##TITLE=Analysis number 316372
Compound Code cc 18403
Project Code adrs
Chemist Name fudan
##JCAMPDX= 6.0         $$ Bruker NMR JCAMP-DX V2.0
##DATA TYPE= NMR SPECTRUM
##DATA CLASS= NTUPLES
##ORIGIN= Bruker BioSpin GmbH
##OWNER= nmr
$$ XWIN-NMR		Version 3.5
$$ Thu Jan 12 12:16:03 2006 GMT Standard Time (UT+0h)  MAYBRIDGE\nmr@NMR_250MHZ
##.OBSERVE FREQUENCY= 250.131544655141
##.OBSERVE NUCLEUS= ^1H
##.ACQUISITION MODE= SIMULTANEOUS (DQD)
##.ACQUISITION SCHEME= undefined
##.AVERAGES= 16
##.DIGITISER RES= 18
##SPECTROMETER/DATA SYSTEM= dpx250
##.PULSE SEQUENCE= zg30
##.SOLVENT NAME= CDCl3
##.SHIFT REFERENCE= (INTERNAL, CDCl3, 0, 16.522)
##AUDIT TRAIL= $$ (NUMBER, WHEN, WHO, WHERE, WHAT)
$$ ##TITLE= Audit trail, XWIN-NMR		Version 3.5
$$ ##JCAMPDX= 5.01
$$ ##ORIGIN= Bruker BioSpin GmbH
$$ ##OWNER= nmr
$$ C:\u/data/dgb/nmr/ADRS/14550/pdata/1/auditp.txt
$$ ##AUDIT TRAIL=  $$ (NUMBER, WHEN, WHO, WHERE, WHAT)
(   1,<2006-01-12 12:15:40.07 +000>,<MAYBRIDGE\nmr>,<NMR_250MHZ>,
      <created by zg, POWCHK disabled, PULCHK disabled
       configuration hash MD5:
       62 19 C7 07 E1 42 D1 B7 37 6C 3D D0 77 39 F9 E6
       data hash MD5: 64K
       62 29 8C 7E A0 78 D2 BF 7C EA F8 2A BA 69 5B FD>)
(   2,<2006-01-12 12:15:53.19 +000>,<MAYBRIDGE\nmr>,<NMR_250MHZ>,
      <Start of raw data processing
       ef LB = 0.3 FT_mod = 6 PKNL = 1 SI = 32K 
       data hash MD5: 32K
       58 1A EA E1 6D B6 25 FA A0 77 E7 F8 77 7A B5 8F>)
(   3,<2006-01-12 12:15:55.13 +000>,<MAYBRIDGE\nmr>,<NMR_250MHZ>,
      <apk 
       data hash MD5: 32K
       A9 31 59 28 E9 E0 8F B5 45 9A 21 72 2C FE 90 06>)
(   4,<2006-01-12 12:15:55.86 +000>,<MAYBRIDGE\nmr>,<NMR_250MHZ>,
      <abs ABSG = 5 
       data hash MD5: 32K
       45 CB 83 CA A8 60 09 D3 F6 39 4E 3A 74 D7 C7 27>)
$$ ##END=
$$ 
$$ hash MD5
$$ CC AC 6C 03 4B A8 C6 22 83 0E 9F BA 39 9F 70 B7
##$RELAX= 
##$RELAX= 
##$RELAX= 
##$RELAX= 
##$RELAX= 
##$RELAX= 
##$RELAX= 
$$ Bruker specific parameters
$$ --------------------------
##$DU= <C:\u>
##$EXPNO= 14550
##$NAME= <ADRS>
##$PROCNO= 1
##$TYPE= <nmr>
##$USER= <dgb>
##$AMP= (0..31)
100 100 100 100 100 100 100 100 100 100 100 100 100 100 100 100 100 100 
100 100 100 100 100 100 100 100 100 100 100 100 100 100 
##$AQSEQ= 0
##$AQ_mod= 3
##$AUNM= <au_zg>
##$AUTOPOS= <14 >
##$BF1= 250.13
##$BF2= 250.13
##$BF3= 250.13
##$BF4= 250.13
##$BF5= 500.13
##$BF6= 500.13
##$BF7= 500.13
##$BF8= 500.13
##$BYTORDA= 1
##$CFDGTYP= 0
##$CFRGTYP= 5
##$CHEMSTR= <none>
##$CNST= (0..31)
1 1 145 1 1 1 1 1 1 1 1 1 1 1 1 1 1 1 1 1 1 1 1 1 1 1 1 1 1 1 1 1 
##$CPDPRG= <>
##$CPDPRG1= <>
##$CPDPRG2= <>
##$CPDPRG3= <>
##$CPDPRG4= <mlev>
##$CPDPRG5= <mlev>
##$CPDPRG6= <mlev>
##$CPDPRG7= <mlev>
##$CPDPRG8= <mlev>
##$CPDPRGB= <>
##$CPDPRGT= <>
##$D= (0..31)
0 1 0 0 0 0 0 0 0 0.06 0 0 0 0 0 0 0.0002 0 0 0 0 0 0 0 0 0 0 0 0 0 0 
0 
##$DATE= 1137068138
##$DBL= (0..7)
120 120 120 120 120 120 120 120 
##$DBP= (0..7)
150 150 150 150 150 150 150 150 
##$DBP07= 0
##$DBPNAM0= <>
##$DBPNAM1= <>
##$DBPNAM2= <>
$$ [...]
##$SUBNAM7= <"">
##$SUBNAM8= <"">
##$SUBNAM9= <"">
##$SW= 20.6930455092707
##$SWIBOX= (0..15)
0 0 3 0 0 0 0 0 0 0 0 0 0 0 0 0 
##$SW_h= 5175.983436853
##$TD= 65536
##$TD0= 1
##$TE= 294.16
##$TE2= 300
##$TE3= 300
##$TEG= 300
##$TL= (0..7)
0 120 120 120 120 120 120 120 
##$TP= (0..7)
150 150 150 150 150 150 150 150 
##$TP07= 0
##$TPNAME0= <>
##$TPNAME1= <>
##$TPNAME2= <>
##$TPNAME3= <>
##$TPNAME4= <>
##$TPNAME5= <>
##$TPNAME6= <>
##$TPNAME7= <>
##$TPOAL= (0..7)
0.5 0.5 0.5 0.5 0.5 0.5 0.5 0.5 
##$TPOFFS= (0..7)
0 0 0 0 0 0 0 0 
##$TUNHIN= 0
##$TUNHOUT= 0
##$TUNXOUT= 0
##$USERA1= <user>
##$USERA2= <user>
##$USERA3= <user>
##$USERA4= <user>
##$USERA5= <user>
##$V9= 5
##$VALIST= <valist>
##$VCLIST= <CCCCCCCCCCCCCCC>
##$VD= 0
##$VDLIST= <DDDDDDDDDDDDDDD>
##$VPLIST= <PPPPPPPPPPPPPPP>
##$VTLIST= <TTTTTTTTTTTTTTT>
##$WBST= 1024
##$WBSW= 4
##$XGAIN= (0..3)
0 0 0 0 
##$XL= 0
##$YL= 0
##$YMAX_a= 384115
##$YMIN_a= -456571
##$ZGOPTNS= <>
##$ZL1= 120
##$ZL2= 120
##$ZL3= 120
##$ZL4= 120
##$ABSF1= 16.522
##$ABSF2= -4.171173
##$ABSG= 5
##$ABSL= 3
##$ALPHA= 0
##$AQORDER= 0
##$ASSFAC= 0
##$ASSFACI= 0
##$ASSFACX= 0
##$ASSWID= 0
##$AUNMP= <proc_1d>
##$AZFE= 0.1
##$AZFW= 0.1
##$BCFW= 0
##$BC_mod= 0
##$BYTORDP= 0
##$COROFFS= 0
##$CY= 12.5
##$DATMOD= 1
##$DC= 0
##$DFILT= <>
##$DTYPP= 0
##$F1P= 14.0000005364418
##$F2P= -0.99999901652339
##$FCOR= 0.5
##$FTSIZE= 32768
##$FT_mod= 6
##$GAMMA= 0
##$GB= 0
##$INTBC= 1
##$INTSCL= 1
##$ISEN= 128
##$LB= 0.3
##$LEV0= 0
##$LPBIN= 0
##$MAXI= 10000
##$MC2= 0
##$MEAN= 0
##$ME_mod= 0
##$MI= 0
##$NCOEF= 0
##$NC_proc= -4
##$NLEV= 6
##$NOISF1= 0
##$NOISF2= 0
##$NSP= 0
##$NTH_PI= 0
##$NZP= 0
##$OFFSET= 16.522
##$PC= 1
##$PHC0= 85.13257
##$PHC1= 0.01954498
##$PH_mod= 1
##$PKNL= yes
##$PPARMOD= 0
##$PSCAL= 4
##$PSIGN= 0
##$REVERSE= no
##$SF= 250.13
##$SI= 32768
##$SIGF1= 0
##$SIGF2= 0
##$SINO= 400
##$SIOLD= 32768
##$SREGLST= <1H.CDCl3>
##$SSB= 0
##$STSI= 32768
##$STSR= 0
##$SW_p= 5175.98343685301
##$SYMM= 0
##$S_DEV= 0
##$TDeff= 65536
##$TDoff= 0
##$TI= <Analysis number 999999
Compound Code 99
Book Reference 9
Project Code 9>
##$TILT= no
##$TM1= 0
##$TM2= 0
##$TOPLEV= 0
##$USERP1= <user>
##$USERP2= <user>
##$USERP3= <user>
##$USERP4= <user>
##$USERP5= <user>
##$WDW= 1
##$XDIM= 32768
##$YMAX_p= 341236261
##$YMIN_p= -228203
$$ End of Bruker specific parameters
$$ ---------------------------------
##NTUPLES= NMR SPECTRUM
##VAR_NAME=  FREQUENCY,     SPECTRUM/REAL,   SPECTRUM/IMAG
##SYMBOL=    X,             R,               I
##VAR_TYPE=  INDEPENDENT,   DEPENDENT,       DEPENDENT
##VAR_FORM=  AFFN,          ASDF,            ASDF
##VAR_DIM=   32768,         32768,           32768
##UNITS=     HZ,            ARBITRARY UNITS, ARBITRARY UNITS
##FACTOR=    0.157963299565203, 1,           1
##FIRST=     4132.6476996994, 0,             0
##LAST=      -1043.33573715361, 0,           0
##MIN=       -1043.33573715361, -228203,     0
##MAX=       4132.6476996994, 341236261,     0
$$ Real data points
##PAGE= N=1
##DATA TABLE= (X++(R..R)), XYDATA
$$ [...]
25199c5674J3208J1731L4142P647k8240J6298j3021j666l0538J5116M2605K6276
25187E7884k5141l846n960q191m4018j3991K5998J5820j9684K8665L6763j8083
25175B6216j8833l0080J1937O7500j261r871j7758r1087k1006M4435J6076r091
25163c2823k1951K0957L6875j7729K6112J1054K5081k970q750J7341k2437o5586
25151c4826m5240q574j4495o562O3456N4995O1853J8611L725L373l1892k9247
25139C5177r713k5104K9063l2027m2416k8945M488N8890L6924J1427k770J5114
25127E0108k1942o3676J9909K0776l676K5480M0785J1986K0264j0128l0246m3872
25115A5768n0107J8638k1093k4723j2371M4273k3607l9596N4494l1318l2006k4933
$$ y = [-35674, -22466, -10735, 23407, 31054, 2814, 19112, 6091, 4425, -26113, -10997, 31608, 57884, 32743, 28897, 22937, 14746, -29272, -43263, -17265, -1445, -21129, 7536, 44299, 26216, 7383, -22697, -10760, 56740, 55479, 45608, 27850, -63237, -84243, -39808, -23732, -32823, -54774, -33817, 3058, -14671, 11441, 22495, 47576, 44606, 35856, 53197, 30760, -34826, -80066, -88640, -103135, -109697, -46241, 8754, 70607, 89218, 92943, 96316, 64424, 35177, 25464, 360, 29423, -2604, -45020, -73965, -69477, -10587, 26337, 37764, 34994, 50108, 28166, -35510, -15601, 5175, 1499, 26979, 67764, 79750, 100014, 89886, 59640, 15768, -34339, -15701, -36794, -61517, -73888, -29615, -53222, -92818, -38324, -69642, -101648, -126581]
25103a26581L5818L2472K0261P811M3568K1592K9601J1180l1864p2506P366M956
25091a6326l357N2372l0078j9674j5763k1808K1581p875m8244j8509Q823j2656
25079a11514k1323O077K5364K789k4053L3313J23763L1866l1993r684j1102m8332
25067c4829n6822Q027N1535L3726l413J0060p625m4642J5831O4814l1409l6428
25055c1175N765J1814L5506J2497n4755j6181j722J4533l0757j8687L1872n099
25043d6389k9030l1275k923j0221K0866L6786O191K2353M3852J1748J8017j2739
25031B7236K2797O109K0679k8482j2195j9076m1704m665J9292L4416K5513K0098
25019G0018K9451L671j6411n7585n383k1286k1848R25M1295K8423r733K3022l0457
$$ y = [-126581, -90763, -58291, -38030, -30219, 13349, 34941, 64542, 75722, 43858, -28648, -21282, -16326, -19683, 32689, 2611, -17063, -32826, -54634, -33053, -40928, -89172, -107681, -98858, -111514, -132837, -126760, -101396, -98607, -122660, -89347, 34416, 66282, 34289, 24605, 13503, -34829, -91651, -83624, -32089, 1637, -1776, 8284, 659, -43983, -28152, 36662, 5253, -31175, -25410, -13596, 21910, 34407, -20348, -36529, -38251, -23718, -54475, -73162, -41290, -46389, -75419, -106694, -109617, -119838, -98972, -62186, -55995, -33642, 10210, 21958, 39975, 27236, 50033, 56142, 76821, 48339, 36144, 17068, -24636, -29301, -10009, 24407, 49920, 70018, 99469, 103140, 86729, 29144, 23761, 2475, -19373, -18448, 22847, 51270, 41537, 64559, 34102]
25006C4102N314n0341p3645m2477J7236J2273j0386N4803M7618J4587k9968R549
24994a1335M2280l0214l5861K2173N173l1378o2519j9768K1400L0971J9557M5467
24982d054P7903m481m8370J1800q7193n6838L0829K2638N5416J6663M074K2351
24970D0738o3043m9233O7092j788n880o163o6005j5752j042N6501Q2409m7302
24958i468q255O2414K728l6168l8269M6221M3068m6653o7767N656L0905J3536
24946b052M5706L1060J8101n9361j18315m0243M8632j5724N1857O5231R626l0298
24934D220o2390j6315L493L5709M4177L0628O931K3457l9093M7469N6008l6115
24922I8179q641L8105j5783o636m2932n1988o4542N769M0081R8263J1042o5937
$$ y = [34102, 39416, -10925, -84570, -127047, -109811, -97538, -107924, -53121, -5503, 9084, -20884, -11335, 30945, 731, -35130, -12957, -7784, -39162, -101681, -121449, -100049, -69078, -49521, -4054, 73849, 69368, 20998, 32798, -54395, -111233, -80404, -57766, -2350, 14313, 18387, 40738, -22305, -71538, -4446, -6234, -12114, -18277, -84282, -100034, -101076, -44575, 37834, -9468, -17723, 44691, 47419, 11251, -27018, 19203, 62271, 15618, -52149, -46493, -15588, -2052, 43654, 74714, 92815, 33454, -84861, -125104, -76472, -92196, -40339, 24892, 34518, 4220, -58170, -74485, -70992, -35283, 8894, 39522, 46453, 69910, 30817, 78286, 134294, 98179, 89538, 127643, 111860, 105224, 62292, 10304, -54238, -48469, -8388, 89875, 100917, 34980]
24910C4980n1473j19011Q279J26948Q8513l8169m8029P055n3020j7482J260j0118
24898g0267l243J486R041J3714N6106L7705K6595J8373n6122k4290Q632j3097
24886D633J641M392l0823n0896m3454k1679o0934L0012J17954R7280N4503K2121
24874A24750p0145o0311o5990P4210J7513m4125M1627M5158j0207o3136o0800
24863g1456n918p548O0070N0910O0442P2603j9727o3213o3778K3680j9697o1576
24851d5208j5049P4888K7128q943K6900m8914r493J5461J2972n5418k4619N081
24839d5214k6923j7952M6024N6215l4965o4771j2219J1888L3633O3531L696k700
24827A0243m2565l679K1627O973R90K155l4443k396O770k9785k7618o18M2765
$$ y = [34980, -16493, -135504, -127225, -277, 88236, 50067, 2038, 9093, -43927, -61409, -60149, -70267, -73510, -72024, -62983, -49269, 6837, 44542, 71137, 89510, 33388, 9098, 17730, 4633, 6274, 10666, -20157, -71053, -114507, -136186, -197120, -167108, -49154, 48126, 102629, 124750, 54605, -5706, -71696, 2514, 20027, -24098, 17529, 62687, 52480, -10656, -71456, -77374, -84922, -24852, 26058, 86500, 159103, 139376, 76163, 12385, 36065, 16368, -45208, -60257, 14631, 41759, 32816, 59716, 10802, 1309, 16770, 29742, -25676, -50295, -45214, -72137, -90089, -44065, 12150, -22815, -87586, -99805, -87917, -54284, 9247, 12943, 10243, -32322, -36001, -14374, -7401, -6411, -4256, -38699, -41095, -34325, -64110, -91728, -92346, -49581]
24814d9581L3899J243q025j909J3336L8958j347o0444K9144j9305J6212o1899
24802f9718M2515O6473k8321l954k7226R6550M595o3127k1802k320l514n994K1568
24789E725l8420M228O2130L9558J9764J3705K2174l3121q7261p9075k2423o848
24777i9864J00751M0143l3609L030L9077l2M751J6824l6558k0799l8414K3336
24765a364J03501K3686r1232p1682j2892J2697K6334M164j8441n147K8947M2477
24753D1048l7204r0883r695K8920P083Q2309k3553j0279M2894K3877q25K599J1332
24740F7623P422l4381k6864j2117k8785j7513J1217M9059P2944K3958m4519r067
24728E8977j9767p986k6581K4633K0930Q005l6017k9225K9976l8380J2695j1456
$$ y = [-49581, -15682, -14439, -22464, -24373, -11037, 27921, 26574, -33870, -4726, -24031, -7819, -69718, -27203, 39270, 10949, 6995, -20231, 76319, 80914, 17787, -4015, -6335, -9849, -15843, 5725, -32695, -28467, 33663, 73221, 92985, 106690, 128864, 95743, 8482, -70593, -93016, -99864, 887, 41030, 7421, 10451, 49528, 49496, 54247, 71071, 34513, 13714, -24700, -1364, 102137, 125823, 34591, -37091, -49983, -37286, -10952, -6788, -25229, -30376, -1429, 41048, 3844, -87039, -96734, -67814, -60731, 21578, -1975, -12254, 30640, 54517, 53692, 56291, 67623, 75045, 40664, 13800, 1683, -27102, -44615, -33398, 15661, 88605, 112563, 68044, 58977, 39210, 31224, 4643, 29276, 50206, 58211, 22194, -7031, 22945, -15435, -2740, -14196]
24716a4196K5984L8078O837m2335k1617N422L6046L7977j0263q7545m6958P8711
24704F141k557p1091J8693K7378M0861M0175N313k6127L0573K192k2082k7114
24692B2355R289k9666J6053J01291K0092J1891J22k6305n5637l7485q958k9989
24680f947P6839j8238j2317l6789j7658K8402j0248j5759p0320L2104L3102M688
24668a3141m101Q762m645L1857k2224q1592l8737R0349J9176k5897k1236L0670
24656c0759K9540o2277L4252J9515m3635l2616P735L9921L685J9046K5920J8065
24644B8392k7572J2920m5136k1973r401o769l2677J0R3101j1367k2678J0945l3989
24631f6194m3307O005N1562K0119n6164L7247N407J1274l430q317j2233L5943
$$ y = [-14196, 11788, 49866, 56703, 14368, -7249, -1827, 34219, 72196, 61933, -25612, -72570, 6141, 3584, -67507, -48814, -21436, 19425, 59600, 64913, 38786, 69359, 71551, 49469, 22355, 31644, 1978, 18031, 119322, 139414, 151305, 151427, 125122, 69485, 32000, 23042, -6947, 69892, 51654, 39337, 2548, -15110, 13292, 3044, -12715, -83035, -50931, -17829, -13141, -17242, -8480, -13125, 18732, -3492, -85084, -123821, -33472, -14296, -40193, -61429, -30759, -1219, -63496, -29244, -9729, -53364, -85980, -78245, -38324, -34639, -15593, 10327, 28392, 820, 13740, -31396, -53369, -62770, -69539, -102216, -102206, -9105, -20472, -43150, -32205, -66194, -109501, -103496, -51934, -31815, -87979, -50732, -45325, -34051, -37481, -45798, -58031, -22088]
24619b2088N9609j7625j04383L4597N1862J0257m4434j1132r1o212L26M3065N4754
24606D8505l9035n1502k6147M9262j6539R85l7707r0750m0451L1204N5539N7099
24594e9537L7532K5311n7703q1168O5817M1474j5702j1196K9470N0009L00l5640
24582a1033k1039j7071P006j8191n1833N9095M6629K7716J0755K7245O713p349
24570E8643n5067K7462j2604k8697m6339l1082J6615K9380q475O754J8875R764
24558a4771m788J9096k6201k3613M1784J2771o8800o6927K678L9048m4996N1340
24546h3379K7220j4084P0417N111N454m2728K193P4337m511j1249n5911M0855
24534A3725M5469k5506q597j8105m1754k1212P7567j7083l5986J1896K3168K3533
$$ y = [-22088, 37521, 19896, -84487, -49890, 1972, 12229, -32205, -43337, -43428, -49640, -49314, -6249, 48505, 9470, -42032, -68179, -18917, -35456, -34471, -72178, -162928, -203379, -172175, -116636, -59537, -22005, 3306, -54397, -135565, -69748, -28274, -43976, -55172, -25702, 24307, 24607, -11033, -32072, -49143, -42137, -60328, -112161, -53066, -6437, 21279, 32034, 59279, 65992, 58643, 3576, 31038, 18434, -10263, -56602, -87684, -71069, -41689, -50164, -43410, -24535, -14771, -19559, -463, -26664, -50277, -8493, 4278, -64522, -131449, -128771, -89723, -134719, -83379, -56159, -70243, 174, 5285, 10739, -31989, -29796, 44541, 40030, 28781, -27130, 13725, 59194, 33688, 25091, 6986, -34768, -55980, 21587, 4504, -31482, -19586, 3582, 27115]
24522B7115m7374l5687K2835Q2169q764m4813k4050j4026J5853l1681m1866q808
24510a09097M6790R1210o278P228k8689j3692P071o5872R8926r501K7663k5956
24498A9803l4114J2798O7404l1383k8536J4617K7113k5149P538k4958J8327p003
24486A6457l0020l5827K375K3383j2376l6019L3586N2569j4377q1294K9299j3009
24474f5253j287l0751J5006J0691O1484M9689j6603P443J6595k8254k1012L5611
24462C3359j6540J9833m0524K6155k1977l2425r0880o9140K8680J11954L9053
24451a2452j0616P5840M3025j2621l1666l8769k984m4115m8922J9564L1733O5504
24439C3521j6805m4633l3901L0857K949P0233R047j4066k0528m9156J6930K7661
$$ y = [27115, -20259, -55946, -33111, 49058, 40294, -4519, -28569, -42595, -26742, -58423, -100289, -109097, -62307, 28903, 22625, 29853, 1164, -12528, -5457, -71329, 27597, 18096, 45759, 19803, -14311, -1513, 65891, 34508, 5972, 20589, 47702, 22553, 30091, 5133, 23460, 16457, -13563, -49390, -47015, -23632, -36008, -72027, -38441, 14128, -249, -81543, -52244, -65253, -66540, -97291, -82285, -71594, -10110, 39579, 22976, 30419, 47014, 18760, -2252, 33359, 16819, 36652, -3872, 22283, 306, -32119, -122999, -192139, -163459, -51505, -12452, -23068, 52772, 95797, 83176, 51510, 12741, 9757, -34358, -83280, -63716, -31983, 33521, 16716, -27917, -61818, -30961, -28012, 42221, 51268, 37202, 16674, -32482, -15552, 12109]
24427A2109L1054L0467J0368k2394l7411o007J9800n1926l3780j3018K3640l7399
24415g4497J6092L8999N7342L7076j6232m657Q07J2347P17q4401k5367j161l9753
24402h2688l2845J3614J6732n65K4570M3988P1570L9026j3462K8790Q330L2966
24390A50026l9706o9334k1274J2966j9179m7148k3094K3178L4768j4975M26K1528
24378H182j2358m1710N649M2564P606n2627L2869J866l1801l5397l6725K5780
24366h6102Q2674k5266n1808K3978L7624J5679q2814k4877N6783M604M1548j5912
24354b3889o2102m3257q294j1654R4916K5293K8979K4123J1062K750J042L8496
24342G7465p8515n4911N0606r6925k1140J9041M6006M3142k908l9237j4125j2659
$$ y = [12109, 43163, 73630, 83998, 61604, 24193, 18186, 37986, -13940, -47720, -60738, -37098, -74497, -58405, -19406, 37936, 75012, 58780, 54123, 54930, 67277, 67994, -16407, -41774, -42935, -82688, -115533, -101919, -85187, -85752, -61182, -17194, 54376, 93402, 79940, 108730, 117060, 150026, 110320, 40986, 19712, 32678, 13499, -33649, -56743, -33565, 1203, -13772, -13346, 8182, -4176, -45886, -40237, 2327, 9933, -42694, -9825, -7959, -39760, -75157, -111882, -86102, -3428, -28694, -80502, -56524, -18900, -3221, -86035, -110912, -54129, -49525, -7977, -23889, -85991, -129248, -137542, -149196, -54280, -28987, -8, 24115, 35177, 37927, 38969, 77465, -1050, -55961, -5355, -102280, -123420, -104379, -58373, -15231, -18139, -57376, -71501, -84160]
24330h4160r017K2403Q5931K04k4349o675q427j2789J813q648q593j5557J960
24317f5904L8613O4228Q181k9361K3883r4o4798k4675K6715K2656j3847l043j0050
24304b7496R305M409K4690O30n4106K8554J9179K1897K5540m1849j6214M7786
24292D2325j8300N188J8570k8141l2417L4801k0693m6872M2381O2165m2479k5513
24280h985N0234k185l273K9416k0464j7071l4036L5617L4590M8696Q793j06079
24268A5253j4564M2891L627O802k8274n2673P789k2611j7715P405L8394L883K4849
24255A5056Q932j3557j1120k7813k2835j7613L9341R5182J3775n2066n8584K021
24243b9281j8080O2318j1080j4135L5302L989l744k4955l6432K4937L2582Q608
$$ y = [-84160, -93177, -70774, 15157, 15361, -8988, -15663, -24090, -36879, -35066, -43714, -52307, -67864, -65904, -27291, 36937, 45118, 15757, 39640, 39546, -25252, -49927, -23212, -556, -14403, -17446, -27496, -18191, -13782, 10908, 11538, -42568, -14014, 5165, 27062, 52602, 10753, -5461, 42325, 24025, 29213, 47783, 19642, -12775, 22026, 1333, -45539, -3158, 59007, 16528, -8985, 41249, 39064, 35791, 65207, 44743, 27672, -6364, 29253, 63843, 112539, 121332, 15253, 689, 43580, 47207, 54009, 25735, -26938, -19149, -41760, -59475, -52070, -13676, -9793, 15056, 23988, 10431, -689, -28502, -51337, -68950, -29609, 65573, 79348, 27282, -31302, -29281, -47361, 14957, 3877, -10258, 25044, 29033, 25289, 334, -36098, -11161, 21421, 30029]
24231C0029k8937J3912N1935k5771m3133l4616O6128L7368j5037k5734j3822L0814
24219D3136L724p3038P278K7941P485k1247j3484M7449N094q156J0002K3798M0700
24206A00682k8775j8005J774q1392l1742L3782L1740l537N7780R560p1635J8392
24194A8624M355p1249K8447J22058J2152l5805J433l4506J7174l3491l2293R782
24182F681J0533j6881J1588l7694N0379L2050l1008m9796o397M9065J8500l923
24170C3097k1581l5739J0372M8201l2359q974o662p1865l0991P6626n927N010
24158d0792L7434l0377m6532l0586K5216Q3155L4669Q47M6888j5986n4765L089
24146A2260L0454k615k0286k8496k0308l0818l1636L0690J7352L3731L802j1617
$$ y = [30029, 1092, 15004, 66939, 41168, -1965, -36581, 29547, 66915, 51878, 26144, 12322, 43136, 46860, -26178, -18900, 9041, 16526, -4721, -18205, 29244, 34338, 26182, 36184, 59982, 100682, 71907, 53902, 55676, -25716, -57458, -23676, 8064, 4527, 62307, 71867, 232, 18624, 22979, -48270, -19823, 102235, 114387, 78582, 80015, 45509, 62683, 29192, -3101, 6681, 17214, 333, 11921, -25773, 24606, 56656, 25648, -24148, -30545, 18520, 37020, 33097, 11516, -24223, -13851, 34350, 1991, -6983, -13645, -85510, -116501, -39875, -45802, -40792, -3358, -33735, -80267, -110853, -85637, -2482, 32187, 33034, 79922, 63936, 9171, 12260, 42714, 40099, 19813, -8683, -28991, -59809, -91445, -60755, -43403, -9672, -5870, -17487]
24134a7487L4254m1443J3260j348k8209l6619N0654L8549k3228n1589L8435k4390
24122d9161K8265k0841N5485O5097L4110n389m9967k2133K8798K7902L063q641
24110H6588n9840m8823L869J2230k9137p9164m359M0584M622J9618j2925j0700
24098g7437N9019L6912o6634n0729N1275N2472J12568K8581r2990m6853J4996
24087B1180J5800j201n9553q5642k5397P2277K8481K116O943j4271J2903L3421
24075G057L7908o227k6694o9275K5104J6197O8018K2073j248M48p2614n3708M5653
24062g308O2818l6640m6270k1182P266K3660j5674P765q150M870M1686p351l654
24049A836O9316k7557j6174k1210n856j0861m5773J1244j4522j9076J4949j4902
$$ y = [-17487, 16767, -24676, -11416, -12764, -40973, -77592, -26938, 11611, -11617, -63206, -24771, -49161, -20896, -41737, 13748, 78845, 112955, 107566, 57599, 35466, 64264, 92166, 95229, 86588, 26748, -22075, -18206, -5976, -35113, -114277, -118636, -78052, -73430, -53812, -66737, -77437, -18418, 18494, -48140, -98869, -47594, 4878, 117446, 146027, 53037, 6184, 21180, 36980, 35779, -23774, -109416, -134813, -62536, -34055, -31939, -24996, -39267, -26364, 7057, 44965, 38738, 12044, -57231, -32127, -15930, 52088, 74161, 72913, 73361, 747, -52961, -7308, 55510, 18870, -27400, -48582, -41316, -17656, -33330, -25565, -33715, -28845, 12841, 5490, 1836, 71152, 43595, 27421, 6211, 355, -10506, -56279, -45035, -59557, -78633, -63684, -78586]
24037g8586k6642Q490P1876M483m116N6972o076J893J5826K23n5120m7837k0898
24024g9512M109l397p079O7427J5362r244R632Q9551J5055n2079l9782m4145j8697
24011e2799O8318j2350n9075j2781j7603O90j3700J5778L8982K0779P754p64N9441
23998D2670n3642o7366N9928j118m611Q803K3802O600Q179K2938M079K0354j1644
23985E8972N245p133j1627m1635J789n074K6267p991n650n942K3602k0812L3265
23972D3276M8158n0685o6822j5329M5432J5197j6007J4042J454m7575o9283m3257
23960a41399Q649J5707N8071N1193N1562L0454n2945k3006j8122m5572J512j0983
23948g4879k841P2923M5509k6003l431j269l8458L048j4902m5982J8078N2430
$$ y = [-78586, -105228, -96738, -24862, -20379, -24495, 32477, 26401, 28294, 44120, 44343, -10777, -58614, -79512, -75403, -78800, -85879, -18452, -3090, -12334, -2702, 86849, 101904, 49825, 10043, -34102, -52799, 15519, 3169, -55906, -68687, -86290, -85600, -99300, -83522, -44540, -23761, -16007, -16771, 42670, -10972, -78338, -18410, -19528, -24139, -15336, 8466, 15066, 23245, 46183, 50262, 70616, 58972, 64217, 57084, 45457, 3822, 5611, 537, 26804, 18813, 13163, 7221, 30823, 10011, 43276, 91434, 40749, -26073, -41402, 4030, 19227, 3220, 17262, 18716, -28859, -98142, -141399, -132750, -117043, -58972, -7779, 43783, 74237, 21292, -1714, -19836, -65408, -63896, -74879, -77720, -4797, 40712, 14709, 11278, 10009, -28449, -25401, -40303, -86285, -68207, -15777]
23936a5777k3866L2028J0553Q3227J1703q6801k3005L2200j273m3799K4461l927
23924d276j7942r934L0890K615K214j5882k4859O635o381j9033l6756j60L6327
23911e6542K0954j5332P0987Q587j5237l7529j9636N3378L5260m3459L31N2066
23899E3828R957l2481K640j3083j9089L297k9251j0017N081l2542J0757P974j2748
23886e5677r659N8036L7682l2526j3988L8283L588J7319j0416j5468l6236O081
23874a2981L9792j2987o3077k497p881J4727k7437k4349j4874l387J3796L9817
23862f1338P3232l297p218L6574Q609K609k0679l2555Q6066L452n5334p818m0051
23849a7748k4529j0311K2186J8740k2866M2556o6821o931K0337j2456k9695L8313
$$ y = [-15777, -39643, -7615, 2938, 86165, 97868, 11067, -11938, 20262, 18989, -24810, -349, -4276, -22218, -32152, -1262, 1353, 3567, -12315, -37174, -30539, -36920, -55953, -92709, -92869, -56542, -35588, -50920, 20067, 28654, 13417, -24112, -43748, 9630, 44890, 1431, 1762, 53828, 63785, 31304, 33944, 20861, 1772, 5069, -24182, -34199, -29118, -61660, -50903, -42929, -55677, -65336, -7300, 30382, -2144, -16132, 22151, 25739, 43058, 32642, 17174, -19062, -12981, 26811, 13824, -49253, -51750, -59631, -44904, -72341, -96690, -111564, -114951, -101155, -61338, 11894, 8597, 1379, 37953, 46562, 49171, 28492, -4063, 82003, 85455, 30121, 22303, -17748, -42277, -52588, -30402, -11662, -34528, 8028, -58793, -65724, -45387, -57843, -87538, -49225]
23837d9225J1938N3027m1111k424K0567j2752K3858l7136k822L4823M2286k1875
23825A9154o809P0841m3517o2485m5157N7512p88p4054k417K2127O0570K1235
23813A6212J4812k5552J1747j5121K2794K4490K4779o723k8255o0312q0483l1007
23801a32619L6910L0725J4504m9748L234M5968J5381l8924J7581L3704N1022K4878
23789E2616j09098n5931m988j9433J7833L1466O6156q638q6136N0012J28387k2356
23777C9890k7355M6610J155j1438k0356l9030m7l0623J334R91k4118m2957J1677
23764i4267M0435P9978J0905k6976j574K7462Q677l2421m6201l3344L0398M6664
23752I736J2542j8395k7736N166j7426L1229l0295l4939k8843J9813J6000m1820
$$ y = [-49225, -37287, 15740, -25371, -27795, -7228, -19980, 3878, -33258, -36080, -1257, 41029, 19154, 12345, 83186, 39669, -22816, -67973, -10461, -11249, -85303, -87720, -65593, -5023, 16212, 31024, 5472, 17219, 2098, 24892, 49382, 74161, 67438, 39183, -21129, -101612, -132619, -95709, -64984, -50480, -100228, -96994, -51026, -35645, -74569, -56988, -23284, 27738, 52616, -56482, -112413, -117401, -136834, -119001, -87535, -21379, -30017, -116153, -66141, 62246, 39890, 12535, 59145, 60300, 48862, 28506, -10524, -10571, -41194, -39860, -38869, -62987, -105944, -94267, -53832, 26146, 37051, 10075, 8501, 35963, 44640, 12219, -33982, -67326, -36928, 9736, 22278, 3883, -23853, -18687, -36113, -4884, -35179, -70118, -98961, -79148, -63148, -104968]
23740a04968n8423K3943K1976K8262K5429K1449J1392Q239M359o067k0925L4493
23728a0841O217o2159p506O0782P0469N3226o073m0816p8006J7901P3342j2327
23716F4209l8299m3523j6509j38k4543L3652O199m9795j02489M3769P6181r390
23704f0676J4163M8042L9840m8916J314O3498J5120m9427q968l9631l8639O8904
23692D624j8382k9080k1941M2072K0341M5391J3743k9965j5368j9430k1359O0839
23680C1485O5709m712L9641r139n6162m3409k0972j5191K8721j5137L1151j297
23668C0688q4602o031K3342K5869j7393k5457M6402N812k8842k0081J6389J7826
23656a6078k1843N7825N7300J3217j9598m0881J6650p312k7338n7333M1713K6454
$$ y = [-104968, -163391, -139448, -117472, -89210, -63781, -42332, -30940, -22701, -18342, -24409, -45334, -10841, -4624, -66783, -74289, -13507, 56962, 110188, 104115, 63299, -14707, 3194, 76536, 64209, 25910, -17613, -34122, -34260, -58803, -25151, -18952, -68747, -171236, -127467, -51286, -60676, -46513, 1529, 41369, -7547, -6233, 57265, 72385, 22958, 13990, -25641, -64280, 4624, -13758, -42838, -64779, -22707, -2366, 43025, 56768, 26803, 11435, -7995, -29354, 31485, 97194, 92482, 132123, 122984, 66822, 23413, 2441, -12750, 15971, 834, 31985, 30688, -53914, -59945, -36603, -10734, -28127, -53584, -7182, -1370, -30212, -50293, -33904, -16078, -37921, 19904, 77204, 90421, 70823, 29942, 46592, 39280, 11942, -45391, -3678, 22776]
23644B2776n8896k2008K3001M3201K2085K3388Q832J9785k1244K30J098p9179
23632a6931l8717M6275J9216J4862j0648l8178K7533M1128j0504k6146n3n28j0495
23619c186k7933n1718J3656M0074j591j4885K58l250j337P326j1608K0762K0099
23606a3333l4556k0843J384M4283L9916j5877M4751J9563o3888l2944j004k6028
23594e8576K9740M6083m224k182J3323J5000K9068J7691n5095j7832k1215L211
23582e008k0451l2918K154P0908r462l8497N736L9399j0022k2809M049q71k6999
23569d4791k7863k200L3517M5758R849M7565N003m5461L4211J605n3135l1433
23557b7375J6146M7646k1084l6039P0616m4589L5473J1764r277M4899q065l0633
$$ y = [22776, -36120, -58128, -35127, 8074, 30159, 53547, 62379, 82164, 60920, 61150, 62248, -16931, -55648, -9373, 9843, 24705, 14057, -24121, 3412, 44540, 34036, 7890, 7837, 7309, -3186, -31119, -82837, -69181, -29107, -30698, -45583, -45325, -48575, -49912, -42586, -54194, -33432, -13333, -47889, -68732, -67348, -23065, 16851, 974, 45725, 65288, 1400, -31544, -32548, -58576, -28836, 17247, 13023, 10841, 24164, 39164, 68232, 85923, 30828, 12996, -8219, -5008, -25459, -58377, -56223, 14685, 5223, -33274, -27538, 11861, 1839, -20970, -16921, -17792, -44791, -72654, -74854, -41337, 4421, 14270, 61835, 66838, 21377, 55588, 57193, 4058, -27375, -11229, 36417, 15333, -20706, 49910, 5321, 40794, 52558, 43281, 88180, 80115, 49482]
23545D9482k941K6666l4878p7416r213J0091n915P1471L2417o193q2550r114L8283
23532A90K1764Q08J895o6952k7936R6844j237m3194J2860O9109j3050l6407J3217
23519B7911R62p4666j0973Q677L2212Q7794J3303n295l3641m2625j4925N706k0457
23506b6017k0964L6253m167k3616m3265J5252N8326o8549n7927L0895J0875k095
23494i4999q2424l1355P9113P1845O866k6457K4999j0433j2493j2624j0982j8695
23482a17639M2163P9789O861r405m2193Q887j280l4120o1025J7484L4235K1975
23470e4268m0121m803Q095J1354k511J2031R572k4783j3371K360j1431L1995Q037
23457f7844j2700M934M5672r815M7781P1021n2229l9613l5537K6534M6280j6995
$$ y = [49482, 46541, 73207, 38329, -39087, -48300, -38209, -44124, 27347, 59764, 53571, -28979, -38093, 190, 21954, 22762, 24657, -42295, -70231, 26613, 25376, -17818, -4958, 64151, 51101, 14694, 27911, 28873, -45793, -56766, -48089, -15877, 71917, 85220, 79925, 46284, 3659, -11266, -5560, -26017, -46981, -10728, -14895, -38511, -81776, -66524, -8198, -76747, -134674, -103779, -92904, -94999, -177423, -208778, -129665, -57820, -50954, -77411, -52412, -62845, -75338, -87962, -98944, -117639, -75476, 4313, 11174, 1769, -40424, -31537, -32817, -66937, -127962, -110478, -76243, -54268, -94389, -99192, -91097, -79743, -82254, -70223, -60651, -85434, -98805, -96445, -107876, -75881, -67844, -80544, -75610, -29938, -39753, 8028, 79049, 26820, -12793, -48330, -21796, 24484, 7489]
23445G489k3177L4474J7746J6252r543m111j2427r444k057N8930J4527k5642o8608
23432e591P904m4946k2882J1171J6499l014J4876N605M637j4900r831j7830M0898
23419a7404L6538p73P309J8180L4597K9742l2571l9990l0908m6644J9939L1039
23407I054L1919p7718l05L1270K6763p748o07j689M4150Q597n2770n2489l808
23394d5381k0229k3706o394M151j1254M6923n581K5165m384J4023p9619l5339
23382a41625O0887M0163K1545k4660r34J7589N4092K152k7304Q784J1923K0787
23370D3399j1033j4938m510J5051M3656p6625k1747N537k1541N416O538k3069
23358e3866J1386J4641M6446J2360k2458n2879p335K4731k670Q1966l6043m8595
$$ y = [7489, -15688, 18786, 36532, 52784, 43241, 39130, 26703, 17259, 15202, 74132, 88659, 63017, -5591, 2313, -42633, -65515, -54344, -37845, -40859, -25983, -20378, -15741, -30641, -40472, -58302, -17404, 19134, 18361, 25670, 43850, 78447, 108189, 75618, 35628, 4720, -41924, -21985, 9054, 40973, -36745, -37050, -5780, 20983, 13235, 12628, 10939, 55089, 63686, 10916, -41573, -45381, -65610, -89316, -95710, -91559, -102813, -55890, -61471, -36306, -40690, -26667, -106286, -141625, -80738, -40575, -19030, -43690, -44624, -27035, 27057, 29209, 1905, 10689, 22612, 43399, 32366, 17428, 12918, 27969, 71625, -5000, -26747, -21210, -42751, -37335, -30797, -53866, -42480, -27839, 18607, 30967, 8509, -44370, -51705, -26974, -29644, 52322, 16279, -32316]
23346c2316J2101l0689M66J1339m6763n3114K2615J0166k0725J0336L9075P2341
23334e168K5514l1350L3390J2059o9069M977P5120m4339r3984j9133O9033L1388
23322a1562l9468L1749K4826j0201L469k5210L0995K1477N647l9318j1681L8372
23310A9095N7469L9947m7563p6938l086J7062J4722Q540Q999n0324r429o280Q911
23297a8875L3960l0776J8464Q8136K0904o4179L4729J8622m6571l3333K1058J7003
23285E9142J9309j2648K2733L624j2854k5412K172k7460l9864j6007J0408M0994
23273B4137k8790k7386j701L0706M737m950L3936m9544k6891J8650L9902j9575
23261f769j5761k4970K7475K5989k6170K9578J7818R625o003K8273J2739n9260
$$ y = [-32316, -20215, -50904, -50438, -39099, -85862, -138976, -116361, -106195, -126920, -116584, -77509, -5168, 20346, -11004, 22386, 34445, -34624, -29647, 45473, 1134, -92850, -111983, -42950, -11562, -51030, -19281, 5545, -4656, -1187, -26397, 4598, 26075, 31722, -7596, -19277, 19095, 76564, 116511, 68948, -7990, -11076, 5986, 20708, 29248, 38247, -12077, -21506, -27786, -18875, 15085, -15691, 2773, 90909, 111813, 47634, 82363, 100985, 54414, 21081, 42139, 59142, 78451, 65803, 88536, 92160, 79306, 53894, 56066, 28606, -11258, -27265, -16857, 24137, -4653, -32039, -33740, -3034, 1703, -3247, 30689, -18855, -45746, -27096, 12806, -6769, -22530, -47500, -20025, 5964, -20206, 9372, 27190, 36815, 30812, 59085, 71824, 12564]
23249A2564k4540k132L8133q354k4535J9126k5091p1689k3534O1733O7365m0429
23237b1383k1472l3771M2366L5678J1858m9812k3672l3027k1894j4995L6505j1616
23225a05235N1209L339P972O0869L6715l9072n0737O3668L4527L3037K8767j4519
23213A10540l7995Q724L2042m8178R074j1217o4090M7417m7509j1319K5173l0883
23201a8221k335Q189J2274J3433m8777o9371K8098N5767k2171O7198j1672J1658
23189B4070p199l3692n807m3764j4852m0780j427K7518J5876m1260P3672P9772
23177C2127j271l6958k2211M7699m926N8047J4501m9481m6073Q302J26L4521m5943
23164a1540k0661J9774q653P621k3038l816P978Q1785j2563n7418J170O0485q283
$$ y = [12564, -11976, -14108, 24025, 15671, -8864, 10262, -14829, -86518, -110052, -48319, 19046, -21383, -42855, -76626, -34260, 1418, 13276, -36536, -60208, -93235, -115129, -130124, -93619, -105235, -54026, -50687, -42715, 18154, 54869, 15797, -34940, 28728, 63255, 96292, 125059, 110540, 72545, 81269, 113311, 65133, 74207, 62990, -1100, 46317, -1192, -12511, 12662, -18221, -20556, -12367, -93, 13340, -35437, -104808, -76710, -20943, -43114, 24084, 12412, 24070, 16871, -16821, -22628, -66392, -81244, -122024, -123451, -95933, -80057, -121317, -47645, 32127, 30856, -6102, -28313, 19386, 14460, 72507, 87008, 37527, -8546, -244, -118, 34403, -11540, -32201, -12427, -21080, -13459, -36497, -40313, -32335, 49450, 36887, -20531, -19361, 41124, 32841]
23151C2841J6286l9192n800K2017m834l2487M2514O9337l5412j6754N052j9201
23139C4367L6737j6811P0155n4429o6603k9248P658N47k2314o169K4313r95L7726
23126A4934J5085k7287o4994j4243N930j6272L5363K7757n5499M4671J5645R699
23114i211N2274J23l3539M1067l1788k992L4173k3954q7319O1010M2737L2233
23102G4814l6386k5921M5798l6428o9529L3030k3273N0083L3856m1386k0499j6912
23090c2753k9528J738L2353M1026M6790n3622k9051M866P968J8279o6996J265
23078e7665M3015O4312J2710r3016j20102L8569J5530M444N939M2842n927k6695
23066g6044n251M3666L746M7091M4232L4348l8108m4790p2404p8224q000N7212
$$ y = [32841, 49127, 9935, 4135, 26152, 21318, -11169, 31345, 100682, 65270, 48516, 53568, 34367, 71104, 54293, 124448, 70019, 3416, -25832, -18174, -17627, -39941, -46110, -21797, -22792, 14934, 30019, 2732, -62262, -76505, -70575, -86847, -51484, -23727, -79226, -34555, -18910, -9211, 43063, 43186, 9647, 50714, 18926, 15934, 50107, 26153, -61166, -156, 42581, 74814, 38428, 12507, 58305, 21877, -47652, -14622, -37895, 12188, 46044, 4658, -15841, -32753, -62281, -60543, -28190, 12836, 59626, 6004, -23047, -18181, -10213, 8066, -58930, -57665, -14650, 49662, 62372, -30644, -150746, -112177, -96647, -92203, -86264, -43422, -49349, -76044, -81295, -37629, -33883, 13208, 57440, 91788, 53680, 8890, -63514, -141738, -149738, -92526]
23054i2526R1941J3211p5015M2763P7974k9006m1152N242K852N275Q37N2018L3602
23041H8016j4531K763j3700J6289l866n1001l1740k3213M8110P4104o665m799
23029G9767k5001k4435L1550M9715p488m2801k7646k717m8621j5260l7747k5786
23017i6470K1772n627L9251K6696L7568k8687J8370K1854m1770k1382m0743m2690
23005a11858M5691K3281r122N658k888j7278M3662R95m9491j2247k0707J1026
22993i3278m044K649M180R951J5430L5274j8266m2993O668M6455j5567Q2706O084
22980C5249m7909j251N196k5666k0602J3645K1071K7384p585q357k2491M8500
22968A7184M9820m8685j851j2857k4405n528L1720N0621m2647N3289J4663o2278
$$ y = [-92526, -585, 12626, -62389, -19626, 58348, 29342, -11810, -6568, -3716, 1559, 2396, 54414, 88016, 73485, 76248, 62548, 78837, 74971, 23970, -7770, -30983, 17127, 91231, 84566, 79767, 54766, 30331, 61881, 111596, 104108, 61307, 33661, 30944, -17677, -32937, -70684, -96470, -74698, -80325, -41074, -14378, 23190, -5497, 12873, 34727, -7043, -28425, -69168, -111858, -66167, -42886, -52008, -46350, -49238, -66516, -22854, -21859, -71350, -83597, -104304, -93278, -97322, -94673, -90493, -80542, -65112, -29838, -48104, -91097, -84429, -37974, -53541, 29165, 35249, -12660, -13911, -8715, -34381, -54983, -41338, -20267, 7117, -468, -8825, -31316, 17184, 67004, 18319, 16468, 3611, -20794, -26322, 5398, 56019, 13372, 66661, 81324, 19046]
22956A9046q5473n394M1643J9660j7011O632k0088j7395k9575K8380j2227P23
22944g1079J7837O2806j432J7485J6007n1254K7184Q4005j3307p2100n0079p658
22932d1585j687J4945l9612K0708j7665n234N3633K278o1379J1879K6525m9687
22920h6881K5725k5645O436K6771Q0499L6735n3111n956K3402j6302j3319m8732
22908e0378k6857J792K045P2003L1719J6948M4042m6561m7623m9913K9192Q9203
22896F5612L1250n0201o3951m489q373N497L9684Q256n23L4552K2834J2496l6305
22883E6339m4413p8219J3916N4614J8746J4698K971l832j2872J3286j3243m9629
22871b7638q322o3392O7816K6055k3149L35k4905J5677l305l5481l6809l426J9101
$$ y = [19046, -66427, -71821, -30178, -10518, -27529, -20897, -40985, -58380, -87955, -59575, -71802, -71079, -53242, 9564, 8132, 25617, 41624, -9630, 17554, 101559, 88252, 16152, -33927, -41585, -43272, -28327, -67939, -47231, -64896, -70130, -16497, -14219, -75598, -63719, -37194, -86881, -61156, -86801, -80365, -53594, 26905, 63640, 10529, 4573, 27975, 11673, -1646, -50378, -77235, -75443, -73398, -1395, 30324, 47272, 91314, 44753, -2870, -52783, -23591, 65612, 96862, 46661, -17290, -21779, -30152, -24655, 15029, 23285, 22762, 57314, 80148, 92644, 56339, 11926, -66293, -52377, 2237, 20983, 35681, 38652, 34820, 21948, 35234, 21991, -27638, -35960, -99352, -31536, -5481, -28630, -28295, -53200, -37523, -40828, -76309, -113118, -116544, -97443]
22858i7443O7763O4472j8171o163l6433j3461K4879n856l8130L0822L0890k8585
22846b5416Q359p0061k9900M1737L81L8025L4181l7957k170K376r332K3823K8224
22833B270N5435M1750o1127j2727k3012n0286L8103N1040Q992R484j5903n6116
22821a2097l2539n6714M5092L4818m6325J368K4090q459M1057L0258j218J8419
22809C7750j7975l7702k437l2781m487J6583P091P170m6490l3828K7473K8223
22797e1410N704j948J3700M0293K0412K5350K7409J5055k1312J088q663n377o5629
22784e328l4922m13K0510M0622Q5768K7648j05955k9782J0101J8551q865k9844
22772a1909P571k4158J4462j518L613j1923l2635l4737J444N5755J8870K7257
$$ y = [-97443, -29680, 34792, 16621, 10458, -25975, -39436, -14557, -20413, -58543, -27721, 3169, -25416, -17057, -87118, -117018, -75281, -74900, -36875, -2694, -40651, -42821, -40445, -49777, -25954, 2270, 57705, 99455, 38328, 25601, 2589, -47697, -9594, 41446, 50438, 59922, 44019, -12097, -44636, -101350, -56258, -21440, -67765, -66397, -42307, -50766, -9709, 20549, 19331, 37750, 19775, -17927, -20364, -53145, -57632, -41049, -33958, -26788, -73278, -107106, -79633, -51410, -45706, -47654, -33954, 6339, 26751, 52101, 79510, 94565, 73253, 74341, 65678, 60301, -5328, -40250, -40663, -20153, 20469, 106237, 133885, 27930, -1852, 8249, 26800, 17935, -11909, -4338, -28496, -14034, -15552, -11939, -23862, -56497, -91234, -89790, -34035, -15165, 12092]
22760A2092M9400j4231l5473o116M594k6385j8112J1857R575k7693N5356P5609
22748I0473j2546l7375p2618p03L6003K0648J1521l6186o3377M3123K2981j347
22736E97j7079K6708l574K2118J3104j5501l1836R007J9828j5835j4156j7243
22724b3862l1786K7164K2629K0675J3027J6170r191j4219l1637k2938P112k2498
22712d9354N140J1663k695M9854m6949m4197K9590K1208K0115N30N7285m2553
22700I637q321l010N347o253m4592M0419K8161L8127q518j0434k9712o3053K027
22687e0175K2356m1257J4276J2009k770N1594L1381M8107J9436l6000o2032K617
22675I542P7895L95o5108l3677k8072K2035l3424l6476L5878K237q9433n052j192
$$ y = [12092, 61492, 47261, 11788, 5672, 10266, -16119, -34231, -22374, -12799, -40492, 14864, 90473, 77927, 40552, -32066, -32769, 3234, 23882, 35403, -783, -64160, -21037, 1944, 597, -16482, 10226, 6652, 28770, 41874, 26373, -5463, 3544, 23372, 7537, -6619, -23862, -55648, -28484, -5855, 14820, 27847, 44017, 34826, 20607, -11030, -33968, -26856, -49354, -44214, -32551, -35246, 14608, -32341, -76538, -46948, -25740, -5625, -5095, 52190, 9637, 1316, -1694, 3653, -2600, -47192, -6773, 21388, 59515, 50997, 40563, 10851, -52202, -50175, -27819, -69076, -54800, -42791, -45561, 6033, 37414, 85521, 104957, 68957, 6925, 9542, 87437, 87832, 22724, -10953, -39025, -16990, -50414, -86890, -51012, -48775, -138208, -143260, -144452]
22662a44452P1403O0608j4330J11415Q8465l1316l7555L107p156n0503q2394j6374
22650d9082O126N0240k3981J4089J6990P311J3390M193J8919j076M2643l3592
22638F6170k1859k3908L2580J2758J3427L0185L525o3979n1267k3253l1623o763
22626f4007M319q46M265J730k3141N1963J1850j0301L0258K6214L7357p761j5762
22613D6138l3297p8637l5400M2281J5759K1211J3009J6087j1448J1178p998j3562
22601a4679k1498m4916J9009J8443L4166l658N6989k5201q0379O5735O6518k883
22589F7646k824j00291k247N890k344M1531K8459J9991P974L697k6978l0248m7269
22576c7013J8607J6253J9466K0903k3964j5825j5049n368J5981o7952k3030N936
$$ y = [-144452, -73049, -12441, -26771, 84644, 173109, 141793, 104238, 107345, 100189, 49686, -32708, -49082, -42956, 7284, -16697, -2608, 14382, 21693, 35083, 39276, 58195, 57119, 99762, 66170, 44311, 20403, 52983, 65741, 79168, 109353, 112878, 48899, -2368, -25621, -57244, -64007, -59688, -60534, -56269, -54539, -77680, -25717, -13867, -24168, 6090, 32304, 69661, 61900, 46138, 12841, -65796, -101196, -58915, -43156, -21945, -8936, 7151, -4297, 6881, -1117, -14679, -36177, -81093, -62084, -43641, -9475, -13133, 43856, 18655, -61724, 4011, 70529, 67646, 64822, -35469, -37716, -31826, -34170, 7361, 35820, 55811, 63785, 67482, 40504, 10256, -37013, -18406, -2153, 17313, 38216, 14252, -1573, -16622, -21990, -6009, -73961, -96991, -91055]
22564i1055n1207m5480K0448L8099P0443P2145K5594M4501K4619J1411K3324m8777
22552I4065o9569p4581l2716J7488K7540o750m458j7692M6262L0210R362l5309
22540a6148J6329K0560l3935l5493m699j3005R030M6754N8182n0194J1364R884
22528A8629M030m308j0954N9121L9822J5228J552m6072m4859n2553k4551q044
22516e2959J6591J4792J6040k377j1877m7217K8274P5038k3382q8773n2606L7547
22504i0909L8170J1060O092M115j5213J8192l1323J4480N0281K8928L0881q491
22492E6263j4732o2274p8450j8509L0396P0M6835N5186M6262m7146n8190j7877
22480f2166J9412M2265k2347j6312m7619M5150K9750M1837J0939J242J3189o244
$$ y = [-91055, -142262, -187742, -167294, -129195, -58752, 13393, 38987, 83488, 108107, 119518, 142842, 94065, 24496, -50085, -82801, -65313, -37773, -44523, -48981, -66673, -20411, 9799, 19161, -16148, 181, 20741, -13194, -48687, -53386, -66391, -57361, -10607, 47575, -2619, 8745, 18629, 22659, 18351, 7397, 66518, 106340, 121568, 123120, 77048, 32189, -20364, -44915, -52959, -36368, -21576, -5536, -7913, -19790, -67007, -38733, 36305, 12923, -75850, -128456, -90909, -52739, -41679, -35587, -31472, -46685, -28493, -59816, -45336, 4945, 33873, 64754, 56263, 41531, -20743, -99193, -117702, -87306, -87236, -40401, 14785, 61047, 13901, -44289, -62166, -42754, -489, -22836, -39148, -86767, -41617, -11867, 29970, 40909, 42151, 55340, 49096]
22468D9096k5937k4860l8443K0895P2116M80o7802p6517j7459Q4445O2519p518
22456C1015K696k529n6831L5327J7765K643J8134m801q706M1640L5479l9327k3715
22443D8790K644m8689K2144l4715l483K1898L5569N1769L6702o0791n3739j2972
22431E127K1428K0890M7554j6453j9230j9368K256k3026l2748p2138M0884K8688
22419a6136K2329j6386O4032L2187l282k0502l9345L8825R467j10429k7208R536
22407e6912J7685q111O792K0331N1480J0819p9962o8263M419K885L0237M7089
22395b1511J4821M1013Q013l6365j9411k1884L8866O2924P919j08306m4162J2303
22383f5780K8301m7224K295j3110l1716P0302N2008n2504J6802r183j3014J4676
$$ y = [49096, 23159, -1701, -40144, -19249, 52867, 53347, -14455, -90972, -108431, -23986, 38533, 31015, 33711, 31182, -25649, 9678, 27443, 30086, 48220, 43419, 34713, 76353, 111832, 72505, 48790, 51434, 2745, 24889, -9826, -13309, 8589, 44158, 95927, 132629, 71838, 18099, 5127, 26555, 47445, 94999, 78546, 59316, 39948, 42204, 19178, -13570, -85708, -44824, -16136, 6193, -10193, 53839, 86026, 82744, 62242, 22897, 61722, 71189, -39240, -66448, -56912, -39227, -47338, -40546, -20215, 31265, 42084, -37878, -106141, -101722, -98837, -68600, -21511, -6690, 34323, 42336, 5971, -13440, -35324, 3542, 66466, 74385, -33921, -78083, -65780, -37479, -84703, -82408, -95518, -127234, -56932, -4924, -57428, -40626, -49809, -62823, -48147]
22371d8147P5298J9752m1967L5126J0536l4697n2764j3746R145M3634l1360n7883
22359h7073k0349J2946O9743N0149q96q5136l6748L125O0153O2659J8136K4170
22347G0879l1555o7222l4371L7542R17l0668k1785l5461Q5532M2452K2729m6652
22335g663m0308O0840J8158j463n4561l3979L0708J5702l54k528k0787K5444M6168
22322C5377R632m733p6237o268J11244P0167n1148k4811l3344n2011J981N962
22310a4189n0326l781J1181K2645K8810N7112J0735J1067M640j837n2295n9882
22298c6120J2608j1875l90M6406r816j7922r124j4505J9630O378N2761k4497p1754
22285e8220p1034N8058P1314L8257J7048M4267o2513q0916o160j3180M779J8591
$$ y = [-48147, 27151, 46903, 4936, 40062, 50598, 15901, -36863, -50609, -41464, 2170, -29190, -87073, -107422, -94476, -24733, 25416, 24520, -60616, -97364, -94239, -34086, 28573, 46709, 70879, 39324, -27898, -62269, -24727, -23810, -54478, -76263, -111724, -26192, 16260, 38989, -7663, -47971, 12869, 31027, 29564, -24997, -58976, -28268, -12566, -12920, -15448, -36235, -10791, 35377, 45009, 40276, -35961, -42229, 69015, 139182, 88034, 63223, 29879, -22132, -20151, -14189, -64515, -68296, -57115, -34470, -5660, 51452, 62187, 73254, 77894, 76057, 23762, -36120, -23512, -35387, -35777, 10629, 813, -17109, -26233, -40738, -21108, -14730, 38031, 13534, -58220, -129254, -71196, 118, 38375, 55423, 99690, 37177, -43739, -49899, -63079, -58300, -39709]
22273c9709K6288K4425Q669J0071j154M8492l796o1383o6394J185N5317N539m6768
22260c9218l9455M1132L6068K6554P0580o5450o3624K911M4214Q587j4531M2607
22248E0375L5154K870j9138p7355m1105k7761Q394n009Q660J8225L4440l9007
22236e1257j9477J3316N0117K315k1804N6573N3244n708r7071k6171M6008j271
22224a186K7605L576M434L2526q331n762r336r6592M946N4006k2441L0009M1673
22211E5127j2060J7011N288o1050O923l3548J7993N4897L9215o4442j6858P463
22199A5959J9915O2021k2113o1679K8988m8790l2026K3030J1013m252j1641O127
22187a3448j7181q2014K4599K7367L7935K0962O196k8159M5029k898l4535j6586
$$ y = [-39709, -13421, 11004, 19673, 29744, 28590, 77082, 73286, 11903, -54491, -53306, 2011, 7550, -39218, -78673, -37541, -1473, 25081, 95661, 30211, -33413, -30502, 13712, 22299, 7768, 50375, 85529, 88399, 69261, -8094, -49199, -76960, -68566, -73575, -64915, -46690, -12250, -51257, -70734, -57418, -7301, -4986, -26790, 29783, 83027, 77319, -19752, -45923, 85, -1186, 26419, 29995, 34429, 66955, 58624, 52862, 43526, -53066, -48120, 5886, -16555, 13454, 55127, 43067, 60078, 65366, 4316, 11239, -22309, -4316, 50581, 89796, 25354, 8496, 15959, 35874, 97895, 75782, 14103, 43091, -5699, -37725, -14695, -3682, -7934, -19575, -13448, -30629, -112643, -88044, -60677, -22742, -1780, 4416, -23743, 21286, 18388, -16147, -32733]
22175c2733P465K989R087j457L5941J5591k0099K9952K224q2142m9330N0352L0713
22162a447l3374l3374M0258O3526K0893m2076o6253J886J0320j0312J0291K8580
22150a1082L9799J9593m5005p7134K3525L1395m1985k7831L7349J5276M9941K0250
22138C4091k1142l2114j767l7478l89N1692n387k2100m8979j9434K116L3997L7087
22125b9807K3590j8780m1579K6177N7516R617k4588l2101K9090N5078j7252n625
22113C1336j7472r181n169m623N492l7691l7978N463k1368j1624N0161P8587k2342
22100C591K521l6215n0689N5686M1661J3064L6645J748j7727k0864m7446j3749
22088c1774N0381q84k9994m9433N1269P3889l022J3324J1509l8966L6903L2455
$$ y = [-32733, -25268, -22279, -13192, -14649, 21292, 36883, 16784, 46736, 48960, -33182, -82512, -32160, -1447, -34821, -68195, -27937, 35589, 56482, 14406, -51847, -49961, -39641, -49953, -39662, -11082, 28717, 48310, 3305, -73829, -50304, -18909, -60894, -88725, -51376, -36100, 13841, 34091, 12949, -19165, -20932, -58410, -58799, -7107, -12494, -34594, -83573, -103007, -100891, -66894, -29807, -6217, -24997, -66576, -40399, 17117, 26734, 2146, -29955, -865, 54213, 36961, 31336, 13864, 4683, -486, -5109, 383, -37308, -75286, -69823, -91191, -102815, -52654, 25933, 3591, 6112, -30103, -80792, -25106, 16555, 29619, 66264, 68012, 50285, 29421, -18025, -31774, 18607, 17723, -12271, -61704, -10435, 63454, 60432, 73756, 85265, 46299, 83202, 115657]
22076A15657j1520m2523o3512j672j9182m6569m213K3035q771M4021O6441J1683
22064F2875n8800j0265R352j2071o145k8497k1150l35J2517L4595k169j02593
22052a22686q028O5197m566n55M8895n220k1154J3633M8847J1269j541j0730n7957
22039d4596r0714N4923m094n1298k9661M7825O0687P270P327O919l4025K0034
22027d9403M5004k9212n6780p339L6912m6613M0302J08388J6217m3245K4941M9119
22015H8291J7559p6183l0628P2911k3273o3230q833M7761L7306J3916l2864l8533
22003D200m936n940P7028J7918j056l1016n7577n6307k2495M0497j8474L5422
21991b2736M9195K3792J3501j9595m2069r0215M1208K3110q387k226j6659J428
$$ y = [115657, 104137, 61614, -1898, -3570, -22752, -69321, -73534, -50499, -59270, -15249, 51192, 62875, 4075, -6190, 3162, -8909, -15054, -43551, -64701, -65036, -52519, -17924, -20093, -122686, -130714, -65517, -70083, -70638, -21743, -26963, -48117, -34484, 14363, 25632, 24091, 13361, -44596, -135310, -80387, -84481, -135779, -165440, -117615, -56928, -49658, -42331, -35412, -69437, -49403, -4399, -33611, -90391, -97730, -60818, -107431, -67129, 41259, 57476, 14231, 39172, 88291, 105850, 29667, -961, 71950, 48677, -14553, -23386, 24375, 61681, 75597, 42733, 4200, -736, -6676, 70352, 88270, 87214, 56198, -1379, -57686, -80181, -39684, -58158, -22736, 26459, 50251, 63752, 44157, 2088, -88127, -46919, -23809, -32196, -34422, -51081, -49653]
21979d9653J0121L2182K7567j016l6571m9356J8320J8197j3636K6172M1674N6272
21967H0273n8296o4861M2445J5032k7919j903l3194N4846j3503m2733J2377M9221
21955A1785J2313M1328r146m5004q366o5076j1388K0311L2556N2541J1109r1041
21943d8078o5741J2662L1021P7413l7256J2202K6025L3114k5033j2274M4263k2720
21931B5598J4395P3006J5501j8286k2339p0536o2563N0359K2492l5754k3885L4541
21919B529m74K0132L7709K876l3723k2180J9587k0359j8394M5342Q4388k4072
21907I3361p7885M106N4733K255J1473p4273n8571L2348O5356J1667k1110l8420
21895E040l2952M5998p8553k8145M7122J1788l1644J32J2423Q727j9514P7976
$$ y = [-49653, -39532, -7350, 20217, 19201, -17370, -66726, -48406, -30209, -43845, -17673, 24001, 80273, 21977, -42884, -439, 14593, -13326, -15229, -48423, 6423, -7080, -49813, -37436, 11785, 24098, 65426, 56280, 11276, 2910, -62166, -73554, -53243, -20687, 31854, 42963, -48078, -113819, -101157, -70136, 7277, -29979, -17777, 8248, 41362, 16329, 4055, 48318, 25598, 39993, 112999, 128500, 110214, 87875, 17339, -45224, 5135, 27627, -8127, -32012, 2529, 2055, 22187, 59896, 62772, 29049, 6869, 26456, 6097, -12297, 33045, 117433, 93361, 15476, 19582, 74315, 76570, 88043, 13770, -44801, -12453, 52903, 64570, 43460, 5040, -27912, 18086, -60467, -88612, -41490, -29702, -61346, -61214, -48791, -40064, -59578, 18398]
21883A8398k818K6981j3471m9800J5477J1842K948k587k4339J9083K0607M5272
21871F7593J5610R57l4871O574q3430m4285P931J4973l297L6398K1825j1450K0047
21858A4575o348l5455N7286K3335k9146K5815j482l9519j6800l2179l470j6765
21846f0153k4759N1428M3213M222J0234k164J7900J1880m381j6259m7668n5034
21834g1541m7564L6823N4665M8932M516m621l1648J6558N5590m607l3083n8359
21822c4339N178P97n90K6755q386J0702J4797J5208P627k2272o5127k5114j2266
21809h7030K3228L4853j8289J3233M1993N681J1165l170j7025k5781j7341K2355
21797a6128l262K7634R1295J2859k831k1459p7564o3608K3112K998K0056j0325
$$ y = [18398, 15580, 42561, 29090, -20710, -5233, 6609, 9557, 6970, -17369, 1714, 22321, 67593, 83203, 84160, 49289, 55863, -27567, -71852, -63921, -48948, -52245, -15847, 5978, -5472, 14575, 8227, -27228, 30058, 53393, 24247, 50062, 48580, 9061, -7739, -39918, -43388, -60153, -84912, -33484, 9729, 13951, 24185, 22021, 39921, 51801, 47420, 31161, -16507, -71541, -119105, -82282, -27617, 21315, 25831, 21210, -10438, 6120, 61710, 57103, 24020, -34339, -29161, -28364, -28954, -2199, -10585, 117, 14914, 30122, 37749, 15477, -49650, -74764, -87030, -63802, -28949, -47238, -34005, 7988, 13669, 24834, 21664, 4639, -21142, -38483, -16128, -19390, 8244, 99539, 112398, 109567, 88108, 10544, -53064, -29952, -26954, -6898, -17223]
21785a7223J0068J9074R470l977K5440l6659q420k7091j9340m2276L5078J12053
21773E6197j0257l4184M7796n397k5744p1473m3757k8798K0077O4615n7647l1802
21761a20374M2357L2990O8228O8539O5197l5852r0148k5392o1949m1464n220M3548
21749e9540M9456k1046m0812j1931k0523K1769L3960K9975R877N321k4190l2979
21737f0663L8267M8791k9725j2566K1539J4030n9034M7640k1891J2688M3039N3104
21725I5219k6889o5436m0760m6243L5008L4757q095J159k4032q4854l3304J01187
21713f2283Q0669K4775K4938Q4426p597m0145o7016n0307j0889M833m5765R872
21701e4489L5272M9554L031m72j4743l0517O428o2387j6763M1454L3639j4392
$$ y = [-17223, -7155, 11919, 21389, 17412, 42852, 6193, -2227, -29318, -48658, -90934, -55856, 56197, 45940, 11756, 59552, 54155, 28411, -43062, -86819, -115617, -95540, -30925, -88572, -120374, -78017, -45027, 23201, 91740, 156937, 121085, 30937, 5545, -56404, -97868, -103088, -59540, -10084, -31130, -71942, -83873, -104396, -82627, -48667, -18692, -8815, -3494, -27684, -60663, -22396, 26395, -3330, -15896, 5643, 19673, -39361, 8279, -13612, -924, 42115, 95219, 68330, 2894, -37866, -84109, -49101, -14344, -22439, -21280, -45312, -130166, -163470, -62283, 18386, 43161, 68099, 152525, 144928, 104783, 37767, -12540, -23429, -18596, -64361, -54489, -19217, 30337, 33368, 32896, 18153, -12364, -5936, -68323, -85086, -43632, -9993, -24385]
21689b4385l4092K5098j7946K1591L1710j6428O11M4130p755m0547M3843q557
21677A7273N211N511k733O0601n7934l9153n6399P2765N5331k3027k5022K5865
21665C8289k1955J6643l7157n3886o101n3132n999O5418L2169J9276M352k6127
21653b8210O791K869N4226J8163N919k5386o1345m7057k9032r806k129M1208L346
21640g0443l4172J4694O8803J1999l0298q055k0163O4625j461o0849n6176L1130
21628i0366R5330O5887O607j7083n3323n087l1382m1097K4668N0022k9468k6732
21616e2024k8175l517O4086K4675J9036J2237k9236p720k4267J8604n890K4873
21604A2682L6725M524j5930q0518l451m1814l5186L0054M652J2895L4471J8375
$$ y = [-24385, -58477, -33379, -51325, -29734, 1976, -14452, -13841, 30289, 22534, -18013, 25830, 17273, 22484, 27995, 25262, 85863, 27929, -11224, -67623, 5142, 60473, 37446, 12424, 38289, 16334, 32977, -4180, -58066, -64167, -117299, -123298, -57880, -25711, -6435, -2083, -28210, -21419, -18550, 35676, 53839, 59758, 34372, -26973, -74030, -103062, -112868, -114997, -73789, -70443, -104615, -89921, -21118, -9119, -39417, -47472, -67635, -3010, -4471, -65320, -121496, -90366, 4964, 70851, 77458, 60375, 7052, 1965, -29417, -70514, -45846, 4176, -25292, -52024, -80199, -83716, -19630, 5045, 24081, 36318, 7082, -638, -24905, -6301, -12191, 12682, 49407, 53931, 38001, -42517, -45968, -87782, -122968, -92914, -88262, -75367, -40896, -22521]
21592b2521K986O8235K6690J4185n5822r994j4482r350O1243O4055l6313q6764
21580B148o7335l7899m5346r495O9229N1768j1265M3330J2685K1441j7420j4176
21568b335j2464N1380L8106L2501L7908J8319j2560n8181P375j7781l6812J8450
21556F3906N365n7581K0963j0590k2944l9391j1166N8354Q6834K2217p420O4992
21544A73539p746L155j5436o9607o1506k1314o5291Q31L7489L3680N0895N9237
21532A17926k7183o2509m8875J2854m354J977M871k3489j7753J1492k418R5431
21520E7970P4467p027l217k4891n8417l3833K131R115K1467l551r72k3603j7362
21507g723Q881K7157J162o3433K1047K8271m7653K0335N9416J687n2534n5820
$$ y = [-22521, -19535, 48700, 75390, 89575, 33753, 23759, 9277, -73, 61170, 125225, 88912, 2148, -65187, -103086, -148432, -157927, -88698, -36930, -48195, -4865, 7820, 29261, 11841, -2335, -14799, 36581, 74687, 107188, 145096, 163415, 150855, 92674, 100049, 82268, 45456, 63906, 69271, 11690, 32653, 22063, -881, -40272, -51438, 6916, 93750, 115967, 108547, 173539, 165793, 168948, 153512, 83905, 22399, 1085, -64206, -63375, -25886, 7794, 58689, 117926, 90743, 28234, -20641, -7787, -12141, -10164, -5293, -28782, -46535, -35043, -37461, 57970, 132437, 125410, 122193, 97302, 38885, 5052, 7183, 16298, 37765, 34214, 33242, 9639, -7723, 1158, 28315, 29477, -33956, -12909, 15362, -32291, -11956, 47460, 49147, -3387, -59207]
21495e9207m8540N228J6715L9509N1142O3287J8921k1706p4899m4076K523L8178
21483a2925L6056N0487l5691p2266P4384p876o6709J0287O1356Q222M0797J4367
21471A00489k3170m7171k9149p9226j3550M1693R3163L9378L0019r22J6459K1925
21459A49938m4062j05803n4014Q335J7690O2797O1775K2381o325j22882p4509
21448h4679L2523M9137O6585l12k6266k9871m2120L7562K0916l0367q207j3981
21436b9080m0684j5884O9226L3857n511l8932q8312q439K2049N9354L3314K4614
21424A5572j797L3008Q0922m5476n4267L3842j0696o9536P373K9968Q033q188
21412A8758N8643K9588m3139n1447l4555n4906J0885J9978L6038L4763M1523k9617
$$ y = [-59207, -107747, -102519, -85804, -46295, 4847, 68134, 87055, 65349, -9550, -53626, -51103, -12925, 23131, 73618, 37927, -34339, 40045, 32169, -34540, -24253, 37103, 45325, 86122, 100489, 77319, 30148, 999, -78227, -91777, -50084, 43079, 82457, 112476, 111554, 128013, 149938, 105876, 73, -53941, -45606, -27916, 34881, 96656, 119037, 112712, -10170, -84679, -52156, -3019, 63566, 63254, 36988, 7117, -35003, 2559, 23475, -6892, -15099, -29080, -69764, -85648, -16422, 17435, 11924, -27008, -115320, -123759, -101710, -42356, -9042, 15572, 13775, 46783, 127705, 82229, 27962, 61804, 51108, -18428, -11055, 18913, 26946, 18758, 77401, 106989, 63850, 12403, -22152, -77058, -66173, -46195, -10157, 24606, 66129, 36512]
21400C6512j0813j6019k3725j8756M1547N8837n1308n0540Q2693J18550o387o0061
21388A00530m8942j0683L062k3914n8048K0369M5940l1822K0974j6684R037K683
21376A2502J4218p0091k6941M7779M474k4602l0998J5204J1286L9530M2866J1250
21364D6477J419J976k857k2642n8685m5524m141O0644K7186k0391j946L5409J1710
21351B8635k6337j9723k1329L4192j1010o416j6095r822L2864K418m5906P3140
21339A4611P8131k32K1068k9952l2976q0231o37N4908L6769m0428o072j1814p884
21326d739K6184J1981l2750m2506L134n74L675k2265K7775n472K8449K7164n0939
21313c0883J3358K6112N8275k3548k5944J620L0383J3095N224j421L8308n1453
$$ y = [36512, 25699, 9680, -14045, -32801, 8746, 67583, 16275, -34265, 48428, 166978, 160591, 100530, 51588, 40905, 43967, 20053, -37995, -17626, 28314, -3508, 17466, 782, 9819, 12502, 26720, -43371, -70312, -22533, -18059, -42661, -73659, -58455, -47169, -7639, 35227, 46477, 47896, 49872, 47015, 24373, -34312, -79836, -83977, -23333, 3853, -16538, -18484, 16925, 28635, 2298, -17425, -38754, -4562, -15572, -21988, -38083, -47905, -15041, -12623, -58529, 14611, 92742, 92510, 113578, 83626, 50650, -29581, -30218, 24690, 61459, 21031, 14959, 3145, -4739, 21445, 33426, 676, -41830, -38696, -39270, -35595, -57860, -30085, -35557, -7108, 20056, -30883, -17525, 8587, 66862, 43314, 17370, 18990, 49373, 62468, 67692, 66271, 104579, 53126]
21301E3126r9121o4478J4623K6537N9833P945K6666M6086l1231m8318k4992J6683
21289a6641L30P844M2225L6336L9776j0655k9460J0885k9419n1518j6867L4499
21277A7335J3180k9995M7339M0525j10039l9616p808O7095K0651j8822m884K8499
21265B3460L2420k8198q7377k9069N7664J3338J7467L1125K6982J240L4799Q363
21253A02214m8425k9634k6223M0105K9194J7629l1497m1440l4161j1949q429K6316
21241a6300P733J327L2103K4063j6474j3951k3887k9857J1061o427m4837P635
21229f7811L3515M106o0124M096L2557j704o649q65M0766O5941M6233l0539l4175
21216B5347j5371k107Q0691O1321j0236k6040p4609o4787O0273L7850k5561k8564
$$ y = [53126, -45995, -110473, -95850, -69313, -9480, -1535, 25131, 71217, 39986, -8332, -33324, -16641, -16311, -8467, 33758, 70094, 109870, 99215, 69755, 80640, 51221, -297, -17164, 17335, 30515, 520, 47859, 88384, -21655, -61271, -69079, -1984, 18667, -155, -5039, 23460, 55880, 27682, -59695, -88764, -31100, -17762, -295, 30830, 57812, 59052, 93851, 102214, 53789, 24155, -2068, 38037, 67231, 84860, 53363, 11923, -22238, -34187, -42616, -16300, -8567, -7240, 24863, 48926, 32452, 18501, -5386, -35243, -24182, -30609, -75446, -67811, -34296, -30190, -90314, -86218, -53661, -55365, -62014, -62879, -22113, 43828, 90061, 59522, 25347, 9976, 7869, 88560, 149881, 139645, 113605, 38996, -25791, 34482, 72332, 46771, 18207]
21204A8207R221J2043O863j4579k5867L755P6240m7534l9071J5981R390j5275
21192I374j6990O7639m9759j6402m601j3490R902J2951K5705K6025L5412k6023
21180E9743q616J8810m6367m1966N069L4288K3958P646R564L9180O6292m9315
21168A18286J6154j760j3158l962l2018j8574k5809j3993k4937K2121J5782L1123
21156F9255n8457m0485K0471K5468M8666p410j1525k9832P388L377k1374K3089
21144B8631K1279k5651j5894m9560N0378J7948k918J1128m7220l3800L4208L7754
21132B6283O534n3230O186M7612K8365O772k1301K2958j0590L1966p4417q9537
21120g2399l3123L4136R0382O0935j1661m8062J2504m4303o4890m492K7292O985
$$ y = [18207, 27428, 39471, 46334, 31755, 5888, 9643, 85883, 38349, -722, 15259, 24649, 9374, -7616, 60023, 10264, -6138, -10739, -24229, -14327, -1376, 24329, 50354, 85766, 59743, 51127, 69937, 23570, -18396, -13327, 20961, 44919, 52565, 62129, 101309, 167601, 118286, 134440, 132680, 119522, 115560, 83542, 64968, 39159, 25166, 229, 22350, 38132, 69255, 10798, -29687, -9216, 16252, 64918, 57508, 45983, 16151, 23539, 26916, 5542, 28631, 49910, 24259, 8365, -41195, 9183, 27131, 24213, 35341, -11879, -45679, -11471, 26283, 32817, -20413, -14227, 33385, 61750, 68522, 47221, 70179, 59589, 91555, 17138, -72399, -105522, -71386, 18996, 79931, 68270, 20208, 32712, -11591, -76481, -80973, -53681, -46696]
21108d6696j7001J8568k856m0304J5615J1994p185n268O7264M4129k0769l6663
21096a9172M1436J11078m296j4900J0974l7529m7396K2614M404m4160l1205J3235
21084E083N3321m1766n7347N80L2285K1796K4650L323m0754l9614O676j9108K3885
21071b6990j5623N6442J31846K3723k5113l5681m2971l953N374L8378j840q4256
21059A9336n7692r795L8599l4026k9065Q7893Q5834j1119q2005m9670R739n1480
21047h3451O1679L3239l0068k141m5046j83M2975L9786M982k0113p571N04J6659
21034A1251M2502k5565M1681j0867L2317P916m1848l6696l2576l9512j7451J4983
21022e3865L6199O081L9137k6054k9062N2548N289j3966j7152n9567J0162Q8830
$$ y = [-46696, -63697, -45129, -47985, -88289, -72674, -60680, -67865, -73133, -5869, 38260, 17491, -19172, 22264, 133342, 129046, 114146, 125120, 87591, 40195, 62809, 67213, 23053, -8152, 5083, 58404, 16638, -40709, -40129, -7844, 13952, 38602, 41925, 1171, -38443, -31767, -50875, -26990, -42613, 13829, 145675, 169398, 144285, 108604, 65633, 61680, 67054, 105432, 103592, 19336, -38356, -48151, -9552, -43578, -72643, 15250, 101084, 89965, 7960, -41710, -31971, -83451, -21772, 11467, -18601, -20742, -65788, -65971, -22996, 16790, 21772, 1659, -5912, -5408, 11251, 53753, 28188, 69869, 59002, 91319, 99235, 57387, 20691, -11885, -51397, -68848, -53865, -17666, -11585, 27552, 1498, -27564, 24984, 30273, 16307, -845, -60412, -50250, 38580]
21010C8580O372j215r098n5709p297J5398o041q702l2519l454M7380o127k37J1819
20996a0850k059L5976P081j2748p601J0775O315M8145l6458k1971K6396m2889
20984A12k032N9902j1625o4823m0531k5216k060N0501K3999k249K9361K1337j547
20971C5129L0665O982l1239R058O2986n532l9777m5146K0088L1809J8229l6814
20959E6438l891k1234k2611K2504l8047q08L2569m7683J6372M6198J7325k960
20947E4172k7323l7336k8758r167j3719L88Q0025J8584j8891M1267K8947m1427
20935D6762o6441j8530Q914k6405m4682L7768O8187k006j4960m3016k3158O4448
20923a3119M7370m6224P3739P2110l6846K5353K111q7370l9719K5215K9941k5660
$$ y = [38580, 44952, 43737, 34639, -21070, -28367, -12969, -19010, -27712, -60231, -63685, -16305, -22432, -22669, -10850, -12909, 23067, 30148, 17400, 9799, 20574, 26889, 75034, 38576, 16605, 43001, 112, -1920, 57982, 46357, -18466, -58997, -84213, -86273, -35772, -11773, -14022, 15339, 36676, 35129, 65794, 72776, 41537, 50595, 113581, 108049, 68272, 23126, 43214, 75023, 93252, 56438, 52547, 31313, 8702, 31206, -6841, -7649, 24920, -22763, -6391, 39807, 57132, 54172, 26849, -10487, -39245, -48412, -62131, -61743, 18282, 36866, 17975, 59242, 88189, 46762, -19679, -38209, -29295, -55700, -100382, -62614, 5573, 3567, -11393, -54409, -77567, -13119, 34251, -11973, 61766, 133876, 97030, 122383, 124494, 37124, -2595, 22620, 52561, 26901]
20911B6901k4243M6188N0726k2593j2991p6917J3655J6050n610k6933o603L7283
20899A4913L8610L6651j4022O152q25Q843Q827l8675K2700J1481j8774J7147l22
20886I2706p3104L775Q532k0592l8898J1086M7520p715L9198m4493j1838K9886
20874C6063N2117L0445J7469r9863j3642M2263n199L7995J6037o8630q3014l4353
20862g2312M1830K0320l8272m1069o2099J9926M8738L0586M2029J9653J673L1852
20850D2855N6550K6983k8144n4922M915L6323J6883p9357k4362j2715J3995M8259
20838D7263l647q726R653J5683j6169M0668j1187J1505r103k5220l2862l083K6550
20825D1325K3494M7982K7610m4143o235K2438m3874K8581P335M3520k0245r6952
$$ y = [26901, 2658, 48846, 99572, 76979, 63988, -12929, 726, 16776, 11166, -15767, -22370, 14913, 53523, 90174, 76152, 82304, 81479, 90322, 99149, 60474, 83174, 94655, 75881, 93028, 92706, 19602, 23377, 31909, 11317, -27581, -16495, 31025, 23310, 62508, 18015, 6177, 36063, 88180, 118625, 136094, 36231, 22589, 64852, 59653, 97648, 113685, 45055, -37959, -72312, -30482, -10162, -48434, -89503, -151602, -131676, -82938, -52352, -10323, 9330, 11003, 42855, 99405, 126388, 98244, 43322, 48237, 84560, 101443, 22086, -2276, -14991, -996, 47263, 43616, 34890, 44543, 60226, 44057, 84725, 73538, 85043, 75940, 50720, 17858, 14775, 41325, 64819, 112801, 140411, 96268, 90033, 112471, 68597, 97178, 104513, 148033, 127788, 30836]
20813C0836k1882k3314k2832k0350J1006m6337K1349L9901M2149k5342l00J0752
20801d364n9224J9168j3153M8519L2385j2378j8385q792j150k5033j0346N466
20789d7287K0578l011k1873M110K8591J0135N8744K2971j8574l7447n9553R929
20777c2687Q2659L5478o2001k3432k1973L0338m4258L0032K2685k0907j4612J6698
20765a980j1636M0483K1265j1625k087l0886l6269J2418J3539K3526n3892J9651
20753a7493j0570k0061L4049L1871J0328j605J0754J7034j2849q088J6218L8629
20741H8217n938j1253j9742J1295l834O3514l7347o2206j6827j3148N8474L0145
20729H1350o3702m4460M7230j4649K740L8572j2733m9435N1437J1591J0163L6344
$$ y = [30836, 8954, -14360, -37192, -57542, -46536, -92873, -71524, -31623, 10526, -14816, -15116, -4364, -63588, -44420, -57573, -9054, 23331, 10953, -7432, -16224, -17374, -42407, -52753, -47287, -26709, -29720, -51593, -47483, -18892, -8757, 49987, 72958, 54384, 16937, -42616, -32687, 49972, 85450, 23449, 17, -21956, 8382, -35876, -5844, 16841, -4066, -18678, -1980, -13616, 26867, 48132, 36507, 34420, 3534, -32735, -20317, -6778, 16748, -37144, -17493, -28063, -48124, -14075, 17796, 28124, 26519, 37273, 54307, 41458, 33370, 49588, 88217, 82279, 71026, 51284, 62579, 58745, 122259, 84912, 22706, 5879, -7269, 51205, 81350, 17648, -26812, 20418, 5769, 8509, 47081, 34348, -15087, 36350, 47941, 58104, 94448]
20717I4448j7627j5172k0334K641P1658j782o6768j0543K958o1079p0485L6595
20705e5490J25757L6285K044j5850l7590l1831N9103L232k4988l9339J166M962
20693B7461k3177L5248R110m787O1607R939k6911M2282l3734n5482M3157M1320
20681A26033j4734m1051q2702n905K7282M8153N939j28586j15688N3937N3369
20670g3953n326L0004O6028O6496K6676j6476o5319q0152J5068K3662M9050N9944
20658I5702J3085P266L2234k8812k8563j3636j2935l7556m2373l3088M8156L5433
20646C4913J6446J876l9648n3016K4116r837m6560j8850K4963K6051j3938L4358
20634a9126j470m0144K9370R951q807N9043k0585l509P3955N1667k2877m8617
$$ y = [94448, 76821, 61649, 41315, 43956, 115614, 113832, 47064, 36521, 39479, -21600, -92085, -55490, 70267, 106552, 108596, 92746, 55156, 23325, 82428, 85660, 60672, 21333, 22499, 27461, 4284, 39532, 48642, 43855, 105462, 115401, 88490, 130772, 97038, 41556, 84713, 126033, 111299, 70248, -12454, -18359, 8923, 57076, 63015, -65571, -181259, -127322, -73953, -79279, -49275, 16753, 83249, 109925, 93449, 28130, -52022, -36954, -13292, 35758, 95702, 108787, 116053, 148287, 119475, 90912, 77276, 64341, 26785, -15588, -48676, -520, 34913, 51359, 53235, 13587, -39429, -15313, -25150, -71710, -90560, -65597, -39546, -53484, -19126, -20596, -60740, -31370, -21419, -30226, 28817, 8232, 4723, 78678, 130345, 107468, 58851]
20622E8851k4184l4421k773n484O310J7247M3121J718N049N919m8175k9508L598
20609b732J4330J771L1132J5465J8882L1246J9429j2695m5686k920K1820J2743
20597A02785n10p1202m4103l2340J9005L4822J5952l8512Q568K7693K6799j1096
20585C7861l7793n2540r063L1219M6266N4475k510O26J1701Q630j9560p873p283
20572E4156O292L6125l1171p2225L8377M2366P566j5131k2711j8977J1792l0651
20560E808n810M0992Q817j5047K7870R943l2372j4464n7090j2455L0266k5947
20548c9489K385J6623o161K4305L492j009j4539l3227L8272L1302O3487l9989
20536D5452m1213k6120k2577m5161J7619M5099P798M5197L0988K6174K8061j2522
$$ y = [58851, 34667, 246, -2527, -8011, -1701, 15546, 58667, 60385, 65434, 71353, 23178, -6330, -2732, 11598, 13369, 44501, 59966, 78848, 110094, 129523, 116828, 71142, 68222, 90042, 102785, 102275, 31073, -13030, -45370, -26365, 8457, 24409, -14103, -5535, 22158, 48957, 37861, 68, -52472, -61535, -30316, 15950, 70425, 67915, 68541, 80242, 88872, 69312, 61439, 54156, 60448, 96573, 65402, -6823, 31554, 73920, 81486, 66355, 43644, 24667, 36459, 5808, -2, 40990, 49807, 34760, 62630, 72573, 40201, 25737, -31353, -43808, -13542, -39489, -37104, -20481, -26642, -2337, 1155, 146, -14393, -47620, -9348, 21954, 85441, 45452, 4239, -21881, -44458, -89619, -72000, -26901, -19103, 26094, 57082, 83256, 111317, 98795]
20524I8795m3827p0244M6533P7496O408p7754m1112L764j4197L1384M7167K5133
20512H9546l8251J6596j2474p6J710m878O894K0880k2806J0328L5292o002o4328
20499C2431o7186k0193K0782M7638K1241L4981R547k5276O30L1867j0468J3993
20487H9987j746L1643K8160J3688n610k3041N727r322k7354l7629j8964L770N1580
20474A00889L375j2446j8212o5750J7534l9311j7067K2716J7572r228m847L5425
20462C0650O1813j3296n8380l3836O5576M5235q2344p3621J5243L7116J6505P605
20450A8266p929j9936K5496K0497j7644l3788K1652Q2889J2563o9690p1512O3502
20438B4366O8060K898j0692n752n2692J0870K8709l7546j4303p1003J6281j1873
$$ y = [98795, 54968, -15276, 31257, 108753, 115161, 37407, -3705, 59, -14138, 17246, 64413, 89546, 51295, 67891, 55417, 55341, 57051, 52173, 59067, 79947, 57141, 67469, 102761, 96759, 32431, -34755, -54948, -34166, 13472, 34713, 69694, 79241, 53965, 54595, 86462, 75994, 89987, 88241, 119884, 148044, 161732, 156122, 133081, 138808, 129486, 102132, 64503, 45539, 49309, 100889, 104264, 91818, 73606, 7856, 25390, -13921, -30988, -8272, 9300, 72, -4775, 30650, 92463, 79167, 20787, -13049, 52527, 97762, 15418, -58203, -42960, -5844, 10661, 18266, 10337, -9599, 15897, 36394, 18750, -15038, 6614, 89503, 102066, 32376, -39136, 24366, 92426, 95324, 84632, 78880, 26188, 37058, 65767, 28221, 13918, -57085, -40804, -52677]
20426e2677N314K6607L7012K7782l7989o33l9154l6654J28618M8496r3456k2312
20414i046j7906O783O8773J04220j4969m1424r2953l6482O6535N6229p3905O007
20402B1862M6453J2208m5103l9846L5768k5776K3880R371n5922J0557R2613j5799
20390G0266J7547N413P5622M1294o039p4580m5629k127K0040j6476m7095l8139
20378I7N8111K4097j9232o984n5350l3820R701j5074O925M3549K6559k9709J2989
20365B1859M6184J8029N2030k3924k6590l8301j93q702k7825j5863M5249M8384
20353I0337L78l6220J0831n8867k2968N5229P4535K8356o9976m317j6676l7954
20341A2688J1604j6085l49o210O887K7869J695l401L1467j0983j6691J3089N8778
$$ y = [-52677, -47363, -20756, 16256, 44038, 6049, 5416, -33738, -70392, 58226, 106722, 13266, -9046, -26952, -20169, 48604, 152824, 137855, 96431, 3478, -33004, 33531, 89760, 15855, 21862, 68315, 80523, 35420, -4426, 31342, 5566, 29446, 38817, -17105, -6548, 86065, 70266, 87813, 93226, 168848, 210142, 204103, 129523, 83894, 81767, 101807, 85331, 38236, 97, 58208, 82305, 63073, 56089, 739, -33081, -23380, -38454, -31529, 12020, 38579, 8870, 21859, 68043, 86072, 138102, 114178, 87588, 49287, 49094, 40392, 12567, -3296, 41953, 90337, 90715, 54495, 65326, 6459, -16509, 38720, 113255, 141611, 71635, 67318, 50642, 12688, 24292, 8207, 7858, 1648, 8535, 36404, 38099, 34698, 66165, 55182, 38491, 51580, 110358]
20328A10358n5971k5073M4191K8093j6198m8075k6420j7633L8770M2120m6658
20317B7504l8336N5276M1366n3525K55J1946P543K7689K8232Q582J0634k7446
20305I9720j2015l364l211m5152j4171L6756J3735K5336K0029r623m3947q184
20293E5909M7682J1543K7823m8919k6494J1891K3000j7470M721M9031o0011o4585
20281A4121Q254P1391J8145P011J3015l6545n3901M776M8593k4041p5544L8813
20269C4088Q2178O6300l6243l5405j0590k5998L8255N865l7221K254J2557L679
20257I9719l8696l5469L2265m466l5398N5851K4340J7053M6470m0399J9348n3422
20245H7196k1862q8k4462j4373Q786n8494L1016L8237K4791k8083Q190N0066k0748
$$ y = [110358, 54387, 29314, 73505, 101598, 85400, 37325, 10905, -6728, 32042, 74162, 27504, -10832, 44444, 85810, 32285, 32540, 44486, 52029, 79718, 107950, 116532, 127166, 99720, 87705, 84341, 81130, 35978, 21807, 58563, 72298, 97634, 117663, 108040, 64093, 55909, 103591, 115134, 142957, 94038, 67544, 79435, 102435, 84965, 89686, 138717, 78706, 14121, 22375, 93766, 111911, 118922, 131937, 95392, 41491, 46267, 94860, 70819, -4725, 34088, 116266, 182566, 146323, 110918, 100328, 74330, 112585, 118450, 81229, 83483, 96040, 99719, 61023, 25554, 57819, 53353, 17955, 73806, 98146, 115199, 161669, 121270, 140618, 87196, 65334, 65246, 40784, 26411, 35197, -23297, 7719, 45956, 70747, 42664, 50854, 100920, 80172]
20232H0172J2336M5125M2817O286k5950k367K71O4038k1205n1388m3987J8606
20220A24754Q577l9598O485R261k2182l6730P3141K9822j6530j02864L254R3941
20208A31331R1969j2688l1512r883m1407J9913m587j1646K9897l1524K368n7725
20196G4506j4048N1263M2616m9400k5603j0934o359j5445j6616j3370j8955K4972
20184B2627P2131k0319n0843M4593K1257J0738n9650p071j3469l7156l9954P3202
20172A6086R1453J1377n6691p936n474N0381k8250l8458J3545k521J1439L0228
20160H5179L838j1130l7199q5139j213Q9223N9831P798m158j5148J0563l6206
20148F6239k5282L3582P1439P808K9559l7478M2118j4144m2152J7717M2939J0166
$$ y = [80172, 92508, 137633, 180450, 186736, 160786, 158419, 158690, 222728, 201523, 150135, 106148, 124754, 133331, 93733, 100218, 109479, 87297, 50567, 123708, 153530, 137000, 34136, 37390, 131331, 223300, 210612, 179100, 169217, 127810, 147723, 143136, 131490, 161387, 129863, 132231, 74506, 60458, 111721, 154337, 104937, 79334, 68400, 62041, 46596, 29980, 16610, -2345, 22627, 94758, 74439, 23596, 68189, 89446, 100184, 40534, 33463, 19994, -17162, -57116, 16086, 107539, 118916, 62225, 54289, 48815, 99196, 70946, 32488, 46033, 43512, 54951, 85179, 89017, 77887, 40688, -44451, -45664, 43559, 103390, 111188, 107030, 91882, 102445, 66239, 40957, 74539, 145978, 153786, 183345, 145867, 187985, 173841, 131689, 149406, 192345, 202511]
20136B02511L5847n2559m3103o2903q683J2058J3615K1029K2977O3248Q880j5338
20124A97579m9417J3631M5632j4535n0778m200l9146l85L4191m2534K4451J2161
20112A26650m4242j3515j4938J4227R7762M4760J2542k4742m2481N448o902p61
20100A53808p6815j4420J02684n3210j1630P9321M2069n7066r300L408M7553k7506
20088A78896o9080k4651K3171J5407L7135K1143r366p3920K5917K6737l5425k9688
20076H6276J13630N0964j7159k5019J6087n826k9048J1166n143n2196J824N0325
20064A95881R026J7179N8009j2672j18777K8926P3488N4122J02972P9765N6066
20053E43985L1924L1025M6972M0591m8897j9392p2886j03098j2854J05570L0999
$$ y = [202511, 238358, 185799, 142696, 79793, 71110, 83168, 96783, 117812, 140789, 204037, 212917, 197579, 148162, 161793, 207425, 192890, 142112, 137912, 98766, 98381, 132572, 90038, 114489, 126650, 82408, 68893, 53955, 68182, 165944, 210704, 223246, 198504, 156023, 161471, 154569, 153808, 76993, 62573, 165257, 112047, 100417, 179738, 221807, 164741, 155441, 158849, 206402, 178896, 109816, 85165, 108336, 123743, 160878, 182021, 172655, 98735, 124652, 151389, 115964, 86276, 199906, 250870, 233711, 208692, 224779, 218953, 189905, 201071, 195928, 143732, 145556, 195881, 204907, 222086, 280095, 267423, 148646, 177572, 251060, 305182, 408154, 487919, 543985, 575909, 606934, 653906, 694497, 645600, 626208, 553322, 450224, 437370, 542940, 573939]
20042E73939o844J2454L4859L1191N8047J40922P9591O5098K170k0682j31371
20031H39374j37218k8238J1119Q7451P3618o3902j74811r0780j36777j21259m798
20020B53779M8880n6113k9901N36L6083R184j5109K361M7026L990K3834L4642
20008C59192P6954L7053o012O9865l254j8683J0143k3644o5039J9781l2825r484
19996D14047K8026L4497J47848J03016R4723J32415J15691l4841q7600l823J4349
19985I58348J6863J6105O0153j480o8624j4729o6415J742R8909M6442O389n4166
19973I99537o7378r2248M1788J42844J13807P7961M6984j8557r8403j12427j79767
19962H54141j66048q3485m4438j3722K2936K8047K911N7077J32154J95316J19625
$$ y = [573939, 567095, 579549, 614408, 645599, 703646, 844568, 924159, 989257, 991427, 970745, 839374, 702156, 673918, 685037, 772488, 846106, 782204, 607393, 516613, 379836, 258577, 253779, 302659, 246546, 216645, 217181, 253264, 262448, 247339, 249700, 296726, 300716, 324550, 359192, 436146, 473199, 467187, 537052, 533798, 515115, 525258, 501614, 436575, 456356, 423531, 414047, 442073, 476570, 624418, 727434, 822157, 954572, 1070263, 1035422, 947822, 943999, 958348, 975211, 991316, 1051469, 1049989, 981365, 966636, 900221, 901963, 1000872, 1047314, 1053703, 999537, 932159, 839911, 881699, 1024543, 1138350, 1216311, 1263295, 1244738, 1146335, 1033908, 854141, 688093, 604608, 560170, 546448, 569384, 597431, 600342, 657419, 789573, 984889, 1104514]
19951A104514j3694l2811k5297o0056j39085j50094r0699q3091m6248m3931k4078
19940C95430J3234l6767O9433K408m3543r49l0229j2063P6216m1713m9033r681
19928C32743n4362l3619P583N0194M8876J7282n1753l8519o96o2303L5645m3261
19916B07810o0470L4760J8691L3347L7769k6165o0410o5902L7526J34511M2065
19905C33532J322O342k4009p210j907l1193m5795o40q1648K0804N1593J3978j93
19892B34976j9387l6314j0283N1996L6780l0563k7231l060L5218O0438j0942j6743
19880B64885j2821j0521o0649j02086l0529M9238N609j8392K8627Q0188Q0005
19869B73554L9650j6137k4705j3793N005j6386n2440O055O3035Q1085j352o1509
$$ y = [1104514, 1090820, 1058009, 1032712, 972656, 833571, 683477, 592778, 509687, 463439, 419508, 395430, 408664, 371897, 441330, 443738, 400195, 399246, 369017, 356954, 433170, 391457, 342424, 332743, 278381, 244762, 252345, 302539, 351415, 368697, 316944, 278425, 277729, 215426, 251071, 207810, 147340, 182100, 200791, 234138, 271907, 245742, 185332, 119430, 156956, 291467, 333532, 334854, 341196, 317187, 309977, 308070, 276877, 231082, 230442, 148794, 169598, 221191, 235169, 234976, 215589, 179275, 168992, 220988, 257768, 227205, 199974, 196914, 232132, 292570, 281628, 264885, 252064, 241543, 180894, 78808, 48279, 97517, 103126, 84734, 113361, 193549, 273554, 313204, 297067, 272362, 258569, 263574, 247188, 194748, 200803, 263838, 344923, 343571, 282062]
19857B82062k9379N520M153n9078N175l1429k5241K5991P1551P521n3839m0711
19845A62296L4937K8129j4957K2521L0716J1082l7661l3115l0970k174L5309L0556
19833B36669J7867k767K1380M013k5429N5859J5715l4667l2376L4171l234j6837
19821B70364k9884j5237k3854M8867K6923k2780k3872l7753K8552N404J7507R457
19809B53694l100m5076r363L9939M2266L7152j4118K0676K9257J3943O8560N3276
19797D87106n4722J4535P8976Q4834J22696K0787m2156l4146L1446L979r319N5834
19785G59850Q0606N9129l3842n5707j0610K1527O0880P0956P576q6914j17643
19774G55808m2430l4128L2571J8782M7135J6741J1347K155n9265l580r5784o3184
$$ y = [282062, 252683, 258203, 262356, 203278, 208453, 177024, 151783, 177774, 249325, 256846, 203007, 162296, 197233, 225362, 210405, 232926, 263642, 274724, 237063, 203948, 172978, 170804, 206113, 236669, 254536, 251769, 273149, 277162, 251733, 307592, 323307, 288640, 256264, 290435, 287201, 270364, 240480, 225243, 201389, 250256, 277179, 254399, 230527, 192774, 221326, 226730, 244237, 253694, 250594, 205518, 196155, 236094, 278360, 315512, 301394, 322070, 351327, 365270, 433830, 487106, 432384, 446919, 525895, 610729, 733425, 754212, 712056, 677910, 709356, 713335, 704016, 759850, 840456, 899585, 865743, 810036, 799426, 820953, 881833, 952789, 960365, 873451, 755808, 713378, 679250, 711821, 730603, 777738, 794479, 805826, 807981, 748716, 745136, 649352, 586168]
19762E86168M4642L8210l8851j0210J9241p7174k1433K2234l5482p1780l236M8074
19750E00403p299L3315O5558L7692M6409K4892N012J07147J06287K6390l0502
19739I15304L5309n995P7761K7462J41838J12988P3678o4191J246l6316o024l7084
19727A235976p8708p3637j10445L6794J5810K5780J37784J62287O2312n9224k6721
19716A328008p0866j88404j10235q7132o8940q0160k4539j5405k9303p9499j1985
19705E61540K0901J190M6838K6357n29K8711Q2005N3495q102Q670l2759j05171
19693F83146o5512N906r875j0191J6060k2163j9872O4833O154l3349k2285j01658
19681D91194l4258J4240J6486k2047j610L3560j0534m0127J4527N4102N6918J5648
$$ y = [586168, 630810, 669020, 630169, 619959, 639200, 562026, 540593, 562827, 527345, 455565, 452329, 500403, 493104, 526419, 591977, 629669, 676078, 700970, 705982, 813129, 919416, 945806, 915304, 950613, 944618, 1022379, 1049841, 1191679, 1304667, 1378345, 1314154, 1315400, 1279084, 1273060, 1235976, 1157268, 1083631, 973186, 1009980, 1025790, 1051570, 1189354, 1351641, 1413953, 1354729, 1328008, 1257142, 1068738, 958503, 871371, 802431, 722271, 697732, 682327, 653024, 573525, 561540, 582441, 583631, 630469, 656826, 656297, 685008, 767013, 820508, 812406, 821076, 788317, 683146, 617634, 623540, 613665, 603474, 619534, 597371, 577499, 642332, 648486, 615137, 592852, 491194, 456936, 471176, 487662, 465615, 464005, 497565, 487031, 446904, 461431, 515533, 572451, 588099]
19669E88099j825K5233L5796m202m6866j7212o9442o0349N7486N7785K068J3612
19657E80183j63Q08P5566K6812o3961K8123q645l4298J04374J36638N0384O6973
19645I62794O8884O6297Q2157M3649O5894P5454N908p5835J1369J4068l5101p2104
19633A213434p2545o4274J0498n7361l6307r770Q8718J5706N5134L7843J7579
19622A198655k0885n5067o5244n5139j5922K2193k5329j9412J4231L3003N96O6168
19610A077848O5100K47j4636o0968j4798L9450L9596J9495J3239l3117J647J7298
19598A150401O0785M6851M3332R9437L5775K4391J10008J00723J45002J02324
19588A919029K4345J5755K5915j1917J5592J4720M3723O9050Q6206P1791R5470
$$ y = [588099, 586274, 611507, 647303, 643101, 596235, 579023, 509581, 449232, 506718, 564503, 566571, 580183, 580020, 580828, 656394, 683206, 619245, 647368, 638723, 604425, 708799, 845437, 895821, 962794, 1031678, 1097975, 1180132, 1223781, 1289675, 1365129, 1371037, 1295202, 1306571, 1320639, 1285538, 1213434, 1140889, 1076615, 1087113, 1029752, 993445, 983675, 1072393, 1088099, 1143233, 1181076, 1198655, 1177770, 1122703, 1057459, 1002320, 986398, 1008591, 983262, 963850, 978081, 1011084, 1011680, 1077848, 1142948, 1143195, 1128559, 1067591, 1052793, 1092243, 1131839, 1151334, 1164573, 1131456, 1133103, 1150401, 1211186, 1258037, 1301369, 1400806, 1436581, 1460972, 1570980, 1671703, 1816705, 1919029, 1943374, 1959129, 1985044, 1973127, 1988719, 2003439, 2047162, 2116212, 2202418, 2274209, 2369679]
19577B369679O9671L9092R606J29314O9197k6713P5534L7674L4331N6170J00943
19566B964498J10596J23250J33298N4930l1133l3696n4975r8273n1075l3934L3437
19555C116923P6698J37653P3455J24673J07506J10965J56273J71077J70931J69331
19545D415485K30720K63436K79270K43979L60686O10045P17267O47896N08235
19536H277019M96189N37353M79872O20603R22873J238778J714831K445707L529903
19527B0263128M620881M606465K586879j474479k786526j311757L76006J538643
19519B8419240K654948L831307N263519P283058J0205463J4795801K2343269L3847380
19511A28643985M2557377L7919403Q842551k4305643k3743811k4338862l3369888
$$ y = [2369679, 2439350, 2478442, 2488048, 2617362, 2686559, 2659846, 2735380, 2773054, 2807385, 2863555, 2964498, 3075094, 3198344, 3331642, 3386572, 3355439, 3321743, 3266768, 3168495, 3117420, 3083486, 3116923, 3193621, 3331274, 3404729, 3529402, 3636908, 3747873, 3904146, 4075223, 4246154, 4415485, 4646205, 4909641, 5188911, 5432890, 5793576, 6403621, 7120888, 7768784, 8277019, 8773208, 9310561, 9790433, 10411036, 11333909, 12572687, 14287518, 16733225, 20263128, 24884009, 29490474, 32077353, 30602874, 27816348, 26504591, 26880597, 28419240, 31074188, 34905495, 40169014, 47452072, 57657535, 72453336, 94796605, 128643985, 171201362, 209120765, 217963316, 193657673, 169913862, 145575000, 112205112]
19504A12205112k6884180j5794060q201424l065768Q64026M900838Q642487R386934
19496H2053965L832185q727355j6255913j3231140q409037n118845l241184k259609
19488B8643067j628014j060371n64477k43791K4774K55192M75933O04877O90366
19479B7197556P02525N15688P32578J088892J407297J872613K508157L382353
19471C9407659M592379O374513R216318J3194782J6711694J5920340O915073q393622
19463A03939136j3423527q146152j745299L725060Q768363J4552205K2514152
19456A30183938L4557581M8336502N7075087M9952406K1130747p818526n5922421
19449B77495314p9325539n8272860l4700664k0727138j3253741q732509n662091
$$ y = [112205112, 85320932, 69526872, 61325448, 58259680, 59123706, 64024544, 72667031, 82053965, 85886150, 77158795, 60902882, 47671742, 39262705, 34143860, 30902676, 28643067, 27015053, 25954682, 25390205, 25146414, 25171188, 25426380, 25902313, 26507190, 27197556, 27900081, 28415769, 29148347, 30237239, 31644536, 33517149, 36025306, 39407659, 44000038, 50374551, 59590869, 72785651, 89497345, 105417685, 112332758, 103939136, 90515609, 82369457, 80624158, 84349218, 93117581, 107669786, 130183938, 164741519, 213078021, 270153108, 320105514, 341236261, 333417735, 277495314, 198169775, 139896915, 105196251, 84469113, 71215372, 62482863, 56820772]
19442E6820772l516363j738488m6571K076893M548625N282935K225943n995795
19434E9657951j0841804q506933n360391l305005k192337j569183j106718q09210
19426B5966370o00811m19136n77253o37907o92022o71632n37781l84757k79542
19417B1165529k83611k73890k96942m20987n85692o42123o69665n94034n08477
19408A6890108m00694l69426k71185r8350l8837j9744K7215n539m3968k00436
19398A5469144j77571j00757J8065J73623L09919M16675O81937J026860J297805
19389A9115700J538666J919968K238907K538319L055868L892708N040073O615712
19381D5955921R241129J3643066K0003418K6221481K7052886J7569627J059204
$$ y = [56820772, 53304409, 51565921, 51519350, 53596243, 58144868, 63427803, 65653746, 59657951, 48816147, 40309214, 34948823, 31643818, 29451481, 27882298, 26775580, 25966370, 25365559, 24946423, 24369170, 23731263, 23039241, 22367609, 21829828, 21445071, 21165529, 20881918, 20608028, 20311086, 19890099, 19304407, 18662284, 17992619, 17398585, 16890108, 16489414, 16119988, 15848803, 15750453, 15711616, 15691872, 15719087, 15713548, 15669580, 15469144, 15291573, 15190816, 15208881, 15382504, 15692423, 16109098, 16791035, 17817895, 19115700, 20654366, 22574334, 24813241, 27351560, 30407428, 34300136, 39340209, 45955921, 55197050, 68840116, 88843534, 115065015, 142117901, 159687528, 160746732]
19374A60746732k776230k471897j5015946k9241906k5498804j5497801p972001
19367F2272147l044769M89107L775097P617755J2953319K0038336K5802899K4866984
19359A54770875J2402536l418113m844398o191119k1194897l2488041k6211050
19352G2825793j6566917j0097386o402413m427013l313151k498691k006861j759997
19344B5753364j428114j117421j024874p44366o12766o05544n63279m58668l88937
19335A8809395l93333l10771l68446l60550l95344m25056m33472n08784m50728
19326A5162911l91490m19357l54551l40858k76895l18783m27095m67416n16803
19317A1649663n78382n32721m36962l94432l05385k90253k09143j51878j79678
$$ y = [160746732, 157970502, 155498605, 140482659, 111240753, 85741949, 70244148, 62272147, 59227378, 59716485, 63491582, 71109337, 84062656, 104100992, 129903891, 154770875, 167173411, 163755298, 158910900, 152719781, 131524884, 99036843, 72825793, 56258876, 46161490, 39759077, 35332064, 32018913, 29520222, 27513361, 25753364, 24325250, 23207829, 22182955, 21438589, 20825823, 20220279, 19657000, 19198332, 18809395, 18416062, 18105291, 17736845, 17376295, 16980951, 16555895, 16122423, 15613639, 15162911, 14771421, 14352064, 13997513, 13656655, 13379760, 13060977, 12633882, 12166466, 11649663, 11071281, 10538560, 10101598, 9707166, 9401781, 9111528, 8902385, 8750507, 8570829]
19308H570829k24882k88959k45312j73335j83980k17926j47056p9330j13516n3318
19298F843215P030J171J12264Q8595k6342k4072M7595J06732M5316O9249J59193
19287G429946K03191K65561L17956M50599O48930Q28961J008876R23422Q80532
19278A2957974P49370P14404P74179Q62762J115443J589512K152474K967176M299097
19269B8182391O269750Q250773Q742079N567881j109470n291166l704182l66334
19261D6541722K411515M742514P027216R699476J3339652J8830783K7791823M1184292
19253A71568993N6108015O1659880M3445836j58668l7282219n1761841n6575577
19246A87004419m7081911l0028584j7184229r488665m560220l35355M087902Q323118
$$ y = [8570829, 8345947, 8056988, 7811676, 7638341, 7454361, 7236435, 7089379, 7010049, 6896533, 6843215, 6850245, 6851416, 6963680, 7052275, 7025933, 7001861, 7049456, 7156188, 7201504, 7270753, 7429946, 7633137, 7898698, 8216654, 8667253, 9316183, 10145144, 11154020, 12077442, 12957974, 13707344, 14421748, 15195927, 16058689, 17174132, 18763644, 20916118, 23883294, 28182391, 34452141, 42702914, 51444993, 57012874, 55903404, 50612238, 46908056, 46541722, 48953237, 53695751, 60722967, 70422443, 83762095, 102592878, 130384701, 171568993, 227677008, 289336888, 332782724, 332624056, 295341837, 243579996, 187004419, 139922508, 109893924, 92709695, 83221030, 78660810, 78325455, 82413357, 90736475]
19238I0736475R769381N106360o373882j6440138j6998532j2204472p794941m902244
19230D0898007l275258k334943j692841j334464j112770o70885k52786P0039L36069
19221C0630168J85755n3459k620K37842O25968R98128J314848J701136K381436
19212C8019202L326166M355069O256473R131046J1971143J2217581O825092l245110
19204H8856662r568766p923492l041291J767621O439819J1923704J8891169K5973079
19196A33318505K9588073K5531065J5873432P454535j0287559l7883997m5580655
19189A18013399l2840567j9764768j1892103p578267n120775l652127k643692
19182C4521100j731644o95541M33055J636582K161166J063265j974406m545615
$$ y = [90736475, 100505856, 105612216, 99238334, 82798196, 65799664, 53595192, 45800251, 40898007, 37622749, 35287806, 33594965, 32260501, 31147731, 30476846, 30224060, 30294099, 30630168, 30815923, 30762464, 30759844, 30997686, 31623654, 32621782, 33936630, 35637766, 38019202, 41345368, 45700437, 51956910, 61087956, 73059099, 85276680, 92101772, 88856662, 79287896, 71364404, 68323113, 70090734, 76530553, 88454257, 107345426, 133318505, 162906578, 188437643, 204311075, 211765610, 201478051, 163594054, 118013399, 85172832, 65408064, 53515961, 45937694, 40816919, 37164792, 34521100, 32789456, 32093915, 32526970, 34163552, 36324718, 37387983, 35413577, 30867962]
19174C0867962m524333l219185k090082j428463j030351p86324o71580n55647
19166A6561997m09254l67712l21392l24500m27632m12484k42073j67138k59750
19157A3630062l98923m43748m57953n16879n31110n89610n71236n00658m44093
19148I175852l84649m12082m20073l79789k97346k69366k52995k44687l50667
19139F164198l26377k51148j85814j32978j88399k42731j77493j23315q4088j76431
19129D275424j75569q4110p9882j59655j78348k15026r8494o2012k7161k0510
19119C174657r7411j82999j88940j14002p5826n4667q0185l6499l4646j4622j07426
19108B187434j38808p2767Q818J1204p9802j3561k8091o6433r2485j65104j01657
$$ y = [30867962, 26343629, 23124444, 21034362, 19605899, 18575548, 17789224, 17117644, 16561997, 16152743, 15785031, 15463639, 15139139, 14711507, 14299023, 14056950, 13889812, 13630062, 13231139, 12787391, 12329438, 11812559, 11281449, 10691839, 10120603, 9619945, 9175852, 8791203, 8379121, 7959048, 7579259, 7281913, 7012547, 6759552, 6514865, 6164198, 5837821, 5586673, 5400859, 5267881, 5079482, 4836751, 4659258, 4535943, 4451855, 4275424, 4099855, 4015745, 3935863, 3776208, 3597860, 3382834, 3284340, 3222328, 3195167, 3174657, 3077246, 2894247, 2705307, 2591305, 2515479, 2460812, 2380627, 2344128, 2309482, 2294860, 2187434, 2048626, 1975859, 1984677, 1995881, 1916079, 1902518, 1874427, 1807994, 1715509, 1550405, 1448748]
19097A448748j8734r8035r9469L4532J7444J5611K3833p300k0238k3291L7117
19086A310218j6967K5615O788n4998j3696N0916K1076L4232M3277L1092R6155
19075A533708K6818K046K6543o7601j1148M8221L1029j1278p7795m5149l2218
19064A423176l9436M6522l360J3968J07602P6711O3116O4822N3983K0749P5589
19053A903442j6439l4913M3832O6914Q7261O4293N3314l0110k1535J7352J2530
19042B145941Q9491J25782M9512K6111K5116n0161M122J39283J11652Q9730J27198
19031B883777O3168O6688J02084J98777J11982J21798J99752J95884J57737J15303
19021D216950J03869J40820L10081L15518K98388L29954L51990K96643L54851
$$ y = [1448748, 1430014, 1331979, 1232510, 1267042, 1284486, 1300097, 1323930, 1316630, 1296392, 1273101, 1310218, 1293251, 1318866, 1325654, 1270656, 1256960, 1307876, 1328952, 1363184, 1406461, 1437553, 1533708, 1560526, 1562572, 1589115, 1521514, 1510366, 1558587, 1589616, 1578338, 1500543, 1455394, 1423176, 1383740, 1430262, 1426902, 1440870, 1548472, 1625183, 1688299, 1753121, 1807104, 1827853, 1903442, 1887003, 1852090, 1895922, 1962836, 2050097, 2114390, 2167704, 2137594, 2116059, 2133411, 2145941, 2235432, 2361214, 2410726, 2436837, 2461953, 2411792, 2415914, 2555197, 2666849, 2756579, 2883777, 2946945, 3013633, 3115717, 3314494, 3426476, 3548274, 3748026, 3943910, 4101647, 4216950, 4320819, 4461639, 4771720, 5087238, 5385626, 5715580, 6067570, 6364213, 6719064]
19012F719064K99016K35248K88872L32310L68568M76822N55124O51322P64821
19003A0691167Q45238J034347J176322J260737J455363J644815J849904K133350
18995B2091243K594847L171712L880738M906953O289633Q206678J0810802J4063682
18987G6016288J7449819J9233958J7473135J1814225N119243L54492l857378q689717
18979A34914065j0708293p318908m05486O469140J0674122J0406720N429699j028540
18971A48432519n971873j0839415j6506480j9766367j8462773j4494707j0502531
18964E1888373p445981n433914m076247l120089k469142k015194j637623j338110
18956B4352073j279321j177276r76323p62808n77508n66658m62007k63534l69437
$$ y = [6719064, 7018080, 7253328, 7542200, 7874510, 8243078, 8719900, 9275024, 9926346, 10691167, 11536405, 12570752, 13747074, 15007811, 16463174, 18107989, 19957893, 22091243, 24686090, 27857802, 31738540, 36645493, 42935126, 51141804, 61952606, 76016288, 93466107, 112700065, 130173200, 141987425, 147106668, 147461160, 143603782, 134914065, 124205772, 116886864, 116481378, 122950518, 133624640, 144031360, 149461059, 148432519, 142460646, 131621231, 115114751, 95348384, 76885611, 62390904, 51888373, 44442392, 39008478, 34932231, 31812142, 29343000, 27327806, 25690183, 24352073, 23072752, 21895476, 20919153, 20156345, 19578837, 19012179, 18550172, 18286638, 17917201]
18947A7917201n27431n49936n40375n16161m27975k84760k48062k40906l20459
18938A4261136m05922m63138m02479m82957n58735n70310n65953n07871m47904
18929I855867m48627n28751m45959l55523l49498l69695l35934k38411k95903
18920F487566l72320l36131k51127j97538k06350j72377j67397m4702j57345k83030
18910D299249j92088q2983o2260k06917k93657k61367j75129p4318j05549j18658
18900B726323o2665O0805N676j29543j82037j39491r2448o5018j79310j25036
18890A817256r9492p3979j03552n2001p4088p5731M142J9959l5146o3569k5004
18879A238795n1261q6463k4343J7260m5691p2531l2818Q786L2549k6271m966r318
$$ y = [17917201, 17389770, 16839834, 16299459, 15783298, 15355323, 15070563, 14822501, 14581595, 14261136, 13855214, 13392076, 12989597, 12506640, 11947905, 11377595, 10811642, 10303771, 9855867, 9407240, 8878489, 8432530, 8077007, 7727509, 7357814, 7021880, 6783469, 6487566, 6115246, 5779115, 5527988, 5330450, 5124100, 4951723, 4784326, 4739624, 4582279, 4299249, 4107161, 4024178, 3961918, 3755001, 3461344, 3199977, 3024848, 2950530, 2844981, 2726323, 2663658, 2724463, 2730139, 2600596, 2418559, 2279068, 2186620, 2121602, 1942292, 1817256, 1717764, 1643785, 1540233, 1488232, 1414144, 1338413, 1342555, 1362514, 1327368, 1263799, 1238795, 1187534, 1101071, 1076728, 1093988, 1048297, 975766, 942948, 951734, 984283, 958012, 953046, 943728]
18867I43728n8447j0416L578L106K7368J8091K7836r627o2311j4986J7621k228
18855H83313m115m9259l28J069l4877O719N9828K158m3717r1721j07739m7731
18843E73600m733l2801p2750o4412Q008k0447M4071K8543n4324q2455R990j3986
18831C18304p60N1713l7828n9084R061M0937J1305l2435k1507Q421L2502J0925
18819C31554K0334k5337j674l388p157o216J6301K2999k6209p4509L6131M4420
18807C27249K320q8867l2583L3526K0269m3927k6288J3881L3682m4534j2418J5198
18795A97508j7204l0664L3450O5643R1359q841k7729J4291l2811m1084O4220P4718
18783C82856J14556P0712N2930N7301R9315J34200J73818J33502J10388k3368
$$ y = [943728, 885281, 874865, 878443, 881549, 908917, 927008, 954844, 945217, 882906, 867920, 885541, 883313, 879198, 829939, 829611, 830680, 795803, 802522, 862350, 864508, 820791, 729070, 621331, 573600, 568867, 536066, 463316, 398904, 406912, 386465, 430536, 459079, 404755, 322300, 332290, 318304, 317544, 369257, 331429, 272345, 281406, 322343, 333648, 301213, 279706, 288127, 320629, 331554, 351888, 326551, 324877, 321489, 314332, 308116, 324417, 347416, 321207, 246698, 282829, 327249, 329569, 240702, 208119, 241645, 261914, 217987, 191699, 205580, 239262, 194728, 182310, 197508, 180304, 149640, 183090, 248733, 340092, 331251, 303522, 317813, 285002, 243918, 308138, 382856, 497412, 568124, 621054, 678355, 777670, 911870, 1085688, 1219190, 1329578, 1306210]
18773A306210n2334n1946j34173j13444l2095K2363J09814M9231j20145j56263
18763H27218K916J49698R9916Q0277N0094K7505l8312m5632r8148j41894j12312
18752H01326j11997p9838n1803n7127J5912J3547k3464j0717m9846q4252J2377
18741C74118J00095L8941Q7646l579l8909k9175N546j7076j4227Q0923O4768M9716
18729F98787J25379J36406P7646q0493r9721m2498O9822J28491k5934o0259n6197
18718H71429j2200M0159O6456L6399L7621k837r5448j53412j52384p1480n1558
18707E12745o9136l9858m6425l20M7757K1826N0646J7907l6477p1709l212o0018
18695C23726n1011l9178J0837O089J3216n0470l2579K9905M7278K7175j2868O5512
$$ y = [1306210, 1253876, 1201930, 1067757, 954313, 922218, 944581, 1054395, 1103626, 983481, 827218, 830134, 979832, 1079748, 1160025, 1210119, 1237624, 1199312, 1153680, 1055532, 913638, 801326, 689329, 609491, 557688, 500561, 516473, 530020, 506556, 495839, 445993, 361741, 374118, 474213, 513154, 600800, 597221, 558312, 529137, 534683, 517607, 503380, 584303, 649071, 698787, 824166, 960572, 1038218, 957725, 858004, 815506, 885328, 1013819, 987885, 927626, 871429, 859229, 899388, 965844, 1002243, 1039864, 1037027, 941579, 788167, 635783, 564303, 512745, 443609, 403751, 357326, 357006, 404763, 426589, 477235, 495142, 458665, 386956, 383744, 323726, 272715, 233537, 244374, 250463, 263679, 213209, 180630, 210535, 257813, 284988, 272120, 337632]
18683C37632P8431j8428n5448M0772K7758M5459J21678P6078R4612L9027N0015
18672H37586m3760m4995Q0011R2536J085j34040j02265j32977n0592j5363l6658
18661D50568J3516k4401K7213P7485O2951R1530O4679J7964K2088p2766n7950
18650F72877j6157q8475q6356n3448o5471n4368k6285l8977J7166j4984n267O574
18638B46829m3166n9170M2837J1633k6411k8356q665m481k2631J09635O9591o7651
18626B19994p7625M2327K3161r707l5085m6537L9338j7418N0023J9738j3682j7572
18614A76955n3460L0822N492l7788q8905K9905K0175N614k7891J6833J5507L0551
18602A23810r513j4626K9718n4055j2393J2573k4514j6948Q401K8366l3552n655
$$ y = [337632, 416063, 397635, 342187, 382959, 410717, 456176, 577854, 653932, 748544, 787571, 837586, 793826, 748831, 828842, 921378, 922463, 788423, 686158, 553181, 502589, 487226, 450568, 464084, 439683, 466896, 544381, 607332, 698862, 763541, 781505, 803593, 730827, 672877, 656720, 568245, 481889, 428441, 362970, 308602, 282317, 243340, 260506, 245522, 240255, 246829, 203663, 144493, 187330, 198963, 172552, 144196, 135531, 131050, 108419, 218054, 287645, 219994, 142369, 184696, 207857, 198150, 163065, 116528, 155866, 138448, 188471, 208209, 194527, 176955, 123495, 154317, 159809, 122021, 33116, 63021, 83196, 88810, 60919, 77752, 93259, 123810, 114297, 99671, 129389, 75334, 62941, 75514, 51000, 34052, 42453, 70819, 37267, 31612]
18590C1612j4507J2248L2041j0283m6032o06L9267m82n523M1172J2432Q414n10
18577I9243J4015m6679J0217m655j9683O7587k8721l9546o1420l0265j153l156
18565d4216M921M0385J6944j4225N60K2502l4665j7252K9024L4383l3402m3305
18553c8346L133J9204M2587N9287n0501j8099J7256M6510p2387m8822K2104o11
18541a8685J5M8640l9770n436N9866J9565k4005j7689o780J0957L2281j3160j7306
18528B8493J1801m4682M9868L0420m3234q7607Q351L7311k3405J8294O2487P6961
18516A25058k7139q2948m1069j2578J9540M0249k1848o2579q5099p9790K3989
18505b04214O9729J466M3186P4798J1934J862l026n1618m1976M1164P7041l6087
$$ y = [31612, 17105, 29353, 61394, 51111, 5079, 4473, 43740, 43258, 37735, 78907, 91339, 99753, 99243, 113258, 66579, 76796, 72141, 52458, 120045, 91324, 51778, -9642, -39907, -41060, -44216, -39295, 1090, 18034, 3809, 4369, 26871, -7794, -25046, 3978, 38361, 4959, -38346, -35213, -16009, 26578, 85865, 35364, 17265, 34521, 81031, 8644, -40178, -18074, -18685, -18670, 29970, -9800, -15236, 44630, 64195, 40190, 22501, 15721, 26678, 58959, 45799, 28493, 40294, -4388, 45480, 75900, 32666, -54941, -46590, -9279, -32684, -14390, 48097, 125058, 97919, 14971, -26098, -38676, -19136, 21113, -735, -63314, -148413, -228203, -204214, -134485, -133019, -89833, -15035, -3101, -1239, -4265, -55883, -97859, -56695, 20346, -15741]
18493a5741L8634K1932J4537J5081j2132M334r2466j5962J7203k4708L836K8698
18481a6754O5943k951l747j885p859p5993n6338Q306O2140N9459J9640M1858R746
18468A01565J3062n2443n8962K2201M8458N6732N3816o3483p7717n447M201K5166
18456F7149O135K9255J9353m1623n556r996j5074L3885K689k4943j5698J0013
18444E5589j923l494l7409k8895p117l4181l7866L4940M3349J5378k7840j9514
18432d8983m906J0272K872O9866M0636n7724L350N6231J6061q939P708J0037k1687
18419G4794o7634N2575K1361K6292p129P86j806O440R062l8048r201k1464m790
18406D1238M7499L6053p6769l2047j2919Q680K0483N8834k3981R5886J4034K5598
$$ y = [-15741, 22893, 44825, 59362, 74443, 62311, 66645, -25821, -41783, -24580, -49288, -45452, -16754, 49189, 46238, 42491, 40606, 32747, -43246, -99584, -91278, -29138, 30321, 49961, 91819, 101565, 114627, 62184, 3222, 25423, 73881, 130613, 184429, 120946, 43229, 37782, 41983, 67149, 73284, 102539, 121892, 80269, 74713, 64717, 49643, 83528, 86217, 61274, 45576, 55589, 53666, 50172, 12763, -16132, -23249, -57430, -95296, -60356, -17007, -1629, -29469, -48983, -53889, -43617, -40745, 29121, 69757, 12033, 15383, 71614, 87675, 78736, 86444, 96481, 74794, 7160, 59735, 81096, 107388, 100259, 101045, 99239, 105679, 114741, 76693, 67492, 46028, 41238, 88737, 124790, 48021, 15974, 3055, 11735, 32218, 91052, 67071, 162957, 176991, 202589]
18394B02589K3462j5393J186R0602Q0490J21317P7673K8118O8281N8028N1755
18383G88108L0163k7392p3344o5381J0266J3904q998J4844R2656P5548m1549n9294
18371G49531P493q7161j14289o9861j39451q1675J2576j7300J5769n1402m7056
18360A77174n0259J9715l6722m3374M1478p092J1224j4668j8396P017J9181K3587
18348A28865Q0207L2075o0262j9726R885l8939o7546J7079l3357n5117k9311N8519
18336B2372Q8336M2853n8912o5427m5390k3491l2152L2312O721M2996Q267n928
18324A2557K8883K9238k1030j6643k916k7703J7608L6066k3065l636N8583M5786
18312A33728R857j7812K6072J8804l4105n2599j0962l7432j0215O3566r652k0732
$$ y = [202589, 226051, 210658, 211844, 302446, 382936, 504253, 581926, 610044, 678325, 736353, 788108, 818271, 790879, 717535, 652154, 662420, 676324, 667326, 682170, 774826, 850374, 808825, 749531, 757024, 669863, 555574, 485713, 346262, 264587, 277163, 259863, 275632, 224230, 177174, 126915, 146630, 109908, 66534, 108012, 100920, 112144, 97476, 79080, 86097, 105278, 128865, 209072, 241147, 180885, 161159, 171044, 132105, 64559, 81638, 48281, -6836, -36147, 22372, 110708, 153561, 94649, 29222, -16168, -39659, -71811, -39499, -32778, 10218, 18485, 12557, 41440, 70678, 49648, 33005, 30089, 2386, 19994, 56060, 32995, 29359, 87942, 133728, 143585, 125773, 151845, 170649, 136544, 83945, 72983, 35551, 25336, 88902, 79250, 58518]
18300E8518J6291O4684Q2095N9238k0944m9209o3619r6109j772P7657J7863n0065
18288I4628j857M7335o07r2553m9567K1220k0780n137k1489j3663P3824K1664
18276E3018N5700K4401j3530m0216m3245n3504j2468L902M9343K7908K2281J2023
18264H5613K4356q760J2801o15j7078K2296M430m6399n7799m7648N6000R554L7549
18251G4300J9560j6489l660N396K9951n0190J1739O7634K1248J3405l3783n4296
18239H4815k2268K5369L4582j0200M6450K8627n3799l8552o357l617q9902M1512
18227C6660L9992l515J8456N572q2354n5713L5080R6240O3737j8426J3879k9476
18215A20132l0812k5739N3376L4717q0204j6480l93J3148L6416j038n1475J6211
$$ y = [58518, 74809, 139493, 221588, 280826, 259882, 210673, 147054, 50945, 49173, 126830, 144693, 94628, 92771, 140106, 139499, 46946, -2621, 18599, -2181, -7318, -28807, -42470, 31354, 53018, 108718, 133119, 119589, 79373, 36128, -17376, -29844, -25942, 23401, 51309, 73590, 85613, 109969, 101209, 114010, 113395, 96317, 118613, 123043, 76644, 18845, -28803, 27197, 36751, 74300, 93860, 77371, 73711, 79107, 109058, 58868, 70607, 138241, 159489, 172894, 139111, 84815, 62547, 87916, 122498, 112298, 158748, 187375, 133576, 95024, 88667, 85050, -4852, 36660, 76652, 73137, 91593, 97165, 14811, -40902, -5822, 90418, 154155, 135729, 149608, 120132, 89320, 63581, 116957, 151674, 71470, 54990, 54597, 67745, 104161, 103123, 51648, 67859]
18203F7859M4245M8739J5038o0190o1773j2245N0971L8925J8819J8808k8966k7618
18191A12612Q9927L1100n6760l0576L676j9439J9085j2341J2287L6159m217L9993
18179B21506k076m6804l2186N2352M0122M7706O1198j8160q3003o2557L2311j8100
18167A92309Q94O8035K0392N8198l6386k8375l1459P475M7799N9526L2573L3535
18155D24516L3787M7029K9914L9778O9336j1598q4898K5764O1624O2043J7528
18144G14823j9508K7701O9786O2624m69O1997J06163R9029Q9407J25606N9984
18133A397143N6212O7601J19383J92521J80822J93848K31073K48481K73464L64126
18123C324674M49861N05016O12739P19893Q55769J086420J422667J764240K395953
$$ y = [67859, 112104, 160843, 175881, 115691, 53918, 41673, 92644, 131569, 150388, 169196, 140230, 112612, 202539, 233639, 176879, 146303, 149979, 130540, 149625, 137284, 149571, 185730, 181513, 221506, 219430, 172626, 140440, 192792, 232914, 280620, 341818, 323658, 240655, 178098, 210409, 192309, 193203, 261238, 281630, 339828, 303442, 275067, 243608, 251083, 298882, 358408, 390981, 424516, 458303, 505332, 535246, 575024, 644360, 632762, 547864, 573628, 635252, 697295, 714823, 695315, 723016, 792802, 855426, 854957, 916954, 1023117, 1122146, 1211553, 1337159, 1397143, 1453355, 1520956, 1640339, 1832860, 2013682, 2207530, 2438603, 2687084, 2960548, 3324674, 3774535, 4279551, 4892290, 5612183, 6467952, 7554372, 8977039, 10741279, 13137232]
18114A3137232L320825M723748P380337J2181095J8430479J9190325R203245j8004420
18106F9562866k6114834j5845242q487717m744327k932945j773910j300109r81474
18098G382308p30068o49422n15526m77008l66933k15356j35452j87307j94496
18089C910740j99950j11050j28346j69279j66943j58616j63119j06321n9446j4052
18079B633618N0074M4719J0306K1608Q4045M2824J5506l0981j00865j43645j77453
18068B449756j40702j11967j28099j35534q2233m2489n9320j00503p7211L1219
18058A602917N4474N1955P8389q6733q2324r1002r029J3199j81178j29867j7150
18047A203651j50798j33424l2661j07769j21556j2138k3062n5412m6287p779J3716
$$ y = [13137232, 16458057, 21181805, 28562142, 40743237, 59173716, 78364041, 87567286, 69562866, 43448032, 27602790, 19115073, 14370746, 11437801, 9663891, 8363782, 7382308, 6652240, 6002818, 5487292, 5010284, 4643351, 4427995, 4292543, 4105236, 3910740, 3710790, 3599740, 3471394, 3302115, 3135172, 2976556, 2813437, 2707116, 2647670, 2633618, 2683692, 2728411, 2738717, 2760325, 2844370, 2887194, 2902700, 2871719, 2770854, 2627209, 2449756, 2309054, 2197087, 2068988, 1933454, 1851221, 1808732, 1749412, 1648909, 1571698, 1602917, 1657391, 1709346, 1787735, 1701002, 1618678, 1527676, 1518647, 1531846, 1350668, 1220801, 1203651, 1052853, 919429, 886768, 778999, 657443, 645305, 622243, 566831, 520544, 512765, 526481]
18036E26481k7780j2048J7852o624o6323J3070k4377J4714j5352j7407j16922
18025B85284r0070k4439N081J4383J6017L3429J6358n116j9314N2608k9689j4520
18013B40012J885n467j2691m0689j05300K136J00163R4038K9801j8644L4835N0968
18001C71047N2112Q043J7859L6654N6682K1582J4458P9491J10178O1127K7928
17990H57161R7495P5181K9604N7689j2454m6902j3502m2367l8201j30006j08811
17979G24887j6388o1090r6971k3461o9791j28800o7652k8908l2741m2408J7219
17968A73896M9613M79J3216o990K1126K2646m4020o1855J9874J325r4891k6336
17956F8083O1499R0141O7732M3119j001M0714L9916L4515j4048m807L9504L9061
$$ y = [526481, 498701, 486653, 504505, 497881, 431558, 444628, 420251, 434965, 419613, 402206, 285284, 195214, 170775, 175856, 190239, 206256, 239685, 256043, 250927, 231613, 284221, 254532, 240012, 241897, 236430, 223739, 183050, 77750, 79886, 180049, 274087, 303888, 285244, 320079, 371047, 423159, 431202, 449061, 485715, 542397, 563979, 578437, 657928, 768106, 829233, 857161, 954656, 1029837, 1059441, 1117130, 1104676, 1057774, 1044272, 1001905, 963704, 833698, 724887, 708499, 647409, 550438, 526977, 457186, 328386, 260734, 231826, 199085, 156677, 173896, 223509, 223988, 237204, 230214, 251340, 273986, 229966, 168111, 187985, 189310, 94419, 68083, 129582, 219723, 287455, 330574, 329573, 370287, 410203, 444718, 430670, 425863, 465367, 504428]
17944E04428L9953k883k5790J4879n8238K176k268J8078J0780j8477l3907p4806
17932C73925j5883L8498k445q2658o7960j658M0421m3474j01932l2264l5139j447
17920F7984J029L5387J3915Q0544L8169m4673J1674q944o039q418k9859l7156
17908A13613p5073k7766L0856L8146J8541K0098m3956K4885O737J8142J4274J5543
17896A54040l1863k5676L2231M5820M5283l2755p1717l0239M7307l3058R010R844
17884A18227L5212R943m9187J0291K7155l5528n4362r1L4213O278l4558J9048
17872H6641M7762k2997m5418Q166M6258j02577q3l0515l6018N5973k5294j1323
17860b9425J9658N4251K0957k6669M8456K6817K1829k8701n6051Q780j113l7799
$$ y = [504428, 544381, 541498, 515708, 530587, 472349, 474525, 472257, 490335, 501115, 482638, 448731, 373925, 358042, 396540, 394095, 311437, 243477, 241819, 282240, 238766, 136834, 104570, 69431, 67984, 69013, 104400, 118315, 198859, 237028, 192355, 204029, 195085, 189046, 180628, 150769, 113613, 38540, 10774, 41630, 79776, 98317, 118415, 74459, 99344, 106081, 124223, 138497, 154040, 122177, 96501, 128732, 174552, 219835, 187080, 115363, 85124, 132431, 99373, 108383, 118227, 153439, 163382, 114195, 124486, 151641, 116113, 61751, 61660, 95873, 102151, 67593, 86641, 134403, 111406, 65988, 74154, 120412, 17835, 17752, -12763, -48781, 7192, -18102, -29425, -9767, 44484, 65441, 38772, 87228, 114045, 135874, 107173, 51122, 59902, 58789, 20990]
17848B0990j3594K8274k9854J1867L5939J362k1114q000K5348N906m5691M8777
17836F0210O267k2132K2766m106l5127k4381k1614n2371n8251O4382N3590k0478
17824c1245p657P239Q860J2488K2704M3951p0248o3245P316N005P94K3490K0284
17811b0264K8625J4977m4243j8114m7857M2496P5155p2456k1028O434N8019M0633
17799D2377m7616k0425j6896p5626k3866N7920J1144q879M2358J5485k8773l8587
17787i1384l2651J0961K472O107L2623k8810n6654l5860M4395P9455M9208J8254
17775a884J6557l316K7717j592L5979M914k4197n1749j8010j6909j5285P9145
17763C1370L3563m6764j0638l3583j6979m3754l968M5247L5218j0966k8170J4239
$$ y = [20990, 7396, 35670, 5816, 17683, 53622, 54984, 33870, 25870, 51218, 57124, 11433, 60210, 66477, 44345, 67111, 63005, 27878, 3497, -18117, -70488, -128739, -64357, -10767, -31245, -38902, -31663, -22803, -10315, 12389, 56340, -13908, -77153, -69837, -64832, -64038, -40548, -20264, 8361, 23338, -20905, -39019, -86876, -44380, 30775, -41681, -62709, -56275, 1744, 42377, -5239, -25664, -42560, -118186, -142052, -84132, -72988, -81867, -39509, -24024, -52797, -91384, -124035, -113074, -110602, -104495, -71872, -100682, -157336, -193196, -148801, -69346, -20138, -1884, 14673, 11357, 39074, 37482, 73461, 78375, 54178, 2429, -15581, -32490, -47775, 31370, 64933, 18169, 7531, -26052, -43031, -86785, -90753, -45506, -10288, -21254, -49424, -35185]
17751c5185K0496J2002K959J9541m901k5310J1800j1298M1789O3574n644m5611
17739D4212n4064m1628n5595L6043R0830k0228m8338K4633J2100J7326o3767m852
17727f3328M2238M1407L9328J47K2068K8292L5754n8859r2531k3423j0193k2082
17715f1182N579N3320k1766k4246M4076K1286o0482k7218l2715M7769P3852m504
17703A3769q66O0069m5085n9100o8335Q598M2487M681L090M3139K7279J8862o870
17690D1718J2739n0416R773M5135n0817M03O345P806K1544j6953K003n719k5759
17677b198m2641J7118j60P946N7284k2788k8160J2381L1450J8795K6426O824m1432
17664D0845K6526K5248j3700r832m7669J2465l2078k923M649p0150l0806K9361
$$ y = [-35185, -14689, -2687, 272, 19813, 14912, -10398, 1402, -9896, 31893, 95467, 89823, 44212, -9852, -51480, -107075, -71032, 19798, -430, -48768, -24135, -12035, 5291, -58476, -63328, -21090, 20317, 59645, 59792, 81860, 110152, 145906, 87047, -5484, -28907, -39100, -61182, -55603, -2283, -24049, -48295, -4219, 17067, -43415, -70633, -103348, -55579, 18273, 13769, 12903, 72972, 27887, -31213, -99548, -90950, -48463, -43782, -40692, 2447, 29726, 48588, 41718, 54457, 4041, 13814, 58949, 8132, 8535, 14880, 22686, 44230, 27277, 29280, 23561, -2198, -44839, -27721, -27881, -19935, 37349, 14561, -13599, -1218, 30232, 49027, 75453, 82277, 40845, 67371, 92619, 78919, 69087, 21418, 33883, 1805, -1118, 3531, -66619, -97425, -68064]
17652f8064Q8834L4109R890n662n5048r5579J1468K1951O8440P9511M9837k9397
17640A10290q3910l4459J9759k9661N7318M2669l0982K3947k2180q1854j8495
17629d7558J4112L9291M2782j6265n7428K6774k4564K9929L5120L1379k6663O1386
17617A08295L6528j5282J6621K1838m1267p1285N828J4972J4865N2426l9008j9269
17605H5262L3203L3456N7887J27514M9484L8638Q2195J11646M2995j67752p5189
17594D19339k1030o4376j727O655R4989J05366J52612Q6574Q879l6819l7361k0628
17582F92473K8035j667l0573j09288j58981j13211j2017j6038R9668R1948P3540
17571E43889K5589J6014q4277j27333o5200j2107l1450n1836l0179o8114j5009
$$ y = [-68064, 20770, 54879, 64769, 59107, 4059, -91520, -80052, -58101, 10339, 89850, 139687, 110290, 26380, -8079, 11680, -17981, 39337, 82006, 51024, 74971, 52791, -29063, -47558, -33446, 5845, 48627, 32362, -25066, 1708, -22856, 7073, 42193, 73572, 46909, 108295, 144823, 129541, 146162, 168000, 126733, 55448, 61276, 76248, 91113, 143539, 104531, 85262, 118465, 151921, 209808, 337322, 386806, 425444, 507639, 619285, 662280, 494528, 419339, 398309, 333933, 332206, 338861, 433850, 539216, 691828, 778402, 787281, 750462, 713101, 692473, 720508, 718841, 688268, 578980, 419999, 306788, 294771, 278733, 378401, 470349, 543889, 569478, 585492, 501215, 373882, 308682, 296575, 265125, 213289, 183110, 114996, 99987]
17560I9987Q251J1955M0117R781m8309k655l5784Q243M7524J4326K48r27p4795
17547G7962q2958m216K9915N592L6217j8884j2383m4003K9315L0187K1042m0277
17535B7509p3100p2413L5630M4381o323j0967L7812J5935M599p3461l0207K1148
17523g9457N0875L9511l423p314j6742N140o704K9319L6820K0019M2335J2961
17511A23340o4159q122P1161J8351m7865l3764m3477l0762m1409J656l043N428
17499e2665O3072Q232k3090n5160l2172M0972K7845j9615p731P409N1889K0909
17487B9895l799j829M573K3147N4918J0056k9509q4549j7863K8351m4460J9129
17475a1940K4223m0099M4246N7660j5666j7111Q193P288k270M32m7132k8299K8652
$$ y = [99987, 108238, 120193, 160310, 170091, 121782, 119127, 83343, 91586, 139110, 153436, 153684, 152757, 77962, -4996, -9212, 20703, 26295, 62512, 43628, 31245, -12758, 16557, 46744, 67786, 27509, -45591, -118004, -82374, -37993, -44316, -55283, -17471, -1536, 3063, -70398, -100605, -79457, -28582, 10929, 7506, 192, -16550, -11410, -18114, 11205, 48025, 68044, 110379, 123340, 59181, 51059, 122220, 140571, 92706, 58942, 15465, -15297, -56706, -55050, -58093, -52665, 10407, 18639, -4451, -59611, -91783, -50811, -22966, -42581, -50312, -42903, 8986, 29895, 26096, 24267, 28840, 51987, 106905, 116961, 87452, 2903, -14960, 13391, -31069, -11940, 12283, -27816, 16430, 74090, 58424, 41313, 49506, 56794, 54524, 54956, 7824, -20475, 8177]
17462H177P0732l9459m0166J4194n0862J6632L6602p756L4873j2281j3257N5531
17450G2960l337l9239N6503J14888K3224N4315P5287L4564J00955R622j82408
17439C17334j19335p5826l3071q3704m8253N5610N1406L0718J4602n1610k4972
17428C2899M487l2046M0281K9817K7602L3326K6964m0182j4121k2641J3971K2791
17416A23148K2570O843k0959o9481k7018P7111N0298j3273p756l9769j3832p089
17404H0793j9604m2341l4111j4160N6153l1380j3816J28528Q9748N158o7440p5510
17392F2018k7131L1859K724j1565j5005k9852L4567N6300m7908p9205m651m764
17380c2613K4563K9018k080J6524m302K5064J5378M2618M3660j0956N40m3666
$$ y = [8177, 78909, 39450, -716, 13478, -37384, -20752, 15850, 8094, 42967, 30686, 17429, 72960, 69623, 30384, 86887, 201775, 224999, 279314, 354601, 389165, 490120, 499742, 317334, 197999, 122173, 89102, 5398, -42855, 12755, 64161, 94879, 109481, 57871, 32899, 37386, 5340, 45621, 75438, 103040, 136366, 163330, 123148, 109027, 86386, 100357, 123148, 145718, 152561, 131602, 62121, 35103, 112214, 162512, 149239, 141483, 101714, 87882, 80793, 61189, 18848, -15263, -29423, 26730, -4650, -18466, 110062, 199810, 204968, 137528, 62018, 34887, 66746, 69470, 57905, 42900, 13048, 47615, 103915, 56007, -23198, -27849, -32613, -8050, 20968, 18888, 35412, 31110, 56174, 71552, 114170, 157830, 146874, 147414, 103748]
17368A03748o3K0174k9280j9758k6870m8022L380j5806k6843J9445L204M7891
17356C1200j5889n6457o428O8645k6611L9742L0074l3645k2880J9412N870K6004
17344E9037r1462J4495P8736p528L410M8986n0225l7399K895M4701k2739j6945
17332B5962l8624j7496K2579K7412K9120L0296J5475j8085n5535K779j398K8672
17320E1157R3579J6772n2714J6815k2037n8345J0174L7855M4015L2049k1233m8841
17308I9246l5840l906k9360P28N185j2186k3557k0883N4036J9959N6539M6745
17296A56706p790r724Q2243M215Q417L794J9262J4711K7621m5791p8818L0753
17284B05599L0836J9139l0968p7735J7395m1607n1929J2576R7880M9895n1325
$$ y = [103748, 103685, 123859, 94579, 74821, 47951, -71, 3309, -12497, -39340, -19895, -16691, 31200, 15311, -41146, -47574, 21071, -5540, 34202, 64276, 30631, 7751, 27163, 33033, 59037, -32425, -17930, 60806, 53278, 56688, 105674, 55449, 18050, 20945, 65646, 42907, 25962, -12662, -30158, -7579, 19833, 48953, 79249, 94724, 76639, 21104, 23883, 22485, 51157, 144736, 161508, 108794, 125609, 103572, 45227, 55401, 93256, 137271, 169320, 148087, 99246, 63406, 59500, 30140, 30868, 36053, 23867, 310, -20573, 33463, 53422, 109961, 156706, 148916, 139192, 221435, 225650, 234067, 237861, 257123, 271834, 299455, 253664, 174846, 205599, 236435, 255574, 224606, 146871, 164266, 122659, 70730, 83306, 181186, 231081, 179756]
17273A79756m4337J9435P2671j720K8653n604N452P340N142J865l2299o3139J5091
17260A88306J978m0007k415O0840l4527q3025J0448R5623m432r4235J5246R1755
17248B05555N60m2507K8523m3365l8869n1352l5353K9638J23613N23o1880j3296
17236A01790O6268j4668M868L7962R569n542K926M2419j6953l9749j0069J6834
17224A95655N8898p379j0867l6896J276n07P20j1560p2613r485K7751O4480K2976
17211B22449K8693N6570r873L181R5070J1372o2176l0471K8986J9854l525L722
17199C63852n481l8951M9405L7199l4571n813J6945L9135l6791n1743l5878q31
17187B96477K8943R989k658k8591L6213j0296l6879K6072N5196K0527O3777j3867
$$ y = [179756, 135419, 154854, 227525, 225805, 254458, 248854, 254306, 261646, 266788, 268653, 236354, 173215, 188306, 190284, 150277, 147862, 208702, 174175, 91150, 101598, 197221, 192789, 98554, 113800, 205555, 206115, 163608, 192131, 148766, 109897, 58545, 23192, 52830, 176443, 176966, 115086, 101790, 168058, 153390, 158258, 196220, 205789, 200247, 203173, 245592, 228639, 188890, 178821, 195655, 254553, 247174, 236307, 199411, 200687, 200180, 200900, 189340, 116727, 107242, 134993, 199473, 222449, 251142, 307712, 297839, 301020, 396090, 407462, 345286, 314815, 343801, 363655, 360130, 363852, 358371, 319420, 368825, 406024, 371453, 365640, 382585, 421720, 384929, 333186, 297308, 296477, 325420, 335409, 332751, 304160, 340373, 330077, 293198, 319270, 374466, 394993, 458770, 444903]
17175D44903L5978P9275j4485l1429k0018K4064j0673l0383k0483K4076L5307
17164E16132K8142l8720O96K3159N2913j1871k4749O5075k6275j9319J5507j0285
17152E70405j13213k0456L0297N974K0736n806K9549N2952k6016N926J4589l4876
17140E30061k5689k6278N4233M6505J1797M4295K4987K5488m6962p2433q7868
17129D78136j9652q945J3481K7999P0977N0222n4339l126k5981K266M1763Q9881
17117F62682Q2843O8237n253P396J4230Q641K3087L0387k5958K5811N325j7405
17105H80023l7279N1953P0548M9743L0547O662M0816L2502L1131O8582M2613K2029
17093A289870R6132O4926L605m0808J3794M8609j7753O845K6007M6634J11719
$$ y = [444903, 480881, 560156, 545671, 514242, 494224, 518288, 507615, 477232, 456749, 480825, 516132, 544274, 505554, 506250, 529409, 582322, 570451, 545702, 610777, 584502, 565183, 580690, 570405, 457192, 436736, 467033, 473007, 493743, 487937, 517486, 570438, 544422, 550348, 564937, 530061, 504372, 478094, 532327, 578832, 590629, 634924, 659911, 685399, 638437, 566004, 478136, 458484, 449539, 463020, 491019, 561996, 612218, 557879, 554753, 528772, 531038, 572801, 662682, 745525, 813762, 808509, 815905, 830135, 838776, 861863, 892250, 866292, 892103, 897428, 880023, 842744, 894697, 965245, 1014988, 1045535, 1052197, 1093013, 1125515, 1156646, 1225228, 1267841, 1289870, 1386002, 1450928, 1454533, 1413725, 1427519, 1476128, 1458375, 1465220, 1491227, 1537861, 1649580]
17082A649580J24750P4310O7436P4044O3760K0235N4640P6573R4748J32984J33678
17071B566738Q6340O7749J35425J00857J43460J65659K56684K42539K71701K45625
17061D282777K24987J89483J77237J73479L04988L67744N44418O47952O71354
17052G584419O97850P34271P53608P97238R09375J097827J422076J671322J980480
17043A7648466K423555L156003M056462N407586P594019J0800607J5364211J9600101
17035H6051010J8893237Q426857r753378j9336869j5182621p705061j567311L399955
17027F3225819Q314115J3947851J9004054J9246191J0406390n006684j1215964
17020A17921772l306105O416428Q239248j908254j7403720k1773785j5677883
$$ y = [1649580, 1774330, 1848640, 1916076, 1990120, 2053880, 2074115, 2128755, 2205328, 2300076, 2433060, 2566738, 2653078, 2720827, 2856252, 2957109, 3100569, 3266228, 3522912, 3765451, 4037152, 4282777, 4507764, 4697247, 4874484, 5047963, 5352951, 5720695, 6265113, 6913065, 7584419, 8282269, 9016540, 9770148, 10567386, 11476761, 12574588, 13996664, 15667986, 17648466, 20072021, 23228024, 27284486, 32692072, 40286091, 51086698, 66450909, 86051010, 104944247, 113371104, 103617726, 84280857, 69098236, 61393175, 59825864, 63225819, 71539934, 85487785, 104491839, 123738030, 134144420, 129137736, 117921772, 114615667, 121032095, 129271343, 127363089, 109959369, 88185584, 72507701]
17013G2507701q521198k976268J705574O622697J1953877J5730578J3087252L06799
17005A10417012j6938076k2559277j7401518j1301010p161551m648079l153547
16998B7253954k358221j938264j667759j403942j096215q90758p20953n59310
16990A6618532m40474l48386k83171k93609n17149o45202o19123n25944m77766
16981A2467708m41953m68034l80050l67847l13626l20374l63591m16123l90045
16972I006065l43914k84652l33456l67264m44413m07969m18020l91770l46269
16963E668338l28724k74062j79305k27442k33455j86855j84231k41815k51918
16954C560531j64176j26542j35861j29298k20683k08023q4670q3268j16066j00587
$$ y = [72507701, 63986503, 61010235, 62715809, 69338506, 81292383, 97022961, 110110213, 110417012, 93478936, 70919659, 53518141, 42217131, 35055580, 30407501, 27253954, 24895733, 22957469, 21289710, 19885768, 18789553, 17898795, 17177842, 16618532, 16178058, 15829672, 15546501, 15252892, 14735743, 14090541, 13471418, 12945474, 12467708, 12025755, 11557721, 11177671, 10809824, 10496198, 10175824, 9812233, 9396110, 9006065, 8662151, 8377499, 8044043, 7676779, 7232366, 6824397, 6406377, 6014607, 5668338, 5339614, 5065552, 4886247, 4658805, 4425350, 4238495, 4054264, 3812449, 3560531, 3396355, 3269813, 3133952, 3004654, 2783971, 2575948, 2491278, 2408010, 2291944, 2191357]
16944B191357j61539r0950q5741q8183j00802q1514o6175j24064m5373J0419l6145
16933A321290n5790J9010o5935l3078k5904j25641q4901k4760O679p6052q6358
16922G68560m6648J0969q042m6631k6247l1211l6410l2378K6769O999o845q9326
16910D89559N484M6494K577q4486l5569K5380k5289M0390K2796m7179l650k3055
16898D13452l7242l0570m808M3047n3167R899k0737l9349j8153l8207j7273p9043
16886A27849k3439j0618q117J3247k5559k2731p459R598j6708j8315n2263k9098
16874f3613P3882J5234j8939r328r727M7165N757r3673m0296L9960L9755m311
16862a8134J936M0239N2192L7644j8317j44012o4105J5001J5834M4223N3901L0811
$$ y = [2191357, 2029818, 1938868, 1853127, 1764944, 1664142, 1582628, 1516453, 1392389, 1347016, 1357435, 1321290, 1265500, 1284510, 1218575, 1185497, 1159593, 1033952, 949051, 924291, 930970, 854918, 768560, 721912, 732881, 724839, 678208, 651961, 620750, 584340, 551962, 578731, 585730, 578885, 489559, 495043, 541537, 544114, 459628, 424059, 449439, 424150, 464540, 487336, 440157, 436507, 413452, 376210, 345640, 340832, 383879, 330712, 340611, 319874, 280525, 262372, 224165, 206892, 127849, 104410, 93792, 85675, 98922, 73363, 50632, 43173, 52771, 36063, 17748, -34515, -63613, 10269, 25503, 6564, -2764, -12491, 34674, 40431, -53242, -93538, -53578, -13823, -18134, -16198, 24041, 76233, 113877, 95560, -48452, -112557, -97556, -81722, -37499, 16402, 47213]
16850D7213K5044O09m4842k1730q285j7127K6679o437O9596R0328K2185K68r055
16837A74446l1331j0449J6217o5049p408O18K5986L205j8914k3463J5042L629
16825H2529L8674j9347P9783J8479n1418q092k7206k4048j9877M7395P3536j0396
16813A80012N651m795K09r398K6227J0617m3741k0966j8080p1084N561l9275J6947
16800C7885Q748J6675L1330L1504m778k2009l428J600k4656K126N39J5394k0745
16787G0185Q1033L1400k3262o849l2946p4378J3139N3830l9065n9453j231N9441
16775G1844J2658j0482R310J7J9773N458O620o431k4507j5465q0413J2751K0099
16762B1232J4996L1594O497j219j8617K4790K82P018k6988o2904J1016Q5928K1405
$$ y = [47213, 72257, 72866, 28024, 6294, -1991, -19118, 7561, 1124, 70720, 161048, 183233, 183501, 174446, 143115, 132666, 148883, 83834, 76426, 77044, 103030, 106235, 87321, 63858, 78900, 82529, 121203, 101856, 181639, 200118, 148700, 140608, 113402, 89354, 69477, 116872, 190408, 180012, 185663, 180868, 181077, 171679, 197906, 208523, 164782, 143816, 125736, 54652, 60213, 20938, 37885, 46633, 63308, 94638, 126142, 121364, 99355, 95927, 97527, 72871, 74997, 75536, 90930, 70185, 151218, 182618, 159356, 152507, 119561, 45183, 58322, 112152, 73087, 13634, 12403, 71844, 84502, 74020, 83330, 83347, 103120, 108578, 115198, 108767, 84260, 68795, -11618, 1133, 21232, 36228, 67822, 74319, 73100, 54483, 79273, 79555, 86573, 59585, -3319, 7697, 93625, 115030]
16749A15030Q20m8509l3433O461n007N0346J1477o726k7038O443r648n6271m4109
16736d0164J6593J1348L091L4232J7968n3038l3459J2075N490K7436R129K6925
16724C7626M8178K1444l0638o7819K847l082j044L5806L3226m0426o096K1975
16712E1997l1312j3581N292N3700J2579p1395n148J8532J5545j0714n0033l0323
16700e4861m0039l0951j147m932P4581N9097L7393o403N26N340m8209k3564L5713
16687B544K4053l4015Q505J0769j278j2102l09k2668O313O0970J4151p486k1351
16674B8096j0218r322J4640l3788j9213N7961J1822j3586q8303L9763L4513M0422
16662E2787j9525j2015L3721J4914l5767k7311p679j7596K8770q082N5554N2124
$$ y = [115030, 115850, 67341, 33908, 40369, 35362, 85708, 97185, 90459, 63421, 69864, 60216, 3945, -40164, -23571, -12223, -9132, 25100, 43068, -9970, -43429, -31354, -25864, 1572, 10701, 37626, 85804, 107248, 76610, 8791, 11638, 8556, 7512, 43318, 76544, 36118, 30022, 51997, 20685, 7104, 12396, 66096, 78675, 7280, 2132, 20664, 36209, 25495, -24538, -54861, -94900, -125851, -126998, -131930, -57349, 1748, 39141, 32738, 33264, 38604, -9605, -33169, 2544, 26597, -7418, 1087, 11856, 10578, -1524, -1833, -24501, -18188, 42782, 56933, 49447, 28096, 17878, 8556, 23196, -10592, -29805, 28156, 39978, 26392, -61911, -22148, 12365, 52787, 33262, 21247, 54968, 69882, 34115, 6804, -875, -18471, 10299, 2217, 57771, 109895]
16650A09895m284m4457l1594k5215m5626j2891p543o336P3008K7098j0987j3455
16638G613K9431L1820j0459r7239n7729k4587P3893N6577J1318j9046n496Q730
16626D826j3442K639m7154L902P2832M7410n6116n2922M0429R4019j6176n5448
16614B4799k0488j7780m8457L7790l8304J2243P808n9557J8084J3990p024k4466
16602a01362k2984M2773m3130m9697M1311K1673L2503L6179O6540O9807p7944
16591A5669o2320K3393K3649k239L5195J330l8342K2674J8581l5353R572k6678
16579a4869q94l8729j0969N1146K0498k3065K7308N4258l3572m0312R388R150
16567I338m842r971Q476L7774k2602q996p228m1134n7171K694l002L9610N5238
$$ y = [109895, 105611, 61154, 29560, 4345, -41281, -54172, -61715, -68051, 4957, 32055, 21068, 7613, 37044, 68864, 58405, -38834, -96563, -121150, -47257, 9320, 20638, 1592, -3904, 4826, -8616, -5977, -53131, -49229, 23603, 71013, 14897, -38025, 2404, 96423, 80247, 24799, 4311, -13469, -61926, -24136, -62440, -50197, -42389, -101946, -83862, -69872, -76896, -101362, -124346, -81573, -124703, -174400, -133089, -111416, -78913, -42734, 23806, 93613, 15669, -46651, -23258, 391, -1848, 33347, 34677, -3665, 19009, 37590, 2237, 11809, -14869, -15763, -54492, -65461, -14315, 6183, -16882, 10426, 64684, 31112, -9200, 188, 9338, 4496, -5475, 3001, 40775, 18173, 9177, 1949, -39185, -96356, -93662, -96664, -57054, -1816]
16554a816N0086j9946l9733L1725l3008q467k3628K4284L3250k8880r912l6278
16542f2323J2066J5759k172Q753k0247K991m9517j817R847L7649j020q103j6653
16529g4787Q736K8762l1521l131L9243m657N0155J4114m9823K4621K8601k21j0965
16516A9127J1917j3780m5120n859O6522O1640n7094j107N3506r022o9465m2899
16504c1634j2534k6057N9726L1313n4325J1004L7135K7397K3858J4565m345l0018
16492D6085m075K2670k9071j9224Q879r135N935k5132l8860l4338l4158K0989
16480h9435J9124J2391P0565O3802j8043j8779J5182L5445m3243k397N9242Q1619
16468A85473N9755K8934J07704J34667O9770k0374n5725j05164r1212m8251m0604
$$ y = [-1816, 48270, 28324, -11409, 20316, -12692, -21159, -44787, -20503, 12747, -16133, -26045, -62323, -50257, -34498, -36670, -27917, -48164, -45173, -94690, -96507, -86660, -49011, -50031, -58134, -74787, -66051, -37289, -68810, -71941, -32698, -37355, 12800, 26914, -22909, 1712, 30313, 30092, 19127, 31044, 17264, -27856, -33715, 32807, 94447, 37353, 36246, 89752, 80730, 11265, -31634, -44168, -70225, -10499, 20814, -33511, -22507, 14628, 42025, 65883, 80448, 76103, 46085, 42010, 64680, 35609, 16385, 25264, 16129, 22064, -3068, -41928, -76266, -110424, -89435, -70311, -57920, 12645, 76447, 58404, 39625, 54807, 90252, 47009, 44612, 103854, 185473, 245228, 274162, 381866, 516533, 586303, 565929, 510204, 405040, 313828, 265577, 224973]
16457B24973N0430O5333R4166J22105P4050L8083M967K8324o438L4339l3010q5206
16445F12116j38504r0788r1196q7698P8168P0027L6105K3055L9436K3472j3125
16434D61068l8394q8763q0036n9378m3206q9383l9466L4254N462R641L7869q96
16422A08772r676J2387k5296j2146j9756l8271l7320O661N658P199K4433Q64L3490
16409E6999r799j5240l1512l6371M4460k6924J818N7474l0967k11j9049M1379
16397C2057O220K501N6942j7549k0296N40k4976j7318Q110N905l4762p0074k8983
16384a01683N9372N6192j4786l2258J6734K4202K3982j4844M7736j3507l122k5947
16372B2071p0520o3742j9163L6613M1398J1051j3731L6330j1511p2514j7726k1903
$$ y = [224973, 275403, 340736, 434902, 557007, 631057, 669140, 674107, 702431, 695993, 730332, 697322, 612116, 473612, 382824, 291628, 203930, 282098, 352125, 388230, 411285, 450721, 474193, 461068, 422674, 333911, 253875, 194497, 151291, 61908, 22442, 56696, 62158, 71799, 109668, 108772, 99096, 111483, 86187, 74041, 54285, 16014, -21306, -14645, -8987, -1788, 22645, 23509, 56999, 47200, 31960, 448, -35923, 8537, -18387, -16569, 40905, 9938, 9727, -9322, 32057, 38277, 40778, 97720, 80171, 59875, 60415, 35439, 18121, 26231, 32136, -2626, -72700, -101683, -42311, 13881, -905, -33163, -16429, 7773, 31755, 16911, 64647, 51140, 48018, 22071, -48449, -112191, -131354, -94741, -53343, -42292, -56023, -19693, -31204, -103718, -121444, -143347]
16360a43347k88P3464R921j2060k5271m2731k031J9204M4140l3694L9776Q4711
16348A1794L5380K5236r978l3587L414J1856j2185m2490n0103L4512Q891j6104
16336c3364K3163J8768M1852K3347j1128k1966m425M47J1804o107K3871j259O193
16323G1196j9050k2132m6065k3604K2505l2449j1870l0595K9210k195O4404M8857
16311D8212M4577k2910j9076o8081J545M1697L979N488m760n4304q1737n6366
16299a61736O396l090N674K8033P6578q859j9424L7253P5683N3474k52J423n6029
16286C5124m1655J0569K0930m4035N2m9281j7814j1541K126j5421M736N9839O3403
16273A7032j9508j7100m005J9978j0894J6680K7053n6546o0970K5099L0064Q443
$$ y = [-143347, -143635, -70171, -60250, -72310, -97581, -140312, -142343, -123139, -78999, -112693, -72917, 11794, 47174, 72410, 62432, 28845, 32259, 44115, 31930, -10560, -60663, -26151, -17260, -33364, -10201, 8567, 50419, 73766, 62638, 40672, 36247, 36694, 48498, 42391, 66262, 65003, 71196, 52146, 30014, -16051, -39655, -17150, -49599, -61469, -92064, -62854, -65049, -645, 48212, 92789, 69879, 50803, -17278, -15733, 25964, 29943, 35431, 30671, -23633, -105370, -161736, -155340, -158430, -152756, -124723, -48145, -57004, -76428, -39175, 36508, 89982, 89730, 91153, 35124, -6531, 4038, 24968, -19067, -19015, -68296, -86110, -97651, -95525, -110946, -106210, -46371, 17032, -2476, -19576, -23581, -3603, -14497, 2183, 29236, -27310, -88280, -63181, -33117, -24674]
16261b4674j8661k419m028l9688l0487N5289N7392j8488M977K5694L2858K6154
16249F3919l3058j2261J9448K5108j750N8769l3104p1964o170J214R068r3451
16237g4232n5300l3146K2317Q3207j000J8327L9886J5214L182K7497j1812j3279
16225B0861j2761J207k6386k1736r405K911J0921l5672j0032M1420L8364M8811
16213D8503m3290M8201N3901p4985L2732q397p879L7869l0331p6960j764L9295
16201A6895K2129L359j7228r854K627q196M315R20M596L0861p566l9405j3210
16188i757K2600J9452q103n386m825R820K1426m0306j3668L944q3055o7864m030
16175a59752p87K6274j5070j4779L6768M3169J6534N731k1026n3003m205j708
$$ y = [-24674, -43335, -45754, -49782, -89470, -119957, -64668, -7276, -25764, -20787, 4907, 37765, 63919, 30861, 18600, 38048, 63156, 61406, 120175, 87071, 15107, 8937, 10151, 19219, -74232, -129532, -162678, -140361, -57154, -58154, -39827, 59, 15273, 18455, 45952, 34140, 20861, 8100, 9307, -17079, -38815, -48220, -45309, -34388, -70060, -80092, -38672, -308, 48503, 5213, 53414, 107315, 32330, 65062, 56665, 48786, 86655, 56324, -20636, -22400, 16895, 39024, 42383, 25155, 15301, 17928, 9732, 14047, 14967, 19563, 50424, 42858, 3453, -9757, 12843, 32295, 24192, 18806, 13981, 23801, 45227, 4921, -8747, -4803, -87858, -155722, -159752, -160539, -134265, -149335, -164114, -127346, -84177, -67643, -61912, -82938, -135941, -140146, -141854]
16163a41854R3563M0472l9589n5568p5650L98L2793L3970K2428K4115l3p1995
16151a36950j4488J35303J700q146M1470J2160j8535o6728N6949O088j9231l697
16139a4105l1210J6619J4128O231N7114j7203N3609k0985o0956j4650n9215l7127
16127a07750N2099K1863n4042k7912k218P263N8840R1853P628m8544K6732J6546
16115D2358K276r7417l2987O904J7229K5977k8765N1445O9916j6615K948l0039
16103A3230n5474K1369q576l1725o4803k6496n397j9472L9825M1297M0435m6824
16091a02611m5693K6820Q8488K4839k9485j3397K6481J7349q4174J3686N0914
16080b6783j2342j1008q867p0672l5514L8000P4092Q6340O1323k0803q275n3320
$$ y = [-141854, -48291, -7819, -47408, -102976, -178626, -178228, -145435, -111465, -89037, -64922, -64955, -136950, -151438, -16135, -14435, -22581, 18889, 31049, 12514, -54214, 2735, 8823, -10408, -14105, -45315, -28696, -14568, -8337, 48777, 31574, 85183, 64198, 3242, -11408, -70623, -107750, -55651, -33788, -87830, -115742, -117960, -110697, -51857, 39996, 47624, -920, 25812, 42358, 44634, -52783, -85770, -78866, -61637, -35660, -64425, -12980, 56936, 40321, 43269, 13230, -42244, -20875, -29451, -61176, -125979, -152475, -157872, -177344, -137519, -96222, -55787, -102611, -148304, -121484, -32996, -8157, -37642, -51039, -24558, -7209, -91383, -77697, -26783, -39125, -50133, -59000, -129672, -165186, -127186, -53094, 33246, 94569, 73766, 65491, 12171]
16068A2171m3535l834j5687l77o067j0715P462m893k5695n7714K9053J05179M9746
16055C5094l8669J4927L7326k4852q72M7609Q201n4629j0573k1576k3722J8453
16043a3283K5562m4222m5692M1221N8551K6592l4233m7457p2930K2255j7531j8575
16031a19742M3395Q4997j0249J8364K2826l1554n4008k9547j2165o2457j9202
16020a69342M9679O5454l9424k9824K6906N8929O5437m339m8888l5014K1223J4857
16008b4346l1176l4615j0456K1153j0814M7184j4569M517M1594j0680N868n211
15996b1551K223j0294n4389n3521J6406M7875L8998k3740m1759K6878L7600M1986
15984F712m8546p6014N893K2604K6398Q1820L17o9865l7442l5411J5255O5768
$$ y = [12171, -31364, -35198, -50885, -51262, -57329, -68044, -60582, -65475, -91170, -148884, -119831, -14652, 35094, -3575, 11352, 48678, 23826, 22954, 70563, 78764, 24135, 13562, -8014, -31736, -13283, 12279, -31943, -77635, -36414, 22137, 48729, 14496, -32961, -105891, -83636, -101167, -119742, -76347, 8650, -1599, 16765, 39591, 8037, -45971, -75518, -87683, -150140, -169342, -119663, -54209, -93633, -123457, -96551, -37622, 27815, 23476, -25412, -60426, -39203, -24346, -55522, -90137, -100593, -79440, -90254, -43070, -57639, -53122, -11528, -22208, -16340, -21551, -19328, -29622, -84011, -137532, -121126, -73251, -34253, -57993, -99752, -72874, -35274, 6712, -41834, -117848, -111955, -89351, -62953, 18867, 19184, -50681, -88123, -123534, -108279, -42511]
15972d2511O1829j9525j3165j1061M7169j544Q79J0129l6564n7963l5127J1324
15960h6130k5266j2140j1698Q032M8600L3213L7721k1264m8910J8887j559L7031
15948b3483N2320r511J2004J164J6644k3346j5530k4558J8123L563n266k6385
15936b4261L879j291N6618J1356l7919J9466N5338n1028k5286J2108j0806M3489
15924E1663r385j5703j6373k1813k4135p0249l4534L3023j7545J7282L2102p012
15912h2679n8153J4966K3060J6875j5832n866L7348n7611N66L5644O7795m2599
15900f6486j5620J081m7800l0080M0519M6446k9161K7262N9714K0830J5451r002
15888A3154o8140J9886r847k4988L7615o698j4173k2483M8427N1947O096m1998
$$ y = [-42511, 19318, -207, -13372, -24433, 22736, 21192, 22071, 32200, -4364, -62327, -97454, -86130, -111396, -123536, -135234, -127202, -78602, -45389, -7668, -28932, -77842, -58955, -60514, -23483, 28837, 19326, 31330, 32494, 49138, 25792, 10262, -14296, 3827, 7390, 2124, -24261, -20382, -21673, 34945, 46301, 8382, 27848, 83186, 32158, 6872, 18980, 8174, 51663, 42278, 26575, 10202, -11611, -35746, -105995, -140529, -107506, -125051, -107769, -75667, -82679, -140832, -125866, -102806, -85931, -101763, -107629, -70281, -127892, -127326, -91682, -23887, -66486, -82106, -81025, -128825, -158905, -118386, -71940, -101101, -73839, -14125, 6705, 22156, 13154, -54986, -35100, -44947, -69935, -32320, -39018, -53191, -75674, -27247, 24700, 30796, -11202]
15876a1202N607m6144J17M4740j3640J9965o4884m3339L6700r2879j2290P6793
15864a00456K1134m0113K7024P876R529J706m5702l0002P6013M1432j2065k7728
15852g1352k4997O1511P7000M6202J4078k0650K2832k5921q6899n6808l8534J0705
15840i2833J2225M6940K5890P121m3942k1076P594l663N9373M2340m1979o9094
15828g1104n8166k0613N7553L5134K5807J3806j3978J4361K2705K211k9519k8202
15816e0005k231L3676j2867O101K1934O830L6670R578m9496m7983K4140l595R2485
15803F5237M5259m837n1126n8971j3140k694r190l7865k0055K2379J3904q636
15791e9735L6558q66k4248m269K2999P7710L3970p7782k4632R607N4941J4414
$$ y = [-11202, -5595, -51739, -51622, -6882, -20522, -557, -65441, -108780, -72080, -164959, -177249, -100456, -79322, -119435, -92411, -84535, -75006, -73300, -119002, -149004, -72991, -31559, -43624, -71352, -96349, -34838, 42162, 88364, 102442, 81792, 104624, 78703, -8196, -65004, -103538, -92833, -80608, -33668, -7778, -657, -44599, -65675, -58081, -61744, -2371, 39969, -2010, -71104, -129270, -149883, -92330, -57196, -31389, -17583, -31561, -17200, 5505, 7716, -21803, -50005, -52236, -18560, -31427, -25326, -3392, 3438, 40108, 49686, 190, -47793, -23653, -27248, 65237, 110496, 105659, 54533, -4438, -17578, -20272, -29462, -67327, -87382, -65003, -51099, -59735, -23177, -24043, -48291, -52560, -29561, 48149, 82119, 4337, -20295, -10688, 44253, 58667]
15779E8667J0551j8522J450k7238l0047m680K41l893j8368K7654M1322n1981o2602
15766g7446k2746N5039j0894P4272J9304k4572n1844l648M6224K8141l7028O472
15754A274K6762L6435j5195n8040l8044R750M6434j8886J2770M8607O6487m1082
15742G7272m6775Q396k4587l4459o2852L7214N7812q610J0413j2353l626K0145
15730A7990K3368M0583n4057j2971J1063J0830k8838q9788J582N4832j2257J0482
15718b7181J9866J3876l3497k2193J6611J8623K7603k7870L1878j6799q8643J0312
15706g7414M1163O2717p460o349r737m4538m7930n6291k2093P6525R8994O715
15694A4302J091l3155K510O0673P7555k3909q5702k2146j4799J5010L6674L3498
$$ y = [58667, 69218, 50696, 52146, 24908, -5139, -9819, -9578, -13471, -31839, -4185, 37137, -14844, -77446, -100192, -45153, -56047, 18225, 37529, 12957, -38887, -42535, 3689, 31830, -5198, 1274, 28036, 64471, 49276, -8764, -46808, -37058, 9376, -9510, 3260, 51867, 118354, 77272, 30497, 38893, 14306, -20153, -83005, -45791, 12021, 3411, 13824, 1471, -2155, 17990, 41358, 81941, 27884, 14913, 25976, 36806, 7968, -81820, -80238, -25406, -37663, -27181, -7315, 6561, -26936, -49129, -32518, -13895, 13708, -14162, 17716, 917, -87726, -77414, -36251, 26466, 19006, 12657, 2920, -41618, -89548, -145839, -167932, -91407, 7587, 14302, 15393, -17762, -15252, 45421, 122976, 99067, 13365, -8781, -23580, -8570, 28104, 61602]
15682F1602j1221L5460K3029j01612l6902l0044J1163M0595N1095q481j7653M6258
15670F3289n3105m9468K4238j1501J6041J1840K029n1692k1694R43M6071N4317
15658C1308j01836o8378M0688J3385L4364L8924n4222k5262J6146k1384k8073
15647a24340l292J720q776O2893L4258q003Q408O9970k89L079l9145o0231p8168
15634a41916J342N6264K066N5857K3343O191j846K0244K6131K8106k6806o7925
15622a8949p0166l4410J7598R845L5163N2287L5984j6720Q348j2028k7894p327
15610b8269J3583R829o0729m2035n8592K4237Q5193K2605l4071q417J1613N5586
15598i467P3385K6680p1835j23740m6429L4564L7871J05831j4577l5646q7388
$$ y = [61602, 50381, 85841, 108870, 7258, -29644, -59688, -48525, -7930, 43165, 34684, 17031, 63289, 10184, -39284, -15046, -26547, -10506, 1334, 3363, -48329, -70023, -69080, -23009, 31308, -70528, -138906, -98218, -84833, -50469, -11545, -65767, -91029, -74883, -96267, -124340, -127632, -125912, -134688, -71795, -37537, -45540, -37132, 32838, 32549, 35628, -3517, -63748, -141916, -140574, -84310, -82244, -26387, -3044, 3147, 1301, 21545, 47676, 75782, 48976, -18949, -89115, -123525, -105927, -96082, -60919, -8632, 27352, 10632, 18980, 6952, -20942, -28269, -14686, -4857, -65586, -107621, -166213, -141976, -56783, -34178, -68249, -76666, -65053, -9467, 63918, 90598, 18763, -104977, -151406, -116842, -78971, 26860, 12283, -23363, -110751]
15587a10751j6077K717O3567N8215K1326M4097L581J9098m1916r8557j9817J09658
15575C5141L8135p7157l9502K5192J1527K0530n5540j2505N3599J0960L058j3911
15563d73r5047n3427l2118r472N881J5661P4127O2677M8140L5943k9370k4699
15551b177o2192M8422N6691k6482P604L8339K4550n5142n8431j3208j524L9667
15539c883M3005m2870m246j9473m7935q184K2842K9906l9876l289L0934J2471
15527c0598j9782m1482k4121N5015O3883R8292l286o0169o4572j3689J0754k4152
15515e3907K6357k7975p758J4289n284j9432M4168J7524j2390K5647N9807k8697
15503C2349K614o0617k2533K7870l4801l8213L69O9459Q6694K6805m5013n3533
$$ y = [-110751, -126828, -124111, -60544, -2329, 18997, 63094, 66675, 85773, 43857, -54700, -74517, 35141, 73276, -3881, -43383, -18191, -6664, 13866, -41674, -54179, -580, 10380, 13438, -473, -95520, -148947, -181065, -190537, -184656, -168995, -94868, -32191, 15949, 51892, 22522, -2177, -64369, -15947, 40744, 14262, 21866, 60205, 84755, 29613, -28818, -42026, -43550, -3883, 39122, -3748, -7994, -27467, -75402, -83586, -60744, -30838, -70714, -74003, -43069, -30598, -50380, -91862, -115983, -60968, 2915, 101207, 97921, 37752, -26820, -40509, -29755, -53907, -27550, -55525, -63283, -48994, -54278, -73710, -29542, -12018, -24408, 1239, 61046, 32349, 34963, -25654, -48187, -20317, -55118, -93331, -92962, -23503, 63191, 89996, 44983, -8550]
15491h550R17N8516l8569o8474N938P7828K2210l5021M6447J347L1953n0155n2492
15478h105J7436r638J4429M0195o3359l8106J6610M6301N0606k1147l1009N4974
15466F9187J3608k9826K750l1653K114j9923l1406N1582k3500N6770N8321o5748
15454E2276j7890m5747n5059M7003K1851r861n8461K848K2823N6579J218J6305
15442C3885L9468l3130j12134j5042K8556K3892M8355M2008J6706O0911n450o576
15430A21449j8736k7106n7674m0320O2439L7606l5933K3448R738k1863k2423K1838
15418E2463m1303j28929n2400N3333L4138r008m2603J3719K9146k2420P179k2194
15406a28879J2215M861K929L1294j2364n93O1585p889R876P833j1915N5743q725
$$ y = [-8550, -7633, 50883, 12314, -56160, -50222, 27606, 49816, 14795, 61242, 62589, 94542, 44387, -8105, 9331, -307, 14122, 54317, -9042, -47148, -30538, 15763, 66369, 45222, 14213, 69187, 82795, 52969, 55719, 24066, 26180, 6257, -25149, 26433, 2933, 59703, 118024, 52276, 34386, -11361, -66420, -19417, 2434, -7427, -65888, -63040, -40217, 16362, 17580, 33885, 73353, 40223, -71911, -86953, -58397, -34505, 13850, 55858, 72564, 133475, 128025, 121449, 102713, 75607, 17933, -22387, 40052, 77658, 41725, 65173, 74911, 53048, 30625, 52463, 11160, -117769, -170169, -116836, -82698, -91706, -134309, -120590, -91444, -113864, -106685, -128879, -116664, -111803, -108874, -77580, -89944, -90537, -28952, -36841, -26965, -19132, -31047, 24696, 15971]
15393A5971k0738K3450m7604J4467k5172m144P5146J743K5747l2756J0653m4691
15381g928m6479K6558L6897L9474J9461m5992k1639j3689J1750R843K0603k2436
15369F423l1602p9449l2208R289M3267L3365L0425n0248k6206L0389J182J5111
15357e0262j295m8769K4219k0622Q383P764k1567K8324k6331m6677j1352P0292
15345h7893K5180k93J836K0943j0386j8570o0928l7157k3968M8275L6154J1050
15333i5757O0097J3804l4578l927M6858R219m1711j0742m748j3638m3337M3267
15321g5193L6483K639N7044M7714J4421p7143p1779N655L8858K0144L4852n0198
15309a6503k6584p684J7475k2254r001R644l5136k2096J8113J5450K917M2775
$$ y = [15971, -4767, 18683, -28921, -14454, -39626, -43770, 31376, 33119, 58866, 26110, 36763, -7928, -54407, -27849, 9048, 48522, 67983, 21991, 352, -13337, -1587, 8256, 28859, 6423, -25179, -104628, -136836, -127547, -84280, -50915, -20490, -70738, -96944, -66555, -65373, -50262, -51557, -100326, -76107, -96729, -88346, -80582, -102149, -73825, -100156, -146833, -158185, -87893, -62713, -63006, -61170, -40227, -50613, -69183, -130111, -167268, -191236, -142961, -106807, -95757, -35660, -21856, -56434, -60361, -13503, -4284, -45995, -56737, -61485, -75123, -118460, -75193, -38710, -36071, 20973, 68687, 83108, 5965, -65814, -60159, -21301, -1157, 33695, -16503, -43087, -50771, -33296, -55550, -64551, -54907, -90043, -112139, -94026, -78576, -75659, -32884]
15297c2884K4058K0967M0359l6653j10559j7537N717k2370M277M6653M4416P6197
15285D2641N6806K4418o1883p3372n5935L3540P3806K2897N9287K0184r8875K9163
15273G2677j2308m5776J0726j7558k82j3185o1147k1110j9735M3393J00084K1740
15261E7519l2526M7269k480n2152l9236J552j7989q188N7002k4669m0803j6360
15249g1061K9636M3822k0534Q539J9797l5397p679M4426j5361J0949M6867J8620
15237G2624k2532M3146o6141n5212m2790N4449K9687k0195k2490J4186K3630P5424
15225H3786o6896k8192j3488M0745j5902l679L0854M1776J8283l2690K161Q042
15213F4800r2598M3550J331P781l8094j1277O031J346m3091K8882L2214O1682
$$ y = [-32884, -8826, 12141, 52500, 15847, -94712, -112249, -106532, -128902, -124625, -77972, -33556, 42641, 99447, 123865, 61982, -11390, -67325, -33785, 40021, 62918, 122205, 142389, 43514, 72677, 60369, 14593, 25319, 7761, 7479, -5706, -66853, -87963, -107698, -64305, 35779, 57519, 24993, 72262, 69782, 17630, -21606, -20054, -38043, -46231, 10771, -13898, -54701, -71061, -41425, 2397, -18137, -9598, 10199, -25198, -32877, 11549, -3812, 7137, 54004, 72624, 50092, 93238, 27097, -28115, -70905, -16456, 13231, -6964, -29454, -15268, 8362, 83786, 16890, -11302, -24790, 15955, 53, -3626, 27228, 69004, 87287, 54597, 56758, 64800, -27798, 15752, 17083, 24864, -13230, -24507, -18476, -17130, -60221, -31339, 875, 62557]
15201F2557p031l6243l8801j5242J5430O565Q15p867J8245k3110j0427N6670l3304
15188a1743p8025J0607K4245m7134K7273K6494M3097Q0268k5925l5574j7516k3848
15176b7781N007K7562o950l6472k647k2142j4715j9536M286M8156j0157j1228
15164f6617N9706L1769o7370P489J3254k5253l6768l4370J9820k7379o0646K974
15152a83391L8134P2239L1470j151l8530O2525J8397l876k0117L225K4645k2913
15140a9343k9654l6514K9382j1172l234j5204L8741M8801j5729l3758Q752l279
15128d2211J2781l4141j1927O1815K961L7202K2806j8124n8243l9661q146j7313
15116i2201L6842P5746O6553o9078p6259K2652N5648O0048k4987j7658K6222n2626
$$ y = [62557, 55526, 19283, -19518, -34760, -19330, -12765, -11950, -19817, -1572, -24682, -35109, 21561, -11743, -89768, -79161, -54916, -102050, -74777, -48283, -5186, 75082, 49157, 13583, -3933, -27781, -22774, 4788, -2162, -38634, -41281, -63423, -78138, -97674, -93388, -45232, -55389, -66617, -6911, 24858, -42512, -35023, -21769, -47022, -83790, -118160, -98340, -125719, -186365, -183391, -145257, -73018, -41548, -42699, -81229, -18704, -307, -4183, -24300, -21075, 3570, -19343, -48997, -85511, -56129, -67301, -70535, -85739, -46998, 1803, -13926, -47684, -38932, -42211, -29430, -63571, -75498, -13683, -10722, 26480, 49286, 31162, -27081, -66742, -74888, -92201, -55359, 20387, 86940, 17862, -58397, -35745, 19903, 79951, 54964, 37306, 63528, 10902]
15104A0902l3473l613L3724m525k8656j5799J7902M9903K1601M11j3694k3073
15092A1610m5293J2374P5191l9802P101K6269K4685l3450n6783o0415l138o4997
15080a46648M1366M526O1818M6488j8535K2786j2618n9934J2224R667m93l961
15068d3314l1510K4707J3022k2517J6460o9117J3241J7525J4736j476m9346m6547
15056a64136N0538K2534M8335R777K4719j0573K0695K0105J0642K4690l628m5781
15044G917l3662m5881M1734M3935M093o884k4572O0554K9753k9249j3827j4331
15032A9580N166r639L0673K755m5444m4344K2447K8831o881m229k2385J4248N6596
15019D7374M8436L2460o7158r8919o0721o633L3309M7585K5458K2881l2663M5732
$$ y = [10902, -22571, -26184, 7540, 3015, -25641, -41440, -23538, 26365, 47966, 48377, 34683, 11610, -33683, -21309, 53882, 14080, 21181, 47450, 72135, 38685, -18098, -78513, -81651, -146648, -105282, -100756, -38938, 7550, -10985, 11801, -817, -60751, -48527, -38860, -39353, -43314, -74824, -50117, -37095, -59612, -43152, -112269, -99028, -81503, -66767, -68243, -117589, -164136, -113598, -91064, -42729, -32952, -8233, -18806, 1889, 21994, 32636, 57326, 53698, 7917, -25745, -71626, -29892, 14043, 18136, 11252, -13320, 47234, 76987, 47738, 33911, 19580, 24746, 15107, 45780, 48535, 3091, -41253, -18806, 10025, 3144, -1085, -23470, -9222, 47374, 95810, 128270, 61112, -37807, -98528, -105161, -71852, -24267, 1191, 24072, -8591, 37141]
15007C7141K1621M227m3323k9254j1273l0343J9727K0844k4337l7349J2080k122
14995f2361N881j1596M0144L8439m6014O424M0316M2075j1889k5397r824j9034
14983a2836l0692r542L0417K9389k3075M3742K4143m2424J1351Q517K4042m5485
14971G547l9239n439J4780L2052n540m9395l2588M3228L7651l1163N2742K7693
14959E2329m0887k3250n561k5806P1585L8616l2428k1295L3208j6430n2749m0120
14947f2788P719J0190N307K1017J1168P310o429k5697n26Q486O671J7843J498
14934A769M9392J4811q652o9546K7890l7006n143N9681L0123o8663o1099N4971
14922a1472M4235p465m4715K5781m450L2897j5783p8352K725l28J2517J6019J7150
$$ y = [37141, 58762, 62989, 19666, -9588, -20861, -51204, -31477, -10633, -34970, -72319, -60239, -62361, -56480, -68076, -27932, 10507, -35507, -29083, 11233, 53308, 41419, 16022, 6198, -12836, -43528, -53070, -22653, 6736, -16339, 27403, 51546, 9122, 20473, 28990, 53032, 7547, -31692, -37131, -22351, 9701, 4161, -45234, -77822, -34594, 3057, -28106, 24636, 52329, 11442, -11808, -17369, -43175, 28410, 67026, 34598, 13303, 46511, 30081, -22668, -62788, -55069, -44879, -39572, -18555, -7387, -77, -6506, -32203, -32729, -24243, -17572, 271, 1769, 51161, 65972, 57320, -12226, 15664, -21342, -26485, 33196, 63319, -5344, -66443, -11472, 32763, 25298, -19417, 6364, 1914, 34811, 19028, -59324, -56599, -56927, -44410, -28391, -11241]
14909a1241j9460J3663k1269M0470P0798N835k7812K4322k3662l8327J5882n428
14897B3771n1360j4135O380K8358n6584l3557M6997O0348L4999K2441k8731l8782
14885A45l5601M4858M8178n0807k4449L1760J1731J9989j3097k5651j6865j9724
14873b9533l721j8917J832k6288r911l9890m8454K0500P9787k689k6074K7410
14861g5948O707J174n4358K6752Q0691J4292l00O8204l86q1384l1810p0986l2402
14848a49754J9086R7810P3085Q486p489o2693j2398J5886q406N625J3166p3967
14836h1563l4817L3918K6810j8532r918l290J2012k3428M70J665L9680L1705J231
14823b4057m1457J4196K6598k8766n5418L745Q6000M8211K4291J1120l136L2346
$$ y = [-11241, -30701, -17038, -38307, 2163, 72961, 78796, 50984, 75306, 51644, 13317, 29199, 23771, -27589, -41724, -35344, -6986, -63570, -97127, -50130, 10218, 45217, 67658, 38927, 145, -35456, 9402, 57580, 6773, -17676, 14084, 25815, 45804, 32707, 7056, -9809, -29533, -33254, -52171, -50339, -76627, -86538, -126428, -174882, -154382, -74595, -77284, -103358, -75948, -69241, -68067, -122425, -95673, -14982, -690, -990, 67214, 66828, -14556, -46366, -117352, -149754, -130668, -32858, 40227, 48713, 41224, -21469, -33867, -17981, -26387, -20762, -7596, -81563, -116380, -82462, -55652, -74184, -84102, -87392, -75380, -98808, -98338, -96673, -56993, -25288, -24057, -65514, -51318, -24720, -53486, -108904, -105159, -19159, 29052, 53343, 64463, 61327, 93673]
14811I3673n4143n5792p8938K7231j627M4026L2675k3581O075K0516M9082L3469
14799I2666N6995k0745o4591l1338N2922K4354k4622j3190k6166k1753J6005K555
14787D3092L498m1767j30745K998Q5984O3152K7184k7822l3053m334L749r505
14775a7569l7811K2348L1240n3946m20k0334L6278Q0937k7202m6345K1648O2501
14763E1325M671n4433m4476o837L5567M7537J4534m0824r6842k8520O3126M5934
14751i238p8215j00158R4034P3508j2707l144M0321L714R877k2259m6958j2585
14739f3810L3737j770l7356J0058N4150L479K105k146P2796P846k1962Q670o7805
14726b008r093J2316j2200j0332J0851r383J2961P2587R940m748n9503m2789j3270
$$ y = [93673, 39530, -16262, -95200, -67969, -69596, -25570, 7105, -16476, -10401, 10115, 59197, 92666, 149661, 128916, 64325, 32987, 85909, 110263, 85641, 72451, 46285, 24532, 40537, 43092, 46590, 4823, -125922, -122924, -36940, 26212, 53396, 25574, -7479, -11813, -8064, -17569, -55380, -33032, -1792, -55738, -56158, -76492, -40214, 40723, 13521, -32824, -11176, 51325, 55996, 1563, -42913, -49750, -14183, 33354, 47888, 7064, -89778, -118298, -55172, -9238, -87453, -187611, -93577, -20069, -32776, -35920, 4401, 8115, 17992, -4267, -51225, -63810, -30073, -31843, -69199, -59141, -4991, -1512, 593, -1553, 71243, 79089, 57127, 65797, -2008, -11101, 1215, -10985, -21317, -10466, -19849, -6888, 65699, 75639, 70891, 11388, -31401, -44671]
14713d4671p016M2086P074l4480k0100K9059M1589M673j4210M125J9331k38l0537
14700c315j8336M2109K788l0594k8993p9159k5134M9690P9651K1792l2357k2202
14688d4060k9786O9521R629J0112j3911j2342l1404L0397o275k8412k852N302
14676d4081J1466n355n0359J8177L2710l02j5137K4609k2367N9287k3011l443
14664a7806N0037r505j3811J1995J0878J6970K9604O546n8972K9843K3193L2750
14652A11722m3875j00751J2955j1314m1353K1262K8252J6109O238J098L1746M7583
14640G9672j4212l4700k0673J1336N2456L7824J4162p2886p3075K9953r420J9771
14628B0208j783n060k0359l7759k35P7237J4797p4255J9532N2085R354O3605R661
$$ y = [-44671, -51687, -9601, -2527, -37007, -57107, -28048, 13541, 18214, 4004, 8129, 27460, 27222, -3315, -21651, 20458, 23246, -7348, -36341, -115500, -140634, -90944, -11293, 10499, -21858, -44060, -73846, -4325, 5304, 15416, 1505, -10837, -42241, -11844, -18119, -46531, -49383, -44081, -32615, -37970, -88329, -70152, -37442, -37744, -52881, -28272, -50639, 8648, -14363, -17806, 32231, 22726, 8915, 20910, 31788, 48758, 78362, 84908, 25936, 55779, 78972, 111722, 67847, -32904, -19949, -31263, -72616, -51354, -23102, -6993, -755, 343, 32089, 79672, 65460, 30760, 10087, 21423, 73879, 111703, 125865, 52979, -20096, 9857, 437, 20208, 18425, 13365, -6994, -44753, -44988, 32249, 47046, -27209, -7677, 44408, 53762, 117367, 127028]
14615A27028j10186m3515j5419J6084m4320L0458M0909J1462o027J5522k3849
14604a853m5696k1518J3735K6457N8775O0082j3492o4910l0605J1570k7467N680
14592b9242M7739J3673k2513m2052N9963P2438p2974p5714J5787J6043L3143j1754
14580D537m6089J4431j9312K5069m4210j961L7713j8935k8482k4336k034Q6558
14568a7051J2196L4234M6244j2409j0410j224J0633r18o985n9379l5172M1379
14556A138N9949M4653j8205l1439L4282j7497l4358l2861p279O3291Q484l9407
14544C0751n7495o886k9192J1460J5596K9393J2965M567R177Q7890J3673m4915
14532G6984k1197n996L026J7025n4311k1429q679M6193K5272o598M7089m301l9622
$$ y = [127028, 16842, -26673, -42092, -26008, -70328, -39870, 1039, 12501, 6474, 21996, -1853, -47549, -69067, -55332, -28875, 29900, 89982, 76490, 11580, -19025, -7455, -34922, -29242, 18497, 32170, 9657, -32395, 27568, 100006, 27032, -48682, -32895, -16852, 16291, 4537, -41552, -27121, -46433, -21364, -65574, -67535, -29822, -48757, -77239, -101575, -103609, -17051, -4855, 29379, 75623, 63214, 52804, 51580, 62213, 61295, 54310, -5069, -40241, 1138, 61087, 105740, 87535, 56096, 90378, 72881, 38523, 5662, -1617, 61674, 70158, 30751, -26744, -33630, -62822, -51362, -35766, -6373, 6592, 11159, 20336, 108226, 121899, 76984, 55787, 49791, 52817, 69842, 15531, -5898, -14577, 31616, 56888, 50290, 97379, 93078, 53456]
14519E3456n5476n5213q74J1150K1247M6339J8672K1677l564P134j319O378O326
14506G5933n9327n9291L452L1119l4296n6695L4756L4361K0157J8146J7480o150
14494A9645K4960k8173q4426n2440j5486K330n935P0932O0770K1130J4593l526
14482B4374k6956L9330m8602o8734M7903K2610n2989O2579O3919k8921l0283p1034
14470f6804J0851K3134l7279j0004j201L4617L8578J9131m2071j2666N6516J8189
14458C0991m3390n931J4350M9963J1281l7516k0014l5507L3558N3073O055l995
14446E2918j5920j8471M3471j7229J9534K8854j8486j1205m2260K4851o937j5897
14434B3223P67K7585K2432n7057o8127j0453K3511m5624J2807Q1145K3280j7803
$$ y = [53456, -2020, -57233, -58107, -46957, -25710, 20629, 39301, 60978, 57414, 64548, 63229, 69607, 75933, 16606, -42685, -39233, -8114, -42410, -99105, -64349, -29988, -9831, 8315, 25795, 19645, 44605, 16432, -67994, -120434, -135920, -133590, -139525, -68593, -7823, 13307, 27900, 24374, -2582, 36748, -11854, -80588, -32685, -10075, -63064, -485, 63434, 34513, 4230, -66804, -55953, -32819, -70098, -80102, -81303, -46686, -8108, 11023, -31048, -43714, 12802, 30991, -12399, -18330, -3980, 45983, 57264, 19748, -266, -35773, -2215, 50858, 56913, 52918, 36998, 18527, 61998, 44769, 64303, 93157, 74671, 63466, 21206, 46057, 39120, 23223, 23990, 51575, 74007, 16950, -51177, -61630, -38119, -83743, -70936, 10209, 33489, 15686]
14422A5686K1901J1205r717j8564k7430k3772l9066L9373P8251L3670j9360j763
14410F0414L5882n2033r109k1021m5728R845R664L1636m0656J6866k9655j0589
14398d4484j9509K8834N886m2463k8583J3432l914n4607K6568K9702l8120Q691
14386a18567O0026J1603P2601l5638p3939j3476M4307k2345l2571J1295J4087
14375h2617M6540J6649L2587N203j7784R29m1037m2572n8043j5940n087j2599
14363a73771K4632N5038N7816k9663K995O1689Q6333j2535k2615j1405j2928k0087
14351E499r9257n4397L6609J0602O1626l2408j2144L9094L7301M8669j36567o6187
14339a61560R6945J9707K1161K7785k736R969o874K2056J1062j0208n3462j0750
$$ y = [15686, 37587, 48792, 39075, 20511, -6919, -30691, -69757, -30384, 47867, 81537, 62177, 60414, 96296, 44263, 35154, 14133, -31595, -21750, -12086, 19550, -21106, -4240, -33895, -44484, -63993, -35159, -29273, -71736, -100319, -86887, -90801, -145408, -118840, -89138, -127258, -118567, -58541, -46938, 25663, -9975, -83914, -97390, -53083, -75428, -107999, -96704, -82617, -36077, -19428, 13159, 18362, 578, 1507, -39530, -82102, -140145, -156085, -161172, -173771, -149139, -94101, -36285, -65948, -62953, -1264, 85069, 72534, 49919, 38514, 25586, 5499, -93758, -148155, -111546, -100944, -39318, -71726, -83870, -44776, -7475, 41194, -95373, -161560, -64615, -44908, -23747, 4038, 1302, 11271, 4397, 26453, 37515, 27307, -26155, -36905]
14327c6905J2184p3590r047M5983J1621J4754K1407J4283k3202l4084l29j2410
14315f9335l9869k4810K3760N7303L4825m1390K0764R210O7747K4750n9845l7118
14303c4008j817j7416j2489J6472L6148K5145J5084J4262j4119J6313K9710L442
14291G6727k8762j6374l234k4857j9224O4817m53n4340m3718O1957L5078k6301
14279B1316J9353R959J6952j3636o845m4726l0808M05J3742K8408k6994k9906
14267d2780m4562J5365P859J2961P8368L7308l9204o0462m1994l1575N4657M1969
14255a2090N079j4510k7788J09936J2163l2399q242Q813K0668j23678j01219k0488
14243a83755M7000L4340L1469J806O2351P3285l2540J6345j227k3047j5886n2631
$$ y = [-36905, -24721, -98311, -107358, -61375, -49754, -35000, -13593, 690, -22512, -56596, -56925, -69335, -109204, -134014, -110254, -52951, -18126, -59516, -38752, -29542, 38205, 62955, 3110, -34008, -35825, -53241, -65730, -49258, -13110, 12035, 27119, 41381, 27262, 43575, 73285, 76727, 47965, 31591, 28357, 3500, -15724, 49093, 48640, -5700, -49418, 12539, 47617, 21316, 40669, 50628, 67580, 53944, 47099, 2373, -28435, -28030, -14288, 14120, -12874, -42780, -87342, -71977, -64118, -51157, 27211, 64519, 25315, -35147, -77141, -108716, -54059, -12090, -7011, -21521, -49309, 60627, 72790, 40391, 32149, 40962, 61630, -62048, -163267, -183755, -136755, -102415, -70946, -69140, -6789, 66496, 33956, 50301, 49074, 26027, 10141, -42490]
14231d2490n4729L4285k0776o7723O1165O5744L1939n3250j3896K6855q889L9084
14219b681M0139j0659k8954n1069M5270n8092l8165M7178J2073K5011j5308O7804
14207C2547J4457o7387q161k8978O1210L358M0246L8611M733o92l0401m7094k4416
14194a1967l3787l7531J5266o5041k4177M5485R4015O4579J9093o3129k2065R3224
14182G3965K5356j0431Q520n8526k3017P777M009j4247j0172k5199l5374m3691
14170a01030l8576K0685J06211J2079J0452L1742J1613n7345m5544J2957J0972
14159b5784N9614R7167k9637k2925r682o4220j1345K1919j1251j5630l5212j7037
14147f4023l0210k5371L8421M5259L1923J7443l3904L3495J0893J0340J3876N3474
$$ y = [-42490, -97219, -62934, -83710, -151433, -90268, -24524, 7415, -45835, -59731, -32876, -41765, -2681, 37458, 26799, -2155, -53224, -7954, -66046, -104211, -57033, -44960, -19949, -35257, 32547, 47004, -20383, -28544, -57522, 3688, 7046, 47292, 85903, 90636, 89944, 59543, 12449, -11967, -45754, -83285, -68019, -133060, -157237, -111752, -17737, 46842, 65935, 2806, -19259, 73965, 99321, 88890, 97410, 38884, 15867, 23644, 27653, 13406, 3234, -21965, -57339, -101030, -139606, -118921, -12710, -631, 9821, 41563, 53176, -4169, -49713, -36756, -25784, 33830, 130997, 101360, 78435, 68753, 4533, -6812, 15107, 3856, -11774, -46986, -64023, -94233, -119604, -81183, -35924, -4001, 13442, -20462, 13033, 23926, 34266, 48142, 101616]
14135A01616k0363j09844n2688k6798k9201J6799N3404J4632M2908L1225J4596
14124C6286k2616Q4043k8494m4761l9699P2165L1408N600l5346P105k0568n4800
14112i677N5554K4562K507m8438r396o511m55l2020J6724l0813J7011P3533m2605
14099I976r1535m4589N0891J16529O2787m9831o5422J882o7955L1832N4858J597
14087A1020l6316k2170L169J3433R0385j9074k1109M433m0835m4411M3366L2042
14075A3933k2442j0809q608j7803l1219j1033L6995N7272L758k2346J0611M0936
14063C9245O841k6526m6792p0997j7891Q9437k9039L6032L6346n125Q50M4419
14051E6800K6317K6808K501m6791o1120l1856L4869j9775n4438k3729L1171K6454
$$ y = [101616, 81253, -28591, -81279, -108077, -137278, -120479, -67075, -52443, -9535, 21690, 36286, 13670, 97713, 69219, 24458, -15241, 56924, 88332, 93932, 58586, 65691, 45123, -9677, 45877, 70439, 72946, 24508, 15112, 8601, 8146, -23874, -7150, -37963, -20952, 52581, 9976, -81559, -126148, -75257, 41272, 104059, 54228, -11194, -9312, -77267, -45435, 9423, 11020, -25296, -47466, -44297, -30864, 59521, 40447, 19338, 23771, -17064, -61475, -18109, 13933, -8509, -19318, -27926, -45729, -76948, -87981, -50986, 6286, 10044, -12302, -1691, 39245, 46086, 19560, -27232, -98229, -116120, -26683, -55722, -19690, 16656, 11531, 12381, 56800, 83117, 109925, 112426, 65635, 4515, -27341, 7528, -12247, -66685, -90414, -59243, -32789]
14039c2789m9206N1407j161K5463N833m4998Q810M1354L9888J4873l0532M4301
14027G3243J885k8919o8349l5841k9302J7478m844J9285j1484r039K62J7817m5963
14014a03771J2945J1642L042P6540m998M8754j5541k83k9519l3447n201k5684
14002f5521R387k6012J8425N7273J7481k1823N6147J3611j5098o5757m6023Q313
13990e9597J4166l4392J2516N9748J5801J347k4498n2832l5179k6925p024j2046
13978a48915P4888K1631K1045N6009O270o5244k731R829M760O1200M6133j3011
13966G1864k6091j9396n1263O830N2345J0828n1018J3734K5962l7175k1199k305
$$ y = [-32789, -81995, -30588, -31749, -6286, -453, -45451, -36641, 4713, 44601, 59474, 28942, 73243, 75128, 46209, -22140, -57981, -87283, -69805, -74649, -55364, -66848, -75887, -75625, -57808, -103771, -90826, -79184, -76142, 398, -4600, 44154, 28613, 28330, -1189, -34636, -39837, -65521, -56134, -82146, -63721, -6448, 11033, -10790, 45357, 58968, 43870, -21887, -67910, -59597, -45431, -79823, -67307, -7559, 8242, 9589, -14909, -67741, -102920, -129845, -136869, -148915, -74027, -52396, -31351, 24658, 30928, -34316, -37047, -27218, -22458, 38742, 84875, 71864, 45773, 26377, -24886, -18056, 34289, 45117, -5901, 7833, 33795, -3380, -24579, -26884]
$$ [...]
##END NTUPLES=NMR SPECTRUM
##END=
