##TITLE=Analysis number 319122
Compound Code cc 18504
Project Code adrs
Chemist Name fudan
##JCAMPDX= 6.0         $$ Bruker NMR JCAMP-DX V2.0
##DATA TYPE= NMR SPECTRUM
##DATA CLASS= NTUPLES
##ORIGIN= Bruker BioSpin GmbH
##OWNER= nmr
$$ XWIN-NMR		Version 3.5
$$ Wed May  3 10:21:22 2006 GMT Daylight Time (UT+1h)  MAYBRIDGE\nmr@NMR_250MHZ
##.OBSERVE FREQUENCY= 250.131544655141
##.OBSERVE NUCLEUS= ^1H
##.ACQUISITION MODE= SIMULTANEOUS (DQD)
##.ACQUISITION SCHEME= undefined
##.AVERAGES= 16
##.DIGITISER RES= 18
##SPECTROMETER/DATA SYSTEM= dpx250
##.PULSE SEQUENCE= zg30
##.SOLVENT NAME= CDCl3
##.SHIFT REFERENCE= (INTERNAL, CDCl3, 0, 16.522)
##AUDIT TRAIL= $$ (NUMBER, WHEN, WHO, WHERE, WHAT)
$$ ##TITLE= Audit trail, XWIN-NMR		Version 3.5
$$ ##JCAMPDX= 5.01
$$ ##ORIGIN= Bruker BioSpin GmbH
$$ ##OWNER= nmr
$$ C:\u/data/dgb/nmr/ADRS/3560/pdata/1/auditp.txt
$$ ##AUDIT TRAIL=  $$ (NUMBER, WHEN, WHO, WHERE, WHAT)
(   1,<2006-05-03 10:20:51.92 +100>,<MAYBRIDGE\nmr>,<NMR_250MHZ>,
      <created by zg, POWCHK disabled, PULCHK disabled
       configuration hash MD5:
       84 BC 41 DB A1 6E 1D 46 DA 25 12 A5 C1 ED C5 3A
       data hash MD5: 64K
       5D 9E A1 38 01 26 EE 31 36 EB F7 68 85 E6 F8 40>)
(   2,<2006-05-03 10:21:05.79 +100>,<MAYBRIDGE\nmr>,<NMR_250MHZ>,
      <Start of raw data processing
       ef LB = 0.3 FT_mod = 6 PKNL = 1 SI = 32K 
       data hash MD5: 32K
       37 9C 94 66 57 7D 61 8B EC 6A 0C D7 1B C8 8C AC>)
(   3,<2006-05-03 10:21:07.31 +100>,<MAYBRIDGE\nmr>,<NMR_250MHZ>,
      <apk 
       data hash MD5: 32K
       3A 4A AC 98 CC 67 CA 07 A1 9D 1D 96 50 55 0D 69>)
(   4,<2006-05-03 10:21:08.18 +100>,<MAYBRIDGE\nmr>,<NMR_250MHZ>,
      <abs ABSG = 5 
       data hash MD5: 32K
       1D 45 F1 47 1A A1 B4 BF D6 3C 3A DF 7D 29 91 C4>)
$$ ##END=
$$ 
$$ hash MD5
$$ D7 5A 82 17 34 8E E6 0A 9F AE 43 40 6E AC FF 30
##$RELAX= 
##$RELAX= 
##$RELAX= 
##$RELAX= 
##$RELAX= 
##$RELAX= 
##$RELAX= 
$$ Bruker specific parameters
$$ --------------------------
##$DU= <C:\u>
##$EXPNO= 3560
##$NAME= <ADRS>
##$PROCNO= 1
##$TYPE= <nmr>
##$USER= <dgb>
##$AMP= (0..31)
100 100 100 100 100 100 100 100 100 100 100 100 100 100 100 100 100 100 
100 100 100 100 100 100 100 100 100 100 100 100 100 100 
##$AQSEQ= 0
##$AQ_mod= 3
##$AUNM= <au_zg>
##$AUTOPOS= <8 >
##$BF1= 250.13
##$BF2= 250.13
##$BF3= 250.13
##$BF4= 250.13
##$BF5= 500.13
##$BF6= 500.13
##$BF7= 500.13
##$BF8= 500.13
##$BYTORDA= 1
##$CFDGTYP= 0
##$CFRGTYP= 5
##$CHEMSTR= <none>
##$CNST= (0..31)
1 1 145 1 1 1 1 1 1 1 1 1 1 1 1 1 1 1 1 1 1 1 1 1 1 1 1 1 1 1 1 1 
##$CPDPRG= <>
##$CPDPRG1= <>
##$CPDPRG2= <>
##$CPDPRG3= <>
##$CPDPRG4= <mlev>
##$CPDPRG5= <mlev>
##$CPDPRG6= <mlev>
##$CPDPRG7= <mlev>
##$CPDPRG8= <mlev>
##$CPDPRGB= <>
##$CPDPRGT= <>
##$D= (0..31)
0 1 0 0 0 0 0 0 0 0.06 0 0 0 0 0 0 0.0002 0 0 0 0 0 0 0 0 0 0 0 0 0 0 
0 
##$DATE= 1146648050
##$DBL= (0..7)
120 120 120 120 120 120 120 120 
##$DBP= (0..7)
150 150 150 150 150 150 150 150 
##$DBP07= 0
##$DBPNAM0= <>
##$DBPNAM1= <>
##$DBPNAM2= <>
##$DBPNAM3= <>
$$ [...]
##$SUBNAM7= <"">
##$SUBNAM8= <"">
##$SUBNAM9= <"">
##$SW= 20.6930455092707
##$SWIBOX= (0..15)
0 0 3 0 0 0 0 0 0 0 0 0 0 0 0 0 
##$SW_h= 5175.983436853
##$TD= 65536
##$TD0= 1
##$TE= 294.16
##$TE2= 300
##$TE3= 300
##$TEG= 300
##$TL= (0..7)
0 120 120 120 120 120 120 120 
##$TP= (0..7)
150 150 150 150 150 150 150 150 
##$TP07= 0
##$TPNAME0= <>
##$TPNAME1= <>
##$TPNAME2= <>
##$TPNAME3= <>
##$TPNAME4= <>
##$TPNAME5= <>
##$TPNAME6= <>
##$TPNAME7= <>
##$TPOAL= (0..7)
0.5 0.5 0.5 0.5 0.5 0.5 0.5 0.5 
##$TPOFFS= (0..7)
0 0 0 0 0 0 0 0 
##$TUNHIN= 0
##$TUNHOUT= 0
##$TUNXOUT= 0
##$USERA1= <user>
##$USERA2= <user>
##$USERA3= <user>
##$USERA4= <user>
##$USERA5= <user>
##$V9= 5
##$VALIST= <valist>
##$VCLIST= <CCCCCCCCCCCCCCC>
##$VD= 0
##$VDLIST= <DDDDDDDDDDDDDDD>
##$VPLIST= <PPPPPPPPPPPPPPP>
##$VTLIST= <TTTTTTTTTTTTTTT>
##$WBST= 1024
##$WBSW= 4
##$XGAIN= (0..3)
0 0 0 0 
##$XL= 0
##$YL= 0
##$YMAX_a= 284633
##$YMIN_a= -332961
##$ZGOPTNS= <>
##$ZL1= 120
##$ZL2= 120
##$ZL3= 120
##$ZL4= 120
##$ABSF1= 16.522
##$ABSF2= -4.171173
##$ABSG= 5
##$ABSL= 3
##$ALPHA= 0
##$AQORDER= 0
##$ASSFAC= 0
##$ASSFACI= 0
##$ASSFACX= 0
##$ASSWID= 0
##$AUNMP= <proc_1d>
##$AZFE= 0.1
##$AZFW= 0.1
##$BCFW= 0
##$BC_mod= 0
##$BYTORDP= 0
##$COROFFS= 0
##$CY= 12.5
##$DATMOD= 1
##$DC= 0
##$DFILT= <>
##$DTYPP= 0
##$F1P= 14.0000005364418
##$F2P= -0.99999901652339
##$FCOR= 0.5
##$FTSIZE= 32768
##$FT_mod= 6
##$GAMMA= 0
##$GB= 0
##$INTBC= 1
##$INTSCL= 1
##$ISEN= 128
##$LB= 0.3
##$LEV0= 0
##$LPBIN= 0
##$MAXI= 10000
##$MC2= 0
##$MEAN= 0
##$ME_mod= 0
##$MI= 0
##$NCOEF= 0
##$NC_proc= -5
##$NLEV= 6
##$NOISF1= 0
##$NOISF2= 0
##$NSP= 0
##$NTH_PI= 0
##$NZP= 0
##$OFFSET= 16.522
##$PC= 1
##$PHC0= 178.7368
##$PHC1= -2.124669
##$PH_mod= 1
##$PKNL= yes
##$PPARMOD= 0
##$PSCAL= 4
##$PSIGN= 0
##$REVERSE= no
##$SF= 250.13
##$SI= 32768
##$SIGF1= 0
##$SIGF2= 0
##$SINO= 400
##$SIOLD= 32768
##$SREGLST= <1H.CDCl3>
##$SSB= 0
##$STSI= 32768
##$STSR= 0
##$SW_p= 5175.98343685301
##$SYMM= 0
##$S_DEV= 0
##$TDeff= 65536
##$TDoff= 0
##$TI= <Analysis number 999999
Compound Code 99
Book Reference 9
Project Code 9>
##$TILT= no
##$TM1= 0
##$TM2= 0
##$TOPLEV= 0
##$USERP1= <user>
##$USERP2= <user>
##$USERP3= <user>
##$USERP4= <user>
##$USERP5= <user>
##$WDW= 1
##$XDIM= 32768
##$YMAX_p= 454909138
##$YMIN_p= -1009732
$$ End of Bruker specific parameters
$$ ---------------------------------
##NTUPLES= NMR SPECTRUM
##VAR_NAME=  FREQUENCY,     SPECTRUM/REAL,   SPECTRUM/IMAG
##SYMBOL=    X,             R,               I
##VAR_TYPE=  INDEPENDENT,   DEPENDENT,       DEPENDENT
##VAR_FORM=  AFFN,          ASDF,            ASDF
##VAR_DIM=   32768,         32768,           32768
##UNITS=     HZ,            ARBITRARY UNITS, ARBITRARY UNITS
##FACTOR=    0.157963299565203, 1,           1
##FIRST=     4132.6476996994, 0,             0
##LAST=      -1043.33573715361, 0,           0
##MIN=       -1043.33573715361, -1009732,    0
##MAX=       4132.6476996994, 454909138,     0
$$ Real data points
##PAGE= N=1
##DATA TABLE= (X++(R..R)), XYDATA
$$ [...]
$$ plain form
23000 311678 133945 52357 52001 137387 175679 321043 244027 48382 -230897 -412155 -280712
22989 -280712 280601 391971 672720 457798 312110 238582 105225 354607 187136 -245323
22979 -245323 -318215 -356178 -324156 -15207 88107 -190428 -367060 -153378 -69449 14718
22969 14718 -54484 35775 30947 23725 122556 127054 45562 231349 297366 167758 269794 539322
22957 539322 299479 101441 223506 149948 -30314 -341936 -372636 -88856 368112 574127
22947 574127 344565 99475 93320 218163 415706 406796 249366 192509 58652 -223483
22937 -223483 -248811 -55620 -131772 -279196 -449639 -293037 -391428 -460929 -240050 203889
22927 203889 20026 -82557 -217134 -376593 -181616 -10808 138570 215460 228201 275971
$$ packed form
23000C11678j77733q1588l56Q5386L8292J45364p7016j95645k79279j81258J31443
22989b80712N61313J11370K80749k14922j45688p3528j33357K49382j67471m32459
22979b45323p2892l7963L2022L08949J03314k78535j76632K13682Q3929Q4167
22969A4718o9202R0259m828p222R8831M498q1492J85787O6017j29608J02036K69528
22957E39322k39843j98038J22065p3558j80262l11622l0700K83780M56968K06015
22947E74127k29562k45090o155J24843J97543q910j57430n6857j33857k82135
22937b23483k5328J93191p6152j47424j70443J56602r8391o9501K20879M43939
22927B03889j83863j02583j34577j59459J94977J70808J49378P6890J2741M7770
$$ plain form
22917 275971 31848 -170041 -41636 20887 -111441 -161894 -56981 433480 507293 298612
22907 298612 159920 -24037 -164078 -52845 145814 52899 -56207 118695 103105 209072
22897 209072 103697 -75597 -12214 154535 72908 29397 -60855 -281353 -176662 -32409
22887 -32409 35283 147632 -164270 -28587 91618 -116203 -368558 -486971 -589873 -650413
22877 -650413 -592944 -428164 -369256 -281888 -474753 -429090 -171359 -198996 -206913 -152847 -260779
22866 -260779 -253302 -10483 341700 106191 -291356 -349020 -105055 167214 218069 43559
22856 43559 -30659 -266419 -306246 -154663 -59379 -260742 -312248 -209246 60407 136568 120134
22845 120134 -39492 -169672 -203885 -139926 -62891 138419 316817 244224 11861 2395 90099
$$ packed form
22917B75971k44123k01889J28405O2523j32328n0453J04913M90461P3813k08681
22907B98612j38692j83957j40041J11233J98659r2915j09106J74902j5590J05967
22897B09072j05375j79294O3383J66749q1627m3511r0252k20498J04691J44253
22887c2409O7692J12349l11902J35683J20205k07821k52355j18413j02902o0540
22877f50413N7469J64780N8908Q7368j92865M5663K57731k7637p917N4066j07932
22866b60779P477K42819L52183k35509l97547n7664K43965K72269N0855j74510
22856D3559p4218k35760l9827J51583R5284k01363n1506J03002K69653P6161j6434
22845A20134j59626j30180l4213O3959P7035K01310J78398p2593k32363r466Q7704
$$ plain form
22834 90099 -20977 -81150 -136105 47722 -100257 -418603 -404009 -163201 -34043 99724
22824 99724 225906 -49393 -154431 -77112 -15300 -121835 -54197 -32415 76971 227018
22814 227018 261517 312500 323895 23016 -298223 -319747 -431904 -625549 -464040 66128
22804 66128 58589 -20072 -178234 2502 35858 118431 81069 86044 258945 345357 40935
22793 40935 -72889 56777 109534 212160 295550 186999 -125240 -376689 -453457 120804
22783 120804 353944 -58575 -222007 -39073 30912 130288 84272 -159427 -210438 87383
22773 87383 201688 -51207 26315 82889 382 -224837 -261160 -30708 230220 104167
22763 104167 -30242 96465 145024 128704 280247 323977 280941 172410 -73524 -161588
$$ packed form
22834I0099j11076o0173n4955J83827j47979l18346J4594K40808J29158J33767
22824I9724J26182k75299j05038P7319O1812j06535O7638K1782J09386J50047
22814B27018L4499N0983J1395l00879l21239k1524j12157j93645J61509N30168
22804F6128p539p8661j58162J80736L3356Q2573l7362M975J72901Q6412l04422
22793D0935j13824J29666N2757J02626Q3390j08551l12239k51449p6768N74261
22783A20804K33140m12519j63432J82934O9985R9376m6016k43699n1011K97821
22773H7383J14305k52895P7522N6574q2507k25219l6323K30452K60928j26053
22763A04167j34409J26707M8559j6320J51543M3730m3036j08531k45934q8064
$$ plain form
22753 -161588 -79572 -133894 -123081 179016 168887 215770 296537 81801 164359 184505 108347
22742 108347 184556 251846 369532 269123 274054 440818 401690 361899 393136 485272 556404
22731 556404 279779 106281 158538 -171223 -221357 -277036 -287306 -84338 75830 148287
22721 148287 137005 352456 604988 580121 411726 181582 163376 164130 143553 87088 71401
22710 71401 -12952 19426 156650 182969 -109001 -214642 -196822 -192596 -456030 -450572 -243531
22699 -243531 -174810 -252534 -259151 -343783 -323250 -109818 -50063 -74093 3834 54946 191577
22688 191577 137044 -2887 -53189 72238 33441 148172 91695 234690 279978 209354 157008
22677 157008 121516 -170374 7425 345199 166472 144364 -29193 -160466 -91423 -125897
$$ packed form
22753a61588Q2016n4322J0813L02097j0129M6883Q0767k14736Q2558K0146p6158
22742A08347P6209O7290J17686j00409M931J66764l9128l9791L1237R2136P1132
22731E56404k76625j73498N2257l29761n0134n5679j0270K02968J60168P2457
22721A48287j1282K15451K52532k4867j68395k30144j8206P54k0577n6465j5687
22710G1401q4353L2378J37224K6319k91970j05641J7820M226k63434N458K07041
22699b43531O8721p7724o617q4632K0533K13432N9755k4030P7927N1112J36631
22688A91577n4533j39931n0302J25427l8797J14731n6477J42995M5288p0624n2346
22677A57008l5492k91890J77799L37774j78727k2108j73557j31273O9043l4474
$$ plain form
22667 -125897 87781 205400 -18612 -120925 -330431 -254930 -300135 66650 2194 -316164
22657 -316164 -505662 -469934 -278090 -414345 -301240 -29448 -43062 -94100 -40952 -306638
22647 -306638 -511955 -424530 -320502 -460326 -452846 -327119 -273615 -95726 -153659 -337171
22637 -337171 -193909 -42652 227657 160603 -173321 -361239 -198880 259481 604868 456634
22627 456634 485800 457011 504942 587267 543079 576571 556018 454404 553129 691059 777849
22616 777849 491861 371151 405433 564835 488947 253952 -7255 256283 352181 404311
22606 404311 393342 700593 620554 574918 957170 1240564 1471436 1879177 2088101 2284054
22596 2284054 2445274 2694446 2551762 2225086 1827119 1641799 1260706 1130063 930848
$$ packed form
22667a25897K13678J17619k24012j02313k09506P5501m5205L66785o4456l18358
22657c16164j89498L5728J91844j36255J13105K71792j3614n1038N3148k65686
22647c06638k05317Q7425J04028j39824P480J25727N3504J77889n7933j83512
22637c37171J43262J51257K70309o7054l33924j87918J62359M58361L45387j48234
22627D56634K9166k8789M7931Q2325m4188L3492k0553j01614R8725J37930Q6790
22616G77849k85988j20710L4282J59402p5888k34995k61207K63538R5898N2130
22606D04311j0969L07251q0039m5636L82252K83394K30872M07741K08924J95953
22596B284054J61220K49172j42684l26676l97967j85320l81093j30643j99215
$$ plain form
22587 930848 777992 644641 597302 541407 514773 812094 1161077 1096851 1033197 1048980 1157170
22576 1157170 1069127 1154323 1268595 1362784 1185220 1216786 1342071 1351966 1234575 1305522 1489881
22565 1489881 1535272 1440099 1351045 1116803 1337680 1468237 1330618 1248712 1456998 1873140
22555 1873140 1986088 1981864 2095028 2139598 2415949 2832028 2890263 3077411 3434564 3612597
22545 3612597 3668869 3796670 4142349 4714637 5137204 5479162 6136301 7117445 8156930
22536 8156930 9149876 9934476 11080044 13192526 15589825 18355345 21853012 26618584
22528 26618584 33218101 42414510 55314188 75229314 106369992 149658187 203213318
22521 203213318 265829027 326194337 367584255 384443398 376157603 338247326 281031759
$$ packed form
22587I30848j52856j33351m7339n5895k6634K97321L48983o4226o3654J5783J08190
22576A157170q8043Q5196J14272R4189j77564L1566J25285R895j17391P0947J84359
22565A489881M5391r5173q9054k34242K20877J30557j37619q1906K08286M16142
22555A873140J12948m224J13164M4570K76351M16079N8235J87148L57153J78033
22545C612597N6272J27801L45679N72288M22567L41958O57139R81144J039485
22536H156930R92946P84600J145568K112482K397299K765520L497667M765572
22528B6618584O599517R196409J2899678J9915126L1140678M3288195N3555131
22521B03213318O2615709O0365310M1389918J6859143q285795l7910277n7215567
$$ plain form
22514 281031759 224216555 172434252 130015566 101892559 84106397 72089440 63473928
22507 63473928 56761959 51309214 47255617 43985664 41247981 38820175 36798726 35185682
22499 35185682 33481452 31774012 30320792 29051663 27632606 26772108 25700789 24772136
22491 24772136 24175148 23362923 22565812 21787021 21224548 20747630 20212489 19766293 19304198
22482 19304198 18732226 17830984 17289715 16671429 16359375 15973522 15556115 15264053 14921136
22473 14921136 14480188 14024071 13723614 13365636 12948726 12459975 12290099 12005462 11559845
22464 11559845 11304849 10962782 10644863 10455758 10127609 9936072 9853047 9430121 9020873
22455 9020873 8964137 9066871 8874780 8606970 8355933 8307507 7928539 7518163 7497715 7535604
$$ packed form
22514B81031759n6815204n1782303m2418686k8123007j7786162j2016957q615512
22507F3473928o711969n452745m053597l269953k737683k427806k021449j613044
22499C5185682j704230j707440j453220j269129j419057q60498j071319r28653
22491B4772136n96988q12225p97111p78791n62473m76918n35141m46196m62095
22482A9304198n71972r01242n41269o18286l12054l85853m17407k92062l42917
22473A4921136m40948m56117l00457l57978m16910m88751j69876k84637m45617
22464A1559845k54996l42067l17919j89105l28149j91537q3025m22926m09248
22455I020873n6736J02734j92091k67810k51037m8426l78968m10376k0448L7889
$$ plain form
22445 7535604 7429908 7621992 7772611 7837152 8022132 7941200 7904202 8097110 7708009 7349665
22435 7349665 7050738 6539242 6200165 5819616 5385689 5324292 5497308 5358360 5191769 4965689
22425 4965689 4621231 4579356 4686128 4516648 4366149 4288204 4066085 4074112 4018212 4088959
22415 4088959 4191953 4112254 3947422 4001052 3888024 3750838 3719210 3730118 3762325 3667665
22405 3667665 3630153 3540216 3369531 3569790 3531071 3445312 3535524 3428494 3290963 3030825
22395 3030825 2792247 2652546 2680626 2824263 2939846 2892590 2870390 2930878 2825535 2661146
22385 2661146 2654449 2747059 2412953 2326259 2019495 1760568 1746191 1907233 2041708 1957938
22375 1957938 1778666 1768658 1875244 1787534 1829708 1697656 1733041 1872243 2040003 2217094
$$ packed form
22445G535604j05696J92084J50619O4541J84980q0932l6998J92908l89101l58344
22435G349665k98927n11496l39077l80549m33927o1397J73016j38948j66591k26080
22425D965689l44458m1875J06772j69480j50499p7945k22119Q027n5900P0747
22415D088959J02994p9699j64832N3630j13028j37186l1628J0908L2207r4660
22405C667665l7512q9937j70685K00259l8719q5759R0212j07030j37531k60138
22395C030825k38578j39701K8080J43637J15583m7256k2200O0488j05343j64389
22385B661146o697R2610l34106q6694l06764k58927j4377J61042J34475q3770
22375A957938j79272j0008J06586q7710M2174j32052L5385J39202J67760J77091
$$ plain form
22365 2217094 1853930 1561240 1593486 1585591 1436950 1417238 1571638 1677027 1294282 1126784
22355 1126784 1206580 1095008 1175800 1156637 953097 1283912 1369105 1406738 1453726 1487611 1255809
22344 1255809 1022629 843648 897891 946188 1091839 943401 1153434 1326940 1452863 1229592
22334 1229592 1083980 1064751 1040618 787538 597659 631971 875922 905848 846779 1035539
22324 1035539 1075800 1107959 980549 760511 716535 739353 635828 467393 596804 757464
22314 757464 766202 872976 945370 767603 622783 287052 122849 323342 337140 350965
22304 350965 396023 416519 382387 272606 276272 499182 601518 722380 840097 692734
22294 692734 596559 508681 387242 375962 455583 632671 726076 802564 753852 623223 753757
$$ packed form
22365B217094l63164k92690L2246p895j48641j9712J54400J05389l82745j67498
22355A126784P9796j11572Q0792j9163k03540L30815Q5193L7633M6988L3885k31802
22344A255809k33180j78981N4243M8297J45651j48438K10033J73506J25923k23271
22334A229592j45612j9229k4133k53080j89879L4312K43951K9926n9069J88760
22324A035539M0261L2159j27410k20038m3976K2818j03525j68435J29411J60660
22314G57464Q738J06774P2394j77767j44820l35731j64203K00493J3798J3825
22304C50965M5058K0496l4132j09781L666K22910J02336J20862J17717j47363
22294F92734r6175q7878j21439j1280P9621J77088R3405P6488m8712j30629J30534
$$ plain form
22283 753757 728755 646664 740562 847102 850644 779837 817820 780538 724302 837432 690542
22272 690542 630179 568458 669579 774924 476418 56612 -72971 -97825 178146 27570
22262 27570 28291 373356 467340 441975 541256 491115 244723 339703 206208 80092 -7651
22251 -7651 171197 379100 275225 884 317275 452955 552524 558787 373730 475060
22241 475060 527981 247017 232663 300280 212011 151387 278606 178966 275750 388977 481154
22230 481154 367174 223970 236028 310797 357919 183423 283153 182252 107394 235272
22220 235272 252251 169005 209555 217603 286436 289121 204012 351827 419043 360290 351620 236774
22208 236774 214470 268002 164441 42331 -1262 44701 16863 133221 228575 279092 407899
$$ packed form
22283G53757k5002q2091R3898J06540L542p0807L7983l7282n6236J13130j46890
22272F90542o0363o1721J01121J05345k98506m19806j29583k4854K75971j50576
22262B7570P21L45065R3984k5365R9281n0141k46392R4980j33495j26116q7743
22251g651J78848K07903j03875k74341L16391J35680R9569O263j85057J01330
22241D75060N2921k80964j4354O7617q8269o0624J27219r9640R6784J13227R2177
22230D81154j13980j43204J2058P4769M7122j74496R9730j00901p4858J27878
22220B35272J6979q3246M0550Q048O8833K685q5109J47815O7216n8753q670j14846
22208B36774k2304N3532j03561j22110m3593M5963k7838J16358R5354N0517J28807
$$ plain form
22197 407899 424657 219851 51427 -6572 313864 281399 93269 39263 -72820 -244907
22187 -244907 -270096 -514737 -480743 -19953 -186083 -262079 -173356 -167141 184241 409998 149877
22176 149877 69423 3418 -204764 -293527 -176433 -353687 -438410 -284091 -138396 -110088
22166 -110088 -214596 -154415 -114855 -41174 178303 279744 150588 -58226 -230725 -102847
22156 -102847 73059 75325 260931 239279 62934 96768 209424 174403 49095 106165 90143
22145 90143 105403 -94030 -275091 -270982 -7809 339190 250867 138452 33862 -221827
22135 -221827 -321743 69603 87535 373586 651995 651601 7874 -227934 -24517 -123802 -147989
22124 -147989 -358734 -305524 -96150 -86444 -50668 -256985 -341061 -295874 -132416 -121671 -52153
$$ packed form
22197D07899J6758k04806j68424n7999L20436l2465j88130n4006j12083j72087
22187b44907k5189k44641L3994M60790j66130p5996Q8723O215L51382K25757k60121
22176A49877q0454o6005k08182q8763J17094j77254q4723J54319J45695K8308
22166a10088j04508O0181L9560P3681K19477J01441j29156k08814j72499J27878
22156a02847J75906K266J85606k1652j76345L3834J12656l5021j25308N7070j6022
22145I0143J5260j99433j81061M109K63173L46999q8323j12415j04590k55689
22135b21827r9916L91346J7932K86051K78409l94o43727k35808K03417r9285k4187
22124a47989k10745N3210K09374R706L5776k06317q4076M5187J63458J0745O9518
$$ plain form
22113 -52153 60383 173901 104403 143410 151647 -142094 -376918 -370203 -196011 104806 262080
22102 262080 52203 -275591 -425194 -334089 -377575 -237340 82776 189043 192877 292913
22092 292913 203535 63869 102087 307691 213370 46378 64853 -86597 -88708 -115688 -158021
22081 -158021 -312848 -264619 -110769 -50319 -3091 207618 122695 -246758 -380218 -218205
22071 -218205 -69854 88105 241788 292777 436128 407588 441630 604004 542971 371353
22061 371353 298964 315253 431002 354403 278552 19990 -87519 -218769 -343252 -298156
22051 -298156 -154359 -2123 -99603 -138962 -32164 -37474 -301574 -324871 -129609 -307675
22041 -307675 -402557 -137968 27991 42628 135045 225829 131956 206783 352495 155519 54581
$$ packed form
22113e2153J12536J13518o9498L9007Q237k93741k34824O715J74192L00817J57274
22102B62080k09877l27794j49603R1105m3486J40235L20116J06267L834J00036
22092B92913q9378j39666L8218K05604r4321j66992J8475j51450k111k6980m2333
22081a58021j54827M8229J53850O0450M7228K10709q4923l69453j33460J62013
22071b18205J48351J57959J53683N0989J43351k8540L4042J62374o1033j71618
22061C71353p2389J6289J15749p6599p5851k58562j07509j31250j24483M5096
22051b98156J43797J52236r7480l9359J06798n310k64100k3297J95262j78066
22041c07675r4882K64589J65959J4637R2417R0784r3873P4827J45712j96976j00938
$$ plain form
22030 54581 333953 347403 236065 14766 -45014 103589 187655 59560 57640 360995 564354
22019 564354 325507 158101 -38267 -91494 -96412 -13151 262072 387859 315793 350535 415327
22008 415327 316082 180278 107275 19111 -120473 -270559 -218103 -215563 -249806 -406539 -328865
21997 -328865 -78147 -25589 -147558 -149173 -121267 -188085 -117930 -157323 72093 111756 107255
21986 107255 105554 183679 218090 277746 584469 520999 152229 122015 58898 -295038 -163840
21975 -163840 152017 335844 418783 415739 569992 556564 410869 341172 325990 251463 240054
21964 240054 316222 559271 797417 1116795 1528156 1917008 1947581 1862857 1715505 1347201
21954 1347201 852572 760997 674142 659840 616681 580512 646135 437985 194166 181998 266361
$$ packed form
22030E4581K79372J3450j11338k21299n9780J48603Q4066j28095j920L03355K03359
22019E64354k38847j67406j96368n3227m918Q3261K75223J25787p2066L4742O4792
22008D15327r9245j35804p3003q8164j39584j50086N2456K540l4243j56733P7674
21997c28865K50718N2558j21969j615K7906o6818P0155l9393K29416L9663m501
21986A07255j701P8125L4411N9656L06723o3470l68770l0214o3117l53936J31198
21975a63840L15857J83827Q2939l044J54253j3428j45695o9697j5182p4527j1409
21964B40054P6168K43049K38146L19378M11361L88852L0573q4724j47352l68304
21954A347201m94629r1575q6855j4302m3159l6169O5623k08150k43819j2168Q4363
$$ plain form
21943 266361 313675 409749 333113 194562 60029 9021 18885 211230 412094 326053 561213
21932 561213 488857 178391 104616 -81918 -305346 -179954 16620 -207512 -121163 114764
21922 114764 137086 14756 -132209 118679 -112266 -298945 -225079 75689 355862 402747
21912 402747 399470 -35899 -160180 -65038 70172 120745 -3512 -54220 -36068 -185388 -267734
21901 -267734 -111300 16559 270667 419569 148300 -32433 14960 144617 115701 599
21891 599 -176387 -293691 -268444 82 131553 16782 -145641 -304725 -308536 -316576 15115
21880 15115 214714 57830 48372 217641 88504 125594 -87988 -266756 -401468 -138099
21870 -138099 67002 207655 111650 96222 149202 33480 -167872 -248406 -242057 -431934 -309600
$$ packed form
21943B66361M7314R6074p6636j38551j34533n1008R864J92345K00864q6041K35160
21932E61213p2356l10466p3775j86534k23428J25392J96574k24132Q6349K35927
21922A14764K2322j22330j46965K50888k30945j86679P3866L00768K80173M6885
21912D02747l277m35369j24281R5142J35210N0573j24257n0708J8152j49320q2346
21901b67734J56434J27859K54108J48902k71269j80733M7393J29657k8916j15102
21891E99j76986j17304K5247K68526J31471j14771j62423j59084l811q040L31691
21880A5115J99599j56884r458J69269j29137L7090k13582j78768j34712K63369
21870a38099K05101J40653r6005j5428N2980j15722k01352q0534O349j89877J22334
$$ plain form
21859 -309600 -143688 94045 360668 512853 367850 399447 370319 317310 306325 258402
21849 258402 -149424 -182748 -128516 115443 231699 65292 -47896 193549 409083 341713
21839 341713 181220 18401 90192 41684 -44875 -128590 -29778 296943 266519 294567 121604
21828 121604 -3611 -14152 -100361 -258967 -84568 333685 527355 317557 119804 103442
21818 103442 107597 229573 55621 -193909 -320294 -180634 -188213 -303702 -210695 -77628
21808 -77628 -151605 -108732 78273 9497 18173 94223 269336 388650 466337 358189 -103020
21797 -103020 -215167 -165353 -246467 -53879 82904 60361 -212809 -356247 -181595 -70019
21787 -70019 -125396 -208844 -105533 -235453 -315477 -293410 -189027 -151000 -196748 -114178 197772
$$ packed form
21859c09600J65912K37733K66623J52185j45003L1597k9128n3009j0985m7923
21849B58402m07826l3324N4232K43959J16256j66407j13188K41445K15534o7370
21839C41713j60493j62819P1791m8508q6559q3715R8812L26721l0424K8048j72963
21828A21604j25215j0541q6209j58606J74399M18253J93670k09798j97753j6362
21818A03442M155J21976j73952k49530j26385J39660p579j15489R3007J33067
21808g7628p3977M2873J87005o8776Q676P6050J75113J19314P7687j08148m61209
21797a03020j12147M9814q1114J92588J36783k2543k73170j43438J74652J11576
21787g0019n5377q3448J03311j29920q0024K2067J04383L8027m5748Q2570L11950
$$ plain form
21776 197772 422344 162205 95120 -123728 -26513 146376 -9607 -377757 -278027 -426547
21766 -426547 -455163 -116767 -163595 -224479 -461619 -217765 175338 197522 55387 -115364
21756 -115364 19733 126860 61921 -20806 159424 343167 491520 393405 371355 414239
21746 414239 512238 308425 207871 -713 -191173 -363976 -217323 -227549 -121807 -25475
21736 -25475 -93973 -240283 -230059 -147475 -111606 -90134 -51278 -104934 -304059 -298279 -83252
21725 -83252 103334 102821 45224 -174506 -205374 -84856 91574 -1349 -197541 74020 281961
21714 281961 146771 -73731 -12108 82895 197100 41431 -150217 -70697 127752 71544
21704 71544 -47854 -179466 -247735 10449 156429 123495 -59859 -240517 -9615 1571
$$ packed form
21776A97772K24572k60139o7085k18848R7215J72889j55983l68150R9730j48520
21766d26547k8616L38396m6828o0884k37140K43854L93103K2184j42135j70751
21756a15364J35097J07127o4939q2727J80230J83743J48353r8115k2050M2884
21746D14239R7999k03813j00554k08584j90460j72803J46653j0226J05742R6332
21736b5475o8498j46310J0224Q2584L5869K1472L8856n3656j99125N780K15027
21725h3252J86586n13n7597k19730l0868J20518J76430r2923j96192K71561K07941
21714B81961j35190k20502O1623R5003J14205j55669j91648P9520J98449n6208
21704G1544j19398j31612o8269K58184J45980l2934j83354j80658K30902J1186
$$ plain form
21694 1571 48878 -90617 -96069 -62047 44575 23333 78234 -203793 -420054 -381367 -115388
21683 -115388 -193215 -199113 -193682 -159172 -259851 -184659 -100725 201112 313815 100878 -5268
21672 -5268 -35295 68801 49675 -81057 -163184 -36745 -101793 -237422 -385563 -252072 24114
21661 24114 201293 186978 -41926 -82418 80181 173489 200551 114541 27545 45243 -71848
21650 -71848 -221122 -259951 -133490 1732 -58945 -60744 -124758 -201367 -219753 -234050 -338757
21639 -338757 -186411 -127947 116898 65552 -148836 -52179 11761 -166015 -178796 14955
21629 14955 178600 302483 289437 307361 212766 -81793 -140964 -281594 -169419 -217955 -365114
21618 -365114 -568844 -577377 -643688 -291301 -182764 -249685 -129404 -13461 -104979 4042
$$ packed form
21694A571M7307j39495n452L4022J06622k1242N4901k82027k16261L8687K65979
21683a15388p7827n898N431L4510j00679P5192Q3934L01837J12703k12937j06146
21672e268l0027J04096j9126j30732q2127J26439o5048j35629j48141J33491K76186
21661B4114J77179j4315k28904m0492J62599R3308K7062q6010q6996J7698j17091
21650g1848j49274l8829J26461J35222o0677j799o4014p6609j8386j4297j04707
21639c38757J52346N8464K44845n1346k14388R6657O3940j77776j2781J93751
21629A4955J63645J23883j3046J7924r4595k94559n9171j40630J12175m8536j47159
21618c65114k03730q533o6311L52387J08537o6921J20281J15943r1518J09021
$$ plain form
21608 4042 15672 109112 128380 411434 691540 467935 414258 341383 -31952 -213973 -18606
21597 -18606 102062 39884 -38093 -206309 -192787 -85449 14492 -42343 100960 122584 -9629
21586 -9629 -45529 -91636 9178 -72030 355256 243371 15886 49125 -31950 31074 3240
21575 3240 -101653 -193021 -207439 -195293 24849 242630 -24931 -264335 -287241 -216112 -70185
21564 -70185 32535 19851 -52994 -58183 -154562 -149572 251775 592650 402703 100100 137399
21553 137399 332056 147953 86043 -9839 -137889 -155464 -174214 -160671 -215947 -80571 36944
21542 36944 231554 410889 363505 566123 603591 440614 224906 108246 67465 214813
21532 214813 101726 95045 70799 61215 -191336 -306238 -20894 148158 67927 53872 -69103
$$ packed form
21608D042J1630R3440J9268K83054K80106k23605n3677p2875l73335j82021J95367
21597a8606J20668o2178p7977j68216J3522J07338R9941n6835J43303K1624j32213
21586i629l5900m6107J00814q1208M27286j11885k27485L3239q1075O3024k7834
21575C240j04893r1368j4418J2146K20142K17781k67561k39404k2906P1129J45927
21564g0185J02720j2684p2845n189r6379M990M01347L40875j89947l02603L7299
21553A37399J94657j84103o1910r5882j28050j7575j8750J3543n5276J35376J17515
21542C6944J94610J79335m7384K02618L7468j62977k15708j16660m0781J47348
21532B14813j13087o681k4246r584k52551j14902K85344J69052q0231j4055j22975
$$ plain form
21521 -69103 -13707 -62600 -53177 20448 -60925 10216 147815 119117 74146 9794 22513 190669
21509 190669 35008 -4304 242151 320401 261581 251996 36243 175856 173307 172612 -72866
21498 -72866 -16471 -50015 -88719 -216126 -290363 -206368 -188874 -50024 -27011 -17905 -40985
21487 -40985 -326536 -256647 -105324 -99851 37645 -46135 -488851 -530947 -415247 -408697 -143530
21476 -143530 -27677 -127451 -172881 -272481 -435625 -491838 -592483 -551694 -363313 -176073
21466 -176073 -131698 9326 -44789 -136760 19333 288381 374691 390993 629726 461144
21456 461144 289012 19798 141797 454877 636376 575813 266784 67470 139039 242523
21446 242523 10025 -165065 -171328 -227518 -181023 -170929 -351426 -421293 -250735 122012 254442
$$ packed form
21521f9103N5396m8893R423P3625q1373P1141J37599k8698m4971o4352J2719J68156
21509A90669j55661l9312K46455P8250n8820r585k15753J39613k549o95k45478
21498g2866N6395l3544l8704j27407p4237Q3995J7494J38850K3013R106k3080
21487d0985k85551O9889J51323N473J37496q3780m42716m2096J15700O550K65167
21476a43530J15853r9774m5430r9600j63144n6213j00645M0789J88381J87240
21466a76073M4375J41024n4115r1971J56093K69048Q6310J6302K38733j68582
21456D61144j72132k69214J21999L13080J81499o0563l09029j99314P1569J03484
21446B42523k32498j75090o263n6190M6495J0094j80497o9867J70558L72747J32430
$$ plain form
21435 254442 80713 -48694 -39329 -59150 73858 221598 65340 -30600 329996 418137
21425 418137 539277 558575 112682 -58595 39873 105843 245768 317549 430029 399001
21415 399001 177562 234157 152114 30279 181993 -484 44170 319720 507138 497889
21405 497889 244368 -46070 71262 186172 75479 -34467 5398 71175 48410 137390
21395 137390 82185 166435 323690 429555 229435 6239 -50926 -34661 -28271 -70476 -184110
21384 -184110 -265599 -261278 -158481 -338715 -439847 -219031 -111119 5837 13793 87096 170840
21373 170840 356702 260154 108861 -62220 -154384 -201761 -33674 261331 205627 -3553
21363 -3553 -139969 -107598 -785 39159 18694 -110940 147425 201647 64559 -43207 -23942
$$ packed form
21435B54442j73729j29407R365j9821J33008J47740j56258r5940L60596Q8141
21425D18137J21140J9298m45893j71277R8468O5970J39925P1781J12480l1028
21415C99001k21439N6595q2043j21835J51714j82477M4654K75550J87418r249
21405D97889k53521k90438J17332J14910j10693j09946L9865O5777k2765Q8980
21395A37390n5205Q4250J57255J05865k00120k23196n7165J6265O390m2205j13634
21384a84110q1489M321J02797j80234j01132K20816J07912J16956P956P3303Q3744
21373A70840J85862r6548j51293j71081r2164m7377J68087K95005n5704k09180
21363c553j36416L2371J06813L9944k0465j29634K58365N4222j37088j07766J9265
$$ plain form
21352 -23942 -185386 -269978 -233493 -210307 -235478 -250198 -191096 -170735 -127137 -182695 -139362
21341 -139362 87113 22283 -22792 -11090 -22222 -143681 -269930 -411091 -186225 83914
21331 83914 232279 244556 486266 431061 300192 52690 20977 213130 335341 374437
21321 374437 102196 -18099 -51539 106971 149460 100463 296844 351099 138855 121033
21311 121033 -26998 -184777 -290819 -267400 -150967 -118954 -176706 -141328 483 -252048
21301 -252048 -307199 -448744 -349166 -63171 -33972 12549 198691 244508 189028 -8057 -97345
21290 -97345 148651 79437 101501 102442 163292 9017 -194824 -107840 -257056 -105987 97791
21279 97791 196788 -171516 -374095 -274920 -27708 -47684 832 43086 65898 106972 365819
$$ packed form
21352b3942j61444q4592L6485K3186k5171j4720N9102K0361M3598n5558M3333
21341a39362K26475o4830m5075J1702j1132j21459j26249j41161K24866K70139
21331H3914J48365J2277K41710n5205j30869k47502l1713J92153J22211L9096
21321C74437k72241j20295l3440J58510M2489m8997J96381N4255k12244j7822
21311A21033j48031j57779j06042K3419J16433L2013n7752L5378J41811k52531
21301b52048n5151j41545R9578K85995K9199M6521J86142M5817n5480j97085q9288
21290i7345K45996o9214K2064R41O0850j54275k03841Q6984j49216J51069K03778
21279I7791R8997l68304k02579R9175K47212j9976M8516M2254K2812M1074K58847
$$ plain form
21268 365819 247106 42202 16702 74719 56055 -119424 -156700 -98360 38371 -34474 -7119
21257 -7119 -137371 -246134 -264942 -304834 -70890 -152542 -102893 -144123 -201445 -190789 -69407
21246 -69407 965 -37604 -34619 201179 295292 87833 18349 23447 221775 239471 -31365
21235 -31365 -183908 -124943 150745 321713 361839 216494 -149300 -291034 -125801 182359
21225 182359 80428 -18108 -226 -36998 79485 242212 149562 -79885 -249078 -82310
21215 -82310 62388 265130 336114 185133 206320 261825 204663 96318 -65877 -134869 -81642
21204 -81642 90362 142820 -52151 35923 175081 227709 383198 184377 -21222 -165209
21194 -165209 -278242 -296425 -286149 -301719 -440041 -412294 -229053 -74112 -92122 -344082
$$ packed form
21268C65819j18713k04904k5500N8017j8664j75479l7276N8340J36731p2845K7355
21257g119j30252j08763j8808l9892K33944q1652M9649m1230n7322J0656J21382
21246f9407P0372l8569K985K35798R4113k07459o9484N098J98328J7696k70836
21235c1365j52543N8965K75688J70968M0126j45345l65794j41734J65233L08160
21225A82359j01931r8536J7882l6772J16483J62727r2650k29447j69193J66768
21215h2310J44698K02742P0984j50981K1187N5505n7162j08345j62195o8992N3227
21204h1642J72004N2458j94971Q8074J39158N2628J55489j98821k05599j43987
21194a65209j13033j8183J0276j5570j38322K7747J83241J54941j8010k51960
$$ plain form
21184 -344082 -144453 249590 544796 453108 405427 242191 173760 45521 -62362 -269891
21174 -269891 -196661 274768 472270 474411 209407 66499 149434 215905 167519 227816 300023
21163 300023 281780 -35812 -210690 -92889 9384 -148239 -333499 -66600 -51205 -55531
21153 -55531 -52619 -13931 -137541 12291 63775 -36623 14644 143981 305000 302865 285620
21142 285620 157584 153690 30992 190954 285077 349454 385460 303951 78406 -9797 172858
21131 172858 12406 -40933 -208389 -387227 -162491 -218831 -95889 40439 53953 -13917
21121 -13917 52289 22272 28808 12925 26833 -64782 -81652 -245788 -170556 -70315 115738
21110 115738 84399 103686 44219 28231 161264 212084 121101 57385 61184 82690 113066
$$ packed form
21184c44082J99629L94043K95206r1688m7681j63236o8431j28239j07883k07529
21174b69891P3230M71429J97502K141k65004j42908Q2935O6471m8386O0297P2207
21163C00023j8243l17592j74878J17801J02273j57623j85260K66899J5395m326
21153e5531K912L8688j23610J49832N1484j00398N1267J29337J61019k135j7245
21142B85620j28036l894j22698J59962R4123O4377L6006q1509k25545q8203J82655
21131A72858j60452n3339j67456j78838K24736n6340J22942J36328J3514o7870
21121a3917O6206l0017O536j5883J3908r1615j6870j64136P5232J00241J86053
21110A15738l1339J9287n9467j5988J33033N0820r0983o3716L799K1506L0376
$$ plain form
21099 113066 173116 395531 426484 231128 334200 67908 96811 182418 84648 64758 -69011
21088 -69011 -123807 -207854 -329942 -28939 287479 260386 209783 342886 -63525 -353034
21078 -353034 -338147 -140373 19199 -137171 -108788 -136521 -138369 -93579 -84847 -76642 -136846
21067 -136846 26636 28085 -122300 28166 58969 -22989 -220929 -231514 64673 260336
21057 260336 7645 -146053 24375 -15369 103967 122469 379448 577502 532931 236660
21047 236660 291833 323799 319359 32773 90862 316389 390826 195795 57957 -102732 -127370
21036 -127370 -163046 -129426 -93569 -171484 -211355 -94682 17694 -181331 -140515 -12920 -91537
21025 -91537 -48841 -25690 -5037 100267 -58890 -97330 -254833 31489 265561 64594
$$ packed form
21099A13066O0050K22415L0953j95356J03072k66292K8903Q5607r7770j9890j33769
21088f9011n4796q4047j22088L01003L16418k7093n0603J33103m06411k89509
21078c53034J4887J97774J59572j56370K8383k7733j848M4790Q732Q205o0204
21067a36846J63482J449j50385J50466L0803q1958j97940j0585K96187J95663
21057B60336k52691j53698J70428l9744J19336J8502K56979J98054m4571k96271
21047B36660N5173L1966m440k86586N8089K25527P4437j95031j37838j60689k4638
21036a27370l5676L3620L5857p7915l9871J16673J12376j99025M0816J27595p8617
21025i1537M2696K3151K0653J05304j59157l8440j57503K86322K34072k00967
$$ plain form
21015 64594 11528 137542 -120263 -294506 -380255 -462116 -581546 -203933 1206 -174447
21005 -174447 -162128 -286128 -330534 -178441 -5982 150183 -38177 -149517 -94649 140976
20995 140976 328889 424097 304801 430595 400426 113477 30255 90799 220294 26145
20985 26145 -424427 -588139 -452919 -207215 -14095 11724 35102 18306 68094 53725 121228
20974 121228 93975 -44113 -173625 107067 178982 117124 -83046 -202361 -354212 -172990
20964 -172990 103908 119773 101688 172963 386087 403023 495300 487193 394217 411515 176495
20953 176495 31763 266413 380334 264493 213675 113654 99224 146404 191420 -24168
20943 -24168 -23146 61743 78654 161595 94037 -209575 -206660 -88737 -16428 -114658 -60214 -32381
$$ packed form
21015F4594n3066J26014k57805j74243q5749q1861j19430L77613K05139j75653
21005a74447J2319j24000m4406J52093J72459J56165j88360j11340N4868K35625
20995A40976J87913R5208j19296J25794l0169k86949q3222O0544J29495j94149
20985B6145m50572j63712J35220K45704J93120K5819K3378j6796M9788j4369O7503
20974A21228k7253j38088j29512K80692P1915o1858k00170j19315j51851J81222
20964a72990K76898J5865j8085P1275K13124J6936R2277q107r2976J7298k35020
20953A76495j44732K34650J13921j15841n0818j00021j4430M7180M5016k15588
20943b4168J022Q4889J6911Q2941o7558l03612K915J17923P2309r8230N4444K7833
$$ plain form
20931 -32381 -178868 -37251 63780 -30389 189520 239789 66155 -60535 -121965 -149778
20921 -149778 -225209 -256037 33971 172685 350165 132323 -68551 -208255 -85111 60869
20911 60869 -90783 19366 -127192 -398953 -467334 -292813 -368025 -304600 -151261 -16447
20901 -16447 166620 171312 -56870 -113248 150013 239146 338289 139651 -209575 -202227 -78767
20890 -78767 -46326 73619 260452 216094 233756 454536 250736 -3258 -10246 -65382 -4805
20879 -4805 166644 -20790 -30814 93889 -53013 200150 479929 463567 180283 98043
20869 98043 122026 314938 291907 241250 298955 314419 157313 -251875 -499115 -222338 84170
20858 84170 173606 14401 -112788 98343 -123101 -193671 -86643 34060 128991 290154
$$ packed form
20931c2381j46487J41617J01031r4169K19909N0269j73634j26690o1430k7813
20921a49778p5431l0828K90008J38714J77480k17842k00874j39704J23144J45980
20911F0869j51652J10149j46558k71761o8381J74521p5212O3425J53339J34814
20901a6447J83067M692k28182n6378K63261Q9133R9143j98638l49226P348J23460
20890g8767L2441J19945J86833m4358J7662K20780k03800k53994o988n5136O0577
20879d805J71449j87434j0024J24703j46902K53163K79779j6362k83284q2240
20869I8043K3983J92912k3031n0657N7705J5464j57106m09188k47240K76777L06508
20858H4170Q9436j59205j27189K11131k21444p0570J07028J20703R4931J61163
$$ plain form
20848 290154 152163 395193 373605 467807 344777 307239 -12364 55071 -28061 -232292
20838 -232292 -18867 296542 275251 209125 67155 -53523 -132317 -83443 12323 76595 90640
20827 90640 208278 169991 -183737 -125834 -176209 -257463 154558 625456 572399 182682 29772
20816 29772 -114140 -49676 6415 131875 263102 116721 -55819 -187663 -321882 -287026
20806 -287026 -169238 -221886 -196986 -308711 -337026 -216355 2851 -55764 161973 289041
20796 289041 223029 464560 309312 73056 -186050 -285574 -352140 -383009 -514375 -406546
20786 -406546 -6042 44338 274574 56532 -285184 -408174 -348939 -478939 -378717 -220339
20776 -220339 -248874 -449159 -351263 -72006 25369 7067 -62992 -179591 -51155 64306
$$ packed form
20848B90154j37991K43030k1588R4202j23030l7538l19603O7435q3132k04231
20838b32292K13425L15409k1291o6126j41970j20678p8794M8874R5766O4272J4045
20827I0640J17638l8287l53728N7903n0375q1254M12021M70898n3057l89717j52910
20816B9772j43912O4464N6091J25460J31227j46381j72540j31844j34219L4856
20806b87026J17788n2648K4900j11725k8315J20671K19206n8615K17737J27068
20796B89041o6012K41531j55248k36256k59106r9524o6566l0869j31366J07829
20786d06546M00504N0380K30236k18042l41716j22990N9235j30000J00222J58378
20776b20339k8535k00285R7896K79257R7375j8302p0059j16599J28436J15461
$$ plain form
20766 64306 -54087 -99830 21324 -114965 -224718 -21100 157374 259986 163876 393529
20756 393529 309046 92973 62123 101156 247654 153754 112645 209572 309723 157513 216510
20745 216510 363527 120761 -44399 185415 95402 -17809 66693 -72929 147172 118683
20735 118683 86661 135053 40692 -48251 -358456 -388073 -276257 -56654 -218236 -301623 -450817
20724 -450817 -477565 -200676 -89977 -73649 -230760 -126881 -136093 -53101 28811 -28167 99799
20713 99799 178866 59598 -36034 92884 124190 87763 29423 -74431 -177614 -32160 97694
20702 97694 170374 441215 566195 498274 543515 292221 133335 76288 139569 170539 47410
20691 47410 -118124 -293378 -333032 -70611 -102816 -429914 -436802 -439368 -403973 -638405 -508316
$$ packed form
20766F4306j18393m5743J21154j36289j09753K03618J78474J02612r6110K29653
20756C93529q4483k16073l0850L9033J46498r3900m1109R6927J00151j52210N8997
20745B16510J47017k42766j65160K29814r0013j13211Q4502j39622K20101k8489
20735A18683l2022M8392r4361q8943l10205k9617J11816K19603j61582q3387j49194
20724d50817k6748K76889J10699J6328j57111J03879r212Q2992Q1912n6978J27966
20713I9799P9067j19268r5632J28918L1306l6427n8340j03854j03183J45454J29854
20702I7694P2680K70841J24980o7921M5241k51294j58886n7047O3281L0970j23129
20691D7410j65534j75254l9654K62421l2205l27098o888k566L5395k34432J30089
$$ plain form
20680 -508316 -45642 163744 313112 248878 180116 103850 -60467 -150248 -19479 247164
20670 247164 172641 116592 96187 -198934 9813 -47851 24931 -43819 -126343 198531 416049
20659 416049 300686 88675 31480 109544 198587 18451 -26705 -138260 -161960 -272155
20649 -272155 -392810 -389458 -265300 -302279 -134277 -63675 -121824 -61527 -23533 -57894 -79417
20638 -79417 103444 137517 146023 70197 136954 -6997 -215057 -312012 -233917 -90319 55487
20627 55487 -4373 -8 103259 105693 97585 225875 184498 -129522 -283949 -247264 -121359
20616 -121359 -55916 -17201 76705 250590 389204 311837 226783 212917 181042 173711 271194
20605 271194 269458 275569 339281 438699 367519 235563 132606 91222 124768 113170 297425
$$ packed form
20680e08316M62674K09386J49368o4234o8762p6266j64317q9781J30769K66643
20670B47164p4523n6049k0405k95121K08747n7664P2782o8750q2524L24874K17518
20659D16049j15363k12011n7195P8064Q9043j80136m5156j11555k3700j10195
20649b72155j20655L352J24158l6979J68002P0602n8149O0297L7994l4361k1523
20638g9417J82861L4073Q506p5826O6757j43951k08060r6955P8095J43598J45806
20627E5487n9860M365J03267K434q108J28290m1377l14020j54427L6685J25905
20616a21359O5443L8715R3906J73885J38614p7367q5054j3866l1875p331R7483
20605B71194j736O111O3712R9418p1180j31956j02957m1384L3546j1598J84255
$$ plain form
20594 297425 239373 88424 145803 1206 74842 316722 335043 95346 -126436 -194234
20584 -194234 58629 186460 192808 151895 119696 -149098 -80488 238172 441395 371489 308358
20573 308358 155632 47685 -3496 48686 156842 330534 -52740 -238845 -66038 11041
20563 11041 66721 218890 333744 502617 446041 364264 -6856 -277933 -217170 -205302 -121980
20552 -121980 -146844 -210778 -150448 -284489 -204808 -4400 -97470 -106033 -48787 -62707 -146341
20541 -146341 -67128 17032 75123 -7526 139241 40764 73715 242623 302394 308821 266159
20530 266159 134487 68471 134610 -61402 -74038 -52497 161716 -8445 -196162 -212506
20520 -212506 -161881 -33503 -52040 -256109 -347142 -415420 -154453 71609 83236 53131 157843
$$ packed form
20594B97425n8052j50949N7379j44597P3636K41880J8321k39697k21782o7798
20584a94234K52863J27831O348m0913l2199k68794O8610L18660K03223o9906o3131
20573C08358j52726j07947n1181N2182J08156J73692l83274j86105J72807P7079
20563A1041N5680J52169J14854J68873n6576q1777l71120k71077O0763J1868Q3322
20552a21980k4864o3934O0330j34041P9681K00408r3070q563N7246j3920q3634
20541a46341P9213Q4160N8091q2649J46767r8477L2951J68908N9771O427m2662
20530B66159j31672o6016O6139j96012j2636K1541K14213j70161j87717j6344
20520b12506N0625J28378j8537k04069r1033o8278K60967K26062J1627l0105J04712
$$ plain form
20509 157843 -66714 -334196 -297226 -387836 -244164 49229 33790 -42539 50736 34487 -158280
20498 -158280 -111130 117544 310074 405073 438608 92315 -149840 -115302 -152471 -290884
20488 -290884 -222260 14727 10304 -135748 -86991 -91495 -219472 -362712 -496924 -607792 -527976
20477 -527976 -106209 33784 -200678 -495919 -486358 -262174 -209393 -252942 -72653 145793
20467 145793 79459 -203232 -109071 4948 -142236 -62513 -27008 135023 322529 266031
20457 266031 68704 54142 177319 139486 113704 -550 -135681 31163 98095 -89201
20447 -89201 168646 183509 22884 164672 222990 295893 432562 394339 182704 256827 209138
20436 209138 20537 240649 444725 242169 1657 -112034 -188284 -32385 49480 26942
$$ packed form
20509A57843k24557k67482L6970r0610J43672K93393j5439p6329R3275j6249j92767
20498a58280M7150K28674J92530R4999L3535l46293k42155L4538l7169j38413
20488b90884O8624K36987m423j46052M8757m504j27977j43240j34212j10868P9816
20477e27976M21767J39993k34462k95241R561K24184N2781m3549J80289K18446
20467A45793o6334k82691R4161J14019j47184P9723L5505J62031J87506n6498
20457B66031j97327j4562J23177l7833k5782j14254j35131J66844O6932j87296
20447h9201K57847J4863j60625J41788N8318P2903J36669l8223k11635P4123m7689
20436B09138j88601K20112K04076k02556k40512j13691p6250J55899Q1865k2538
$$ plain form
20426 26942 232340 194211 14962 167015 245980 213419 131435 28734 -41043 171485 175370
20415 175370 -76830 8431 222360 313797 445359 506911 514800 302567 268513 264285 -36712
20404 -36712 -182013 -138323 -255193 -365988 -391271 -278163 -311345 -177452 187745 321477
20394 321477 355811 71295 222359 339386 158111 -95295 -57466 -130139 -45100 59113
20384 59113 178687 5217 -279220 -467997 -552235 -106937 122685 31783 68527 -99990
20374 -99990 -18467 109536 303087 226494 208235 90189 103512 286458 183971 -7429
20364 -7429 -140735 -170538 -104177 -87085 185006 167123 77792 -159667 -418561 -445356 -334613
20353 -334613 -271359 -105481 -54416 136826 240649 202059 130534 136391 -17212 -210292 -65754
$$ packed form
20426B6942K05398l8129j79249J52053P8965l2561q1984j02701o9777K12528L885
20415A75370k52200Q5261K13929R1437J31562O1552P889k12233l4054m228l00997
20404c6712j45301M3690j16870j10795k5283J13108l3182J33893L65197J33732
20394C21477L4334k84516J51064J17027j81275k53406L7829p2673Q5039J04213
20384E9113J19574j73470k84437j88777q4238M45298K29622r0902L6744j68517
20374i9990Q1523J28003J93551p6593j8259j18046J3323J82946j02487j91400
20364g429j33306k9803O6361J7092K72091j7883q9331k37459k58894k6795J10743
20353c34613O3254J65878N1065J91242J03823l8590p1525N857j53603j93080J44538
$$ plain form
20342 -65754 -74067 -160277 -259673 -98267 -5458 -171420 63437 279973 292120 498403 554679
20331 554679 316413 293625 219899 205127 58694 180441 233377 203677 269959 148216 246036
20320 246036 -49333 -392279 -212646 -18216 10931 106952 -315369 -356697 -310962 -82885
20310 -82885 83242 163116 113289 -21304 -86638 -211483 -335720 -356827 -194750 -242231 -233795
20299 -233795 -281853 -399351 -401530 -162498 33508 -17167 86431 50002 -1103 51234 -7566
20288 -7566 -194204 -77318 -30552 -172157 -259950 -115641 -55779 174667 206571 161495 67863
20277 67863 -12303 -18733 84728 221779 186289 55568 106874 -32598 70383 140490 128240
20266 128240 -48493 -259475 122015 349767 154537 39799 117581 266823 420043 225975
$$ packed form
20342f5754q313q6210r9396J61406R2809j65962K34857K16536J2147K06283N6276
20331E54679k38266k2788p3726j4772j46433J21747N2936k9700O6282j21743R7820
20320B46036k95369l42946J79633J94430K9147R6021m22321m1328M5735K28077
20310h2885J66127P9874m9827j34593o5334j24845j24237k1107J62077m7481Q436
20299b33795m8058j17498k179K39032J96006n0675J03598l6429n1105N2337n8800
20288g566j86638J16886M6766j41605q7793J44309N9862K30446L1904m5076r3632
20277F7863q0166o430J03461J37051l5490j30721N1306j39472J02981P0107j2250
20266A28240j76733k10982L81490K27752j95230j14738P7782J49242J53220j94068
$$ plain form
20256 225975 -129429 -167908 -61597 -153489 -60363 -74663 -110752 -326800 -309340 -339860 -216624
20245 -216624 -798 328640 379062 186283 44122 103916 24770 19573 127623 306705
20235 306705 466043 546330 212613 -83819 -243842 -513738 -533788 -262380 79146 -93976
20225 -93976 -134296 -74098 64201 119382 132395 -101784 -98470 57063 50940 -53661 -99265
20214 -99265 -140511 -290318 -141964 243566 89405 34332 87065 24953 35025 164461 232746
20203 232746 181330 758 -24232 35154 46438 -136695 -197373 -87394 -204861 -184463 121459
20192 121459 122254 178129 234626 -139016 -363415 -97804 -42534 -116203 -223062 -224346 91702
20181 91702 64777 -245128 143460 220346 184521 323664 307846 307979 196343 149630 134037
$$ packed form
20256B25975l55404l8479J06311r1892R3126j4300l6089k16048J7460l0520J23236
20245b16624K15826L29438N0422j92779j42161N9794p9146n197J08050J79082
20235C06705J59338Q0287l33717k96432j60023k69896k0050K71408L41526j73122
20225i3976m0320O0198J38299N5181J3013k34179L314J55533o123j04601m5604
20214i9265m1246j49807J48354L85530j54161n5073N2733o2112J0072J29436O8285
20203B32746n1416j80572k4990N9386J1284j83133o0678J09979j17467K0398L05922
20192A21459P95N5875N6497l73642k24399K65611N5270p3669j06859j284L16048
20181I1702k6925l09905L88588P6886l5825J39143j5818J33j11636m6713j5593
$$ plain form
20170 134037 148502 37651 150974 326455 531498 541097 482532 312176 244115 103886
20160 103886 102383 110724 -126287 -241172 -362503 -212552 -92552 -48950 166609 212588 175653
20149 175653 164395 257720 453870 538376 552998 236650 -31238 -80338 -99673 -111886 112471
20138 112471 122656 71254 23768 -79798 -139875 -158561 58449 181947 121110 -6621 83286
20127 83286 211738 221208 325894 488200 425224 387822 272121 30047 -31288 -75601 210431
20116 210431 332094 201170 28149 66993 48494 130674 210129 291854 181262 226974 278264
20105 278264 137441 210911 241014 270634 131030 244515 424051 265478 268133 520964
20095 520964 592324 525043 450806 291213 226517 65232 -60059 -101656 154108 423601
$$ packed form
20170A34037J4465j10851J13323J75481K05043R599n8565j70356o8061j40229
20160A03886j503Q341k37011j14885j21331J49951J20000M3602K15559M5979l6935
20149A75653j1258R3325J96150Q4506J4622l16348k67888m9100j9335j2213K24357
20138A12471J0185n1402m7486j03566o0077j8686K17010J23498o0837j27731Q9907
20127H3286J28452R470J04686J62306o2976l7402j15701k42074o1335m4313K86032
20116B10431J21663j30924j73021L8844j8499Q2180P9455Q1725j10592M5712N1290
20105B78264j40823P3470L0103K9620j39604J13485J79536j58573K655K52831
20095E20964P1360o7281p4237j59593o4696j61285j25291m1597K55764K69493
$$ plain form
20085 423601 602076 487194 460215 289374 469660 306771 30803 120541 166411 169182
20075 169182 267460 106484 11072 -50702 74278 35971 27076 143310 192504 297367 167741
20064 167741 335265 317176 251887 126266 -30336 -71740 -166296 -220381 -65232 20138 6808
20053 6808 -59391 -137920 -74850 160657 327212 188673 215860 451729 415603 319737 100799
20042 100799 -35510 -97855 -137494 -32953 8823 82379 41070 -49381 22095 13426 114448
20031 114448 264674 120981 -133870 -127609 -24811 120389 197735 235218 250180 38798
20021 38798 -113994 -193458 -148586 -233073 -425587 -186250 -149301 -152304 -66165 137210 120814
20010 120814 30812 -130291 -219375 -211922 -177109 -166479 5296 136686 120050 218645 135894
$$ packed form
20085D23601J78475j14882k6979j70841J80286j62889k75968Q9738M5870K771
20075A69182R8278j60976r5412o1774J24980l8307q895J16234M9194J04863j29626
20064A67741J67524j8089o5289j25621j56602m1404r4556n4085J55149Q5370j3330
20053F808o6199p8529O3070K35507J66555j38539K7187K35869l6126r5866k18938
20042A00799j36309o2345l9639J04541M1776P3556m1309r0451P1476q669J01022
20031A14448J50226j43693k54851O261J02798J45200P7346L7483J4962k11382
20021C8798j52792p9464M4872q4487j92514K39337L6949l003Q6139K03375j6396
20010A20814r0002j61103q9084P453L4813J0630J71775J31390j6636R8595q2751
$$ plain form
19999 135894 24750 28030 -50588 -42175 22203 -122084 -35887 163117 137785 91953 148382
19988 148382 253838 691511 639094 713878 366030 326496 561625 489128 296545 135357
19978 135357 -46009 -140324 -49068 -158479 -412542 -267899 -19032 -132253 -32438 232988
19968 232988 156938 -2876 26779 41816 191298 159180 187777 294981 412041 193811
19958 193811 -49998 -108108 181994 338387 384705 451974 513242 523878 395822 387099 375636
19947 375636 231862 368481 247274 435271 455962 464713 462195 518025 403405 110123 19770
19936 19770 112408 55135 -55263 -86691 47790 140288 17754 22015 222633 127088 -40854
19925 -40854 -36188 194524 202571 128837 299683 310937 158128 -240760 -66024 105465 237003
$$ packed form
19999A35894j11144L280p8618Q413O4378j44287Q6197J99004k5332m5832N6429
19988A48382J05456M37673n2417P4784l47848l9534K35129p2497j92583j61188
19978A35357j81366r4315R1256j09411k54063J44643K48867j13221R9815K65426
19968B32988p6050j59814K9655J5037J49482l2118K8597J07204J17060k18230
19958A93811k43809n8110K90102J56393M6318O7269O1268J0636j28056q723j1463
19947C75636j43774J36619j21207J87997K0691Q751k518N5830j14620k93282r0353
19936A9770R2638n7273j10398l1428J34481R2498j22534M261K00618r5545j67942
19925d0854M666K30712Q047p3734J70846J1254j52809l98888J74736J71489J31538
$$ plain form
19914 237003 417055 286902 81462 128450 208262 293465 472161 820117 1065690 1017513
19904 1017513 1061197 1143715 1313825 1153616 1144881 1182924 1045247 841148 798691 870829 1116641
19893 1116641 1323671 1302667 1103075 972462 973192 992316 779802 630509 487696 298736
19883 298736 84065 176682 134116 206320 239482 346654 515131 457979 363443 116456 120652
19872 120652 392192 304039 220366 401022 725537 910346 783512 766409 589316 524205
19862 524205 469734 581394 809063 912941 948000 1005382 840201 765310 777299 938226
19852 938226 1132614 1251410 1544375 1631550 1368402 1364000 1390776 1075758 813517 661076
19842 661076 751294 744045 764303 684976 634458 759506 718295 672718 417940 388424 249366
$$ packed form
19914B37003J80052j30153k05440M6988P9812Q5203J78696L47956K45573m8177
19904A017513M3684Q2518J70110j60209q735L8043j37677k04099m2457P2138K45812
19893A116641K07030k1004j99592j30613P30J9124k12514j49293j42813j88960
19883B98736k14671R2617m2566P2204L3162J07172J68477n7152r4536k46987M196
19872A20652K71540q8153q3673J80656L24515J84809j26834j7103j77093o5111
19862E24205n4471J11660K27669J03878L5059N7382j65181p4891J1989J60927
19852I38226J94388J18796K92965Q7175k63148m402K6776l15018k62241j52441
19842F61076R0218p249K0258p9327n0518J25048m1211m5577k54778k9516j39058
$$ plain form
19831 249366 129241 432875 507508 384353 408851 558761 616366 800454 901878 697828
19821 697828 467287 235331 332074 616749 640433 609324 833078 714648 632170 813974
19811 813974 693236 373431 597471 901371 947118 1205630 1242735 1388184 1303042 967203
19801 967203 1080177 1302845 1406357 1362696 1341898 1234086 1189351 993070 950131 1008940
19791 1008940 1225960 974526 795240 1018577 752590 342289 523768 593701 653956 800730
19781 800730 814705 882781 584746 498911 504608 479676 589398 556420 445325 470094 183582
19770 183582 42548 343725 358327 297069 445407 436483 503441 337443 354961 401570 450203
19759 450203 305192 172703 267988 176697 36714 -70027 -138644 136974 174830 19168
$$ packed form
19831B49366j20125L03634P4633j23155K4498J49910N7605J84088J01424k04050
19821F97828k30541k31956R6743K84675K3684l1109K23754j18430q2478J81804
19811H13974j20738l19805K24040L03900M5747K58512L7105J45449q5142l35839
19801I67203J12974K22668J03512m3661k0798j07812m4735j96281m2939N8809
19791A008940K17020k51434j79286K23337k65987m10301J81479O9933O0255J46774
19781H00730J3975O8076k98035q5835N697k4932J09722l2978j11095K4769k86512
19770A83582j41034L01177J4602o1258J48338q924O6958j65998J7518M6609M8633
19759D50203j45011j32489R5285r1291j39983j06741o8617K75618L7856j55662
$$ plain form
19749 19168 -44326 -40170 195922 172661 -75627 147464 325406 371496 282923 79248 139527
19738 139527 80509 -127135 148356 444089 542667 328402 287839 278281 374086 311589 99976
19727 99976 -76580 -20734 191808 163236 -75409 175798 660540 776773 552407 357049
19717 357049 583496 746785 617926 357358 43050 15653 134726 328421 631513 768276
19707 768276 649660 374416 171793 165483 3069 -81975 109140 236578 62922 290659
19697 290659 349404 434279 421289 336314 165213 39770 -52312 -143121 -239519 -325274 -288458
19686 -288458 -221036 -183663 -242388 -301998 -126617 30908 89823 188774 249753 248118 365324
19675 365324 321704 343827 285979 191977 176623 219089 269316 274045 232151 461264 394559
$$ packed form
19749A9168o3494M156K36092k3261k48288K23091J77942M6090q8573k03675O0279
19738A39527n9018k07644K75491K95733R8578k14265m0563r558R5805o2497k11613
19727I9976j76556N5846K12542k8572k38645K51207M84742J16233k24366j95358
19717C57049K26447J63289j28859k60568l14308k7397J19073J93695L03092J36763
19707G68276j18616k75244k02623o310j62414q5044J91115J27438j73656K27737
19697B90659N8745Q4875j2990q4975j71101j25443r2082r0809r6398q5755L6816
19686b88458O7422L7373n8725n9610J75381J57525N8915R8951O0979j635J17206
19675C65324m3620K2123n7848r4002j5354M2466N0227M729m1894K29113o6705
$$ plain form
19664 394559 304601 402687 313192 186921 -11438 118571 355417 474970 269392 370850
19654 370850 582338 710525 710991 545311 325831 335324 357422 239194 223322 407682 536801
19643 536801 484389 316628 353246 393104 377942 546403 463315 514314 533763 530287 384309
19632 384309 267450 373815 483106 308186 33427 51613 118858 191269 451428 560645
19622 560645 560312 419421 335229 418164 521166 569679 414724 356545 511158 642231 799447
19611 799447 687750 724252 675157 565598 579353 701448 731377 627653 372202 71083
19601 71083 122435 468011 556177 570352 568176 410304 318910 352542 581496 780297 888538
19590 888538 790948 771474 897919 872630 675673 529654 573706 687855 674934 694381 650617
$$ packed form
19664C94559q9958R8086q9495j26271j98359J30009K36846J19553k05578J01458
19654C70850K11488J28187M66j65680k19480R493K2098j18228j5872J84360J29119
19643E36801n2412j67761L6618L9858j5162J68461q3088N0999J9449l476j45978
19632C84309j16859J06365J09291j74920k74759J8186O7245P2411K60159J09217
19622E60645l33j40891q4192Q2935J03002M8513j54955n8179J54613J31073J57216
19611G99447j11697L6502m9095j09559J3755J22095K9929j03724k55451l01119
19601G1083N1352L45576Q8166J4175k176j57872r1394L3632K28954J98801J08241
19590H88538r7590j9474J26445k5289j96957j46019M4052J14149j2921J9447m3764
$$ plain form
19579 650617 542167 373946 284139 77435 227175 541380 651278 329784 269397 384449
19569 384449 521148 614312 763581 493045 317719 350580 625380 1027767 924301 672233
19559 672233 587830 414491 235810 174049 379476 147749 113481 98574 29976 190297
19549 190297 618183 817941 686979 540352 652874 911387 746037 639147 669683 801899
19539 801899 1015725 876564 670764 690561 690796 685541 472355 714453 956505 1073797 1091834
19528 1091834 1002182 964767 920622 1028499 922649 703098 527941 420221 481419 560103
19518 560103 477071 617961 800688 827738 781078 814570 881515 810964 774204 842535 634283
19507 634283 502716 342594 588673 807093 1077868 1032637 733802 741480 660010 618662
$$ packed form
19579F50617j08450j68221q9807k06704J49740L14205J09898l21494o0387J15052
19569C84449J36699R3164J49269k70536j75326L2861K74800M02387j03466k52068
19559F72233q4403j73339j78681o1761K05427k31727l4268j4907o8598J60321
19549A90297M27886J99758j30962j46627J12522K58513j65350j06890L0536J32216
19539H01899K13826j39161k05800J9797K35n255k13186K42098K42052J17292J8037
19528A091834q9652l7415m4145J07877j05850k19551j75157j07720O1198P8684
19518E60103q3032J40890J82727K7050m6660L3492O6945p0551l6760O8331k08252
19507F34283j31567j60122K46079K18420K70775m5231k98835P678q1470m1348
$$ plain form
19497 618662 763171 651148 697943 776057 909440 1054044 615284 607048 625867 602377 553501
19486 553501 518321 263007 356789 666511 715899 917467 944903 887463 857707 857424 767296
19475 767296 622947 591744 373272 428230 659095 780588 772167 847549 963660 862557
19465 862557 806293 1107341 1109362 1092905 1217429 1107048 880887 858368 830006 781386 969923
19454 969923 1181499 1219421 1238618 1152247 1073713 1133104 936521 816414 971942 1015381 1217876
19443 1217876 1259742 1173391 1086315 1088141 1200071 1281114 1209581 1256012 1175669 944949 966427
19432 966427 1025358 1100636 986190 924684 986882 1166000 1507756 1609495 1612323 1415462 1317364
19421 1317364 1499958 1680540 1653862 1651219 1379113 1147766 1248241 1469476 1545404 1455452
$$ packed form
19497F18662J44509j12023M6795P8114J33383J44604m38760q236J8819k3490m8876
19486E53501l5180k55314R3782L09722M9388K01568K7436n7440k9756k83r0128
19475G67296j44349l1203k18472N4958K30865J21493q421P5382J16111j01103
19465H62557n6264L01048K021j6457J24524j10381k26161k2519k8362m8620J88537
19454I69923K11576L7922J9197q6371p8534N9391j96583j20107J55528M3439K02495
19443A217876M1866q6351q7076J826J11930Q1043p1533M6431q0343k30720K1478
19432I66427N8931P5278j14446o1506O2198J79118L41756J01739K828j96861r8098
19421A317364J82594J80582k6678k643k72106k31347J00475K21235P5928q9952
$$ plain form
19411 1455452 1437076 1429719 1334989 1093934 1068824 1408110 1589173 1616260 1771714 1916380
19401 1916380 1918003 2000668 2239254 2402447 2521342 2696395 2356692 2201746 2374497 2461496
19391 2461496 2587484 2632351 2672607 2610630 2553755 2695354 2964777 2995206 3230829 3488624
19381 3488624 3701512 3601643 3633574 3651999 3856221 4026889 4393735 4588489 5278346 5975787
19371 5975787 6505164 7027179 7345721 7453163 7701414 7996438 8492258 9045778 9682302
19362 9682302 10699704 12494245 14995003 18334949 23216836 29124215 34501439 38650361
19354 38650361 41283903 41689046 39379607 36833633 36753451 39736924 45301449 54384845
19346 54384845 69047820 94208135 134565845 184028680 228576893 263520325 284033527
$$ packed form
19411A455452j8376p357r4730k41055k5110L39286J81063K7087J55454J44666
19401A916380J623Q2665K38586J63193J18895J75053l39703j54946J72751Q6999
19391B461496J25988M4867M0256o1977n6875J41599K69423L0429K35623K57795
19381C488624K12888r9869L1931J8425K04222J70668L66846J94754O89857O97441
19371E975787N29377N22015L18542J07442K48251K95024M95820N53520O36524
19362I682302J017402J794541K500758L339946M881887N907379N377224M148922
19354C8650361K633542M05143k309439k545974q0182K983473N564525R083396
19346E4384845J4662975K5160315M0357710M9462835M4548213L4943432K0513202
$$ plain form
19339 284033527 277162574 242173786 203513607 171768543 144242327 120487143 104100629
19332 104100629 97787541 100704692 107884794 113813353 116193134 113534521 103127928 86560261
19324 86560261 71067447 60273405 53305615 48723230 45548648 43060542 41465409 40604433
19316 40604433 40139165 39911822 39720138 39633554 39564211 39511336 39310462 39262883 39911105 41525603
19306 41525603 43877819 47128415 51942625 59831339 71836902 87487005 102954815 114277928
19298 114277928 120649798 120217506 112302850 103080877 100699598 108412846 126916797 154691963
19290 154691963 190227378 234352799 285291385 326559767 343090392 338351858 312403854
19283 312403854 259681930 193895079 145153270 116734632 100133698 90088924 83954593
$$ packed form
19339B84033527o870953l4988788l8660179l1745064k7526216k3755184j6386514
19332A04100629o313088K917151P180102N928559K379781k658613j0406593j6567667
19324H6560261j5492814j0794042o967790m582385l174582k488106j595133q60976
19316D0604433m65268k27343j91684q6584o9343n2875k00874m7579O48222J614498
19306D1525603K352216L250596M814210P888714J2005563J5650103J5467810J1323113
19298A14277928O371870m32292p914656r221973k381279P713248J8503951K7775166
19290A54691963L5535415M4125421N0938586M1268382J6530625m738534k5948004
19283C12403854n2721924o5786851m8741809k8418638j6600934j0044774o134331
$$ plain form
19276 83954593 81167121 81773065 84514395 86727002 87040132 85482603 80326031 72144867
19268 72144867 64392750 59047332 55515429 52993131 51018736 49629174 48544827 48350312
19260 48350312 48498260 49191098 50392624 52008288 54141390 56724041 59965659 64921049
19252 64921049 71967737 82243231 96365077 113581523 131339059 147038732 159802905
19245 159802905 169297936 176454291 184265293 194479971 206598080 217257599 221479649
19238 221479649 217591301 209432514 199790970 190203017 182298832 175270197 167433692 155968864
19230 155968864 139118137 119360738 101227474 87456696 77689976 70457253 64674490
19223 64674490 60090515 56513386 53407816 50638595 48129086 45880292 43847051 41855060
$$ packed form
19276H3954593k787472O05944K741330K212607L13130j557529n156572q181164
19268G2144867p752117n345418l531903k522298j974395j389562j084347j94515
19260D8350312J47948O92838J201526J615664K133102K582651L241618M955390
19252F4921049P046688J0275494J4121846J7216446J7757536J5699673J2764173
19245A59802905R495031P156355P811002J0214678J2118109J0659519M222050
19238B21479649l888348q158787r641544r587953p904185p028635p836505j1464828
19230A55968864j6850727j9757399j8133264j3770778r766720p232723n782763
19223F4674490m583975l577129l105570k769221k509509k248794k033241j991991
$$ plain form
19215 41855060 40345640 39052257 38011961 36848446 35688199 34784234 34085967 32993863
19207 32993863 32269519 31486956 30590411 29760549 29188173 28538577 27879555 27090760 26332656
19198 26332656 25835868 25087240 24069378 23166484 22570143 21785398 21117945 20580956 20126465
19189 20126465 19773007 19272626 18809191 18291601 17995483 17475641 16868494 16417338 16060436
19180 16060436 15798911 15385884 15121078 15056946 14703814 14149747 13884976 13619273 13585059 13353902
19170 13353902 13152650 13022360 12905438 12613845 12560128 12562214 12538379 12048139 11748167 11487307
19160 11487307 11216298 11252007 11272687 10958963 10630763 10499006 10539042 10244241 10055324 10007912
19150 10007912 9843637 9735258 9570208 9444701 9351166 9218670 9152169 8997008 8668954 8636094
$$ packed form
19215D1855060j509420j293383j040296j163515j160247r03965o98267j092104
19207C2993863p24344p82563q96545q29862n72376o49596o59022p88795p58104
19198B6332656m96788p48628j017862r02894n96341p84745o67453n36989m54491
19189B0126465l53458n00381m63435n17590k96118n19842o07147m51156l56902
19180A6060436k61525m13027k64806o4132l53132n54067k64771k65703l4214k31157
19170A3353902k01252j30290j16922k91593n3717K086k3835m90240k99972k60860
19160A1487307k71009L5709K0680l13724l28200j31757M0036k94801j88917m7412
19150A0007912j64275j08379j65050j25507r3535j32496o6501j55161l28054l2860
$$ plain form
19140 8636094 8399313 7990255 7468014 7059559 6800223 6611073 6271177 6452426 6301256
19131 6301256 6251843 6255519 6128661 6077072 6091896 5966119 5766250 5528171 5473244 5259629
19121 5259629 5440278 5566436 5594381 5659569 5676609 5446616 5350225 5263381 5317903 5328894 5087050
19110 5087050 5185745 5109193 5207327 5271735 5332421 5252144 4903615 4695324 4598417 4436684 4195236
19099 4195236 4277185 4697695 4426972 4186563 4101029 4124208 4099448 3993270 4042466 3996831
19089 3996831 3904074 3770752 3464512 3346385 3215007 3191117 3444637 3409237 3250594 3239991
19079 3239991 3146954 3081378 3099997 3148905 3062100 2915257 2653605 2585317 2647486 2901552 3046625
19068 3046625 3041527 3048429 3094921 2975852 2643397 2569518 2758997 2657936 2700014 2645481 2237669
$$ packed form
19140H636094k36781m09058n22241m08455k59336j89150l39896J81249j51170
19131F301256m9413L676j26858n1589J4824j25777j99869k38079n4927k13615
19121E259629J80649J26158K7945O5188J7040k29993r6391q6844N4522J0991k41844
19110E087050R8695p6552R8134O4408O0686q0277l48529k08291r6907j61733k41448
19099D195236Q1949M20510k70723k40409q5534K3179k4760j06178M9196m5635
19089C996831r2757j33322l06240j18127j31378k3890K53520l5400j58643j0603
19079C239991r3037o5576J8619M8908q6805j46843k61652o8288O2169K54066J45073
19068C046625n098O902M6492j19069l32455p3879J89479j01061M2078n4533m07812
$$ plain form
19057 2237669 2162505 2405598 2716449 2570447 2751541 2919059 3040509 3148406 3253231 3126408
19047 3126408 3152831 3291473 3293592 3378426 3429548 3371170 3226698 2956966 2698015 2808561
19037 2808561 2837773 2534594 2341134 2172487 2243405 2274289 2272417 2207553 2164617 2441255 2495672
19026 2495672 2364485 2302762 2170944 1960954 1685011 1760473 1716188 1707242 1769315 1794465 1672966
19015 1672966 1567488 1471290 1442959 1572690 1479274 1658245 1793431 1497273 1318211 1223865
19005 1223865 1405559 1587447 1467249 1381896 1514515 1866328 1837551 1890875 2031441 2058524
18995 2058524 1710357 1479943 1517675 1682671 1765684 1580600 1245913 1143288 1221664 1251169
18985 1251169 1180220 1158601 1180604 1132304 1036793 884501 905463 1128871 1169322 1240367 1488561
$$ packed form
19057B237669p5164K43093L10851j46002J81094J67518J21450J07897J04825j26823
19047C126408K6423J38642K119Q4834N1122n8378j44472k69732k58951J10546
19037B808561K9212l03179j93460j68647P0918L0884j872o4864m2936K76638N4417
19026B495672j31187o1723j31818k09990k75943P5462m4285q946O2073K5150j21499
19015A672966j05478r6198k8331J29731r3416J78971J35186k96158j79062r4346
19005A223865J81694J81888j20198q5353J32619L51813k8777N3324J40566K7083
18995B058524l48167k30414L7732J64996Q3013j85084l34687j02625P8376K9505
18985A251169p0949k1619K2003m8300r5511j52292K0962K23408M0451P1045K48194
$$ plain form
18974 1488561 1548919 1309601 1041101 1042440 1161768 1309883 1387784 1085540 879381 853005
18964 853005 802188 903179 1001128 1445251 1613377 1403424 1207135 981803 764316 926888
18954 926888 904009 927482 1192989 1357166 964946 537712 829790 799220 932733 1247297
18944 1247297 1120049 992304 1184694 1215658 993108 947849 1190714 1399473 1565544 1321357
18934 1321357 1151445 1084500 919026 882698 1216508 1415694 1276331 1416384 1177595 1130108
18924 1130108 1022913 869611 860118 872902 765339 744386 784025 917442 647108 498913
18914 498913 386820 530083 622103 760381 950341 861741 817285 882703 837958 875901 850664
18903 850664 969640 1021805 974073 1180501 1357867 1709788 1684105 1513911 1508681 1899504
$$ packed form
18974A488561O0358k39318k68500J339J19328J48115P7901l02244k06159k6376
18964H53005n0817J00991R7949M44123J68126k09953j96289k25332k17487J62572
18954I26888k2879K3473K65507J64177l92220m27234K92078l0570J33513L14564
18944A247297j27248j27745J92390L0964k22550m5259K42865K08759J66071k44187
18934A321357j69912o6945j65474l6328L33810J99186j39363J40053k38789m7487
18924A130108j07195j53302r493J2784j07563k0953L9639J33417k70334j48195
18914D98913j12093J43263R2020J38278J89960q8600m4456O5418m4745L7943k5237
18903H50664J18976N2165m7732K06428J77366L51921k5683j70194n230L90823
$$ plain form
18893 1899504 1956632 1954404 2209533 2446272 2487668 2513597 2449103 2002021 1706230 1748013 1832222
18882 1832222 1899203 2115340 2120557 1868666 1871574 1894122 1724476 1489371 1339214 1362360 1511935
18871 1511935 1487775 1365978 1313588 1218730 1073251 1280774 1345743 1586454 1850051 1748618
18861 1748618 1378661 1238004 1343089 1368937 1242559 1177959 1351442 1377222 1218650 1042867
18851 1042867 966970 880322 1053703 1223962 1314657 1290158 1157914 1396225 1576743 1814462
18841 1814462 1722021 1500245 1265086 1077238 1322019 1355542 1396114 1644272 1600273 1527343
18831 1527343 1638427 1550248 1562618 1728642 1436855 1233107 1324486 1563385 1766400 1733364
18821 1733364 1468619 1453476 1593693 1636806 1865320 1613498 1368781 1196781 868581 902264
$$ packed form
18893A899504N7128k228K55129K36739M1396K5929o4494m47082k95791M1783Q4209
18882A832222O6981K16137N217k51891K908K2548j69646k35105j50157K3146J49575
18871A511935k4160j21797n2390r4858j45479K07523O4969K40711K63597j01433
18861A748618l69957j40657J05085K5848j26378o4600J73483K5780j58572j75783
18851A042867p5897q6648J73381J70259R0695k4499j32244K38311J80518K37719
18841A814462r2441k21776k35159j87848K44781L3523M0572K48158m3999p2930
18831A527343J11084q8179J2370J66024k91787k03748R1379K38899K03015l3036
18821A733364k64745j5143J40217M3113K28514k51822k44717j72000l28200L3683
$$ plain form
18811 902264 1069709 1215343 1245990 1079743 1135708 1212843 975261 1060434 1234093 1260205
18801 1260205 1098834 1121679 1235467 1050923 734388 548701 829564 887380 1058415 1100370
18791 1100370 1146830 1278797 1139376 1051782 1043522 1067345 1008821 1260660 1476991 1582862
18781 1582862 2022513 2182488 1995162 2049321 2264778 2443400 2472418 2321195 2350652 2233347
18771 2233347 2050360 1899523 1833423 1765527 1796907 2028873 2356732 2565307 2801052 2991305
18761 2991305 3200452 3005625 2482767 2008126 1927764 1902854 1871795 1631946 1762293 1903012
18751 1903012 2055079 2259886 2293635 2096054 1887126 1653506 1413475 1485437 1603680 1468381
18741 1468381 1325266 1290584 1396928 1443805 1236191 1047528 1201175 1327351 1317702 1344305
$$ packed form
18811I02264J67445J45634L0647j66247N5965P7135k37582Q5173J73659K6112
18801A260205j61371K2845J13788j84544l16535j85687K80863N7816J71035M1955
18791A100370M6460J31967j39421q7594q260K3823n8524K51839K16331J05871
18781A582862M39651J59975j87326N4159K15457J78622K9018j51223K9457j17305
18771B233347j82987j50837o6100o7896L1380K31966L27859K08575K35745J90253
18761B991305K09147j94827n22858m74641q0362k4910l1059k39849J30347J40719
18751A903012J52067K04807L3749j97581k08928k33620k40031P1962J18243j35299
18741A468381j43115l4682J06344M6877k07614j88663J53647J26176r649K6603
$$ plain form
18731 1344305 1534343 1722650 1559332 1389426 1593949 1869825 1681134 1595168 1769980 1854715
18721 1854715 1975470 2143622 2176913 2135253 2278205 2607675 2785272 2709044 2930806 2916518
18711 2916518 3099700 3344736 3447534 3518262 3737876 3604800 3383398 3326395 3497524 3682920
18701 3682920 3719749 3687132 3516765 3497643 3488332 3499687 3482660 3399431 3478420 3493546 3252763
18690 3252763 3243473 3262902 3602135 3770042 3526674 3440293 3562014 3804926 4084516 4222001
18680 4222001 4301259 4499291 4401978 4645581 5236164 5395331 5254497 5683006 6099920 6519905
18670 6519905 7122879 8154702 9040500 9916830 10919219 12218609 13335448 14689473 16540445
18661 16540445 19205251 23201330 28231962 33541996 39328714 44560349 47361248 48138636
$$ packed form
18731A344305J90038J88307j63318j69906K04523K75876j88691q5966J74812Q4735
18721A854715J20755J68152L3291m1660J42952L29470J77597p6228K21762j4288
18711B916518J83182K45036J02798P0728K19614j33076k21402n7003J71129J85396
18701C682920L6829l2617j70367j9122r311J1355j7027q3229P8989J5126k40783
18690C252763r290J9429L39233J67907k43368q6381J21721K42912K79590J37485
18680D222001P9258J98032r7313K43603N90583J59167j40834M28509M16914M19985
18670F519905O02974J031823Q85798Q76330J002389J299390J116839J354025J850972
18661A6540445K664806L996079N030632N310034N786718N231635K800899P77388
$$ plain form
18653 48138636 48210275 48091033 48842733 52689547 61022860 75291867 98797123 133562617
18645 133562617 175301011 220557017 265927520 297652339 305743337 295184022 271240415
18638 271240415 233214918 193862909 162158552 139262944 124123076 116633624 115653685
18631 115653685 117953915 121034308 121361378 115704439 105700896 94154575 81022822 69066713
18623 69066713 60477569 54660309 50987137 48126319 45640483 43378407 41592994 40424797
18615 40424797 39478584 38605845 38329599 38574700 38923904 39391026 40274525 41457117 43039833
18606 43039833 45858028 50786323 58101591 67893413 79115664 90540684 100466134 105962384
18598 105962384 106791343 105559647 104669483 106055510 113688291 129121635 151906534 181672532
$$ packed form
18653D8138636P1639j19242P51700L846814Q333313J4269007K3505256L4765494
18645A33562617M1738394M5256006M5370503L1724819Q090998j0559315k3943607
18638B71240415l8025497l9352009l1704357k2895608j5139868p489452r79939
18631A15653685K300230L080393L27070n656939j0003543j1546321j3131753j1956109
18623F9066713q589144n817260l673172k860818k485836k262076j785413j168197
18615D0424797r46213q72739k76246K45101L49204M67122Q83499J182592J582716
18606D3039833K818195M928295P315268R791822J1222251J1425020R925450N496250
18598A05962384Q28959j231696q90164J386027P632781J5433344K2784899K9765998
$$ plain form
18590 181672532 214506859 243003006 264593629 275375787 267556464 240449827 206209539
18583 206209539 170163503 133388264 106285314 89852362 79849020 74012103 71056426
18576 71056426 69575850 69016927 68921154 68203692 65619864 61624165 57042980 52019838 47489337
18567 47489337 44022924 41368888 39133174 37046126 35350935 33446752 31879465 30682527
18559 30682527 29349768 28043026 27135209 26512997 25690420 24936298 24562891 24236420 23601603
18550 23601603 22796573 22313816 21779484 21569172 21087626 20414712 19757854 19005553 18308060
18541 18308060 17999232 17421516 17002878 16875734 16323219 15724852 15384926 15029345 14636911
18532 14636911 14161981 13772110 13483715 13459441 13352781 13103796 12674408 12402554 11915150
$$ packed form
18590A81672532L2834327K8496147K1590623J0782158p819323k7106637l4240288
18583B06209539l6046036l6775239k7102950j6432952j0003342n836917k955677
18576G1056426j480576n58923r5773p17462k583828l995699m581185n023142m530501
18567D7489337l466413k654036k235714k087048j695191j904183j567287j196938
18559C0682527j332759j306742r07817o22212q22577p54122l73407l26471o34817
18550B3601603q05030m82757n34332k10312m81546o72914o56858p52301o97493
18541A8308060l08828n77716m18638j27144n52515n98367l39926l55581l92434
18532A4636911m74930l89871k88395k4274j06660k48985m29388k71854m87404
$$ plain form
18523 11915150 11626414 11488343 11608671 11701870 11620737 11449768 11235042 10708621 10319948 10344162
18513 10344162 10310796 10364324 10084615 9860047 9764632 9695290 9341406 9011117 8957635 9001615
18503 9001615 8671827 8633699 8512635 8450880 8389580 7996101 7775635 7806989 7896135 7866357
18493 7866357 7724903 7607978 7345524 7183835 6972434 6870234 6567351 6335325 6039815
18484 6039815 5838012 5695339 5488413 5402641 5259497 5276083 5315455 5327642 5403429 5357569
18474 5357569 5056900 4869001 4985480 4863245 4592887 4380964 4403787 4496098 4327309 4092432
18464 4092432 4151632 4356794 4308360 4152904 3996627 3916106 3894673 4004710 4246852 4570326
18454 4570326 4400840 4269173 4130397 4016998 3995435 4058456 4213580 4067802 4017746 3750980
$$ packed form
18523A1915150k88736j38071J20328R3199q1133j70969k14726n26421l88673K4214
18513A0344162l3366N3528k79709k24568r5415o9342l53884l30289n3482M3980
18503I001615l29788l8128j21064o1755o1300l93479k20466L1354Q9146k9778
18493G866357j41454j16925k62454j61689k11401j02200l02883k32026k95510
18484F039815k01803j42673k06926q5772j43144J6586L9372J2187P5787m5860
18474E357569l00669j87899J16479j22235k70358k11923K2823R2311j68789k34877
18464D092432N9200K05162m8434j55456j56277q0521k1433J10037K42142L23474
18454D570326j69486j31667j38776j13399k1563O3021J55124j45778n0056k66766
$$ plain form
18444 3750980 3687358 3785321 3516241 3048173 2991887 3180212 3320934 3318455 3195296 3029668
18434 3029668 2850026 3103591 3158047 3027319 2942500 2835186 2640660 2613022 2557985 2735914
18424 2735914 2794575 2689710 2520648 2368462 2449305 2515246 2572559 2278297 1999964 2076035
18414 2076035 2491914 2859339 2949416 2583760 2322980 2396736 2302497 2389671 2495993 2672465
18404 2672465 2708478 2599934 2683222 2844275 2906319 2892585 3069691 3189025 3352097 3614348
18394 3614348 3472959 3225054 3106089 3157214 2765801 2474815 2709939 2553850 2336739 2437249
18384 2437249 2770690 3008637 2954054 2719950 2725350 2973305 2933541 2938985 3129515 3176870 3215744
18373 3215744 3072883 3094461 2998779 2835699 2760442 2870881 2884875 2814970 2657672 2693994
$$ packed form
18444C750980o3622R7963k69080m68068n6286J88325J40722k479j23159j65628
18434C029668j79642K53565N4456j30728q4819j07314j94526k7638n5037J77929
18424B735914N8661j04865j69062j52186Q0843O5941N7313k94262k78333P6071
18414B076035M15879L67425R0077l65656k60780P3756r4239Q7174J06322J76472
18404B672465L6013j08544Q3288J61053O2044j3734J77106J19334J63072K62251
18394C614348j41389k47905j18965N1125l91413k90986K35124j56089k17111J00510
18384B437249L33441K37947n4583k34104N400K47955l9764N444J90530M7355L8874
18373C215744j42861K1578r5682j63080p5257J10439J3994o9905j57298L6322
$$ plain form
18363 2693994 3065664 3314230 3333342 3250860 3142617 3136612 3234880 3297005 3314789 3505140 3516042
18352 3516042 3469456 3378411 3139430 2988627 3119253 3225649 3121721 3052910 3058699 3065758 3206206
18341 3206206 3285614 3293991 3553760 3753882 3858532 4071314 4084534 4233170 4536001 4777088
18331 4777088 5155002 5495500 5860887 6031604 6439701 6479252 6307690 6772381 7194721 7286643
18321 7286643 7457848 7908594 8409300 8637681 9175428 9785242 10129897 10382847 10674643
18312 10674643 11139728 12074974 13323915 14678732 16119983 18112916 20062051 22538275
18304 22538275 26285816 31567693 39809735 52890568 72231350 95587843 114801635
18297 114801635 128084993 134554684 130283810 117695568 113600357 126722543 157760962
$$ packed form
18363B693994L71670K48566J9112q2482j08243o005R8268O2125J7784J90351J0902
18352C516042m6586r1045k38981j50803J30626J06396j03928o8811N789P059J40448
18341C206206P9408Q377K59769K00122J04650K12782J3220J48636L02831K41087
18331D777088L77914L40498L65387J70717M08097L9551j71562M64691M22340R1922
18321G286643J71205M50746N00706K28381N37747O09814L44655K52950K91796
18312A0674643M65085R35246J248941J354817J441251J992933J949135K476224
18304B2538275L747541N281877Q242042J3080833J9340782K3356493J9213792
18297A14801635J3283358O469691m270874j2588242m095211J3122186L1038419
$$ plain form
18290 157760962 197242190 227276929 244113762 245143451 220623150 176885066 143425977
18283 143425977 131246358 135625494 147290512 155223069 157441705 151587834 132262042
18276 132262042 103334506 80269657 65913901 56984649 50744726 46054830 42735984
18269 42735984 39946538 37764103 35941715 34383042 32643444 31099348 29740490 28693196
18261 28693196 27759241 26926107 26131712 25477071 24728132 24208181 23605054 22648132 21633927
18252 21633927 20793932 20169076 19674666 18918689 18417407 17881359 17329092 16710763 16266014
18243 16266014 15713388 15305969 15098889 14644460 14367909 14174246 13774016 13304214 13202628
18234 13202628 12873979 12544553 12301320 11973727 11430276 10915562 10619385 10131054 9995917
$$ packed form
18290A57760962L9481228L0034739J6836833J029689k4520301m3738084l3459089
18283A43425977j2179619M379136J1665018P932557K218636n853871j9325792
18276A32262042k8927536k3064849j4355756q929252o239923m689896l318846
18269D2735984k789446k182435j822388j558673j739598j544096j358858j047294
18261B8693196r33955q33134p94395o54641p48939n19951o03127r56922j014205
18252B1633927q39995o24856m94410p55977n01282n36048n52267o18329m44749
18243A6266014n52626m07419k07080m54429k76551j93663m00230m69802j01586
18234A3202628l28649l29426k43233l27593n43451n14714k96177m88331j35137
$$ plain form
18225 9995917 10242420 10250231 9967938 9637277 9176903 9030140 8893909 9081868 9010410 8771432
18215 8771432 8549012 8393708 8279956 8087252 8174579 8080446 7826570 8007197 8105281 7861108
18205 7861108 7693886 7715235 7456483 7251069 7234742 6947839 6800892 6708997 6785243 7117723
18195 7117723 6821696 6724102 6483396 6185851 5934428 5819461 5929202 5992690 5819575 5698167
18185 5698167 5844418 5767752 5590305 5457330 5605415 5726264 5611779 5274382 5152621 5462161
18175 5462161 5314033 5196591 5458037 5837626 5837148 5792688 5799642 5889755 5974755 6330698 6331886
18164 6331886 6296772 6458982 6982210 7078137 6911668 6853638 7247874 7502981 7678187 7658754
18154 7658754 8012194 8243090 8313785 8299675 8368056 8438036 8806880 9117652 9334424 9492866
$$ packed form
18225I995917K46503P811k82293l30661m60374j46763j36231J87959p1458k38978
18215H771432k22420j55304j13752j92704Q7327r4133k53876J80627R8084k44173
18205G861108j67222K1349k58752k05414j6327k86903j46947r1895P6246L32480
18195G117723k96027r7594k40706k97545k51423j14967J09741O3488j73115j21408
18185E698167J46251p6666j77447j32975J48085J20849j14485l37397j21761L09540
18175E462161j48128j17442K61446L79589m78m4460O954R0113Q5000L55943J188
18164F331886l5114J62210N23228R5927j66469n8030L94236K55107J75206j9433
18154G658754L53440K30896P0695j4110O8381O9980L68844L10772K16772J58442
$$ plain form
18144 9492866 9587197 9881813 10133350 10519457 10848589 11294539 11559636 11758776 12111847 12499361
18134 12499361 12972093 13578240 14269751 15052117 15865979 16572478 17046792 17784730 18814819
18125 18814819 20379132 22551707 24905170 27752581 31651625 36445154 42816899 51525670
18117 51525670 64328213 83237263 107959977 134178261 157688917 178441054 196559889
18110 196559889 213173985 238374941 285522732 354566780 415367791 448869582 454909138
18103 454909138 427831694 356023082 284080400 241735347 219031683 204192581 190210394
18096 190210394 171454209 145378267 119170489 99715506 86585974 77344627 70530750
18089 70530750 65049463 60412792 56867926 53895633 51133810 48733181 46544150 45068938
$$ packed form
18144I492866R4331K94616K51537L86107L29132M45950K65097J99140L53071L87514
18134A2499361M72732O06147O91511P82366Q13862P06499M74314P37938J030089
18125A8814819J564313K172575K353463K847411L899044M793529O371745Q708771
18117E1525670J2802543J8909050K4722714K6218284K3510656K0752137J8118835
18110A96559889J6614096K5200956M7147791O9044048O0801011L3501791O039556
18103D54909138k7077444p1808612p1942682m2345053k2703664j4839102j3982187
18096A90210394j8756185k6075942k6207778j9454983j3129532r241347o813877
18089G0530750n481287m636671l544866k972293k761823k400629k189031j475212
$$ plain form
18081 45068938 43609836 41876487 40521825 39298704 37909493 36700108 35842280 34960727
18073 34960727 33984329 33181128 32506798 31677860 30718280 29460724 28674736 28124432 27855100
18064 27855100 27434423 26588837 25933586 25167527 24548764 23819276 23035731 22257247 21500442
18055 21500442 21049600 20639241 20237889 19779476 19276772 18665881 18205421 17629118 17160418
18046 17160418 16887028 16665762 16131282 15776197 15622031 15348723 14863322 14365905 14000588
18037 14000588 13807062 13612738 13128793 12756951 12641734 12412135 12481682 12433087 12269792 12034238
18027 12034238 11705489 11549597 11329023 11245234 11050915 10722471 10892863 10828618 10652680 10380513
18017 10380513 9939793 9567902 9464756 9460135 9553864 9466279 9321785 9009076 8840605 8566633
$$ packed form
18081D5068938j459102j733349j354662j223121j389211j209385q57828q81553
18073C4960727r76398q03201o74330q28938r59580j257556p85988n50304k69332
18064B7855100m20677q45586o55251p66059o18763p29488p83545p78484p56805
18055B1500442m50842m10359m01352m58413n02704o10891m60460n76303m68700
18046A7160418k73390k21266n34480l55085j54166k73308m85401m97417l65317
18037A4000588j93526j94324m83945l71842j15217k29599O9547m8595j63295k35554
18027A2034238l28749j55892k20574q3789j94319l28444J70392o4245j75938k72167
18017A0380513m40720l71891j03146m621R3729q7585j44494l12709j68471k73972
$$ plain form
18007 8566633 8547055 8208816 7826931 7503845 7343984 7125214 6958479 7061944 6967422 6750094
17997 6750094 6498946 6195896 6262676 6433360 6318337 6144563 6095948 6035926 5970629 6041144
17987 6041144 6049069 6008758 6062727 5959809 5823233 5380080 5458356 5630990 5522461 5368653
17977 5368653 5097913 5002400 5309453 5327474 5071614 4958062 4820089 4657734 4567493 4318503
17967 4318503 4144328 4198761 4241063 4191623 4122294 4095565 3994115 3599864 3428179 3583954
17957 3583954 3723309 3873794 4063756 4200053 4039384 3881017 3800799 3719102 3552013 3619022
17947 3619022 3606716 3570681 3342847 3224699 3099194 2891615 3137695 3297175 3374245 3345169
17937 3345169 3257428 3091601 2983759 2852693 2951582 3230657 3381461 3177967 3150234 3243045
$$ packed form
18007H566633j9578l38239l81885l23086j59861k18770j66735J03465r4522k17328
17997F750094k51148l03050O6780J70684j15023j73774m8615o0022o5297P0515
17987F041144P925m0311N3969j02918j36576m43153P8276J72634j08529j53808
17977E368653k70740r5513L07053J8021k55860j13552j37973j62355r0241k48990
17967D318503j74175N4433M2302m9440o9329k6729j01450l94251j71685J55775
17957C583954J39355J50485J89962J36297j60669j58367q0218q1697j67089O7009
17947C619022j2306l6035k27834j18148j25505k07579K46080J59480P7070k9076
17937C345169q7741j65827j07842j31066R8889K79075J50804k03494k7733R2811
$$ plain form
17927 3243045 3331957 3125976 2999105 3152178 3268546 3390338 3259013 3092907 3118891 2955856
17917 2955856 2872943 2960650 3070792 2979083 2588273 2518635 2515451 2072761 1609925 1837779
17907 1837779 2082619 1947330 1994613 2300611 2452335 2294786 2111564 2000745 2016902 1825547
17897 1825547 1751319 1481519 1349180 1296607 1419958 1519975 1417030 1358670 1408591 1402329
17887 1402329 1433689 1419712 1449356 1619631 1749581 1405548 1348705 1269423 1256339 1220663 1412132
17876 1412132 1548229 1448873 1395135 1126445 1297177 1488509 1401686 1418280 1313483 1413557
17866 1413557 1407662 1575318 1734493 1714528 1566927 1395697 1189334 1202201 1474351 1302212
17856 1302212 1095617 1112025 955327 848987 550879 334305 304771 372820 401794 441289
$$ packed form
17927C243045Q8912k05981j26871J53073J16368J21792j31325j66106K5984j63035
17917B955856q2913Q7707J10142r1709l90810o9638l184m42690m62836K27854
17907A837779K44840j35289M7283L05998J51724j57549j83222j10819J6157j91355
17897A825547p4228k69800j32339n2573J23351J00017j02945n8360M9921o262
17887A402329L1360j3977K9644J70275J29950l44033n6843p9282j3084l5676J91469
17876A412132J36097r9356n3738k68690J70732J91332q6823J6594j04797J00074
17866A413557n895J67656J59175j9965j47601j71230k06363J2867K72150j72139
17856A302212k06595J6408j56698j06340k98108k16574k9534O8049K8974L9495
$$ plain form
17846 441289 518995 651456 940379 1031411 799586 607648 576234 506209 579584 547814 619625
17835 619625 723783 707108 930185 1011540 974065 1186107 1146505 957736 822997 617477
17825 617477 780583 965333 799012 562010 438491 556176 858928 935712 760387 791326
17815 791326 919756 1026078 909710 1102404 1228123 1145315 1194094 938060 904582 1113516
17805 1113516 1159072 1349960 1343465 1305629 1313030 1086417 871923 897021 967137 867373 724764
17794 724764 479387 381609 462821 389396 746402 882391 705477 537489 435111 589165
17784 589165 661540 585017 546779 616863 971646 936814 1015364 1074320 1216131 1088240 1102933
17773 1102933 968782 748013 675244 880785 986711 951023 675913 369607 392777 475914
$$ packed form
17846D41289P7706J32461K88923R1032k31825j91938l1414p0025P3375l1770P1811
17835F19625J04158j6675K23077Q1355l7475K12042l9602j88769j34739k05520
17825F17477J63106J84750j66321k37002j23519J17685L02752P6784j75325L0939
17815G91326J28430J06322j16368J92694J25719q2808M8779k56034l3478K08934
17805A113516M5556J90888o495l7836P401k26613k14494K5098P0116r9764j42609
17794G24764k45377r7778Q1212p3425L57006J35989j76914j67988j02378J54054
17784E89165P2375p6523l8238P0084L54783l4832P8550N8956J41811j27891J4693
17773A102933j34151k20769p2769K05541J05926l5688k75110l06306K3170Q3137
$$ plain form
17763 475914 534551 586822 462793 594128 1166772 1244848 968688 640528 633512 553771 428082
17752 428082 578545 589630 536061 545485 535396 412068 450651 536924 676985 634677 488262
17741 488262 468938 304091 178019 -28709 -235567 -214543 37238 107938 -115771 53760
17731 53760 267824 422634 539452 896367 914922 998161 974916 736810 686745 869248
17721 869248 731042 734120 764280 659236 575876 652552 711398 538711 376430 319891 210305
17710 210305 410730 580899 741330 786588 464048 430937 502028 446066 285217 245651
17700 245651 435451 481646 211450 103358 261089 692919 427132 255884 486140 728689
17690 728689 853731 539310 336059 511527 540920 388536 527513 649048 726115 928827
$$ packed form
17763D75914N8637N2271j24029J31335N72644P8076k76160l28160p016p9741j25689
17752D28082J50463J1085n3569R424j0089j23328L8583Q6273J40061m2308j46415
17741D88262j9324j64847j26072k06728k06858K1024K51781P0700k23709J69531
17731E3760K14064J54810J16818L56915J8555Q3239k3245k38106n0065J82503
17721H69248j38206L078L0160j05044q3360P6676N8846j72687j62281n6539j09586
17710B10305K00425J70169J60431M5258l22540l3111P1091n5962j60849l9566
17700B45651J89800M6195k70196j08092J57731M31830k65787j71248K30256K42549
17690G28689J25042l14421k03251J75468K9393j52384J38977J21535P7067K02712
$$ plain form
17680 928827 1173597 1342412 1189267 939467 567227 477714 674924 936120 963599 870383
17670 870383 796423 720967 614258 597961 592840 532118 842604 862060 979648 880026 846504
17659 846504 762736 513492 706424 948784 693382 491818 345633 65352 -67260 54236
17649 54236 -7651 230950 390594 310061 46474 -42362 151966 374453 374324 435421 320900
17638 320900 488870 361754 417520 316133 -41253 -110867 19670 216681 278527 254475
17628 254475 434720 527120 333222 213617 202927 79267 15216 27992 170082 291931
17618 291931 24825 -138357 -96569 -24153 -29212 279293 448118 244652 365079 244442
17608 244442 -1026 -63929 9941 206278 41330 -248568 -216261 -110435 -24097 185843
$$ packed form
17680I28827K44770J68815j53145k49800l72240q9513J97210K61196K7479r3216
17670H70383p3960p5456j06709j6297n121o0722L10486J9456J17588r9622l3522
17659H46504q3768k49244J92932K42360k55402k01564j46185k80281j32612J21496
17649E4236o1887K38601J59644q0533k63587q8836J94328K22487j29O1097j14521
17638C20900J67970j27116N5766j01387l57386o9614J30537J97011O1846k4052
17628B54475J80245R2400j93898j19605j0690j23660o4051J2776J42090J21849
17618B91931k67106j63182M1788P2416n059L08505J68825k03466J20427j20637
17608B44442k45468o2903P3870J96337j64948k89898L2307J05826Q6338K09940
$$ plain form
17598 185843 199737 73563 15309 64997 141172 257169 518993 483158 378232 343240 184125
17587 184125 42131 93162 292739 281885 73381 -9631 -57739 -200015 -386658 -347750
17577 -347750 -363220 -456281 -300329 -257165 -268007 -112220 -193627 -233853 -148832 -57391 -75751
17566 -75751 -189476 -32995 -64008 -183041 -192617 -24729 52212 45179 26886 146835 19212
17555 19212 -122723 -123631 -16981 393497 638231 538687 275696 116160 394616 240083
17545 240083 -2019 -92402 -144491 -145720 -251834 -532439 -659223 -476220 -240784 -113563
17535 -113563 -164889 -334895 -663015 -535341 -373089 -438541 -333462 -138238 108724 186497
17525 186497 125848 2154 -5552 -14081 57058 -41915 -59659 96207 187648 395314 175822
$$ packed form
17598A85843J3894j26174n8254M9688P6175J15997K61824l5835j04926l4992j59115
17587A84125j41994N1031J99577j0854k08504q3012m8108j42276j86643L8908
17577c47750j5470r3061J55952M3164j0842J55787q1407m0226Q5021R1441j8360
17566g5751j13725J56481l1013j19033r576J67888P6941p033j8293J19949j27623
17555A9212j41935r08J06650M10478K44734r9544k62991j59536K78456j54533
17545B40083k42102r0383n2089j229j06114k80605j26784J83003K35436J27221
17535a13563n1326j70006l28120J27674J62252o5452J05079J95224K46962P7773
17525A86497o0649j23694p706q529P1139r8973j7744J55866R1441K07666k19492
$$ plain form
17514 175822 299151 153959 263494 428265 311995 294106 394093 535333 475801 495216
17504 495216 514173 659370 926555 1085070 1310226 1105254 1079804 1192695 1045757 1003192
17494 1003192 1165925 1392741 1151752 1081618 1103314 948178 985833 632111 451251 570072
17484 570072 445617 281859 170434 110485 176875 229824 153324 153619 80939 92038 176575
17473 176575 191856 148519 195922 305382 432878 323401 115152 -11051 -26535 102098
17463 102098 258725 356319 194705 82729 -104487 -139007 158916 121729 -275521 -116133
17453 -116133 23475 88172 -136361 -47210 210985 131194 156070 288164 194540 203439 436458
17442 436458 624224 775669 1079273 1164548 1349687 1271523 793655 427643 456456 564705
$$ packed form
17514A75822J23329j45192J09535J64771j16270j7889R9987J41240n9532J9415
17504D95216J8957J45197K67185J58515K25156k04972k5450J12891j46938m2565
17494A003192J62733K26816k40989p0134K1696j55136L7655l53722j80860J18821
17484E70072j24455j63758j11425n9949O6390N2949p6500K95p2680J1099Q4537
17473A76575J5281m3337M7403J09460J27496j09477k08249j26203j5484J28633
17463A02098J56627R7594j61614j11976j87216l4520K97923l7187l97250J59388
17453a16133J39608O4697k24533Q9151K58195p9791K4876J32094r3624Q899K33019
17442D36458J87766J51445L03604Q5275J85139p8164m77868l66012K8813J08249
$$ plain form
17432 564705 392598 281136 185810 179616 168082 -70299 -61973 299549 361236 110705 232962
17421 232962 266004 260284 28354 -72252 14109 41031 94313 290443 457661 320994 164187
17410 164187 222392 287362 510032 509588 472752 360381 306082 202817 62842 362946 560606
17399 560606 627612 461091 388461 169144 -92995 16736 59007 177595 236045 171749
17389 171749 188589 267473 304897 133715 155774 51446 118007 252505 247846 76668 114140
17378 114140 206044 227035 297273 190151 -55927 -3744 -5696 -278870 -470389 -562804 -398291
17367 -398291 -145478 -68787 266986 269362 166144 126512 45752 152128 155556 9247 -40042
17356 -40042 3047 -93539 -78272 -71379 -82314 -96923 -167964 -111866 -156758 -123726 24472 -162518
$$ packed form
17432E64705j72107j11462r5326o194j1534k38381Q326L61522O1687k50531J22257
17421B32962L3042n720k31930j00606Q6361K6922N3282J96130J67218j36667j56807
17410A64187N8205O4970K22670m44l6836j12371n4299j03265j39975L00104J97660
17399E60606O7006j66521p2630k19317k62139J09731M2271J18588N8450o4296
17389A71749J6840P8884L7424j71182K2059j04328O6561J34498m659j71178L7472
17378A14140R1904K0991P0238j07122k46078N2183j952k73174j91519r2415J64513
17367c98291K52813P6691L35773K376j03218l9632q0760J06376L428j46309m9289
17356d0042M3089r6586J5267O893j0935j4609p1041N6098m4892L3032J48198j86990
$$ plain form
17344 -162518 -227353 -66478 -44600 -4374 -84716 -232371 -310325 -206502 -131901 22838 93841
17333 93841 -35343 -100221 -86132 84521 37787 10221 -55792 -171746 -28064 361856 345007
17322 345007 310162 90110 -125880 -91234 -3921 -121116 -285580 -416505 -473216 -338909
17312 -338909 -223398 -343652 -297901 -82081 135249 275112 317110 210280 199611 237712
17302 237712 -55124 -218605 -306249 -502844 -458402 -65157 87292 151280 40074 -208810
17292 -208810 -322918 -166390 -172061 -142478 55095 116707 -95060 -396277 -437047 -588274
17282 -588274 -415305 -165253 -227768 39700 123967 182948 402358 122157 -8914 133756
17272 133756 -26757 38111 -47907 -24592 -171478 -162249 -48123 65871 -79070 -29658 60557
$$ packed form
17344a62518o4835J60875K1878M0226q0342j47655p7954J03823P4601J54739P1003
17333I3841j29184o4878J4089J70653m6734k7566o6013j15954J43682L89920j6849
17322C45007l4845k20052k15990L4646Q7313j17195j64464j30925n6711J34307
17312c38909J15511j20254M5751K15820K17330J39863M1998j06830j0669L8101
17302B37712k92836j63481q7644j96595M4442L93245J52449O3988j11206k48884
17292b08810j14108J56528n671K9583J97573O1612k11767l01217m0770j51227
17282e88274J72969K50052o2515K67468Q4267N8981K19410k80201j31071J42670
17272A33756j60513O4868q6018K3315j46886R229J14126J13994j44941M9412R0215
$$ plain form
17261 60557 143543 -45737 63112 236150 151222 -134643 -240740 -264699 -319815 -178144
17251 -178144 -206654 127447 156850 -35713 -201066 18808 -2674 342250 192606 -114816
17241 -114816 102181 385684 347033 265749 124683 152381 168116 174530 100002 196850 92896
17230 92896 1194 -117555 -189830 -21028 78356 39910 95944 22514 16472 -146241 551
17219 551 162176 -104522 -214498 -54423 7605 -39414 -95309 -69381 -152438 -97546 -128525
17208 -128525 -112163 40383 68289 91544 -138761 -82225 10825 -30399 -183579 62461 205760
17197 205760 347740 289622 -13261 -279245 -438803 -349786 -222070 -82442 185367 206846
17187 206846 -30052 -234158 -292136 -257355 -333505 -41757 282476 80580 -122995 -210858
$$ packed form
17261F0557Q2986j89280J08849J73038q4928k85865j06097k3959n5116J41671
17251a78144k8510L34101K9403j92563j65353K19874k1482L44924j49644l07422
17241a14816K16997K83503l8651q1284j41066K7698J5735O414p4528R6848j03954
17230I2896r1702j18749p2275J68802R9384l8446N6034p3430o042j62713J46792
17219E51J61625k66698j09976J60075O2028m7019n5895K5928q3057N4892l0979
17208a28525J6362J52546K7906K3255k30305N6536R3050m1224j53180K46040J43299
17197B05760J41980n8118l02883k65984j59558Q9017J27716J39628K67809K1479
17187B06846k36898k04106n7978L4781p6150K91748L24233k01896k03575q7863
$$ plain form
17177 -210858 -548407 -556426 -450197 -317880 -385039 -400506 -257236 -87587 -7925 58858 -127844
17166 -127844 -79751 -60174 -11823 -242503 -345181 -382737 -297696 -292835 -266818 107654 130290
17155 130290 -41701 -48159 40781 162798 181641 145101 -310088 -353134 -459842 -309726 -80404
17144 -80404 -142072 -84139 -101372 -390089 -98617 66224 146620 144835 -150811 -174633 -135798
17133 -135798 -134309 -224511 -62193 12609 -124989 -163787 -72313 42093 25518 113053 254643
17122 254643 66914 50322 -172625 -261007 -193137 -45940 14818 87803 269706 130220
17112 130220 76308 164298 231630 245920 26544 -88411 -171815 -227001 -171702 72846 203206
17101 203206 -70487 -249766 -188128 -178393 -306350 -249373 -55124 -110106 -332557 -400283 -226250
$$ packed form
17177b10858l37549q019J06229J32317o7159j5467J43270J69649P9662O6783j86702
17166a27844M8093J9577M8351k30680j02678l7556Q5041M861K6017L74472K2636
17155A30290j71991o458Q8940J22017J8843l6540m55189m3046j06708J50116K29322
17144h0404o1668N7933j7233k88717K91472J64841Q0396j785k95646k3822L8835
17133a35798J489r0202J62318P4802j37598l8798R1474J14406j6575Q7535J41590
17122B54643j87729j6592k22947q8382O7870J47197O0758P2985J81903j39486
17112A30220n3912Q7990O7332J4290k19376j14955q3404n5186N5299K44548J30360
17101B03206k73693j79279O1638R735j27957N6977J94249n4982k22451o7726J74033
$$ plain form
17090 -226250 -52961 170676 177377 -139581 -440962 -455142 -443514 -615650 -513447 -309563
17080 -309563 -495876 -739798 -457498 -27765 -5721 86049 281572 102178 -67572 -49247
17070 -49247 97425 158107 164431 138559 396747 160928 -245651 -459700 -392163 18382 -160284
17059 -160284 -175993 -9535 -102109 -10182 73340 185714 195705 17388 -53119 -20945 -27490
17048 -27490 26506 176362 33376 65472 205481 127848 -45067 119435 272054 257375
17038 257375 185730 286560 319805 434231 389216 443083 237257 73957 321002 453998
17028 453998 334538 354095 172144 65881 161968 476316 453740 207164 295334 399331
17018 399331 93941 -109870 -238957 -189523 -250389 -171935 -72324 131496 257557 573360
$$ packed form
17090b26250J73289K23637O701l16958l01381j4180J1628j72136J02203K03884
17080c09563j86313k43922K82300M29733K2044R1770J95523j79394j69750J8325
17070d9247J46672O0682O324k5872K58188k35819m06579k14049O7537M10545j78666
17059a60284j5709J66458r2574R1927Q3522J12374R991j78317p0507L2174o545
17048b7490N3996J49856j42986L2096J40009p7633j72915J64502J52619j4679
17038B57375p1645J00830L3245J14426m5015N3867k05826j63300K47045J32996
17028D53998j19460J9557j81951j06263R6087L14348k2576k46576Q8170J03997
17018C99331l05390k03811j29087M9434o0866P8454R9611K03820J26061L15803
$$ plain form
17008 573360 588618 287509 161338 117888 -1205 -14143 145004 754 -215574 -422946
16998 -422946 -433215 -398018 -270735 -279011 -67952 280591 794264 738863 389408 134540
16988 134540 67027 -79030 -200194 -116083 38036 139831 142530 510209 666063 444545
16978 444545 -49754 19106 57857 -90466 -242899 -377166 -114135 80875 53295 -215354
16968 -215354 -279848 38427 38368 -11602 111760 215468 -64944 -15042 188924 85842 -114535
16957 -114535 -137938 -99737 8062 55696 73541 235446 203944 -71380 -107490 -149682 -347301
16946 -347301 -327694 -399824 -464693 -119367 21450 73159 131461 86110 -38259 -89491 -91458
16935 -91458 110460 208819 -121331 -519867 -435192 -196313 55882 214378 339120 432023
$$ packed form
17008E73360J5258l01109j26171m3450j19093j2938J59147j44250k16328k07372
16998d22946j0269L5197J27283q276K11059L48543N13673n5401l49455k54868
16988A34540o7513j46057j21164Q4111J54119J01795K699L67679J55854k21518
16978D44545m94299O8860L8751j48323j52433j34267K63031J95010k7580k68649
16968b15354o4494L18275n9m9970J23362J03708k80412M9902K03966j03082k00377
16957a14535k3403L8201J07799M7634J7845J61905l1502k75324l6110m2192j97619
16946c47301J9607p2130o4869L45326J40817N1709N8302m5351j24369n1232j967
16935i1458K01918R8359l30150l98536Q4675K38879K52195J58496J24742R2903
$$ plain form
16925 432023 345710 189330 252807 276582 330497 402533 404830 397927 177509 133799 225269
16914 225269 319415 420484 212335 -14759 42422 53694 120305 41007 -198914 -298441 -222796
16903 -222796 -184961 -99065 112894 -18860 -283393 -342079 -345558 -460178 -427656 -121669 -39756
16892 -39756 6884 119079 44315 -26163 -79248 79098 474889 424040 254203 85269 -4925
16881 -4925 -102012 43591 210325 273330 16698 78487 12126 -75480 77250 148479 -67403
16870 -67403 -158970 -78621 -143157 53133 39636 -107426 -168060 -332865 -420459 -253155 -174502
16859 -174502 -197598 -96575 -67265 32513 228753 241337 284965 284137 121279 -87593 -130581
16848 -130581 243 197767 166910 164176 -29886 -251726 -458376 -472745 -442928 -539033 -364385
$$ packed form
16925D32023q6313j56380O3477K3775N3915P2036K297o903k20418m3710R1470
16914B25269R4146J01069k08149k27094N7181J1272O6611p9298k39921r9527P5645
16903b22796L7835Q5896K11959j31754k64533n8686l479j14620L2522L05987Q1913
16892c9756M6640J12195p4764p0478n3085J58346L95791n0849j69837j68934r0194
16881d925r7087J45603J66734O3005k56632O1789o6361q7606J52730P1229k15882
16870f7403r1567Q0349o4536J96290j3497j47062o0634j64805q7594J67304P8653
16859a74502k3096J01023K9310R9778J96240J2584M3628q28j62858k08872m2988
16848a30581J30824J97524l0857k734j94062k21840k06650j4369K9817r6105J74648
$$ plain form
16837 -364385 -24103 315113 367584 356909 371306 499211 565538 242541 50870 -19900
16827 -19900 -253199 -306834 -294224 -195703 50107 226046 387279 378476 321253 149646 86114
16816 86114 209502 -18387 -176711 -63183 -63724 79525 194887 288455 38608 -122978
16806 -122978 -10779 133682 276085 96790 -111710 -111653 -9670 -108180 -56240 -237929 -117834
16795 -117834 -10059 5577 83754 -87702 -21825 79298 160756 321826 207127 -86434
16785 -86434 -275109 -244401 -180605 -124678 -249391 -364659 -342872 -402161 -426152 -239292 -113200
16774 -113200 45117 356286 292071 208312 134021 -201002 -90644 167052 157454 -4151
16764 -4151 145123 117693 -85742 -31607 -127060 -424568 -239427 -170118 -161202 -171288 -151405
$$ packed form
16837c64385L40282L39216N2471j0675J4397J27905O6327l22997j91671p0770
16827a9900k33299n3635J2610R8521K45810J75939J61233q803n7223j71607o3532
16816H6114J23388k27889j58324J13528n41J43249J15362R3568k49847j61586
16806a22978J12199J44461J42403j79295k08500N7J01983r8510N1940j81689J20095
16795a17834J07775J5636P8177j71456O5877J01123Q1458J61070j14699k93561
16785h6434j88675L0708O3796N5927j24713j15268K1787n9289k3991J86860J26092
16774a13200J58317L11169o4215q3759p4291l35023J10358K57696r598j61605
16764d151J49274k7430k03435N4135r5453k97508J85141O9309Q916j0086J9883
$$ plain form
16753 -151405 -166615 -315006 -380953 -383338 -507577 -386251 -389472 -493504 -345314 -205377 -306267
16742 -306267 -556309 -427616 -287328 17967 -5627 -149158 -146848 -156535 -426507 -299049
16732 -299049 -204657 -347200 -484108 -681077 -502922 -489200 -348913 -334858 -338393 -103580
16722 -103580 22494 -126853 -336811 -348013 -392213 -292341 -201599 -323064 -397340 -145543
16712 -145543 81258 29119 -186266 -365579 -413042 -303728 -320683 -206167 -57695 -98733
16702 -98733 -32291 79944 68862 50388 -54987 8323 80110 36086 -79533 46837 -145364
16691 -145364 -153811 -134844 150094 509108 464645 141327 101732 15490 -47351 178287 204855
16680 204855 26649 -378 -237496 -263407 -334398 -269958 -260975 -68376 -7061 -5338 -175168
$$ packed form
16753a51405j5210j48391o5947k385j24239J21326l221j04032J48190J39937j00890
16742c06267k50042J28693J40288L05295k3594j43531K310r687k69972J27458
16732b99049R4392j42543j36908j96969J78155J3722J40287J4055l535K34813
16722a03580J26074j49347k09958j1202m4200R9872R0742j21465p4276K51797
16712a45543K26801n2139k15385j79313m7463J09314j6955J14516J48472m1038
16702i8733O6442J12235j1082j8474j05375O3310P1787m4024j15619J26370j92201
16691a45364q447J8967K84938L59014m4463l23318l9595q6242o2841K25638K6568
16680B04855j78206k7027k37118k5911p0991O4440Q983J92599O1315J723j69830
$$ plain form
16669 -175168 -26892 223111 21899 73741 262152 265390 116149 240237 159556 216288
16659 216288 289280 431253 301986 82420 -103622 3703 -181371 -56990 179867 29922
16649 29922 -82187 -290035 -261837 -237003 -336248 -342569 -306640 -293608 -194510 -178382 -219845
16638 -219845 -110710 -3675 -48487 -77954 -168634 -341121 -50711 -179638 -105144 152937
16628 152937 245183 341817 309525 143917 -129063 -160394 9370 138707 -20042 -93830
16618 -93830 -242895 -191444 65588 170314 97466 99985 87161 110144 116782 82191 -9312
16607 -9312 14294 41721 -235473 -293316 -238630 -196731 78174 373915 495473 171716 -43084
16596 -43084 -200498 -146817 -205324 -161732 -293866 -451215 -328104 -76183 394957 350324
$$ packed form
16669a75168J48276K50003k01212N1842J88411L238j49241J24088q0681N6732
16659B16288P2992J41973j29267k19566j86042J07325j85074J24381K36857j49945
16649B9922j12109k07848K8198K4834r9245o321L5929J3032R9098J6128m1463
16638b19845J09135J07035m4812k9467r0680j72487K90410j28927P4494K58081
16628A52937R2246R6634l2292j65608k72980l1331J69764J29337j58749p3788
16618i3830j49065N1451K57032J04726p2848K519j2824K2983O638l4591r1503
16607i312K3606K7427k77194n7843N4686M1899K74905K95741J21558l23757k14800
16596d3084j57414N3681n8507M3592j32134j57349J23111K51921M71140m4633
$$ plain form
16586 350324 308106 216664 134190 211396 119388 12261 -42383 -395661 -466753 -349840 -263241
16575 -263241 -109118 25751 -24455 27379 67764 -77171 -219239 -333325 -654435 -554868
16565 -554868 -166500 -165463 -361403 -506893 -366675 64966 229800 106692 -31998 -17519
16555 -17519 52731 -246425 -285326 -383861 30497 235003 255637 471051 40094 -265175
16545 -265175 -141613 -92248 18340 54355 29828 -46901 -69657 38167 152066 41374
16535 41374 15198 -42157 -115491 89147 117373 135441 28383 -304255 -677433 -549790 -298340
16524 -298340 -67374 206889 192271 187351 361790 266077 67899 974 109003 -99657
16514 -99657 -78929 65956 43142 70417 -45676 -120496 10486 136494 -150162 -208874 108366
$$ packed form
16586C50324m2218r1442q2474P7206r2008j07127n4644l53278p1092J16913Q6599
16575b63241J54123J34869n0206N1834M0385j44935j42068j14086l21110R9567
16565e54868L88368J037j95940j45490J40218M31641J64834j23108j38690J4479
16555a7519P0250k99156l8901r8535M14358K04506K0634K15414m30957l05269
16545b65175J23562M9365J10588L6015k4527p6729k2756J07824J13899j10692
16535D1374k6176n7355p3334K04638K8226J8068j07058l32638l73178J27643K51450
16524b98340K30966K74263j4618m920J74439r5713j98178o6925J08029k08660
16514i9657K0728J44885k2814K7275j16093p4820J30982J26008k86656n8712L17240
$$ plain form
16503 108366 100355 -69355 -29270 70198 45200 -158096 -134870 138419 67104 190253 243848
16492 243848 -36657 -62679 -135714 -260792 -276230 -290588 -212636 -232652 -201740 -106265 -17210
16481 -17210 -127072 75488 242600 117627 94393 164742 130532 -87685 -125319 1131
16471 1131 108012 43101 156607 168676 32355 -2168 255384 151850 217885 327729 27670
16460 27670 -219881 -171453 213234 100236 10528 12712 -27432 -96441 -104660 -269377 -206097
16449 -206097 -20704 76914 140789 31660 -81715 109416 -30644 -125117 -57763 19969
16439 19969 182505 466730 574054 478008 188866 102455 298450 404456 454175 166589
16429 166589 45585 158803 135017 8525 -153779 -134985 -288085 -474238 -334357 -230730
$$ packed form
16503A08366q011j69710M0085R9468k4998k03296K3226K73289p1315J23149N3595
16492B43848k80505k6022p3035j25078j5438j4358P7952k0016L0912R5475Q9055
16481a7210j09862K02560J67112j24973k3234P0349l4210k18217l7634J26450
16471A131J06881o4911J13506J2069j36321l4523K57552j03534O6035J09844l00059
16460B7670k47551M8428L84687j12998q9708K184m0144o9009q219j64717O3280
16449b06097J85393R7618O3875j09129j13375J91131j40060r4473O7354P7732
16439A9969J62536K84225J07324r6046k89142q6411J95995J06006M9719k87586
16429A66589j21004J13218k3786j26492j62304J8794j53100j86153J39881J03627
$$ plain form
16419 -230730 -328449 -448316 -428375 -162744 -38403 -47290 16696 21649 14124 -187567 -315374
16408 -315374 -99570 47359 334277 405916 193533 159856 86777 -73031 -63272 -157102 1327
16397 1327 152638 -78867 103503 126618 -206766 -135493 -30672 76875 259595 213537
16387 213537 249652 310568 204444 298924 399908 285979 123544 -8630 -114433 -214402
16377 -214402 -358086 -286247 -113948 -242053 -328091 47414 307991 145643 -183659 -163438
16367 -163438 -74613 28483 173399 338927 513673 462795 224743 -23169 -30969 -22288 -57514
16356 -57514 69393 -10355 -321203 -270574 -164670 52794 73073 -45029 -22801 202860
16346 202860 190947 219621 48145 -16109 -99392 -228204 -470824 -676893 -403113 -90129
$$ packed form
16419b30730r7719j19867J9941K65631J24341q887O3986M953p525k01691j27807
16408c15374K15804J46929K86918P1639k12383l3677p3079j59808R759r3830J58429
16397A327J51311k31505J82370K3115l33384P1273J04821J07547J82720m6058
16387B13537L6115O0916j06124R4480J00984j13929j62435j32174j05803r9969
16377b14402j43684P1839J72299j28105q6038L75505K60577j62348l29302K0221
16367a63438Q8825J03096J44916J65528J74746n0878k38052k47912p800Q681l5226
16356e7514J26907p9748l10848N0629J05904K17464K0279j18102K2228K25661
16346B02860j1913K8674j71476o4254q3283j28812k42620k06069K73780L12984
$$ plain form
16336 -90129 -71500 -91878 -29695 -42907 -268264 -291001 42548 209188 185658 -14868 -13835
16325 -13835 11220 -193978 -216438 -278032 -332848 -228352 -76198 -56504 -114360 -374011 -447149
16314 -447149 -595687 -285463 70421 65237 38701 -106292 -398375 -434140 -218031 -204698
16304 -204698 -284413 -416578 -160432 -129749 -153712 -259820 -226457 -140787 9485 51800 56551
16293 56551 20788 -203264 -200115 -186924 -280145 -246049 -61505 -148957 -303389 -541057 -395530
16282 -395530 -343347 -486569 -524811 -490603 -221788 -218672 -281131 -2864 45414 39874 44636
16271 44636 -90930 -227552 138037 392368 287690 288953 147313 57986 101487 91267 282475
16260 282475 308304 411057 333820 238439 113242 68644 -98172 52293 -52524 -216482
$$ packed form
16336i0129J8629k0378O2183j3212k25357k2737L33549J66640k3530k00526J033
16325a3835K5055k05198k2460o1594n4816J04496J52154J9694n7856k59651p3138
16314d47149j48538L10224L55884n184k6536j44993k92083l5765K16109J3333
16304b04698p9715j32165K56146L0683k3963j06108L3363Q5670J50272M2315M751
16293E6551l5763k24052L149J3191r3221L4096J84544q7452j54432k37668J45527
16282c95530N2183j43222l8242L4208K68815L116o2459K78267M8278n540M762
16271D4636j35566j36622L65589K54331j04678J263j41640q9327M3501j0220J91208
16260B82475K5829J02753p7237r5381j25197m4598j66816J50465j04817j63958
$$ plain form
16250 -216482 -184124 552 68998 55555 -174409 -198786 49991 16136 19949 113545 8691
16239 8691 51595 -57940 -77410 8164 -92895 -383811 -146000 -23727 -228723 -311563 -299952
16228 -299952 -443019 -628079 -428318 -361149 -205400 114698 161294 -49280 147167 224489
16218 224489 -152363 -508589 -666023 -518005 -477004 -448523 -281607 -300008 -173675 27648
16208 27648 85039 -82603 12484 -145366 -358128 -221899 -281732 -258539 -172664 -339078 -204250
16197 -204250 -86225 -201291 -171904 16987 112023 -179877 -264353 -109272 21406 146784
16187 146784 140335 81868 -36086 -88857 -186207 -147808 7882 -2432 -418500 -384961 -221726
16176 -221726 -297661 -328761 -447520 -350263 -154434 -215010 -314501 -394684 -163123 -186049 -246773
$$ packed form
16250b16482L2358J84676O8446j3443k29964k4377K48777l3855L813R3596j04854
16239H691M2904j09535j9470Q5574j01059k90916K37811J22273k04996q2840J1611
16228b99952j43067j85060J99761O7169J55749L20098M6596k10574J96447P7322
16218B24489l76852l56226j57434J48018M1001K8481J66916j8401J26333K01323
16208B7648N7391j67642R5087j57850k12762J36229n9833K3193Q5875j66414J34828
16197b04250J18025j15066K9387J88891R5036k91900q4476J55081J30678J25378
16187A46784o449n8467j17954n2771r7350L8399J55690j0314m16068L3539J63235
16176b21726p5935l1100j18759R7257J95829o0576r9491q0183K31561k2926o0724
$$ plain form
16165 -246773 -220315 -152160 -152562 42293 136775 23662 14151 -127439 33328 100334 39916
16154 39916 125994 26536 -16988 -160063 -244029 -399491 -156938 -121656 -121496 -87191 36097
16143 36097 126332 102688 -167643 -90457 20420 65734 132721 60281 -34103 -183907 -378823
16132 -378823 -297723 -384198 -379254 -384315 -212684 -112057 -152937 -181370 -168771 -178971 168955
16121 168955 275061 175291 240459 254878 26801 184014 167425 -10917 -5929 -51411 -173923
16110 -173923 -54344 74902 -171171 -221533 113849 148149 -103803 -165554 -57945 67659
16100 67659 132890 237787 229944 117430 81720 122044 166716 -41734 -13988 -49451 -87872
16089 -87872 -161181 -68620 40541 -12026 -88006 -8256 -107746 -306834 -50568 23911 -128170
$$ packed form
16165b46773K6458O8155m02J94855R4482j13113r511j41590J60767O7006o0418
16154C9916Q6078r9458m3524j43075q3966j55462K42553L5282J60L4305J23288
16143C6097R0235k3644k70331P7186J10877M5314O6987p2440r4384j49804j94916
16132c78823Q1100q6475M944n061J71631J00627m0880k8433J2599j0200L47926
16121A68955J06106r9770O5168J4419k28077J57213j6589j78342M988m5482j22512
16110a73923J19579J29246k46073n0362L35382L4300k51952o1751J07609J25604
16100F7659O5231J04897p843j12514l5710M0324M4672k08450K7746l5463l8421
16089h7872p3309R2561J09161n2567p5980P9750r9490j99088K56266P4479j52081
$$ plain form
16078 -128170 -328701 -270092 -211831 -144905 -66092 144838 234795 275315 245138 160870 68739
16067 68739 80308 252543 298400 376943 475831 561272 509813 250450 333097 340457 193484
16056 193484 225154 203629 308765 369727 196629 387790 189263 -174509 -320530 -357961
16046 -357961 -421220 -370630 -408534 -140162 -16645 349495 593751 296381 167103 187796
16036 187796 235859 297820 178216 171728 355096 524047 494018 370762 111643 278152
16026 278152 332261 337657 505072 567291 460889 514712 468966 373353 288726 255039 225332
16015 225332 290700 435021 439364 474479 254283 -6133 44778 -42954 54650 298970 52718
16004 52718 -116890 103971 93628 117362 29935 48026 229731 310056 233258 38225 -219709
$$ packed form
16078a28170k00531N8609N8261O6926P8813K10930Q9957M0520l0177q4268r2131
16067F8739J1569J72235M5857P8543R8888Q5441n1459k59363Q2647P360j46973
16056A93484L1670k1525J05136O0962j73098J91161j98527l63772j46021l7431
16046c57961o3259N0590l7904K68372J23517L66140K44256k97370j29278K0693
16036A87796M8063O1961j19604o488J83368J68951l0029j23256k59119J66509
16026B78152N4109N396J67415O2219j06402N3823m5746r5613q4627l3687k9707
16015B25332O5368J44321M343L5115k20196k60416N0911q7732R7604K44320k46252
16004E2718j69608K20861j0343K3734q7427J8091J81705Q0325p6798j95033k57934
$$ plain form
15993 -219709 27690 238221 241341 174797 -90330 -243897 -21051 189725 270885 493905
15983 493905 169745 -94954 -292683 64523 240978 135353 -146103 -118619 -50313 112084
15973 112084 125231 154339 -40572 -284193 -297913 -110594 -86596 -88940 33312 138112 134667
15962 134667 204481 244645 246293 188276 434205 478786 43149 -173323 -149647 -26452 52336
15951 52336 197754 135599 58678 18809 -118069 91140 219248 116876 99363 182126 159307
15940 159307 -39218 -385263 -315180 -236725 -36323 -111976 -38172 118794 73832 -73187
15930 -73187 -34463 -205561 23165 335421 397732 302585 403193 432567 420459 105998 13800
15919 13800 -98126 -119442 -16198 120542 360402 327224 428054 345569 149973 106514
$$ packed form
15993b19709K47399K10531L120o6544k65127j53567K22846K10776Q1160K23020
15983D93905l24160k64699j97729L57206J76455j05625k81456K7484O8306J62397
15973A12084J3147K9108j94911k43621j3720J87319K3998k344J22252J04800l445
15962A34667O9814M0164J648n8017K45929M4581m35637k16472K3676J23195P8788
15951E2336J45418o2155p6921l9869j36878K09209J28108j02372j7513Q2763k2819
15940A59307j98525l46045P0083P8455K00402p5653P3804J56966m4962j47019
15930g3187L8724j71098K28726L12256O2311r5147J00608K9374j2108l14461r2198
15919A3800j11926k1316J03244J36740K39860l3178J00830q2485j95596m3459
$$ plain form
15909 106514 125503 129908 196585 -28056 -99921 107348 -10776 23373 26946 -215129 -318888
15898 -318888 -305890 -232626 -110889 -100225 282491 291335 275439 245403 142582 -37436 -66388
15887 -66388 -127314 -103972 -35506 -158661 -71952 137565 21234 -195224 -76769 -15933 -181104
15876 -181104 -164331 -125035 -19670 -18696 -120126 -264994 -261679 -57531 168668 246832 159774
15865 159774 -67958 -160157 -7692 41077 232025 282403 142316 130246 232857 106937
15855 106937 -78859 -81633 62108 167380 -59163 -138304 295347 328122 237135 45844
15845 45844 -393747 -355555 -156009 135385 82732 -49899 -133551 -188877 103632 319435
15835 319435 208525 46605 -60027 -138015 -279380 -533078 -370938 -89470 177335 478323
$$ packed form
15909A06514J8989M405O6677k24641p1865K07269j18124L4149L573k42075j03759
15898c18888J2998P3264J21737J0664L82716Q844j5896l0036j02821j80018k8952
15887f6388o0926K3342O8466j23155Q6709K09517j16331k16458J18455O0836j65171
15876a81104J6773L9296J05365R74j01430j44868L315K04148K26199P8164q7058
15865A59774k27732r2199J52465M8769J90948N0378j40087j2070J02611j25920
15855A06937j85796k774J43741J05272k26543p9141M33651L2775r0987j91291
15845D5844m39591L8192J99546K91394n2653j32631q3652n5326K92509K15803
15835C19435j10910j61920j06632p7988j41365k53698J62140K81468K66805L00988
$$ plain form
15825 478323 624549 536446 609595 437722 162455 -37953 -118767 -207687 -87285 -69068
15815 -69068 56041 214110 160382 -87789 -344610 -380341 -371532 -171893 54923 -101213
15805 -101213 -315498 -498767 -340517 -185258 164569 314823 106791 -41807 -191257 -56143
15795 -56143 94413 309831 163898 116533 261115 14603 -258596 -303657 -333883 -229633
15785 -229633 10928 -64835 -148897 -238805 -71860 -34291 -112827 -188261 -168638 -204268 -54843
15774 -54843 129202 147695 981 -89426 -77725 -280935 -140974 64658 153045 381161
15764 381161 364807 226029 249463 38226 125516 342717 301292 224228 56229 -7298 50992
15753 50992 -324295 -517456 -377143 -130157 24230 118058 259450 264276 250515 272587 162254
$$ packed form
15825D78323J46226q8103P3149j71873k75267k00408q0814q8920J20402J8217
15815f9068J25109J58069n3728k48171k56821l5731Q809J99639K26816j56136
15805a01213k14285j83269J58250J55259L49827J50254k08032j48598j49450J35114
15795e6143J50556K15418j45933m7365J44582k46512k73199m5061l0226J04250
15785b29633K40561p5763q4062q9908J66945L7569p8536p5434J9623l5630J49425
15774e4843J84045J8493j46714r0407J1701k03210J39961K05632Q8387K28116
15764C81161j6354j38778K3434k11237Q7290K17201m1425p7064j67999o3527N8290
15753E0992l75287j93161J40313K46986J54387R3828J41392M826j3761K2072j10333
$$ plain form
15742 162254 237033 324802 340945 326743 203623 98152 24512 6184 -101086 -345148 -449022
15731 -449022 -218213 -232923 -188542 -241231 -250541 -173202 -123157 -114074 -27645 -80414 -65158 -93270
15719 -93270 -43406 22361 119871 316913 227437 81693 180330 60111 -333762 -349354 -196357
15708 -196357 13403 58607 66824 -60026 -181832 -93207 83564 281003 67501 65623 132813
15697 132813 308363 217336 149510 29035 147041 240694 299255 464025 290479 173802
15687 173802 246146 201852 71456 107333 -110815 -529844 -372896 -78635 148199 400086
15677 400086 327232 79434 96926 -74249 -19048 259193 182590 24755 207905 35962
15667 35962 -24413 19697 10060 -28009 -119871 -156117 -271280 -178458 20608 -46212 -321753
$$ packed form
15742A62254P4779Q7769J6143j4202j23120j05471p3640j8328j07270k44062j03874
15731d49022K30809j4710M4381n2689r310P7339N0045R083Q6429n2769J5256k8112
15719i3270M9864O5767R7510J97042q9476j45744R8637j20219l93873j5592J52997
15708a96357K09760M5204Q217j26850j21806Q8625J76771J97439k13502j878O7190
15697A32813J75550r1027o7826j20475J18006R3653N8561J64770j73546j16677
15687A73802P2344m4294j30396L5877k18148m19029J56948K94261K26834K51887
15677D00086p2854k47798J7492j71175N5201K78241p6603j57835J83150j71943
15667C5962o0375M4110r637l8069r1862l6246j15163R2822J99066o6820k75541
$$ plain form
15656 -321753 -479530 -400642 -282020 -291253 -279698 -360065 -283179 106762 -29353 -300553 -248805
15645 -248805 -65775 -68056 -109161 -199065 -113701 -50943 -130186 -284498 -205733 -74511 37043
15634 37043 22941 -66389 -467717 -667159 -742203 -755514 -710998 -555373 -460919 -451066 -390101
15623 -390101 -316669 -255738 -311915 -418002 -564461 -425259 -277941 -211971 -81263 -57467
15613 -57467 -67506 -27807 17865 -123778 -138610 156714 331632 113890 -71328 -156553 -327818
15602 -327818 -123891 73595 184131 70574 96755 151535 -64308 63305 55822 -189769
15592 -189769 -216173 -273742 -150773 55599 -38427 -205607 -210723 -29308 135426 -70152
15582 -70152 -161879 -145019 -148214 -68844 211024 375703 341288 214228 119373 -89794 -74407
$$ packed form
15656c21753j57777P8888J18622r233J1555q0367P6886L89941j36115k71200N1748
15645b48805J83030k281m1105q9904Q5364O2758p9243j54312P8765J31222J11554
15634C7043j4102q9330m01328j99442p5044j3311M4516J55625R4454R853O0965
15623c90101P3432O0931n6177j06087j46459J39202J47318O5970J30708K3796
15613e7467j0039L9699M5672j41643j4832K95324J74918k17742j85218q5225j71265
15602c27818K03927J97486J10536j13557K6181N4780k15843J27613p483k45591
15592a89769k6404n7569J22969K06372r4026j67180n116J81415J64734k05578
15582g0152r1727J6860l195P9370K79868J64679l4415j27060r4855k09167J5387
$$ plain form
15571 -74407 -100864 -214605 -291395 -142568 10716 170664 251484 242204 85760 140965 64822
15560 64822 -75703 41415 66536 -190734 -306970 -143116 64628 -8982 5459 -68359
15550 -68359 -72555 79199 225168 387307 184714 -149882 -351637 -270820 -323396 -195424
15540 -195424 -20026 -101241 -286564 -438142 -387391 -239704 -163373 -38713 155604 86766
15530 86766 190578 140073 110953 301092 400625 396506 56377 108300 149211 -59070 -194887
15519 -194887 -240504 -297103 -392146 -304633 -56997 -35777 -66764 -76392 -208282 -271691 -164942
15508 -164942 -132906 -173543 -142988 -178041 -31693 -80146 -19590 167562 398455 457057 310532
15497 310532 -22622 -395250 -337432 -260225 -80928 -58401 -195422 -121447 73388 52475
$$ packed form
15571g4407k6457j13741p6790J48827J53284J59948Q0820r280j56444N5205p6143
15560F4822j40525J17118K5121k57270j16236J63854K07744p3610J4441p3818
15550f8359m196J51754J45969J62139k02593l34596k01755Q0817n2576J27972
15540a95424J75398q1215j85323j51578N0751J47687P6331J24660J94317o8838
15530H6766J03812n0505k9120J90139R9533m119l40129N1923M0911k08281j35817
15519a94887m5617n6599r5043Q7513K47636K1220l0987r628j31890o3409J06749
15508a64942L2036m0637L0555l5053J46348m8453O0556J87152K30893N8602j46525
15497C10532l33154l72628N7818P7207J79297K2527j37021P3975J94835k0913
$$ plain form
15487 52475 -149185 -282712 -160633 20946 252849 -15187 -320734 -497258 -501076 -571369
15477 -571369 -712704 -778875 -728702 -546368 -418208 -366686 -244025 -202522 -157716 57660
15467 57660 94748 108757 39185 -23101 19995 14173 -20605 -108390 -61349 73638 97481 481520
15455 481520 543804 182835 154108 124234 75106 -62233 41478 63859 105089 31037 -21845
15444 -21845 279650 433329 423711 368620 150644 85679 86410 -19263 -210237 -42731 125421
15433 125421 -89117 144457 365065 417748 259676 -215784 -82042 121576 112671 -60237
15423 -60237 86201 86114 142099 161066 -52690 -247392 -163623 -76383 -77810 -69427 -198254 -552218
15411 -552218 -647370 -382027 113475 -31034 -88344 -209986 -242764 -147946 -83027 -67241 -304912
$$ packed form
15487E2475k01660j33527J22079J81579K31903k68036l05547j76524l818p0293
15477e71369j41335o6171N0173J82334J28160N1522J22661M1503M4806K15376
15467E7660L7088J4009o9572o2286M3096n822l4778q7785M7041J34987K3843L84039
15455D81520O2284l60969k8727k9874m9128j37339J03711K2381M1230p4052n2882
15444b1845L01495J53679r618n5091k17976o4965P31j05673j90974J67506J68152
15433A25421k14538K33574K20608N2683j58072m75460J33742K03618q905j72908
15423f0237J46438q7N5985J8967k13756j94702Q3769Q7240j427Q383j28827l53964
15411e52218r5152K65343M95502j44509n7310j21642l2778R4818O4919J5786k37671
$$ plain form
15400 -304912 -445613 -451269 -347365 -84034 -98432 55325 67862 157238 177795 75992 267308
15389 267308 184561 26070 76105 85019 94298 51769 -65640 -245287 -83646 307552 290383
15378 290383 267164 95668 128892 117544 -54528 -74730 7623 -120435 -18050 119095
15368 119095 226156 76912 159079 58662 218728 328046 150650 -222944 -406046 -257279
15358 -257279 -102876 -45815 -76472 -90367 -70558 -161396 -245410 -113959 -396985 -413131 -384167
15347 -384167 -598603 -433896 -336102 -343602 -472977 -443897 -332722 -307619 -329969 -215212 -234293
15336 -234293 -187802 -13257 28541 54083 112183 -25698 -169619 -117675 -227965 -65547
15326 -65547 -69691 -144032 58367 209028 100027 -86257 -204419 -193719 18462 188836
$$ packed form
15400c04912j40701n656J03904K63331j4398J53757J2537Q9376K0557j01803J91316
15389B67308q2747j58491N0035Q914R279m2529j17409j79647J61641L91198j7169
15378B90383k3219j71496L3224j1348j72072k0202Q2353j28058J02385J37145
15368A19095J07061j49244Q2167j00417J60066J09318j77396l73594j83102J48767
15358b57279J54403N7061l0657j3895J9809r0838q4014J31451k83026j6146K8964
15347c84167k14436J64707R7794p500j29375K9080J11175K5103k2350J14757j9081
15336b34293M6491J74545M1798K5542N8100j37881j43921N1944j10290J62418
15326f5547m144p4341K02399J50661j09001j86284j18162J0700K12181J70374
$$ plain form
15316 188836 167087 -21354 -95951 52607 312693 380811 297461 321377 352964 207922 83988
15305 83988 217045 304083 183208 -54843 -145759 -60611 26146 140533 93308 157546 215231
15294 215231 204063 244181 118103 99461 43375 288666 269775 89056 144729 -26514 -229139
15283 -229139 -248767 46049 203260 86851 -24956 52714 -49685 -24749 -89758 -96364 76447
15272 76447 353688 549603 509533 401824 148456 -178754 -82357 64737 123005 60940
15262 60940 30590 165062 132905 143322 -79904 -142235 -105929 -220469 -275089 -149262 274681
15251 274681 4371 -324318 -545840 -546421 -130291 -172044 -210193 -239342 -126693 14638 -15405
15240 -15405 152128 148169 46277 109540 211635 197063 205771 237512 188015 -152048 -169074
$$ packed form
15316A88836k1749j88441p4597J48558K60086O8118q3350K3916L1587j45042j23934
15305H3988J33057Q7038j20875k38051r0916Q5148Q6757J14387m7225O4238N7685
15294B15231j1168M0118j26078j8642n6086K45291j8891j80719N5673j71243k02625
15283b29139j9628K94816J57211j16409j11807P7670j02399K4936o5009o606J72811
15272G6447K77241J95915m0070j07709k53368l27210R6397J47094N8268o2065
15262F0940l0350J34472l2157J0417k23226o2331L6306j14540n4620J25827M23943
15251B74681k70310l28689k21522n81M16130m1753l8149k9149J12649J41331l0043
15240a5405J67533l959j01892O3263J02095j4572Q708L1741m9497l40063j7026
$$ plain form
15229 -169074 -208738 -215649 -136837 29540 186957 34944 -16621 -15123 -31173 176247 238071
15218 238071 137610 208818 199806 202160 282509 624073 635680 424873 360382 44738 44749 18895
15206 18895 -53443 -281070 -255005 -17575 -124610 -163373 -139267 -120415 -359540 -358325 -134863
15195 -134863 -185581 -326068 -307022 -305433 -439727 -261841 -12324 132972 15785 161668
15185 161668 304705 262632 27803 -313693 -311587 -174379 -95745 -176247 -230805 39730 104962
15174 104962 -120198 -315135 -164210 -88439 -24583 129239 151269 39465 5366 -129882
15164 -129882 -285564 -281704 -262704 -242863 6187 166926 422157 253468 -97726 -107197 19237
15153 19237 -146025 -148377 -124735 -72165 -170775 -332497 -491656 -578693 -289001 49850 123921
$$ packed form
15229a69074l9664o911P8812J66377J57417j52013n1565J498j6050K07420O1824
15218B38071j00461P1208r012K354Q0349L41564J1607k10807o4491l15644J1k5854
15206A8895p2338k27627K6065K37430j07035l8763K4106J8852k39125J215K23462
15195a34863n0718j40487J9046J589j34294J77886K49517J45296j17187J45883
15185A61668J43037m2073k34829l41496K106J37208P8634q0502n4558K70535O5232
15174A04962k25160j94937J50925P5771O3856J53822K2030j11804l4099j35248
15164a29882j55682L860J9000J9841K49050J60739K55231j68689l51194r471J26434
15153A9237j65262k352K3642N2570r8610j61722j59159q7037K89692L38851P4071
$$ plain form
15142 123921 94676 80701 -141467 -316618 -146733 85920 99023 -176792 -339900 39428
15132 39428 156922 -25764 -267517 -166860 -243395 -408411 -253183 -42537 65558 86123
15122 86123 34128 60291 -71348 -324278 -322834 -241186 55018 246528 21222 -70472 -20253
15111 -20253 261186 369511 305233 53903 -169984 -66381 299526 231298 88250 114906
15101 114906 119559 215775 45189 20951 350780 256960 -72231 -279257 -121441 59389
15091 59389 135137 93593 -58009 -87800 74143 54516 35398 76474 21288 -3042 -52664
15080 -52664 9563 196036 323274 372877 101257 35591 -157554 -100100 -84968 158135 257172
15069 257172 224896 303621 187634 110146 195881 349306 339393 208344 463984 416811 381083
$$ packed form
15142A23921k9245j3975k22168j75151J69885K32653J3103k75815j63108L79328
15132C9428J17494j82686k41753J00657p6535j65016J55228K10646J08095K0565
15122H6123n1995K6163j31639k52930J444Q1648K96204J91510k25306r1694N0219
15111b0253K81439J08325o4278k51330k23887J03603L65907o8228j43048K6656
15101A14906M653R6216j70586k4238L29829r3820l29191k07026J57816J80830
15091E9389P5748m1544j51602k9791J61943j9627j9118M1076n5186k4330m9622
15080e2664O2227J86473J27238M9603k71620o5666j93145N7454J5132K43103R9037
15069B57172l2276P8725j15987p7488Q5735J53425r913j31049K55640m7173l5728
$$ plain form
15058 381083 128897 84701 122674 234328 224613 -14209 -159168 -59750 -4534 -138250 -345671
15047 -345671 -476249 -298113 -340435 -257236 -110666 -99907 -60711 -150586 -118770 -87347 -268301
15036 -268301 -209855 -70931 -153459 4981 74087 -132216 -227291 -11820 120520 273331
15026 273331 124967 -82053 8572 91892 39005 106182 -10479 -215169 -267029 -75691
15016 -75691 -47842 -271369 -59502 -73060 191085 123614 137390 239971 447006 497450 425297
15005 425297 627940 711490 839578 884628 1009097 1096603 1725126 3333240 5453004 7624772
14995 7624772 9161513 10235733 10109486 8240151 5530467 3605930 2605100 2325433
14987 2325433 2032852 1736340 1460332 1394796 1241162 1062788 940252 873725 791223 602365
$$ packed form
15058C81083k52186m4196L7973J11654r715k38822j44959R9418N5216j33716k07421
15047c45671j30578J78136m2322Q3199J46570J0759L9196q9875L1816L1423j80954
15036b68301N8446J38924q2528J58440O9106k06303r5075K15471J32340J52811
15026B73331j48364k07020R0625Q3320n2887O7177j16661k04690n1860J91338
15016g5691K7849k23527K11867j3558K64145o7471J3776J02581K07035N0444p2153
15005D25297K02643Q3550J28088M5050J24469Q7506O28523J608114K119764K171768
14995G624772J536741J074220j26247j869335k709684j924537j000830k79667
14987B325433k92581k96512k76008o5536j53634j78374j22536o6527q2502j88858
$$ plain form
14977 602365 536016 597495 704919 670206 511360 452440 641704 791311 598775 415121
14967 415121 431002 506685 581753 626998 510047 438142 579592 564746 531270 735066 664756
14956 664756 318345 384812 340120 150433 266668 325674 287707 257929 277504 129620 88050
14945 88050 102894 83869 63118 371448 596589 613564 448152 441077 747274 923662 803790
14934 803790 687447 646290 541625 409350 217122 337092 392586 227488 -96911 -31793
14924 -31793 192938 313303 279065 187989 272721 410617 549647 775582 1034918 430013
14914 430013 -74583 -59862 112700 195261 222229 109105 -151150 -295984 -196162 -308435
14904 -308435 -261430 -234253 -136698 63874 191207 47252 -5373 -97960 -238354 -72538
$$ packed form
14977F02365o6349O1479J07424l4713j58846n8920J89264J49607j92536j83654
14967D15121J5881P5683P5068M5245j16951p1905J41450j4846l3476K03796p0310
14956F64756l46411O6467m4692j89687J16235N9006l7967k9778J9575j47884m1570
14945H8050J4844j9025k0751L08330K25141J6975j65412p075L06197J76388j19872
14934H03790j16343m1157j04665j32275j92228J19970N5494j65098l24399O5118
14924c1793K24731J20365l4238r1076Q4732J37896J39030K25935K59336o04905
14914D30013n04596J4721J72562Q2561K6968j13124k60255j44834R9822j12273
14904c08435M7005K7177R7555K00572J27333j43955n2625r2587j40394J65816
$$ plain form
14894 -72538 81263 148415 115146 30411 108432 185303 208595 15519 -111328 -166508 -173010
14883 -173010 -159385 14768 30770 -69172 -148669 -132103 -239995 -456362 -571590 -294566
14873 -294566 51904 116917 -256156 -238395 -82734 275931 257479 -85309 24552 229194
14863 229194 319766 408667 288472 257681 160450 188165 351056 215505 -99545 -143732 6809
14852 6809 7832 -53852 -67917 -26824 -16554 -144136 19400 88478 -11422 192633 115160
14841 115160 77788 253620 245249 -76754 -213399 123423 236228 -3612 -39276 -24563
14831 -24563 -164518 -47516 -257336 -290000 -218148 -92260 -13960 134274 141602 160407 295429
14820 295429 229987 -54689 -26724 197088 225372 -167691 -334651 -176399 -189304 -235737
$$ packed form
14894g2538J53801O7152l3269q4735P8021P6871K3292j93076j26847n5180o502
14883a73010J3625J74153J6002r9942p9497J6566j07892k16367j15228K77024
14873b94566L46470O5013l73073J7761J55661L58665j8452l42788J09861K04642
14863B29194R0572Q8901j20195l0791r7231K7715J62891j35551l15050m4187J50541
14852F809J023o1684j4065M1093J0270j27582J63536O9078r9900K04055p7473
14841A15160l7372J75832q371l22003j36645L36822J12805k39840l5664J4713
14831b4563j39955J17002k09820l2664P1852J25888P8300J48234P328J8805J35022
14820B95429o5442k84676K7965K23812K8284l93063j66960J58252j2905m6433
$$ plain form
14810 -235737 -316459 -285829 -365775 -491707 -463359 -238368 -204396 -67771 -262375 -58522
14800 -58522 -31752 -45345 252671 550034 412760 -32928 -266092 -150343 -129263 -126091 34429
14789 34429 137505 237897 14024 -70463 30406 -180206 -229815 -280631 -123553 205331
14779 205331 362120 420961 232937 154630 281031 396703 316241 334515 179569 190695
14769 190695 325434 250282 -120977 -325360 -238739 -4162 176473 220910 330935 -5880
14759 -5880 -177168 -42371 121183 -106497 -284760 -275700 -252257 -445629 -319090 -254197 -88800
14748 -88800 50519 111081 56478 15129 -34959 126546 375157 304219 -61101 -73887 -137778
14737 -137778 -208016 -418884 -414070 -485642 -386366 -415274 -413249 -109882 -95112 72728 -37575
$$ packed form
14810b35737q0722L0630p9946j25932K8348K24991L3972J36625j94604K03853
14800e8522K6770j3593K98016K97363j37274m45688k33164J15749K1080L172J60520
14789C4429J03076J00392k23873q4487J00869k10612m9609n0816J57078L28884
14779B05331J56789N8841j88024p8307J26401J15672q0462J8274j54946J1126
14769A90695J34739p5152l71259k04383Q6621K34577J80635M4437J10025l36815
14759e880j71288J34797J63554k27680j78263R060K3443j93372J26539O4893J65397
14748h8800J39319O0562n4603m1349n0088J61505K48611p0938l65320j2786o3891
14737a37778p0238k10868M814p1572R9276k8908K025L03367J4770J67840j10303
$$ plain form
14726 -37575 -449244 -556006 -208799 115036 169906 268371 347743 134102 160109 321186
14716 321186 431486 306620 142241 -37922 -159635 -289097 -177609 -139848 -7242 -22427
14706 -22427 -62455 -10090 -121675 -76605 -145663 16255 130336 164212 201068 110844 113648
14695 113648 -41668 38791 -113245 -157779 -215494 -201755 -47080 190195 286353 82857
14685 82857 -55485 -35832 -186845 -295555 -102214 -104194 -101697 -300926 -369099 -302855 -228695
14674 -228695 -210187 -210689 -42607 -65607 84551 212878 120058 118535 -71676 85234 120463
14663 120463 73189 -105581 26540 158715 109724 48549 -228441 -81486 172416 -34314
14653 -34314 -71432 62257 82667 -91997 -124687 -143477 -80992 55247 35565 -62851 43302
$$ packed form
14726c7575m11669j06762L47207L23835N4870R8465P9372k13641K6007J61077
14716C21186J10300j24866j64379j80163j21713j29462J11488L7761J32606j5185
14706b2427m0028N2365j11585M5070o9058J61918J14081L3876L6856r0224K804
14695A13648j55316Q0459j52036m4534n7715J3739J54675K37275R6158k03496
14685H2857j38342J9653j51013j08710J93341j980K497j99229o8173O6244P4160
14674b28695J8508n02J68082k3000J50158J28327r2820j523j90211J56910L5229
14663A20463m7274j78770J32121J32175m8991o1175k76990J46955K53902k06730
14653c4314l7118J33689K0410j74664l2690j8790O2485J36239j9682r8416J06153
$$ plain form
14642 43302 -55208 -149991 -5439 69327 141207 87751 -191771 -258224 -101100 -53244 -126925
14631 -126925 -20216 199611 177517 212077 232872 163189 196933 98780 58585 292023 495989
14620 495989 398904 131290 84561 175359 297735 277092 390726 158968 115022 413521
14610 413521 533752 335898 25346 73929 163229 21657 -103416 -65868 -32114 28607
14600 28607 175117 247521 139783 -123063 -106292 108621 278606 197586 318218 273878
14590 273878 133140 -77799 -157332 -162662 -279254 -288418 -252409 -277536 -324812 -319222 -352474
14579 -352474 -194115 -266983 -231750 -169066 -139239 -133870 70491 213709 122239 63451 82385
14568 82385 -9220 -243224 -453705 -431199 -65648 -15424 -38153 -97021 -286723 -326856 -136629
$$ packed form
14642D3302r8510r4783J44552P4766P1880n3456k79522o6453J57124M7856p3681
14631a26925J06709K19827k2094L4560K0795o9683L3744r8153m0195K33438K03966
14620D95989r7085k67614m6729R0798J22376k0643J13634k31758m3946K98499
14610D13521J20231j97854l10552M8583Q9300j41572j25073L7548L3754O0721
14600B8607J46510P2404j07738k62846J6771K14913J69985q1020J20632m4340
14590B73878j40738k10939p9533n330j16592r164L6009k5127m7276N590l3252
14579c52474J58359p2868L5233O2684K9827N369K04361J43218r1470n8788J8934
14568H2385r1605k34004k10481K2506L65551N0224k2729n8868j89702m0133J90227
$$ plain form
14557 -136629 124037 -84122 -63741 -194152 -253145 -189783 -215824 -132803 59829 -118299
14547 -118299 -189023 -126254 -138947 -179335 -305519 -437497 -443975 -149075 -94899 -138609 276917
14536 276917 222562 64297 -196663 1489 248249 259264 148747 -73970 4195 165123
14526 165123 246168 115768 -2739 -162707 -356397 -317985 67868 30573 -33406 -129509
14516 -129509 -155895 -200636 -209417 -31569 -113493 -113008 167279 101227 271509 270810 35468 35311
14504 35311 184542 214080 3750 3116 150474 24487 -40397 -187752 -309701 -290200 -177542
14493 -177542 -320238 -32904 439127 239685 2366 -7527 33765 93706 161947 74780 -301258
14482 -301258 -564833 -593308 -415839 -136341 -98409 -149305 -55104 -245094 -306921 -304618 -255917
$$ packed form
14557a36629K60666k08159K0381j30411n8993O3362k6041Q3021J92632j78128
14547a18299p0724O2769j2693m0388j26184j31978o478K94900N4176m3710M15526
14536B76917n4355j58265k60960J98152K46760J1015j10517k22717P8165J60928
14526A65123Q1045j30400j18507j59968j93690L8412L85853l7295o3979r6103
14516a29509k6386m4741q781J77848q1924M85K80287o6052J70282o99k35342j57
14504C5311J49231K9538k10330o34J47358j25987o4884j47355j21949J9501J12658
14493a77542j42696K87334M72031j99442k37319r893M1292N9941O8241q7167l76038
14482c01258k63575k8475J77469K79498L7932n0896R4201j89990o1827K303M8701
$$ plain form
14471 -255917 -271634 -258373 -111717 -33745 -47407 -140422 -208497 -127944 75612 -100455 -176566
14460 -176566 -54086 159433 16575 -16607 -77107 -164034 80797 261860 196275 -57919
14450 -57919 -244533 -117761 164209 147306 173629 35014 -328601 -306329 -157738 14163
14440 14163 -19513 -204160 -227734 -91452 -49395 -1324 115772 -3070 -71522 22069 -66950
14429 -66950 -158335 -62223 -55787 -123357 -60584 -171336 -196738 -82018 -189135 -225324 -42512
14418 -42512 -86095 -85308 171463 339387 274042 336680 142778 62816 82172 85485 66058 28990
14406 28990 -20925 182053 381804 145799 -113119 -297704 -215911 -156011 -133548 -105953 -102877
14395 -102877 -158776 -337854 -106919 85929 94034 -50295 -4791 -64770 146010 69576 -164238
$$ packed form
14471b55917j5717J3261J46656P7972j3662r3015o8075Q0553K03556j76067p6111
14460a76566J22480K13519j42858l3182o0500q6927K44831J81063o5585k54194
14450e7919j86614J26772K81970j6903K6323j38615l63615K2272J48591J71901
14440A4163l3676j84647k3574J36282M2057M8071J17096j18842o8452R3591q9019
14429f6950r1385R6112O436o7570O2773j10752k5402J14720j07117l6189J82812
14418d2512m3583P87K56771J67924o5345O2638j93902p9962J9356L313j9427l7068
14406B8990m9915K02978J99751k36005k58918j84585Q1793N9900K2463K7595L076
14395a02877n5899j79078K30935J92848Q105j44329M5504n9979K10780p6434k33814
$$ plain form
14384 -164238 -123788 28020 319940 501168 282740 -114375 -234392 -349188 -583815 -362735
14374 -362735 -65700 -104155 -219633 -121654 -47407 -123884 -210507 -57000 -70425 -77044 46619
14363 46619 114785 137003 198866 292010 217908 173001 263934 221154 190385 216584 351501
14352 351501 177864 256636 347168 416147 313035 -61116 -238834 -143756 -224601 -392667
14342 -392667 -430620 -398106 -350223 -133621 -211554 -494038 -462463 -389842 -49755 165708 160962
14331 160962 113641 281447 298453 277110 95162 18185 262950 95738 -92919 -139226
14321 -139226 -167147 -7457 75729 -53930 -240887 -381199 -405389 -306322 -346307 -487520
14311 -487520 -595794 -385563 -211958 21816 142135 -71398 4211 194600 175902 49131
$$ packed form
14384a64238M0450J51808K91920J81228k18428l97115j20017j14796k34627K21080
14374c62735K97035l8455j15478R7979P4247p6477q6623J53507j3425o619J23663
14363D6619O8166K2218O1863R3144p4102m4907R0933m2780l0769K6199J34917
14352C51501j73637P8772R0532O8979j03112l74151j77718R5078q0845j68066
14342c92667l7953L2514M7883K16602p7933k82484L1575P2621L40087K15463m746
14331A60962m7321J67806J7006k1343j81948p6977K44765j67212j88657m6307
14321a39226k7921J59690Q3186j29659j86957j40312k4190R9067l9985j41213
14311d87520j08274K10231J73605K33774J20319k13533P5609J90389j8698j26771
$$ plain form
14301 49131 121299 -146613 -160874 -124674 -95887 -143027 -399581 -469326 -218366 -148603 -19899
14290 -19899 107473 19813 -115518 4481 -135516 -150236 232155 264224 106984 -26899
14280 -26899 35212 117988 203073 89631 104937 241131 269431 203093 290021 284434 -12667
14269 -12667 -23632 197324 245951 286331 232415 65183 -356957 -318284 -74859 6217 40241
14258 40241 -39959 -28508 87168 133330 33361 -261661 -652255 -730732 -329769 -114500 -204994
14247 -204994 -111674 -124617 -129939 -208820 -296194 -400060 -210132 1755 -34118 -277799 -564141
14236 -564141 -356815 -122569 -282351 -329672 -70915 39218 -12532 -53298 -79535 -69261
14226 -69261 18928 -72431 -216383 -46640 28086 -164909 -182317 243224 370466 268592
$$ packed form
14301D9131P2168k67912j4261L6200K8787m7140k56554o9745K50960O9763J28704
14290a9899J27372q7660j35331J19999j39997j4720L82391L2069j57240j33883
14280b6899O2111Q2776Q5085j13442J5306J36194K8300o6338Q6928n587k97101
14269a2667j0965K20956M8627M0380n3916j67232m22140L8673K43425Q1076L4024
14258D0241q0200J1451J15676M6162r9969k95022l90594p8477M00963K15269r0494
14247b04994R3320j2943n322p8881q7374j03866J89928K11887l5873k43681k86342
14236e64141K07326K34246j59782m7321K58757J10133n1750m0766k6237J0274
14226f9261Q8189r1359j43952J69743P4726j92995j7408M25541J27242j01874
$$ plain form
14216 268592 138726 74975 -150011 -337969 -79732 187180 148840 -31633 -144555 -408235
14206 -408235 -296974 -174694 -171455 -76354 -190284 -258750 -483330 -230933 88392 -110938
14196 -110938 -172388 -2941 307227 447057 446659 323193 171836 165285 69844 40457 151580
14185 151580 -33033 -23865 -55165 -4146 -64514 -86821 222681 476654 571985 181160 45270
14174 45270 164432 109605 88704 61761 42457 -75243 -18317 220636 349272 234713 364681
14163 364681 468028 531886 289188 268803 396041 598618 513870 534535 263290 -84214
14153 -84214 -144918 -164760 -269613 95855 343222 607129 851615 901675 772375 579057
14143 579057 578365 395835 207159 31001 -114754 -119444 -77884 130572 221461 93697 64259
$$ packed form
14216B68592j29866o3751k24986j87958K58237K66912l8340j80473j12922k63680
14206d08235J11261J22280L239R5101j13930o8466k24580K52397L19325j99330
14196a10938o1450J69447L10168J39830l98j23466j51357o551r5441k9387J11123
14185A51580j84613R168l1300N1019o0368k2307L09502K53973R5331l90825j35890
14174D5270J19162n4827k0901k6943j9304j17700N6926K38953J28636j14559J29968
14163C64681J03347O3858k42698k0385J27238K02577q4748K0665k71245l47504
14153h4214o0704j9842j04853L65468K47367K63907K44486N0060j29300j93318
14143E79057o92j82530j88676j76158j45755m690M1560K08456R0889j27764k9438
$$ plain form
14132 64259 325092 461356 487369 442660 474287 296123 -17271 -20854 -27058 -272427 -278442
14121 -278442 -33347 -146449 -182844 -121554 -94450 -240211 -156558 -60411 -20946 94479 51570
14110 51570 -124516 -6892 139465 288469 286093 122791 -127564 -69177 22767 136453
14100 136453 -23145 -55681 81149 235377 324968 155706 89264 -61621 -168785 82208
14090 82208 220031 192421 286278 350294 11412 -37547 109550 203511 151939 50298 -76297
14079 -76297 316248 252295 184539 51713 -276562 -353020 -68633 130000 -129557 -264683
14069 -264683 -94090 126335 47682 43398 159270 307415 179525 244257 253905 160278 187893
14058 187893 64190 221006 74292 -99637 -449957 -411521 -194056 -258493 -293816 -329865
$$ packed form
14132F4259K60833J36264K6013m4709L1627j78164l13394l583o204k45369o015
14121b78442K45095j13102l6395O1290K7104j45761Q3653R6147L9465J15425m2909
14110E1570j76086J17624J46357J49004k376j63302k50355N8387R1944J13686
14100A36453j59598l2536J36830J54228Q9591j69262o6442j50885j07164K50993
14090H2208J37823k7610R3857O4016l38882m8959J47097R3961n1572j01641j26595
14079g6297L92545o3953o7756j32826l28275p6458K84387J98633k59557j35126
14069b64683J70593K20425p8653m284J15872J48145j27890O4732R648r3627K7615
14058A87893j23703J56816j46714j73929l50320L8436K17465o4437l5323l6049
$$ plain form
14048 -329865 -422502 -164648 -95568 8294 66437 -30872 -174009 -133506 18901 -68356 -221803
14037 -221803 -106195 25451 124994 26345 128824 305993 364124 17972 -112006 128899
14027 128899 -18365 19026 321689 398022 479988 445888 64162 -82317 -99655 -59728 -30384
14016 -30384 936 -75223 -70753 82359 184887 54526 -67610 -249139 -185847 -211385 -128058
14005 -128058 153441 166675 118759 156680 178910 178317 186435 38096 12457 116208 125739 237864
13993 237864 461811 477318 517749 20910 -356347 -390256 -329393 49544 229560 81798
13983 81798 -66321 -131722 -8360 57174 230574 381113 395892 369896 296496 88456 -38967
13972 -38967 -206695 -237859 -83052 158908 121020 283219 434292 379339 224250 165574
$$ packed form
14048c29865r2637K57854O9080J03862N8143r7309j43137M0503J52407q7257j53447
14037b21803J15608J31646R9543r8649J02479J77169N8131l46152j29978K40905
14027A28899j47264L7391L02663P6333Q1966l4100l81726j46479j7338L9927K9344
14016c0384L1320p6159M470J53112J02528j30361j22136j81529O3292k5538Q3327
14005a28058K81499J3234m7916L7921K2230n93Q118j48339k5639J03751R531J12125
13993B37864K23947J5507M0431m96839l77257l3909O0863L78937J80016j47762
13983H1798j48119o5401J23362O5534J73400J50539J4779k5996p3400k08040j27423
13972c8967j67728l1164J54807K41960l7888J62199J51073n4953j55089n8676
$$ plain form
13962 165574 214804 127720 7182 70460 161899 -15284 -220249 -281622 -241777 -376599 -335990
13951 -335990 -79244 177973 279436 130539 140029 236157 342452 215955 172959 155539
13941 155539 -206034 -265988 -304749 -177905 305014 429825 310635 376888 402647 325054
13931 325054 337788 314664 478112 329697 -68688 -121162 -213004 -146152 98808 -39529
13921 -39529 -178892 -64636 -90802 -156315 -127810 -243464 -367154 -166746 -14905 94538
13911 94538 156319 -1056 22012 123736 73756 56182 72701 -74501 -185633 -367736 -504061
13900 -504061 -410036 -170048 -119585 48873 392867 395240 307800 306270 223017 129194 -18637
13889 -18637 33989 124947 252143 158128 -105032 -51211 99430 248099 275341 406869 294629
$$ packed form
13962A65574M9230q7084j20538O3278R1439j77183k04965o1373L9845j34822M0609
13951c35990K56746K57217J01463j48897R490R6128J06295j26497m2996j7420
13941A55539l61573n9954l8761J26844M82919J24811j19190O6253K5759p7593
13931C25054J2734k3124J63448j48415l98385n2474r1842O6852K44960j38337
13921c9529j39363J14256k6166o5513K8505j15654j23690K00408J51841J09443
13911I4538O1781j57375K3068J01724m9980j7574J6519j47202j11132j82103j36325
13900e04061R4025K39988N0463J68458L43994K373q7440j530q3253r3823j47831
13889a8637N2626R0958J27196r4015k63160N3821J50641J48669K7242J31528j12240
$$ plain form
13878 294629 188419 103048 103365 -7632 61425 161076 -20031 59524 53886 42670 42638 264044
13866 264044 324691 239531 108336 52231 164597 472842 231766 49108 -127433 -55520
13856 -55520 69020 163967 38281 -77431 -23931 97028 13878 -37443 151108 208926 189436
13845 189436 -139805 -274463 -199856 -230462 -267683 -328889 -80687 7721 -4600 -93539 -58124
13834 -58124 193323 107578 -8839 -55736 -294896 -286908 -199420 -194392 -57089 -134022 -184384
13823 -184384 -63967 183017 422554 459696 286610 176801 223379 137532 133128 97384 -750
13812 -750 -185504 -400195 -345027 -164951 -135407 -151762 -26883 44817 289927 144050 -6097
13801 -6097 -135606 10199 -33685 -32660 185320 234671 323190 277180 -25522 -193075 -176545
$$ packed form
13878B94629j06210q5371L17j10997O9057R9651j81107P9555n638j1216l2K21406
13866B64044O0647q5160j31195n6105J12366L08245k41076j82658j76541P1913
13856e5520J24540R4947j25686j15712N3500J20959q3150n1321J88551N7818j9490
13845A89436l29241j34658P4607l0606l7221o1206K48202Q8408j2321q8939L5415
13834e8124K51447q5745j16417m6897k39160P988Q7488N028J37303p6933n0362
13823a84384J20417K46984K39537L7142j73086j09809M6578q5847m404l5744r8134
13812g50j84754k14691N5168J80076K9544j6355J24879P1700K45110j45877j50147
13801f097j29509J45805m3884J025K17980M9351Q8519m6010l02702j67553J6530
$$ plain form
13790 -176545 -8646 51946 -87903 -76389 -259993 -107773 23702 -5355 157849 42492
13780 42492 -39607 27974 23361 -111092 -186531 -26223 281905 240084 25315 -129490 -80859
13769 -80859 -93432 -159364 -379951 -329624 -53495 42202 12798 -35920 -255180 -399956 -323839
13758 -323839 -187606 -198538 -407871 -429212 -210171 80601 -71219 -82950 144719 139947
13748 139947 -33295 68708 313877 201917 213281 69477 73265 -94866 -201428 -141663
13738 -141663 -19564 178050 214416 79269 -41813 199151 267273 1702 -67869 -151233
13728 -151233 -367536 -511991 -386385 -165730 -24196 172599 54508 52907 -54602 -59469
13718 -59469 69553 116843 118186 29137 112456 359084 269124 -11311 -168593 660 -29821
$$ packed form
13790a76545J67899O0592j39849J1514j83604J52220J31475k9057J63204j15357
13780D2492q2099O7581m613j34453p5439J60308L08128m1821k14769j54805M8631
13769h0859j2573o5932k20587N0327K76129R5697k9404m8718k19260j44776P6117
13758c23839J36233j0932k09333k1341K19041K90772j51820j1731K27669m772
13748A39947j73242J02003K45169j11960J1364j43804L788j68131j06562N9765
13738a41663J22099J97614L6366j35147j21082K40964O8122k65571o9571q3364
13728a51233k16303j44455J25606K20655J41534J96795j18091j601j07509m867
13718e9469J29022M7290J343q9049Q3319K46628q9960k80435j57282J69253l0481
$$ plain form
13707 -29821 -119241 -207334 -124272 -237169 -149493 -213506 77942 381885 339564 28587 -574509
13696 -574509 -961224 -703896 -479458 -485977 -161349 -5603 215806 251942 207846 104491
13686 104491 169407 176093 148632 236682 173919 54404 73830 33326 111723 306156 318443
13675 318443 352648 233676 -1683 20778 3377 -131536 -154664 -136804 -257874 -25694
13665 -25694 365930 245800 -119465 -291134 -182794 158375 273032 134924 233113 213522
13655 213522 122042 255181 215109 248494 198293 311266 -20777 -110530 4744 -185914
13645 -185914 -264803 20813 62294 206623 279133 -64193 -234181 -151 223426 368002
13635 368002 443363 291362 256682 430348 617598 466755 406590 470069 240237 229090
$$ packed form
13707b9821q9420q8093Q3062j12897Q7676o4013K91448L03943m2321l10977o03096
13696e74509l86715K57328K24438o519L24628J55746K21409L6136m4096j03355
13686A04491O4916O686k7461Q8050o2763j19515J9426m0504P8397J94433J2287
13675C18443L4205j18972k35359K2461j7401j34913k3128J7860j21070K32180
13665b5694L91624j20130l65265j71669J08340L41169J14657j38108R8189j9591
13655B13522r1480J33139m0072L3385n0201J12973l32043q9753J15274j90658
13645a85914p8889K85616M1481J44329P2510l43326j69988K34030K23577J44576
13635C68002P5361j52001l4680J73666J87250j50843o0165O3479k29832j1147
$$ plain form
13625 229090 263135 87307 -134746 -35613 -68541 -139468 -245210 -60858 330011 533628
13615 533628 354671 307359 292388 -89209 -343371 -285856 90196 163129 150216 304055
13605 304055 260975 174751 76348 216745 218471 112745 -180194 -196279 -222021 -243921 -106996
13594 -106996 -84367 16563 -15961 145663 224213 53459 141307 48585 29426 153035 339197
13583 339197 353870 52908 -204246 -296322 -211441 -12507 4947 76735 119672 170805 238377
13572 238377 113254 -109214 -87709 -143560 -222040 -92792 -147745 -283750 -321387 -268016 -180704
13561 -180704 -165861 98641 9462 -68674 -84302 99989 179519 128126 -63219 50081 14304
13550 14304 -273178 -265432 -283472 -352975 -337876 -209629 17074 223839 62128 -129566 -141654
$$ packed form
13625B29090L4045j75828k22053R9133l2928p0927j05742J84352L90869K03617
13615E33628j78957m7312j4971l81597k54162N7515L76052P2933j2913J53839
13605C04055m3080q6224r8403J40397J726j05726k92939j6085k5742k1900J36925
13594a06996K2629J00930l2524J61624P8550j70754Q7848r2722j9159J23609J86162
13583C39197J4673l00962k57154r2076Q4881J98934J7454P1788M2937N1133O7572
13572B38377j25123k22468K1505n5851p8480J29248n4953j36005l7637N3371Q7312
13561a80704J4843K64502q9179p8136j5628J84291P9530n1393j91345J13300l5777
13550A4304k87482P746j8040o9503J5099J28247K26703K06765j61711j91694j2088
$$ plain form
13539 -141654 -318924 -68540 250257 108201 -52455 -175069 -151448 59085 -84221 -325995
13529 -325995 -38775 56322 36013 145032 -67103 -393099 -159582 -248341 -305424 -33860
13519 -33860 -44043 -140830 -131909 -131595 -101931 -264066 -379717 -294587 -151956 -127792 -126367 -147320
13507 -147320 81156 222832 154610 -120098 47239 126143 7180 160181 133525 111264
13497 111264 42016 -142591 -290798 -120086 100764 -23259 -170990 -137313 -6956 -191608
13487 -191608 -156173 -299229 -421334 -317433 -317583 -187199 -50876 72156 138910 3106
13477 3106 -211667 -180988 4972 -5539 118245 564944 510986 274209 52319 13134 12592
13466 12592 -50215 4291 -64322 86203 -78169 -268832 -160743 -230876 -369465 -461984 -473270
$$ packed form
13539a41654j77270K50384L18797j42056j60656j22614K3621K10533j43306k41774
13529c25995K87220R5097k0309J09019k12135l25996K33517q8759n7083K71564
13519c3860j0183r6787Q921L14K9664j62135j15651Q5130J42631K4164J425k0953
13507a47320K28476J41676o8222k74708J67337P8904j18963J53001k6656k2261
13497A11264o9248j84607j48207J70712K20850j24023j47731L3677J30357j84652
13487a91608L5435j43056j22105J03901j50J30384J36323J23032O6754j35804
13477C106k14773L0679J85960j0511J23784M46699n3958k36777k21890l9185n42
13466A2592o2807N4506o8613J50525j64372j90663J08089p0133j38589r2519j1286
$$ plain form
13455 -473270 -487491 -383615 -209846 2059 73568 152714 99666 81513 198764 395530
13445 395530 259138 99058 60206 -11893 -46517 -229142 -433388 -384026 -90418 -143713
13435 -143713 -126288 287330 548948 509818 256563 168506 576378 432702 -145913 -468760
13425 -468760 -639159 -497260 157691 482455 303750 69064 -53876 -215423 -232055 71269
13415 71269 150394 4160 68386 302913 172287 45449 40623 97858 49897 -153844 44973
13404 44973 177179 198441 -88048 -106022 -41764 -49804 -22309 36564 -61044 -66712 -56833 51541
13392 51541 -52505 -40752 17422 132413 64003 566 -178058 -169513 -32899 164954 122641
13381 122641 239723 287597 359336 335979 230141 38270 -30066 220624 465506 322432
$$ packed form
13455d73270j4221J03876J73769K11905P1509P9146n3048j8153J17251J96766
13445C95530j36392j60080l8852p2099l4624j82625k04246M9362K93608n3295
13435a43713J7425M13618K61618l9130k53255q8057M07872j43676n78615l22847
13425d68760j70399J41899O54951L24764j78705k34686j22940j61547j6632L03324
13415G1269P9125j46234O4226K34527j30626j26838m826N7235m7961k03741J98817
13404D4973J32206K1262k86489j7974O4258q040K7495N8873r7608n668R879J08374
13392E1541j04046J1753N8174J14991o8410o3437j78624Q545J36614J97853m2313
13381A22641J17082M7874P1739k3357j05838j91871o8336K50690K44882j43074
$$ plain form
13371 322432 181994 217682 110521 -37140 -119423 3374 57779 9945 59017 104398 132481
13360 132481 44194 -10520 -165536 -202644 -298329 -335612 -76634 -53085 56988 224992 194818
13349 194818 47586 -82452 -182340 -224431 -187382 -32262 121846 22988 -22984 4316 -83508
13338 -83508 -80579 168876 208565 139629 -65829 111628 83780 192501 336893 205094 120649
13327 120649 76059 -42460 -126906 -453178 -461586 -140835 -130836 -143263 74141 274542 368121
13316 368121 415086 313847 7519 -236894 -290229 -214970 -367625 -358854 -201560 -117848 -151838
13305 -151838 -84567 -13283 152163 27861 148506 125029 -285472 -490876 -233806 -113475
13295 -113475 -42703 -49685 25020 138377 105028 -66675 -169866 113415 262168 229753 186389
$$ packed form
13371C22432j40438L5688j07161j47661q2283J22797N4405m7834M9072M5381K8083
13360A32481q8287n4714j55016l7108r5685l7283K58978K3549J10073J68004l0174
13349A94818j47232j30038r9888m2091L7049J55120J54108r8858m5972K7300q7824
13338h3508K929K49455L9689o8936k05458J77457k7848J08721J44392j31799q4445
13327A20649m4590j18519q4446l26272q408L20751R999j2427K17404K00401R3579
13316C68121M6965j01239l06328k44413n3335P5259j52655Q771J57294Q3712l3990
13305a51838O7271P1284J65446j24302J20645k3477m10501k05404K57070J20331
13295a13475P0772o982P4705J13357l3349j71703j03191K83281J48753l2415m3364
$$ plain form
13284 186389 142158 104401 197454 296004 286408 129679 -63960 -56987 250038 168740 -15496
13273 -15496 -93350 -162055 -119913 -126446 -214396 -226325 -217359 -232600 -194193 -313636 -520015 -322797
13261 -322797 -83455 53647 126445 -94214 44160 36363 -94956 -115368 -30636 138117
13251 138117 232629 66081 61907 240384 405628 266632 -50925 -105657 -160244 -110982 73899
13240 73899 211242 102580 48447 246225 225452 391906 473110 324979 255758 107327
13230 107327 116348 257246 340919 519689 266086 280862 348229 403481 373517 252328 344558
13219 344558 384829 372816 357362 181765 38654 4240 157638 427170 407569 384832 210432
13208 210432 4973 31663 138666 89839 185995 233633 59740 -64465 -66607 -141597 -284709
$$ packed form
13284A86389m4231l7757R3053R8550r596j56729j93639O973L07025q1298j84236
13273a5496p7854o8705M2142o533q7950j1929Q966j5241L8407j19443k06379J97218
13261c22797K39342J37102P2798k20659J38374p797j31319k0412Q4732J68753
13251A38117R4512j66548m174J78477J65244j38996l17557n4732n4587M9262J84881
13240G3899J37343j08662n4133J97778k0773J66454Q1204j48131o9221j48431
13230A07327R021J40898Q3673J78770k53603J4776O7367N5252k9964j21189R2230
13219C44558M0271j2013j5454j75597j43111l4414J53398K69532j9601k2737j74400
13208B10432k05459K6690J07003m8827R6156M7638j73893j24205k142p4990j43112
$$ plain form
13197 -284709 -200406 -74727 381 68198 48187 157216 372402 393812 241784 -93920
13187 -93920 -179724 143885 200473 137014 39194 229749 180933 218114 295460 250059 -55849
13176 -55849 -70760 139690 155563 20362 -110334 -55273 15706 46316 -29641 -105836 -267736
13165 -267736 -174216 -52214 39445 -65021 -19098 122484 290746 477551 464557 133513
13155 133513 97995 276092 231690 -106249 -92916 -266766 -276950 -250245 -195896 -57983 31330
13144 31330 -103013 114242 240910 483441 416856 384951 398982 359130 390737 327867 267834
13133 267834 201826 82038 12917 -65322 49388 -6330 -240262 -339494 -46858 37110 -43455
13122 -43455 -131167 67175 112592 79645 24909 6757 103226 212321 360967 425049 331454
$$ packed form
13197b84709Q4303J25679P5108O7817k0011J09029K15186K1410j52028l35704
13187i3920q5804L23609N6588o3459r7820J90555m8816L7181P7346m5401l05908
13176e5849j4911K10450J5873j35201j30696N5061P0979L0610p5957p6195j61900
13165b67736R3520J22002R1659j04466M5923J41582J68262J86805j2994l31044
13155A33513l5518J78097m4402l37939J3333j73850j0184K6705N4349J37913Q9313
13144C1330j34343K17255J26668K42531o6585l1905J4031l9852L1607o2870o0033
13133B67834o6008j19788o9121p8239J14710n5718k33932r9232K92636Q3968q0565
13122d3455q7712J98342M5417l2947n4736j8152R6469J09095J48646O4082r3595
$$ plain form
13111 331454 425812 566672 571792 504575 366524 477800 439129 272606 70405 -105635
13101 -105635 -271557 -235110 -40931 2972 12685 95216 46825 267393 343169 399538 557619
13090 557619 326648 125819 257240 258265 -20571 -89415 -71250 -60588 -309382 -220266 4839
13079 4839 -28572 -159532 -161740 -223378 -411722 -503859 -398551 -128776 115779 449436 369167
13068 369167 -95301 -224384 100954 214736 140257 -116041 -339631 -263402 101428 -28678
13058 -28678 25985 116862 302352 504257 439222 359276 72037 -1248 -285411 -423824 -440953
13047 -440953 -191066 -26149 95657 136689 168282 35103 36746 37692 435626 422380 180392
13036 180392 195630 273097 147967 -178470 -368065 -107808 89173 53803 -60997 -182496
$$ packed form
13111C31454R4358J40860N120o7217j38051J11276l8671j66523k02201j76040
13101a05635j65922L6447J94179M3903R713Q2531m8391K20568P5776N6369J58081
13090E57619k30971k00829J31421J025k78836o8844J8165J0662k48794Q9116K25105
13079D839l3411j30960k208o1638j88344r2137J05308K69775K44555L33657q0269
13068C69167m64468j29083L25338J13782p4479k56298k23590P6229L64830j30106
13058b8678N4663R0877J85490K01905o5035p9946k87239p3285k84163j38413j7129
13047d40953K49887J64917J21806M1032L1593j33179J643R46L97934j3246k41988
13036A80392J5238P7467j25130l26437j89595K60257J96981l5370j14800j21499
$$ plain form
13026 -182496 -112571 47922 393151 299950 93269 -99694 18724 10133 76455 27017 -40740
13015 -40740 23435 -49757 -33254 75694 162213 199187 -77131 -151607 -52396 131625 250609
13004 250609 208002 277271 100539 92535 93776 235804 187736 218129 218911 119228 155092 195095
12992 195095 63888 77789 54696 -6513 -179088 -91752 166823 273849 58166 -2049
$$ packed form
13026a82496O9925J60493L45229r3201k06681j92963J18418q591O6322m9438o7757
13015d0740O4175p3192J6503J08948Q6519L6974k76318p4476R9211J84021J18984
13004B50609m2607O9269j76732q004J241J42028m8068L0393P82r9683L5864M0003
12992A95095j31207J3901k3093o1209j72575Q7336K58575J07026k15683o0215
$$ [...]
##END NTUPLES=NMR SPECTRUM
##END=
