##TITLE=Analysis number 320496
Compound Code sb 01866
Book Reference b
Project Code adrs
Chemist Name stores
##JCAMPDX= 6.0         $$ Bruker NMR JCAMP-DX V2.0
##DATA TYPE= NMR SPECTRUM
##DATA CLASS= NTUPLES
##ORIGIN= Bruker BioSpin GmbH
##OWNER= nmr
$$ XWIN-NMR		Version 3.5
$$ Tue Jun 27 13:52:20 2006 GMT Daylight Time (UT+1h)  MAYBRIDGE\nmr@NMR_250MHZ
##.OBSERVE FREQUENCY= 250.131544655141
##.OBSERVE NUCLEUS= ^1H
##.ACQUISITION MODE= SIMULTANEOUS (DQD)
##.ACQUISITION SCHEME= undefined
##.AVERAGES= 16
##.DIGITISER RES= 18
##SPECTROMETER/DATA SYSTEM= dpx250
##.PULSE SEQUENCE= zg30
##.SOLVENT NAME= CDCl3
##.SHIFT REFERENCE= (INTERNAL, CDCl3, 0, 16.522)
##AUDIT TRAIL= $$ (NUMBER, WHEN, WHO, WHERE, WHAT)
$$ ##TITLE= Audit trail, XWIN-NMR		Version 3.5
$$ ##JCAMPDX= 5.01
$$ ##ORIGIN= Bruker BioSpin GmbH
$$ ##OWNER= nmr
$$ C:\u/data/dgb/nmr/ADRS/1610/pdata/1/auditp.txt
$$ ##AUDIT TRAIL=  $$ (NUMBER, WHEN, WHO, WHERE, WHAT)
(   1,<2006-06-27 13:51:48.18 +100>,<MAYBRIDGE\nmr>,<NMR_250MHZ>,
      <created by zg, POWCHK disabled, PULCHK disabled
       configuration hash MD5:
       E2 DF 36 D8 04 B2 41 60 5A D7 A3 38 5A 4B D0 FE
       data hash MD5: 64K
       88 07 4D D6 2E 26 3D C6 9D 88 80 97 D4 0A 63 6F>)
(   2,<2006-06-27 13:52:09.04 +100>,<MAYBRIDGE\nmr>,<NMR_250MHZ>,
      <Start of raw data processing
       ef LB = 0.3 FT_mod = 6 PKNL = 1 SI = 32K 
       data hash MD5: 32K
       18 C8 F5 F5 C4 4B BF A9 9B CB 4E 6E 91 62 2B 7A>)
(   3,<2006-06-27 13:52:11.85 +100>,<MAYBRIDGE\nmr>,<NMR_250MHZ>,
      <apk 
       data hash MD5: 32K
       2F 68 51 72 B8 5A AC BE B1 BB C3 14 EC D3 77 50>)
(   4,<2006-06-27 13:52:12.76 +100>,<MAYBRIDGE\nmr>,<NMR_250MHZ>,
      <abs ABSG = 5 
       data hash MD5: 32K
       47 0C 66 1C 5D 9D 3F 11 11 42 B0 85 30 94 00 61>)
$$ ##END=
$$ 
$$ hash MD5
$$ F9 B4 1A 00 9B 0F 93 13 56 07 86 94 FA 8A 9F 25
##$RELAX= 
##$RELAX= 
##$RELAX= 
##$RELAX= 
##$RELAX= 
##$RELAX= 
##$RELAX= 
$$ Bruker specific parameters
$$ --------------------------
##$DU= <C:\u>
##$EXPNO= 1610
##$NAME= <ADRS>
##$PROCNO= 1
##$TYPE= <nmr>
##$USER= <dgb>
##$AMP= (0..31)
100 100 100 100 100 100 100 100 100 100 100 100 100 100 100 100 100 100 
100 100 100 100 100 100 100 100 100 100 100 100 100 100 
##$AQSEQ= 0
##$AQ_mod= 3
##$AUNM= <au_zg>
##$AUTOPOS= <39 >
##$BF1= 250.13
##$BF2= 250.13
##$BF3= 250.13
##$BF4= 250.13
##$BF5= 500.13
##$BF6= 500.13
##$BF7= 500.13
##$BF8= 500.13
##$BYTORDA= 1
##$CFDGTYP= 0
##$CFRGTYP= 5
##$CHEMSTR= <none>
##$CNST= (0..31)
1 1 145 1 1 1 1 1 1 1 1 1 1 1 1 1 1 1 1 1 1 1 1 1 1 1 1 1 1 1 1 1 
##$CPDPRG= <>
##$CPDPRG1= <>
##$CPDPRG2= <>
##$CPDPRG3= <>
##$CPDPRG4= <mlev>
##$CPDPRG5= <mlev>
##$CPDPRG6= <mlev>
##$CPDPRG7= <mlev>
##$CPDPRG8= <mlev>
##$CPDPRGB= <>
##$CPDPRGT= <>
##$D= (0..31)
0 1 0 0 0 0 0 0 0 0.06 0 0 0 0 0 0 0.0002 0 0 0 0 0 0 0 0 0 0 0 0 0 0 
0 
##$DATE= 1151412706
##$DBL= (0..7)
120 120 120 120 120 120 120 120 
##$DBP= (0..7)
150 150 150 150 150 150 150 150 
##$DBP07= 0
##$DBPNAM0= <>
##$DBPNAM1= <>
$$ [...]
##$SUBNAM7= <"">
##$SUBNAM8= <"">
##$SUBNAM9= <"">
##$SW= 20.6930455092707
##$SWIBOX= (0..15)
0 0 3 0 0 0 0 0 0 0 0 0 0 0 0 0 
##$SW_h= 5175.983436853
##$TD= 65536
##$TD0= 1
##$TE= 297.16
##$TE2= 300
##$TE3= 300
##$TEG= 300
##$TL= (0..7)
0 120 120 120 120 120 120 120 
##$TP= (0..7)
150 150 150 150 150 150 150 150 
##$TP07= 0
##$TPNAME0= <>
##$TPNAME1= <>
##$TPNAME2= <>
##$TPNAME3= <>
##$TPNAME4= <>
##$TPNAME5= <>
##$TPNAME6= <>
##$TPNAME7= <>
##$TPOAL= (0..7)
0.5 0.5 0.5 0.5 0.5 0.5 0.5 0.5 
##$TPOFFS= (0..7)
0 0 0 0 0 0 0 0 
##$TUNHIN= 0
##$TUNHOUT= 0
##$TUNXOUT= 0
##$USERA1= <user>
##$USERA2= <user>
##$USERA3= <user>
##$USERA4= <user>
##$USERA5= <user>
##$V9= 5
##$VALIST= <valist>
##$VCLIST= <CCCCCCCCCCCCCCC>
##$VD= 0
##$VDLIST= <DDDDDDDDDDDDDDD>
##$VPLIST= <PPPPPPPPPPPPPPP>
##$VTLIST= <TTTTTTTTTTTTTTT>
##$WBST= 1024
##$WBSW= 4
##$XGAIN= (0..3)
0 0 0 0 
##$XL= 0
##$YL= 0
##$YMAX_a= 646524
##$YMIN_a= -594177
##$ZGOPTNS= <>
##$ZL1= 120
##$ZL2= 120
##$ZL3= 120
##$ZL4= 120
##$ABSF1= 16.522
##$ABSF2= -4.171173
##$ABSG= 5
##$ABSL= 3
##$ALPHA= 0
##$AQORDER= 0
##$ASSFAC= 0
##$ASSFACI= 0
##$ASSFACX= 0
##$ASSWID= 0
##$AUNMP= <proc_1d>
##$AZFE= 0.1
##$AZFW= 0.1
##$BCFW= 0
##$BC_mod= 0
##$BYTORDP= 0
##$COROFFS= 0
##$CY= 12.5
##$DATMOD= 1
##$DC= 0
##$DFILT= <>
##$DTYPP= 0
##$F1P= 14.0000005364418
##$F2P= -0.99999901652339
##$FCOR= 0.5
##$FTSIZE= 32768
##$FT_mod= 6
##$GAMMA= 0
##$GB= 0
##$INTBC= 1
##$INTSCL= 1
##$ISEN= 128
##$LB= 0.3
##$LEV0= 0
##$LPBIN= 0
##$MAXI= 10000
##$MC2= 0
##$MEAN= 0
##$ME_mod= 0
##$MI= 0
##$NCOEF= 0
##$NC_proc= -3
##$NLEV= 6
##$NOISF1= 0
##$NOISF2= 0
##$NSP= 0
##$NTH_PI= 0
##$NZP= 0
##$OFFSET= 16.522
##$PC= 1
##$PHC0= 22.11452
##$PHC1= -1.261639
##$PH_mod= 1
##$PKNL= yes
##$PPARMOD= 0
##$PSCAL= 4
##$PSIGN= 0
##$REVERSE= no
##$SF= 250.13
##$SI= 32768
##$SIGF1= 0
##$SIGF2= 0
##$SINO= 400
##$SIOLD= 32768
##$SREGLST= <1H.CDCl3>
##$SSB= 0
##$STSI= 32768
##$STSR= 0
##$SW_p= 5175.98343685301
##$SYMM= 0
##$S_DEV= 0
##$TDeff= 65536
##$TDoff= 0
##$TI= <Analysis number 999999
Compound Code 99
Book Reference 9
Project Code 9>
##$TILT= no
##$TM1= 0
##$TM2= 0
##$TOPLEV= 0
##$USERP1= <user>
##$USERP2= <user>
##$USERP3= <user>
##$USERP4= <user>
##$USERP5= <user>
##$WDW= 1
##$XDIM= 32768
##$YMAX_p= 473841981
##$YMIN_p= -20097
$$ End of Bruker specific parameters
$$ ---------------------------------
##NTUPLES= NMR SPECTRUM
##VAR_NAME=  FREQUENCY,     SPECTRUM/REAL,   SPECTRUM/IMAG
##SYMBOL=    X,             R,               I
##VAR_TYPE=  INDEPENDENT,   DEPENDENT,       DEPENDENT
##VAR_FORM=  AFFN,          ASDF,            ASDF
##VAR_DIM=   32768,         32768,           32768
##UNITS=     HZ,            ARBITRARY UNITS, ARBITRARY UNITS
##FACTOR=    0.157963299565203, 1,           1
##FIRST=     4132.6476996994, 0,             0
##LAST=      -1043.33573715361, 0,           0
##MIN=       -1043.33573715361, -20097,      0
##MAX=       4132.6476996994, 473841981,     0
$$ Real data points
##PAGE= N=1
##DATA TABLE= (X++(R..R)), XYDATA
$$ [...]
17764A0929j842m79J894J039l13o46j775k915J858K605l422n153J027M042J211
17749H060l233k30j940j8L970J272n824J976R64o82l661O517K949k962k264J494
17733F388J002j18m8l412q21K856J312L619k983J744q22o591M15L77K019J324
17717F261m333L307J303K183Q881r65k468k961l702m298k064J763N98M60k903
17702A062l10O91j592K234N327J622P86m990l394l624j640N078O1J165k048J474
17686A902K218M855l724p002k087m71J428K927K170K970l574j839J002q49j280
17671a354L881M169k46r43mJ302j820J083n683l496K60J724K857k663O93J165
17655I25J050J502M026n16q91J64K098p099m544M616k667m100L662M384m947m895
$$ y = [10929, 9087, 8608, 10502, 11541, 11228, 10582, 8807, 5892, 7750, 10355, 6933, 1780, 2807, 6849, 8060, 4827, 4597, 2657, 2639, 6609, 7881, 2057, 4033, 4997, 4315, 654, 7171, 10120, 7158, 4894, 6388, 7390, 7272, 7224, 3812, 2991, 5847, 7159, 10778, 7795, 9539, 8717, 2126, 2541, 2918, 4937, 6261, 1928, 5235, 6538, 8721, 17602, 16637, 14169, 11208, 7506, 3208, 1144, 2907, 3505, 3965, 1062, 752, 1443, -149, 2085, 7412, 9034, 9820, 4830, 1436, -2188, -3828, 1250, 1311, 2476, 428, 1902, 4120, 8975, 5251, -1751, -3838, -4309, -2881, 46, 2216, 5186, 1612, -227, 775, -74, -1354, 2527, 6696, 6450, 5507, 5503, 6805, 4985, 6068, 385, -3111, -2851, -1127, 1730, -933, -240, 925, 1975, 3477, 7503, 6987, 6096, 6260, 8358, 1259, -3285, 1331, -1336, -5436, -1774, 2610, -2337, -7232]
17639g232J928M050L409M251n517o522k701k23N522N246l984k549L135J996K188
17624B997K231m220N708L070j291q91M37m137m057k892m6j999o45L742r38K371
17608e60L616k176j017K789L321k076J38O43m177n495M590K466p64n102J568L0
17592b206q50M97j099P17Q3j036K343J290n293l042N379N417k690l915M8r9k94
17575d750K48L012Q0P5l187j737K442M277m362m969o430l92K666L859Q102L477
17559B411l506K267O620J752j485r012k934l835J65K899N05m095O94l77L64K597
17543d970M524j012l170p26l967p11k256N502J958k311K004N621J314j228j230
17528f58p08k847l21m53M155j593L627O571l054k269m370K602j197Q3L289l038
$$ y = [-7232, -5304, -1254, 2155, 6406, 889, -5633, -8334, -8557, -3035, 2211, -1773, -4322, -1187, 809, 2997, 5228, 1008, 6716, 9786, 8495, 7604, 8041, 3904, -153, -3045, -3091, -5090, -5735, -1993, -2931, -560, 3056, 880, -137, 2652, 5973, 3897, 4035, 4678, 501, -4994, -404, 2062, 1298, -3804, -2236, -2206, -3056, -2559, -3658, -2941, -2858, -3894, -1551, -261, -5554, -8596, -3217, 2200, -490, -4405, -4357, -4456, -4750, -4502, -1490, -1410, -1335, -4522, -6259, -3817, 460, -3902, -8871, -15301, -15693, -13027, -9168, -1066, 2411, -1095, 1172, 7792, 9544, 8059, -953, -3887, -7722, -7557, -4658, -4153, -8248, -7554, -7931, -7567, -4970, -446, -1458, -4628, -5354, -9321, -10032, -12288, -6786, -4828, -7139, -5135, 486, 1800, 572, -658, -1366, -4213, -4534, -4987, -832, -2425, 1202, 7773, 4719, 2450, -1920, 682, -515, -432, 2857, -181]
17512a81l585M56M595N09R87j405j696P58R60K8p544M86J886j271l901M85O419
17495b014J833m553P06L039K235J895k31k349o196k717J680J52l047J489L251
17480d827M319l72m211r54J964l345J778M221L006o52l217M74Q46k460j928k107
17464g465k74J532J696J510Q67k802K617P504j063p073k479l15K255L91J552J609
17448F2M756P947Q173J722J605j779k674k57o278l786j401p7M792L325o286o624
17432C220J49R70l904l365j851L22k439K468j630K822K810K072K827K44J280m130
17416A865n294M010J154l773n216q1M165L923K010J846j293o559k651m059Q49
17401i104M977J998j509k81M12J733m892n550L044L320O452L626O66P17j652l201
$$ y = [-181, -3766, -3310, 1285, 1794, 2781, 1376, -320, 438, 1398, 1426, -6118, -5632, -3746, -5017, -8918, -8433, -2014, -181, -4734, -4028, -989, 1246, 3141, 2910, 561, -5635, -8352, -6672, -6520, -9567, -8078, -4827, -508, -880, -5091, -6045, -4081, -7426, -5648, -1427, 1579, 927, -2290, -1816, -970, -3430, -5358, -7465, -7739, -6207, -4511, -3001, -2134, -4936, -2319, 5185, 4122, -2951, -5430, -5745, -3490, -3099, -1547, 62, 4818, 12765, 20938, 22660, 24265, 22486, 19812, 19555, 13277, 9491, 8090, 8013, 12805, 16130, 9844, 3220, 3369, 4339, 435, -2930, -4781, -4459, -6898, -4430, -6060, -3238, -428, 1644, 4471, 4715, 5995, 1865, -3429, 581, 1735, -2038, -7254, -7335, -3170, 753, 2763, 4609, 3316, -3243, -5894, -9953, -9104, -4127, -2129, -3638, -3919, -3507, -1774, -6666, -12216, -9172, -5852, 600, 4226, 4892, 5609, 3957, 756]
17385G56j646M78K164L816L003L147k510n195m469n2K918M52k269l614L364o48
17369c05k240M574M675m323J151M351j734n500j608m82J321J567l380L193N334
17354F594J957k705m489n92R40k255K409N050k820n051k768Q59L120L778m344
17339c17k945R35k875l724m82L517K59K968R69Q27j530J458L234q88k841L40m42
17322a537j663O87L537K289J099r56l375m6L118K167j369k311k902L163j839J745
17306A807m360r71j814N71L085l867q01P614J006N9Q0j827N22M630Q06j416j157
17289C967k552m123r43M166M884J10n127l327l92M701N98j241l316L062J357j850
17273b6J20k716l418N292J804J221K997j475J522j341m065j536k276K720J631
$$ y = [756, -890, -412, 1752, 5568, 8571, 11718, 9208, 4013, -456, -508, 2410, 2862, 593, -3021, 343, -305, -2545, 2029, 6704, 2381, 3532, 7883, 6149, 649, -959, -1441, -120, 1447, -1933, 1260, 6594, 8551, 5846, 1357, 765, 1705, -550, 1859, 6909, 4089, -962, -3730, -2871, 249, 4027, -317, -3262, -2327, -5202, -8926, -9408, -5891, -5632, -2664, -1695, -868, -2398, -940, 2294, 1406, -1435, -1095, -1537, -3200, -2513, 1024, 3313, 4412, 3456, 81, 35, 3153, 5320, 3951, 1640, -1262, 1901, 62, 1807, -2553, -3524, -5338, -4767, -1682, -5549, -6350, 1264, 2270, 2329, 2409, 582, 1104, 5734, 6540, 5124, 3967, 1415, -2708, -3651, 515, 5399, 5509, 382, -2945, -3337, 1364, 1962, 721, -2595, 467, 1824, -26, 94, -2622, -6040, -748, 1056, 2277, 5274, 3799, 5321, 3980, -85, -1621, -3897, -1177, 454]
17258D54k656l396k891K066J31L409k558K935N776L167L532K00k475n217m833
17243b356m10L274k728o120j772K352K232K850k082l425J929m1l44K721K567J655
17227C02J006k4P89j156m379K137M076K497j119j35r111n325L331j638M80o06
17211h875L010k43j239L534L878K077N39j113J444l153o378n70L831N046J08q016
17195f120k863L837L283k23O9L993M461P82k041k804r89l308K632L190J114J371
17179F384n59j785K677k427r358j482k568k131m92O67l13J291L644N36J968J110
17163b838J428K885j500l962j270j663J097j327j245J433K837R87K198J831J720
17148B611m63k216j267J941P79K701L23N75m151J728j019r27m107q010M761J671
$$ y = [454, -2202, -5598, -8489, -6423, -6292, -2883, -5441, -2506, 3270, 6437, 9969, 10169, 7694, 2477, -2356, -2766, 508, -2220, -8340, -10112, -7760, -5528, -2678, -4760, -8185, -6256, -6297, -6641, -3920, -1353, 302, 1308, 1284, 2073, 917, -3462, -1325, 2751, 5248, 4129, 3994, -5117, -10442, -7111, -8749, -8269, -8875, -5865, -6108, -7347, -3813, 65, 2142, 2681, 1568, 3012, -141, -6519, -7089, -3258, 1788, 1896, -6120, -8983, -5146, -1863, -2086, -2017, 1976, 6437, 7219, 5178, 2374, 1385, -1923, 709, 3899, 5013, 6384, 5825, 4040, 6717, 4290, -5068, -6550, -9118, -11249, -11741, -11074, -11387, -10096, -6452, -5916, -3948, -2838, -1410, 1475, -25, -3987, -5257, -6920, -5823, -7150, -8395, -6962, -4125, -3138, -940, 891, 2611, 2148, -68, -1335, 606, 1385, 4086, 4409, 4984, 833, 2561, 1542, 615, -3492, -11502, -6741, -5070]
17132e070l864L134M038K879P51k21J12K017k8K270n307R20N51j62j972k33K49
17115F4m896j734J350K238J831J391J141l25j344l738k83O50L560K701J136j6
17099C726L139j207n966J769N265J481j364L48j918L92J979k1K459o75j377q58
17083G172k541j569j586j272L219O28J039l355n13K542J131N97n34m189J093j179
17067F83K060N247J544J081K024l012l39r54m81O72k650l402p632l327J202l74
17051g658N215N040M672K86j062J28l87M851K050n005k257J97j216k852K519O769
17035A1290l074q640l876K027M157L391L940p15n302r66k008k84p9K154M167j277
17019D905o5L54j908m828K856K627L114K173J602J574p459l372K235k191j282
$$ y = [-5070, -8934, -5800, -1762, 1117, 1868, 1647, 1759, 3776, 3748, 6018, 711, 1631, 2182, 2020, 48, -185, 64, -4832, -6566, -5216, -2978, -1147, 244, 1385, 1060, -284, -4022, -4305, -3655, -95, 2606, 3742, 3726, 6865, 5658, -308, 1461, 6726, 8207, 6843, 7191, 5273, 5665, 7644, 7623, 10082, 9407, 8030, 7172, 4631, 3062, 1476, 204, 3423, 4051, 5090, 1735, 1222, 3764, 4895, 5492, 4958, 769, 1862, 683, 2743, 7990, 9534, 10615, 12639, 9627, 9288, 8334, 7853, 8525, 5875, 2473, -5159, -8486, -7284, -7658, -2443, 2597, 7269, 7555, 6493, 6621, 6234, 11085, 13135, 8130, 5873, 6070, 4854, 2002, 4521, 11290, 8216, -424, -4300, -2273, 1884, 5275, 9215, 8500, 3198, 2232, 224, -60, -139, 2015, 6182, 4905, 4840, 5194, 3286, -1542, 1314, 3941, 7055, 9228, 10830, 12404, 4945, 1573, 3808, 1617, 335]
17004C35j171j679L98q46j360k290M943M814j057m555r04M441M261n883k924q74
16988d351m287L492N622J554j44o301J901L102m741J623N896q72m243J539l47
16973e57J75P08l091k987N820L142k195K773N317O57n300l125m265j602L486P527
16957F483k916o43K844m14l391m038l502K553p08K06K819K280k645o90J18m038
16941e682M188M61J067j61k858J75N987k623m040l436j813J882L134R01j080q59
16925d757J590k399m102M212J642K224Q89M633l943l420k82m982J186K344J241
16910c924O058r97k002L398R77l574l868k041j3L403j785m988J222N432J906K048
16894A252m20k376m132q93K340K41j470o37l986r17j09O977J70k980J830M152
$$ y = [335, -836, -2515, -2117, -2963, -4323, -6613, -1670, 3144, 2087, -2468, -3372, 1069, 5330, -553, -3477, -4351, -8638, -5146, 476, 2030, 1886, -4415, -2514, 588, -4153, -2530, 3366, 2494, -1749, -210, -557, -382, 326, -2765, -5752, 68, 3210, 1015, 3788, 9105, 9762, 4462, 1337, -2928, -4530, -1044, 6483, 3567, 2924, 5768, 5354, 1963, -2075, -5577, -3024, -3732, -3526, -707, 1573, -1072, -1762, -1644, -5682, -1494, -1033, 34, -127, -2985, -2810, 3177, 554, -3486, -6922, -8735, -6853, -3719, -2818, -3898, -4757, -3167, -5566, -9668, -5456, -3814, -1590, -701, 3932, -11, -3431, -3713, -8695, -7509, -5165, -3924, 2134, 1137, -865, 2533, 3510, -64, -3932, -5973, -5986, -2583, -4368, -9356, -8134, -2702, -796, 1252, 832, -1544, -5676, -6569, -4229, -3988, -5458, -6095, -10081, -10998, -11107, -4130, -3960, -6940, -5110, -958]
16878i58K40l101K592N045N63l0p556k400L393J762k291m107j860m29J797k474
16862i814J984N331L281L959n12n249j181j00K194q32n301J525O581K253J658
16847E777m182j412K380M201J640o201l747k19K061N203R83J086N346p633j787
16832C496o799n980j091J660M209j230l685K75Q30p45L733l495j341N399N124
16817C60m093o3l369j67J491J56j141m682k867n25P99o33P162L963L929q6K782
16800C016M772k113j739l554n527Q87K21k218l081l14J755M59l62Lp43j342J040
16783h840R93N459L457M150j184K59m76l643m771k475J447K600L345j430o015
16768g124J645j837K681L229j743q99L36j976j146P97K938J025J2J620m29K721
$$ y = [-958, -718, -3819, -1227, 3818, 4381, 4351, -3205, -5605, -2212, -450, -2741, -6848, -8708, -9137, -7340, -9814, -7830, -2499, 782, 4741, 4229, -1020, -2201, -2301, -107, -939, -6240, -4715, 1866, 4119, 5777, 1595, 183, 2563, 6764, 8404, 2203, -1544, -1763, 298, 5501, 6484, 7570, 12916, 5283, 3496, -3303, -9283, -10374, -8714, -4505, -5735, -9420, -9145, -8315, -9060, -5327, -8822, -10163, -4764, 360, -3733, -3796, -7165, -7332, -5841, -5685, -6826, -11508, -14375, -14900, -14101, -14734, -7572, -3609, 320, 234, 3016, 7788, 5675, 3936, 382, -5145, -4258, -4037, -6255, -9336, -9650, -7895, -7436, -7798, -7795, -8538, -9880, -8840, -7847, -2388, 1069, 5219, 4035, 4294, 3818, 175, -4596, -7071, -5624, -3024, 321, -1109, -7124, -5479, -7316, -4635, -1406, -3149, -4048, -3712, -5688, -6834, -6037, -3099, -2074, -2062, -442, -871, 1850]
16752A850K623K965K322p037q440j783P054l878o83m005k28J480M206j480L90
16737d644R12k35j515L77M421l244M896k234o055N380K541m71k314k232L68N033
16721I84K98k376m47J103L430o11k778r16n464J373N539R04k384J157k43l365
16705c796J57j605J69O346l913m568N72j845l807K312L535l369j477O406L786
16690a097l529m550l57O000K066m800m272j923L456O563L784J711k688K53K386
16675C003l295j365J011j21J920k793K967K242R13o8k605o24O94j182k228j254
16659b785M83K713J453L096J579m471m008k225l130j303j826J547J587O379L002
16644B091K419j532j993l501l260m764L250R906M566l053n100l481l753L841j388
$$ y = [1850, 4473, 7438, 9760, 2723, -5717, -7500, -446, -4324, -5007, -9012, -9240, -7760, -3554, -5034, -4644, -3732, -3967, -5482, -5105, -684, -3928, 968, -1266, -7321, -1941, 600, 129, -2185, -4417, -4049, 984, 1282, -1094, -1541, -438, 2992, 2381, -397, -1313, -6777, -5404, 135, 1039, -1345, -188, -431, -3796, -3639, -5244, -5075, 1271, -2642, -7210, -6638, -8483, -12290, -9978, -6443, -9812, -11289, -4883, -1097, -4626, -9176, -9533, -3533, -1467, -6267, -10539, -12462, -9006, -2443, 1341, 3052, 364, 617, 3003, -292, -1657, -646, -767, 1153, -1640, 1327, 3569, 4482, 4414, 1809, 1185, 1879, 697, -1531, -2785, -2302, 411, 1864, 4960, 6539, 2068, -1940, -4165, -7295, -8598, -10424, -8877, -7290, -911, 2091, 4510, 2978, 985, -2516, -5776, -10540, -7290, 2616, 7182, 4129, -971, -4452, -8205, -4364, -5752]
16629e752j814J995J60L952l475J083R12k211j3k662K503O638j759K030l182j913
16613c508J900P10l79J075m2J75j993n188J733J358j866L385K080k742j492L132
16597a662J255J921j594l868l819k305M288J754J749k41j299q90M850K973k838
16582B74J608M48m373J635k484m091J326P48Q22N896j197r86J675j786l37l649
16566d471J2J78l9J587J70J99L507P93l516j802l010J050K421J870l156m552r37
16549i696M979M901k552m324k099K801M447q86N90k918l475k378M276L593M536
16534A795l208l954J822J273o17K323J845l302j460k749p91N186J963J490o85
16519I31k265n144m260M324m36l376O177J507n11p73m644j905N138J882j677L517
$$ y = [-5752, -7566, -5571, -5411, -1459, -4934, -3851, -2939, -5150, -5163, -7825, -5322, 1316, -443, 1587, -1595, -3508, -1608, -898, -1277, -202, -244, -69, -2062, -7250, -5517, -4159, -6025, -2640, -560, -3302, -4794, -1662, -407, 1514, -80, -3948, -7767, -10072, -5784, -4030, -2281, -2522, -3821, -4711, 139, 3112, 274, 1882, 2330, -2043, -408, -2892, -6983, -5657, -4909, -4087, 1809, 612, -374, 1301, -485, -822, -4471, -4459, -4281, -4320, -2733, -2563, -2364, 1143, 1936, -1580, -3382, -6392, -5342, -2921, -1051, -4207, -8759, -9696, -4717, 184, -2368, -6692, -8791, -5990, -1543, -2429, -1839, -4757, -8232, -10610, -6334, -2741, 1795, -1413, -5367, -3545, -2272, -2889, -566, 1279, -2023, -3483, -6232, -7023, -1837, 126, 1616, 931, -1334, -6478, -10738, -6414, -6850, -10226, -4049, -2542, -3053, -3826, -8470, -10375, -5237, -3355, -5032, -1515]
16503a515k040k578o4j64R79j469L669r29o38J567L818k296K5K84n90l987J748
16486d180M39k165O034K444k579q18k055K395m293m117l73M93M200M903J890q75
16470A343k190K956j240k665J796K767j12l316l962N133L535l63l223j269l186
16455c996j990o550L908Q248m51j023q36K101K016J356j111k766P02M42o46k102
16439b698M136m181J211J558J409K183m623k2K277J762P35k049k460n403L630
16424b535O198K632k564j192k377r000k925M830k650n276N353K907L113o25j341
16409e452K13L538l305K366l187j605M671K752j397n102l279l39J091Q76O40J814
16393e705L431J889k791l355r65K239l023N464L524j949j486k382l312M62M017
$$ y = [-1515, -3555, -6133, -6197, -6361, -5382, -6851, -3182, -4111, -4749, -3182, 636, -1660, -1635, -1351, -1941, -5928, -4180, -3741, -5906, 128, 2572, -7, -825, -2880, -485, -4778, -8895, -9268, -8775, -4575, 328, 2218, 1343, -847, 2109, 869, -1796, 0, 2767, 2655, -661, -4623, 510, 4045, 3682, 459, -810, -3996, -5986, -12536, -8628, -380, -831, -1854, -2690, -589, 1427, 2783, 1672, -1094, -392, 50, -596, -2698, 1438, -2743, -1532, 26, 1435, 3618, -1005, -1027, 1250, 3012, 3747, 1698, -762, -6165, -2535, 3663, 6295, 3731, 2539, 162, -8838, -11763, -6933, -9583, -14859, -9506, -6599, -3486, -4111, -5452, -5239, -1701, -5006, -2640, -5827, -7432, -2761, -9, -1406, -6508, -9787, -10126, -9035, -8159, -7519, -5705, -2274, -385, -3176, -6531, -7496, -5257, -8280, -2816, 708, -1241, -2727, -5109, -8421, -7959, -3942]
16378c942k052k909L026j118k523L874O144O62m277l326k996J213M967L560j348
16363a045N61o43p284n59K778r12q6K058L576L65j278J426k123k360J558N474
16347A506O30j071q83l757r1J753k84k936L914K415l594k015l119K281J246k220
16331f225L27k028N0j643J837j361L35j396q01M726J368O11P60J890j976J171
16315b355j850j708j104R39j289J887J529k928Q773K076k720J78k041m929o84
16300f226O32K842j320O94M100l597k423j574n504l38J004K276l303J321K627
16285h789K87j300o43J451L369J368m941l733k254k46O347M914L932p93k025N35
16269b521p946n167M64L180n51K854N621K369n555n82J445M837M059m80k819m859
$$ y = [-3942, -5994, -8903, -5877, -6995, -9518, -5644, 500, 1162, -3115, -6441, -9437, -8224, -3257, 303, -1045, -484, -1127, -8411, -8970, -6192, -7104, -7190, -5132, -1556, -1191, -2469, -1043, -3166, -5526, -3968, 1506, 2136, 1065, 182, -3575, -3666, -1913, -2197, -5133, -1219, 1196, -2398, -4413, -7532, -5251, -4005, -6225, -5898, -7926, -7876, -9519, -7682, -9043, -8708, -10104, -10905, -6179, -4811, -4200, -3440, -1550, -3526, -2355, -4205, -5913, -7017, -6078, -7367, -5480, -3951, -6879, 1894, 3970, 1250, 1428, -613, -5542, -6226, -5594, -2752, -4072, -3378, 722, -2875, -5298, -6872, -12376, -12714, -11710, -9434, -12737, -11416, -8789, -8502, -9802, -10445, -8994, -5625, -4257, -9198, -12931, -15185, -15431, -9084, -4170, -238, -1031, -3056, -2521, -10467, -15634, -15170, -11990, -12541, -9687, -4066, -1697, -7252, -7834, -6389, -1552, 2507, 2027, -792, -5651]
16253e651m174J896N05J500j913N83Q2K366O55Q40k85j815j893l8M011N106k036
16236b61n577J226K86K935J907l631m424J5L493j03j626J274J262l436j163l181
16220a1004L212N522j584l843j822K963p87J942N23k30N526k787r93N644J343
16205C625l532l245l067O631O94J816n759k885J063P64K350j810l87M102k99J05
16189A66r97J994N99O81j55j597K044r50k641K388J317J235K435j429j033l735
16173C22k001l898j28M361j422k366l574M298J818n701o368l519O0O805J828K257
16157g228J6l32L028k326K702P11Q09J043j035J295j469k211K3O70J482M249l829
16140b402m268K420N53p90m105K72J337K355k39j945M36P11k213K597K447J304
$$ y = [-5651, -9825, -7929, -7424, -5924, -7837, -7254, -7172, -4806, -4151, -3311, -3596, -5411, -7304, -7342, -3331, 1775, -261, -5838, -4612, -4326, -1391, 516, -3115, -7539, -7524, -4031, -4134, -5760, -4486, -3224, -6660, -7823, -11004, -7792, -2270, -3854, -7697, -9519, -6556, -7343, -5401, -4878, -5108, 418, -2369, -3362, 2282, 3625, 93, -3152, -6219, 412, 1106, 2922, -2837, -5722, -4659, -3895, -1545, -3355, -3742, 360, 61, 166, -831, 1163, 1762, 2443, 2288, 691, 2735, 1785, -856, 1532, 2849, 4084, 6519, 5090, 4057, 322, -1679, -5577, -5705, -1344, -2766, -5132, -8706, -4408, -2590, -8291, -14659, -18178, -18118, -11313, -9485, -7228, -7212, -7544, -4516, -6842, -4140, -3429, -2620, -1577, -2612, -1317, -2786, -4997, -4974, -4304, -2822, 1427, -2402, -6670, -4250, -3697, -4487, -8592, -8320, -6983, -4628, -4867, -6812, -6376, -5665, -7878, -5281, -2834, -1530]
16124a530j067j576r048J295O454M623l295k417j081L32L931J581k536r40j617
16109f891j971J019L795M458k97k110j890j177k406K358O984l134k754k701N8
16094f659O448K272n563o505k205K146J042j824J537k62J090K050L153L810L411
16079C941J981k832m269k765L647K407L916K736k268m111k535L074L25k971m274
16064c998J697l12K939q11p861k904M15J097j396r44l256K978P393K530m933n890
16048a3256J577J482R25N112L332o33p086k839l149N411P224j167l319O27J289
16033d470N138K879J798j826P54n083m847Q79j710J235L891J999J591J957n543
16018a358m589j467m496J859J786J937j97j268k271J172J991Q32K315k132k017
$$ y = [-1530, -2597, -4173, -13221, -11926, -5472, -849, -4144, -6561, -7642, -7310, -3379, -1798, -4334, -5274, -6891, -8862, -7843, -4048, 410, 113, -1997, -3887, -5064, -7470, -5112, 1872, -1262, -4016, -6717, -6659, -211, 2061, -3502, -10007, -12212, -10066, -9024, -10848, -9311, -9573, -8483, -6433, -3280, 530, 3941, 5922, 3090, -1179, -3944, -297, 2110, 6026, 8762, 6494, 2383, -152, 2922, 3247, 276, -3998, -2301, -2613, 326, -485, -8346, -11250, -10835, -9738, -11134, -12078, -15334, -12356, -4963, -2433, -7366, -13256, -11679, -10197, -9272, -4160, -828, -1461, -8547, -11386, -14535, -9124, -1900, -3067, -6386, -5759, -4470, 668, 3547, 5345, 3519, 4273, -810, -5657, -4778, -6488, -5253, -1362, 637, 2228, 4185, -1358, -5947, -7414, -11910, -10051, -8265, -6328, -6525, -7793, -10064, -8892, -6901, -6069, -3754, -5886, -7903]
16003g903Q47L388L864k14k716q57L443o82l138J645M56k650q07l713J004L649
15987d384R35j360L248J685J477M484j539m046o767l812J987M563o26J1l069J943
15971e270L70K679j639m042k349j18L599L061J499J310P42n242l279l622j714
15956a4015N560P478R10m38p64J195k0n716j918J417p67j284m007p11k088M022
15940a1146N763K773N221K199p647q399n6J580N27M526j357k210j892l042M491
15925h669K462L096J551k162j500L628P042l594o575L38M14j547j528k939M859
15910e124J898n329m09L376K064Q01j481l348o034L417O110O70m668K027L419
15895b611J936o2N73n604j22M300N85l60j84k469J138K948l258l894j728N58J050
$$ y = [-7903, -7056, -3668, 196, -18, -2734, -3591, -148, -830, -3968, -2323, -1867, -4517, -5324, -9037, -8033, -4384, -3449, -4809, -1561, 124, 1601, 6085, 4546, 500, -6267, -10079, -8092, -3529, -4155, -4144, -7213, -5270, -4900, -2221, -3860, -7902, -10251, -10369, -6770, -3709, -2210, -900, -158, -5400, -8679, -12301, -14015, -8455, -977, -67, -505, -1269, -74, -94, -5810, -7728, -6311, -7078, -8362, -12369, -13080, -15168, -11146, -5383, -2610, 2611, 4810, -2837, -11236, -11292, -9712, -9185, -4659, -6016, -8226, -10118, -13160, -8669, -6207, -3111, -1560, -3722, -5222, -1594, 5448, 1854, -4721, -4383, -3969, -5516, -7044, -9983, -5124, -3226, -8555, -8964, -5588, -3524, -2723, -4204, -7552, -13586, -10169, -4059, -3389, -8057, -6030, -2611, -675, -737, -164, -5768, -5890, -1590, -1005, -1365, -1549, -4018, -2880, 68, -3190, -7084, -8812, -8254, -7204]
15878g204k826j383M619K037J030J664K082J429j172K214k898o296L401J762k262
15863c803L9Q1n98j814J95N990L870j219K841M21j542m288n586m076L234L31J182
15846d742L490L980N275o436l085r49k678k536J275M797L262N410j275J287n292
15831A783o945K515o48m457k581J240K750N365R63k555l009l193m442K612L754
15816f848L789L848j279k648N4k123O34J084L701M976m189l990L812m274J656
15801a797K721K078q336K2O247j152j016J202K211K523j445m749n717k283L199
15786f292M496j829m913P002O198l633l111M44P39m155Q76K656k580K553K129
15771E80l240l692J873m05j363j50L137J64j585J392M990l20m33j702K019K076
$$ y = [-7204, -10030, -11413, -6794, -4757, -3727, -2063, 19, 1448, 276, 2490, -408, -6704, -3303, -1541, -3803, -3764, -3683, -4281, -6095, -5900, 90, 3960, 2741, 5582, 6003, 4461, 173, -5413, -9489, -6255, -5924, -4742, -1252, 2728, 8003, 1567, -1518, -2467, -5145, -7681, -6406, -1609, 1653, 7063, 5788, 7075, 1783, -5162, -2647, -3295, -7752, -10333, -9093, -6343, -978, -15, -2570, -5579, -8772, -13214, -10602, -6848, -3059, 789, -490, -3138, -3084, -5207, -4573, -3489, 212, 5188, 999, -2991, 821, -3453, -1797, 924, 3002, -5334, -5312, 935, -217, -1233, -31, 2180, 4703, 3258, -1491, -7208, -9491, -6292, -1796, -3625, -8538, -1536, 4662, 1029, -2082, -1638, -899, -5054, -4178, -1522, -4102, -1549, 580, -2660, -6352, -4479, -4884, -6247, -6397, -3260, -3096, -4681, -3289, 1701, 1381, 948, -754, 1265, 3341]
15755C341k400K0n088k513M91L93O8L421k232k712K420M248o840m715j705K575
15739a1228L026K249p91L283L202L172L2q23m147l75j904P98K105Q49R08r090
15723h734o312Q11p90j22J956j596Q40K973L187o58n903L757K96L595Q537j615
15707B22k910k367j336M038Q49O11J833M219K497k022q48m351M027K837l952l875
15691e28O41K864J404K35p998k108J985J622L037M16o61m948n22M411n0l029J572
15674a657Q71N32J932L588J223j616n935m032j1k510J430J403J86j84K285j692
15658d187K74j84j610L290J693p669j789l62l224K575L670K703K161R42p010n206
15642a3933L412N76K352O058m401j968J814R42J227L330J876m000j143j344j211
$$ y = [3341, 941, 961, -4127, -6640, -6149, -5756, -5688, -2267, -4499, -7211, -4791, -543, -7383, -12098, -13803, -11228, -8202, -5953, -6744, -3461, -259, 2913, 2945, 2122, -2025, -2400, -4304, -3506, -1401, -552, 356, -8734, -15046, -14235, -15025, -15147, -13191, -14787, -13947, -10974, -7787, -8445, -14348, -10591, -10295, -6700, 1837, 222, -2688, -5055, -6391, -2353, -1504, -893, 940, 5159, 7656, 5634, 4786, 435, 4462, 7299, 3347, -528, 113, 2977, 4381, 4616, -3382, -5490, -3505, -1883, 1154, 1570, 909, -4039, -4561, -150, -200, -3229, -1657, -786, -254, 1678, 5266, 6489, 4873, -1062, -5094, -5105, -7615, -6185, -4782, -4596, -4780, -2495, -4187, -3913, -4097, -5707, -2417, -724, -8393, -10182, -10544, -13768, -11193, -7523, -4820, -2659, -1717, -8727, -13933, -10521, -9945, -7593, -1535, -5936, -7904, -6090, -5148, -3921, -591, 1285, -2715, -3858, -5202, -6413]
15627f413K434J692K120r47k545j022m456n087L331N417M360J193M0l790m75Q372
15611D224M185K356n189m091n1o572J85K938K630L23j517K69K648J844M43N65
15595E190m397J256k066R10j250j944n879n09q53l18J473O915O333P98l110l428
15579h79k766j00l447j264m57j472R28K58R13j490j647J761n94K697L780q72k307
15562f958j784K436j042J467J772k871J333M264k008r97O040j029K266K3m774
15547a862l385J687j129J065J44K481J975J562j208k157k057r06K588l299O189
15532A688M44m373l97Q53P91L581k509n183k938q34K901j697L029l460n257M098
15516i263Q679J12j70L813k628n041k46J392J343n230J26L520K31P4J732j225
$$ y = [-6413, -3979, -2287, -167, -1114, -3659, -4681, -9137, -14224, -10893, -5476, -1116, 77, 117, -3673, -4148, 4224, 8409, 10765, 5576, 1485, 1434, -5138, -4953, -2015, 615, 938, -579, -310, 2338, 4182, 4625, 5190, 793, 2049, -17, 893, -357, -2301, -8180, -8689, -9542, -9860, -8387, -1472, 4861, 5659, 2549, -879, -3645, -3745, -7192, -8456, -8913, -10385, -9457, -9199, -8286, -9776, -11423, -9662, -10256, -7559, -3779, -4651, -6958, -8742, -6306, -7348, -5881, -4109, -6980, -5647, -1383, -3391, -4388, 1652, 623, 2889, 2912, -1862, -5247, -3560, -4689, -3624, -3480, -999, 976, 2538, 1330, -827, -2884, -3790, -1202, -4501, 1688, 2132, -2241, -2638, -1785, -994, 2587, 78, -5105, -8043, -8877, -5976, -7673, -4644, -8104, -13361, -9263, -584, -472, -642, 3171, 543, -4498, -4744, -3352, -2009, -7239, -7113, -3593, -3362, -3288, -1556, -2781]
15500b781n83J493J620P88J74q22k652K359J938n55k852j674J332k202J802l872
15484f487L433O264J805n084j880J071j286q4J012m372k476kJ546L873l549R39
15468e277J977R20m586Q53M925L210m21k949k685K946M21o947r58L043j259J353
15452e434J164k06Q043O029j011m110l31j187k631J710O61j819j696l959o162
15437a0939j372N813J311k16J797J53o38N507M79k587o1l020j992n027N015L815
15421a962J029l171K017o939k678M402O127j405J226K737M937n125n542m468n028
15406a3843L575K902J147k24M796P57O71L476j193l32M77m275k087l45O19P97
15390c082l759j544M094L955J037J900k346R24K623j88j800m548Q98m83p52r31
$$ y = [-2781, -3364, -1871, -251, 537, 711, -111, -2763, -404, 1534, 979, -1873, -3547, -2215, -4417, -2615, -6487, -3054, 3210, 5015, -69, -1949, -878, -2164, -2248, -1236, -5608, -8084, -8086, -6540, -2667, -6216, -5277, -3300, -2380, -6966, -6113, -1188, 2022, 1601, -1348, -4033, -1087, -666, -7613, -8571, -5528, -6787, -5434, -4270, -4476, 3567, 9596, 8585, 4475, 4144, 2957, 326, 2036, 2697, 878, -818, -4777, -10939, -12311, -6498, -5187, -5403, -3606, -3453, -4091, 1416, 1895, -692, -753, -3773, -5765, -10792, -5777, -1962, -933, -4104, -2087, -9026, -11704, -7302, -1175, -2580, -1354, 1383, 6320, 1195, -4347, -8815, -13843, -10268, -7366, -6219, -6443, -1647, -890, -219, 3257, 2064, 1732, 2209, -2066, -4153, -4498, -3879, -3082, -6841, -8385, -4291, -336, 701, 2601, 255, 1179, 3802, 3614, 1814, -2734, -1836, -2319, -3071, -4002]
15374d002M84j792J893K640L519j543k795j58J88L525K635K066j216l930k185
15359f71m83M507j487j180o20K77k534k541k112j971K07m404n190O253O389n90
15343f150J380N315j128K376m90k903l730n74O985N058P58O0q339n647n549J46
15327a2432P791j639j522L60M948l198L38N875k56l360k642J339J649J730j066
15312b085l523q9M448K028L591k649n085J94J903j126j731m884q30l44M575M044
15296a563O007K150l219m009m492k653l117K158Q489L329j24k267k095j428O47
15281b187J044k862n02J563r70l9J543K786J629l851n533L84j854k012J215l266
15265a2912L115L884K521j299O75k551N16n55L139m115p560K083N388J229J0553
$$ y = [-4002, -3518, -5310, -3417, -777, 2742, 1199, -1596, -1754, -1566, 1959, 4594, 6660, 5444, 1514, -671, -1154, 3353, 1866, 686, 66, 343, -2191, -4732, -6844, -8815, -8608, -13012, -18202, -11949, -5560, -6150, -4770, 545, -583, 1793, 1303, -1600, -5330, -5904, 1081, 6139, 6897, 6957, -1382, -7029, -12578, -12432, -4641, -6280, -7802, -7442, -2494, -5692, -5354, 521, 265, -3095, -5737, -4398, -2749, -1019, -2085, -5608, -5697, -1249, 779, 4370, 1721, -3364, -3170, -1267, -2393, -4124, -9008, -9838, -10182, -5607, -1563, 4444, 6594, 3375, -634, -5126, -7779, -10896, -8738, -249, 3080, 2956, 689, -1406, -2834, -2187, -1143, -4005, -4507, -2944, -3914, -3953, -2410, 376, 2005, -1846, -7379, -6995, -8849, -10861, -9646, -12912, -9797, -5913, -3392, -4691, -4016, -6567, -6051, -6606, -3467, -7582, -15142, -13059, -7671, -6442, 4111]
15250D111M105k294J69k009j122n921l52O47J969l144N149j66p246j291N592J048
15234g55k806m15n73P99K268j956n238L504J577m349Q74j977n38o04K619N22j771
15217h819l76l708M33L534L660m81k03k261L517K595K726K914n850m505k908N382
15201d350O358m79l475k033o52m00j206L479J224K90p46K048o81n132l554J603
15185g706J906Q58J117P81q34n354p426N576O45J492M114K454Q05J880K861j009
15169B160j470K324j369n994J306K932P39J087j866K463j272Q33k426K545o701
15154d709j422k616r68L57L47Q89M568K859k698J381Q81N93N63m55l684n958K776
15137g296N049p77k019M259K107l021k701M871m870K076J380l379o66q67M070
$$ y = [4111, 8216, 5922, 6091, 4082, 2960, -2961, -3313, -2666, -697, -3841, 1308, 1142, -6104, -7395, -1803, -755, -3561, -3976, -4549, -3750, -1482, -3438, -8676, -5172, -3595, -7944, -7070, -9047, -9585, -10189, -7570, -7048, -8819, -9195, -12903, -12470, -8936, -5276, -5757, -5960, -8221, -4704, -2109, 617, 3531, -2319, -6824, -9732, -4350, 2008, 1529, -1946, -3979, -4631, -5031, -6237, -2758, -1534, -1244, -1990, 58, -623, -5755, -9309, -7706, -5800, -4942, -3825, -3044, -3878, -9232, -16658, -11082, -10437, -8945, -4831, -2377, -1572, 308, 3169, 2160, 690, 3014, 1645, -4349, -3043, -111, 628, 1715, -151, 2312, 1040, 1873, -553, 1992, -4709, -6131, -8747, -9715, -9358, -9011, -8122, -3554, -695, -3393, -2012, -1131, -538, 25, -430, -4114, -10072, -7296, -2247, -3024, -5043, -784, 1323, -1698, -4399, 472, -4398, -2322, -942, -4321, -4987, -5854, -1784]
15122a784R59K0o82k385M013J324q20k335M66K464on87l032k202l42O745K488
15105D304K092J970o748j405O05l577m361L878j321n739P03M706O076L732N71
15090E486k320n296j12N878j669L512o635j470M098l817j764N873J049J084K841
15075F738k596l975m165k889M366K039Q0Q809Q007m096p865q059r1L324J728N134
15059F489m984m445L554J503q037k717K977K93J904K639J066J363o14k193n010
15044f212m697J281p32L577M185O40k639k159j229J131l916o374L35J318J820
15029a3671L511M123M507L820l188j193j34n95j798K498P85o89K426O65o14K105
15013B558m81j318o85m760J430o65m483q20K106R330N799n248l344k522j632L633
$$ y = [-1784, -825, -805, -1487, -3872, 141, 1465, 645, -1690, -1224, 1240, 1234, 647, -2385, -4587, -4929, 1816, 4304, 6396, 8366, 1618, 213, 818, -2759, -7120, -3242, -4563, -10302, -9599, -4893, 1183, 4915, 5486, 3166, -2130, -2242, 3636, 1967, 5479, -1156, -2626, 1472, -2345, -4109, 1764, 2813, 3897, 6738, 4142, 167, -3998, -6887, -2521, -482, -402, 8407, 16414, 12318, 4453, -3606, -3697, -373, 1355, 6489, 1505, -2940, 614, 2117, -5920, -8637, -5660, -5367, -3463, -824, 242, 1605, 991, -1202, -6212, -10909, -9628, -10360, -6783, -2598, -1958, -4597, -6756, -7985, -6854, -10770, -17144, -16809, -15491, -13671, -10160, -6037, -1530, 2290, -898, -2091, -2225, -2820, -4618, -2120, -1335, -2024, 402, 1067, 453, 2558, 2077, 759, 74, -4686, -3256, -3921, -8404, -9224, -7118, 2212, 8011, 2763, -581, -3103, -4735, -1102]
14997a102J158K59L71j293k698j407M010k246n506q22j228L736O548N9k730j253
14981d144K74N81j392l273j65L270J250p36j590n927l076k983J446P119N874N353
14965A881o46m580j382k13k766M3l073l043l57Q082P244K270J836m669n658l610
14949h641l344L750K930J223K787j462k186l194m265M575R271j695K148L705k737
14934B865n213o468j021O64n93m276m208j847K718K088L519M217j425K065K640
14919d275k406J180k558o223l03J711M950J441N33K61J423N950l86k924L4k378
14903c970k735L060R62m22j014J515O804l128l139q223l441N167Q96J76J735M681
14887a076r96m994M34L287K123K914j542m257o700J126M999L061l161P62j93J666
$$ y = [-1102, 56, 315, 686, -607, -3305, -4712, -702, -2948, -8454, -9276, -10504, -6768, -220, -161, -2891, -4144, -3870, -3289, -4681, -7954, -8119, -4849, -3599, -4335, -5925, -11852, -14928, -17911, -16465, -9346, -3472, 1881, 1235, -3345, -4727, -4940, -7706, -7663, -10736, -13779, -14136, -6054, 1190, 3460, 5296, 627, -5031, -8641, -11985, -8235, -5305, -4082, -1295, -2757, -4943, -8137, -12402, -7827, 1444, -251, 1897, 5602, 2865, -2348, -8816, -9837, -9173, -9766, -14042, -18250, -20097, -17379, -15291, -11772, -7555, -8980, -6915, -4275, -6681, -5501, -8059, -14282, -14585, -12874, -7924, -6483, -5950, -5689, -4266, 1684, 1298, -1626, -1592, -3970, -6705, -3645, -2683, -3105, -4119, -2604, 4200, 1072, -2067, -10290, -13731, -8564, -7668, -7492, -5757, -1076, -2072, -7066, -6632, -3345, -1222, 1692, 150, -4107, -10807, -9681, -4682, -1621, -4782, -4020, -4213, -2547]
14871b547n918m760j881k891O388K701m225m748M100N887L902n348l373N04L0
14856a2179K580J386K157M588j718J032K439o642k988J375k395L50k223O3n801
14841a7976K029L421J317K890J592R47k770l822j955L361J358N031q8K253K021
14826c91Q16j358m295m290K900K79j511N313K940J364K075l522m829O264J456
14811C211M72m125n099J842k71l547l950P282J637j61q08o710j430J642K522K486
14795e007O19L432J151k874n407m380p70J314j234L408N37k221K809L351K90l046
14779h028K749M609N179n604m743o56J324m44K12J84j045m32K440J119K761j679
14763b054m247q29K922L421N32m747M414N60k758Q33L820j071q79m491n317K368
$$ y = [-2547, -8465, -13225, -15106, -17997, -11609, -8908, -13133, -17881, -13781, -7894, -3992, -9340, -12713, -12209, -12179, -9599, -8213, -6056, -1468, -3186, -2154, 285, -6357, -9345, -7970, -10365, -10015, -12238, -12175, -17976, -15947, -12526, -11209, -8319, -6727, -5780, -8550, -12372, -14327, -10966, -9608, -4577, -4665, -2412, -391, 425, -933, -5228, -9518, -6618, -6339, -7850, -2537, 403, 1767, 3842, 320, -4509, 1755, 3211, 3683, -442, -5541, -3699, -3970, -7517, -11467, -4185, -2548, -2709, -3517, -10227, -11657, -10015, -7493, -5007, -4388, -956, 195, -2679, -8086, -12466, -13236, -11922, -13156, -9748, -9211, -11432, -8623, -5272, -4982, -8028, -5279, -670, 4509, -1095, -5838, -6494, -5170, -5614, -5402, -5218, -6263, -6695, -4255, -3136, -375, -2054, -6301, -7130, -4208, -787, -255, -5002, -588, -28, -2786, -1953, 1867, 796, -83, -4574, -9891, -7523]
14747g523M820lj666J053m190K151M247k26k507o068n22K954N983J417o74M833
14731D079n940m876K01M428Mj896l22K708l457k901P510N159l43l189j386r83
14715a204K011k735M43M89p26n263m812l27M003M362L267l172J728M484P40q203
14699d915j653K910j989j927l608J134K637o258N42N251L109j282O19m088l176
14684a2694J622K410O095k086K417O934J302n451m0k030j378K243j38l424J97
14669d021o59j570K62k81J617P56l52n972m226M532L251K544j342l182q54L335
14653f162N417m96N75o295p793k24O399J798K837J45j471K92k5L317J259k718
14637c145p89K202J142L353K21k311j011l435n676L124N077K887k893n171M658
$$ y = [-7523, -2703, -2706, -4372, -3319, -7509, -5358, -1111, -1337, -3844, -9912, -10434, -7480, -1497, -80, -754, 4079, -1861, -6737, -6536, -2108, -2104, -4000, -4322, -1614, -5071, -7972, -462, 4697, 4354, 1165, -221, -1204, 807, -1928, -1485, -996, -1722, -6985, -11797, -12124, -8121, -3759, -492, -3664, -1936, 2548, 3288, -4915, -6568, -3658, -5647, -7574, -11182, -10048, -7411, -13669, -13127, -7876, -4767, -6049, -5430, -9518, -12694, -11072, -8662, -2567, -4653, -2236, 4698, 6000, 549, 509, -1521, -2899, -656, -794, -4218, -4021, -4680, -6250, -5988, -6269, -4652, -3896, -4248, -10220, -14446, -9914, -6663, -4119, -5461, -8643, -9497, -6162, -745, -1241, -666, -6961, -14754, -14978, -8579, -6781, -3944, -3799, -5270, -4978, -5003, -1686, -427, -3145, -3934, -1732, -590, 2763, 2984, 673, -338, -3773, -9449, -6325, -1248, 1639, -1254, -6425, -1767]
14622a767K23J115L083k779K843O55K018n15j969R0l19r467q634O09L834R10k204
14605a2274M57Q85J072p33N980K75m5J930L755j256l003n39n91M393l36m825n554
14588a0409J427j523L284M451J419k196j693j821K650N718J746j096m241J873
14574d11M811K99j019O59k390O24j376N79K057N52N135p06k116n352k246n326
14558f226n904j215Q107L796k69j840k947k370m58K309K157K471o115m047k055
14543a4606K440J040J038m13L470O00M161l718k439o46j31M664J573m21r42j747
14527f077O239K86k73J600N45j310m64j979l645K882O371L574q20j533l821k667
14511a092K901J451k488l4m66K702k760J640J077l223j608k277K688M360N62J378
$$ y = [-1767, -1544, -429, 2654, -125, 2718, 3373, 5391, 4876, 2907, 2997, 2678, -6789, -15423, -14814, -10980, -10070, -12274, -11817, -10932, -9860, -10593, -4613, -4338, -4383, -2453, 1302, 46, -2957, -3496, -4087, 306, -30, -4855, -10409, -8982, -10505, -7221, -2770, -1351, -3547, -5240, -7061, -4411, 1307, 3053, 1957, -2284, -411, 4400, 4699, 3680, 4339, 1949, 2573, 1197, 1776, 3833, 4385, 9520, 8814, 6698, 1346, -900, -6226, -12130, -13345, -5238, -1442, -1711, -3551, -6498, -8868, -9326, -7017, -4860, -2389, -8504, -12551, -14606, -12166, -11126, -10088, -10501, -7031, -6431, -2270, -5988, -8427, -9073, -9204, -4540, -2967, -3388, -4330, -6077, 162, 448, 175, 1775, 2320, 1010, 546, -1433, -5078, -2196, 4175, 7749, 6929, 5396, 1575, -1092, 1809, 3260, 772, 738, 272, 2974, 214, 1854, 2931, -292, -1900, -4177, -1489, 2871, 3433, 4811]
14495D811n511k084k30j13L204j082k361l362K194j569L431N949j128j493m568
14480c912j988L1L771J782l135L462m512o019N666P394k159n542K138m432M12
14465g043L39l346M440P939J445l036P63k12l73P39r46K893j17m755l737J149
14449c858K857J442k493m247K104o3k426K601J511n62k813l921K739K529K500
14434b100l006q56N664q32q046p83L468J210j802j498L632J34Q23J380j748O13
14418c747m41n120M705M174r60k70k69m653n009K19r69J580J279J339K696K576
14402b870K959J399o64n763J354J186J86J8l410l703J226L059K001L573n98l15
14386c62l93q60M88K323m287m416n40J271K91J825l145n96L586J071J264M21J774
$$ y = [4811, -700, -2784, -3014, -3127, 77, -1005, -3366, -6728, -4534, -6103, -2672, 3277, 2149, 656, -3912, -5900, -5869, -2098, -316, -3451, 11, -4501, -10520, -4854, 2540, 381, -5161, -3023, -7455, -7043, -6704, -10050, -5610, 2329, 3774, 738, 1501, 1289, 916, 1655, 709, 3602, 3485, -1270, -5007, -3858, -1001, 441, -2052, -6299, -4195, -4258, -6684, -4083, -2572, -3134, -5947, -9868, -7129, -4600, -2100, -5106, -5962, -298, -1130, -9176, -9959, -6491, -5281, -7083, -8581, -4949, -4815, -3992, -2612, -4360, -3747, -4188, -9308, -4603, -429, -1389, -1659, -1928, -6581, -11590, -11371, -12340, -10760, -9481, -8142, -5446, -2870, 89, 1488, 824, -4939, -3585, -2399, -2213, -2195, -5605, -9308, -8082, -5023, -3022, 551, -47, -362, -755, -1615, -1127, 1196, -3091, -7507, -8047, -6776, -6485, -4660, -7805, -8401, -4815, -3744, -2480, -2059, -285]
14369b85l861J02J553J644N624M285n367o118m371O6J716L951M780J096l013k03
14353A599k212j442K936L789j444p773J483j376j828k63j097K32k301L90M175
14338e132K543K311q37m633k404J808K995L177J584k553L20L427k280p118m215
14323a1007Q059N125o149j227M701K775l607j582K372l58n720J495K199J338n229
14308f815q43J692K517P3k17J507j531l428K396K407k266K691j106n507l706J4
14292a2122M800M592J984J564p85j669k267k056N114J610k032R81j169l478j971
14277f904J775M016O80j663r11J020O347L797o163m005n297J866M11K378j120
14262c773m630m034J668L462M450p1J814L944M074J077m701n477M908K170J930
$$ y = [-285, -4146, -4044, -2491, -847, 4777, 9062, 3695, -2423, -6794, -6728, -5012, -1061, 3719, 4815, 1802, 1599, -613, -2055, 881, 4670, 3226, -4547, -3064, -4440, -6268, -6531, -7628, -7396, -9697, -9307, -5132, -2589, -278, -1115, -5748, -8152, -6344, -3349, -172, 1412, -1141, -821, 2606, 326, -6792, -11007, -2948, 2177, -3972, -5199, -498, 2277, -1330, -2912, -540, -898, -6618, -5123, -2924, -1586, -6815, -7658, -5966, -3449, -3376, -3593, -2086, -3617, -7045, -4649, -2242, -4508, -1817, -2923, -8430, -12136, -12122, -7322, -2730, -746, 818, 33, -1636, -3903, -5959, -845, 765, -1267, -286, -1455, -4933, -6904, -5129, -1113, -433, -2096, -3007, -1987, 4360, 8157, 1994, -2011, -7308, -5442, -5031, -2653, -3773, -8403, -12437, -10769, -7307, -2857, -2928, -1114, 2830, 6904, 7981, 3280, -2197, 2711, 4881, 6811]
14247F811m236j263n68R84K566o48j993k394N5J523l634K077J227N35J663o106
14231c401J604j333M4k608J248N713N328p98q197j863K482P402l743l363J605
14216A20k729k741k058j008l219l065L877N628L810J806j180l253j867p50k328
14201h957k081J33L910k511K528K605o56K033O35N76j331Q56l01p55J329J004
14185i83J62j678J798J592K985J36k853m714k454L036L174L230J019k743m319
14170b612P20M304l488m631j151M193K067k105L538r90n389p605M29n54L977K736
14154f561K909J13j985o147q50M516K569M226L21L414N93m788j367J530J873k025
14138a659m072l75m344l209L417O613j961J258K398R56n17j329l67N019O242m87
$$ y = [6811, 2575, 1312, 744, 1728, 4294, 3646, 1653, -741, -686, 837, -2797, -720, 507, 1042, 2705, -3401, -1797, -3130, -3086, -5694, -4446, 1267, 6595, 5797, -2400, -4263, -1781, 5621, 1878, -1485, 120, -2609, -5350, -7408, -8416, -11635, -14700, -10823, -5195, -1385, 421, -759, -4012, -5879, -6629, -8957, -11038, -10905, -6995, -9506, -6978, -4373, -5029, -2996, -2361, -1785, -3116, -2260, -2561, -3316, -1987, -983, -821, -2499, -701, 891, 3876, 4012, 1159, -3555, -6009, -2973, 201, 3431, 4450, 1707, -2612, -1892, 2412, -1076, -5707, -6858, -2665, -598, -2703, 835, -155, -5544, -13149, -12720, -13274, -9297, -6561, -3652, -3539, -5524, -11671, -12521, -8005, -5436, -1210, -889, 2525, 3118, -1670, -3037, -1507, 366, -1659, -5731, -6106, -10450, -13659, -10242, -3629, -5590, -4332, -1934, -978, -1495, -2824, -3191, 1828, 8070, 7583]
14122G583l374q830M82j70J314k54k517q54P95j859l256k77K947K688R26L078
14106a578K795Q62p56l246J907j00j621j168L454P35j212k545K991K746L8j084
14090B218j208k625M631j111n374k924J963O5j565K411O144j902L145J915n182
14075F01m528n169K777N928K730R79n816J000M524j67k606k205N171L944k924
14060D239o83k117N202M633n038o96j393k850J926j100j65n673k84L622M10l136
14044c103j475J880K037m40m73K41j232n424l720J493K240L031j190k074K017
14029f192K010p03J47M349J154l40j549N266M17m505l600m6O07K972J387j203
14013A71j767l760j443j156M235Q656j207o330l569K150J951j94L684l268k70
$$ y = [7583, 4209, -4621, -4139, -4309, -2995, -3249, -5766, -6620, -5825, -7684, -10940, -11217, -8270, -5582, -4656, -1578, 1217, 2079, 1323, -1923, -16, -116, -1737, -2905, 549, 1284, 72, -2473, 518, 3264, 3302, 2218, 1010, -1615, 3016, 1905, -3469, -6393, -4430, -4365, -5930, -3519, 2625, 723, 3868, 5783, 601, -3927, -9096, -6319, -391, 2339, 3318, -2498, -1498, 3026, 2859, 253, -1952, 3219, 7163, 4239, 3556, 1439, 6641, 11274, 6236, 5540, 4147, 1297, 3223, 2123, 1958, -3715, -3999, -377, 33, -3103, -4578, -2698, -661, -1101, -1574, -1333, -2565, -7989, -11709, -10216, -7976, -4945, -6135, -8209, -6192, -4182, -4885, -4738, -389, 765, 425, -1124, 4142, 4559, 54, -3546, -3592, -2985, -13, 1374, 171, -1596, -5356, -6799, -7955, -3720, 4936, 3729, -2601, -6170, -4020, -2069, -2263, 1421, -1847, -2117]
13998b117j526k443M528N982o050K011M972L99o443k230K388J355K899L858k512
13983E071J081r37K074K848k007J376L20n422j430k61K862k870o64j565o047l798
13967i369q21j255k77l053L250L424L082L448K37k366J858J008k389L732O636
13952G145K750n482k179r89l458j866j556J43l798k257pp60J757N705K399k810
13936e263J414l359n969L07j355N952K500L77J494J605k989l160P77K015l593
13921i247n69L821J806n47l588j711N10L908M466k611m105N187J801L32p39k517
13905c803m141K028K703J176j340k859K18L92N62m782J053M158P463N21m106j571
13889b328R42N60L99k936l223j730k71K858R559j617m175K577j120k363K5l428
$$ y = [-2117, -3643, -6086, -1558, 4424, -1626, 385, 5357, 5756, -687, -2917, -529, 826, 3725, 7583, 5071, 6152, 5215, 7289, 10137, 8130, 9506, 9826, 4404, 2974, 2713, 5575, 2705, 2041, 476, -5571, -9369, -10190, -11445, -11722, -14775, -11525, -8101, -5019, -1571, -1334, -3700, -1842, -834, -3223, 509, 7145, 9895, 4413, 2234, 1245, -2213, -4079, -5635, -5492, -9290, -11547, -11554, -12314, -10557, -4852, -2453, -5263, -3849, -7208, -13177, -12870, -14225, -8273, -5773, -5396, -3902, -2297, -5286, -8446, -7669, -5654, -9247, -9816, -5995, -4189, -4736, -8324, -10035, -9525, -5617, -1151, -3762, -7867, -2680, -879, -547, -1286, -3803, -7944, -5916, -3213, -2037, -3377, -6236, -6018, -5626, -5064, -9846, -8793, -4635, 2828, 3349, -757, -2328, -1386, -826, -427, -3363, -6586, -8316, -8587, -5729, 3830, 2213, -1962, 615, -505, -2868, -2843, -6271]
13873f271K303k57m97K597J080L01l263m351p70j75L475K903j633J53j97l69J110
13856c861K776l337P24L821q5k341k191K636l904j821J059K941r97J024J140L908
13840A492m03K218N552k058k981k445p668J081M971J828J302l327j223j824J027
13825b458L819K560j442m414k668m095M821K661J767M243M22l652r438N47L186
13810d141J790n99j920M93K676P045K566K67k067n796k774k556k175K201r82M545
13794a427Q06J935L859P81j785k908M9M02l005l100m80N47J210j116k011O593
13778C50j866Q01O200J297K74k99o73k760Ll546k000k54l58L082K788n735k501
13761e197L698j970k395K400Q7J783Q33j114K76l1L130J86j853k625j683K880
$$ y = [-6271, -3968, -4225, -4722, -2125, -1045, -744, -4007, -8358, -9128, -9303, -5828, -2925, -4558, -4405, -4602, -4971, -3861, -1085, -4422, -3698, 123, 38, -2303, -4494, -1858, -5762, -7583, -6524, -3583, -4580, -3556, -2416, 1492, 1089, 3307, 8859, 6801, 3820, 1375, -6293, -5212, -241, 1587, 2889, -438, -1661, -3485, -2458, 1361, 3921, 2479, -1935, -4603, -8698, -3877, -1216, 551, 4794, 5216, 1564, -7874, -7327, -4141, -2351, -2950, -4870, -4377, -1701, 5344, 7910, 8177, 6110, 314, -2460, -5016, -7191, -4990, -5972, -1427, -621, 1314, 5173, 5954, 4169, 1261, 1310, 1712, -1293, -4393, -4873, -4326, -3116, -4232, -6243, 350, -1516, -715, 5485, 6782, 7056, 6757, 6084, 3324, 3327, -219, -2219, -2473, -2831, 251, 3039, -2696, -5197, -1499, -3469, -5864, -3464, -3377, -1594, -761, -1875, -1599, -1630, 1500, 1686, -167, -2792, -4475, -1595]
13745a595K521n88L694K14n800k957k509m010K565m24p63J199K244N15k092j973
13729i759K395j899l62N42Q23K390r6L820O383J104Q63J404o110n583L435J488
13713H38K242L095O20l56n682j006L587p36L38k559j877K280k258J309O220K277
13697H332J155o17m126N18k637N56M061m084R46m314O51L261J131r32l947j447
13681a493m66j295l682k179r24r12O287n76j248O315L326N7j255m667m56M217
13665A049j533J070J320l200r22L540l578k280L803j704J58L720m82r82j45l982
13649d148q73K413k204k594L40K192j1M217l62K001K050P1l432k360J34K00L962
13632A596J836m465j047L370K032o87j062M108L037J12j838o020k216L095K406
$$ y = [-1595, 926, 338, 4032, 4246, -1554, -4511, -7020, -11030, -8465, -8889, -9652, -8453, -6209, -5694, -7786, -9759, -7364, -9263, -9625, -9083, -8260, -5870, -5966, -2146, 4237, 5341, 6204, 7608, 1498, -4085, -650, 838, 3080, 6175, 6795, 6439, 757, -249, 3338, 2602, 2940, 381, -1496, 784, -1474, -165, 6055, 8332, 9487, 8870, 4744, 5262, 2625, 3181, 7242, 3158, 4104, -210, 441, 3702, 4833, 3901, -46, -1493, -1959, -3254, -6936, -9115, -10039, -10951, -4664, -5240, -6488, -173, 3153, 3210, 1955, -2712, -3168, 1049, -484, 586, 1906, -1294, -2216, 1324, -2254, -4534, -731, -2435, -2277, 1443, 961, -21, -166, -4148, -5021, -2608, -4812, -7406, -7066, -4874, -4885, -668, -1030, 971, 3021, 3092, -340, -2700, -2566, -2366, 1596, 3432, -1033, -2080, 1290, 3322, 2635, 1573, 5681, 8718, 8830, 6992, 972, -1244, 1851, 4257]
13617D257l601R34K556L406q18k578n461m027k996l127q82L943N356L819P998
13602H779k721k663k482K625J689n244j791p01j727n144L738N033J149O72R16
13587B128P92q3j983p561k233J746Q83K0k803O67K466n37L537j459J429k500Q75
13570d616J112J98n864k906K066K175M159O28J745R8J587K135M603j648q048K422
13554a54L971J478k566k94l161j054l707K136L280N45P25J870L12j803o426n691
13538a0539L251K615k735k798K245O346K353k619J40l93O87L063k529l94J32J07
13522a068K785J625m597j606J236l743k042L490K375n205j24M793K508j784n313
13507f670n09L463m92M077M351j326K960l10L10l186o728L83J388R25R6P1J802
$$ y = [4257, 656, 1590, 4146, 7552, 6734, 4156, -1305, -5332, -8328, -11455, -12337, -8394, -3038, 781, 8779, 6058, 3395, 913, 3538, 5227, -17, -1808, -2509, -4236, -9380, -5642, -609, 540, 1212, 2128, 2920, 2837, 854, -6707, -8940, -7194, -6311, -6291, -9094, -8427, -5961, -6498, -2961, -4420, -2991, -5491, -4616, -3504, -3306, -9170, -12076, -10010, -7835, -3676, -3048, -1303, -1205, 382, 2517, 7120, 5472, -2576, -154, 3817, 5295, 2729, 2435, -726, -1780, -5487, -3351, -71, 474, 1199, 3069, 3381, 1578, -4848, -10539, -7288, -4673, -7408, -10206, -7961, -1615, 738, -1881, -1741, -2134, -1447, 1616, -913, -1307, -1175, -1068, 1717, 3342, -1255, -2861, -1625, -5368, -7410, -3920, -1545, -6750, -6874, -2081, 427, -1357, -6670, -7179, -3716, -4208, -131, 4220, 2894, 5854, 5544, 5854, 2668, -4060, -3677, -2289, -1364, -1268, -1197, 605]
13490F05R43J337j200n22j704j923J945j024L616l200o622L090j710Q37J818N984
13474B270k450K23j964J571M68J660k635l060J068K278j852J430M474J963k441
13459C003n795m26r90J839O32j69N16K813M969m91J568N56k155r76J363J830k6
13442H061k137R77N45l914l866l398l337l52pJ83N806M814K514L731J636l788
13426G468l540k286j386J511P11k305o47j314J472j871M239M809K119M599q57
13411A2722p726j075J082K84j521O39J303K821k290N21K664K434K272N893P67
13396B0790L97k505l995j678l205j319r80n86K927N002L355o148k588j238l617
13381D612l078N219m11k463j194j044J993L326N209j370m732Q79P04j028q16l396
$$ y = [605, 1548, 2885, 1685, 1163, -541, -2464, -519, -1543, 2073, -1127, -7749, -4659, -6369, -5532, -3714, 2270, -180, 43, -1921, -350, 118, 1778, -857, -3917, -2849, -571, -2423, -993, 3481, 5444, 3003, -2792, -3218, -4208, -2369, -1737, -1906, -1390, 1423, 6392, 5901, 7469, 8025, 5870, 4894, 6257, 8087, 8061, 5924, 6901, 7446, 3532, -334, -3732, -7069, -7421, -7428, -7245, -1439, 3375, 5889, 9620, 11256, 7468, 3928, 1642, 256, 1767, 2478, 173, -474, -1788, -316, -2187, 2052, 6861, 8980, 13579, 12722, 4996, 3921, 5003, 5287, 3766, 4405, 5708, 8529, 6239, 6760, 9424, 11858, 14130, 20023, 20790, 21187, 18682, 14687, 13009, 9804, 8485, 7505, 6919, 9846, 14848, 18203, 12055, 9467, 8229, 4612, 1534, 6753, 6342, 3879, 2685, 1641, 3634, 6960, 12169, 10799, 6067, 6946, 7650, 6622, 5806, 2410]
13365B410l19N950J611R78m231n202L127k6k297m835n115M637M221K374R66M337
13349H586O060o563m257m357m735L279M191m21L183P569K973k082L670P96n853
13334A2039n40R11j514l670m166k0j058m587o13N264L180J55o453j711n91J726
13318a648N274N887L093j722o367n483J587N903j808j895l977J059M270K107O14
13303F894p09j380m241k871M809O691J37l209L43K265J111l362P58l982l697K955
13287B512J710m39j961J621N72K683k694m959j767n83J847J966k038N074P73L28
13271D645l937J487N01l531M004Q61J516K871K880n897k325J286K837K598n436
13256D360m33J259j400j869j230o33j528k789J392O017J764j222J961M233J168
$$ y = [2410, 2091, 8041, 9652, 10630, 6399, 1197, 4324, 4298, 2001, -2834, -7949, -3312, 909, 3283, 4249, 8586, 14646, 8083, 3826, -531, -5266, -1987, 2204, 1783, 4966, 12535, 15508, 13426, 17096, 17892, 12039, 11499, 12410, 10896, 7226, 3060, 3040, 1982, -2605, -3218, 2046, 5226, 5381, -1072, -2783, -3374, -1648, 3626, 9513, 12606, 10884, 4517, -966, 621, 6524, 4716, 2821, -1156, -97, 4173, 6280, 6894, 6185, 4805, 564, -2307, 2502, 9193, 9330, 6121, 6464, 8729, 9840, 6478, 7236, 3254, -443, 2512, 4222, 3783, 1822, 3443, 4015, 6698, 4004, -955, -2722, -3305, -1458, 508, -1530, 3544, 4317, 4645, 708, 2195, 2696, -835, 3169, 4030, 5546, 8417, 11297, 5400, 3075, 4361, 7198, 9796, 4360, 3927, 5186, 3786, 1917, 687, 54, -1474, -4263, -2871, 3146, 4910, 3688, 5649, 9882, 11050]
13241A1050M934m070o269J63P35j971l832L393L271K231j542J060J941n74j049
13226I471j843k65k874m273M52J301K681J186Q39N548o54l957J395O18k377k18
13210G030l764r3l425P38K485J061j549m42M257J037q870J210N447M922p25J798
13194A1117K877l171k378m509K975j358l470j821L497J717j420l927o020K23J800
13179c868P898M54k130j195k10M52J34k097J423M604M187J283n691J6k191O299
13163I368L390l928o872o496L6L206K680K98J107J218j16K268J328o730K383J199
13147D339M066j033j531l753j152K486M285L276L69k171l665P81L721o050L099
13132G067K422M861r79r104n280J386r09m3N902J82J426K442j954q21k54k517
$$ y = [11050, 15984, 11914, 5645, 5808, 6543, 4572, 740, 4133, 7404, 9635, 8093, 9153, 11094, 10520, 9471, 7628, 7363, 4489, 216, 668, 1969, 4650, 5836, 6675, 12223, 11569, 7612, 9007, 9625, 7248, 7030, 3266, 3173, -252, 486, 2971, 4032, 2483, 2041, 6298, 7335, -1535, -325, 5122, 10044, 9319, 11117, 13994, 10823, 8445, 3936, 6911, 5553, 2083, 262, 3759, 5476, 4056, 129, -5891, -5668, -3868, 4030, 4484, 2354, 1159, 949, 1401, 1535, -562, 861, 5465, 9652, 10935, 5244, 5260, 3069, 9368, 12758, 8830, 1958, -4538, -4502, -1296, 1384, 1682, 2789, 4007, 3891, 6159, 7487, 757, 3140, 4339, 8405, 7372, 5841, 2088, 936, 3422, 7707, 10983, 11352, 9181, 5516, 6297, 10018, 3968, 7067, 9489, 14350, 13371, 4267, -1013, 373, -536, -579, 5323, 5505, 6931, 9373, 7419, 6598, 6344, 3827]
13116C827k717J248L940J002j132k318n883k823N327O823L400j768n095l436J479
13101A874K044J999j903o65O947M827l839n520p14k996m63J25k055l50J283r82
13085c88K110n83L170K778p44j969j918J312k174k054l441l041M205K974M779
13070E016r96k448j557j558J767K455l534l203L486O89l976K82L889L728O86j977
13054B749j253J273k743p03L078J054p64J797L398K050L843L88k994m66l295m957
13038B455l602j499J622O584N456L955K78k72m07n613k454P8j102K750N364l432
13022A0161m252l022L541l473J418J61j090Q60L36N582R92l699k462Q69j847K87
13006D362M393P365j672l624j116J777L741m484l937k755j844J345J330J307M133
$$ y = [3827, 1110, 2358, 6298, 7300, 6168, 3850, -2033, -4856, 471, 7294, 10694, 8926, 3831, 395, 1874, 3918, 5917, 4014, 3349, 10296, 15123, 11284, 5764, 5050, 2054, 1591, 1716, -339, -689, 594, -388, 1722, 1139, 4309, 7087, 6343, 4374, 2456, 3768, 1594, -460, -3901, -6942, -2737, 237, 5016, 4020, 1572, 15, -1543, 224, 2679, -855, -4058, -572, 117, -3859, -3577, 312, 4040, 4726, 2749, 1496, 2769, 26, -677, 2401, 3455, 2691, 4488, 7886, 9936, 13779, 14167, 11173, 10707, 7412, 2455, -1147, -2646, -1024, 5560, 11016, 14971, 15249, 14977, 14570, 8957, 6503, 6581, 5479, 8229, 13593, 10161, 5909, 2887, 6428, 2955, 4373, 4534, 3444, 4304, 4640, 10222, 11214, 7515, 5053, 5922, 4075, 4362, 8755, 16120, 14448, 10824, 9708, 11485, 15226, 10742, 6805, 4050, 2206, 3551, 4881, 6188, 10321]
12991A0321O98K974K087K146o42p473k277q57j065p28J457M633K264J226m499
12976A0265k163rP93k989l882L627L813J041L10m59K833N387K952j943k860p55
12960A5961K303M401O579N01m157K221K129n674n18J098k9q53K013K821R70j985
12944B7781K261K625k716n522l525j079J333m146o904J518M746L539j118k198
12930A6595M007l773n126j66K571J773K056K25L462M155O99M386K782L703K750
12915D0099J544N88L117k320l845r95K120k567j339j543J820L173P280k027K155
12900D7260L066p76j834l516r872m14J454n525R8l222m862j899O15k981m139M7
12884A3500O961M953k833J319L076o124l887M914M463L321K850j402l257j035
$$ y = [10321, 11019, 13993, 16080, 18226, 17584, 10111, 7834, 6977, 5912, 5184, 6641, 11274, 13538, 14764, 10265, 8102, 8093, 8886, 5897, 2015, 5642, 9455, 10496, 10806, 10347, 13180, 18567, 21519, 19576, 16716, 15961, 18264, 22665, 29244, 29745, 25588, 27809, 29938, 24264, 23746, 24844, 24815, 23962, 25975, 28796, 29766, 27781, 30042, 32667, 29951, 24429, 20904, 19825, 21158, 17012, 10108, 11626, 16372, 19911, 18793, 16595, 20602, 16829, 11703, 11537, 14108, 15881, 17937, 18162, 21624, 25779, 26478, 30864, 33646, 37349, 40099, 41643, 42231, 45348, 43028, 39183, 38188, 40308, 37741, 36402, 34859, 36679, 39852, 47132, 45105, 47260, 50326, 49550, 47716, 44200, 34328, 33914, 35368, 29843, 29941, 26719, 21857, 19958, 20573, 17592, 13453, 13500, 20461, 25414, 22581, 23900, 26976, 20852, 16965, 21879, 26342, 29663, 32513, 31111, 27854, 26819]
12870B6819l313O456J510j982N85L439L165l935J181L549K59q31k480q40J852
12855C5434K752k686k044o91L97l606j417K750m002J303N612L942k964p966N86
12840B7400P307M145l983L64L387j474l265j292k883Q16p79R30n57m375K336J3179
12824D1256J6284N720p309m076o00j1157o951P276Q389Q634k00j809n511P2O415
12809E6433Q853R800N749P988J1472K791k158l199o70K246l10K463L121J474J280
12794A07333j235l039M320N114P32M021J0556J0698J4664J2569J2034J8510J7958
12781B14235L305l811l090q408j7551j4481j3203j2119q414q448q410r878o216
12768A03511j326p59R76p56n174m677r43O360K878L638M112Q244N919N857J1641
$$ y = [26819, 23506, 29962, 31472, 29490, 30075, 33514, 36679, 32744, 33925, 37474, 37733, 36902, 34422, 33582, 35434, 38186, 35500, 33456, 32765, 33162, 29556, 28139, 30889, 26887, 28190, 33802, 37744, 34780, 26814, 27400, 34707, 38852, 34869, 35233, 38620, 37146, 33881, 32589, 29706, 30522, 29743, 30673, 30116, 25741, 28077, 41256, 57540, 63260, 55951, 51875, 51275, 40118, 33167, 40443, 48832, 57466, 57266, 55457, 49946, 50018, 56433, 65286, 75086, 80835, 88823, 100295, 103086, 100928, 97729, 97059, 99305, 98995, 101458, 104579, 106053, 107333, 106098, 103059, 107379, 112493, 113225, 117246, 127802, 138500, 153164, 165733, 177767, 196277, 214235, 217540, 213729, 210639, 202231, 184680, 170199, 156996, 144877, 136463, 128015, 119605, 109727, 103511, 102185, 101426, 102402, 101646, 96472, 91795, 90852, 97212, 100090, 103728, 107840, 116084, 122003, 127860, 139501]
12753A39501J0137Q885l474J605J869m313k905K200J1678J6728J8903L6208M5709
12740B82731N1042M3364M0895K6963J7276j141j2532k4900l4905l3916l1693l3419
12728B89765k7805k0638j7781j5257j0338q700j2907j4548j2860j0064j2161j0781
12716A15925l225J090J007J90R36l906l75L778M771o87j812k085m509K121M388
12701A17607O55M221L897R855J5413J4836J7557J9245J9175J5513J2037N539n548
12688B50002j3645j6300j6947j5769j2175j5785j4271q772n219m282j5587r361
12676A01889k166k185q906n593j531n443k530j106j048q38k588J346L131k892
12662F9540O67K132j814k171j265K076m87j648r39m842j226n031n445J657R00
$$ y = [139501, 149638, 158523, 155049, 156654, 158523, 154210, 151305, 153505, 165183, 181911, 200814, 237022, 282731, 333773, 377137, 418032, 444995, 462271, 461130, 448598, 423698, 388793, 354877, 323184, 289765, 261960, 241322, 223541, 208284, 197946, 189246, 176339, 161791, 148931, 138867, 126706, 115925, 112700, 113790, 114797, 114987, 115923, 112017, 111642, 115420, 120191, 119504, 117692, 115607, 111098, 113219, 117607, 118262, 122483, 126380, 136235, 151648, 166484, 184041, 203286, 222461, 237974, 250011, 255550, 250002, 236357, 220057, 203110, 187341, 175166, 159381, 145110, 136338, 131119, 126837, 111250, 101889, 99723, 97538, 88632, 83039, 81508, 76065, 73535, 72429, 71381, 70543, 67955, 69301, 72432, 69540, 70207, 72339, 70525, 68354, 67089, 69165, 68678, 67030, 66091, 61249, 60023, 54992, 49547, 51204, 52104]
12647E2104N14N99n093o976K32N13q27L916M974M643J11n978J770o340o351l958
12631C3853P011N212L102m65k224l974k923o43j93k395l472l94J058K461M247
12616D0261m601l862N18j23k881k095L593k698k810l779M78J120r63K292J23L92
12600B4965n30L174K640J674l253M589j363j881k578j156k66J700j496l719l225
12585A9275K697J299K358J337J644Q67k899q355m638M556O282j10k0k234m321
12570A7738m243J759O021k041J714N01L091M016Q43j695r44J111J993q03n65o145
12554B2351k761J23j253K258J064L554k184k520m665j71N267M583P0j063J390
12539B6043J608L99l031k054k50K30j464L60L634k824m617J054J419l14j563J906
$$ y = [52104, 52618, 53217, 48124, 41148, 41380, 41893, 41066, 44982, 49956, 54599, 54710, 48732, 50502, 44162, 37811, 33853, 40864, 46076, 49178, 48713, 46489, 42515, 39592, 38949, 38756, 36361, 32889, 32495, 33553, 36014, 40261, 35660, 31798, 32316, 32193, 29312, 27217, 30810, 28112, 25302, 21523, 22001, 23121, 22158, 24450, 24573, 24965, 24435, 27609, 30249, 31923, 28670, 33259, 31896, 30015, 27437, 26281, 26015, 27715, 26219, 22500, 19275, 21972, 23271, 25629, 26966, 28610, 29477, 26578, 18223, 13585, 18141, 24423, 24313, 24293, 22059, 17738, 13495, 15254, 21275, 19234, 20948, 21449, 24540, 28556, 29399, 27704, 26760, 27871, 29864, 29061, 28496, 22351, 19590, 19713, 18460, 20718, 21782, 25336, 23152, 20632, 15967, 15796, 21063, 25646, 25716, 24653, 26043, 27651, 28050, 25019, 22965, 22715, 22945, 21481, 21841, 25475, 22651, 18034, 19088, 20507, 20193, 18630, 20536]
12523B0536M91k196j130L997M298p33K94j165l805m14J160L843m60k384l898J83
12507A8617J8l379q45o12j081j050M339J977P64j883J044r65k893r42N95j826
12491A1878J621J840k598J639M712L659N46L174q62j056J185N258K910J116k195
12476C2827j026j430l72M110j770L530K484J948L664O573N857P060M96n51q124
12461E5276l203j177o584j240k424J163j510K036j702n140j727m69j313q68q05
12446C0313Q16j195Q78k964j347p02j656l208j022J737j03Q40j60L146J144q73
12430B5644n822o338L164K161j374n51J750L814M881L918N052L288n220p255M93
12415B7605k658m059O781N845j661j09j820j947N14K86l89P14j880k445M359J67
$$ y = [20536, 21027, 18831, 17701, 21698, 25996, 25263, 25557, 24392, 20587, 20173, 21333, 25176, 24716, 22332, 18434, 18617, 18635, 15256, 14411, 13799, 12718, 11668, 16007, 17984, 18748, 16865, 17909, 16944, 14051, 13109, 13704, 11878, 13499, 15339, 12741, 14380, 19092, 22751, 23297, 26471, 25609, 24553, 25738, 30996, 33906, 35022, 32827, 31801, 30371, 29999, 34109, 32339, 35869, 38353, 40301, 43965, 50538, 56395, 63455, 63951, 63400, 55276, 52073, 50896, 44312, 43072, 40648, 41811, 40301, 42337, 40635, 35495, 33768, 33299, 31986, 31118, 30313, 31129, 29934, 30812, 27848, 26501, 25799, 24143, 20935, 19913, 21650, 21547, 22387, 22227, 25373, 26517, 25644, 19822, 13484, 16648, 18809, 17435, 16884, 18634, 22448, 27329, 31247, 36299, 39587, 34367, 27112, 27605, 24947, 20888, 27669, 33514, 31853, 31744, 29924, 27977, 28491, 28777, 28388, 29102, 27222, 24777, 29136, 29303]
12399B9303m95K001n54m71k284n732K89N679k815N90J586k292J830n45j169M981
12383B9902J326L675L641K025L398j945l474j110q47n244p199L232N839r97l589
12368B8633L576J213L008J448m887j045J990r53R06j738j350m639j909K001L307
12353B9561N9l795O18M398J901M002k863j42K178j49K516K439O57j013K475j847
12337D0995l837k143L83J815N636o7J807l843k125L375k158m883l483q44K473
12322C3101j554m81m718N04N358N204L144J422l067L226O354o57l131l28N140
12307D9517m41K37K586k532m07L58k736j453k628L5K115R70j484p65n218k546
12291C5608O076J545J823K650n892j037N589Q58k986j010o91j346P738L054K022
$$ y = [29303, 28808, 30809, 30255, 29784, 27500, 21768, 22057, 27736, 24921, 25511, 27097, 24805, 26635, 26090, 24921, 29902, 31228, 34903, 38544, 40569, 43967, 42022, 38548, 37438, 36591, 31347, 24148, 27380, 33219, 32222, 28633, 32209, 33422, 36430, 37878, 32991, 31946, 33936, 32983, 33889, 32151, 30801, 26162, 24253, 26254, 29561, 29620, 25825, 26443, 30841, 32742, 36744, 33881, 33739, 35917, 35768, 38284, 40723, 41380, 40367, 42842, 40995, 37158, 35015, 35398, 37213, 42849, 42782, 44589, 40746, 38621, 41996, 39838, 34955, 31472, 30628, 33101, 31547, 31066, 26348, 26852, 32210, 37414, 40558, 41980, 38913, 42139, 48493, 47836, 44705, 44377, 49517, 49076, 49313, 51899, 49367, 48960, 49318, 46582, 45129, 42501, 42536, 44651, 45621, 44137, 43372, 38154, 35608, 41684, 43229, 45052, 47702, 41810, 40773, 46362, 47220, 44234, 43224, 42533, 41187, 48925, 51979, 54001]
12276E4001M105k242n930q178J443L720q26K490J168p35n39L79J025l808m455
12261D1618m240j769J132M454J63L643m56j653k82K919K861K476Q15k050L180
12246E2811R002J341N367n51k926n94O95K862J254K942k018R17kl501L905l508
12230F7996q65p98j861m2m351l869n879J238O630l092m596Q09K094K051M032M20
12214E9917J654L26M137J657m447j705j032P40j782m59m5L65M203R21N89K436
12198F7475L631J183k123n274J742N842j253n15M249P768K336N410o86k347p64
12183H6674j23p6j427l910k714j392l230k107m84l560j268M519K071o595m883
12168F1495L766N309K5j973m842L728k641n046L174K26J690J290J592L434K93
$$ y = [54001, 58106, 55864, 49934, 41756, 43199, 46919, 46093, 48583, 49751, 49016, 48477, 48856, 49881, 46073, 41618, 37378, 35609, 36741, 41195, 41358, 45001, 44545, 42892, 42610, 45529, 48390, 50866, 51681, 49631, 52811, 61813, 63154, 68521, 67970, 65044, 64450, 65145, 68007, 69261, 72203, 70185, 71102, 71100, 67599, 71504, 67996, 67131, 66333, 64472, 64430, 60079, 56210, 50331, 51569, 58199, 55107, 50511, 51320, 53414, 55465, 59497, 59917, 61571, 61897, 66034, 67691, 63244, 61539, 60507, 61247, 59465, 59006, 58961, 59326, 63529, 64450, 65039, 67475, 71106, 72289, 70166, 64892, 66634, 72476, 71223, 70708, 74957, 82725, 85061, 90471, 89785, 87438, 86674, 86551, 86475, 85048, 81138, 78424, 77032, 73802, 71695, 71211, 67651, 66383, 70902, 72973, 66378, 61495, 65261, 70570, 70595, 68622, 63780, 67508, 64867, 59821, 62995, 63221, 64911, 66201, 67793, 71227, 71520]
12153G1520J203O33J514L205q25m006J263N892L512o5n40k202L169O71l21n88
12137H4035K77m831k063J791N22k446o488q59N563L384L471O100M411R413R443
12122A11723N438L630j848M89j727L24N256N233J0545J8176J8171K9492L7788
12109B42690L5747L3121K1507Q103k723j5315k7651l3829l2592k3682j4069r409
12097A81898r505r988n383j588L360L618M965K615K457K968L72R17M965O994O769
12082A95434M569O573J1389J6315J7754K0858K0392J6183J9828J9166J7952K7216
12070C93629K4174J8985J1723k53m447q638j8656j5966j671P306Q152K0528K7799
12057D62665K3863J1560L35o788j1774k5947l2720k2258j7275j0161q709p700
$$ y = [71520, 72723, 73356, 74870, 78075, 77250, 73244, 74507, 80399, 83911, 83846, 83306, 81104, 84273, 84944, 84623, 84035, 84312, 79481, 77418, 79209, 79731, 77285, 70797, 69938, 75501, 78885, 82356, 88456, 92867, 102280, 111723, 117161, 120791, 118943, 119432, 117705, 118029, 123285, 128518, 139063, 157239, 175410, 204902, 242690, 278437, 311558, 333065, 341168, 338445, 323130, 295479, 261650, 229058, 205376, 191307, 181898, 172393, 162405, 157022, 155434, 158794, 162412, 167377, 169992, 172449, 175417, 175789, 176706, 181671, 188665, 195434, 200003, 206576, 217965, 234280, 252034, 272892, 293284, 309467, 329295, 348461, 366413, 393629, 417803, 436788, 448511, 448258, 443811, 435173, 416517, 400551, 398880, 406186, 414338, 434866, 462665, 486528, 498088, 498423, 491635, 479861, 453914, 421194, 398936, 381661, 371500, 362791, 355091]
12045C55091j2462j1459q937j2805n520M654L393J5765K1865J6661K1077L2635
12033D19958L2060L1811L5922K8551J3033P64P434p40j315j3349j8591j9301j8078
12020D98159k1580k7584l2862k8788k1876j2899j289N984Q737N556j994N7j200
12007C68421j0464j4073j4158q677q092p781o229o315k852O9L024N444O390J9244
11993C23951K8566L0422L4500L4614L2738J8864J2589R289P627O711O583P145
11981E53599M483n142k1432k5279l4006l6023l3217k6144j6413j0839j4283r207
11969C26097q443o505l788o909q221l827m27N904M757K272j593J679O615Q799
11955C16410J0531J3020J6441J6452J2844J0602R581R473J9688K7290K9172K8131
$$ y = [355091, 342629, 331170, 322233, 309428, 303908, 308562, 311955, 327720, 349585, 366246, 387323, 419958, 452018, 483829, 519751, 548302, 561335, 562099, 569533, 568793, 567478, 554129, 535538, 516237, 498159, 476579, 448995, 416133, 387345, 365469, 352570, 351281, 357265, 366002, 371558, 369564, 369621, 368421, 357957, 343884, 329726, 321049, 312957, 305176, 298947, 292632, 289780, 289849, 292873, 298317, 304707, 323951, 352517, 382939, 417439, 452053, 484791, 503655, 516244, 525533, 533160, 539871, 546454, 553599, 558082, 552940, 531508, 506229, 472223, 436200, 402983, 376839, 360426, 349587, 335304, 326097, 317654, 311149, 307361, 300452, 292231, 288404, 287977, 293881, 298638, 300910, 299317, 300996, 307611, 316410, 326941, 339961, 356402, 372854, 385698, 396300, 405881, 415354, 435042, 462332, 491504, 519635]
11943E19635K8480J6863l975j5300l0471k9489k7283k0252k0082j3601r385r592
11931C85548j4852j2156q676j1473j7470j3378m880m592o767n403k931k068l133
11918B77769q132N882O552K588L734J5113K6559L3017M1056M7019M6769M8242
11906E46168M1204K5111M022j8741l8107m8535n2916m7608m1826k9083j6821j5576
11894C07292j2916p978n656m934J029N873O570Q705J4138J7233J0080K290p7p0
11880C41579m827Q35J2527K6996L1169J6533N01r242j5225k3476l1125k7932j1724
11867C06589l573J401O458N986R983O923j336j1495j6412j9494k3720j5240n337
11854B40733r700m947k146k381K726O431K172J0374J6572J4722L0725L7094L7720
$$ y = [519635, 548115, 564978, 561003, 545703, 515232, 485743, 458460, 438208, 418126, 404525, 395140, 385548, 370696, 358540, 349864, 338391, 320921, 307543, 302663, 298071, 291304, 285901, 282970, 280902, 277769, 269637, 275519, 282071, 284659, 288393, 303506, 330065, 363082, 404138, 451157, 497926, 546168, 587372, 612483, 616505, 597764, 559657, 511122, 458206, 410598, 368772, 339689, 322868, 307292, 294376, 286398, 280742, 275808, 276837, 282710, 289280, 297985, 312123, 329356, 339436, 341726, 341649, 341579, 336752, 337587, 350114, 377110, 408279, 424812, 425313, 416071, 400846, 377370, 346245, 318313, 306589, 303016, 304417, 310875, 316861, 326844, 333767, 332431, 320936, 304524, 285030, 261310, 246070, 240733, 231033, 226086, 223940, 221559, 224285, 230716, 232888, 243262, 259834, 274556, 305281, 342375, 380095]
11841C80095K5817P835J181j5562k9629l2190l2373k2019j8653j3420j1915j0053
11829B29114n217l847m873k733l01R89n34j899k231L679N692R090J1372J3537
11815B51838J9551K6511L7844N2071R4348J72617L40872N38932M77693L23361
11805B335638K46907n46516o65606l30786j67877r4790p5906p1815n6967m3401
11795E28881l7342l0707k3054j5865j7864j2144q928o651p564j5120j3846p711
11783C32085k252j351j992K28L46K31J970K24j419J864O859O987J0498J0261J5464
11768C80003K1567K3607K0857J0674j4358k3196j6791j3268j4628p895p306n280
11756C53986q495r030k699m947j690l50r48m638q991q437o582q260q226j044Q82
$$ y = [380095, 405912, 413747, 414928, 399366, 369737, 337547, 305174, 283155, 264502, 251082, 239167, 229114, 223897, 220050, 215177, 212444, 212143, 213132, 212598, 210699, 208468, 212147, 217839, 226929, 238301, 251838, 271389, 297900, 335744, 387815, 482163, 654780, 995652, 1534584, 2012277, 2335638, 2582545, 2036029, 1370423, 1039637, 871760, 776970, 701064, 629249, 572282, 528881, 491539, 460832, 437778, 421913, 404049, 391905, 382977, 376326, 368762, 353642, 339796, 332085, 329833, 328482, 326490, 326718, 327064, 327295, 329265, 329489, 328070, 329934, 336793, 343780, 354278, 364539, 380003, 401570, 425177, 446034, 456708, 442350, 419154, 402363, 389095, 374467, 366572, 359266, 353986, 345491, 336461, 333762, 328815, 327125, 326775, 325827, 321189, 312198, 303761, 297179, 288919, 280693, 279649, 280531]
11741B80531l193o675l302k162J540N34j005J267p023q306m987R58J718p39L027
11726B52183J128n304k359K081m13k976l812j834K86P548Q647M459M230k478J839
11711B63225P702N935J935o44jj765n433o995j14N544j583m222q0L274k75j204
11695B65299j243q642p017L13j003J03N912O577R74j141p82l526n656m087l101
11680B42980k668l9o79Q20Q871L58K40j284k196p310o803k224l806j414k248k424
11664B20174m159o489q305m635l693l508L142L176k535K069Q98m140j913o991
11650A83091J640K356J686l655r153p44N150K081P11K077M485R94O434P005o242
11635A97916m849M38R093J179L172L967M266J683M042P97j911L402P21M267M532
$$ y = [280531, 277338, 270663, 267361, 265199, 266739, 267273, 266268, 267535, 260512, 252206, 247219, 248177, 249895, 249156, 252183, 253311, 248007, 245648, 247729, 247316, 244340, 240528, 238694, 238980, 246528, 255175, 259634, 263864, 261386, 263225, 270927, 276862, 278797, 278153, 278152, 276387, 270954, 263959, 263845, 269389, 267806, 263584, 263504, 266778, 266503, 265299, 264056, 255414, 248397, 248710, 247707, 247810, 253722, 260299, 261273, 260132, 259350, 255824, 250168, 246081, 242980, 240312, 240273, 239594, 240414, 249285, 249643, 249883, 248599, 246403, 239093, 232290, 230066, 226260, 224846, 222598, 220174, 216015, 209526, 201221, 196586, 192893, 189385, 192527, 195703, 193168, 195237, 196135, 191995, 190082, 183091, 184731, 187087, 188773, 185118, 175965, 175221, 180371, 182452, 183163, 185240, 189725, 190719, 197153, 204158, 197916, 193067, 193505, 202598, 203777, 206949, 210916, 215182, 216865, 220907, 221704, 219793, 223195, 223916, 228183, 232715]
11620B32715O415M151K53l233o100m752n311n005r17M396Q41k618k995M5R28O67
11604B19480j3o737n447N81j668J001k902J33k136J266j422l705N49K378N455
11589B06813K151M170J785k822n607j653k039P062L638n25m418p615k327J609
11575B00222Q35J202n00K45J468Q84k48k038m98m91k595N79O41K539J502J687
11559B05434k340J665Q889O467j152M685O869L335j881k449j406j924l644L1L953
11544B26532j303o913k865M566N809L569L530M999K316L496j616r33M747K877
11530B48811J806j672n403k694K92n83N750R313O382l12J584M661P012Q889M799
11515B88635J1040J2101J2907K2984L4038N6687R0387J10800J04955Q3787L8500
$$ y = [232715, 239130, 243281, 243534, 240301, 234201, 229449, 224138, 219133, 218216, 222612, 223453, 220835, 217840, 217885, 218813, 219480, 219467, 212730, 207283, 207864, 206196, 207197, 204295, 204428, 202292, 203558, 202136, 198431, 198980, 201358, 206813, 208964, 213134, 214919, 212097, 206490, 204837, 202798, 209860, 213498, 212973, 208555, 200940, 198613, 200222, 201057, 202259, 201759, 202004, 203472, 204356, 204108, 202070, 201572, 201081, 198486, 199065, 199706, 202245, 203747, 205434, 203094, 204759, 213648, 220115, 218963, 223648, 230517, 233852, 231971, 229522, 228116, 226192, 222548, 222579, 226532, 225229, 218316, 215451, 220017, 225826, 229395, 232925, 237924, 240240, 243736, 242120, 241187, 245934, 248811, 250617, 248945, 243542, 240848, 241140, 240557, 246307, 255620, 262002, 261690, 263274, 267935, 274947, 283836, 288635, 299675, 311776, 324683, 347667, 381705, 438392, 528779, 639579, 744534, 828321, 866821]
11504H66821m7894r8655q5711n9349m5464k6732j2534j2682j2788o663k257m884
11492D51208j80N278J3048Q115R123O829J5839J4511J6832K0898J6713J7927J8703
11479F14844J5263J6413K1862L0761M5558N1406O1700N9905O3330O9253O3548
11468A113843M3858L518l9604n3772m0373k9775k7164k4057k2250k1339m960J7963
11456I15888L1206L3766L5333M0379K9971K171k2651m0185n9228o9721o1998m7142
11444G87789l4636k5473k3377j9483j3710m890j246M445K1123M0018O3579J00497
11432H94636J22028J20586Q6004K8325m0252o1356l1426K025J5925O729r1J0301
11420A153434L7323M1500J8079k2943o0121q3198p4337m3884j5553J0093L0754
$$ y = [866821, 818927, 720272, 634561, 575212, 529748, 503016, 490482, 477800, 465012, 458349, 456092, 451208, 451028, 456306, 469354, 477469, 486592, 493421, 509260, 523771, 540603, 561501, 578214, 596141, 614844, 630107, 646520, 668382, 699143, 744701, 796107, 857807, 917712, 981042, 1050295, 1113843, 1157701, 1161219, 1121615, 1067843, 1027470, 997695, 970531, 946474, 924224, 902885, 897925, 915888, 947094, 980860, 1016193, 1056572, 1086543, 1088714, 1066063, 1025878, 966650, 896929, 834931, 787789, 753153, 727680, 704303, 684820, 671110, 666220, 664974, 669419, 690542, 730560, 794139, 894636, 1016664, 1137250, 1223254, 1251579, 1211327, 1149971, 1118545, 1120570, 1136495, 1143224, 1143133, 1153434, 1190757, 1232257, 1250336, 1227393, 1167272, 1084074, 1009737, 965853, 950300, 960393, 991147]
11409I91147N0789N6054M5685K3596j7446n6726o7146m6435l0452k1724j4619
11398I12723p969q06K272j875J217l168l606OL275M191K9040N6427Q1455J06065
11384A179247J18208R2653L8567j3132n5528q1407r3810p2071m1759k7117k0767
11373A023084k1493j6162p581j3393j5140p764j2464o642j0261p257o517j0307
11361H88103k0908k5217k6119l1232k2184k0478j4912j3975q479K711j904l377
11349G02029M052K248m527q924q871m964j1630p881q948j8992j4759j9678j1697
11336E87458n159o232p826l472J308L449P268J2338J2822J2852J3591N691J784
11323F35872K75n072r872p634L957J1541J2647J1200O675M386Q145J102m163l918
$$ y = [991147, 1041936, 1097990, 1143675, 1167271, 1149825, 1093099, 1025953, 979518, 949066, 927342, 912723, 904754, 903948, 906220, 904345, 905562, 902394, 898788, 898794, 902069, 906260, 935300, 991727, 1073182, 1179247, 1297455, 1390108, 1428675, 1415543, 1360015, 1278608, 1184798, 1112727, 1070968, 1043851, 1023084, 1001591, 985429, 977848, 964455, 949315, 941551, 929087, 922445, 912184, 904927, 898410, 888103, 867195, 841978, 815859, 784627, 762443, 741965, 727053, 713078, 704599, 707310, 705406, 702029, 706081, 708329, 703802, 694878, 686007, 681043, 669413, 661532, 652584, 633592, 618833, 599155, 587458, 582299, 576067, 568241, 564769, 566077, 569526, 576794, 589132, 601954, 614806, 628397, 634088, 635872, 636147, 631075, 621203, 613569, 617526, 629067, 641714, 652914, 659589, 663975, 672120, 673222, 669059, 665141]
11309F65141j9590j8319j1028n998N602O879L638l383n289k576O786M702O833
11296F33398Q458R810P287P127N485O999N910j78R532J1212P696L880L261j782
11282G18095j9574l3290k8561k9227j9531j2767l356k831K3M438J4359Q309M720
11269F00807O532R422n04m949j0449q966p690q083p405J862K4751L1767L480J9648
11255F50223L1105P608O997j3192k5067j8839l7461k6091n154l036Q1O742L967
11242E77883J947N582K022m08L095k880n273L000L612J654K160p58J456J195n89
11227E93698R36l299p841j1122j8801j6527l741Q980J3524K0157K6561K6232K4721
11214F53478J2813J0458J0480L862k073K952P646J0233R459P230J369j615K754
$$ y = [665141, 645551, 627232, 616204, 610206, 615808, 622687, 626325, 622942, 617653, 615077, 621863, 626565, 633398, 641856, 651666, 658953, 666080, 671565, 678564, 684474, 684296, 693828, 705040, 712736, 716616, 719877, 718095, 698521, 665231, 636670, 607443, 587912, 575145, 571789, 568958, 568981, 573419, 587778, 596087, 600807, 607339, 616761, 616257, 611308, 600859, 591893, 584203, 576120, 568715, 570577, 595328, 627095, 630575, 650223, 681328, 688936, 695933, 682741, 657674, 638835, 601374, 575283, 570129, 567093, 567174, 573916, 577883, 579830, 585412, 587434, 587026, 590121, 587241, 581968, 584968, 588580, 590234, 592394, 591636, 593092, 594287, 593698, 594634, 591335, 583494, 572372, 553571, 537044, 533303, 542283, 555807, 575964, 602525, 628757, 653478, 666291, 676749, 687229, 691091, 689018, 691970, 699616, 709849, 719308, 726538, 727907, 726292, 729046]
11201G29046k80j080J473r527j2586j0711j2083j5126l296L245l218o646M74K7749
11187F87434L6328K8652K8836J8829J7906K9057L5246K4303J9334Q894R238J2206
11175I56263J3435J3675K1617K3298K3304L5280M2395L7622L7910M7524M9075
11164A301398M1874L2622K7820L2288L2365L6254L9597L3861O716j6861k5892
11153A542042k7529k3883l180N506J3477K4748J6599J7778J3602J6749K0731K0261
11141A636901K3778M0860M6771M2403M3174M8938M8052L4231J6069J2712K2855
11130B016744M2304P3645Q5110R6006R5560Q0918Q2630J07390R0821N4282N3396
11119B878806O7639R2206J14181J51852J92139K38138K94053L19506K95665K58402
$$ y = [729046, 728766, 727686, 729159, 719632, 707046, 696335, 684252, 669126, 665830, 669075, 665857, 659211, 659685, 687434, 723762, 752414, 781250, 800079, 817985, 847042, 882288, 906591, 925925, 934819, 944057, 956263, 969698, 983373, 1004990, 1028288, 1051592, 1086872, 1129267, 1166889, 1204799, 1252323, 1301398, 1343272, 1375894, 1403714, 1436002, 1468367, 1504621, 1544218, 1578079, 1584795, 1567934, 1542042, 1514513, 1490630, 1487450, 1492956, 1506433, 1531181, 1547780, 1565558, 1579160, 1595909, 1616640, 1636901, 1660679, 1701539, 1748310, 1790713, 1833887, 1882825, 1930877, 1965108, 1981177, 1993889, 2016744, 2059048, 2132693, 2217803, 2313809, 2409369, 2490287, 2572917, 2680307, 2771128, 2825410, 2878806, 2946445, 3038651, 3152832, 3304684, 3496823, 3734961, 4029014, 4348520, 4644185, 4902587]
11109D902587K41143K64230L14282L83318M46250N11454O52613Q79484J172458
11100I767819J489251J786029K081383K459668L049775M228136O640730J1012604
11092D2515395J6827976K0664119J9082353J2809886J197410j4312806k1463172
11085G7321161j7316226j0981489o922271m823656l768724l139740k634865k187962
11077B5546228j755515j310489q78940n14814k68922r6432P2998K93569O26621
11068B1714304J107393J610820K185511K759227L254460M075723M843911N272996
11060D6824345O024841O730043P033137Q340436R820743J0698878J3130938J4178895
11052A22782256J1244559O472395k576971j2735420j4028672r492721o604207
$$ y = [4902587, 5143730, 5407960, 5722242, 6105560, 6551810, 7063264, 7715877, 8595361, 9767819, 11257070, 13043099, 15124482, 17584150, 20633925, 24862061, 31502791, 42515395, 59343371, 80007490, 99089843, 111899729, 113097139, 98784333, 77321161, 60004935, 49023446, 42101175, 37277519, 33508795, 30369055, 27734190, 25546228, 23790713, 22480224, 21601284, 21086470, 20817548, 20721116, 20794114, 21087683, 21714304, 22821697, 24432517, 26618028, 29377255, 32631715, 36707438, 41551349, 46824345, 52849186, 59579229, 66612366, 74952802, 84773545, 95472423, 108603361, 122782256, 134026815, 140499210, 137922239, 125186819, 111158147, 101665426, 95061219]
11045I5061219n505767m850192m945552n167927m957595m650482m830340n167909
11037E4985455m798580l851267k974293k579002k479604k174834j730609j313046
11029C3084220j099984r08490n92851k38817K06838P34952J250744J796310K514083
11020C6747005L618530N492504Q771877J4200029K0664062K3714337K0621114
11013A33829458J3214687m04330j5751513j8739699j1378948l025664L947751
11006A01691742J1449315K2955242M2567915P0592287Q8035960P3404633M9416473
10999D60113567J3728414o5737878r8870620o9511818m1223858k6310954j9409140
10992A52777713j6456808j4396828j2173168j0264029q840302p691913o650296
$$ y = [95061219, 89555452, 84705260, 79759708, 74591781, 69634186, 64983704, 60153364, 54985455, 50186875, 46335608, 43361315, 40782313, 38302709, 36127875, 34397266, 33084220, 31984236, 31075746, 30482895, 30244078, 30450916, 31185868, 32436612, 34232922, 36747005, 40365535, 45858039, 54629916, 68829945, 89494007, 113208344, 133829458, 147044145, 146639815, 130888302, 112148603, 100769655, 97743991, 101691742, 113141057, 136096299, 178664214, 249256501, 337292461, 410697094, 460113567, 473841981, 408104103, 309233483, 239721665, 198497807, 172186853, 152777713, 136320905, 121924077, 109750909, 99486880, 90646578, 82954665, 76304369]
10985G6304369n635476m828196m290782l866657l536178l271331k973218k495720
10977D5406811k027013j714044j547785j468872j410161j382173j343803j237796
10969C3275164j177022j177267j136359j070135j004495q61481p30066o56432
10961B5461907n87318n48866n75773o28789o81744p23508p09761o56457o05742
10952A9743949n53640m51012l34047l09098l41545l96893m63589m94780m89685
10943A5909660m62938m36563m22315l93580l65668l33290k89629k59359k44285
10934A2702033k41367k08033j54251j22338r4654o7310p8621j29641j62198l27836
10924A1115784m65106l93751l15253k62880k34508k07885k13755k33591k33147
$$ y = [76304369, 70668893, 65840697, 61549915, 57683258, 54147080, 50875749, 47902531, 45406811, 43379798, 41665754, 40117969, 38649097, 37238936, 35856763, 34512960, 33275164, 32098142, 30920875, 29784516, 28714381, 27709886, 26848405, 26118339, 25461907, 24874589, 24325723, 23749950, 23121161, 22439417, 21715909, 21006148, 20349691, 19743949, 19190309, 18739297, 18405250, 18096152, 17754607, 17357714, 16894125, 16399345, 15909660, 15446722, 15010159, 14587844, 14194264, 13828596, 13495306, 13205677, 12946318, 12702033, 12460666, 12252633, 12098382, 11976044, 11881390, 11814080, 11735459, 11605818, 11443620, 11115784, 10650678, 10256927, 9941674, 9678794, 9444286, 9236401, 9022646, 8789055, 8555908]
10915H555908k20216j98553j57040j25720j47287j73519j62184j63871j81743
10906G025775j72304j47543j31497j35842j28088j13648j03889r1000p9788p5170
10896E847006p7510q2245o8564n7236n6062p6210r1809r6132r0107p7893o9337
10885E003901q5414j00178j12974j13981j05962r3351o5377l7863k3445k3866
10875D241490l1284l6997n8805p5521n9058m8479m2478m8128n1682n0231l9755
10864C699072j1696K3981P5652J27759J72538J76437J24379J1817j31163k05100
10854D063676j72742j08579n2161l1883m6594n7032m1526l215K5513J3692n7569
10843C531580j36707j61914j58749j27604j00283r8338r0965p5261o0254o1131
$$ y = [8555908, 8335692, 8137139, 7980099, 7854379, 7707092, 7533573, 7371389, 7207518, 7025775, 6853471, 6705928, 6574431, 6438589, 6310501, 6196853, 6092964, 6001964, 5922176, 5847006, 5769496, 5687251, 5618687, 5561451, 5505389, 5429179, 5337370, 5241238, 5151131, 5073238, 5003901, 4918487, 4818309, 4705335, 4591354, 4485392, 4392041, 4326664, 4288801, 4265356, 4241490, 4210206, 4173209, 4114404, 4038883, 3979825, 3931346, 3888868, 3840740, 3789058, 3738827, 3699072, 3687376, 3711357, 3787009, 3914768, 4087306, 4263743, 4388122, 4399939, 4268776, 4063676, 3890934, 3782355, 3730194, 3698311, 3651717, 3594685, 3553159, 3549944, 3575457, 3589149, 3531580, 3394873, 3232959, 3074210, 2946606, 2846323, 2747985, 2657020, 2581759, 2521505, 2460374]
10833B460374n3246m4916l0432j3923j263J4602J3712N045o619m435O81O973L6358
10820B382911Q4526J54209K41248L25996L50057K77274J64819m9683k62745k87211
10810C381401k46807k08790j33318n7775N076N7588R2971R7269P0125M302r4965
10799B967077k06990k42879k01574j53516j15422q1762n4205m7336m6207m7619
10789A769567m4446k3625k0570r962j204r168j8979j8891k7044l2977k9703k1960
10777A511038p51J6365M6702J00414J79397K31826K46825J82491K4337j22997
10767B415647k54216k45277j31686o1262k3885O733L5267N7966N6318L7354j4183
10756A878776p5220j14092j14688q7212o0648m7762l6018k5484k9329l4043l4100
$$ y = [2460374, 2407128, 2362212, 2331780, 2317857, 2316594, 2331196, 2344908, 2349953, 2343334, 2338899, 2339580, 2346553, 2382911, 2467437, 2621646, 2862894, 3188890, 3538947, 3816221, 3981040, 3931357, 3668612, 3381401, 3134594, 2925804, 2792486, 2734711, 2739787, 2797375, 2890346, 2987615, 3057740, 3062042, 2967077, 2760087, 2517208, 2315634, 2162118, 2046696, 1964934, 1910729, 1863393, 1817186, 1769567, 1725121, 1701496, 1680926, 1670964, 1669760, 1660592, 1641613, 1622722, 1595678, 1562701, 1532998, 1511038, 1510287, 1526652, 1573354, 1673768, 1853165, 2084991, 2331816, 2514307, 2538644, 2415647, 2161431, 1916154, 1784468, 1723206, 1699321, 1706054, 1741321, 1799287, 1855605, 1892959, 1878776, 1803556, 1689464, 1574776, 1487564, 1426916, 1379154, 1343136, 1317652, 1288323, 1254280, 1220180]
10745A220180l1119l2019l3962l4838k9945k5644k7164k3518j9145k7013k5402
10734I10411k4351k7483k3364k0970j4809o869N353J2422J1500K0493J6269Q604
10722H67206R26k589j1184j5826j4067j1381k500J3055J5582J9720L2331M6644
10710I37917O1669M8894L1177J2498k2987n0151n3229m4313k7302j9388N758J8503
10698H99046L3694N0813O9263Q5716P5414M1147j8139q0740j02512q0721n9082
10687I13899l5954k1224j5311q491O9R621J8123J3470J1973J5481K0589L1189
10675I53434M5832P0949R9180J17673J26921J48156J78833K24792K55384K26426
10665B447580J26430l4794j77160k39610k39164k02215j48044j01901o3368l9744
$$ y = [1220180, 1189061, 1157042, 1123080, 1088242, 1058297, 1032653, 1005489, 981971, 962826, 935813, 910411, 886060, 858577, 835213, 814243, 799434, 792565, 797918, 810340, 821840, 842333, 858602, 867206, 868132, 865543, 854359, 838533, 824466, 813085, 810585, 823640, 839222, 858942, 891273, 937917, 999586, 1048480, 1079657, 1092155, 1069168, 1019017, 965788, 921475, 894173, 874785, 880543, 899046, 932740, 983553, 1052816, 1138532, 1213946, 1255093, 1236954, 1156214, 1053702, 972981, 913899, 877945, 856721, 841410, 832919, 832988, 842609, 860732, 874202, 886175, 901656, 922245, 953434, 999266, 1070215, 1169395, 1287068, 1413989, 1562145, 1740978, 1965770, 2221154, 2447580, 2574010, 2539216, 2362056, 2122446, 1883282, 1681067, 1533023, 1431122, 1367754, 1328010]
10655A328010r393K2555P7670J22960J42125J30902Q6627K2300m9340r0715r3681
10644A690020p8299o2425m2035k2129Q613K5181L0953L7263L6422M8427P9467
10633A751458R6701J00749P5471N3970M2182K5616O71m4450o5660m2160j3864
10622A980684O523K2777J4454j2593l3717l9384o4392p2047l0836J3164K6975
10611A811608J3802k0341m8629n9331n0454p748K5189K2370L394l7239q1509q9701
10599A481411p7279o1585m6025l8375j5736K8294Q0210J12979J23856J01377M2880
10588A732007l9378j03352j23941j24720j10044q5586n1740l1307k452K5531L8139
10577A123157N3213N0146K3420j3379m3292n1716m2414k0904j6429l0175o1973
$$ y = [1328010, 1318617, 1341172, 1418842, 1541802, 1683927, 1814829, 1901456, 1923756, 1874416, 1783701, 1690020, 1611721, 1549296, 1507261, 1485132, 1493745, 1518926, 1549879, 1587142, 1623564, 1671991, 1751458, 1848159, 1948908, 2024379, 2078349, 2120531, 2146147, 2146818, 2102368, 2036708, 1994548, 1980684, 1987207, 2009984, 2024438, 2011845, 1978128, 1938744, 1874352, 1802305, 1771469, 1784633, 1811608, 1825410, 1805069, 1756440, 1697109, 1646655, 1638907, 1664096, 1686466, 1689860, 1652621, 1571112, 1481411, 1404132, 1342547, 1296522, 1258147, 1242411, 1270705, 1350915, 1463894, 1587750, 1689127, 1732007, 1692629, 1589277, 1465336, 1340616, 1230572, 1144986, 1093246, 1061939, 1059487, 1085018, 1123157, 1176370, 1226516, 1249936, 1236557, 1193265, 1141549, 1099135, 1078231, 1061802, 1031627, 969654]
10566I69654p3911o1418m3657m0549l7762k9114k6865k0572r612J275N319O811
10554F39599R887R581L355j17L198J7107K3421L6763N6514O4005P4378Q3315P7190
10541A098196O9081N9035L9799Q29m1203r4299j24024j22606r3854o9984n8481
10530F62489m4495l3759k3282j9169j5334o735k298m480l50L611P481P827N641
10517E37147m183j3422j2602q805o735M429J1610J7198J0948J0676R561n683j8554
10504E31585j8572o835M252J2338K3373M2140P0834R1104J05776J15713J04523
10493A076231O6662J3562l8332o9930n9167l9837k6842l7839p8804q4309o2330
10482F59065m5924k9839j7560j1771j2254p894l568m622r610p699j9597k7106
$$ y = [969654, 895743, 834325, 790668, 750119, 712357, 683243, 656378, 635806, 626194, 627469, 632788, 639599, 649486, 659067, 662422, 662305, 665503, 682610, 706031, 742794, 799308, 863313, 937691, 1021006, 1098196, 1167277, 1226312, 1266111, 1266940, 1225737, 1131438, 1007414, 884808, 790954, 720970, 662489, 617994, 584235, 560953, 541784, 526450, 519715, 517417, 512937, 512587, 516198, 523679, 531506, 537147, 532964, 519542, 506940, 498135, 491400, 495829, 507439, 524637, 535585, 546261, 555822, 550139, 531585, 513013, 506178, 510430, 522768, 546141, 588281, 659115, 750219, 855995, 971708, 1076231, 1142893, 1156455, 1118123, 1048193, 989026, 949189, 922347, 884508, 805704, 721395, 659065, 613141, 583302, 565742, 553971, 541717, 533823, 530255, 525633, 516023, 508324, 488727, 461621]
10470D61621k6747k0974j6031j3535q221l187q98L379J14r194n254r591r13P90
10456C51359J367J022K913J3334K4402L6610O4925R4079J14778J05833O9221l704
10444H76139o3978j05999j03424p7705n0986l7850l1133k2851j7646j2857j3170
10433C38540j4209j1139m559M293N996R26q707j1223q789n243j804J740L351l172
10419B86001p361q845j1540j2537m981k820m209o412m963p822r568k074K950J778
10405B07597r082o655q532n600q534o081m359M55k16J558J13n715j768l639k688
10390A46854n85k416J789k867o365n488J343Q316N519O824k142J757N767O349
10376A64655J4009R615M730R546J9592J7728J0218Q618J943j0247j3866j5030
$$ y = [461621, 434874, 413900, 397869, 384334, 376113, 372926, 372028, 375407, 375521, 366327, 361073, 351482, 350569, 351359, 352726, 353748, 356661, 369995, 394397, 431007, 495932, 590011, 704789, 810622, 879843, 876139, 812161, 706162, 602738, 525033, 474047, 436197, 405064, 382213, 364567, 351710, 338540, 324331, 313192, 308633, 312926, 318922, 319848, 311141, 299918, 291129, 285886, 284082, 285822, 289173, 286001, 278640, 269795, 258255, 245718, 240737, 237917, 233708, 227296, 222333, 214511, 204943, 202869, 205819, 207597, 198515, 191860, 183328, 177728, 169194, 163113, 158754, 159209, 158993, 160551, 160664, 154949, 153181, 149542, 146854, 146269, 143853, 145642, 142775, 136410, 130922, 132265, 140581, 146100, 152924, 150782, 152539, 158306, 164655, 178664, 188279, 193009, 202555, 222147, 239875, 250093, 258711, 260654, 250407, 236541, 221511]
10364B21511j4231r966m093r817j0013m100l480P29k297O01O714L372M843J766
10350A81539p75J808n9m918j0278k681l247j701j306j937L583K131m912k274J427
10335A56400n06k558Q45O008L082L988K777n565k701o854q734k287k911p221k002
10320A31761N66j927p904r155q22k48j874J238K992J100l508j606j127L021J702
10305A14209J086K157O542R058L352L559O863P470N252J20o024r069o016o113
10291A32446o872p826k184M19L276J912M325M073O609L725O235O189J0456J3049
10277A75832K39o294r393j0850o149k265m889m038l19J041L557M730K109j353
10263A41958J762m056m551j222j24j733K313J77M007P029k07K382L611Q090J2069
$$ y = [221511, 207280, 197314, 193221, 183404, 173391, 169291, 165811, 166540, 164243, 164844, 171558, 174930, 179773, 181539, 180764, 182572, 182513, 177595, 167317, 164636, 161389, 159688, 158382, 156445, 160028, 162159, 157247, 154973, 156400, 155894, 153336, 154181, 160189, 163271, 167259, 170036, 164471, 161770, 154916, 146182, 143895, 140984, 133763, 131761, 132327, 130400, 122496, 113341, 112519, 112271, 110397, 111635, 114627, 115727, 112219, 110613, 109486, 112507, 114209, 115295, 117452, 123994, 133052, 136404, 139963, 146826, 154296, 159548, 159668, 153644, 144575, 138559, 132446, 125574, 117748, 115564, 115983, 119259, 121171, 125496, 129569, 136178, 139903, 146138, 152327, 162783, 175832, 176071, 169777, 160384, 149534, 143385, 141120, 136231, 132193, 131874, 132915, 136472, 141202, 143311, 141958, 143720, 139664, 135113, 133891, 133767, 132034, 134347, 134524, 138531, 145560, 145353, 147735, 151346, 159436, 171505]
10248A71505R234J4832O352r197j1012j2916l768j892k843k975l167o070o346
10235A41737l687n06J047j600J642J035l417M038q38k229j857n044k303M705O472
10220A39195m71l22j651k541m675j134M662K824K747J254n608o162Q387M083M820
10205A45408J0212J9530K4988K3090L2081M4361N4525O1466N2141L1136k1291
10194D77647p7300p4738m6671k5879j8104j7170j7604q431k753L914O342L279
10182B02532r67l684j3788j0633o498q646j2781p175m428j485l53k982l373R2
10168A25831J493j157J46O639r61q374p817K19j069O732O69m620j73K213K563
10153A22334l585J731J207j145j05n90N221N544P249O857Q743j632r827p523n422
$$ y = [171505, 180739, 195571, 201923, 192726, 181714, 168798, 165030, 163138, 160295, 157320, 154153, 148083, 141737, 138050, 137544, 138591, 136991, 138633, 139668, 136251, 140289, 139451, 137222, 135365, 130321, 128018, 132723, 139195, 138724, 138402, 136751, 134210, 129535, 128401, 133063, 135887, 138634, 139888, 134280, 128118, 136505, 140588, 145408, 155620, 175150, 200138, 223228, 255309, 299670, 354195, 415661, 467802, 498938, 477647, 400347, 325609, 278938, 253059, 234955, 217785, 200181, 191750, 188997, 192911, 199253, 202532, 201565, 197881, 184093, 173460, 166962, 158316, 145535, 138360, 133932, 132447, 132094, 129112, 125739, 125831, 127324, 126167, 126313, 132952, 131991, 123617, 115800, 116019, 114950, 121682, 122351, 117731, 117558, 119771, 122334, 118749, 120480, 121687, 120542, 120437, 119847, 125068, 130612, 137861, 144718, 153461, 151829, 142002, 134479, 129057]
10138A29057q623n499m598k664o60P16n86L01o034l38L868L403k481j489l739
10123A00634j135k076M15J944L410J114o660n329n298q6R375J565q056l942L84
10108H6259M55L296L35l49p101n416j538O176J619N631K847l609J860K394q04
10093I2055l973L218q88m404j402L482L242Q633N584Q072P070Q510M271l874m853
10078A24743m017m410k685n810j842j011K534l42P11j886m042N52O910O399l510
10063A12294m519M82j895K509j324j957j646J44n396M3k470j817M351l053L014
10048I8760o09j000N920O563L284l554n892K253M481N683J2029J1007R297M484
10034A52706K175M370K442l073k514k563q682q521k462m267l354q5j932m07j149
$$ y = [129057, 120434, 114935, 110337, 107673, 107013, 107729, 107143, 107444, 101410, 101072, 104940, 108343, 105862, 104373, 100634, 99499, 97423, 97838, 99782, 103192, 104306, 97646, 92317, 87019, 86933, 96308, 97873, 89817, 85875, 86259, 86714, 90010, 90345, 89996, 82895, 77479, 75941, 82117, 83736, 89367, 92214, 88605, 90465, 92859, 92055, 88082, 91300, 90412, 86008, 84606, 88088, 91330, 99963, 105547, 113619, 120689, 129199, 133470, 129596, 124743, 120726, 116316, 113631, 107821, 105979, 104968, 107502, 107160, 107871, 105985, 101943, 102495, 109405, 115804, 112294, 107775, 108257, 106362, 108871, 107547, 105590, 103944, 104088, 98692, 98735, 96265, 94448, 98799, 95746, 98760, 98151, 97151, 103071, 109634, 112918, 109364, 103472, 105725, 110206, 115889, 127918, 138925, 148222, 152706, 154881, 159251, 161693, 158620, 156106, 153543, 144861, 136340, 133878, 129611, 126257, 126172, 124240, 123833, 122684]
10019A22684j834N263O59m42j680j936l07k912p494q6P47M491k153M31m35m95
10003A14501l039m596p67o53L458M116M056R231L623J155Q783M575J84N940P09
9988A51276K640P350Q471L025K561M915l146l781j1584q512r527p858P88M457
9974A41075R71j929N38j304J048k259N901K152L505l184n973j626J287n55K898
9959A42545j141k088M82J1505J0843J0582P815N216J248k383l910n496j0178j0413
9945A54627N186M504q791p708q40n055k49N36o322k318J027j294j34M65J795K310
9929A37739R79k282j703N466N633L245J42Q23p50L202O560N704l421j963J363
9914A60737R61J17J545M583n32p632j520N086Q496R102P707L055k318o659l354
$$ y = [122684, 120850, 126113, 126772, 126330, 124650, 122714, 122407, 119495, 112001, 111915, 112662, 117153, 115000, 115431, 114996, 114501, 111462, 106866, 106099, 105446, 108904, 113020, 117076, 126307, 129930, 131085, 139868, 144443, 144627, 150567, 151276, 153916, 161266, 169737, 172762, 175323, 180238, 177092, 173311, 161727, 153215, 143688, 135830, 136618, 141075, 142046, 140117, 140655, 139351, 140399, 138140, 144041, 146193, 149698, 146514, 140541, 138915, 140202, 139647, 142545, 141404, 139316, 139798, 151303, 162146, 172728, 180543, 185759, 187007, 184624, 180714, 175218, 165040, 154627, 159813, 164317, 155526, 147818, 146978, 141923, 141674, 142210, 135888, 133570, 134597, 133303, 133169, 133634, 135429, 137739, 138718, 136436, 134733, 140199, 145832, 149077, 149219, 150042, 149292, 152494, 159054, 164758, 161337, 159374, 160737, 161698, 161815, 163360, 167943, 167411, 159779, 158259, 163345, 171841, 180943, 188650, 191705, 189387, 182728, 179374]
9899A79374p013j339J6o494o084L548m399j958K589K119K551K354Q81l06k135
9884A63704l676j329J592J299J238m820o217k711j197K15k52k347l999k722j17
9869A38661J86L189K866P66L10O74K845K345M022j247k673J829N166O456J1247
9854A76642Q932P244J972n620j0216r681o074j890m449K335j042j022n82j073
9840A55476o723l515m630n031R77N982L163q78m31n41k562L222M371n77m799K982
9824A46486O54j736K252m270l786K163P95k299K561N137J070J658K68J687K145
9809A54785J738m596j059N291K124j512m047k806J406N327j663n646J088k447
9795A47983J087o48N07P4j572J626k76L197L33n56J365j688m62K407m30n061o79
$$ y = [179374, 172361, 171022, 171038, 164544, 158460, 162008, 157609, 155651, 158240, 160359, 162910, 165264, 166145, 165839, 163704, 160028, 158699, 160291, 161590, 162828, 158008, 151791, 149080, 147883, 148098, 147846, 145499, 141500, 138778, 138661, 138847, 142036, 144902, 145668, 145978, 146652, 149497, 151842, 155864, 154617, 151944, 153773, 158939, 165395, 176642, 185574, 192818, 194790, 189170, 178954, 169273, 163199, 161309, 156860, 159195, 158153, 157131, 156549, 155476, 148753, 145238, 140608, 135577, 136554, 142536, 145699, 144821, 144390, 143849, 141287, 144509, 148880, 148303, 143504, 146486, 147140, 145404, 147656, 143386, 139600, 141763, 142558, 140259, 142820, 147957, 149027, 150685, 150953, 152640, 154785, 156523, 151927, 150868, 156159, 158283, 156771, 152724, 149918, 151324, 156651, 154988, 149342, 150430, 147983, 149070, 148422, 148929, 149003, 147431, 149057, 148781, 151978, 152311, 151755, 153120, 151432, 150970, 153377, 152947, 147886, 147207]
9778A47207P30o51K854K504l373j268O40K702O08j256j23L798k157p6M171k547
9762A53763l761J163L411M830k21j757Q92K555q59p00L155L259m002l784K727
9747A60671J402k292J812q04J569N032L492k339l141M073K164j74l058N048L177
9732A76632J51M088j39j872M39l693j599Kj849k070L785N478j350M55K090m47
9716A80101o59J258J450K444K030n06p47j54L8L54n21k888O626L784m345j039
9700A87226k267j461o76l96M3P10k549j791K794P81k487k238j035K547K785P623
9684A89609l55l305J596o06o885k199Q314L645L187K373k225n74J502J57j005
9669A93229k905m17N798J227K512N375N616P217k224j258L198J293L890J641j127
$$ y = [147207, 147937, 147286, 150140, 152644, 149271, 148003, 148643, 151345, 151953, 150697, 150574, 154372, 152215, 152139, 156310, 153763, 150002, 151165, 154576, 159406, 159185, 157428, 158320, 160875, 160016, 159316, 162471, 165730, 161728, 157944, 160671, 162073, 159781, 161593, 160789, 162358, 167390, 170882, 168543, 165402, 169475, 171639, 171465, 168407, 173455, 176632, 176783, 180871, 180732, 178860, 179299, 175606, 174007, 174009, 172160, 170090, 173875, 179353, 178003, 178458, 180548, 180101, 179442, 180700, 182150, 184594, 186624, 186118, 185371, 185217, 185255, 185609, 185088, 182200, 188826, 192610, 188265, 187226, 184959, 183498, 182822, 182426, 182469, 183179, 180630, 178839, 181633, 182414, 179927, 177689, 176654, 179201, 181986, 189609, 189254, 185949, 187545, 186939, 180054, 177855, 186169, 189814, 193001, 195374, 193149, 192575, 194077, 194234, 193229, 190324, 189907, 195705, 196932, 199444, 204819, 210435, 217652, 215428, 214170, 217368, 218661, 222551, 224192, 223065]
9654B23065o037J251l252m795O316M830J2602J1757N529J0896J2795Q594P107
9641B90658M26j3455j1869r190q009q997k264K836l73n257n905J49L239m266M099
9626B31822N661M36J360k24M166R271J0345J1627J0393R471P972J1082J1051Q531
9612C32964O818L302K418P319J3277J6847J8783J7112L328m15j782k918o119p617
9598D03317j0543p848n116p069n754q676q450p885q558N72o51j579N372N145K587
9583C44864r51J104O590P189J3795J1567P787J536m763m465J1547K0187L1189
9570D47176M1594M5240L7167J5167j0087l1432l7506l1494j7246q991l428l993
9558D42167k319j901m318p228k911l02j514j976r454o846L09k065K79M169j62
$$ y = [223065, 217028, 218279, 215027, 210232, 216548, 221378, 233980, 245737, 251266, 262162, 274957, 283551, 290658, 291084, 277629, 265760, 256570, 248561, 239564, 237300, 240136, 239763, 234506, 228601, 228750, 231989, 227723, 231822, 237483, 237919, 239279, 239055, 243221, 252492, 262837, 274464, 284857, 294328, 302300, 313382, 324433, 332964, 339782, 343084, 345502, 352821, 366098, 382945, 401728, 418840, 422168, 421753, 419971, 417053, 410934, 403317, 392774, 384926, 379810, 372741, 366987, 358311, 349861, 341976, 333418, 333990, 333339, 331760, 337132, 342277, 344864, 343913, 345017, 351607, 358796, 372591, 384158, 391945, 393481, 388718, 384253, 395800, 415987, 447176, 488770, 534010, 571177, 586344, 576257, 544825, 507319, 475825, 458579, 449588, 446160, 442167, 439848, 437947, 433629, 426401, 423490, 423188, 421674, 419698, 410244, 403398, 403707, 401642, 401921, 406090, 405928]
9543D05928j674L131Q046L270J0081N292J2202J0926N654R438J1555J2818K0074
9530E16741K0497R522J138n159o863r047q017o171r877j3600q271J060j85q777
9516D72991o205o10n994k340M672O357K077Q345R786J61p389j657m962p479J375
9501D69128r34K676O297M485O993P358J3794J3934J8013J5758O875k652o660p620
9487E47445o739p799l844n201l342Q32Q620M306J293R352M713L586R47N261J0506
9472E69936P034J4247R455O793J5601L686p075j0938n544j30J713M356O482N049
9458F20665L82m093o171j010L29O100M941K95N322L60J336J9k469M214K210N164
9442F37594J0047R248O752P410R101N057Q849R599J2515J4882J7660J8532J7842
$$ y = [405928, 404254, 407385, 415431, 418701, 428782, 434074, 446276, 457202, 462856, 472294, 483849, 496667, 516741, 537238, 546760, 547898, 542739, 535876, 526829, 518812, 512641, 502764, 489164, 480893, 481953, 481768, 472991, 466786, 466176, 460182, 457842, 462514, 468871, 470948, 479293, 489079, 489240, 481851, 480194, 475232, 467753, 469128, 468194, 470870, 477167, 481652, 488645, 496003, 509797, 523731, 541744, 557502, 564377, 561725, 555065, 547445, 540706, 532907, 529063, 523862, 520520, 521352, 529972, 534278, 535571, 544923, 549636, 553222, 554169, 559430, 569936, 576970, 591217, 600672, 607465, 623066, 626752, 619677, 608739, 603195, 603065, 604778, 609134, 615616, 620665, 621047, 616954, 610783, 609773, 610102, 616202, 621143, 621438, 626760, 627120, 628456, 628475, 626006, 630220, 632430, 637594, 647641, 656889, 663641, 671051, 680152, 685209, 694058, 703657, 716172, 731054, 748714, 767246, 785088]
9429G85088J8787J8432J3789J495n766l223J963L370K12J1466J2848P871M285
9416H70617R204J0736L061J4246J3172J5541R821K609J750l147O31J932Q301O909
9402I65383J3359J3906P034Q513Q577O384J0578J7089K4111K5129K2398K9049
9390A151510K4674K0536J8497K0003K5827K9321K0962J1689R118K090R630J3808
9378A357665J8630J6851J8740K3176J7484J2655J0058J3102R939P756P482P384
9366A520922O694J3467J8208J3555J4008J7080K4069K5338K7421K8029K6659L2262
9354A767712L1237L0191L4316L1853K9206M1343M6428M2309L7911L1277K7180
9343B150963J6172K6693M0603N1848O9587P1029O0066M4793K9444K0674J4262
$$ y = [785088, 803875, 822307, 836096, 837591, 831825, 828602, 830565, 833935, 834147, 845613, 858461, 866332, 870617, 879821, 890557, 893618, 907864, 921036, 936577, 946398, 949007, 950757, 947610, 948241, 950173, 958474, 965383, 978742, 992648, 999682, 1008195, 1016772, 1023156, 1033734, 1050823, 1074934, 1100063, 1122461, 1151510, 1176184, 1196720, 1215217, 1235220, 1261047, 1290368, 1311330, 1323019, 1332137, 1334227, 1343857, 1357665, 1376295, 1393146, 1411886, 1435062, 1452546, 1465201, 1475259, 1488361, 1498300, 1506056, 1513538, 1520922, 1527616, 1541083, 1559291, 1572846, 1586854, 1603934, 1628003, 1653341, 1680762, 1708791, 1735450, 1767712, 1798949, 1829140, 1863456, 1895309, 1924515, 1965858, 2012286, 2054595, 2092506, 2123783, 2150963, 2167135, 2193828, 2234431, 2286279, 2355866, 2426895, 2486961, 2531754, 2561198, 2581872, 2596134]
9332B596134J2743M743Q170O922J1869J6816K6065L3783M6433M1450M4264M0305
9320B889697M2392M8587N2881O5605P9170Q1706Q5388Q6143Q7913Q2357Q3420
9309C685259Q5697R2748R2915Q8662P6041P8618R8685J05082J16910J24392J33651
9298D778660J41287J35105J29938J31640J26878J31273J39200J57803J68142J76011
9288F215937J90304J94877K03273K25830K36783K50554K65757K76089K92906L18108
9278H670418L42416L71215M08812M41166M65059M83343N09532N40886N87494O46589
9268A3466930P06485P73155Q46517R24277J005737J086337J183500J315376J482524
9259B2790838J733910K119476K696732L455491M127235M310879L859547K726412
$$ y = [2596134, 2608877, 2613620, 2621790, 2628712, 2640581, 2657397, 2683462, 2717245, 2763678, 2805128, 2849392, 2889697, 2932089, 2980676, 3033557, 3099162, 3178332, 3260038, 3345426, 3431569, 3519482, 3601839, 3685259, 3770956, 3863704, 3956619, 4045281, 4121322, 4199940, 4298625, 4403707, 4520617, 4645009, 4778660, 4919947, 5055052, 5184990, 5316630, 5443508, 5574781, 5713981, 5871784, 6039926, 6215937, 6406241, 6601118, 6804391, 7030221, 7267004, 7517558, 7783315, 8059404, 8352310, 8670418, 9012834, 9384049, 9792861, 10234027, 10699086, 11182429, 11691961, 12232847, 12820341, 13466930, 14173415, 14946570, 15793087, 16717364, 17723101, 18809438, 19992938, 21308314, 22790838, 24524748, 26644224, 29340956, 32796447, 36923682, 41234561, 45094108, 47820520]
9251D7820520J146682o1731K0311Q70234J559984J963107K184527K283927K282136
9242F0069697K197889K030551J783966J463682J080928O54482K08771k17989n99826
9233F8672151r13997j123322j204432j138414r57193p73473o91992p18908q50396
9224F0300024r15181q33057o28724n81784q74904r46657M255J618058K497119
9215E9639149K236887O95200j878910l644260l791844k872961k113709k038056
9207D6231496k303010k357455k021238j731662j870752k208163k252162j840599
9199B9646455j375738r85118o28963k74568K1072K03106M21873M80397M02812
9190B7911328Q31326J220849J007280O21481J26449p89047j073763Q0068J846916
$$ y = [47820520, 48967202, 48905471, 48925782, 49796016, 51356000, 53319107, 55503634, 57787561, 60069697, 62267586, 64298137, 66082103, 67545785, 68626713, 69281195, 69489966, 69271977, 68672151, 67758154, 66634832, 65430400, 64291986, 63334793, 62561320, 61869328, 61150420, 60300024, 59384843, 58551786, 57923062, 57341278, 56466374, 55519717, 55523972, 57142030, 59639149, 61876036, 62571236, 60692326, 57048066, 53256222, 50383261, 48269552, 46231496, 43928486, 41571031, 39549793, 37818131, 35947379, 33739216, 31487054, 29646455, 28270717, 27285599, 26656636, 26382068, 26403140, 26606246, 27028119, 27508516, 27911328, 28742654, 29963503, 30970783, 31592264, 31718713, 30929666, 29855903, 29935971, 31782887]
9181C1782887M060139O656024Q476151Q087047N833072J328655n246329q262107
9173E2715539p174162n087312l108569j768356j038967p51219j113171j356331
9165C1317452j235093j263286j204619j367253j620953j880768j740643j234940
9157A9769897q19959m93788j72259J73909M67704P02474Q53589P88725R11505
9148B2181797J184785J133619J055775R22343K80767K41668J522570K771072L146322
9139C4440718K400595O90495j212612k267400k130345j562106j079266j166540
9131B8113539j996292k174521j616679j312922j421306j486418j554155j419120
9123A5132126j126621r00020p41879o24572n43978m75312m13967l51942k83278
$$ y = [31782887, 35843026, 42499050, 50975201, 59062248, 64895320, 66223975, 60977646, 52715539, 45541377, 40454065, 37345496, 35577140, 34538173, 33786954, 32673783, 31317452, 30082359, 28819073, 27614454, 26247201, 24626248, 22745480, 21004837, 19769897, 18949938, 18456150, 18283891, 18457800, 18925504, 19627978, 20481567, 21270292, 22181797, 23366582, 24500201, 25555976, 26478319, 26759086, 27000754, 28523324, 31294396, 34440718, 36841313, 37531808, 36319196, 34051796, 31921451, 30359345, 29280079, 28113539, 26117247, 23942726, 22326047, 21013125, 19591819, 18105401, 16551246, 15132126, 14005505, 13105485, 12363606, 11739034, 11195056, 10719744, 10305777, 9953835, 9670557]
9114I670557k28626j86922j40633r0199l2482O1309J92967L85736P14420J194893
9104A1541020J740207K018047J796582J031110l30248j718146k348765j957902
9096A1771905j334417r24740p11495n85339m95154m19226l56949l15869k81045
9087F347671k54167k41832k29762k07444j86881j73281j56711j45333j29986j20248
9077D502026j06054r4674r5210r4469q7825q6048p4315o0528o1092n8100m3714
9066C639997k7147O9K1330L1326P619m2469r0275j12853j30948j27450j04342
9055C064857r0938p2485o5422n5102m3507l6364k6371k2289k8104l0338m8491
9044B545446n9803o0623n9755m8061l8564l9139l5555k7435k8837k5345k7939
$$ y = [9670557, 9441931, 9255009, 9114376, 9024177, 8991695, 9053004, 9245971, 9631707, 10346127, 11541020, 13281227, 15299274, 17095856, 18126966, 17796718, 16078572, 13729807, 11771905, 10437488, 9512748, 8801253, 8215914, 7720760, 7301534, 6944585, 6628716, 6347671, 6093504, 5851672, 5621910, 5414466, 5227585, 5054304, 4897593, 4752260, 4622274, 4502026, 4395972, 4301298, 4206088, 4111619, 4023794, 3937746, 3863431, 3802903, 3741811, 3683711, 3639997, 3612850, 3612919, 3634249, 3665575, 3673194, 3630725, 3540450, 3427597, 3296649, 3169199, 3064857, 2973919, 2901434, 2836012, 2780910, 2737403, 2701039, 2674668, 2652379, 2624275, 2593937, 2545446, 2485643, 2425020, 2365265, 2317204, 2278640, 2239501, 2203946, 2176511, 2147674, 2122329, 2094390]
9033B094390l2767k4419k9034l2158k7294k6658j6281m840q299M623K6461M7639
9021A971363O2356Q2436P1406O5763L2758q983n2115j03288j20904j00501o7179
9010A833112m7516l1166k6575j4530O234L1098M4530M2095P733m2162p6807q7469
8998A638577q2244o6896m6372l5674l6321l3463l0546l0933j8951j5118j6754
8987A225305j3605j2011j0366j0770q546m845L238P971K1079L2552M0950M7949
8975A318901N3583N0157L5426K752l0055o7089p9421o0085l3348k0211j181J1658
8963A181087K2837L6830N4667N1757L5692K0716k4463p3722q5726q7742p2078
8952A059855n3736l6939k7097k6844k9886k9997k3877k0920j3675q913o691j0185
$$ y = [2094390, 2061623, 2037204, 2008170, 1976012, 1948718, 1922060, 1905779, 1900939, 1892640, 1897263, 1923724, 1971363, 2033719, 2116155, 2187561, 2253324, 2286082, 2277099, 2224984, 2121696, 2000792, 1900291, 1833112, 1785596, 1754430, 1727855, 1713325, 1719559, 1750657, 1795187, 1837282, 1845015, 1802853, 1726046, 1638577, 1556333, 1489437, 1443065, 1407391, 1371070, 1337607, 1307061, 1276128, 1257177, 1242059, 1225305, 1211700, 1199689, 1189323, 1178553, 1170007, 1165162, 1168400, 1176371, 1197450, 1230002, 1270952, 1318901, 1372484, 1422641, 1458067, 1460819, 1430764, 1363675, 1284254, 1224169, 1190821, 1170610, 1169429, 1181087, 1203924, 1240754, 1295421, 1347178, 1382870, 1403586, 1379123, 1305401, 1219675, 1131933, 1059855, 1006119, 969180, 942083, 915239, 885353, 855356, 831479, 810559, 796884, 787971, 781280, 771095]
8940G71095j0970r798r162n042j0925r251k062P81J1907K2017J8140N240m228
8927G67742n447j6741j9040k162M951Q006R436P714J1317J3705K3309L2049K4669
8914H59508P790n801k9993n5166o2096m8688l0897j6583k2845j8071j3660j6251
8902E47247j2293n373p146q001j0162j4000q144n261o015l180m119j753k720o020
8888D53060K268k557k41O976M653N290J866Q076J3672J7498J9279K8923L9504
8875E98267M2576L0511K1574J1858j4993l6343m2819l9414l3299k6861k0205j4884
8863D75968j0062n261n581j36J443O616N496M545M153j1562j7211j2949j0032
8850D25427o866j97j673k067p2Q77p89M726O082n06Q47M463J3019J4914K0213
$$ y = [771095, 760125, 750327, 741165, 736123, 725198, 715947, 713885, 714666, 726573, 748590, 766730, 771970, 767742, 762295, 745554, 726514, 724352, 729303, 737309, 746745, 754459, 765776, 779481, 802790, 834839, 859508, 867298, 861497, 831504, 776338, 714242, 665554, 634657, 618074, 595229, 577158, 563498, 547247, 534954, 529581, 522435, 514434, 504272, 490272, 482128, 476867, 470852, 467672, 463553, 461800, 459080, 453060, 455328, 452771, 452530, 459506, 464159, 469449, 471315, 479391, 493063, 510561, 529840, 558763, 598267, 640843, 671354, 692928, 704786, 689793, 653450, 610631, 571217, 537918, 511057, 490852, 475968, 465906, 460645, 455064, 454928, 456371, 462987, 468483, 473028, 477181, 465619, 448408, 435459, 425427, 418561, 418364, 416691, 414624, 414552, 415429, 414640, 419366, 425448, 424942, 425789, 430252, 443271, 458185, 478398]
8835D78398K9923L2986M1493N0477N3954M8908N1556N4499M1074K2026l207l3658
8823H68429m9987n2452m6874k5857q234o750j2744j8790k7147k3863p910J241
8811E89062K027K414O697K0465K2482K4551J2850j128j9884k7620l1631k1729
8799E78556j3827j1591j200K649J421l453Q348J0661J5185J8697J8451K0482L0987
8786F75366M9774O8861Q7748R0853R2278P6863L6394r094o6502j01837r6394p4876
8774H29434n4186l9032k5721j6214j3339l908P984K1265L4950N7606Q5954R4675
8762I79468Q8466O8305K0253m7288q2759q8545p9210o3647m7269l7364l2062k0694
8750F57654j2561j3203j3726j2324l538O241J1959J3737J4140J2484O686J1912
$$ y = [478398, 508321, 541307, 582800, 633277, 687231, 736139, 787695, 842194, 883268, 905294, 902087, 868429, 818442, 765990, 719116, 693259, 685025, 678275, 665531, 646741, 619594, 595731, 587821, 589062, 591089, 593503, 600200, 620665, 643147, 667698, 680548, 679420, 659536, 631916, 600285, 578556, 564729, 553138, 551938, 554587, 556008, 552555, 560903, 571564, 586749, 605446, 623897, 644379, 675366, 725140, 794001, 881749, 972602, 1064880, 1141743, 1178137, 1169043, 1102541, 1000704, 904310, 829434, 775248, 736216, 710495, 694281, 680942, 677034, 685018, 706283, 741233, 798839, 884793, 979468, 1067934, 1136239, 1156492, 1109204, 1026445, 937900, 858690, 795043, 747774, 710410, 678348, 657654, 645093, 631890, 618164, 605840, 602302, 608543, 620502, 634239, 648379, 660863, 667549, 679461]
8738F79461J7858K0941K3924J8455P534j0889m2535m8426m0884l5078k5140j9216
8726E46005j6175k728O301K3203L7401N4466P9524R6582R6902O9795L0743k8379
8714I93640q5170r8452q1550o0753m7857l8906k5196j8769j4918j5806j8490j8846
8702D68927k6629k7467k2161k2066j9448j4849r329q848o83M666O237P765P299
8689C43414O394K398p015j6129k1281j4176j2844K064N094N174J3400K2898K7586
8676C56977L8867M4567L3045J9405L123k3377l7795m2155l1753l3289k4317j7802
8664B85496j5610j3881r596n759j0692j2651j0055r255q702k426n418o488p35
8651A74228M5L08o3k203p473n30o452o721R41Q93m721m805O70M482K830L444J973
$$ y = [679461, 697319, 718260, 742184, 760639, 768173, 757284, 714749, 666323, 625439, 590361, 565221, 546005, 529830, 527102, 533403, 556606, 594007, 648473, 727997, 824579, 921481, 991276, 1022019, 993640, 908470, 810018, 728468, 667715, 619858, 580952, 555756, 536987, 522069, 506263, 487773, 468927, 442298, 414831, 392670, 370604, 351156, 336307, 326978, 318130, 317447, 322113, 328350, 336115, 343414, 349808, 352206, 345191, 329062, 307781, 293605, 280761, 282825, 287919, 293093, 306493, 329391, 356977, 395844, 440411, 473456, 492861, 495984, 472607, 434812, 392657, 360904, 327615, 303298, 285496, 269886, 256005, 246409, 240650, 229958, 217307, 207252, 197997, 189295, 186869, 181451, 174963, 174228, 174273, 174581, 174518, 172315, 164842, 164312, 157860, 151139, 152080, 152973, 148252, 143447, 144117, 148599, 151429, 154873, 156846]
8634A56846N379J5810J7726Q965k612j146n829j6433j2337o607j1292j0309l902
8621A34259P30m615m728O69n766p740m057M225K003l100o266l878J296m319K074
8606A00787K306q85j909L942j234q51J096l905M705k525r307m784N86J149J363
8591I0534N992N933N095j23J820M47o621n675J044j612l720p590L412J756k738
8576H7954k817j042m72o165j719O02l799k948l816m527j766K082L2K442K870M145
8560G1056o15Q81O50o12n291n389k340r20N407L897K146k842K050n60j674l969
8544F1875J136l974k752K554k158k229M983M962O896L86J720m61o129l399k259
8529F1151J034j639l824j988l277n87k682l595k034OK637r86J598N378L289p032
$$ y = [156846, 162225, 178035, 195761, 204726, 202114, 200968, 195139, 178706, 166369, 159762, 148470, 138161, 134259, 134989, 130374, 125646, 126315, 120549, 112809, 108752, 112977, 114980, 111880, 105614, 101736, 103032, 98713, 100787, 103093, 102208, 100299, 104241, 103007, 102156, 103252, 99347, 104052, 101527, 92220, 87436, 88022, 89171, 90534, 96526, 102459, 107554, 107431, 109251, 109698, 103077, 97402, 98446, 96834, 93114, 85524, 88936, 90692, 87954, 85137, 84095, 83623, 77458, 75739, 76341, 72542, 69594, 65778, 61251, 59485, 61567, 61599, 64041, 66911, 71056, 70441, 71322, 71972, 71360, 66069, 60680, 58340, 57420, 62827, 66724, 68870, 66028, 68078, 67518, 65844, 61875, 63011, 59037, 56285, 58839, 56681, 54452, 59435, 64397, 71293, 71679, 73399, 72938, 66809, 63410, 61151, 62185, 60546, 56722, 54734, 51457, 50870, 48188, 44593, 42559, 42565, 45202, 44216, 45814, 51192, 54481, 47449]
8513D7449j229k782k714R90K435j47j89j015K624N122k280J615L124L975M40k854
8497E4564J394n14Q24j79L210K708P349M440M48j262n83N905R517N796Q080K598
8481A04295m054p620q244l142m694J38o4J906k23m73o844m623M12k717k988n336
8465E5729Q01K07J269J275k925R62L400M82l668l417j22k371l147J09m108l583
8449D0893L233L478N154m080m327q50J992P134J218k920m985K488m078j224N556
8434D8682k709o150r26L83k27J41K029P806J51k570l635k973m689O04M908K925
8418D3750J234l413m895N508K949l233n521O09L441K471M91O7k504M51M408M731
8402E0544L85N718l190m43L324j28j148J000M791l939k09k92l754m91K113l619
$$ y = [47449, 46220, 43438, 40724, 41714, 44149, 44002, 43813, 42798, 45422, 50544, 48264, 49879, 53003, 56978, 57418, 54564, 55958, 55444, 56268, 56089, 59299, 62007, 69356, 73796, 74244, 72982, 72399, 78304, 87821, 93617, 101697, 104295, 100241, 92621, 84377, 81235, 76541, 76679, 76615, 78521, 78298, 77825, 70981, 66358, 66770, 64053, 61065, 55729, 56530, 56737, 58006, 59281, 56356, 57318, 60718, 61200, 57532, 54115, 53993, 51622, 48475, 48584, 44476, 40893, 44126, 47604, 52758, 48678, 44351, 43501, 45493, 52627, 53845, 50925, 45940, 48428, 44350, 43126, 48682, 45973, 39823, 38897, 39280, 39053, 39194, 41223, 49029, 49180, 46610, 42975, 40002, 35313, 35917, 40825, 43750, 44984, 41571, 36676, 42184, 45133, 41900, 36379, 36988, 40429, 42900, 43391, 43458, 40954, 41405, 45813, 50544, 50929, 56647, 53457, 53014, 56338, 56210, 55062, 56062, 60853, 56914, 56705, 56413, 52659, 52168, 54281, 50662]
8386E0662p612K346M742N13J542L092R5m517k857K504j425L833l785l698j995
8371D3440K60K658M95O94k379j402L511j86K677N945J351k449l146n862p022k204
8355C6381j14J166K044K18m787k833k812l723q58j099M54L036l560L605J982K58
8339B9358K314r77n111K572l63j70K803Q65m766n100l203k247P070M823M154M248
8323C6270o05j385Q181J1414j124J012M957j176j41K411j467k42m419m986n053
8308D3647p325l459M078K725k011r33J109M193k17l78J333J64k003k921p005k013
8292B8984o08Q616N27o186l648q11j751M689K737L443l33j845O300P517O450N641
8276E9722j423p85K095M355P588L793k404m658l122k103o033n022j494j896J690
$$ y = [50662, 43050, 45396, 50138, 50651, 52193, 55285, 55380, 50863, 48006, 50510, 49085, 52918, 49133, 45435, 43440, 43700, 46358, 46853, 47547, 45168, 43766, 47277, 47091, 49768, 55713, 57064, 54615, 51469, 45607, 38585, 36381, 36267, 37433, 39477, 39695, 34908, 32075, 29263, 25540, 24682, 23583, 24037, 27073, 23513, 27118, 29100, 29358, 31672, 30695, 25584, 28156, 27793, 27623, 30426, 31291, 26525, 21425, 18222, 15975, 23045, 27868, 32022, 36270, 35665, 34280, 42461, 53875, 52751, 53763, 58720, 57544, 57403, 59814, 58347, 58105, 53686, 48700, 43647, 36322, 32863, 36941, 39666, 37655, 36722, 37831, 42024, 41807, 41429, 42762, 42926, 40923, 38002, 30997, 28984, 28376, 36992, 37519, 31333, 27685, 26874, 25123, 29812, 32549, 35992, 35659, 33814, 40114, 47631, 54081, 59722, 58299, 57514, 59609, 63964, 71552, 75345, 72941, 68283, 65161, 63058, 57025, 52003, 50509, 48613, 50303]
8261E0303j800k352M47J372l521J541L383m292J806K598O07o85L644j302k272
8246D9477K419L142O76K61k708j637j218K197M903l589p120j874p60N198N400
8231E4767L178k011Q44K289K505N750L945N976K096o8K344N895P033Q009J0575
8216A13127R362J0439M262L15l33P973R858O940J154J204K079J928o564n535o60
8201A55549p307q439o849l885q90J299M284Q21K660K918K429O246N571N957J2634
8186A72998J7638J9880J6637J8952J9765J6770K0154J9791J4582N372K510n429
8174C39620o438n931J164k236p93n561o618n225l473N237J8304L1904N0688Q0708
8160D91350J40522K27259L22906L33793K55870J36736j37426l71044l02338j88331
$$ y = [50303, 48503, 46151, 46598, 47970, 44449, 45990, 49373, 45081, 46887, 49485, 50092, 49407, 53051, 51749, 49477, 51896, 55038, 55714, 55975, 53267, 51630, 50412, 52609, 57512, 53923, 46803, 44929, 44169, 49367, 54767, 57945, 55934, 56778, 59067, 61572, 67322, 71267, 77243, 79339, 79271, 81615, 87510, 94543, 102552, 113127, 122489, 132928, 137190, 137505, 137172, 145145, 155003, 161943, 163097, 164301, 166380, 168308, 161744, 156209, 155549, 148242, 139803, 132954, 129069, 128179, 129478, 133762, 134583, 137243, 140161, 142590, 148836, 154407, 160364, 172998, 190636, 210516, 227153, 246105, 265870, 282640, 302794, 322585, 337167, 342539, 345049, 339620, 333182, 327251, 328415, 326179, 325386, 319825, 313207, 307982, 304509, 309746, 328050, 359954, 410642, 491350, 631872, 859131, 1182037, 1515830, 1771700, 1908436, 1771010, 1399966, 1097628, 909297]
8150I09297j18574p7121o7155n6460m5773l9034l2869k7654k5222k7718k8203
8139C63514k6269k5461k0600j9459j3701j0766n497q312p383j1440l816m982o43
8126B05185M769J589j495J903J603Q735O260K894K861J1111J9172K3125J8711
8113C06423J1063J545j5759k9518k7536k3034j9525j2372n735p393m995n855n879
8100A61430J197J981m964J69J1361J4911J1536J2208J1342J1863J6135R794O258
8087B65221J0306J2710P193p227n845j0949p306q209q715p263j0892j1895j3788
8074B03341j0216j0451o336q031J448M859L566K889k132j3542j0563j478O4L078
8060A56496K297L65J980N645L577k279o638m317r186m675m93q497q354p299k489
$$ y = [909297, 790723, 713602, 646447, 589987, 544214, 505180, 472311, 444657, 419435, 391717, 363514, 337245, 311784, 291184, 271725, 258024, 247258, 241761, 233449, 226066, 214626, 210810, 205828, 205185, 209954, 211543, 210048, 211951, 213554, 222289, 228549, 231443, 234304, 245415, 264587, 287712, 306423, 317486, 319031, 303272, 273754, 246218, 223184, 203659, 191287, 185552, 178159, 173164, 167309, 161430, 162627, 164608, 159644, 159813, 171174, 186085, 197621, 209829, 221171, 233034, 249169, 258963, 265221, 275527, 288237, 295430, 288203, 282358, 271409, 264103, 255894, 247179, 239916, 229024, 217129, 203341, 193125, 182674, 176338, 168307, 169755, 174614, 178180, 181069, 178937, 165395, 154832, 153354, 153418, 156496, 158793, 159158, 161138, 166783, 170360, 168081, 161443, 157126, 147940, 143265, 142772, 134275, 125921, 118622, 116133]
8045A16133Q38q610j0089m677k917m23M99J532l999l086j313m21m722q509m816
8030F5420k289o989J41K63m327l661j431J618l268m796K240R74k018m825K117
8015C9169R59L481K477j818m893j427O16j232j662n302K848J597P74r17m898k594
7999B7178j924q52K851N649J297l106p303l857k373J028L774o063m004J659J712
7984A5666O713L125p44m706k09M124L049q16j137j032n287M164P885L19l881R56
7968B8189j513k586L434n55R8k055j276L948P76j438J289l191P22N83K143j954
7952B6614Q1M024N470j780l776J03J605M758M817L528j449N012M346O620J0692
7937G0665Q526O910J6504K0088J5168J8933J2498J9049K0799L3742O0120R0675
$$ y = [116133, 116971, 108361, 98272, 93595, 90678, 90255, 90754, 92286, 88287, 85201, 83888, 83467, 78745, 70236, 65420, 63131, 56142, 56283, 56546, 52219, 48558, 47127, 48745, 45477, 40681, 42921, 43895, 41877, 37052, 39169, 40128, 43609, 46086, 44268, 39375, 37948, 38564, 37332, 35670, 30368, 33216, 34813, 35587, 34670, 29772, 27178, 25254, 24402, 27253, 32902, 34199, 31093, 23790, 19933, 17560, 18588, 22362, 16299, 12295, 13954, 15666, 22379, 25504, 24760, 20054, 19845, 23969, 27018, 26202, 25065, 24033, 18746, 22910, 30795, 31114, 27233, 28189, 26676, 24090, 27524, 26969, 27067, 25012, 23736, 27684, 28460, 27022, 28311, 25120, 25842, 26425, 28568, 26614, 26695, 30719, 36189, 34409, 30633, 30736, 32341, 37099, 41916, 45444, 43995, 49007, 53353, 59973, 70665, 79191, 86101, 102605, 122693, 137861, 156794, 169292, 188341, 209140, 242882, 303002, 393677]
7925C93677J17223J48004J58297J33232P3476l724q0794j30948j40151j17448
7915E50844q4983o1140m2521k9967k8843k6286k2538j5732j0830j1226j0711r455
7903A96612q422k620p557q143L6M588J4112K0306K0967K5799K7348K6864J8361
7890C28251R473P372J1176J1920J2526J1078J0566J5655K7679N4092R9536J63493
7878G62817K39415L13589L31138K68851J25670p6927k50198l03788k71274k02137
7868I37156j35045r4150p1053n7459n2658l7635k8665k4220j9702k5390k6502
7857C64677k1464r093p203j4416j2513m369L410J5678L3454M5538N3585M2469
7845D89753K6360K938k3766l9065l3722k2175j6526r308q772l652J0725K6148
$$ y = [393677, 510900, 658904, 817201, 950433, 1023909, 1020185, 939391, 808443, 668292, 550844, 465861, 404721, 362200, 332233, 303390, 277104, 254566, 238834, 228004, 216778, 206067, 196612, 188190, 185570, 178013, 169870, 169906, 174494, 188606, 208912, 229879, 255678, 283026, 309890, 328251, 337724, 345096, 356272, 368192, 380718, 391796, 402362, 418017, 445696, 499788, 599324, 762817, 1002232, 1315821, 1646959, 1915810, 2041480, 1964553, 1714355, 1410567, 1139293, 937156, 802111, 707961, 636908, 579449, 526791, 489156, 460491, 436271, 416569, 391179, 364677, 343213, 334120, 326917, 312501, 299988, 295619, 299029, 314707, 348161, 393699, 447284, 489753, 516113, 519051, 495285, 456220, 422498, 400323, 383797, 374489, 365717, 362065, 372790, 398938]
7833C98938M2969O6835R2135J07302J06334Q6824L9789l1793q4264r6904r9485
7822F28680r6400p3677n3331l1707k7436k6270k4160j6815j2440j0523j3704j0201
7810B32016r828q707p669r760r981k971K920L634J3627J7090J2900Q070O301n107
7796B42535j8168j3615j5548j4749j3870j3324q674r831m866l253o40k680k709
7783A20608o997k788o289j1772m561k234m899K861L649j7j0360o562n60J976l295
7768F8760j659J09O98K561K770o53l114m139O29l03p971j086O84j02J373j957
7752E6600k501l214k757M52N55K998O6l213k137l253K003l069J828L642L739k97
7736E1442n242q282m052j61K315J999K205k721m241n833r3R83M35K182p74o46
$$ y = [398938, 441907, 508742, 600877, 708179, 814513, 901337, 941126, 909333, 825069, 728165, 628680, 532280, 458603, 405272, 373565, 346129, 319859, 295699, 278884, 266444, 255921, 242217, 232016, 222188, 213481, 205812, 196052, 186071, 183100, 186020, 189654, 203281, 220371, 233271, 241341, 247642, 242535, 224367, 210752, 195204, 180455, 166585, 153261, 144587, 134756, 129890, 126637, 125997, 123317, 120608, 113611, 110823, 104534, 92762, 88201, 85967, 81068, 83929, 87578, 87561, 77201, 70639, 70079, 72055, 68760, 67101, 67210, 67908, 70469, 73239, 72586, 69472, 65333, 65962, 65659, 57688, 56602, 57286, 57184, 58557, 56600, 54099, 50885, 48128, 48580, 49135, 52133, 52199, 48986, 46849, 43596, 45599, 42530, 44358, 48000, 51739, 51442, 46200, 37918, 33866, 33705, 36020, 38019, 40224, 37503, 33262, 27429, 27336, 28319, 28754, 30936, 30162, 29516]
7720B9516n205L65J481p74P48n46q21q808j269M066L065k083m628k922P85K622
7704A5592P53j862k506j335K847L146K39m920n741k81K470J680L340R32J78P61
7688A5293l192N78m71j94j527o74J032K40k747l088k473K974O069J013l006o071
7672C756J186L373K213K285l242k426K480J109k239j047K004L776K157k526n884
7657F975n716J089q95P81j608K078M77j830k229K065J019o4K842J669J884n022
7641C515J724K300k748r01k643J657%k325K001M202J355k885K40n056n056L328
7625a292R83L098K469L869m678r372o224J91K794L935M640l296J002q48m580K520
7609d789K455J061q75Q31l698l893K375L625q76J280n60N378N355k785o090J358
$$ y = [29516, 24311, 24676, 26157, 25383, 26131, 25585, 24764, 15956, 14687, 18753, 21818, 19735, 15107, 12185, 12970, 15592, 16345, 14483, 11977, 10642, 13489, 16635, 16874, 11954, 6213, 5932, 8402, 10082, 13422, 14354, 14532, 15293, 12101, 12679, 12208, 12014, 10487, 9813, 10845, 11085, 8338, 5250, 2777, 5751, 11820, 12833, 9827, 3756, 4942, 8315, 10528, 12813, 9571, 7145, 9625, 10734, 8495, 7448, 9452, 13228, 15385, 12859, 6975, 1259, 2348, 1453, 2234, 626, 2704, 3181, 1351, -878, 1187, 2206, 2142, 4984, 6653, 8537, 3515, 5239, 7539, 4791, 3890, 1247, 2904, 2904, 579, 2580, 6782, 8137, 5252, 5492, 436, -4620, -1292, -309, 2789, 5258, 9127, 4449, -4923, -11147, -10956, -8162, -4227, 413, -2883, -1881, -2729, -7309, -4789, -2334, -1273, -2148, -1317, -5015, -8908, -6533, -2908, -3784, -2504, -3064, 2314, 7669, 4884, -1206, 152]
7593A52L378p84k489q48P709M943q366o69j435j432k887k329J440P354k785k984
7577b032K484P07l037l08K461r43l876l870l56L478K59o343J118O999l73k629
7561f261J82N77l629K995K005J466L819j593l347k85L304K798k973n92K300K70
7545A036q73j046k494j193l368M34j523O20K722K515k924n792j116Q849O949J932
7529D728j69j579m611j991K620K776N656L0m039m670k914n43Q253j374k839J15
7513e51J08N84K02n61j651K275L46n68j690J165J434l341r4n06K81K833k114K798
7495I50L523N38j909j862j43j175R77L503J680k31j808m349l158k729n65K879
7479c879L140J615j320k709J815Q743J737m212k810n09N610J303o124P08J320
$$ y = [152, 3530, 2746, 257, -591, 7118, 12061, 3695, 3026, 1591, 159, -2728, -5057, -3617, 3737, 952, -2032, 452, 1159, -1878, -2186, 275, -668, -4544, -8414, -8770, -5292, -5033, -11376, -10258, -3259, -3632, -6261, -6079, -5502, -9131, -6136, -4131, -2665, 1154, -439, -3786, -4071, -767, 2031, -942, -1534, 766, 1036, 163, -883, -3377, -4570, -7938, -7504, -9027, -8407, -5685, -3170, -6094, -11886, -13002, -4153, 2796, 4728, 4559, 2980, -1631, -3622, -1002, 1774, 7430, 7460, 3421, -1249, -4163, -4706, 3547, 2173, -666, -551, -443, 141, 343, -218, -1869, 406, 752, 184, -1506, -341, 1093, -2248, -2342, -2848, -2567, 266, -1848, 950, 4473, 5011, 3102, 1240, 1097, -78, 899, 4402, 6082, 5851, 4043, -306, -3464, -6193, -6758, -3879, -739, 876, -444, -3153, -1338, 7405, 9142, 4930, 2120, 1611, 7221, 8524, 2400, 3108, 4428]
7464D428j453j573j302k898L411M996J612j095J055K168l519J791n992l19Q02
7449B112k092K97J549J344k83m53m437l21L617k293N19L3J987k32K092N269j407
7432G301k913R14N30J093j359J536J137k425m372l528j723j00L731N84j545k9
7416a168L595J64l647n89K568J043m764o53K683K094o867L90P01k205l456L778
7400f333k433J70M168q63M229N08J068j537k097n906L08K932J315J845m91M608
7384A491K750N22l970N44j23j817O33j377p19k513k53O45L500j176o027P08L673
7367c509J829J967J756m848j570k80j654l804L798K723L205k350k506M761M322
7352C840q69n68l578k471l76K015k516k728l78k21O04J896l11j202l828k646K278
$$ y = [4428, 2975, 1402, 100, -2798, 613, 5609, 7221, 6126, 7181, 9349, 5830, 7621, 1629, 1310, 2112, 20, 317, 1866, 3210, 2927, 2474, -1963, -2284, 1333, -960, -441, -408, 1579, 1347, 3439, 8708, 7301, 4388, 5302, 5832, 6925, 5566, 7102, 8239, 5814, 1442, -2086, -3809, -3909, -178, 406, -1139, -1168, 2427, 2591, -1056, -1645, 923, 1966, -2798, -3451, -768, 1326, -5541, -5151, -4450, -6655, -10111, -6333, -8766, -8596, -4428, -5291, -1062, -554, 514, -1023, -3120, -9026, -8718, -5786, -4471, -2626, -3117, 1491, 4241, 4763, 793, 1337, 1214, -603, 30, -1347, -2066, -4579, -4832, -4187, -687, -1863, -7890, -7182, -3509, -1680, 287, 2043, -2805, -4375, -4655, -6309, -10113, -6315, -3592, -387, -2737, -5243, -482, 3840, 2971, 2403, -1175, -3646, -4022, -2007, -4523, -7251, -7629, -7850, -7246, -5350, -5661, -6863, -10691, -13337, -11059]
7335a1059N729k73k510k359n07O12J251l83J050P237L918p005p23j949l45l388
7319a0704L198J530j907J269Q639K912l572k631MM284p46n991K196k587k917k456
7303i479K486Q05j222N841K972n207p73j073o568MO076Q846n179l454k561O841
7287a645M460k305n879j007J492L295M319P26k50l508n348j320K615N621j875
7272f09k560L203j288m211j043K168J44J343L845k246K412M014k946r32K594j207
7256B681M69l665k554k57J586k545m10L383L445L011p71n762m382k085K604J836
7240c416J561K208j25l211l225J749J12j944J104l94J270L150j892j858k169p43
7224g823Q143l24o741o57L305l726l527K726J674J10N5o9j184n37o21J248j31
$$ y = [-11059, -5330, -5603, -8113, -10472, -10979, -10367, -9116, -9499, -8449, -1212, 2706, -4299, -5022, -6971, -7316, -10704, -7506, -5976, -7883, -6614, 2025, 4937, 1365, -1266, -1262, 3022, 2276, -3715, -1519, -4106, -7023, -9479, -6993, -6188, -7410, -1569, 1403, -3804, -4577, -5650, -12218, -12214, -6138, 2708, -2471, -5925, -8486, -1645, 2815, 510, -5369, -6376, -4884, -1589, 2730, 3456, 3206, -302, -5650, -6970, -4355, 1266, -609, -3169, 34, -1254, -5465, -6508, -4340, -4196, -2853, 992, -1254, 1158, 5172, 2226, 1294, 3888, 2681, 3150, -515, -3069, -3326, -1740, -4285, -4695, -1312, 2133, 5144, 4373, -1389, -5771, -7856, -5252, -3416, -1855, 353, 228, -2983, -6208, -4459, -4347, -6291, -5187, -5581, -4311, -1161, -3053, -4911, -7080, -7823, 320, -4, -6745, -7402, -4097, -7823, -11350, -8624, -6950, -6840, -6785, -6854, -8038, -8575, -9196, -7948, -8079]
7207h079J493k74Q8k3L173k810k761R43J824M444k314j363K40k00k329K042M340
7190a566j7P75N27L07j2152j491O559N701O9n28j852k020j738J540m01l290K295
7173g282L16P86k94l17J269J704l781N36L052r83L468M078j188j541j798R92N209
7156D226m80n024o367M6O115N567K348l693m898k980K387J106R37K168k377k343
7140c262O7l29r67k049M467m132L53k89L333q2N526M795j167m748k621L410j668
7123F37L60k801k917L228J495M101j759kM022J70l10j970m793k022J914k558k720
7106e925K215J7M243j197J698N99j021j034k433m505m323L278P29O97r17O015
7090a864Q5l687r4k78m838J773N454k762j643K206j753k261L794Q13k21K530J478
$$ y = [-8079, -6586, -6860, -6772, -6795, -3622, -6432, -9193, -8250, -6426, -1982, -4296, -5659, -5419, -5619, -7948, -5906, -1566, -1583, -808, -281, 26, -12126, -13617, -7058, -1357, -1288, -1816, -3668, -5688, -7426, -5886, -6287, -9577, -7282, -6966, -6180, -6474, -6791, -5522, -3818, -7599, -7063, -4011, -4994, -1526, 2552, 1364, -177, -1975, -983, 4226, 3746, -1278, -7645, -7599, -1484, 4083, 6431, 2738, -2160, -5140, -2753, -1647, -710, 1458, -919, -3262, -3195, -3524, -4491, -6540, -2073, -6205, -5852, -6141, -2808, -2890, 2636, 7431, 6264, 1516, -1105, 2305, 637, 997, -1804, -4721, -1493, 2, 4103, 2344, 2342, 6364, 6534, 6224, 4254, -539, -2561, -647, -3205, -5925, -3710, -3693, 550, -647, 1051, 1650, 629, -405, -2838, -7343, -11666, -8388, -7659, -6962, -7879, -1864, -1779, -5466, -5560, -5838, -10676, -8903, -3449, -6211, -7854, -5648, -7401, -9662, -5868, -5055, -5276, -2746, -1268]
7073a268K976K673m745m338k840l926M238j127O102k60l046k12J314K588J021
7058h50j645j659m032k079L579j664P9K205k393n604K167L722L04L458l19K13
7042d518l07K624J336j887j502K915K239K391j938m927l97l681l154K811P238
7027g57o79j261l726m38N618K289k421l031J461j694M465P04o083J494J998J320
7011g41J364n31o7j428p955o878P003O094k312k015K781K182o1j182m920j636
6995a0302K797N447M176j578L218J820L76j659l265k738K180R02M943m002o192
6980c877j109N163L065J683m019j962K692P626j561j0890j838L830J243k936R85
6965a905L17p8Q28L514K059j537m677k284Q72j809P53M763o66j031m988K70J186
$$ y = [-1268, 1708, 4381, -364, -4702, -7542, -11468, -7230, -8357, -2255, -2515, -5561, -5773, -4459, -1871, -850, -2495, -4154, -8186, -10265, -6686, -8350, -8271, -6066, -8459, -14063, -11896, -8174, -7870, -4412, -4731, -4518, -4825, -2201, -865, -2752, -4254, -1339, 900, 3291, 1353, -3574, -3971, -7652, -10806, -7995, -757, -1436, -2697, -6423, -6861, -1243, 1046, -1375, -4406, -2945, -4639, -174, 530, -5553, -4059, -2061, -741, 623, 92, 25, -1403, -9358, -16236, -9233, -3139, -5451, -7466, -4685, -2503, -2564, -3746, -8666, -10302, -7505, -2058, 2118, 540, 3758, 5578, 5954, 4295, 1030, -1708, 472, 1374, 6317, 2315, -3877, -4986, 177, 3242, 4925, 906, -1056, 1636, 9262, 7701, -3189, -5027, -1197, 46, -2890, -1905, -1588, -1666, -838, 2676, 4735, 3198, -1479, -3763, -2891, -4700, -3947, 816, 150, -881, -5869, -5599, -4413]
6948d413n601j399J453L785K186J953N5O30k587l348m295J492O77J374l951J77
6932a1812K222Q11O163K761Q59M024M0m462k338L428K046r635o721K782K182L234
6916d416Q30L097O118m175k182m163m128k002k539O708J049J777p62n070O3L174
6900f621L661O315N70n522K286N199k93m321k727l927q65M803N211o43l587l703
6884d164k238q460m633O156L677k987Q234O019nn422k229N767K977k75j02l601
6868a286m677j980L645j216M69j908k128J914J126o375j071k516L345L003M329
6853e326L76q88n299n155ML970P580m7m191K02O00M27N510K176q39L632J170R13
6835D815j747n319k892k157M503o45K408K746K90J619M651k93l433O414l73m556
$$ y = [-4413, -10014, -11413, -9960, -6175, -3989, -2036, -1981, -1351, -3938, -7286, -11581, -10089, -9412, -8038, -11989, -11812, -9590, -8779, -2616, 145, 1004, 5028, 5068, 606, -1732, 1696, 3742, -5893, -12614, -9832, -7650, -4416, -3586, -489, 5629, 1454, -728, -4891, -9019, -11021, -13560, -6852, -5803, -4026, -4788, -9858, -9795, -6621, -2960, 3355, 3925, -1597, 689, 5888, 5595, 1274, -1453, -5380, -6245, -1442, 3769, 3126, -461, -4164, -6402, -14862, -19495, -13339, -9662, -12649, -4415, 1604, 1599, -3823, -6052, -285, 2692, 2417, 2315, -1286, -5963, -7943, -4298, -5514, -5045, -6953, -9081, -7167, -6041, -12416, -13487, -16003, -12658, -9655, -5326, -4950, -5838, -11137, -16292, -16288, -12318, -4738, -4785, -8976, -8774, -8174, -7747, -2237, -61, -900, 2732, 3902, 4815, 3068, -2251, -5143, -7300, -2797, -3442, -1034, 1712, 2002, 3621, 8272, 7979, 4546, 10960, 10587, 6031]
6819F031K666K33n212p764K358J508K323L918M89o83l020j041k391k080l291l473
6803i429r65L047j178L932p10M818M749P85j008k022m796r68K646R86k495l851
6787f459l677N87K752K513j522j889N726L003M619m53n949m140O88l378K910k24
6771d893m418K610O011K835l952K74o44j900N27j228J837K430j514k908J191k33
6755c975j858j228K556K76Q44K841q86o36K270L808k138j998l215j208k392K5
6739f914N336j690n570K567M977p71j328k937P16R62j74K086J042j647r57m207
6723h509n665M382J752K56J493L18k656o02L483J438J052n134K30M167K869K8
6707a098r91R3k722L826r48m153l5L266O357L282j087l594q63J9k300m549l94
$$ y = [6031, 8697, 8930, 3718, -4046, -1688, -180, 2143, 6061, 6550, 5867, 2847, 1806, -585, -2665, -5956, -9429, -10394, -7347, -8525, -4593, -5303, -485, 4264, 5049, 4041, 2019, -2777, -3745, -1099, -113, -2608, -6459, -10136, -9549, -6797, -4284, -5806, -7695, -1969, 1034, 5653, 5200, -749, -4889, -4201, -7579, -4669, -4893, -9311, -6701, -690, 2145, -1807, -1533, -2177, -4077, -3550, -4778, -2941, -511, -2025, -4933, -3742, -3975, -5833, -7061, -4505, -4229, -3385, -544, -1430, -2066, 204, 4012, 1874, -124, -3339, -4547, -6939, -6914, -1578, -3268, -8838, -6271, -1294, -2065, -3393, -6330, -5614, -4652, -4826, -2740, -1698, -3345, -4302, -8509, -14174, -9792, -8040, -7784, -6291, -5973, -8629, -9231, -5748, -4310, -3258, -8392, -8162, -3995, -1126, -1098, -2089, -1996, -4718, -892, -1840, -5993, -6028, -2762, 3595, 6877, 5790, 2196, 1333, 1352, -948, -5497, -5891]
6690e891L40J848J837L047m405l97l77m056N625P093K147p479n985j413L728j11
6674d449J674M748j356j773k933n34L832K378Q38q30K077j241j233N223r12K88
6658E797o056l125K588N317l708j999J381J02n363P72k564J441K826L175l318
6643b734j468l567J858j247J119J41N624J43J384K822m667j201j438K161p64j693
6627c527R67j220K286K752L83k7l076j795J244m127k166K955m89L990j110P9K821
6610f0j485j237J204m493P57N57k300j139M031Q420l122j48J563j369L261O04
6594E044k412k371m33j605J174M311J533N99J919J754j853O62k397n197M950J705
6578G383n285o04k119o377m589J495M060L871k268L078K459J476J860m25p13k97
$$ y = [-5891, -5551, -3703, -1866, 1181, -3224, -3621, -3998, -8054, -2429, 4664, 6811, -668, -6653, -8066, -4338, -4449, -2775, 1973, 617, -1156, -4089, -4623, -791, 1587, 2425, 1595, 3672, 2431, 1198, 6421, 5509, 5797, -259, -3384, -796, 4521, 813, -1186, 195, 297, -5066, -4294, -6858, -5417, -2591, 584, -2734, -4202, -7769, -5911, -7158, -6039, -5898, -274, -131, 1253, 4075, -592, -1793, -3231, -1070, -1834, -3527, -2560, -3780, -1494, 1258, 1641, 1614, -1462, -3257, -2013, -6140, -8306, -5351, -5840, -1850, -2960, -2881, -60, -1545, -2782, -1578, -6071, -5314, -4757, -7057, -8196, -4165, 4255, 1133, 985, 2548, 1179, 4440, 5044, 2632, 261, -172, -1777, -603, 3708, 5241, 5840, 7759, 9513, 7660, 8322, 5925, 728, 5678, 7383, 2098, 1494, -625, -7002, -11591, -10096, -6036, -2165, -4433, -1355, 1104, 2580, 4440, 4015, 3302, 3005]
6562C005l339m653J93L496j654o04k355k664M977j302K303J881J406J629J628
6547C947j688R73J229k236k392M77K658m564m953j366M760M655L88J459K927k077
6531D197K43J847O164j628l659J68K567l049q97o077j039m45O15M718J410q10
6515D325m65j019n95k869J38J248j557m045J578k287J400K899L464K663M97m614
6499G61q363n192M460O321O142J635k805k17q56j244K04k176r87J187M233M55
6483C558n9L629q53m333Q41l227k452K517k517l57r0K932J474M105j684j873j49
6466A462r93j057R67n521k115J848J612j495P33J219J802Rm129P07j748L680K307
6449g12K632k29n852k840M581m48K075K232l50M635K174j910n326m121J723n938
$$ y = [3005, -334, -4987, -4794, -1298, -2952, -3556, -5911, -8575, -3598, -4900, -2597, -716, 690, 2319, 3947, 2259, 3232, 4461, 2225, -167, 310, 2968, -1596, -6549, -7915, -3155, 1500, 1888, 3347, 6274, 4197, 4440, 6287, 12451, 10823, 7164, 7332, 9899, 6850, 5953, -124, -1163, -1608, -993, 3725, 5135, 4325, 3860, 2841, 2246, -623, -485, 763, -794, -4839, -3261, -5548, -4148, -1249, 2215, 4878, 5375, 761, -7602, -12794, -8334, -2013, 4129, 5764, 2959, 2742, 1886, 642, 846, -1330, -2317, -1130, 3103, 3558, 3499, 7128, 6275, 1942, 2783, -444, -2896, -379, -2896, -3253, -3343, -411, 1063, 5168, 3484, 1611, 1462, 469, -588, 379, -5142, -7257, -5409, -3797, -5292, -4559, -3340, -1538, -1529, -5658, -4951, -6699, -3019, -712, 1920, 1691, -4161, -7001, -2420, -2868, -793, 1439, 1089, 5724, 7898, 5988, 662, -3459, -1736, -7674]
6433g674k499K502R700N401n110n343l427j92K79N775O199m288p03j23m360k23
6417d086J353L952j620j752m512k412K544M897L314n856m967J764N465j317p5
6402c308M865l076l346J786Q11M236L265J237l631J260j565k72J551K79j000q196
6386e104j296K243K964K179m035j851J212K633M43N42J389M814K00K42k224j776
6370B575j156n34n34m717l466k49J705K020l604J533Q38r1J765K534J918n354
6354d817j816M542L269k59r51l88j931k26L34J886J498J20M378M536L60j807r9
6337H629q799m597o011o00K990O602j198j495R67N583k95l506l181J597l404j696
6321h414M444M090m775n65j259k017K895j56J674O62j885M70k062l130J610L948
$$ y = [-7674, -10173, -7671, 2029, 7430, 2320, -3023, -6450, -6642, -6363, -588, 5611, 1323, 620, 497, -3863, -4086, -2733, 1219, -401, -2153, -6665, -9077, -6533, -1636, 1678, -4178, -9145, -7381, -1916, -3233, -3308, 1557, -1519, -4865, -3079, -2268, 1968, 5233, 6470, 2839, 4099, 2534, 2262, 3813, 4092, 3092, -5104, -6400, -4157, -1193, 986, -3049, -4900, -3688, -1055, -612, -70, 1319, 6133, 6333, 6575, 4351, 2575, 1419, 885, 351, -4366, -7832, -8081, -6376, -4356, -7960, -6427, -5589, -5680, -3915, -1381, 537, -4817, -6633, -2091, 1178, 919, -32, -420, -2351, -2577, -2243, -357, 1141, 1261, 5639, 10175, 10535, 8728, 8629, -170, -4767, -10778, -11378, -8388, -1786, -2984, -4479, -3512, 2071, 1776, -1730, -4911, -3314, -6718, -8414, -3970, 120, -4655, -5220, -6479, -8496, -5601, -5757, -4083, -3421, -5306, -4836, -6898, -10028, -8418, -4470]
6305d470K000r20M491R07m091p867l380P317j196k85M137P707m41j815o453k764
6289g123J43J807J473n603k386R17O46N348K719j89j271j347q24j120J125Q1Q88
6272d716J08L886O77j135m097k375O90L982J531L761L07k633j434l455K702j423
6256c624L416l857N04K472n72l761M645k114p258L54L568L96L768O076L892m528
6240C377l092k101J108j132J416k368j035m587j995k320r19J332L707M499N974
6225A864K352j048k978j251l723j597L99N390l053O01k32Q80L176K129j018m590
6209b699N53j296Q5o56l416k909L451K882O142j1M99m820j877L677J456K06n758
6192d491p916q32J311J076P876N252m423l94J057k254J243K993n61K30q26m96
$$ y = [-4470, -2470, -3390, 1101, 2008, -2083, -9950, -13330, -6013, -7209, -7494, -3357, 4350, 3909, 2094, -4359, -7123, -6980, -5173, -3700, -9303, -11689, -10772, -10126, -4778, -2059, -2248, -3519, -4866, -5690, -6810, -5685, -5604, -4716, -4608, -722, -45, -1180, -5277, -7652, -6962, -2980, -1449, 2312, 2619, -14, -1448, -4903, -2201, -3624, -208, -4065, -3561, -1089, -1661, -5422, -777, -2891, -10149, -9795, -6227, -5831, -2063, 4013, 7905, 3377, 285, -1816, -708, -1840, -424, -2792, -3827, -8414, -10409, -12729, -13648, -12316, -8609, -4110, 1864, 4216, 3168, 190, -1061, -4784, -6381, -5982, -592, -3645, -3044, -3276, -2396, 780, 2909, 1891, -2699, -2146, -3442, -3357, -4013, -7429, -10338, -6887, -4005, 2137, 2126, 2625, -2195, -4072, -395, 1061, 1267, -4491, -12407, -13239, -11928, -10852, -2976, 2276, -2147, -2541, -1484, -3738, -2495, 498, -63, 167, -659, -1155]
6176a155L919M285o935k20L445L778K229l391m622q03k680M459K792l601n275
6161c775J281J498J702j938l343O410M21m310L126J509l128K115J138m070l770
6146e134O047J420j660K903k204m64m679j741L436J370K739l360K103L078l477
6131C77k470k314j06r8n692J334K913j951k524L854M791m453l105K479K014J340
6115c611j915O014J795m08l374K411J282k063n35m189n67M591L538l51r72r37
6099G09j360m162J624L209L085q005j333j940K311M455P716J69p41l270m61j571
6083D35k308j113L425K500j286n912J589J239N438N775j165o888j821k455n00
6068c047k053Ql724j966m98M396M453M925N440k329p271l032M20j36J977J233
$$ y = [-1155, 2764, 7049, 114, -106, 3339, 7117, 9346, 5955, 1333, 530, -2150, 2309, 5101, 1500, -3775, -2494, -996, 706, -1232, -4575, 1835, 2256, -2054, 1072, 2581, -547, 1568, 2706, -1364, -5134, 913, 2333, 673, 3576, 1372, 908, -3771, -5512, -2076, -706, 2033, -1327, 776, 3854, 377, -2093, -4407, -4513, -4611, -10303, -8969, -6056, -8007, -10531, -6677, -1886, -6339, -9444, -6965, -4951, -3611, -5526, 488, 2283, 1875, -1499, 912, 2194, 131, -404, -4593, -5160, -569, 2969, 2618, 1646, 709, -651, -4813, -3189, 20, 3105, -4900, -6233, -8173, -5862, -1407, 6309, 6478, 5737, 2467, 2006, 435, -1873, -2986, 439, 2939, 1653, -4259, -2670, -1431, 4007, 9782, 8617, 1729, -92, -2547, -3047, -5100, -5092, -8816, -10782, -11280, -6884, -2431, 2494, 7934, 5605, -1666, -4698, -4278, -4414, -2437, -1204]
6052a204L887j013K053k291l838L610K544M76j129n519n176P16M517K56L115j583
6036e79K736K76l096M736M771k143m703p47M21m513j292j979o64N342K128J125
6020A819m72j999J818N368J844n644n29M126l452j967o13K858K475L449J693j1866
6004a092l789L002M909n709j785N89M19L513L630J443J711q67k328j836j175n33
5988A02m68Q2k02L004n08k248K927j342q127j011J8p63J580N039K825Jl993j121
5970d205n122p19L632L52L014R249J17j221K467j258n771o819J453J647K87m78
5954c375k115k642k327m354K145L701L310n80L118m84k307l265M425L183K150
5939E83o24L16J627J368L036l778l742J224j80k17o098j49Q97j96L003O177P43
$$ y = [-1204, 2683, 1670, 3723, 1432, -2406, 1204, 3748, 4224, 3095, -2424, -7600, -6884, -2367, -2111, 1004, -579, 2157, 2433, -663, 4073, 8844, 6701, 1998, 1251, 1672, -2841, -4133, -6112, -6776, -1434, 694, 1819, 1347, -652, 1166, 6534, 8378, 2734, 2205, 6331, 2879, 912, 299, 3157, 5632, 9081, 10774, -1092, -4881, -1879, 3030, -2679, -4464, -3875, -3456, 57, 3687, 5130, 6841, 5974, 3646, 1810, 635, 102, -366, -284, -486, 2518, 2010, -238, 2689, 1347, -6780, -7791, -7773, -8536, -6956, -1917, 908, 909, -3084, -4205, -9327, -10046, -6414, -6062, -3048, 6201, 6318, 5097, 7564, 6306, 535, -6284, -4831, -3184, -2897, -3375, -5490, -8132, -10459, -14813, -12668, -8967, -5657, -6237, -3119, -3603, -5910, -9175, -4750, -1567, 583, -41, 275, 1902, 3270, 6306, 2528, -1214, 10, -170, -387, -6485, -6634, -5737, -5933, -2930, 3247, 3990]
5922C990n41o90J452o43q190j056L735j99N33L10k076P63J827j230l557j14J049
5905d637k131L181L794N777m8k261k322k397o66l184L652j219N314Q64j074l841
5889a198l012K114R8k821l802q88K198M786J370M606j539n985L37L437j786m168
5873f253j068M02J367j791M237o06Q57O789K404o623k242p17J829J566j296l907
5857e052j595J530P1L224M48o05J574m649J785L82k010k790M83N394L113J634
5841B937l379n966J883k055k691L969j338J519j9r3M214k012J803M249K683m476
5825A228p611j798M542N227N58j859J370J067l103K42R54J047L951J671o279l096
5809a889O53J294k465j826R97L404R7j044l648j339j316N461K155M453j584l944
$$ y = [3990, 3449, 2759, 4211, 3568, -4622, -5678, -1943, -2142, -1609, -1299, -3375, -2612, -785, -2015, -5572, -5686, -4637, -6768, -3587, 207, 5984, 5936, 3675, 1353, -1044, -1710, -4894, -1242, -2461, 2853, 3717, 2643, -1198, -4210, -2096, -1998, -4819, -8621, -9509, -7311, -2525, -1155, 3451, 1912, -4073, -3736, -299, -2085, -6253, -7321, -6919, -5552, -7343, -3106, -3712, -2855, 3934, 6338, -285, -2527, -3244, -1415, 151, -1145, -5052, -6647, -5117, -5046, -1822, -1374, -1979, -405, -5054, -3269, -2887, -4897, -7687, -7204, -1810, 1303, 2937, -442, -6408, -4525, -6580, -9271, -5302, -6640, -5121, -5140, -5233, -1019, -3031, -1228, 3021, 5704, 1228, -6383, -8181, -3639, 1588, 2146, 287, 1657, 2724, -379, -137, 817, 1864, 5815, 7486, 1207, -1889, -1236, 58, -2407, -4233, -3236, 168, 265, -779, -4427, -5766, -7082, -1621, 534, 4987, 3403, -541]
5793e41O07J79l708n0K591r4j195o155K153q21J230q48N001M750l519m412l215
5776h047N718l41J66N162J632J952k002m113l120J519j83j187L896K336o128q37
5760c577N583J983j583m015R48O405J822j366m888k326J251M834N85l095l335
5745g74l13J782p02J84J685l097j190n488K310M520J948J087p336o416k45M603
5729g442K518n47m455N89L463J590K925p66j546M002k079k822k437k682K396M285
5713c008K829j849J215j046k527M00k71K165j4k673J041J985R34J20K556k735
5697h78r83k099m320k748K1J081K885K249l764k410O188L812p64l267k715p50
5681h462P458O003J101m488l350K948K325K385O82l482L779n786m471l631j00
$$ y = [-541, 66, 245, -3463, -3513, -922, -1016, -2211, -8366, -6213, -7034, -5804, -6652, -1651, 3099, -420, -4832, -8047, -2329, -2670, -2504, 2658, 4290, 6242, 4240, 127, -2993, -1474, -1657, -2844, 1052, 3388, -2740, -3577, 2006, 3989, 2406, -1609, -661, 5744, 7566, 6200, 1312, -1014, 237, 5071, 5656, 2561, -774, -1087, 695, -7, 177, 1862, -1235, -2425, -7913, -5603, -1083, 865, 1952, -5384, -11800, -12045, -7442, -4924, -5471, -9926, -9337, -5874, -4284, -1359, -2125, -3671, 331, -1748, -4570, -7007, -9689, -7293, -3008, -179, -2028, -813, -1859, -4386, -3986, -4257, -2092, -2106, -4779, -3738, -1753, -819, -699, 1857, -878, -1861, -3960, -8280, -11028, -11007, -9926, -7041, -4792, -8556, -10966, -4778, -966, -1730, -4997, -7712, -8462, -1004, 4999, 6100, 1612, -1738, 1210, 3535, 5920, 6602, 3120, 6899, 1113, -3358, -6989, -7089]
5666g089J017J62L764L851n007n437J89k00j751J192M469J971K228k851j485O679
5650A702Q56k950j547q67k720J864Q13J569K047q24K608j315J601M599j604k697
5634C135J440L897o6o216p45M780K991j960n344j769j644M995j919j698K008J386
5618C271o826m171K281L692k2M504j001k080j580K69K710K812j517k673l912j228
5602e471O419J924m48l968p44K299j827L3n294j415q48L797N460j815j298L656
5586D60L21K892J96l631j065M613j678m134o3L371L076K591p36k878l914l189
5570c768K657J593M308K018q7j399N635l219M7j366o058n662l003k508K692R317
5554A197m059K165M977m182o047p70p93P61O034j699K53l38J224L057J483k454
$$ y = [-7089, -6072, -5910, -2146, 1705, -3302, -8739, -8550, -8750, -10501, -9309, -4840, -2869, -641, -3492, -4977, 1702, 2558, -392, -1939, -2806, -5526, -3662, -2849, -1280, 767, -57, 2551, 1236, 2837, 7436, 5832, 3135, 4575, 8472, 8406, 2190, 1445, 6225, 9216, 7256, 1912, 143, -1501, 3494, 1575, -123, 1885, 3271, -3555, -7726, -5445, -1753, -1775, 2729, 1728, -352, -1932, -1663, 1047, 3859, 2342, -331, -4243, -5471, 948, 2872, 2424, -1544, -2288, 11, -1816, -1783, -7077, -8492, -9340, -5543, -83, -1898, -3196, 460, 781, 3673, 3869, 238, -827, 3786, 2108, -2026, -2089, 1282, 4358, 6949, 6213, 3335, -579, -3768, -1111, 482, 4790, 6808, 6721, 5322, 10957, 7738, 7785, 6419, 361, -5301, -8304, -10812, -8120, 1197, -2862, -697, 4280, 98, -5949, -6719, -7512, -6751, -717, -2416, -2163, -2501, -1277, 1780, 3263, 809]
5538H09J922k411l467L17J737J174j434J14N593l19qL00l875n825j547j598K746
5521e772N581N332n280l87p21l087K931o94n087M201L908J039l253r80J478k046
5505b837K371l54j156O46k815k507L131M913j017J387K470k417R64m78j392L055
5489C964p874j228J92L098J919M568J736j958K15K857k305J658l47k755j73j901
5473A666m73j650p18Q1N15P054l57o24r01m822K124k465k176P50L307J634j15
5456B830L288j250j056l460k116k659k783L687O002K314j481m586k582M606k452
5441a698k643N82N053K837N66n273j679K040P195M6l083o371Q3J667j163m77L113
5424G95q79n822L082R42N979K525k121l595j193m97L763O150Q02l478m701k403
$$ y = [809, 2731, 320, -3147, -2830, -1093, 81, -1353, -1239, 4354, 4035, 4027, 4327, 452, -5373, -6920, -8518, -5772, -191, 5141, -139, -526, -1247, -4334, -1403, -2097, -7184, -2983, 925, 1964, -1289, -2269, -791, -2837, -466, -820, -1976, -1330, -4145, -6652, -3521, 1392, 375, 1762, 4232, 1815, 2779, 2301, 909, 3964, -3910, -5138, -4946, -1848, 71, 4639, 6375, 4417, 4632, 7489, 5184, 6842, 6495, 3740, 3567, 1666, 1193, -457, -1175, -1094, -579, 6475, 6118, 5494, 4593, -229, 1895, -570, -2746, -1996, 1311, 2945, 2830, 6118, 4868, 3812, 352, -1764, -4423, -7206, -3519, 2483, 4797, 3316, -1270, -3852, 754, -1698, -4341, -3759, 1294, 4131, 4697, -576, -2255, -215, 6980, 7026, 3943, -2428, -2345, -678, -1841, -2318, 795, -84, -5906, -2824, -1882, 4097, 6622, 4501, 906, -287, -784, 2979, 9129, 9931, 6453, 1752, -651]
5408f51J572j423K125l246l944N31Q161O98J219K228m531q288r99O059R95L251
5392C757j890j644j070J827J958M497m714l161j85L761N97O18J342j79j442p28
5376C344m0n25J58K94k463j717N85Q96j142k136l86J36m817K058L187k490K561
5359b497P201j647o152m47K297J131O48J80K567j025PL772l34l747k94j383n04
5342b27K874l72P12J018l623p73J450L94k717M83M957l397l50o33l951J518k076
5325d713n026o8O23J412J702j414O66m298j68M341J814L558k056l362M331k95
5309b953j200O240M889o94j803k390J000O1N101N137l549k185l587J626J882l160
5293D415l124J593j44j973k191M71L97K803L336K972o816o791L384N405M943K27
$$ y = [-651, 921, -502, 1623, -1623, -5567, -5036, 3125, 3823, 5042, 7270, 2739, -5549, -6548, -489, 506, 3757, 1867, 223, -847, 980, 2938, 7435, 2721, -440, -625, 3136, 3733, 4351, 5693, 5514, 4072, 3344, 3304, 2779, 2937, 3231, 768, -949, -364, 532, -610, -2746, -3132, -2996, -7813, -5755, -2568, -5058, -2497, 4704, 3057, -3095, -3542, -1245, -114, 534, 714, 3281, 2256, 2263, 6035, 5701, 1954, 1660, 277, -227, 2647, 2275, 2987, 4005, 382, -391, 1059, 1453, -1264, -781, 4176, 779, 429, -204, -4155, -2637, -4713, -9739, -9807, -9184, -7772, -6070, -7484, -6818, -11116, -11284, -6943, -5129, -1571, -3627, -6989, -2658, -2953, -4153, 2087, 6976, 6282, 4479, 2089, 3089, 3150, 8251, 13388, 9839, 7654, 4067, 5693, 7575, 4415, 1291, 2884, 2740, 767, -1424, -953, -556, 2247, 5583, 8555, 1739, -5052, -1668, 3737, 8680, 8907]
5277H907o782n658j746L092M241M066k297k545J474l755k381J392j788n976j750
5262a1506Q70Q73O33K257K647N81j93q58J808M576J886L125J004l454o816m607
5246g174M158J927L395M59k956j51K239q114k063L764L581J997J681M00L154J813
5230H110q85k524l024k760j223N190M840j820L18K908m479J934j866J685r23k55
5214E226q64J884l317p796M486M498K582J046n419l47j225j688J887K159p55K022
5198D379L055O59o357L817Q78k791l259j910j372J712j526n09j885J216q64l86
5182e143K82L291j93J625J401J63p27J828j496N26k493n815k965L553K592L938
5166C67J43J016M410K61l888m459K282m40K690m192K541L828J864K764q46n869
$$ y = [8907, 2125, -3533, -5279, -2187, 2054, 6120, 3823, 1278, 2752, -1003, -3384, -1992, -3780, -9756, -11506, -10636, -9763, -9130, -6873, -4226, -3645, -3838, -4696, -2888, 1688, 3574, 6699, 7703, 4249, -2567, -7174, -3016, -1089, 2306, 2765, -191, -342, 1897, -6217, -8280, -4516, -935, 1062, 2743, 3143, 6297, 8110, 7225, 4701, 1677, -1083, -2306, 2884, 7724, 5904, 6222, 9130, 4651, 6585, 4719, 6404, 5481, 5226, 4362, 6246, 2929, -4867, -381, 4117, 6699, 7745, 2326, 1979, 754, -934, 953, 3112, 2357, 4379, 7434, 8093, 1736, 5553, 6431, 3640, 381, -1529, -2901, -1189, -2715, -3224, -5109, -3893, -4757, -5143, -4861, -1570, -1763, -138, 1263, 1426, 699, 2527, 1031, 1557, -936, -6751, -9716, -6163, -3571, 367, 510, 1526, 5936, 6197, 2309, -2150, 132, -308, 2382, -1810, 731, 4559, 6423, 9187, 8341, 2472]
5150B472l959l931J604P955L089r43M016j874l641k318J157j705q19k223k56P4
5134a302L731L102J20o16J267k876K369J260q872k012P320L599l134k004k028
5119g6J494O03O85K308m14p88o0k562n313J0q16J275L090k908O57M062j874q23
5101a450j2K784j216j686l153k394M048K708M04R28k223k503J491k74n2j604j690
5084e894p13j811K750K690k94k600K79L836L18k679k167m79J728L678k223K096
5068a485O497M576K853j030o006n882K063J223m050o6L366j230j384k480j621
5053d656m037p50n58J461L33L304j850r19j34L318J099M681Q82L345K983O62l249
5036E915o315j196P891L616j638j259m082l967k961o974J197P570N499K093j837
$$ y = [2472, -1487, -5418, -3814, 4141, 7230, 6287, 10303, 8429, 4788, 2470, 3627, 1922, 1103, -1120, -1376, -1302, 2429, 5531, 5651, 5035, 6302, 3426, 5795, 7055, -1817, -3829, 3491, 7090, 3956, 1952, -76, 1418, 2021, 2706, 5014, 4600, 3812, 3752, 1190, -4123, -4113, -4929, -3654, -564, -3472, -2815, 1247, -627, -1450, -1462, 1322, 106, -1580, -4733, -7127, -3079, -371, 33, 961, -1262, -3765, -2274, -2548, -2600, -4204, -5894, -6607, -8418, -5668, -2978, -3272, -5872, -5593, -1757, -1439, -4118, -6285, -6764, -5036, -1358, -3581, -1485, 5012, 9588, 12441, 11411, 5405, -477, 1586, 2809, -1241, -1307, 2059, 829, -555, -3035, -4656, -8693, -9443, -10001, -8540, -8207, -4903, -6753, -7672, -7806, -4488, -3389, 1292, 2174, 5519, 8502, 9164, 5915, -400, -1596, 6295, 9911, 8273, 7014, 2932, -1035, -3996, -10970, -9773, -2203, 3296, 5389, 3552]
5021C552J83j596n600K90n34L891J01k813M298k15q54P16k231n441K885K385J853
5004H70K972o53j840j720j491k36M61K834k458L18M030J452L265m131k941m07
4988C25K688K253k228n385K090J579j343j996N071L309j07l473O51J019r17k247
4972A289k333J560j923K417K293n964K942q30r35J089K492j114m044l268j439
4957g768L063O258n51R41J558L760Q25m419l433n7l63n99l207N86R32l09K447
4940c36K645j514l564j50J255K59M02K654J902k174Q25m015k583j52K445R89K575
4923A463N524K395o246m118L193p93l693Q54P222k525p443L95J037J433K189J611
4907B498L874j293k552k161M340N720l433j349k334o40M757L48l494n769n74j595
$$ y = [3552, 3735, 2139, -3461, -3171, -3705, 186, 287, -2526, 1772, 1557, 703, 1419, -812, -6253, -3368, -983, 870, 3842, 3189, 1349, -371, -1862, -2098, -1637, 1197, -1261, -943, 3087, 4539, 7804, 3673, 732, 325, 3013, 5266, 3038, -2347, -257, 1322, -21, -2017, 3054, 6363, 6256, 2783, 3434, 4453, 3536, 1289, -1044, 516, -1407, 1010, 3303, -2661, 281, -549, -1484, -395, 2097, 983, -3061, -6329, -7768, -4705, 1553, 1002, 1943, 3501, 7261, 8086, 3667, 234, 177, -186, -785, -3992, -3406, -2474, -2783, -336, 2309, 795, -2769, -2919, -1664, -1405, -1003, 1651, 3553, 1379, 2204, -1811, -4394, -4546, -2101, -1112, 1463, 6987, 9382, 3136, -982, 2211, 1418, -2275, -1421, 5801, 3276, -4167, -3772, -2735, -1302, 887, 2498, 6372, 5079, 2527, 366, 4706, 10426, 6993, 5644, 3310, 2670, 7427, 7775, 4281, -1488, -2062, -3657]
4891c657J84J578q33L55o58K605M310L653o833l547O21N659N152k249j050L136
4875H426j674j283K398k795l243k318N143J815m893m205l34j58J958p61J373L589
4859C038L516j272q909j598O374j317J755J096n189R28N314L153j273J071k752
4844C935n10K443l114n996o64j888j840j555L010J716j706P98K236K872J459j308
4828a12Q70k678O509M443k527j632p288k151J566P42j45M938K135o79j647L437
4812E781K862k195J553k3j171L22l018j293k839k459L616J167m405o970j620N542
4796e150N262K328L2L162R55N15m009j553n114j896K379j240O57J084M52j18j741
4779c995K581k940k554M277L174J27o52P77P859j885n400q41n38l951M165j586
$$ y = [-3657, -3473, -1895, -2728, -2373, -3031, -426, 3884, 7537, 704, -2843, -2222, 3437, 8589, 6340, 5290, 8426, 6752, 5469, 7867, 5072, 1829, -489, 4654, 6469, 1576, -2629, -2963, -3121, -1163, -1924, -551, 3038, 6554, 5282, -3627, -5225, 1149, -168, 1587, 2683, -2506, -1578, 3736, 6889, 5616, 6687, 3935, 3425, 5868, 2754, -3242, -3906, -5794, -7634, -9189, -6179, -4463, -6169, -5371, -3135, -263, 1196, -112, 758, -1920, 4589, 9032, 6505, 4873, -2415, -4566, -3000, -2258, -2403, 2535, 4670, 3991, 2344, 5781, 8643, 6448, 8001, 7978, 6807, 7129, 4111, 2818, -21, -2480, 1136, 2303, -2102, -9072, -10692, -5150, 112, 2440, 2472, 5634, 6589, 7104, 3095, 1542, -3572, -5468, -3089, -4329, -3672, -2588, -2136, -2254, -3995, -1414, -4354, -6908, -2631, 543, 670, 18, 795, 8654, 6769, 1369, 528, -10, -3961, 204, -1382]
4763a382M571N172j782o384O96k50R91r39N174M049m086p11R43j859p25j859j545
4746G4R88k141j387K812L006j11m997p94j40P691N276m845l269O4l162k571O32
4729b874N821K452k799K859J278k682l746j447k064M722J276K638K307K708n64
4714I885q405j532j528o573J975K871J933j025j274P29j49k84K188m2l097J865
4698b463O53l9p24J291N604J555J22L06l223m882k496N76M586M993o85q845j151
4681d822M689K819J9l24o387l52r79L40J185j013j54P684P878k00m873j408k281
4664A821m048M23K370j285K799l901k393L57J229J996N245l191l614j142J600
4649a734J610l443J010K096J343k077M24N3r24j16q63K333L024O791K001k430
$$ y = [-1382, 3189, 8361, 6579, 195, 891, 641, 1632, 693, 5867, 9916, 5830, 5119, 6062, 4203, 3478, 1619, 74, 1062, -1079, -2466, 346, 3352, 3241, -1756, -2550, -2690, 5001, 10277, 5432, 2163, 2227, -935, -3506, -2874, 2947, 5399, 2600, 5459, 6737, 4055, 309, -1138, -3202, 1520, 2796, 5434, 7741, 10449, 9885, 1480, -52, -1580, -8153, -6178, -3307, -1374, -2399, -3673, -2944, -3093, -3377, -1189, -1231, -4328, -2463, -1810, -1849, -2573, -1282, 4322, 5877, 5999, 6305, 3082, -1800, -4296, -3720, 866, 5859, 5174, -3671, -4822, -133, 2686, 2705, 2381, -4006, -4358, -5337, -4997, -3812, -4825, -4979, 2705, 10583, 10383, 5510, 4102, 1821, -2227, -1804, 566, -719, 2080, -1821, -4214, -3857, -2628, -632, 4613, 1422, -2192, -3334, -1734, -124, -3567, -2557, -461, 882, -1195, -771, -718, -1642, -1758, -2621, -288, 2736, 9527, 11528, 9098]
4633I098k553L791K823k581k932m861j855j145J814L910j334l236k958P73J98
4618a048j455l457n88J887K599m41l152K111L361j578M97M046J071J002L493l963
4602D385l129J187J252O99j067L221l51q382K586Q598L479p280l265l24p006K97
4586e100L77o56J993L190N305k876l014p43M36M70P51J176o01o59K188J490m866
4569a139m70K649L512j598K122K712l618n307k952L781M135j86L623K832n76j173
$$ y = [9098, 6545, 10336, 13159, 10578, 7646, 2785, 930, -215, 1599, 5509, 4175, 939, -2019, -1246, -1048, -2503, -5960, -6548, -4661, -2062, -2503, -5655, -3544, -183, -1761, -1264, 2782, 3853, 4855, 8348, 4385, 1256, 2443, 3695, 4394, 3327, 6548, 6197, -2185, 401, 8999, 12478, 5198, 1933, 1609, -5397, -5100, -4723, -5379, -3386, -196, 5109, 2233, -781, -1524, -1088, -618, 133, 1309, 708, 49, 2237, 3727, -1139, -1609, 1040, 4552, 2954, 5076, 7788, 4170, -1137, -4089, -308, 3827, 3641, 7264, 10096, 9520, 8347]
$$ [...]
##END NTUPLES=NMR SPECTRUM
##END=
