##TITLE=Analysis number 320464
Compound Code sew 02034
Project Code adrs
Chemist Name stores
##JCAMPDX= 6.0         $$ Bruker NMR JCAMP-DX V2.0
##DATA TYPE= NMR SPECTRUM
##DATA CLASS= NTUPLES
##ORIGIN= Bruker BioSpin GmbH
##OWNER= nmr
$$ XWIN-NMR		Version 3.5
$$ Tue Jun 27 08:42:43 2006 GMT Daylight Time (UT+1h)  MAYBRIDGE\nmr@NMR_250MHZ
##.OBSERVE FREQUENCY= 250.131544655141
##.OBSERVE NUCLEUS= ^1H
##.ACQUISITION MODE= SIMULTANEOUS (DQD)
##.ACQUISITION SCHEME= undefined
##.AVERAGES= 16
##.DIGITISER RES= 18
##SPECTROMETER/DATA SYSTEM= dpx250
##.PULSE SEQUENCE= zg30
##.SOLVENT NAME= CDCl3
##.SHIFT REFERENCE= (INTERNAL, CDCl3, 0, 16.4463)
##AUDIT TRAIL= $$ (NUMBER, WHEN, WHO, WHERE, WHAT)
$$ ##TITLE= Audit trail, XWIN-NMR		Version 3.5
$$ ##JCAMPDX= 5.01
$$ ##ORIGIN= Bruker BioSpin GmbH
$$ ##OWNER= nmr
$$ C:\u/data/dgb/nmr/ADRS/1510/pdata/1/auditp.txt
$$ ##AUDIT TRAIL=  $$ (NUMBER, WHEN, WHO, WHERE, WHAT)
(   1,<2006-06-27 08:42:04.32 +100>,<MAYBRIDGE\nmr>,<NMR_250MHZ>,
      <created by zg, POWCHK disabled, PULCHK disabled
       configuration hash MD5:
       E2 DF 36 D8 04 B2 41 60 5A D7 A3 38 5A 4B D0 FE
       data hash MD5: 64K
       22 FC 82 E1 3E 2B 95 47 0C D5 BB 41 28 B5 DD DC>)
(   2,<2006-06-27 08:42:23.04 +100>,<MAYBRIDGE\nmr>,<NMR_250MHZ>,
      <Start of raw data processing
       ef LB = 0.3 FT_mod = 6 PKNL = 1 SI = 32K 
       data hash MD5: 32K
       37 AC FC 4C E7 9D EC 7A A1 8D B0 24 BE FA 25 16>)
(   3,<2006-06-27 08:42:27.65 +100>,<MAYBRIDGE\nmr>,<NMR_250MHZ>,
      <apk 
       data hash MD5: 32K
       8A F2 6F 06 ED B9 78 A3 14 0F 40 21 62 FF CC 43>)
(   4,<2006-06-27 08:42:29.09 +100>,<MAYBRIDGE\nmr>,<NMR_250MHZ>,
      <abs ABSG = 5 
       data hash MD5: 32K
       BA 8E E4 D1 55 1E 1D E0 89 88 7E 75 A1 F8 66 C7>)
$$ ##END=
$$ 
$$ hash MD5
$$ B9 61 70 B2 A1 32 45 5C 82 4C 05 79 44 12 FD 9F
##$RELAX= 
##$RELAX= 
##$RELAX= 
##$RELAX= 
##$RELAX= 
##$RELAX= 
##$RELAX= 
$$ Bruker specific parameters
$$ --------------------------
##$DU= <C:\u>
##$EXPNO= 1510
##$NAME= <ADRS>
##$PROCNO= 1
##$TYPE= <nmr>
##$USER= <dgb>
##$AMP= (0..31)
100 100 100 100 100 100 100 100 100 100 100 100 100 100 100 100 100 100 
100 100 100 100 100 100 100 100 100 100 100 100 100 100 
##$AQSEQ= 0
##$AQ_mod= 3
##$AUNM= <au_zg>
##$AUTOPOS= <3 >
##$BF1= 250.13
##$BF2= 250.13
##$BF3= 250.13
##$BF4= 250.13
##$BF5= 500.13
##$BF6= 500.13
##$BF7= 500.13
##$BF8= 500.13
##$BYTORDA= 1
##$CFDGTYP= 0
##$CFRGTYP= 5
##$CHEMSTR= <none>
##$CNST= (0..31)
1 1 145 1 1 1 1 1 1 1 1 1 1 1 1 1 1 1 1 1 1 1 1 1 1 1 1 1 1 1 1 1 
##$CPDPRG= <>
##$CPDPRG1= <>
##$CPDPRG2= <>
##$CPDPRG3= <>
##$CPDPRG4= <mlev>
##$CPDPRG5= <mlev>
##$CPDPRG6= <mlev>
##$CPDPRG7= <mlev>
##$CPDPRG8= <mlev>
##$CPDPRGB= <>
##$CPDPRGT= <>
##$D= (0..31)
0 1 0 0 0 0 0 0 0 0.06 0 0 0 0 0 0 0.0002 0 0 0 0 0 0 0 0 0 0 0 0 0 0 
0 
##$DATE= 1151394122
##$DBL= (0..7)
120 120 120 120 120 120 120 120 
##$DBP= (0..7)
150 150 150 150 150 150 150 150 
##$DBP07= 0
##$DBPNAM0= <>
##$DBPNAM1= <>
##$DBPNAM2= <>
$$ [...]
##$SUBNAM7= <"">
##$SUBNAM8= <"">
##$SUBNAM9= <"">
##$SW= 20.6930455092707
##$SWIBOX= (0..15)
0 0 3 0 0 0 0 0 0 0 0 0 0 0 0 0 
##$SW_h= 5175.983436853
##$TD= 65536
##$TD0= 1
##$TE= 296.16
##$TE2= 300
##$TE3= 300
##$TEG= 300
##$TL= (0..7)
0 120 120 120 120 120 120 120 
##$TP= (0..7)
150 150 150 150 150 150 150 150 
##$TP07= 0
##$TPNAME0= <>
##$TPNAME1= <>
##$TPNAME2= <>
##$TPNAME3= <>
##$TPNAME4= <>
##$TPNAME5= <>
##$TPNAME6= <>
##$TPNAME7= <>
##$TPOAL= (0..7)
0.5 0.5 0.5 0.5 0.5 0.5 0.5 0.5 
##$TPOFFS= (0..7)
0 0 0 0 0 0 0 0 
##$TUNHIN= 0
##$TUNHOUT= 0
##$TUNXOUT= 0
##$USERA1= <user>
##$USERA2= <user>
##$USERA3= <user>
##$USERA4= <user>
##$USERA5= <user>
##$V9= 5
##$VALIST= <valist>
##$VCLIST= <CCCCCCCCCCCCCCC>
##$VD= 0
##$VDLIST= <DDDDDDDDDDDDDDD>
##$VPLIST= <PPPPPPPPPPPPPPP>
##$VTLIST= <TTTTTTTTTTTTTTT>
##$WBST= 1024
##$WBSW= 4
##$XGAIN= (0..3)
0 0 0 0 
##$XL= 0
##$YL= 0
##$YMAX_a= 447203
##$YMIN_a= -546071
##$ZGOPTNS= <>
##$ZL1= 120
##$ZL2= 120
##$ZL3= 120
##$ZL4= 120
##$ABSF1= 16.44633
##$ABSF2= -4.246843
##$ABSG= 5
##$ABSL= 3
##$ALPHA= 0
##$AQORDER= 0
##$ASSFAC= 0
##$ASSFACI= 0
##$ASSFACX= 0
##$ASSWID= 0
##$AUNMP= <proc_1d>
##$AZFE= 0.1
##$AZFW= 0.1
##$BCFW= 0
##$BC_mod= 0
##$BYTORDP= 0
##$COROFFS= 0
##$CY= 12.5
##$DATMOD= 1
##$DC= 0
##$DFILT= <>
##$DTYPP= 0
##$F1P= 14.0000005364418
##$F2P= -0.99999901652339
##$FCOR= 0.5
##$FTSIZE= 32768
##$FT_mod= 6
##$GAMMA= 0
##$GB= 0
##$INTBC= 1
##$INTSCL= 1
##$ISEN= 128
##$LB= 0.3
##$LEV0= 0
##$LPBIN= 0
##$MAXI= 10000
##$MC2= 0
##$MEAN= 0
##$ME_mod= 0
##$MI= 0
##$NCOEF= 0
##$NC_proc= -2
##$NLEV= 6
##$NOISF1= 0
##$NOISF2= 0
##$NSP= 0
##$NTH_PI= 0
##$NZP= 0
##$OFFSET= 16.44633
##$PC= 1
##$PHC0= 172.1699
##$PHC1= 5.814516
##$PH_mod= 1
##$PKNL= yes
##$PPARMOD= 0
##$PSCAL= 4
##$PSIGN= 0
##$REVERSE= no
##$SF= 250.130018926675
##$SI= 32768
##$SIGF1= 0
##$SIGF2= 0
##$SINO= 400
##$SIOLD= 32768
##$SREGLST= <1H.CDCl3>
##$SSB= 0
##$STSI= 32768
##$STSR= 0
##$SW_p= 5175.98343685301
##$SYMM= 0
##$S_DEV= 0
##$TDeff= 65536
##$TDoff= 0
##$TI= <Analysis number 999999
Compound Code 99
Book Reference 9
Project Code 9>
##$TILT= no
##$TM1= 0
##$TM2= 0
##$TOPLEV= 0
##$USERP1= <user>
##$USERP2= <user>
##$USERP3= <user>
##$USERP4= <user>
##$USERP5= <user>
##$WDW= 1
##$XDIM= 32768
##$YMAX_p= 295975413
##$YMIN_p= -45969
$$ End of Bruker specific parameters
$$ ---------------------------------
##NTUPLES= NMR SPECTRUM
##VAR_NAME=  FREQUENCY,     SPECTRUM/REAL,   SPECTRUM/IMAG
##SYMBOL=    X,             R,               I
##VAR_TYPE=  INDEPENDENT,   DEPENDENT,       DEPENDENT
##VAR_FORM=  AFFN,          ASDF,            ASDF
##VAR_DIM=   32768,         32768,           32768
##UNITS=     HZ,            ARBITRARY UNITS, ARBITRARY UNITS
##FACTOR=    0.157963299565203, 1,           1
##FIRST=     4113.72061326484, 0,            0
##LAST=      -1062.26282358817, 0,           0
##MIN=       -1062.26282358817, -45969,      0
##MAX=       4113.72061326484, 295975413,    0
$$ Real data points
##PAGE= N=1
##DATA TABLE= (X++(R..R)), XYDATA
$$ [...]
24961 22830 14666 7441 -6205 -996 -3983 3331 568 -6091 -14421 -28682 -8104 9480 22754
24948 22754 20334 15798 14253 1940 8443 4230 12481 -742 -3821 7504 14702 17738 7820 3825
24934 3825 9667 19288 20347 10371 119 -4126 -6663 -16375 -13529 -4364 -12888 -14862 -12872 -7415
24920 -7415 -9820 -12007 -19785 -10297 6793 12413 6536 423 -10603 -9576 -4127 -8015 -11909 -7846
24906 -7846 -1496 -1989 2743 10317 21226 9375 5494 4661 2730 8262 8331 61 -1025 -3143 503
24891 503 -3221 -3312 3394 1555 5727 18888 20251 17250 10229 8815 8084 9422 4756 4233 -6590
24876 -6590 -10861 -4885 13 -2471 -1916 5100 11858 18878 25639 23004 15798 8918 10953 20053 19948
24861 19948 17938 16849 10516 5552 1869 255 2437 9420 5235 -3098 -13442 -14429 -10990 -1785
24847 -1785 6115 6527 -603 -8557 -2141 -904 -1114 10297 8772 5834 10455 3532 -3656 -4979 -6969
24832 -6969 528 -1914 -5476 -8692 -1859 5677 -2082 -1373 3953 12351 13364 3993 -6661 -14584 -15522
24817 -15522 -15936 -19385 164 15243 18350 13068 -329 1626 10675 19701 24091 11332 3805 5243
24803 5243 -177 -1681 10671 22734 20695 20672 21856 9915 4817 3318 424 -4105 -16080 -26999
24789 -26999 -29607 -19341 -17915 -12649 -15368 -15015 -15191 -11884 -3144 2183 -1459 -10375 -12340 -11490 -16329
24774 -16329 -16227 -15048 -7987 -1818 -2231 -6325 -3432 1035 3975 11543 13194 14144 14958 15851 11278 11658
24758 11658 16514 14438 3132 -2618 1459 12737 16724 19477 17453 16832 14780 5749 6602 2610
24744 2610 4378 -2802 6091 15959 17229 24304 24916 12984 11076 11805 19041 18873 14231 5595 12306
24729 12306 19032 8012 14993 18686 27982 31859 32237 36288 36018 27630 18209 14074 9426 9194 12772
24714 12772 -4275 6378 13201 38 -2668 10483 11721 8391 15579 7547 5394 13893 22465
24701 22465 18757 14891 -959 -3493 -1179 -4573 1151 657 236 6994 19053 5840 -7944 -5035
24687 -5035 -6244 -14214 -16765 -8604 869 3362 -3733 143 4508 10341 22499 25660 21962 23617
24673 23617 18943 7824 -85 -2592 -9432 -11763 -10967 -979 5330 4192 7927 8256 7702 11966 9143
24658 9143 6215 10636 10853 10308 7444 10171 3946 -1519 -2835 -3384 -21168 -22988 -8751 5536 7044
24643 7044 4600 16468 23666 9641 8806 9158 7088 19649 18736 14910 13190 3776 726 14970
24629 14970 20171 4328 -522 -3170 -11403 -19448 -20128 -22718 -18379 -11359 -13001 -12127 -7160 3914
24615 3914 -667 -9819 -5092 7211 11281 8716 5830 1179 -7380 839 15309 17889 7672 8467
24601 8467 15266 18818 17437 20887 14395 6739 -13835 -9310 -14255 1519 -3397 -30489 -30300 -14892
24587 -14892 -4263 -6801 768 -3816 -7283 3475 98 -4451 -9429 -795 -2078 397 11108 16436
24573 16436 9906 11948 506 -13761 -22980 -15853 -7725 1366 -9148 -8978 3216 4398 -1245 -6557
24559 -6557 -3360 -4476 1638 4513 -8212 -8809 -10468 -9852 -13098 -18244 -5369 -322 686 7178 10046
24544 10046 1089 -4256 -7012 -11440 -11575 7354 13036 2107 -5379 2871 17791 19270 9012 9276
24530 9276 12182 8980 9383 3327 -4380 -15671 -18087 -16836 -14553 -6671 536 13151 6146 9076
24516 9076 14448 8425 14792 13754 16651 17012 3890 -7699 -5255 -6191 -10661 -22841 -33816 -25406
24502 -25406 -34844 -38604 -28817 -20287 -11737 -5432 -10975 2070 2854 -12973 -16929 -8086 -14505 -17954
24488 -17954 -8472 -8904 3085 16028 14974 12048 5062 13442 3311 -2551 -4994 -2411 -7538 -14325
24474 -14325 -6479 6628 10720 17446 11778 5833 15021 11685 7161 1468 -3210 -1210 1671 8569
24460 8569 3214 -3207 -1651 7878 15621 8892 2825 6893 10269 6803 8158 -3023 -9881 -10022 -18375
24445 -18375 -32942 -30808 -14749 -1365 10711 8221 6630 679 1481 2051 4736 13055 7339 208
24431 208 4822 3901 -2168 -387 -8910 -17381 -18102 -4384 7501 11341 8400 8610 5383 2812 -6400
24416 -6400 -12140 -4857 11804 23033 17077 6914 -1817 3555 -2042 7454 5011 7009 12392 5307
24402 5307 -4966 -2749 4207 1699 3535 3571 11468 17584 14506 21615 21526 21652 17906 17916 21807 18671
24386 18671 15079 11835 14323 8000 -3588 -3188 -7316 -10722 -11227 -4113 -12587 -18103 -12085 -9472 -10127
24371 -10127 7758 27290 27895 11317 -3605 3938 11740 2374 6356 10027 11139 16210 7621 -9211
24357 -9211 -23316 -31876 -20641 717 8554 353 -7554 -6559 -7854 -4390 -1634 2531 -4583 -3721
24343 -3721 2027 -11367 -22517 -28345 -23756 -363 621 -424 3070 1738 -7457 -4755 -7227 -8673
24329 -8673 -9809 -9555 1745 -7085 -13195 -12083 -13329 -10737 -15342 -7301 -4672 -2723 -8325 -3418 -7033
24314 -7033 5612 8122 7270 15881 14949 6988 -12070 -23456 -19267 -13727 -9771 -10864 2002 -3195
24300 -3195 -12557 -3625 -10246 -13200 -22364 -28090 -19540 -9007 -12372 -4026 1178 7916 1037 8457
24286 8457 5569 2227 11209 15367 14452 10386 18835 11239 -2163 -10786 -18084 -28005 -28947 -30816 -28520
24271 -28520 -16311 -4694 -15080 -20861 -20445 -22434 -27079 -30475 -22639 -19016 -12369 -16078 -21095 -17928
24257 -17928 -16291 -5308 -10593 -12593 -18929 -17368 -9253 3612 2169 -3462 2170 4360 2021 -11949
24243 -11949 -3092 289 -6203 -9720 -8735 -2563 3319 7526 11929 1835 -10084 -19062 -9584 -7185
24229 -7185 -3697 -18430 -15798 -26593 -20200 -9552 -18936 -15552 -10318 -11438 -5951 -260 6909 7042
24215 7042 3181 302 12529 20406 15234 3416 1841 7203 8190 11555 290 -14264 -22297 -27835
24201 -27835 -14124 -12210 -15536 -3774 7981 8039 8766 -1854 1285 3956 2389 2074 5715 -3884
24187 -3884 -8315 -9223 -13785 -19934 -12333 -8951 -11034 -13256 -4628 -2916 -3325 -6249 1656 8179 8663
24172 8663 3995 5250 6168 5364 3168 11929 22595 12875 11081 16548 22592 23370 21173 9734 -355
24157 -355 -3103 -9468 -13812 136 13553 27370 27695 17733 10879 3253 962 -813 8451 7735 3900
24142 3900 627 -1520 9620 12053 15147 17233 20703 16657 13621 5709 -10581 -5229 -1990 -3793
24128 -3793 -5585 5830 9540 10336 5775 -434 -2633 1490 238 -2313 2933 2756 -5950 1627 12992
24113 12992 5654 -8705 -20221 -7874 5766 12493 12559 3213 10037 8892 7859 5126 12039 10239
24099 10239 8980 8196 5331 1658 -11702 -21389 -14645 -6057 -1608 5046 -6761 -10293 -795 -8753
24085 -8753 -2449 -10075 -15461 -16934 -3756 -3095 -6056 -13258 -11242 -11618 -13675 -11376 -6252 -178 506
24070 506 -5820 3659 9387 12701 11994 7652 3637 11052 14659 18634 34437 28410 18698 12361 4253
24055 4253 8734 16882 14180 11039 17874 6016 16062 18336 19979 27876 13150 5079 2146 2959
24041 2959 -3439 -3935 2248 4711 5087 5318 4760 -847 -3346 -11616 -11589 -3370 -15370 -7091 1820 1716
24025 1716 3841 8495 12160 11898 7725 18286 21402 13440 5890 -10070 -1880 11363 13286 4976
24011 4976 -2435 -1455 -4943 -7254 2071 8693 2232 -614 -8718 -12679 -1985 8473 6309 4018
23997 4018 -5159 -5338 881 -4826 1309 8355 4222 1060 1636 6620 355 -8059 1734 -648 -5827
23982 -5827 -4478 -1586 1652 5112 244 1479 13725 15748 10073 -35 -3151 -3439 -641 -10101
23968 -10101 -7389 -5293 -10250 -6470 -2528 -4050 -3067 2464 14523 21900 19336 19731 18049 10305 1615
23953 1615 6736 24257 16355 2702 4 552 4724 5825 8378 5724 13616 19194 19612 5210
23939 5210 -8893 -7003 -1837 -9924 -18959 -10542 938 5322 9309 5047 2342 3068 219 8138
23925 8138 7136 18301 11965 9839 7732 3169 -3849 -8651 -2554 -1367 -8656 -12167 -5179 2803
23911 2803 3346 -11135 -18480 -16723 -27052 -27469 -16433 -8734 -2979 1314 -3219 -3681 6340 7760
23897 7760 7642 3251 -2982 -3582 -3608 -2059 4754 5457 19239 29706 26234 15222 -7003 -20992 -10022
23882 -10022 283 -4465 -6856 -27395 -28569 -14780 -776 8178 1839 4441 11020 9881 18665
23869 18665 24245 13610 8956 16534 18267 10749 4653 -1111 -17394 -13509 -798 -4248 -11041 -6007
23855 -6007 -3464 1622 7373 11066 7919 3299 -3891 5974 5125 631 -3299 -2132 -2268 -1337 2399
23840 2399 6001 11500 15846 2094 -15676 -18361 -17560 -9068 -4669 -17769 -5402 5822 -6191
23827 -6191 -6794 -5639 -5998 1366 2670 -15040 -21199 -4559 -988 2847 8709 -3418 948 -3981
23813 -3981 2475 4877 4152 -10602 -15484 -21942 -24612 -27633 -20687 -8465 -6040 -4352 -6565 -16784
23799 -16784 -23775 -24608 -16194 -20835 -25737 -35505 -32729 -21477 -10925 7870 7513 -1591 -3897 3478
23785 3478 -2454 -7491 -10103 1535 537 -3272 -734 -7877 -3354 -9549 -9533 -9745 -6472 -4093 -2449
23770 -2449 -17820 -24166 -9347 -5513 -4762 -12779 -10223 -9468 -5717 803 -1653 1963 2580 8269 17440
23755 17440 17399 7378 13557 7823 -702 -378 -5305 -3533 -7605 -4269 1969 -2701 -11169 -14060 -19580
23740 -19580 -9572 -3585 8969 3228 -4 -695 -2311 5518 8648 12825 10737 8086 15855 13063
23726 13063 4402 4731 4728 13361 9024 3644 -42 -15456 -22193 -21734 -2152 11483 4322 -11639 -9425
23711 -9425 -5267 -1306 1795 4325 9453 8077 2895 1331 -1039 7778 -5635 -19120 -8062 -8577
23697 -8577 -9601 -7024 -9267 -416 6953 9527 11060 7144 9403 12685 12450 8132 1063 2301 -3078
23682 -3078 -18725 -19182 -12358 4424 3640 -1724 -59 3943 -2898 -10530 -5000 7172 9288 16695
23668 16695 5107 1784 5470 1111 -3204 -6981 -11095 7130 13760 3522 16618 15710 -1835
23655 -1835 -4461 -17607 -23588 -20053 -19277 -18307 -22607 -8042 -7340 -4674 7346 8215 12431 -1125 -17685
23640 -17685 -29311 -19907 -4562 1495 -3356 8191 11515 6366 8117 -5077 -9103 -3939 -2514
23627 -2514 -3391 123 -250 -16211 -20458 -19921 -17950 -15782 -10365 -1297 2198 -5000 -12218 -16206 -12945
23612 -12945 -8576 -6306 -7377 -7123 -8752 -14686 -16073 -12700 -866 7511 12225 2995 -5985 -11072
23598 -11072 -11559 -14344 -7261 7100 7891 12307 12024 16676 18989 11341 -5791 -2655 4415 -1561 -8085
23583 -8085 -13350 -15982 -7792 290 8616 13522 14013 7747 797 -176 5748 -10719 -7291 3919 7536
23568 7536 -1705 -5832 5549 3226 -6257 5424 8104 -3329 -6003 -14087 -19282 -4939 -1479 -18026
23554 -18026 -17326 -3110 1844 -3183 -3967 -14428 -18061 -27446 -32637 -31773 -25660 -7034 2259 3646
23540 3646 4278 4877 -1711 -5761 -6955 -13499 -22197 -27027 -30987 -24600 -24885 -26618 -24064 -20801 -14962
23525 -14962 -2110 -3424 -341 -2619 -3433 -12403 -31717 -44727 -34086 -16678 -13045 -18920 -15535
23512 -15535 -20846 -18455 -5854 -1451 2633 -657 -7184 4269 -914 541 -942 3587 4096 8792
23498 8792 8250 10100 6507 1148 2619 2188 4705 4168 -2555 -8050 -4939 -13087 -18679 -11126 -6730
23483 -6730 -9317 -5732 -10131 -15886 -13309 -25420 -21447 -9513 -11474 -13679 -12747 756 1474 3575
23469 3575 3053 5897 10616 15646 17702 13183 14802 14010 8228 -99 -5542 -4085 -5359 -4557 -16418
23454 -16418 -20115 -21160 -11300 -11177 -7691 -1061 4000 -5108 -11082 -2955 3431 6319 8502 9774 12453
23439 12453 7607 5229 9010 6796 5783 -866 -7811 -16832 -13753 -13463 -17782 -23281 -10169 4147
23425 4147 3137 6930 25332 31605 19473 12047 17624 20763 22398 9985 12694 8575 1098 -4298
23411 -4298 -4038 -6774 -2510 -141 5077 3173 -300 5107 -6159 -21594 -30078 -24478 -17510 -4095
23397 -4095 -1760 10230 14264 20167 11878 -549 -5376 -6243 -5698 -3968 -11517 -7536 -10 12468
23383 12468 10292 -12825 -19276 -18801 -1344 6100 3479 711 -9986 -12438 -3717 2959 10354 14355
23369 14355 3918 -8113 -24646 -36446 -35633 -22133 -18224 -7874 -4871 2684 -2167 -8449 -15967
23356 -15967 -16392 -14017 -5501 1778 2256 6633 6668 -3522 -16344 -18026 -4180 -112 3471 2661 11325
23341 11325 18085 30211 28545 15432 5229 -371 -6450 -8910 -7983 -9227 -6247 -4743 -4899 -1883
23327 -1883 -3174 -3844 -6907 -7205 -3230 -7047 -2422 -6624 -6694 -8637 2302 10218 655 -8506 -17044
23312 -17044 -15371 -6963 -18030 -25250 -17502 -15223 -10883 -12153 -10954 -2403 4502 -6096 -12425 -23438
23298 -23438 -21585 -11722 -12938 -13631 -3798 -6394 -8367 -17301 -18318 -16112 -1297 1524 -7333 -10825
23284 -10825 -23233 -16268 -9782 -6085 -8722 -11560 -3500 1163 -7022 -13491 -12943 -14487 -15291 -6096 -1484
23269 -1484 -2467 -14074 -11997 -11711 -4329 -6526 -8305 -8802 -8445 -4181 -14606 -23799 -28629 -29394 -31087
23254 -31087 -21408 -14533 -12888 -2387 212 -13108 -26533 -13376 -5662 -544 9417 13822 15264
23241 15264 3306 2427 3438 6328 13196 3056 -18145 -14213 -11246 12691 25150 16648 16324 11605
23227 11605 11100 10340 2392 1656 3542 569 -2316 1184 5071 13067 14284 12471 11002 11425 10726 11465
23211 11465 21 6140 9335 3583 -4698 -8247 -189 7969 6945 -3093 -11513 -19332 -20566 -1562
23197 -1562 -5627 -17243 -20282 -19729 -23850 -23714 -20526 -14029 -6803 -11327 -5175 11274 3453 -5758 -11510
23182 -11510 1948 5798 -6302 -19682 -20240 -4514 6236 1513 384 -349 3870 8241 13356 18018
23168 18018 8284 5530 20557 12532 -3163 1551 8465 4189 -4366 -16444 -21192 -12211 -5103 -10422
23154 -10422 -9790 -2499 -7670 -11231 4817 6678 -989 -10693 -15731 -23533 -15641 2550 6845 5591
23140 5591 12387 8370 -32 80 -9276 -9868 -670 6480 6150 15800 20003 15221 6898 9788 13711
23125 13711 8843 -4874 380 10291 11580 13044 5778 -4188 -5424 -1267 2260 9938 4391 3563
23111 3563 8009 8247 -3396 -6653 -2124 -7594 -1827 -5299 -3560 -12377 -11275 -12322 -13621 -10869 -13811
23096 -13811 -15951 -13419 1069 10310 4356 -3865 -13999 -13258 -19690 -16338 -15282 -4296 -14082 -21214
23082 -21214 -13805 -10435 -6195 -2647 -11608 -12787 -13548 3441 13531 13965 7669 7895 11104 8765 2468
23067 2468 2047 -7241 2162 4277 551 -1830 4964 7525 3189 1587 10652 11457 -1366 -3966 3219
23052 3219 -1115 570 3016 898 4969 729 -2061 -7000 -3571 -4493 -3104 -5206 -3943 1078 -12774
23037 -12774 -11824 -5568 -2644 -3234 -11649 -17532 -3323 19294 20157 4956 -11164 -15869 -5865 775
23023 775 -3410 -4153 -7733 -4671 -5798 1633 1483 -13732 -17132 -8063 -2074 -292 -16116 -16551 -15457
23008 -15457 -9989 -5531 -1082 -6379 4273 8412 -2339 -1259 -328 -5904 -13225 -5434 334 3397
22994 3397 1759 -7333 -8337 -1706 -1829 6 -3566 466 5629 3094 5173 26417 29559 26916 10798
22979 10798 -12301 -11951 -16558 -17829 94 11259 21084 25617 32811 15509 -3738 -8451 -8386 -7526
22965 -7526 -10938 -11835 4786 13759 3340 -4140 -6454 -3789 -12252 -17040 -7021 -6064 -5339 1726 -2481
22950 -2481 -10789 -7727 2527 5825 -7949 -8355 -10463 -10546 -7217 -168 123 5 -3208 -3396 -3785 -4237
22934 -4237 -9706 -12913 -11115 -12665 -9130 -4436 2433 -561 10817 3929 6665 11367 6495 8099
22920 8099 8830 14171 12686 13211 11118 7720 -39 -3238 -303 3921 6339 -3807 3028 8869 5988
22905 5988 -2608 -1518 -204 1057 -212 7014 5590 8192 13810 1416 -7961 -14295 -14226 -15489 -18065
22890 -18065 -12868 -11541 -13717 -10928 -10955 -5639 237 -2397 -11029 -12015 -8807 -9698 -11302 -4600 4967
22875 4967 2991 929 -3016 -5321 -5322 566 11072 16106 13914 3685 -2705 7141 7620 191 -3253
22860 -3253 -2783 -6825 -8459 -7233 5200 4703 5840 10238 4825 7465 5710 6971 3929 -8560 -19143
22845 -19143 -8429 3210 -9233 -15733 -7930 7888 13674 5316 -7722 -18571 -25530 -24464 -16075
22832 -16075 -14016 -13941 -7769 -3068 -10685 -23113 -23586 1159 -2198 6457 22137 15064 8036 6687
22818 6687 -3811 3046 3676 3837 5548 7131 3395 -7409 2956 13029 21448 27919 23075 19728
22804 19728 11601 10044 6805 4808 -1239 -7119 -6772 3633 -862 -1880 -8199 -13912 -17017 -17071 -18166
22789 -18166 -10146 -15946 -39987 -32468 -26684 -28071 -21067 2 1058 1242 9471 7557 -3946 -15266
22775 -15266 -13794 -9501 -10822 -10659 -14379 -17730 -9148 -1606 -2927 -7599 -10988 3187 8785 6749
22761 6749 3715 5017 1547 3767 1306 -2658 -5167 -2823 -7896 -8877 -8072 -6723 4974 7922 -2839
22746 -2839 14232 17612 915 -13297 -13513 -15590 -14029 -2967 15369 12993 -840 -1399 9715
22733 9715 1590 -9655 -17899 -13946 -7411 -6442 -4876 2028 5251 1678 -7635 -4705 4838 13337 10859
22718 10859 11866 7523 10868 14993 10567 3314 6455 2100 3572 5883 15103 15008 9906 9170 -4717
22703 -4717 -10162 -6084 -11328 -12157 -12508 -4853 683 4385 7559 1961 -4616 1041 5804 6876 -1269
22688 -1269 -3898 3541 14414 5953 -8597 -5064 -3412 -1325 -1111 -4952 -10668 -11172 -23629 -17529
22674 -17529 -5181 7788 3189 -2905 -5691 -4290 -4611 4610 2478 -4441 -8441 -11544 -6517 -11879
22660 -11879 -15188 -19392 -18525 -13837 -18661 -20699 -23601 -21575 -12415 -2749 11937 14963 12841 13410 22144
22645 22144 35654 22863 6973 6225 -10765 -24281 -27368 -20831 -16640 -19424 -14838 -665 2800
22632 2800 4247 11362 12191 17877 21516 22060 19634 16183 3165 -9680 -18348 -24505 -24549 -36779 -28589
22617 -28589 -10423 -7867 -6758 -14916 -20685 -16590 -20878 -28178 -29287 -6012 13077 16833 9150 2762
22603 2762 2 4621 3553 9641 10708 3235 8825 14984 11094 1772 180 5598 11689 7168 -3194
22588 -3194 -4237 -1462 -3547 2441 2723 -1529 -13100 -21246 -18727 -16750 234 -4012 -11213 -16262
22574 -16262 -15211 -4673 4543 -661 -12710 -16945 -16295 -11975 -404 17469 12147 4685 -2336 -8303
22560 -8303 -10744 -10546 -8699 4439 10037 10096 9351 7188 -147 1131 1385 -1082 -6504 1456 7372 11115
22544 11115 17476 14196 17458 24795 14275 6118 10263 17974 26645 12015 1597 4564 6456 -2323
22530 -2323 -20171 -15532 -6723 -6722 -5704 -1002 89 369 -1297 1560 7235 11311 11880 6582 -115 3132
22514 3132 846 -6083 -3307 5577 1134 8817 2868 2567 7329 -1920 2042 4588 9610 -524 -9236
22499 -9236 -12 -15653 -16690 -1154 -5586 -6893 -861 832 -4654 -6310 -15328 -9792 -5623 -6819
22485 -6819 5906 8421 914 2149 -3997 -15269 -19980 -8610 1874 3113 1786 1850 -10092 -13429
22471 -13429 -5082 -3736 -2625 -564 438 -4039 -8525 -8662 -11331 -3590 -1040 -1610 -8560 -5412 5600
22456 5600 966 -877 2301 -1132 -1490 3742 7907 16497 32000 18506 5696 -1657 -4853 -11092
22442 -11092 -12275 -14463 -24294 -21877 -23545 -22335 -11643 -11784 -7894 -12019 -19358 -11952 6994 17126
22428 17126 10030 -1021 -3136 -9345 -11534 -3683 4598 6496 4019 1451 -1796 -1372 -5283 -6730
22414 -6730 -14022 -24367 -20945 -10450 -1927 -7109 -11711 -10313 -9451 -2698 -5436 -1999 -13777 -5265
22400 -5265 6195 9290 13582 6438 5708 -4362 -1613 -4249 -135 -18 9771 5058 -2357 5319 7414
22385 7414 18190 7348 4615 7529 3247 6722 13978 10119 5331 10443 10721 -4931 -7951 -711
22371 -711 8464 14056 -1021 -9943 -16687 -21169 -24514 -8407 -15060 -24156 -18289 -13322 -4203 -4473 -6006
22356 -6006 -687 9246 10087 6122 1872 -5068 -9716 -13031 -10980 -6902 -12130 -4124 1461 8086 8248
22341 8248 11417 7687 5802 1203 -7578 -1383 -470 -5549 -8847 -8859 -12036 3461 5208 -831 -5756
22326 -5756 -12134 -13305 -12006 -7332 -4690 -898 -4142 2027 -3854 -9917 -19960 -27308 -3819 11587
22312 11587 24289 12045 4258 6131 7871 -9280 -11235 11522 14942 -3249 -5517 -13793 -16591
22299 -16591 -17532 -11799 -14882 -6124 -5083 -9856 1304 5981 -1924 3123 4877 13537 25478 23152
22285 23152 23435 17102 11611 5664 11662 18142 5734 3012 2164 2723 5632 -4405 -4787 -5264 -3250
22270 -3250 -12672 -20009 -19928 -23476 -14115 -12767 -10051 -2290 4999 7414 2055 2787 -3141 -10309 -22615
22255 -22615 -23917 -17043 -1114 -2843 -15539 -23463 -10511 -3233 -5254 -16607 -16063 -5847 5292
22242 5292 -3073 -4465 9252 3406 -3840 5330 14767 1936 -2448 1901 4943 17044 21577 15295
22228 15295 -1621 -6397 -6303 -4204 -15908 -20082 -13314 -8388 -5340 9458 13216 13088 8439 -7820
22214 -7820 -15751 -10445 -2543 -108 3463 3890 -414 -992 -3769 2140 4207 -3279 -3675 576 -5764
22199 -5764 -8841 -4903 -1406 -18829 -21007 -6687 2545 3787 4426 3328 16635 11693 12380 -1047
22185 -1047 2584 10418 13327 1157 -706 11241 5040 626 -14 7115 9667 4157 2866 -3994
22171 -3994 -2819 5998 13666 13907 -5254 -19098 -11244 -551 9684 4569 -14639 -11250 9573
22158 9573 2943 -6026 -16822 -24391 -16341 -13369 -19021 -24300 -25746 -18412 -8373 -3551 -4925 -20118
22144 -20118 -10905 -10690 -14122 -11964 -7142 -15128 -21641 -15319 -9721 -7687 -1788 5646 58 -8194 -14962
22129 -14962 -21125 -15672 -23410 -27167 -21281 -23074 -24446 -14115 -657 -1068 -1146 -688 -3813 1089 -7506
22114 -7506 -13749 -29084 -31731 -28732 -25798 -15572 -7544 -2184 -9855 -19259 -19489 -21272 -14809 -11476
22100 -11476 -23120 -24165 -16643 -11295 -13681 -5952 -1513 401 -5650 -7525 4386 8804 5344 -3351
22086 -3351 -5395 -3780 2139 -8989 -16819 -12213 -16893 -22130 -21960 -22467 -22382 -10258 -4563 -7463 -20517
22071 -20517 -13606 -10255 -12643 552 16179 7303 3591 9855 419 -804 6845 12902 5341 6961
22057 6961 7069 6500 1228 -6068 5907 10423 1799 -8749 -16129 -30378 -22253 -17580 -11250 1900
22043 1900 9496 14941 1527 353 5984 -6198 -13869 -23245 -22614 -6779 2102 729 -107 5654
22029 5654 13880 8608 3058 -1686 -7357 -4993 -7556 -11595 -5576 -1731 3093 16981 14523 -1494
22015 -1494 -4732 7873 3546 8560 10969 10131 3293 -3095 -7753 -18255 -10826 -2387 -10340 -7771
22001 -7771 -8246 -10925 -15247 -16992 -11473 -11538 -3443 745 -8436 525 -4096 -9500 -11313 -10096 11338
21986 11338 11479 18496 27631 18383 -2998 -6484 -7313 -4966 -5415 -1383 3431 232 1238 -1263 -3660
21971 -3660 -14906 -20137 -24303 -11830 138 -6742 -20627 -21438 -17090 3169 11891 2884 -1470 -13982
21957 -13982 -24200 -14455 392 4925 1021 -1853 6155 -171 -6417 -1615 -6323 -25736 -18252 -19612
21943 -19612 -24490 -17137 -8176 -4793 -2659 -7707 -11526 -18455 -13300 -17051 -14822 -3674 3670 7563
21929 7563 -1167 -8528 -4383 -2906 -6032 -9358 -10550 -4758 -5805 -11325 -6900 -2215 -9509 -19261 -11675
21914 -11675 10552 21104 16699 -1416 -1884 1652 -5828 -12076 -17902 -17151 -881 16761 1377
21901 1377 -14053 -4757 4682 -115 8669 7121 5503 2311 -2556 4547 -1578 -4553 -16386 -15136
21887 -15136 -18034 -10999 -16588 -14681 -8549 -920 -2238 278 13143 21340 13961 4848 73 -6948
21873 -6948 -6231 -4791 -1118 3279 1140 247 -8119 -15420 -20388 -15174 -9865 498 894 -8192 -19697
21858 -19697 -7124 886 3331 -6172 -19189 -15409 -2611 1600 8624 7558 6086 -36 1832 6833
21844 6833 12914 10344 14845 12208 15704 9238 -11598 -8503 -9863 -21643 -25482 -13022 -6129 -10253
21830 -10253 -3110 -1950 -1645 3664 14314 14748 6025 6922 4592 105 10354 21691 22794 25919
21816 25919 17911 5364 -4576 2694 -7679 -13920 -7541 -7011 3647 8239 -2184 3634 529 -6933
21802 -6933 -4743 -4591 -13977 -10264 -11753 -6715 -15542 -19663 -18566 -18837 -27820 -25853 -18046 -6677 8319
21787 8319 12850 2150 9515 16416 16904 18334 8063 8375 13445 11042 9897 9800 13126 4332 685
21772 685 -1452 3009 3796 -847 -2133 13656 9478 -5843 -13065 -22126 -23581 -7722 -4178 3410
21758 3410 2098 380 3641 2278 -2341 2635 5190 3907 4834 2940 -3569 -1955 3930 -1693 -11810
21743 -11810 -22428 -16927 -4899 -4061 -5910 -3545 -1725 4279 2382 1605 9830 -5356 -19558 -15946
21729 -15946 -5594 1745 4787 2757 4856 9246 947 -13402 -3943 5739 -292 11850 5981 -2927
21715 -2927 -16229 -14232 -22337 -27836 -5019 11997 11582 10582 10938 2750 2571 3663 -312 -8733 -12477
21700 -12477 -12113 -17055 -18854 -21178 -15562 -6277 -6004 -11672 -12630 -15444 -20274 -3497 7015 1735 -5308
21685 -5308 -2493 -18 4540 10012 -3107 -17886 -10936 -3943 -21581 -35665 -29423 -27197 -10509
21672 -10509 -4148 -11811 -16496 -18842 -14050 -8440 -8577 -7606 -867 -762 -1660 5959 3754 13065 13498 -3149
21656 -3149 -7447 2390 11181 -2312 -5296 9833 13648 8528 -469 5790 -1038 1957 2376 3674
21642 3674 833 -4931 -13521 -12304 -6054 -5504 525 -2992 -3737 -5037 123 -5140 -18722 -14485 2048
21627 2048 5849 3458 -4566 -312 -4394 -5027 -4552 -1559 -5287 -8944 -3971 920 88 1200 4247
21612 4247 -718 -2569 -5026 -15225 -21763 -12359 3819 703 -879 4671 4884 4878 -292 -434 4678
21597 4678 3004 -4878 -15688 -27124 -18689 -5442 6203 12564 13712 -368 -19629 -21687 -9383
21584 -9383 1330 7191 3666 -308 3179 -4231 -13874 -11145 -4918 -10232 -7226 -9704 -5516 -7834
21570 -7834 3551 18985 16701 -4337 2029 14581 25919 27173 18152 18316 18694 3819 12847 5426
21556 5426 -7261 -9592 -18724 -9572 -10774 -18029 1866 4878 -3851 2626 8768 -682 -7372 -10512
21542 -10512 4729 -1214 -5095 -8523 -17184 -14203 -8601 -1501 -10052 -8133 -10029 7160 20554 10430
21528 10430 9340 9316 -3269 1308 3370 -10306 -17761 -15770 -10750 -3783 -972 8977 3344 -11459
21514 -11459 -15078 -3718 -5406 -7648 1336 3949 136 -5857 -19270 -22742 -19119 -21646 -13606 -11284
21500 -11284 -13033 -8638 -12269 -11955 -24272 -22240 -11025 -15501 -26237 -28399 -16287 -6492 8245
21487 8245 15713 23150 25977 19126 12187 18060 19384 20757 24697 8435 6897 7224 14979 26235
21473 26235 19555 26549 31318 33981 29607 13923 6253 4314 13208 17299 17254 -109 -16312 -11631
21459 -11631 -8522 -4630 398 4868 11026 10826 721 1097 16416 13933 -1784 -4081 -6957 -13956
21445 -13956 -15946 -14947 -14424 -5745 -767 7747 16700 7818 -7849 -10114 -2828 -3582 -461 4564 -2441
21430 -2441 -5600 -501 -6548 -4549 -3745 -2349 -5068 -9101 -11807 -7283 1841 4370 6059 11350 23688
21415 23688 18352 13873 2057 -6231 -447 -3445 2879 9479 10897 21208 27638 22168 13754 15109
21401 15109 20440 20573 14061 133 -974 6990 3859 -1326 -8770 -16077 -13303 -10164 -9414 -16601 -7191
21386 -7191 -868 9925 15038 12840 9441 -2460 -2755 -1879 -5363 -7093 2200 3789 309 -451 4961
21371 4961 14374 10436 3469 15773 21773 19622 12211 8283 2940 7050 7399 -5923 -9672 -6220
21357 -6220 -9062 139 -2324 -7748 -847 -654 -4680 -10781 -4317 -9793 -11778 -6634 -1163 -1485 -2590
21342 -2590 -13949 -13127 6585 6318 4290 -2752 2362 -4288 -203 4030 -5987 -3974 -11743 -15031
21328 -15031 -1425 26097 31150 14016 -670 -5435 -4682 2137 10893 7632 17811 19378 26671
21315 26671 18171 15415 4523 -3685 513 -628 -8728 -13818 -6927 9514 8613 3836 2821 3718
21301 3718 -3722 26 7433 4760 9722 15720 6766 -3746 -7573 -4382 -9843 -12619 -3245 -832
21287 -832 1938 2559 -1266 -1845 3939 14181 13367 15865 11164 3384 8102 6950 4344 4746 5997 -8680
21271 -8680 -20119 -19075 -10893 -3501 1057 1439 225 -9898 -11145 -11632 -588 8402 5884 -4667
21257 -4667 -6873 -495 4620 5704 1908 -766 -2205 -10507 -17195 -6978 -2775 7297 1606 -5003
21243 -5003 -3109 1883 3025 591 4629 8509 14666 9236 6699 7645 121 -4508 -18146 -19849 -26316
21228 -26316 -13351 -4028 -2941 554 -8078 -13752 -4136 -5166 -6656 -7781 -3273 -973 3445 -4881
21214 -4881 -12485 -17159 -15785 -5325 -3507 2029 535 13 2053 -12649 -14456 -6538 -6239 -1621 3726
21199 3726 2978 -13274 -29654 -27827 -25688 -16638 -13786 -6119 -3765 -5980 -12013 -21324 -25651 -14730
21185 -14730 -10457 -13151 -13340 -2354 267 4656 4131 2379 3272 -835 -12152 -15387 -17007 -19324 -12546
21170 -12546 -8446 -4562 -1916 -6779 -7915 -4250 -10954 3978 3901 8247 11822 11191 9125 6725 8454
21155 8454 14824 21355 20149 18077 9382 569 -1040 3904 843 3461 -342 -5612 -9477 1484
21141 1484 7406 4448 12765 10162 -310 -14952 -5467 6331 4083 1177 14581 9865 180 -7709
21127 -7709 1983 -45 10257 11682 -3204 -6471 -976 2792 -5896 -117 6373 -937 -2552 -2409
21113 -2409 6064 5967 -5461 -3075 3314 12561 11295 6346 2863 8993 24418 20083 3943 -2910
21099 -2910 3845 7264 2074 -9325 -5205 -2039 -5321 -5995 -10816 -11762 -10004 -6794 5850 5789 6713
21084 6713 722 9624 18933 11144 1846 -1155 5750 4379 183 -9469 -18983 -14240 -7729 -6038 -6942
21069 -6942 -9501 3499 5692 2083 4576 4221 -3485 -3548 -12728 -30955 -22810 -8602 1017 8189 16934
21054 16934 11621 -5109 2422 10419 13751 17818 17714 20403 11923 2875 4208 -7614 -6877 3384
21040 3384 -10183 -26256 -16233 -6570 699 -3059 -7367 -10526 -9029 -6176 -11340 -12502 1364 1048
21026 1048 -6706 -15383 -4762 2595 2438 5364 5248 -2066 -6328 6387 10205 9525 14728 18210 10860
21011 10860 5390 14226 26226 20002 9698 1063 5832 4025 -6473 -11454 -23132 -17129 -5896
20998 -5896 536 -2656 1452 1351 -6424 409 4354 11594 8005 -4629 -9785 1221 12939 10550
20984 10550 1490 977 -4635 10460 3133 -12830 -10809 4237 9331 2870 9699 6410 56 -3051
20970 -3051 -12631 -20600 -16242 -13858 -8826 2469 4674 2284 2859 -7273 -16789 -18091 -14386 -18682
20956 -18682 -21413 -13694 -10326 -3976 -14046 -23884 -20077 -5231 -10173 -21239 -20928 -19942 -10624 142
20942 142 10496 12136 1685 -5458 -6099 -6682 10785 5463 -166 4724 18748 9568 1293 -301
20928 -301 463 4953 10025 2070 -4894 392 494 -10311 -12747 -11372 -22636 -21017 -15720 -18312 -13583
20913 -13583 -2871 1799 -1276 -10530 -14818 -15903 -14070 -24771 -34078 -25428 -16720 3626 6577 -5737
20899 -5737 -9729 -1256 3001 -5160 -6863 -7000 -13297 -9860 2558 12927 10744 13125 12297 9852 8367
20884 8367 5616 5650 7767 1223 10310 20843 17257 7952 7825 -6139 -4062 6090 11785 11106 7960
20869 7960 10403 17397 13529 11272 17757 22460 18121 19992 19970 9648 -552 -7925 -9937 -11226 -14557
20854 -14557 -10292 13671 20860 10985 4713 -1148 8633 8480 11499 15068 16106 19582 16436 7329
20840 7329 17039 17997 10820 6129 -2556 915 17480 19842 8158 7129 20621 20728 20983 4197
20826 4197 -5633 -10059 -11109 -5413 -137 4449 -5565 -13988 -13296 -16941 -18963 -20209 -16523 -1120
20812 -1120 -655 -1233 6930 -4006 -14711 -15912 -10597 -15364 -5506 -4393 -6775 8183 2065 -15131
20798 -15131 -21558 -15993 -20190 -30632 -17495 -16251 -16558 -16698 -13711 -1882 8972 11148 6439 -4101
20784 -4101 -8228 -15606 -6567 -1384 -10666 -13316 -489 9515 13045 12432 15474 17437 16473 13957 18864
20769 18864 24150 18847 8409 -3742 -13301 -8469 1887 3076 5017 1951 -2840 11507 12479 12561
20755 12561 19763 26210 23694 15014 18178 21337 20229 6614 -554 2849 845 -3112 6608 16409
20741 16409 17135 16729 12383 6051 4839 2320 7793 3007 12087 24420 9310 9676 7256 14821 27595
20726 27595 27778 13509 111 -703 7173 5483 7427 6125 1954 -5932 -12807 -15183 -8131 -15642
20712 -15642 -15728 -9466 -7723 -7959 1961 1812 631 6358 14978 15420 7181 1164 8429 3770 1060 3301
20696 3301 9637 -3200 -11344 -13593 -1880 12245 25022 27053 17264 14126 9825 13453 18409 10593
20682 10593 9830 17280 22795 25067 16010 10964 7691 19007 13644 5541 10498 -4313 -11526 -4901
20668 -4901 10125 27076 22655 14025 4497 10485 29082 36223 27800 27530 15461 8601 18062 31540
20654 31540 26373 5440 19 -3851 3544 7776 3016 -11816 -17582 -18175 -16302 -15369 -7264 -2421
20640 -2421 3285 18641 21567 9764 423 68 10015 12668 19345 28321 5799 -7639 -7865 -5919
20626 -5919 -1226 7155 4235 -4442 4406 13110 18384 19580 13500 10013 11003 4085 4931 3657 11396
20611 11396 15388 5726 -240 4369 15238 16909 17200 27372 28610 21531 20900 7909 4247 7952
20597 7952 15884 20360 17858 12219 18724 24051 27201 23981 22878 25416 29490 32877 30184 30531 24660
20582 24660 19599 13380 -5223 -3871 11920 7856 8881 7195 -3112 -5003 -865 6637 10322 14518
20568 14518 17074 19846 16172 11876 8029 -5217 -14664 -6186 10603 20537 8730 12793 19084 29282
20554 29282 21983 18171 12869 20048 26892 18377 18006 12363 19037 27795 34436 23563 20946 11511
20540 11511 -985 5786 7615 -235 12026 6261 5801 9182 10609 11720 9462 8161 4319 2513
20526 2513 -3721 7867 21030 27837 38113 30608 31900 35356 28183 22136 28360 39373 38616 40185
20512 40185 40299 33332 25672 28344 31817 31978 33782 29823 31821 41736 47435 56690 69702 81586
20498 81586 80179 81192 85343 97537 116076 140029 160222 165096 177234 200609 214609 220017 233269
20485 233269 243944 251014 254602 270545 282910 290828 291938 295536 273538 267183 264366 259906 254993
20472 254993 252933 242272 231556 228925 213462 193057 184833 182986 175968 157184 143383 133775 131066
20459 131066 110867 105117 104162 86479 67687 59620 46971 41949 50037 52054 49792 42124 44588
20446 44588 42191 34983 33540 49834 73375 82560 76763 60862 53731 56201 51180 39407 29572
20433 29572 32142 37380 42617 49701 41960 40241 41418 38867 32030 35017 31977 31987 38858 36847 42721
20418 42721 46926 35240 17388 12183 24632 30687 30838 19547 14304 11544 16512 18870 17331 20956
20404 20956 27668 31727 33973 30521 24151 13186 15999 7466 7747 22039 37311 35677 35601 29177
20390 29177 26846 33125 24288 20374 20324 20046 20068 24396 28890 22857 25438 28123 24149 29623 29990 45768
20374 45768 57507 69641 80394 82310 86534 103431 117773 124685 128243 122703 122487 125231 136499
20361 136499 148282 161880 171946 172953 171584 169989 161120 155168 143779 137623 135909 142979 139524
20348 139524 137879 126094 121002 117876 101337 92297 90588 84335 80670 79568 67756 61415 60211
20335 60211 54383 46301 49044 58723 63831 60847 67852 60059 59477 58692 51299 58168 70089 84801
20321 84801 96152 98269 115290 137052 136833 138399 148320 150141 157326 169871 173849 180515 186796 196373
20307 196373 208802 203488 197102 182524 181157 189274 182804 173661 148449 130643 118655 100855 103739
20294 103739 109864 92329 82503 78386 84306 76842 77782 91710 87054 65170 50120 45004 46435
20281 46435 63241 68257 58973 59624 51860 49668 54850 48711 37476 30411 37331 41885 37104 35123
20267 35123 33604 35132 35947 24597 23762 37493 40453 52262 45280 40047 29145 15557 17315 17891
20253 17891 27465 28913 33449 34450 26134 15200 19479 17299 31248 41343 46256 43660 39021 44371
20239 44371 55195 54187 48137 38248 50943 57476 47255 45235 43315 39509 45241 48206 39128 41898
20225 41898 57257 60979 64701 66546 66965 66712 71436 69489 65176 72990 64427 65732 65407 56603 43176
20210 43176 43659 55535 62706 53474 53704 59177 63066 70702 77195 62430 54866 63899 65515 69942
20196 69942 73522 58841 59912 52159 46173 44240 50485 52917 57462 63459 49785 51048 59779 55921
20182 55921 45540 51409 43730 37037 38969 43646 43898 46298 49205 52588 44171 36218 42027 44202
20168 44202 49702 45611 50949 59737 63154 66230 69484 86207 81321 73348 65685 54339 50739 55893
20154 55893 66989 56429 48636 56801 70277 68314 58939 50214 40205 37762 42496 35210 43521
20141 43521 48281 52661 44919 44721 60049 62779 61357 64550 76270 72360 62980 62296 68380 60672
20127 60672 47023 49516 54298 54093 44542 46419 62165 74998 72069 72185 72744 78727 73912 67400
20113 67400 67729 67565 67621 64379 64062 67691 76638 77443 79029 86435 89063 80215 84995 85421 91394 100979
20097 100979 98130 97280 108207 112805 116279 105921 101787 109321 120437 130700 133082 135761 156635
20084 156635 158184 155350 169906 169604 171003 169203 173420 184104 194814 201613 202752 208574 223398
20071 223398 227960 217601 202232 209297 211193 210884 209730 200750 201571 203784 214069 233169 238153 238627
20057 238627 229890 222938 229190 240972 240532 236095 229153 224676 222813 234289 240027 234837 224141 218827
20043 218827 221137 244767 249530 246698 238815 236328 236097 242499 250413 246476 245156 238785 230660 241160
20029 241160 249131 258314 255727 271432 269046 267881 267698 279522 291347 295750 287040 293154 307877
20016 307877 308876 316676 334507 339927 343830 370855 395791 398096 414283 434173 447442 467081 488701
20003 488701 511932 539549 566511 587515 614722 660511 700638 747993 813696 906282 1009705
19992 1009705 1108070 1191561 1286706 1405347 1547830 1699135 1865321 2067592 2294372 2564673
19982 2564673 2882983 3291573 3836517 4559401 5465244 6552528 7852371 9434041 11273529
19973 11273529 13263815 15346275 17540296 19696026 21739136 23894018 26268945 28526276
19965 28526276 30393905 32336767 34793362 37537541 39967959 42102253 44108819 45796602
19957 45796602 47274922 48640460 49420239 49024472 47888125 46976589 46356792 45206035 43397686
19948 43397686 41616792 40019194 38516475 37065934 35559271 33576644 31111216 28743305
19940 28743305 26689750 24538005 21976735 19450102 17339589 15569561 13970323 12522603
19932 12522603 11307999 10329667 9519004 8849179 8272295 7760525 7299899 6878031 6494533
19923 6494533 6139625 5820247 5511421 5230707 4966456 4715288 4495673 4297386 4104234
19914 4104234 3915590 3742917 3590653 3457300 3330761 3215035 3101304 2996775 2894358
19905 2894358 2799808 2710856 2616348 2532363 2458519 2380889 2297631 2232328 2177724 2115177 2052656
19894 2052656 2001035 1951974 1891212 1845136 1810511 1768692 1729699 1690316 1654914 1620302 1585104
19883 1585104 1564975 1545575 1538364 1516398 1485741 1463944 1454222 1453660 1466855 1469058 1476089 1490525
19871 1490525 1514787 1552301 1592436 1638894 1692776 1747942 1824226 1910107 1998980 2104038 2229724
19860 2229724 2370026 2549849 2774251 3069652 3485819 4083263 4914709 5983083 7334640
19851 7334640 9018409 10884976 12704855 14544176 16431405 17924919 19107720 20498603
19843 20498603 21944708 23056660 24151764 25596415 26857393 27337992 27618877 27840443
19835 27840443 27210453 25985485 25021239 24094004 22881717 21785591 21012233 20106816 18797652
19826 18797652 17470248 16192730 14601407 12892914 11431745 10169876 9065165 8171043
19818 8171043 7508579 7015803 6635563 6346839 6121821 5951539 5836856 5758587 5737333 5764319
19808 5764319 5867263 6090473 6474802 7097184 8016708 9211208 10725894 12581140 14506688
19799 14506688 16382399 18386079 20211417 21529591 22844927 24380113 25692658 26771863
19791 26771863 28135420 29723249 30696775 31071196 31455878 31326803 30224655 29015556 28042838
19782 28042838 26796688 25438380 24395924 23470937 22147306 20576602 19112515 17449307
19774 17449307 15442565 13563223 11976174 10551621 9343393 8419431 7700418 7123106
19766 7123106 6671376 6286244 5944607 5668031 5420805 5177196 4962262 4772002 4591257
19757 4591257 4433749 4299217 4176068 4048142 3938204 3827784 3723056 3622870 3509378
19748 3509378 3389803 3271787 3151862 3044126 2952032 2845653 2737630 2631794 2520292 2427806
19738 2427806 2343425 2238810 2150606 2065614 1978947 1895945 1800371 1696449 1604845 1536413 1468090
19727 1468090 1399471 1341752 1295557 1250934 1209949 1169684 1127114 1083195 1055694 1018689 991884
19716 991884 961991 943641 928450 904969 873790 845683 821642 790011 757272 744555 737890 725277
19704 725277 701992 699899 710588 712401 697614 673617 668629 664818 648379 642720 635696 637332 610609
19691 610609 576643 550663 529254 514463 482967 456988 445504 421172 396640 389147 382033 376552
19679 376552 371061 350997 325288 325886 333492 329230 313914 300860 286878 282980 297587 307549 316854
19666 316854 334563 358573 390815 419198 445349 474055 479376 489056 518342 533576 554794 583166
19654 583166 606799 615438 616254 610653 602786 585648 569782 551326 526923 500304 485619 478277 455375
19641 455375 431160 415345 396459 381764 373748 347213 337773 322894 319750 315938 318336 321777 340388
19628 340388 340217 321463 326099 328380 328550 335298 335591 333053 325060 339987 358089 374899 389864 408480
19614 408480 426323 442874 468316 500683 517371 525772 538413 554356 569096 595880 624453 632342
19602 632342 621048 621566 606196 583513 586489 569776 538221 514863 494090 478463 461553 450633
19590 450633 433365 393068 367127 342677 316943 302811 301448 295370 287050 282719 284933 284298 285373
19577 285373 281682 295671 307776 322292 325463 308626 297967 277662 274642 264067 259406 250007
19565 250007 235366 231503 226386 220404 207714 199330 191314 185233 182854 173742 161293 154708 153585
19552 153585 140462 126561 130998 125884 116393 119130 128280 129068 124568 119203 113097 113070 110356 107795
19538 107795 106636 107040 116276 107457 97193 84457 80886 84080 78933 84224 92683 88458 93723 98379
19524 98379 88025 78092 72835 61549 53853 49642 53030 61259 61973 64676 55742 53002 57648 61185
19510 61185 55047 62871 71344 67311 56567 48064 48477 55860 49609 56496 49939 51077 57320 48037
19496 48037 48859 49483 48607 52265 40488 39251 46107 53479 51010 48748 57067 60217 61258 52367 43261
19481 43261 45341 50126 55077 51768 56506 57925 64068 69334 67109 58260 56561 66120 65307 68592 65981
19466 65981 56700 48760 39330 42115 41025 28798 30705 54096 59205 49534 52061 59936 59335 45706
19452 45706 51534 60211 60724 53645 41613 53868 65491 79465 80362 82930 95842 118031 143856
19439 143856 171545 170216 170225 184232 186840 202993 223926 244502 259270 276675 281328 286674 288463
19426 288463 292388 300499 306453 311342 299571 287072 275212 251364 242654 246241 242039 233223 230635
19413 230635 215272 199200 186667 178922 175294 158574 142772 134334 123161 113298 101544 93205
19401 93205 103154 107619 101093 92694 89642 94004 86051 71707 74961 79816 72242 76820 91888 98453
19387 98453 100100 105860 116875 133549 132622 135439 149211 149511 148289 141661 136951 134996 148802 144541
19373 144541 128091 129350 121350 109803 110702 99965 87869 89711 92473 96222 97862 96469 92494
19360 92494 83246 85209 92749 88556 78918 70610 71441 78997 91603 81613 71898 57057 44914 53675
19346 53675 62036 56929 60352 59124 58129 71386 74606 85464 97998 109160 127274 158298 180987
19333 180987 202956 225055 228718 238823 254660 269714 279846 286163 276488 263222 256535 259030
19321 259030 262430 251908 242746 236344 226198 225580 244569 248716 234824 230325 227791 236387 243078
19308 243078 240717 232960 218873 209149 207966 206690 198900 187102 171161 153529 135842 134565 117826
19295 117826 121568 119663 122942 124817 118088 117686 129295 132391 135821 134406 132052 146087 164577 179281
19281 179281 193524 205939 226776 225610 224833 233940 237905 230302 227389 221419 232233 233540 232947 240549
19267 240549 239593 238813 239681 235644 243445 258688 261188 244341 229741 219589 215423 225356 219271 207985
19253 207985 187844 183930 185497 171032 155555 161582 163303 148307 142857 129487 108402 105505 107451
19240 107451 119280 127891 135904 130283 115748 125505 122221 118000 129168 138360 134813 134445 134867 134058
19226 134058 125134 110657 106280 109900 118528 118498 134923 140450 129103 120954 116976 117148 121904 129503
19212 129503 134212 128463 121760 130430 121151 125666 122229 111305 108639 115064 117600 121415 129622 141250
19198 141250 139607 127652 135267 144421 147124 143630 135402 140301 144031 151617 164372 165194 178492 199097
19184 199097 196068 196534 193738 178289 176822 189782 199026 214875 226395 226560 217604 212390 213831 218956
19170 218956 212280 205852 218733 230495 236148 251949 263670 268604 272731 270039 283865 289467 283573
19157 283573 285757 299909 315139 326085 333403 344617 353938 366702 386031 404356 437490 468277
19145 468277 488024 519057 559256 598968 635888 682135 743264 806652 854810 920727 995899
19134 995899 1086478 1175271 1283024 1418677 1569018 1782411 2067446 2461732 2996249 3663540
19124 3663540 4437255 5345415 6435610 7666030 8965034 10312031 11726264 12964040
19116 12964040 13988230 15130590 16460649 17659437 18451065 19222835 20137865 20808950 21209282
19107 21209282 21633904 22069072 21972130 21394527 20964496 20754856 20295567 19435735 18635393
19098 18635393 17895495 16918008 15834441 14846385 13901957 12683954 11327567 10188468 9253998
19089 9253998 8394024 7595234 6952359 6470311 6118643 5874212 5694854 5575378 5529440 5554260
19079 5554260 5653465 5869375 6258383 6885489 7733771 8743484 9955777 11415430 13103880
19070 13103880 14886342 16743350 18687723 20370351 21751123 23245060 25032526 26638245
19062 26638245 27626008 28575997 29760392 30692201 31244804 31796411 32367874 32198235 31360744
19053 31360744 30697596 30322609 29546526 28146255 26828086 25638037 24156937 22492187
19045 22492187 20956515 19485656 17657555 15663915 13949021 12512977 11183900 9932934
19037 9932934 8854904 8006959 7338914 6791257 6329264 5933160 5578176 5253646 4968144
19028 4968144 4710904 4464590 4230732 4020462 3820561 3630694 3462576 3306842 3162643
19019 3162643 3026714 2904833 2795923 2709810 2628931 2560913 2490595 2425076 2370052 2333402 2283813
19008 2283813 2237316 2196146 2168916 2139147 2088790 2043128 1998855 1961076 1909910 1866645 1821701
18997 1821701 1764138 1695400 1643275 1588942 1542721 1502304 1459868 1408518 1359632 1295033 1235392
18986 1235392 1194905 1148473 1108083 1055961 1013136 971941 920290 887887 863945 836730 814433
18975 814433 796440 780744 781388 775576 757254 740761 741057 745770 748800 748799 765913 779873 791423 801092
18961 801092 829681 854875 874374 890236 914093 934670 952182 956345 966643 970214 971484 962033
18949 962033 956329 950703 946073 914894 885067 864258 828105 791823 766210 748385 734247 708212
18937 708212 678539 632865 595477 575048 542709 503995 466561 434826 414850 402609 395017 396702
18925 396702 392761 392307 397233 381017 360067 361989 369489 372016 367205 354594 346294 357802 357353 350390
18911 350390 340898 334419 339871 347347 353157 345392 334169 331415 346626 354940 364756 367643 368792 363297
18897 363297 377268 398788 407424 406560 411975 417769 438136 461866 471390 489023 526958 574089 614479
18884 614479 648613 692908 749939 805343 861343 922904 990303 1057718 1105895 1154355 1226032
18873 1226032 1296628 1385490 1496685 1624143 1807996 2062933 2403584 2889126 3568554 4487035
18863 4487035 5629695 6975516 8594605 10517591 12701115 14984808 17221018 19357241
18855 19357241 21101041 22436323 23584462 24441605 24547834 23651782 22270719 20979089
18847 20979089 19686492 17874168 15597600 13495440 11821646 10423070 9099845 7893851
18839 7893851 6943789 6242121 5733953 5353379 5053659 4830033 4645317 4490499 4367150
18830 4367150 4288099 4227722 4181764 4119930 4063454 4032256 4020832 4031641 4065381 4134837 4262597
18819 4262597 4470409 4802106 5308625 6075773 7182493 8645646 10439727 12604205 15214862
18810 15214862 18281820 21708170 25220415 28655885 31845730 34342824 36289239 37951948
18802 37951948 38996383 38680418 36954378 34760091 32744864 30511956 27371735 23761012
18794 23761012 20595781 18046665 15834511 13733449 11872574 10411069 9306810 8470434
18786 8470434 7811406 7275464 6849153 6480959 6170506 5899183 5656714 5431392 5224862
18777 5224862 5034966 4854526 4676289 4516848 4367658 4255366 4164591 4107865 4103065 4154728
18767 4154728 4281374 4519038 4896812 5422011 6104108 6939785 7955973 9178313 10545243
18758 10545243 11908385 13238597 14442403 15342588 16060525 16674107 16976901 16656457 15819145
18749 15819145 14897000 14055330 13043663 11624376 10109136 8846894 7832102 6932371
18741 6932371 6061160 5302941 4711454 4251692 3895288 3606247 3376847 3179080 2996578
18732 2996578 2828311 2698991 2577929 2452356 2339295 2231058 2121456 2032789 1934849 1845135
18722 1845135 1759782 1682596 1604017 1528987 1454787 1401638 1346104 1288228 1237585 1198669 1160658
18711 1160658 1117513 1074534 1037713 1002037 963899 954875 927564 900484 866041 838712 821585
18700 821585 774175 748933 727948 703415 677399 649335 617322 593691 575401 538729 518462
18689 518462 511452 498793 487341 476060 472965 451936 435184 425610 407214 407339 407488 404205 390813
18676 390813 384593 376728 373354 384881 389680 409101 431507 458493 491999 516997 536943 559623
18664 559623 583872 608126 617765 613598 605107 590854 575134 547419 519870 497935 459184 419372
18652 419372 396209 372424 350683 328432 300583 269035 256882 248968 232363 226332 217390 201551
18640 201551 187167 176554 171203 168128 169748 169593 168154 164528 166604 175215 182561 192331 182074 171845
18626 171845 186225 202726 216795 248533 283340 339422 382984 422011 483242 539668 591577
18615 591577 646866 689029 709085 720307 723136 704220 662818 637755 609871 555664 486687 416015
18603 416015 367266 356380 341258 311125 286090 257501 256802 249576 232879 233584 233926 231880 234098
18590 234098 241071 238088 250705 256743 250547 254108 268164 283099 277492 269399 275806 288958 294630
18577 294630 295018 296147 311653 316195 316080 331301 346498 350216 351776 373373 404796 422422 424742
18564 424742 422200 418921 399779 386556 364865 352102 337501 317131 288580 261780 249937 241311
18552 241311 224646 204119 187694 181033 169723 157215 154349 165691 161735 162338 159972 163486 169877
18539 169877 164506 150355 138946 137240 146202 153949 159982 165637 175027 170292 175201 184973 180797 171126
18525 171126 170628 172673 169808 151556 141509 134689 137266 134660 123164 117960 122549 117152 104476
18512 104476 88714 76503 85175 86141 74507 60403 56168 47042 31635 31965 31287 35137 47261
18499 47261 58208 67862 64066 58080 46167 42047 27863 24641 36659 42166 31605 35102 25525
18486 25525 15171 15795 12167 21237 22185 25997 23627 22054 19527 14997 24407 37459 26866 30105
18472 30105 38935 39799 28897 18324 21569 26666 20731 22414 20178 23289 26395 24964 18078 11751
18458 11751 4160 -2086 1536 1203 10750 146 -3171 8478 4531 7694 9608 1706 8049 3211
18444 3211 -6805 1675 12310 13006 9513 3033 85 10692 7623 -733 7327 8039 11068 24652
18430 24652 27477 21378 28577 34428 44749 40551 25076 18296 8296 -2952 -4633 -5104 -585 2
18416 2 -2457 15442 25881 22045 19816 14405 14837 14070 2306 -950 6215 9455 409 7487 12414
18401 12414 15380 7985 1153 -4856 -4046 -3128 2722 769 -377 19297 31735 24308 22937 19421
18387 19421 15748 11010 -489 -2143 -2442 5385 16292 16647 9678 1284 11682 15906 16271 13034
18373 13034 7758 9302 19531 16924 6675 7910 11617 17562 6310 -3245 -4790 17351 39070
18360 39070 41655 32395 26302 20711 16993 13148 19077 21961 6249 -2488 284 7300 2539 -13646
18346 -13646 -14958 2819 8186 -5570 -2517 5334 12948 28734 24931 17900 32248 41253 51993
18333 51993 68032 79673 91097 92612 94287 94475 107202 115534 107284 100802 99781 97072 79375
18320 79375 72131 66822 48149 45438 51816 48897 44693 44412 39155 30505 27364 26576 25695 21583 38468
18305 38468 37895 29379 24885 24472 25358 28160 22855 16131 12961 12589 15890 15811 26102 29564 34396 45113
18289 45113 39143 43381 63653 77032 81413 93797 108324 135942 157602 182237 193357 192303
18277 192303 203132 198443 200210 195667 165450 168657 161681 144178 120427 104474 97903 93598 91898
18264 91898 77348 63373 55996 41009 34535 27430 27271 22118 29221 39732 39462 41072 48382 50333
18250 50333 48076 40091 34900 34047 35559 35375 33165 21700 16945 25021 50149 55874 44729 57701
18236 57701 64851 69006 81052 91395 102369 104396 108091 115504 108311 107602 113344 105516 99815 98327
18222 98327 93317 93552 94623 84740 78233 57999 48132 54899 52458 50749 42379 44983 41753 37228
18208 37228 39324 36791 39994 36871 35189 40308 42662 38528 36846 45188 33976 46829 56990 46902
18194 46902 29976 23394 24491 29419 20862 18852 15207 16197 21610 20983 22166 22488 28416 28550 17935
18179 17935 25311 17914 16109 17755 15179 13690 -767 4578 12419 21010 25127 25916 23963 25253
18165 25253 25354 29218 27899 24329 26828 36560 43156 40554 36148 42701 39593 31799 31810 44978 40164
18150 40164 35122 41011 41235 50418 58113 57295 63973 78215 76996 63498 65817 64671 68423 71911
18136 71911 79454 98142 129174 140526 144055 146528 163724 183029 210501 240605 266862 294314
18124 294314 329051 380057 437123 497220 576078 678363 807824 984050 1215794 1578952
18114 1578952 2194114 3310362 5358529 8503438 11454264 13302496 14286567 12457125
18106 12457125 8550727 5846849 4370450 3480532 2873070 2440201 2119987 1863635 1650997
18097 1650997 1481800 1351882 1249055 1168066 1114128 1056591 997865 945969 886738 827750 768129
18086 768129 712052 659821 611560 575426 542446 514144 490259 486416 478577 466493 432380 402136
18074 402136 384826 373481 349795 336134 326965 311948 290659 280695 286706 275923 273496 274410 269038
18061 269038 256643 233184 208093 202369 199272 189510 190242 178920 183066 170705 167292 164912 156922
18048 156922 160893 154444 163636 160606 140306 132491 125958 121644 118665 101755 118117 125882 123823
18035 123823 109850 102114 96662 104103 108901 96814 86761 80082 76939 60991 58200 59632 56691
18022 56691 50239 42899 52570 52548 47012 32013 29057 19079 30628 42612 53785 53590 53540 58349 50556
18007 50556 47078 51691 52892 41311 30540 28596 24005 14338 24377 24080 11315 6585 19174
17994 19174 25988 35391 24894 18389 20087 10383 9990 14960 13020 16954 14829 3271 419 4137
17980 4137 9910 18051 10801 5208 -967 -4431 382 13799 12347 20632 17668 5955 2241 6108
17966 6108 11922 10934 14877 20710 21197 25260 29984 32203 32211 16923 838 1084 6427 11874 14953 12559
17950 12559 11745 2897 -10273 -4921 5353 9896 10265 6183 11144 20609 6557 1591 16487 18767
17936 18767 13512 10163 11289 13302 12126 17564 6838 1824 8886 18227 25192 17958 464 -11912
17922 -11912 -9302 223 -12999 -8941 7868 19243 8828 2348 1487 -5911 -18494 -10847 4274
17909 4274 2930 -8234 180 3932 1481 7746 9392 9757 16683 12523 9155 10636 10951 17268 13195
17894 13195 12815 11636 7305 9995 9102 7426 5055 6766 15628 10022 -1026 2314 14251 17099
17880 17099 12568 10920 1001 -17470 -19794 -1426 9833 9659 6067 10014 12026 9079 9960 14752
17866 14752 15488 13256 8559 2314 -5205 -6224 -4025 -8739 8246 13813 9636 -2688 -16152 -19399
17852 -19399 -8357 3297 12092 4853 -3065 -1588 1947 -12421 -21626 -20832 -13532 -16863 -24884 -19065
17838 -19065 -2160 2641 -2101 -2255 5892 11078 12669 10506 2071 -1363 -10695 -8191 5642 21880
17824 21880 23940 18985 8157 -9509 -7738 8712 11254 7984 59 -4655 -8237 -8925 -11174 -7146
17810 -7146 -8337 -11725 -12119 -14109 -6662 467 -4243 6583 -10554 -12274 -9153 -10967 1777 -7648
17796 -7648 -17470 -9613 -9598 62 18494 14734 -7827 -21468 -20128 -18462 -34442 -31704 -23461 -12238
17782 -12238 -15126 -11489 -7059 -9646 -11967 -15033 -12281 -6057 -9297 -5019 -19882 -26744 -23006 -20148
17768 -20148 -21557 -29233 -24626 -13579 6789 15937 -363 -10813 -9702 -11474 -4001 5607 9852
17755 9852 7855 4111 -4280 -11963 4984 3876 -2459 -4656 -6461 -10587 -19461 -29410 -32044 -19254
17741 -19254 -17981 -7285 -2532 -8630 -10551 -12495 -11567 -4275 -6192 -7646 -11704 -11830 -20883 -19903 -16476
17726 -16476 -3981 -2474 -310 -9718 -7117 -1283 2253 -4640 55 4180 -4037 -5407 -1322 4437
17712 4437 21338 16560 4104 -10339 -14874 -6647 -3703 2521 4256 10337 3063 -354 6403 3835
17698 3835 2567 8431 7122 3241 -6283 1914 3329 -11504 -5269 4988 3999 7044 -6983 -17182
17684 -17182 -21989 -22334 -15438 -7734 1453 7762 -1115 -1267 -4311 -5930 706 -9379 -12511 -13592 -3965
17669 -3965 9506 4693 -6344 -9668 80 5212 -1112 -8775 7207 -492 -1061 -1082 -4817 -2437 -13446
17654 -13446 -12508 -13655 -21112 -10166 -2726 -14558 -24587 -35627 -27909 -13244 -10246 -4295 3041
17641 3041 10189 4688 8058 12459 5339 -12063 -18267 -27709 -34146 -28394 -26170 -19651 -21570 -21285 -27809
17626 -27809 -24405 -11547 -1375 -7154 -19396 -14701 -5233 -5996 1158 1577 -1745 678 -9683 -15279
17612 -15279 -17336 -23060 -13521 -7444 -14459 -8414 -6857 456 7797 6394 11309 9077 10591 -1272
17598 -1272 -3702 2549 4666 6419 5306 4947 11266 -3093 -8032 4532 4530 -2659 -14063 -8624 2825
17583 2825 6739 3551 -1678 -1256 -10103 -18680 -14618 -7623 531 -1058 5536 16458 21012 7701
17569 7701 8635 13066 10855 9365 19667 14893 11999 18809 11440 16018 27009 23406 30503 27006
17555 27006 16731 8469 10575 4492 -320 1903 -18150 -18478 -9806 -9790 -4762 692 19148 23741
17541 23741 19016 15245 10017 1196 -5961 -16153 -19973 -16681 -5246 7147 5538 -2448 -20389
17528 -20389 -11525 -2016 7256 11593 -283 4708 7581 4868 -2352 -10843 -15547 -7343 -11563 -9545
17514 -9545 -4560 -515 -14200 -27651 -25871 -25530 -20605 -13521 -19272 -16596 -6948 4347 7204 -5280
17500 -5280 -17056 -12384 -14945 -17438 -27452 -19933 -9289 1404 -2097 -4039 -1522 775 8345 6808
17486 6808 -5267 -9382 1655 5889 2676 -6802 -14768 -13206 -2615 -5789 -10343 -20553 -20727 -30113
17472 -30113 -19727 -5343 -1841 -3192 -14492 -8424 5951 10871 3747 -10832 -14271 -14412 -2857
17459 -2857 8321 5202 6552 -1994 -1879 2431 5211 5100 2008 -6078 -3564 -2908 14445 25025 42483
17444 42483 49064 52444 54894 54686 34481 33635 31569 28037 22056 12391 12961 11849 12025 7527 -1860
17429 -1860 3074 -1631 -1779 -7363 -3388 6394 10273 1733 98 2927 20 4809 2586 -2270 2627
17414 2627 4974 17426 22979 24437 27718 24688 18398 1966 -10849 -12423 -14764 -10272 -8793 -6430
17400 -6430 -16104 -26135 -16499 -13795 -13173 -10727 -8632 -8825 -10210 -7404 -4940 -3624 -2057 10151 14082
17385 14082 16152 7483 5010 8531 13550 4697 9223 4250 3323 -807 -5507 -3038 -4906 -2244 -9276
17370 -9276 -18177 -30957 -24853 -17410 -23906 -22512 -16992 -3616 2188 -4585 1899 -4820 -9843 -12928
17356 -12928 -9458 -12536 -18393 -15274 -8876 -8380 -10300 -12015 -3213 16848 17757 -2912 -7646 4865
17342 4865 -1677 -10672 -3998 3240 421 -5396 -6185 -9989 -12882 -7403 -14888 -13478 -5945 -5572 -11174
17327 -11174 -4071 16170 19723 10370 5809 30 -8557 -21813 -20686 -22456 -8997 6015 9377
17314 9377 4606 -2153 -974 9090 26394 19790 11892 2371 -10000 -7410 8009 9833 -128 -7140
17300 -7140 -4816 -6326 -7453 -1862 -2495 -9474 -13322 -2907 16235 15501 2673 -3753 -7223 -1583
17286 -1583 -170 -1460 -3936 -16064 -22950 -17957 -3884 2092 -7522 -12433 -5784 -789 -1360 -5679
17272 -5679 -8408 -2454 1273 1898 -4039 -761 -7677 -11213 -1970 5440 6545 2689 12383 16133 8214
17257 8214 5872 510 -1796 156 5524 7013 -3694 -8581 -16989 -24590 -26433 -14838 -11205 -6043
17243 -6043 -8958 -12402 -8974 -3147 -9376 -12530 -2690 -15603 -11830 -14540 -10965 -2696 352 3236
17229 3236 3602 5900 17674 6925 -10392 -13397 -8513 -15891 -9040 -9644 -15179 -5966 2304 5166
17215 5166 -2470 -1447 11680 20605 16442 9980 -1189 5064 2155 3137 5728 -3755 -3080 -10252 -21881
17200 -21881 -20955 -11746 7298 7616 720 5572 4636 8383 14039 10679 2960 -2815 -4316 -7439 -2985
17185 -2985 -485 -11869 -13946 183 9439 5177 1597 4461 -17750 -29455 -24507 -14524 -7243 -9061
17171 -9061 -5208 -5281 -12533 -13296 -9958 -3183 -1641 3500 3903 -1816 -6413 -10592 -15279 -14277 -11192 -10308
17155 -10308 -3360 5182 11459 21443 11709 2374 -7273 -8496 -3830 -7838 -16180 -27835 -20348 -8726
17141 -8726 4978 10410 8362 3791 3378 -329 -7712 -10380 -11677 -10886 -6648 -1498 -11384 -5113 -3847
17126 -3847 -6222 -11315 -21120 -27349 -29118 -23007 -13897 -7485 -5642 4429 -1894 -3971 -7013 -16254
17112 -16254 -8261 -9141 -918 7435 -2854 -1933 4398 -4365 -8584 -17528 -13502 -13929 -6424 -12635 -1575
17097 -1575 3053 6198 -7041 -10711 -9843 -11279 -23543 -29911 -28844 -19363 -9007 -10926 -15652 -11931
17083 -11931 -7530 -14210 -16820 -16484 -6442 -8324 -16848 -18965 -8878 -5706 -6198 -6280 -20595 -13452 -15914
17068 -15914 -7987 -5445 -5932 -18687 -31692 -13187 -1701 -665 -10275 -6225 -7033 -1526 8527 10323
17054 10323 2407 -3833 -12494 -24211 -27375 -13426 -2214 -13990 -13419 388 3984 9235 13017
17041 13017 8524 15299 20965 11474 -6468 -1428 9719 19605 15374 7429 3994 4830 8638 16313
17027 16313 9837 3800 12738 20566 21352 19505 4971 7418 12948 7269 -11869 -24644 -23942 -5568
17013 -5568 7949 17936 26538 17669 12235 5790 -2301 -9120 -8735 -11730 -5583 -1747 -3711 4095 5579
16998 5579 -2655 3103 2931 -7333 -9339 -6327 -3247 -9373 -24028 -22067 -3967 -9741 -14991 -12692
16984 -12692 5190 13344 -9695 -22609 -18400 -7392 5032 -2498 -3955 187 1121 445 -11531
16971 -11531 -11834 -2974 -9853 -19625 -22417 -31960 -26994 -29442 -24960 -17146 -15928 -22522 -21816 -18253 -8444
16956 -8444 -10836 -3448 3939 -12860 -22936 -20502 -24747 -17848 -9830 -9788 -1119 5303 12675 21874 28046
16941 28046 24601 18578 10086 12935 5332 -3764 -15274 -11080 -12743 -16051 -14764 -7081 -1344 -8863
16927 -8863 -5180 199 3445 2219 1453 5496 1173 682 11705 787 -4464 -8172 -5548 -9467 -11293
16912 -11293 -756 4109 13283 16078 18413 22953 16104 6902 5899 16085 15277 18047 14392 24419
16898 24419 30175 20839 7414 14624 22298 23775 28794 30771 20142 25747 28161 20287 3224 7820
16884 7820 13378 13570 12417 14756 12347 11947 7382 376 -3078 8020 6792 1136 -2638 -4285 13297
16869 13297 10441 8376 766 4233 6886 6604 -1825 3178 7786 5520 9238 2993 -7405 -7586 -18440
16854 -18440 -16553 -4655 2827 -2443 -7963 -10888 -13881 -22343 -17191 -5573 704 -1678 8193 9728
16840 9728 13069 4058 4503 9094 9708 8910 8315 -3740 -10641 -18564 -33481 -28708 -19570 -24088 -16256
16825 -16256 -19903 -17152 -24781 -36707 -32687 -19065 -27000 -23517 -17569 -13972 5732 8104 751 -4495
16811 -4495 -7268 -2806 -7518 -7500 -16733 -31551 -32051 -12708 -4448 -515 -5868 -3503 915 -1913 4685
16796 4685 842 -7636 -8729 -5240 -12226 -6008 -4399 -12371 -6597 -5378 -11038 -8451 5479 21841
16782 21841 14719 -3091 -10844 -15655 -18520 -10977 -413 1443 7094 7898 5497 4580 4087 -8477
16768 -8477 -7092 -10509 -20308 -10926 -7973 -640 -661 2949 10833 13300 5086 2207 11645 10673 5801
16753 5801 1479 4014 7139 6044 -2148 -4127 -5641 366 6927 9831 11874 12595 7070 -6201 -17442
16738 -17442 -15266 -3743 7503 4515 3183 1018 4883 19330 26550 21822 12473 14886 25768
16725 25768 29552 19004 19247 20922 8594 3005 1114 -1918 -5699 -5260 -12730 -19629 -18834 -14177 -2902
16710 -2902 9117 6020 -1176 -5828 -210 11702 8199 -269 -5588 -9644 -9570 -3277 10187 12744
16696 12744 -1707 -7072 -15539 -12059 -112 -2289 -7472 -12218 -15056 -5923 -3226 -7602 -15967 -14255
16682 -14255 -8524 682 3042 -5737 -6431 -10957 -6738 -3917 -2081 -7726 153 7973 2916 -291 -5262
16667 -5262 -9528 -8140 -15214 -18361 -14565 870 1374 115 4117 1285 2455 5457 -2059 -3235 -4551
16652 -4551 -9510 -11619 -2150 -13267 -17479 -22345 -13175 -7071 -13549 -10894 -6763 -6227 -2164 1569 2138
16637 2138 -5736 -9478 -16483 -16804 -1053 1691 -2236 -3468 -1702 -1787 -3253 741 876 -7720 -12290
16622 -12290 -13073 -12354 -5682 -9498 -11900 431 13815 16762 16712 14447 7652 1458 -8799 -12079 -6851
16607 -6851 -7674 -9432 5578 9139 13337 5355 4727 8576 9598 17406 21476 12852 7579 10707 4643
16592 4643 -4208 -7062 -12446 -11020 -6401 5027 11323 6030 -7457 -2404 14968 17742 5718 -2820
16578 -2820 -7825 -3785 1537 -2593 -6763 5707 8840 961 3988 9028 9613 190 -2379 4576 23600
16563 23600 24864 19478 13964 12362 7249 2954 2523 42 -5262 -13857 -13353 -19370 -20524 -5457 -5289
16548 -5289 -1290 -3153 -2460 -1163 -6638 -11742 -7253 -6811 3016 3202 -1228 -3779 -183 8031 12340
16533 12340 8390 5714 -1135 -127 160 8325 1845 -5863 -8046 -9211 -3335 -6326 -15961 -11472 741
16518 741 3082 9642 10368 12040 9172 4539 -2595 7042 11630 18753 12690 8370 7404 1441 -2514
16503 -2514 3213 10657 3899 -9664 -24488 -31866 -27892 -11044 -6801 -18189 -22866 -7803 3977
16490 3977 9439 18149 14981 5777 3515 -10931 -8090 -5726 -562 1004 1889 1545 6081 -1073 1916
16475 1916 8030 -2458 -7072 -9220 -2199 -1100 4682 11415 3401 -8191 -1528 -3614 -4274 -2016
16461 -2016 -5126 -6970 -6298 -7401 3099 8386 10603 12989 6140 6329 6940 8542 2350 -7492 -9076
16446 -9076 658 -11398 -7962 -11436 -19546 -23445 -20950 1560 12674 8201 7736 6499 14918 19731
16432 19731 18990 296 -5170 -7859 -61 -679 737 -478 -8883 -732 13799 20516 18842 14306
16418 14306 -4479 -6423 -1817 3640 6776 905 9949 10273 -1564 -3925 -13830 -8999 -13432 -23508
16404 -23508 -25006 -30353 -19033 -19698 -15467 -15312 -7412 -6061 -5180 -10389 -12481 -19638 -18720 -15858 -21969
16389 -21969 -23166 -8978 -456 5629 20778 23409 14730 5273 -9879 -13527 -10799 -12720 -16042 -12697
16375 -12697 -7654 -3921 -5127 -3551 -3565 -14401 -19496 -18323 -17499 -20278 -12700 -11878 -6835 -1766 -18116
16360 -18116 -14295 -522 -8238 -16286 -13522 -20941 -15774 -7730 -9459 -19557 -11877 6665 12409 5104
16346 5104 7298 -374 -3884 -10234 -10942 -10804 -9307 -8896 -8524 -6109 -20056 -25492 -33174 -16283 -5279
16331 -5279 -3719 247 5924 4937 4151 -991 -6729 -13924 -11499 -11800 -13952 -9510 -5957 -5975 3053 -3838
16315 -3838 -12053 -24146 -13559 -9731 -7167 -2873 -104 -2810 -9019 -7163 -6070 -7185 -12342 -16018
16301 -16018 -10921 -5992 -6014 -8745 -11485 -13774 -13013 -15127 -16312 -2455 -5673 -5791 -8079 -9681 -9340
16286 -9340 -13728 -9783 -3327 -10684 -11159 -10145 -1125 2039 12698 6997 -6180 -8784 -64 -3794
16272 -3794 -13715 -8980 1811 1169 -3539 -12188 2118 10777 -2764 -7073 -11149 -7950 -6633 -7321
16258 -7321 -1155 -128 -243 1561 3033 -7481 -10482 -6168 -7682 -13152 -17149 -14223 -17265 811
16244 811 23852 24882 12365 24462 21187 2683 4843 27135 12980 -873 -3852 -6083 -3578
16231 -3578 8276 15690 15007 -325 -9664 -16875 -14518 -14004 -5579 -3097 -3644 -2850 1629 -14522 -25256
16216 -25256 -17253 -2222 5757 16446 15784 9605 1804 -6612 -9574 -5377 -13731 -9000 8919 18127
16202 18127 16646 8806 -8455 -3876 8644 469 4660 10532 1785 -2408 -2021 8641 4641 5857
16188 5857 8665 5639 14990 11020 -147 20 8190 10142 11656 12198 13847 11339 5936 -2407 3155
16173 3155 1216 -3236 -17328 -11326 4679 4498 -474 -8022 -1194 17307 5510 3952 2185 2250
16159 2250 -9152 -6347 -6205 -15521 -18721 -13590 -10696 -4538 -1071 6901 3641 10531 9997 627 -10876
16144 -10876 -17010 -18713 -26856 -22819 -3892 5002 1544 -8300 -6605 3251 4955 -942 -25086 -34116
16130 -34116 -20010 -664 16756 16554 9242 14723 19620 19859 3139 -13360 -10621 -7710 -11586 -10339
16116 -10339 -9629 -7183 -8301 -743 -122 -1688 7129 9531 849 -9191 -17184 -22512 -13453 -4254 -4316
16101 -4316 -6306 -3597 -3926 -9318 69 11162 -288 1677 2514 -10562 -8617 -14452 -4101 9107
16087 9107 14021 11583 8316 -3162 -12623 -582 17001 23920 12631 -4181 -7234 -13519 -22186
16074 -22186 -16218 5169 8141 4942 736 3460 3666 13275 9790 5994 4730 2305 14627 15710
16060 15710 16682 10012 10162 8486 17075 27010 20519 16886 14498 25905 31123 20142 16143 15148 14515
16045 14515 18484 18390 30680 43242 29559 37674 50044 35955 29113 25898 18997 26579 30898 28160
16031 28160 12489 9831 -1906 -11250 -19743 -11156 -9051 2836 11311 6134 1911 7024 9277 11964
16017 11964 16184 8998 6040 8315 6199 7349 -1623 -11586 -2068 15884 14452 8456 1557 -574
16003 -574 -2376 -11626 -19457 -12077 -10133 -19521 -19928 -1985 -5471 628 6364 8407 2928 9146 11606
15988 11606 7269 8329 18197 18802 8386 -7148 -18912 -18989 -6898 -4260 6858 17736 16624 1033
15974 1033 -7897 -5465 10388 20842 13522 -2764 -12497 -2771 -12230 -6529 -11534 -12470 -6195 -3568
15960 -3568 -11129 -14916 -11856 -9985 -3660 -4261 -5303 3122 6352 1425 -9789 -13096 -5028 4216 12218
15945 12218 11388 9776 13617 8905 15795 13173 10674 2783 753 15754 23198 11925 9834 -1774
15931 -1774 244 -4647 788 14009 3078 1513 10071 16997 25619 9600 841 6381 13871 24947
15917 24947 19092 13693 14674 9726 7104 4485 -12817 -28378 -27204 -21209 -15292 -1750 3988 24
15903 24 -112 1911 3316 -9254 -13356 -10506 -6843 -4635 652 4033 4417 4168 8413 310 -3816 -11382
15887 -11382 -6011 -378 -4695 4862 11973 11550 15512 9203 2629 2586 -6774 -8511 -4691 -2351 -11220
15872 -11220 -10129 -3184 -4337 -1473 11039 12955 12983 6684 3529 5617 -2511 -9980 -11977 -7868 -2311
15857 -2311 -10689 -10760 -6762 -9622 -5965 10182 8482 10171 8990 -2176 -12087 -9474 1436 11521
15843 11521 3742 -1411 -9556 -16206 -20258 -13536 -9158 -16259 -15653 -18180 -18931 -2737 5373 -8628
15829 -8628 -23883 -18944 -6437 -3884 2620 11698 -369 -15381 -13711 -9824 -15497 -25804 -16492
15816 -16492 -1781 -3989 -1642 -3163 -19222 -17785 -6926 9483 15500 13175 11496 2637 -8671
15803 -8671 -798 -1248 -1248 8554 10234 3464 -12627 -12193 -4600 3519 3464 4395 14552 4372 -4384 -7313
15787 -7313 -9438 -5852 -3004 -1679 -8117 -8150 -683 -6269 -8627 -16845 -21073 -22883 -19542 -16746 -14031
15772 -14031 -2574 -2369 -2917 -4540 4342 2834 5681 -1150 316 -2311 -8600 -9050 -16115 -15347 -9453
15757 -9453 -5482 -730 2062 -2280 -2457 -290 -3476 2364 -4138 1448 7592 13097 17077 4309 5681
15742 5681 8053 -4347 -8816 -10623 -8083 -2764 -9991 -9841 -5554 -4506 -6086 388 -13493 -11949
15728 -11949 -11400 -21590 -23309 -15406 -1646 1001 2348 7230 -496 2770 10342 10338 5030 3130 3333
15713 3333 -8433 -1987 -179 -1853 677 -8704 -17274 -21255 -1380 14846 9372 3748 -10709 -14783
15699 -14783 -4251 622 8035 14357 15935 6464 363 5122 3280 10364 9184 13399 11246 824
15685 824 -3398 -9586 -15740 -3734 -6706 -10256 1321 2080 3368 16031 7206 4466 9131 2829
15671 2829 3835 2921 -3365 -9707 -8046 -19818 -33370 -18632 -17447 -12423 -2006 8836 5755 -11360
15657 -11360 -12009 -7233 -2126 7096 7202 -656 -14232 -19629 -71 1580 -4340 7200 12579 -2004
15643 -2004 -11871 -13697 -10208 -1776 897 3387 217 -1293 -1881 588 -12619 -8064 9654 14434
15629 14434 13757 16857 7616 -1380 -5566 -2912 -397 3989 -10673 -7602 -1271 9063 2209 -4285
15615 -4285 4930 7522 -8478 -15698 -8331 -3410 2617 8672 13156 10233 -9482 -14146 -8785 -6620
15601 -6620 -5106 -7319 -15746 -12833 -5769 -2733 -3521 -5052 -7580 -7354 -9714 -14783 -16378 -8601 6923
15586 6923 13943 9527 2646 3981 7571 13947 14820 11749 5625 6462 247 -3704 3742 11525 16856
15571 16856 11115 2493 -7270 -12185 -10986 -24888 -26807 -13815 -6009 8365 9667 10870 13543 1133
15557 1133 -10533 -4991 -3113 873 5033 6595 -2015 -5520 -11358 -18887 -13419 890 -3765 -11721
15543 -11721 -1873 -2724 -947 3409 3725 -2222 -9195 -12128 -4132 -1361 -5284 -7124 -4079 -2105 8583
15528 8583 13593 11040 15107 12942 -6077 -16037 -15107 -4231 -702 33 -7728 -6709 -8644 -3788 12074
15513 12074 19559 15024 12937 1058 3005 -6777 -3022 -4893 -5740 -7428 -9157 -2492 5645 7432
15499 7432 -1567 -169 5941 -1071 8811 8997 -3073 -9862 -7474 -6020 -1577 2780 2778 10207 7858
15484 7858 12401 14797 20519 16469 8243 6472 9272 6643 20087 25908 13878 6718 2500 -3768
15470 -3768 777 -4620 -4915 -3308 -11011 -16724 -4797 -7575 -7088 -1184 11944 14785 16127 4936
15456 4936 -5668 -4013 3993 8388 12393 22105 23592 21363 27815 57959 76016 86460 96637
15443 96637 89410 72725 56441 40034 29200 26977 33354 17994 10707 15817 23818 24273 18088
15430 18088 14068 22169 21792 9772 3882 14249 15984 247 -4375 -1700 -2900 -9901 -7931 3431
15416 3431 3455 14882 25146 21281 4237 -7882 -10274 -1145 -8148 -9790 -5873 -2548 1166 -4361
15402 -4361 -13804 -14379 -14212 -12569 4954 9789 -1899 -3615 -13938 -9008 -1947 -5125 -8903 -12663
15388 -12663 -18669 -18161 -22537 -22166 -16932 -30460 -34685 -31299 -20136 -8404 -7127 -9599 9697 4896
15374 4896 1955 9468 5789 3982 -111 4924 6741 -839 -5658 5215 17763 24847 19398 15377
15360 15377 9379 3356 2473 -4236 -3651 -2016 170 1390 -2075 1362 8696 8835 11513 17220 5303
15345 5303 1036 3165 2925 1627 8566 11757 13495 -1198 -3671 -483 5148 -711 -4136 6922
15331 6922 16762 24102 22262 10696 -8520 -22182 -23228 -19478 -14998 -5689 1174 4722 11678 8423
15317 8423 8878 20694 23589 12256 13569 11812 11257 -3460 -8932 -5294 1210 -2046 -8835 -7614
15303 -7614 -6316 3243 11106 13358 2226 -5192 -4425 -6748 -7399 -7098 -4662 704 3249 -3605 -9973
15288 -9973 -1715 1526 4626 10170 3735 -4355 -10451 -16292 -3881 521 -11323 -4193 6040 1974
15274 1974 -1737 2376 -4056 -4739 -8589 -6538 -3926 6000 9082 16667 18960 12107 -2528 -2584 4246
15259 4246 13196 1816 -5685 -9636 -7784 -730 -3175 -145 -1072 11934 26320 20413 12322 5500
15245 5500 -2936 -4210 -6417 940 13939 20086 20392 15132 11202 16390 20061 11595 517 3125
15231 3125 -7359 -20432 -8108 -6054 5691 9725 14192 8081 1067 -8279 -19189 -19790 -10072 3127
15217 3127 13615 15847 8709 2317 -1829 -7121 -5343 -5689 -2787 2477 -3126 -7616 -8142 -5299 5338
15202 5338 5050 11392 13105 5862 9515 13428 12958 814 3651 -8437 -15289 -15801 -8426 -2270 -2349
15187 -2349 -6354 -7727 6251 14916 10929 2511 7388 15481 24676 24143 24450 11036 -7241 -4485
15173 -4485 -2610 -11005 -13509 -16294 -18065 -7564 7052 6948 -2928 5966 12265 9165 -988 -2367
15159 -2367 -10778 2652 3350 -3620 -8497 -15412 -8948 -1328 6709 21582 30360 21904 15135 19314
15145 19314 15634 -1972 -4774 -73 -4764 7039 17693 683 4670 11020 7416 11545 6452
15132 6452 -4240 -1036 -2270 -7557 -8794 -3762 99 -13294 -18924 -12459 -10486 -11973 -8437 -2301
15118 -2301 -11101 -10254 6695 18662 18397 17997 14581 18726 26553 9314 -158 8918 8998 6730 -5440
15103 -5440 -13351 -6935 11035 18886 20205 24117 7189 -9991 1943 12626 6979 -1475 -12077
15090 -12077 -19063 -11151 -2246 -2741 934 -82 1300 6733 10872 9241 5126 -10388 -17251 -16824 -3372
15075 -3372 -3217 -11656 -6686 -20484 -25516 -17583 -5772 -8687 -1788 5283 6313 10473 6058 -1370
15061 -1370 -6259 -21344 -28237 -21224 -14017 -11006 -7929 -10207 -12364 -7659 -4626 -3769 3480 -14248
15047 -14248 -24595 -33959 -35134 -22464 -15442 861 15360 14102 4635 1969 7148 4128 1483
15034 1483 -8101 -2707 -8709 -6278 -2891 567 6741 12685 6559 14303 6167 10295 12337 17905 17758
15019 17758 2896 -5274 -5346 -1405 9715 26144 32439 28440 21069 21916 32463 26408 13055 15832
15005 15832 22422 26611 33715 28491 30130 31007 20758 27046 29982 23612 38641 57541 87861 110835
14991 110835 128368 132269 116434 93715 83272 73680 56239 37512 51363 50756 36605 28713
14979 28713 23504 17910 11047 3571 1465 -2709 -9082 -8766 -1061 15094 14420 8871 14073 25862
14965 25862 18677 15790 22952 16585 -320 -3126 -2154 -1718 -78 -7160 -5579 3056 12252 11623 11130
14950 11130 11336 20913 21695 19916 4947 -10719 -3836 4838 3577 -2524 -5688 -537 -7182 -7041 6631
14935 6631 24310 22743 21958 13424 11620 16525 6393 726 -7492 -12832 4587 14581 5685 -2568
14921 -2568 -2006 -6304 -4673 -3075 4817 377 -1448 -4253 -5244 -8621 -13372 -17228 -11965 -11467 -3528
14906 -3528 -4537 -6357 -16010 -18488 -18351 -17527 -23027 -18667 -4646 -6148 -4881 -7670 -3225 6459 23117
14891 23117 13520 4081 5248 -528 -1472 -3529 -1961 2677 6071 7908 7383 14651 38399 45014 30082
14876 30082 18821 12674 4897 8387 12242 13708 7128 8924 8493 30 -8968 -7286 -4615 18943
14862 18943 19444 17482 14012 8699 17800 23561 26962 20457 17758 26193 31250 22508 23789 37188
14848 37188 35995 32237 29329 33153 28231 22755 9619 -5002 -21406 -26667 -19678 -9752 11619
14835 11619 16990 16125 18500 23415 28471 34335 31034 20665 25533 23709 12361 5703 9304 9858
14821 9858 16439 9982 -3911 -10161 8656 15373 7357 8475 13223 24985 19038 1305 -3975 -7751
14807 -7751 -8811 -3101 -7266 -15815 -17651 -15668 -6020 -2782 3927 19664 27094 24646 12148 15056
14793 15056 10879 14771 17430 22619 20980 22497 28504 20309 3721 -2213 4924 8560 2526 -8848
14779 -8848 -3702 -201 -2122 10283 11074 8649 -4445 -5350 624 7650 14533 16629 22609 22462 18674
14764 18674 20985 24717 24246 18518 4758 2214 6004 10479 19468 22241 19066 27059 18441 5055
14750 5055 17492 29366 17467 13333 13924 33141 41451 45837 48342 38268 28472 22306 25901 22016
14736 22016 20750 18201 21592 24859 34471 45004 40331 27180 16988 29132 33277 17885 14646
14723 14646 11286 13683 18492 23840 29306 21169 1258 10539 19032 19697 11506 14149 21059 15496
14709 15496 18167 22363 17023 15644 21944 16761 10612 9019 5400 601 -2937 61 7651 19569
14695 19569 20051 23369 27138 12762 10094 17042 16897 15633 16099 2958 1189 10488 9003 -1331
14681 -1331 1991 16635 12443 6636 12510 16348 22113 29250 26126 20209 21117 24696 17125 6064
14667 6064 5157 17468 20320 25308 20739 19565 15507 21491 28723 22616 17768 20723 14817 9214 1152
14652 1152 2251 2138 1613 5402 23792 30162 25029 21939 21257 16431 19889 19845 19356 9470 8185 26837
14636 26837 28449 27053 29291 26994 20954 19046 18333 20006 14805 13386 3417 -3668 8740 20476
14622 20476 16480 24309 26648 31646 33692 41169 35018 20931 19918 9136 6558 6713 7430 17895
14608 17895 29466 27169 21763 15432 10702 22642 24200 19376 20224 16805 17891 21866 31636 42328
14594 42328 42490 33940 27831 21364 18647 23381 25568 30337 32883 33091 35636 34154 34970 31001 30334
14579 30334 24945 31148 36847 28848 14269 25138 41706 49026 42656 41201 28754 28128 34355 31956
14565 31956 25990 39198 46353 39098 42794 47767 50682 30630 26957 27086 32562 36757 37982 43228
14551 43228 48275 53968 59670 48933 45578 74969 77089 56387 60473 56492 50198 50154 72938 84915
14537 84915 81630 83637 88154 89921 92633 97462 115516 137398 168014 204454 243637 320618 458149
14524 458149 670162 966801 1271337 1489359 1580463 1452463 1113388 811659 616080 495942
14514 495942 418522 362309 320209 287665 263359 249885 228671 211758 192872 169736 150753
14503 150753 146085 153316 159855 160629 152194 144821 139652 128502 119004 109743 98836 92081 87309 83419
14489 83419 86500 89369 80306 73325 66264 68271 65272 54823 60682 67661 70611 59683 50757 54522
14475 54522 59279 55989 46628 44272 47233 47092 47922 33354 40005 47324 44686 42778 43971 31326
14461 31326 28211 38643 29060 29221 35248 32221 33175 42501 53267 55206 41769 30370 28669 31159
14447 31159 28208 38360 39661 29730 31722 32276 32587 39268 40628 40482 44404 40675 29644 23408 25314
14432 25314 41060 42916 49136 34171 31077 33023 28955 17084 15834 25669 32375 38203 42404 33311
14418 33311 21345 21048 27305 27934 32142 46670 46583 44794 42244 36464 32646 23242 22791 24239 25394
14403 25394 24420 26008 29824 29989 23720 27418 29206 31653 38212 41239 35259 39634 48536 45561 46646
14388 46646 50807 56877 63573 53992 57323 56375 49035 52716 50000 45968 37591 35107 39516 32463 33752
14373 33752 39561 35726 41290 38527 39130 53062 60015 67691 65879 66757 66384 52952 38114 30249
14359 30249 35530 27682 31803 31981 35990 38962 37406 34993 36043 32381 26955 24837 30460 52682
14345 52682 51731 37199 36957 33814 29835 24414 15522 5778 -1934 -3274 1399 14320 22537 33313
14331 33313 33830 46113 50772 49848 38030 32443 24178 28459 21558 34544 39633 32481 24015 19094
14317 19094 11561 15373 19757 24672 24089 30929 50352 62292 65359 47864 51490 53786 52410 68101
14303 68101 81568 88329 86836 94599 92815 100648 107594 116692 145669 180684 201874 217245 224770
14290 224770 230485 215032 178675 129044 83021 74044 70072 64078 61936 74615 81016 73123 67289
14277 67289 67541 77385 74636 58739 69983 79642 73589 75303 69794 71207 68641 64137 50639 52295
14263 52295 57431 51081 43458 49711 50259 49146 51431 55434 55369 58138 68818 61176 48832 56428 58287
14248 58287 63539 74784 73834 74274 80928 83140 91978 96905 88164 81244 81655 90980 112197 118470 109611
14233 109611 103457 101401 92028 82029 69090 77733 93639 87467 79595 61346 51754 67822 100669
14220 100669 129072 129171 132337 127409 126642 130781 139525 131357 120255 112262 106803 110225 111037 108209 108457
14205 108457 106627 99779 100086 105711 100845 95123 86384 88097 95009 113353 117199 121025 135378 126239
14191 126239 108523 92968 56250 22302 7452 14988 11893 1192 6829 23418 56419 95476
14179 95476 117764 127912 142334 154394 158763 163481 156997 150491 149248 154852 167531 206682 222442
14166 222442 236924 251706 260799 277433 304777 329873 344960 358575 358778 366773 365278 373648 390209
14153 390209 387751 397600 405245 412134 416896 424779 435719 448609 457171 451114 438849 419209 398552
14140 398552 399388 396070 394905 393076 369500 342759 340115 348320 355405 360273 375384 415332 444436
14127 444436 465861 485647 489587 482275 475116 455269 446701 437242 438936 424004 404337 381620 376680
14114 376680 396249 408050 411241 425908 426888 430463 432478 428789 423326 436882 448849 439616 435860
14101 435860 428118 442573 480262 523738 553163 577532 611749 649393 675491 691985 712742 733248
14089 733248 747936 763131 771322 781452 794269 821643 863392 931685 1018198 1116326 1199044 1258949
14077 1258949 1314735 1353491 1412725 1479634 1570027 1663115 1776852 1929545 2102553 2258607
14067 2258607 2428764 2599683 2779434 3012997 3322389 3689042 4089341 4521739 5017227
14058 5017227 5571652 6200432 6953932 7832319 8778856 9823290 10948089 12002005 13252012
14049 13252012 14981660 17317306 20379321 24406660 29926478 37840469 50084826 70695015
14041 70695015 106380823 162409943 225274585 270016136 295975413 286938417 225469016
14034 225469016 159645078 117458694 91929312 75242942 63547768 54813555 47910620
14027 47910620 42280686 37759885 34264458 31635988 29665082 28192828 26985404 25852413
14019 25852413 24626806 23060225 21243678 19517335 17988580 16626305 15435903 14404893
14011 14404893 13534564 12810809 12197143 11655095 11136936 10650943 10199420 9784961 9422842
14002 9422842 9099859 8763467 8400231 8051726 7735033 7444645 7176220 6928623 6697590
13993 6697590 6455603 6211569 5964118 5717169 5472753 5236512 5012901 4812732 4632221
13984 4632221 4478226 4329796 4185401 4066235 3948102 3817425 3693119 3593466 3501449 3408209
13974 3408209 3319319 3214645 3094479 2995948 2897559 2794028 2693484 2614547 2535565 2451446
13964 2451446 2372130 2298267 2225398 2161418 2114259 2072957 2027704 1960058 1880372 1796365 1719779
13953 1719779 1659714 1587968 1520362 1468656 1429216 1391610 1354241 1344649 1344592 1343324 1340281 1330502 1310952
13940 1310952 1291390 1299070 1334234 1390462 1458145 1490577 1473896 1387527 1250636 1123395 1009074
13929 1009074 916226 844525 771989 720061 677691 633274 593941 567223 548990 536315 517085
13918 517085 501511 486824 463502 439588 435613 436028 442144 448528 434976 386023 373135 403030
13906 403030 414351 389277 350700 321730 300267 270609 242146 248399 266113 284429 296026 309539
13894 309539 326203 340352 361445 365635 376888 399238 406319 390419 356256 322870 294631 261827
13882 261827 244850 247199 246963 232838 218829 212984 211589 217861 215276 205614 213837 234065 230086
13869 230086 233312 233306 231151 229273 220868 218603 238894 256303 271120 277127 275930 264775 242229 214363
13855 214363 192626 184049 194001 217212 218128 222914 218825 198711 186094 181694 170285 169899 168575
13842 168575 165564 151266 143754 138452 134439 122049 103330 97826 101533 108816 107487 109908 127887
13829 127887 151461 161163 155617 144875 143910 150956 162948 156129 143075 125130 139963 151626 147080
13816 147080 131683 121668 114489 117975 140303 147855 153461 150414 153068 154804 146002 137156 141874
13803 141874 135871 127824 126231 134524 124144 125368 149061 149668 137090 128750 127533 120396 118169 120951
13789 120951 122487 106558 86680 77633 72517 58726 67159 79568 79533 91950 83360 75785 59118
13776 59118 53382 53914 41057 28491 24602 27911 35147 34806 28564 21179 24183 22892 28951 41188
13762 41188 31357 23955 39471 56248 53819 43678 39796 44549 44216 53324 48138 36966 29896 22758
13748 22758 19203 22921 24413 24199 26930 30247 20558 34584 49622 39174 34189 37462 38929 54031
13734 54031 60089 49051 38008 32774 22800 16653 24738 30188 28664 14139 18643 24043 29164 34039
13720 34039 31299 16045 11524 14633 28611 32039 23935 6540 -2786 5679 1276 -6762 -10771 -8257
13706 -8257 -7721 -2844 16095 24813 10928 3391 4202 4011 -573 1781 14209 10347 4850 11226 12093
13691 12093 20123 22093 9025 9359 6894 2932 11217 19995 19512 18294 21454 17580 13910 20042 26862
13676 26862 35417 31236 27260 22322 18871 10526 20231 17888 22703 23893 29153 21254 9377 3385
13662 3385 5927 6315 -1784 -6034 6482 34206 44201 26348 15017 7076 10617 13639 11230 12222
13648 12222 12893 9655 3993 7587 16493 14252 16950 14874 15385 24199 29471 29180 37982 44891 41356
13633 41356 37616 25003 27649 32110 36273 36593 28698 15332 29042 35901 29795 20756 26898 28126
13619 28126 16734 16336 26502 29692 21847 14916 21778 17395 6346 15216 13558 18171 22128 23923
13605 23923 28508 22552 19293 17899 13238 18175 7450 -1451 -1380 3677 2498 1614 4610 15028 23461
13590 23461 39201 50873 40312 32870 31041 34554 29779 18574 3507 9992 23569 26030 30130
13577 30130 32558 23570 18605 20866 30498 28199 27663 45489 48221 44283 37886 43363 47190 55499
13563 55499 73036 66486 60489 61960 74574 103907 126229 138997 152579 196360 254199 359136
13551 359136 520188 791922 1123686 1383468 1546945 1566082 1327222 972788 705975 534027
13541 534027 437806 371333 312010 272974 246788 228044 219700 207994 195273 180874 165483 155363
13529 155363 143403 131208 130910 130939 107390 102256 94470 90387 80589 68247 67927 85639 83817 74550
13515 74550 70624 66871 69306 70889 63564 52572 51106 60122 60115 57280 50929 47886 54162 53763 41197
13500 41197 27400 19503 30752 29899 27933 32812 32954 21331 16728 26239 40584 52699 47840 41481
13486 41481 26284 20931 26233 19085 23362 29730 18006 -856 1159 7581 10456 3452 -211 12633
13472 12633 23769 19960 9510 9473 16589 28889 37528 24291 14260 10841 15794 13068 5778 15460
13458 15460 14852 11187 14022 17870 21740 17445 14260 8884 808 -1466 -14549 -19321 -1670 19273
13444 19273 35793 41105 25524 8407 -4878 -12036 -7958 -6208 -3330 -7822 -3309 2125 4812
13431 4812 11864 4172 4498 12584 4914 6087 12914 6222 8870 -29 8005 20221 12259 -810
13417 -810 1982 2164 3492 15157 18997 25400 21613 11773 11132 10353 16620 13245 7094 4595 5513 12113
13401 12113 12244 7965 6479 -2604 -4846 -1086 10444 18428 14120 7203 1015 2711 8412 16672
13387 16672 20735 16225 12624 19943 16410 16822 21063 22624 19862 15900 12354 6756 13256 29314
13373 29314 24439 16408 11310 16195 9770 9288 4689 -3089 758 11279 16506 4653 3181 -519
13359 -519 -4565 -6958 1438 13387 20150 11306 2415 -5353 -11766 -5576 -1829 -6469 2779 6410 2175
13344 2175 -8544 -14435 -5893 11448 17356 7980 13888 23799 26707 46201 44899 33211 24490 10797
13330 10797 -660 4405 20077 26289 35902 29303 8785 7732 9299 11554 9381 7838 7380 -7648
13316 -7648 -24098 -20954 -3200 8673 19619 13289 4987 -3243 -8521 -8776 -6901 -2192 283 -9732
13302 -9732 -15474 -20370 -5899 8073 13910 12766 10744 3829 1898 991 -3031 5388 9644 13462
13288 13462 6330 862 -2557 3268 1803 -1375 -8043 -7302 -16641 -15188 -4290 1581 -451 -1220 -7867
13273 -7867 -13591 -6831 3117 6026 -3785 -1389 238 -3737 -8147 -11584 -21596 -13023 4346 16
13259 16 -228 4220 6002 4380 10797 2768 -21617 -18797 -8354 -8824 477 8164 11155 14074 -990
13244 -990 5442 7242 4207 -4645 -1457 2931 4782 6026 15706 25781 25373 18558 8616 -905 -357
13229 -357 1175 -817 7474 4289 6770 819 -11228 -9265 -4651 -5171 -1876 11256 9641 8782 5995
13214 5995 5800 2241 -1554 160 2269 -6102 -8753 -6536 2570 930 -4157 4371 12404 7306 9223
13199 9223 15923 20918 19275 718 -7935 -1532 12718 7853 4144 10656 13811 13964 12007 21436
13185 21436 25670 24582 19241 5623 6995 8973 15143 3171 2736 5020 -9098 2347 1810 -1601
13171 -1601 -909 3372 5590 3655 -6797 -10752 -8797 -6048 1378 -2448 -17732 -24288 -23680 -24744 -15590
13156 -15590 -5164 2799 4980 4744 -5424 -18685 -27454 -21696 -12107 -13016 -12484 -11160 -13720 -16688
13142 -16688 -18460 -13315 -6548 -928 6466 9794 26514 23693 21057 18450 4123 307 10784 20473
13128 20473 17763 2652 -3284 5282 19642 10623 5939 9053 4313 12011 22502 15206 351
13115 351 -6618 -2826 -10448 -16576 -15061 -5436 9665 15382 379 4128 11796 11346 17616 19991 12870
13100 12870 -4604 -12165 -10684 -5443 -7495 -2983 5690 7454 21657 11494 12143 23502 14384 3245
13086 3245 3957 12830 12786 2221 -4154 -2505 -762 -5127 1625 14988 15722 9977 3083 -3946 3875
13071 3875 6872 10166 8732 18786 23111 22141 18338 23718 26740 26405 31459 22029 16019 11797 10556
13056 10556 7440 10877 15427 10016 7976 4612 13768 17856 12415 14999 9849 7815 3485 -5076
13042 -5076 -9688 -9868 -3270 1726 -2084 4012 15847 16275 15899 8052 8070 1898 -8021 -11497 -5375 699
13026 699 9167 15634 12542 18428 9545 3500 -3929 -12811 -8583 866 12496 18520 10612 -124
13012 -124 -481 9828 8053 3629 3453 784 974 13507 11890 7378 4068 7266 18261 17838 1149
12997 1149 -228 11444 12929 2915 7436 19805 11911 -5248 -605 10536 12101 9242 13155
12984 13155 7068 4969 13227 18447 18988 2975 1280 13952 14802 20185 23064 25344 20669 16702
12970 16702 20429 23093 24403 26261 12676 1760 2144 335 -202 4988 8567 21017 25461 19685
12956 19685 9492 5122 371 10378 25347 26504 21800 20592 17449 21799 14674 13666 17948 25246
12942 25246 33537 27980 11997 11639 17466 12075 9643 24007 35638 24293 5132 -4940 9091
12929 9091 22434 13634 10704 15421 8491 6628 17370 15204 6083 -1906 -3213 1454 9737 15957
12915 15957 22643 25208 26791 27933 28712 22651 27273 33167 24455 16981 16101 27355 29732 38622 53195
12900 53195 59944 68405 69672 76985 97593 107135 113961 130219 131945 140629 150259 175481 207097
12887 207097 247763 290486 336557 371656 408480 465326 554095 691733 902992 1246179 1797763
12876 1797763 2772044 4289079 5880396 6951928 7553696 6982270 5150172 3609242 2712874
12867 2712874 2172162 1780835 1500097 1290878 1128658 1006883 912891 836342 778228 712092
12857 712092 659434 629380 587287 541492 511462 477618 443263 417809 395130 358208 332627
12846 332627 310608 284961 276281 265115 248821 236990 237743 229668 201701 188914 188323 181224 171868
12833 171868 160691 155245 145808 135317 138532 141359 136919 129603 121550 120980 127844 123888 114851 110173
12819 110173 98658 103012 118111 113336 106693 93450 77191 66116 67291 73061 83703 77383 66297
12806 66297 69900 77891 68304 68718 69093 63819 68774 73900 77934 71084 59681 50945 46973 53980 54656
12791 54656 52583 48323 48977 44040 39199 39983 33723 27421 27192 24108 25690 28834 32864 24596 24869
12776 24869 32354 42099 52416 42219 45773 39076 34822 44168 37631 28632 25070 24063 15063 15352
12762 15352 26277 29195 21347 5051 -2555 -3575 12070 9808 217 -4571 -1783 8101 16563 18184
12748 18184 20030 34251 33909 31347 21284 471 -1380 14760 18374 14408 11639 5547 9640 13041
12734 13041 15544 16186 20755 12356 2872 -9709 -5933 9427 15227 25392 15972 11756 3242 -9817
12720 -9817 -761 -15935 -15640 -12408 -10508 2712 -5253 -12566 -17999 -24710 -18626 -1026 6931 6213
12706 6213 10600 14405 15500 11571 15450 11103 2366 -7852 -4463 5567 29 -7294 2794 6498
12692 6498 10107 13914 14850 16277 17835 18080 13507 1123 207 1098 9431 16617 4740 634 2968
12677 2968 -6566 -23825 -14387 -8255 -2177 -1935 -312 3288 3776 -12502 -11803 -15122 -25035 -15313 10257
12662 10257 11629 8191 -9325 -13561 -6207 -5076 -9854 -15147 -11319 2150 11440 3036 -2628 -2898
12648 -2898 -5318 3064 3373 7357 15608 9873 -2480 -5891 -4905 -2881 4535 6207 -3762 -6070 -4296
12633 -4296 2251 5181 -6648 7108 13755 9114 7922 3367 2613 2545 -3015 -9363 -15523 -13217 9789
12618 9789 33296 29590 25022 18157 1280 -16150 -13011 -1446 1993 -15164 -17848 -23317 -23774 -12526
12604 -12526 -14062 -14140 -9013 -15971 -23608 -14938 -2381 -5159 -3258 147 1260 -686 -6408 -2691 -7509
12589 -7509 -8878 -8318 -14915 -7253 -1088 -3514 -11132 -10262 -1969 1398 -2400 -13554 -7784 11034 22301
12574 22301 20256 9355 13340 4592 -8721 -10152 -3518 3280 9972 12546 9619 1470 -6112 -5135
12560 -5135 -2143 -11273 -14552 -7202 428 -2923 4378 4982 6398 4175 11077 9976 4354 1558 9203
12545 9203 2475 2331 -1 -6368 -7385 -9156 -9477 229 -2225 -8437 -16387 -8562 6414 10780 11924
12530 11924 -4281 -14058 -11474 6703 23667 12303 4771 13379 5676 -3416 -12064 -13000 -15441 -11285
12516 -11285 -6853 -10273 1212 7333 -5510 -5602 -5722 -3070 754 -1120 8437 12501 16371 22901 16226
12501 16226 676 -5502 6842 4447 -7523 -920 -3176 -1590 -416 5016 17003 16082 9317 9062
12487 9062 10310 798 -4753 -1418 -3718 -5648 -4242 -8888 -10878 -4084 -9551 -22317 -5064 10014
12473 10014 7493 3850 1341 4731 14901 11174 6305 -6694 -9422 -3273 -8135 -10944 -12612 -1293
12459 -1293 6114 -6704 -18072 -23751 -24831 -10367 8962 -2542 -10056 -17617 -16361 -12262 -1568
12446 -1568 1365 -6066 -1449 7099 5282 12023 13733 14927 9543 3904 -13411 -18270 -12793 -4575
12432 -4575 -4303 -11004 -9953 -5343 -4554 -17952 -22595 -10285 -1303 -3395 1184 -3647 -4547 -4087 2614
12417 2614 8071 12475 13300 1688 -8427 -12786 -13845 4871 12209 8415 10470 4431 14254 17886
12403 17886 11454 7438 16277 12544 10351 5380 -1042 6811 15531 9121 -2872 -9481 -2421 2624
12389 2624 -3976 -6631 -8968 -12244 -14107 -10782 -6571 -1741 -3010 -282 4895 7571 4206 -2559 -7139
12374 -7139 -944 8986 11260 1246 -2845 -13132 -22155 -25226 -23607 -15952 -21074 -20338 -8186 -4170
12360 -4170 -385 -2320 -5119 -1519 4750 959 -6584 -5266 -3485 3077 4023 6226 2984 18997 14368
12345 14368 -3938 -3411 10993 14652 6402 -373 6530 9498 12684 7119 13635 19308 10555 12053
12331 12053 17165 14735 13087 12807 12381 8371 -2615 -2799 -11983 -12101 -9976 606 4346 -7451 -8839
12316 -8839 -10478 -1698 -7520 -5327 -1644 902 6876 11246 16540 20389 12957 9938 14854 12004 -1778
12301 -1778 -11531 -11452 -13304 -8446 -1610 -4483 -13393 -16404 -8177 -5215 -2267 -7993 -15323 -8056 -17390
12286 -17390 -31605 -37010 -34219 -21437 -279 3526 -9736 -19517 -13166 -11024 -9713 -11444 -9219
12273 -9219 -2147 -4676 -12420 -6405 -6330 991 -3883 -6361 1449 5398 15085 16514 15815 5634 2778
12258 2778 9938 7581 7988 14503 19293 11653 -8123 -7948 9932 14474 4081 -2392 1589 7960
12244 7960 11750 10502 21299 16671 5703 -13901 -14899 -3228 908 -10353 -14686 -11205 -11313 -16454
12230 -16454 -8975 -2125 -471 -5302 2192 -141 -10160 -18975 1696 26469 25574 19993 7122 11323
12216 11323 9330 7550 11119 12122 13318 16220 28945 36483 40700 45213 62819 87380 129170
12203 129170 202786 280634 324600 346731 339663 269630 179858 125367 94088 69101 58800 49682
12191 49682 49679 44995 42728 43503 50529 46978 34993 45084 51576 48214 50113 44100 38281 21858 17675
12176 17675 22514 18905 28400 32040 32509 36291 28155 8196 4102 4099 3746 8039 11322 16736 8915
12161 8915 4921 2407 -1850 -5852 -5934 4327 15416 18929 13515 16318 4050 -2543 -892 7212
12147 7212 3647 1472 3016 -8825 3857 1717 7095 20734 13163 8269 14259 12470 -374 -1635
12133 -1635 -4344 -12970 -17328 -10221 -8321 -7610 -5318 2746 5577 -2231 -5266 -1983 -5073 -629 -4227
12118 -4227 -3316 -3628 -7047 -4214 4174 403 -11320 -16020 -20660 -14756 -12394 -7641 -10990 -8930 2857
12103 2857 -2209 -2345 7504 -3964 -8322 2473 -2051 -13953 -12269 -2861 -3847 1615 -859 -6970
12089 -6970 -472 5132 8831 11995 10371 4009 1745 -4244 -11801 -11086 -9336 -7862 -6958 -2455 -257
12074 -257 2284 3456 10495 10817 5953 948 7572 7159 20503 21877 13580 3312 4636 2010 -3816
12059 -3816 -21424 -21751 -18978 -12636 -10040 -16657 -2806 9971 1394 -9460 1430 -208 -14593
12046 -14593 -38063 -32482 -15864 -11238 -8126 9052 13673 3895 99 -5594 -6628 -5726 6071 15518
12032 15518 20754 5169 1095 7554 10062 2901 -6151 -1582 4239 25100 30530 14220 2484
12019 2484 -3785 -19939 -13787 -5059 -3237 9697 14154 10874 11991 9062 -636 -7577 -3340 -9112
12005 -9112 -8581 -10548 -14941 -5134 -8325 -10306 -11664 2035 2273 609 -3424 -12021 -6440 11964 8260
11990 8260 5530 1866 -1312 -5949 -9983 -5352 2639 -9506 -16027 -12226 -15927 -27501 -28352 -22921
11976 -22921 -13108 -17160 -13024 -12590 -5160 -145 -5933 -19845 -17718 -1457 -756 5271 -1389 -4004
11962 -4004 -8484 -5466 -233 -5874 6588 3132 -194 6576 14076 22851 10625 16598 9208 2182
11948 2182 -1281 -6487 9784 4824 -11168 -7742 1407 2683 4887 7132 10113 7968 -10163 -20787
11934 -20787 -22391 -11079 -6665 -2055 -4431 1489 12127 13273 11798 14392 8168 -3639 1238 241
11920 241 -8180 -6984 3841 -929 -915 -6753 -6971 -14091 -8706 89 11216 9432 8790 -4035 -4113 9657
11904 9657 19185 18681 23763 21507 26674 31290 20803 3021 3566 -135 -4458 -12602 -13622 -10619 -11051
11889 -11051 -15789 -5201 6921 14745 22584 15925 3823 -2768 -788 3628 3229 1789 -2105 -5760
11875 -5760 -2216 6386 9716 -848 1477 -6374 -9462 -14527 -10947 -2580 3706 -5011 -4534 8924
11861 8924 19789 14594 2168 -7606 -6378 -10757 -15470 -7423 3753 -4848 -4215 2775 10221 6856
11847 6856 14449 -6274 -11242 -8978 -10920 -7518 4791 7557 -8 -15842 -10311 -9701 -4910 7705
11833 7705 6106 336 -6444 -21198 -15400 -11832 -18705 -18557 -12110 -1996 -1746 -2918 -9312 -1710 10744
11818 10744 12938 9020 -4131 -5025 -7741 -6900 -6804 -2123 -641 -4770 -9386 -18382 -18171 -9359 -11571
11803 -11571 -6522 4275 6051 586 -5243 2352 -4574 -8082 -2453 -342 4509 8346 19189 18945
11789 18945 5812 -12054 -20325 -17302 -5744 -4061 -8256 -386 8004 7357 3078 8703 10283 18380
11775 18380 16958 -839 -16696 -872 -1700 -2555 3657 -2762 3902 3010 9676 4338 -3976 -9774
11761 -9774 -4424 8138 -1114 -1653 -14529 -21284 -15915 -11273 -11946 -9461 -6754 -5932 -154 2274 -6920
11746 -6920 -5633 -2197 477 669 12982 27525 16058 3256 17314 14707 5965 2442 -12706
11733 -12706 -24122 -32409 -19387 -5393 -9826 -4459 -9153 -19701 -12167 -2853 7893 473 -6728
11720 -6728 -183 5968 9852 4390 6393 12138 13546 8935 -3135 -5406 9958 23575 23682 6770
11706 6770 9979 7930 -25 3284 -1391 -4037 3831 8570 6301 3122 5497 5266 -721 -9662 -16954
11691 -16954 -18105 -11623 -3717 -6249 -2904 3166 1452 -7100 204 -3015 -9487 -6206 286 6426
11677 6426 7363 16125 11106 17220 12439 -2885 -11100 -12559 -12219 -18122 -20474 -21685 -22708 -15683 663
11662 663 8967 12513 5473 -3148 -8522 -6430 -7514 -422 -3022 -3833 -3128 2304 9664 10131 13530 20494
11646 20494 18455 771 -6010 -3694 -11742 -20063 -21203 -18617 -17280 -12137 5526 4187 -6425 6034
11632 6034 -1678 -5373 -2004 -10679 -13899 -8380 -7707 -10790 -11478 -21492 -11750 4977 8100 7190 3428
11617 3428 -9589 -10054 -1152 2332 2496 3672 -2205 4866 18901 25168 13397 26185 31066 30738
11603 30738 22126 10336 -1173 835 4569 2173 12668 24162 21311 5642 -170 -1801 -507
11590 -507 1008 1681 -2459 -2003 -11656 -3319 6568 -223 -12372 -22862 -23214 -10905 7281 14054 4103
11575 4103 2885 -5711 -8219 -18229 -7963 -790 2081 15452 27147 17950 12362 -7392 -6082
11562 -6082 -6101 -3403 266 478 -18969 -20491 -8560 -2985 2775 -2267 755 15945 15034 -2407 -7029
11547 -7029 -8456 -1466 58 -5076 -2065 -9023 -14336 -11312 -8021 -8615 -190 -3663 -15118 -637
11533 -637 -7301 -14865 -17381 5555 7409 -1281 -3840 -14461 -16558 -13226 -7998 -6169 -14620 -8000
11519 -8000 -3998 -8643 -25301 -26779 -25378 -22051 2200 8973 5354 -1301 -10752 -774 -7700 -20627
11505 -20627 -22145 -18597 -24935 -10550 1166 8298 14963 8979 9092 8750 22130 32616 27130 14891
11491 14891 16451 16778 964 -4103 -5421 -5711 -9186 -3196 6396 7630 13406 11759 5499 1366 5576
11476 5576 18260 20210 13600 15571 12642 3826 -2707 -4682 -822 -7231 -7928 -6187 -8160 -6881 1061
11461 1061 3104 -5710 -6613 2868 5243 3771 3046 1613 7630 5653 372 3528 1248 -1363 8031
11446 8031 8977 8773 825 3263 -25680 -36847 -27803 -12168 -2919 -6714 -4312 4718 -2744 -6353
11432 -6353 -8750 -8099 -7519 -5131 -3866 7237 5279 11238 7518 5938 -19689 -25618 -20114 -12651 -1689
11417 -1689 -551 -11075 -1687 4036 -5494 -12281 -11434 -3616 -16453 -22424 -22408 -22182 -15194 -15135 -9188 -5906
11401 -5906 -6556 -8347 1896 2933 2083 1371 362 -4367 -6518 -1119 7738 13141 9230 11464 7025
11386 7025 1082 1796 -2765 -4391 -3557 7166 792 -4172 -5937 -5720 -6226 -19316 -23607 -10972 11338
11371 11338 11883 6796 4989 4010 4803 -1622 -17507 -20044 -8013 -12478 -10552 -5374 -9635 -4417 -5383
11356 -5383 -14683 -19401 -7750 -7343 -461 -3618 718 7566 11678 8461 10289 4283 -4577 -5880 -3382
11341 -3382 5884 9340 21159 17772 3597 1020 7691 11101 13612 8055 -4943 -1583 2363 13131
11327 13131 20099 7631 -4892 809 13669 17177 2976 -10289 -18255 -24658 -24618 -18766 -15097 -1918
11313 -1918 -9905 -21408 -15880 -15295 -13803 -10158 -9079 -1271 -1932 -13876 -8047 10238 3191 246
11299 246 -805 -603 6804 16637 9866 9187 -245 -335 2012 4101 6749 2736 -2891 10279 719 -17770
11283 -17770 -15097 -2627 3949 -2512 2283 2831 8227 13246 14680 9009 957 -4864 6426 1538
11269 1538 -28 464 581 -1521 4538 11059 99 -15060 -16308 -12338 1703 12840 6913 -1367
11255 -1367 -17684 -15156 3985 14768 17345 3889 -8943 -11957 -19717 -11961 7045 8709 -637
11242 -637 -12058 -15025 -15122 4240 15125 17176 7532 -3667 -10627 -8917 -8239 -6163 -10310 -22433
11228 -22433 -20505 -9950 -13548 -28510 -29718 -15576 -11703 -9613 -5215 -160 -1790 -10885 -4653 526
11214 526 9108 9931 6545 13011 24706 19296 9247 14237 26759 27237 21006 15372 9899 8808 12834
11199 12834 12514 7968 15491 15159 12835 25081 10109 3318 -1233 -9357 2969 6456 -4667 -18257
11185 -18257 -18465 -17219 -17347 -4808 -5561 -14258 -19837 -17127 -9611 -11676 -9060 -14373 -12147 -9154 -15896
11170 -15896 -15721 -5310 16814 25754 24170 17394 9731 9986 20560 11573 3484 955 -10596 -24098
11156 -24098 -26581 -21283 -21965 -3959 6398 -3379 -9661 -9042 2928 3321 -5107 3724 -4759 -6021
11142 -6021 -297 -8117 1261 11420 7337 -5194 -9219 -14072 -16693 -13744 3289 5451 10594 10802
11128 10802 -3100 -617 -1479 1812 1095 5125 5999 -1715 -6555 -3081 -66 -204 5794 8442 4201
11113 4201 -2082 -9414 -11764 -4216 1610 6508 -928 -7009 -8119 -8088 -11507 -2951 -543 5135 -3926
11098 -3926 -13482 -7347 -3636 -4557 -7031 -4469 -16961 -653 8812 13034 18751 8077 -3045 -3685
11084 -3685 -1590 -1212 8758 12190 6042 -12954 -13105 -4534 -9475 -5859 -8137 -7495 -3399 631 1647
11069 1647 -718 -4670 -2031 10572 1801 575 9934 7608 2838 14885 7093 -4843 -1243 1288
11055 1288 -2858 -4215 -4071 -8137 -9386 -836 2018 7468 10528 3924 -1980 7155 14795 11337 15202
11040 15202 13677 3130 730 -2588 2939 -241 -1326 -3746 -2149 -7058 -16962 -18153 -10004 -3538
11026 -3538 4150 4987 2010 12039 5193 6342 12463 7379 6131 6156 8191 2860 11002 6066 3882
11011 3882 -2246 -11204 -8894 -12800 -8549 -4229 4369 2968 -1043 -9243 -10198 3726 3469 8082 5978
10996 5978 73 535 -6554 -16837 -14996 -4088 806 6052 12318 3579 2111 -1807 -8112 -14162
10982 -14162 -11941 -9230 -6338 -17997 -25326 -18179 -20810 -21039 -21943 -32754 -37111 -22832 -7586 -12825
10968 -12825 -13737 -1936 2711 -6389 -15395 -16361 -10835 -8441 -4896 343 -1465 -6617 282 -5 -1457
10953 -1457 2968 -3210 -5190 -13067 -11715 -10246 -8905 -8934 -362 -510 -1433 -7546 -9838 -6769 -4262 -1307
10937 -1307 -6836 -6956 11 4836 -4646 -13942 -21043 -26306 -16424 -11025 -5618 -2626 -7999 -7379 -9459
10922 -9459 -4162 1271 7278 2430 7812 5131 -11148 -12238 -9921 -13568 -15539 -12447 -20067 -24757
10908 -24757 -13583 -11300 -15209 -13628 -3597 -2200 -3767 903 -1062 5993 14253 28226 25950 13237
10894 13237 -6351 -14504 -8839 -4901 -7646 -7702 -12789 -12817 -14623 -12530 -9056 -10377 -15777 -8271 -2304
10879 -2304 -4539 1308 -938 10072 5456 -7647 -23401 -21847 -13140 5600 7607 115 -2790 -2157
10865 -2157 -992 -5056 -2180 -3140 -6546 -13859 -22791 -23670 -8402 -10440 -19362 -18992 -15705 -11611 4461
10850 4461 11352 12565 15050 3541 -859 -1850 2603 4599 551 795 -3140 4593 6617 -8074 -21677
10835 -21677 -15609 -7330 -7633 -5176 -4457 -8976 -4813 -8010 -8887 -14409 -16003 -13870 -16411 -15800 -12980
10820 -12980 -10086 -5451 -1046 -6186 -11617 -14692 -9263 -4206 4713 4612 11778 7137 5191 4841 3931
10805 3931 6552 1207 -5905 -1968 -6742 -4519 -6363 -2608 -3501 -13976 -18107 -9350 2770 7875
10791 7875 -802 -1149 1953 6283 1154 2245 -11167 -6463 -1610 2534 1536 -8355 -1070 10759 21148
10776 21148 28659 14034 -4883 -5906 -469 4497 12670 6908 11590 10462 7823 10096 9691 23004
10762 23004 36584 60300 100937 153040 179451 202383 209671 168706 121429 86107 58776 41074
10750 41074 35094 38589 36652 20689 19157 21350 23341 13190 5080 4386 13556 15420 21533 23840
10736 23840 25850 7874 4902 12762 9375 9106 4132 5190 -368 -1353 6896 2003 -2686 1439 -7344
10721 -7344 -20791 -12051 -652 2278 -1017 -2331 -1751 -12892 -9186 1769 -1126 -1851 6418 16565
10707 16565 2611 3477 14245 5348 2657 -5758 -3541 2657 -2494 -4072 5924 877 -11383 -16793
10693 -16793 -7146 3896 -1708 158 45 1362 2417 2456 -5827 -12073 -13874 -16336 -20596 -19404 -6051
10678 -6051 -2271 9151 8486 14 -2175 5571 10400 16411 8173 -6238 -16444 -14379 -11399 5138
10664 5138 13256 14102 6260 3989 1244 2136 2386 4094 -6828 -13029 -13087 -13989 -17474 -21852 -24842 -15105
10648 -15105 -8020 -1139 5985 10472 2717 -6042 -3604 711 -1720 1046 678 -13079 -19493 -18624 -8032
10633 -8032 -2506 4955 -2567 -14036 -13930 -1072 617 11761 22019 13194 4078 -1458 6459 13921
10619 13921 5827 4011 4811 271 -6304 3931 -2315 3877 4406 -4095 -19863 -14929 -7297 -9489
10605 -9489 -1607 10551 8953 -14170 -25162 -17937 -7183 -6381 -11965 -22162 -15548 -5840 2337 5447
10591 5447 5744 2909 -3056 -3446 -2888 -1050 -19467 -19777 -15973 -17226 -16347 -15011 -11942 -14268 -16673 -25059
10575 -25059 -23138 -21343 -1419 7126 1980 569 778 1599 -5390 -9084 5409 8006 9789 9349 7018
10560 7018 16155 17329 16373 1659 -2663 7143 5525 -4305 -17398 -34762 -38533 -32950 -19065 -6979
10546 -6979 -5797 -10820 -12631 -9681 -5495 -17684 -21143 -11548 -2808 3398 10845 -2862 -4021 -5416
10532 -5416 2933 5669 -1025 -16972 -21773 -18098 -22327 -17817 -11659 -10359 -19228 -18377 -8036 7395
10518 7395 3211 -2538 -14749 -14434 -2688 -7335 -7044 -728 -5675 -21759 -25125 -27922 -18354 -7907
10504 -7907 4707 8943 -6229 -7954 -4245 3467 -1166 7885 1784 692 16172 8357 8818 13530
10490 13530 8229 -2219 -1515 -2918 -728 -5707 -15031 -10866 -9765 1551 -7340 -5692 -6600 -3378
10476 -3378 -13190 -16219 -2164 12989 11486 5129 873 3082 12078 14896 -737 -2457 -2789 368
10462 368 4952 12365 22918 16629 4108 -682 -1525 -6327 -10292 -14968 -23116 -21159 -8014 936
10448 936 -1190 -5677 -11798 -6717 4035 14380 3783 4418 2832 -962 -7818 -1929 163 5355
10434 5355 4985 -2023 -6600 -8274 -1375 9526 3444 -3691 -1204 692 -5032 1364 -3514 -4092 -2061
10419 -2061 -9913 -4600 2131 -5932 -11147 -17279 -13497 1842 8642 2460 5131 13437 -5848 -14281
10405 -14281 -15526 -5484 1024 11328 -50 213 2430 1907 5786 -856 -6383 -11542 -6618 -1717
10391 -1717 1215 5800 6515 11461 11657 13199 10799 9171 9956 53 9023 2564 -6644 -10211 -7025
10376 -7025 -790 -4576 -1787 697 -311 -3149 -6218 -1458 -4283 -2294 3989 7385 6456 -5136 -26783
10361 -26783 -30999 -27538 -26653 -13758 -7116 -9987 -9695 -14454 -15071 -21847 -13377 1552 10748 13857 12934
10346 12934 2353 1598 16141 16479 16404 5943 -6932 -4957 -4148 -8189 -9179 -19270 -23300 -21650 -13835
10331 -13835 -12036 -22915 -15912 -7770 -2882 -1703 3215 2908 3928 -1943 -4678 -5164 1116 2069 3690
10316 3690 6816 5125 3403 9940 15044 25050 17594 10464 10536 8050 8490 12149 10938 1575 -9788
10301 -9788 -10271 -16866 -23012 -13537 -6696 -1005 10054 360 -12123 -11588 -4140 11087 -1409 -13873
10287 -13873 -14119 -8208 -12672 -1770 5773 -6087 -22552 -23999 -23241 -15501 -9004 -1472 3233 1141
10273 1141 5821 -5184 -6586 -5357 -17 2739 -723 5672 2384 -1471 -6734 -19016 -15914 -5153
10259 -5153 -2708 3850 6826 -6529 -11531 -7264 -14762 -12122 -8484 -3192 -7640 -20099 -22605 -12651
10245 -12651 3996 486 -5316 -2738 -846 -4500 -7755 712 10175 18538 12733 -1147 -9263 -13789
10231 -13789 -18689 -15573 -5692 777 -1459 3824 15869 17969 8526 -1255 5485 10860 9699 8005
10217 8005 9557 2380 3950 7244 -5113 -15715 -12093 -15426 -14022 1219 13209 17538 11410 15683
10203 15683 26794 31322 22427 15091 15394 20324 17163 22928 26259 23612 14352 6718 6282 -7197
10189 -7197 -9065 -4784 -1071 -786 2270 8270 15262 6954 -721 -5323 -7923 -730 4592 14722 11624
10174 11624 9033 2985 -9965 -36 8502 6143 8793 2355 1458 3420 5213 798 1269 5947 3705
10159 3705 6512 14854 17245 15283 14136 8264 624 1244 1658 553 9242 9122 -3574 -8848 -11582
10144 -11582 -14771 -10670 -7307 -4899 -7089 1596 10655 -2364 -17248 -21346 -21540 -13894 -6920 3250
10130 3250 2729 -2240 -8452 -8629 -11164 -8527 1611 11398 9109 9382 -1394 -1047 -7772 -13774 -20247
10115 -20247 -6691 1443 5279 896 -5654 -2745 -5506 1912 5550 4501 -3217 1850 15551 9892
10101 9892 6365 13466 26782 22639 12495 3022 12793 22244 27531 24622 44826 79344 127500
10088 127500 158167 188616 204394 195028 156718 117316 79891 51293 36205 33451 32481 34414
10076 34414 42483 40765 38765 40431 54876 56096 52673 50864 51087 37617 29199 15687 7037 4946
10062 4946 -4932 643 1293 10229 12733 9020 15258 16460 8564 -3285 -3503 -4321 -3265 -3438 9499
10047 9499 7522 21262 23466 13904 21915 49841 93054 120455 130989 133309 113640 87185 69408
10034 69408 50957 46439 45426 33823 30061 27938 26154 28430 27571 14617 13576 11448 6585 3249
10020 3249 5444 17297 15911 12113 14205 3755 -5198 -1451 8170 8326 15234 17704 19014 6158
10006 6158 -10750 -14131 -7411 5685 22214 9598 2886 4134 -2502 -11210 -11756 -4581 -7255 -7927
9992 -7927 -3966 -12446 -15185 -13214 -19598 -27202 -23367 -14742 -13772 -2837 11184 14341 14428 15150 7260
9977 7260 -3601 -3309 8656 25109 20875 14891 562 2436 11583 13504 13849 6755 -4309 -13285
9963 -13285 -17179 -3574 -2593 -11188 -23930 -35152 -29302 -24569 -16394 -8669 -5862 -1250 -1423 -6429
9949 -6429 -1735 -5216 -12509 -7973 734 -1452 -10278 -12413 -11982 -15783 -12725 -7915 -8039 -3600 -2870 7307
9933 7307 15262 3765 -6284 -1704 9482 8284 6031 229 3452 2601 3663 4581 14129 12634 13997
9918 13997 8799 8346 16193 17232 13319 8543 -306 -728 -2166 -7922 -11076 -10188 -9904 -5119 289 1344
9902 1344 7613 16527 12557 8594 8725 4719 -5054 -12303 -6272 4226 -1143 -2409 2614 4989 -4752
9887 -4752 -8594 -7717 -288 -1916 4136 8664 15524 24712 20035 14918 5205 -3667 -12321 -12112 -9346
9872 -9346 -17027 -9616 -3464 1748 2339 -257 -1827 4798 3658 -2692 -11072 -2402 -7995 -6884 -6872 -4397
9856 -4397 3815 -1479 -11701 -12847 -704 1509 -5316 -2726 -3455 -1269 5259 9646 12170 11025 8934
9841 8934 5401 -1742 -11440 -14489 -5501 1323 1536 4811 -695 -11516 -3268 12952 9286 -3839
9827 -3839 -9737 -5286 233 415 -4710 -18154 -20640 -14418 -5795 12487 11307 -2075 -5764 -4261
9813 -4261 -7338 512 8278 6688 4891 10510 11610 18964 11969 10064 4973 -1375 -5154 -503 -9124
9798 -9124 -8261 -5217 771 19532 22139 22928 13854 7210 -13189 -7955 -5345 2330 5508 6326 -1380
9783 -1380 -10328 -8161 -7220 -8336 -6494 -11580 -7679 -4912 3496 8302 5108 5391 9217 1516 403
9768 403 -3928 -24616 -20230 -6925 4401 11624 16340 20844 10863 -6108 -17685 -7337 -500 72
9754 72 2382 7550 5513 5405 -1991 -6884 -150 -5302 -15998 -17619 -13679 -15579 -8840 4155 -11066
9739 -11066 -26035 -27166 -11564 -3625 -3743 -1564 -9799 -11106 -12166 -7240 -7780 -6789 -480 1987 6062
9724 6062 14270 11562 22161 16341 2248 3179 -2574 -6561 -3061 -11493 -10732 -12291 -16717 -15118 835
9709 835 -784 -12251 -9668 -3541 -3215 -1961 -7034 -2526 4343 12352 2807 -3289 -12446 -18057 -9441
9694 -9441 1828 8637 3804 1112 12720 17462 9363 4215 -1540 -3441 -7342 -11712 -13323 -13973 -9394
9679 -9394 -2245 -2299 -10150 -10030 -13433 -27431 -23843 -8429 -2387 4206 -1774 -20837 -20570 -12481 7937
9664 7937 7681 3915 11734 13335 3635 7486 8290 2454 -7224 1474 11173 10076 14145 18732 16501
9649 16501 12377 16213 20393 9502 10528 8287 -2075 -13164 -13824 -8860 -5710 -17733 -22792 -4016
9635 -4016 10381 10404 211 -9209 -3249 -2119 -1537 9170 16913 8822 3067 -8016 -9071 -551 -10258
9620 -10258 -6683 -1414 9466 20576 15481 10085 10919 18824 21171 12109 720 -3629 9958 5339
9606 5339 10569 17212 23462 20664 12111 7169 1058 5623 11239 5930 -5428 -5284 -3328 292 3094
9591 3094 13941 15158 6990 -11073 -10759 4562 16986 24640 34624 52263 50152 26185 8653
9578 8653 8539 11878 1592 -5372 -17550 -4424 5378 1883 -5759 -3821 -105 -1206 -4881 -1109
9564 -1109 8556 16346 21167 7545 752 -3239 -7630 -3681 -7289 -372 4703 118 3547 -5385 -24096
9549 -24096 -25845 -18854 -20699 -16172 -18350 -14424 -13701 -17009 -22633 -21759 -19569 -29761 -23723 -17179 105
9534 105 3879 8668 2890 -5086 -1836 12818 -2793 -14533 -13582 -5496 -8564 -2248 4245 8105 15999
9519 15999 16850 11426 10033 8448 -291 -8283 -11080 -7174 -6365 -10459 -7252 1350 3965 9225 6914
9504 6914 3727 -4579 -13231 -16358 -17846 -14231 -16974 -14193 -9963 -6287 8244 3631 -1844 -10043 -16475
9489 -16475 -15449 -2263 1258 4184 -1757 -433 5742 102 -14548 -14736 5695 11744 1365 -7962
9475 -7962 -14540 -13390 3309 14730 11015 6645 -2060 -4657 -12289 -13033 -1701 4885 -473 3401
9461 3401 8223 -5516 8014 13937 104 -2018 2096 6037 9520 15431 7351 5671 12607 8377
9447 8377 3938 1810 -8759 5423 7967 2182 7047 13163 7212 9597 11675 711 4549 9451
9433 9451 9024 8925 13098 7523 1205 10630 21681 20996 11340 12667 3402 8968 15398 7748 -3287
9418 -3287 -9347 -7075 -2401 3882 1274 4234 -1475 -2025 1766 -3279 -11698 -11712 -4428 3976 6393 -3766
9402 -3766 -7654 -6113 -15740 -12822 -715 7521 7278 6389 -4458 -18115 -16766 -15389 4691 3357
9388 3357 -2732 -3972 -6233 -21819 -18233 -16428 -17793 -4009 -2965 500 1986 2555 13072 16709
9374 16709 15388 4502 -5060 -11038 -8561 7529 13472 11216 -9501 -1917 5055 14223 6402 -9221
9360 -9221 -8772 -6992 -9377 -4193 -8491 -9472 -11958 -14767 -20609 -25294 -18319 -4319 -10671 -7438 5824
9345 5824 7288 8235 9248 4625 -874 7978 6404 3371 8899 576 -4328 6739 19394 30408
9331 30408 21161 10262 13975 9008 -2033 -11514 -7362 1717 7300 2986 -5165 -7032 -5144 -5211 -10563
9316 -10563 -499 11325 11329 7594 15757 9021 7750 12028 -786 -20896 -35441 -26254 -6282 -753
9302 -753 6443 12600 9277 1978 6671 14282 6142 1225 -9828 -711 7140 -6469 -10394 1456
9288 1456 8589 5663 -3650 -8610 -4125 12484 16196 16252 10332 6771 7327 13484 10314 6037 8794
9273 8794 8920 13993 3699 7533 9426 11257 8156 20166 13567 14451 18274 6799 3366 3172 6975
9258 6975 1245 -6417 -15589 -5710 -5537 -6340 -9436 -9472 2566 9458 2433 7112 14303 3910 5163
9243 5163 9819 10431 19790 21906 29458 29905 26634 18226 13699 29376 28526 32485 36535 29832 31352
9228 31352 35641 35914 44295 58273 64271 76844 94452 97076 102165 106692 108724 115118 115641 125699
9214 125699 146830 171563 196508 224591 261282 305945 361584 442642 546714 722622 998153
9203 998153 1488212 2425779 3889740 5264693 6118787 6592396 5783217 3971450 2708961
9194 2708961 2031904 1629527 1347681 1145164 987837 862917 760361 688947 637974 580151
9184 580151 529799 497090 485528 466334 439958 405836 382132 363935 338075 300153 276008 260252
9172 260252 255368 249535 243803 228417 207011 199700 193492 180543 177720 169402 165150 164346 158794 146036
9158 146036 134729 133737 122087 122968 122104 119946 102920 103297 103679 110901 124089 116874 109704 104058 93682
9143 93682 88287 80546 72844 82061 88266 81777 73045 55996 42738 39026 40620 52702 59188 63186
9129 63186 56484 49456 41543 41021 33829 24810 20668 19525 22794 25502 28161 28148 12111 8839 7023
9114 7023 20561 30023 27865 36248 41650 36573 40108 45216 50099 58257 47552 37830 22313 16211
9100 16211 20074 17115 15582 24559 26817 24176 30453 26792 18933 17497 23079 25693 28367 22756 35723
9085 35723 30128 26900 29160 21342 -5068 -6133 -5102 -11100 -11738 312 6991 19356 19521 8411
9071 8411 4862 9334 6681 -2042 -3449 -7728 -6061 2270 5450 2671 -1451 -4551 -3783 -3876 -2291 8229
9055 8229 4263 -253 6513 14235 15183 12166 8069 23551 29593 25552 11006 -3183 739 1223 9537
9040 9537 17956 25392 20810 10888 1650 5296 361 6102 11307 21277 23989 28058 28814 18145 4609
9025 4609 2818 -1160 11706 15240 16487 12763 17587 13635 8341 3725 2614 -6639 -5850 -2467 -7674
9010 -7674 -12073 -235 7991 27126 28032 10950 13296 11084 6932 1777 -819 4509 -2525 -13115
8996 -13115 -16546 -16483 -6693 16 1165 1488 384 -11694 -12486 -528 9686 9519 816 8766 20028
8981 20028 10671 6220 3484 -2093 -6359 2157 11575 9008 -2674 -7193 -7145 4880 7658 11032 15239
8966 15239 17831 13477 9335 8279 2338 5335 13886 14306 126 -12393 -2756 5467 3480 -2101
8952 -2101 -2749 -7166 -10736 -2958 78 14390 15146 13196 20482 24464 22369 23315 3978 -2372 1008
8937 1008 -13318 -39366 -35914 -25658 -22409 -19278 -19958 -23501 -25042 -25630 -19576 -17919 -18002 -13946 -19482
8922 -19482 -14219 -10645 -4690 9663 7051 -4510 1299 1526 -1418 -12525 -4272 -7193 -20644 -24576
8908 -24576 -27499 -9703 570 -3072 4635 7352 3728 5315 4849 4951 7086 7988 3151 1160 20960
8893 20960 20954 14270 6974 11524 3300 9850 11009 5068 12426 17865 11852 1818 1926 -6874 -4325
8878 -4325 -198 -4488 11297 15522 13500 -8180 -12507 -9814 -3315 11168 11112 738 -9942 -10528
8864 -10528 -6762 -7159 8612 -1720 -6524 7189 932 -3927 -356 -5011 4393 18548 13495 17690
8850 17690 17602 18186 11792 -2163 -6776 -7977 -6770 1918 26464 25010 7130 8271 5971 579 -2438
8835 -2438 166 -917 897 4496 -4 -10726 -10959 3575 11422 -1117 -8373 -11119 -8531 -6521
8821 -6521 1806 2020 -426 5117 17926 14449 6053 -2983 1097 5065 13058 -1309 -1958 3387 4553
8806 4553 3186 7830 19114 8197 12030 4481 1104 18002 29209 29668 29689 26242 22231 25109 27212
8791 27212 26283 14782 11502 12056 16045 7040 -4150 11733 21631 19749 8151 9235 17132 15579
8777 15579 21597 11320 12239 21996 13679 13764 16099 16670 -3518 -12730 -10076 -7218 3460 9459 6356
8762 6356 3926 15559 23354 17163 5444 -3072 -2182 584 -13292 -13383 -3016 2580 9617 -1490
8748 -1490 -5490 4757 5069 15964 14639 3154 -5972 -6843 -4308 4292 9120 11609 5510 12182 15988
8733 15988 8989 3751 2921 15769 16146 17685 18258 12162 3857 4808 9544 3782 3167 -2897 -12354 -21821
8717 -21821 -16287 -9388 2922 6304 7693 12113 12285 6067 2427 -884 6495 16238 12324 2545 6482
8702 6482 9689 8700 14073 416 2509 3540 6849 6185 9049 8465 23932 22294 22318 5716 -7040
8687 -7040 2062 2937 -17755 -17461 -19597 -12149 -11583 -4974 -8677 -11198 -6003 -2682 4997 3581 7029
8672 7029 12983 13114 12820 5668 -5296 -10714 -9065 -3367 11030 12366 7637 8907 17548 9204 -2159
8657 -2159 -3324 -10221 4503 6217 -7408 -12285 -2701 10247 9882 14356 20294 16352 9989 10301 1390
8642 1390 9144 3122 1439 9452 4607 3660 14805 28237 25914 17960 5124 8821 13666 19004
8628 19004 -215 -3328 6632 18039 20039 22396 24452 22203 25340 31961 29152 14405 9346 2299
8614 2299 3391 3769 -2368 -3880 -2885 738 1550 147 20391 20891 18584 19423 26365 29872 33982 21468
8598 21468 20594 16867 27049 42436 41897 33607 40759 46933 70156 73478 77334 83868 86375 91340
8584 91340 90906 80651 75617 69155 64279 58685 56692 56311 41055 26940 31645 39216 31813 23468
8570 23468 27616 34392 31304 34287 38353 36753 24661 17042 8672 5704 3244 4693 9194 4714
8556 4714 -2874 -8132 1760 1888 8745 12116 15241 13026 11146 17524 23086 21864 27388 30569 33054
8541 33054 21064 19912 21504 22444 20172 16459 14058 -111 -1166 7527 24470 29669 18492 8897
8527 8897 4886 10273 11979 5838 22167 33247 26682 21858 25757 29969 28814 30439 24007 10793
8513 10793 610 -6929 -25086 -13042 4933 7747 1626 1371 -10234 -12365 859 3903 959
8500 959 -4824 4379 13522 18582 16264 3664 2519 1663 -7104 -11865 -20153 -2451 14453 2024
8486 2024 -3459 -3429 6039 11895 15805 17209 23710 17549 26576 26631 26708 20800 10708 3649 351 14106
8470 14106 16100 15988 21282 11529 2194 1874 16803 23450 18544 16427 7684 -12765 -4152 10626
8456 10626 2226 8527 14029 16207 14833 14327 12969 1508 2480 9986 10049 11378 18151 6883 -6287
8441 -6287 -11275 -5174 -1778 -6021 -2412 5663 11981 5708 2327 1664 5312 9664 6992 6721 6781 4753
8425 4753 -11948 -20148 -20370 2702 11692 8603 2963 -8157 -17610 -17184 -12415 -7813 -9630 -3758 2159
8410 2159 -3696 -7890 -9240 -14073 -15326 -10244 2568 4355 1234 -1181 -5293 -10854 -16425 -7509 -819
8395 -819 -1730 -14106 -24897 -32349 -29375 -20583 -11989 -1179 3516 10316 12681 12578 6294 2486 10477
8380 10477 16768 23293 24093 10488 -3627 -6290 -9125 -17368 -12780 2927 4212 2650 -13493 -22213
8366 -22213 -24318 -19001 -12782 7441 -8812 -12312 -2231 3416 -1731 9934 14873 9875 10562 4807
8352 4807 9424 10145 2079 -2222 586 -5284 -3837 5144 5013 2921 -1796 -1764 -3201 -504 2085 8336
8336 8336 4954 3219 3977 4467 -3859 -1123 7210 11697 14231 29037 35680 20500 8314 800 -6440
8321 -6440 -10805 -1883 -3338 -12638 -6968 9932 18384 17023 5246 -300 -14964 -17643 -11437 -12523
8307 -12523 -12437 -4510 3064 781 -564 3137 6243 1828 -157 -3254 1660 -989 6217 19387 27053
8292 27053 21147 22717 22413 15729 11032 9959 14695 11609 408 -1284 -9255 -10868 658 9780
8278 9780 2024 -695 777 -7825 1356 -73 -4619 -2757 -4524 1027 5729 2778 -3965 -8197 -2006
8263 -2006 7758 15645 12237 5546 9875 14186 7035 9049 536 -4507 -193 -708 -4353 -12913 7098
8248 7098 13418 3246 -3646 -13904 -5657 3034 9879 13009 12061 16158 14944 7807 15459 -2323
8234 -2323 -9370 -11187 -2246 -2419 -5846 7651 14696 20297 25848 14721 91 2150 -4539 -14041
8220 -14041 -9179 734 -1370 5640 17163 11951 -6526 -4600 5848 8478 20072 28421 35934 29668
8206 29668 14665 912 -5011 -10494 -9500 -884 923 6625 996 7190 7468 -469 -10408 -4991 3553
8191 3553 9509 13422 13246 6537 -5641 -10774 -4571 -3878 -1965 -8996 -14328 -9828 4864 5709 8503
8176 8503 5676 -8385 -5306 -1239 -2408 -9937 -12238 -13121 -15865 -4834 70 7541 19561 13353
8162 13353 4202 3177 4198 2167 3120 -3370 -15212 -22274 -14115 -20333 -19023 -16789 -15361 -17240 -31846
8147 -31846 -30854 -16618 -12975 1996 14180 9758 7726 6269 15214 17926 9085 6301 12019 16029
8133 16029 16280 8806 -1525 -793 -1154 -4204 -156 11671 3393 8555 24709 35249 45477 43281
8119 43281 31231 27052 26416 24851 19633 17606 16176 11335 13155 8435 3063 9970 19437 18430 257
8104 257 2037 7684 -7802 -13296 -11533 -15551 -7832 -4319 -4331 3095 17112 26302 18185 7082 1460
8089 1460 -4760 -7597 -4113 -1049 1048 8150 -2129 -11595 -12143 -7265 -5059 -1895 -524 1508 -7831
8074 -7831 -6811 5298 -1758 687 3784 7926 737 -10652 -10819 7188 3310 11330 10798 5554 780
8059 780 10514 15369 12894 8794 6048 18624 17726 1907 1274 14244 19314 10037 -3388 -13021 -10022
8044 -10022 -11204 730 9846 6969 800 146 7481 15062 9419 1445 3297 1940 4308 4614 14230
8029 14230 11223 9507 3610 5873 -137 8779 13969 9826 6451 15763 21994 23673 25456 26263 13136
8014 13136 7962 2780 -4676 -3223 1713 2549 6954 17305 22685 19657 5577 14830 26448 32198
8000 32198 24797 10163 6550 2155 -911 -301 1506 1398 9050 17731 29886 32282 39965 37810 34763
7985 34763 26582 17066 12414 17789 20881 32037 40408 27778 31154 43574 40007 41252 25332 22480
7971 22480 26468 27676 17683 13185 3215 -882 -2231 5858 8529 20167 17085 13535 23710 27118
7957 27118 24365 25476 25370 20621 11281 19405 30789 43054 51303 50996 50225 35519 30194 34955 44998
7942 44998 42057 42302 33531 30796 29586 33133 43338 42787 39373 28821 34359 43872 34804 30332 25881
7927 25881 18133 21871 19454 24279 21073 17496 17943 18406 25709 17916 28056 25625 13424 27662
7913 27662 46142 40335 27177 26695 26956 16675 14923 15970 1930 -3449 10395 19109 18432 22722
7899 22722 19728 23282 22438 24935 28606 30534 41074 47634 27869 6020 5528 7813 -5594 1040
7885 1040 6126 712 11834 12900 -1256 -3969 -258 5918 -3005 -9023 -10419 -9532 -9722 -4242 6133
7870 6133 24731 19195 14558 6459 14230 11337 15959 13315 6981 6813 5490 -5337 -10019 -3796 2420
7855 2420 2410 -1695 -5812 -12437 -10543 147 2887 7220 8598 12572 24954 28221 10814 -8966
7841 -8966 -3460 743 -4786 -6066 -4911 -11155 -19244 -22475 -22780 -15213 -15414 -15776 -18367 -11790 -14170 -24314
7825 -24314 -16225 -9222 -13391 -12786 -23811 -28433 -18650 -9729 -10836 -4450 6999 12117 20104 31764
7811 31764 33908 29141 26200 16616 3639 -1716 2392 6164 12684 17782 12509 1511 3514 3879
7797 3879 5771 9086 4356 7569 28392 37342 25515 15755 5713 -1535 7637 14590 4987 -964
7783 -964 -264 7036 -2156 -11483 -7336 4251 -1824 166 5075 -2267 -8339 -6846 760 1561 -4980
7768 -4980 -13223 -14561 -3993 5201 4219 2874 -15113 -14893 -8955 -3402 7153 7345 -1701 -16517 -14810
7753 -14810 -13764 -15838 -2492 -1658 2315 -2580 2000 -6356 3034 17202 13846 11242 953 2156
7739 2156 -208 -8055 -7337 -16814 -14678 -11910 -18781 -6454 1254 4809 15514 15575 5748 -2564 -13201
7724 -13201 -15041 -13724 -8980 -8181 -13873 1613 10469 12520 -874 -5098 -10688 -7650 -9846 -11345
7710 -11345 -18685 -26056 -16383 -10837 -8999 -6882 -936 -111 -7570 -12408 363 -2865 -6087 -677 6654
7695 6654 11322 10091 13082 1928 -2309 -11863 -425 814 -2552 -6299 -6450 -12278 -13572 -9430 -20200
7680 -20200 -24794 -16005 -8180 -4593 -8055 -8493 6240 13013 13175 6664 4857 5734 -3241 -16772 -16983
7665 -16983 -4676 -3105 -2882 -14864 -23085 -11785 1084 7709 5447 -1997 -3861 -3983 -2748 999
7651 999 -6100 -6735 -817 14670 10970 -1731 -7398 -13759 -16448 -10343 -10574 -5571 -2049 -13104 -14074
7636 -14074 -7396 -5537 -4150 -4250 -6932 -5880 2424 1714 -11127 -10702 9608 12317 7048 4359 20370
7621 20370 28172 24672 16660 11044 3784 -9055 -3949 12092 14031 14453 5810 -8431 -11289 -8891
7607 -8891 -8057 -4869 -8548 -13536 -8248 -14765 -9352 434 1831 -705 -4344 -12070 -7236 -7809 -6096
7592 -6096 -14024 -9826 -9113 -8903 -6985 -108 494 2649 -682 -2332 3264 1009 -5404 -7532 -11047 -2791
7576 -2791 -4645 -2883 -6285 -2685 10844 9634 7734 1828 -2724 -9422 -13830 -9219 -7861 -12243 -8566
7561 -8566 -12953 -14745 -342 4406 11546 18987 13342 -4151 -8448 -10526 -17055 -8892 -6547 -796
7547 -796 863 3422 4184 1100 4505 146 -1271 6056 6737 5502 1721 -8908 -12306 -6675 83
7532 83 -4716 -12955 -3990 -2208 -9790 -10316 -11845 -18122 -20205 -13070 -15224 -12092 -4806 -2528 -1707 -3717
7516 -3717 -1522 -332 2891 15370 21800 22221 17228 10218 6428 8981 5074 2058 3101 5361 12487
7501 12487 17847 22336 21539 27807 22149 11509 6509 1006 -449 8262 10624 7254 4820 893 5990
7486 5990 7498 11193 11431 8469 9146 7564 5185 2209 2193 3466 -4731 -11960 -26149 -22000 -17238 -9537
7470 -9537 4582 8212 15896 6398 -2549 -1689 -1520 -11715 -17302 -12124 -17515 -19408 -17506 -12820 -14138
7455 -14138 -23486 -10978 2304 373 5018 3264 11491 11396 -10444 -26330 -36189 -30761 -27534 -3919
7441 -3919 -2082 -8022 -25195 -26867 -22171 -23030 -11985 -3657 -9078 -16873 -14436 -2450 2642 383
7427 383 4801 8022 -656 -3743 -24083 -27472 -25820 -16278 -6920 8269 13108 10776 26105 21117
7413 21117 -3387 -3316 -10661 -18363 -9513 12343 20745 6591 -17286 -22456 -24607 -31025 -31367 -28822
7399 -28822 -17306 -13294 -5681 -3810 3551 2449 4094 2327 -15769 -13047 -1752 4146 4786 9408
7385 9408 13459 4825 888 -5336 -5773 -5929 -1545 -7327 1166 -1449 -5675 -11947 -10220 -12008 -14755
7370 -14755 -8604 3150 2451 -18562 -14993 939 1907 -5415 -18103 -12273 -19656 -27513 -20875 -5945
7356 -5945 -2131 -6971 -20902 -24955 -14801 -3573 -4109 -10455 -10560 -16818 -18753 -24176 -20524 -28501 -33083
7341 -33083 -14227 -8484 -12951 -435 6164 2010 -2664 -323 -981 491 -5934 -1737 6152 827
7327 827 -3454 -1989 3373 8994 5623 -9148 -13437 -12656 -7582 2070 1033 -818 6413 14573 14221
7312 14221 3985 -1103 8472 13036 4944 3552 -6619 -3415 9739 -4000 -9037 -4576 -2072 -8288
7298 -8288 -16995 -19535 -9062 1642 4162 -9204 -7011 -2417 5016 8579 11861 9723 -850 -16972
7284 -16972 -12395 -11087 -11761 -7997 -9922 -15810 -16158 -22080 -24482 -28533 -24584 -13608 -6564 54 304
7269 304 544 -1045 -9345 -6198 -2759 -6558 -8143 -12157 -10233 -16184 -12695 -9587 -17826 -19096 -15099
7254 -15099 -10251 1072 -3016 -4743 -3636 -9661 -7429 -10546 -14373 -32211 -25808 -23907 -29270 -36531
7240 -36531 -27227 -13762 -1107 1599 -6169 -5150 -2291 -1002 -5506 7270 4569 2888 -7016 -17381
7226 -17381 -15773 -20035 -23185 -17195 -10696 -11835 -1841 978 1862 -1232 -1608 -15037 -3691 -8082 -12638
7211 -12638 -11032 -14459 -16699 -12744 -5605 6527 11110 6163 5174 -935 7932 7474 21815 28482 21653
7196 21653 13059 -1627 -17846 -16986 -10807 -3187 5326 8155 -1392 -1225 981 5185 -1248 -305 -9546
7181 -9546 -12490 -10174 -15774 -31800 -19516 -13360 -20065 -19109 -11086 -21435 -10581 -6019 -4562 -7736
7167 -7736 1368 8786 15910 23121 17796 733 -5397 -798 -4974 -10487 -13361 -17142 -5964 -6861 -7508
7152 -7508 -10827 -11906 -3033 -852 -3574 -4463 -902 2860 6557 -1297 1090 -153 -3608 3769 -3775
7137 -3775 -9145 -12140 -8105 2229 6593 -3661 -6073 -2516 12310 17122 9470 9514 1830 -5826 -13805
7122 -13805 -18642 -15207 -26640 -24334 -13436 -3285 4246 12931 17321 4785 -11604 -15889 -14384
7109 -14384 -12813 -6961 10047 15756 739 181 -12385 -14404 -7514 -5075 -3182 286 -5767 -8711
7095 -8711 -10245 1107 8057 3821 -4254 -2124 -9256 -7956 -4073 4766 -9579 -8729 -14407 -11480 -9997
7080 -9997 -15007 -22557 -14174 -10599 -21040 -33899 -32686 -17975 -12923 -13713 -3137 -2042 -1003 10445
7066 10445 9408 14033 10206 -693 -862 -8157 -7757 -13055 -13293 -17518 -19144 -9751 -458 694 -11028
7051 -11028 -3565 6522 168 -5004 -13229 -13009 -10209 -18545 -21104 -24036 -11395 742 -3251 -17465
7037 -17465 -16519 -4850 -10962 -17936 -22720 -20634 -13162 -12559 -9303 -12202 -15702 -10381 5692 361 -4369
7022 -4369 -4106 -7092 -9401 -1831 11063 13868 1534 1222 5300 8443 14801 13091 23255 17141 1742
7007 1742 -10169 -10229 -8291 -2036 8927 7717 -4722 -2867 -4863 -10803 -3829 -2214 -10863 -3434 -7238
6992 -7238 -15380 -4950 -2142 465 8905 4105 1994 -7806 -8234 -6319 -6089 -5541 3517 9126 -327
6977 -327 10810 8454 6566 -7898 -23339 -13682 -16227 -14779 -6478 -593 3134 6246 6537 -2630 -6846
6962 -6846 -2480 9200 5950 2479 -8275 -4762 -2658 -1786 2221 -2300 881 -5315 -5883 -5033 -10335
6947 -10335 -14143 -6928 1869 7276 6985 4801 4871 3851 9189 9484 -5170 -3187 7745 3595 -7571
6932 -7571 -14907 -16687 -13892 -4902 -4129 -955 -2820 5885 6467 -9969 -12352 -12626 -12070 -2292 -495 -2600
6916 -2600 -7907 -5311 -1353 8588 7837 3579 4264 5717 4156 9140 6112 3470 11402 15221 11511
6901 11511 5861 -2441 -191 -5419 -8165 -1088 -3433 -6946 -1546 7459 18793 17152 3157 -3307
6887 -3307 -3982 -6377 -5834 -14469 -27446 -20680 -24738 -16948 -11890 -17729 -17427 -3939 1586 11071 13179
6872 13179 2793 -2052 -6622 -2616 -1247 7172 18013 9858 5203 -5571 -11339 4605 -4284 -12224
6858 -12224 -6029 -12842 -4322 8021 4119 -2466 -4276 -6297 -3324 -3388 4358 11000 16592 12928 -9371
6843 -9371 -23817 -26354 -29167 -29345 -21245 -18296 -5760 -981 -7335 -8181 -8191 272 -186 -3184 524 391
6827 391 -287 7569 4355 168 2043 7442 10486 4833 -8960 -14226 -20348 -13599 -6422 -14785 -22118
6812 -22118 -22077 -12572 -2455 2711 -539 -2402 -10116 1956 15069 16630 8242 -6496 -11050 105
6798 105 777 -6440 -5334 -5160 -8107 -935 1709 -4098 -19755 -18366 -13393 -7004 7217 8420 17724
6783 17724 18621 9986 -2165 -11333 -19162 -6942 -7587 -8620 -11470 -33568 -40226 -23075 -8156 9738
6769 9738 5479 -8913 -8229 -5199 -4837 -8375 -1490 12054 11706 9374 956 -10659 -17514 -13647 -6728
6754 -6728 -5349 -5894 -12492 -16885 -16250 -10904 -1540 527 825 378 -2767 -8242 4165 13399 11741 14965
6738 14965 17636 25122 27994 34907 23999 1098 -470 13249 26289 42104 74153 100887 122594
6725 122594 135935 124880 107395 96555 71357 45324 25086 22351 20251 13403 13695 18779 16541
6712 16541 16765 15539 13203 20880 19506 3557 90 -9164 4864 18614 23215 20819 20801 16342 11665
6697 11665 21046 17692 9943 11231 13868 23646 34142 23884 24394 23875 14812 7238 -1292 -9591 -20464
6682 -20464 -10184 1186 5913 11093 12684 6139 6593 6869 600 -1436 76 10313 9093 11414
6668 11414 4457 -1951 -10356 -572 8128 15447 19137 16780 13674 10537 13465 19066 14423 10920 3428
6653 3428 -4418 -10038 -9794 6599 -2809 -12998 -5702 1978 -5208 -5749 -16146 -16571 -3497 -8947 -16475
6638 -16475 -3264 2886 3830 5793 -3559 -1503 2688 5169 3348 -2784 6504 5961 -2565 -5078 -11030
6623 -11030 -7855 -6481 -5930 -8837 -9716 -6657 3682 -883 284 9428 12416 12890 10521 15125 11780
6608 11780 2954 2941 740 6160 10684 10326 19061 15669 -6068 -7532 -17995 -25117 -24164 -32305 -25884
6593 -25884 -13070 2445 -8343 -2546 2402 741 -4149 4262 16354 10244 -2010 -3190 9697
6580 9697 18328 28230 19299 5212 -1268 -7465 -6912 -3484 1716 2189 -177 -8045 -8472 -1434 10447
6565 10447 22554 17346 20826 23121 12839 646 9815 518 -14121 -12668 504 10886 6945
6552 6945 -4213 2273 2366 1162 5030 12598 14676 12615 13967 14458 17290 10360 7164 -7919 -10449
6537 -10449 -4765 -3572 -5919 -3733 -4020 -5923 -2061 1778 -6082 -10115 -10521 -7720 -12405 -14447 -12659
6522 -12659 -3630 2525 15821 20884 18282 5641 1452 2495 10626 5314 -7695 445 4260 16558
6508 16558 11976 -257 -7418 -4421 -1760 -10384 -19627 -11166 -3664 1963 11908 941 7920 20635
6494 20635 24645 14501 13905 3381 -13339 -4144 -7322 -18002 -17146 -16464 -7846 230 -17654 -13706
6480 -13706 -3715 2627 3389 -1468 -5801 -10876 -9042 2677 10546 2905 -2338 11200 8652 -17825
6466 -17825 -25059 -10868 3987 1431 -4787 -10912 -4578 -2092 7674 12192 6126 16750 24998 18733
6452 18733 8236 8426 11544 6093 2760 7819 11070 2497 244 -2915 -10169 -1047 -2697 -12125 -7797
6437 -7797 -7233 -13236 -12298 -18013 -4274 -965 -9453 -4712 -2718 -539 9896 7468 5170 -2084 -14595
6422 -14595 895 9094 5755 6499 -142 -4478 -5100 5180 5074 -6650 10687 30948 32996 30286
6408 30286 28843 18703 5684 5519 8473 5053 -6706 -25001 -18915 -14675 -14096 -19173 -22060 -22032 -14189
6393 -14189 -10126 7747 14599 11837 8468 6511 8653 6400 -7165 -7412 20376 8787 339 -4997
6379 -4997 6156 13553 16292 7325 -2445 -4090 -3682 775 2787 8052 2645 -5324 -11114 -16094 -19954
6364 -19954 -15563 -4136 1848 8120 1240 4271 12346 4124 -2943 -455 5132 2928 -12949 -18281
6350 -18281 -9911 -9107 -229 -5357 -7868 -4383 -15818 -14488 -9646 -7141 3636 4449 9582 4502 -7555
6335 -7555 -3683 12088 5935 -3622 -3969 5776 -5544 -21484 -21529 -13505 -7745 -1791 -805 -16486 -24749
6320 -24749 -21224 -21863 -7084 -18503 -26858 -22221 -26111 -24991 -20469 -24530 -27723 -28776 -18318 5078
6306 5078 8709 8220 923 -5608 -5877 -2635 14720 11596 1373 -4972 -22229 -24133 -25505 -20438 -7059
6291 -7059 -15588 -22101 -27110 -21070 -8123 -8236 -12974 -1292 7754 3766 -6954 -8897 -8489 -11143 -22654
6276 -22654 -10075 -8229 -9691 44 -5235 -10976 421 16488 12635 12727 8907 -7500 -7398 -15927
6262 -15927 -18826 -23623 -21873 -15492 -8535 -3925 -7220 1305 2579 1051 803 2558 13388 8943 -1365
6247 -1365 1316 2123 8679 9516 11782 3835 3746 10432 24036 23903 14621 7882 7119 10117 -2083 -20671
6231 -20671 -14792 471 10603 4803 9709 5021 1623 664 16826 18427 20877 17697 13735 7189
6217 7189 3185 10653 5368 6700 6327 11226 9652 4642 632 8927 -5119 -13856 -5544 -11543 -14621
6202 -14621 -10165 5096 11477 9462 3560 -2751 -16375 -13561 -15455 -15640 -14070 -25194 -28845 -25475
6188 -25475 -15440 2087 10239 22088 18621 -1510 4930 -3237 -13644 -14002 -13060 -18337 -15263 -11179
6174 -11179 -5989 -7497 -3203 -64 -9463 -14275 -10615 -9032 -5235 -11078 -6411 -3735 280 -1170 -4039
6159 -4039 -3519 -16673 -31691 -28691 -19942 -6677 -3744 -5131 -4910 -11996 -6734 3734 -7955 -18163
6145 -18163 -17724 -18741 -9125 -3181 1588 1778 -8357 -5853 -17502 -10121 -4327 -17851 -16971 -10816 -937
6130 -937 924 808 -8902 -20022 -10098 -4645 -2574 1757 4715 2644 -14886 -20133 -12290 -4215 -749
6115 -749 2688 -959 -6103 -16160 -27559 -24713 -19589 -4580 -1031 -10275 -12723 -14209 -13253 -5679 3389
6100 3389 15138 10942 86 -6278 -9729 -5164 -261 -8822 -6078 -2631 -15605 -17571 -7380 -13850
6086 -13850 -17626 -1804 11112 15081 7143 -8417 -14556 -15600 -15266 -11096 -8287 834 -2896 -7420
6072 -7420 -5571 -5284 1920 -2931 -6872 -8922 -5903 -1294 7230 12867 14251 18223 6695 1586 18192
6057 18192 11754 205 7020 -8650 -2866 7310 17562 15351 7058 5048 -428 5858 8071 12270
6043 12270 16470 25700 18520 13329 14308 11760 1295 2274 -4579 -1574 784 -6490 -3529 -6479 -8638
6028 -8638 1068 -3773 -8829 -8631 -2395 -4690 -3522 2253 9803 6103 590 -5296 -9363 -793 9959
6013 9959 16940 11492 -2611 -12253 -7154 -8945 -9256 -16920 -15727 9602 16248 13890 5780 -3871 -6896
5998 -6896 -4242 -9465 -12529 -9185 2019 1612 -265 -6479 -4403 -7772 -2548 4312 1070 5441 9236
5983 9236 10173 -6622 215 10877 6893 6344 11143 3361 -4825 -8083 -21488 -19519 -14816 -29342
5969 -29342 -37255 -23414 -14917 -4680 -1971 -3818 -6760 -3286 11901 12309 234 2204 917 -6659
5955 -6659 -8421 -9957 -12852 -7331 -2758 6562 7658 7441 -2078 15038 17655 -4339 -4571 -7778 -10131
5940 -10131 -4804 1559 -2645 -4023 -5064 -2804 -2875 -12844 -8307 972 3579 4635 -3410 -21225 -22911
5925 -22911 -11067 3515 24537 26408 18978 6062 -2592 -3052 -3163 1855 9514 -9596 -13205 -6417
5911 -6417 9108 9528 137 -11167 -15197 -15765 -18760 2189 12651 6076 -5861 -11437 -11196 -5227
5897 -5227 -538 -3737 -7667 -7617 -3506 -6570 -9881 -15977 -19156 -12527 -3439 7894 15892 4488 -4160
5882 -4160 5150 15716 20106 12172 7229 13766 27429 26746 16480 7753 -6666 -5860 -18514 -15543
5868 -15543 -19359 -21618 -13671 -12507 -4841 -3998 -5446 -5352 -9441 -11679 -22801 -16637 -815 10063 6903
5853 6903 12722 13477 6512 -1420 312 6573 11309 13017 10619 4662 1540 2728 1520 -3842 -5313
5838 -5313 3879 19135 16222 11965 9110 5414 -691 -459 -1524 5761 5443 -1505 -11207 -13269 -10604
5823 -10604 2216 2943 -10539 -13543 -4176 4201 -2772 -10427 -1710 4708 12661 8164 11952 7575
5809 7575 3654 3453 -3062 -7263 -1951 1541 55 6358 3230 261 2071 11900 9026 -10099 -14252
5794 -14252 -5880 4592 29 -3122 -4189 -2124 -7683 -18527 -25715 -12846 -11833 10360 15626 15210
5780 15210 687 -7309 770 10984 787 -251 -1861 4608 10421 9735 8165 942 -8520 -17035
5766 -17035 -17875 -18525 -15114 -5164 202 6623 14679 13824 3255 -5818 -8845 2916 11529 1526 1718
5751 1718 3506 13216 13479 12690 20401 28448 21451 16578 7986 -1271 6965 2753 -3526 1131 5204
5736 5204 1546 -2578 2788 2020 -5353 -15661 -19166 -2651 5718 15029 21661 11999 7686 -2760
5722 -2760 -7106 -12301 -15820 -16724 -4502 616 10076 20442 30133 23648 19939 10506 -2513 -11614
5708 -11614 -12548 -16212 -12108 -8965 -5497 1239 1446 -973 -10996 -15270 -4071 -2157 -2543 -2143 -12988
5693 -12988 -24822 -28718 -16646 -15104 -11248 -10832 -9479 -5005 3924 2910 3293 11069 6802 666 -9237
5678 -9237 -14121 -6055 530 11244 9604 7386 4432 -3114 -4626 -6636 -11413 -6867 5436 8339
5664 8339 13589 5519 -355 7995 -1397 -13049 -12639 4016 17523 16691 11047 3222 -8870 -6299
5650 -6299 -6679 79 3088 -8973 -22695 -24182 -9719 -1335 164 3191 3824 -1542 -1933 -5125 8336
5635 8336 12195 7559 9527 11765 11756 6814 4140 6112 -92 -12580 -19960 -7972 -1062 8759 6294
5620 6294 2553 1241 4882 4505 -1070 -6014 -3805 5763 1472 7633 10729 14207 5640 -1396 2434
5605 2434 -2985 -8455 1625 9484 11504 3901 7771 19731 21724 2546 -5295 -856 3773 10397
5591 10397 9797 6267 3650 12171 -878 -4711 8852 10734 11151 14680 21438 23642 10389 14467
5577 14467 16906 8281 -3778 -964 6983 8239 1475 3227 8504 14671 10927 -3432 -17564 -4529
5563 -4529 8903 13095 16414 11278 -6241 -7875 -15267 -9798 10228 8655 5607 11124 14411 13705
5549 13705 9569 7776 8494 20857 23195 11748 5361 8333 -7274 -22901 -17971 -6975 -5085 -9952
5535 -9952 -9946 -9431 -2674 -6974 -14942 -13013 -9304 -8320 1043 7123 13608 14463 20884 16688 -3804 -11119
5519 -11119 -4336 -2836 2037 -7204 -9227 4319 20547 22255 21161 8501 7670 9830 8472 17621
5505 17621 11853 1247 596 3872 -9762 -12866 -13579 -1222 -3350 -3652 -3520 3289 -1697 -14306 -18924
5490 -18924 -22197 -11283 -2145 11765 7350 -2513 2789 -3507 -4631 -791 -6333 -6436 3484 1311
5476 1311 7451 5465 -2585 -427 -4856 1075 1573 4640 -10107 -16604 -23980 -11558 -1603 -1740 989
5461 989 4743 7299 5656 7460 -5631 -7395 -6252 -16792 -10161 -5901 775 -15448 -13244 4664
5447 4664 13909 20090 18294 22886 23512 28345 30965 25071 18821 10174 6872 -1533 -5032 -4348 -15029
5432 -15029 -15419 1650 43 5960 -5329 -5746 -5569 -1124 -1523 -5439 -2165 -535 -326 2038 12700
5417 12700 16722 6986 4586 13325 7985 -10329 -10593 7366 10991 5057 -2326 -442 3087 455
5403 455 2226 8541 5041 2163 7587 7186 -2173 -1242 16884 15009 7358 -4353 -4476 -691 9993
5388 9993 12786 11882 11963 11700 5944 8152 -4006 -11761 -13408 -7322 -6455 2822 9242 213 -3950 -12398
5372 -12398 -19000 -12072 -7629 -12106 -19876 491 17664 24347 20930 6456 -4300 -6637 -8394 -10002
5358 -10002 -2637 2424 2396 -591 3322 15797 15795 5300 -8850 -18057 -11538 -5497 -1789 -125 1638
5343 1638 4526 14895 8242 -7995 -13669 -5253 -8115 -11160 -19905 -16980 -6155 2921 4552 -4200
5329 -4200 -2220 -6594 -949 -329 2402 3217 4118 -6579 -13581 -8402 3863 12018 15582 7914 1806
5314 1806 2175 681 -590 5997 4643 -2292 226 -10826 -13737 -8335 197 9848 10686 -388 -511
5299 -511 -7243 -7130 10551 15593 2622 -9043 -21999 -13417 5059 10891 10863 12959 16504 9941 3228
5284 3228 4286 4638 15180 14265 6623 11760 10805 3662 8502 13476 6903 5629 2864 120 -5831
5269 -5831 2151 -5202 -2783 -1561 18385 23801 8903 156 -3674 4061 -155 -8397 -9399 -1449
5255 -1449 -5227 -5316 -7541 -3466 2631 9508 6903 -1201 -17665 -20754 -3831 16146 26478 20089
5241 20089 7190 11399 13083 11957 12825 15343 19042 11780 14507 16852 3353 -3584 3994 1137
5227 1137 6828 6462 1998 -15530 -13507 -6901 -11670 -5040 -6789 -20093 -24159 -12365 -11891 -1150
5213 -1150 -110 926 -101 -3141 -7122 2237 3988 2825 -257 -1703 4350 805 -1997 -9953 -20519
5198 -20519 -6179 5612 5698 -358 -15193 -17690 -19070 -11416 -9486 -4838 1005 11450 25977 16582
5184 16582 7195 1929 -4928 -9831 626 7221 14493 15403 10680 12364 10905 -1075 -1519 3744 1559
5169 1559 -6142 -3103 5023 7273 5364 15719 11536 8305 7994 6160 13065 10917 17198 19164 10359
5154 10359 -5696 -11730 -7556 281 -7469 -16366 -14090 2850 4861 -20 -1286 1452 -927 -1102
5140 -1102 -1521 -1036 -2019 -283 11899 16684 15772 13295 14198 14393 16178 24502 26406 13843 2261 -9041
5124 -9041 -11577 -3762 -1485 -2129 13674 9988 5882 6599 25976 15288 -4606 -18741 -13384 -7069
5110 -7069 -16685 -18910 -4379 10679 17718 7979 6305 8196 -598 3016 553 -2355 -2385 -2895 -5383
5095 -5383 -3148 -8807 -9593 -18873 -28572 -19342 -1075 10750 9634 4290 8977 13257 7698 8384 9479
5080 9479 -4486 -17088 -16307 -19551 -23159 -18885 420 9515 24514 21001 23195 21693 10052 14086
5066 14086 8878 -3314 251 -1915 6387 -1137 -14126 -16668 -2995 16366 7401 10206 9071 -1027
5052 -1027 5137 9880 5852 -7341 -23554 -28136 -19749 -6163 546 -2588 -22375 -22322 -18269 -15238
5038 -15238 -14559 -19223 -9496 -5728 3419 4176 5150 1951 2693 -4333 -591 1763 1735 -3673 7568 24248
5022 24248 12166 7074 4408 10466 16637 11509 5477 -7223 -7173 -3286 -2476 14818 18408 12486 3858
5007 3858 -2475 -2371 -494 -9408 832 3613 -2817 -11156 -5689 -388 5151 -2212 1804 2409 484
4992 484 4055 -9708 4324 17084 25614 22216 12920 -2188 -327 14141 13842 12642 10634 17915
4978 17915 16622 8423 -4153 1549 -1958 -2163 -3019 -11078 -6099 -7034 -13224 -1044 2386 2380 -1038 5418
4962 5418 11332 8133 5141 2469 3499 1269 834 2051 -8208 -4705 -9382 -19093 -5350 321 5979
4947 5979 3697 -1888 -3436 -8518 -15322 -3072 4840 10982 10918 7378 -1235 -7160 -2861 -2698 -5648
4932 -5648 -8643 -5788 -6520 2876 3162 -2342 4349 6602 -371 11693 23787 16737 2300 1714 -1992
4917 -1992 1914 7386 1519 -13209 -14506 -3623 5163 850 -39 -2988 4028 2267 4608 12231 -5133
4902 -5133 -17693 -14080 -17669 -20026 -15312 -18481 -13036 -12205 -11449 -7058 -2331 -2465 -3664 -1008 8296
4887 8296 4072 1262 2283 -411 -9168 -10499 -12381 -26889 -19156 -21331 -26777 -23734 -24330 -13809 5883
4872 5883 2681 -1307 -6174 -5934 -16802 -32724 -38338 -31495 -17636 -13377 -2788 -1913 -9665 -6195
4858 -6195 -404 1262 7261 12451 7635 4079 5690 5816 8153 14249 16604 1254 4668 2361 -4303
4843 -4303 -10413 -14287 -9181 -3407 -2898 -3149 -7521 -10309 -18067 -15263 -12439 -4574 -3494 -6955 -5516
4828 -5516 -4603 -6916 -18920 -11778 3671 6515 5788 -3048 -8918 -16430 -20951 -20999 -3405 8413 3505
4813 3505 5797 4556 -6292 -6496 -966 4143 6036 -6396 -8044 -1164 -3580 4278 23959 19721
4799 19721 16555 5463 -10689 -8427 1454 8548 1108 -9606 -13147 -9239 -10744 -1841 8646 15972
4785 15972 29285 27413 6363 -2890 1125 2734 -5320 -13717 -14779 -10228 4665 11370 9635 4875
4771 4875 6247 8012 3282 -710 -10685 -12529 -12343 -6018 -9450 -7247 -11134 -10446 -11206 788 -3079
4756 -3079 550 3518 -1385 -10364 -12586 -18726 -14857 1293 544 7297 18956 10822 2032 -7429 -7021
4741 -7021 -1259 -8447 -13785 -3866 -9137 -4653 4731 -4966 -9538 -9879 -9537 -5596 -10073 5 3189
4726 3189 -2362 -5209 -2788 898 4217 -2037 -3905 5973 11637 15973 19916 13253 -4099 -28018
4712 -28018 -20657 -13003 2505 6897 11914 3621 -139 -10152 -18503 -21824 -17791 -25239 -29861 -18338
4698 -18338 3987 2892 352 741 -1127 -1445 4392 -5287 -7416 -3613 -1362 -10024 -16140 -16280 -8970
4683 -8970 -10323 -8185 -505 7862 1920 -10376 -8803 -15867 -17398 -6817 2799 16128 8923 11952
4669 11952 14915 10449 9509 5343 10734 10668 2929 12752 6317 1828 11500 14211 8362 7344 395
4654 395 -3085 -14529 -11888 -6644 -12493 -21716 -11995 52 645 -451 -1366 4001 8763 12020 5716
4639 5716 15232 27999 22070 25314 21288 19256 14431 1787 -5173 -2936 -4166 -4936 -18197 -27792
4625 -27792 -26751 -14194 -6219 11673 19128 7612 3287 11508 9126 2848 5635 5978 -767 1102
4611 1102 -842 -2537 -3674 -2387 -7584 -2276 -14676 -23756 -22917 -12937 -858 3395 -4521 5239 10608
4596 10608 12658 1506 -3852 4156 154 3849 8150 9617 5826 7953 12290 3497 -1848 9038
4582 9038 17589 2557 -9725 -6137 6326 1108 -3104 -4247 -3340 2934 2289 -5676 -12935 -12174 -7705
4567 -7705 -18839 -11728 1041 4053 3275 3792 15942 21698 20989 6846 -12911 -11551 1196 1017
4553 1017 -10683 -17658 -20854 -14348 6170 13286 18721 14280 18855 19770 12589 4591 13832 23553 12093
4538 12093 13758 31022 22856 13327 13773 8463 3704 15493 19470 18952 12322 3486 -7723 -13735
4524 -13735 -7963 -1700 -6869 -11917 -5609 -3783 9458 4538 247 4604 14341 14762 14818 11893 920
4509 920 -670 943 6644 11225 7186 -2167 -5309 -2675 -10007 -13668 -5215 7444 3991 3716 13976
4494 13976 -6354 -16023 -6602 6400 531 -3007 -4779 1537 8198 5376 -3467 -7272 -3724 -10063
4480 -10063 -5451 -1111 3579 -4977 -8629 -1782 -4373 -23905 -23729 -17300 -10867 -18351 -12403 -9185 -5240
4465 -5240 -1752 -3191 -8047 -4927 1052 -6203 -16836 -14227 -16839 -2449 17010 22807 17424 8647
4451 8647 8334 15949 17464 20058 16775 11534 2777 3066 -4596 34 6914 5253 10603 16480 27368
4436 27368 22155 11436 7689 12603 8389 8533 4579 2198 14536 18949 27054 20942 3723 -5864
4422 -5864 969 -5867 -2000 11717 23308 22480 12080 -49 5662 11855 11371 2039 -847 3397
4408 3397 11758 1404 -823 -504 -15387 -14799 -3737 4251 11748 14551 1985 -4601 -4267 -6271 -9717
4393 -9717 -8404 -2246 4410 5317 5310 6775 6564 2783 -2617 -12958 -6831 -7130 -6225 -15250 -18065 -11594
4377 -11594 -12759 -10404 -5723 2687 5841 -2565 -10671 -23532 -16177 -12311 -13365 -7632 -1169 -12019
4363 -12019 -9392 -7983 -4734 -3353 4525 5841 3875 7387 410 4863 8377 7976 4824 -4127 -4426
4348 -4426 896 -8064 -12194 -10196 -1022 3519 12590 3087 -1417 -1681 -5395 -3711 -8025 -12026 -10892
4333 -10892 -827 -6440 2590 19900 13645 7043 -250 -4021 -6658 -10005 -7285 -4643 1917 2412
4319 2412 -13439 -14564 944 6896 10174 11688 2749 11139 9862 5675 -2737 -15033 -20992 -16150
4305 -16150 -12428 -7351 -2279 -7888 -8884 -4217 -2584 -830 -5119 -14533 -14195 -10079 -5504 2253 872
4290 872 2840 -4622 -7407 -16849 -14756 -11286 -5298 -9637 -2778 6814 1066 10213 18965 8794 7015
4275 7015 10229 16672 22586 20585 14267 10898 6973 12168 11164 6358 -1172 -5682 -5927 -8861 -9364
4260 -9364 -9777 -16784 -14163 -7243 -65 -8339 -19583 -20422 -23604 -5379 1697 -3343 -11090 -6336 -5023
4245 -5023 -671 6211 14757 19542 19572 7734 2480 -1596 -6239 -5777 -2501 -5923 -12539 -4170 4527
4230 4527 11161 1050 -13940 -16981 -17063 -13328 -8654 -4350 2899 9987 7222 10358 11601 13040 11503
4215 11503 6504 1360 -1847 4930 10259 3609 -5173 -17412 -30509 -25970 -23824 -16759 -12485 -13003
4201 -13003 -15038 -5309 7376 -4568 -13046 3679 10572 13251 13187 19011 21114 13482 -1264 -13706
4187 -13706 -21048 -18678 -12876 -7459 -10729 -17440 -13947 -13116 -7041 619 9046 19981 21223 16101 3792
4172 3792 -13034 -11523 -15880 -17504 -7739 1126 1198 11301 11104 14115 17803 12666 1582 1907 -3876
4157 -3876 -8895 -11383 -4775 1956 5994 1466 -7775 -15621 -2959 -11050 -14454 -14012 -6439 -3017 -15480
4142 -15480 -19083 -2198 -873 7359 10277 8116 26128 25166 8430 2027 5450 10414 7593 3007
4128 3007 -9570 -13684 -11943 -9682 -12645 2311 504 -9958 -6737 -442 9911 9025 2360 855
4114 855 4316 1117 -3979 -8561 -11277 -9611 -7124 -8877 -9825 -15151 -15217 26 10766 6118 842
4099 842 -3910 -12096 -9260 -10765 -17548 -18146 -19033 -19152 -11409 9713 19920 6803 -2020 6901 16283
4084 16283 13902 2845 -4503 -10387 -10953 -5090 -8584 -5901 -9270 2721 4875 1176 8322 -2213
4070 -2213 -9110 -5161 1692 119 -11057 -9694 -4262 -4797 -8203 -14184 -13394 -10094 -11538 -16262 -9930
4055 -9930 508 -3232 2068 -896 -10257 -9853 -5101 -12031 -7737 356 15463 21074 9283 15884
4041 15884 21354 27155 20566 16301 7983 5525 9672 -1680 -17110 -20168 -17611 -18450 -15620 -7963
4027 -7963 -7655 -11807 -2807 4284 3697 -4339 102 8279 7233 9577 13476 11762 -1520 -11424 -7738
4012 -7738 -2571 -5007 6458 4551 -4563 742 -8143 -15096 -9485 -3127 10146 15021 26080 13266
3998 13266 12754 14093 7905 -7329 4168 18538 25223 18101 3312 5783 7223 11907 16373 87
3984 87 -12654 -13213 -5670 -10147 -11736 -9514 -19667 -23859 -20366 -16758 -24661 -22418 -10717 -5685 5373
3969 5373 585 -6986 -14481 -16780 -14042 -18515 -4955 6744 2803 -1697 -3340 2306 4401 -3297
3955 -3297 -5132 -961 4545 3231 -2041 -10835 -10366 -21150 -11794 4463 16092 17653 7606 2677
3941 2677 -12068 -21396 -26781 -17122 -12540 -9352 -9824 -5628 -4536 7485 14766 -2808 -11151 -7467
3927 -7467 -7072 -17776 -12681 -6034 -11173 -17268 -12095 -1009 -194 -3675 -2415 -6320 -12159 -23452 -23967
3912 -23967 -13932 827 -4449 -9663 -3360 7635 8675 4824 1306 -4709 -3896 -4884 -797 4541
3898 4541 15183 12877 10804 3517 5104 9618 3391 11470 8689 4888 2056 -1989 -9177 -5773 -5060
3883 -5060 -448 -5797 -11531 -3929 1847 -2402 -5178 -4543 -10581 -6924 -16640 -19386 -9885 3957 -6213
3868 -6213 -6446 376 -1306 -12169 -11437 -2739 -2786 4050 439 -3953 -8702 -8502 -16227 -19111 -19974 -29348
3852 -29348 -23320 -9619 52 -1000 -7683 -16703 -15674 -11907 -4860 7529 -1077 -9100 -9451 -8153
3838 -8153 -607 8173 12342 11638 5579 -2798 -14933 -16606 -9951 -11186 -11172 -13478 -17583 -17121 -12555 -15230
3822 -15230 -17034 -15863 -6570 -8065 -6461 2490 11237 18578 20922 9666 -1293 -5748 -3994 540
3808 540 -364 -9740 -12795 -9277 -9956 -4867 -2523 6053 5858 -432 7226 13604 19039 13529 7939 4974
3792 4974 8075 -704 -7027 10553 24783 21301 14436 15450 1117 -5829 -3766 -1004 -9364 -703
3778 -703 11008 16695 21106 20759 14921 16151 13136 15951 11050 8904 5926 -2238 -7572 -5775 -9858
3763 -9858 -8978 -15754 -22473 -5098 -192 -14150 -23513 -18184 -13983 -5274 2134 1578 -6440 -7098 -3785
3748 -3785 10290 9455 -375 -8029 -15644 -7491 1870 -1783 -5898 -3148 -914 1660 -7961 -8695 -871
3733 -871 4551 7195 -9510 2150 1553 1077 2341 266 -3058 -5221 -3167 -5565 -1750 12094 17499
3718 17499 18844 15707 8928 7896 5245 15529 20126 8059 -2753 -12307 -17586 -10165 -3533 -12237
3704 -12237 -8159 -9456 -4393 12874 20158 12795 6645 -8701 -19919 -10739 -4132 1030 1801 -13
3690 -13 4323 5368 16053 18292 11085 528 -7767 4532 1558 -1929 -11283 -11160 -12703 -16317 -2503
3675 -2503 -865 976 -7124 792 1899 -6683 -20004 -29835 -28998 -23924 -9818 -4186 5490 7389 9584
3660 9584 14319 20413 9199 4647 -6128 -15122 -17975 -20933 -23899 -17363 -13658 -13731 -8684 -8621 -5293
3645 -5293 3521 -2192 -2172 -5866 -10251 -2006 1286 1948 -4029 -5488 4924 19151 9028 -7423 -13320
3630 -13320 -12165 -4616 -4596 -10332 -9586 -5199 8551 12635 12962 6118 6080 3285 3301 3785 4336 1960 -1462
3613 -1462 -4356 -12080 -9245 -2645 -3867 -4659 4107 1378 -7107 -12047 -7108 3331 486 6049 -1825
3598 -1825 -11806 -22402 -12857 -6286 -475 -7921 -7720 -10414 -14106 -10192 -10122 -557 6466 -4460 -2384
3583 -2384 10441 14285 9184 1465 -11903 -22623 -10539 -7173 -4654 -237 7209 3830 -5133 -8222
3569 -8222 3626 8106 4468 -1296 2048 -2987 -32 5293 3910 1295 1533 -733 -20836 -21043 -19540
3554 -19540 -22330 -22513 -14428 -10534 -2450 10611 -1919 -10650 -5831 -7072 -20763 -8426 -1358 -4719
3540 -4719 -10430 -15655 -3969 2476 3277 4588 9256 11229 9750 1141 -20765 -21867 -4159 6137
3526 6137 2518 2996 3825 -5779 -8661 -10724 -8622 -10409 -12630 -23808 -33839 -17437 125 5082
3512 5082 10146 17376 28035 13636 868 -1046 -3457 -2360 -176 -2424 246 -11856 -13621 -14074
3498 -14074 -20912 -20077 -14832 -24539 -32182 -27771 -21746 -22029 -8839 -9193 -2101 -2300 3223 -1224 -5241
3483 -5241 -733 9097 8465 -3084 -19204 -15335 -6533 -781 -1288 6740 4788 -5344 7275 1114
3469 1114 1416 3474 -3067 -6642 -5395 -9053 -15699 -5914 -3135 1710 1638 -5533 -4563 28 -7237 -6625
3453 -6625 -11731 -9586 -20024 -17838 -5911 -3506 -11983 -15411 -14706 -13258 -9758 -5103 -12862 -15045 -8790
3438 -8790 -12600 -8634 -230 2006 13284 8378 6207 7324 7489 4517 3088 1087 7437 9836 7514
3423 7514 -3045 -12377 -8673 1749 -3685 12488 21726 25677 21438 17504 11104 9122 13503 10875
3409 10875 5079 -2948 4632 10908 1807 -2123 5661 9132 12202 912 3868 7007 3538 -2868
3395 -2868 5823 6108 -6492 -10497 -8713 -8039 -14271 769 18154 6401 2562 4015 2857 -1029
3381 -1029 -6032 -6251 -10637 -28486 -22730 -15195 -12218 -15893 -21154 -7553 -10527 -10512 -10303 -10775 -5864 -7480
3365 -7480 -4997 -10365 654 -7383 -26186 -14078 -624 -2807 -6869 -3515 -11929 -14525 -5384 -2935
3351 -2935 -2642 2143 11591 18677 9096 -5582 -19862 -8424 -4854 3171 17304 21563 21 94
3337 94 15222 18202 15535 17549 19536 19892 18182 4677 4020 8865 8961 5130 1477 7506 9232 -1112
3321 -1112 -14249 -21446 -3796 -1167 5827 11823 1108 -10637 -14685 -7671 5557 2631 344 -6889
3307 -6889 -6234 -4346 11900 14839 634 -8192 2639 8531 17648 19301 14166 3002 9377 8512
3293 8512 14030 17761 11073 13667 21905 21869 18094 18972 22205 15575 7654 4714 5503 11823 14242 10793
3277 10793 19227 18699 13004 15227 12396 3761 -4756 -6600 -12377 -25975 -23665 -11919 -7383 -1683
3263 -1683 -6814 -1843 -663 -5072 -17332 -8095 -8693 -13156 -17845 -14311 -10025 -6279 -1534 -11533 -18990
3248 -18990 -10400 -20748 -16113 669 3863 2255 -2152 6177 16331 4606 4539 8091 -1133 5389
3234 5389 3467 -4356 -11132 -6168 -3127 3208 -575 -2118 -6365 -14162 -12164 -6373 572 5480 1509
3219 1509 2933 -530 -3029 -4326 -11911 -13182 -5772 -1912 1839 -190 -1555 4718 13689 16225 21262
3204 21262 17607 7745 29 -7353 -10777 -9390 2530 15083 19801 14540 21545 24562 15756 996
3190 996 -11233 -12853 -6402 -3821 3113 18145 10417 10048 10629 226 -12326 -3236 1841 562 2884
3175 2884 6223 -4133 -2022 4218 -951 -11366 -6456 5092 -5740 7463 17140 17129 854 -16082
3161 -16082 -10922 -3724 -503 5442 7785 8414 -1707 -19627 -25617 -24769 -13018 -14346 -18088 -17782 -13580
3146 -13580 -85 13844 10476 3288 -1017 -111 6518 -1689 3751 10542 2641 -3804 -6963 -18949
3132 -18949 -17118 -11027 -3356 1303 -8256 -13490 -10840 -13155 -12552 -4635 1501 -578 4949 1529 2413
3117 2413 9169 10832 3205 5246 13096 17136 6320 612 1070 -7927 -14859 -10389 -5072 -3583 -8819
3102 -8819 -4310 1315 175 -4873 -6591 -1975 1339 -2477 -3291 2374 5385 3042 -3247 -3915 -6414
3087 -6414 -8925 -4296 -475 2250 6007 8073 8859 9353 -4488 -8556 -6219 10550 13385 7167 460
3072 460 17 7677 6422 -2874 -16690 -12092 919 3508 4423 3992 5623 1817 12727 22142 6488
3057 6488 -12075 -4802 -6200 -14712 -7552 -512 -13710 -14459 -1027 -7448 -10357 -12032 -5555 -3959
3043 -3959 9978 9886 16579 8482 12110 20467 10677 -2206 6960 -3718 -18185 -10046 -4238 -5635
3029 -5635 2276 1839 883 398 -7722 -11354 -15581 -17105 -7105 -3710 299 -15044 -12796 -4717 -3282
3014 -3282 -11940 -16175 -6535 -5094 -8279 -2713 43 3990 5408 -1991 -10325 -1573 7836 4272 13277
2999 13277 8660 7860 16884 19902 21128 25073 23221 16856 9988 -4632 -9309 -4260 -12369 -19960 -21328
2984 -21328 -14667 -1265 1296 2880 176 349 11909 12385 6362 -4134 -9918 -14992 -14623 -11497 -13181
2969 -13181 -12551 -9027 -6972 -5231 2927 6556 3056 14296 18860 14821 4636 9232 10425 11611
2955 11611 7309 -2896 4062 8454 25075 29448 4211 -12342 -1780 -395 3572 -3679 -14097
2942 -14097 -10407 -3886 8436 18447 20326 10337 3147 5310 9302 -3492 -4750 3797 1161 -6896
2928 -6896 -734 6194 12658 16515 7989 -992 -6682 -10998 -12952 -10385 -4464 -4433 -4993 -3018 1849 5783
2912 5783 8577 -430 2233 -3535 -13033 -7497 -6169 -3820 -6579 -12352 -7642 -2154 -7310 -16277 -3704
2897 -3704 8098 9949 7822 10207 18459 25001 16739 4752 9495 -1877 -18910 -3665 -2228 -3007
2883 -3007 6852 9482 11334 13945 12981 14143 7087 5101 9206 6788 -5076 -3699 10949 17086 25933
2868 25933 29958 16911 12210 10674 10600 2539 0 515 2890 1923 471 -4018 -12043 -12518 -11366 -20171
2852 -20171 -11626 1624 8283 12860 7419 5885 10674 16093 13901 18697 18822 11989 6005 16886
2838 16886 11288 10790 15853 10750 -1545 -2772 1417 8221 1161 -1143 -374 1556 487 -282 -5419
2823 -5419 -8831 -11189 -6566 1654 5351 -6040 2522 17996 17511 3562 -8058 -14976 -11876 -12986
2809 -12986 -13422 -7476 1370 -215 -4440 -5048 -6669 -3328 3 -4232 -10779 -9557 -4009 -681 -1287
2794 -1287 3869 8633 19153 20874 20923 20595 10823 13933 22334 12907 -2468 -597 -86 -7744 -9729
2779 -9729 -2232 2817 17416 17708 10393 3088 -5814 -14475 -19853 -16858 -8450 4240 6585 2841 -7239
2764 -7239 -8381 -7707 -6971 -847 -5034 -5608 -5638 -5338 -2682 -7177 -10469 -4499 878 5783 5908 6378 4302
2747 4302 1471 5257 -4759 -13101 -854 10485 5464 1214 6515 11807 9542 2295 3449 4540
2733 4540 3388 7246 3677 11431 15681 3628 516 7667 -437 -10600 -9738 -8458 -3267 -3436 -2175
2718 -2175 4073 7898 11116 7605 10418 13603 6001 10019 5222 4305 -2702 2626 15153 11601 6322
2703 6322 1204 -735 4571 -1262 -8273 -9083 5960 4427 4711 3167 10462 19642 23555 11003 4184
2688 4184 7951 12600 10501 6039 9773 15299 14067 6553 2188 -6423 -1860 -9848 -17062 -14455 2854
2673 2854 1283 -6821 -7909 528 3282 5849 11474 5283 -2710 -9486 -18588 -14560 -1393 -2924 -4072
2658 -4072 -6082 -1984 -3200 11326 16322 11945 7170 3136 -6854 -10339 1262 1472 -2314 -1301 5687
2643 5687 8805 -265 -7598 -7495 -10929 1474 13607 15266 14161 2672 8039 4062 -4495 -8873
2629 -8873 -6762 -6270 -14645 -17515 -2139 7997 1922 8175 19793 26521 18107 6952 -1086 -6021
2615 -6021 -3183 9361 192 -4242 3608 9934 6556 12961 9549 20207 22538 20495 22604 20900
2601 20900 24240 25651 21988 17099 -6016 -16220 -16028 -15158 -14093 -4830 5281 17462 27948 17988
2587 17988 9943 8198 2868 -13476 -20730 -13432 -18335 -20168 -10921 -2057 2396 -425 -1980 -5368
2573 -5368 -8248 -6437 83 -8160 -7180 -8092 1358 10819 4989 -6708 -16747 -1198 -769 8160 10259
2558 10259 4505 -1544 -2934 -3273 -1448 -7017 -5602 -6021 -4355 -1143 -5364 3989 11823 5879 -10228
2543 -10228 -15889 -7981 -1977 1683 1490 2694 -343 -1796 -1094 -1488 -1581 -4335 -5075 -9314 -6715 -3918
2527 -3918 -7158 282 1994 -6155 -8112 -9420 -12787 -10762 -15117 -13717 -3274 1062 -11873 -19985
2513 -19985 -18343 -19554 -15221 -6385 -1964 -2420 2885 5110 9106 5271 172 5413 7074 2473 1234
$$ [...]
##END NTUPLES=NMR SPECTRUM
##END=
