##TITLE=Analysis number 318114
Compound Code cc 18614
Project Code adrs
Chemist Name prosynth
##JCAMPDX= 6.0         $$ Bruker NMR JCAMP-DX V2.0
##DATA TYPE= NMR SPECTRUM
##DATA CLASS= NTUPLES
##ORIGIN= Bruker BioSpin GmbH
##OWNER= nmr
$$ XWIN-NMR		Version 3.5
$$ Thu Mar 16 08:17:46 2006 GMT Standard Time (UT+0h)  MAYBRIDGE\nmr@NMR_250MHZ
##.OBSERVE FREQUENCY= 250.131544655141
##.OBSERVE NUCLEUS= ^1H
##.ACQUISITION MODE= SIMULTANEOUS (DQD)
##.ACQUISITION SCHEME= undefined
##.AVERAGES= 16
##.DIGITISER RES= 18
##SPECTROMETER/DATA SYSTEM= dpx250
##.PULSE SEQUENCE= zg30
##.SOLVENT NAME= CDCl3
##.SHIFT REFERENCE= (INTERNAL, CDCl3, 0, 16.522)
##AUDIT TRAIL= $$ (NUMBER, WHEN, WHO, WHERE, WHAT)
$$ ##TITLE= Audit trail, XWIN-NMR		Version 3.5
$$ ##JCAMPDX= 5.01
$$ ##ORIGIN= Bruker BioSpin GmbH
$$ ##OWNER= nmr
$$ C:\u/data/dgb/nmr/ADRS/800/pdata/1/auditp.txt
$$ ##AUDIT TRAIL=  $$ (NUMBER, WHEN, WHO, WHERE, WHAT)
(   1,<2006-03-16 08:17:26.36 +000>,<MAYBRIDGE\nmr>,<NMR_250MHZ>,
      <created by zg, POWCHK disabled, PULCHK disabled
       configuration hash MD5:
       84 BC 41 DB A1 6E 1D 46 DA 25 12 A5 C1 ED C5 3A
       data hash MD5: 64K
       23 50 57 28 8F 16 14 0F 8A B1 C9 83 65 D3 DC 04>)
(   2,<2006-03-16 08:17:37.77 +000>,<MAYBRIDGE\nmr>,<NMR_250MHZ>,
      <Start of raw data processing
       ef LB = 0.3 FT_mod = 6 PKNL = 1 SI = 32K 
       data hash MD5: 32K
       B4 0A 2D 6D E5 A9 5A BF 84 68 E4 7E FD 8B 9B 20>)
(   3,<2006-03-16 08:17:39.23 +000>,<MAYBRIDGE\nmr>,<NMR_250MHZ>,
      <apk 
       data hash MD5: 32K
       C3 6A 5D 9F BC 15 6C 43 4A 2F 82 ED 80 5B DA DB>)
(   4,<2006-03-16 08:17:39.97 +000>,<MAYBRIDGE\nmr>,<NMR_250MHZ>,
      <abs ABSG = 5 
       data hash MD5: 32K
       EE E6 42 EF 26 83 DF EA 81 61 19 D1 9C 28 16 9A>)
$$ ##END=
$$ 
$$ hash MD5
$$ 97 D5 43 10 F0 15 E7 FC 6D F3 2F B4 CA B4 A3 19
##$RELAX= 
##$RELAX= 
##$RELAX= 
##$RELAX= 
##$RELAX= 
##$RELAX= 
##$RELAX= 
$$ Bruker specific parameters
$$ --------------------------
##$DU= <C:\u>
##$EXPNO= 800
##$NAME= <ADRS>
##$PROCNO= 1
##$TYPE= <nmr>
##$USER= <dgb>
##$AMP= (0..31)
100 100 100 100 100 100 100 100 100 100 100 100 100 100 100 100 100 100 
100 100 100 100 100 100 100 100 100 100 100 100 100 100 
##$AQSEQ= 0
##$AQ_mod= 3
##$AUNM= <au_zg>
##$AUTOPOS= <2 >
##$BF1= 250.13
##$BF2= 250.13
##$BF3= 250.13
##$BF4= 250.13
##$BF5= 500.13
##$BF6= 500.13
##$BF7= 500.13
##$BF8= 500.13
##$BYTORDA= 1
##$CFDGTYP= 0
##$CFRGTYP= 5
##$CHEMSTR= <none>
##$CNST= (0..31)
1 1 145 1 1 1 1 1 1 1 1 1 1 1 1 1 1 1 1 1 1 1 1 1 1 1 1 1 1 1 1 1 
##$CPDPRG= <>
##$CPDPRG1= <>
##$CPDPRG2= <>
##$CPDPRG3= <>
##$CPDPRG4= <mlev>
##$CPDPRG5= <mlev>
##$CPDPRG6= <mlev>
##$CPDPRG7= <mlev>
##$CPDPRG8= <mlev>
##$CPDPRGB= <>
##$CPDPRGT= <>
##$D= (0..31)
0 1 0 0 0 0 0 0 0 0.06 0 0 0 0 0 0 0.0002 0 0 0 0 0 0 0 0 0 0 0 0 0 0 
0 
##$DATE= 1142497044
##$DBL= (0..7)
120 120 120 120 120 120 120 120 
##$DBP= (0..7)
150 150 150 150 150 150 150 150 
##$DBP07= 0
##$DBPNAM0= <>
##$DBPNAM1= <>
##$DBPNAM2= <>
$$ [...]
##$SUBNAM7= <"">
##$SUBNAM8= <"">
##$SUBNAM9= <"">
##$SW= 20.6930455092707
##$SWIBOX= (0..15)
0 0 3 0 0 0 0 0 0 0 0 0 0 0 0 0 
##$SW_h= 5175.983436853
##$TD= 65536
##$TD0= 1
##$TE= 294.16
##$TE2= 300
##$TE3= 300
##$TEG= 300
##$TL= (0..7)
0 120 120 120 120 120 120 120 
##$TP= (0..7)
150 150 150 150 150 150 150 150 
##$TP07= 0
##$TPNAME0= <>
##$TPNAME1= <>
##$TPNAME2= <>
##$TPNAME3= <>
##$TPNAME4= <>
##$TPNAME5= <>
##$TPNAME6= <>
##$TPNAME7= <>
##$TPOAL= (0..7)
0.5 0.5 0.5 0.5 0.5 0.5 0.5 0.5 
##$TPOFFS= (0..7)
0 0 0 0 0 0 0 0 
##$TUNHIN= 0
##$TUNHOUT= 0
##$TUNXOUT= 0
##$USERA1= <user>
##$USERA2= <user>
##$USERA3= <user>
##$USERA4= <user>
##$USERA5= <user>
##$V9= 5
##$VALIST= <valist>
##$VCLIST= <CCCCCCCCCCCCCCC>
##$VD= 0
##$VDLIST= <DDDDDDDDDDDDDDD>
##$VPLIST= <PPPPPPPPPPPPPPP>
##$VTLIST= <TTTTTTTTTTTTTTT>
##$WBST= 1024
##$WBSW= 4
##$XGAIN= (0..3)
0 0 0 0 
##$XL= 0
##$YL= 0
##$YMAX_a= 329901
##$YMIN_a= -413718
##$ZGOPTNS= <>
##$ZL1= 120
##$ZL2= 120
##$ZL3= 120
##$ZL4= 120
##$ABSF1= 16.522
##$ABSF2= -4.171173
##$ABSG= 5
##$ABSL= 3
##$ALPHA= 0
##$AQORDER= 0
##$ASSFAC= 0
##$ASSFACI= 0
##$ASSFACX= 0
##$ASSWID= 0
##$AUNMP= <proc_1d>
##$AZFE= 0.1
##$AZFW= 0.1
##$BCFW= 0
##$BC_mod= 0
##$BYTORDP= 0
##$COROFFS= 0
##$CY= 12.5
##$DATMOD= 1
##$DC= 0
##$DFILT= <>
##$DTYPP= 0
##$F1P= 14.0000005364418
##$F2P= -0.99999901652339
##$FCOR= 0.5
##$FTSIZE= 32768
##$FT_mod= 6
##$GAMMA= 0
##$GB= 0
##$INTBC= 1
##$INTSCL= 1
##$ISEN= 128
##$LB= 0.3
##$LEV0= 0
##$LPBIN= 0
##$MAXI= 10000
##$MC2= 0
##$MEAN= 0
##$ME_mod= 0
##$MI= 0
##$NCOEF= 0
##$NC_proc= -4
##$NLEV= 6
##$NOISF1= 0
##$NOISF2= 0
##$NSP= 0
##$NTH_PI= 0
##$NZP= 0
##$OFFSET= 16.522
##$PC= 1
##$PHC0= 176.2731
##$PHC1= 9.25722
##$PH_mod= 1
##$PKNL= yes
##$PPARMOD= 0
##$PSCAL= 4
##$PSIGN= 0
##$REVERSE= no
##$SF= 250.13
##$SI= 32768
##$SIGF1= 0
##$SIGF2= 0
##$SINO= 400
##$SIOLD= 32768
##$SREGLST= <1H.CDCl3>
##$SSB= 0
##$STSI= 32768
##$STSR= 0
##$SW_p= 5175.98343685301
##$SYMM= 0
##$S_DEV= 0
##$TDeff= 65536
##$TDoff= 0
##$TI= <Analysis number 999999
Compound Code 99
Book Reference 9
Project Code 9>
##$TILT= no
##$TM1= 0
##$TM2= 0
##$TOPLEV= 0
##$USERP1= <user>
##$USERP2= <user>
##$USERP3= <user>
##$USERP4= <user>
##$USERP5= <user>
##$WDW= 1
##$XDIM= 32768
##$YMAX_p= 325219398
##$YMIN_p= -346214
$$ End of Bruker specific parameters
$$ ---------------------------------
##NTUPLES= NMR SPECTRUM
##VAR_NAME=  FREQUENCY,     SPECTRUM/REAL,   SPECTRUM/IMAG
##SYMBOL=    X,             R,               I
##VAR_TYPE=  INDEPENDENT,   DEPENDENT,       DEPENDENT
##VAR_FORM=  AFFN,          ASDF,            ASDF
##VAR_DIM=   32768,         32768,           32768
##UNITS=     HZ,            ARBITRARY UNITS, ARBITRARY UNITS
##FACTOR=    0.157963299565203, 1,           1
##FIRST=     4132.6476996994, 0,             0
##LAST=      -1043.33573715361, 0,           0
##MIN=       -1043.33573715361, -346214,     0
##MAX=       4132.6476996994, 325219398,     0
$$ Real data points
##PAGE= N=1
##DATA TABLE= (X++(R..R)), XYDATA
$$ [...]
$$ plain form
23783 3358 -15478 -41607 -9476 -12167 -80782 -78209 -95619 -95257 -56168 -36548 -88059 -106161 -68877
23770 -68877 -25711 -68667 -26775 21771 46847 9001 -89969 -150070 -106135 -114986 -110407 -58488
23758 -58488 -79732 -115804 -122171 -125986 -131579 -112729 -167611 -163537 -55102 53949 76187 68097
23746 68097 42737 -11434 -10574 37544 133164 53970 -9697 -88463 -90244 -143757 -161363 -93384
23734 -93384 -11407 58293 57315 -3159 31691 28246 -41781 -36711 -39946 3677 -59127 -64265 27646
23721 27646 -35278 -190542 -102946 -31814 -36713 -67393 -127500 -68629 42534 35239 49755 106856
23709 106856 103703 48311 11207 -2924 -2595 -1689 68728 102048 95298 133987 65182 -36132
23697 -36132 -60090 -10031 -19130 -49217 -86500 -53516 6405 99486 139781 119316 -8345 -56374
$$ packed form
23783C358j8836k6129L2131k691o8615K573j7410L62L9089J9620n1511j8102L7284
23770f8877M3166m2956M1892M8546K5076l7846r8970o0101M3935q851M579N1919
23758e8488k1244l6072o367l815n593J8850n4882M074J08435J09051K2238q090
23746F8097k5360n4171Q60M8118R5620p9194o3667p8766j781n3513j7606O7979
23734i3384Q1977O9700r78o0474L4850l445p0027N070l235M3623o2804n138R1911
23721B7646o2924j55264Q7596P1132m899l0680o0107N8871J11163p295J4516N7101
23709A06856l153n5392l7104j4131L29R06P0417L3320o750L8689o8805j01314
23697c6132k3958N0059r099l0087l7283L2984N9921R3081M0295k0465j27661m8029
$$ plain form
23685 -56374 -12526 -4924 -3993 -76741 -112741 -61358 -9043 -71566 -69977 -55771 -92775 -84391 -89853
23672 -89853 3253 -5461 -48973 -39977 -71342 -33433 -54737 -114711 -25722 111425 94161 12163
23660 12163 89149 38116 -46088 -46087 -22149 -9452 -5051 16182 88598 108639 86444 102734 89488
23647 89488 56149 -2836 -51853 -91300 -71418 -79978 -71128 -39081 1451 17252 -24648 -6500
23635 -6500 -25540 -69782 -109161 -144685 -211258 -237031 -253470 -221995 -106874 23710 54942
23624 54942 65060 37502 1262 86700 150164 131961 94810 100718 40060 41218 12022 11604
23612 11604 -2460 21696 60725 22308 4018 -34044 -35761 -658 -30981 -109925 -132340 -132221
23600 -132221 -8415 103653 22497 20497 31620 -8467 -36304 -113529 -113925 -24718 19779 11728
$$ packed form
23685e6374M3848P602R31p2748l6000N1383N2315o2523J589J4206l7004Q384n462
23672h9853R3106q714m3512Q996l1365L7909k1304n9974Q8989J37147j7264q1998
23660A2163P6986n1033q4204JK3938J2697M401K1233P2416K0041k2195J6290j3246
23647H9488l3339n8985m9017l9447J9882q560Q850L2047M0532J5801m1900J8148
23635f500j9040m4242l9379l5524o6573k5773j6439L1475J15121J30584L1232
23624E4942J0118k7558l6240Q5438O3464j8203l7151N908o0658J158k9196m18
23612A1604j4064K4156L9029l8417j8290l8062j717L5103l0323p8944k2415J19
23600a32221J23806J12068q1156k000J1123m0087k7837p7225l96Q9207M4497q051
$$ plain form
23588 11728 7325 35697 -977 6968 5402 -126669 -144588 -129450 -5634 40236 30754 105345
23576 105345 119891 10181 -39261 23503 52240 -8922 -105379 -52897 67546 58083 -20743
23565 -20743 -7443 13447 46481 45334 36421 -67014 -106533 -67949 -92622 -23819 8229 67390
23553 67390 68583 85093 102325 86460 25023 -30816 -77770 -55557 -31621 -31840 22288 68
23541 68 -9675 -37970 -25740 27466 -34650 -74828 -107186 -181417 -187736 -102213 -54335 -125874 -54744
23528 -54744 22030 16622 17611 26425 32467 -17335 9306 -68526 -182379 -219776 -185097 -151376
23516 -151376 -181070 -114772 -76637 -89007 -71201 -36607 -20525 -63910 -84386 -74118 -85784
23505 -85784 -121585 -33850 68304 62683 108239 47665 -34446 11216 -14609 -1515 8014 -55221
$$ packed form
23588A1728m403K8372l6674P945j566j32071j7919J5138J23816M5870r482P4591
23576A05345J4546j09710m9442O2764K8737o1162r6457N2482J20443r463p8826
23565b0743J3300K0890L3034j147q913j03435l9519L8584k4673O8803L2048N9161
23553F7390J193J6510J7232j5865o1437n5839m6954K2213K3936k19N4128k2220
23541F8r743k8295J2230N3206o2116m0178l2358p4231o319Q5523M7878p1539P1130
23528e4744P6774n408R89Q814O042m9802K6641p7832j13853l7397L4679L3721
23516a51376k9694O6298L8135j2370J7806L4594J6082m3385k0476J0268j1666
23505h5784l5801Q7735J02154n621M5556o0574q2111M5662k5825J3094R529o3235
$$ plain form
23493 -55221 -78172 -45674 -17560 27152 12534 -61699 11975 115127 92044 -1089 10839
23482 10839 24709 -74836 -146727 -63117 -28731 -37413 -60137 -101196 -100190 -134187 -161885 -153186
23470 -153186 -136222 -35080 -18229 -20756 -70449 -54586 -92748 -69206 -79167 -62155 -43348 -58714
23458 -58714 -159369 -161368 -105263 -66389 -3939 27027 -47290 -106882 -128304 -87634 -104135 -6982
23446 -6982 21700 76832 112863 69026 53445 -36903 -83676 -58159 4485 1141 -28676 41397
23434 41397 54662 41196 34045 -15605 -72039 -120906 -145411 -143380 -56059 41879 78252 141686
23422 141686 134461 70265 16638 -35870 -88905 -100625 -88292 -116539 -170747 -231258 -129123
23411 -129123 -14295 -31100 -160047 -226876 -110162 -37865 -47575 -26124 48359 29054 -64841
$$ packed form
23493e5221k2951L2498K8114M4712j4618p4233P3674J03152k3083r3133J1928
23482A0839J3870r9545p1891Q3610L4386q682k2724m1059J006l3997k7698Q699
23470a53186J6964J01142J6851k527m9693J5863l8162K3542r961J7012J8807j5366
23458e8714j00655j999N6105L8874O2450L0966p4317n9592k1422M0670j6501R7153
23446f982K8682N5132L6031m3837j5581r0348m6773K5517O2644l344k9817P0073
23434D1397J3265j3466p151m9650n6434m8867k4505K031Q7321R7938L6373O3434
23422A41686p225o4196n3627n2508n3035j1720J2333k8247n4208o0511J02135
23411a29123J14828j6805j28947o6829J16714P2297r710K1451P4483j9305r3895
$$ plain form
23400 -64841 14871 34901 18692 7353 -1756 16970 92002 14451 -82189 -55876 -55614 -33944
23388 -33944 -23970 30054 -26641 -32496 -18416 -51000 -53374 -77682 -195269 -216092 -101580 -60632
23376 -60632 -67868 -13963 -44244 -115430 -108764 -162112 -104713 -47108 -11313 34682 47416 110311
23364 110311 91136 84658 71864 126241 44250 39909 117286 91982 60649 92327 152001 99901
23352 99901 69491 86668 -39077 -100338 -51475 -4671 -11170 12597 22258 -48409 -37914 34541
23340 34541 89265 71051 83686 87476 99996 2629 -82067 -75688 -36808 -13065 -76677 -54354
23328 -54354 5213 83815 75730 88058 39734 -23745 -128637 -157405 -82362 -58129 -45610 -11286
23316 -11286 17176 -3987 60506 -2167 -14610 -91358 -24697 -18473 -27051 -75185 -83545 -72503
$$ packed form
23400f4841P9712K0030j6209j1339r109J8726P5032p7551r6640K6313K62K1670
23388c3944R974N4024n6695n855J4080l2584k374k4308j17587k0823J14512M0948
23376f0632p236N3905l0281p1186O666n3348N7399N7605L5795M5995J2734O2895
23364A10311j9175o478j2794N4377q1991m341P7377k5304l1333L1678N9674n2100
23352I9901l0410J7177j25745o1261M8863M6804o499K3767R661p0667J0495P2455
23340C4541N4724j8214J2635L790J2520r7367q4696O379L8880K3743o3612K2323
23328e4354N9567P8602q085J2328m8324o3479j04892k8768P5043K4233J2519L4324
23316a1286K8462k1163O4493o2673j2443p6748O6661O224q578m8134q360J1042
$$ plain form
23304 -72503 -75615 -74814 -97239 -76323 4266 43287 66259 77558 21226 -13997 -33496 81416
23292 81416 138489 187176 191013 102657 -51381 -113421 -45324 13364 1592 -61902 12893 22123
23280 22123 8394 25786 101961 95450 98565 125965 90370 101368 187154 262963 158677 52850
23268 52850 17754 28097 40640 68156 106293 74985 47463 -43248 -21570 62717 118364 38209
23256 38209 3413 52471 -35510 -23954 25169 42422 -79035 -84359 -129036 -130505 -90645 -70197
23244 -70197 -16405 61471 46794 50210 47235 -9926 12273 33182 38953 -33350 -43876 -2910
23232 -2910 29456 -66710 -32300 -24533 27102 67634 31416 139898 140770 54321 84627 108273
23220 108273 13500 -26029 -3302 38210 21861 -30131 -35522 -13834 -44614 -84696 -149800 -188940
$$ packed form
23304g2503l112Q01k2425K0916Q0589L9021K2972J1299n6332l5223j9499J14912
23292H1416N7073M8687L837q8356j54038o2040O8097N8688j1772o3494P4795R230
23280B2123j3729J7392P6175o511L115K7400l5595J0998Q5786P5809j04286j05827
23268E2850l5096J0343J2543K7516L8137l1308k7522r0711K1678Q4287N5647q0155
23256C8209l4796M9058q7981J1556M9123J7253j21457n324m4677j469L9860K0448
23244g0197N3792P7876j4677L416k975n7161K2199K0909N771p2303j0526M0966
23232b910L2366r6166L4410P767N1635M0532l6218J08482Q72q6449L0306K3646
23220A08273r4773l9529K2727M1512j6349n1992n391K1688l0780m0082o5104l9140
$$ plain form
23208 -188940 -160347 -98707 -38529 2222 -36942 -35939 -33665 -55194 -75802 -94952 -34574 34961
23196 34961 -57754 -100626 2524 38196 76646 32500 -40165 9529 27257 118559 118043 104545
23184 104545 82614 123303 93739 30364 35138 84436 170404 134470 56035 -95450 -133262
23173 -133262 -99592 -81153 -88905 -126150 -80827 76819 -18233 -178834 -193974 -140443 -80294
23162 -80294 -53279 -144825 -94981 14540 -12325 43994 38500 7546 -25967 -47422 36656 1078
23150 1078 -125958 -136940 -53552 -25354 -58410 -24169 11406 39253 4056 -43463 -17249 -33623
23138 -33623 -19954 24822 29480 -4195 -69350 -117236 -172536 -137608 -18084 138005 226862
23127 226862 170763 108868 90648 4848 -9462 67576 120566 89338 41290 26793 -2526
$$ packed form
23208a88940K8593O1640O0178M0751l9164J003K274k1529k0608j9150O0378O9535
23196C4961r2715m2872J03150L5672L8450m4146p2665M9694J7728R1302n16j3498
23184A04545k1931M0689k9564o3375M774M9298Q5968l5934p8435j51485l7812
23173a33262L3670J8439p752l7245M5323J57646r5052j60601j5140N3531O0149
23162h0294K7015r1546M9844J09521k6865N6319n494l0954l3513k1455Q4078l5578
23150A078j27036j0982Q3388K8198l3056L4241L5575K7847l5197m7519K6214j6374
23138c3623J3669M4776M658l3675o5155m7886n5300L4928J19524J56089Q8857
23127B26862n6099o1895j8220q5800j4310P7038N2990l1228m8048j4497k9319
$$ plain form
23116 -2526 9417 39660 -43141 -159178 -204339 -179827 -137124 -46617 -18729 33502 6428 -22045
23104 -22045 -34929 -66077 -75876 -75615 -62323 -49757 33098 84536 132634 107993 138899 75239
23092 75239 67190 71865 -8991 -28599 -38997 12524 45350 12792 53821 23409 -54701 -76378
23080 -76378 -79408 -41177 24934 44721 22275 52756 112704 150970 122041 28647 31304 109394
23068 109394 149148 101876 63093 56973 -24615 -62653 -18659 15764 -13333 12410 51742 86423
23056 86423 -5681 -76400 -54191 39975 81927 23714 -3420 56375 52472 12805 -30988 -658
23044 -658 13433 2286 24303 97364 63872 4311 -39457 -58250 -169240 -112132 -52609 -33825
23032 -33825 -35764 38510 61726 33030 -38834 -126130 -143965 -184123 -118390 -51061 446 42684
$$ packed form
23116b526J1943L0243q2801j16037m5161K4512M2703R0507K7888N2231k7074k8473
23104b2045j2884l1148r799K61J3292J2566Q2855N1438M8098k4641L0906o3660
23092G5239q049M675q0856j9608j0398N1521L2826l2558M1029l0412p8110k1677
23080g6378l030L8231O6111J9787k2446L0481N9948L8266k8929r3394K657P8090
23068A09394L9754m7272l8783o120q1588l8038M3994L4423k9097K5743L9332L4681
23056H6423r2104p0719K2209R4166M1952n8213k7134N9795l903l9667m3793L0330
23044f58J4091j1147K2017P3061l3492n9561m3768j8793j10990N7108N9523J8784
23032c3825j939P4274K3216k8696p1864q7296j7835m0158O5733O7329N1507M2238
$$ plain form
23020 42684 41333 7978 -68313 4876 61273 96352 126591 165209 153904 83546 11276 -13404
23008 -13404 -2754 -52259 -73575 -44396 5268 -9162 -98629 -150718 -98671 -26912 1721 1328
22996 1328 102868 52607 60135 100789 88443 98085 47913 -72760 -61413 -31712 -9541 -70142
22984 -70142 -89458 -66310 -117825 -185407 -170744 -85500 -15218 -25373 -300 25527 -9365 61809
22972 61809 87735 64908 2648 -108826 -96029 -132617 -35707 15659 -31754 -651 53307
22961 53307 110919 19974 -39590 -26094 -22267 -5214 19308 59859 146362 207378 133632 79115
22949 79115 65052 75781 82875 49774 75701 66498 92965 129017 192406 68624 24966 113104
22937 113104 155581 60305 -12582 14775 -47170 -115091 -74094 -73564 -18339 44995 4121 -65862
$$ packed form
23020D2684j351l3355p6291P3189N6397L5079L0239L8618j1305p0358p2270k4680
23008a3404J0650m9505k1316K9179M9664j4430q9467n2089N2047P1759K8633l93
22996A328J01540n0261P528M0654j2346R642n0172j20673J1347K9701K2171o0601
22984g0142j9316K3148n1515o7582J4663Q5244P0282j0155K5073K5827l4892P1174
22972F1809K5926k2827o2260j11474J2797l6588R6910N1366m7413L1103N3958
22961E3307N7612r0945n9564J3496L827J7053K4522M0551Q6503O1016p3746n4517
22949G9115j4063J0729P094l3101K5927r203K6467L6052O3389j23782m3658Q8138
22937A13104M2477r5276p2887K7357o1945o7921M0997N30N5225O3334m0874o9983
$$ plain form
22925 -65862 -9422 14559 -39287 -22245 17027 2850 -74058 332 13628 103174 111899 74538
22913 74538 49162 -25902 19890 116544 108258 -993 -9731 111096 168974 173906 118808 97937
22901 97937 108984 40202 16672 8039 38229 64689 89398 121550 75227 5686 28280 93065
22889 93065 67402 96461 159442 171222 142018 32049 -76114 -91494 -47581 -44730 -96827
22878 -96827 -98143 -24040 110816 100549 130403 233392 224307 193479 134638 77232 -15289 -63871
22866 -63871 -61866 -95056 -104097 -74074 38866 38444 -83527 -62930 -22594 -2362 134701 157679
22854 157679 56664 -10802 94027 141753 61221 -63190 -89756 -54528 -8557 50192 87110
22843 87110 142154 99384 96604 128144 187069 165496 129986 79037 20104 -69949 -160647 -128015
$$ packed form
22925f5862N6440K3981n3846J7042L9272j4177p6908P4390J3296Q9546Q725l7361
22913G4538k5376p5064M5792R6654q286j09251q738J20827N7878M932n5098k0871
22901I7937J1047o8782k3530q633L0190K6460K4709L2152m6323o9541K2594O4785
22889I3065k5663K9059O2981J1780k9204j09969j08163j5380M3913K851n2097
22878i6827j316P4103J34856j0267K9854J02989r085l0828n8841n7406r2521m8582
22866f3871K005l3190r041L0023J12940m22j21971K0597M0336K0232J37063K2978
22854A57679j01015o7466J04829M7726q0532j24411k6566L5228M5971N8749L6918
22843H7110N5044m2770k780L1540N8925k1573l5510n0949n8933r0053r0698L2632
$$ plain form
22831 -128015 -14839 -9776 -36375 -135762 -202736 -159330 -57001 -3549 -62654 -69637 -122367
22820 -122367 -130773 -179367 -181320 -167663 -93174 -42937 -25251 -69831 -145839 -139149 -172824 -199017
22808 -199017 -167771 -172600 -100678 -28352 -76836 -163854 -112238 -56413 -53263 -49359 -94521 -3561
22796 -3561 22385 -65351 -135992 -119034 -4322 30610 25181 -65323 -37091 -20387 -81027 -115393
22784 -115393 -72462 -94998 -44950 -42296 -19570 -19694 -29160 -21549 -51589 -64472 40749 59740
22772 59740 77629 -35312 -93017 -47216 -16150 -27610 61675 58067 -74824 -212501 -152336
22761 -152336 -100733 -87529 -74668 -34262 9875 -10718 -70059 -80236 -111079 -118396 -92693 -9495
22749 -9495 -13229 -48854 20189 135401 156870 124762 40725 37068 -11406 -76287 -97760 -122415
$$ packed form
22831a28015J13176N063k6599r9387o6974M3406J02329N3452n9105o983n2730
22820a22367q406m8594j953J3657P4489N0237J7686m4580p6008O690l3675k6193
22808a99017L1246m829P1922P2326m8484q7018N1616N5825L150L904m5162R0960
22796c561K5946q7736p0641J6958J14712L4932n429r0504K8232J6704o0640l4366
22784a15393M2931k2536N0048K654K2726j24r466P611l0040j2883J05221J8991
22772E9740J7889j12941n7705M5801L1066j1460Q9285l608j32891j37677O0165
22761a52336N1603J3204J2861M0406M4137k0593n9341j0177l0843p317K5703Q3198
22749i495l734l5625O9043J15212K1469l2108q4037l657m8474o4881k1473k4655
$$ plain form
22737 -122415 -125791 -158118 -210977 -177530 -126909 -80695 13611 -15380 -48350 -51856 -52650 -13772
22725 -13772 1761 12344 87606 213595 197166 119285 37834 50960 -13867 50749 32095
22714 32095 -17161 8225 12865 -16378 -25148 3920 57834 -6187 19821 57163 13300 -58898
22702 -58898 -54624 4630 -76574 -46067 68025 85109 51288 -7784 -127995 -196202 -92494
22691 -92494 -59665 -124054 -104218 33629 100465 74848 52085 46863 14191 7806 29591 -61398
22679 -61398 8291 23955 19828 9230 -2841 47346 52657 -8449 -71610 -50590 -58362 -45037
22667 -45037 -15949 -8458 104677 45450 -5162 19424 52198 56437 32848 14309 -30760 -186154
22655 -186154 -297236 -259737 -79218 -16368 -86300 -182135 -180720 -126950 -39823 -51889 -78139
$$ packed form
22737a22415l376l2327n2859L3447N0621M6214R4306k8991l2970l506p94L8878
22725a3772J5533J0583P5262J25989j6429p7881q1451J3126o4827O4616j8654
22714C2095m9256K5386M640k9243q770K9068N3914o4021K6008L7342m3863p2198
22702e8898M274N9254q1204L0507J14092J7084l3821n9072j20211o8207J03708
22691i2494L2829o4389J9836J37847O6836k5617k2763n222l2672o385K1785r0989
22679f1398O9689J5664m127j0598j2071N0187N311o1106o3161K1020p772J3325
22667d5037K9088P491J13135n9227n0612K4586L2774M239k3589j8539m5069j55394
22655a86154j11082L7499J80519O2850o9932r5835J415N3770Q7127j2066k6250
$$ plain form
22644 -78139 33399 124598 181282 120380 65962 -13859 -52123 -20210 -25938 -30112 75337 48616
22632 48616 15110 10185 -19382 -92626 -73227 -67723 -86690 -64479 -36898 -57585 -97993 -150578
22620 -150578 -146548 -53042 34920 92014 112370 42890 -32800 -95520 -112340 -152015 -158391 -132347
22608 -132347 -213237 -247188 -197221 -166850 -111398 -89566 -91005 -110873 -35860 -47970 -60485 -77143
22596 -77143 -153787 -39232 76337 80926 122518 132857 60451 26353 -19016 -25704 -42601 -17011
22584 -17011 1173 24943 -16553 -86778 -21919 -3836 -40390 -90553 -113174 -93957 32850
22573 32850 12724 -63882 -170407 -103034 -23124 26137 37306 66653 81771 -4891 -34478
22562 -34478 -43629 -5733 114063 5934 -27496 -131925 -216268 -184574 -62833 -56092 -12732
$$ packed form
22644g8139J11538R1199N6684o0902n4418p9821l8264L1913n728m174J05449k6721
22632D8616l3506m925k9567p3244J9399N504j8967K2211K7581k0687m0408n2585
22620a50578M030R3506Q7962N7094K0356o9480p5690o2720j6820l9675o376K6044
22608a32347q0890l3951M9967L0371N5452K1832j439j9868P5013j2110j2515j6658
22596g7143p6644J14555J15569M589M1592J0339p2406l4098m5369o688j6897K5590
22584a7011J8184K3770m1496p0225O4859J8083l6554n0163k2621J9217J26807
22573C2850k0126p6606j06525O7373P9910M9261J1169K9347J5118q6662k9587
22562c4478r151L7896J19796j08129l3430j04429q4343L1694J21741O741M3360
$$ plain form
22551 -12732 25166 -15645 -75040 -114297 -103803 -121223 -156868 -155244 -124234 -37627 50516 -873
22539 -873 -26603 -60897 -59358 36691 70900 14789 -17272 23942 79267 9077 -110223 -142572
22527 -142572 -42249 -37523 -49795 -4822 4268 -66845 -66775 -64308 -68616 -39618 -48819 -33212 80637
22514 80637 106715 114513 58970 11864 135666 138254 70944 41381 103623 116152 62325 78757
22502 78757 64827 7904 -35595 -39580 -27192 36294 52736 44652 28422 25898 84559 115937
22490 115937 73793 65738 63469 31188 8556 25853 108561 91442 92355 66726 27304 -80483
22478 -80483 -108835 -68751 -52876 -30093 -11898 -13591 -56816 -102418 -122769 -108666 -42888 37361
22466 37361 72865 -16277 -58077 -80445 -25104 14308 51333 -38311 -28639 56222 133755 85775
$$ packed form
22551a2732L7898m0811n9395l9257J0494j7420l5645J624L1010Q6607Q8143n1389
22539h73k5730l4294J539R6049L4209n6111l2061M1214N5325p0190j19300l2349
22527a42572J00323M726j2272M4973R090p1113P0K467m308K8998r201J5607J13849
22514H0637K6078P798n5543m7106J23802K588o7310k9563O2242J2529n3827J6432
22502G8757j3930n6923m3499l985J2388O3486J6442q084j6230k524N8661L1378
22490A15937m2144q055k269l2281k2632J7297Q2708j7119R13k5629l9422j07787
22478h0483k8352M0084J5875K2783J8195j693m3225m5602k0351J4103O5778Q0249
22466C7361L5504q9142m1800k2368N5341L9412L7025q9644R672Q4861P7533m7980
$$ plain form
22454 85775 75733 39893 13894 -1595 -42588 -93536 -82350 -78695 -143533 -194064 -217429 -128744
22442 -128744 -88571 -54124 -63216 -47074 -86627 -148980 -130073 17378 14604 -123718 -139934
22431 -139934 -107815 -79057 -86585 -20166 32858 83322 11580 5481 31157 11757 -7186 11432
22419 11432 -34820 -40289 -39902 -32689 16621 32578 12456 8960 -58193 -112361 -48757 -26653 -2071
22406 -2071 7493 1420 45190 89070 77999 138177 177867 94227 21427 -12326 -40276 4233
22394 4233 -133539 -154832 -159556 -103915 -66094 -52941 -74733 -114884 -54351 -19155 -13134 -30432
22382 -30432 -45219 -61351 -74500 -56170 13887 93479 135484 85694 9217 -28615 -56530 -4579
22370 -4579 46090 54191 -18285 -48498 -15360 32039 67691 108602 48325 -4797 43984 -31719
$$ packed form
22454H5775j0042l5840k5999j5489m0993n0948J1186L655o4838n0531k3365Q8685
22442a28744M0173L4447r092J6142l9553o2353J8907J47451k774j38322j6216
22431a39934L2119K8758p528O6419N3024N0464p1742o099K5676j9400j8943J8618
22419A1432m6252n469L87P213M9310J5957k0122l496o7153n4168O3604K2104K4582
22406b071R564o073M3770M3880j1071O0178L9690q3640p2800l3753k7950M4509
22394D233j37772k1293m724N5641L7821J3153k1792m0151O0533L5196O021j7298
22382c0432j4787j6132j3149J8330P0057P9592M2005m9790p6477l7832k7915N1951
22370d579N0669Q101p2476l0213L3138M7399L5652M0911o0277n3122M8781p5703
$$ plain form
22358 -31719 -58581 -4701 -42207 -41661 37632 -8064 636 -63236 -211586 -185626 -125593 -123029
22346 -123029 -89362 6635 159995 128681 90579 42646 -20906 -12086 47331 62238 70844 51970
22334 51970 91610 56674 -71244 -121509 -135807 -133422 -137709 -143282 -160863 -56177 -16555 -17920
22322 -17920 35907 90572 124377 101788 71162 91038 125711 96903 23865 -30824 -17137 17707
22310 17707 3837 -4599 -37603 -42338 -6750 17956 46771 8847 -42752 -72518 -59254 605
22298 605 -10595 3433 -15720 47966 -68607 -117735 -123505 -31320 66847 126449 76067 -31084
22286 -31084 -2661 -36438 -46256 -106678 -36390 -31957 -25681 85039 191972 217012 154754 70205
22274 70205 82205 80483 95643 162819 132578 108520 39506 -10058 -4676 -19559 -13933 59669
$$ packed form
22358c1719k6862N3880l7506N46P9293m5696Q700o3872j48350K5960O0033K564
22346a23029L3667R5997J53360l1314l8102m7933o3552Q820N9417J4907Q606j8874
22334E1970L9640l4936j27918n0265j4298K385m287n573j7581J04686L9622j365
22322a7920N3827N4665L3805k2589l0626J9876L4673k8808p3038n4689J3687L4844
22310A7707j3870q436l3004m735L5588K4706K8815l7924n1599k9766J3264N9859
22298F05j1200J4028j9153O3686j16573m9128n770R2185R8167N9602n0382j07151
22286c1084K8423l3777r818o0422P0288M433O276J10720J06933K5040o2258q4549
22274G0205J2000j722J5160O7176l0241k4058o9014m9564N382j4883N626P3602
$$ plain form
22262 59669 92268 44830 -44835 -76429 50339 61519 25177 25863 33138 -1446 -43627 -16680
22250 -16680 3391 -85520 -80961 26054 63229 7767 55104 144369 164520 90987 60033 18113
22238 18113 25196 -43726 -50196 -28142 13513 -24763 11175 53356 29428 39612 40175 71189
22226 71189 46190 -14377 -21368 49117 87549 27375 -13417 16674 97053 -37312 -46670 42467
22214 42467 103914 91538 88837 -17148 -13911 79863 698 22258 19885 -54234 -70533 -26433
22202 -26433 -84191 -115010 -27224 -21772 -135597 -157993 -104365 -122358 -75102 -20758 -70508 -107420
22190 -107420 -104322 18832 52521 2761 -6593 877 7105 -73667 -64831 -58028 -70948 -93206
22178 -93206 -85356 -33608 -5776 28296 126002 169333 170167 231438 171095 115220 36820 21634
$$ packed form
22262E9669L2599m7438q9665l1594J26768J1180l6342O86P275l4584m2181K6947
22250a6680K0071q8911M559J07015L7175n5462M7337Q9265K0151p3533l0954m1920
22238A8113P083o8922o470K2054M1655l8276L5938M2181k3928J0184N63L1014
22226G1189k4999o0567o991P0485L8432o0174m0792L0091Q0379j34365r358Q9137
22214D2467O1447j2376k701j05985L237R3774p9165K1560k373p4119j6299M4100
22202b6433n7758l0819Q7786N452j13825k2396N3628j7993M7256N4344m9750l6912
22190a07420L098J23154L3689m9760r354P470O228q0772Q836O803j2920k2258
22178i3206P850N1748K7832L4072R7706M3331Q34O1271o0343n5875p8400j5186
$$ plain form
22166 21634 -3105 -42774 -51891 -56717 -59852 26706 47543 -16649 -122987 -138049 -142500 -146605
22154 -146605 -84565 -61281 -57006 -36749 -4833 -82740 -159240 -40039 -8126 -87234 -39805
22143 -39805 44200 96613 65351 -63210 -44304 -28174 -19721 -55207 -68956 -83859 -142525 -126469
22131 -126469 -38199 -40001 5593 -2414 -19240 -14492 39789 103522 29570 -67987 -76149 -72104
22119 -72104 -35386 48634 63579 60759 -1463 29719 63941 57252 34651 57396 71665 34047
22107 34047 66691 -37710 -81519 -48531 -35151 -1866 -801 -27379 -63256 -25873 46961 -33657
22095 -33657 -64506 -20016 21887 61545 -31269 -65312 -17381 -79751 -97207 -67114 16975 14934
22083 14934 23308 47849 59337 64804 -15593 -24916 109792 150605 142345 181118 149164 106952
$$ packed form
22166B1634k4739l9669r117m826l135Q6558K0837o4192j06338j5062m451m105
22154a46605O2040K3284M275K0257L1916p7907p6500J19201L1913p9108M7429
22143c9805Q4005N2413l1262j28561J8906J6130Q453l5486j3749j4903n8666J6056
22131a26469Q8270j802M5594q007j6826M748N4281O3733p3952r7557q162M045
22119g2104L6718Q4020J4945k820o2222L1182L4222o689k2601K2745J4269l7618
22107C4047L2644j04401m3809L2988J3380L3285J065k6578l5877L7383P2834q0618
22095c3657l0849M4490M1903L9658r2814l4043M7931o2370j7456L0093Q4089k041
22083A4934Q374K4541J1488N467q0397r323J34708M0813q260L8773l1954m2212
$$ plain form
22071 106952 -6060 -14392 46062 51596 31814 -55761 -134934 -120787 -119217 -172811 -180681 -82727
22059 -82727 -15031 10980 22150 -6344 -13955 62362 131255 152914 84636 -30718 -22759 58661
22047 58661 159702 106800 -5484 -30236 25914 -29295 30510 95777 97298 55708 -117752
22036 -117752 -130198 -114043 -194241 -227026 -194260 -104008 32357 62975 -153 23442 100200
22025 100200 106034 24547 -75442 -55969 -18028 -83778 -93404 -40606 1059 313 -20003 -71487
22013 -71487 -51103 45289 11442 -68543 -66455 -142338 -195968 -232951 -186146 -51601 47445 34762
22001 34762 113890 72025 -6674 -51204 -43069 -80346 -144340 -131483 -61161 -4776 -54661 -18837
21989 -18837 -32450 -46942 -5795 -1416 -98236 -78296 -63365 -45108 -22191 40088 41561 27451
$$ packed form
22071A06952j13012q332O0454N534j9782q7575p9173J4147J570n3594p870R7954
22059h2727O7696K6011J1170k8494p611P6317O8893K1659o8278j15354P959Q1420
22047E8661J01041n2902j12284k4752N6150n5209N9805O5267J521m1590j73460
22036a17752j2446J6155q0198l2785L2766R0252J36365L0618o3128K3595P6758
22025A00200N834q1487r9989J9473L7941o5750r626N2798M1665p46k0316n1484
22013g1487K0384R6392l3847p9985K088p5883n3630l6983M6805J34545R9046j2683
22001C4762P9128m1865p8699m4530Q135l7277o3994J2857P0322N6385m9885L5824
21989a8837j3613j4492M1147M379r6820J9940J4931J8257K2917O2279J473j4110
$$ plain form
21977 27451 -7349 -71686 -69526 -8727 -20327 6593 78594 70953 63883 35032 61476 52920
21965 52920 17431 8882 47450 21494 64563 48414 34600 -55267 -30294 -23450 25990 56502
21953 56502 -41262 -337 41449 49307 73606 28364 -22994 -9153 20483 17779 -24355 -10001
21941 -10001 -82167 -113662 -152067 -184390 -158996 -38777 12776 28902 57058 66086 63035 90575
21929 90575 20135 -80045 -22606 81770 112382 68595 41357 56130 15255 -82536 -245350
21918 -245350 -213631 -143423 -110810 -120873 -689 35453 81979 147805 177286 148560 121334
21907 121334 -7330 -14064 4279 -94005 -75939 -22489 -5017 85565 128617 200918 177480
21896 177480 168640 161664 175662 69164 -2994 37449 72736 110918 71446 55954 57714 -42884
$$ packed form
21977B7451l4800o4337K160O0799j1600K6920P2001p641p070k8851K6444q556
21965E2920l5489q549L8568k5956M3069j6149j3814q9867K4973O844M9440L0512
21953E6502r7764M0925M1786P858K4299m5242n1358J3841K9636k704m2134J4354
21941a0001p2166l1495l8405l2323K5394J20219N1553J6126K8156R028l051K7540
21929I0575p0440j00180N7439J04376L0612m3787k7238J4773m0875r7791j62814
21918b45350L1719P0208L2613j0063J20184L6142M6526O5826K9481k8726k7226
21907A21334j28664o734J8343r8284J8066N3450J7472R0582M3052P2301k3438
21896A77480q840o976J3998j06498p2158M0443L5287L8182l9472j5492J760j00598
$$ plain form
21884 -42884 -68455 -14149 -30423 14683 118048 64865 -6741 45079 74636 26038 -42456
21873 -42456 15456 134854 115156 77322 35406 14380 69316 -6866 -107278 -20325 8290
21862 8290 9740 -44322 -6489 -14906 -7073 2662 -16378 -39178 -102104 -8747 16346 -18192 -61273
21849 -61273 -50681 41485 -490 -81066 -44973 -20444 -54437 -66324 -43193 -55515 -48000 -182029
21837 -182029 -235185 -152599 -116981 -96357 -61958 -19611 -24532 -26244 -71712 -68368 -55690 -61221
21825 -61221 -72854 -100674 -64939 -117385 -123088 -53592 -50667 -83737 -112673 -160468 -74395 -73071
21813 -73071 -34187 14121 -26934 -40026 -44124 -41430 -33401 -51695 -109335 -72381 -115625 -169418
21801 -169418 -99386 -47724 -2797 135335 110888 10274 -53333 -11896 82643 114259 31166
$$ packed form
21884d2884k5571N4306j6274M5106J03365n3183p1606N1820K9557m8598o8494
21873d2456N7912J19398j9698l7834m1916k1026N4936p6182j00412Q6953K8615
21862H290J450n4062L7833q417P833R735j9040k2800o2926R3357K5093l4538m3081
21849f1273J0592R2166m1975q0576L6093K4529l3993j1887K3131j2322P515j34029
21837a82029n3156Q2586L5618K0624L4399M2347m921j712m5468L344J2678n531
21825f1221j1633k7820L5735n2446n703O9496K925l3070k8936m7795Q6073J324
21813g3071L8884M8308m1055j3092m098K694Q029j8294n7640L6954m3244n3793
21801a69418P0032N1662M4927J38132k4447j00614o3607M1437R4539L1616q3093
$$ plain form
21790 31166 -77908 -135497 -105439 17196 126118 64067 -57629 -94368 -75623 -135302 -127312
21779 -127312 -134520 9928 33245 -42477 -45037 -75100 -49692 -4576 -33953 -66980 -125121 -66608
21767 -66608 -16316 -27564 -2123 28780 59361 28823 5880 62246 146833 119119 98194 87454
21755 87454 156521 132690 97213 57934 97409 157455 188258 173379 130044 38266 3626 12839
21743 12839 52345 49833 22302 69446 20031 -16258 49836 213566 182464 78418 4774
21732 4774 8765 -49479 -77089 -27260 -888 -17861 -2376 64740 58823 37727 29661 12505
21720 12505 -683 -139643 -105174 -74482 -38167 -65877 -113347 -53198 -18201 -55850 -71481
21709 -71481 3564 -67738 -118656 -44862 -37577 -45264 -49111 -37782 -12413 -51760 -31877 -9854
$$ packed form
21790C1166j09074n7589L0058J22635J08922o2051j21696l6739J8745n9679P990
21779a27312p208J44448K3317p5722k560l0063K5408M5116k9377l3027n8141N8513
21767f6608N0292j1248K5441L0903L0581l0538k2943N6366Q4587k7714k0925j0740
21755H7454O9067k3831l5477l9279L9475O0046L0803j4879m3335r1778l4640R213
21743A2839L9506k512k7531M7144m9415l6289O6094J63730l1102j04046p3644
21732D774L991n8244k7610M9829K6372j6973J5485O7116n917k1096q066j7156
21720A2505j3188j38960L4469L0692L6315k7710m7470O0149L4997l7649j5631
21709g1481P5045p1302n0918P3794P285p687l847J1329K5369l9347J9883K2023
$$ plain form
21697 -9854 -5181 -90151 -73931 -48469 -38965 -45736 -1790 16043 59308 38956 8835 -55407
21685 -55407 -153015 -170337 -126956 5251 113150 110946 20412 -65746 -86930 -109547 -76864
21674 -76864 -79501 -90221 -56082 -33780 -32703 -8843 19747 -16539 -5082 33652 4827 -55693
21662 -55693 -48522 20976 73406 30059 -36594 -52879 -60616 -23165 -46106 -180721 -172058 -119267
21650 -119267 -110505 -109795 -89843 -45188 -5620 44765 -76713 -125019 -105584 9488 15802 -21346
21638 -21346 -100585 -147221 -82179 -64378 -53689 -57405 -89652 -169958 -158182 -85507 -82203 -90222
21626 -90222 -72974 -27257 11334 18048 17194 42913 58317 32920 8779 32855 34014 -12320
21614 -12320 -126679 -107185 -87792 2552 18886 -25182 -67406 7540 40455 19409 -38235
$$ packed form
21697i854M673q4970J6220K5462R504o771M3946J7833M3265k0352l0121o4242
21685e5407r7608j7322M3381J32207J07899k204r0534q6158k1184k2617L2683
21674g6864k637j0720L4139K2302J077K3860K8590l6286J1457L8734k8825o0520
21662e5693P171O9498N2430m3347o6653j6285p737L7451k2941j34615Q663N2791
21650a19267Q762P10J9952M4655L9568N0385j21478m8306J9435J15072O314l7148
21638b1346p9239m6636O5042J7801J0689l716l2247q0306J1776P2675L304q019
21626i0222J7248M5717L8591O714q54K5719J5404k5397k4141K4076J159m6334
21614a2320j14359J9494J9393R0344J6334m4068m2224P4946L2915k1046n7644
$$ plain form
21603 -38235 -131176 -58092 29105 -6941 -61972 -72222 -46766 -45840 -81618 -40953 75642 101865
21591 101865 94868 68012 116398 93987 55365 33694 4037 -47398 -31772 42799 -35554 -147605
21579 -147605 -126092 -83497 -103331 -124446 -129392 -133164 -130831 -113487 -28812 -14960 -85535 -146162
21567 -146162 -81091 -77458 -94990 -166054 -115509 -28642 18827 79996 51682 -38459 967 -50388
21555 -50388 -42067 -16425 89623 111944 84339 46512 -27627 -51790 -105151 -214706 -162554
21544 -162554 -46458 -75396 -65124 58681 39317 80338 127615 138932 121456 27209 12458
21533 12458 98459 105643 95664 96177 36591 23499 20585 -67872 -110361 -78340 -50293 -22711 41486
21520 41486 113997 180494 129020 -12602 -119646 -103993 -88760 -50794 32432 73527 83030
$$ packed form
21603c8235r2941P3084Q7197l6046n5031j0250K5456R26l5778M0665J16595K6223
21591A01865o997k6856M8386k2411l8622k1671k9657n1435J5626P4571p8353j12051
21579a47605K1513M2595j9834k1115m946l772K333J7344Q4675J3852p0575o0627
21567a46162O5071L633j7532p1064N0545Q6867M7469O1169k8314r0141L9426n1355
21555e0388Q321K5642J06048K2321k7605l7827p4139k4163n3361j09555N2152
21544a62554J16096k8938J0272J23805j9364M1021M7277J1317j7476r4247j4751
21533A2458Q6001P184r979N13n9586j3092k914q8457m2489L2021K8047K7582O4197
21520D1486P2511O6497n1474j41622j07044J5653J5233L7966Q3226M1095R503
$$ plain form
21509 83030 8770 -73035 -139670 -91499 12063 82798 164623 173144 87549 18584 18399 42199
21497 42199 77419 89915 49470 -9451 11284 87435 58711 55214 23753 12191 -22971 2382
21485 2382 81785 -3974 -61372 -4664 21072 -35982 -44047 -37593 -38023 41818 37677 41915 42020
21472 42020 45556 32985 -73800 -152038 -172272 -109916 -106844 -111376 -73135 -55108 -30906 -59040
21460 -59040 -7379 21408 48927 91383 56435 67126 42968 10783 -2673 -85200 -452 17734
21448 17734 -21660 7760 -23418 -59270 -11233 91150 63824 35189 -37774 22210 59993
21437 59993 -29714 -97061 -130565 -113980 -49811 -76753 -25529 9660 -15216 -110358 -109982 -33391
21425 -33391 -54015 -113873 -143880 -168631 -84514 261 3346 24259 -23767 -80553 -99837 -98152
$$ packed form
21509H3030p4260q1805o6635M8171J03562P0735Q1825Q521q5595o8965j85K3800
21497D2199L5220J2496m0445n8921K0735P6151k8724l497l1461j1562l5162K5353
21485B382P9403q5759n7398N6708K5736n7054q065O454m30P9841m141M238J05
21472D2020L536j2571j06785p8238k0234O2356L072m532L8241J8027K4202k8134
21460e9040N1661K8787K7519M2456l4948J0691k4158l2185j3456q2527Q4748J8186
21448A7734l9394K9420l1178l5852M8037J02383k7326k8635p2963N9984L7783
21437E9993q9707o7347l3504J6585O4169k6942N1224L5189k4876r5142L76P6591
21425c3391k0624n9858l0007k4751Q4117Q4775L085K0913m8026n6786j9284J685
$$ plain form
21413 -98152 -55803 -48418 -27587 -48969 -46785 31135 66051 157923 132881 74448 44366 -35721
21401 -35721 -38462 9975 43404 41890 18826 18874 29523 49795 17977 74766 86595 49086 10290
21388 10290 -24239 15193 21807 -32858 981 28164 -12928 76631 175448 130953 -10953 -29806
21376 -29806 20809 63678 136680 101061 47449 60886 54993 7510 -57909 44142 99695 55046
21364 55046 17866 9072 -40075 13532 72608 -35090 -115863 -141666 -85680 -31760 28074 77786
21352 77786 86450 82478 108107 141932 127296 63042 25573 28939 28734 -36970 -83874 -86896 -93747
21339 -93747 -78613 -61635 -15469 66933 137151 142920 34094 -56688 -58258 -61645 -7244 -235
21327 -235 22472 101903 109898 50680 -6310 42857 95512 113304 79244 140566 189288 154124
$$ packed form
21413i8152M2349P385K0831k1382K184P7920L4916R1872k5042n8433l0082q0087
21401c5721k741M8437L3429j514k3064M8J0649K0272l1818N6789J1829l7509l8796
21388A0290l4529L9432O614n4665L3839K7183m1092Q9559R8817m4495j41906j8853
21376b9806N0615M2869P3002l5619n3612J3437n893m7483o5419J02051N5553m4649
21364E5046l7180q794m9147N3607N9076j07698q0773k5803N5986N3920N9834M9712
21352G7786Q664l972K5629L3825j4636o4254l7469L366k05o5704m6904l022o851
21339i3747J5134J6978M6166Q2402P0218N769j08826r0782j570l387N4401P009
21327b35K2707P9431P995n9218n6990M9167N2655J7792l4060O1322M8722l5164
$$ plain form
21315 154124 47067 -22804 -45629 -51035 -33318 -9424 -5917 1154 -46017 -12663 105521 57385
21303 57385 4898 -2264 -40353 -40942 -59895 -78299 -96973 -29509 25580 -69436 -180218 -203585
21291 -203585 -87171 3629 56384 14214 36729 79749 60028 50345 -3039 -83580 -88056 -48651
21279 -48651 -74793 -115501 -150085 -19780 68316 -15201 -61033 -64709 -103481 -84466 -78040 -153370
21267 -153370 -98771 -50580 -26284 -9279 29935 30747 53217 35733 36561 21452 14797 -15183
21255 -15183 -51361 -66459 -72533 -160054 -231306 -160083 -57981 -45126 -53801 -51591 -1727 18191
21243 18191 -91393 -144672 -137059 -160161 -209919 -59706 35847 36187 35399 78698 52296 32696
21231 32696 -46920 -111492 -149317 -198492 -126706 -60041 -43611 -86532 -154006 -102164 -35615 26017
$$ packed form
21315A54124j07057o9871k2825n406J7717K3894L507P071m7171L3354J18184m8136
21303E7385n2487p162l8089n89j8953j8404j8674O7464N5089r5016j10782k3367
21291b03585J16414R0800N2755m2170K2515M3020j9721r683n3384q0541m476L9405
21279d8651k6142m0708l4584J30305Q8096q3517m5832l676l8772J9015O426p5330
21267a53370N4599M8191K4296J7005L9214Q12K2470j7484Q28j5109o655k9980
21255a5183l6178j5098o074q7521p1252P1223J02102J2855q675K210M9864J9918
21243A8191j09584n3279P613k3102m9758J50213R5553L40p88M3299k6402j9600
21231C2696p9616o4572l7825m9175P1786O6665J6430m2921o7474N1842O6549O1632
$$ plain form
21219 26017 27515 -30109 -30357 -73217 -59427 -70147 -38145 -50246 15067 34982 33947 -7944
21207 -7944 -13304 -10297 -103703 -128734 -161582 -168012 -192899 -173726 -176873 -132774 -165356 -190720 -147881
21194 -147881 -162855 -167847 -89912 1397 -8827 -51146 -100580 -6809 67591 40904 -47858 -7954
21182 -7954 18047 3345 54375 59031 113863 72910 -70651 -79591 -45256 -64776 -58621 49950
21170 49950 117454 86471 54787 33197 28504 38096 18966 69150 144578 155797 177188 129151
21158 129151 107995 -11702 -53198 -61979 -106952 -104508 -37574 -12489 13331 -3173 -1185 52143
21146 52143 11531 37177 129655 127244 56289 -4221 -24905 -35558 -35773 -63462 -76513 -14474
21134 -14474 107975 170625 139962 116514 108904 171026 141279 95789 65029 57361 -27934 -43828
$$ packed form
21219B6017J498n7624k48m2860J3790j0720L2002j2101O5313J9915j035m1891
21207g944n360L007r3406k5031l2848o430k4887J9173l147M4099l2582k5364M2839
21194a47881j4974m992P7935R1309j0224m2319m9434R3771P4400k6687q8762L9904
21182g954K6001j4702N1030M656N4832m0953j43561q940L4335j9520O155J08571
21170D9950O7504l0983l1684k1590m693R592j9130N0184P5428J1219K1391m8037
21158A29151k1156j19697m1496q781m4973K444O6934K5085K5820j6504J988N3328
21146E2143m0612K5646R2478k411p0955o0510k0684j0653k15k7689j3051O2039
21134a4474J22449O2650l0663k3448p610O2122k9747m5490l0760p668q5295j5894
$$ plain form
21122 -43828 39524 27233 52646 49509 57675 130728 187195 193089 185788 129471 59220 119036
21110 119036 116013 28862 14420 71364 26661 12959 -85634 -182385 -122311 -58789 -79501 -68699
21098 -68699 -26477 -38761 40901 156353 137346 5868 -23009 -37601 -67397 22798 122148
21087 122148 141760 179735 28424 9247 -37997 -74404 1011 54842 89826 39823 -89756
21076 -89756 8177 -7899 -61911 -8600 -85011 -58842 -7448 -16766 -26975 -50653 -520 2212
21064 2212 -86171 -67286 -75473 -118699 -118383 -78296 -150224 -264821 -271942 -180065 -172346 -157824 -126279
21051 -126279 -118215 -49091 -73143 -63197 -11970 -9604 75614 94608 77898 42344 989 -59876
21039 -59876 -55189 -92796 -62751 13039 9530 -38368 -92560 -102542 -153293 -78376 27489 34901
$$ packed form
21122d3828Q3352j2291K5413l137Q166P3053N6467N894p301n6317p0251N9816
21110A19036l023q7151j4442N6944m4703j3702r8593r6751O0074O3522k0712J0802
21098f8699M2222j2284P9662J15452j9007j31478k8877j4592k9796R0195R9350
21087A22148J9612L7975j51311j9177m7244l6407P5415N3831L4984n0003j29579
21076h9756R7933j6076n4012N3311p6411K6169N1394r318j0209k3678N0133K732
21064B212q8383J8885q187m3226L16M0087p1928j14597p121R1877P719J4522L1545
21051a26279Q064O9124k4052R946N1227K366Q5218J8994j6710l5554m1355o0865
21039e9876M687l7607L0045P5790l509m7898n4192r982n0751P4917J05865P412
$$ plain form
21027 34901 -32571 -36140 44776 92671 54808 39743 3601 -56723 -31891 -34013 -17838 48565
21015 48565 30547 -52609 -113105 -99328 -79283 -87478 -178466 -229612 -145973 -143290 -50194 56912
21003 56912 82427 73692 45986 44363 -47601 -96795 22171 45491 12524 -12705 -27680 21183
20991 21183 -37656 -56930 -127221 -87991 -3023 22529 -26126 15623 59384 26258 -4213 -16174
20979 -16174 46674 35705 45731 148311 99097 5437 47536 -29700 -109473 -116554 -7805
20968 -7805 57940 83316 68818 29222 1676 -20697 33441 61049 109204 85386 51070 68162
20956 68162 115146 71186 -38916 -4850 616 11649 85429 53485 62602 33438 49826 127847
20944 127847 183175 166623 142667 88786 58592 31750 -39064 -56650 61234 35506 -56014
$$ packed form
21027C4901o7472l569Q0916M7895l7863j5065l6142o0324K4832k122J6175O6403
21015D8565j8018q3156o0496J3777K0045q195r0988n1146Q3639K683R3096J07106
21003E6912K5515q735k7706j623r1964m9194J18966K3320l2967k5229j4975M8863
20991B1183n8839j9274p0291L9230Q4968K5552m8655M1749M3761l3126l0471j1961
20979a6174O2848j0969J0026J02580m9214r3660M2099p7236p9773p081J08749
20968g805O5745K5376j4498l9596k7546k2373N4138K7608M8155k3818l4316J7092
20956F8162M6984m3960j10102L4066N466J1033P3780l1944R117k9164J6388P8021
20944A27847N5328j6552k3956n3881l0194k6842p0814j7586J17884k5728r1520
$$ plain form
20933 -56014 -95087 -130943 -87911 38041 107602 49258 -14341 17528 37424 56056 48438 49827
20921 49827 82327 113722 -290 21866 61742 108065 48679 -96205 -94375 -59965 -71444
20910 -71444 -66707 -51092 6588 63960 26336 -1154 -28620 -82003 -78149 -64426 28427 25268
20898 25268 -69267 -95034 -46834 -23056 -95562 -121435 -94938 -63058 -50130 -3587 35407 54729
20886 54729 26144 57892 146988 213164 203641 132344 94039 46144 65654 42299 92364 131910
20874 131910 80679 35183 -35537 -95071 -73123 -47945 -41285 16398 18142 -35345 -39935 -49827
20862 -49827 -30490 79149 117469 80061 13356 -7104 -938 61895 -37198 -61943 -82132 -165106
20850 -165106 -179171 -122359 -81748 -130761 -163885 -140736 -121616 -153195 -194550 -174664 -148539
$$ packed form
20933e6014l9073l5856M3032J25952O9561n8344o3599L1869J9896J8632p618J389
20921D9827L2500L1395j14012K2156L9876M6323n9386j44884J830L4410j1479
20910g1444M737J5615N7680N7372l7624k7490k7466n3383L854J3723R2853l159
20898B5268r4535k5767M8200K3778p2506k5873K6497L1880J2928M6543L8994J9322
20886E4729k8585L1748Q9096O6176r523p1297l8305m7895J9510k3355N0065L9546
20874A31910n1231m5496p0720n9534K1948K5178O660N7683J744n3487m590r892
20862d9827J9337J09639L8320l7408o6705k0460O166O2833r9093k4745k0189q2974
20850a65106j4065N6812M0611m9013l3124K3149J9120l1579m1355J9886K6125
$$ plain form
20839 -148539 -116617 -64388 -89569 -123446 -142035 -113507 -119810 -113628 -95930 -71309 -2464 36275
20827 36275 -36612 -36503 -34031 7160 -31120 -14449 -31917 2901 -6030 -121015 -196753 -146144
20815 -146144 -55508 21708 5696 -84123 -38381 -18218 -7548 -30025 -106026 -116250 -109168 -80676
20803 -80676 -48339 -56081 -30780 25773 18486 -17838 -56280 40108 132968 76379 -28494 24042
20791 24042 71229 51383 53018 -37797 -80476 -80352 21673 67858 101935 141786 91697 9323
20779 9323 -53179 -47860 -79732 -35456 56414 85593 56724 -14175 -42710 -14438 48093 31866
20767 31866 7119 93891 88496 27908 -89614 -36228 74123 111650 124177 163522 59147
20756 59147 -1565 -25655 50269 50593 -16635 -100895 -177311 -132948 -101034 -45336 7369 26416
$$ packed form
20839a48539L1922N2229k5181l3877j8589K8528o303O182J7698K4621O8845L8739
20827C6275p2887J09K472M1191l8280J6671j7468L4818q931j14985p5738N0609
20815a46144R0636P7216j6012q9819M5742K0163J0670k2477p6001j0224P082K8492
20803h0676L2337p742K5301N6553p287l6324l8442R6388R2860n6589j04873N2536
20791B4042M7187j9846J635r0815m2679J24J02025M6185L4077L9851n0089q2374
20779I323o2502N319l1872M4276R1870K9179k8869p0899k8535K8272O2531j6227
20767C1866k4747Q6772n395o0588j17522N3386J10351L7527J2527L9345j04375
20756E9147o0712k4090P5924L24o7228q4260p6416M4363L1914N5698N2705J9047
$$ plain form
20744 26416 21962 -2941 -24132 39675 -23947 30768 -2431 -540 6611 -44341 -66613 -85481
20732 -85481 -88976 -100657 -48883 -12349 -18894 65363 107106 8080 -6063 41358 75275 108477
20720 108477 36634 -1573 5238 2754 18164 32161 32585 44877 -1690 -16416 -66862 -67612 -7653
20707 -7653 56914 33039 -38455 39133 23820 -49630 -54794 -31306 -16957 -25485 -71285 -64792
20695 -64792 -49889 -50490 -47410 -83174 -126346 -85317 -53515 53406 68345 5769 183 -54892
20683 -54892 -118897 -85213 -1042 19581 -11884 -23925 -97795 -114161 -56811 11177 53796 81957
20671 81957 44823 -32411 -16553 -14780 -77727 -83974 -110254 -92759 -14183 29398 11847 -90756
20659 -90756 -116363 -29920 6857 88824 71357 85229 76964 25391 7965 61297 28583 21378
$$ packed form
20744B6416m454k4903k1191O3807o3622N4715l3199J891P151n0952k2272j8868
20732h5481l495j1681N1774L6534o545Q4257M1743r9026j4143M7421L3917L3202
20720A08477p1843l8207O811k484J5410J3997M24J2292m6567j4726n0446p50N9959
20707g653O4567k3875p1494P7588j5313p3450n164K3488J4349q528m5800O493
20695f4792J4903o01L080l5764m3172M1029L1802J06921J4939o2576n586n5075
20683e4892o4005L3684Q4171K0623l1465j2041p3870j6366N7350O7988M2619K8161
20671H1957l7134p7234J5858J773o2947o247k6280J7495P8576M3581j7551j02603
20659i0756k5607Q6443L6777Q1967j7467J3872q265n1573j7426N3332l2714p205
$$ plain form
20647 21378 -42618 -81137 -46780 36814 -9024 -67782 -16058 -6708 30590 20384 4815 50969
20635 50969 83147 116755 88147 82710 53958 -16017 -46555 -56518 -13894 -38442 -5307 -15527
20623 -15527 5797 -5803 -49848 -20 159669 166282 108249 94184 42393 -3727 -26723 34256
20611 34256 73051 136325 111353 50805 40345 -27209 -173328 -131530 -26662 65494 99678
20600 99678 30929 6695 35188 52727 33869 65380 71331 1232 26985 34859 161391 245452
20588 245452 202840 179268 156332 140981 145775 46499 -7914 -2388 64939 31282 71680 40777
20576 40777 60247 173779 153333 142531 211826 250173 278501 260618 216021 263948 490377
20565 490377 736338 1012104 1202787 1402933 1563772 1497762 1274643 1066451 873314 553715
$$ packed form
20647B1378o3996l8519L4357Q3594m5838n8758N1724R350L7298j0206j5569M6154
20635E0969L2178L3608k8608n437k8752o9975l0538r963M2624k4548L3135j0220
20623a5527K1324j1600m4045M9828J59689O613n8033j4065n1791m6120k2996O0979
20611C4256L8795O3274k4972o0548j0460o7554j46119M1798J04868R2156L4184
20600I9678o8749k4234K8493J7539j8858L1511N951p0099K5753P874J26532Q4061
20588B45452m2612k3572k2936j5351M794r9276n4413N526O7327l3657M0398l0903
20576D0777J9470J13532k0446j0802O9295L8347K8328j7883m4597M7927K26429
20565D90377K45961K75766J90683K00146J60839o6010k23119k08192j93137l19599
$$ plain form
20555 553715 356956 249907 155394 190745 308901 380737 267791 183163 185314 224429 190804
20544 190804 215329 218529 181048 133484 90215 28945 111287 78240 -7648 -3766 77223 100361
20532 100361 179434 195330 134296 88876 53888 61025 125728 138745 59689 40028 78361 43713
20520 43713 -29136 3141 -36913 16790 23886 -2319 -6044 26226 56625 201353 126751 35848
20508 35848 27139 14251 20007 65986 -5404 -101561 -194606 -180868 -82877 -60459 -53904 -44779
20496 -44779 48718 97975 149751 143384 59119 -30579 -9002 14204 31420 -17680 -79480 -45934
20484 -45934 -1233 -20641 31326 200316 233169 130181 49227 41962 33453 -42904 -24086 -85475
20472 -85475 -43036 37868 44885 4710 -26280 22686 120985 143114 31652 31655 26903 -15600 -13375
$$ packed form
20555E53715j96759j07049r4513L5351J18156P1836j12946q4628K151L9115l3625
20544A90804K4525L200l7481m7564m3269o1270Q2342l3047q5888L882Q0989K3138
20532A00361P9073J5896o1034m5420l4988P137O4703J3017p9056j9661L8333l4648
20520D3713p2849L2277m0054N3703P096k6205l725L2270L0399J44728p4602r0903
20508C5848q709j2888N756M5979p1390r6157r3045J3738R7991K2418O555R125
20496d4779R3497M9257N1776o367q4265q9698K1577K3206J7216m9100o1800L3546
20484d5934M4701j9408N1967J68990L2853j02988q0954p265q509p6357J8818o1389
20472h5475M2439Q0904P017m0175l0990M8966R8299K2129j11462Lm752m2503K225
$$ plain form
20459 -13375 18196 -31581 -79943 -89070 -911 77654 33609 51533 56126 9470 -22408 34508
20447 34508 96474 103741 47780 17084 41464 21510 1505 50283 97964 108361 17878 14617
20435 14617 16902 44981 61072 41563 -57145 -76113 -112067 -147068 -101501 10595 82985 471
20423 471 -24660 -21873 9731 23420 44660 11478 -3693 -7504 26071 -2438 -145649 -169214
20411 -169214 -109446 -88791 -85542 -50896 -5583 81180 118514 155079 168778 192384 164319 76657
20399 76657 40654 -32810 -54593 -9473 106011 163838 131525 65020 41988 76168 158172
20388 158172 223824 150062 108791 78840 56622 -5936 -38730 7851 -50107 -35303 -35087 -41533
20376 -41533 -64379 -6367 68837 182793 221141 178776 121889 96928 52045 -45637 -90282
$$ packed form
20459a3375L1571m9777m8362r127Q8159P8565m4045J7924M593m6656l1878N6916
20447C4508O1966P267n5961l0696K4380j9954k0005M8778M7681J0397r0483l261
20435A4617K285K8079J6091j9509r8708j8968l5954l5001M5567J12096P2390q2514
20423D71k5131K787L1604J3689K1240l3182j5171l811L3575k8509j43211k3565
20411a69214N9768K0655L249L4646M5313Q6763L7334L6565J3699K3606k8065q7662
20399G6657l6003p3464k1783M5120J15484N7827l2313o6505k3032L4180Q2004
20388A58172O5652p3762m1271k9951k2218o2558l2794M6581n7958J4804K16o446
20376d1533k2846N8012P5204J13956L8348m2365n6887k4961m4883r7682m4645
$$ plain form
20365 -90282 -98268 6997 79675 109284 87244 110544 151832 114774 202306 293097 248252 228101
20353 228101 260938 234527 146458 4934 -64965 -118439 -91189 -139056 -49377 -3069 41524
20342 41524 -3073 -13329 81056 101253 57009 26913 -12335 -15712 57890 58945 34128 62743
20330 62743 27027 16055 -70765 -45660 12601 -16567 -21941 43201 141465 97229 114418 92636
20318 92636 17529 19240 106641 117962 144053 157902 104705 63300 43848 -3450 -184 -8093
20306 -8093 18201 47205 119072 129182 162902 -2675 -59600 -151865 -85932 -76553 -46024 53525
20294 53525 88389 55963 51270 21210 -76279 -96732 -79553 -29883 75258 154961 184827 183502
20282 183502 192127 150409 -34303 4540 74141 83328 84285 47828 -41265 -12806 44377 64276
$$ packed form
20365i0282p986J05265P2678K9609k2040K3300M1288l7058Q7532R0791m4845k0151
20353B28101L2837k6411q8069j41524o9899n3474K7250m7867Q9679M6308M4593
20342D1524m4597j0256R4385K0197m4244l0096l9248l377P3602J055k4817K8615
20330F2743l5716j0972q6820K5105N8261k9168n374O5142R8264m4236J7189k1782
20318I2636p5107J711Q7401J1321K6091J3849n3197m1405j9452m7298L266p909
20306h093K6294K9004P1867J0110L3720j65577n6925r2265O5933R379L0529R9549
20294E3525L4864l2426m693l0060r7489k0453J7179M9670J05141P9703K9866j325
20282A83502Q625m1718j84712L8843O9601R187R57l6457q9093K8459N7183J9899
$$ plain form
20270 64276 90267 89004 94107 193423 178436 85504 62493 -18818 -22791 12886 22438 114880
20258 114880 205702 179346 144354 102701 120490 134844 93067 15230 99195 100992 113455 2036
20246 2036 -21867 -17719 48395 92564 91530 55222 50914 30354 27258 -12205 -38177 20530 116271
20233 116271 80939 96243 163743 140669 130508 48338 -664 39709 89504 71764 37740
20222 37740 24777 65662 105474 986 9853 98778 175203 126438 -22055 -71966 -56297
20211 -56297 -98315 -91954 -98379 -34162 -91888 -19873 48898 24837 34611 82941 58970 72299
20199 72299 4923 -49344 28271 142985 251400 191006 141022 133569 111227 13017 -42386
20188 -42386 -40312 43267 22898 51712 53995 113022 182520 178440 161489 176886 202513 154572
$$ packed form
20270F4276K5991j263N103R9316j4987r2932k3011q1311l973L5677R552R2442
20258A14880R0822k6356l4992m1653J7789J4354m1777p7837Q3965J797J2463j11419
20246B036k3903M148O6114M4169j034l6308m308k0560l096l9463k5972N8707R5741
20233A16271l5332J5304O7500k3074j0161q2170m9002M0373M9795j7740l4024
20222C7740j2963M0885L9812j04488Q867Q8925P6425m8765j48493m9911J5669
20211e6297m2018O361o425O4217n7726P2015O8771k4061R774M8330k3971J3329
20199G2299o7376n4267P7615J14714J08415o0394m9984p453k2342r8210n5403
20188d2386K074Q3579k0369K8814K283N9027O9498m080j6951J5397K5627m7941
$$ plain form
20176 154572 168045 186287 283530 267980 166349 217896 288233 290231 263575 174278 181370 107382
20164 107382 68872 72704 173615 241943 219225 245132 238907 235905 264666 285542 386146 413868
20152 413868 363919 341852 296709 211275 156664 187619 226061 221070 155133 147703 156579 67984
20140 67984 148436 142570 130249 64164 90910 144858 179940 143442 107494 167695 230690 286841
20128 286841 259839 208842 188481 201304 159954 103383 73355 88478 56483 150895 278458
20117 278458 332171 303463 341974 323807 209321 94825 87799 79397 60868 92511 173652
20106 173652 217570 189587 205963 118531 148648 185698 215260 205045 129454 119882 162909 131341
20094 131341 94265 170342 177267 172754 178139 157085 71807 28066 -29793 69508 161167 131137
$$ packed form
20176A54572J3473J8242R7243j5550j01631N1547P0337J998k6656q9297P092p3988
20164A07382l8510L832J00911O8328k2718K5907o225l002K8761K0876J00604K7722
20152D13868m9949k2067m5143q5434n4611L0955L8442m991o5937p430Q876q8595
20140F7984Q0452n866j2321o6085K6746N3948L5082l6498l5948O0201O2995N6151
20128B86841k7002n0997k0361J2823m1350n6571l0028J5123l1995R4412J27563
20117B78458N3713k8708L8511j8167j14486j14496p026q402j8529L1643Q1141
20106A73652M3918k7983J6376q7432L0117L7050K9562j0215p5591r572M3027l1568
20094A31341l7076P6077O925m513N385k1054q5278m3741n7859R9301R1659l0030
$$ plain form
20082 131137 92926 80676 63027 138614 157963 181676 265560 279988 209389 207345 253508 295836
20070 295836 331010 345767 334789 299795 220242 201567 239196 256881 297382 290108 306583 376002
20058 376002 294334 251959 292257 311487 362864 337570 285231 302463 361189 394565 399647 349319
20046 349319 216107 167517 190930 315948 361236 400957 338900 293942 372947 361735 325626
20035 325626 346618 443472 489805 543526 579800 546062 519351 516973 530660 523525 543824 645194
20023 645194 725341 803904 1022239 1272751 1396388 1573613 1658939 1667133 1645842 1619429 1577028
20012 1577028 1423165 1260965 1087149 939597 752450 710954 726457 810452 802257 740496
20002 740496 700714 581457 471861 549856 663028 612949 476404 538499 643849 620983
$$ packed form
20082A31137l8211j2250j7649P5587J9349K3713Q3884J4428p0599k044M6163M2328
20070B95836L5174J4757j0978l4994p9553j8675L7629J7685M0501p274J6475O9419
20058C76002q1668m2375M0298J9230N1377k5294n2339J7232N8726L3376N082n0328
20046C49319j33212m8590K3413J25018M5288L9721o2057m4958P9005j1212l6109
20035C25626K0992R6854M6333N3721L6274l3738k6711k378J3687p135K0299J01370
20023F45194Q0147P8563K18335K50512J23637J77225Q5326Q194k1291k6413m2401
20012A577028j53863j62200j73816j47552j87147m1496J5503Q3995q195o1761
20002G40496l9782j19257j09596P7995J13172n0079j36545O2095J05350k2866
$$ plain form
19992 620983 588524 595111 648242 738775 851783 899209 810060 710756 694969 649778 648578 673112
19980 673112 685133 679516 711540 691617 627032 743874 810625 783011 762673 792220 809539
19969 809539 763242 744652 814394 847658 936672 991452 922836 939758 924229 994404 1058691
19958 1058691 1120329 1171799 1228156 1259457 1305136 1411301 1406438 1463021 1598140 1738518 1784577
19947 1784577 1904018 2037140 2085878 2158363 2385677 2677938 2987205 3305215 3699343 4145105
19937 4145105 4452495 4626067 4687500 4776400 4689939 4586707 4545665 4591294 4799672 5121241
19927 5121241 5513347 5832835 6081456 6328643 6670990 7081475 7466020 8018590 8814726
19918 8814726 9771980 10772386 11925431 13399226 15230952 17495809 20275740 23665685
$$ packed form
19992F20983l2459O587N3131R0533J13008M7426q9149r9304j5787m5191j200K4534
19980F73112J2021n617L2024j9923o4585J16842O6751k7614k0338K9547J7319
19969H09539m6297j8590O9742L3264Q9014N4780o8616J6922j5529P0175O4287
19958A058691O1638N1470N6357L1301M5679J06165m863N6583J35119J40378M6059
19947A784577J19441J33122M8738P2485K27314K92261L09267L18010L94128M45762
19937D145105L07390J73572O1433Q8900q6461j03232m1042M5629K08378L21569
19927E121241L92106L19488K48621K47187L42347M10485L84545N52570P96136
19918H814726R57254J000406J153045J473795J831726K264857K779931L389945
$$ plain form
19910 23665685 28042372 33753970 41199493 51181695 64962505 84068435 110648945 146332147
19902 146332147 190145197 235173036 269454799 282811762 271305884 239231939 197516471
19895 197516471 156411040 121628572 94652732 74671791 60021036 49165010 40996867
19888 40996867 34734700 29809072 25984773 22815808 20252590 18143180 16352485 14874542
19880 14874542 13629068 12669523 11761871 10886057 10095244 9318956 8600036 8064704 7632185
19871 7632185 7276866 6880209 6415708 5992853 5641870 5498990 5344329 5227341 5316976 5458793
19861 5458793 5368631 5076095 4765733 4353409 3869708 3432085 3021772 2772851 2489313 2346567
19851 2346567 2271806 2115461 1994719 1991381 1990567 1922756 1948155 1894863 1856514 1843127 1926953
$$ packed form
19910B3665685M376687N711598P445523R982202J3780810J9105930K6580510L5683202
19902A46332147M3813050M5027839L4281763J3356963j1505878l2073945m1715468
19895A97516471m1105431l4782468k6975840j9980941j4650755j0856026q168143
19888D0996867o262167m925628l824299l168965k563218k109410j790695j477943
19880A4874542j245474r59545r07652q75814p90813p76288p18920n35332m32519
19871G632185l55319l96657m64501m22855l50983j42880j54661j16988Q9635J41817
19861E458793r0162k92536l10362m12324m83701m37623m10313k48921k83538j42746
19851B346567p4761j56345j20742l338q14o7811K5399n3292l8349j3387Q3826
$$ plain form
19840 1926953 1953218 1978351 2112157 2282667 2514245 2897102 3450233 4386354 5858406 7707134
19830 7707134 9743535 10899168 10453370 8904069 7119926 5569411 4331748 3450841
19822 3450841 2844629 2386819 2048594 1763772 1543338 1445277 1320247 1166686 1018715 961113
19812 961113 929747 850286 763405 643361 636055 604999 645962 673176 672827 688595 597524 571931
19800 571931 594572 529135 482504 439247 348415 328570 262185 251917 290667 408377 353154
19789 353154 302536 326614 395173 469410 495348 453937 366331 374050 280651 238927 263465 371599
19777 371599 384593 255760 162607 219509 304822 337812 298834 316827 264591 294046 339681
19766 339681 308879 194116 131498 160128 236148 321329 180482 116340 126269 182988 197566
$$ packed form
19840A926953K6265K5133J33806J70510K31578L82857N53131R36121J472052J848728
19830G707134K036401J155633m45798j549301j784143j550515j237663q80907
19822C450841o06212m57810l38225k84822k20434r8061j25030j53561j47971n7602
19812I61113l1366p9461q6881j20044p306l1056M0963K7214l49J5768r1071k5593
19800E71931K2641o5437m6631m3257r0832j9845o6385j0268L8750J17710n5223
19789C53154n0618K4078O8559P4237K5938m1411q7606P719r3399m1724K4538J08134
19777C71599J2994j28833r3153N6902Q5313L2990l8978J7993n2236K9455M5635
19766C39681l0802j14763o2618K8630P6020Q5181j40847o4142R929N6719J4578
$$ plain form
19755 197566 140377 125091 158792 167442 127450 83056 145713 221850 257942 253521 205996 172318
19743 172318 215413 212303 128480 150508 144575 88876 101392 146371 182084 72350 -22616 -18416
19731 -18416 99726 87822 29027 120269 124463 142997 102992 66047 104755 8625 -13598 48560
19719 48560 192669 178150 73490 26556 14273 41298 81376 153633 100016 11557 73270
19708 73270 65998 9377 43024 144369 238511 135207 96205 89061 175689 115535 52995 43810
19696 43810 173002 230988 184883 71400 96433 223925 228097 128987 92103 102625 131008
19685 131008 132103 207227 160708 81912 144197 254476 229666 209530 218187 170167 187560 194212
19673 194212 197433 111712 95095 126186 149714 115615 105363 81357 123845 170133 83367 120420
$$ packed form
19755A97566n7189j5286L3701Q650l9992m4394O2657P6137L6092m421m7525l3678
19743A72318M3095l110q3823K2028n933n5699J2516M4979L5713j09734r4966M200
19731a8416J18142j1904n8795R1242M194J8534m0005l6945L8708r6130k2223O2158
19719D8560J44109j4519j04660m6934j2283K7025M0078P2257n3617q8459O1713
19708G3270p272n6621L3647J01345R4142j03304l9002p144Q6628o0154o2540r185
19696D3810J29192N7986m6105j13483K5033J27492M172r9110l6884J0522K8383
19685A31008J095P5124m6519p8796O2285J10279k4810k0136Q657m8020J7393O652
19673A94212L221q5721j6617L1091K3528l4099j0252k4006M2488M6288q6766L7053
$$ plain form
19661 120420 185305 153584 119652 -27918 -72881 -116573 -148979 -180908 -122432 -48105 36761
19650 36761 118302 89708 68380 124414 139042 54645 3156 29669 92530 175898 151410 154959
19638 154959 149912 101619 84341 79269 41345 67806 112005 219114 257121 221121 166154 125847
19626 125847 206990 257965 285001 263056 224104 249385 226244 269419 342188 301682 286611
19615 286611 219001 229290 304764 337724 317566 238474 115502 189134 215484 153405 157345
19604 157345 167312 102293 112496 68517 47159 27291 65697 110141 195551 215796 169607 179690
19592 179690 102225 43053 -1878 4797 79639 196128 161194 87210 99322 54136 78871
19581 78871 178805 153599 184484 181508 191076 257729 237491 191413 84840 83385 183093 254391
$$ packed form
19661A20420O4885l1721l3932j47570m4963m3692l2406l1929N8476P4327Q4866
19650C6761Q1541k8594k1328N6034J4628q4397n1489K6513O2861Q3368k4488L549
19638A54959n047m8293j7278n072l7924K6461M4199J07109L8007l6000n4967m0307
19626A25847Q1143N0975K7036k1945l8952K5281k3141M3175P2769m0506j5071
19615B86611o7610J0289P5474L2960k0158p9092j22972P3632K6350o2079L940
19604A57345R967o5019J0203m3979k1358j9868L8406M4444Q5410K0245m6189J0083
19592A79690p7465n9172m4931O675P4842J16489l4934p3984J2112m5186K4735
19581G8871R9934k5206L0885k976R568O6653k0238m6078j06573j455R9708P1298
$$ plain form
19569 254391 229811 154569 152629 70158 75 -2915 12152 30293 124340 153364 221132 263568
19557 263568 186312 71222 45554 85644 138185 143942 136510 173096 179732 100009 65037 85215
19545 85215 112100 84839 86230 178178 277516 312660 282659 417143 448325 363723 303302 342127
19533 342127 459237 403895 270296 255936 239899 214186 222862 258863 277213 285333 346629
19522 346629 365739 395089 268512 235405 255982 311422 210770 188505 245612 297840 384749
19511 384749 428157 448003 484678 491107 408764 383111 348571 276346 315708 304709 405308
19500 405308 453358 405088 236072 208386 201130 319498 359049 301574 318127 491837 545043
19489 545043 538633 565038 458586 442765 519091 508890 541065 479914 483744 471028 468000 510662
$$ packed form
19569B54391k4580p5242j940q2471p0083k990J5067J8141R4047K9024O7768M2436
19557B63568p7256j15090k5668M0090N2541N757p432L6586O636p9723l4972K0178
19545H5215K6885k7261J391R1948R9338L5144l0001J34484L1182q4602o0421L8825
19533C42127J17110n5342j33599j4360j6037k5713Q676L6001J8350Q120O1296
19522C46629J9110K9350j26577l3107K0577N5440j00652k2265N7107N2228Q6909
19511C84749M3408J9846L6675O429q2343k5653l4540p2225L9362j0999J00599
19500D05308M8050m8270j69016k7686p256J18368L9551n7475J6553J73710N3206
19489E45043o410K6405j06452j5821P6326j0201L2175o1151L830j2716l028M2662
$$ plain form
19477 510662 483119 424612 421452 416120 543789 554522 477983 516084 507490 502280 527227 540689
19465 540689 476961 454757 470888 496925 493875 454283 512814 603994 626981 604380 564890 551560
19453 551560 524272 575124 641532 642678 681066 705742 786282 854587 917527 847770 715668
19442 715668 695749 673819 674872 702629 838554 889506 981079 1002826 977287 1084398 1097263
19431 1097263 1138016 1094863 1072785 1062228 1055950 1151541 1152691 1063215 1061386 1107169 1275623 1516281
19419 1516281 1579887 1519544 1584009 1620085 1644441 1815353 1969480 2140202 2210830 2274365 2349078
19408 2349078 2398674 2509814 2570142 2622248 2743136 2889001 3045549 3238478 3407445 3492217
19398 3492217 3567055 3696145 3888068 4073044 4322188 4717618 5097644 5457768 5830163 6316458
$$ packed form
19477E10662k7543n8507l160n332J27669J0733p6539L8101q594n210K4947J3462
19465E40689o3728k2204J6131K6037l050l9592N8531R1180K2987k2601l9490j3330
19453E51560k7288N0852O6408J146L8388K4676Q0540O8305O2940o9757j32102
19442G15668j9919k1930J053K7757J35925N0952R1573K1747k5539J07111J2865
19431A097263M0753m3153k2078j0557o278R5591J150q9476j829M5783J68454K40658
19419A516281O3606o0343O4465L6076K4356J70912J54127J70722P0628O3535P4713
19408B349078M9596J11140O0328N2106J20888J45865J56548J92929J68967Q4772
19398C492217P4838J29090J91923J84976K49144L95430L80026L60124L72395M86295
$$ plain form
19388 6316458 6934218 7562544 8164506 8661048 9196980 9940457 10745565 11553859 12506494
19379 12506494 13810217 15299618 17141673 19451641 22418347 26208639 31033178 37241905
19371 37241905 45282393 56010855 70526239 90261429 116770731 150787532 190040445
19364 190040445 227512223 253608532 261124747 247984429 218890876 182667433 147198888
19357 147198888 116863040 92817716 74450965 60674709 50267140 42212866 35943466
19350 35943466 30970911 27047334 23871099 21325903 19238721 17553258 16124067 14788040
19342 14788040 13631338 12753664 11833790 11083117 10517058 9824903 8931285 8105707 7463799
19333 7463799 6849936 6279499 5742705 5360911 5048085 4677164 4430153 4291523 4018774
$$ packed form
19388F316458O17760O28326O01962M96542N35932P43477Q05108Q08294R52635
19379A2506494J303723J489401J842055K309968K966706L790292M824539O208727
19371C7241905Q040488J0728462J4515384J9735190K6509302L4016801L9252913
19364A90040445L7471778K6096309P516215j3140318k9093553l6223443l5468545
19357A47198888l0335848k4045324j8366751j3776256j0407569q054274o269400
19350C5943466m972555l923577l176235k545196k087182j685463j429191j336027
19342A4788040j156702q77674r19874p50673n66059o92155q93618q25578o41908
19333G463799o13863n70437n36794l81794l12826l70921k47011j38630k72749
$$ plain form
19324 4018774 3850003 3722670 3556989 3356237 3206055 2969236 2789686 2565595 2414116
19315 2414116 2465373 2486518 2413194 2332323 2240028 2057368 1895388 1756289 1722150 1630665 1459561
19304 1459561 1390974 1359093 1313578 1190780 1146527 1094052 1021302 943404 905040 843545 755898
19293 755898 746940 810845 868007 788562 737129 801084 818372 884750 911791 868969 777720 688282
19281 688282 596409 596810 600481 597879 564134 553331 534349 457337 382457 407845 339651 365429
19269 365429 319554 329640 320413 402588 308279 282659 306952 357231 351467 327312 318644 321216
19257 321216 344527 447221 498055 528454 531910 510607 375374 313067 320091 333170 303897
19246 303897 327398 342705 381588 342878 369395 434049 467427 508024 509896 511550 622422 743406
$$ packed form
19324D018774j68771j27333j65681k00752j50182k36819j79550k24091j51479
19315B414116N1257K1145p3324q0871r2295j82660j61980j39099l4139r1485j71104
19304A459561o8587l1881m5515j22798m4253n2475p2750p7898l8364o1495q7647
19293G55898q958O3905N7162p9445n1433O3955J7288O6378K7041m2822r1249q9438
19281F88282r1873M01L671k602l3745j0803j8982p7012p4880K5388o8194K5778
19269C65429m5875J0086r227Q2175r4309k5620K4293N0279n764k4155q668K572
19257C21216K3311J02694N0834L0399L456k1303j35233o2307P024J3079k9273
19246C03897K3501J5307L8883l8710K6517O4654L3378M0597J872J654J10872J20984
$$ plain form
19234 743406 829310 930557 1154343 1371910 1620910 1664192 1708024 1669846 1411578 1133683
19224 1133683 931661 767368 591561 503213 547425 508644 370830 317422 269272 233117
19214 233117 313880 359630 306189 294761 315596 289851 310451 239403 217295 266111 178014
19203 178014 180037 236011 291025 303948 287055 299252 292020 300742 208748 220092 161923 141744
19191 141744 144083 212706 189845 162107 180194 192657 157614 127428 117631 77832 67115 17965
19179 17965 52398 65100 111380 128028 141888 183571 233649 135328 191746 115470 88923 144991
19167 144991 180784 110029 39121 10446 19632 83272 136456 95043 83059 17569 -13578 45536
19155 45536 96486 183902 158597 121915 54412 49105 31604 69613 110312 120721 86457 60344
$$ packed form
19234G43406Q5904J01247K23786K17567K49000M3282M3832l8178k58268k77895
19224A133683k02022j64293j75807q8348M4212l8781j37814n3408m8150l6155
19214B33117Q0763M5750n3441j1428K0835k5745K0600p1048k2108M8816q8097
19203A78014K023N5974N5014J2923j6893J2197p232Q722r1994J1344n8169k0179
19191A41744K339O8623k2861k7738J8087J2463l5043l0186r797l9799j0717m9150
19179A7965L4433J2702M6280J6648J3860M1683N0078r8321N6418p6276k6547N6068
19167A44991L5793p0755p0908k8675R186O3640N3184m1413j1984o5490l1147N9114
19155D5536N0950Q7416k5305l6682o7503n307j7501L8009M0699J0409l4264k6113
$$ plain form
19143 60344 53369 32353 43609 -15675 -17996 85052 117976 154379 169254 266967 263990 138726
19131 138726 136683 173847 213519 164659 68930 34348 -2669 -29556 -39538 51516 150629 175047
19119 175047 137359 92856 86553 85855 170423 150982 181838 74126 16020 95449 137931 160370
19107 160370 115682 119889 180230 195832 145627 126437 54799 -13376 17519 -16906 47146 155932
19095 155932 159978 89615 -40301 -112426 -32988 75958 78995 60493 46440 14475 -35253
19084 -35253 -13502 6769 57265 37016 90536 109526 122975 250303 230951 182366 215783
19073 215783 243270 217046 147795 58265 -42313 -115266 -144299 -115694 -44212 9135 11288
19062 11288 28069 -95035 -66476 27171 174121 159984 150791 102636 -17992 -33448 -17096
$$ packed form
19143F0344o975k1016J1256n9284k321J03048L2924L6403J4875R7713k977j25264
19131A38726k043L7164L9672m8860r5729l4582l7017k6887r982R1054R9113K4418
19119A75047l7688m4503o303o98Q4568j9441L0856j07712n8106P9429M2482K2439
19107A60370m4688M207O0341J5602n0205j9190p1638o8175L0895l4425O4052J08786
19095A55932M046p0363j29916p2125P9438J08946L037j8502j4053l1965m9728
19084c5253K1751K0271N0496k0249N3520J8990J3449J27328j9352m8585L3417
19073B15783K7487k6224o9251q9530j00578p2953k9033K8605P1482N3347K153
19062A1288J6781j23104K8559R3647J46950j4137r193m8155j20628j5456J6352
$$ plain form
19051 -17096 16483 34727 27337 -1440 15138 20536 21707 55088 49032 -13380 18721 4862
19039 4862 13833 47671 104617 126323 135134 87505 69896 104806 103704 114031 -2478 -33858
19027 -33858 -91732 -25565 5661 12467 83887 122884 125693 94146 100322 80111 68327 -16162
19015 -16162 -41997 -23764 7336 -3192 46216 56540 64367 21858 11329 78827 60720 105026
19003 105026 161346 58420 55491 74302 80354 108143 131365 94805 61040 154743 224354 142485
18991 142485 35558 33133 86421 72240 47177 72999 80571 50452 57347 18963 20304 22304
18979 22304 29388 46694 78718 109661 13787 8718 -25842 7865 -17367 -15955 59621 -22911
18967 -22911 -41844 -42712 4574 117285 33989 -43004 40320 58367 -28376 -95088 -105857 -115303
$$ packed form
19051a7096L3579J8244p390k8777J6578N398J171L3381o056o2412L2101j3859
19039D862Q971L3838N6946K1706Q811m7629j7609L4910j102J0327j16509l1380
19027c3858n7874O6167L1226O806P1420L8997K809l1547O176k0211j1784q4489
19015a6162k5835J8233L1100j0528M9408J0324P827m2509j0529O7498j8107M4306
19003A05026N6320j02926k929J8811O052K7789K3222l6560l3765R3703O9611q1869
18991A42485j06927k425N3288j4181k5063K5822P572l0119O895l8384J341K000
18979B2304P084J7306L2024L0943r5874n069l4560L3707k5232J412P5576q2532
18967b2911j8933q68M7286J12711q3296p6993Q3324J8047q6743o6712j0769r446
$$ plain form
18955 -115303 -19746 39859 29395 -12304 19018 93187 148765 83875 73798 137337 162448
18944 162448 65692 28937 53744 24971 -35694 -18142 25581 8487 -69237 -147372 -127735
18933 -127735 -115353 -55251 -48783 -4651 14768 13664 -33036 -72076 -39022 -21905 -29023 -1799
18921 -1799 58646 63744 -3048 51857 64641 142931 124171 28875 -437 -29081 13066 -18061
18909 -18061 -11884 -1560 -49117 -35098 70652 56217 16520 -48884 -97342 -77271 -40884 12500
18897 12500 -16618 -42826 -74378 -35583 8822 41371 53343 61337 86728 136534 206158 275000
18885 275000 299012 337187 440528 543352 586727 544582 567607 597804 497738 464583 459270
18874 459270 480636 408416 476361 564043 574597 627668 692723 700395 725849 778271 805252 703959
$$ packed form
18955a15303R5557N9605j0464m1699L1322P4169N5578o4890j0077O3539K5111
18944A62448r6756l6755K4807k8773o0665J7552M3723j7094p7724p8135J9637
18933a27735J2382O0102O468M4132J9419j104m6700l9040L3054J7117p118K7224
18921a799O0445N098o6792N4905J2784P8290j8760r5296k9312k8644M2147l1127
18909a8061O177J0324m7557J4019J05750j4435l9697o5404m8458K0071L6387N3384
18897A2500k9118k6208l1552L8795M4405L2549J1972P994K5391M9806O9624O8842
18885B75000K4012L8175J03341J02824M3375m2145K3025L0197j00066l3155n313
18874D59270K1366p2220O7945Q7682J0554N3071O5055P672K5454N2422K6981j01293
$$ plain form
18862 703959 667332 650839 594868 487225 362489 378748 414034 453510 467401 478323 367208
18851 367208 299028 330391 316844 198765 127467 116303 109617 92040 171142 155121 46750
18840 46750 18767 124456 284520 327322 278493 329627 433836 423413 295380 254352 267128
18829 267128 330148 318445 264778 289621 369340 513682 675606 748544 731961 664863 500158
18818 500158 523452 503645 521720 626055 781971 782404 628901 481650 463134 566034 745104
18807 745104 966238 979983 912490 788985 606547 450453 363233 227594 209761 240866
18797 240866 240733 328786 366436 274951 162596 128567 88362 95306 165762 201319 262213 193817
18785 193817 108833 158682 207246 101935 13748 21149 78403 135935 172151 141350 78945
$$ packed form
18862G03959l6627j6493n5971j07643j24736J6259L5286L9476J3891J0922j11115
18851C67208o8180L1363j3547j18079p1298j1164o686j7577P9102j6021j08371
18840D6750k7983J05689J60064M2802m8829N1134J04209j0423j28033m1028J2776
18829B67128O3020j1703n3667K4843P9719J44342J61924P2938j6583o7098j64705
18818E00158K3294j9807J8075J04335J55916M33j53503j47251j8516J02900J79070
18807G45104K21134J3745o7493j23505j82438j56094q7220j35639j7833L1105
18797B40866j33Q8053L7650r1485j12355l4029m0205O944P0456L5557O0894o8396
18785A93817q4984M9849M8564j05311q8187P401N7254N7532L6216l0801o2405
$$ plain form
18774 78945 52369 94173 138136 165254 211531 368478 645426 775380 717106 560260 384864
18763 384864 308116 232492 195825 137436 160815 259702 219232 163498 167101 157178 63275 48653
18751 48653 52768 153825 210270 205263 172262 151322 102203 130084 164565 214966 191167 81864
18739 81864 10158 73433 94661 40174 29713 28001 -5843 17023 32765 9376 19931 89515
18727 89515 117666 84423 8460 -74231 -61011 51322 93866 122704 121354 206282 143909 135014
18715 135014 218315 278137 311571 303271 355884 401266 414936 467502 525078 640405 741936
18704 741936 873704 979224 1144571 1312996 1387184 1339991 1261536 1140199 945317 810424
18694 810424 685153 638539 542180 394536 300152 294823 302297 216361 228271 239173 238611 151018
$$ packed form
18774G8945k6576M1804M3963K7118M6277J56947K76948J29954n8274j56846j75396
18763C84864p6748p5624l6667n8389K3379R8887m0470n5734L603r923r3903j4622
18751D8653M115J01057N6445n007l3001k0940m9119K7881L4481N0401k3799j09303
18739H1864p1706O3275K1228n4487j0461j712l3844K2866J5742k3389J0555O9584
18727H9515K8151l3243p5963q2691J3220J12333M2544K8838j350Q4928o2373q895
18715A35014Q3301N9822L3434q300N2613M5382J3670N2566N7576J15327J01531
18704G41936J31768J05520J65347J68425P4188m7193p8455j21337j94882j34893
18694H10424j25271m6614r6359j47644r4384n329P474q5936J1910J0902n62q7593
$$ plain form
18682 151018 215449 279714 245873 123834 136689 173450 139245 59029 20098 113010 157866
18671 157866 214936 216174 154960 160712 133027 103089 130501 130182 91835 70956 85702 152593
18659 152593 158591 157365 121513 84696 19307 48460 38186 7636 59494 87593 128619 127296
18647 127296 136627 246766 264393 276549 279538 260541 221778 227781 308365 320219 225063 233559
18635 233559 234140 221281 220948 153954 130181 133117 156153 172001 152872 41470 -10013 -24545
18623 -24545 43860 89542 127672 122460 173231 211397 296367 369764 271285 261348 240041 216028
18611 216028 282133 313239 257078 236089 245213 283457 248148 172516 72076 87772 117904
18600 117904 122200 192018 219989 211131 244513 169690 147320 142018 194891 235390 255757 219923
$$ packed form
18682A51018O4431O4265l3841j22039J2855L6761l4205q0216l8931R2912M4856
18671A57866N7070J238o1214N752k7685k9938K7412l19l8347k0879J4746O6891
18659A52593N998j226l5852l6817o5389K9153j0274l0550N1858K8099M1026j323
18647A27296R331J10139J7627J2156K989j8997l8763O003Q0584J1854r5156Q496
18635B33559N81j2859l33o6994k3773K936K3036J5848j9129j11402n1483j4532
18623b4545O8405M5682L8130n212N0771L8166Q4970P3397r8479r937k1307k4013
18611B16028O6105L1106n6161k0989R124L8244l5309p5632j00440J5696L0132
18600A17904M296O9818K7971q858L3382p4823k2370n302N2873M0499K0367l5834
$$ plain form
18588 219923 244771 204666 164327 228620 207019 218671 282337 277811 238826 211992 136921 141012
18576 141012 289762 325130 375264 371153 371183 244665 189296 136581 139673 168325 172262 280256
18564 280256 364859 294469 327550 419792 397982 392942 332166 319906 327979 335255 293782 236594
18552 236594 164215 175885 233933 189463 93391 128523 125533 147484 195813 171307 178142 173708
18540 173708 137456 102044 88122 142891 154846 118723 127366 127134 142056 159572 174681 122014
18528 122014 192844 278944 317305 299380 290726 284370 248130 273890 324204 345490 304937 291080
18516 291080 296313 159244 110262 181788 233947 211684 223952 259119 245967 228618 208772
18505 208772 218527 236316 279997 308693 365313 391750 270670 216924 174714 210317 227863
$$ packed form
18588B19923K4848m0105m0339O4293k1601J1652O3666m526l8985k6834p5071M091
18576A41012J48750L5368N0134m111L0j26518n5369n2715L092K8652L937J07994
18564B80256Q4603p0390L3081R2242k1810n040o0776j2260Q073P276m1473n7188
18552B36594p2379J1670N8048m4470r6072L5132k990K1951M8329k4506O835m434
18540A73708l6252l5412j3922N4769J1955l6123Q643k32J4922J7516J5109n2667
18528A22014P0830Q6100L8361j7925q654o356l6240K5760N0314K1286m0553j3857
18516B91080N233j37069m8982P1526N2159k2263J2268L5167j3152j7349j9846
18505B08772R755J7789M3681K8696N6620K6437j21080n3746m2210L5603J7546
$$ plain form
18494 227863 232536 185408 211174 349332 402329 391983 384133 338413 331302 258521 306250 328068
18482 328068 261999 209653 204521 196773 176944 193123 161767 167625 153450 200440 334483 399952
18470 399952 361272 293349 353411 320020 309758 301541 246916 182253 141026 247860 234387
18459 234387 207756 212675 233766 215703 233683 306861 380596 450830 452527 387686 333409 319994
18447 319994 386425 433410 449638 484937 453350 395107 391376 432251 478337 572001 764716
18436 764716 779366 768706 740366 689437 576373 560540 581796 587129 680576 725003 681523
18425 681523 671602 579615 468524 459273 458814 523580 558443 635219 717332 842020 879146 870253
18413 870253 886272 912697 943850 905996 954050 1068464 1170245 1187036 1211031 1171152 1311397
$$ packed form
18494B27863M673m7128K5766J38158N2997j0346p850m5720p111p2781M7729K1818
18482C28068o6069n2346n132p748j9829J6179l1356N858j4175M6990J34043O5469
18470C99952l8680o7923O0062l3391j0262q217n4625o4663m1227J06834j3473
18459B34387k6631M919K1091j8063J7980P3178P3735P0234J697o4841n4277j3415
18447C19994O6431M6985J6228L5299l1587n8243l731M0875M6086R3664J92715
18436G64716J4650j0660k8340n0929j13064j5833K1256N333R3447M4427m3480
18425F81523r921r1987j11091r251m59O4766L4863P6776Q2113J24688L7126q893
18413H70253J6019K6425L1153l7854M8054J14414J01781J6791K3995l9879J40245
$$ plain form
18402 1311397 1473406 1567971 1652499 1753606 1924719 2139934 2325864 2591015 2982797 3523103
18392 3523103 4291816 5106140 5863417 6551646 7358567 8684937 10992879 14612495 19173602
18383 19173602 23375754 25206852 24030522 20957871 17575381 14998003 13596360 13181223
18375 13181223 13659426 15026370 17235756 20162530 24247003 30206384 39322679 54264291
18367 54264291 79364494 118783521 171337816 225460104 261446116 267958584 248481818
18360 248481818 210803484 166450370 125380205 93466711 72125568 59727813 54528111
18353 54528111 55439232 61909612 72573771 83377807 88061488 82929294 70407151 55536386
18345 55536386 42249991 32241353 25395366 21009124 18223542 16431228 15330869 14698436
$$ packed form
18402A311397J62009R4565Q4528J01107J71113K15215J85930K65151L91782N40306
18392C523103P68713Q14324P57277O88229Q06921J326370K307942L619616M561107
18383A9173602M202152J831098j176330l072651l382490k577378j401643m15137
18375A3181223M78203J366944K209386K926774M084473N959381R116295J4941612
18367E4264291K5100203L9419027N2554295N4122288L5986012O512468j9476766
18360B48481818l7678334m4353114m1070165l1913494k1341143j2397755n199702
18353E4528111R11121O470380J0664159J0804036M683681n132194j2522143j4870765
18345E5536386j3286395j0008638o845987m386242k785582j792314j100359o32433
$$ plain form
18337 14698436 14434465 14304422 14232009 14142514 13963361 13676824 13690722 14148227 14985360 16416009
18327 16416009 18903843 23252873 30515064 41896508 57332277 73818666 85395605
18320 85395605 87024655 79773485 68922794 59480281 54122502 53660177 58832957 71214062
18312 71214062 94152035 130368872 178966982 232972055 279687833 304787645 294570745
18305 294570745 252078142 195127439 141075870 99460651 71057439 52983608 41668161
18298 41668161 34428132 29483262 25809883 22995824 20913360 19718823 19693588 21314278
18290 21314278 24697159 29153387 32680418 33039742 29771499 24633808 19395688 15366987
18282 15366987 12635634 10764608 9570473 8585835 7504294 6305016 5336010 4573525
$$ packed form
18337A4698436k63971j30043p2413q9495j79153k86537J3898M57505Q37133J430649
18327A6416009K487834M349030P262191J1381444J5435769J6486389J1576939
18320H5395605J629050p251170j0850691r442513n357779m62325N172780J2381105
18312G1214062K2937973L6216837M8598110N4005073M6715778K5099812j0216900
18305B94570745m2492603n6950703n4051569m1615219k8403212j8073831j1315447
18298D1668161p240029m944870l673379k814059k082464j194537k5235J620690
18290B1314278L382881M456228L527031L59324l268243n137691n238120m028701
18282A5366987k731353j871026j194135r84638j081541j199278r69006p62485
$$ plain form
18274 4573525 3983498 3630535 3380381 3084919 2815325 2608037 2452048 2310417 2124351
18265 2124351 1973941 1893478 1860234 1720287 1648920 1561181 1480814 1460432 1308032 1124911
18255 1124911 1031201 1013058 985024 985631 886316 811637 755334 747461 786523 785033 772858 682467
18243 682467 603889 541852 494311 520385 469265 408874 410225 318162 300313 373665 488794
18232 488794 546147 562888 506263 551555 536598 440749 359305 352922 420703 510199 381040
18221 381040 309677 289961 305383 331625 384249 409237 379507 347848 400797 446114 488308
18210 488308 415472 421589 492234 450388 429075 366129 246895 216591 310197 253066 195471
18199 195471 245750 293888 361234 407953 332339 352057 320489 245985 233260 211179 136238
$$ packed form
18274D573525n90027l52963k50154k95462k69594k07288j55989j41631j86066
18265B124351j50410q0463l3244j39947p1367q7739q0367k0382j52400j83121
18255A124911r3710j8143k8034O07r9315p4679n6303p873L9062j490j2175r0391
18243F82467p8578o2037m7541K6074n1120o0391J351r2063j7849P3352J15129
18232D88794N7353J6741n6625M5292j4957r5849q1444o383O7781Q9496j29159
18221C81040p1363j9716J5422K6242N2624K4988k9730l1659N2949M5317M2194
18210D88308p2836O117P0645m1846k1313o2946j19234l0304R3606n7131n7595
18199A95471N0279M8138O7346M6719p5614J9718l1568p4504j2725k2081p4941
$$ plain form
18188 136238 189449 212567 181472 140542 120181 156494 252044 260520 246357 195822 236052 253127
18176 253127 272025 260173 308146 306779 285570 164925 57135 100612 153003 99988 91328
18165 91328 78030 107772 176774 204740 182519 144623 118919 119070 121945 65050 61045 132954
18153 132954 223917 325809 331223 268669 269079 271820 239461 201073 222455 210219 318742 427625
18141 427625 513749 567528 540522 470987 564309 577802 622654 701289 732887 745204 844890
18130 844890 904288 851522 844558 969961 1096535 1353788 1587158 1842712 2129835 2408810
18120 2408810 2778412 3410980 4341891 5639054 7315698 9614901 13504478 20283105 32962894
18111 32962894 57998337 103998212 157995381 159226313 121455952 82665518 51851895
$$ packed form
18188A36238N3211K3118l1095m0930k0361L6313R5550Q476j4163n0535M0230J7075
18176B53127J8898j1852M7973j367k1209j20645j07790M3477N2391n3015q660
18165I1328j3298K9742O9002K7966k2221l7896k5704J51K875n6895m005P1909
18153A32954R0963J01892N414o2554M10K741l2359l8388K1382j2236J08523J08883
18141D27625Q6124N3779k7006o9535R3322J3493M4852P8635L1598J2317R9686
18130H44890N9398n2766o964J25403J26574K57253K33370K55554K87123K78975
18120B408810L69602O32568R30911J297163J676644K299203L889577O778627J2679789
18111C2962894K5035443M5999875N3997169J230932l7770361l8790434l0813623
$$ plain form
18104 51851895 32649267 21814467 15587008 11875628 9468923 7703613 6418822 5435549
18096 5435549 4641188 4028027 3468437 3077900 2817446 2585989 2382652 2194399 2001720
18087 2001720 1712595 1510854 1398676 1229074 1106281 1059807 1041352 1030279 994848 1013329
18077 1013329 968687 821650 687852 582004 514156 413128 384964 349463 317787 363852
18067 363852 392192 419759 414872 443102 377644 277013 337751 398555 379078 229731 151747
18056 151747 81083 80035 111103 119282 101019 184755 291088 206737 165385 109427 113313 78784
18044 78784 112418 116304 122072 128843 113827 143206 174515 226103 240404 251474 181130 105055
18032 105055 168876 187663 48032 60012 71094 -19691 -125687 -122110 -102168 -151413 -94297
$$ packed form
18104E1851895j9202628j0834800o227459l711380k406705j765310j284791r83273
18096E435549p94361o13161n59590l90537k60454k31457k03337j88253j92679
18087B001720k89125k01741j12178j69602j22793m6474j8455j1073l5431J8481
18077A013329m4642j47037j33798j05848o7848j01028k8164l5501l1676M6065
18067C63852K8340K7567m887K8230o5458j00631O0738O0804j9477j49347p7984
18056A51747p0664j048L1068Q179j8263Q3736J06333q4351m1352n5958L886l4529
18044G8784L3634L886N768O771j5016K9379L1309N1588J4301J1070p0344p6075
18032A05055O3821J8787j39631J1980J1082r0785j05996L577J9942m9245N7116
$$ plain form
18021 -94297 13572 124648 123301 66092 78212 135030 131675 103834 149711 162438 154458 99483
18009 99483 106739 124984 208874 218459 118577 98991 103514 30235 8071 108281 138044 43097
17997 43097 -17749 32247 2680 -73954 -9256 42549 78858 107209 54337 4487 -15834 -16773
17985 -16773 -52186 -86422 -152100 -96930 -71947 -120504 -139766 -195889 -150479 -140646 -132843 -47874
17973 -47874 -82513 -125686 -52939 11369 9024 50526 51940 -34944 -101291 -41535 22950 123953
17961 123953 209282 180149 98424 47697 -6847 -21413 57283 135437 204541 133776 32972
17950 32972 15103 153950 252407 387645 358197 361644 399760 358655 336759 312921 301323
17939 301323 224849 143179 187838 185466 267319 306680 376332 444399 500889 788386 1255594
$$ packed form
18021i4297J07869J11076j347n7209J2120N6818l355k7841M5877J2727p980n4975
18009I9483P256J8245Q3890R585r9882j9586M523p3279k2164J00210K9763r4947
17997D3097o0846M9996k9567p6634O4698N1805L6309K8351n2872m9850k0321r39
17985a6773l5413l4236o5678N5170K4983m8557j9262n6123M5410R833P803Q4969
17973d7874l4639m3173P2747O4308k345M1502J414q6884o6347N9756O4485J01003
17961A23953Q5329k9133q1725n0727n4544j4566P8696P8154O9104p0765j00804
17950C2972j7869J38847R8457J35238k9448L447L8116m1105k1896k3838j1598
17939C01323p6474q1670M4659k372Q1853L9361O9652O8067N6490K87497M67208
$$ plain form
17928 1255594 1887582 2667168 3385195 3835038 3739118 3313673 2696747 2087647 1632443 1405579
17918 1405579 1221088 957575 728913 724975 890687 1154883 1289608 1311988 1204920 1029189
17908 1029189 704730 548080 415465 322009 316287 249461 204940 91405 80843 128049 313984
17897 313984 373287 368811 340438 338443 288720 334190 332880 244111 188317 292300 607398 862204
17885 862204 1107768 1258232 1294256 1317177 1174638 986865 908994 904917 902268 1039732 1356693
17874 1356693 1923624 2730967 3585235 4334609 4766696 4708204 4102315 3241276 2388078 1750964
17864 1750964 1217807 986459 913325 886071 810436 905785 958562 933549 916226 838435 708800
17853 708800 822341 1029612 1175284 1250856 1278851 1228545 1175769 1127071 1116797 1227557 1413185
$$ packed form
17928A255594O31988P79586P18027M49843r5920m25445o16926o09100m55204k26864
17918A405579j84491k63513k28662l938J65712K64196J34725K2380j07068j75731
17908A029189l24459j56650j32615r3456n722o6826m4521j13535j0562M7206J85935
17897C13984N9303m476k8373j995m9723M5470j310q8769n5794J03983L15098K54806
17885H62204K45564J50464L6024K2921j42539j87773p7871m077k649J37464L16961
17874A356693N66931Q07343Q54268P49374M32087n8492o05889q61039q53198o37114
17864A750964n33157k31348p3134k7254p5635R5349N2777k5013j7323p7791j29635
17853G08800J13541K07271J45672P5572K7995n0306n2776m8698j0274J10760J85628
$$ plain form
17842 1413185 1433727 1347957 1130981 895960 651747 517057 559184 608196 698192 837543
17832 837543 962061 1087069 1113271 1049721 1037207 1253804 1274805 1177907 1015150 867416
17822 867416 696590 593204 602409 602012 706158 743782 544520 405937 441071 555453 612356
17811 612356 540788 507037 612593 738371 789335 726530 698102 728386 908988 1070054 1053239
17800 1053239 1057751 997480 841917 816399 792030 769412 599796 456551 344409 430592 569826
17789 569826 610955 718558 888572 1160223 1333740 1269254 1124622 1023501 950373 964629
17779 964629 960918 884642 785579 617316 490149 425448 437295 375353 401181 469250 620238
17768 620238 660822 495524 362091 241691 236062 198018 214793 280994 345353 293449 237638
$$ packed form
17842A413185K0542q5770k16976k35021k44213j34690M2127M9012Q9996J39351
17832H37543J24518J25008K6202o3550j2514K16597K1001r6898j62757j47734
17822H67416j70826j03386R205l97J04146L7624j99262j38583L5134J14382N6903
17811F12356p1568l3751J05556J25778N0964o2805k8428L0284J80602J61066j6815
17800A053239M512o0271j55563k5518k4369k2618j69616j43245j12142Q6183J39234
17789E69826M1129J07603J70014K71651J73517o4486j44632j01121p3128J4256
17779I64629l711p6276r9063j68263j27167o4701J1847o1942K5828O8069J50988
17768F20238M0584j65298j33433j20400n629l8044J6775O6201O4359n1904n5811
$$ plain form
17757 237638 137144 34271 11178 -41609 -22151 27856 60323 6058 15657 176886 195455
17746 195455 73358 56717 45586 -18609 -20087 -53274 -90002 -81200 -7590 -9663 21031 68421
17734 68421 27818 -23599 11161 56974 77608 6099 -48983 -56888 -11632 44703 112529 158001
17722 158001 158133 139031 113546 107341 97063 -53365 -122787 -81534 -24751 19523 37249 107604
17710 107604 140614 189342 166712 116685 75464 38426 26024 -54868 -3225 78300 3483
17699 3483 -31168 -26344 27350 28601 -39481 -41692 -34828 -54474 -123408 -105632 -35902 73918
17687 73918 101710 91427 135497 150138 96229 42118 17219 -3411 -48217 -110306 -95767 -56307
17675 -56307 42100 132116 72941 1595 79503 93602 6651 41170 56419 -89829 -138810
$$ packed form
17757B37638j00494j02873k3093n2787J9458N0007L2467n4265R599J61229J8569
17746A95455j22097j6641j1131o4195j478l3187l6728Q802P3610k073L0694M7390
17734F8421m0603n1417L4760M5813K0634p1509n5082p905M5256N6335O7826M5472
17722A58001J32j9102k5485o205j0278j50428o9422M1253N6783M4274J7726P0355
17710A07604L3010M8728k2630n0027m1221l7038j2402q0892N1643Q1525p4817
17699C483l4651M824N3694J251o8082k211O864j9646o8934J7776O9730J09820
17687G3918K7792j0283M4070J4641n3909n4111k4899k0630m4806o2089J4539L9460
17675e6307R8407R0016n9175p1346P7908J4099q6951L4519J5249j46248m8981
$$ plain form
17664 -138810 -58492 -23093 37312 68150 71516 102666 84650 70374 81974 62303 27759 68167
17652 68167 113345 135771 95639 -15312 -41285 -74516 15764 154672 196281 187491 171588
17641 171588 110390 46470 41992 97540 114844 95588 110124 33342 -30870 35918 63155 82769
17629 82769 100914 71172 39914 38213 52456 80375 40733 31990 117794 81265 -9262 -31622
17617 -31622 -19429 -32516 -16049 -7204 23711 19924 9772 -19585 26168 57533 56402 59417
17605 59417 32706 -16573 -48071 -97811 -119671 -64419 -35069 -13411 74313 53727 75286 199389
17593 199389 75044 -30033 87163 303735 397372 373361 338451 323672 214549 168963
17583 168963 170962 92495 79218 47876 -63775 -105052 -79622 -77398 8064 74872 98789 152574
$$ packed form
17664a38810Q0318L5399O0405L0838L366L1150j8016j4276J1600j9671l4544M0408
17652F8167M5178K2426m0132j10951k5973l3231R0280J38908M1609q790j5903
17641A71588o1198o3920m478N5548J7304j9256J4536p6782o4212O6788K7237J9614
17629H2769J8145k9742l1258j701J4243K7919l9642q743Q5804l6529r0527k2360
17617c1622J2193j3087J6467Q845L0915l787j0152k9357M5753L1365j131L015
17605E9417k6711m9279l1498m9740k1860N5252K9350K1658Q7724k0586K1559J24103
17593A99389j24345j05077J17196K16572R3637k4011l4910j4779j09123m5586
17583A68963J999p8467j3277l1342j11651m1277K5430K224Q5462O6808K3917N3785
$$ plain form
17571 152574 156130 148036 165814 120252 84548 -11412 -113851 -116852 -36390 26575 84262 -3786
17559 -3786 -60347 -4000 113875 91248 181607 251137 277544 294433 274795 234544 213351 156375
17547 156375 171801 300049 313165 289470 256704 217229 178026 214900 157076 85144 -16259
17536 -16259 -33030 110456 281814 335365 367953 343128 188493 78764 173606 215837 151464
17525 151464 193604 199049 191320 153378 85462 62926 32767 -77430 -19320 29775 121195 185511
17513 185511 199690 171595 174584 199346 178830 184453 162618 185099 243710 220319 160166 71655
17501 71655 113888 169258 195680 158951 61939 61348 50460 89438 204004 200124 130594 4597
17489 4597 -64218 -31060 -8239 75338 140195 234053 163072 140320 171459 179724 130482 75043
$$ packed form
17571A52574L556q094J7778m5562l5704r5960j02439l001Q0462O2965N7687q8048
17559c786n6561N6347J17875k2627R0359O9530K6407J6889j9638m0251k1193n6976
17547A56375J5426J28248J3116k3695l2766l9475l9203L6874n7824p1932j01403
17536a6259j6771J43486J71358N3551L2588k4825j54635j09729R4842M2231o4373
17525A51464M2140N445p729l7942o7916k2536l0159j10197N8110M9095R1420O4316
17513A85511J4179k8095K989K4762k0516N623k1835K2481N8611k3391o0153q8511
17501G1655M2233N5370K6422l6729r7012n91j0888L8978J14566l880o9530j25997
17489D597o8815L3158K2821Q3577O4857R3858p0981k2752L1139Q265m9242n5439
$$ plain form
17477 75043 165740 183774 113628 119038 140194 87074 94225 126095 150403 142642 42170 -48724
17465 -48724 17558 171101 304616 294639 251357 202639 270960 288212 311299 295466 283731
17454 283731 264100 236516 315086 346843 329894 249980 177705 169001 154656 177647 445622
17443 445622 831648 1096893 1040502 829542 693798 536285 398693 407418 403917 288864
17433 288864 255501 316160 273284 245892 244550 234564 226412 300256 326546 328536 381204 426891
17421 426891 486091 537087 585647 582629 493736 380385 327862 210258 126468 151049 218924
17410 218924 403022 478275 470597 558333 670904 654687 659188 683261 793792 839294 872789
17399 872789 812610 717734 709389 618014 541163 535774 586204 628338 757973 741501 638259
$$ packed form
17477G5043R0697J8034p0146N410K1156n3120P151L1870K4308p761j00472r0894
17465d8724O6282J53543J33515r977m3282m8718O8321J7252K3087j5833j1735
17454B83731j9631k7584P8570L1757j6949p9914p2275q704j4345K2991K67975
17443D45622L86026K65245n6391k10960j35744j57513j37592Q725l501j15053
17433B88864l3363O0659m2876k7392j342r986q152P3844K6290J990N2668M5687
17421D26891N9200N0996M8560l018q8893j13351n2523j17604q3790K4581O7875
17410B18924J84098P5253p678Q7736J12571j6217M501K4073J10531M5502L3495
17399H72789o0179r4876q345r1375p6851n389N0430M2134J29635j6472j03242
$$ plain form
17388 638259 663652 681505 778468 823767 960804 995731 939573 931268 932681 992288 984666 1000514
17376 1000514 1078454 1125436 1216831 1326609 1505125 1692442 1890198 2100437 2378577 2729710
17366 2729710 3165415 3886871 4595315 5202630 5674943 6009391 6324838 7006675 8346423
17357 8346423 10836680 15292939 22107526 29634156 33130538 30707078 25592182 20606501
17349 20606501 16979827 14933538 14153124 14380814 15442949 17215018 19772339 23546917
17341 23546917 29230050 38154549 52811204 78172664 122676690 193122715 274958788
17334 274958788 324041980 325219398 294986056 241235221 182192863 133594232 98975695
17327 98975695 76666393 63497874 57045883 56252443 61903199 74871395 92040970 102465991
$$ packed form
17388F38259K5393J7853R6963M5299J37037L4927n6158q305J413N9607p622J5848
17376A000514P7940M6982R1395J09778J78516J87317J97756K10239K78140L51133
17366B729710M35705P21456P08444O07315M72313L34448L15447O81837J339748
17357H346423K490257M456259O814587P526630L496382k423460n114896m985681
17349B0606501l626674k046289p80414K27690J062135J772069K557321L774578
17341B3546917N683133Q924499J4656655K5361460M4504026P0446025Q1836073
17334B74958788M9083192J177418l0233342n3750835n9042358m8598631l4618537
17327I8975695k2309302j3168519o451991p93440N650756J2968196J7169575J0425021
$$ plain form
17319 102465991 96837276 80011936 61254680 45787631 35061274 28059327 23312799
17312 23312799 19978587 17597881 16026506 15178671 14844542 14597815 14362534 14012946 13535466
17303 13535466 13041624 12829972 13016926 13580583 14651752 16590995 19875663 25364084 35082725
17294 35082725 50672225 71268441 88185426 90481511 80131622 66208416 54780960
17287 54780960 48123180 46503800 49940692 59832544 79527927 113906724 163255083 216396946
17279 216396946 263775498 298392991 291342587 240141209 177534668 124362950 86956342
17272 86956342 62996130 47610109 37340184 30294055 25481219 22041315 19436385 17600191
17264 17600191 16621786 16488727 17535006 20347218 25038259 29876882 31016836 27344512
$$ packed form
17319A02465991n628715j6825340j8757256j5467049j0726357p001947m746528
17312B3312799l334212k380706j571375q47835l34129k46727k35281l49588m77480
17303A3535466m93842k11652J86954N63657J071169J939243L284668N488421R718641
17294C5082725J5589500K0596216J6916985K296085j0349889j3923206j1427456
17287E4780960o657780j619380L436892R891852J9695383L4378797M9348359N3141863
17279B16396946M7378552L4617493p050404n1201378o2606541n3171718l7406608
17272H6956342k3960212j5386021j0269925p046129m812836l439904k604930j836194
17264A7600191r78405j33059J046279K812212M691041M838623J139954l672324
$$ plain form
17256 27344512 21768249 16666296 13023746 10666101 9342758 8445287 7714585 7129226
17248 7129226 6450551 5661087 4892669 4179028 3589755 3219188 2988769 2819806 2645607
17239 2645607 2533232 2395932 2177615 2024849 1855754 1590361 1515703 1421905 1367129 1280710
17229 1280710 1215851 1131098 1129506 1097459 1063433 1016134 923397 910453 903194 896430 785355 737091
17217 737091 632545 529480 577062 614698 572677 553133 523279 443449 377449 287463 279215
17206 279215 327652 377407 385205 532581 514986 425379 436766 480774 546329 477069 365230
17195 365230 351676 332348 299645 217969 188128 241898 338455 319472 281968 384536 424781
17184 424781 387027 375950 390203 327936 392128 491063 569757 630739 669833 869781 1048495
$$ packed form
17256B7344512n576263n101953l642550k357645j323343q97471p30702n85359
17248G129226o78675p89464p68418p13641n89273l70567k30419j68963j74199
17239B645607j12375j37300k18317j52766j69095k65393p4658r3798n4776q6419
17229A280710o4859q4753j592l2047l4026m7299r2737j2944p259o764j11075m8264
17217G37091j04546j03065M7582L7636m2021j9544k9854p9830o6000q9986q248
17206B79215M8437M9755P798J47376j7595q9607J1387M4008O5555o9260j11839
17195C65230j3554j9328l2703q1676k9841N3770R6557j8983l7504J02568M0245
17184D24781l7754j1077J4253o2267O4192R8935P8694O0982L9094J99948J78714
$$ plain form
17173 1048495 1078511 956119 851774 732500 583841 386401 293512 299743 395504 517588
17163 517588 493546 368516 410578 462971 436495 457754 391619 326466 299280 230106 198510
17152 198510 110143 12206 46232 102474 119214 116433 63272 48358 105490 65953 20124 60100
17140 60100 205745 232304 305291 349449 395045 429255 482360 443147 383446 354379 272106
17129 272106 233951 127621 124964 222639 277235 352491 442391 502117 557549 608808 663856
17118 663856 715922 687988 592552 551929 451193 362800 270930 169767 192700 189657 103378
17107 103378 85770 157042 96912 129474 184209 138078 59204 -27493 -28016 12699 49780 171424
17095 171424 68690 8780 66563 78579 87362 96528 67090 98514 50245 2389 134652
$$ packed form
17173A048495L0016j22392j04345j19274j48659j97440r2889O231R5761J22084
17163E17588k4042j25030M2062N2393k6476K1259o6135o5153k7186o9174l1596
17152A98510q8367r7937L4026N6242J6740k781n3161j4914N7132l9537m5829L9976
17140F0100J45645K6559P2987M4158M5596L4210N3105l9213n9701k9067q2273
17129B72106l8155j06330k657R7675N4596P5256Q9900N9726N5432N1259N5048
17118F63856N2066k7934r5436m0623j00736q8393r1870j01163K2933l043q6279
17107A03378j7608P1272o0130L2562N4735m6131p8874q6697n23M0715L7081J21644
17095A71424j02734n9910N7783J2016Q783R166k9438L1424m8269m7856J32263
$$ plain form
17084 134652 240992 339929 362441 282052 155382 113258 139440 65599 56949 -19665 -39138
17073 -39138 -50507 5082 108249 78115 93696 90595 110774 69396 42329 39310 69444 68694
17061 68694 87560 63869 56592 20533 -17258 35820 51923 80264 90890 22714 2364 10760
17049 10760 53872 56955 98900 125922 96056 67520 40758 -36036 -35379 -44475 -139382 -100254
17037 -100254 -19859 10332 -83055 -68629 -37299 -26685 -17914 -52864 -2458 41474 41929 47345
17025 47345 8912 -45829 -61763 -54863 -91115 -143195 -206058 -167644 -101415 -5187 121206 38174
17013 38174 -47255 -79053 -71551 -1537 -7161 -17133 -30363 -101510 -112297 -70159 -119775 -110445
17001 -110445 -28794 -99430 -131656 -153958 -61204 24287 -36743 -94891 -86539 -22024 -60387 -114590
$$ packed form
17084A34652J06340R8937K2512q0389j26670m2124K6182p3841q650p6614j9473
17073c9138j1369N5589J03167l0134J5581l101K0179m1378k7067l019L0134p50
17061F8694J8866k3691p277l6059l7791N3078J6103K8341J0626o8176k0350Q396
17049A0760M3112L083M1945K7022k9866k8536k6762p6794O57r096r4907L9128
17037a00254Q0395L0191r3387J4426L1330J0614Q771l4950N0406M3932M55N416
17025D7345l8433n4741j5934O900l6252n2080o2863L8414O6229R6228J26393q3032
17013C8174q5429l1798P502P0014n624r972j3230p1147j0787M2138m9616R330
17001a10445Q1651p0636l2226k2302R2754Q5491o1030n8148Q352O4515l8363n4203
$$ plain form
16989 -114590 -61098 -76217 9783 10675 -110351 -237830 -268699 -237834 -142338 -58443 -72915
16978 -72915 -63676 2192 17281 -12748 -26271 -64502 -133533 -69403 -34028 -17896 42388 84501
16966 84501 10823 37417 93648 -28585 -121067 -8668 28915 46722 -34751 -91428 -39531
16955 -39531 -47798 -29312 22633 36952 -22851 -46816 -77852 -41641 15655 9781 -98908 -131151
16943 -131151 -137295 -125178 -58957 -40409 -37536 -70380 -55910 -55525 -72433 -119409 -88380 -119297
16931 -119297 -126137 -165761 -104825 80227 100340 76459 71652 -6723 -99990 -54272 -2668 -23285
16919 -23285 -147026 -140627 -124818 -158085 -172855 -97226 -29326 -26632 -57057 -59146 -31674 -1401
16907 -1401 -323 -32329 -154825 -212706 -113279 -65519 -66011 -91106 -115130 -149680 -159492 -153383 -22326
$$ packed form
16989a14590N3492j5119Q6000Q92j21026j27479l0869L0865R5496Q3895j4472
16978g2915R239O5868J5089l0029j3523l8231o9031O4130L5375J6132O0284M2113
16966H4501p3678K6594N6231j22233r2482J12399L7583J7807q1473n6677N1897
16955c9531q267J8486N1945J4319n9803k3965l1036L6211N7296n874j08689l2243
16943a31151o144J2117O6221J8548K873l2844J4470L85j6908m6976L1029l0917
16931a19297o840l9624O0936J85052K0113k3881m807p8375r3267M5718N1604k0617
16919b3285j23741O399J5809l3267j4770P5629O7900K694l0425k089K7472L0273
16907a401J078l2006j22496n7881R9427M7760m92k5095k4024l4550r812O109J31057
$$ plain form
16894 -22326 24725 31987 62030 -64003 -55827 -35713 1130 -71840 -60732 4541 -70161 -137115
16882 -137115 -101629 -33915 -70996 -23124 -38011 18254 71137 118819 81284 36285 11481
16871 11481 -55117 -52509 -79928 -5838 -33324 -1800 -24152 -94741 -92033 -65627 -112619 -97351
16859 -97351 -68166 -31480 41238 50084 52996 134899 126772 82716 36136 -28790 -36313 55576
16847 55576 144809 218330 107687 -66649 -84432 -80254 19572 172832 426088 615276 611701
16836 611701 541646 525512 495627 450596 467054 590842 711556 644973 648157 564417 485527
16825 485527 502678 517739 547257 600801 652900 595849 542452 441669 311506 234947 225879
16814 225879 115575 64559 27277 91205 185625 297265 297643 262709 267929 266574 232501 221239
$$ packed form
16894b2326M7051P262L0043j26033Q176K0114L6843p2970J1108O5273p4702o6954
16882a37115L5486O7714l7081M7872j4887N6265N2883M7682l7535m4999k4804
16871A1481o6598K608k7419P4090k7486L1524k2352p0589K708K6406m6992J5268
16859i7351K9185L6686P2718Q846K912Q1903q127m4056m6580o4926p523R1889
16847E5576Q9233P3521j10643j74336j7783M178R9826J53260K53256J89188l575
16836F11701p0055j6134k9885m5031J6458J23788J20714o6583L184q3740p8890
16825D85527J7151J5061K9518N3544N2099n7051n3397j00783j30163p6559r068
16814B25879j10304n1016l7282O3928R4420J11640L78l4934N220j355l4073j1262
$$ plain form
16802 221239 145500 152330 168421 98113 66303 1954 13025 43615 20227 -2855 51672 149511
16790 149511 195698 327027 440726 438643 377835 405377 397949 474688 588920 690286 676202
16779 676202 641551 628044 555440 512717 471716 451465 451013 390211 307409 239226 237675 288754
16767 288754 297505 288058 365820 543458 580326 532842 478907 454620 473704 534049 363925
16756 363925 214610 195723 109329 80006 65435 -63986 -102257 -51729 5496 7228 -15949
16745 -15949 -84414 -108530 -152994 -169706 -193054 -193096 -146817 -124441 -61568 -69749 -24832 2986
16733 2986 3411 8962 -49987 -76709 8669 50583 28285 -24585 -10020 26995 58345 59768 34371
16720 34371 -13171 -74423 -41038 -86652 -73083 -87175 -112574 -95969 -184571 -172423 -168836 -54317
$$ packed form
16802B21239p5739O830J6091p0308l1810o4349J1071L0590k3388k3082N4527R7839
16790A49511M6187J31329J13699k083o0808K7542p428P6739J14232J01366j4084
16779F76202l4651j3507p2604m2723m1001k0251m52o0802q2802o8183j551N1079
16767B88754Q751r447P7762J77638L6868m7484n3935k4287J9084O0345j70124
16756C63925j49315j8887q6394k9323j4571j29421l8271N0528N7225J732k3177
16745a5949o8465k4116m4464j6712k3348m2M6279K2376O2873q181M4917K7818
16733B986M25N551n8949k6722Q5378M1914k2298n2870J4565L7015L1350J423k5397
16720C4371m7542o1252L3385m5614J3569j4092k5399J6605q8602J2148L587J14519
$$ plain form
16708 -54317 -4003 85395 28728 -2584 -14370 -18416 17135 31112 70920 12625 -93970 -140015
16696 -140015 -144729 -167076 -91034 -53032 -132026 -111289 -93796 -93628 -121394 -139865 -190333 -123235
16684 -123235 -23785 -16498 -41658 -78244 -72370 -90624 -194969 -185356 -228235 -199178 -77480 -39663
16672 -39663 -57239 -58132 24274 144114 109767 62399 -4239 -103603 -89582 17457 27256 -35200
16660 -35200 -97440 -70183 -55603 -66293 -87791 -75304 -4476 16517 -25450 -53585 -115393 -149688
16648 -149688 -118002 -126502 -93502 -119067 -186220 -190796 -199557 -125669 -68659 -100285 -29652 48826
16636 48826 48739 60112 39800 -14821 -18118 -35606 15560 66728 58224 74558 73046 -2168 -101
16623 -101 -20977 -71117 -45051 -106393 -85160 -100815 -160206 -156195 -125058 -193848 -193982 -130290 -103788
$$ packed form
16708e4317N0314Q9398n6667l1312j1786m046L5551J3977L9808n8295j06595m6045
16696a40015m714k2347P6042L8002p8994K0737J7493J68k7766j8471n0468O7098
16684a23235R9450P287k5160l6586N874j8254j04345R613m2879K9057J21698L7817
16672c9663j7576q93Q2406J19840l4347m7368o6638r9364J4021J07039R799o2456
16660c5200o2240K7257J4580j0690k1498J2487P0828K0993m1967k8135o1808l4295
16648a49688L1686q500L3000k5565o7153m576q761P3888N7010l1626P0633P8478
16636D8826q7J1373k0312n4621l297j7488N1166N1168q504J6334j512p5214K067
16623a01k0876n0140K6066o1342K1233j5655n9391M011L1137o8790j34O3692K6502
$$ plain form
16610 -103788 -83893 -47287 8077 12585 -5296 17270 20100 92730 90201 79516 39715 -9436
16598 -9436 -70116 -8064 -80385 -233588 -236641 -98771 -55968 -46944 51249 166468 214688 213885
16586 213885 143159 9457 -21525 -54707 -80449 -14654 34005 -64029 -103536 -74215 24715
16575 24715 56026 65304 13752 10502 -74588 -127399 -94160 -78761 -27343 -19022 -48553 -93162
16563 -93162 -68701 -33475 -130383 -202974 -184607 -147680 -96623 -92792 -105863 -84481 -121265 -44119
16551 -44119 112916 127544 21208 49187 49663 52575 55309 61216 66515 -6402 -64867 -32426
16539 -32426 -67856 -131904 -120332 -40119 -92079 -136822 -137726 -181109 -162226 -88971 -67036 -33039
16527 -33039 -68992 -51690 -43027 -74352 -72960 -77727 -44237 -32662 -39696 -97527 -213366 -229141
$$ packed form
16610a03788J9895L6606N5364M508j7881K2566K830P2630k529j0685l9801m9151
16598i436o0680O2052p2321j53203l053J37870M2803R024R8193J15219M8220q03
16586B13885p0726j33702l0982l3182k5742O5795M8659r8034l9507K9321R8930
16575B4715L1311R278n1552l250q5090n2811L3239J5399N1418Q321k9531m4609
16563i3162K4461L5226r6908p2591J8367L6927N1057L831j3071K1382l6784P7146
16551d4119J57035J4628j06336K7979M76K912K734N907N299p2917n8465L2441
16539c2426l5430o4048J1572Q0213n1960m4743r04m3383J8883P3255K1935L3997
16527c3039l5953J7302Q663l1325J392m767L3490J1575p034n7831j15839j5775
$$ plain form
16515 -229141 -222342 -249406 -134934 -78950 -54501 5047 20380 27857 31272 -46054 -147435 -98128
16503 -98128 2421 52902 89725 47570 34421 -91985 -116165 -41971 36008 -44172 -162923
16492 -162923 -159633 -97976 28555 99818 88793 38595 -15994 -38455 -39333 -44278 -88397 -136417
16480 -136417 -47590 -43852 13671 30403 -6956 44435 -48454 -105634 -112835 -100611 -108906 -147492
16468 -147492 -81633 7932 -31419 -31823 -49328 -85167 -110363 -84426 -102885 -201781 -217908 -175759
16456 -175759 -125388 -66041 -117126 -149823 -124397 -185702 -143092 -66777 -58334 -66967 -98261 -83943
16444 -83943 -37284 41448 72778 114545 24159 17202 30439 -60641 -73523 -79621 -57454 -127711
16432 -127711 -154115 -135022 -107912 -100043 -126969 -151799 -169269 -187847 -128696 -160629 -201239 -106802
$$ packed form
16515b29141O799k7064J14472N5984K4449N9548J5333P477L415p7326j01381M9307
16503i8128J00549N0481L6823m2155j3149j26406k4180P4194P7979q0180j18751
16492a62923L290O1657J26531P1263j1025n0198n4589k2461q78m945m4119m8020
16480a36417Q8827L738N7523J6732l7359N1391r2889n7180p201J2224q295l8586
16468a47492O5859Q9565l9351m04j7505l5839k5196K5937j8459r8896j6127M2149
16456a75759N0371N9347n1085l2697K5426o1305M2610P6315Q443q633l1294J4318
16444h3943M6659P8732L1330M1767r0386o957J3237r1080j2882o098K2167p0257
16432a27711k6404J9093K7110P869k6926k4830j7470j8578N9151l1933m0610R4437
$$ plain form
16420 -106802 -132282 -98605 -43726 -44961 -92559 -130134 -124973 -52257 -46138 -93953 -172793 -262627
16408 -262627 -203964 -150276 -90137 -56928 -68509 -72361 -42670 -30789 88547 41673 -86927
16397 -86927 -62231 -84339 -75599 -148225 -176718 -59689 -5652 -35823 -13580 -67695 -180631
16386 -180631 -90697 -123381 -164659 -195870 -251761 -229771 -127755 -131852 -175213 -202253 -130008
16375 -130008 -57706 -67680 -231262 -322323 -243477 -205233 -178817 -106675 -8058 30440 94840
16364 94840 23905 15472 19716 -14816 -52094 -202648 -221306 -157683 -96821 -135717 -248061 -213796
16352 -213796 -201391 -191554 -135527 -102601 -16330 -8569 -75233 -127581 -100412 -48499 -51707 -88649
16340 -88649 -73279 -58914 -74288 -97281 5781 15492 -3948 -50472 -62645 -31517 -69789 -103971
$$ packed form
16420a06802k5480L3677N4879j235m7598l7575N161P2716O119m7815p8840q9834
16408b62627N8663N3688O0139L3209j1581l852K9691J1881J19336m6874j28600
16397h6927K4696k2108Q740p2626k8493J17029N4037l0171K2243n4115j12936
16386a80631Q9934l2684m1278l1211n5891K1990J02016m097m3361k7040P2245
16375a30008P2302r974j63582r1061P8846L8244K6416P2142R8617L8498O4400
16364I4840p0935q433M244l4532l7278j50554j8658O3623O0862l8896j12344L4265
16352b13796J2405R837N6027L2926Q6271P761o6664n2348K7169N1913l208l6942
16340h8649J5370J4365j5374k2993J03062R711j9440m6524j2173L1128l8272l4182
$$ plain form
16328 -103971 -25957 21316 63703 33317 -21187 -53918 -49289 -102529 -123105 -78000 -11558 19375
16316 19375 5132 -41882 -57570 -73349 -72194 -37302 -49766 -67181 -81707 -109397 -108420 31679
16304 31679 35531 -44615 -90925 -71504 -96825 -153359 -162137 -112312 -116205 -102973 -94971 -103761 41
16291 41 64407 8298 -76111 -39358 -3285 67105 1667 -143114 -139062 -35714 -67212 -94300
16279 -94300 -99398 -88394 -61284 -87845 -118695 -142472 -69565 -36994 -38725 -103973 -98298 -38665
16267 -38665 -40330 -90608 -97609 -108922 -92315 -130690 -167024 -123019 -54326 -57260 -106913 -92872
16255 -92872 -131919 -67703 15381 -104503 -79451 11049 -23041 -40402 -110765 -183291 -142895
16244 -142895 -84700 -3486 -12746 -24144 -17841 -12304 -125171 -191355 -158394 -150753 -125582 -50708
$$ packed form
16328a03971P8014M7273M2387l0386n4504l2731M629n3240k0576M5105O6442L0933
16316A9375j4243m7014j5688j5779J155L4892j2464j7415j4526k7690R77J40099
16304C1679L852q0146m6310J9421k5321n6534q778M9825l893J3232Q002q790J03802
16291D1O4366n6109q4409L6753L6073P0390o5438j44781M052J03348l1498k7088
16279i4300n098J1004K7110k6561l0850k3777P2907L2571j731o5248N675N9633
16267c8665j665n0278p001j1313J6607l8375l6334M4005O8693k934m9653J4041
16255i2872l9047O4216Q3084j19884K5052R0500l4090j7361p0363p2526M0396
16244a42895N8195Q1214r260j1398O303N537j12867o6184L2961P641K5171P4874
$$ plain form
16232 -50708 -32941 -29596 -9006 24367 -89846 -148052 -89781 -99558 -155181 -90066 16311 -13293
16220 -13293 -58681 -46387 -54986 -36005 -3201 -127134 -218328 -259933 -157358 -64698 15666
16209 15666 -306 -32009 16896 19141 -40705 -81498 -61077 -492 12682 -10543 60289 101925
16197 101925 93283 122642 106579 83560 31147 29898 5757 63441 94610 100827 68518 34741
16185 34741 30379 30871 -135325 -119612 20587 4308 -39949 -53553 -22813 -33531 -62426 -49398
16173 -49398 4197 52790 65931 43645 86864 141187 141627 106095 40384 36816 -23002 -16944
16161 -16944 1985 -49941 -76360 -86383 -34284 -1660 31119 16840 -103587 -128368 -88533
16150 -88533 18235 86604 98970 75887 27165 -17056 60117 88664 41918 3922 -58364
$$ packed form
16232e0708J7767L345K0590L3373j14213n8206N8271r777n5623O5115J06377k9604
16220a3293m5388J2294q599J8981L2804j23933r1194m1605J02575R2660Q0364
16209A5666j5972l1703M8905K245n9846m0793K0421O0585J3174k3225P0832M1636
16197A01925q642K9359j6063k3019n2413j249k4141N7684L1169O217l2309l3777
16185C4741m362M92j66196J5713J40199j6279m4257j3604L0740j0718k8895J3028
16173d9398N3595M8593J3141k2286M3219N4323M40l5532o5711l568n9818O058
16161a6944J8929n1926k6419j0023N2099L2624L2779j4279j20427k4781L9835
16150h8533J06768O8369J2366k3083m8722m4221P7173K8547m6746l7996o2286
$$ plain form
16139 -58364 -144090 -178484 -137983 -42321 -26461 -62807 -98028 -121218 -147095 -162886 -171001 -191134
16127 -191134 -192799 -75952 -57881 -101116 -169085 -229809 -242751 -223817 -182226 -104558 -60920
16116 -60920 -32443 -58755 -91320 -183415 -90646 -26372 -95947 -147982 -84790 -60374 -116764 -170477
16104 -170477 -175619 -253665 -267541 -138680 -132751 -165663 -164502 -169475 -166121 -91676 -70879 -92026
16092 -92026 -119581 -111121 -151714 -174073 -171060 -89174 84512 108279 109526 43145 -26927 -95815
16080 -95815 -42297 -7745 12131 -34839 -126378 -158311 13151 52544 -12943 -109516 -131804
16069 -131804 -94323 -129389 -120661 -23463 65230 17016 -11665 -45834 -47574 2397 -39939 -126570
16057 -126570 -74003 21894 55711 -37081 -74442 -56649 -41405 -68893 -71035 -2651 977 -4248
$$ packed form
16139e8364q5726l4394M0501R5662J5860l6346l5221k3190k5877j5791q115k0133
16127a91134j665J16847J8071m3235o7969o0724j2942J8934M1591P7668M3638
16116f0920K8477k6312l2565r2095R2769O4274o9575n2035O3192K4416n6390n3713
16104a70477n142p8046j3876J28861N929l2912J161m973L354P4445K0797k1147
16092i2026k7555Q460m0593k2359L013Q1886J73686K3767J247o6381p0072o8888
16080i5815N3518L4552J9876m6970r1539l1933J71462L9393o5487r6573k2288
16069a31804L7481l5066Q728R7198Q8693m8214k8681l4169j740M9971m2336q6631
16057a26570N2567R5897L3817r2792l7361J7793J5244k7488k142O8384L628n225
$$ plain form
16045 -4248 -22802 63129 102511 62814 4814 46281 9842 -42331 -28558 19407 -47233 -96308
16033 -96308 -91915 14904 109610 83078 -72512 -104109 -48928 -31363 -32899 27070 123590 91246
16021 91246 66041 59516 80515 36854 8708 -67746 -121491 -70033 21456 16322 35714 101464
16009 101464 50541 25991 74322 62216 21570 -68888 -112535 -4592 2053 -24046 -13810
15998 -13810 -85882 -139014 -58133 76551 66160 36676 126992 151004 71444 68065 92046 29074
15986 29074 -27760 -77388 -122651 -108920 -65782 -140788 -111624 -57092 -29956 -103901 -129268 -145386
15974 -145386 -89404 35444 46436 56058 -20424 29920 25661 -44680 16649 46789 -21530 -23325
15962 -23325 -26141 -75546 -38383 -32533 -105413 -173163 -91707 -73365 -123621 -7792 82432 93319
$$ packed form
16045d248j8554Q5931L9382l9697n8000M1467l6439n2173J3773M7965o6640m9075
16033i6308M393J06819R4706k6532j55590l1597N5181J7565j536N9969R6520l2344
16021I1246k5205o525K0999m3661k8146p6454n3745N1458R1489n134J9392O5750
16009A01464n0923k4550M8331j2106m0646r0458m3647J07943O645k6099J0236
15998a3810p2072n3132Q0881J34684j0391k9484R0316K4012p9560l379K3981o2972
15986B9074n6834m9628m5263J3731M3138p5006K9164N4532K7136p3945k5367j6118
15974a45386N5982J24848J0992R622p6482N0344m259p0341O1329L0140o8319j795
15962b3325k816m9405L7163N850p2880o7750Q1456J8342n0256J15829R0224J0887
$$ plain form
15950 93319 32663 -92656 -40356 -26146 -79809 -61971 -65859 -77106 -103691 -47396 -43705 -142179
15938 -142179 -144079 -137267 -163774 -118492 -81154 -108350 -97142 -106520 -148687 -195932 -118894 -117098
15926 -117098 -144487 -150238 -188123 -194772 -174126 -127584 -112987 -140819 -74879 -49124 -73199 -129757
15914 -129757 -185465 -124669 -44109 -21405 25787 102647 120059 76311 -38622 -111981 -129400
15903 -129400 -100380 -88749 -71425 -115441 -116385 -42107 -66352 -99403 -60975 -24152 -16704 -36409
15891 -36409 -2251 55913 53187 37128 -38297 -77512 -20522 13924 -57058 10947 28277 -113625
15879 -113625 -136822 -88465 -78771 24126 57055 6755 18886 57013 25748 130 -4961 29325
15867 29325 -60812 -131902 -156209 -135055 -108089 -143036 -140324 -105171 -130369 -48143 32181 30736
$$ packed form
15950I3319o0656j25319N2300J4210n3663J7838l888j1247k6585N6295L691r8474
15938a42179j900O812k6507M5282L7338k7196J1208r378m2167m7245P7038J796
15926a17098k7389n751l7885o649K0646M6542J4597k7832O5940K5755k4075n6558
15914a29757n5708O0796Q0560K2704M7192P6860J7412m3748j14933p3359j7419
15903a29400K9020J1631J7324m4016r44P4278k4245l3051L8428L6823P448j9705
15891c6409L4158N8164k726j6059p5425l9215N6990L4446p0982O8005J7330j41902
15879a13625k3197M8357R694J02897L2929n0300J2131L8127l1265k5618n091L4286
15867B9325r0137p1090k4307K1154K6966l4947K712L5153k5198Q2226Q0324j445
$$ plain form
15855 30736 3042 -2952 -4298 -25119 34369 1129 70353 154023 128505 18866 -78278 -104228
15843 -104228 -11403 -31073 -150884 -194674 -33222 55267 130752 188247 104924 -17559 -76522
15832 -76522 -66841 16701 18145 -11331 -56138 6001 83083 125345 77772 77077 -23675 -91284
15820 -91284 -47246 34929 139158 91524 68862 55625 -3199 -67390 -147641 -155882 -105681 -123527
15808 -123527 -134936 -75698 -96035 -154691 -153965 -189947 -192400 -180487 -119282 -60721 -38924 -48727
15796 -48727 -73072 24599 113785 80809 41763 40997 -12071 -37625 -20250 16464 66460 46638
15784 46638 -44514 -91601 -60794 -101334 -92754 -28583 -18549 -139097 -132559 -76451 -66141 -28061
15772 -28061 -30047 -86313 -53910 -10706 -58364 -121183 -226008 -213190 -180209 -123164 -112547 -130234
$$ packed form
15855C0736k7694n994j346k0821N9488l3240O9224Q3670k5518j09639r7144k5950
15843a04228R2825j9670j19811m3790J61452Q8489P5485N7495q3323j22483n8963
15832g6522R681Q3542J444k9476m4807O2139P7082M2262m7573o95j00752o7609
15820i1284M4038Q2175J04229m7634k2662j3237n8824o4191q0251q241N0201j7846
15808a23527j1409N9238k0337n8656P26l5982k453J1913O1205N8561K1797r803
15796d8727k4345R7671Q9186l2976l9046p66n3068k5554J7375L6714M9996j9822
15784D6638r1152m7087L0807m0540Q580O4171J0034j20548O538N6108J0310L8080
15772b8061j986n6266L2403M3204m7658o2819j04825J2818L2981N7045J0617j7687
$$ plain form
15760 -130234 -148987 -114205 -41010 -39783 -66943 -15788 -10710 -109468 -238601 -269779 -218169 -172916
15748 -172916 -131976 -85205 32194 139099 165201 94150 26257 40820 58403 85998 43570
15737 43570 27415 -25887 -130463 -129011 -40550 24309 45143 -37025 -117593 -187675 -146310 -109234
15725 -109234 -41030 2831 57120 60804 -34545 16024 -28435 -77530 -88733 -39027 11082 20268
15713 20268 -25149 -2357 -16147 -77776 -134659 -116188 -116883 -140406 -138828 -130963 -182812 -90056
15701 -90056 -44538 -118488 -237259 -243895 -119207 -48027 -77530 -123908 -200936 -170380 -59881
15690 -59881 23219 28382 12380 22957 -61345 -102735 -69779 -23739 -37713 12401 9838 -49199
15678 -49199 -102314 -153573 -173058 -155245 -156284 -203055 -132696 -63999 -17109 65870 44854 36312
$$ packed form
15760a30234j8753L4782P3195J227k7160N1155N078r8758j29133l1178N1610M5253
15748a72916M0940M6771J17399J06905K6102p1051o7893J4563J7583K7595m2428
15737D3570j6155n3302j04576J452Q8461O4859K0834q2168q0568p0082M1365L7076
15725a09234O8204M3861N4289L684r5349N0569m4459m9095j1203M9706N0109R186
15713B0268m5417K2792j3790o1629n6883J8471o95k3523J578P865n1849R2756
15701i0056M5518p3950j18771o636J24688P1180k9503m6378p7028L0556J10499
15690e9881Q3100N163j6002J0577q4302m1390L2956M6040j3974N0114k563n9037
15678d9199n3115n1259j9485J7813j039m6771P0359O8697M6890Q2979k1016q542
$$ plain form
15666 36312 -20688 -60263 -92966 -41391 -53901 -101164 -80167 -161459 -138099 -109578 -83328 -91413
15654 -91413 -90444 -40717 -60512 -32811 -29517 -113836 -76562 -46031 -179244 -164223 -68993 -60519
15642 -60519 -89698 -101017 -96761 -41555 1309 21819 -15986 -108216 -112086 -79612 -27041 -18866
15630 -18866 -44699 -73051 -47253 2204 -58827 -88819 -74167 -62480 9940 -26075 -44850 -16747
15618 -16747 39881 104531 113830 44876 -23737 -86776 -92047 -71792 -51248 -36568 -23803 -34522
15606 -34522 7594 7140 15369 -35526 -99768 -90439 -168223 -125099 -54279 7612 -535 -269 38048
15593 38048 -14172 -23272 37348 46506 -10763 -13358 45322 167832 128976 68462 81406 92844
15581 92844 35889 63433 75886 -1213 -180 -24542 -99105 -172520 -193683 -126333 -106316 -97942
$$ packed form
15666C6312n7000l9575l2703N1575j2510m7263K0997q1292K3360K8521K6250q085
15654i1413R69M9727j9795K7701L294q4319L7274L0531j33213J5021R5230Q474
15642f0519k9179j1319M256N5206M2864K0510l7805r2230l870L2474N2571Q175
15630a8866k5833k8352K5798M9457o1031k9992J4652J1687P2420l6015j8775K8103
15618a6747N6628O4650R299o8954o8613o3039n271K0255K0544J4680J2765j0719
15606c4522M2116m54Q229n0895o4242R329p7784M3124P0820O1891q147K66L8317
15593C8048n2220r100O0620R158n7269k595N8680J22510l8856o0514J2944J1438
15581I2844n6955K7544J2453p7099J033k4362p4563p3415k1163O7350K0017Q374
$$ plain form
15569 -97942 -168467 -172419 -181574 -121853 -18084 -19637 -92479 -117843 -136131 -179547 -144130 -80736
15557 -80736 -63882 -101410 -82427 -72642 -45276 -27921 -69601 -65939 -78346 -79697 -38025 -49211
15545 -49211 -96437 -102837 2941 71753 55590 116556 76959 47526 85076 124425 80001 6414
15533 6414 -48195 -46169 -33957 -10553 32408 76280 71850 30744 -11311 -40166 -83641 -40486
15521 -40486 85010 117714 36932 -45656 -96006 -61146 -92691 -61154 5045 31296 35701 11996
15509 11996 47453 -20122 -59206 6729 -27294 -49625 -81128 -74255 -52128 -29835 -5521 -13008
15497 -13008 -92248 -35704 48733 20623 -17603 -7989 -81890 -3709 75234 35688 26379 -8894
15485 -8894 -67634 -191195 -195318 -71265 24839 -13249 -13871 16460 7686 -95751 -188662 -182914
$$ packed form
15569i7942p0525l952r155N9721J03769j553p2842k5364j8288m3416L5417O3394
15557h0736J6854l7528J8983R785K7366J7355m1680L662j2407j351M1672j1186
15545d9211m7226o400J05778O8812j6163O0966l9597k9433L7550L9349m4424p3587
15533F414n4609K026J2212K3404M2961M3872m430m1106m2055k8855m3475M3155
15521d0486J25496L2704q0782q2588n0350L4860l1545L1537O6199K6251M405k3705
15509A1996L5457o7575l9084O5935l4023k2331l1503O873K2127K2293K4314p487
15497a3008p9240N6544Q4437k8110l8226R614p3901P8181P8943l9546r309l5273
15485h894n8740j23561m123J24053R6104l8088o22L0331q774j03437r2911N748
$$ plain form
15473 -182914 -107246 -111129 -100289 -65730 -63299 -81940 -148697 -229864 -218100 -152728 -93601 -226037
15461 -226037 -277536 -153801 -138571 -42383 -22338 -34933 -35096 -55288 -114492 -157273 -150925 -123243
15449 -123243 -20636 73925 116343 55424 33124 24552 15740 -5513 -139278 -127148 -89505
15438 -89505 -130652 -140313 -53000 -352 -12754 -26966 4188 1453 55031 15919 -40857 -25066
15426 -25066 10398 7362 -82970 -157479 -149161 -100687 -59763 -98164 -88213 -45131 -30763 -35266
15414 -35266 -89631 -80944 -54669 -58420 -101639 -94636 -102768 -146568 -161920 -145493 -119063 -38357
15402 -38357 -29681 -5451 38723 -14198 -8760 -27819 -36509 -9124 -53445 -43807 -47903 -85870 -88078
15389 -88078 -109818 -115287 -89650 -64285 -73654 -114171 -88670 -100505 -143317 -85493 -3627 -21738
$$ packed form
15473a82914P5668l883J0840L4559K431j8641o6757q1167J1764O5372N9127j32436
15461b26037n1499J23735J5230R6188K0045j2595j63k0192n9204m2781O348K7682
15449a23243J02607R4561M2418o0919k2300q572q812k1253j33765J2130L7643
15438h9505m1147r661Q7313N2648j2402j4212L1154k735N3578l9112n6776J5791
15426b5066L5464l036r0332p4509Q318M8474M0924l8401R951M3082J4368m503
15414c5266n4365Q687K6275l751m3219P003q132m3800j5352J6427K6430Q0706
15402c8357Q676K4230M4174n2921N438j9059q690K7385m4321R638m096l7967k208
15389h8078k1740n469K5637K5365r369m0517K5501j1835m2812N7824Q1866j8111
$$ plain form
15377 -21738 -80828 -11993 46099 42160 19790 20646 -397 34118 -51076 -156705 -181068 -146798
15365 -146798 -132827 -25211 17389 18738 -43736 -66640 -114465 -107836 -170141 -218785 -188416 -106218
15353 -106218 -37784 -52799 -62076 -35935 -33287 -18462 12868 3117 -21068 -74945 -88385 -28548
15341 -28548 51696 54030 -3262 -16861 63378 74012 72943 140966 170280 188256 262127 200136
15329 200136 45140 21756 15610 -63069 -127657 -52599 901 67862 57385 57431 56730 -4477
15317 -4477 -72094 -50080 -19223 12797 -6297 -64456 -85411 -37975 85324 75827 -19309 -20161
15305 -20161 -27665 -49404 -99647 -138081 -83346 40041 58112 29841 -18409 -53309 -87340 -82979
15293 -82979 -146057 -89923 -67123 -63149 -4236 72828 113594 13492 5600 34535 60627 44999
$$ packed form
15377b1738n9090O8835N8092l939k2370Q56k1043L4515q5194j05629k4363L4270
15365a46798J3971J07616M2600J349o2474k2904m7825O629o2305m8644L0369Q2198
15353a06218O8434j5015r277K6141K648J4825L1330r751k4185n3877j3440N9837
15341b8548Q0244K334n7292j3599Q0239J0634j069O8023K9314J7976P3871o1991
15329B00136j54996k3384o146p8679o4588P5058N3500O6961j0477M6p01o1207
15317d477o7617K2014L0857L2020j9094n8159k0955M7436J23299r497r5136q52
15305b0161p504k1739n0243l8434N4735J23387J8071k8271m8250l4900l4031M361
15293h2979o3078N6134K2800L974N8913P7064M0766j00102p892K8935K6092j5628
$$ plain form
15281 44999 -16455 -8413 -21691 -58821 -93158 -28230 -27541 -54133 36648 46335 54885 31571 -17463
15268 -17463 -71916 -48118 -51037 -24889 -19916 4588 -78292 -68582 -37057 -16085 -27651 -27482 -30792
15255 -30792 -41881 22404 -8937 22208 60606 51321 12434 -35525 -43207 984 -19255 -35271
15243 -35271 -70915 -101418 -35719 -30209 13599 129062 13337 -17671 -58024 -52751 -9399 27529
15231 27529 -88307 -196831 -182075 -188246 -169093 -78821 -85319 -72588 -22282 -31499 23037 40420
15219 40420 86017 122556 113821 97419 6961 5027 -1422 -44455 -94275 -159557 -176962 -128836
15207 -128836 -164515 -85898 -59387 -81635 -104539 -156045 -182304 -116961 -123981 -164181 -122908 -99770
15195 -99770 -130528 -92190 -28651 11748 55958 57287 52252 121851 79996 8598 -16325 -97902
$$ packed form
15281D4999o1454Q042j3278l7130l4337O4928O89k6592R0781R687Q550k3314m9034
15268a7463n4453K3798k919K6148M973K4504q2880R710L1525K0972j1566J69l310
15255c0792j1089O4285l1341L1145L8398r285l8887m7959p682M4191k0239j6016
15243c5271l5644l0503O5699N510M3808J15463j15725l1008m0353N273M3352L6928
15231B7529j15836j08524J4756o171J9153R0272o498J2731N0306r217N4536J7383
15219D0420M5597L6539q735j6402r0458j934o449m3033m9820o5282j7405M8126
15207a28836l5679P8617K6511k2248k2904n1506k6259O5343p020m0200M1273K3138
15195i9770l0758L8338O3539M0399M4210J329n035O9599m1855p1398k4923q1577
$$ plain form
15183 -97902 -15481 25181 32031 48772 76100 45725 -30062 -36629 -119116 -106593 32649 15858
15171 15858 -13684 -48223 -92727 -112495 -183849 -197078 -102499 -96581 -124811 -29751 38209 70948
15159 70948 47075 -44302 -129139 -75227 -7589 12912 29022 64037 85251 95727 48122 20820
15147 20820 -14307 -18589 -99644 -149179 -137000 -67558 -66762 -121838 -65160 -33107 -40486 -47506 -119872
15134 -119872 -79159 6353 -45845 -111069 -46347 3423 -13627 -79494 -164577 -140495 -104871
15123 -104871 12522 -54514 -27141 -20072 -25028 -83600 -61188 -39274 -18878 4574 68395 14961
15111 14961 -63146 -61963 -107886 -161733 -117248 -58253 -1280 -39395 7288 53210 54569 -41333
15099 -41333 -31409 -77074 -84949 -117978 -108736 -93106 -146683 -121747 -4632 -22348 -81605 -74044
$$ packed form
15183i7902Q2421M0662O850J6741K7328l0375p5787o567q2487J2523J39242j6791
15171A5858k9542l4539m4504j9768p1354j3229R4579N918k8230R5060O7960L2739
15159G0948k3873r1377q4837N3912O7638K0501J6110L5015K1214J0476m7605k7302
15147B0820l5127m282q1055m9535J2179O9442P96n5076N6678L2053p379p020p2366
15134a19872M0713Q5512n2198o5224O4722M9770j7050o5867q5083K4082L5624
15123a04871J17393o7036K7373P069m956n8572K2412K1914K0396K3452O3821n3434
15111A4961p8107J183m5923n3847M4485N8995N6973l8115M6683M5922J359r5902
15099d1333R924m5665p875l3029R242J5630n3577K4936J17115j7716n9257P561
$$ plain form
15087 -74044 -66730 -57896 -14824 -33826 6498 -36016 -26647 23836 9315 -14957 30427 14778
15075 14778 -22008 11033 -4454 -74047 -63504 -120120 -119682 -88065 -73922 -7780 -67849 -157205
15063 -157205 -162450 -178533 -263764 -298625 -200936 -81572 -25112 -77935 -54735 -44567 -120875
15052 -120875 -162324 -134047 -129388 -120394 -109507 -95292 -83780 -51451 2242 -32709 -41979 -126266
15040 -126266 -50458 1077 -17387 -39496 -37802 -51791 -100623 -147326 -163576 -160113 -138169 -158399
15028 -158399 -93600 -35508 981 -77884 -166515 -219934 -194630 -138345 -97366 -87315 -98653
15017 -98653 -54230 -35303 24571 14157 -4635 5051 -825 -65374 -40296 -32592 -11512 -89094
15005 -89094 -124350 -79063 -7300 13017 -147469 -169651 -122225 -83203 -16230 -7445 -34942 -90074
$$ packed form
15087g4044P314Q834M3072j9002M0324m2514R369N0483j4521k4272M5384j5649
15075A4778l6786L3041j5487o9593J0543n6616M38L1617J4143O6142o0069q9356
15063a57205n245j6083q5231l4861R7689J19364N6460n2823K3200J0168p6308
15052a20875m1449K8277M659Q994J0887J4215J1512L2329N3693l4951r270q4287
15040a26266P5808N1535j8464k2109J694j3989m8832m6703j6250L463K1944k0230
15028a58399O4799N8092L6489p8865q8631n3419K5304N6285M0979J0051j1338
15017i8653M4423J8927N9874j0414j8792R686n876o4549K5078P704K1080p7582
15005h9094l5256M5287P1763K0317j60486k2182M7426L9022O6973Q785k7497n5132
$$ plain form
14993 -90074 -49451 -45766 -22136 39475 70972 50992 -15483 -6795 47168 24624 -46378 12937
14981 12937 4900 69951 72264 96728 22104 -50908 -84497 -75411 9317 43351 -13718 -49101
14969 -49101 -41010 -23838 31361 42263 126286 106979 11664 -39323 20558 18893 -48384 -106153
14957 -106153 -88960 -106529 -104857 -90739 -106269 -69542 1521 46782 98304 31993 -18490 3242
14945 3242 542 -27408 18802 73902 -15605 10202 32369 -15316 28295 23686 10030 -86665
14933 -86665 -61518 -30233 -70194 -89812 -91645 -90713 -128242 -118793 -150451 -167487 -132859 -59074
14921 -59074 -69904 -141327 -192316 -163032 -144431 -64912 -20855 -81659 -131772 -72193 -27526 -62907
14909 -62907 -123511 -121434 -61607 -77534 -61211 -77799 -21171 46728 28652 -70306 -108432 -67791
$$ packed form
14993i0074M0623L685K3630O1611L1497j9980o6475Q688N3963k2544p1002N9315
14981A2937q037O5051K313K4464p4624p3012l3589R086Q4728L4034n7069l5383
14969d9101Q091J7172N5199J0902Q4023j9307r5315n0987N9881j665o7277n7769
14957a06153J7193j7569J672J4118j5530L6727P1063M5261N1522o6311n0483K1732
14945C242k700k7950M6210N5100q9507K5807K2167m7685M3611m609j3656r6695
14933h6665K5147L1285l9961j9618j833R32l7529R449l1658j7036L4628P3785
14921e9074j0830p1423n0989K9284J8601P9519M4057o0804n0113N9579M4667l5381
14909f2907o0604K077N9827j5927J6323j6588N6628O7899j8076r8958l8126M0641
$$ plain form
14897 -67791 -58506 -27339 -49151 -72209 11832 3781 -53311 -104458 -125478 -108905 -119647 -124014
14885 -124014 -156574 -173481 -154709 -142341 -136788 -54462 8091 -25137 -100926 -82745 -117538 -65148
14873 -65148 -23156 -71832 -133088 -112400 -116234 -195634 -161141 -28115 59187 14340 -51987 -15525
14861 -15525 48683 29805 -35409 -113737 -129325 -79562 -130658 -180308 -190828 -131059 -2214
14850 -2214 54770 -25549 -36574 -51368 -170544 -215036 -212164 -227438 -191517 -189651 -200817 -160200
14838 -160200 -125988 -77643 6110 -56868 -123950 -81972 -76280 -6723 -28548 -111491 -127292 -60902
14826 -60902 -17563 -32755 -70691 -45898 -38070 -94151 -106922 -86203 -68051 -72998 -65328 -21046
14814 -21046 71462 112428 149769 173896 163727 99693 68990 87852 104616 69413 28520 -33913
$$ packed form
14897f7791R285L1167k1812k3058Q4041q051n7092n1147k1020J6573j0742m367
14885a24014l2560j6907J8772J2368N553Q2326O2553l3228p5789J8181l4793N2390
14873f5148M1992m8676o1256K0688l834p9400L4493J33026Q7302m4847o6327L6462
14861a5525O4208j8878o5214p8328j5588M9763n1096m9650j0520N9769J28845
14850b214N6984q0319j1025j4794j19176m4492K872j5274L5921J866j1166M0617
14838a60200L4212M8345Q3753o2978o7082M1978N692O9557k1825q2943j5801O6390
14826f0902M3339j5192l7936K4793P828n6081j2771K0719J8152m947P670M4282
14814b1046R2508M0966L7341K4127j0169o4034l0703J8862J6764l5203m0893o2433
$$ plain form
14802 -33913 -57958 -11767 4357 81322 71078 -2 -18941 -42598 -63621 -21541 3112 14764
14790 14764 63489 9299 -11209 28079 69594 131432 104489 -4811 -123992 -116456 -65035
14779 -65035 -61342 -123257 -102630 -66553 -65736 -62852 -56232 -50913 -141824 -108144 -108580 -110207 -119423 -33719
14765 -33719 53580 11613 -52845 -12340 -8812 -84714 -79703 -69240 -99429 -61830 24629 -54008
14753 -54008 -130138 -115183 -64185 -4236 2248 -43991 -35461 30597 174827 156740 5718 -19366
14741 -19366 71758 158862 161603 108352 1947 -60305 -33706 -14442 -88101 -158039 -144750 -59477
14729 -59477 -37623 -44905 -137534 -168768 -126396 -197111 -181587 -64493 6001 -56467 -74293 -46088
14717 -46088 -45629 -53918 -110258 -15134 -1497 30070 -1124 -36331 -25948 -19535 -10531 -9062 -4524
$$ packed form
14802c3913k4045M6191J6124P6965j0244p1080j8939k3657k1023M2080K4653J1652
14790A4764M8725n4190k0508L9288M1515O1838k6943j09300j19181P536N1421
14779f5035L693o1915K0627L6077Q17K884O620N319r0911L3680m36j627r216Q5704
14765c3719Q7299m1967o4458M0505L528p5902N011J0463l0189L7599Q6459p8637
14753e4008p6130J4955N0998N9949O484m6239Q530O6058J44230j8087j51022k5084
14741a9366R1124Q7104K741n3251j06405o2252K6599J9264p3659o9938J3289Q5273
14729e9477K1854p282r2629l1234M2372p0715J5524J17094P0494o2468j7826K8205
14717d6088M59q289n6340R5124J3637L1567l1194l5207J0383O413R004J469M538
$$ plain form
14704 -4524 21138 -20087 -37978 -68337 4216 26776 27295 40936 -11482 -24327 -46047 -93881
14692 -93881 -50218 -2220 48880 52597 57914 113434 128468 64553 -13664 -15640 123036 162090
14680 162090 93550 88584 55772 18536 7881 85275 111975 122711 170677 122304 113728 85805
14668 85805 91064 118119 76073 -41754 -132410 -97329 -49412 19787 -10963 -19402 -39775 -79117
14656 -79117 -33099 -42129 -20480 -36954 3635 29867 -48979 -54788 40513 21069 -30587 -53811
14644 -53811 -8272 5095 147483 140834 68551 37011 128576 110230 59458 -32083 -38586 10516
14632 10516 12140 -32528 -88810 -114362 -60751 87847 57972 -60440 -6321 -26405 -21746 -3616
14620 -3616 48307 27184 -32544 -57438 39093 50854 13160 -33627 -23047 -65640 -56784 -82334
$$ packed form
14704d524K5662m1225j7891l0359P2553K2560N19J3641n2418j2845k1720m7834
14692i3881M3663M7998N1100L717N317N5520J5034o3915p8217j976J38676L9054
14680A62090o8540m966l2812l7236j0655P7394K6700J0736M7966m8373q576k7923
14668H5805N259K7055m2046j17827r0656L5081M7917O9199l0750q439k0373l9342
14656g9117M6018r030K1649j6474M0589K6232p8846n809R5301j9444n1656k3224
14644e3811M5539J3367J42388o649p2283l1540R1565j8346n0772r1541o503M9102
14632A0516J624m4668n6282k5552N3611J48598k9875j18412N4119k0084M659J8130
14620c616N1923k1123n9728k4894R6531J1761l7694m6787J0580m2593Q856k5550
$$ plain form
14608 -82334 -118854 -70635 -125993 -163652 -154191 -130367 -37255 33877 118833 60651 -55757 -76929
14596 -76929 -60093 47560 6592 -16652 37814 105345 92839 20870 -16424 -1652 -6578 -54968
14584 -54968 -8478 7136 -18792 -24061 61125 58210 61493 53322 87478 57432 57064 75209 -16088
14571 -16088 -92069 -55314 -9091 -47470 -71018 -112647 -162385 -179800 -79186 11120 56762
14560 56762 -3128 -30217 22772 43629 -13444 -8946 12212 19301 79858 21853 4848 -32018
14548 -32018 -24772 14720 -49542 13687 39917 36584 76245 79634 136899 57264 42705 55386
14536 55386 72909 123291 123354 56731 98102 122782 104984 -5464 27746 95804 145662 190626
14524 190626 174931 196882 212220 231169 123161 9958 24688 -21571 -46255 44894 180883
$$ packed form
14608h2334l6520M8219n5358l7659R461K3824R3112P1132Q4956n8182j16408k1172
14596g6929J6836J07653m0968k3244N4466O7531j2506p1969l7294J4772m926m8390
14584e4968M6490J5614k5928n269Q5186k915L283q171L4156l0046l68J8145r1297
14571a6088p5981L6755M6223l8379k3548m1629m9738j7415J00614R0306M5642
14560E6762n9890k7089N2989K0857n7073M498K1158P089O0557n8005j7005l6866
14548c2018P246L9492o4262O3229K6230l333L9661L389N7265p9635j4559J2681
14536E5386J7523N0382O3o6623M1371K4680j7798j10448L3210O8058M9858M4964
14524A90626j5695K1951J5338J8949j08008j13203J4730m6259k4684R1149J35989
$$ plain form
14513 180883 65899 29220 -29254 -22316 72541 70803 52246 38862 20373 36218 99007 101710
14501 101710 33780 46800 20503 28413 34653 69433 69091 39705 26746 -28400 -46146 -35217
14489 -35217 10413 25633 51253 -46625 -114828 -93444 -83040 -57260 -99736 -115313 -67645 -35047
14477 -35047 -18678 -129055 -146097 -83591 -38537 42347 49574 8662 -25530 -62457 -22618 -14767
14465 -14767 -90860 -85316 -74194 29696 3465 1555 62475 19806 -30113 -53116 -80799 -86100
14453 -86100 -2833 90800 94707 -3 -105568 -180986 -186258 -127694 -46839 -104109 -42206 -19304
14441 -19304 -90663 -138278 -79257 -32031 -15791 -35373 -87316 -118543 -80422 -29882 40352 71014
14429 71014 20648 42291 107318 61964 -16501 -31982 -140759 -108321 -20215 -29306 -117837 -120306
$$ packed form
14513A80883j14984l6679n8474O938R4857j738j8557j3384j8489J5845O2789K703
14501A01710o7930J3020k6297P910O240L4780l42k9386j2959n5146j7746J0929
14489c5217M5630J5220K5620r7878o8203K1384J0404K5780m2476j5577M7668L2598
14477c5047J6369j10377j7042O2506M5054Q0884P227m0912l4192l6927L9839P851
14465a4767p6093N544J1122J03890k6231j910O0920m2669m9919k3003k7683n301
14453h6100Q3267R3633L907r4710j05565p5418n272N8564Q0855n7270O1903K2902
14441a9304p1359m7615N9021M7226J6240j9582n1943l1227L8121N0540P0234L0662
14429G1014n0366K1643O5027m5354p8465j5481j08777L2438Q8106r091q8531k469
$$ plain form
14417 -120306 -98897 -148174 -138259 -130324 -10159 -76615 -150098 -126897 -86343 -72270 -15935 15997
14405 15997 -93929 -62802 13318 30859 30980 64332 130901 154500 118690 23056 13772 -37447
14393 -37447 -64543 -31673 -3518 -34508 -64255 -78012 -118296 -32337 -22078 -35714 -66454 -55075
14381 -55075 -42030 -16205 -30224 -14515 22298 9947 -25031 -20266 -87745 -79177 -35811 15256
14369 15256 27012 -15437 9759 7463 22410 -55391 -76932 -54988 -45335 -45919 -43118 -97508 -110589
14356 -110589 -73950 -18510 16355 3307 4678 -5535 -49666 -71066 -11736 24629 -33753 -92457
14344 -92457 -98775 22808 -8362 1307 -64868 -94595 -18873 13103 -31191 -19964 63423 52039
14332 52039 -2084 -27658 -64311 -118303 -97774 -31489 36213 12092 49851 58635 68054 -3378
$$ packed form
14417a20306K1409m9277R915P935J20165o6456p3483K3201M0554J4073N6335L1932
14405A5997j09926L1127P6120J7541J21L3352O6569K3599l5810r5634r284n1219
14393c7447k7096L2870K8155l0990k9747j3757m0284Q5959J0259j3636l0740J1379
14381e5075J3045K5825j4019J5709L6813j2351l4978M765o7479Q568M3366N1067
14369A5256J1756m2449K5196k296J4947p7801k1541K1944R653n84K801n4390j3081
14356a10589L6639N5440L4865j3048J371j0213m4131k1400N9330L6365n8382n8704
14344i2457o318J21583l1170R669o6175k9727P5722L1976m4294J1227Q3387j1384
14332E2039n4123k5574l6653n3992K0529O6285O7702k4121L7759Q784R419p1432
$$ plain form
14320 -3378 -66165 -90654 -26705 -34391 -90590 -121570 -106899 -52388 -61160 -77916 -94746 -47000
14308 -47000 -55653 -1125 60833 12931 23066 75366 103151 110551 111798 34740 -25917 -59225
14296 -59225 -63993 -28266 -23843 -122288 -125152 -120698 -130851 -79316 24082 35306 -2170 -99914
14284 -99914 -100825 76051 174733 66570 37047 -13539 -9605 7195 28018 55177 69356 68750
14272 68750 88292 5374 -58069 -49230 13498 33393 3276 22046 75530 174274 136032 63373
14260 63373 3588 -175 44100 104984 145184 62955 66187 7 -39302 -51393 -3059 -78488
14248 -78488 -82358 -113632 -72453 -21186 -16152 -24298 -5807 42683 29571 17169 47775 183519
14236 183519 207521 119475 73682 102291 180471 215666 119353 -4309 -70788 21219 16608
$$ packed form
14320c378o2787k4489O3949p686n6199l0980J4671N4511q772j6756j6830M7746
14308d7000q653N4528O1958m7902J0135N2300K7785P400J247p7058o0657l3308
14296e9225m768L5727M423r8445k864M454j0153N1535J03398J1224l7476r7744
14284i9914r11J76876R8682j08163k9523n0586L934J6800K0823K7159J4179o06
14272F8750J9542q2918o3443Q839O2728J9895l0117J8770N3484R8744l8242p2659
14260F3373n9785l763M4275O0884M0200q2229L232o6180l9309j2091M8334p5429
14248g8488l870l1274M1179N1267N034q146J8491M8490j3112j2402L0606J35744
14236A83519K4002q8046m5793K8609P8180L5195r6313j23662o6479R2007m611
$$ plain form
14225 16608 53676 59188 1128 41267 85987 170792 120007 34159 -22508 -70781 -52974 -42303
14213 -42303 -59583 -77316 -53559 -33771 14445 15723 24797 96422 92068 54835 32582 7876
14201 7876 -59714 -102890 -147602 -60293 85993 29675 3415 -69680 -98580 -63616 -24347 -25678
14189 -25678 -20828 31945 109028 52014 10009 -88623 -60603 -35515 3542 -7146 -5898 -13075
14177 -13075 -4763 -18376 -133067 -130664 -72190 -30897 -46588 -68057 -115916 -70010 -16447 -55677
14165 -55677 -71996 -72697 -50055 61949 97579 63150 22225 -13983 -111485 -126503 -20177 89669
14153 89669 51594 11017 -10781 -3419 -79486 -161268 -184795 -163601 -166631 -168519 -151741 -30129
14141 -30129 119689 166876 105636 89758 71271 145790 168098 99621 -40979 -139497 -60738
$$ packed form
14225A6608L7068N512n8060M0139M4720Q4805n0785q5848n6667m8273J7807J0671
14213d2303j7280j7733K3757J9788M8216J278R074P1625m354l7233k2253k4706
14201G876o7590m3176m4712Q7309J46286n6318k6260p3095k8900L4964L9269j331
14189b5678M850N2773P7083n7014m2005r8632K8020K5088L9057j0688J248p177
14177a3075Q312j3613j14691K403N8474M1293j5691k1469m7859M5906N3563l9230
14165e5677j6319p01K2642J12004L5630l4429m0925l6208r7502j5018J06326J09846
14153H9669l8075m0577k1798P362p6067q1782k3527K1194l030j888J6778J21612
14141c0129J49818M7187o1240j5878j8487P4519K2308o8477j40600r8518P8759
$$ plain form
14130 -60738 -89127 -114096 -109636 -3628 117227 93230 -23182 31949 146026 166709 142282
14119 142282 157541 124456 47398 10782 -23311 -22569 51792 29800 -23217 28386 73886 101300
14107 101300 63308 25468 43317 30113 26217 58502 510 -79790 -122737 -50907 5882 84876
14095 84876 88628 -2952 -88016 -82222 15554 38498 -15717 -14715 -29949 22197 -9564 -58811
14083 -58811 1539 62517 45125 30267 -36749 -61861 -98600 -120458 -168856 -32830 15845
14072 15845 51598 25008 -18112 -13480 -42863 -133236 -113328 3749 9080 -100355 -130481 -137151
14060 -137151 -38463 16232 38188 32532 47769 134465 147577 91426 21842 -15207 -26630 -68099
14048 -68099 -124488 -68799 21390 107003 74491 112105 150325 122737 1785 -101948 -183941
$$ packed form
14130f0738k8389k4969M460J06008J20855k3997j16412N5131J14077K0683k4427
14119A42282J5259l3085p7058l6616l4093P42P4361k1992n3017N1603M5500K7414
14107A01300l7992l7840J7849j3204l896L2285n7992q0300m2947P1830N6789P8994
14095H4876L752r1580q5064N794R7776K2944n4215J002j5234N2146l1761m9247
14083e8811O0350O0978j7392j4858o7016k5112l6739k1858m8398J36026M8675
14072A5845L5753k6590m3120M632k9383r0373J9908J17077N331j09435l0126o670
14060a37151R8688N4695K1956n656J5237Q6696J3112n6151o9584l7049j1423m1469
14048f8099n6389N5689R0189Q5613l2512L7614L8220k7588j20952j03733q1993
$$ plain form
14037 -183941 -211276 -205739 -98486 -17822 1400 -33847 -39736 -14330 -16570 -26621 -29851 -29938 -84622
14024 -84622 -118780 -64498 -115553 -113069 -6250 128801 165103 102097 64792 84743 -31510
14013 -31510 -86759 -67130 15009 141679 164028 104425 61268 50123 29999 -25128 19320
14002 19320 61907 -8920 -37214 -65839 -71661 -95464 -86298 -174689 -215160 -162297 -128637 -126482
13990 -126482 -219239 -188403 -40246 -12817 -45947 -76458 -115987 -145708 -142224 -78528 -25537
13979 -25537 -18364 -83635 -103470 -107745 -55666 -115733 -147612 -142337 -78153 -25702 -10417 28206
13967 28206 96259 80865 26064 -58042 -170700 -111834 -36948 -33313 33749 100773 163490 164709
13955 164709 89530 27353 58016 32321 122036 130738 151031 196911 221369 251286 286087 285237
$$ packed form
14037a83941k7335N537J07253Q0664J9222l5247n889K5406k240j0051l230q7n4684
14024h4622l4158N4282n1055K484J06819J35051L6302o3006l7305J9951j16253
14013c1510n5249J9629Q2139J26670K2349n9603m3157j1145k0124n5127M4448
14002A9320M2587p0827k8294k8625n822k3803R166q8391m0471N2863L3660K155
13990a26482r2757L0836J48157K7429l3130l0511l9529k9721L484O3696N2991
13979b5537P173o5271j9835m275N2079o0067l1879N275O4184N2451J5285L8623
13967B8206O8053j5394n4801q4106j12658N8866P4886L635O7062O7024O2717J219
13955A64709p5179o2177L0663k5695Q9715Q702K0293M5880K4458K9917L4801q50
$$ plain form
13943 285237 226714 192366 141919 60106 63981 58171 110335 179067 90504 50788 538 -6426
13931 -6426 -15189 52571 54163 80857 124191 146462 161831 189792 178121 149079 167438 133140
13919 133140 47603 -7290 117970 111668 122899 56210 -5464 21012 5748 -7428 -1255 70657
13907 70657 55537 83588 69887 73275 120862 142673 61170 -84119 -118925 -55580 -6459 50006
13895 50006 51523 -9097 -22455 54048 5955 -110468 -149928 -101576 -174395 -186753 -150163 -60274
13883 -60274 -88057 -60359 -13818 40183 78307 81877 67533 79896 84164 139497 252259 174649
13871 174649 -1071 -48264 -55674 1345 50405 73197 59623 107178 166855 144650 84668
13860 84668 127051 121531 78812 68743 58222 141944 170992 157632 199064 186378 122596 12637
$$ packed form
13943B85237n8523l4348n0447q1813L875n810N2164O8732q8563l9716n0250o964
13931f426q763O7760J592K6694M3334K2271J5369K7961j1671k9042J8359l4298
13919A33140q5537n4893J25260o302J1231o6689o1674K6476j5264j3176O173P1912
13907G0657j5120K8051j3701L388M7587K1811q1503j45289l4806O3345M9121N6465
13895E0006J517o0620j3358P6503m8093j16423l9460M8352p2819j2358L6590Q9889
13883f0274k7783K7698M6541N4001L8124L570j4344J2363M268N5333J12762p7610
13871A74649j75720m7193p410N7019M9060K2792j3574M7555N9677k2205n9982
13860H4668M2383n520m2719j0069j0521Q3722K9048j3360M1432j2686o3782j09959
$$ plain form
13848 12637 -29485 -59736 27356 82221 46672 -28724 -47211 70476 119590 100222 111196
13837 111196 91567 46515 40804 67262 148661 180324 128179 145237 182543 126222 74226 34742
13825 34742 16862 1171 50172 74620 35743 11899 -18435 -5507 32489 -1242 498 -25137
13813 -25137 31996 26289 61531 89212 85454 48218 19135 14336 -46235 -62146 -88789 -175280
13801 -175280 -168253 -90563 -43195 -79138 -95033 -85027 -47519 -21553 -29144 -82403 -5101 18036
13789 18036 -29236 -66835 -88383 -18008 -10526 -21881 67740 143598 146706 103400 138103 107566
13777 107566 154967 153114 22602 -15677 23954 75708 60597 89423 113389 -18361 -51598
13766 -51598 -22490 -59326 -12441 1503 -28585 -50413 26007 104513 127615 228583 288241
$$ packed form
13848A2637m2122l0251Q7092N4865l5549p5396j8487J17687M9114j9368J0974
13837A11196j9629m5052n711K6458Q1399L1663n2145J7058L7306n6321n1996l9484
13825C4742j7880j5691M9001K4448l8877k3844l0334J2928L7996l3731J740k5635
13813b5137N7133n707L5242K7681l758l7236k9083m799o0571j5911k6643q6491
13801a75280P027P7690M7368l5943j5895J0006L7508K5966p591n3259P7302K3137
13789A8036m7272l7599k1548P0375P482j1355Q9621P5858L108m3306L4703l0537
13777A07566M7401j853j30512l8279L9631N1754j5111K8826K3966j31750l3237
13766e1598K9108l6836M6885J3944l0088k1828P6420P8506K3102J00968N9658
$$ plain form
13755 288241 236789 196947 136641 86683 67591 32400 9103 31876 -18125 -38548 -99436
13744 -99436 -89047 -76055 -44173 -16857 -61743 -58095 -29767 5254 24062 21074 103640 117656
13732 117656 105979 98083 97927 63152 102200 127304 115659 91432 28077 17429 -20872 -92601
13720 -92601 -39021 41045 35895 42759 129466 157714 113128 183576 166087 70330 54774 27146
13708 27146 70128 61713 93033 20546 45734 93237 126899 167675 141796 145182 128721 131396
13696 131396 153840 164975 184755 147249 105504 61098 -18579 -50026 -24084 9385 15550 123157
13684 123157 179018 135583 101929 37215 -11883 36032 10726 35032 159393 217726 133418
13673 133418 135433 174988 113208 77707 70693 108591 81340 29592 30131 77391 144684 242492
$$ packed form
13755B88241n1452l9842o0306m9958j9092l5191k3297K2773n0001k0423o0888
13744i9436J0389J2992L1882K7316m4886L648K8328L5021J8808k988Q2566J4016
13732A17656j1677p896j56l4775L9048K5104j1645k4227o3355j0648l8301p1729
13720i2601N3580Q0066n150O864Q6707K8248m4586P0448j7489r5757j5556k7628
13708B7146M2982q415L1320p2487K5188M7503L3662M0776k5879L386j6461K675
13696A31396K2444J1135J9780l7506m1745m4406p9677l1447K5942L3469O165J07607
13684A23157N5861m3435l3654o4714m9098M7915k5306K4306J24361N8333q4308
13673A33418K015L9555o1780l5501p014L7898k7251n1748N39M7260O7293R7808
$$ plain form
13661 242492 198839 132291 71822 110659 119251 109994 100740 108092 131829 151064 232641 213774
13649 213774 235917 233952 165058 122100 83408 6095 -37838 24716 42009 17379 22055 -10175
13637 -10175 9347 60269 70545 76450 2055 -109568 -41536 104167 144227 68464 12853
13626 12853 -4782 -79820 -111492 23923 65324 40749 -1208 -8979 96755 167959 194915
13615 194915 158822 98844 53801 65112 64917 126584 154474 90001 61876 120802 181630 148907
13603 148907 26137 -45803 -51702 -49492 75546 110172 80033 133837 102837 17985 -49125
13592 -49125 -23018 65477 44165 -74642 -57885 -117 4176 -4231 21450 37750 57506 68635
13580 68635 61300 63303 20007 -21696 77682 107733 31012 39934 87446 170308 185881 134979
$$ packed form
13661B42492m3653o6548o0469L8837Q592r257r254P352K3737J9235Q1577j8867
13649B13774K2143j965o8894m2958l8692p7313m3933O2554J7293k4630M676l2230
13637a0175J9522N0922J0276N905p4395j11623O8032J45703M0060p5763n5611
13626A2853j7635p5038l1672J35415M1401k4575m1957p771J05734P1204K6956
13615A94915l6093n9978m5043J1311j95O1667K7890o4473k8125N8926O0828l2723
13603A48907j22770p1940n899K210J25038L4626l0139N3804l1000q4852o7110
13592d9125K6107Q8495k1312j18807J6757N7768M293q407K5681J6300J9756J1129
13580F8635p335K003m3296m1703R9378L0051p6721Q922M7512Q2862J5573n0902
$$ plain form
13568 134979 100748 81561 65008 122890 162440 172665 132258 86576 70920 71579 131921 170203
13556 170203 112878 79163 60567 155334 132698 124340 166338 98409 19047 67557 118215 84336
13544 84336 -1816 -53330 -18262 -15932 -2921 31612 18184 38696 119176 76693 64176 65181
13532 65181 75691 62417 51938 83817 35683 59859 53538 -71204 -67178 -17696 7442 -8091
13520 -8091 13410 11499 -30697 -42228 -10073 39868 160149 150883 104018 123577 4732 -84806
13508 -84806 -105895 -66410 -31453 62212 98716 93220 30272 -2942 -7769 42670 103828 83444
13496 83444 42372 14461 29389 37959 93559 139032 143999 120653 42609 50794 79885 35302
13484 35302 12096 67739 81116 121349 88865 53964 43553 41857 89597 31817 -40814 -93260
$$ packed form
13568A34979l4231j9187j6553N7882L9550J0225m0407m5682j5656O59O0342L8282
13556A70203n7325l3715j8596R4767k2636q358M1998o7929p9362M8510N0658l3879
13544H4336q6152n1514L5068K330J3011L4533j3428K0512Q0480m2483j2517J005
13532F5181J0510j3274j0479L1879m8134K4176o321j24742M026M9482K5138j5533
13520h091K1501j911m2196j1531L2155M9941J20281r266m6865J9559j18845q9538
13508h4806k1089L9485L4957R3665L6504n496o2948l3214m827N0439O1158k0384
13496H3444m1072k7911J4928Q570N5600M5473M967k3346p8044Q185K9091m4583
13484C5302k3206N5643J3377M0233l2484l4901j0411j696M7740n7780p2631n2446
$$ plain form
13472 -93260 -81598 43950 126504 80298 37261 15412 -91783 -107653 -6239 73529 31549
13461 31549 58305 54180 -29461 -38940 624 62779 60419 42326 5604 86712 96583 95726 56595
13448 56595 -50113 -28626 61893 90493 94023 70496 61368 105623 137639 117739 107209 96910
13436 96910 67097 62886 92845 77885 22794 75623 79467 100505 43432 66525 70128 111974
13424 111974 143923 188411 158521 99353 66132 78985 107668 63568 37381 61197 214271
13413 214271 212534 203755 102808 13056 -3420 45472 20698 -27662 56344 158355 104685
13402 104685 80966 86548 76669 27325 18951 38449 -9229 -71514 -90375 -72700 25471 84710
13390 84710 50537 -5691 -34248 -42907 -47387 -79656 27037 60669 72431 157004 212056 242417
$$ packed form
13472i3260J1662J25548Q2554m6206m3037k1849j07195j5870J01414P9768m1980
13461C1549K6756m125q3641r479L9564O2155k360j8093l6722Q1108R871q57l9131
13448E6595j06708K1487R0519K8600L530k3527r128M4255L2016j9900j0530j0299
13436I6910k9813m211K9959j4960n5091N2829L844K1038n7073K3093L603M1846
13424A11974L1949M4488k9890n9168l3221J2853K8683m4100k6187K3816J53074
13413B14271j737q779j00947q9752j6476M8892k4774m8360Q4006J02011n3670
13402A04685k3719N582r879m9344q374J9498m7678o2285j8861J7675R8171N9239
13390H4710l4173n6228k8557q659m480l2269J06693L3632J1762Q4573N5052L0361
$$ plain form
13378 242417 178298 73310 86346 77215 29927 32082 96702 107047 87631 109906 116896 144093
13366 144093 112777 82819 70743 113815 215244 236617 224831 186414 113574 161044 261023
13355 261023 205968 131560 116234 142485 143377 72116 127579 193579 269136 262865 192640 177164
13343 177164 264050 300331 190199 186123 168890 213206 243098 248186 180146 80330 -6959 56679
13331 56679 96333 143182 177921 226081 168795 126018 189296 199291 121588 101747 161748 139669
13319 139669 57524 55422 106017 157231 132169 194776 110626 138128 213159 192173 256498 304220
13307 304220 232123 156003 114740 114513 132823 33295 114811 132902 141143 175080 105197 110015
13295 110015 97919 137040 205532 165955 233791 251614 266336 306993 256364 210934 230006
$$ packed form
13378B42417o4119j04988J3036r131m7288K155O4620J0345j9416K2275O990K7197
13366A44093l1316k9958j2076M3072J01429K1373j1786l8417p2840M7470R9979
13355B61023n5055p4408j5326K6251Q92p1261N5463O6000P5557o271p0225j5476
13343A77164Q6886L6281j10132m076j7233M4316K9892N088o8040r9816q7289O3638
13331E6679L9654M6849L4739M8160n7286m2777O3278R995p7703j9841O0001k2079
13319A39669q2145k102N0595N1214k5062O2607q4150K7502P5031k0986O4325M7722
13307C04220p2097p6120m1263k27J8310r9528Q1516J8091Q241L3937o9883M818
13295A10015j2096L9121O8492l9577O7836J7823J4722M0657n0629m5430J9072
$$ plain form
13284 230006 216496 223019 283933 307622 277822 259417 360973 415840 297996 206423 130146
13273 130146 75365 112779 132247 190789 193085 192949 205721 239030 272994 334442 284082 237892
13261 237892 287467 334491 257293 259204 331068 244716 239816 208359 157057 107034 178945 243069
13249 243069 239695 153437 172909 249323 313618 322327 224393 153808 179060 188927 140459 187572
13237 187572 209931 219634 198403 187823 239308 284849 253701 334431 267017 179011 76224
13226 76224 68710 120966 114600 69888 153572 298061 376508 316302 192614 224131 299016 397637
13214 397637 364886 302830 244082 297239 372894 362439 333594 305338 290968 214241 85475
13203 85475 72441 87768 129005 150446 169542 277703 262322 171821 238041 362685 376672
$$ packed form
13284B30006j3510O523O0914K3689k9800j8405J01556N4867j17844r1573p6277
13273A30146n4781L7414J9468N8542K296j36J2772L3309L3964O1448n0360m6190
13261B37892M9575M7024p7198J911P1864q6352m900l1457n1302n0023P1911O4124
13249B43069l374q6258J9472P6414O4295Q709r7934p0585K5252R867m8468M7113
13237A87572K2359R703k1231j0580N1485M5541l1148Q0730o7414q8006j02787
13226G6224p514N2256o366m4712Q3684J44489P8447o0206j23688L1517P4885R8621
13214C97637l2751o2056n8748N3157P5655j0455k8845k8256j4370p6727j28766
13203H5475j3034J5327M1237K1441J9096J08161j5381r0501O6220J24644J3987
$$ plain form
13192 376672 315441 243223 266226 304704 397119 403685 368973 344302 320844 280849 235618 326257
13180 326257 349469 456673 450752 430340 323293 339546 248983 190968 180768 202034 333549
13169 333549 377174 416061 409730 458871 431027 427425 405335 382837 317946 382516 410052 406322
13157 406322 440834 427281 459604 458702 441520 357919 288998 370804 513354 522794 528216 539504
13145 539504 525202 532750 501026 366947 253776 231050 256876 294172 309697 342071 457603
13134 457603 543498 580783 565930 580763 621249 565115 441176 484400 533880 486976 512461
13123 512461 482133 438308 447079 456994 455946 488385 595767 624878 549949 535027 555462 519669
13111 519669 496629 532111 599019 594178 610197 537701 518167 576830 602358 656845 703968 582465
$$ packed form
13192C76672o1231p2218K3003L8478R2415O566l4712k4671k3458l9995m5231R0639
13180C26257K3212J07204n921k0412j07047J6253r0563n8015j0200K1266J31515
13169C33549M3625L8887o331M9141k7844l602k2090k2498o4891O4570K7536l730
13157D06322L4512j3553L2323r02j7182q3601o8921Q1806J42550R440N422J1288
13145E39504j4302P548l1724j34079j13171k2726K5826L7296J5525L2374J15532
13134D57603Q5895L7285j4853J4833M0486n6134j23939M3224M9480m6904K5485
13123E12461l0328m3825Q771R915j048L2439J07382K9111p4929j4922K0435l5793
13111E19669k3040L5482O6908m841J6019p2496j9534N8663K5528N4487M7123j21503
$$ plain form
13099 582465 474642 442082 444756 419369 381701 411279 453287 542299 533070 592910 643472 610738
13087 610738 630448 636627 680582 647958 521943 462509 554827 584460 506579 489771 558235
13076 558235 558290 528063 542238 640632 644652 644333 625564 558947 460685 541087 601712 638848 618137
13063 618137 631209 633148 656992 663991 851125 846718 806228 729495 673781 713742 748071 802790
13051 802790 856918 825570 757582 703521 758786 709549 601661 649775 753607 704969 674141
13040 674141 633296 611513 666022 728759 768684 764049 734628 762211 840936 865411 790502 900317
13028 900317 903999 933089 882491 909929 866473 821185 803301 822967 878256 952488 1004517 1075591
13016 1075591 1035456 1021560 1000711 875859 792167 843537 883610 891184 870966 891546 876891
$$ packed form
13099E82465j07823l2560K674k5387l7668K9578M2008Q9012r229N9840N0562l2734
13087F10738J9710O179M3955l2624j26015n9434R2318K9633p7881j6808O8464
13076E58235N5l0227J4175R8394M020l19j8769o6617r8262Q0402O0625L7136k0711
13063F18137J3072J939K3844O999J87134m407m0490p6733n5714L9961L4329N4719
13051H02790N4128l1348o7988n4061N5265m9237j07888M8114J03832m8638l0828
13040F74141m0845k1783N4509O2737L9925m635k9421K7583P8725K4475p4909J09815
13028I00317L682K9090n0598K7438m3456m5288j7884J9666N5289P4232N2029P1074
13016A075591m0135j3896k0849j24852q3692N1370M0073P574k0218K0580j4655
$$ plain form
13005 876891 922186 981783 981865 1123679 1193258 1146151 1186798 1216646 1139861 1179518 1117010 1101205
12993 1101205 1138065 1142001 1143848 1253146 1243224 1277708 1425137 1552190 1680785 1867036 2086680
12982 2086680 2299701 2466554 2460483 2224494 1982553 1760261 1621107 1557305 1421226 1348936
12972 1348936 1380865 1467493 1461674 1450302 1480378 1435669 1361079 1315291 1357086 1368178 1435380
12961 1435380 1404814 1409461 1366194 1393258 1406911 1369590 1519552 1600042 1554709 1495813 1428815
12950 1428815 1507849 1529808 1596882 1609436 1621138 1678922 1713037 1697127 1619916 1699117 1838551
12939 1838551 1830161 1781484 1771345 1835193 1815440 1716529 1742772 1818848 1883646 1910460 1893796
12928 1893796 1856827 1798466 1872177 1923011 1960733 1919262 1949967 1970804 1954276 2022379 2029060
$$ packed form
13005H76891M5295N9597Q2J41814O9579m7107M0647K9848p6785L9657o2508j5805
12993A101205L6860L936J847J09298r922L4484J47429J27053J28595J86251K19644
12982B086680K13021J66853o071k35989k41941k22292j39154o3802j36079p2290
12972A348936L1929Q6628n819j1372L0076m4709p4590m5788M1795J1092O7202
12961A435380l0566M647m3267K7064J3653l7321J49962Q0490m5333n8896o6998
12950A428815P9034K1959O7074J2554J1702N7784L4115j5910p7211P9201J39434
12939A838551q390m8677j0139O3848j9753r8911K6243P6076O4798K6814j6664
12928A893796l6969n8361P3711N0834L7722m1471L0705K0837j6528O8103O681
$$ plain form
12917 2029060 2135395 2142175 2065695 2055887 2036960 2077814 2116204 2263137 2298041 2382481 2454167
12906 2454167 2510478 2433327 2420653 2486665 2598472 2617688 2631409 2676248 2686025 2631812 2611653
12895 2611653 2677317 2839487 2848368 2853906 2862042 2831921 2867401 2950039 3028721 3074290 3081077 3107372
12883 3107372 3099221 3191289 3265095 3335694 3405255 3461767 3569071 3700920 3662089 3688034 3771958
12872 3771958 3841839 3908468 3890963 3870083 3961872 4020573 4077396 4157413 4201831 4480519 4641757
12861 4641757 4650462 4678267 4664296 4713059 4747581 4942619 5113520 5226270 5266832 5312448 5379358
12850 5379358 5480975 5521853 5631987 5728169 5807005 5940550 6110142 6156791 6236514 6343930
12840 6343930 6359317 6441422 6551774 6704763 6820553 6999719 7171762 7314148 7501926 7568245
$$ packed form
12917B029060J06335O780p6480r808j8927M0854L8390J46933L4904Q4440P1686
12906B454167N6311p7151j2674O6012J11807J9216J3721M4839R777n4213k0159
12895B611653O5664J62170Q881N538Q136l0121L5480Q2638P8682M5569O787K6295
12883C107372q151R2068P3806P0599O9561N6512J07304J31849l8831K5945Q3924
12872C771958O9881O6629j7505k0880R1789N8701N6823Q0017M4418K78688J61238
12861D641757Q705K7805j3971M8763L4522J95038J70901J12750M0562M5616O6910
12850E379358J01617M0878J10134R6182P8836J33545J69592M6649P9723J07416
12840F343930J5387Q2105J10352J52989J15790J79166J72043J42386J87778O6319
$$ plain form
12830 7568245 7579940 7662883 7781365 7984075 8065847 8035232 8083747 8187202 8354116 8484546
12820 8484546 8572506 8702125 8937503 9094185 9244566 9384222 9549540 9679396 9767097 9914917
$$ packed form
12830G568245J1695Q2943J18482K02710Q1772l0615M8515J03455J66914J30430
12820H484546Q7960J29619K35378J56682J50381J39656J65318J29856Q7701J47820
$$ [...]
##END NTUPLES=NMR SPECTRUM
##END=
