##TITLE=cx039 - 1
##JCAMPDX= 6.0         $$ Bruker NMR JCAMP-DX V2.0
##DATA TYPE= NMR SPECTRUM
##DATA CLASS= NTUPLES
##ORIGIN= BRUKER
##OWNER= g12444
$$ XWIN-NMR		Version 3.6
$$ Thu Mar 31 16:32:41 2011 CEST (UT+2h)  cnuessle@icmbsg010.epfl.ch
$$ Compression mode = diff/dup
##.OBSERVE FREQUENCY= 400.132200715
##.OBSERVE NUCLEUS= ^1H
##.ACQUISITION MODE= SIMULTANEOUS (DQD)
##.ACQUISITION SCHEME= undefined
##.AVERAGES= 16
##.DIGITISER RES= 18
##SPECTROMETER/DATA SYSTEM= drx400
##.PULSE SEQUENCE= zg
##.SOLVENT NAME= DMSO
##.SHIFT REFERENCE= (INTERNAL, DMSO, 0, 11.5077)
##AUDIT TRAIL= $$ (NUMBER, WHEN, WHO, WHERE, WHAT)
$$ ##TITLE= Audit trail, XWIN-NMR		Version 3.6
$$ ##JCAMPDX= 5.01
$$ ##ORIGIN= Bruker BioSpin GmbH
$$ ##OWNER= cnuessle
$$ $$ /opt/xwinnmr/data/guest/nmr/cx039/1/pdata/1/auditp.txt
$$ ##AUDIT TRAIL=  $$ (NUMBER, WHEN, WHO, WHERE, WHAT)
(   1,<2011-03-31 16:32:18.90 +0200>,<cnuessle>,<icmbsg010.epfl.ch>,
      <created by zg, POWCHK disabled, PULCHK disabled
       configuration hash MD5:
       72 99 7F 0C FF 0C D4 97 28 54 C6 46 16 10 DF EB
       data hash MD5: 32K
       2E C9 F8 DA EE 42 E1 3D C6 D6 45 BD ED 38 7B D2>)
(   2,<2011-03-31 16:32:22.08 +0200>,<cnuessle>,<icmbsg010.epfl.ch>,
      <Start of raw data processing
       efp LB = 3 FT_mod = 6 PKNL = 1 PHC0 = 185.6805 PHC1 = 12.09467 SI = 16K 
       data hash MD5: 16K
       11 E3 31 50 11 0D 90 8A F9 B6 93 BA 2E 83 5C FE>)
(   3,<2011-03-31 16:32:23.38 +0200>,<cnuessle>,<icmbsg010.epfl.ch>,
      <apk 
       data hash MD5: 16K
       11 E3 31 50 11 0D 90 8A F9 B6 93 BA 2E 83 5C FE>)
$$ ##END=
$$ 
$$ $$ hash MD5
$$ $$ 09 AA 39 89 08 06 CB 24 CA 3A B1 FA 7F D8 15 ED
##$RELAX= 
##$RELAX= 
##$RELAX= 
##$RELAX= 
##$RELAX= 
$$ Bruker specific parameters
$$ --------------------------
##$DU= </opt/xwinnmr>
##$EXPNO= 1
##$NAME= <cx039>
##$PROCNO= 1
##$TYPE= <nmr>
##$USER= <guest>
##$AMP= (0..31)
100 100 100 100 100 100 100 100 100 100 100 100 100 100 100 100 100 100 
100 100 100 100 100 100 100 100 100 100 100 100 100 100 
##$AQSEQ= 0
##$AQ_mod= 3
##$AUNM= <au_zg>
##$AUTOPOS= <>
##$BF1= 400.13
##$BF2= 400.13
##$BF3= 400.12
##$BF4= 400.12
##$BF5= 400.12
##$BF6= 400.12
##$BF7= 400.12
##$BF8= 400.12
##$BYTORDA= 1
##$CFDGTYP= 2
##$CFRGTYP= 5
##$CHEMSTR= <none>
##$CNST= (0..31)
1 1 145 1 1 1 1 1 1 1 1 1 1 1 1 1 1 1 1 1 1 1 1 1 1 1 1 1 1 1 1 1 
##$CPDPRG= <>
##$CPDPRG1= <>
##$CPDPRG2= <>
##$CPDPRG3= <>
##$CPDPRG4= <mlev>
##$CPDPRG5= <mlev>
##$CPDPRG6= <mlev>
##$CPDPRG7= <mlev>
##$CPDPRG8= <mlev>
##$CPDPRGB= <>
##$CPDPRGT= <>
##$D= (0..31)
0 3 0 0 0 0 0 0 0 0 0 0 0 0 0 0 0 0 0 0 0 0 0 0 0 0 0 0 0 0 0 0 
##$DATE= 1301581867
##$DBL= (0..7)
120 120 120 120 120 120 120 120 
##$DBP= (0..7)
150 150 150 150 150 150 150 150 
##$DBP07= 0
##$DBPNAM0= <>
##$DBPNAM1= <>
##$DBPNAM2= <>
##$DBPNAM3= <>
##$DBPNAM4= <>
##$DBPNAM5= <>
##$DBPNAM6= <>
##$DBPNAM7= <>
##$DBPOAL= (0..7)
0.5 0.5 0.5 0.5 0.5 0.5 0.5 0.5 
##$DBPOFFS= (0..7)
0 0 0 0 0 0 0 0 
##$DE= 6
##$DECBNUC= <off>
##$DECIM= 32
$$ [...]
##$SUBNAM1= <"">
##$SUBNAM2= <"">
##$SUBNAM3= <"">
##$SUBNAM4= <"">
##$SUBNAM5= <"">
##$SUBNAM6= <"">
##$SUBNAM7= <"">
##$SUBNAM8= <"">
##$SUBNAM9= <"">
##$SW= 12.0152597044212
##$SWIBOX= (0..15)
0 0 3 3 0 0 0 0 0 0 0 0 0 0 0 0 
##$SW_h= 4807.69230769231
##$TD= 32768
##$TD0= 1
##$TE= 300
##$TE2= 300
##$TE3= 300
##$TEG= 300
##$TL= (0..7)
0 120 120 120 120 120 120 120 
##$TP= (0..7)
150 150 150 150 150 150 150 150 
##$TP07= 0
##$TPNAME0= <>
##$TPNAME1= <>
##$TPNAME2= <>
##$TPNAME3= <>
##$TPNAME4= <>
##$TPNAME5= <>
##$TPNAME6= <>
##$TPNAME7= <>
##$TPOAL= (0..7)
0.5 0.5 0.5 0.5 0.5 0.5 0.5 0.5 
##$TPOFFS= (0..7)
0 0 0 0 0 0 0 0 
##$TUNHIN= 0
##$TUNHOUT= 0
##$TUNXOUT= 0
##$USERA1= <user>
##$USERA2= <user>
##$USERA3= <user>
##$USERA4= <user>
##$USERA5= <user>
##$V9= 5
##$VALIST= <valist>
##$VCLIST= <CCCCCCCCCCCCCCC>
##$VD= 0
##$VDLIST= <DDDDDDDDDDDDDDD>
##$VPLIST= <PPPPPPPPPPPPPPP>
##$VTLIST= <TTTTTTTTTTTTTTT>
##$WBST= 1024
##$WBSW= 12
##$XGAIN= (0..3)
0 0 0 0 
##$XL= 0
##$YL= 0
##$YMAX_a= 468594
##$YMIN_a= -557622
##$ZGOPTNS= <>
##$ZL1= 120
##$ZL2= 120
##$ZL3= 120
##$ZL4= 120
##$ABSF1= 0
##$ABSF2= 0
##$ABSG= 0
##$ABSL= 0
##$ALPHA= 0
##$AQORDER= 0
##$ASSFAC= 0
##$ASSFACI= 0
##$ASSFACX= 0
##$ASSWID= 0
##$AUNMP= <proc_1d>
##$AZFE= 0.1
##$AZFW= 0.1
##$BCFW= 0
##$BC_mod= 0
##$BYTORDP= 0
##$COROFFS= 0
##$CY= 0
##$DATMOD= 1
##$DC= 0
##$DFILT= <>
##$DTYPP= 0
##$F1P= 8.34393892286757
##$F2P= 7.69542082928722
##$FCOR= 1
##$FTSIZE= 16384
##$FT_mod= 6
##$GAMMA= 0
##$GB= 0
##$INTBC= 1
##$INTSCL= 1
##$ISEN= 128
##$LB= 3
##$LEV0= 0
##$LPBIN= 0
##$MAXI= 10000
##$MC2= 0
##$MEAN= 0
##$ME_mod= 0
##$MI= 0
##$NCOEF= 0
##$NC_proc= -5
##$NLEV= 6
##$NOISF1= 0
##$NOISF2= 0
##$NSP= 0
##$NTH_PI= 0
##$NZP= 0
##$OFFSET= 11.50766
##$PC= 1
##$PHC0= 185.6805
##$PHC1= 12.09467
##$PH_mod= 1
##$PKNL= yes
##$PPARMOD= 0
##$PSCAL= 4
##$PSIGN= 0
##$REVERSE= no
##$SF= 400.13
##$SI= 16384
##$SIGF1= 0
##$SIGF2= 0
##$SINO= 400
##$SIOLD= 16384
##$SREGLST= <1H.CDCl3>
##$SSB= 0
##$STSI= 16384
##$STSR= 0
##$SW_p= 4807.69230769232
##$SYMM= 0
##$S_DEV= 0
##$TDeff= 32768
##$TDoff= 0
##$TI= <>
##$TILT= no
##$TM1= 0
##$TM2= 0
##$TOPLEV= 0
##$USERP1= <user>
##$USERP2= <user>
##$USERP3= <user>
##$USERP4= <user>
##$USERP5= <user>
##$WDW= 1
##$XDIM= 16384
##$YMAX_p= 533331619
##$YMIN_p= -809474
$$ End of Bruker specific parameters
$$ ---------------------------------
##NTUPLES= NMR SPECTRUM
##VAR_NAME=  FREQUENCY,     SPECTRUM/REAL,   SPECTRUM/IMAG
##SYMBOL=    X,             R,               I
##VAR_TYPE=  INDEPENDENT,   DEPENDENT,       DEPENDENT
##VAR_FORM=  AFFN,          ASDF,            ASDF
##VAR_DIM=   16384,         16384,           16384
##UNITS=     HZ,            ARBITRARY UNITS, ARBITRARY UNITS
##FACTOR=    0.293456162344645, 1,           1
##FIRST=     4604.55996063232, 0,            0
##LAST=      -203.132347059996, 0,           0
##MIN=       -203.132347059996, -809474,     0
##MAX=       4604.55996063232, 533331619,    0
$$ Real data points
##PAGE= N=1
##DATA TABLE= (X++(R..R)), XYDATA
16383 -809474 -803195 -797118 -791418 -786196 -781408 -776889 -772440 -767867 -762989 -757694 -752002 -746041 -739958 -733843
16369 -733843 -727719 -721583 -715461 -709414 -703486 -697672 -691920 -686181 -680472 -674873 -669467 -664259 -659148 -653990
16355 -653990 -648701 -643312 -637923 -632603 -627357 -622147 -616945 -611757 -606604 -601481 -596362 -591223 -586043 -580801
16341 -580801 -575493 -570142 -564790 -559466 -554149 -548772 -543321 -537894 -532657 -527748 -523223 -519059 -515182 -511507
16327 -511507 -507951 -504440 -500913 -497328 -493647 -489812 -485757 -481451 -476945 -472376 -467886 -463516 -459163 -454649
16313 -454649 -449814 -444603 -439109 -433538 -428125 -423049 -418365 -414012 -409859 -405753 -401541 -397086 -392286 -387099
16299 -387099 -381592 -375948 -370386 -365048 -359978 -355151 -350519 -346026 -341600 -337154 -332583 -327804 -322792 -317594
16285 -317594 -312289 -306922 -301493 -296022 -290606 -285368 -280376 -275630 -271103 -266785 -262675 -258719 -254801 -250816
16271 -250816 -246785 -242882 -239358 -236390 -233978 -231969 -230145 -228279 -226155 -223604 -220585 -217218 -213700 -210207
16257 -210207 -206828 -203574 -200436 -197457 -194734 -192336 -190256 -188401 -186627 -184797 -182828 -180684 -178372 -175923
16243 -175923 -173338 -170604 -167760 -164929 -162268 -159865 -157674 -155536 -153289 -150882 -148399 -145959 -143634 -141466
16229 -141466 -139508 -137787 -136238 -134718 -133076 -131229 -129171 -126923 -124493 -121898 -119197 -116458 -113676 -110778
16215 -110778 -107724 -104562 -101374 -98211 -95095 -92073 -89266 -86824 -84814 -83152 -81642 -80053 -78195 -75998
16201 -75998 -73541 -71006 -68576 -66388 -64530 -63021 -61756 -60505 -59030 -57216 -55120 -52920 -50804 -48884
16187 -48884 -47171 -45605 -44070 -42410 -40464 -38154 -35563 -32901 -30362 -28036 -25976 -24306 -23182 -22625 -22480
16172 -22480 -22549 -22707 -22857 -22846 -22481 -21619 -20207 -18297 -16073 -13794 -11661 -9764 -8172 -6981 -6233 -5818 -5497
16155 -5497 -5031 -4314 -3391 -2371 -1327 -251 902 2129 3331 4344 4996 5202 5051 4784 4659 4844 5378
16138 5378 6234 7394 8864 10600 12437 14135 15483 16393 16901 17122 17191 17245 17435 17897 18709 19875 21333
16121 21333 22984 24717 26412 27988 29454 30869 32240 33477 34451 35049 35216 34987 34495 33921 33425 33102
16105 33102 32969 33003 33192 33510 33907 34336 34793 35300 35857 36439 37025 37603 38106 38408 38435 38271 38106 38102 38318 38727
16085 38727 39270 39875 40406 40668 40519 39957 39054 37861 36412 34804 33257 32088 31603 31968 33136 34862 36765
16068 36765 38425 39539 40076 40257 40371 40580 40888 41248 41624 42009 42425 42906 43416 43818 43980 43906 43719 43529 43324
16049 43324 42993 42424 41576 40459 39080 37444 35620 33802 32273 31234 30632 30214 29788 29383 29154 29180 29388
16032 29388 29665 29997 30481 31230 32332 33837 35693 37694 39549 41008 41933 42330 42354 42248 42216 42310 42473 42660
16014 42660 42909 43264 43732 44303 44936 45522 45920 46087 46160 46369 46853 47525 48119 48349 48042 47208 45993 44561 43020
15995 43020 41456 39967 38603 37326 36050 34729 33423 32313 31608 31398 31614 32143 32950 34049 35381 36814
15979 36814 38207 39425 40325 40807 40885 40682 40319 39814 39074 37996 36615 35149 33911 33185 33127 33688 34643 35730
15961 35730 36751 37572 38118 38425 38646 38929 39271 39535 39591 39416 39093 38719 38354 38033 37773 37547 37279 36908 36431
15942 36431 35850 35118 34170 32969 31555 30051 28609 27331 26248 25342 24582 23932 23378 22974 22865 23221 24102
15925 24102 25410 26960 28580 30134 31515 32651 33550 34330 35203 36360 37820 39366 40681 41594 42196 42713
15909 42713 43325 44080 44880 45519 45774 45511 44752 43710 42689 41913 41435 41200 41189 41445 41972 42655 43303 43771 44024
15890 44024 44073 43934 43666 43424 43409 43715 44244 44790 45178 45319 45156 44600 43565 42026 40035 37720 35333 33245
15872 33245 31812 31168 31154 31471 31887 32312 32754 33243 33785 34344 34911 35555 36397 37513 38875 40343 41755 43048
15854 43048 44317 45721 47318 49008 50613 51966 52935 53421 53389 52917 52181 51355 50508 49621 48691 47751 46817
15837 46817 45847 44759 43482 42012 40439 38923 37657 36850 36688 37262 38474 40056 41683 43089 44106
15822 44106 44689 44918 44953 44941 44967 45036 45113 45190 45289 45423 45574 45720 45857 45986 46088 46139 46138 46123 46167 46330 46623 47040 47578
15799 47578 48171 48641 48785 48520 47909 47080 46150 45186 44220 43324 42679 42506 42916 43862 45216 46823 48492 50018
15781 50018 51258 52212 53005 53786 54637 55545 56445 57287 58047 58668 59051 59132 58943 58575 58125 57691 57370 57209 57138
15762 57138 56963 56457 55524 54290 53013 51891 50942 50054 49140 48239 47505 47136 47283 47950 48961 50075 51099
15745 51099 51913 52482 52845 53013 52906 52425 51548 50342 48898 47275 45527 43773 42154 40733 39494 38450
15729 38450 37735 37571 38096 39217 40625 41994 43133 43942 44306 44170 43656 43037 42580 42397 42441 42633 42971 43507
15711 43507 44258 45147 45991 46581 46812 46749 46544 46303 46010 45541 44771 43722 42610 41706 41186 41101 41435 42171 43278
15692 43278 44648 46050 47175 47779 47862 47664 47492 47545 47861 48362 48872 49154 49028 48478 47629 46643 45636 44635
15674 44635 43620 42628 41783 41197 40880 40763 40794 41029 41619 42717 44377 46532 49016 51599 54037 56104 57618
15657 57618 58518 58905 58920 58579 57818 56695 55467 54463 53938 53989 54523 55268 55885 56117 55853 55084 53848 52184
15639 52184 50130 47750 45203 42741 40577 38795 37423 36533 36204 36378 36800 37164 37271 37010 36268 34976
15623 34976 33248 31411 29871 28915 28648 29049 30019 31394 32970 34525 35874 36925 37702 38324 38951 39684
15607 39684 40499 41289 41987 42606 43178 43675 44052 44298 44423 44394 44128 43585 42864 42178 41732 41617 41787 42138 42583
15588 42583 43073 43557 43966 44232 44337 44296 44124 43843 43502 43206 43120 43362 43867 44404 44767 44960 45143 45432 45783 46046
15568 46046 46104 45947 45686 45471 45379 45386 45439 45499 45528 45491 45387 45249 45084 44849 44503 44044 43494 42864 42163 41448 40814 40306
15546 40306 39857 39356 38786 38260 37944 37962 38356 39120 40229 41633 43201 44718 45939 46692 46933 46748 46288 45699
15528 45699 45143 44822 44930 45554 46617 47893 49117 50110 50817 51275 51584 51884 52270 52711 53056 53127 52818 52136
15510 52136 51218 50304 49629 49268 49075 48799 48293 47621 46977 46535 46388 46552 46983 47590 48249 48840 49287 49568 49661
15491 49661 49526 49172 48687 48158 47634 47175 46880 46793 46783 46561 45884 44731 43291 41826 40553 39575 38868 38337
15473 38337 37937 37725 37818 38325 39287 40663 42305 43980 45458 46587 47317 47679 47747 47589 47249 46781 46282 45895
15455 45895 45752 45910 46303 46789 47230 47544 47673 47586 47347 47121 47097 47370 47863 48353 48598 48450 47908 47084 46128 45145
15435 45145 44194 43332 42600 41973 41374 40721 39965 39095 38127 37108 36138 35348 34793 34386 33964 33406 32703 31985 31491
15416 31491 31445 31950 33000 34536 36460 38610 40769 42700 44219 45293 46090 46869 47810 48923 50097 51199
15400 51199 52121 52749 52898 52387 51239 49739 48248 46984 45983 45212 44661 44334 44173 44007 43644 42987 42114
15383 42114 41243 40592 40270 40308 40730 41539 42637 43834 44970 45998 46961 47875 48658 49161 49216 48655 47405 45573
15365 45573 43395 41124 39000 37276 36181 35824 36142 36969 38196 39823 41899 44430 47331 50381 53265
15350 53265 55694 57509 58678 59286 59513 59559 59568 59624 59778 60023 60271 60394 60297 59969 59495 59038 58771 58796 59107 59640
15330 59640 60299 60936 61331 61314 60872 60128 59220 58266 57378 56659 56141 55769 55465 55200 55002 54900 54863 54808 54669 54428
15310 54428 54109 53738 53299 52709 51905 50950 50021 49329 49023 49160 49706 50528 51417 52169 52651 52833 52784 52647 52592 52707
15290 52707 52892 52891 52489 51705 50787 50046 49697 49813 50337 51107 51908 52546 52907 52996 52947 52951 53099 53303 53397 53293 52988
15269 52988 52498 51826 50983 50007 48970 47963 47071 46340 45754 45253 44756 44181 43474 42622 41655 40675 39874 39459
15251 39459 39521 39970 40615 41294 41935 42547 43178 43879 44701 45720 47002 48525 50146 51661 52890 53747 54268
15234 54268 54529 54540 54276 53806 53359 53196 53453 54089 54927 55716 56219 56305 56000 55463 54914 54525 54335 54259 54174 53997
15214 53997 53705 53291 52756 52126 51457 50783 50093 49385 48741 48289 48095 48098 48145 48108 47955 47738 47543 47466 47555 47817 48254
15193 48254 48842 49490 50074 50477 50586 50321 49700 48883 48127 47665 47583 47793 48117 48418 48677 49002 49536 50359 51459
15174 51459 52760 54143 55452 56527 57287 57783 58108 58307 58388 58380 58318 58209 58005 57644 57075 56269 55312 54457 54017
15155 54017 54153 54786 55656 56492 57136 57540 57697 57590 57188 56488 55524 54336 52963 51527 50243 49305 48771 48594
15137 48594 48730 49167 49867 50723 51583 52307 52844 53238 53554 53797 53919 53886 53705 53384 52920 52337 51711 51131 50667
15118 50667 50357 50248 50402 50844 51505 52231 52847 53226 53295 53027 52431 51541 50442 49299 48332 47697 47394 47309 47340
15099 47340 47424 47478 47427 47317 47327 47658 48421 49614 51145 52850 54488 55761 56384 56184 55167 53503 51514 49616
15081 49616 48171 47339 47035 47071 47322 47766 48412 49262 50290 51432 52558 53476 53995 54016 53570 52802 51921 51124
15063 51124 50515 50088 49762 49423 48967 48345 47552 46579 45404 44091 42859 42003 41696 41881 42335 42810 43119 43167
15045 43167 42936 42452 41762 40940 40064 39209 38477 38001 37850 37909 37921 37664 37124 36501 36075 36037 36427 37182 38182 39252
15025 39252 40185 40813 41099 41097 40810 40144 39017 37502 35850 34389 33377 32921 33000 33550 34486 35659 36885 38035
15007 38035 39049 39925 40761 41716 42882 44206 45533 46685 47521 47966 48061 47971 47880 47851 47851 47875 47998 48320 48909 49775
14987 49775 50815 51801 52425 52441 51803 50673 49294 47829 46365 45029 44034 43554 43637 44227 45214 46462 47826
14970 47826 49130 50183 50849 51146 51247 51358 51590 51923 52252 52453 52440 52215 51884 51609 51501 51553 51631 51581 51333 50932
14950 50932 50453 49939 49445 49098 49043 49355 50037 51054 52311 53608 54709 55466 55915 56207 56436 56552 56434 56023
14932 56023 55391 54662 53848 52824 51500 49957 48413 47083 46084 45446 45158 45164 45372 45696 46065 46401 46621 46645
14914 46645 46372 45664 44413 42679 40722 38915 37636 37167 37592 38769 40376 42024 43363 44188 44545 44742
14898 44742 45179 46104 47443 48854 49990 50714 51094 51280 51422 51646 52030 52609 53362 54210 55038 55735 56245 56599
14880 56599 56887 57168 57396 57450 57191 56519 55443 54136 52878 51927 51432 51424 51811 52411 53019 53477 53721 53767 53641
14861 53641 53329 52834 52265 51816 51681 51979 52733 53857 55129 56260 57017 57302 57071 56244 54740 52609 50077
14844 50077 47468 45087 43155 41715 40605 39570 38461 37304 36265 35595 35532 36195 37521 39261 41073
14829 41073 42674 43991 45175 46420 47763 49078 50224 51134 51790 52177 52281 52131 51788 51326 50847 50489 50348
14812 50348 50417 50593 50738 50707 50336 49467 48018 46068 43902 41940 40550 39854 39732 39986 40460 41041 41616 42106
14794 42106 42482 42754 42954 43152 43448 43959 44781 45949 47418 49040 50565 51708 52254 52121 51370 50221 48986
14777 48986 47915 47085 46458 46008 45745 45626 45524 45291 44848 44244 43597 42966 42291 41509 40711 40116 39865 39861 39831 39543
14757 39543 38979 38349 37984 38184 39076 40576 42436 44365 46142 47704 49120 50459 51668 52595 53137 53384
14741 53384 53604 54065 54868 55925 57074 58194 59222 60103 60754 61116 61236 61289 61491 61971 62695 63537 64401 65249
14723 65249 66041 66687 67087 67180 66973 66588 66237 66092 66143 66222 66175 65972 65626 65095 64327 63367 62345 61357 60429 59565
14703 59565 58754 57950 57100 56182 55227 54320 53599 53209 53218 53543 53946 54146 53979 53485 52863 52312 51890 51538 51236 51041
14683 51041 50999 51112 51375 51769 52184 52471 52591 52673 52901 53323 53803 54155 54304 54306 54258 54204 54108 53957 53834 53857 54053 54332
14661 54332 54570 54700 54739 54754 54796 54830 54736 54434 54015 53677 53546 53609 53840 54297 55061 56103 57183 57909 57915 57066 55549
14640 55549 53802 52333 51506 51390 51758 52258 52671 53004 53340 53639 53724 53449 52837 52083 51430 51008 50762 50542 50241
14621 50241 49849 49434 49075 48829 48728 48798 49036 49366 49644 49698 49445 49031 48850 49311 50530 52235 53961 55326
14603 55326 56176 56613 56912 57356 58060 58927 59762 60383 60628 60338 59449 58078 56454 54773 53128 51547 50075
14586 50075 48812 47919 47587 47943 48972 50512 52333 54214 55993 57610 59134 60688 62325 63923 65222
14571 65222 65989 66185 66001 65745 65661 65780 65917 65845 65484 64915 64237 63491 62671 61767 60801 59847 59011 58389 58006 57784
14551 57784 57595 57376 57191 57189 57485 58039 58654 59113 59299 59174 58737 58041 57211 56372 55566 54748 53902 53139 52679 52732
14531 52732 53391 54614 56288 58233 60191 61904 63234 64194 64836 65153 65096 64650 63893 62987 62092 61268 60437
14514 60437 59438 58114 56441 54588 52813 51294 50058 49037 48162 47398 46738 46220 45944 46015 46457 47174 48015
14497 48015 48846 49595 50247 50853 51499 52271 53195 54205 55135 55752 55842 55326 54307 53010 51688 50570 49834 49576
14479 49576 49823 50562 51731 53171 54637 55930 57002 57926 58780 59563 60197 60570 60608 60351 59959 59618 59431 59420
14461 59420 59596 59982 60553 61211 61809 62232 62453 62554 62679 62917 63216 63438 63481 63322 63000 62640 62441 62541 62916
14442 62916 63460 64105 64769 65249 65260 64612 63310 61520 59520 57617 56030 54794 53830 53073 52508 52135 51966
14425 51966 52012 52234 52555 52946 53446 54094 54825 55478 55936 56221 56452 56736 57093 57489 57904 58375 58957 59695 60604
14406 60604 61624 62652 63619 64517 65321 65950 66356 66595 66717 66653 66247 65433 64349 63314 62643 62418 62414 62263 61677
14387 61677 60553 58961 57100 55223 53556 52242 51315 50714 50337 50062 49759 49367 48974 48751 48816 49161 49663
14370 49663 50134 50387 50316 49957 49474 49032 48646 48168 47467 46619 45885 45513 45584 46022 46700 47520 48434 49418 50438
14351 50438 51447 52418 53381 54427 55649 57087 58704 60406 62112 63826 65608 67473 69316 70955 72279
14336 72279 73320 74186 74958 75662 76262 76622 76559 75987 75000 73792 72532 71319 70221 69273 68471 67821 67347 67046
14318 67046 66816 66434 65620 64139 61896 58994 55708 52389 49372 46937 45292 44557 44737 45737 47397 49515
14302 49515 51834 54064 55985 57507 58634 59403 59886 60197 60432 60627 60804 61051 61489 62193 63137 64209 65262
14285 65262 66145 66687 66747 66322 65579 64782 64159 63811 63697 63703 63707 63607 63356 63004 62690 62563 62716 63154 63789 64475 65041
14264 65041 65302 65077 64293 63068 61673 60408 59492 58991 58820 58820 58859 58902 59017 59307 59820 60493 61162 61565 61436
14245 61436 60665 59384 57886 56463 55327 54562 54093 53742 53386 53030 52768 52681 52791 53056 53406 53787 54167 54521
14227 54521 54818 55046 55229 55431 55716 56137 56730 57517 58484 59539 60479 61076 61214 60972 60575 60308 60464 61244 62629
14208 62629 64369 66134 67652 68745 69363 69569 69424 68865 67737 65987 63816 61640 59907 58924 58774 59335
14192 59335 60337 61486 62604 63646 64580 65304 65732 65924 66074 66382 66920 67623 68345 68912 69209 69248 69148 69060
14174 69060 69069 69113 68999 68539 67668 66462 65120 63934 63176 62984 63295 63871 64386 64581 64433 64191 64209 64700 65626
14155 65626 66732 67709 68365 68682 68775 68824 68986 69324 69779 70246 70659 70999 71228 71279 71106 70707 70071 69146 67859
14136 67859 66210 64369 62622 61173 60017 59021 58118 57394 56983 56926 57148 57550 58084 58767 59610 60539 61397 62029
14118 62029 62367 62428 62282 62024 61766 61640 61757 62099 62483 62716 62766 62736 62729 62777 62834 62787 62525 61990 61152 59997 58578
14097 58578 57001 55344 53656 52050 50728 49880 49600 49855 50500 51325 52099 52649 52937 53031 52997 52867 52710 52662
14079 52662 52846 53283 53891 54525 54941 54831 53992 52492 50647 48852 47407 46452 45985 45898 46052 46393 46970 47836
14061 47836 48980 50339 51828 53323 54684 55820 56755 57603 58502 59517 60601 61660 62612 63423 64112 64722
14045 64722 65283 65817 66369 66997 67770 68781 70085 71569 72957 73969 74449 74389 73845 72835 71308 69251 66799
14028 66799 64185 61612 59205 57054 55248 53852 52848 52123 51561 51156 51048 51430 52351 53596 54792 55624
14012 55624 55947 55787 55295 54667 54046 53496 53022 52590 52121 51538 50850 50187 49710 49517 49651 50131 50907 51837 52765
13993 52765 53604 54327 54913 55293 55361 55041 54380 53573 52879 52477 52426 52721 53322 54142 55050 55879 56467 56716 56637 56354
13973 56354 56052 55883 55894 56032 56248 56596 57229 58293 59808 61606 63364 64768 65649 66003 65929 65552 64989 64357
13955 64357 63790 63398 63232 63290 63541 63911 64324 64792 65430 66318 67389 68472 69396 70047 70375 70391 70121 69545 68644
13936 68644 67499 66308 65242 64320 63447 62573 61783 61223 60979 61053 61383 61847 62266 62489 62476 62316 62139 61981 61754
13917 61754 61385 60946 60640 60669 61122 61914 62836 63671 64281 64605 64602 64242 63546 62621 61618 60664 59808 59040 58369 57845
13897 57845 57484 57206 56902 56604 56508 56799 57485 58407 59360 60165 60730 61084 61334 61583 61868 62150 62373 62561 62826
13878 62826 63279 63941 64749 65629 66511 67266 67739 67865 67717 67396 66911 66196 65226 64101 63006 62146 61694 61740 62254
13859 62254 63083 63976 64622 64742 64212 63141 61803 60466 59280 58294 57531 57045 56930 57252 57916 58657 59193 59406
13841 59406 59414 59496 59936 60906 62399 64229 66090 67699 68908 69710 70147 70238 70006 69521 68901 68254 67623 66958 66117
13822 66117 64934 63358 61561 59871 58553 57669 57128 56831 56717 56715 56736 56741 56802 57071 57700 58783 60355 62379
13804 62379 64706 67087 69244 70963 72156 72891 73351 73748 74221 74751 75195 75410 75336 74990 74418 73664 72742 71641
13786 71641 70411 69220 68316 67896 68011 68523 69154 69617 69750 69554 69126 68552 67842 66973 65994 65070 64389 64071
13768 64071 64172 64669 65413 66149 66652 66830 66747 66601 66654 67090 67921 68989 70054 70897 71385 71488 71259 70785 70131
13749 70131 69360 68615 68103 67962 68164 68569 69045 69530 70000 70375 70495 70250 69705 69081 68606 68389 68405 68558 68747
13730 68747 68917 69057 69143 69124 68940 68521 67804 66758 65410 63844 62207 60691 59513 58847 58760 59187 59952 60829
13712 60829 61626 62226 62551 62554 62243 61695 61038 60435 60026 59861 59904 60067 60230 60242 59958 59301 58324 57249 56400 56050
13692 56050 56290 57072 58306 59899 61699 63490 65051 66203 66860 67059 66912 66530 65983 65298 64501 63670 62955
13675 62955 62514 62429 62711 63354 64350 65670 67226 68865 70428 71795 72875 73587 73866 73703 73169 72387 71445
13658 71445 70359 69139 67843 66559 65385 64415 63698 63200 62839 62526 62218 61946 61808 61944 62480 63438 64715
13641 64715 66187 67744 69211 70332 70949 71163 71230 71315 71384 71303 70975 70427 69762 69031 68180 67161 66057 65056
13623 65056 64333 63961 63912 64120 64533 65140 65973 67034 68219 69369 70423 71466 72571 73677 74641 75391 75995
13606 75995 76607 77371 78317 79292 80010 80223 79865 79064 78060 77094 76314 75788 75571 75729 76266 77048 77808 78292 78417
13587 78417 78269 78000 77773 77714 77871 78198 78599 79002 79367 79634 79723 79583 79209 78605 77758 76666 75396 74124 73111
13568 73111 72585 72599 72997 73523 73956 74181 74200 74096 73989 74001 74184 74482 74774 74967 75052 75106 75241 75520 75887 76179 76214
13547 76214 75839 74952 73548 71777 69921 68293 67105 66414 66168 66288 66679 67197 67665 67936 67960 67809 67641 67593
13529 67593 67686 67823 67845 67632 67196 66645 66062 65450 64790 64114 63492 62989 62628 62400 62323 62503 63076 64054 65266 66432
13509 66432 67290 67668 67525 66994 66393 66110 66420 67354 68730 70276 71750 72991 73925 74544 74904 75156 75496 76054
13491 76054 76791 77506 77965 78056 77839 77500 77250 77226 77438 77792 78155 78441 78615 78621 78401 78010 77650 77573 77917 78636 79531
13470 79531 80329 80786 80784 80385 79775 79134 78544 77985 77375 76628 75701 74580 73267 71803 70258 68698 67206 65919
13452 65919 64995 64518 64445 64640 64929 65153 65248 65277 65351 65531 65817 66159 66473 66689 66813 66954 67247 67741 68350 68950
13432 68950 69529 70183 70965 71764 72364 72606 72519 72296 72185 72378 72894 73553 74104 74373 74294 73877 73157 72213 71247 70559
13412 70559 70383 70725 71389 72149 72889 73615 74378 75175 75918 76495 76861 77075 77262 77525 77867 78201 78451 78613 78720
13393 78720 78774 78746 78603 78310 77817 77096 76190 75208 74265 73416 72690 72169 72010 72361 73293 74738 76450 78027 79063
13374 79063 79358 78996 78234 77329 76401 75419 74268 72856 71185 69370 67620 66160 65156 64655 64558 64690 64937
13357 64937 65322 65863 66424 66784 66828 66620 66318 66055 65881 65781 65735 65768 65938 66261 66673 67065 67337 67416 67277 66958
13337 66958 66540 66120 65749 65417 65106 64846 64668 64519 64283 63941 63653 63651 64063 64843 65835 66880 67887 68854 69804
13318 69804 70708 71490 72102 72543 72798 72794 72462 71840 71082 70376 69857 69564 69461 69477 69541 69594 69603 69573 69501 69350 69083 68717
13296 68717 68318 67976 67785 67849 68250 69014 70103 71405 72729 73832 74508 74695 74509 74179 73933 73888 74006 74142
13278 74142 74135 73884 73375 72647 71790 70975 70457 70481 71158 72377 73872 75377 76742 77868 78615 78825 78463 77707
13260 77707 76833 76040 75397 74936 74717 74790 75135 75635 76104 76358 76264 75751 74858 73770 72717 71817 71049 70368 69813
13241 69813 69504 69562 70020 70750 71484 71966 72133 72146 72201 72371 72656 73121 73905 75114 76686 78317 79570 80150 80094
13222 80094 79675 79152 78608 78016 77327 76466 75335 73927 72424 71140 70349 70179 70608 71526 72790 74247 75725
13205 75725 77007 77870 78198 78064 77665 77177 76680 76208 75805 75538 75463 75580 75789 75936 75925 75751 75429 74954 74359
13186 74359 73731 73188 72854 72835 73173 73824 74615 75269 75562 75496 75268 75127 75231 75598 76134 76721 77241 77541 77491 77085
13166 77085 76456 75779 75172 74679 74302 74009 73744 73434 73000 72361 71506 70563 69795 69501 69870 70895 72397 74145
13148 74145 75936 77618 79098 80371 81473 82373 82967 83189 83073 82682 82040 81150 80036 78737 77356 76080
13132 76080 75082 74369 73784 73141 72351 71430 70429 69374 68253 67062 65892 64919 64248 63813 63463 63108 62729
13115 62729 62300 61788 61240 60816 60733 61187 62274 63941 66010 68243 70419 72408 74162 75617 76668 77230
13099 77230 77268 76804 75956 74936 73982 73293 73007 73201 73896 75030 76460 78011 79531 80888 81952 82662 83090
13082 83090 83403 83750 84185 84675 85169 85648 86123 86587 86978 87208 87198 86886 86253 85358 84351 83433 82756 82362 82202
13063 82202 82199 82292 82446 82619 82754 82848 82986 83284 83794 84472 85210 85875 86347 86558 86497 86202 85767 85313 84904 84513 84051
13042 84051 83476 82853 82305 81878 81480 80977 80367 79855 79790 80441 81778 83437 84933 85933 86344 86212 85611 84603
13024 84603 83265 81766 80411 79562 79463 80095 81155 82201 82843 82875 82314 81334 80148 78931 77837 76998 76505
13007 76505 76367 76533 76988 77786 78951 80372 81813 82990 83702 83925 83803 83526 83228 82978 82816 82778 82855 82934 82843
12988 82843 82482 81886 81182 80498 79894 79392 79037 78911 79070 79467 79977 80492 81003 81573 82264 83095 84040 84990 85762
12969 85762 86208 86310 86198 86078 86162 86619 87496 88653 89788 90597 90930 90822 90413 89844 89216 88606 88095 87764 87651
12950 87651 87721 87859 87909 87780 87488 87104 86698 86322 86013 85790 85628 85414 84955 84082 82797 81305 79902 78804
12932 78804 78082 77745 77834 78388 79313 80312 81008 81181 80903 80437 80034 79816 79775 79834 79877 79733 79224 78266 76957 75561
12912 75561 74379 73572 73116 72902 72842 72917 73209 73876 75056 76795 79032 81608 84235 86498 87978 88447 88002
12895 88002 87039 86070 85486 85419 85759 86277 86735 86974 86945 86674 86208 85603 84927 84229 83502 82711 81867 81083 80529 80313
12875 80313 80406 80686 81025 81320 81490 81480 81280 80929 80492 80044 79636 79278 78948 78602 78172 77610 76961 76389 76086 76161
12855 76161 76593 77292 78152 79062 79929 80749 81633 82757 84240 86011 87757 89077 89710 89671 89172 88451 87661 86906
12837 86906 86318 86022 86039 86226 86332 86154 85655 84945 84137 83256 82286 81259 80268 79436 78878 78660 78780 79149 79613
12818 79613 80032 80377 80733 81207 81804 82422 82935 83206 83066 82391 81233 79848 78581 77676 77184 77014 77054 77249
12800 77249 77613 78189 78997 80014 81176 82400 83581 84613 85443 86057 86423 86492 86293 85941 85492 84852 83905 82723
12782 82723 81580 80758 80366 80365 80738 81549 82807 84336 85830 87025 87828 88324 88702 89129 89666 90315 91067 91907
12764 91907 92809 93738 94581 95119 95141 94601 93647 92518 91349 90087 88625 86981 85297 83705 82282 81078
12748 81078 80153 79561 79308 79319 79459 79607 79732 79914 80257 80773 81348 81836 82172 82372 82456 82441 82371 82314 82375 82687 83338
12727 83338 84298 85422 86545 87572 88514 89455 90466 91545 92595 93467 94057 94374 94521 94628 94813 95150 95636
12710 95636 96235 96939 97768 98704 99628 100333 100603 100293 99362 97906 96157 94403 92862 91628 90711 90072 89643
12693 89643 89355 89138 88885 88464 87748 86670 85301 83850 82525 81400 80460 79692 79063 78465 77757 76866 75842
12676 75842 74832 74003 73502 73446 73914 74913 76365 78096 79863 81437 82718 83782 84797 85888 87064 88224
12660 88224 89219 89958 90498 90992 91525 92029 92352 92383 92117 91683 91293 91087 91025 90958 90809 90669 90692 90893 91113 91207 91182
12639 91182 91147 91219 91496 92016 92698 93360 93834 94093 94293 94656 95274 96018 96645 96969 96925 96564 96045 95589 95354 95358 95522
12618 95522 95730 95858 95784 95420 94792 94044 93380 92974 92879 93041 93441 94160 95228 96499 97696 98557 98977 99088 99194
12599 99194 99609 100480 101686 102888 103764 104229 104445 104666 105083 105742 106578 107513 108473 109328 109876 109962 109582 108846 107887
12580 107887 106829 105798 104905 104220 103787 103635 103766 104147 104697 105248 105588 105643 105550 105529 105725 106134 106636 107087 107415
12561 107415 107645 107838 107991 107993 107679 106963 105965 104979 104288 104020 104173 104689 105466 106404 107486 108795 110369 112086
12543 112086 113682 114880 115527 115664 115491 115240 115082 115136 115531 116386 117716 119354 120955 122136 122669 122633 122368
12526 122368 122209 122279 122519 122846 123226 123661 124160 124800 125779 127337 129557 132251 135041 137558 139597 141139 142244
12509 142244 142939 143206 143049 142580 142041 141739 141965 142907 144600 146931 149674 152537 155233 157564 159462 160994
12493 160994 162307 163575 164954 166529 168309 170304 172574 175188 178147 181377 184764 188210 191678 195174
12479 195174 198678 202108 205363 208399 211281 214159 217178 220373 223667 226941 230082 232969 235465 237439
12465 237439 238781 239431 239416 238864 237961 236873 235691 234431 233059 231528 229853 228129 226513 225140 224009
12450 224009 222914 221523 219617 217241 214643 212075 209613 207098 204227 200725 196514 191750 186692 181521
12436 181521 176331 171288 166662 162681 159351 156443 153643 150750 147775 144897 142348 140333 138993 138373
12422 138373 138379 138757 139170 139346 139150 138545 137566 136345 135077 133923 132914 131927 130717 129079 127015 124767 122673
12405 122673 120961 119660 118653 117792 116974 116164 115360 114547 113721 112945 112372 112134 112214 112488 112828 113088 113066 112616
12387 112616 111756 110654 109498 108389 107308 106192 105039 103892 102737 101497 100147 98779 97540 96528
12373 96528 95742 95144 94773 94742 95117 95837 96762 97785 98868 99978 101017 101813 102197 102050 101274 99794 97635
12356 97635 94961 92020 89111 86590 84849 84210 84744 86176 88004 89772 91269 92521 93656 94803 96066
12341 96066 97497 99057 100593 101879 102691 102913 102594 101917 101104 100288 99458 98533 97463 96295 95160 94182 93400
12324 93400 92761 92194 91713 91438 91482 91783 92078 92067 91641 90949 90296 89950 90001 90368 90892 91418 91779 91765 91194 90033
12304 90033 88444 86717 85129 83867 83031 82646 82620 82735 82768 82666 82596 82832 83535 84663 86075 87699 89520
12287 89520 91462 93358 95019 96289 97060 97285 97015 96406 95638 94833 94045 93335 92802 92545 92595 92894 93327 93774
12269 93774 94172 94572 95111 95904 96939 98086 99171 100056 100699 101169 101596 102078 102635 103238 103856 104457 104988 105384
12251 105384 105635 105768 105745 105454 104849 104051 103269 102650 102211 101913 101770 101853 102193 102706 103182 103336 102932 101881 100259
12232 100259 98262 96199 94457 93389 93129 93544 94362 95301 96143 96771 97183 97460 97720 98078 98624 99377 100251
12215 100251 101080 101709 102091 102361 102777 103512 104484 105390 105938 106057 105947 105918 106174 106702 107354 108008 108597 109032 109201
12196 109201 109063 108727 108392 108196 108072 107750 106957 105669 104169 102905 102262 102373 103059 103981 104847 105505 105935 106206
12178 106206 106398 106546 106678 106853 107107 107415 107728 108022 108304 108573 108771 108816 108732 108735 109160 110235 111903 113813 115497
12159 115497 116576 116886 116523 115795 115083 114686 114736 115214 116043 117169 118568 120183 121848 123312 124382 125039 125408
12142 125408 125657 125905 126168 126352 126277 125816 125073 124383 124066 124210 124709 125404 126105 126552 126484 125764 124415 122559 120367
12123 120367 118058 115899 114140 112897 112147 111810 111811 112080 112610 113534 115039 117178 119817 122756 125819 128862
12107 128862 131754 134366 136564 138216 139233 139607 139467 139060 138633 138347 138283 138477 138948 139719 140826 142328 144272
12090 144272 146627 149250 151915 154379 156448 158043 159223 160190 161219 162537 164242 166289 168524 170758
12076 170758 172867 174824 176670 178490 180339 182122 183593 184515 184813 184569 183930 183049 182073 181137 180344 179750
12060 179750 179335 179026 178759 178478 178083 177471 176642 175663 174564 173336 171978 170469 168734 166691 164345 161830
12044 161830 159374 157211 155518 154390 153862 153954 154688 156025 157850 160045 162492 164987 167245 169044 170352
12029 170352 171311 172114 172856 173473 173835 173893 173688 173308 172913 172734 172922 173419 174051 174721 175459 176330 177334 178390
12011 178390 179364 180117 180562 180710 180705 180800 181223 181993 182896 183653 184125 184396 184700 185283 186297 187755 189553 191548
11993 191548 193655 195871 198261 200916 203892 207150 210580 214068 217507 220774 223783 226593 229396 232381
11979 232381 235614 239000 242338 245455 248305 250938 253457 256019 258816 262016 265670 269683 273883 278096
11965 278096 282211 286244 290340 294644 299165 303793 308461 313273 318454 324165 330370 336892 343548 350253
11951 350253 357004 363802 370615 377464 384503 391946 399940 408469 417381 426504 435740 445023 454276 463427
11937 463427 472451 481383 490263 499119 508006 517004 526161 535493 545038 554839 564897 575162 585569
11924 585569 596074 606722 617674 629153 641310 654116 667338 680638 693702 706310 718303
11913 718303 729525 739864 749321 757993 765965 773247 779813 785639 790725 795156 799133 802868 806430 809764
11899 809764 812867 815869 818945 822169 825477 828752 831872 834683 836946 838329 838489 837257 834799 831610
11885 831610 828337 825580 823820 823380 824364 826622 829776 833249 836304 838108 837808 834633 828014 817738 804055
11870 804055 787691 769729 751358 733606 717244 702892 691118 682361 676759 674161 674340 677198 682820
11857 682820 691432 703339 718855 738095 760726 785913 812532 839385 865280 889055 909645 926288
11845 926288 938817 947815 954487 960316 966680 974568 984486 996525 1010495 1026037 1042682 1059867 1076959
11832 1076959 1093332 1108459 1121950 1133547 1143118 1150603 1155981 1159295 1160699 1160471 1158984 1156633 1153744
11819 1153744 1150503 1146920 1142824 1137884 1131653 1123711 1113794 1101799 1087699 1071509 1053324 1033308 1011638
11806 1011638 988541 964420 939877 915530 891788 868789 846525 825062 804703 785968 769460
11795 769460 755676 744921 737351 733038 731937 733878 738618 745819 754880 764764 774106 781674 786934 790304
11781 790304 792886 795820 799777 804856 810767 817085 823430 829528 835176 840194 844412 847731 850226 852160
11767 852160 853918 855854 858152 860811 863718 866759 869872 873061 876356 879718 882920 885463 886590 885398
11753 885398 880998 872680 859985 842657 820658 794248 764031 730897 695925 660249 624883 590561
11741 590561 557677 526346 496555 468339 441865 417368 394970 374546 355779 338372 322257
11730 322257 307599 294552 283027 272666 263031 253831 245026 236789 229360 222872 217260 212287 207639
11717 207639 203033 198328 193587 189051 185041 181810 179434 177822 176808 176209 175798 175300 174479 173233 171556
11702 171556 169434 166805 163633 159982 156054 152170 148691 145919 143966 142674 141723 140845 139936 138966 137836
11687 137836 136374 134480 132289 130159 128457 127347 126783 126637 126759 126958 127005 126697 125957 124872 123641 122495
11671 122495 121645 121208 121140 121303 121623 122095 122637 123050 123106 122706 121968 121159 120496 120007 119557 119050 118571 118339 118517
11652 118517 119109 119980 120945 121843 122574 123108 123461 123637 123618 123393 123028 122658 122417 122351 122430 122618 122892 123192 123412 123463
11632 123463 123358 123250 123357 123807 124534 125343 126071 126648 127014 127115 126997 126821 126718 126703 126742 126828 126989 127246 127586 127961
11612 127961 128294 128498 128511 128321 127951 127417 126708 125824 124823 123809 122885 122108 121505 121085 120822 120658 120548 120458 120358
11593 120358 120233 120089 119977 120006 120280 120787 121348 121692 121651 121273 120778 120390 120211 120235 120424 120793 121398 122256 123299
11574 123299 124433 125604 126764 127796 128531 128835 128676 128138 127428 126826 126587 126835 127518 128455 129473 130492 131492
11557 131492 132462 133384 134273 135175 136106 136975 137600 137803 137479 136601 135212 133453 131568 129843 128534 127770 127465
11540 127465 127333 127038 126377 125383 124292 123420 123031 123260 124108 125479 127224 129230 131484 134044 136947 140121
11524 140121 143374 146464 149210 151539 153429 154875 155904 156568 156915 157015 156998 157003 157098 157250 157405 157570 157823 158259
11506 158259 158938 159883 161124 162688 164547 166622 168857 171243 173764 176353 178875 181151 183063 184618 185865
11491 185865 186817 187504 188022 188478 188918 189384 190008 190942 192234 193825 195635 197595 199609 201584 203503 205416
11475 205416 207343 209260 211180 213166 215265 217495 219904 222591 225649 229059 232661 236221 239578 242686
11461 242686 245555 248191 250620 252946 255341 257992 261019 264480 268408 272800 277568 282558 287609 292596
11447 292596 297438 302104 306632 311095 315564 320087 324680 329339 334070 338857 343644 348374 353059 357793
11433 357793 362732 368031 373764 379859 386116 392310 398343 404290 410290 416395 422515 428512 434317 439937
11419 439937 445393 450715 455978 461294 466737 472282 477803 483161 488303 493321 498396 503685 509248 515050
11405 515050 520951 526776 532448 538000 543425 548605 553405 557782 561752 565352 568661 571823 574983 578199
11391 578199 581433 584575 587463 589896 591688 592788 593316 593414 593122 592445 591449 590193 588632 586632 584103 581064
11375 581064 577590 573742 569579 565172 560586 555863 550992 545908 540542 534879 528944 522758 516301 509530
11361 509530 502408 494970 487324 479553 471676 463730 455851 448253 441115 434479 428244 422225 416199 409947
11347 409947 403371 396498 389366 381997 374485 367022 359822 353048 346754 340861 335206 329665 324225 318956
11333 318956 313959 309344 305208 301544 298155 294717 290952 286728 282095 277291 272690 268642 265296 262543
11319 262543 260100 257628 254857 251671 248079 244141 240000 235929 232230 229040 226251 223613 220904 218018
11305 218018 214944 211742 208513 205318 202153 199048 196106 193458 191170 189196 187420 185735 184061 182336
11291 182336 180526 178633 176691 174732 172741 170650 168434 166199 164106 162218 160459 158733 157073 155653
11277 155653 154653 154110 153895 153824 153766 153674 153550 153389 153162 152881 152630 152532 152658 152974 153323 153499 153377 153004 152563 152249
11257 152249 152169 152325 152659 153065 153422 153638 153700 153692 153713 153754 153683 153346 152645 151569 150236 148849 147576 146449 145373
11238 145373 144200 142787 141023 138907 136643 134598 133096 132232 131895 131899 132094 132384 132686 132939 133133 133263 133247
11221 133247 132898 131991 130406 128221 125671 123013 120413 117944 115672 113775 112528 112128 112583 113742 115389
11206 115389 117263 119032 120355 121041 121144 120874 120422 119868 119229 118580 118086 117904 118056 118414 118786 119002 118928 118457
11188 118457 117540 116229 114683 113092 111602 110298 109282 108732 108826 109609 110940 112534 114054 115228 115921 116129
11172 116129 115948 115579 115289 115275 115507 115758 115787 115518 115076 114668 114408 114216 113866 113170 112121 110904 109791 108975
11154 108975 108446 108023 107542 106994 106466 105997 105531 104983 104339 103691 103179 102913 102959 103312 103877 104491 105003 105320 105420
11135 105420 105327 105090 104804 104603 104589 104741 104898 104841 104406 103543 102300 100808 99296 98021 97121 96596 96428 96653
11117 96653 97297 98293 99518 100917 102539 104445 106559 108669 110554 112097 113252 113984 114275 114176 113801 113292
11101 113292 112765 112265 111749 111173 110569 110071 109880 110197 111115 112533 114172 115672 116727 117194 117116 116656 116011 115352
11083 115352 114810 114490 114438 114615 114917 115220 115428 115531 115573 115553 115385 114967 114250 113253 112016 110545 108822 106841
11065 106841 104614 102178 99643 97211 95110 93496 92396 91751 91515 91710 92398 93611 95280 97173 98944
11050 98944 100289 101084 101397 101408 101344 101413 101686 102039 102265 102230 101948 101525 101081 100718 100527 100555 100751 100983 101142 101283
11030 101283 101616 102323 103394 104663 105971 107254 108513 109770 111055 112398 113811 115284 116758 118114 119195
11015 119195 119862 120007 119588 118684 117483 116165 114807 113450 112231 111356 110965 111096 111753 112891 114337 115807
10999 115807 117017 117770 117962 117576 116706 115553 114346 113229 112219 111242 110163 108844 107250 105524 103958
10984 103958 102829 102208 101919 101721 101512 101346 101330 101538 101984 102601 103290 104009 104791 105681 106642 107573 108397 109138 109881
10965 109881 110669 111475 112244 112930 113507 114005 114495 114993 115425 115671 115629 115267 114681 114069 113607 113313 113047 112640 112028
10946 112028 111292 110578 109994 109556 109211 108927 108760 108827 109190 109761 110330 110690 110748 110592 110456 110587 111089 111881 112788
10927 112788 113659 114399 114961 115353 115646 115959 116422 117121 118084 119267 120559 121795 122818 123542 123947 123987 123598 122796
10909 122796 121691 120422 119059 117559 115838 113896 111895 110128 108913 108460 108763 109592 110638 111621 112328
10894 112328 112612 112434 111947 111499 111438 111886 112681 113506 114110 114471 114779 115268 116046 117061 118179 119270 120193 120775
10876 120775 120852 120381 119480 118381 117360 116668 116477 116846 117688 118785 119877 120790 121531 122313 123501 125477 128464
10859 128464 132434 137132 142192 147244 151987 156238 159865 162651 164276 164455 163165 160732 157712 154673
10845 154673 152027 149995 148624 147822 147450 147412 147667 148191 149013 150308 152399 155570 159894 165225 171279 177655
10829 177655 183819 189177 193240 195667 196221 194797 191532 186836 181274 175379 169538 164001 158922 154342
10815 154342 150202 146410 142915 139716 136886 134598 133052 132304 132153 132294 132559 132973 133612 134420 135136 135387
10799 135387 134903 133689 132046 130403 129067 128098 127402 126887 126532 126400 126568 127033 127690 128397 129059 129644 130123
10782 130123 130394 130302 129760 128854 127846 127028 126553 126402 126496 126799 127315 128026 128869 129733 130481 131032 131420 131812 132459
10763 132459 133602 135395 137839 140807 144159 147805 151628 155419 158938 161981 164396 166084 166971 166954 165953
10748 165953 164064 161585 158859 156127 153567 151403 149879 149119 149089 149738 151099 153228 156101 159611 163629
10733 163629 168049 172760 177608 182394 186853 190643 193376 194699 194432 192699 189949 186806 183829 181298
10719 181298 179183 177325 175632 174170 173107 172643 172949 174129 176186 179023 182451 186218 190048 193743 197269
10704 197269 200710 204108 207351 210157 212203 213356 213802 213924 214068 214388 214844 215328 215812 216375 217109 218007 218934
10687 218934 219686 220058 219928 219343 218506 217646 216867 216149 215522 215199 215477 216503 218136 220038 221906 223610 225156
10670 225156 226624 228173 229971 231992 233949 235466 236316 236493 236131 235399 234430 233353 232384 231865 232156 233387
10654 233387 235285 237265 238738 239343 239024 238028 236843 235997 235828 236469 237980 240410 243746 247871 252576 257561
10638 257561 262437 266735 269909 271396 270807 268138 263776 258334 252466 246751 241599 237218 233657 230960
10624 230960 229221 228517 228815 230017 232048 234846 238274 242107 246100 250047 253766 257089 259938 262419 264727
10609 264727 266839 268315 268386 266312 261776 255057 246903 238203 229649 221605 214214 207535 201613 196510 192336
10594 192336 189227 187275 186480 186792 188127 190311 193092 196235 199552 202840 205801 208076 209347 209431 208296
10579 208296 206007 202684 198524 193848 189057 184519 180501 177168 174563 172599 171141 170107 169497 169324 169591
10564 169591 170353 171726 173735 176142 178419 179924 180189 179142 177120 174630 172038 169432 166736 163905 161045
10549 161045 158349 155961 153912 152176 150759 149700 149017 148699 148746 149186 150047 151322 152933 154705 156377 157667
10533 157667 158388 158540 158309 157965 157738 157730 157900 158143 158373 158543 158583 158343 157652 156427 154737 152792 150914 149464
10515 149464 148734 148825 149606 150826 152281 153898 155720 157820 160239 162966 165900 168854 171623 174080 176150
10500 176150 177689 178476 178339 177274 175442 173134 170709 168515 166794 165658 165137 165244 165948 167081 168305
10485 168305 169252 169675 169502 168785 167655 166302 164976 163920 163268 163013 163042 163173 163229 163160 163073 163142 163470 164008 164573
10466 164573 164960 165070 164927 164563 163903 162826 161333 159619 158027 156941 156624 157115 158266 159912 162046 164808
10450 164808 168291 172399 176881 181452 185894 190142 194355 198839 203797 209127 214428 219180 222977 225663
10436 225663 227346 228278 228691 228705 228329 227558 226461 225228 224133 223430 223260 223650 224580 226014 227882 230096 232609
10419 232609 235507 239051 243587 249411 256695 265427 275334 285909 296550 306659 315608 322705 327333
10406 327333 329194 328414 325460 321000 315745 310232 304693 299124 293453 287668 281850 276194 270995 266553
10392 266553 263032 260438 258750 258032 258393 259855 262313 265610 269637 274337 279624 285235 290551 294602 296333
10377 296333 295006 290519 283504 275056 266244 257745 249757 242143 234647 227085 219444 211888 204708 198258
10363 198258 192869 188726 185760 183659 182018 180539 179113 177797 176715 175945 175489 175334 175505 176042 176952 178186
10347 178186 179668 181340 183207 185331 187765 190485 193386 196337 199283 202306 205567 209179 213168 217495
10333 217495 222095 226908 231907 237093 242476 248063 253860 259861 265981 272071 278026 283892 289883 296357
10319 296357 303740 312426 322731 334895 349083 365381 383909 405003 429251 457344 489773 526391
10307 526391 565963 605822 641956 669799 685668 688139 678559 660380 637685 613800 590701 569253
10295 569253 549809 532677 518355 507526 500917 499116 502475 511089 524849 543562 567037 595051
10283 595051 627278 663274 702536 744566 788725 833737 877131 915187 943796 959998 963478 957162
10271 957162 946462 937380 934313 938503 947707 957064 960773 954130 935184 905200 867741 827032 786546
10258 786546 748389 713518 682390 655513 633634 617568 607950 605151 609314 620367 638026 661870
10246 661870 691435 726238 765754 809412 856620 906721 958712 1010711 1059528 1100895 1130619
10235 1130619 1146281 1148639 1141847 1132204 1126005 1127520 1137770 1154239 1171493 1182693 1181724 1165204 1133460
10222 1133460 1089977 1039696 987214 935759 887128 842274 801991 767265 739142 718388 705279
10211 705279 699654 701132 709290 723712 743969 769565 799942 834513 872681 913733 956511 998852
10199 998852 1037079 1065981 1079696 1073472 1045609 998493 938014 871589 805943 745736 693295 649053
10187 649053 612225 581450 555250 532253 511261 491258 471401 451108 430201 408947 387909
10176 387909 367691 348744 331282 315360 301052 288534 277980 269426 262772 257895 254727 253247
10164 253247 253362 254813 257230 260308 263905 267986 272517 277343 282058 285976 288262 288174 285318 279865 272589
10149 272589 264591 256873 250078 244526 240386 237781 236787 237442 239764 243751 249357 256542 265390 276193
10135 276193 289349 305159 323619 344248 365947 386925 404856 417336 422577 420105 411032 397588
10123 397588 382198 366672 351917 338197 325598 314324 304694 297033 291589 288513 287842 289561 293695
10110 293695 300337 309551 321200 334824 349715 365150 380615 395777 410156 422638 431268 433702
10098 433702 428242 414802 395135 372133 348691 326860 307605 291009 276644 263941 252450 241924
10086 241924 232269 223448 215382 207950 201074 194780 189179 184395 180520 177557 175378 173765 172507 171481
10072 171481 170649 170008 169575 169409 169627 170329 171509 173046 174775 176531 178171 179616 180858 181918 182709 182953
10056 182953 182301 180601 178042 175018 171908 168962 166292 163899 161707 159602 157506 155438 153481 151692
10042 151692 150053 148519 147067 145732 144628 143967 144037 145049 146956 149460 152195 154911 157509 159955 162182
10027 162182 164047 165368 166005 165912 165128 163763 162029 160212 158521 156964 155424 153879 152474 151350 150489
10012 150489 149780 149171 148691 148360 148121 147877 147585 147243 146794 146110 145094 143767 142317 141083 140427 140558 141424
9995 141424 142741 144119 145259 146149 147047 148202 149589 150942 151963 152490 152560 152348 152024 151610 150967 149916 148377
9978 148377 146440 144313 142194 140159 138182 136288 134671 133616 133330 133874 135215 137271 139851 142628 145240
9963 145240 147470 149308 150872 152263 153455 154315 154731 154732 154523 154411 154662 155381 156499 157855 159301 160746 162143
9946 162143 163503 164902 166441 168190 170153 172281 174474 176642 178778 180961 183319 186000 189129 192743
9932 192743 196762 201035 205350 209473 213226 216501 219189 221186 222497 223301 223906 224661 225872 227749 230372
9917 230372 233671 237471 241632 246148 251130 256677 262792 269434 276665 284676 293623 303415 313614 323461
9903 323461 331972 338098 341063 340713 337596 332689 326956 321003 315039 309109 303414 298410 294628 292399 291730
9888 291730 292368 294060 296790 300773 306230 313159 321298 330248 339673 349432 359577 370270 381641 393584
9874 393584 405645 417229 428066 438522 449474 461937 476851 495142 517822 545880 579903 619555
9862 619555 663084 707013 746313 775417 789989 788663 773628 749513 721344 692902 666191 641906
9850 641906 620276 601714 586987 577053 572859 575218 584696 601545 625758 657207 695696 740981
9838 740981 792863 851331 916602 988866 1067538 1150041 1230678 1300527 1349172 1368165 1354689 1313116
9826 1313116 1253127 1185624 1119220 1058990 1007106 964129 930114 905172 889597 883810 888337 903813
9814 903813 931021 970871 1024220 1091353 1171105 1259924 1351438 1437057 1507791 1556682 1580573 1579992
9802 1579992 1557287 1514679 1453867 1377179 1288845 1195047 1102618 1017371 943120 881631 833127
9791 833127 796944 772160 758003 753955 759534 773942 795818 823336 854593 887925 921723 953697
9779 953697 980035 995286 993573 970877 927120 866642 796632 724499 655787 593483 538511 490654
9767 490654 449245 413465 382443 355374 331662 310981 293196 278201 265797 255691 247616 241399
9755 241399 236903 233930 232200 231440 231500 232420 234382 237557 241933 247193 252765 258004 262429 265841 268293
9740 268293 270027 271425 272945 275000 277873 281707 286553 292462 299588 308276 319072 332625 349507 369919
9726 369919 393300 417973 441116 459292 469509 470415 462869 449411 432963 415679 398575 381873
9714 381873 365587 349874 335022 321315 309033 298544 290323 284855 282507 283448 287593 294598 303958
9701 303958 315124 327611 341021 354924 368545 380444 388472 390255 384094 369861 349256 325152
9689 325152 300458 277260 256598 238699 223297 209881 197901 186938 176789 167453 159051 151763
9677 151763 145771 141196 137994 135928 134658 133893 133466 133298 133298 133322 133205 132865 132349 131784 131247 130701 130086 129413
9659 129413 128682 127815 126723 125416 123971 122452 120908 119389 117948 116650 115593 114878 114558 114635 115078 115880
9643 115880 117077 118696 120663 122760 124699 126231 127212 127656 127694 127450 126959 126237 125391 124608 124070 123859 123918 124082
9625 124082 124195 124205 124181 124213 124315 124412 124421 124304 124097 123934 123988 124336 124865 125333 125474 125073 124044 122435 120380 118057
9605 118057 115687 113561 112022 111351 111610 112617 114047 115556 116839 117637 117807 117399 116627 115745 114996 114626 114768
9588 114768 115307 115975 116618 117299 118174 119319 120680 122109 123410 124391 124960 125189 125276 125403 125620 125859 126027 126047
9570 126047 125817 125216 124194 122857 121410 120019 118744 117611 116690 116081 115787 115675 115611 115582 115683 116032 116714 117770
9552 117770 119179 120823 122495 124004 125309 126526 127780 129058 130197 131005 131381 131351 131009 130460 129793 129085
9536 129085 128416 127838 127353 126942 126619 126413 126304 126219 126122 126073 126152 126378 126705 127064 127374 127556 127580 127470 127261 126962 126565
9515 126565 126089 125591 125104 124584 123972 123275 122574 121986 121633 121634 122099 123089 124598 126561 128876 131365 133757 135728
9497 135728 136982 137350 136833 135560 133666 131222 128326 125293 122642 120862 120190 120587 121829 123570 125383
9482 125383 126875 127806 128160 128090 127802 127424 126946 126291 125414 124365 123317 122562 122413 123055 124440 126312 128336
9465 128336 130236 131856 133140 134142 135014 135894 136776 137511 137921 137897 137392 136423 135146 133859 132862 132331 132275 132530
9447 132530 132862 133118 133296 133497 133798 134142 134336 134155 133466 132255 130587 128552 126318 124223 122713 122127 122557
9430 122557 123851 125677 127592 129133 129945 129927 129258 128291 127378 126755 126488 126474 126515 126449 126240 125952 125659 125374 125062
9411 125062 124718 124428 124334 124554 125113 125941 126935 128037 129261 130603 131968 133221 134300 135245 136130 136990 137838
9394 137838 138701 139626 140638 141708 142742 143586 144072 144086 143610 142699 141443 139964 138446 137100 136046 135249 134597
9377 134597 133998 133401 132756 132002 131091 130018 128845 127712 126842 126448 126567 126998 127433 127628 127453 126897 126115 125441
9359 125441 125243 125679 126585 127601 128385 128736 128605 128108 127483 126970 126670 126537 126457 126312 125998 125451 124664 123713 122739
9340 122739 121883 121223 120775 120509 120347 120185 119925 119545 119147 118926 119085 119764 121001 122700 124660 126632 128405
9323 128405 129894 131151 132275 133293 134127 134677 134924 134947 134875 134819 134822 134849 134867 134886 134924 134947 134839 134432 133620 132461 131200
9302 131200 130193 129783 130162 131285 132855 134435 135679 136493 137005 137418 137897 138517 139236 139918 140388 140500 140227
9285 140227 139690 139118 138805 139036 139902 141205 142571 143647 144198 144138 143571 142766 142010 141489 141248 141211 141266 141380 141593
9266 141593 141954 142492 143240 144209 145313 146325 146953 147011 146520 145636 144539 143402 142416 141770 141553 141648 141718 141379 140440
9247 140440 139005 137352 135741 134349 133285 132585 132181 131906 131542 130911 129976 128884 127878 127187 126964 127267 128038
9230 128038 129138 130401 131700 132982 134260 135544 136784 137869 138714 139362 139974 140708 141589 142492 143237 143687
9214 143687 143797 143667 143516 143587 144034 144845 145816 146656 147146 147210 146884 146240 145350 144341 143426 142832 142662 142823 143080
9195 143080 143212 143135 142924 142720 142600 142531 142424 142255 142149 142292 142771 143514 144347 145075 145545 145692 145592 145458 145516 145846
9175 145846 146330 146715 146730 146223 145267 144127 143070 142187 141437 140812 140387 140220 140246 140291 140167 139741 139001 138122 137449
9156 137449 137303 137733 138467 139129 139453 139335 138799 137986 137138 136484 136107 135958 136017 136385 137174 138385 139921 141663
9138 141663 143472 145161 146507 147323 147512 147093 146211 145156 144311 144019 144441 145490 146884 148277 149388 150104
9122 150104 150506 150774 151033 151306 151603 152014 152646 153500 154442 155281 155858 156118 156136 156036 155890 155697 155415 154982 154346
9103 154346 153519 152592 151667 150765 149782 148598 147219 145832 144683 143900 143452 143280 143428 144003 145015 146319 147737
9086 147737 149132 150324 151030 150999 150166 148651 146667 144457 142244 140174 138339 136836 135796 135302 135246 135317 135170
9069 135170 134606 133669 132603 131683 131057 130733 130678 130899 131448 132382 133710 135336 137021 138488 139615 140525 141509
9052 141509 142838 144599 146689 148944 151215 153357 155188 156514 157200 157228 156734 156001 155380 155146 155427 156206 157362
9035 157362 158704 160030 161191 162111 162739 163012 162893 162413 161676 160860 160185 159821 159801 159990 160162 160156 159999 159895 160067
9016 160067 160586 161361 162255 163188 164134 165064 165910 166576 166977 167066 166872 166544 166318 166410 166924 167811 168868 169817 170449
8997 170449 170699 170596 170220 169715 169307 169229 169615 170440 171479 172354 172700 172349 171389 170047 168541 167037 165671 164567
8979 164567 163840 163580 163802 164421 165264 166123 166782 167026 166704 165829 164596 163248 161889 160448 158856 157227 155838
8962 155838 154941 154615 154739 155110 155557 155957 156227 156333 156281 156080 155734 155286 154859 154621 154687 155022 155426 155661 155602 155271
8942 155271 154756 154144 153527 152994 152601 152378 152373 152602 152998 153457 153945 154529 155304 156347 157691 159269 160885 162299
8924 162299 163337 163906 163947 163438 162457 161205 159952 158940 158306 158082 158240 158729 159484 160379 161222 161841 162152 162114
8906 162114 161692 160908 159875 158753 157737 157055 156894 157270 158016 158932 159899 160840 161635 162138 162308 162288 162356 162782 163712
8887 163712 165106 166737 168302 169584 170487 170979 171045 170699 169996 169008 167805 166460 165058 163690 162428 161294
8871 161294 160279 159392 158702 158324 158356 158834 159706 160825 161987 163026 163878 164571 165200 165869 166636 167499 168401 169252
8853 169252 169978 170596 171190 171777 172210 172285 171958 171446 171130 171342 172219 173704 175643 177841 180080 182101 183608
8836 183608 184329 184126 183052 181302 179126 176757 174373 172129 170191 168715 167806 167487 167695 168297 169088 169815
8820 169815 170271 170434 170496 170729 171310 172224 173268 174130 174520 174300 173506 172268 170761 169210 167887 167048 166826 167147
8802 167147 167790 168539 169266 169934 170577 171234 171858 172292 172380 172090 171533 170869 170226 169677 169266 169048 169124 169598 170488 171644
8782 171644 172776 173576 173854 173606 172988 172255 171695 171507 171701 172111 172522 172795 172909 172911 172840 172727 172623 172565 172511 172362
8762 172362 172043 171550 170912 170207 169609 169384 169769 170827 172399 174154 175696 176689 176960 176579 175839 175089 174571 174334
8744 174334 174278 174287 174315 174372 174469 174609 174773 174910 174949 174854 174644 174341 173934 173411 172802 172191 171701 171453 171489 171756 172192 172823
8722 172823 173738 174989 176524 178185 179762 181067 182022 182699 183286 183975 184849 185891 187047 188260 189493 190736
8706 190736 191994 193272 194561 195868 197221 198616 199968 201110 201872 202174 202046 201602 201010 200454 200080 199936
8690 199936 199935 199945 199938 199986 200114 200223 200138 199688 198742 197214 195116 192623 190068 187870 186376 185689 185649 185995 186519 187083
8670 187083 187569 187875 187945 187793 187479 187048 186534 186000 185568 185383 185536 186025 186792 187771 188869 189961 190925 191726 192453
8651 192453 193253 194172 195077 195766 196161 196380 196611 196954 197385 197851 198333 198842 199386 199895 200189 200106 199652 198997 198328
8632 198328 197729 197209 196779 196465 196271 196157 196028 195754 195251 194554 193810 193178 192711 192356 192029 191695 191414 191344 191681
8613 191681 192502 193658 194848 195815 196463 196838 197039 197168 197313 197563 197993 198655 199559 200636 201701 202528 203002 203194
8595 203194 203267 203294 203191 202858 202360 201926 201830 202249 203197 204525 206010 207491 208930 210359 211765 213039 214005 214513
8577 214513 214518 214074 213238 212041 210595 209181 208164 207777 207953 208339 208521 208237 207486 206499 205602 205044 204915 205170
8559 205170 205694 206368 207170 208246 209827 212037 214783 217807 220843 223760 226604 229514 232559 235616 238309
8544 238309 240043 240198 238474 235163 231065 227074 223791 221423 219860 218820 218001 217201 216333 215357 214222 212903
8528 212903 211445 209939 208458 207029 205676 204430 203290 202201 201142 200215 199625 199547 200030 201015 202384 203990
8512 203990 205680 207311 208797 210151 211424 212586 213498 214025 214156 214036 213891 213898 214112 214473 214887 215302 215721 216151
8494 216151 216580 217005 217440 217895 218337 218680 218823 218681 218209 217471 216656 215967 215451 214989 214441 213749 212963 212213 211625
8475 211625 211242 211016 210874 210793 210851 211192 211890 212838 213779 214447 214667 214368 213589 212505 211425 210667 210379 210512 210967
8456 210967 211731 212869 214374 216068 217641 218782 219297 219171 218551 217628 216518 215256 213884 212512 211294 210352
8440 210352 209745 209475 209510 209810 210345 211076 211940 212844 213698 214488 215280 216155 217135 218167 219213 220289 221432 222654
8422 222654 223959 225352 226770 228049 228980 229422 229387 229036 228574 228153 227846 227675 227631 227690 227823 228025 228319 228716 229184
8403 229184 229660 230076 230384 230556 230588 230536 230515 230633 230933 231402 232014 232733 233495 234231 234912 235538 236095 236545 236859 237062
8383 237062 237225 237435 237764 238246 238882 239669 240568 241444 242110 242446 242464 242260 241932 241551 241162 240796 240487 240317 240438
8364 240438 241013 242112 243648 245400 247091 248509 249577 250316 250739 250825 250552 249948 249143 248339 247697 247264 246983
8347 246983 246796 246728 246892 247419 248360 249650 251151 252736 254310 255783 257043 257938 258303 258085 257462 256826 256598
8330 256598 256996 257919 259006 259837 260155 259917 259159 257889 256117 253977 251725 249598 247709 246078 244692 243566
8314 243566 242796 242537 242887 243788 245050 246479 247925 249252 250302 250936 251116 250939 250583 250226 249966 249788 249643
8297 249643 249587 249788 250354 251177 251968 252429 252425 252022 251412 250784 250258 249891 249709 249733 249965 250402 251088 252126 253578 255370
8277 255370 257323 259289 261168 262818 264057 264771 264979 264773 264284 263686 263159 262824 262709 262747 262773 262545 261876 260763
8259 260763 259409 258117 257129 256540 256313 256364 256635 257091 257681 258326 258917 259335 259547 259662 259836 260123 260460 260772 261017
8240 261017 261141 261084 260867 260647 260668 261137 262073 263272 264444 265425 266249 267045 267902 268837 269829 270857 271902 272908
8222 272908 273788 274473 274963 275329 275646 275914 276072 276131 276235 276532 277037 277660 278331 279061 279894 280841 281840 282753 283434
8203 283434 283848 284115 284395 284726 285017 285138 284987 284542 283919 283363 283136 283370 284014 284857 285644 286206 286507 286591 286558 286542
8183 286542 286699 287139 287827 288598 289269 289745 290016 290074 289826 289164 288066 286657 285228 284150 283664 283717 284040 284366
8165 284366 284554 284613 284679 284927 285467 286290 287296 288387 289543 290800 292148 293495 294761 295967 297204 298469
8149 298469 299535 300056 299869 299197 298540 298377 298939 300163 301794 303536 305112 306274 306861 306859 306352 305447 304235
8132 304235 302763 301042 299120 297153 295395 294108 293485 293618 294518 296153 298443 301193 304106 306862 309216
8117 309216 311070 312494 313688 314821 315876 316661 316986 316798 316179 315252 314150 313051 312194 311829 312102 312960 314128
8100 314128 315225 315967 316283 316279 316130 315985 315884 315780 315647 315568 315712 316242 317213 318516 319886 320964 321414 321061 320007
8081 320007 318613 317285 316284 315741 315736 316297 317340 318686 320115 321405 322379 322960 323225 323407 323784 324539 325727
8064 325727 327317 329207 331212 333133 334833 336196 337100 337482 337376 336879 336118 335253 334435 333738 333129 332517 331880
8047 331880 331350 331180 331594 332639 334131 335754 337235 338446 339377 340113 340818 341697 342853 344174 345375 346202
8031 346202 346599 346707 346740 346880 347223 347770 348440 349093 349589 349871 349997 350100 350333 350815 351612 352755 354228 355863
8013 355863 357337 358356 358820 358803 358470 358022 357648 357505 357722 358386 359508 361037 362903 365008 367198 369302 371205
7996 371205 372881 374386 375779 377028 377979 378429 378283 377655 376823 376060 375503 375157 374988 374956 374985 374969 374837 374592 374289
7977 374289 373983 373707 373518 373527 373832 374451 375332 376419 377678 379110 380770 382743 385053 387583 390092 392306 394040
7960 394040 395257 396059 396620 397118 397690 398405 399293 400390 401718 403223 404788 406288 407644 408826 409853 410815
7944 410815 411843 413058 414512 416120 417632 418721 419157 418905 418063 416731 415009 413119 411416 410253 409834
7929 409834 410231 411438 413365 415804 418530 421416 424398 427346 430037 432237 433811 434757 435164 435168 434906 434479
7913 434479 433954 433383 432799 432224 431693 431273 431008 430846 430627 430199 429543 428798 428161 427789 427747 427991 428396 428839 429302
7894 429302 429884 430714 431859 433269 434774 436141 437206 437973 438609 439342 440386 441880 443803 445981 448232 450489
7878 450489 452766 455031 457142 458883 460059 460618 460723 460674 460733 461005 461419 461761 461786 461360 460546 459604 458914 458818 459470
7859 459470 460790 462528 464377 466089 467548 468806 470027 471390 472973 474690 476338 477762 478939 479905 480635
7844 480635 481029 480996 480536 479779 478967 478337 477976 477803 477718 477751 478040 478722 479868 481486 483540 485963 488603 491197
7826 491197 493464 495265 496635 497692 498543 499277 499963 500608 501165 501595 501927 502287 502848 503735 504972 506473 508094
7809 508094 509689 511148 512429 513584 514684 515733 516670 517477 518214 518972 519793 520641 521421 522026 522385 522499 522442
7792 522442 522335 522323 522586 523314 524586 526267 528083 529804 531344 532781 534289 536007 537939 539980 541994 543858
7776 543858 545467 546731 547583 548029 548175 548203 548238 548262 548184 547998 547875 548140 549123 551006 553775 557263 561211 565336
7758 565336 569392 573195 576640 579709 582438 584889 587144 589306 591419 593405 595148 596656 598074 599520
7744 599520 600931 602093 602780 602868 602401 601572 600607 599689 598980 598622 598678 599123 599883 600886 602103 603520 605119 606898
7726 606898 608912 611224 613821 616565 619242 621678 623811 625646 627206 628520 629641 630640 631564 632398 633076
7711 633076 633553 633855 634063 634278 634574 634943 635352 635820 636424 637245 638340 639728 641374 643188 645076 647023 649122
7694 649122 651510 654268 657356 660623 663857 666870 669537 671774 673490 674585 675030 674958 674663 674475 674598 675028
7678 675028 675633 676330 677172 678240 679552 681116 683015 685386 688311 691742 695508 699331 702897 705939 708294
7663 708294 709931 710965 711602 712045 712421 712792 713197 713678 714329 715338 716907 719094 721814 724945 728361 731868
7647 731868 735215 738235 740963 743575 746213 748913 751612 754198 756590 758808 760940 763049 765126 767129
7633 767129 769017 770781 772447 774076 775756 777610 779802 782476 785595 788884 792027 794932 797777 800831
7619 800831 804233 807887 811491 814698 817251 819055 820201 820936 821541 822241 823188 824469 826077 827906 829829
7604 829829 831773 833704 835587 837398 839173 841028 843129 845622 848552 851835 855278 858644 861754 864562
7590 864562 867157 869704 872362 875197 878139 881024 883654 885899 887775 889460 891209 893272 895845 898986
7576 898986 902510 906060 909335 912236 914820 917191 919449 921695 924030 926516 929125 931768 934364 936899
7562 936899 939464 942265 945562 949539 954177 959252 964449 969511 974281 978692 982762 986599 990289 993776
7548 993776 996932 999744 1002328 1004796 1007207 1009613 1012069 1014579 1017074 1019475 1021753 1023956 1026190 1028590
7534 1028590 1031281 1034369 1037920 1041956 1046447 1051332 1056552 1062058 1067800 1073678 1079514 1085074 1090159 1094688
7520 1094688 1098737 1102514 1106285 1110225 1114282 1118223 1121856 1125172 1128295 1131381 1134557 1137888 1141367 1144937
7506 1144937 1148522 1152080 1155671 1159489 1163778 1168667 1174095 1179887 1185866 1191937 1198090 1204339 1210685 1217132
7492 1217132 1223676 1230267 1236799 1243173 1249368 1255426 1261414 1267393 1273373 1279271 1284915 1290082 1294553 1298224
7478 1298224 1301190 1303734 1306206 1308923 1312114 1315887 1320259 1325180 1330499 1335967 1341344 1346523 1351540 1356514
7464 1356514 1361593 1366956 1372825 1379425 1386871 1395095 1403859 1412846 1421819 1430741 1439736 1448968 1458569 1468581
7450 1468581 1478891 1489198 1499076 1508185 1516436 1523978 1531028 1537755 1544267 1550686 1557217 1564106 1571513 1579429
7436 1579429 1587696 1596097 1604427 1612470 1619926 1626455 1631844 1636128 1639575 1642608 1645711 1649304 1653608 1658580
7422 1658580 1663976 1669508 1675019 1680527 1686094 1691722 1697460 1703530 1710255 1717824 1726174 1735065 1744263 1753708
7408 1753708 1763528 1773903 1784872 1796218 1807517 1818316 1828352 1837675 1846589 1855509 1864808 1874662 1884995
7395 1884995 1895632 1906512 1917734 1929418 1941606 1954286 1967466 1981219 1995646 2010789 2026579
7384 2026579 2042868 2059487 2076281 2093090 2109717 2125950 2141664 2156908 2171874 2186757 2201670
7373 2201670 2216628 2231600 2246616 2261830 2277409 2293354 2309462 2325449 2341124 2356479 2371677
7362 2371677 2386978 2402657 2418889 2435632 2452632 2469588 2486313 2502751 2518875 2534640 2550064
7351 2550064 2565343 2580784 2596575 2612649 2628788 2644844 2660846 2676926 2693190 2709675 2726390
7340 2726390 2743349 2760543 2777893 2795256 2812519 2829715 2847039 2864730 2882948 2901750 2921118
7329 2921118 2940930 2960964 2981009 3000997 3021015 3041217 3061748 3082684 3103963 3125345 3146503
7318 3146503 3167236 3187650 3208133 3229129 3250917 3273532 3296834 3320647 3344888 3369548 3394583
7307 3394583 3419827 3445043 3470054 3494843 3519576 3544538 3570012 3596164 3623008 3650449 3678362
7296 3678362 3706661 3735358 3764574 3794476 3825179 3856703 3888978 3921892 3955294 3989041 4023074
7285 4023074 4057414 4092036 4126793 4161486 4196011 4230394 4264738 4299216 4334067 4369515 4405679
7274 4405679 4442563 4480168 4518614 4558128 4598864 4640767 4683603 4727164 4771418 4816469 4862386
7263 4862386 4909092 4956413 5004193 5052366 5100983 5150202 5200271 5251427 5303770 5357199 5411473
7252 5411473 5466345 5521716 5577687 5634506 5692424 5751588 5812022 5873636 5936286 5999860 6064300
7241 6064300 6129566 6195622 6262486 6330265 6399155 6469385 6541101 6614306 6688944 6764998 6842471
7230 6842471 6921321 7001455 7082831 7165537 7249778 7335774 7423682 7513594 7605553 7699558 7795590
7219 7795590 7893628 7993655 8095638 8199534 8305335 8413105 8522979 8635147 8749803 8867042
7209 8867042 8986778 9108855 9233264 9360256 9490224 9623495 9760186 9900194 10043299 10189291
7199 10189291 10338059 10489582 10643878 10800977 10960950 11123919 11289993 11459156 11631254
7190 11631254 11806094 11983574 12163700 12346505 12532007 12720232 12911243 13105152 13302126
7181 13302126 13502407 13706343 13914371 14126952 14344474 14567225 14795413 15029214 15268790
7172 15268790 15514294 15765919 16023943 16288714 16560634 16840183 17127930 17424491 17730465
7163 17730465 18046396 18372772 18710028 19058520 19418507 19790214 20173965 20570270 20979819
7154 20979819 21403370 21841613 22295116 22764382 23249936 23752350 24272238 24810260 25367135
7145 25367135 25943649 26540662 27159110 27799979 28464232 29152780 29866507 30606328 31373189
7136 31373189 32168069 32992112 33846775 34733821 35655167 36612719 37608274 38643538 39720221
7127 39720221 40840127 42005179 43217456 44479362 45793794 47164113 48593975 50087175
7119 50087175 51647608 53279319 54986649 56774425 58648105 60613786 62678091 64848008
7111 64848008 67130803 69534021 72065411 74732705 77543427 80505071 83625788 86915348
7103 86915348 90385830 94051702 97929384 102036642 106392107 111015022 115925220 121143407
7095 121143407 126691575 132593294 138873726 145559567 152679066 160262056 168339913 176945384
7087 176945384 186112239 195874697 206266624 217320548 229066579 241531097 254735052
7080 254735052 268691773 283404219 298861607 315035523 331875708 349305602 367217734
7073 367217734 385469293 403878453 422222119 440235867 457616784 474029800 489118064
7066 489118064 502517474 513874792 522868015 529227098 532752831 533331619 530944256 525667423
7058 525667423 517667673 507188856 494534663 480048349 464091946 447027122 429199240
7051 429199240 410925322 392486055 374121569 356030416 338370995 321264701 304800082
7044 304800082 289037382 274013084 259744286 246232780 233468612 221433073 210101124
7037 210101124 199443353 189427553 180020025 171186616 162893437 155107299 147796025 140928741
7029 140928741 134476109 128410432 122705655 117337342 112282639 107520196 103030115 98793932
7021 98793932 94794596 91016388 87444792 84066369 80868623 77839900 74969384 72247114
7013 72247114 69663908 67211186 64880846 62665233 60557219 58550259 56638364 54816022
7005 54816022 53078138 51419964 49836979 48324763 46878980 45495469 44170435 42900593
6997 42900593 41683063 40515108 39394000 38317132 37282193 36287230 35330511 34410304 33524779
6988 33524779 32672114 31850642 31058899 30295574 29559443 28849317 28163996 27502281 26863053
6979 26863053 26245344 25648243 25070796 24512045 23971086 23447047 22939070 22446368 21968270
6970 21968270 21504210 21053676 20616158 20191137 19778103 19376602 18986247 18606732 18237835
6961 18237835 17879382 17531170 17192917 16864312 16545097 16235091 15934136 15642054 15358575
6952 15358575 15083288 14815728 14555519 14302427 14056290 13816957 13584255 13357949 13137719
6943 13137719 12923176 12713889 12509409 12309273 12113038 11920413 11731347 11545919 11364159
6934 11364159 11185983 11011245 10839832 10671710 10506889 10345379 10187211 10032460 9881179
6925 9881179 9733291 9588557 9446737 9307790 9171871 9039142 8909633 8783245 8659802 8539109
6915 8539109 8421024 8305496 8192536 8082153 7974297 7868830 7765543 7664248 7564858 7467402
6905 7467402 7371980 7278699 7187599 7098615 7011572 6926218 6842300 6759606 6677969 6597308 6517706
6894 6517706 6439381 6362550 6287282 6213462 6140896 6069461 5999141 5929940 5861754 5794368 5727629
6883 5727629 5661599 5596564 5532836 5470547 5409621 5349899 5291236 5233517 5176653 5120571 5065220
6872 5065220 5010607 4956821 4904010 4852289 4801660 4751961 4702885 4654117 4605506 4557122 4509189
6861 4509189 4462002 4415859 4370984 4327431 4285042 4243515 4202584 4162165 4122354 4083248 4044779
6850 4044779 4006697 3968691 3930541 3892223 3853940 3816025 3778789 3742440 3707128 3672939 3639817
6839 3639817 3607603 3576145 3545294 3514834 3484528 3454249 3424018 3393939 3364119 3334642 3305572
6828 3305572 3276942 3248736 3220893 3193307 3165851 3138402 3110922 3083531 3056496 3030102 3004518
6817 3004518 2979781 2955817 2932464 2909540 2886965 2864802 2843175 2822132 2801583 2781367 2761302
6806 2761302 2741174 2720737 2699866 2678715 2657614 2636728 2615853 2594575 2572589 2549910 2526877
6795 2526877 2503999 2481736 2460322 2439763 2419985 2400910 2382458 2364578 2347268 2330549 2314401
6784 2314401 2298752 2283499 2268490 2253525 2238401 2222999 2207293 2191314 2175089 2158656 2142100
6773 2142100 2125533 2109038 2092638 2076319 2060109 2044144 2028647 2013855 1999915 1986824 1974433
6762 1974433 1962540 1950969 1939561 1928135 1916516 1904633 1892585 1880619 1869001 1857894 1847380
6751 1847380 1837600 1828769 1821044 1814339 1808315 1802555 1796781 1790899 1784867 1778595 1771948 1764790 1757046 1748785
6737 1748785 1740200 1731509 1722878 1714399 1706101 1697982 1690017 1682120 1674144 1665975 1657633 1649286 1641183 1633528
6723 1633528 1626386 1619671 1613209 1606824 1600399 1593871 1587161 1580100 1572471 1564187 1555424 1546546 1537875 1529549
6709 1529549 1521556 1513783 1506046 1498139 1489944 1481513 1473090 1465016 1457546 1450674 1444087 1437300 1429863 1421549
6695 1421549 1412435 1402794 1392885 1382819 1372620 1362366 1352260 1342586 1333554 1325178 1317289 1309648 1302096
6682 1302096 1294610 1287251 1280091 1273154 1266365 1259547 1252487 1245065 1237330 1229472 1221716 1214245 1207174 1200532
6668 1200532 1194263 1188268 1182454 1176733 1170990 1165065 1158829 1152306 1145694 1139242 1133104 1127264 1121562 1115768
6654 1115768 1109700 1103318 1096742 1090170 1083754 1077558 1071578 1065783 1060133 1054578 1049060 1043520 1037931 1032334
6640 1032334 1026843 1021592 1016661 1012043 1007667 1003432 999268 995211 991389 987883 984570 981160 977386 973157
6626 973157 968564 963783 958936 954023 949013 943970 939076 934491 930237 926229 922411 918819 915555 912714
6612 912714 910320 908300 906514 904833 903161 901384 899369 897050 894477 891739 888840 885676 882128 878128
6598 878128 873670 868842 863836 858860 854067 849571 845460 841729 838251 834836 831313 827601 823722 819746
6584 819746 815734 811752 807907 804316 801049 798106 795461 793093 790979 789067 787268 785465 783549 781446
6570 781446 779109 776510 773682 770778 768079 765917 764532 763977 764132 764806 765827 767102 768605 770351 772325
6555 772325 774420 776428 778137 779426 780282 780786 781082 781333 781690 782263 783117 784307 785935 788104 790835 794057
6539 794057 797662 801506 805344 808818 811570 813451 814695 815868 817588 820215 823759 827979 832489 836859
6525 836859 840751 844044 846808 849145 851063 852469 853255 853372 852863 851877 850616 849231 847776 846265 844734
6510 844734 843232 841805 840509 839406 838507 837717 836853 835724 834224 832400 830454 828650 827106 825660 823956
6495 823956 821641 818454 814251 809014 802800 795663 787666 778955 769787 760504 751459 742959 735186 728144
6481 728144 721701 715722 710138 704905 699950 695171 690396 685361 679809 673643 666937 659787 652222 644299
6467 644299 636219 628293 620803 613925 607732 602248 597467 593327 589661 586199 582694 579008 575098 570947
6453 570947 566554 561979 557349 552822 548541 544593 540969 537548 534155 530662 527064 523468 520006 516750
6439 516750 513711 510892 508336 506114 504252 502662 501180 499715 498351 497262 496565 496240 496161 496184 496189 496050 495624
6422 495624 494828 493714 492490 491491 491137 491801 493618 496405 499799 503498 507411 511599 516112 520849 525485
6407 525485 529569 532722 534814 536002 536610 536983 537473 538468 540356 543437 547871 553676 560671 568373 575897
6392 575897 581991 585297 584815 580265 572145 561522 549729 538077 527648 519155 512881 508718 506253 504878
6378 504878 503896 502601 500333 496597 491220 484411 476650 468497 460408 452654 445377 438691 432717 427526 423046
6363 423046 419069 415355 411717 408056 404362 400715 397266 394150 391386 388891 386573 384357 382176 379979
6349 379979 377785 375724 374040 372991 372707 373079 373787 374442 374747 374590 374021 373141 371967 370413 368396 365968
6333 365968 363347 360835 358670 356912 355425 353969 352370 350610 348806 347134 345778 344887 344564 344888 345913
6318 345913 347611 349836 352358 354909 357243 359180 360636 361629 362300 362894 363709 365026 367037 369794 373253
6303 373253 377348 382030 387224 392736 398206 403235 407573 411170 414028 416066 417147 417227 416495 415358 414338
6288 414338 413939 414508 416153 418753 422068 425888 430126 434805 439969 445606 451606 457761 463780 469278 473800
6273 473800 476926 478407 478228 476579 473800 470331 466656 463227 460368 458232 456820 456082 456064 456894 458593 460930
6257 460930 463482 465774 467358 467850 466999 464761 461272 456726 451334 445381 439250 433317 427877 423160 419310
6242 419310 416308 413949 411941 410050 408152 406183 404091 401795 399141 395924 391971 387228 381816 376035
6228 376035 370267 364805 359765 355158 350986 347262 343995 341153 338646 336357 334115 331707 328990 326039
6214 326039 323129 320572 318618 317459 317224 317894 319228 320797 322136 322910 323013 322526 321558 320177 318452 316483
6198 316483 314351 312135 310041 308398 307489 307386 307929 308810 309674 310164 309986 309035 307417 305308 302828 300055
6182 300055 297110 294186 291550 289452 287976 286971 286165 285373 284586 283906 283452 283305 283460 283760 283943 283792 283282
6165 283282 282543 281715 280838 279845 278642 277165 275385 273326 271094 268856 266742 264776 262885 260981 259055
6150 259055 257183 255445 253855 252398 251061 249806 248534 247126 245523 243793 242104 240647 239600 239154 239469
6135 239469 240510 241948 243284 244130 244368 244116 243618 243183 243070 243302 243648 243791 243513 242777 241705 240501 239371
6118 239371 238463 237836 237444 237183 236950 236683 236341 235869 235191 234266 233144 232003 231092 230568 230387 230351 230275 230112 229942
6099 229942 229866 229926 230110 230400 230770 231124 231245 230896 230005 228710 227254 225858 224672 223774 223183 222848 222647 222470
6081 222470 222295 222110 221812 221313 220688 220155 219896 219934 220123 220255 220205 219988 219649 219147 218393 217360 216099 214696 213252
6062 213252 211862 210593 209488 208589 207917 207453 207141 206888 206575 206089 205380 204483 203470 202401 201352 200487 200052
6045 200052 200263 201192 202736 204659 206675 208543 210103 211219 211795 211836 211463 210848 210150 209476 208845 208192 207418
6028 207418 206478 205428 204393 203490 202808 202421 202410 202839 203715 204979 206525 208198 209783 211066 211950 212502 212904
6011 212904 213377 214100 215162 216572 218284 220169 222001 223516 224523 225006 225150 225234 225449 225832 226362 227077 228063
5994 228063 229330 230724 231997 233020 233923 235012 236546 238614 241184 244197 247639 251543 255887 260504 265097
5979 265097 269363 273088 276153 278549 280423 282070 283795 285771 288014 290455 293045 295838 298993 302686
5965 302686 307019 311960 317338 322926 328518 333974 339200 344111 348590 352475 355591 357788 358994 359248 358709
5950 358709 357642 356365 355166 354245 353694 353497 353546 353710 353918 354205 354703 355554 356774 358166 359348 359874 359378
5933 359378 357684 354814 350919 346195 340815 334927 328723 322483 316488 310940 305970 301674 298076 295053
5919 295053 292337 289646 286847 284001 281257 278717 276384 274179 271943 269433 266360 262521 257938 252855
5905 252855 247596 242336 237046 231675 226356 221368 216937 213137 209930 207188 204722 202335 199880 197287
5891 197287 194567 191833 189249 186940 184950 183270 181873 180722 179791 179109 178722 178628 178744 178900 178869 178419 177391
5874 177391 175730 173518 170961 168346 165976 164112 162897 162273 161998 161777 161400 160780 159913 158826 157584 156333
5858 156333 155249 154433 153864 153484 153295 153374 153791 154527 155446 156327 156969 157290 157286 156959 156322 155431 154372 153244 152185
5839 152185 151380 150949 150816 150718 150422 149919 149390 149061 149130 149733 150851 152248 153585 154632 155369 155953 156602 157473
5821 157473 158553 159643 160469 160830 160716 160274 159691 159078 158446 157726 156826 155693 154377 152990 151586 150150 148705
5804 148705 147369 146276 145420 144587 143496 142027 140344 138843 137962 137935 138662 139805 141011 142088 143035 143962
5788 143962 144977 146099 147241 148254 148990 149379 149520 149690 150220 151306 152946 155021 157396 160001 162877 166140
5772 166140 169856 173908 177963 181594 184431 186294 187249 187529 187392 187022 186515 185926 185333 184840 184540 184474 184656
5755 184656 185106 185809 186645 187412 187960 188289 188514 188775 189136 189520 189733 189571 188965 188062 187136 186421 185998 185815 185733
5736 185733 185528 184937 183780 182082 180055 177980 176120 174669 173687 173085 172708 172453 172283 172155 171996 171759 171424
5719 171424 171000 170557 170211 170006 169863 169635 169213 168562 167703 166721 165768 165017 164610 164682 165361 166663 168421 170391
5701 170391 172405 174378 176213 177814 179208 180532 181843 182997 183722 183808 183228 182116 180683 179161 177775
5686 177775 176709 176055 175761 175600 175215 174257 172523 170001 166855 163415 160125 157392 155407 154062 153062 152101
5670 152101 150967 149588 148064 146615 145433 144570 143961 143533 143277 143201 143272 143427 143609 143774 143885 143925 143891 143772 143549
5651 143549 143208 142724 142072 141291 140529 139991 139862 140236 141091 142321 143814 145483 147198 148732 149812 150263 150109
5634 150109 149522 148702 147809 146960 146259 145742 145350 145019 144771 144677 144781 145058 145429 145813 146139 146347 146401 146311 146129 145935
5614 145935 145823 145896 146248 146910 147841 148987 150297 151688 153027 154142 154855 155052 154775 154267 153909 154051 154855 156274
5596 156274 158177 160424 162818 165073 166935 168330 169353 170154 170869 171630 172572 173802 175346 177113 178940
5581 178940 180727 182521 184478 186747 189370 192247 195170 197907 200308 202342 204048 205471 206621 207474 207983
5566 207983 208117 207895 207391 206704 205959 205336 205063 205348 206298 207895 210000 212396 214871 217351 219950 222878 226269
5549 226269 230086 234142 238181 241979 245407 248444 251181 253807 256554 259616 263083 266896 270854 274689
5535 274689 278193 281308 284139 286887 289723 292729 295963 299534 303571 308156 313325 319104 325493 332445
5521 332445 339913 347907 356468 365589 375198 385206 395574 406319 417463 428983 440842 453052 465684
5508 465684 478791 492302 506059 519987 534235 549164 565228 582849 602322 623803 647377 673108
5496 673108 701024 731161 763669 798869 837159 878894 924370 973930 1028108 1087767 1154102 1228453
5484 1228453 1312080 1406110 1511680 1630153 1763294 1913409 2083464 2277249 2499636 2756918
5474 2756918 3057152 3410500 3829517 4329284 4927290 5642888 6495681 7501886 8667680
5465 8667680 9978834 11387440 12800360 14079044 15061263 15605347 15639374 15186421 14349003
5456 14349003 13264936 12063849 10844029 9669645 8578061 7588347 6707652 5935438 5266130
5447 5266130 4690712 4197985 3775916 3412981 3099146 2826309 2588223 2380068 2197935 2038437
5437 2038437 1898517 1775400 1666613 1570070 1484119 1407444 1338860 1277227 1221504 1170790 1124284
5426 1124284 1081218 1040841 1002485 965689 930273 896283 863867 833179 804359 777567 752977
5415 752977 730701 710680 692606 675943 660070 644425 628561 612162 595095 577439 559485 541687
5403 541687 524528 508361 493353 479549 466975 455657 445558 436509 428228 420428 412924 405681 398756
5390 398756 392210 386107 380543 375630 371442 367945 365002 362475 360314 358533 357148 356182 355689 355735 356323 357349
5374 357349 358635 360020 361437 362938 364657 366721 369107 371493 373270 373753 372488 369506 365368 360972 357247
5359 357247 354922 354402 355735 358665 362780 367778 373700 380880 389584 399594 410029 419513 426584 430094
5345 430094 429511 425122 418004 409628 401339 394089 388482 384863 383287 383480 384909 386976 389183 391201 392853
5330 392853 394086 394936 395451 395574 395131 393985 392191 390001 387793 385976 384855 384504 384734 385169 385388 385064 384032
5313 384032 382328 380158 377790 375421 373205 371398 370433 370822 372908 376667 381706 387435 393237 398566 403062
5298 403062 406597 409190 410887 411672 411489 410331 408319 405688 402781 400081 398162 397561 398615 401369 405685
5283 405685 411426 418529 426916 436351 446394 456524 466307 475424 483599 490580 496206 500473 503568 505873
5269 505873 507875 510021 512616 515825 519663 523943 528209 531746 533732 533533 531011 526689 521649 517191 514401
5254 514401 513852 515538 518997 523515 528371 533039 537284 541146 544830 548567 552518 556744 561163 565491 569258
5239 569258 572022 573654 574495 575333 577213 581159 587884 597661 610282 624973 640306 654244 664464 668945
5225 668945 666623 657758 643800 626899 609310 592904 578871 567658 559048 552335 546573 540819 534315
5212 534315 526636 517811 508268 498601 489276 480452 471982 463608 455169 446715 438510 430989 424683 420111
5198 420111 417596 417082 418063 419668 420842 420528 417819 412122 403385 392206 379634 366805 354661 343845
5184 343845 334664 327067 320639 314707 308562 301690 293852 285070 275595 265822 256142 246819 237955 229538
5170 229538 221524 213927 206884 200605 195213 190663 186795 183423 180348 177394 174491 171737 169339 167457
5156 167457 166070 164942 163711 162054 159871 157370 154937 152942 151677 151383 152170 153884 156145 158552 160827
5141 160827 162824 164500 165875 166972 167737 168040 167786 166988 165767 164327 162892 161629 160633 159951 159550 159274
5125 159274 158910 158346 157690 157240 157336 158226 160041 162797 166370 170489 174840 179223 183602 188007 192385 196584
5109 196584 200469 204032 207427 210966 215098 220376 227454 237070 249987 266899 288364 314678 345489
5096 345489 379111 411926 438556 453329 452722 437283 411327 380562 349705 321562 297267 276831
5084 276831 259629 244867 231919 220463 210438 201922 195006 189690 185815 183077 181121 179708 178792
5071 178792 178413 178532 178993 179614 180296 181050 181925 182859 183608 183833 183297 181993 180095 177772 175071 171957 168451
5054 168451 164736 161163 158151 155988 154688 154011 153637 153351 153123 153041 153150 153327 153330 152956 152088 150671 148721 146396
5036 146396 144003 141916 140423 139596 139281 139187 139044 138688 138027 136965 135406 133345 130893 128206 125414 122622
5020 122622 119950 117530 115457 113761 112438 111520 111079 111157 111703 112582 113643 114752 115789 116664 117351 117861 118191
5003 118191 118355 118440 118565 118833 119315 120002 120759 121382 121703 121667 121358 120925 120476 120051 119661 119305 118991 118729 118515 118290
4983 118290 117959 117472 116895 116402 116187 116349 116786 117213 117304 116906 116140 115273 114507 113926 113604 113674 114300 115586 117494
4964 117494 119853 122466 125218 128082 131029 133915 136466 138420 139707 140519 141156 141795 142395 142860 143224 143653
4948 143653 144285 145120 146087 147189 148549 150300 152493 155112 158089 161311 164668 168061 171318 174115 176040
4933 176040 176768 176269 174887 173193 171711 170724 170219 169966 169703 169277 168673 168021 167565 167554 168097 169088 170260 171350
4915 171350 172273 173163 174278 175853 177985 180562 183271 185713 187542 188576 188854 188600 188067 187393 186572 185524
4899 185524 184170 182469 180418 178078 175648 173461 171835 170901 170598 170800 171388 172212 173070 173772 174187 174218 173791
4882 173791 172891 171597 170102 168661 167458 166577 166057 165929 166186 166785 167690 168868 170260 171743 173123 174215
4866 174215 174942 175337 175469 175425 175319 175247 175225 175264 175510 176232 177616 179603 181942 184326 186525 188428 189999 191190
4848 191190 191926 192183 192033 191615 191084 190594 190265 190146 190217 190459 190920 191676 192723 193946 195147 196139 196841 197304
4830 197304 197635 197907 198130 198245 198169 197855 197330 196677 195990 195355 194848 194523 194414 194534 194894 195549 196614 198238 200533
4811 200533 203519 207095 211094 215347 219755 224301 229006 233859 238816 243883 249209 255060 261698 269295
4797 269295 277942 287709 298639 310748 324082 338800 355165 373459 393871 416489 441366 468595
4785 468595 498274 530383 564642 600456 636895 672643 705965 734853 757414 772372 779415 779265
4773 779265 773487 764084 753061 742148 732790 726231 723495 725248 731759 743022 758867 778910 802393
4760 802393 828102 854423 879473 901245 917826 927710 930138 925282 914164 898350 879576 859412
4748 859412 839100 819562 801463 785222 771048 759011 749091 741210 735297 731363 729498 729782 732197
4735 732197 736615 742863 750819 760395 771393 783346 795477 806852 816629 824207 829244 831632 831520 829353
4721 829353 825814 821664 817563 813955 811018 808672 806670 804726 802636 800353 798008 795841 794010 792411
4707 792411 790682 788401 785300 781387 776946 772400 768093 764188 760656 757282 753715 749606 744758 739230
4693 739230 733374 727764 723063 719921 718912 720470 724776 731644 740453 750156 759443 767025 771858 773255
4679 773255 770996 765404 757261 747567 737272 727076 717345 708165 699518 691466 684160 677704 672017 666799
4665 666799 661557 655698 648675 640138 630000 618398 605642 592174 578583 565547 553666 543267
4653 543267 534322 526525 519450 512653 505738 498437 490691 482678 474746 467279 460585 454853 450138 446387
4639 446387 443505 441508 440646 441347 444033 448986 456348 466253 478972 494906 514408 537608 564411 594548
4625 594548 627507 662387 697863 732295 763858 790661 810915 823262 827152 823013 812146 796439
4613 796439 778027 758917 740713 724524 711090 700955 694562 692271 694328 700835 711745 726831
4601 726831 745572 767028 789778 812001 831667 846764 855535 856733 849873 835366 814412 788672
4589 788672 759911 729811 699905 671455 645286 621792 601164 583597 569336 558647 551722 548500
4577 548500 548523 551007 555037 559739 564339 568157 570559 570920 568652 563379 555102 544181 531162 516625
4563 516625 501177 485473 470136 455655 442390 430642 420705 412835 407202 403885 402959 404543 408767
4550 408767 415703 425344 437600 452267 468949 486961 505270 522549 537372 548453 554874 556263
4538 556263 552922 545837 536521 526702 517983 511607 508387 508738 512721 520009 529829 540970 551945 561302
4524 561302 567994 571590 572209 570274 566250 560468 553082 544195 534028 523025 511868 501412 492514 485850
4510 485850 481803 480433 481514 484583 488981 493959 498794 502765 505126 505256 502907 498276 491800 483868 474687
4495 474687 464352 453014 440961 428552 416103 403841 391943 380590 369953 360163 351292 343340
4483 343340 336267 330059 324753 320397 316995 314501 312841 311928 311654 311910 312588 313529 314435 314878 314416 312751
4467 312751 309802 305661 300489 294516 288052 281410 274792 268256 261734 255096 248248 241146 233738 225994
4453 225994 218004 209990 202203 194811 187793 180986 174286 167804 161790 156472 151980 148409 145861 144387
4439 144387 143886 144107 144759 145615 146528 147380 148030 148293 148010 147163 145904 144466 143053 141801 140797 140101 139696
4422 139696 139406 138918 137896 136140 133633 130470 126745 122497 117777 112770 107806 103187 99009 95146 91426
4407 91426 87805 84365 81145 77968 74498 70464 65825 60780 55670 50831 46485 42693 39366 36367 33643
4392 33643 31256 29280 27688 26381 25266 24288 23432 22744 22305 22160 22269 22562 22983 23474 23984 24503 25060 25708
4374 25708 26547 27761 29598 32269 35860 40342 45645 51687 58387 65700 73682 82554 92712 104628
4360 104628 118725 135366 154925 177744 203930 233137 264505 296932 329596 362291 395144 427925
4348 427925 459673 489044 515060 537643 557448 574994 589762 600106 604225 601417 592561 579379
4336 579379 563163 544085 521519 494992 464969 432842 400194 368042 336646 305910 275917 247157
4324 247157 220316 195920 174149 154896 137903 122835 109377 97356 86752 77559 69642 62732
4312 62732 56558 50951 45807 41014 36471 32103 27840 23662 19643 15917 12609 9840 7741 6405 5781
4297 5781 5614 5518 5149 4350 3188 1869 618 -419 -1189 -1671 -1858 -1811 -1723 -1851 -2370 -3308 -4594 -6132 -7838
4278 -7838 -9636 -11463 -13200 -14668 -15676 -16049 -15615 -14250 -11981 -9050 -5899 -3064 -1011 3 2 -678
4262 -678 -1481 -1861 -1536 -568 774 2230 3660 5022 6311 7517 8594 9448 10015 10366 10727 11402 12674
4245 12674 14735 17617 21169 25138 29292 33468 37535 41399 45026 48419 51551 54316 56567 58226 59412
4230 59412 60415 61489 62684 63895 65021 66066 67091 68150 69273 70432 71479 72192 72461 72415 72337 72467
4214 72467 72899 73619 74591 75799 77231 78862 80685 82751 85153 87967 91250 95077 99532 104666 110497
4199 110497 117052 124410 132677 141922 152161 163352 175376 188036 201169 214802 229158 244509
4187 244509 261010 278602 297028 316010 335431 355394 376107 397735 420350 444030 468931 495205
4175 495205 522871 551793 581787 612790 644974 678662 714130 751506 790852 832262 875889 921981
4163 921981 970907 1023152 1079249 1139725 1205137 1276171 1353665 1438530 1531657 1633976 1746578
4152 1746578 1870763 2008009 2159953 2328440 2515703 2724514 2958055 3219526 3511737 3836879
4142 3836879 4196657 4593086 5030013 5514774 6058834 6676863 7385198 8201485 9146432 10246867
4132 10246867 11538115 13064052 14874656 17021827 19553298 22502922 25876647 29638693
4124 29638693 33709445 37986656 42386638 46878702 51477554 56184949 60921442 65512597
4116 65512597 69756819 73529569 76833547 79735820 82233296 84167521 85277518 85360763
4108 85360763 84415583 82644385 80311584 77579272 74455127 70875751 66836431 62455294
4100 62455294 57927266 53421370 49014490 44705356 40479059 36362746 32434554 28791138
4092 28791138 25507471 22616361 20111013 17959097 16117163 14540472 13187892 12023482
4084 12023482 11016560 10141314 9376273 8703717 8109038 7580199 7107333 6682376 6298662
4075 6298662 5950625 5633619 5343798 5078020 4833740 4608862 4401589 4210292 4033435 3869568
4065 3869568 3717354 3575595 3443228 3319353 3203268 3094474 2992596 2897248 2807943 2724058
4055 2724058 2644903 2569857 2498524 2430766 2366567 2305844 2248312 2193493 2140871 2090080 2040962
4044 2040962 1993469 1947566 1903248 1860569 1819609 1780412 1742966 1707177 1672841 1639694 1607513
4033 1607513 1576191 1545689 1515956 1486937 1458656 1431174 1404479 1378513 1353290 1328913 1305469
4022 1305469 1282944 1261213 1240106 1219475 1199221 1179279 1159627 1140306 1121450 1103221 1085709
4011 1085709 1068914 1052810 1037371 1022520 1008109 993985 980081 966458 953269 940690 928843
4000 928843 917766 907423 897741 888615 879857 871185 862308 853028 843332 833429 823659 814282 805355 796807
3986 796807 788582 780662 773044 765739 758753 752026 745393 738616 731455 723767 715592 707130 698641 690341
3972 690341 682318 674544 666948 659495 652183 644994 637848 630673 623521 616599 610146 604233 598704 593330
3958 593330 587975 582617 577253 571837 566328 560818 555564 550830 546666 542868 539125 535210 531091 526904
3944 526904 522824 518943 515288 511868 508655 505567 502514 499452 496377 493293 490230 487227 484266 481243
3930 481243 478002 474410 470439 466225 462014 458087 454688 451974 449973 448572 447520 446516 445348 443952
3916 443952 442378 440709 439023 437406 435978 434878 434212 433993 434125 434450 434820 435137 435366 435555 435838 436477 437835
3899 437835 440256 443921 448850 455096 462909 472704 484902 499827 517683 538536 562252 588409 616333
3886 616333 645331 675014 705428 736739 768624 799943 829089 854861 877087 896341 912912 925958
3874 925958 933626 934123 926946 913300 895302 874624 851691 825983 797046 765335 732174 698970
3862 698970 666496 634852 603923 573811 544921 517781 492855 470461 450751 433699 419087 406546
3850 406546 395661 386062 377455 369640 362517 356076 350317 345136 340286 335446 330368 325026 319639 314548
3836 314548 310052 306280 303143 300399 297808 295261 292781 290454 288400 286760 285666 285229 285531 286575 288232
3821 288232 290308 292657 295221 297959 300736 303269 305149 305935 305321 303271 300007 295883 291282 286529 281837
3806 281837 277335 273149 269433 266318 263844 261924 260341 258815 257140 255316 253537 252022 250856 249995 249402
3791 249402 249151 249370 250089 251169 252375 253483 254336 254842 254959 254717 254214 253519 252620 251493 250159 248687 247186
3774 247186 245814 244734 244056 243801 243854 243924 243588 242501 240594 238103 235427 232988 231123 229970 229387 229033 228550
3757 228550 227725 226524 225045 223409 221699 219981 218366 216997 215968 215303 215015 215126 215601 216305 217104 217987
3741 217987 218997 220050 220876 221166 220742 219582 217738 215280 212303 208989 205629 202525 199887 197816 196320
3726 196320 195348 194809 194595 194584 194659 194746 194827 194925 195092 195368 195729 196095 196402 196654 196868 196970 196786 196150 195005 193420
3706 193420 191536 189496 187402 185322 183348 181637 180364 179601 179266 179191 179219 179250 179285 179440 179903 180815 182128 183583
3688 183583 184862 185735 186064 185761 184829 183401 181714 180020 178477 177107 175849 174646 173497 172437 171513 170813
3672 170813 170476 170590 171085 171734 172250 172396 172039 171181 169978 168693 167594 166839 166429 166256 166201 166163 166022 165652 164996
3653 164996 164138 163316 162826 162852 163374 164201 165045 165627 165813 165716 165640 165877 166494 167336 168174 168855 169350 169692 169926 170063
3633 170063 170054 169813 169265 168420 167409 166403 165487 164603 163630 162504 161244 159864 158322 156566 154595 152489 150387
3616 150387 148440 146782 145527 144771 144568 144904 145674 146675 147674 148499 149065 149316 149179 148593 147550 146144 144586
3599 144586 143128 141916 140903 139936 138939 138000 137278 136868 136766 136920 137273 137758 138264 138676 138943 139071 139031 138675
3581 138675 137790 136235 134046 131474 128914 126779 125336 124577 124243 124054 123902 123812 123794 123792 123747 123649 123509 123296 122917
3562 122917 122268 121336 120274 119335 118731 118521 118615 118843 119022 119026 118832 118530 118268 118150 118165 118169 117950 117383 116552 115711 115130
3541 115130 114976 115286 116016 117113 118584 120504 122968 126039 129703 133881 138559 143866 150043 157386 166221
3526 166221 176867 189601 204692 222311 242128 262700 281169 293835 297620 291681 277974 260181
3514 260181 241908 225516 211977 201334 193310 187681 184306 182947 183096 183907 184287 183169 179891 174478
3500 174478 167642 160419 153695 147936 143201 139306 136035 133252 130883 128824 126928 125081 123257 121527
3486 121527 119996 118706 117608 116639 115818 115244 115026 115199 115707 116416 117152 117752 118102 118193 118113 117934 117621 117065 116190
3467 116190 115024 113689 112328 111027 109792 108650 107731 107192 107085 107369 107994 108947 110213 111665 113003 113867
3451 113867 114053 113613 112795 111871 110972 110059 109042 107936 106909 106171 105791 105617 105380 104876 104113 103340 102915 103059
3433 103059 103696 104508 105155 105472 105470 105192 104599 103597 102156 100396 98540 96781 95214 93885 92827 92041 91456
3416 91456 90959 90521 90230 90221 90580 91345 92492 93896 95313 96482 97243 97568 97504 97098 96391 95468 94471 93529 92695
3397 92695 91947 91274 90768 90605 90947 91815 93005 94110 94720 94666 94092 93292 92516 91912 91553 91467 91619 91914 92294
3378 92294 92791 93463 94281 95140 95987 96904 98082 99733 102040 105142 109106 113934 119581 125969 132947 140165
3362 140165 146966 152486 156017 157400 157134 156114 155207 154876 155022 155114 154582 153189 151142 148900 146917 145496
3346 145496 144772 144724 145250 146249 147630 149297 151180 153294 155760 158803 162667 167429 172921 178894 185219 191882
3330 191882 198853 206088 213681 221902 231055 241333 252744 265134 278346 292392 307477 323884 341849
3317 341849 361513 383006 406564 432587 461614 494274 531214 573009 620156 673199 732866 800143
3305 800143 876293 962918 1062100 1176550 1309679 1465651 1649585 1867999 2129505 2445682
3295 2445682 2831862 3307182 3892926 4607861 5458660 6423617 7432304 8354556 9020341
3286 9020341 9279259 9073888 8474173 7638074 6730460 5866500 5102931 4455465 3918482 3478040
3276 3478040 3118350 2824342 2582607 2381907 2213435 2070701 1949033 1844922 1755488 1678209
3266 1678209 1610898 1551762 1499423 1452839 1411175 1373659 1339482 1307795 1277748 1248528 1219364
3255 1219364 1189519 1158321 1125257 1090158 1053327 1015433 977275 939598 902971 867729 834007
3244 834007 801875 771418 742700 715670 690130 665809 642438 619756 597530 575615 554017 532928
3232 532928 512701 493733 476307 460527 446393 433931 423179 414049 406294 399597 393650 388148 382780
3219 382780 377308 371691 366075 360624 355379 350240 345046 339701 334281 328979 323961 319301 314996 310976
3205 310976 307159 303519 300086 296862 293788 290818 287993 285457 283387 281864 280814 280112 279750 279904 280809
3190 280809 282552 284919 287419 289448 290549 290588 289725 288216 286248 283910 281257 278372 275364 272262 268954
3175 268954 265249 261012 256261 251195 246135 241410 237250 233778 231078 229220 228218 227973 228269 228870 229616
3160 229616 230491 231611 233144 235179 237681 240579 243862 247616 251995 257184 263370 270719 279360 289384
3146 289384 300851 313812 328331 344520 362570 382722 405043 428937 452525 472426 484526 485713
3134 485713 475650 457172 434819 412823 393946 379422 369469 363815 361928 363013 365966 369395 371703
3121 371703 371287 367014 358781 347645 335265 323134 312178 302773 294945 288546 283382 279268 276079 273749
3107 273749 272217 271376 271091 271230 271608 271914 271778 270903 269160 266644 263638 260489 257475 254756 252400 250389
3091 250389 248629 247046 245740 244983 245093 246325 248832 252646 257712 263947 271248 279471 288492 298271 308865
3076 308865 320380 332868 346248 360368 375192 390975 408221 427402 448615 471413 494897 518026
3064 518026 540069 560972 581341 602093 624095 647977 674098 702588 733433 766578 801984 839578
3052 839578 879177 920459 962954 1006052 1049072 1091366 1132415 1171936 1209940 1246673 1282444 1317462
3040 1317462 1351739 1385021 1416755 1446203 1472712 1495973 1516089 1533400 1548224 1560716 1570924
3029 1570924 1578914 1584788 1588604 1590341 1590011 1587797 1584118 1579550 1574665 1569895 1565482 1561566 1558344 1556140
3015 1556140 1555339 1556235 1558954 1563437 1569404 1576337 1583516 1590188 1595761 1599892 1602480 1603708 1604076 1604284 1604988
3000 1604988 1606612 1609337 1613138 1617706 1622341 1626012 1627561 1625957 1620478 1610764 1596760 1578642 1556816
2987 1556816 1531946 1504843 1476226 1446581 1416187 1385193 1353637 1321461 1288540 1254703 1219761
2976 1219761 1183597 1146282 1108153 1069767 1031810 994998 959938 926991 896236 867571 840832
2965 840832 815858 792515 770719 750429 731605 714165 698004 683009 669052 655996 643779 632544
2953 632544 622686 614752 609223 606343 606046 608009 611797 617021 623434 630929 639421 648777 658871 669662
2939 669662 681195 693586 707032 721784 738096 756149 775984 797411 819965 842934 865480 886749
2927 886749 905924 922285 935389 945270 952488 957947 962623 967362 972777 979090 985993 992718 998259 1001640
2913 1001640 1002123 999323 993203 984026 972337 958976 945014 931553 919486 909373 901424 895531 891291
2900 891291 888040 884941 881229 876494 870799 864609 858634 853692 850598 850064 852623 858597 868080 880865
2886 880865 896370 913690 931808 949842 967186 983537 998902 1013571 1028056 1042957 1058786 1075842
2874 1075842 1094160 1113515 1133411 1153092 1171627 1188001 1201209 1210395 1215094 1215482 1212390 1206974 1200272
2861 1200272 1192954 1185288 1177217 1168424 1158398 1146515 1132152 1114795 1094152 1070264 1043558 1014811
2849 1014811 984988 955076 926018 898631 873430 850576 830014 811631 795364 781241 769384
2838 769384 759947 753045 748715 746886 747333 749687 753516 758455 764291 770907 778112 785527 792669 799110 804622
2823 804622 809219 813056 816282 818969 821096 822477 822741 821465 818345 813273 806350 797871 788253 777906
2809 777906 767133 756152 745125 734149 723264 712506 701936 691596 681474 671568 662002 652989
2797 652989 644674 637074 630174 624015 618658 614110 610355 607440 605466 604490 604454 605185 606437 607990 609739
2782 609739 611714 614014 616742 620007 623960 628768 634513 641100 648270 655711 663154 670388 677228 683510
2768 683510 689118 693987 698112 701565 704482 707013 709264 711273 713066 714712 716314 717928 719468 720669
2754 720669 721165 720639 718915 715986 711997 707179 701783 696091 690464 685293 680882 677387 674819 673045 671784
2739 671784 670623 669134 667042 664358 661332 658269 655361 652692 650371 648606 647632 647505 647961 648518 648709 648234
2723 648234 647016 645154 642801 640046 636913 633491 629987 626625 623501 620533 617482 613968 609463 603364
2709 603364 595194 584841 572613 559106 545006 530901 517177 504019 491519 479773 468834 458496
2697 458496 448215 437328 425398 412347 398344 383667 368623 353501 338570 324086 310291 297365
2685 297365 285387 274326 264084 254524 245488 236878 228707 221036 213882 207211 200997 195257 190016 185206
2671 185206 180637 176083 171388 166527 161625 156891 152516 148606 145174 142155 139436 136940 134683 132736
2657 132736 131143 129858 128786 127852 127052 126435 126035 125826 125716 125601 125412 125120 124726 124260 123798 123442 123309 123516
2639 123516 124123 125049 126113 127149 128064 128802 129308 129551 129555 129408 129234 129158 129302 129811 130780 132144 133697 135226
2621 135226 136616 137879 139160 140702 142695 145106 147665 150066 152213 154288 156679 159860 164195 169747
2607 169747 176279 183425 190860 198378 205889 213351 220733 227980 234994 241651 247863 253607 258943 264017
2593 264017 268985 273926 278870 283928 289368 295497 302490 310340 318912 328039 337589 347488 357716 368262
2579 368262 379047 389899 400568 410767 420235 428760 436224 442652 448205 453118 457650 462046 466530
2566 466530 471305 476574 482545 489400 497258 506169 516169 527345 539776 553398 567931 582916 597780
2553 597780 611895 624663 635587 644305 650601 654376 655627 654457 651146 646221 640443 634659 629592 625712
2539 625712 623243 622247 622680 624382 627107 630636 634906 640017 646043 652826 659955 666910 673172 678310 682050
2524 682050 684233 684746 683542 680726 676575 671426 665513 658888 651546 643650 635628 628031 621318 615722 611253
2509 611253 607785 605173 603325 602202 601752 601833 602172 602413 602197 601199 599155 595913 591501 586126 580090 573702
2493 573702 567263 561082 555449 550568 546568 543605 541915 541749 543271 546497 551286 557358 564347 571882 579647
2478 579647 587361 594672 601090 606089 609311 610678 610341 608540 605533 601618 597180 592659 588461 584894 582225
2463 582225 580775 580968 583211 587704 594401 603158 613943 626901 642246 660133 680656 703859 729685
2450 729685 757924 788254 820382 854222 890028 928391 970124 1016146 1067353 1124402 1187450 1255915
2438 1255915 1328348 1402530 1475777 1545346 1608811 1664407 1711335 1749876 1781253 1807304 1830122
2427 1830122 1851727 1873863 1897939 1925078 1956161 1991842 2032641 2079159 2132274 2193143 2262987
2416 2262987 2342813 2433180 2534075 2644838 2764092 2889807 3019588 3151143 3282791 3413861
2406 3413861 3544795 3676932 3812058 3951905 4097758 4250229 4409162 4573744 4742803 4915151
2396 4915151 5089810 5266137 5443933 5623616 5806479 5994955 6192707 6404495 6635826 6892545
2386 6892545 7180603 7506042 7875099 8294367 8771058 9313208 9929694 10630144 11424790 12324165
2376 12324165 13338564 14477430 15748771 17158740 18711610 20410296 22257212 24254546
2368 24254546 26402528 28694204 31106178 33586956 36047532 38360929 40376002 41944467
2360 41944467 42951775 43338606 43105359 42302785 41017573 39358342 37441796 35378276 33259462
2351 33259462 31152320 29100391 27129687 25255333 23486414 21828521 20284760 18856157
2343 18856157 17541973 16339960 15246488 14256653 13364435 12562899 11844460 11201203 10625260
2334 10625260 10109211 9646404 9231034 8857968 8522493 8220089 7946303 7696752 7467322
2325 7467322 7254564 7056047 6870399 6697009 6535558 6385531 6245893 6115027 5990896 5871292
2315 5871292 5754119 5637687 5521009 5403958 5287191 5171881 5059342 4950648 4846358 4746460
2305 4746460 4650512 4557866 4467932 4380432 4295481 4213468 4134888 4060244 3989943 3924166 3862847
2294 3862847 3805747 3752575 3703080 3657085 3614454 3575061 3538775 3505411 3474696 3446328 3420097
2283 3420097 3395918 3373733 3353351 3334393 3316376 3298816 3281245 3263185 3244198 3223993 3202508
2272 3202508 3179844 3156097 3131187 3104770 3076296 3045199 3011178 2974416 2935582 2895655 2855740
2261 2855740 2816922 2780090 2745762 2714000 2684465 2656623 2629978 2604211 2579243 2555268 2532679
2250 2532679 2511898 2493270 2477039 2463322 2452059 2443049 2436092 2431070 2427902 2426473 2426578 2427875 2429922
2237 2429922 2432311 2434685 2436648 2437765 2437688 2436203 2433118 2428166 2421011 2411306 2398732 2383081 2364385 2343028
2223 2343028 2319762 2295558 2271369 2247952 2225803 2205136 2185865 2167667 2150152 2133017 2116097
2212 2116097 2099337 2082796 2066671 2051259 2036843 2023600 2011632 2001036 1991904 1984243 1977907 1972613
2200 1972613 1968036 1963918 1960160 1956872 1954404 1953294 1954151 1957491 1963571 1972216 1982715 1993823 2003924 2011360
2186 2011360 2014782 2013432 2007291 1997044 1983855 1969037 1953735 1938711 1924243 1910126 1895747 1880265
2174 1880265 1862899 1843181 1821046 1796790 1770999 1744462 1718063 1692666 1669065 1647943 1629837
2163 1629837 1615118 1604013 1596650 1593035 1593004 1596237 1602416 1611405 1623292 1638243 1656236 1676840 1699178
2150 1699178 1722096 1744362 1764780 1782318 1796280 1806345 1812465 1814751 1813409 1808722 1800982 1790375
2138 1790375 1776901 1760378 1740522 1717025 1689664 1658436 1623667 1586015 1546385 1505803 1465304
2127 1465304 1425900 1388578 1354227 1323557 1297068 1275028 1257412 1243966 1234422 1228670 1226713 1228496
2115 1228496 1233814 1242320 1253522 1266709 1280941 1295179 1308472 1320061 1329413 1336244 1340512 1342342 1341866
2102 1341866 1339128 1334094 1326721 1316954 1304708 1289864 1272276 1251804 1228358 1201969 1172854 1141448
2090 1141448 1108441 1074783 1041609 1010037 980940 954828 931918 912277 895883 882589 872087
2079 872087 863927 857604 852728 849111 846661 845204 844376 843627 842301 839784 835663 829866 822708 814759 806635
2064 806635 798864 791841 785809 780816 776689 773094 769650 765996 761829 756957 751408 745519 739821 734753
2050 734753 730450 726779 723477 720238 716758 712789 708171 702857 696921 690514 683769 676720 669303 661460
2036 661460 653220 644721 636153 627691 619466 611567 604041 596893 590111 583709 577701 571987 566283 560240
2022 560240 553651 546624 539575 533065 527602 523497 520840 519553 519474 520392 522053 524195 526638 529277 531975
2007 531975 534482 536455 537562 537595 536531 534532 531865 528777 525390 521633 517300 512236 506492 500304 493945
1992 493945 487592 481291 475012 468719 462372 455916 449286 442461 435541 428778 422528 417135 412811 409559
1978 409559 407218 405588 404516 403886 403580 403499 403541 403549 403329 402730 401660 400091 398100 395856 393558 391338 389211
1961 389211 387109 384933 382586 380012 377249 374378 371421 368318 364976 361334 357394 353205 348845 344473
1947 344473 340345 336711 333693 331270 329310 327617 326030 324514 323143 321962 320862 319636 318133 316332
1933 316332 314309 312197 310142 308253 306597 305258 304345 303916 303935 304305 304906 305638 306479 307511 308846 310521
1917 310521 312410 314251 315749 316684 316945 316553 315680 314632 313786 313504 314062 315571 317908 320771 323859 326971
1901 326971 329985 332901 335888 339206 343021 347334 352076 357220 362788 368784 375182 381989 389288 397221
1887 397221 405942 415597 426343 438383 451996 467512 485238 505428 528379 554564 584610 619134
1875 619134 658684 703880 755574 814858 882930 960992 1050210 1151555 1265283 1390093 1522375
1864 1522375 1655987 1782947 1895067 1986068 2053213 2097642 2123356 2135616 2139633 2139941 2140363 2144281
1852 2144281 2154999 2175930 2210622 2262775 2336305 2435304 2563683 2724373 2917825 3139434 3376188
1841 3376188 3604370 3791329 3903264 3917180 3830637 3662343 3442940 3203125 2966256 2746763
1831 2746763 2551820 2383871 2242851 2127678 2037006 1969505 1923980 1899396 1894788 1909078 1940768
1820 1940768 1987315 2044190 2104048 2156703 2190364 2194163 2161308 2091424 1990614 1869159 1738219
1809 1738219 1607184 1482492 1367722 1264303 1172259 1090846 1019035 955794 900169 851281 808329
1798 808329 770522 737001 706889 679467 654349 631452 610753 592056 574967 559053 544078 530078
1786 530078 517206 505508 494858 485054 475929 467392 459388 451844 444621 437538 430494 423521 416746 410301
1772 410301 404270 398670 393473 388670 384281 380314 376731 373441 370336 367330 364370 361431 358495 355546
1758 355546 352556 349476 346285 343058 339960 337142 334678 332546 330648 328851 327056 325247 323440 321612
1744 321612 319696 317651 315534 313503 311705 310169 308780 307375 305829 304073 302070 299832 297472 295166
1730 295166 293060 291223 289671 288395 287364 286518 285750 284908 283885 282726 281631 280793 280215 279727 279136 278303
1714 278303 277172 275796 274331 272955 271800 270916 270246 269662 269064 268433 267792 267150 266495 265818 265096 264238 263118
1697 263118 261666 259915 257950 255834 253630 251507 249737 248528 247843 247443 247147 246999 247185 247814 248786 249822
1681 249822 250584 250799 250332 249223 247671 245929 244184 242537 241020 239637 238385 237285 236345 235502 234657 233781
1665 233781 232920 232099 231276 230407 229498 228563 227614 226703 225942 225460 225364 225707 226452 227452 228510 229498 230470 231605
1647 231605 232981 234440 235681 236465 236721 236535 236048 235410 234823 234555 234836 235698 236923 238150 239017 239272 238871
1630 238871 238008 236995 236105 235491 235148 234857 234229 232921 230871 228357 225841 223755 222367 221752 221810 222281 222805
1613 222805 223030 222758 222034 221116 220291 219689 219240 218795 218265 217684 217192 216932 216930 217028 216970 216585 215868 214899 213754 212481
1593 212481 211125 209772 208597 207781 207394 207359 207506 207607 207481 207120 206706 206493 206675 207305 208289 209464 210722 212027
1575 212027 213321 214459 215308 215871 216279 216681 217185 217786 218301 218458 218077 217122 215636 213702 211451 209021 206499
1558 206499 203931 201404 199083 197118 195496 194067 192725 191521 190577 189962 189668 189669 189951 190502 191308 192364 193657
1541 193657 195162 196893 198879 201031 203105 204826 205998 206536 206512 206186 205941 206114 206796 207763 208588 208859 208307
1524 208307 206836 204554 201774 198915 196312 194116 192342 190966 189997 189437 189203 189093 188902 188571 188180 187831
1508 187831 187617 187642 187989 188661 189520 190279 190565 190074 188694 186571 184058 181564 179391 177638 176247 175140 174351
1491 174351 174015 174274 175158 176524 178123 179718 181140 182303 183226 183983 184617 185091 185319 185214 184718 183832 182617
1474 182617 181182 179672 178256 177100 176303 175838 175590 175435 175301 175173 175098 175142 175316 175524 175609 175467 175168 174963 175132
1455 175132 175791 176847 178050 179080 179677 179786 179562 179196 178763 178271 177762 177311 176939 176582 176124 175462 174555 173457
1437 173457 172322 171383 170867 170887 171396 172226 173179 174108 174959 175744 176467 177092 177579 177906 178088 178189 178264 178277 178095 177634
1417 177634 176975 176336 175888 175629 175412 175093 174636 174081 173449 172745 172044 171479 171112 170874 170638 170313 169896 169461 169085
1398 169085 168767 168433 168020 167556 167140 166851 166683 166541 166285 165843 165275 164717 164266 163958 163810 163824 163973 164220 164512
1379 164512 164794 165058 165338 165615 165788 165781 165656 165538 165480 165404 165187 164749 164046 163026 161681 160161 158788 157908 157717
1360 157717 158187 159158 160451 161912 163390 164730 165780 166406 166497 166012 164991 163499 161601 159424 157214 155273
1344 155273 153873 153205 153369 154366 156085 158295 160654 162776 164363 165260 165412 164776 163320 161119 158479 155921
1328 155921 153979 152913 152592 152615 152576 152253 151666 151020 150546 150352 150382 150523 150724 150996 151361 151806 152274 152669 152895
1309 152895 152937 152922 153068 153509 154200 154988 155774 156574 157446 158405 159378 160262 161004 161602 162006 162100 161808 161166 160326 159482
1289 159482 158799 158365 158166 158087 158015 157885 157627 157180 156575 155925 155324 154813 154461 154416 154827 155728 157003 158409 159636
1270 159636 160434 160734 160627 160249 159708 159076 158393 157683 156989 156402 156037 155935 156011 156149 156340 156665 157137 157617 157875
1251 157875 157712 157043 155950 154686 153559 152770 152364 152269 152330 152381 152340 152256 152231 152277 152269 152043 151553 150916 150289 149722 149133
1230 149133 148405 147478 146379 145231 144232 143562 143313 143475 143980 144723 145572 146407 147153 147797 148409 149134 150077 151209
1212 151209 152420 153587 154615 155473 156196 156811 157249 157343 156902 155804 154069 151899 149637 147635 146095 144997
1196 144997 144157 143339 142371 141218 140002 138951 138256 137937 137834 137733 137502 137109 136608 136130 135843 135863 136201 136752
1178 136752 137356 137906 138435 139106 140099 141497 143229 145074 146743 147996 148696 148836 148567 148145 147805 147673 147724 147796
1160 147796 147682 147290 146709 146110 145599 145157 144678 144066 143334 142654 142256 142233 142476 142813 143131 143365 143450 143331 142976 142377
1140 142377 141569 140644 139722 138894 138221 137731 137452 137473 137958 139039 140681 142664 144698 146511 147866 148581 148627 148155
1122 148155 147420 146672 146103 145845 145945 146359 146998 147746 148403 148643 148148 146846 144955 142821 140778 139146 138231
1105 138231 138251 139253 141079 143381 145717 147690 149068 149776 149795 149096 147726 145898 143979 142349 141211 140521
1089 140521 140139 140034 140308 141042 142188 143562 144908 145973 146579 146687 146428 146067 145895 146096 146617 147160 147338 146883
1071 146883 145735 143973 141764 139377 137111 135152 133548 132309 131490 131174 131382 132037 133024 134253 135635 137047
1055 137047 138356 139515 140601 141701 142762 143587 143967 143822 143269 142552 141860 141228 140593 139923 139264 138662 138089
1038 138089 137487 136820 136098 135415 134991 135082 135829 137121 138586 139775 140417 140531 140355 140198 140290 140705 141387 142191 142898
1019 142898 143281 143243 142914 142564 142463 142754 143404 144246 145093 145801 146267 146412 146194 145648 144889 144067 143343 142851 142609
1000 142609 142479 142253 141796 141153 140532 140159 140124 140310 140449 140296 139842 139316 138963 138793 138566 137998 137016 135810 134681
981 134681 133883 133575 133803 134463 135316 136067 136483 136489 136138 135507 134625 133479 132047 130349 128500 126708 125205 124185
963 124185 123796 124141 125242 126982 129062 131033 132437 132981 132636 131613 130275 129049 128332 128401 129348 131064 133261
946 133261 135559 137620 139265 140455 141184 141423 141184 140577 139817 139151 138724 138448 138084 137497 136803 136235 135898 135688
928 135688 135418 135000 134447 133755 132850 131647 130161 128577 127188 126213 125656 125279 124727 123714 122164 120228 118218
911 118218 116463 115178 114413 114077 114046 114249 114667 115258 115944 116656 117375 118089 118764 119387 119991 120600 121158 121536 121601
892 121601 121245 120423 119202 117758 116311 115067 114175 113708 113664 113973 114524 115198 115927 116731 117688 118851 120228 121819
874 121819 123632 125625 127681 129650 131371 132700 133551 133888 133670 132872 131548 129879 128162 126702 125698 125208
858 125208 125173 125422 125719 125886 125886 125817 125836 126069 126558 127281 128177 129167 130155 131023 131630 131850 131606 130867 129640 127965
838 127965 125930 123699 121475 119451 117776 116525 115692 115240 115133 115328 115760 116295 116737 116888 116641 116058 115344
821 115344 114731 114383 114384 114767 115559 116782 118409 120312 122277 124108 125710 127075 128199 129034 129490 129480 129007 128245
803 128245 127525 127188 127443 128289 129564 131066 132670 134379 136248 138218 140044 141399 142066 142029 141447 140541 139493
786 139493 138420 137431 136683 136370 136633 137475 138802 140523 142536 144650 146586 148107 149149 149781 150070 149963 149266
769 149266 147794 145555 142818 139965 137227 134568 131848 129038 126283 123837 121974 120851 120392 120335 120398 120430
753 120430 120418 120382 120269 119983 119544 119151 119033 119215 119485 119568 119333 118873 118402 118091 117969 118018 118319 119063 120385 122201
733 122201 124218 126050 127368 128005 128014 127651 127233 127008 127152 127788 128914 130337 131782 133028 133931 134373 134261 133591
715 133591 132449 130941 129129 127075 124894 122771 120905 119419 118332 117590 117086 116649 116067 115178 113975 112657
699 112657 111530 110838 110626 110760 111044 111344 111639 111943 112192 112272 112159 111954 111803 111864 112288 113192 114583 116311 118121
680 118121 119783 121220 122508 123781 125131 126527 127803 128737 129187 129150 128746 128158 127583 127148 126783 126177 124952
663 124952 122974 120488 117955 115754 114014 112673 111675 111041 110777 110791 110947 111124 111225 111237 111293 111617 112386 113612
645 113612 115124 116648 117936 118854 119370 119484 119220 118682 118077 117641 117529 117755 118215 118740 119136 119250 119041 118607
627 118607 118184 118076 118490 119385 120535 121725 122874 124007 125171 126430 127869 129504 131257 133064 134995 137253
611 137253 140031 143372 147181 151363 155913 160930 166650 173486 182036 193019 207073 224397 244274 264692
597 264692 282403 293755 296190 289575 276247 259621 242591 226838 212988 201071 190894 182217
585 182217 174765 168258 162503 157454 153136 149555 146677 144440 142749 141486 140528 139762 139111 138532 138018 137647
569 137647 137594 138083 139271 141121 143322 145330 146554 146622 145534 143614 141298 138928 136684 134640 132836 131336
553 131336 130220 129515 129133 128876 128527 127999 127361 126740 126239 125924 125824 125921 126177 126535 126871 126961 126573 125624 124260
534 124260 122756 121366 120266 119556 119240 119239 119459 119841 120360 120994 121686 122300 122659 122693 122503 122236 121939 121566 121068
515 121068 120463 119867 119472 119436 119776 120340 120877 121182 121177 120935 120669 120644 121028 121824 122935 124238 125568 126681 127326
496 127326 127377 126863 125862 124429 122658 120792 119212 118298 118236 118911 120002 121193 122278 123156 123828 124333 124660
479 124660 124742 124508 123921 123015 121924 120858 120028 119567 119440 119435 119270 118724 117694 116221 114488 112744 111196 109972
461 109972 109156 108821 109027 109758 110830 111920 112672 112800 112154 110787 108973 107154 105766 105006 104718 104554 104296
444 104296 103972 103723 103632 103700 103908 104220 104579 104919 105184 105341 105413 105499 105735 106174 106731 107242 107594 107801 107946 108057 108069
423 108069 107905 107564 107146 106791 106591 106582 106773 107166 107726 108330 108779 108914 108737 108404 108132 108089 108313 108704 109109 109451
403 109451 109759 110085 110404 110613 110612 110379 109989 109574 109239 109013 108869 108812 108912 109231 109751 110369 110944 111374 111656 111869
383 111869 112111 112427 112760 112964 112882 112421 111583 110470 109272 108216 107495 107185 107205 107355 107417 107211 106610 105588 104258
364 104258 102853 101625 100738 100240 100124 100395 101065 102071 103207 104181 104763 104898 104700 104305 103739 102934 101839 100522
346 100522 99171 97982 97037 96265 95555 94921 94529 94572 95128 96103 97269 98355 99154 99643 100009 100462 101022 101526
328 101526 101822 101887 101756 101451 101007 100506 100051 99722 99505 99280 98901 98289 97473 96583 95796 95298 95265 95835 97033 98716
308 98716 100617 102423 103852 104733 105059 104961 104564 103873 102837 101495 100024 98666 97607 96892 96405 95907 95159
291 95159 94074 92748 91377 90166 89290 88870 88942 89417 90071 90629 90873 90724 90231 89487 88587 87677 86932 86442 86143
272 86143 85945 85888 86068 86440 86803 86999 87078 87244 87655 88252 88773 88919 88516 87550 86136 84453 82684 80990 79516
253 79516 78365 77565 77060 76745 76526 76360 76195 75908 75326 74340 73025 71614 70375 69481 68981 68821 68892 69068 69258
234 69258 69420 69518 69478 69220 68679 67813 66643 65332 64156 63360 63035 63124 63521 64137 64898 65705 66453 67047 67388 67381
214 67381 66953 66082 64822 63294 61613 59819 57905 55929 54064 52511 51397 50730 50405 50259 50135 49930 49621
197 49621 49239 48811 48293 47560 46478 45010 43244 41347 39519 37969 36824 36042 35405 34629 33460 31699 29256
180 29256 26223 22852 19462 16337 13661 11468 9640 7964 6244 4402 2511 747 -729 -1868 -2726
165 -2726 -3433 -4162 -5098 -6360 -7946 -9792 -11830 -13959 -16028 -17915 -19603 -21178 -22781 -24587 -26728 -29171
149 -29171 -31637 -33715 -35110 -35788 -35960 -35940 -36006 -36334 -37032 -38132 -39584 -41297 -43200 -45299 -47675 -50419 -53546
132 -53546 -56980 -60561 -64109 -67505 -70739 -73875 -76992 -80140 -83310 -86365 -89033 -91045 -92328 -93014 -93315
117 -93315 -93472 -93776 -94492 -95740 -97479 -99594 -101923 -104286 -106542 -108648 -110640 -112611 -114719 -117142 -119935 -122961
101 -122961 -125990 -128863 -131586 -134278 -137033 -139850 -142680 -145493 -148259 -150938 -153537 -156176 -159046 -162255 -165733
86 -165733 -169275 -172682 -175884 -178943 -181955 -184926 -187789 -190522 -193218 -196006 -198913 -201832 -204617 -207232 -209794
71 -209794 -212500 -215502 -218808 -222293 -225795 -229210 -232509 -235728 -238980 -242479 -246464 -251054 -256167 -261575 -267042
56 -267042 -272409 -277577 -282455 -286961 -291066 -294797 -298202 -301306 -304105 -306609 -308857 -310917 -312889 -314925 -317202
41 -317202 -319840 -322853 -326185 -329784 -333613 -337601 -341640 -345627 -349517 -353328 -357098 -360809 -364397 -367833 -371171
26 -371171 -374520 -377995 -381682 -385597 -389665 -393750 -397726 -401562 -405352 -409259 -413412 -417797 -422255 -426604 -430749
11 -430749 -434703 -438527 -442253 -445870 -449382 -452848 -456346 -459911 -463501 -467019 -470384
0 -470384
$$ Imaginary data points
##PAGE= N=2
##DATA TABLE= (X++(I..I)), XYDATA
16383 40266 47872 55197 62328 69472 76869 84682 92967 101707 110799 120051 129247 138243 147013 155601
16369 155601 164055 172377 180549 188573 196504 204409 212320 220206 228005 235697 243346 251079 258994 267083
16355 267083 275231 283315 291295 299215 307137 315088 323052 331008 338962 346942 354959 363005 371068 379122
16341 379122 387128 395046 402865 410609 418315 425956 433423 440606 447494 454185 460828 467562 474485 481651
16327 481651 489079 496767 504695 512836 521176 529694 538329 546969 555489 563828 572050 580313 588752 597388
16313 597388 606107 614699 622954 630757 638131 645228 652262 659425 666837 674547 682539 690742 699027 707213
16299 707213 715101 722560 729601 736349 742949 749514 756123 762829 769673 776670 783798 790970 798067 804986
16285 804986 811685 818172 824437 830413 836048 841370 846474 851449 856343 861181 866011 870901 875861 880785
16271 880785 885490 889849 893895 897843 901975 906509 911547 917096 923071 929283 935468 941400 946979 952237
16257 952237 957260 962123 966835 971373 975771 980139 984625 989353 994375 999657 1005120 1010673 1016236 1021767
16243 1021767 1027246 1032614 1037776 1042667 1047331 1051919 1056605 1061471 1066455 1071399 1076179 1080779 1085247 1089621
16229 1089621 1093960 1098378 1103009 1107920 1113074 1118365 1123694 1129008 1134264 1139409 1144400 1149260 1154055 1158786
16215 1158786 1163370 1167719 1171809 1175654 1179254 1182571 1185591 1188408 1191228 1194267 1197651 1201371 1205294 1209194
16201 1209194 1212856 1216172 1219155 1221893 1224521 1227223 1230192 1233517 1237108 1240744 1244198 1247350 1250225 1252946
16187 1252946 1255656 1258473 1261472 1264657 1267930 1271083 1273885 1276221 1278131 1279702 1280967 1281952 1282810 1283809 1285163
16172 1285163 1286931 1289103 1291695 1294726 1298121 1301704 1305247 1308506 1311283 1313522 1315314 1316771 1317970 1319021
16158 1319021 1320130 1321520 1323294 1325373 1327565 1329700 1331711 1333629 1335492 1337272 1338876 1340214 1341277 1342174
16144 1342174 1343131 1344409 1346151 1348325 1350775 1353327 1355863 1358316 1360591 1362535 1364013 1365012 1365669 1366202 1366821
16129 1366821 1367668 1368816 1370293 1372082 1374092 1376182 1378197 1380004 1381522 1382714 1383592 1384238 1384740 1385105 1385262
16114 1385262 1385153 1384797 1384291 1383795 1383491 1383518 1383923 1384653 1385599 1386651 1387738 1388818 1389841 1390774 1391634 1392449 1393215
16097 1393215 1393899 1394480 1394954 1395296 1395465 1395496 1395547 1395798 1396306 1396988 1397696 1398305 1398730 1398894 1398730 1398270 1397680 1397158 1396826
16078 1396826 1396755 1397047 1397856 1399306 1401391 1403914 1406514 1408790 1410412 1411220 1411279 1410895 1410475 1410301 1410405 1410652 1410905
16061 1410905 1411111 1411263 1411374 1411445 1411425 1411216 1410777 1410206 1409664 1409226 1408830 1408356 1407753 1407075 1406427 1405894 1405540 1405463 1405811
16042 1405811 1406702 1408098 1409749 1411340 1412742 1414076 1415522 1417107 1418707 1420210 1421636 1423093 1424639 1426240
16028 1426240 1427799 1429158 1430098 1430445 1430179 1429442 1428477 1427561 1426915 1426617 1426576 1426632 1426698 1426795 1426943 1427102 1427215 1427225 1427062
16009 1427062 1426682 1426147 1425636 1425307 1425138 1424909 1424349 1423327 1421920 1420364 1418929 1417797 1417016 1416576 1416469 1416656 1417037
15992 1417037 1417527 1418122 1418913 1420031 1421538 1423342 1425227 1427004 1428611 1430047 1431244 1432084 1432492 1432461 1432016 1431235
15976 1431235 1430281 1429347 1428551 1427884 1427269 1426692 1426281 1426269 1426840 1428015 1429629 1431376 1432913 1434015 1434630 1434824 1434709
15959 1434709 1434439 1434195 1434064 1433970 1433759 1433359 1432849 1432370 1432020 1431807 1431698 1431652 1431610 1431503 1431304 1431050 1430784 1430502 1430201
15940 1430201 1429928 1429790 1429918 1430403 1431244 1432360 1433656 1435068 1436563 1438147 1439867 1441798 1443964 1446255 1448443
15925 1448443 1450310 1451754 1452774 1453418 1453774 1453970 1454174 1454531 1455071 1455644 1455975 1455853 1455309 1454605 1454009 1453605 1453292
15908 1453292 1452887 1452217 1451215 1449972 1448709 1447715 1447217 1447250 1447659 1448242 1448887 1449569 1450232 1450737 1450946 1450832 1450498 1450073
15890 1450073 1449645 1449297 1449133 1449221 1449488 1449708 1449657 1449244 1448517 1447564 1446440 1445212 1444010 1443020 1442440 1442471 1443278 1444880
15872 1444880 1447047 1449363 1451455 1453183 1454610 1455866 1457039 1458157 1459208 1460203 1461210 1462289 1463423 1464493
15858 1464493 1465342 1465877 1466137 1466267 1466389 1466468 1466333 1465818 1464865 1463514 1461854 1460027 1458223 1456638 1455379 1454414 1453643
15841 1453643 1453010 1452521 1452168 1451903 1451677 1451496 1451444 1451657 1452273 1453370 1454958 1456959 1459189 1461350 1463108 1464240
15825 1464240 1464708 1464623 1464186 1463638 1463181 1462921 1462848 1462886 1462960 1463044 1463154 1463291 1463427 1463540 1463632 1463711 1463775 1463820 1463865 1463957 1464139 1464416
15803 1464416 1464739 1465036 1465258 1465333 1465148 1464643 1463917 1463182 1462632 1462364 1462401 1462728 1463362 1464373 1465802 1467537 1469334 1470952
15785 1470952 1472227 1473056 1473396 1473300 1472935 1472512 1472161 1471884 1471592 1471185 1470618 1469898 1469021 1467968 1466772 1465548 1464430
15768 1464430 1463493 1462759 1462217 1461800 1461369 1460763 1459901 1458878 1457951 1457374 1457222 1457373 1457643 1457959 1458395 1459080 1460080 1461341
15750 1461341 1462670 1463789 1464477 1464672 1464431 1463866 1463106 1462222 1461196 1460020 1458785 1457642 1456717 1456070 1455729 1455750 1456186
15733 1456186 1457000 1458091 1459410 1461001 1462906 1465032 1467091 1468724 1469720 1470106 1470031 1469621 1469019 1468469 1468240 1468459
15717 1468459 1469041 1469783 1470530 1471245 1471944 1472591 1473068 1473240 1473032 1472518 1471897 1471365 1470989 1470702 1470402 1470062 1469811 1469886 1470451
15698 1470451 1471484 1472821 1474274 1475705 1476998 1478012 1478578 1478577 1478048 1477249 1476547 1476189 1476186 1476366 1476511 1476436 1476022 1475283
15680 1475283 1474395 1473600 1473072 1472859 1472916 1473183 1473663 1474423 1475485 1476761 1478126 1479521 1480989 1482609 1484387 1486191
15664 1486191 1487799 1488981 1489558 1489433 1488613 1487189 1485348 1483351 1481415 1479595 1477871 1476345 1475243 1474730 1474770
15649 1474770 1475143 1475523 1475573 1475066 1473980 1472468 1470745 1469000 1467367 1465950 1464853 1464214 1464173 1464763 1465862 1467306
15633 1467306 1468990 1470825 1472620 1474096 1475053 1475495 1475563 1475398 1475157 1475107 1475578 1476795 1478733 1481156 1483768 1486305
15617 1486305 1488553 1490354 1491626 1492381 1492734 1492870 1492977 1493181 1493490 1493801 1493985 1494002 1493908 1493759 1493543 1493233 1492847 1492424
15599 1492424 1491975 1491487 1491006 1490678 1490678 1491071 1491762 1492562 1493297 1493882 1494306 1494570 1494664 1494595 1494420 1494214 1494036 1493930 1493948 1494150
15579 1494150 1494589 1495230 1495893 1496343 1496480 1496431 1496406 1496481 1496552 1496476 1496218 1495877 1495607 1495521 1495610 1495768 1495898 1495965 1495961 1495888 1495772 1495655
15557 1495655 1495551 1495425 1495263 1495100 1494988 1494958 1495027 1495234 1495625 1496186 1496822 1497448 1498101 1498915 1499998 1501343 1502848 1504374
15539 1504374 1505803 1507024 1507908 1508321 1508200 1507613 1506756 1505877 1505194 1504834 1504858 1505299 1506131 1507204 1508262 1509032 1509341
15522 1509341 1509191 1508722 1508110 1507502 1506992 1506583 1506167 1505591 1504772 1503765 1502733 1501881 1501391 1501325 1501560 1501839 1501944 1501863
15504 1501863 1501786 1501931 1502385 1503084 1503899 1504686 1505319 1505705 1505802 1505635 1505277 1504794 1504224 1503631 1503126 1502784 1502602 1502565 1502667
15485 1502667 1502848 1502936 1502732 1502200 1501547 1501099 1501093 1501591 1502507 1503668 1504922 1506217 1507604 1509144 1510823 1512535 1514116
15468 1514116 1515370 1516132 1516327 1516019 1515365 1514547 1513719 1512980 1512375 1511941 1511735 1511806 1512149 1512669 1513195 1513559 1513678 1513573
15450 1513573 1513306 1512950 1512623 1512466 1512546 1512791 1512999 1512937 1512486 1511701 1510769 1509908 1509271 1508905 1508779 1508855 1509094 1509415 1509726
15431 1509726 1509978 1510185 1510405 1510701 1511140 1511785 1512680 1513775 1514923 1515985 1516946 1517921 1519094 1520633 1522587 1524837
15415 1524837 1527172 1529392 1531334 1532848 1533814 1534185 1534024 1533525 1532967 1532581 1532401 1532275 1532000 1531444 1530571 1529387 1527897
15398 1527897 1526156 1524396 1522983 1522183 1521997 1522232 1522693 1523273 1523914 1524530 1524994 1525234 1525328 1525482 1525925 1526772 1527965
15381 1527965 1529361 1530839 1532294 1533577 1534525 1535068 1535274 1535256 1535057 1534620 1533872 1532799 1531465 1530036 1528796 1528049
15365 1528049 1527986 1528675 1530118 1532248 1534879 1537728 1540520 1543122 1545535 1547770 1549754 1551335 1552317 1552532 1551954
15350 1551954 1550732 1549121 1547392 1545787 1544464 1543454 1542701 1542128 1541640 1541123 1540487 1539736 1538964 1538314 1537915 1537825 1537985
15333 1537985 1538242 1538432 1538431 1538140 1537482 1536480 1535311 1534214 1533353 1532785 1532518 1532532 1532747 1533035 1533302 1533529 1533751 1533983
15315 1533983 1534180 1534275 1534246 1534135 1534003 1533891 1533799 1533692 1533585 1533601 1533907 1534599 1535639 1536884 1538140 1539209 1539922 1540210
15297 1540210 1540124 1539810 1539448 1539191 1539121 1539199 1539254 1539088 1538662 1538179 1537961 1538220 1538942 1539947 1540990 1541840 1542335 1542426 1542187
15278 1542187 1541777 1541387 1541155 1541064 1540949 1540650 1540156 1539563 1538958 1538388 1537890 1537521 1537341 1537390 1537673 1538144 1538714 1539287 1539804
15259 1539804 1540245 1540638 1541056 1541595 1542362 1543466 1544949 1546703 1548491 1550087 1551399 1552472 1553408 1554300 1555197 1556110
15243 1556110 1557038 1557948 1558734 1559231 1559305 1558933 1558214 1557324 1556420 1555565 1554775 1554140 1553830 1553940 1554375 1554890 1555216 1555166 1554682
15224 1554682 1553861 1552922 1552107 1551585 1551386 1551395 1551432 1551365 1551166 1550886 1550581 1550296 1550074 1549968 1549997 1550137 1550380 1550775 1551374 1552139
15204 1552139 1552928 1553586 1554059 1554417 1554781 1555244 1555845 1556560 1557316 1558048 1558692 1559160 1559373 1559316 1559026 1558587 1558153 1557937 1558126
15185 1558126 1558769 1559740 1560803 1561752 1562520 1563182 1563880 1564704 1565623 1566510 1567223 1567646 1567704 1567376 1566738 1565954 1565171 1564436
15167 1564436 1563737 1563079 1562480 1561926 1561376 1560802 1560228 1559721 1559408 1559476 1560035 1560972 1561974 1562702 1562964 1562774 1562260 1561547
15149 1561547 1560713 1559807 1558897 1558078 1557435 1557030 1556957 1557327 1558163 1559338 1560654 1561972 1563232 1564366 1565269 1565853 1566093
15132 1566093 1566063 1565894 1565685 1565443 1565133 1564751 1564344 1563963 1563633 1563397 1563322 1563457 1563803 1564318 1564962 1565697 1566452 1567092 1567466
15113 1567466 1567483 1567159 1566577 1565855 1565110 1564462 1564025 1563922 1564245 1564966 1565915 1566882 1567747 1568496 1569131 1569669 1570216 1570930 1571894
15094 1571894 1573031 1574155 1575055 1575538 1575450 1574700 1573309 1571460 1569473 1567720 1566538 1566158 1566617 1567713 1569095 1570452
15078 1570452 1571654 1572718 1573672 1574495 1575133 1575511 1575538 1575141 1574313 1573171 1571931 1570824 1570026 1569603 1569494 1569545 1569602 1569559
15060 1569559 1569380 1569102 1568805 1568556 1568403 1568444 1568841 1569711 1570972 1572343 1573503 1574263 1574600 1574605 1574423 1574189 1574011 1573972 1574134
15041 1574134 1574524 1575153 1576025 1577064 1578080 1578858 1579340 1579697 1580213 1581089 1582325 1583746 1585127 1586284 1587079 1587429
15025 1587429 1587344 1586956 1586442 1585892 1585309 1584739 1584366 1584455 1585195 1586590 1588468 1590576 1592700 1594690 1596414 1597768 1598749
15008 1598749 1599447 1599972 1600454 1600998 1601593 1602093 1602326 1602199 1601731 1601029 1600265 1599640 1599283 1599165 1599172 1599254 1599445 1599770 1600179
14989 1600179 1600555 1600733 1600523 1599800 1598602 1597166 1595838 1594898 1594444 1594453 1594919 1595882 1597304 1599009 1600762 1602361 1603662
14972 1603662 1604573 1605038 1605047 1604675 1604112 1603605 1603311 1603219 1603195 1603093 1602836 1602441 1602005 1601672 1601549 1601639 1601825 1601945 1601898 1601723
14952 1601723 1601553 1601507 1601630 1601941 1602490 1603305 1604315 1605374 1606337 1607065 1607409 1607271 1606702 1605894 1605063 1604282 1603476 1602553
14934 1602553 1601528 1600530 1599682 1598980 1598321 1597690 1597238 1597173 1597587 1598411 1599497 1600696 1601880 1602932 1603780 1604400 1604778
14917 1604778 1604906 1604797 1604479 1603988 1603422 1603014 1603080 1603876 1605483 1607783 1610471 1613131 1615364 1616916 1617738 1617983 1617983
14900 1617983 1618132 1618690 1619620 1620604 1621243 1621333 1620988 1620488 1620071 1619856 1619867 1620058 1620345 1620622 1620776 1620718 1620421 1619925 1619329
14881 1619329 1618736 1618172 1617564 1616818 1615902 1614878 1613904 1613213 1613016 1613376 1614184 1615232 1616278 1617104 1617577 1617687 1617525
14864 1617525 1617226 1616894 1616577 1616322 1616239 1616455 1617006 1617801 1618656 1619345 1619633 1619343 1618452 1617091 1615435 1613608 1611720
14847 1611720 1609982 1608688 1608082 1608246 1609097 1610411 1611882 1613274 1614559 1615902 1617507 1619516 1621941 1624624 1627275
14832 1627275 1629566 1631252 1632282 1632826 1633169 1633504 1633798 1633881 1633651 1633139 1632435 1631611 1630723 1629849 1629079 1628479 1628093 1627952
14814 1627952 1628018 1628162 1628213 1628045 1627604 1626890 1625954 1624949 1624132 1623822 1624276 1625537 1627368 1629387 1631283 1632920 1634273
14797 1634273 1635343 1636164 1636809 1637371 1637928 1638552 1639297 1640186 1641179 1642169 1642994 1643471 1643430 1642786 1641606 1640102 1638563
14780 1638563 1637290 1636519 1636308 1636523 1636960 1637493 1638074 1638637 1639075 1639322 1639420 1639504 1639714 1640087 1640555 1641074 1641735 1642681 1643909
14761 1643909 1645210 1646330 1647195 1647985 1649001 1650482 1652476 1654800 1657126 1659122 1660578 1661465 1661916 1662124 1662207 1662143
14745 1662143 1661863 1661401 1660952 1660769 1660971 1661445 1661944 1662256 1662303 1662111 1661720 1661157 1660472 1659799 1659312 1659123 1659195 1659348 1659388
14726 1659388 1659224 1658864 1658323 1657577 1656622 1655514 1654373 1653353 1652595 1652126 1651794 1651372 1650744 1649965 1649132 1648272 1647395
14709 1647395 1646588 1645980 1645616 1645446 1645407 1645454 1645545 1645653 1645803 1646059 1646496 1647177 1648104 1649180 1650203 1650941 1651258 1651212 1651039
14690 1651039 1651005 1651255 1651742 1652326 1652949 1653645 1654429 1655249 1656047 1656778 1657363 1657735 1657952 1658186 1658565 1659038 1659418 1659561 1659499
14671 1659499 1659381 1659331 1659372 1659455 1659561 1659752 1660085 1660508 1660881 1661102 1661174 1661178 1661199 1661268 1661337 1661326 1661238 1661213 1661425 1661899 1662511 1663145
14649 1663145 1663780 1664399 1664876 1664972 1664470 1663348 1661870 1660504 1659724 1659800 1660684 1662040 1663408 1664425 1665009 1665317 1665513
14632 1665513 1665597 1665465 1665109 1664696 1664472 1664594 1665035 1665611 1666133 1666546 1666922 1667369 1667955 1668682 1669515 1670411 1671312 1672127 1672767
14613 1672767 1673201 1673519 1673963 1674830 1676240 1677953 1679470 1680362 1680508 1680103 1679497 1679021 1678834 1678850 1678819 1678511 1677833 1676800
14595 1676800 1675480 1674026 1672700 1671761 1671332 1671386 1671845 1672680 1673913 1675579 1677667 1680068 1682551 1684833 1686685
14580 1686685 1688004 1688807 1689203 1689352 1689380 1689281 1688918 1688128 1686889 1685397 1683974 1682888 1682198 1681736 1681230 1680502 1679600
14563 1679600 1678709 1677964 1677382 1676930 1676598 1676411 1676426 1676685 1677183 1677840 1678524 1679121 1679627 1680141 1680768 1681509 1682220 1682681 1682767
14544 1682767 1682520 1682075 1681565 1681116 1680858 1680873 1681138 1681580 1682181 1683032 1684253 1685859 1687707 1689550 1691149 1692313 1692887
14527 1692887 1692805 1692158 1691148 1689949 1688632 1687215 1685764 1684407 1683284 1682462 1681877 1681379 1680831 1680203 1679613 1679295
14511 1679295 1679446 1680088 1681076 1682230 1683448 1684711 1686036 1687458 1689021 1690731 1692497 1694154 1695556 1696648 1697472
14496 1697472 1698113 1698669 1699216 1699774 1700283 1700624 1700657 1700288 1699534 1698567 1697681 1697164 1697190 1697807 1698960 1700516 1702294 1704122
14478 1704122 1705835 1707257 1708230 1708713 1708832 1708771 1708638 1708427 1708078 1707558 1706912 1706281 1705847 1705729 1705907 1706279 1706751 1707265
14460 1707265 1707746 1708084 1708189 1708053 1707768 1707475 1707291 1707229 1707174 1706991 1706649 1706234 1705860 1705646 1705692 1705984 1706353 1706599 1706621 1706369
14440 1706369 1705746 1704668 1703216 1701660 1700334 1699507 1699329 1699778 1700666 1701765 1702947 1704186 1705475 1706798 1708133
14425 1708133 1709427 1710610 1711673 1712661 1713592 1714398 1714970 1715297 1715504 1715755 1716125 1716577 1717039 1717478 1717924 1718403 1718900
14408 1718900 1719365 1719706 1719830 1719714 1719399 1718914 1718239 1717387 1716453 1715506 1714508 1713390 1712214 1711198 1710590 1710478 1710674
14391 1710674 1710798 1710532 1709816 1708836 1707888 1707249 1707110 1707525 1708415 1709615 1710930 1712207 1713353 1714334 1715192 1716065 1717091
14374 1717091 1718275 1719484 1720534 1721284 1721690 1721829 1721879 1722047 1722444 1723014 1723604 1724160 1724831 1725855 1727329 1729126 1731007
14357 1731007 1732787 1734387 1735812 1737087 1738222 1739218 1740099 1740928 1741783 1742695 1743621 1744458 1745100 1745499 1745692 1745737 1745625
14340 1745625 1745255 1744521 1743437 1742151 1740820 1739502 1738167 1736744 1735142 1733308 1731322 1729404 1727782 1726555
14326 1726555 1725696 1725141 1724817 1724640 1724542 1724478 1724382 1724128 1723559 1722585 1721263 1719817 1718591 1717952 1718169 1719343 1721431 1724283
14308 1724283 1727672 1731317 1734916 1738204 1740979 1743086 1744438 1745068 1745148 1744893 1744476 1744034 1743682 1743482 1743423 1743478 1743669
14291 1743669 1744025 1744495 1744940 1745195 1745140 1744728 1743961 1742907 1741751 1740759 1740148 1739988 1740174 1740509 1740811 1740984 1741019 1740969 1740948
14272 1740948 1741087 1741447 1741978 1742549 1742993 1743164 1742975 1742407 1741509 1740441 1739477 1738912 1738907 1739438 1740330 1741334 1742248 1742987
14254 1742987 1743593 1744162 1744758 1745342 1745781 1745914 1745617 1744873 1743853 1742895 1742336 1742345 1742899 1743843 1744949 1746008 1746947 1747846
14236 1747846 1748821 1749911 1751070 1752205 1753241 1754147 1754935 1755627 1756237 1756796 1757357 1757979 1758695 1759494 1760338 1761172 1761919
14219 1761919 1762471 1762705 1762562 1762153 1761737 1761593 1761902 1762704 1763883 1765145 1766106 1766484 1766203 1765354 1764115 1762699 1761254
14202 1761254 1759798 1758318 1756937 1755965 1755753 1756473 1758020 1760072 1762223 1764113 1765524 1766436 1766968 1767224 1767226 1767016
14186 1767016 1766743 1766608 1766707 1766963 1767192 1767225 1766977 1766470 1765841 1765261 1764833 1764543 1764259 1763819 1763165 1762416 1761794 1761526 1761782
14167 1761782 1762596 1763816 1765151 1766285 1767003 1767287 1767350 1767538 1768100 1769009 1769990 1770707 1770949 1770735 1770263 1769770 1769428 1769294
14149 1769294 1769296 1769287 1769134 1768799 1768310 1767680 1766897 1765978 1764983 1763963 1762938 1761935 1761055 1760495 1760448 1760938 1761781 1762753 1763776
14130 1763776 1764924 1766273 1767762 1769233 1770566 1771731 1772751 1773630 1774298 1774653 1774659 1774399 1774023 1773670 1773444 1773407 1773582
14113 1773582 1773936 1774339 1774587 1774560 1774336 1774086 1773901 1773750 1773541 1773180 1772629 1771934 1771182 1770457 1769869 1769542 1769541 1769876 1770587
14094 1770587 1771745 1773348 1775259 1777250 1779076 1780546 1781560 1782137 1782419 1782598 1782797 1783054 1783410 1783921 1784596 1785321
14078 1785321 1785922 1786242 1786162 1785622 1784737 1783850 1783387 1783636 1784637 1786221 1788140 1790158 1792114 1793972 1795791 1797598
14062 1797598 1799326 1800872 1802155 1803118 1803732 1804047 1804196 1804337 1804565 1804859 1805107 1805205 1805120 1804890 1804589 1804285 1804009 1803768
14044 1803768 1803576 1803449 1803378 1803340 1803254 1802935 1802144 1800766 1798887 1796718 1794460 1792231 1790074 1788071 1786413 1785304
14028 1785304 1784831 1784950 1785576 1786634 1788035 1789643 1791297 1792897 1794471 1796124 1797913 1799709 1801205 1802104 1802329
14013 1802329 1802043 1801528 1801059 1800824 1800878 1801167 1801602 1802103 1802608 1803102 1803651 1804392 1805418 1806703 1808144 1809633 1811043
13996 1811043 1812224 1813076 1813609 1813894 1813989 1813907 1813653 1813294 1812992 1812967 1813383 1814238 1815389 1816665 1817921 1819031 1819883 1820402
13978 1820402 1820581 1820503 1820334 1820271 1820472 1820982 1821726 1822575 1823454 1824397 1825476 1826684 1827868 1828765 1829116 1828817 1827981 1826863
13960 1826863 1825722 1824740 1824016 1823601 1823522 1823763 1824246 1824862 1825512 1826113 1826615 1827046 1827487 1827942 1828272 1828302 1827949 1827243 1826284
13941 1826284 1825194 1824073 1822975 1821942 1821089 1820568 1820443 1820613 1820919 1821304 1821844 1822625 1823616 1824690 1825702 1826521
13925 1826521 1827049 1827272 1827296 1827292 1827394 1827605 1827832 1828039 1828333 1828871 1829706 1830727 1831699 1832380 1832638 1832492 1832046 1831412 1830681
13906 1830681 1829968 1829420 1829157 1829220 1829558 1830083 1830748 1831551 1832467 1833409 1834310 1835234 1836334 1837670 1839089 1840342 1841254
13889 1841254 1841788 1842019 1842105 1842206 1842404 1842685 1842979 1843242 1843508 1843867 1844352 1844887 1845337 1845601 1845634 1845390 1844842 1844062 1843224
13870 1843224 1842467 1841812 1841215 1840707 1840420 1840501 1841020 1841935 1843109 1844318 1845312 1845875 1845878 1845336 1844442 1843535 1842961 1842901 1843339
13851 1843339 1844153 1845240 1846548 1848044 1849655 1851196 1852433 1853245 1853747 1854220 1854944 1856036 1857404 1858799 1859909
13836 1859909 1860475 1860396 1859767 1858791 1857655 1856462 1855281 1854201 1853310 1852645 1852158 1851749 1851309 1850801 1850332 1850152 1850518
13819 1850518 1851495 1852906 1854492 1856081 1857621 1859088 1860464 1861785 1863161 1864712 1866476 1868379 1870284 1872017
13805 1872017 1873375 1874167 1874291 1873790 1872842 1871705 1870627 1869756 1869090 1868492 1867782 1866871 1865812 1864720 1863696 1862804
13789 1862804 1862070 1861509 1861179 1861203 1861682 1862583 1863710 1864770 1865483 1865713 1865523 1865115 1864700 1864396 1864220 1864162 1864284 1864707
13771 1864707 1865507 1866634 1867950 1869285 1870442 1871234 1871609 1871694 1871714 1871901 1872401 1873193 1874081 1874793 1875118 1874986 1874467 1873722
13753 1873722 1872931 1872242 1871735 1871456 1871472 1871855 1872560 1873393 1874134 1874659 1874961 1875074 1874994 1874680 1874170 1873653 1873368 1873436 1873795
13734 1873795 1874269 1874689 1874961 1875072 1875053 1874918 1874653 1874250 1873724 1873112 1872494 1871988 1871733 1871857 1872455 1873562 1875115 1876938
13716 1876938 1878786 1880407 1881624 1882378 1882725 1882765 1882604 1882371 1882212 1882255 1882583 1883203 1884021 1884889 1885671 1886277 1886656 1886824
13698 1886824 1886886 1887042 1887541 1888580 1890184 1892165 1894247 1896201 1897882 1899158 1899906 1900073 1899714 1898973 1898066 1897199
13682 1897199 1896499 1896010 1895733 1895677 1895891 1896450 1897385 1898622 1900026 1901473 1902870 1904122 1905113 1905720 1905869 1905571 1904884
13665 1904884 1903876 1902634 1901278 1899960 1898822 1897927 1897258 1896798 1896585 1896670 1897076 1897786 1898737 1899814 1900905 1901955
13649 1901955 1902977 1904046 1905251 1906646 1908213 1909825 1911284 1912428 1913186 1913499 1913308 1912685 1911902 1911257 1910837 1910510
13633 1910510 1910120 1909634 1909153 1908809 1908648 1908618 1908699 1908995 1909647 1910703 1912076 1913604 1915150 1916646 1918075 1919443 1920720
13616 1920720 1921808 1922606 1923137 1923535 1923880 1924106 1924110 1923909 1923639 1923444 1923361 1923294 1923039 1922401 1921348 1920069 1918869 1918021
13598 1918021 1917659 1917762 1918215 1918911 1919762 1920645 1921367 1921723 1921637 1921240 1920782 1920465 1920385 1920540 1920847 1921163 1921363 1921391 1921252
13579 1921252 1920948 1920472 1919854 1919170 1918497 1917884 1917390 1917119 1917210 1917778 1918810 1920113 1921374 1922332 1922894 1923130 1923199 1923265
13561 1923265 1923441 1923767 1924195 1924602 1924869 1924964 1924949 1924930 1924973 1925057 1925058 1924825 1924273 1923434 1922420 1921421 1920688 1920470 1920904 1921938
13541 1921938 1923368 1924948 1926491 1927872 1928986 1929759 1930198 1930413 1930575 1930842 1931271 1931781 1932222 1932479 1932543 1932531 1932605 1932841
13523 1932841 1933213 1933684 1934279 1935047 1936004 1937119 1938342 1939653 1941078 1942626 1944176 1945485 1946337 1946672 1946594 1946327
13507 1946327 1946167 1946418 1947268 1948667 1950330 1951878 1953025 1953658 1953817 1953632 1953255 1952843 1952545 1952466 1952582 1952727 1952680 1952316
13489 1952316 1951704 1951059 1950605 1950467 1950623 1950930 1951210 1951333 1951274 1951081 1950796 1950456 1950175 1950128 1950422 1950980 1951561 1951892 1951780
13470 1951780 1951185 1950230 1949160 1948219 1947535 1947073 1946718 1946359 1945943 1945494 1945072 1944741 1944574 1944647 1945010 1945690 1946722 1948114
13452 1948114 1949775 1951519 1953145 1954520 1955605 1956469 1957262 1958108 1959026 1959956 1960825 1961579 1962215 1962801 1963450 1964239 1965124
13435 1965124 1965964 1966645 1967186 1967685 1968161 1968491 1968536 1968298 1967963 1967784 1967922 1968371 1968958 1969415 1969538 1969311 1968859 1968350 1967932
13416 1967932 1967733 1967907 1968587 1969754 1971167 1972499 1973539 1974271 1974803 1975226 1975544 1975693 1975632 1975408 1975149 1974973 1974919 1974918
13398 1974918 1974852 1974663 1974388 1974086 1973768 1973409 1972996 1972539 1972054 1971584 1971222 1971085 1971240 1971676 1972350 1973259 1974430 1975832
13380 1975832 1977312 1978627 1979481 1979611 1978926 1977605 1976038 1974611 1973527 1972773 1972209 1971706 1971243 1970915 1970885 1971307 1972250
13363 1972250 1973656 1975353 1977103 1978700 1980068 1981263 1982325 1983159 1983653 1983852 1983961 1984188 1984614 1985204 1985875 1986572
13347 1986572 1987294 1988055 1988822 1989498 1989992 1990277 1990383 1990388 1990398 1990513 1990793 1991235 1991782 1992387 1993055 1993798 1994566 1995292 1996019
13328 1996019 1996909 1998098 1999539 2001025 2002333 2003340 2004047 2004531 2004858 2005029 2005004 2004787 2004437 2003995 2003465 2002872 2002333
13311 2002333 2002023 2002059 2002434 2003041 2003739 2004414 2005007 2005500 2005907 2006270 2006617 2006946 2007263 2007626 2008120 2008808 2009712 2010826
13293 2010826 2012098 2013420 2014647 2015622 2016202 2016296 2015929 2015273 2014601 2014157 2014055 2014237 2014523 2014725 2014745 2014610 2014435 2014363
13275 2014363 2014519 2015028 2015991 2017404 2019093 2020740 2022016 2022742 2022926 2022659 2022000 2021008 2019852 2018825 2018185 2018003
13259 2018003 2018180 2018601 2019199 2019914 2020626 2021178 2021430 2021327 2020922 2020347 2019783 2019453 2019521 2019974 2020675 2021515 2022499 2023678
13241 2023678 2025048 2026497 2027819 2028798 2029356 2029634 2029914 2030395 2031074 2031857 2032720 2033682 2034683 2035521 2035894 2035568 2034584
13224 2034584 2033286 2032096 2031237 2030671 2030257 2029913 2029612 2029358 2029242 2029477 2030271 2031666 2033498 2035498 2037405 2039026
$$ [...]
##END NTUPLES=NMR SPECTRUM
##END=
