##TITLE=Analysis number 320417
Compound Code tl 00744
Project Code adrs
Chemist Name prosynth
##JCAMPDX= 6.0         $$ Bruker NMR JCAMP-DX V2.0
##DATA TYPE= NMR SPECTRUM
##DATA CLASS= NTUPLES
##ORIGIN= Bruker BioSpin GmbH
##OWNER= nmr
$$ XWIN-NMR		Version 3.5
$$ Fri Jun 23 13:32:32 2006 GMT Daylight Time (UT+1h)  MAYBRIDGE\nmr@NMR_250MHZ
##.OBSERVE FREQUENCY= 250.131544655141
##.OBSERVE NUCLEUS= ^1H
##.ACQUISITION MODE= SIMULTANEOUS (DQD)
##.ACQUISITION SCHEME= undefined
##.AVERAGES= 16
##.DIGITISER RES= 18
##SPECTROMETER/DATA SYSTEM= dpx250
##.PULSE SEQUENCE= zg30
##.SOLVENT NAME= DMSO
##.SHIFT REFERENCE= (INTERNAL, DMSO, 0, 16.522)
##AUDIT TRAIL= $$ (NUMBER, WHEN, WHO, WHERE, WHAT)
$$ ##TITLE= Audit trail, XWIN-NMR		Version 3.5
$$ ##JCAMPDX= 5.01
$$ ##ORIGIN= Bruker BioSpin GmbH
$$ ##OWNER= nmr
$$ C:\u/data/dgb/nmr/ADRS/1350/pdata/1/auditp.txt
$$ ##AUDIT TRAIL=  $$ (NUMBER, WHEN, WHO, WHERE, WHAT)
(   1,<2006-06-23 13:32:09.39 +100>,<MAYBRIDGE\nmr>,<NMR_250MHZ>,
      <created by zg, POWCHK disabled, PULCHK disabled
       configuration hash MD5:
       E2 DF 36 D8 04 B2 41 60 5A D7 A3 38 5A 4B D0 FE
       data hash MD5: 64K
       09 4A 78 74 05 E9 4D 3D B2 89 F4 47 65 DB C1 CF>)
(   2,<2006-06-23 13:32:22.62 +100>,<MAYBRIDGE\nmr>,<NMR_250MHZ>,
      <Start of raw data processing
       ef LB = 0.3 FT_mod = 6 PKNL = 1 SI = 32K 
       data hash MD5: 32K
       F2 A8 83 67 F5 B5 6C 26 78 E2 43 1E 37 DF F5 5F>)
(   3,<2006-06-23 13:32:24.17 +100>,<MAYBRIDGE\nmr>,<NMR_250MHZ>,
      <apk 
       data hash MD5: 32K
       D8 FA 7E DB 5B 12 09 B5 8D 7C E4 E2 1F 8B 63 0E>)
(   4,<2006-06-23 13:32:24.90 +100>,<MAYBRIDGE\nmr>,<NMR_250MHZ>,
      <abs ABSG = 5 
       data hash MD5: 32K
       8C A9 75 1B 03 15 7D 0A A4 03 A8 99 4C 22 86 2E>)
$$ ##END=
$$ 
$$ hash MD5
$$ A5 8C 02 6E E8 33 AF 0A D8 A6 78 6B 2F 76 11 33
##$RELAX= 
##$RELAX= 
##$RELAX= 
##$RELAX= 
##$RELAX= 
##$RELAX= 
##$RELAX= 
$$ Bruker specific parameters
$$ --------------------------
##$DU= <C:\u>
##$EXPNO= 1350
##$NAME= <ADRS>
##$PROCNO= 1
##$TYPE= <nmr>
##$USER= <dgb>
##$AMP= (0..31)
100 100 100 100 100 100 100 100 100 100 100 100 100 100 100 100 100 100 
100 100 100 100 100 100 100 100 100 100 100 100 100 100 
##$AQSEQ= 0
##$AQ_mod= 3
##$AUNM= <au_zg>
##$AUTOPOS= <34 >
##$BF1= 250.13
##$BF2= 250.13
##$BF3= 250.13
##$BF4= 250.13
##$BF5= 500.13
##$BF6= 500.13
##$BF7= 500.13
##$BF8= 500.13
##$BYTORDA= 1
##$CFDGTYP= 0
##$CFRGTYP= 5
##$CHEMSTR= <none>
##$CNST= (0..31)
1 1 145 1 1 1 1 1 1 1 1 1 1 1 1 1 1 1 1 1 1 1 1 1 1 1 1 1 1 1 1 1 
##$CPDPRG= <>
##$CPDPRG1= <>
##$CPDPRG2= <>
##$CPDPRG3= <>
##$CPDPRG4= <mlev>
##$CPDPRG5= <mlev>
##$CPDPRG6= <mlev>
##$CPDPRG7= <mlev>
##$CPDPRG8= <mlev>
##$CPDPRGB= <>
##$CPDPRGT= <>
##$D= (0..31)
0 1 0 0 0 0 0 0 0 0.06 0 0 0 0 0 0 0.0002 0 0 0 0 0 0 0 0 0 0 0 0 0 0 
0 
##$DATE= 1151065926
##$DBL= (0..7)
120 120 120 120 120 120 120 120 
##$DBP= (0..7)
150 150 150 150 150 150 150 150 
##$DBP07= 0
##$DBPNAM0= <>
##$DBPNAM1= <>
##$DBPNAM2= <>
$$ [...]
##$SUBNAM6= <"">
##$SUBNAM7= <"">
##$SUBNAM8= <"">
##$SUBNAM9= <"">
##$SW= 20.6930455092707
##$SWIBOX= (0..15)
0 0 3 0 0 0 0 0 0 0 0 0 0 0 0 0 
##$SW_h= 5175.983436853
##$TD= 65536
##$TD0= 1
##$TE= 295.16
##$TE2= 300
##$TE3= 300
##$TEG= 300
##$TL= (0..7)
0 120 120 120 120 120 120 120 
##$TP= (0..7)
150 150 150 150 150 150 150 150 
##$TP07= 0
##$TPNAME0= <>
##$TPNAME1= <>
##$TPNAME2= <>
##$TPNAME3= <>
##$TPNAME4= <>
##$TPNAME5= <>
##$TPNAME6= <>
##$TPNAME7= <>
##$TPOAL= (0..7)
0.5 0.5 0.5 0.5 0.5 0.5 0.5 0.5 
##$TPOFFS= (0..7)
0 0 0 0 0 0 0 0 
##$TUNHIN= 0
##$TUNHOUT= 0
##$TUNXOUT= 0
##$USERA1= <user>
##$USERA2= <user>
##$USERA3= <user>
##$USERA4= <user>
##$USERA5= <user>
##$V9= 5
##$VALIST= <valist>
##$VCLIST= <CCCCCCCCCCCCCCC>
##$VD= 0
##$VDLIST= <DDDDDDDDDDDDDDD>
##$VPLIST= <PPPPPPPPPPPPPPP>
##$VTLIST= <TTTTTTTTTTTTTTT>
##$WBST= 1024
##$WBSW= 4
##$XGAIN= (0..3)
0 0 0 0 
##$XL= 0
##$YL= 0
##$YMAX_a= 456705
##$YMIN_a= -629613
##$ZGOPTNS= <>
##$ZL1= 120
##$ZL2= 120
##$ZL3= 120
##$ZL4= 120
##$ABSF1= 16.522
##$ABSF2= -4.171173
##$ABSG= 5
##$ABSL= 3
##$ALPHA= 0
##$AQORDER= 0
##$ASSFAC= 0
##$ASSFACI= 0
##$ASSFACX= 0
##$ASSWID= 0
##$AUNMP= <proc_1d>
##$AZFE= 0.1
##$AZFW= 0.1
##$BCFW= 0
##$BC_mod= 0
##$BYTORDP= 0
##$COROFFS= 0
##$CY= 12.5
##$DATMOD= 1
##$DC= 0
##$DFILT= <>
##$DTYPP= 0
##$F1P= 14.0000005364418
##$F2P= -0.99999901652339
##$FCOR= 0.5
##$FTSIZE= 32768
##$FT_mod= 6
##$GAMMA= 0
##$GB= 0
##$INTBC= 1
##$INTSCL= 1
##$ISEN= 128
##$LB= 0.3
##$LEV0= 0
##$LPBIN= 0
##$MAXI= 10000
##$MC2= 0
##$MEAN= 0
##$ME_mod= 0
##$MI= 0
##$NCOEF= 0
##$NC_proc= -3
##$NLEV= 6
##$NOISF1= 0
##$NOISF2= 0
##$NSP= 0
##$NTH_PI= 0
##$NZP= 0
##$OFFSET= 16.522
##$PC= 1
##$PHC0= 159.6627
##$PHC1= 9.01093
##$PH_mod= 1
##$PKNL= yes
##$PPARMOD= 0
##$PSCAL= 4
##$PSIGN= 0
##$REVERSE= no
##$SF= 250.13
##$SI= 32768
##$SIGF1= 0
##$SIGF2= 0
##$SINO= 400
##$SIOLD= 32768
##$SREGLST= <1H.DMSO>
##$SSB= 0
##$STSI= 32768
##$STSR= 0
##$SW_p= 5175.98343685301
##$SYMM= 0
##$S_DEV= 0
##$TDeff= 65536
##$TDoff= 0
##$TI= <Analysis number 999999
Compound Code 99
Book Reference 9
Project Code 9>
##$TILT= no
##$TM1= 0
##$TM2= 0
##$TOPLEV= 0
##$USERP1= <user>
##$USERP2= <user>
##$USERP3= <user>
##$USERP4= <user>
##$USERP5= <user>
##$WDW= 1
##$XDIM= 32768
##$YMAX_p= 275208241
##$YMIN_p= -83674
$$ End of Bruker specific parameters
$$ ---------------------------------
##NTUPLES= NMR SPECTRUM
##VAR_NAME=  FREQUENCY,     SPECTRUM/REAL,   SPECTRUM/IMAG
##SYMBOL=    X,             R,               I
##VAR_TYPE=  INDEPENDENT,   DEPENDENT,       DEPENDENT
##VAR_FORM=  AFFN,          ASDF,            ASDF
##VAR_DIM=   32768,         32768,           32768
##UNITS=     HZ,            ARBITRARY UNITS, ARBITRARY UNITS
##FACTOR=    0.157963299565203, 1,           1
##FIRST=     4132.6476996994, 0,             0
##LAST=      -1043.33573715361, 0,           0
##MIN=       -1043.33573715361, -83674,      0
##MAX=       4132.6476996994, 275208241,     0
$$ Real data points
##PAGE= N=1
##DATA TABLE= (X++(R..R)), XYDATA
$$ [...]
18522B8236914p74615n04700l05930j78001k53105m58648o73045r35969j329703
$$ 28236914 27462299 26957599 26651669 26473668 26220563 25761915 25088870 24152901 22823198
18513B2823198j685514j845447j975571k112624k063961j817897j491542j201592
$$ 22823198 21137684 19292237 17316666 15204042 13140081 11322184 9830642 8629050
18505H629050r41738p09948n67698m68445l73976l05678k85469k66402k34766
$$ 8629050 7687312 6977364 6409666 5941221 5567245 5261567 4976098 4709696 4474930
18496D474930k14837j93022j95345j91394j32730j37426j33288j39537j22205
$$ 4474930 4260093 4067071 3871726 3680332 3547602 3410176 3276888 3137351 3015146
18487C015146j12763j12436j07072j16611j06830j00901r1076q3123q7160o9382
$$ 3015146 2902383 2789947 2682875 2566264 2459434 2358533 2267457 2184334 2097174 2027792
18477B027792n6188n9341p7790m2586l3016n7252q0615o2435m5532n8283n3139
$$ 2027792 1971604 1912263 1834473 1791887 1758871 1701619 1621004 1558569 1513037 1454754 1401615
18466A401615m0710k3337q646m3935n8356l6366l1477l3096n365J0204K517l814
$$ 1401615 1360905 1337568 1328922 1284987 1226631 1190265 1158788 1125692 1120327 1130531 1133048 1129234
18454A129234k7467m2216k3336l3453m2540l1441l8771l6326m5648j7808l5056
$$ 1129234 1101767 1059551 1036215 1002762 960222 928781 890010 853684 808036 790228 755172
18443G55172k7939l1124l3677m0889m3263k4909l731Q607J74l8040l7770k5683
$$ 755172 727233 696109 662432 621543 578280 553371 549640 558247 558421 520381 482611 456928
18431D56928n196L264l603l1205L229p909j3329j0659j4056j0069j7183q483p276
$$ 456928 451732 454996 451393 420188 423417 415508 402179 391520 377464 367395 350212 341729 334453
18418C34453P503j0519m019P017j0815P537J0657k8897j7030J0122K0266l771
$$ 334453 341956 331437 327418 334435 323620 331157 341814 312917 295887 306009 326275 322504
18406C22504k0547j1471o780J532N718P76k3827k5390j9105j2828J1724r180m940
$$ 322504 301957 290486 283706 285238 290956 291732 267905 242515 223410 210582 222306 213126 208186
18393B08186K668L868P69q251l042K027K202Q750o665j4254o714K207j4581k3950
$$ 208186 210854 214722 215491 207240 204198 206225 208427 217177 210512 196258 189544 191751 177170 153220
18379A53220j546J3000P039N012Q436j3573l5933Q47L345N961J1649n861j3175
$$ 153220 151674 164674 171713 176725 185161 171588 135655 136502 139847 145808 157457 151596 138421
18366A38421O654j0589j3046o066j6157N982K665j2766k286L3011J4222j5928
$$ 138421 145075 134486 121440 115374 99217 105199 107864 95098 92812 125823 140045 124117
18354A24117j5171k1062J0753K4879M607l199n075j483p68L376p8N68L557k204
$$ 124117 108946 87884 98637 123516 128123 124924 119849 118366 117598 120974 120896 121464 125021 122817
18340A22817j0375l606p599L735K3189n265K51j765j8620M054j6436j6278J1173
$$ 122817 112442 108836 101237 104972 128161 122896 123147 121382 102762 106816 90380 74102 85275
18327H5275J460K047j1490l146L562r240l196K375J1704l103j9921l401Q440J3019
$$ 85275 86735 88782 77292 74146 77708 68468 65272 67647 79351 76248 56327 52926 61366 74385
18313G4385q712l0129j9495J0145K7378K6398k2209k5645j1187M815j1511j229
$$ 74385 65673 35544 16049 26194 53572 79970 57761 32116 20929 25744 14233 13004
18301A3004J5772N056j4316R490K506p257J2751O770k788J8007l474j13l036j0261
$$ 13004 28776 33832 19516 29006 31512 24255 37006 43776 40988 58995 55521 55408 52372 42111
18287D2111p708R860J9772j6749n287j5022k5441q056K270o00J5358L0934M690
$$ 42111 34403 44263 64035 47286 41999 26977 1536 -6520 -4250 -4850 10508 41442 46132
18274D6132j5597j300n05K757L518P794j049j6252k180k535J5845k0724q618q127
$$ 46132 30535 29235 28730 31487 35005 42799 41750 25498 23318 20783 36628 15904 7286 -841
18260h41R610j258m479o629J1918Q345J8079L37j990M402k088m089J401J1087
$$ -841 8769 7511 3032 -3597 8321 16666 34745 35082 33092 37494 35406 31317 32718 43805
18246D3805O959j9558j6125O687J339j8048M175J2647J646k029L006P723J814
$$ 43805 50764 31206 15081 21768 23107 5059 9234 21881 23527 21498 24504 32227 34041
18233C4041j0639K173k2497j3209j7321J1749J4715j932M304Q829o581q231k534
$$ 34041 23402 25575 3078 -10131 -27452 -15703 -988 -2920 1384 10213 3632 -4599 -7133
18220g133k486J7840K5510O176j9751j6877M469j7667K067R163J6886j0950k2826
$$ -7133 -9619 8221 33731 39907 20156 3279 7748 -9919 -7852 1311 18197 7247 -15579
18207a5579j4091o121l625n243M995R434J2412K1179R950J2475m778j4960j413
$$ -15579 -29670 -35791 -39416 -44659 -39664 -30230 -17818 3361 13311 25786 21008 6048 4635
18194D635o71J7880j0403j1579r760L477j612m835J987j1353N795J3254p134J1827
$$ 4635 3964 21844 11441 -138 -9898 -6421 -8033 -12868 -10881 -22234 -16439 -3185 -10319 1508
18180A508p77R374o452r592k390j9175r339J8093K9608K321n619J348p649m121
$$ 1508 731 10105 3653 -5939 -8329 -27504 -36843 -18750 10858 13179 7560 8908 1259 -2862
18166b862m045n857P708r581j2307L76r757n60Q856n884L810j0409o277q888J1229
$$ -2862 -6907 -12764 -5056 -14637 -26944 -26568 -36325 -36885 -28029 -33913 -30103 -40512 -46789 -55677 -44448
18151d4448J8030J0452j666r444o744K391J1412j5629K435Q159o442J582J2531
$$ -44448 -26418 -15966 -17632 -27076 -33820 -31429 -20017 -35646 -33211 -25052 -31494 -29912 -17381
18138a7381j0475k088j9540L52K1598M956Q974j2605O848J4608j395p43n821k47
$$ -17381 -27856 -29944 -49484 -49132 -27534 -22578 -13604 -26209 -19361 -4753 -6148 -6891 -12712 -12959
18124a2959J7632J5638J5165j8461q004j4329Q214N877p576j8077N97k269J3570
$$ -12959 4673 20311 35476 17015 9011 -5318 2896 8773 1197 -16880 -16283 -18552 -4982
18111d982K0923j095J2174Q857L987Q702Q149J3832j7903j5793N802J9013K9080
$$ -4982 15941 14846 27020 35877 39864 48566 56715 70547 52644 36851 42653 61666 90746
18098I0746K2355M0101J4783L830K8115J8287J8485K2713J0726P907P650q16n909
$$ 90746 113101 153202 167985 171815 199930 218217 236702 259415 270141 278048 285698 284882 278973
18085B78973J7700k490p493J6249J5858K340J7052J321k024J342Q026j156q340
$$ 278973 296673 294183 286690 302939 318797 321137 338189 339510 337486 338828 346854 345698 337358
18072C37358k1333k6140N061J843k7971k8431j7468k7990j9114J4741k268Q00
$$ 337358 316025 289885 294946 296789 268818 240387 222919 194929 175815 190556 188288 189088
18060A89088M21k0717n362l080j3641p822j7588j5630j0695j9025Q677J3425N214
$$ 189088 189509 168792 163430 160350 146709 138887 121299 105669 94974 75949 84626 98051 103265
18047A03265l0404j9306l860l438k2126Q349p153r488J1970O391J7048R859r517
$$ 103265 72861 53555 49695 46257 24131 32480 25327 15839 27809 34200 51248 61107 51590
18034E1590o403j0347m704J0438O540K6131K4168J7481K561n17J0394K2904L369
$$ 51590 45187 34840 30136 40574 47114 73245 97413 114894 117455 116938 127332 150236 153605
18021A53605p047J0908j5974k5013J4818O028O359q516O330J7388J9841J250j2467
$$ 153605 146558 157466 141492 116479 131297 137325 143684 135168 141498 158886 178727 179977 167510
18008A67510J096j5564k9083j1120J9709L609j2029k6023l49K865j8349k1872
$$ 167510 168606 153042 123959 112839 132548 136157 124128 98105 97756 100621 82272 60400
17996F0400L771p733R247j6684j3190J0833J537j3406j136J1715k1869l686l138
$$ 60400 64171 56438 65685 49001 35811 46644 48181 34775 33639 45354 23485 19799 16661
17983A6661R105j0602m977q608O139J116Q425l019j0429j7253j741M739J1334
$$ 16661 25766 15164 10187 1579 7718 8834 17259 14240 3811 -13442 -15183 -10444 890
17970H90q302M023R84k20P423j0519k8122J2121Q667l490K920j7808n411K2744
$$ 890 -7412 -3389 -2405 -2625 4798 -5721 -33843 -21722 -13055 -16545 -13625 -31433 -36844 -14100
17956a4100J2912P369J5406r765j8168j4744M818J8213m718l156K7807n56Q625
$$ -14100 -1188 6181 21587 11822 -6346 -21090 -16272 1941 -2777 -5933 21874 21318 29943
17943B9943o366j037m16j0787q810m46j2050k876j829J7976L431R143J1914J1058
$$ 29943 23577 22540 22124 11337 2527 2081 -9969 -12845 -14674 3302 6733 15876 27790 38848
17929C8848j8640l1145j3981J746J618j2096R890O656L290P664k166l482J1165
$$ 38848 20208 -10937 -24918 -23172 -21554 -33650 -23760 -17104 -13814 -6150 -8316 -11798 -633
17916f33M027j7462l616P50O853R5q140J9122J1693n953j1014P336q245J5704
$$ -633 3394 -14068 -17684 -16934 -10081 -9986 -18126 996 12689 6736 -4278 3058 -5187 10517
17902A0517J3218j0384K233J3509j0181k545L614j1639j787m524K641M211J1051
$$ 10517 23735 13351 15584 29093 18912 16367 19981 8342 6555 2031 4672 8883 19934
17889A9934p784r834q399P438p077J4577K2726P127Q128q497j1696l4822j310
$$ 19934 12150 2316 -6083 1355 -5722 8855 31581 38708 46836 38339 26643 -8179 -9489
17876i489p010M177K2263o681J7680J7503j7619k9161P139Q104j7571k0674J5286
$$ -9489 -16499 -12322 9941 3260 20940 38443 20824 -8337 -1198 6906 -10665 -31339 -16053
17863a6053J2059o755N676j677m201j8044J350Q120q685o49J8421R645r39o444
$$ -16053 -3994 -10749 -5073 -6750 -10951 -28995 -27645 -19525 -28210 -28859 -10438 -793 -1732 -8176
17849h176nJ6551P634p621j8007J2268q301R984j084M090J0838j6800j6060J3953
$$ -8176 -8181 8370 16004 8383 -9624 2644 -5657 4327 3243 7333 18171 1371 -14689 -736
17835g36J4010q732J1775K5532j2215o740m035m389q199j982R187j5863q003j199
$$ -736 13274 4542 16317 41849 29634 22894 18859 14470 6271 4289 13476 -2387 -10390 -11589
17821a1589J6483j3709k869J5096l805L718r36j0397l032J5215N572J9943o714
$$ -11589 4894 -8815 -11684 3412 -393 3325 2389 -8008 -11040 4175 9747 29690 22976
17808B2976j624P188k337l965k5465j9376P034L113K049K3216O072P028j3074
$$ 22976 21352 28540 26203 22238 -3227 -22603 -15569 -12456 -10407 12809 18881 25909 12835
17795A2835j5656q708q087q257J935J0212O159r806J3106O356l165Q227j7253
$$ 12835 -2821 -11529 -19616 -27873 -25938 -15726 -9567 -19373 -6267 89 -3076 5151 -12102
17782a2102k2628K1014J5407l825k724j429L612M638k3623J1932J9795J0218K438
$$ -12102 -34730 -13716 1691 -2134 -4858 -6287 -2675 1963 -21660 -9728 10067 20285 22723
17769B2723k0021j590l11O473J2330P255n594k7935l958L703r425L605q083m851
$$ 22723 2702 1112 801 7274 19604 26859 21265 -6670 -10628 -6925 -16350 -12745 -20828 -25679
17755b5679P260J3516O652K440R356J2912N092m487k067j5217k027k565j4900
$$ -25679 -18419 -4903 1749 4189 13545 26457 31549 27062 24995 9778 7751 5186 -9714
17742i714j6813j1078K7754K2257j0805q939m186o530L821R455R234L492n358
$$ -9714 -26527 -37605 -9851 12406 1601 -7338 -11524 -18054 -14233 -4778 4456 7948 2590
17729B590q443K598J3749J2765j6576p566J0872K21n374r38J4918n896j8201j0909
$$ 2590 -5853 -3255 10494 23259 6683 -883 9989 10210 4836 3898 18816 12920 -5281 -16190
17715a6190J3925K7959j113k222J2914J0889p68Q067j7876j6465J6664K7975j1841
$$ -16190 -2265 25694 24581 22359 35273 46162 45394 53461 35585 19120 35784 63759 51918
17702E1918J447n127j7611L775m603j9556j2935O857K546n657k711j012R877J4012
$$ 51918 53365 48238 30627 34402 29799 10243 -2692 4165 6711 1054 -1657 -2669 7208 21220
17688B1220N007j5970k2556r198J2746q929m438J482j2468p602J4681K1572K054
$$ 21220 26227 10257 -12299 -21497 -8751 -17680 -22118 -20636 -33104 -40706 -26025 -4453 -2399
17675b399K462r200K830J5740n184r325M374j2083J0113J0472Q424P135q351j5154
$$ -2399 63 -9137 -6307 9433 4249 -5076 -702 -12785 -2672 7800 16224 23359 15008 -146
17661a46j616j80k067K6093L941j6045M052m381j4194L421L658J649R113J3720
$$ -146 -1762 -1942 -4009 22084 26025 9980 14032 9651 -4543 -1122 2536 4185 13298 27018
17647B7018j2188k1069O386j3162r879Q445k92O326J1850m922m637K5662N687
$$ 27018 14830 -6239 147 -13015 -22894 -14449 -14741 -8415 3435 -1487 -6124 19538 25225
17634B5225k6894j3652Q558K0083O388j1362R195M446J2331r301Q492J5478M711
$$ 25225 -1669 -15321 -6763 13320 19708 8346 17541 21987 34318 25017 33509 48987 53698
17621E3698J0298R331j7430N665J5288m186K3913K5156M821L251K5181L6398K2269
$$ 53698 63996 73327 55897 61562 76850 72664 96577 121733 126554 129805 154986 191384 213653
17608B13653J1223M21N534O860P063l6406k7778m51j3365J837j2029l9140j9150
$$ 213653 224876 225297 230831 237691 244754 208348 180570 180119 166754 168591 156562 117422 98272
17595I8272o654n675K51j8927l0699k1446J4238P935M237R046L136q96j2280o476
$$ 98272 91618 85943 86194 67267 36568 15122 29360 37295 41532 50578 53714 52818 40538 34062
17581C4062N774J5653K011j7565k959m572j047j2320k104o167K8404R656l3973
$$ 34062 39836 55489 57500 39935 36976 32404 31357 19037 16933 10766 39170 48826 14853
17568A4853J8081L8760K6817J2202M052K0770K7313m106Q408j5613J9914J8829
$$ 14853 32934 71694 98511 110713 114765 135535 162848 158742 167150 151537 171451 190280
17556A90280r287p171j209j375J7059J49k9530k8987j5164n068p425j7744j5321
$$ 190280 180993 173822 172613 171238 188297 188446 158916 129929 114765 109697 102272 84528 69207
17543F9207l751J8645J4335k3484j0663q632L886K123o041n748j3714j0998O268
$$ 69207 65456 84101 98436 74952 64289 55657 59543 61666 55625 49877 36163 25165 31433
17530C1433l645J881r533l201J3149R00k2005r71J0736M491J1956L511M410P887
$$ 31433 27788 29669 20136 16935 30084 30984 8979 8008 18744 23235 35191 38702 43112 50999
17516E0999r540k7099k0428o690J6804n005m351K6724Q940j4719m566o837m409
$$ 50999 41459 14360 -6068 -12758 4046 -959 -5310 21414 30354 15635 11069 4232 -177
17503a77O051j7724j4832K4517O180q089q825J1132n768K089n561j4853J5356
$$ -177 5874 -11850 -26682 -2165 4015 -4074 -12899 -1767 -7535 -5446 -11007 -25860 -10504
17490a0504J5841j3889J706o093n072J4188J7862O68k06l980n89J0178J441j3418
$$ -10504 5337 -8552 -6846 -12939 -18011 -3823 14039 14707 14501 10521 9932 20110 21551 8133
17476H133n703n040K251J4697L9511l444j4348j5557k531j429k218O011R393k571
$$ 8133 2430 -2610 -359 14338 53849 50405 36057 20500 17969 16540 14322 20333 29726 27155
17462B7155j830n52j193n647q915R09O080J9585o661M582j0619k7418n326K1213
$$ 27155 25325 24773 23580 17933 9018 9927 16007 35592 28931 33513 22894 -4524 -9850 11363
17448A1363O583j0247J712M232L0J4339Q787j9421j0374J534N079o740n490J8321
$$ 11363 17946 7699 9411 13643 13673 28012 36799 17378 7004 8538 13617 6877 1387 19708
17434A9708K0169J2787k5160j5905M000K564P228J0484R464l470k5682j0314L51
$$ 19708 39877 52664 27504 11599 15599 18163 25391 35875 45339 41869 16187 5873 6224
17421F224k797K6918K3652q324j2418j6510j7962j428P168q082Q285K0921j173
$$ 6224 3427 30345 53997 45673 33255 16745 -1217 -2645 4523 -3559 4726 25647 24474
17408B4474n890j915j193j911k2553Q725K976j853Q056l898N751K1827J9984J517
$$ 24474 18584 16669 15476 13565 -8988 -263 2713 860 8916 5018 10769 32596 52580 54097
17394E4097l1135k7258L704L39P530j6411P591p71M626J2833J2461m285L182Q770
$$ 54097 22962 -4296 -592 -253 7277 -9134 -1543 -2314 2312 15145 27606 23321 26503 35273
17380C5273M514j0910p482o537M698M342L148Q083J5776J4172m675o804j1665
$$ 35273 39787 28877 21395 14858 19556 23898 27046 35129 50905 65077 60402 53598 41933
17367D1933l66k418M242O104K047L109j615r031P533N607M475R474k1643k1022
$$ 41933 41567 39149 43391 49495 51542 54651 53036 44005 51538 57145 61620 71094 49451 28429
17353B8429j9158j1653p088J4732n956J0945K3802j2034q745j5914l404r561l116
$$ 28429 9271 -2382 -9470 5262 -694 10251 34053 22019 13274 -2640 -6044 -15605 -18721
17340a8721P670K0864n610l666J5630J0404n639L29J5454j2325j1661Q605M945
$$ -18721 -11051 9813 4203 537 16167 26571 20932 21261 36715 24390 12729 21334 26279
17327B6279J2010j7385m684l333p11M573M679Q426l311o051R149q155L528K265
$$ 26279 38289 20904 16220 12887 12176 16749 21428 29854 26543 20492 29641 21486 25014 27279
17313B7279J101j4678J7276m524n297n573P011j202J0192J2103M572K54k217J0596
$$ 27279 28380 13702 30978 26454 21157 15584 22595 21393 31585 43688 48260 48514 46297 56893
17299E6893q12j1265Q305O325n289J073O660j7879P93L479j1101J190M244k228
$$ 56893 56081 44816 53121 59446 54157 55230 61890 44011 44804 48283 37182 38372 42616 40388
17285D0388j4759j4582J1076M256Q199p334R591j0375q854P152J1972o830j6133
$$ 40388 25629 11047 22123 26379 34578 27244 36835 26460 17606 24758 36730 29900 13767
17272A3767l113J8785J021M117N541j6998k0405J6552K2132P831P172J0675J0151
$$ 13767 10654 29439 30460 34577 40118 23120 2715 19267 41399 49230 56402 67077 77228
17259G7228k1831j1642J5822l102m800k518Q88o15K3629J1831R288M298r09l6111
$$ 77228 55397 43755 59577 56475 51675 49157 50045 49430 73059 84890 94178 98476 97567 61456
17245F1456N512j5882j1275m283p309n21N779K058R701J531k1825R592K1706l361
$$ 61456 66968 51086 39811 35528 28219 27698 33477 35535 45236 46767 24942 34534 56240 52879
17231E2879k105J1047L2865J4617m575M330J5617J0047j3884j1752R204o487j5344
$$ 52879 50774 61821 94686 109303 104728 109058 124675 134722 120838 109086 118290 111803 96459
17218I6459r808J3668K6512K308r075q143Q855J6059j0806r481Q326P243N749
$$ 96459 86651 100319 126831 129139 120064 111921 120776 136835 126029 116548 124874 132117 137866
17205A37866Q931k848j933j2635j8893J1080J3438J4542n240j3905r064p556j1992
$$ 137866 146797 143949 142016 129381 110488 121568 135006 149548 144308 130403 121339 113783 101791
17192A01791K0149K1875Q239j15j4885P945m808m0103J6579J6657J2077J7613
$$ 101791 121940 143815 152054 151939 137054 144999 140191 100088 116667 133324 145401 163014
17180A63014Q529j2603M900R020K5448J3314N261J6604J1372J7054K9552l042
$$ 163014 171543 158940 163840 172860 198308 211622 216883 233487 244859 261913 291465 288423
17168B88423k2972j6482J4912P248J2641M458M645L447m961J9725K0645K1736
$$ 288423 265451 248969 263881 271129 283770 288228 292873 296320 291359 311084 331729 353465
17156C53465K2633R424J3096J6856P26J1719K2181L6163L5589K8232L2575N8567
$$ 353465 376098 385522 398618 415474 416200 427919 450100 486263 521852 550084 582659 641226
17144F41226O2223N8318O2529P2775R3332Q7551J10876Q7316J20171J40230J67283
$$ 641226 703449 761767 824296 897071 990403 1077954 1188830 1276146 1396317 1536547 1703830
17133A703830J77933J97346K54312L58527N40331P36947R58947J088628R14143
$$ 1703830 1881763 2079109 2333421 2691948 3232279 3969226 4928173 6016801 6930944
17124F930944O22859N61001P44935J126540J698688K397656K991437L341672L550582
$$ 6930944 7553803 8114804 8859739 9986279 11684967 14082623 17074060 20415732 23966314
17115B3966314L566011L449125L262187L271992L308121K817101J544677l41276
$$ 23966314 27532325 30981450 34243637 37515629 40823750 43640851 45185528 44844252
17107D4844252k064913l101546l473553l230371l135738l622595m188738m167385
$$ 44844252 42779339 39677793 36204240 32973869 29838131 26215536 22026798 17859413
17099A7859413l497309k587746j809593j289453r20084o83658n09676l80698l26866
$$ 17859413 14362104 11774358 9964765 8675312 7755228 7071570 6561894 6181196 5854330
17090E854330k78266k29788j71515j57433j47717r7193o7524p0189o2512o4115
$$ 5854330 5576064 5346276 5174761 5017328 4869611 4772418 4704894 4634705 4572193 4508078
17080D508078k6170J9071O4744Q1205J03889J77769K64692M30882O11606Q63837
$$ 4508078 4481908 4500979 4565723 4646928 4750817 4928586 5193278 5624160 6235766 7099603
17070G099603J236595J757844K337457K924951L306304L534476L727880L819075
$$ 7099603 8336198 10094042 12431499 15356450 18662754 22197230 25925110 29744185
17062B9744185L802065L572252K988224J890812M09790q62227j661914k171396
$$ 29744185 33546250 37118502 40106726 41997538 42407328 41545101 39883187 37711791
17054C7711791k417638k713595l174615l588311l764540l438525k706128k029323
$$ 37711791 35294153 32580558 29405943 25817632 22053092 18614567 15908439 13879116
17046A3879116j506071j150423r39801q52706q01910p23573o64949o36271n62655
$$ 13879116 12373045 11222622 10282821 9430115 8628205 7904632 7239683 6603412 6040757
17037F040757m84188m20830l78933k86502k59626k28972k19221k04729j87179
$$ 6040757 5556569 5135739 4756806 4470304 4210678 3981706 3762485 3557756 3370577
17028C370577j72798j45076j22231j42011j30769j13537j01236r1116j11297p9404
$$ 3370577 3197779 3052703 2930472 2788461 2657692 2544155 2442919 2351803 2240506 2161102
17018B161102r3256j08040r3213n5030n6180o2713o0764o4690o0659m0320k0705
$$ 2161102 2067846 1959806 1866593 1811563 1755383 1692670 1631906 1567216 1506557 1466237 1445532
17007A445532o2133o7740l8823l8970m6622m8851m0195k3821k4951k8131m0476
$$ 1445532 1383399 1315659 1276836 1237866 1191244 1142393 1102198 1078377 1053426 1025295 984819
16996I84819l1274k9082k9630m0044j7956j0604o790k8671R98p154l2449k5720
$$ 984819 953545 924463 894833 854789 836833 826229 819439 790768 791766 784612 752163 726443
16984G26443K39K0548k4650k9413j0971k0187k6634m2448k2010j3119m0358k8902
$$ 726443 726682 747230 722580 693167 682196 662009 635375 592927 570917 557798 517440 488538
16972D88538K927k4598j9236n293r494j5675j7641j214k735l4795j6575l066o481
$$ 488538 491465 466867 447631 442338 432844 417169 399528 398314 395579 360784 344209 341143 334662
16959C34662j3118j8615Q237N899J073j6404j1796N187l688j3148J5200j3589
$$ 334662 321544 302929 311166 317065 318138 301734 289938 295125 291437 278289 293489 279900
16947B79900j4271L46M305J4394K3242p6J8553J6268L5848K8332L1850K7450R480
$$ 279900 265629 265975 270280 284674 307916 307840 326393 342661 378509 406841 438691 466141 475621
16934D75621o925J810j4465k585l2525m8120k1053k5985j3322k1411m3392l5561
$$ 475621 468696 470506 456041 453456 420931 372811 351758 325773 312451 291040 247648 212087
16922B12087p554l7153j4779R810J752r784k1918l602L994N753L355q645j9484
$$ 212087 204533 167380 152601 162411 164163 154379 132461 128859 132853 138606 141961 133316 113832
16909A13832N539m527J693Q33M217O814J5351K329j7388q957m133J142R733kJ3964
$$ 113832 119371 114844 116537 117370 121587 128401 143752 146081 128693 119736 115603 116745 126478 126476 140440
16894A40440K1491J1614r645p114j1923J7114J3229J5986K3097M8983K7221k139
$$ 140440 161931 173545 163900 156786 144863 161977 175206 191192 214289 263272 290493 288354
16882B88354K4846q193J0839J2414j0881j2195l0331k8378l8014k1008l3533p713
$$ 288354 313200 305007 315846 328260 317379 305184 274853 246475 208461 187453 153920 146207
16870A46207J0018j9742k9688p786l840j0842j8324o704J070M37R289N679L628
$$ 146207 156225 136483 106795 99009 95169 84327 66003 59299 60369 60806 70095 75774 79402
16857G9402K860J4810j945N72Q765n407J1642j6209j2959m645j5054O373K597
$$ 79402 82262 97072 95127 95699 104464 99057 110699 94490 81531 76886 61832 68205 70802
16844G0802J610j2375l694R724N917K539P009k161K975l330j4587j3867j6149
$$ 70802 72412 60037 56343 66067 71984 74523 81532 79371 82346 79016 64429 50562 34413
16831C4413N238n743P493l96p669j2312O150P453N537L530N251O292J8805J6543
$$ 34413 39651 33908 41401 41005 33336 21024 27174 34627 40164 43694 48945 55237 74042 90585
16817I0585j3470l3872j4339J8958M758J6184l584k9097o579J66j961J3463K968
$$ 90585 77115 43243 28904 47862 52620 68804 65220 36123 29544 29710 27749 41212 44180
16804D4180j0881J885p022l433j1558J614J6630J8223l245k1044n505Q00J2701
$$ 44180 33299 35184 28162 24729 13171 14785 31415 49638 46393 25349 19844 20644 33345
16791C3345j59k0199q105M89J9137J5970j6122j5072N539J5513j182J1766o08
$$ 33345 33186 12987 4882 5371 24508 40478 24356 9284 14823 30336 29154 40920 40312
16778D0312P461p542l5848j9492N919K1565j562P710K0286k779k9305Q239P544
$$ 40312 47773 40231 4383 -15109 -9190 12375 10813 18523 38809 36030 6725 14964 22508
16765B2508n647j5174J2789m873n203m602J0198J8015p565k3132j337K064J952
$$ 22508 16861 1687 14476 9603 4400 -202 9996 28011 20446 -2686 -4023 -1959 -7
16752gJ5029J2518p754M651q571r307j1489l684K307J9753m60M595J1427O949
$$ -7 15022 27540 19786 24437 15866 6559 -4930 -8614 -6307 13446 12986 17581 29008 35957
16738C5957n18j1681o328R447Q943J1319j8101k7552J2511q623j6062J6123P755
$$ 35957 35439 23758 17430 26877 35820 47139 29038 1486 13997 5374 -10688 5435 13190
16725A3190J2562l640P384o725n843J8305o657j4369j078Q869L347k4944j4222
$$ 13190 25752 22112 29496 22771 16928 35233 28576 14207 13129 21998 25345 401 -13821
16712a3821N017j1807J9901N165J394o537n880J3841J6740j9758n192L114O500
$$ -13821 -8804 -20611 -710 4455 5849 -688 -6568 7273 24013 4255 -937 2177 8677
16699H677o981r797J527n306m477J9693L2980LP02j8058k2711j1050p899l551
$$ 8677 1696 -8101 -6574 -11880 -16357 3336 36316 36319 37021 18963 -3748 -14798 -22697 -26248
16685b6248N617K1014L06l667j4562j9553K783L1746J5387N994j9473j5103J1770
$$ -26248 -20631 383 689 -2978 -17540 -37093 -34310 -2564 12823 18817 -656 -15759 -3989
16672c989K5994N706M232j923R275j8516p038j0927j2010J2031j2207k329J8492
$$ -3989 22005 27711 31943 30020 39295 20779 13741 2814 -9196 2835 -9372 -11701 6791
16659F791K3218r18P47o32j1061J1143L726O931k1193k1038M242J425P80n510
$$ 6791 30009 29091 29838 29206 18145 29288 33014 39945 18752 -2286 1956 3381 4161 -1349
16645a349R090J2811J8939J0955o557o924j297J3921Q162j5710p414p847k1651
$$ -1349 7741 20552 39491 50446 43889 36965 35668 49589 57751 42041 34627 26780 5129
16632E129K3578j701r511L335n568J1695K5461j15k4215j2118K2864J8387J6738
$$ 5129 28707 27006 17495 20830 15262 26957 52418 52303 28088 15970 38834 57221 73959
16619G3959Q332R290n935m808J2140J7332J7194K2838M7139L4969J4493J783j4997
$$ 73959 82291 91581 85646 80838 92978 110310 127504 150342 197481 232450 246943 248726 233729
16606B33729J1016K1233M987k5960j7132k2574l6003k7187J34k0217l0937m774
$$ 233729 244745 265978 270965 245005 227873 205299 169296 142109 142243 122026 91089 86315
16594H6315q374l327j1362n415n975J152J8462J2622j2229k1635o41J2581k5302
$$ 86315 77941 74614 63252 57837 51862 53014 71476 84098 71869 50234 49593 62174 36872
16581C6872j2719O862J4313J3162J7975p252l849N284j0086j0596Q31j232j223
$$ 36872 24153 31015 45328 58490 76465 69213 65364 70648 60562 49966 50797 49565 48342
16568D8342J5364K1183K6250K8610k383K486R477K2354M612K1947J0140K333Q591
$$ 48342 63706 84889 111139 139749 137366 139852 149329 171683 176295 198242 208382 210715 219306
16555B19306J1714M515L828j2659l9375k5488k8991j3898k4712j3919o583m291
$$ 219306 231020 235535 239363 226704 187329 161841 132850 118952 94240 80321 73738 69447
16543F9447r98l660j3301n529J1243Q009P256J0567j7446j9752P525J8012J2355
$$ 69447 68449 64789 51488 45959 57202 65211 72467 83034 65588 45836 53361 71373 83728
16530H3728q211k8060P514J7496M691p702k1880J133M194J8755j4631k0444j0962
$$ 83728 75517 47457 54971 72467 77158 69456 47576 48709 52903 71658 57027 36583 25621
16517B5621J4685J8615J325j679n455k1695J0612K2374L13r515k0093k729j209
$$ 25621 40306 58921 60246 58567 53112 31417 42029 64403 64716 55201 35108 32379 31170
16504C1170l35M417Q132K611O99l681M561O034j1675j5931j4103m241J876J1784
$$ 31170 30835 35252 43384 45995 46694 43013 47574 53608 41933 26002 11899 7658 9534 21318
16490B1318Q237L205N132k69m467m099j7980K702O582j5656Q286J3218J2597J1158
$$ 21318 29555 32760 37892 37623 33156 29057 11077 13779 20361 4705 12991 26209 38806 49964
16476D9964o009j3707m696q647J0765J499P115p816o154n071l852j1476n488n955
$$ 49964 43955 30248 25552 16905 27670 29169 36284 28468 22314 17243 13391 1915 -3573 -9528
16462i528j7597N407K9375K0323j2666M389j857j93M204L701P904j27k1790j5665
$$ -9528 -27125 -21718 7657 27980 15314 19703 17846 17653 21857 25558 33462 33335 11545 -4120
16448d120p273k254P578k278J467J4236P198J7872j1610L723n601j8273P110K3451
$$ -4120 -11393 -13647 -6069 -8347 -6880 7356 14554 32426 20816 24539 18938 665 7775 31226
16434C1226J3374N052L911j6867J69k5185k9439j484R226K1155J489Q502N978
$$ 31226 44600 49652 53563 36696 36865 11680 -17759 -19243 -10017 11138 12627 21129 27107
16421B7107j5700k2394m32Q072m182N138n186k393j2496K1022M76j0063J3408
$$ 27107 11407 -10987 -11419 -3347 -7529 -2391 -7577 -9970 -22466 -1444 -968 -11031 2377
16408B377J3228k4686J140O828J1920K801j85J8743J1286M790m787J2527O327
$$ 2377 15605 -9081 -7941 -1113 10807 13608 13423 32166 43452 48242 43455 55982 62309
16395F2309j2162p437l230j532P887J1111r950j3357N205j0202R693k224k5231
$$ 62309 50147 42710 39480 37948 45835 56946 46996 33639 38844 28642 38335 36111 10880
16382A0880p150n68J9641J4445j0849k671P789J9435n278k2191J2806r628M193
$$ 10880 3730 3162 22803 37248 26399 23728 31517 50952 45674 23483 36289 26661 30854
16369C0854J0599q131j3348R04j6274O574J807o278j1982j252J9997o318o230
$$ 30854 41453 33322 19974 20878 4604 11178 12985 6707 -5275 -6527 13470 7152 922
16356I22J356K5926J7497j4182j5618q85o694l653J7829r821j0532P723J1355
$$ 922 2278 28204 45701 31519 15901 15016 8322 4669 22498 12677 2145 9868 21223
16343B1223j324j895J125j4919M567m145Q936J1957j5k134k1963j1206J324N002
$$ 21223 19899 18004 19129 4210 8777 4632 13568 25525 25510 23376 1413 -9793 -8469 -3467
16329c467j1643j6862j7983K9312K2788n396K681J0434O980R929p656j2863j7156
$$ -3467 -15110 -31972 -49955 -20643 2145 -3251 -570 9864 16844 26773 19117 6254 -10902
16316a0902P884J2178j2198L0965p28p864k179M712R806O193N936p848k2726N401
$$ -10902 -3018 9160 -3038 27927 27199 19335 17156 21868 31674 37867 43803 35955 13229 18630
16302A8630K331M470Q78l632j4656R951O390N83l074J8228N618j2762j1234m626
$$ 18630 20961 25431 26309 22677 8021 17972 24362 24945 21871 40099 45717 32955 21721 17095
16288A7095P559q29k1427l069N220m984o473P203P523m73M425P868J4530J0416
$$ 17095 24654 23825 2398 -671 4549 -435 -6908 295 7818 7345 11770 19638 34168 44584
16274D4584K1778J0095k0114j1452j8124J174k3240J195J8330K01j391P369Q523
$$ 44584 66362 76457 56343 44891 26767 27941 4701 5896 24226 24427 23036 30405 38928
16261C8928j3243l828J7834q257k6281j0775M52J4131K8243O904j8522m767K795
$$ 38928 25685 21857 39691 31434 5153 -5622 -5170 8961 37204 44108 25586 20819 23614
16248B3614Q717O648r579k0942M495J0351O998M357J566j0478N411k062k0251
$$ 23614 32331 38979 29400 8458 12953 23304 30302 34659 36225 25747 31158 29096 8845
16235H845J3731Q605J67n304k5147Q778J8434O888j4511o299o020j3710j115K9502
$$ 8845 22576 31181 31348 26044 897 9675 28109 34997 20486 14187 8167 -5543 -6658 22844
16221B2844K2404M729l3768j1935m14L2642L3642j7382l2430j0903J6535M552
$$ 22844 45248 49977 16209 4274 3860 36502 70144 52762 20332 9429 25964 30516
16209C0516J0670Q14P990k290j0707k755K070o89j0870m133M923j1990o90J1522
$$ 30516 41186 42000 49990 47700 36993 34238 36308 35619 24749 20616 25539 13549 12859 24381
16195B4381K1105J9389j7685j8943n480j260J544n514m101j31M630K804M018L042
$$ 24381 45486 64875 47190 28247 22767 21507 23051 17537 13436 13305 17935 20739 24757 27799
16181B7799K347M282K1767K128j7828j4546M913J8136j9191J597J0739L445j271
$$ 27799 30146 34428 56195 58323 40495 25949 30862 48998 29807 31404 42143 45588 44317
16168D4317j2195P736K5160l281J9845J3301r74k305j1579J6762J4403M145L08
$$ 44317 32122 39858 65018 61737 81582 94883 93909 91604 80025 96787 111190 115335 115643
16155A15643j9028k2710j7172O921K276J2582m67j5564l887k984L8034R351p778
$$ 115643 96615 73905 56733 63654 65930 78512 78045 62481 58594 55610 93644 102995 95217
16142I5217K913m845L234p838j0013M778o799P415j7183p963J0936j725P49J7232
$$ 95217 98130 93285 96519 88681 78668 83446 76647 84062 66879 58916 69852 68127 68876 86108
16128H6108k631r918Q919J0570N770J2981J719j5327j1106r338M466O675Q69n221
$$ 86108 83477 73559 82478 93048 98818 111799 113518 98191 87085 77747 82213 88888 89757 84536
16114H4536M009R309R226j7185m264J4410J4338q75k5542k2506J7859J1259O786
$$ 84536 88545 97854 107080 89895 85631 100041 114379 113504 87962 65456 83315 94574 101360
16101A01360O869r519N052j156m32j0109Q568J2025j753j3661p516K4279P329
$$ 101360 108229 98710 103762 102606 102174 92065 100633 112658 110905 97244 89728 114007 121336
16088A21336N347k1098j8995j744K7418J1066p249j9768o209j1740j042K166k1114
$$ 121336 126683 105585 86590 84846 112264 123330 116081 96313 90104 78364 77322 79488 58374
16075E8374N301n073r773K1796J9533K1265j873r331o490R349r75j1147j2469
$$ 58374 63675 58602 48829 70625 90158 111423 109550 100219 93729 103078 102103 90956 78487
16062G8487j483Q060J6841j8467r410K392J4269O572J5657K636o242K570J0420
$$ 78487 77004 85064 101905 83438 74028 76420 90689 97261 112918 115554 109312 111882 122302
16049A22302J8225j588k043k4709J608K373m296O699k840P565J9227o921j1833
$$ 122302 140527 138939 136896 112187 113795 116168 111872 118571 115731 123296 142523 135602 123769
16036A23769n978P298L010J3489N731l149q026N15P806l292M261J793M229j239
$$ 123769 117791 125089 128099 141588 147319 144170 136144 136659 144465 141173 145434 147227 151456 150217
16022A50217j716j1292j0240q502L993Q707J2436P774J0765J0799N256K489j1821
$$ 150217 148501 137209 126969 118467 122460 131167 143603 151377 162142 172941 178197 180686 168865
16009A68865p846j070q527R157q286j106J5649J9766N391n577n774j705J013Q034
$$ 168865 161019 159949 151422 160579 152293 151187 166836 186602 191993 186416 180642 178937 179950 187984
15995A87984M580K8064n623k588K3652J5684J3755J7171K7552K8643M5365M2613
$$ 187984 192564 220628 215005 212417 236069 251753 265508 282679 310231 338874 384239 426852
15983D26852J3210P047J3572J5501m381j762j961o294j3377k7492k0608j369k1596
$$ 426852 440062 447109 460681 476182 471801 470039 468078 461784 448407 420915 400307 398938 377342
15970C77342j6710j8218j308j4178k667P081J706M011J4228j0193m13l126J6663
$$ 377342 360632 342414 341106 326928 324261 331342 333048 337059 351287 341094 340681 337555 354218
15957C54218L974q21j457J5466l435j1137J0369j8956j2652J0361Q434p593j7028
$$ 354218 358192 357371 355914 371380 367945 356808 367177 348221 335569 345930 354364 346771 329743
15944C29743j8651k552K5724K4884l434m310r535j3292k367Q097K2569J5569j6645
$$ 329743 311092 308540 334264 359148 355714 351404 341869 328577 326210 334307 356876 372445 355800
15931C55800j2031J1783j2401m138K8408N511q721m987r766K2955j25M715J2310
$$ 355800 343769 355552 343151 339013 367421 372932 364211 359224 349458 372413 372288 377003 389313
15918C89313J878L58J5361J4602o260o440j8842n09K4356K9859N177n110N710
$$ 389313 391191 391549 406910 421512 415252 408812 389970 389461 413817 443676 448853 443743 449453
15905D49453J4240l964K90J0162J7967N887L659l558L417J1694L293L019j1592
$$ 449453 463693 459729 460019 470181 488148 494035 497694 494136 497553 509247 512540 515559 503967
15892E03967j9040M611J1679O165j499k3774O728o210J386k961o993R873K2675
$$ 503967 484927 489538 501217 507382 505883 482109 488837 482627 484013 481052 474059 483932 506607
15879E06607J2192k0194Q749J7935J2724l477N931M023q789p131J3364L0691L2830
$$ 506607 518799 498605 507354 525289 538013 534536 540467 544490 535701 528570 541934 572625 605455
15866F05455J7996m649R528k1086r673n872L132J676N132r840K609P579K096J0830
$$ 605455 623451 618802 628330 607244 597571 591699 594831 596507 601639 591799 594408 601987 604083 614913
15852F14913l720J3235J1401J0219K3161k398n182J0078N000K922o916J5182O126
$$ 614913 611193 624428 635829 646048 669209 666811 661629 671707 676707 679629 672713 687895 694021
15839F94021J6443K0062K0080J5506P325J8318J7369J7908R832L0800J6450J1240
$$ 694021 710464 730526 750606 766112 773437 791755 809124 827032 836864 867664 884114 895354
15827H95354J3539K9580K4667M876K7571L492J4327K3488K3073M9925L2442J6912
$$ 895354 908893 938473 963140 968016 995587 999079 1013406 1036894 1059967 1109892 1142334 1159246
15815A159246P829K2337L4945J9656J6984J1639J3700J8200J1265L1953L1679
$$ 1159246 1167075 1189412 1224357 1244013 1260997 1272636 1286336 1304536 1315801 1347754 1379433
15804A379433M2999K3832J0619L7505M2549J5492K7549J4321K6812L5726L6119
$$ 1379433 1422432 1446264 1456883 1494388 1536937 1552429 1579978 1594299 1621111 1656837 1692956
15793A692956M1630L5778K7724L4680M8396N0846K6484M4127N1491M4531N0592
$$ 1692956 1734586 1770364 1798088 1832768 1881164 1932010 1958494 2002621 2054112 2098643 2149235
15782B149235N3194P2795P2676N9769L6574L3369P6862Q4310N3622O2441P6368
$$ 2149235 2202429 2275224 2347900 2407669 2444243 2477612 2554474 2638784 2692406 2754847 2831215
15771B831215P9765P4395Q5380R9896J31727J21001J08220J01848J01867J23772
$$ 2831215 2910980 2985375 3070755 3170651 3302378 3423379 3531599 3633447 3735314 3859086
15761C859086J38111J42192J55060J54292J62790J86249J99252J73468K02757
$$ 3859086 3997197 4139389 4294449 4448741 4611531 4797780 4997032 5170500 5373257
15752E373257K28989K66800K64684K71404K81595K97166L13408L57808L91052
$$ 5373257 5602246 5869046 6133730 6405134 6686729 6983895 7297303 7655111 8046163
15743H046163M30278M64707M60392M97262N46368O00981O56838P10806P92065
$$ 8046163 8476441 8941148 9401540 9898802 10445170 11046151 11702989 12413795 13205860
15734A3205860Q38027Q97910R81566J070599J167250J250285J388196J527136
$$ 13205860 14043887 14941797 15923363 16993962 18161212 19411497 20799693 22326829
15726B2326829J687145J825824J991881K198562K368173K575457K790955L019353
$$ 22326829 24013974 25839798 27831679 30030241 32398414 34973871 37764826 40784179
15718D0784179L247715L404427L522479L628094L644967L569754L405695L145998
$$ 40784179 44031894 47436321 50958800 54586894 58231861 61801615 65207310 68353308
15710F8353308K788084K317254J736925J143777N16997j25889p43243j351316
$$ 68353308 71141392 73458646 75195571 76339348 76856345 76730456 75987213 74635897
15702G4635897j901115k371017k733850k987348l147108l258017l276355l193508
$$ 74635897 72734782 70363765 67629915 64642567 61495459 58237442 54961087 51767579
15694E1767579l057613k908973k742582k568408k410259k226936k056720j890818
$$ 51767579 48709966 45800993 43058411 40490003 38079744 35852808 33796088 31905270
15686C1905270j761925j645501j503555j386192j303292j210662j104272j010568
$$ 31905270 30143345 28497844 26994289 25608097 24304805 23094143 21989871 20979303
15678B0979303r61529r30851q52794p97622p83922p20169o66416o54386o15886
$$ 20979303 20017774 19086923 18234129 17436507 16652585 15932416 15266000 14611614 13995728
15669A3995728n49906n30214n13927m86090m48293m26386m08493l75315l59366
$$ 13995728 13445822 12915608 12401681 11915591 11467298 11040912 10632419 10257104 9897738
15660I897738l46977l42313l14210l24363l10503k71764k56409k34332k24838
$$ 9897738 9550761 9208448 8894238 8569875 8259372 7987608 7731199 7496867 7272029
15651G272029k16612k18453k17051k09105j84066j88272j67290j56656j71600
$$ 7272029 7055417 6836964 6619913 6410808 6226742 6038470 5871180 5714524 5542924
15642E542924j69256j49555j36304j05419j20183j45494j52086j24979j33262
$$ 5542924 5373668 5224113 5087809 4982390 4862207 4716713 4564627 4439648 4306386
15633D306386j00341p3676j11234j07896q4886q3146j09735j02637p8804p0796
$$ 4306386 4206045 4132369 4021135 3913239 3828353 3745207 3635472 3532835 3454031 3383235
15623C383235p3781p2243n5213r0043j05227o8676o3189q8687o1210n5583o6971
$$ 3383235 3309454 3237211 3181998 3091955 2986728 2918052 2854863 2766176 2704966 2649383 2582412
15612B582412n7465o6124m2779n2176p1347n3440l8421k8539l9614l5811m4214
$$ 2582412 2524947 2458823 2416044 2363868 2292521 2239081 2200660 2172121 2132507 2096696 2052482
15601B052482l5987m7030m9072j7545k5359m9097n0437n8325m5908m5599j9278
$$ 2052482 2016495 1969465 1920393 1902848 1877489 1828392 1777955 1719630 1673722 1628123 1608845
15590A608845q526j3314k5335m2952k7539m3864l7057k4658k1075O72k5842j0871
$$ 1608845 1600319 1587005 1561670 1518718 1491179 1447315 1410258 1385600 1364525 1365197 1339355 1328484
15578A328484k1347l1962P1j4352k1424l5634n7898l0682k2726k2800j85r532
$$ 1328484 1307137 1275175 1275246 1260894 1239470 1203836 1145938 1115256 1092530 1069730 1069545 1060013
15566A060013l5330k1691k1836j608q384k2169l1331j8803l2459l1579j6202k546
$$ 1060013 1024683 1002992 981156 979548 971164 948995 917664 898861 866402 834823 818621 816075
15554H16075n195j0429j1302j479p534k5584j8380R695q280o977j1966r797j1816
$$ 816075 810880 800451 789149 787670 780136 754552 736172 745867 737587 730610 718644 708847 697031
15541F97031j2966j2319O40o313j6596l182N661j7221p584j9003j8284n067j968
$$ 697031 684065 671746 672386 666073 649477 646295 651956 634735 627151 608148 589864 584797 582829
15528E82829j4103j5368k3390R191O430J6951K311l2709l0661l618q437M900O348
$$ 582829 568726 553358 529968 539159 545589 562540 564851 532142 501481 497863 489426 494326 500674
15515E00674o188n571n965j0389k1275j3302K371p627l646K107O106Q193K025
$$ 500674 494486 488915 482950 472561 451286 437984 440355 432728 429082 431189 437295 445488 447513
15502D47513j8787j1285L751J4214O911J323K310M708j0101j7714l2690l001O327
$$ 447513 428726 417441 421192 435406 442317 443640 445950 450658 440557 422843 390153 387152 393479
15489C93479k902j4106j3466J7068Q704k1144j5194J0110K0855O901O936m502
$$ 393479 390577 376471 363005 380073 388777 367633 352439 362549 383404 390305 397241 392739
15477C92739j0106k1315j5460j6009k0021l223K3611m198j0870k0685L127J3921
$$ 392739 382633 361318 345858 329849 309828 306605 330216 326018 315148 294463 297590 311511
15465C11511J3075M715m373j7782j0071J5568k415K406m204l603l535J3366N740
$$ 311511 324586 329301 324928 307146 297075 312643 310228 312634 308430 304827 301292 314658 320398
15452C20398n352j3183j6241l580j0949j2218m757M589K3764J4712J7316K1933
$$ 320398 315046 301863 285622 282042 271093 258875 254118 258707 282471 297183 314499 336432
15440C36432K1416K1888P501K3795L5081m957j6405M920Q972K2883K2002j1587
$$ 336432 357848 379736 387237 411032 446113 441156 424751 429671 438643 461526 483528 471941
15428D71941l2787l2172l6859j9423j3939k1886j7974l1995j4044q481J36j0935
$$ 471941 439154 406982 370123 350700 336761 314875 296901 264906 250862 242381 242517 231582
15416B31582o855K5158j8200k2105k2614q527O063N400K366m516j3977j4349L288
$$ 231582 224727 249885 231685 209580 186966 178439 184502 189902 192268 187752 173775 159426 162714
15403A62714Q577J0256J900N111p343j3023o357j348l75J332j081R686L978r155
$$ 162714 171291 181547 183447 188558 181215 168192 161835 160487 160112 161444 160363 170049 174027 164872
15389A64872j7641k0726M852J2581P480J5669M429k2176l913o124J988o584n770
$$ 164872 147231 126505 131357 143938 151418 167087 171516 149340 145427 139303 141291 134707 128937
15376A28937Q149j1568q626l052M154o452J0666O898j2818n510L947J8982m52
$$ 128937 137086 125518 116892 113840 117994 111542 122208 129106 116288 110778 114725 133707 133255
15363A33255r360j6479J4401j3516q24K9234Q390k0475k3514o994J810o878P236
$$ 133255 123895 107416 121817 108301 107477 136711 145101 124626 101112 94118 95928 89050 96286
15350I6286k448m017J458K721O682N175J10j4125n517o953Q241k587q652P972
$$ 96286 93838 89821 91279 94000 100682 105857 105967 91842 86325 79372 87613 85026 76374 84346
15336H4346P316M054q481o504K850j2500k5484M846K959J2488O43j5803k013J2591
$$ 84346 91662 95716 87235 80731 83581 71081 45597 50443 53402 65890 66533 50730 48717 61308
15322F1308m690j1665M694J9623K9073n214n529j4073p327J7524j256j9627J7993
$$ 61308 56618 44953 49647 69270 98343 93129 87600 73527 66200 83724 82468 62841 80834
15309H0834j6657k7225K8631M727j2007m577J0227J6691R284j6539j3324m645
$$ 80834 64177 36952 65583 70310 58303 53726 63953 80644 89928 73389 60065 55420
15297E5420R648o02N912j2542j815N49J1673j2859J4220K125o994k5065o421L979
$$ 55420 65068 64466 70378 57836 56021 56570 68243 55384 69604 71729 64735 39670 33249 37228
15283C7228n805J4204j1604j82Q340j260k7362k0873K8881K6095Q821j3149k994
$$ 37228 31423 45627 34023 33841 42181 40921 13559 -7314 21567 47662 56483 43334 40340
15270D0340j1951l521j1284K2832J3724q17J5593r60n016N97q140r508O360J6107
$$ 40340 28389 24868 13584 36416 50140 49323 64916 63956 58940 59537 51397 41889 48249 64356
15256F4356m093k0220m357Q738R448l489o921K475Q18J8549J7680j7957j3964
$$ 64356 60263 40043 35686 44424 53872 50383 43462 45937 46755 65304 82984 65027 51063
15243E1063k663q586O737J3104J500R93k262J4064K241K754M573k3917l2185J2401
$$ 51063 48400 39814 46551 59655 61155 62148 59886 73950 76191 78945 83518 59601 27416 39817
15229C9817R062J5154K956q633M487j5853p819r91M679q568j1917N766N511J1355
$$ 39817 48879 64033 66989 58356 62843 46990 39171 38180 42859 34291 22374 28140 33651 45006
15215D5006K2263J0791q05j5292j1504j2508k367L501L855j6848l125Q291O492
$$ 45006 67269 78060 77255 61963 50459 37951 35584 39085 42940 26092 22967 31258 37750
15202C7750J2046R361k0830k867j6657j2474K0722J9549R623l588j349J0037J2663
$$ 37750 49796 59157 38327 35460 18803 6329 27051 46600 56223 52635 51286 61323 73986
15189G3986M859n816k4705k5114Q252P169K9768k866k8619l0828O032J6279J0930
$$ 73986 78845 73029 48324 23210 31462 38631 68399 65533 36914 6086 12118 28397 39327
15176C9327P439R542q029o679m231M252j946j7970o099q113r448P131Q804J7581
$$ 39327 46766 56308 48279 41600 37369 41621 39675 21705 15606 7493 -1955 5176 13980 31561
15162C1561q053J7524J0729M968J6477J9362j0939M042j408p798j7174j7867j0386
$$ 31561 23508 41032 51761 56729 73206 92568 81629 85671 84263 76465 59291 41424 31038
15149C1038J846R086m651j9598Q806j288m642M140J0021P44J6938J053k28k0898
$$ 31038 32884 41970 37319 17721 26527 25239 20597 24737 34758 35502 52440 53493 53265 32367
15135C2367j1053n348K441q600P407o318j1O962J456J2774N445j9454j6825M098
$$ 32367 21314 15966 18407 9807 17214 10896 10885 17847 19303 32077 37522 18068 1243 5341
15121E341Q648R900K2681N48j0629q631q562R126L83Q445n278p944k2901j0487
$$ 5341 13989 23889 46570 47118 36489 27858 19296 28422 28805 37250 31972 24028 1127 -9360
15107i360J7874l690K962N465j5355j677N036j2695K406j1091j472J8780J3077
$$ -9360 8514 4824 7786 13251 -2104 -3781 1255 -11440 -9034 -20125 -21597 -2817 10260
15094A0260J5544J7334m678k6859k8798J9677J8905q689K162J1714J154m705J4464
$$ 10260 25804 43138 38460 11601 -17197 2480 21385 12696 14858 26572 27726 23021 37485
15081C7485J4332j5590k0699l241J9064J8429K984k5444k4485k049k1052R30K0146
$$ 37485 51817 36227 15528 12287 31351 49780 52764 27320 2835 786 -20266 -19336 810
15068H10J3688J0509J2633O69j8503m982J23l82P661k1934n455K0353J1037l542
$$ 810 14498 25007 37640 38309 19806 14824 14947 14565 22226 292 -5163 15190 26227 22685
15054B2685P24K461m035j4541j8960k341j719Q964R625R497L048O920K8775k2371
$$ 22685 23409 25870 21835 7294 -11666 -14007 -15726 -6762 2863 12360 15408 22328 51103 28732
15040B8732j6985m906K324K0750J3093j7689l776J5468O850j0190j8073m686L579
$$ 28732 11747 6841 9165 29915 43008 25319 21543 37011 43861 33671 15598 10912 14491
15027A4491q597r115o91q433J3084K1672J6185p177l52k495j3814O765R862L345
$$ 14491 5894 -3221 -3912 -12345 739 22411 38596 31419 31067 28572 14758 21523 31385 34730
15013C4730R656K5176N29j1117k863j523j2108j4911j311N530M450p842J2448
$$ 34730 44386 69562 70091 58974 56111 54588 42480 27569 26258 31788 36238 28396 40844
15000D0844j0230m042o539J7618J8229l34M78M808j0028k1754k625K729m311L166
$$ 40844 30614 26572 20033 37651 55880 55546 56024 60832 50804 29050 26425 29154 24843 28009
14986B8009J1782J1336M249m373P28l545j225k1678j0585J0966j2146l497m796
$$ 28009 39791 51127 55376 51003 51731 48186 46961 25283 14698 25664 13518 10021 5225
14973E225j9290J0589l50q057O321J1209n582j0694l208J1337O231p810K59L0268
$$ 5225 -14065 -3476 -3826 -11883 -5562 5647 65 -10629 -13837 -2500 3731 -4079 -3820 26448
14959B6448N144%j5601r096m419K1349m279j5933O38l278L076J5917j347n104
$$ 26448 31592 31592 15991 6895 2476 23825 19546 3613 4251 973 4049 19966 18619 13515
14945A3515k5363j9783J8977K6300P412j9194K324O884q655L486O538K890q63
$$ 13515 -11848 -31631 -12654 13646 21058 1864 4188 11072 2417 5903 12441 15331 14468
14932A4468k3509J0146J3027J635P825j5232M652j8937J3964R692m542J1528l392
$$ 14468 -9041 1105 14132 15767 23592 8360 13012 -5925 8039 17731 13189 24717 21325
14919B1325p055o164j1218k227J5182L0742q387l1485j3148J0524J8856R136l7257
$$ 21325 14270 8106 -3112 -5339 9843 40585 32198 713 -12435 -1911 16945 26081 -11176
14906a1176j8406J4501K9511k920j7684m115L934o335l037o050k032P71K0817
$$ -11176 -29582 -15081 14430 11510 -6174 -10289 -6355 -12690 -15727 -21777 -23809 -23038 -2221
14893b221N284q299K827R001n897k352M851N359j2674j0302J0981j082P785P492
$$ -2221 3063 -5236 -2409 6592 695 -1657 3194 8553 -4121 -14423 -3442 -4524 3261 10753
14879A0753j5889q007P94K656o630L45R668N799r155o723k33J4285p556j1363
$$ 10753 -5136 -13143 -12349 -9693 -16323 -15978 -6310 -511 -9666 -16389 -16622 -2337 -9893 -21256
14865b1256Q634N788L990l775j4290Q59J2855K2660L046j7118p067m799J2974
$$ -21256 -12622 -6834 -2844 -6619 -20909 -20050 -7195 15465 18511 1393 -5674 -10473 2501
14852B501R203l893J1160m55J830r76j410K390K872J8933n188k8713K181N226
$$ 2501 11704 7811 18971 18516 20346 19370 17960 20350 23222 42155 36967 8254 10435 15661
14838A5661j0517j4648R873r15k219m68M964k331J0285L291j215k379r983r568
$$ 15661 5144 -9504 369 -546 -2765 -3233 1731 -600 9685 12976 11761 9382 -601 -10169
14824a0169q735Q446J0998j3519j1831j3811J0759L016J0593R615J1609L709j4847
$$ -10169 -18904 -10458 540 -12979 -24810 -38621 -27862 -24846 -14253 -4638 6971 10680 -4167
14811d167J0717p42j5884N874m881r029M642q374q269M418R656p67J4337J1464
$$ -4167 6550 5808 -10076 -4202 -9083 -18112 -13470 -21844 -30113 -25695 -16039 -16806 -2469 8995
14797H995J274K006l316J1765J180r986n630m102n794J7664Q945j4917j0076J238
$$ 8995 10269 12275 8959 20724 21904 11918 6288 2186 -3608 14056 23001 8084 -1992 -754
14783g54R39j5387m949Q004J0354r296j3212j8786j950J1806L4360j0165j7950
$$ -754 185 -15202 -20151 -12147 -1793 -11089 -24301 -43087 -45037 -33231 1129 -9036 -26986
14770b6986J0930Q080L793P687K0818J6617K934k6252n881m927Q174p786j5163
$$ -26986 -16056 -7976 -4183 3504 24322 40939 43873 17621 11740 6813 14987 7201 -7962
14757g962m483j9555J856K7499o625J3378L113j5610L836j3364j710M688j12Q725
$$ -7962 -12445 -32000 -30144 -2645 -9270 4108 7221 -8389 -4553 -17917 -19627 -14939 -15051 -6326
14743f326J90N66p586J3347J6309J2692j2463j3253m487j4897j6800J8029J6071
$$ -6326 -6136 -5570 -13156 191 16500 29192 16729 3476 -1011 -15908 -32708 -14679 1392
14730A392n361k0309J595M45J9271J8602m63j3682j8709R771O591l414j9300J1774
$$ 1392 -3969 -24278 -22683 -22238 -2967 15635 15172 1490 -17219 -7448 -857 -4271 -23571 -11797
14716a1797J4748p65n051o843j2095o817L024j7786q176J3611J5446J4349J9173
$$ -11797 2951 2186 -2865 -9708 -21803 -28620 -25596 -43382 -51558 -37947 -22501 -8152 11021
14703A1021p964M520k625Q856P4j9808j789j5414m206m550J0745R038J7631R123
$$ 11021 3057 7577 4952 13808 13882 -5926 -7715 -23129 -27335 -31885 -21140 -12102 5529 14652
14689A4652o733j3611j8977K974J8448L3761P916j3984j7128j6896r843j2201
$$ 14652 7919 -5692 -24669 -21695 -3247 30514 38430 24446 7318 -9578 -19421 -31622
14677c1622J1848j956q233K238O696P524J7813J1187j539q235r548j0890J0419
$$ -31622 -19774 -21730 -29963 -27725 -21029 -13505 4308 15495 13956 5721 -3827 -14717 -4298
14664d298P91k015J1225k69j5536j9493J5450J2753K524J123m693n031j556M26
$$ -4298 -3507 -5522 5703 5434 -10102 -29595 -14145 -1392 1132 2255 -2438 -7469 -9025 -8599
14650h599l809o906j6505q738K825P262J1564n846j1559k027o637L550J1468Q007
$$ -8599 -12408 -19314 -35819 -44557 -41732 -34470 -22906 -28752 -40311 -42338 -48975 -45425 -33957 -25950
14636b5950j3365j2872Q817K6993l359j554M628k926L861OJ630J4045J14J806
$$ -25950 -39315 -52187 -43370 -16377 -19736 -21290 -16662 -19588 -15727 -15721 -14091 -46 68 1874
14622A874j1220N472J1822R897m681K83L304J78J1629l514r877P077O163j3988
$$ 1874 -9346 -3874 7948 17845 13164 13447 16751 16929 28558 25044 15167 22244 28407 14419
14608A4419k5555m554R543R99J0439J1795j7907j6871j714L468k900j8729J4278
$$ 14419 -11136 -15690 -6147 -5148 5291 17086 -821 -17692 -19406 -15938 -18838 -37567 -23289
14595b3289R271O560M658J1945m915r892O505j5595p336R673R419o848r864l148
$$ -23289 -14018 -7458 -2800 9145 4230 -5662 843 -14752 -22088 -12415 -2996 -9844 -19708 -22856
14581b2856J7166J7730q585q822j2373j0411P770p587k733P316Q871j9802J2988
$$ -22856 -5690 12040 3455 -5367 -17740 -28151 -20381 -27968 -30701 -23385 -14514 -34316 -21328
14568b1328M809q017N017m319j77K8561J9609j169r255M751n453j9032r597K3336
$$ -21328 -16519 -24536 -19519 -23838 -24015 4546 24155 22986 13731 18482 13029 -6003 -15600 7736
14554G736L032L457k5k1106L776Q501m720M832m944j5180o04k2061m237K0381
$$ 7736 10768 14225 14200 -6906 -3130 5371 651 5483 539 -14641 -15245 -37306 -41543 -21162
14540b1162p584j7988m0K0052K945J0725K6509R948q809L537r780j0798K434J7949
$$ -21162 -28746 -46734 -46774 -26722 -23777 -13052 13457 23405 14596 18133 8353 -2445 -11 17938
14526A7938J918k1906m854K2j3876J6953Q870j0055m505R292j2477k4723J0931
$$ 17938 19856 -2050 -6904 -6882 -20758 -3805 5065 -4990 -9495 -203 -12680 -37403 -26472
14513b6472J7445j7934k253M0175J1757L326k3687j8445k2894q995J7165j1361
$$ -26472 -9027 -26961 -29214 10961 22718 26044 2357 -16088 -38982 -47977 -30812 -42173
14501d2173j000J2991r242l723j843K0858J7410N988j2629q875j1050r335K996
$$ -42173 -43173 -30182 -39424 -43147 -44990 -24132 -6722 -734 -13363 -22238 -33288 -42623 -39627
14488c9627J2875p858P454p846K016J3757j2129J5803O959j0096m005R802p169
$$ -39627 -26752 -34610 -27156 -35002 -32986 -19229 -31358 -15555 -8596 -18692 -22697 -12895 -20064
14475b0064p383j557O875J2939j0477p620J915m33J6911O269j1471j966N419Q938
$$ -20064 -27447 -29004 -22129 -9190 -19667 -27287 -25372 -25805 -8894 -2625 -14096 -16062 -10643 -1705
14461a705j8879j8150K2496K8487j5711j6206K81j674k0471m851J7010Q86O570
$$ -1705 -20584 -38734 -16238 12249 -3462 -19668 -19387 -21061 -41532 -46383 -29373 -28487 -21917
14448b1917J1799p849Q490J6425P716q760k7232j8239j337J1407J7634j462l334
$$ -21917 -10118 -17967 -9477 6948 14664 5904 -21328 -39567 -40904 -29497 -11863 -13325 -16659
14435a6659p39J9826K8508j1736j319j4158N061J760j7171l6007J679O925p34
$$ -16659 -17398 2428 30936 19200 17881 3723 8784 10544 -6627 -42634 -40955 -34030 -34764
14422c4764q35K5277R319L479l778L699L728j5779m087P578o783L201p90j7364
$$ -34764 -35599 -10322 -1003 2476 -1302 2397 6125 -9654 -13741 -6163 -12946 -9745 -10535 -27899
14408b7899P411o546k322j3885L987J5898K568p678n63R061n247j2672n084L398
$$ -27899 -20488 -27034 -29356 -43241 -39254 -23356 -20788 -28466 -29029 -19968 -25215 -37887 -42971 -39573
14394c9573J8832J6427n482p558j937j458l37l1r084O044O829q282n922J0242
$$ -39573 -20741 -4314 -9796 -17354 -19291 -20749 -21086 -21117 -30201 -24157 -17328 -25610 -31532 -21290
14380b1290K3757K1554M263o852j6875j3139j2050J266K5062R696J719j1949j7427
$$ -21290 2467 24021 28284 21432 4557 -8582 -20632 -19366 5696 15392 17111 5162 -12265
14367a2265m578n042M631j006Q462J1566j0081M409r839p508J0199J3517l066
$$ -12265 -16843 -21885 -17254 -18260 -9798 1768 -8313 -3904 -13743 -21251 -11052 2465 -601
14354f01j5188j0881k0369O931j2675m961K2546K5542M464j2001j6709R851R081
$$ -601 -15789 -26670 -47039 -40108 -52783 -57744 -35198 -9656 -5192 -17193 -33902 -24051 -14970
14341a4970n465K2665J0754n723m519q377q464q851r85J4913L018L409M813j497
$$ -14970 -20435 2230 12984 7261 2742 -5635 -14099 -22950 -23935 -9022 -6004 -2595 2218 721
14327G21P05J1675j2185k2658l967k480j4559m378k923J9642M6547J3890K879
$$ 721 1426 13101 916 -21742 -25709 -28189 -42748 -47126 -50049 -30407 16140 30030 32909
14314C2909l749k3469m720M409j6j939p619l196j6273N03l24j181L989J0117N536
$$ 32909 29160 5691 971 5380 5364 3425 -4194 -7390 -23663 -23160 -23484 -24665 -20676 -10559 -5023
14299e023k931K908j3481R898J9599j0840j5133k680p151j698O14J313L465R022
$$ -5023 -7954 -5046 -18527 -8629 10970 130 -15003 -17683 -24834 -26532 -25918 -24605 -21140 -12118
14285a2118R717Q292j366o096j2052R106j3097l098M671j492o501J208q29M114
$$ -12118 -2401 5891 4525 -1571 -13623 -4517 -17614 -20712 -16041 -17533 -24034 -22826 -23655 -19541
14271a9541J0419K8190k2492Q79J719j9437N035J0819j0438j2519n934J4752J2914
$$ -19541 -9122 19068 -3424 -2545 -826 -20263 -15228 -4409 -14847 -27366 -33300 -18548 -5634
14258e634L335j4642j4905k0155J632r268P119L837K624R469N613R604m65m628
$$ -5634 -2299 -16941 -31846 -52001 -50369 -59637 -52518 -48681 -46057 -36588 -30975 -21371 -21836 -26464
14244b6464K743J4122J1712k381p599k120Q637j3945k1706M805K0642K749k7167
$$ -26464 -23721 -9599 2113 -268 -7867 -9987 -1350 -15295 -37001 -32196 -11554 -8805 -35972
14231c5972L487M538J2014P974q996j0240p965m268J4742J771J0242J0454J7620
$$ -35972 -32485 -27947 -15933 -7959 -16955 -27195 -35160 -39428 -24686 -22915 -12673 -2219 15401
14218A5401J168j5569j8590j0000m738J3386J3292J0466n482j5894o939J109j458
$$ 15401 16569 1000 -17590 -27590 -32328 -18942 -5650 4816 -666 -16560 -23499 -22390 -23848
14205b3848N374j1397q277R429N763J0872K4009l39o296o140j42K2401O673k3365
$$ -23848 -18474 -29871 -38148 -28719 -22956 -12084 11925 11586 5290 -850 -992 21409 28082 4717
14191D717l7711k018J7992J7719n564o061k885m459R069J5978K764J0128k562
$$ 4717 -32994 -35012 -17020 699 -4865 -10926 -13811 -18270 -9201 6777 9541 19669 17107
14178A7107r993j7518m894K438n318N879J040o454j3340k437P725O951L686m377
$$ 17107 7114 -10404 -15298 -12860 -18178 -12299 -11259 -17713 -31053 -33490 -25765 -18814 -15128 -19505
14164a9505N276j918J0942R22j0850q329O256M543j0040J0191K1349p543k206
$$ -19505 -14229 -16147 -5205 -4283 -15133 -23462 -17206 -12663 -22703 -12512 8837 1294 -912
14151i12r47J5299l131J4773j2416j5568j0524o561j5359p856P241J9183J3616
$$ -912 -1859 13440 10309 25082 12666 -2902 -13426 -19987 -35346 -43202 -35961 -16778 -3162
14138c162J129j4765J3242L619m148o567Q215J7767k446M074k122j9162j9694
$$ -3162 -2033 -16798 -3556 63 -4085 -10652 -2437 15330 12884 16958 14836 -4326 -24020
14125b4020K635J995J3010o436j5237r343R810J588N061Q350J2503m099k5021
$$ -24020 -21385 -19390 -6380 -12816 -28053 -37396 -27586 -25998 -20937 -12587 -84 -4183 -29204
14112b9204j9319R71k526K277J5978o520K1640J9203L659p051j723l360O585m000
$$ -29204 -48523 -47552 -50078 -47801 -31823 -38343 -16703 2500 6159 -892 -2615 -5975 610 -3390
14098c390J1360K260N676j189J016o154L13k0419j7563p264K728J1337J916j2133
$$ -3390 7970 10230 15906 14717 15733 9579 9892 -10527 -28090 -35354 -32626 -21289 -19373 -31506
14084c1506J362K2118J8564j3020j5895p581l884k4L446J2170j703J2861L57j7903
$$ -31506 -30144 -8026 10538 -2482 -18377 -25958 -29842 -29866 -26420 -14250 -15953 -3092 -2735 -20638
14070b0638q038J3560O844k5413q285K0289j0576J6416J0572r733K839J8335Q518
$$ -20638 -28676 -15116 -8272 -33685 -41970 -21681 -32257 -15841 -5269 -15002 -12163 6172 14690
14057A4690q182j0065r739m627j3529R330O592K9362o894o790J34j9357l156J8374
$$ 14690 6508 -3557 -13296 -17923 -31452 -22122 -15530 13832 6938 148 282 -19075 -22231 -3857
14043c857j291j2947p913K710Q931p873N859K7274J3233l3979r821K169P616n389
$$ -3857 -5148 -18095 -26008 -23298 -14367 -22240 -16381 10893 24126 -9853 -19674 -17505 -9889 -15278
14029a5278j1301J1030K1737M627K652j5214O09n726r49j0432j8911J4012J7351
$$ -15278 -26579 -15549 6188 10815 13467 -1747 -1138 -6864 -7813 -18245 -37156 -23144 -5793
14016e793j0735P335J7800j532j3516r89j0767J986m497j1529o478J8084J3418
$$ -5793 -16528 -9193 8607 7075 -6441 -7430 -18197 -16211 -20708 -32237 -38715 -20631 -7213
14003g213M547m563Q560M998j2638j9175p476L957R120J4567n378k3723M972p230
$$ -7213 -2666 -7229 1331 6329 -6309 -25484 -32960 -29003 -19883 -5316 -10694 -34417 -29445 -36675
13989c6675J3549N124k6581j1527P394K1888o670j0596K6592l172m344o706J707
$$ -36675 -23126 -18002 -44583 -56110 -48716 -26828 -33498 -44094 -17502 -20674 -25018 -31724 -30017
13976c0017n141K3534J8125j3525q552j955o56J4964l416k7552k1707J8877J5725
$$ -30017 -35158 -11624 6501 -7024 -15576 -17531 -18187 -3223 -6639 -34191 -55898 -37021 -21296
13963b1296r08J66o994J8336p339m316p568J1503K531o861j6770j0684k024J4936
$$ -21296 -22204 -22038 -29032 -10696 -18035 -22351 -29919 -18416 -15885 -22746 -39516 -50200 -52224 -37288
13949c7288M859L770K764p653N463m77m337J904K0681n19N060j73k431p689k4577
$$ -37288 -32429 -28659 -25895 -33548 -28085 -28562 -32899 -30995 -10314 -10833 -5773 -5946 -8377 -16066 -40643
13934d0643k0277l170O335q992J8026J4030P167R542j851j1822k328O4N59q67
$$ -40643 -60920 -64090 -57755 -66747 -48721 -34691 -27524 -17982 -19833 -31655 -33983 -33919 -33360 -34227
13920c4227J376K2301R191R976j0882j2747J5090M484r164r240M629Q787Q663
$$ -34227 -32851 -10550 -1359 8617 -2265 -15012 78 4562 -4602 -13842 -9213 -426 8237
13907H237L213j0339j4344l014q192o696k287l600J1352J495r097N440N205J2833
$$ 8237 11450 1111 -13233 -16247 -24439 -31135 -33422 -37022 -25670 -24175 -33272 -27832 -22627 -9794
13893i794l933M226r493j1984J061R441L6J7445P843m416j2976k4993J608N193
$$ -9794 -13727 -9501 -18994 -30978 -29917 -20476 -20440 -2995 4848 432 -12544 -37537 -35929 -30736
13879c0736Q256J0836j22K2133J2202r788k0913n496m736r119j334R50J6963J4407
$$ -30736 -22480 -11644 -11766 10367 22569 12781 -8132 -13628 -18364 -27483 -28817 -27867 -10904 3503
13865C503j0478J6950p946k2484J2688N414q054n796N687J1872n814n685M262
$$ 3503 -6975 9975 2029 -20455 -7767 -2353 -10407 -16203 -10516 1356 -4458 -10143 -5881
13852e881N145J372j790J578O882k366k4708j7321N765J6206J865o735k457L626
$$ -5881 -736 636 -1154 424 7306 4940 -19768 -37089 -31324 -15118 -13253 -19988 -22445 -18819
13838a8819m349K391l119j3576o50N648J8274Q233j7599q966J9345J8803j917
$$ -18819 -23168 -20777 -23896 -37472 -38122 -32474 -14200 -5967 -23566 -32532 -13187 5616 3699
13825C699k2209m897N65O438j47k5845l399L661N379J5450O630m754n475j3470
$$ 3699 -18510 -23407 -22842 -16404 -16551 -42396 -45795 -42134 -36755 -21305 -14675 -19429 -24904 -38374
13811c8374l742j3259Q496J3052O323J3307m399O503q670l365O120L791j0561
$$ -38374 -42116 -55375 -46879 -33827 -27504 -14197 -18596 -12093 -20763 -24128 -18008 -14217 -24778
13798b4778J716Q853j0014J0031R419k015k4158k889J9283J5168M841l48j8391
$$ -24778 -23062 -14209 -24223 -14192 -4773 -6788 -30946 -33835 -14552 616 5457 5109 -13282
13785a3282n214J4459k3348j4895o775P887L451Q734j1400J0105Q568J0922n576
$$ -13282 -18496 -4037 -27385 -42280 -49055 -41168 -37717 -28983 -40383 -30278 -21710 -10788 -16364
13772a6364N622K51q937N571P583J3073L457j7738k1118j1523J5234J522k999
$$ -16364 -10742 -10491 -19428 -13857 -6274 6799 10256 -7482 -28600 -40123 -24889 -23367 -26366
13759b6366K0095Q305k1844n786J5797J6696n284k859R967M809M122J1430m034
$$ -26366 -6271 2034 -19810 -25596 -9799 6897 1613 -1246 8721 13530 17652 29082 25048
13746B5048k8914J820J0687J6193k334k069J980k1106j5409M316K820r738J2505
$$ 25048 -3866 -2046 8641 24834 22500 20431 22411 1305 -14104 -9788 -6968 -16706 -4201
13733d201K0029O918o557J0045r0j7634j2114L158j3543n124M964j2413l698q017
$$ -4201 15828 22746 16189 26234 26144 8510 -3604 -446 -13989 -19113 -14149 -26562 -30260 -38277
13719c8277j2056o684R367J4472k080l4737J0799K2066J793J2749J9824K7j3593
$$ -38277 -50333 -57017 -47650 -33178 -35258 -69995 -59196 -37130 -35337 -22588 -2764 -2737 -16330
13706a6330J0426P993J2583k9105n769J3658n886j3644J594K2210J0090l865j9998
$$ -16330 -5904 2089 14672 -14433 -20202 -6544 -12430 -26074 -24480 -2270 7820 3955 -16043
13693a6043l289l679j496L014q283k0194N943O980R070N009j6979o575k864K2887
$$ -16043 -19332 -23011 -24507 -21493 -29776 -49970 -44027 -37047 -27977 -22968 -39947 -46522 -49386 -26499
13679b6499n145k076J8379Q421Q215j7743j0532j745Q257J9339J0447k063r016
$$ -26499 -31644 -33720 -15341 -6920 1295 -16448 -26980 -28725 -20468 -1129 9318 7255 -1761
13666a761k7399k6379j1805J02L6938J5488k513m947J4236J1124l093K978q08
$$ -1761 -29160 -55539 -67344 -67242 -30304 -14816 -17329 -22276 -8040 3084 -9 2969 2161
13653B161N589j1774k0708j3063j8360n770J2219J2447k626l873K1185R486k0524
$$ 2161 7750 -4024 -24732 -37795 -56155 -61925 -49706 -37259 -39885 -43758 -22573 -13087 -33611
13640c3611L745K0093J9125j574j3571J5632K547o039r759n201J9028P351k695
$$ -33611 -29866 -9773 9352 7778 -5793 9839 12386 6347 -3412 -8613 10415 17766 15071
13627A5071k3807J751J2250R417n538j7452q208l509J8455K157p653j809P013
$$ 15071 -8736 -6985 5265 14682 9144 -8308 -16516 -20025 -1570 587 -7066 -8875 -1862
13614a862j3537M327m341q179K758K3734M543n921Q336M068k1888k0615j1842
$$ -1862 -15399 -11072 -15413 -23592 -20834 2900 7443 1522 9858 13926 -7962 -28577 -40419
13601d0419K191K752m932q948q35n027n289R700K5572J4460j1551N426r404L97
$$ -40419 -38228 -35476 -40408 -49356 -50191 -55218 -60507 -50807 -25235 -10775 -22326 -16900 -26304 -25907
13587b5907M547k342O882K1700J8531M325j1616k5858K391J481Q875m715r052
$$ -25907 -21360 -23702 -16820 4880 23411 27736 16120 -9738 -7347 -5866 3009 -1706 -10758
13574a0758k1641j105k493J2576R479R661J8266n127k2262j7010j2951J35J520
$$ -10758 -32399 -33504 -35997 -23421 -13942 -4281 13985 8858 -13404 -30414 -43365 -43230 -41710
13561d1710R890L276K2888J964o009j1719o761O898k018n077O046J686O930O636
$$ -41710 -31820 -28544 -5656 -3692 -9701 -21420 -28181 -21283 -23301 -28378 -22332 -20646 -13716 -7080
13547g080n157q846K18j5764K10j191K2560J4434o864j5604j7515K202J0404j1207
$$ -7080 -12237 -21083 -20865 -36629 -36419 -37610 -15050 -616 -7480 -23084 -40599 -38397 -27993 -39200
13533c9200J3335p102j2246R411J3236n902Q104o235j0441j3133o522K895J2245
$$ -39200 -25865 -32967 -45213 -35802 -22566 -28468 -20364 -26599 -37040 -50173 -56695 -53800 -41555
13520d1555M016L623K3678p607k4197m510J7078P269r003j94l965O662K1757K552
$$ -41555 -37539 -33916 -10238 -17845 -42042 -46552 -29474 -22205 -31208 -31402 -35367 -28705 -6948 -4396
13506d396j0145k367l127L84l887J9722j349m597j176Q928K2015O005Q667J2812
$$ -4396 -14541 -16908 -20035 -19651 -23538 -3816 -5165 -9762 -10938 -2010 20005 26010 34677 47489
13492D7489j6560r902j678l569L536j5752j1366K7156j3270j5009q147K7443j0392
$$ 47489 30929 21027 19349 15780 19316 3564 -7802 19354 6084 -8925 -17072 10371 -21
13479b1k4531r776M867j0580J2134R679J4064R13l886L171M050J8725j105k23
$$ -21 -24552 -34328 -29461 -40041 -27907 -18228 -4164 -3251 -7137 -3966 84 18809 17704 17481
13465A7481k560m702n992K212M048j3288N432q692n191R307J3720j0159j2111
$$ 17481 14921 10219 4227 6439 10487 -2801 2631 -6061 -11252 -1945 11775 1616 -10495
13452a0495k110r305L533M1401J4655j7000k1053J1754J6034J9611N174j2453
$$ -10495 -12605 -21910 -18377 23024 37679 20679 -374 11380 27414 47025 52199 39746
13440C9746j260J0798J4752q584k4836r067P890j0112j4732K6485K3434k333j984
$$ 39746 38486 49284 64036 55452 30616 21549 29439 19327 4595 31080 54514 52181 50197
13427E0197q724P167j0738j10k1322r547R564Q480r216J2728m264p052n928n253
$$ 50197 41473 48640 37902 37792 16470 6923 16487 24967 15751 28479 24215 17163 11235 5982
13413E982m161J7481k684m360n127J507j285J2357M598m275j7646N365N342J9187
$$ 5982 1821 19302 16618 12258 7131 8638 7353 19710 24308 20033 2387 7752 13094 32281
13399C2281q118l3321n964L06L457J6837L394m609L73o249J3692n487k3495p245
$$ 32281 24163 -9158 -15122 -14816 -11359 5478 8872 4263 4636 -1613 12079 6592 -16903 -24148
13385b4148K4097J4069O725j4801j1200j132L875J832O743j6091L057J4627j495
$$ -24148 -51 14018 20743 5942 -5258 -6390 -2515 -683 6060 -10031 -6974 7653 6158
13372F158p954j3636N409K7539J4872k8322j7922n87J4753J7490r774j0508j0804
$$ 6158 -1796 -15432 -10023 17516 32388 4066 -13856 -14443 310 17800 8026 -2482 -13286
13359a3286k1201J2130K2355J3506j6948j6451j4729K1830K9892M711j6490k096
$$ -13286 -34487 -22357 -2 13504 -3444 -19895 -34624 -12794 17098 21809 5319 3223
13347C223K119j1907k233J7928j376M251k5952j6176J1695J1228k646J5637R784
$$ 3223 5342 -6565 -8798 9130 7754 12005 -13947 -30123 -18428 -7200 -9846 5791 15575
13334A5575k1724l267Q164L5342J5643j8440j8344q724j5650j1087p880J0106
$$ 15575 -6149 -9416 -1252 34090 49733 31293 12949 4225 -11425 -22512 -30392 -20286
13322b0286M446m253n612k829J5047J6513L402N07P502J0252k034j7393j3817
$$ -20286 -15840 -20093 -25705 -28534 -13487 3026 6428 6935 14437 24689 22655 5262 -8555
13309h555M152K7171j779r949l555j7296r903J1946J6439N119j6816j650n51l586
$$ -8555 -4403 22768 20989 11040 7485 -9811 -19714 -7768 8671 13790 -3026 -4676 -5227 -8813
13295h813j3853l424J1210m798O369J7455K2654M161J0686P116p454j7374Q366
$$ -8813 -22666 -26090 -14880 -19678 -13309 4146 26800 30961 41647 48763 41309 23935 32301
13282C2301K446j2357M910j5572j1151q330J3514J2193J5396k0821j4935l932
$$ 32301 34747 22390 27300 11728 577 -7753 5761 17954 33350 12529 -2406 -6338
13270f338q685Q970J7518L503O293l121j4138k0470j286P996J2421J7757L505
$$ -6338 -15023 -6053 11465 14968 21261 18140 4002 -16468 -17754 -9758 2663 20420 23925
13257B3925k2549m689J3481m507j0617l577m624P457J1620k26J2805j0746k6057
$$ 23925 1376 -3313 10168 5661 -4956 -8533 -13157 -5700 5920 5694 18499 7753 -18304
13244a8304n90Q859L065J2353n96P714N831p981r334r841q093Q010J1673K4804
$$ -18304 -18894 -10035 -6970 5383 4787 12501 18332 10351 1017 -8824 -16917 -8907 2766 27570
13230B7570J8478j0547k7595o950l249o392L863P709j2496l563J2237l16K527
$$ 27570 46048 35501 7906 956 -2293 -8685 -4822 2887 -9609 -13172 -935 -1251 1276
13217A276o750j0513J0726j0720n089j559O955P095K153O110n448k2451k024r36
$$ 1276 -5474 -15987 -5261 -15981 -21070 -22629 -15674 -8579 -6426 -316 -5764 -28215 -30239 -31175
13203c1175p174J6430K4525j1492j1380J2089J2970J4330J8663J9300P455j8254
$$ -31175 -38349 -21919 2606 -8886 -20266 -8177 4793 19123 37786 57086 64541 46287
13191D6287r892n78o290M827k480k3092j0065j3964o210K321J5912m181Q998L452
$$ 46287 36395 35817 29527 34354 31874 8782 -1283 -15247 -21457 -19136 -3224 -7405 1593 5045
13177E045l797j0705o252J1971K9402j4171j9317j8269O008K3165J7396J3162
$$ 5045 1248 -9457 -15709 -3738 25664 11493 -7824 -26093 -20085 3080 20476 33638
13165C3638J2167J6160J7376J4677P780J194o000j4628J2877J2379M905k0113
$$ 33638 45805 61965 79341 94018 101798 102992 96992 82364 95241 107620 112525 92412
13153I2412l3009j5324j9690k2261M730p697j6056M930P845n63O89R424J5756
$$ 92412 59403 44079 24389 2128 6858 -839 -16895 -11965 -4120 -4683 -3994 5430 21186
13140B1186r111l260m718l1163N001K1207R586J294K3900L1824N391J3057J369
$$ 21186 12075 8815 4097 -27066 -22065 -858 8728 10022 33922 65746 71137 84194 85563
13127H5563O319J7254j3293j3355n424j5031q749l1220j9561l025N790m056p288
$$ 85563 91882 109136 95843 82488 77064 62033 53284 22064 2503 -522 5268 1212 -6076
13114f076J6073K3851J7904M883j3932m131j9991q636J3085j8991l013N732P166
$$ -6076 9997 33848 51752 56635 42703 38572 18581 9945 23030 4039 1026 6758 13924
13101A3924q622j0680J4136J9991p206J1100N699k1408L754J3025N222j5036p816
$$ 13924 5302 -5378 8758 28749 21543 32643 38342 16934 20688 33713 38935 23899 16083
13088A6083n67j787J073m245Q906J6314P856M644r562m543n178j5069M146j8538
$$ 16083 15516 13729 14802 10557 19463 35777 43633 48277 38715 34172 28994 13925 18071 -467
13074d67m298N68J8284K7778n832j4937O242L821j2889q009j5193r706q298K4441
$$ -467 -4765 -4197 14087 41865 36033 21096 27338 31159 18270 10261 -4932 -14638 -22936 1505
13060A505J0694k893j2489j2202r087j0694r639M091K8602m90o047J0983J6245
$$ 1505 12199 9306 -3183 -15385 -24472 -35166 -44805 -40714 -12112 -12602 -18649 -7666 8579
13047H579k564R856n317j2596r800J3352J4862k238L94j5200m995Q520M902N909
$$ 8579 6015 15871 10554 -2042 -11842 1510 16372 14134 14528 -672 -5667 2853 7755 13664
13033A3664K587J8736L2190P468k737J704j5691j219N738j4387K1487J1939L14
$$ 13664 16251 34987 67177 74645 71908 73612 57921 56702 62440 48053 69540 81479 81793
13020H1793k1118k626j19j0538p872J119O272m334r022J2470P790M448n021j6373
$$ 81793 60675 58049 57930 47392 39520 40639 46911 42577 33555 46025 53815 58263 53242 36869
13006C6869J2095L6819L7663O408R563K0986L9543M4693M4898Q4147J30322J81298
$$ 36869 48964 85783 123446 129854 139417 160403 199946 244639 289537 373684 504006 685304
12994F85304K21643K24970J63130Q2828K7508J6132M1714K5146j0574m4971j60354
$$ 685304 906947 1131917 1295047 1377875 1405383 1421515 1463229 1488375 1477801 1432830 1272476
12983A272476k28716k21317j33473j07350p4252o2640o8969m1091m5236k0220
$$ 1272476 1043760 822443 688970 581620 507368 444728 375759 334668 289432 269212
12973B69212k1389k8387m923r545j0140J9350k2835k8723k7716J1383J09N542
$$ 269212 247823 219436 214513 204968 194828 214178 191343 162620 134904 146287 146396 151938
12961A51938j2533k2307R104Q348M604j4758j1107j3162l826N171M075L351J873
$$ 151938 139405 117098 126202 134550 139154 124396 113289 100127 96301 101472 105547 108898 110771
12948A10771q168j7447j6300j3962J3050J7802P424k295J0160R714j3952j5510
$$ 110771 102603 85156 68856 54894 67944 85746 93170 90875 101035 110749 96797 81287
12936H1287j0137m797p913n642l065K494k545m499j3187j0479J3433J9748n096
$$ 81287 71150 66353 58440 52798 49733 52227 49682 45183 31996 21517 34950 54698 49602
12923D9602n44J559l081J2150N14k212n278m022k0751j3248m692k973o029K9202
$$ 49602 49058 50617 47536 59686 60200 57988 52710 48688 27937 14689 9997 7024 995 30197
12909C0197k481j4300L4621j1272q044o799L70M675O437l881j1324l495j3626
$$ 30197 27716 13416 48037 36765 28721 21922 22292 26967 33404 29523 18199 14704 1078
12896A078J3622K5353J713M41o424Q349l077l3252j2616j5455j6362M968J6165
$$ 1078 14700 40053 41766 42207 35783 44132 41055 7803 -4813 -20268 -36630 -31662 -15497
12883a5497J0101K0404m98j8163p971J240O363j0995j0472J0945O374J9395p127
$$ -15497 -5396 15008 14510 -3653 -11624 -10384 -4021 -15016 -25488 -14543 -8169 11226 4099
12870D099j2712j3327j5204k602J5823M009K631K3438J2902j0980p484P089o118
$$ 4099 -8613 -21940 -37144 -39746 -23923 -19914 -17283 6155 19057 8077 593 7682 1564
12857A564n980J2641J2900J128k004K1748j3988k4128q860R340J1760k927J53
$$ 1564 -4416 8225 21125 22253 20249 41997 28009 3881 -4979 4361 16121 13194 13347
12844A3347j2659j152N667k201k315o428j0750J8744L6623L2993j5345k2141o905
$$ 13347 688 -464 5203 3002 687 -5741 -16491 2253 38876 71869 56524 34383 27478
12831B7478r092r196k2106L550p04j224J4225R125j1069J435J9285p375o41J3724
$$ 27478 18386 9190 -12916 -9366 -10070 -11294 2931 12056 987 2422 21707 14332 13691 27415
12817B7415J5210J6737r644j7425m197M120J693P968j1284l908J8145P236P900
$$ 27415 42625 59362 49718 32293 28096 32216 33909 41877 30593 26685 44830 52066 59966
12804E9966m791q910J1063M473J0091J2518j5325J1952L1975J5263J2529K667
$$ 59966 55175 46265 57328 61801 71892 84410 69085 81037 113012 128275 140804 143471
12792A43471j2433m002J7078M751k5903j3326Q239N10K6051J9565Q829Q415n143
$$ 143471 131038 127036 144114 148865 122962 109636 117875 118385 144436 164001 172830 181245 176102
12779A76102K802k278n669j0248R542j2785j0843j1595k0910j5219j3038j3474
$$ 176102 178904 176626 170957 160709 170251 157466 146623 135028 114118 98899 85861 72387
12767G2387k0772K707j1551J6978K5177k665k4814J221J2412j7788j6796L131
$$ 72387 51615 54322 42771 59749 84926 82261 57447 58668 71080 53292 36496 39627
12755C9627N304J4208o365J8871j2546j9660j7953P435J3978J1997J4079L070
$$ 39627 44931 59139 52774 71645 59099 39439 21486 28921 42899 54896 68975 72045
12743G2045k7224m981J2948M560q353n25j145m790P088J104L56p12O707L725Q277
$$ 72045 44821 39840 52788 57348 48995 48470 47325 42535 49623 50727 51083 50371 57078 60803 69080
12728F9080R147J2603m843N187J2913J8044K9905K8380J3687m291o276p432j203
$$ 69080 78227 90830 85987 91174 104087 122131 152036 180416 194103 189812 183536 176104 174901
12715A74901J1474j47J1162j0704k0973j5994p540k0765j9137l164r031m464m542
$$ 174901 186375 186228 197390 186686 165713 149719 142179 121414 102277 99113 90082 85618 81076
12702H1076M88K0593N004n658k589M108j6080J3077M8196K7551Q927M513L3656
$$ 81076 81564 102157 107161 101503 98914 103022 86942 100019 148215 175766 184693 189206 222862
12689B22862K4689J2359q7J3185K4276P924L567K0395J4983J5436j1554k9969
$$ 222862 247551 259910 259823 273008 297284 305208 308775 329170 344153 359589 348035 318066
12677C18066j8451j7957j7432M833j4123l2206k2534j3329k2213J217j5597n10
$$ 318066 299615 281658 264226 269059 254936 222730 200196 186867 164654 165871 150274 149764
12665A49764J6047J1614j9579n8948o0669n7458j1114P3319J34393Q3667j4038
$$ 149764 165811 177425 157846 98898 38229 -19229 -30343 42976 177369 261036 246998
12654B46998n5955J4222Q3254M3075N8046P1388O2670J8158M203K8876K958p402
$$ 246998 191043 205265 288519 331594 389640 461028 523698 541856 546059 574935 577893 570491
12642E70491J5653k3969j7224J0265J0861j3220k96J7848Q736j32j1169K2508
$$ 570491 586144 562175 544951 555216 566077 552857 552561 570409 579145 579013 567844 590352
12630E90352K3157J6296J1424J9249K0961J7042L157K1296Q547M5380M6173n02
$$ 590352 613509 629805 641229 660478 681439 698481 701638 722934 731481 776861 823034 822532
12618H22532n602L951l821k605L985k0849J86r755J04o263J212m084k9111j4405
$$ 822532 816930 820881 817060 814455 818440 797591 797777 788022 788126 781863 783075 778991 749880 735475
12604G35475L0447L9192K9787r462j0728Q867K3876K3808L3312P596o323J6552
$$ 735475 765922 805114 834901 825439 814711 823578 847454 871262 904574 912170 905847 922399
12592I22399J6989J3809L7379N8474L9848K7285J8908L6359J9525J1841O6596
$$ 922399 939388 953197 990576 1049050 1088898 1116183 1135091 1171450 1190975 1202816 1269412
12581A269412P5259M7650L8673N9123P7110P9555R4116J00912R4422R3504J00734
$$ 1269412 1344671 1392321 1430994 1490117 1567227 1646782 1740898 1841810 1936232 2029736 2130470
12570B130470J03827J19847J39664J37827J90696J86784J98072K23576K50076
$$ 2130470 2234297 2354144 2493808 2631635 2822331 3009115 3207187 3430763 3680839
12561C680839L04532L38180M01749M59375N30994O12927P51445Q06750P58555
$$ 3680839 3985371 4323551 4725300 5184675 5715669 6328596 7080041 7886791 8645346
12552H645346P20868P82117R28401J112973J344255J632327J897670K072675K334021
$$ 8645346 9366214 10148331 11076732 12189705 13533960 15166287 17063957 19136632 21470653
12543B1470653K861575L711754M880958O557027R027994J2857970J8853306K8151667
$$ 21470653 24332228 28043982 32924940 39481967 48509961 61367931 80221237 108372904
12535A08372904M0826380N1319965M6333627K3751690M603675k538899l634004
$$ 108372904 149199284 200519249 246852876 270604566 275208241 272669342 269035338
12528B69035338j284250L228543L988892j2956831m1763368n1314930m0368552
$$ 269035338 267751088 270979631 274968523 262011692 220248324 168933394 128564842
12521A28564842k7608370j8677852j2941309r246368o900185n376357m328564
$$ 128564842 100956472 82278620 69337311 60090943 53190758 47814401 43485837
12514D3485837l632310l149672k848948k589282k257648j934557j681679j451029
$$ 43485837 39853527 36703855 33854907 31265625 29007977 27073420 25391741 23940712
12506B3940712j305641j177468j056769r67873q69684q30825p61703o96946o62036
$$ 23940712 22635071 21457603 20400834 19432961 18563277 17732452 16970749 16273803 15611767
12497A5611767n96886n90041n85809n91253n58755n25598n03950m84932m49233
$$ 15611767 15014881 14424840 13839031 13247778 12689023 12163425 11659475 11174543 10725310
12488A0725310m30165m00848l88978l45004l24865l16436k94635k65735k41408
$$ 10725310 10295145 9894297 9505319 9160315 8835450 8519014 8224379 7958644 7717236
12479G717236k18781k39932k48247k31519k06240k06294j93973j75949j65452
$$ 7717236 7498455 7258523 7010276 6778757 6572517 6366223 6172250 5996301 5830849
12470E830849j69651j85020j60183j45437j71828j54496j28778j35091j24883
$$ 5830849 5661198 5476178 5315995 5170558 4998730 4844234 4715456 4580365 4455482
12461D455482j24313r1681q9852j20857j31828j22285j16840r1481p6899j16485
$$ 4455482 4331169 4239488 4149636 4028779 3896951 3774666 3657826 3566345 3489446 3372961
12451C372961r8559q2206r4921q2853j04239r4543p4521q4112j00713r1784p2064
$$ 3372961 3274402 3192196 3097275 3014422 2910183 2815640 2741119 2657007 2556294 2464510 2392446
12440B392446o2508o0467n6510o3883o8720n8054m3134m6484n5914m0850j8637
$$ 2392446 2329938 2269471 2212961 2149078 2080358 2022304 1979170 1932686 1876772 1835922 1817285
12429A817285l4330m6103l4354k5910l2819l0995l5016m5387j6927k0532k4288
$$ 1817285 1782955 1736852 1702498 1676588 1643769 1612774 1577758 1532371 1515444 1494912 1470624
12418A470624m4019n9774m1632o9836o4027l8990k1637k8766l759R248J7335M0878
$$ 1470624 1426605 1366831 1325199 1255363 1191336 1152346 1130709 1101943 1098184 1107432 1124767 1165645
12406A165645N7870M3522Q470P182j6392k2339m6452k5265m3152p2351p0407n5647
$$ 1165645 1223515 1267037 1275507 1282689 1266297 1243958 1197506 1172241 1129089 1056738 986331 930684
12394I30684l8270k4080k0863m8773m4153m4095l3931l1399k0953l8853k4121
$$ 930684 892414 868334 847471 798698 754545 710450 676519 645120 624167 585314 561193
12383E61193k0127l0189k2170j7172N17J4296l744p401O550j3279p46M266Q766
$$ 561193 541066 510877 488707 471535 472052 486348 482604 475203 481753 468474 467728 471994 480760
12370D80760l468l241j0165j1737J2414J3160L297j650R686p711k3876N336K721
$$ 480760 477292 474051 463886 452149 464563 477723 481020 479370 489056 481345 457469 462805 465526
12357D65526J6101J6597j1900r056j4209j2453j648k3050j6164j028m338j8131
$$ 465526 481627 498224 486324 477268 463059 450606 448958 425908 409744 408716 404378 386247
12345C86247j7443l1423k6210k3159j1676j6879j8353R748J7790J5859k7L669
$$ 386247 368804 337381 311171 288012 276336 259457 241104 250852 268642 284501 284474 288143
12333B88143J6208j477J2247L0548m31R961K922R866m149j3187l466K543L380
$$ 288143 304351 302874 315121 345669 345238 355199 358121 367987 363838 350651 347185 349728 353108
12320C53108J869J965o815q385r629J2240j881q065r544m127R252r87k9067l0439
$$ 353108 354977 356942 350127 341742 332113 344353 342472 334407 324863 320736 329988 329001 299934 269495
12306B69495n616l587J1012P129k11j4545K288N076j0711p810o192L571J0290
$$ 269495 263879 260292 271304 278433 278222 263677 265965 271041 260330 252520 246328 249899 260189
12293B60189K340O694J3515J116p627n347l62K508p661n506q422j0271K499j4242
$$ 260189 262529 269223 282738 283854 276227 270880 270518 273026 265365 259859 251437 241166 243665 229423
12279B29423Q246R428o84k5311r715J5965r842l2557j4338M810o531j1595q622
$$ 229423 237669 247097 246413 221102 211387 227352 217510 184953 170615 175425 168894 157299 148677
12266A48677m939L284p657l1421O691k2k3837J4538j939j6819J0239K098j1316
$$ 148677 143738 147022 139365 107944 114635 114613 90776 105314 103375 86556 96795 98893 87577
12253H7577Q368r413m584J4912J0488J3642q645j4862j3629K3016K3133K5425
$$ 87577 95945 86532 81948 96860 107348 120990 112345 97483 83854 106870 130003 155428
12241A55428j2957k5288l0278j6227J3756J1769O061N070n879k7341o50l140j8574
$$ 155428 142471 117183 86905 70678 84434 96203 102264 107334 101455 74114 73464 70324 51750
12228E1750J8138o388k0129J3140J4921J7371n348m479J4640j0233J828p877L473
$$ 51750 69888 63500 43371 56511 71432 88803 83455 78976 93616 83383 85211 77334 80807
12215H0807O258j304l601M340J154o994L41J0038J1096j3827j1586n923j1372
$$ 80807 87065 85761 82160 86500 87654 80660 81001 91039 102135 88308 76722 70799 59427
12202E9427J7877K0300R943l315j5268j0922m635J4726K0487J5542P827k2615
$$ 59427 77304 97604 107547 104232 88964 78042 73407 88133 108620 124162 131989 109374
12190A09374l445n748N061J925j0020J4383q421l412n743k439o023n297R147j965
$$ 109374 105929 100181 105242 107167 97147 111530 103109 99697 93954 91515 85492 80195 89342 87377
12176H7377k3325r921R346P527k018J969p480j998m247l930J9813j88n679L234
$$ 87377 64052 54131 63477 71004 68986 70955 63475 61477 57230 53300 73113 72925 67246 70480
12162G0480o488J195J7209p296N289l936j2811k2683j2008J700j3915J7343K2634
$$ 70480 63992 65187 82396 75100 80389 76453 63642 40959 28951 30651 16736 34079 56713
12149E6713l139r396Q218j1626o856n730k102J6186N992N008j378j4740k0188
$$ 56713 53574 44178 52396 40770 33914 28184 26082 42268 48260 53268 51890 37150 16962
12136A6962j6042J2959L690J7972N676q52q036J7903M760o701K188l77j724J5065
$$ 16962 920 13879 17569 35541 41217 40365 32329 50232 54992 48291 50479 50102 48378 63443
12122F3443j1165k0045r049L925j931r65q586j0918K967J9719J6357M141p432
$$ 63443 52278 32233 23184 27109 25178 24213 15627 4709 7676 27395 43752 47893 40461
12109D0461N825J006q71j6535j902N370l863q580j7064j5095O154J743P744K3201
$$ 40461 46286 47292 46421 29886 27984 33354 29491 20911 3847 -11248 -5094 -3351 4393 27594
12095B7594K1879j2965j919p218P733J0907J2741J2513j809O55o093J7537J4570
$$ 27594 49473 36508 34589 27371 35104 46011 58752 71265 69456 70111 64018 81555 96125
12082I6125K4494K4949j0548j1965j4628K1877K5538J7986J4257M5494N1244M8863
$$ 96125 120619 145568 135020 123055 108427 130304 155842 173828 188085 233579 284823 333686
12070C33686N7288J11469J60775K19734K43857J99668Q3385N0377j851k4789p114
$$ 333686 390974 502443 663218 882952 1126809 1326477 1409862 1460239 1458388 1433599 1426485
12059A426485J0866l130j31403k07988k01305j45129j17213q1469o7768m4460
$$ 1426485 1437351 1434221 1302818 1094830 893525 748396 631183 549714 481946 437486
12049D37486n3557l3647k4631k4338l1476k4993j4135p163N697M544k0572j676
$$ 437486 383929 350282 325651 301313 269837 244844 230709 223546 229243 233787 213215 211539
12037B11539n148r80m523p280J3285j413j7885j5665l8929k2196m890J7925J3357
$$ 211539 206391 205411 200888 193608 206893 205480 187595 171930 133001 110805 105915 123840 137197
12024A37197K2004K2157j1231j3019j6115k8844N06j472R125k306r819k630K713
$$ 137197 159201 181358 170127 157108 140993 112149 112655 111183 120308 118002 108183 105553 108266
12011A08266j6954L262N54j461K4665J0905P283P057J7179J269p798m303p943
$$ 108266 91312 94574 95128 93667 118332 129237 136520 143577 160756 162025 154227 149924 141981
11998A41981K641R604k569k2751P130j910O048J6933J0719Q034m408J4582J9723
$$ 141981 144622 154226 151657 128906 136036 134126 140174 157107 167826 175860 171452 186034 205757
11985B05757r890k8701l82J0085J856K6995J8058p884k159O123J4901J8996J0419
$$ 205757 195867 167166 166784 176869 178725 205720 223778 215894 213735 219858 234759 253755 264174
11972B64174J8206M1921K6552L999J2699R08K5545N6476N8538L4543O0633O2569
$$ 264174 282380 324301 350853 354852 367551 368459 394004 450480 509018 543561 604194 666763
11960F66763O8451M2666O3950R1056Q5530R9674J33648J54591J75870K16673K56068
$$ 666763 735214 777880 841830 932886 1018416 1118090 1251738 1406329 1582199 1798872 2054940
11949B054940L19750M10500N18359O71739R38719J342561J978589L125138N013864
$$ 2054940 2374690 2785190 3303549 3975288 4914007 6256568 8235157 11360295 16374159
11940A6374159P503213Q802110O449053J840078r63093j323302m69229R19241
$$ 16374159 23877372 32679482 39128535 40968613 40005520 38682218 38212989 39132230
11932C9132230J361443j900137p247489q537693o220545l907469k503616j659576
$$ 39132230 40493673 38593536 31346047 22808354 16587809 12680340 10176724 8517148
11924H517148j127689q22539o25576n01367m42757l81706k91018k84333k70145
$$ 8517148 7389459 6566920 5941344 5439977 4997220 4615514 4324496 4040163 3770018
11915C770018k28437k03090j95636j81127j35604j24460j19833q7714q1020p7735
$$ 3770018 3541581 3338491 3142855 2961728 2826124 2701664 2581831 2494117 2413097 2335362
11905B335362q0724q2915n6369o4072n8180o5075o9182q2269o2245m8632n9591
$$ 2335362 2254638 2171723 2115354 2051282 1993102 1928027 1858845 1776576 1714331 1665699 1606108
11894A606108q4482o4336n7624p1446o7319l9455l2622k6496m5823m4933m5776
$$ 1606108 1521626 1457290 1399666 1328220 1260901 1221446 1188824 1162328 1116505 1071572 1025796
11883A025796n2903k2289k3944l6453k4605l9268r457k8710n4175k9890j7218
$$ 1025796 972893 950604 926660 890207 865602 826334 816877 788167 733992 704102 686884
11872F86884j0790l255N390k7260l0597o972R56j2332l6371l0602k2280K721r308
$$ 686884 676094 672839 678229 650969 620372 613400 614356 602024 565653 535051 512771 515492 506184
11859E06184r476j7367k2673k6631k1722k8939r016k038j7163j4998l923J5722
$$ 506184 496708 479341 456668 430037 408315 379376 370360 368322 351159 336161 332238 347960
11847C47960j644P715j0642j5975o089j7414j8019k1361j1277j5890o327J2883
$$ 347960 346316 354031 343389 327414 321325 303911 285892 264531 253254 237364 231037 243920
11835B43920j976K246J5003J864j1018n385k3915k8551j1540N96M563L576K090
$$ 243920 241944 244190 259193 261057 250039 244654 220739 192188 180648 181244 185807 189383 191473
11822A91473j2860j7528j9808j0267K2556N539L237J4280Q929J5233n822j2242
$$ 191473 178613 161085 141277 131010 153566 159105 162342 176622 185551 200784 194962 182720
11810A82720j4291j5582K3213K0142p077j0321j1515n427k7548k9102l26j0479
$$ 182720 168429 152847 176060 196202 189125 178804 167289 161862 134314 105212 104886 94407
11798I4407m577J3886r500j6248n227j0311N181Q933J747n463l966j0686k2119
$$ 94407 89830 103716 94216 77968 72741 62430 67611 76544 78291 72828 68862 58176 36057
11785C6057O021L562J8422J1440j9984q056K4308R254j7298R37N229M234J5493
$$ 36057 42078 45640 64062 75502 55518 47462 71770 81024 63726 64663 69892 74126 89619
11772H9619L127j5185J638j7605j3277j2434j3588l280R608R527R880P1J4947
$$ 89619 92746 77561 79199 61594 48317 35883 22295 19015 28623 38150 48030 48101 63048
11759F3048J3797q994m996j687J2690j8522j0457r288p764P76J1255n31j1731
$$ 63048 76845 67851 62855 61168 73858 55336 44879 35591 27827 28603 39858 39327 27596
11746B7596P391j939l787Q112Q175J4961k276l805K681J6345q5j8753N75M159
$$ 27596 34987 33048 29261 37373 45548 60509 58233 54428 57109 73454 73369 54616 55191 59350
11732E9350L122J454m32l440j092O182M832P425j4368j7196j7922n191j822J0937
$$ 59350 62472 63926 63494 60054 58962 65144 69976 77401 63033 45837 27915 22724 20902 31839
11718C1839O287K793J6849Q571O902n084j2396j9309l373Q689L651K399R906J420
$$ 31839 38126 40919 57768 66339 73241 68157 55761 36452 33079 41768 45419 47818 57724 59144
11704E9144o734n178r905p211q393k995Q210l065J2470J3692N885J6332j7953
$$ 59144 52410 47232 37327 30116 21723 18728 26938 23873 36343 50035 55920 72252 54299
11691E4299k2433R579L5171J2633m1457k2834J9991J9428K717k84J1454l356J1832
$$ 54299 31866 41445 76616 89249 47792 24958 44949 64377 67094 66810 78264 74908 86740
11678H6740K4729J0111L9857Q7745J01955P2580K459j2389k1864j2163n031K0033
$$ 86740 111469 121580 161437 249182 351137 423717 426176 413787 391923 379760 374729 394762
11666C94762J8933n4171r4513r1000m4362l5525k3882j1431j5274n136L400L0785
$$ 394762 413695 359524 265011 174011 129649 94124 70242 58811 43537 38401 41801 72586
11654G2586K0168j1752l788j2139k3009P080J3903L077L20K1985L5856M1323N1405
$$ 72586 92754 81002 77214 65075 42066 49146 63049 66126 66446 88431 124287 165610 217015
11641B17015P9076P0304M873p346j8707r573J2198J5502J6469o7428q9489o3429
$$ 217015 296091 366395 371268 363922 345215 335642 347840 363342 379811 312383 222894 159465
11629A59465m4689j6920R404m362j6040k3886n698k7101Q470J3813r347N61k41
$$ 159465 114776 97856 107260 102898 86858 62972 57274 30173 38643 52456 43109 43670 43429
11616D3429J0014k8445j8766j6312q680K4563J6836j3148P413j985M762J6183
$$ 43429 53443 24998 6232 -10080 -18760 5803 22639 9491 16904 14919 19681 35864
11604C5864J3687j7279L398j7942q931L0037J3005j2288j3963j1803J0450O991
$$ 35864 49551 32272 35670 17728 8797 38834 51839 39551 25588 13785 24235 31226
11592C1226j7290O694K7464J39j5254J773q387k1974k1019J6075K4712n735j5935
$$ 31226 13936 20630 48094 48233 32979 34752 26365 4391 -16628 -553 24159 18424 2489
11579B489o561J5444l714j1298O29R201J829P851P056L108J5579m353r763J930
$$ 2489 -4072 11372 7658 -3640 -3011 6190 8019 15870 22926 26034 41613 37260 27497 29427
11565B9427j1717k2920l003j258q252J2454K7249M13j2222L652K1107R574j8499
$$ 29427 17710 -5210 -8213 -9471 -17723 -5269 21980 22393 10171 13823 34930 44504 26005
11552B6005k0673R146J7319j8222j2956R601N093m609j2012q395L814J755N431
$$ 26005 5332 14478 31797 13575 619 10220 15313 10704 -1308 -9703 -5889 -4134 1297
11539A297K328M799j489O162j1286q805K020J2775N620K353J132J7657j1279j4958
$$ 1297 3625 8424 6935 13097 1811 -6994 -4974 7801 13421 15774 16906 34563 23284 8326
11525H326n17J353n565o905q152M456M078q583P948O143R260J5004m035r262j1118
$$ 8326 7809 9162 3597 -3308 -11460 -7004 -2926 -11509 -3561 2582 11842 26846 22811 13549 2431
11510B431k901l389Q605n734j6147j4743J2436M025P264J1298P665O060M188n41
$$ 2431 -470 -3859 4746 -988 -17135 -31878 -19442 -15417 -8153 3145 10810 16870 21058 20517
11496B0517O941l978o838M555J7361j3518o999P853k545k11j9061m785n685j899
$$ 20517 27458 23480 16642 21197 38558 25040 18041 25894 23349 23138 4077 -708 -6393 -8292
11482h292n341O071O530r80L58J1021j4640L202J4694n433j8056j1571n188J0244
$$ -8292 -13633 -7562 -1032 -2012 -1654 9367 -5273 -2071 12623 7190 -10866 -22437 -27625 -17381
11468a7381o868J7831O627N59J3401Q411K3j2507q421J60L594o353j9834j4785
$$ -17381 -24249 -6418 209 768 14169 22580 22603 10096 1675 1835 5429 -924 -20758 -35543
11454c5543J3925J0901N133j147k145J6612k500M491k244N924P548l384n197P558
$$ -35543 -21618 -10717 -5584 -6731 -8876 7736 5236 9727 7483 13407 20955 17571 12374 19932
11440A9932J258j911q193J226j4660j0544O627J2100Q64P50m410K9198j1660j4500
$$ 19932 21190 19279 11086 12312 -2348 -12892 -6265 5835 6699 7449 3039 32237 20577 6077
11426F077R238m611j2140J0816N624j6992n107M12N431n763P859K0390O33L885
$$ 6077 15315 10704 -1436 9380 15004 -1988 -7095 -6683 -1252 -7015 844 21234 21867 25752
11412B5752Q74k003r205q001o257k3318r606J7043O333l339J473L757n952j3838
$$ 25752 26626 24623 15418 7417 1160 -22158 -31764 -14721 -8388 -11727 -10254 -6497 -12449 -26287
11398b6287j0961J1324Q353J5496l61j3537j4905r905N152J7676P466O327r225
$$ -26287 -37248 -25924 -17571 -2075 -2436 -15973 -30878 -40783 -35631 -17955 -10489 -4162 -13387
11385a3387L137k374M713r209Q993P217M485k034k788P926q566j5335P31R144
$$ -13387 -10250 -12624 -7911 -17120 -8127 -910 3575 1541 -1247 6679 -1887 -17222 -16491 -7347
11371g347m176r886p939N95N919J5795Q962l295j3110L124J0862P419j4943k742
$$ -7347 -11523 -21409 -29348 -28753 -22834 -7039 1923 -1372 -14482 -11358 -496 6923 -8020 -10762
11357a0762K4564j2086k1240J3948J0944Q994P036m723j3384N268k743r075j5565
$$ -10762 13802 1716 -19524 -5576 5368 14362 21398 16675 3291 8559 5816 -3259 -18824
11344a8824J8713j0622j8839p159K876J0349K1262K7154r566j4922J0359O323
$$ -18824 -111 -10733 -29572 -36731 -33855 -23506 -2244 24910 15344 422 10781 17104
11332A7104k901j917L896j6258L027J680L65M101M343K795L464k8556j7744k494
$$ 17104 14203 12286 16182 -76 2951 4631 4996 9097 13440 16235 19699 -8857 -26601 -29095
11318b9095L666l078J2231O336K069K704J5205O107j9347j2264J2228L587j1848
$$ -29095 -25429 -28507 -16276 -9940 -7871 -5167 10038 16145 -3202 -15466 -3238 349 -11499
11305a1499k1728J8812m744n18N716K608j0558R621n744r93K34N780m893k857
$$ -11499 -33227 -14415 -19159 -19677 -13961 -11353 -21911 -12290 -18034 -19027 -18793 -13013 -17906 -20763
11291b0763j2377k748J4012P73J0294N779j0132O714k44n475J2736j099j1517
$$ -20763 -33140 -35888 -21876 -21103 -10809 -5030 -15162 -8448 -8692 -14167 -1431 -2530 -14047
11278a4047J213N088k3022k2121m722K6955J1751o486J469r187p244R383R854
$$ -14047 -12834 -7746 -30768 -52889 -57611 -30656 -18905 -25391 -23922 -33109 -40353 -30970 -21116
11265b1116O829J46n073k591n845J0814J3819O965P402j4991j8688q67J4443K0295
$$ -21116 -14287 -14141 -19214 -21805 -27650 -16836 -3017 3948 11350 -3641 -22329 -23196 -8753 11542
11251A1542J668J3749o238q864p724r334j448k4235Q458k547j2012k011j0525
$$ 11542 13210 26959 20721 11857 4133 -5201 -6649 -30884 -22426 -24973 -36985 -38996 -49521
11238d9521L228P519J5373J4917P068j3472m069r99k2396m110K3811J3548j349
$$ -49521 -46293 -38774 -23401 -8484 -1416 -14888 -18957 -19956 -42352 -46462 -22651 -9103 -10452
11225a0452P648j2081m213P244K06n629Q90j6463m445P299R792R993j2039k165
$$ -10452 -2804 -14885 -19098 -11854 -11648 -17277 -16387 -32850 -37295 -29996 -20204 -10211 -22250 -24415
11211b4415J4936R37l103J7104M734j4551j5385K677K8841J4611n068k8941n024
$$ -24415 -9479 -8542 -11645 5459 10193 -4358 -19743 -17066 11775 26386 21318 -7623 -12647
11198a2647J4360N131p09p186o289q44J6982J2256r201n051l635j1796l119J1868
$$ -12647 1713 6844 6135 -1051 -7340 -8184 8798 21054 11853 6802 3167 -8629 -11748 120
11184A20P052J0199p587k0397j7321n529J3185J9242l852r726O333J128P988k67
$$ 120 7172 17371 9784 -10613 -27934 -33463 -20278 -1036 -4888 -14614 -8281 -7153 835 568
11170E68j1447k0225J15R053l305q789M85Q265n67J6361O448j4379J7407O872
$$ 568 -10879 -31104 -30989 -21936 -25241 -34030 -33545 -25280 -25847 -9486 -3038 -17417 -10 6862
11156F862j086j0286m534n342k2912o050M412J0761K826J2440K559L980j0046
$$ 6862 5776 -4510 -9044 -14386 -37298 -43348 -38936 -28175 -25349 -12909 -10350 -6370 -16416
11143a6416J4832j374N562k890p237j650j4569q350J8709j642o024j2025K0808
$$ -16416 -1584 -2958 2604 -286 -7523 -9173 -23742 -32092 -13383 -15025 -21049 -33074 -12266
11130a2266J1868O882p177J7886o161k0110k1985r359R165J0980K87O709J2624
$$ -12266 -398 6484 -693 17193 11032 -9078 -31063 -40422 -31257 -20277 -19990 -13281 -657
11117f57O823N150k0614r852O550K1370O607L911n263k3097r41j8673R341n495
$$ -657 6166 11316 -9298 -19150 -12600 8770 15377 19288 14025 -9072 -10013 -28686 -19345 -24840
11103b4840n17m73P4j0806K3027L630L200j3922o988J5368J1191q240J7008r856
$$ -24840 -25357 -25830 -25756 -36562 -13535 -9905 -6705 -20627 -27615 -12247 -1056 -9296 7712 -2144
11089b144m954J0244L468o988k9725J7458n610J0109K6019J6777J1781m028k855
$$ -2144 -7098 3146 6614 -374 -30099 -12641 -18251 -8142 17877 34654 46435 42407 39552
11076C9552j5456r921n370j26L546m370n260J5062P375m297J5769L2123K1213
$$ 39552 24096 14175 8805 8679 12225 7855 2595 17657 25032 20735 36504 68627 89840
11063H9840J107K9026M3211N2356N4398Q6890R6439J17879P9420N6792M4148J8534
$$ 89840 90947 119973 163184 215540 269938 356828 453267 571146 650566 707358 751506 770040
11051G70040k1721j1283j3434q69l7683n4666q6709r6941q9914n1964l3615N384
$$ 770040 748319 737036 723602 722733 685050 630384 543675 446734 356820 304856 271241 276625
11039B76625J0535J966j2571J5754P520k380K225J8634K9303K4728L8353P6500
$$ 276625 287160 289126 276555 292309 299829 297449 299674 318308 347611 372339 410692 487192
11027D87192Q3291J07988Q9133O6948K7733J9734J0918J490j517j6608m4929o8750
$$ 487192 570483 678471 767604 834552 862285 882019 892937 894427 892910 876302 831373 762623
11015G62623q6649q8254r2539q3472m8862l5872j7837O192k6008m5069l5361k6507
$$ 762623 675974 587720 495181 411709 362847 326975 309138 315330 289322 244253 208892 182385
11003A82385m101N238M593k7572l0277k2835Q374J4223O690q854l0763k214p901
$$ 182385 178284 183522 188115 160543 130266 107431 115805 130028 136718 127864 97101 94887 86986
10990H6986p675p690j5603k0759P178O451l212m472j2386o079J9187l519J2663
$$ 86986 79311 71621 56018 35259 42437 48888 45676 41204 28818 22739 41926 38407 51070
10977E1070J1451Q377J521k0104P341j0104K0j3258J0680j401K147j2226k0257
$$ 51070 62521 70898 72419 52315 59656 49552 49572 36314 46994 45593 47740 35514 15257
10964A5257J0695K005k2312J5379r92j5321j232l460l656r162K001m143O859J8638
$$ 15257 25952 27957 5645 21024 20032 4711 3479 19 -3637 -12799 -10798 -14941 -8082 10556
10950A0556K9760J9123r903j6374k8733j810k163j2369j6737j2628J0306R615
$$ 10556 40316 59439 49536 33162 4429 2619 456 -11913 -28650 -41278 -30972 -21357
10938b1357J2383J155j0104m013J2829J6579J2288j669N688p45j7935k0788O282
$$ -21357 -8974 -7819 -17923 -21936 -9107 7472 19760 18091 23779 23034 5099 -15689 -9407
10925i407P491J7236p446o047R77L651kJ3092m609n787r955j3280K3364J6686
$$ -9407 -1916 15320 7874 1827 2804 6455 6453 19545 14936 9149 -806 -14086 9278 25964
10911B5964k311j8514k6279k207O22N789M276P445j2633m520J9554q174j0224
$$ 25964 23653 5139 -21140 -23347 -22725 -16936 -12660 -5215 -17848 -22368 -2814 -10988 -21212
10898b1212r807J0269L5725j580l4378l5248R946J6081k39J1937K1735m25r881
$$ -21212 -31019 -20750 14975 13395 -20983 -56231 -46285 -30204 -30443 -18506 3229 2804 -7077
10885g077j2096K1245J656r668Q07o273j6467o66J2043l539L965K852m292j61
$$ -7077 -19173 2072 3728 -5940 -5133 -11406 -27873 -28539 -16496 -20035 -16070 -13218 -17510 -17671
10871a7671J0022k0692j5536K4036K3554M647j0601q400k565p918J2829J5055
$$ -17671 -7649 -28341 -43877 -19841 3713 8360 -2241 -10641 -13206 -21124 -8295 6760
10859F760J1133Q088R922r056k5178L15k096n679J384K6699M283L38o113j3400
$$ 6760 17893 25981 35903 26847 1669 1984 -112 -5791 -4407 22292 26575 26913 20800 7400
10845G400J2154J7028p226j5229J1300r307N765O943J0202n495n960R273j049
$$ 7400 19554 36582 29356 14127 25427 16120 21885 28828 39030 33535 27575 36848 35799
10832C5799K032J2486Q000R769j9181n250J141j2399J2166K1837j55k8986k579
$$ 35799 37831 50317 58317 68086 48905 43655 44796 32397 44563 66400 66245 37259 34680
10819C4680J6069p401j2827M992o617o675P374L618M816P772q559N731J4259l0797
$$ 34680 50749 43348 30521 35513 28896 22221 29595 33213 38029 45801 37242 42973 57232 26435
10805B6435j1444Q448K3633J4813k9627j8916J1386l380k0329k817Q242N754m452
$$ 26435 14991 23439 47072 61885 32258 13342 24728 21348 1019 -1798 6444 12198 7746
10792G746j1019L505O707K940M679Q55Q925J181Q167p716M078j3353m946N196
$$ 7746 -3273 232 6939 9879 14558 15413 24338 25519 33686 25970 30048 16695 11749 16945
10778A6945K308P163P738q783k810j8618k4744r944N143J9546J9288p965p490
$$ 16945 19253 26416 34154 25371 22561 3943 -20801 -30745 -25602 -6056 13232 5267 -2223
10765b223j5770P766j4344P105O064P454O683J3161j887K655k232j1077k322M628
$$ -2223 -17993 -10227 -24571 -17466 -11402 -3948 2735 15896 14009 16664 14432 3355 1033 5661
10751E661J3787M623j2391j3458m547p980P418J1006k668q705j1622M162l762
$$ 5661 19448 24071 11680 -1778 -6325 -14305 -6887 4119 1451 -7254 -18876 -14714 -18476
10738a8476j98M468J622p92N618J5855K0094o769j4717L592m36K848j3537j0715
$$ -18476 -18674 -14206 -12584 -13376 -7758 8097 28191 21422 6705 10297 9861 12709 -828 -11543
10724a1543M450J704P996Q541K147j834J1600k0694j9514J5086o104r859p42K0955
$$ -11543 -7093 -5389 2607 11148 13295 11461 23061 2367 -17147 -2061 -8165 -18024 -18766 2189
10710B189J5102K9260L505k557M634K3q499o672J080M725J9857j0249K200m168
$$ 2189 17291 46551 50056 47499 52133 52156 43657 36985 38065 42790 62647 52398 54598 50430
10696E0430j7931P87q556J3272J4839R425j6192k4072l812K6538M2076J1380m996
$$ 50430 32499 33286 24730 38002 52841 62266 46074 22002 18190 44728 86804 98184 93188
10683I3188R10j0496k0010j7431l756J6144J487O728o125P525J1107K590j7785
$$ 93188 94098 83602 63592 46161 42405 58549 60036 66764 60639 68164 79271 81861 64076
10670F4076j3201N024J9142J1259l068q210Q226n644K613J2222K3750L7856J7499
$$ 64076 50875 55899 75041 86300 83232 75022 83248 77604 80217 92439 116189 154045 171544
10657A71544p27O953J8594J1459j9597J5434L0562J1474j2878j585R068j778j1460
$$ 171544 170817 177770 196364 207823 188226 203660 234222 245696 232818 231233 240301 238523 227063
10644B27063j3122l786K3674R279J6642L7553N6973O2985M7481N2426N1256N6648
$$ 227063 213941 210155 233829 243108 259750 297303 354276 417261 464742 517168 568424 625072
10632F25072N3290P8244Q6714J03564J43802J88041K14443L11337M19599N42124
$$ 625072 678362 756606 843320 946884 1090686 1278727 1493170 1804507 2224106 2766230
10622B766230O94514Q03473Q05840P10892N77325M89404M33317M38089N33673
$$ 2766230 3460744 4264217 5070057 5780949 6358274 6847678 7280995 7719084 8252757
10613H252757O44666P22575Q22757R96202J205738J164822R20407O08864M22243
$$ 8252757 8897423 9619998 10442755 11438957 12644695 13809517 14729924 15338788 15761031
10604A5761031L67816M64273O37031P39172P20229O36049P42602R64594R65985
$$ 15761031 16128847 16593120 17230151 17969323 18689552 19325601 20068203 21032797 21998782
10595B1998782O36775K12162m0649j01856p553J39509R3214k24341o60481p85891
$$ 21998782 22635557 22847719 22807070 22705214 22697661 22837170 22930384 22706043 22045562 21259671
10585B1259671n85215m48518m78023n89811o20576n62192m43318l56690m25128
$$ 21259671 20674456 20225938 19747915 19158104 18537528 17975336 17532018 17175328 16750200
10576A6750200o82078j014370j127419r71549p85801o59370o01836o12104n74281
$$ 16750200 16068122 15053752 13926333 12954784 12168983 11509613 10907777 10295673 9721392
10567I721392m83199m76900n44116o80331q27902q42088p47609o19679m70011
$$ 9721392 9238193 8761293 8217177 7536846 6708944 5866856 5119247 4499568 4029557
10558D029557l55201k89033k58523j91911j57911j36366j23181j17383j15841
$$ 4029557 3674356 3385323 3126800 2934889 2776978 2640612 2517431 2400048 2284207
10549B284207r3954r7638r5208q8154j00271q4927o0243n0536p1655n6382m4769
$$ 2284207 2190253 2092615 1997407 1909253 1808982 1724055 1663812 1613276 1541621 1485239 1440470
10538A440470l5682l1476k7491l6473m2704l9056o3770p1900l6371j9502m2867
$$ 1440470 1404788 1373312 1345821 1309348 1266644 1227588 1163818 1091918 1055547 1036045 993178
10527I93178k7251j0803m1553l5884k2421j1239k4870m6850m3512j3600j9837
$$ 993178 965927 955124 913571 877687 855266 844027 819157 772307 728795 715195 695358
10516F95358k3817k3384j5887l7202J3833K319m3554l4242q261M69O904k5530
$$ 695358 671541 648157 632270 595068 608901 611220 567666 533424 525163 525632 532536 507006
10504E07006k3002l698J0669m979j0791j7371j0581k7838j9898j6125j3251l094
$$ 507006 484004 480306 490975 485996 475205 457834 447253 419415 399517 383392 370141 367047
10492C67047J3090p814l7566m916J5276q033j9001n530j4443o485k1213o363m33
$$ 367047 380137 372323 334757 329841 345117 337084 318083 312553 298110 291625 270412 264049 263616
10479B63616J297r345j5083j8686j5295n249J6841l951O488j8939k93K3893n843
$$ 263616 264913 255568 240485 221799 206504 201255 218096 214145 220633 201694 201401 225294 219451
10466B19451j3594j887j1651k5199j4116N818K062N292J0295M41q679j1678j6050
$$ 219451 205857 203970 192319 167120 153004 158822 160884 166176 176471 176912 168233 156555 140505
10453A40505k854k645l494j1685o00o134l017j612j3121J2758O25J588O120k6174
$$ 140505 137651 135006 131512 119827 119227 113093 110076 108464 95343 108101 108726 110314 116434 90260
10439I0260j2517j067L62o207J6999J9886r152j6088j527q087J7668J6246p467
$$ 90260 77743 76676 77038 70831 87830 107716 98564 82476 80949 72862 90530 106776 99309
10426I9309j3122j2544j5129m42o660J3008K3241k6721k4359j0741r558J8761
$$ 99309 86187 73643 58514 58072 51412 64420 87661 60940 36581 25840 16282 35043
10414C5043K9186K0673m223l866o322k0446p310l358O711O639m014j781M683j9877
$$ 35043 64229 84902 80679 76813 70491 50045 42735 39377 46088 52727 48713 46932 51615 31738
10400C1738J0877o117l245K1108J9550j272j9710k4807l566l557R433m996J5873
$$ 31738 42615 36498 33253 54361 73911 72639 52929 28122 24556 20999 30432 25436 41309
10387D1309M5972j3347j3694j1290j044m958P445Q225n807j8113n680J552p596
$$ 41309 87281 73934 60240 48950 47906 42948 50393 58618 52811 34698 29018 30570 22974
10374B2974Q896J1266q941L472L528j4284l0324N284J067J9991J4362J2040M854
$$ 22974 31870 43136 34195 37667 41195 26911 -3413 1871 2938 22929 37291 49331 54185
10361E4185j1475O665R900M127k6785Q912m773J3011J1891m219q111Q480K6356
$$ 54185 42710 49375 59275 63402 36617 45529 40756 53767 65658 61439 53328 61808 88164
10348H8164Q403j0851m383m553J9075R121j6500R051L0682K2911k4318j2307k0512
$$ 88164 96567 85716 81333 76780 95855 104976 88476 97527 128209 151120 126802 114495 93983
10335I3983J0277J7939J9479o074j0034o130j335k189l770j3595l295p610K369
$$ 93983 104260 122199 141678 135604 125570 119440 118105 115916 112146 98551 95256 87646 90015
10322I0015K9894J7993m195o021J9973K3790J5902Q231K7128K1083J7482M4712
$$ 90015 119909 137902 133707 127686 147659 171449 187351 195582 222710 243793 261275 305987
10310C05987P0132P7393R2340J08669J08248J14544J32540J27702R9065O0367
$$ 305987 376119 453512 545852 654521 762769 877313 1009853 1137555 1236620 1296987
10300A296987N9381L3396k7477m5338q5418r4532r5159j01273j38590j03717q0469
$$ 1296987 1356368 1389764 1362287 1316949 1231531 1136999 1041840 940567 801977 698260 617791
10289F17791j09253q3062o1347m7440r264k3944k1709p777j6792k3920r014N334
$$ 617791 508538 425476 364129 316689 307425 283481 261772 253995 237203 213283 204269 209603
10277B09603J1149r273q536r66l775L297l394j6141j5813P503p93k4742J0931
$$ 209603 220752 211479 202943 201977 198202 201499 198105 181964 166151 173654 172861 148119 159050
10264A59050k495j1273k0741k5453k67R097Q55J8698j4798j2571j7479n545n956
$$ 159050 156555 145282 124541 99088 98821 107918 108773 127471 112673 100102 82623 77078 71122
10251G1122j3018m949P733J5521l60J1768m656j2486k1975j1738M837M5308J8802
$$ 71122 58104 53155 60888 76409 76049 87817 83161 70675 48700 36962 41799 87107 105909
10238A05909n750j1643J8487K5206l004k193P743Q388K1259r36j985j3913n727
$$ 105909 100159 88516 107003 132209 129205 127012 134755 143143 164402 163466 161481 147568 141841
10225A41841k141k621j5981j1968l8357j8064P98O733n057l780Q701O804J808
$$ 141841 139700 137079 121098 109130 70773 52709 53507 60240 55183 51403 60104 66908 68716
10212F8716j658o579L518J5982M087l024l306j5451N024M677r3j9426N158J2266
$$ 68716 67058 60479 63997 79979 84066 81042 77736 62285 67309 71986 71893 52467 57625 69891
10198F9891J2950O078j983Q883O76l963q067p250j3894k2231J0796q578j927J0190
$$ 69891 82841 88919 86936 95819 96495 92532 84465 77215 63321 41090 51886 43308 41381 51571
10184E1571J1228J1151L2683J0959K29j290Q096M715P711j1366j6025n96J2500
$$ 51571 62799 73950 106633 117592 117821 116531 124627 129342 137053 125687 109662 109066 121566
10171A21566M286j515O803J4527K9476N229J3645J6501J2097k617J5231J0223
$$ 121566 125852 124337 131140 145667 175143 180372 194017 210518 222615 219998 235229 245452
10159B45452R197j5068L851R738J511K123Q260j0021j5779L775J6824R044q089
$$ 245452 254649 239581 243432 253170 254681 256804 265064 255043 239264 243039 259863 268907 260818
10146B60818m067j8548o054q838P2j7724j8572P621p369j7013M789j4571p234
$$ 260818 256751 238203 232149 223311 223383 205659 187087 194708 187339 170326 175115 160544 153310
10133A53310j0545j1558K368Q442N775k211j8704r309N965K0377K4049Q414K2320
$$ 153310 142765 131207 133575 142017 147792 145581 126877 117568 123533 143910 167959 176373 198693
10120A98693K0871q735J0801p34J247j0841j2496j4531j2774j3379j0185r736
$$ 198693 219564 210829 221630 220896 222143 211302 198806 184275 171501 158122 147937 138201
10108A38201n137q113k3004j630P075r617j6915J276K7049K8362J0463Q154q213
$$ 138201 133064 124951 101947 100317 107392 97775 80860 82136 109185 137547 148010 156164 147951
10095A47951j9162J943N674P671L1727J5113n269K35m160j6248k1653j3182k7634
$$ 147951 128789 130732 136406 144077 175804 190917 185648 185883 181723 165475 143822 130640 103006
10082A03006j404j0245j1891j3809l817J2809L728o50P8N642J0770Q679L489m811
$$ 103006 101602 91357 79466 65657 61840 74649 78377 77727 77805 83447 94217 102896 106385 101574
10068A01574l6885K385K8611J9470J3004N518q884p877O347Q350k023O512J296
$$ 101574 64689 67074 95685 115155 128159 133677 124793 116916 123263 131613 129590 136102 137398
10055A37398j6037j5838K0382r650j1455M893q014k50j2430l0892j0251M293L4902
$$ 137398 121361 105523 125905 116255 104800 109693 101679 101429 88999 58107 47856 52149 87051
10042H7051j5796k7655J3278j2401j9962j9003K0673K6232J4182l527K7032K2879
$$ 87051 71255 43600 56878 44477 24515 5512 26185 52417 66599 63072 90104 112983
10030A12983J7690J2286J4947K2786N3122N9847K6670L5435L3755K9324J7635
$$ 112983 130673 142959 157906 180692 233814 293661 320331 355766 389521 418845 436480
10019D36480J3963M231J5651j5909k3949j9679j612L2657J7369O791n204m2625
$$ 436480 450443 454674 470325 454416 430467 410788 409176 441833 459202 465993 460789 418164
10007D18164j5690K6890K7547K4576O663j6441j098l669L6115K4259O369J2877
$$ 418164 402474 429364 456911 481487 488150 471709 470611 466942 503057 527316 533685 546562
9995E46562K665r836l411J9735J7386L867R565j8144n878K0255j723J1399Q23
$$ 546562 549227 539391 535980 555715 573101 576968 586533 568389 562511 582766 581043 592442 593265
9982E93265n095j1179Q941J71N24p561L983L9738M3045M0363J0872K4623J3312
$$ 593265 588170 576991 585932 586103 586627 579066 583049 622787 665832 706195 717067 741690 755002
9969G55002K5927Q528J898K6493M8361J3777J6333L2461M0333L9761J8018L8091
$$ 755002 780929 789457 791355 817848 866209 879986 896319 928780 969113 1008874 1026892 1064983
9957A064983M5116L8472O6229O9066P2562R2762Q5558J04097J24570J41571J67941
$$ 1064983 1110099 1148571 1214800 1283866 1356428 1449190 1534748 1638845 1763415 1904986 2072927
9946B072927J73910K07140K25015K54105K68634K69251K63289K80178K64994K32602
$$ 2072927 2246837 2453977 2678992 2933097 3201731 3470982 3734271 4014449 4279443 4512045
9936D512045K23286K22029K35030K58525K69531L42551M45576N23902O07512P26363
$$ 4512045 4735331 4957360 5192390 5450915 5720446 6062997 6508573 7032475 7639987 8366350
9926H366350Q56296J019488J141636J292891J482574J719138K006278K349533
$$ 8366350 9222646 10242134 11383770 12676661 14159235 15878373 17884651 20234184
9918B0234184K848597L613126M760607O500021R041082J2469199J6206227J9387507
$$ 20234184 23082781 26695907 31456514 37956535 46997617 59466816 75673043 95060550
9910I5060550K1793279K3649773K4465293K3537319K0838598J7685124J4152024
$$ 95060550 116853829 140503602 164968895 188506214 209344812 227029936 241181960
9903B41181960Q960303K819558l085015q907343j4580100j9227060k1221920k1188741
$$ 241181960 250142263 252961821 249876806 240969463 226389363 207162303 185940383 164751642
9895A64751642k1010367k0562920j9386185j7327408j4103816j0539730p711922
$$ 164751642 143741275 123178355 103792170 86464762 72360946 61821216 54109294
9888E4109294n726381m464367l634900l054796k640836k325076k112003j918725
$$ 54109294 48382913 43918546 40283646 37228850 34588014 32262938 30150935 28232210
9880B8232210j733642j603811j491163j358627j209518j109316j012501r16328
$$ 28232210 26498568 24894757 23403594 22044967 20835449 19726133 18713632 17797304
9872A7797304q45056p68439p10929o44994o19654o11009n70000n38366n16823
$$ 17797304 16952248 16183809 15472880 14827886 14208232 13597223 13027223 12488857 11972034
9863A1972034m93983m49576m29413m07173m01052l67899l47243l30728l04164
$$ 11972034 11478051 11028475 10599062 10191889 9790837 9422938 9075695 8744967 8440803
9854H440803k96042k83034k68642k47544k49432k28519k19517j84904k03051k14441
$$ 8440803 8144761 7861727 7593085 7345541 7096109 6867590 6648073 6463169 6260118 6045677
9844F045677j76223j76641j79952j55824j65982j38836j44188j18830j28897j27420
$$ 6045677 5869454 5692813 5512861 5357037 5191055 5052219 4908031 4789201 4660304 4532884
9834D532884j28674j24805j01887j17557j12671j12282j13909j00867q2652p1487
$$ 4532884 4404210 4279405 4177518 4059961 3947290 3835008 3721099 3620232 3537580 3466093
9824C466093r7300j14402j03919q5755o7099o8725q0132r8772r4539p5742o6830
$$ 3466093 3368793 3254391 3150472 3064717 2997618 2928893 2848761 2749989 2655450 2579708 2512878
9813B512878p7440n4079m0597n7009o5044n6015o0900l6343k0776l9553o2700
$$ 2512878 2435438 2381359 2340762 2283753 2218709 2162694 2101794 2065451 2044675 2005122 1942422
9802A942422m1128k9873l3854l8012l1937n5192m9802l4154k4272o2676m4933
$$ 1942422 1901294 1871421 1837567 1799555 1767618 1712426 1662624 1628470 1604198 1541522 1496589
9791A496589k9289k4324n7975k0335k8841j4776N382M9346N1005N7845M6019M9757
$$ 1496589 1467300 1442976 1385001 1364666 1335825 1321049 1326431 1375777 1426782 1484627 1530646 1580403
9779A580403L8832J0351j1634q683l467l8847o0220j04356j12277q8231m7888
$$ 1580403 1619235 1629586 1617952 1609269 1605802 1566955 1506735 1402379 1290102 1201871 1153983
9768A153983m2604n7136n0385m3852k7185m2994m3631k5404q434l5705l3992j8899
$$ 1153983 1111379 1054243 1003858 960006 932821 889827 846196 820792 812358 776653 742661 723762
9756G23762j5848k1281k6562l4737K46j4456l2857Q37J1987j621o171l121r797
$$ 723762 707914 686633 660071 625334 625580 611124 578267 579104 591091 589470 583299 580178 570381
9743E70381j2434o976j9202j3877m764o739q630Q398L299k1548J878K6899M882
$$ 570381 557947 550971 531769 517892 513128 506389 497759 506157 509456 487908 489786 516685 521567
9730E21567k0009J199k2790k0754O470J035j8290q234l94k223j2301j1760k9679
$$ 521567 501558 502757 479967 459213 465683 466718 448428 440194 439800 437577 425276 413516 383837
9717C83837j0031m820m09j9305k6817j9065j4866J8759J7334Q407J3111J0391
$$ 383837 373806 368986 368577 349272 322455 303390 288524 307283 324617 333024 346135 356526
9705C56526j8831K935J8319K4925J1413m725K770j1090r510P677O652p415k3105
$$ 356526 337695 340630 358949 383874 395287 390562 393332 382242 372732 380409 387061 379646 356541
9692C56541m397o563M044O520o922k13J2527N037l904L191j2661o441l325p257
$$ 356541 352144 345581 349625 356145 349223 349010 361537 366574 362670 365861 353200 346759 343434 336177
9678C36177K760m312P819l233n145m128m401J8731R54k384L081n528k4185j5228
$$ 336177 338937 334625 342444 339211 334066 329938 325537 344268 345222 342838 345919 340391 316206 300978
9664C00978n047K504O725O855O623J3017N564j2728n059R624M634j709j3087J690
$$ 300978 295931 298435 305160 312015 318638 331655 337219 324491 319432 329056 333690 331981 318894 320584
9650C20584K050k6562j0768R851r688O877j5858j1102n674j1610q573j1864l980
$$ 320584 322634 296072 285304 295155 285467 292344 276486 265384 259710 248100 239527 227663 223683
9637B23683n86p742n724m628O493o781L484r21o594k5176j0607P117p337j0163
$$ 223683 223097 215355 209631 205003 211496 204715 208199 207278 200684 175508 164901 172018 164681 154518
9623A54518j5365m948l912Q562J1323j434j5300j8060K0698M225j0961o34J3134
$$ 154518 139153 134205 130293 138855 150178 148744 133444 115384 136082 140307 129346 128712 141846
9610A41846P422M365J0100K54p784p975p332j8499k3870K2854J6951l358k927
$$ 141846 149268 153633 163733 163987 156203 148228 140896 122397 98527 121381 138332 134974 132047
9597A32047Q150j0934k2709K3074m403l059K719O160M659k1701M598J2922j8656
$$ 132047 140197 129263 106554 129628 125225 122166 124885 131045 135704 114003 118601 131523 112867
9584A12867K774J3270Q995j579q018N415P01j4039J435q020j7841J9896N618k1536
$$ 112867 115641 128911 137906 136327 128309 133724 134425 120386 121821 113801 95960 115856 121474 99938
9570I9938r904N552L141J5327J231J6000J95o473j0630k1390L923n671r071J1390
$$ 99938 90034 95586 98727 114054 115285 131285 131480 125007 114377 92987 96910 91239 82168 93558
9556I3558J622J6544N300J3562P63k4229m380k907Q676J2778j2161J93N363M216
$$ 93558 95180 111724 117024 130586 131349 107120 102740 99833 108509 121287 109126 109319 114682 118898
9542A18898L556Q711m580L302j1936k1225n124J1942J4040J2653N972Q451j299
$$ 118898 122454 131165 126585 129887 117951 96726 91602 103544 117584 130237 136209 144660 143361
9529A43361k895J4725O402p887l715L662l798o09R808J0935m482J8720K0237O123
$$ 143361 140466 155191 161593 153706 149991 153653 149855 149246 159054 169989 165507 184227 204464 210587
9515B10587J9359L4649L4892K4126M2513P2748R4040J04802J05194J23431J44719
$$ 210587 229946 264595 299487 323613 366126 438874 532914 637716 742910 866341 1011060
9504A011060J49649J00114P2955N9495K4923n754l7292n4999q4122r5905j17188
$$ 1011060 1160709 1260823 1333778 1393273 1418196 1412442 1375150 1320151 1236029 1140124 1022936
9493A022936j07843j01707j25067j08683r3607n8985m4219m2472k8038j9545k3190
$$ 1022936 915093 813386 688319 579636 486029 427044 382825 340353 312315 292770 269580
9482B69580p245r367k2678k8963j9476J697J847j5982q527j0140N887k0339k2964
$$ 269580 262335 252968 230290 201327 181851 183548 185395 169413 160886 150746 156633 136294 113330
9469A13330j9420k0522q212L1160K852L21j3079q756M453j192q584J0606J8338
$$ 113330 93910 73388 65176 96336 99188 99509 86430 77674 82127 80935 72351 82957 101295
9456A01295K2576J53k163j2961q064J0124n124j3601N888M09o831n348j470n6
$$ 101295 123871 124024 121861 108900 100836 110960 105836 92235 98123 98532 91701 86353 84883 84827
9442H4827j3648J4279K253R202J0609J2602m1O812K593l3020j6363P570L5231
$$ 84827 71179 85458 87711 96913 107522 120124 120083 126895 129488 96468 80105 87675 122906
9429A22906J1189J3256j980l674j7033p894Q02l675M065o38r075j9160p961l041
$$ 122906 134095 147351 145371 141697 124664 116770 117572 113897 117962 117324 108249 89089 81128 78087
9415G8087k730j332J1545J0934K368j0449P400J142k4734N388J8556q604m545
$$ 78087 75357 74025 85570 96504 98872 88423 95823 96965 72231 77619 96175 87571 83026
9402H3026o148K153K4542J3813j110N960n905o344k577j1860P982P15n307p309
$$ 83026 76878 79031 103573 117386 116276 122236 116331 109987 107410 95550 103532 104247 98940 91631
9388I1631m737j2380j6734n336J2669J9286P435j2122k8578M233J7398q455p754
$$ 91631 86894 74514 57780 52444 65113 84399 91834 79712 51134 55367 72765 64310 56556
9375E6556K2952J5730q935k5576j1593K2773J6633l036j3116j2030M47K307K3646
$$ 56556 79508 95238 86303 60727 49134 71907 88540 85504 72388 60358 60805 63112 86758
9362H6758m33j0290k419j0474n112O136k413q895p87o990J4736p237j4882j2581
$$ 86758 86325 76035 73616 63142 58030 64166 61753 52858 52071 45081 59817 52580 37698 25117
9348B5117O910l629M168m765l364O604R958L813K2894N663k2126q254J0997P988
$$ 25117 32027 28398 32566 27801 24437 31041 40999 44812 67706 73369 51243 42989 53986 61974
9334F1974J4039o088M787J7534K402o153n00j229j4906j5677N646J4516M131n150
$$ 61974 76013 69925 74712 92246 94648 88495 87995 86766 71860 56183 61829 76345 80476 75326
9320G5326J1759j3026j4961n050n135L609N412p198l106n84R199P75J4350L399
$$ 75326 87085 74059 59098 54048 48913 52522 57934 50736 47630 47046 56245 57020 71370 74769
9306G4769j2350N081p385q947p670m753J0339K151k1668p69O603J5136j242k0780
$$ 74769 62419 67500 60115 51168 43498 38745 49084 51235 29567 28798 35401 50537 49295 28515
9292B8515j6514q297J0569m47j0048O413Q049N086N104O947J0955o322K44L219
$$ 28515 12001 3704 14273 13826 3778 10191 18240 23326 28430 35377 46332 40010 40254 43473
9278D3473r535J7665j1970j8268N334J187J5273J091l843L631l553j0419J2325
$$ 43473 33938 51603 39633 21365 26699 27886 43159 44250 40407 44038 40485 30066 42391
9265D2391P707R314N045j7870K303J2470k268j0254M271k56q863j8727J845O920
$$ 42391 50098 59412 64457 46587 48890 61360 59092 48838 53109 52853 43990 25263 27108 34028
9251C4028P284k3602r933m077L55J9604J0330Q753l202q541j0554m823J8874M690
$$ 34028 41312 17710 7777 3700 4055 23659 33989 42742 39540 30999 20445 15622 34496 39186
9237C9186j6133o465J0274J2768j0264J5784J1104m290j6379O827r918M408n138
$$ 39186 23053 16588 26862 39630 29366 45150 56254 51964 35585 42412 32494 36902 31764
9224C1764M220N36p767j17k552K1363N201j4697L878p317j5792l424J8482J5131
$$ 31764 35984 36520 28753 28636 26084 47447 52648 37951 41829 34512 18720 15296 33778 48909
9210D8909k5383l186j2228j199K0853J4578l085j7375n168Q749k503j1411j0576
$$ 48909 23526 20340 8112 6913 27766 42344 39259 21884 16716 25465 22962 11551 975
9197I75L662J0165O025J6799J5084r831j3808m32r21P222p016j1135o242j3701
$$ 975 4637 14802 20827 37626 52710 42879 29071 28639 27718 34940 27924 16789 10547 -3154
9183c154M663J4119J1423J0188j7329j8356Q206J0421J0599n957r187J2288j02
$$ -3154 1509 15628 27051 37239 19910 1554 9760 20181 30780 24823 15636 27924 27822
9170B7822q642J1371j4078j1118j400J6306R940j5575j328n251p582p012L4932
$$ 27822 19180 30551 16473 5355 3955 20261 30201 14626 13298 8047 465 -6547 28385
9157B8385K0912j0954j8981m095N515N258p40L768M679R38m456P713J3457j033
$$ 28385 49297 38343 19362 15267 20782 26040 25300 29068 33747 34685 30229 37942 51399 50366
9143E0366k0837J5868K281k3226j617Q132P349O67Q054K987N231P123q222j1133
$$ 50366 29529 45397 47678 24452 22835 30967 38316 38983 47037 50024 55255 62378 54156 43023
9129D3023k752j10j4171M296p36l625k807q398J192J3568Q6j0092k485n545R093
$$ 43023 40271 40161 25990 30286 29550 25925 23118 14720 15912 29480 29566 19474 16989 11444 20537
9114B0537J2470N141K262p448J0654K741j2600j1266k3942l440Q199J4848m254
$$ 20537 33007 38148 40410 32962 43616 46357 33757 22491 -1451 -4891 3308 18156 13902
9101A3902J817K4824j0737o703O880L220r5K972J436J3887n154j0959J4993n347
$$ 13902 15719 40543 29806 23103 29983 33203 33108 36080 37516 51403 46249 35290 50283 44936
9087D4936j537m895Q63j0841j6423r191J7609J2448P735q857k8196j35J7225l763
$$ 44936 43399 38504 39367 28526 12103 2912 20521 32969 40704 31847 3651 3516 20741 16978
9073A6978m382O337K137M090j9261j4999M749J0682K3051N537P418k1205j0536
$$ 16978 12596 18933 21070 25160 5899 -9100 -4351 6331 29382 34919 42337 21132 10596
9060A0596J2708k648q791K040J4017K614o50j1998J2036j967P085j0216J0949
$$ 10596 23304 20656 11865 13905 27922 30536 29886 17888 29924 27957 35042 24826 35775
9047C5775K4275J4104N167p222k8342l082j0994q821J5414m309j5017J9057n904
$$ 35775 60050 74154 79321 72099 43757 40675 29681 20860 36274 31965 16948 36005 30101
9034C0101j7923j6601J5071K1459J6724l791k9386j587J4805J0457O063J3033
$$ 30101 12178 -4423 10648 32107 48831 45040 15654 14067 28872 39329 45392 58425
9022E8425R497q082M11l53J245j4640Q630k325K265p302j3052J2065J187J3575
$$ 58425 67922 59840 60251 59898 61143 46503 55133 52808 55073 47771 34719 46784 47971 61546
9008F1546K2317k2996j8335p730l388j0979O028m996P588K2386m812q467j164
$$ 61546 83863 60867 42532 34802 31414 20435 26463 21467 29055 51441 46629 38162 36998
8995C6998l461N024J086j1075r791n419N309J8874J5587j4662k4054J0001K383
$$ 36998 33537 38561 39647 28572 18781 13362 18671 37545 53132 38470 14416 24417 26800
8982B6800K174R958P202n289j40j0399j2821n713l2162J593P998M839J2556J9310
$$ 26800 28974 38932 46134 40845 40705 30306 17485 11772 -20390 -18797 -10799 -5960 6596 25906
8968B5906O35L629q017j4086l56N610J0411j2071j0160J32R549P075O391j3712
$$ 25906 26541 30170 22153 8067 7711 13321 23732 11661 1501 1633 11182 18257 24648 10936
8954A0936J017k1876n96K8324P648r342J6821K0121m51k5317J093O012m15j0717
$$ 10936 11953 -9923 -10519 17805 25453 16111 32932 53053 52602 27285 28378 34390 33975 23258
8940B3258O67J368P673j4764M073J288p509j2807j0376J8303Q838k2871r39q20
$$ 23258 23925 25293 32966 18202 22275 23563 16054 3247 -7129 11174 20012 -2859 -3798 -4618
8926d618O4J3578L955p778K1410M997j1518j5633m052L249M59j5604K143j125
$$ -4618 -4554 9024 12979 5201 26611 31608 20090 4457 405 3654 4113 -11491 -9348 -10473
8912a0473L379J8904J7249j8502j8881p431M30Q00J5120L6580J3727j510L889
$$ -10473 -7094 11810 29059 10557 -8324 -15755 -15325 -14525 595 37175 50902 49392 53281
8899E3281j3191P359n508k5335r29J665j7911K0720K8093K774P41j921k7784r897
$$ 53281 40090 47449 41941 16606 15677 17342 -569 20151 48244 51018 51759 49838 22054 12157
8885A2157J7735K8260q246j2457l740J3083n19j409k3965j4740j6517M786Q707
$$ 12157 29892 58152 49906 37449 33709 46792 46273 44864 20899 6159 -10358 -5572 3135
8872C135J3850K1790M922J3639r564k6128j012K108N960O319K854j3119m608r841
$$ 3135 16985 38775 43697 57336 47772 21644 20632 22740 28700 35019 37873 24754 20146 10305
8858A0305k1663J758J7462J1705J1898j884m794k2530K66K258K148l05L52P66
$$ 10305 -11358 -9600 7862 19567 31465 29581 24787 2257 2523 4781 6929 6624 6976 7742
8844G742Q651O743P235j346j1836l788J0123O849R523j2322P669J5948j9528j3749
$$ 7742 16393 23136 30371 29025 17189 13401 23524 30373 39896 27574 35243 51191 31663 17914
8830A7914K4858N724j1467r299m494m753o936R709J5874o328j9312N451j9453
$$ 17914 42772 48496 37029 27730 23236 18483 11547 21256 37130 30802 11490 16941 -2512
8817b512J512J921J2497m482Q524P552k126k7036M710J1971R791R348q050j4061
$$ -2512 -1000 921 13418 8936 17460 25012 22886 -4150 560 12531 22322 31670 23620 9559
8803I559n585O774J9192k668j315O428j3921o703k708L703k03M815m387j8715
$$ 9559 3974 10748 29940 27272 25957 32385 18464 11761 9053 12756 12553 17368 12981 -5734
8789e734k514J2093J5325l546k762P753J5810j0993j8584Q066l140j7539K908
$$ -5734 -8248 3845 19170 15624 12862 20615 36425 25432 6848 14914 11774 -5765 -2857
8776b857p19k317J2901K0517N046j6910q632J3460J14J442k101L631l401l699
$$ -2857 -3576 -5893 7008 27525 32571 15661 7029 20489 20603 22045 19944 23575 20174 16475
8762A6475P701o211m060N503K1792n509o029p70j951J866p15p270o610O61p158
$$ 16475 24176 17965 13905 19408 41200 35691 29662 28892 26941 28807 28092 20822 14212 14873 7715
8747G715L710j4245R214Q92J0858J8402N621R464M185l722k7345j7668K0617N308
$$ 7715 11425 -2820 6394 7286 18144 36546 42167 51631 55816 52094 24749 7081 27698 33006
8733C3006K426J632N055k1662L184J523k601j2068J8602J2869K38J208K174q33
$$ 33006 35432 37064 42119 20457 23641 25164 22563 10495 29097 41966 42204 43412 45586 44753
8719D4753R963j3697k1735j1415p198p533p116o466K819J0317N271M05Q469j2435
$$ 44753 54716 41019 19284 7869 671 -6862 -13978 -20444 -17625 -7308 -2037 -1632 6837 -5598
8705e598r408J2972J2273L238N165K879m763l150k863q463J0980Q823l881J421
$$ -5598 -15006 -2034 10239 13477 18642 21521 16758 13608 10745 2282 13262 22085 18204 19625
8691A9625L449l811j8508j0514J2032J2871M625M856J2527K219j5293k5771L456
$$ 19625 23074 19263 755 -9759 2273 15144 19769 24625 37152 39371 24078 -1693 1763
8678A763J0873J6165R344J14j5174J4776k343j2095k5931L858J9628K6074r70
$$ 1763 12636 28801 38145 38259 23085 37861 35518 23423 -2508 1350 20978 47052 46082
8665D6082m792J0987L774j7351j1270j0739j0475J4257n589j9047J7568R490j7524
$$ 46082 41290 52277 56051 38700 27430 16691 6216 20473 14884 -4163 13405 22895 5371
8652E371K11p876O34R902J7199N119N611N678j5684j4431j6057J2970J0626k259
$$ 5371 5582 -2294 -1660 8242 25441 30560 36171 41849 26165 11734 -4323 8647 19273 17014
8638A7014M011P071N082j4131N877J1007J2973J4720p35k1776j2963p648L170
$$ 17014 21025 28096 33178 19047 24924 35931 48904 63624 62889 41113 28150 20502 23672
8625B3672K1056p042J0284j1672j4060J3877J2573p596j8362M742M856J9250M380
$$ 23672 44728 37686 47970 36298 22238 36115 48688 41092 22730 27472 32328 51578 55958
8612E5958n833k4290j1462N275K12m010p42J2177M098L449m844J3174J1164O658
$$ 55958 50125 25835 14373 19648 19860 15850 15108 27285 31383 34832 29988 43162 54326 60984
8598F0984j3432k7778q314L45j2186q999j3304J1111K2229M295Q668R679L695
$$ 60984 47552 19774 11460 11805 -381 -9380 -22684 -11573 10656 14951 23619 33298 36993
8585C6993J1760p360k31P932K6627m977j4679l22q306J052k68K5497J7611R299
$$ 36993 48753 41393 41162 49094 75721 70744 56065 55743 47437 48489 48221 73718 91329 100628
8571A00628j5652k6973j710J8375K349j2825l011P298j1283N516J0808K132p158
$$ 100628 84976 58003 56293 74668 77017 64192 61181 68479 57196 62712 73520 75652 68494
8558F8494j1008K850j0085M801n697k2396M826J6925R577J3463L698M710j8838
$$ 68494 57486 60336 50251 55052 49355 26959 31785 48710 58287 71750 75448 80158 61320
8545F1320l4915N609J2468K644o632J7872l302k2548K674K0638K6726J4839o127
$$ 61320 26405 32014 44482 47126 40494 58366 55064 32516 35190 55828 82554 97393 91266
8532I1266L309P833R03J755J4429N887k512k0972k8878j9988j2047k668q947L949
$$ 91266 94575 102408 103311 105066 119495 125382 122870 101898 73020 53032 40985 38317 29370 33319
8518C3319J8328n688j4991J238P358j4802J3831J6925m620q002l258p571j5046
$$ 33319 51647 45959 30968 32206 39564 24762 38593 55518 50898 42896 39638 32067 17021
8505A7021p981R835N406J5161M472J3987j8263j1362Q887o280l752n067J5544
$$ 17021 9040 18875 24281 39442 43914 57901 39638 28276 37163 30883 27131 22064 37608
8492C7608J1685O182L6727M8297J5510J816r266j253o785j0830L2145J9217k9960
$$ 37608 49293 55475 92202 140499 156009 157825 148559 147306 140521 129691 161836 181053 151093
8479A51093m2687j2815k5585k5017k2425n37M2639M611j1016L684n53r842p787
$$ 151093 108406 95591 70006 44989 22564 22027 64666 69277 58261 61945 61392 51550 43763
8466D3763J3001l299n547j0703M290m864J871J936J3608l403k5756n94J4449J2266
$$ 43763 56764 53465 47918 37215 41505 36641 38512 40448 54056 50653 24897 24303 38752 51018
8452E1018J7398j1740k1458J1170O471N556J0848K2086L9392K8391r830j4722
$$ 51018 68416 56676 35218 46388 52859 58415 69263 91349 130741 159132 149302 134580
8440A34580l0527j0729J3253j660J4426j6821k2649k355k1683j4992j0999J341
$$ 134580 104053 93324 106577 104917 119343 102522 79873 77518 55835 40843 29844 31185
8428C1185q950R159p179j1033j290R822N634l56o566Q990m182r781J36J200P629
$$ 31185 22235 31394 24215 13182 11892 21714 27348 26992 20426 29416 25234 15453 15589 16789 24418
8413B4418M166L120M512j5503p51J0942P881K565j2782j7665R37N759L01q68l991
$$ 24418 28584 31704 36216 20713 19962 30904 38785 41350 28568 10903 11840 17599 17900 17032 13041
8398A3041p599J1774J431J7146P376q904j3755k110n60J0123j7075k1324M911
$$ 13041 5442 17216 18647 35793 43169 34265 20510 18400 17840 27963 10888 -10436 -5525
8385e525K2705j2585j7303N913J1442J9851K0049o145p010l758m308L415J2074
$$ -5525 17180 4595 -12708 -6795 4647 24498 44547 38402 31392 27634 23326 26741 38815
8372C8815q099j3842j9001l534O366N321J3959Q134Q64r758j2629p809l793M438
$$ 38815 30716 16874 -2127 -5661 705 6026 19985 28119 28983 19225 6596 -1213 -5006 -568
8358e68J4928J7040j0600k5812n642P212J1833p10J1022J3603k223j3795o325
$$ -568 14360 31400 20800 -5012 -10654 -3442 8391 7681 18703 32306 30083 16288 9963
8345I963k3511j1788J5948Q833L185J3909J218L979J4675P182j1561k3601o746
$$ 9963 -13548 -25336 -9388 -555 2630 16539 17757 21736 36411 43593 32032 8431 1685
8332A685r021p640o527K475J0396O689M492J4022O181J3131j0635j1873n301m995
$$ 1685 -7336 -14976 -21503 -19028 -8632 -1943 2549 16571 22752 35883 25248 13375 8074 3079
8318C079k67r117J7361J2961k0510k7568Q587L0432K2897j0895k7360o803O802
$$ 3079 2812 -6305 11056 24017 3507 -24061 -15474 14958 37855 26960 -400 -7203 -401
8305d01m569o556K1093P527o748M581J0647r222O216l562J008j7010l066J541
$$ -401 -4970 -11526 9567 17094 10346 14927 25574 16352 22568 19006 20014 3004 -62 1479
8291A479n8K040k2758k0138q360J6129J9461M006J003k906j0512J0958J8079N125
$$ 1479 1421 3461 -19297 -39435 -47795 -31666 -12205 -8199 -7196 -10102 -20614 -9656 8423 13548
8277A3548p70j826N971l22k139j2323J3487O543J2287P138K1074n162N483k0101
$$ 13548 12778 10952 16923 16601 14462 2139 15626 22169 34456 41594 62668 57506 62989 42888
8263D2888j2098Q55N653q856o763q695j00P460k4252j115R821O935l368j1444
$$ 42888 30790 31645 37298 28442 21679 12984 12884 20344 -3908 -5023 4798 11733 8365 -3079
8249c079J992j5780j5080N533Q030J3918J1566R527J5552j0574o271J6993N800
$$ -3079 -1087 -16867 -31947 -26414 -18384 -4466 7100 16627 32179 21605 15334 32327 38127
8236C8127j1652N67J5320J2793k6663j7623R051J8261K4622j8967j8622Q036j2857
$$ 38127 26475 27042 42362 55155 28492 10869 19920 38181 62803 43836 25214 33250 20393
8223B0393J297n862R31N389J0764J377j693o652k877K851q498m201j405P641l117
$$ 20393 21690 15828 16759 22148 32912 34289 32596 25944 23067 25918 17420 13219 11814 19455 16338
8208A6338q049m1008k8221Q836K9897Q934P659K7696P738j1322q235M48j2J2285
$$ 16338 8289 -32719 -60940 -52104 -22207 -13273 -5614 22082 29820 18498 10263 10711 10699 22984
8194B2984k2795j2138J6337N583J4623M471j891l603k1728k4784m796J850Q007
$$ 22984 189 -11949 4388 9971 24594 29065 27174 23571 1843 -22941 -27737 -25887 -17880
8181a7880J2765O046j0733L342J3944P376K865k1o809q297p213P451J7906K782
$$ -17880 -5115 931 -9802 -6460 7484 14860 17725 17704 10895 2598 -4615 2836 20742 23524
8167B3524j0757R108J5865k080k1769o618l134p648j7094m722l928K8012J9027
$$ 23524 12767 21875 37740 35660 13891 7273 4139 -3509 -20603 -25325 -29253 -1241 17786
8154A7786K248J602j2971j9038p941J2358m825m933J2792M342M04J0925J1268
$$ 17786 20034 21636 8665 -10373 -18314 -5956 -10781 -15714 -2922 1420 1824 12749 24017
8141B4017l78N005m190j3210j5509o377K1060N426J44n411P78J2660j5371p103
$$ 24017 23639 28644 24454 11244 -4265 -10642 10418 15844 15988 10577 11355 24015 8644 1541
8127A541j75j7549p678J5215L472K142K6399L260n919j1647J4433J6063q236j892
$$ 1541 1366 -16183 -23861 -8646 -5174 -3032 23367 26627 20708 9061 23494 39557 31321 29429
8113B9429j0600J6017o54j1225L261k296k8974j4452Q609J5219k6j8836o007J4014
$$ 29429 18829 34846 34192 22967 26228 23932 -5042 -19494 -10885 4334 4308 -14528 -20535 -6521
8099f521N213J948l812K3003J4139j341L2j1106j3827m493J8928j6827j2638K1214
$$ -6521 -1308 640 -3172 19831 33970 32629 32661 21555 7728 3235 22163 5336 -7302 13912
8085A3912j287j9800K209K515J355J1383j992K371J2206J2611O35K0387O389j7309
$$ 13912 12625 -7175 -4966 -2451 -1096 10287 8295 10666 22872 35483 36118 56505 62894 45585
8071D5585k08K851m707K887j0342J7557J9359j6100j3137L52k212r349J0792k766
$$ 45585 45377 48228 43521 46408 36066 53623 72982 56882 43745 44097 41885 32536 43328 40562
8057D0562J2862k759j776o210M185J379j5702p510L556K703m311k2797p859M0354
$$ 40562 53424 50665 48889 42679 46864 48243 32541 25031 28587 31290 26979 4182 -3677 36677
8043C6677L747K568M29k2900J535j0485O379j3259j4018P728J3957j724K347J2687
$$ 36677 40424 42992 43421 20521 22056 11571 17950 4691 -9327 -1599 12358 10634 12981 25668
8029B5668J6707j2669k864K504p842J4542K09O778q917k7341p709q660r148K2664
$$ 25668 42375 29706 26842 29346 21504 36046 36255 43033 34116 6775 -934 -9594 -18742 3922
8015C922K4464j826n593p302k196m273N906J9473o765n362o699K629K1889p442
$$ 3922 28386 26560 20967 13665 11469 7196 13102 32575 25810 20448 13749 16378 38267 30825
8001C0825J147N848L011j0492j4396Q152k383P765n784l1341j5070O1L0807L533
$$ 30825 31972 37820 40831 30339 15943 24095 21712 29477 23693 -7648 -22718 -22657 8150 11683
7987A1683N050J0706j1819m758P39J3888K602n832L283J43r307l457O297J3641
$$ 11683 16733 27439 15620 10862 11601 25489 28091 22259 25542 25685 16378 12921 19218 32859
7973C2859O057N658K777p428J4373M761q956k565k6474j8785j36K011l85K3900
$$ 32859 38916 44574 47351 39923 54296 59057 50101 47536 21062 2277 2141 4152 3767 27667
7959B7667K2444O550n286k6127k2796j6353M719J6691J97l342J1235l712j6637
$$ 27667 50111 56661 51375 25248 2452 -13901 -9182 7509 7706 4364 15599 11887 -4750
7946d750p49q613J9671J7569R679L54p471k909p95j470J481L746l605K312p429
$$ -4750 -5499 -14112 5559 23128 32807 33161 25690 22781 21986 20516 21997 25743 22138 24450 17021
7931A7021j3400j6986J2102M091J5985O185K254p479j2267o340j7094J6425K6670
$$ 17021 3621 -13365 -1263 2828 18813 24998 27252 19773 7506 1166 -15928 497 27167
7918B7167q50j5412k1824r596J253J2811l401K173K7259J2389j6715k3449n644
$$ 27167 26317 10905 -10919 -20515 -19262 -6451 -9852 -7679 19580 31969 15254 -8195 -13839
7905a3839O105j1669J1866m339J6903J1662r05j6753q216J2991O173p56M73J9924
$$ -13839 -7734 -19403 -7537 -11876 5027 16689 15784 -969 -9185 3806 9979 9223 9696 29620
7891B9620r828k5572m680P689Q537l913j1468K0212J5115p017j4676K16p611M532
$$ 29620 19792 -5780 -10460 -2771 5766 1853 -9615 10597 25712 18695 4019 4235 -3376 1156
7877A156l638q098m877n049K4062K0609j5267K97K0329M351m92M859j234K411
$$ 1156 -2482 -10580 -15457 -20506 3556 24165 8898 9195 29524 33875 33383 38242 37008 39419
7863C9419J310q318o202R830j013j7969q849K532k040j888O85P99L37P461k844
$$ 39419 40729 32411 26209 36039 35026 17057 8208 10740 8700 6812 7497 8296 8633 16094 13250
7848A3250p304J0066M680j3117j3764j86J1409L650p765j0230n762Q495J3354
$$ 13250 5946 16012 20692 7575 -6189 -6375 5034 8684 919 -9311 -15073 -6578 6776
7835F776J8071j23j9726o24k8331J858N401J1008J6961O411J0159L767k8781k0452
$$ 6776 24847 24724 4998 4374 -23957 -22099 -16698 -5690 11271 17682 27841 31608 2827 -17625
7821a7625J3604P242M086q329P373j3080k0709J0581J8661K8108n875k0415p509
$$ -17625 -4021 3221 7307 -1022 6351 -6729 -27438 -16857 1804 29912 24037 3622 -3887
7808c887r260P601J227J3548J0085m655k5239r245J3214j0451l764P871k266L415
$$ -3887 -13147 -5546 -4319 9229 19314 14659 -10580 -19825 -6611 -17062 -20826 -12955 -15221 -11806
7794a1806r047p510J5517Q268j987L546J8819L901j57p402M698J2740p207n876
$$ -11806 -20853 -28363 -12846 -4578 -6565 -3019 15800 19701 19544 12142 16840 29580 22373 16497
7780A6497j3985P583K511k0152j333K1064j0074J4317o804k1359j3886N254j2818
$$ 16497 2512 10095 12606 -7546 -8879 12185 2111 16428 9624 -11735 -25621 -20367 -33185
7767c3185J556N357J6763j2088k796j6373M239K1088K062K883M599J2386K5M452
$$ -33185 -31629 -26272 -9509 -21597 -24393 -40766 -36527 -15439 -13377 -10494 -5895 6491 6516 10968
7753A0968j9522j2447N826l01J0303J4404O20j56n003k1157K4760R726j5145Q260
$$ 10968 -8554 -21001 -15175 -15476 -5173 9231 9851 9695 4692 -16465 8295 18021 2876 11136
7739A1136k617J969J1585k600o721k1469j2334j382J5091J6459j280j6481q729
$$ 11136 8519 10488 22073 19473 12752 -8717 -21051 -22433 -7342 9117 7837 -8644 -17373
7726a7373J220J1466Q121J1092J0102J1820j5133j9748L503P517j649j3829Q51
$$ -17373 -16153 -4687 3434 14526 24628 36448 21315 1567 5070 12587 10938 -2891 -2040
7713b040J6018L110j0293j829q718n245j615O696j56l552J3245L2068o508k5543
$$ -2040 13978 17088 6795 4966 -3752 -8997 -10612 -3916 -4072 -7624 5621 37689 31181 5638
7699E638j807l47q184K065J1050p022n091k1616j059K1075L0286m704k4467n897
$$ 5638 3831 3484 -4700 -2635 8415 1393 -3698 -25314 -26373 -5298 24988 20284 -4183 -10080
7685a0080k258R711p40M274O839l776j529P833k3568j2510j1881O701Q923J0148
$$ -10080 -12338 -2627 -3367 907 7746 3970 2441 10274 -13294 -25804 -37685 -30984 -22061 -11913
7671a1913J1649k246J254R876m329P752q039r638Q008Q511m369P466J6790J4142
$$ -11913 -264 -2510 -1256 8620 4291 12043 4004 -5634 2374 10885 6516 13982 30772 44914
7657D4914Qk2585k2605R725j617j0308L963r78O701l563p473R66R922M79j4200
$$ 44914 44922 22337 -268 9457 7840 -2468 1495 517 7218 3655 -3818 -2852 7070 7549 -6651
7642f651J0348K167j77r790r94R699P740r270r024M013o787r663j0551J9892n918
$$ -6651 3697 5864 5687 -4103 -5097 4602 12342 3072 -5952 -1939 -8726 -18389 -28940 -9048 -14966
7627a4966P71K1623j8390k9828N492J7882k035q08j371j2735K667K7416J3296
$$ -14966 -14195 7428 -10962 -40790 -35298 -17416 -19451 -20259 -21630 -34365 -31698 -4282 9014
7614I014J2211m292j8897j9000J2685J225M813J4929N004k900p503m35p487k237
$$ 9014 21225 16933 -1964 -20964 -8279 -7054 -2241 12688 17692 14792 7289 6854 -633 -2870
7600b870j4596K1514n799j2367L2530J8615j7038k5305k4948J0454P145n437k044
$$ -2870 -17466 4048 -1751 -14118 18412 37027 19989 -5316 -30264 -19810 -12665 -18102 -20146
7587b0146J0065R769K0456P913j6040j8742j6224n526J0546J5476J2697j665k411
$$ -20146 -10081 -312 20144 28057 12017 -6725 -22949 -28475 -17929 -2453 10244 8579 6168
7574F168O940p955J1641M879j2635j7460Q406o280j0599k9183m823L2898K2494
$$ 6168 13108 5153 16794 21673 9038 -8422 -16 -6296 -16895 -46078 -50901 -18003 4491
7561D491J2123P766R600k866n437m878L390l2717k072R703M37Q055L852l208n16
$$ 4491 16614 24380 33980 31114 25677 20799 24189 -8528 -10600 -897 -460 7595 11447 8239 7723
7546G723L562j191j5728l78K536r916J59J666J4657N357r271l038q728J1903J4252
$$ 7723 11285 10094 -5634 -6012 -3476 -13392 -13233 -11567 3090 8447 -824 -3862 -12590 -687 13565
7531A3565j123j0791r706j570m546P180J1054L138R783J527m360j5023N065q413
$$ 13565 12442 1651 -8055 -9625 -14171 -6991 4063 7201 16984 18511 14151 -872 4193 -4220
7517d220L847J208o370l384n093M676R909K1446k73q287k5070R484P708o45o447
$$ -4220 -373 835 -5535 -8919 -14012 -9336 573 22019 21746 13459 -11611 -2127 5581 4936 -1511
7502a511k923j0306N697r801j7222K891J3099J1097r791J6273N923j1687P996
$$ -1511 -4434 -14740 -9043 -18844 -36066 -33175 -20076 -8979 -18770 -2497 3426 -8261 -265
7489b65M065m481O355l319L195k673k862J6833l877r277j273q968O28L932J7210
$$ -265 3800 -681 5674 2355 5550 2877 15 16848 12971 3694 2421 -6547 -5919 -1987 15223
7474A5223R442j0555p390K800O317J0752j8479k4353r317J3853K636p467J4263
$$ 15223 24665 14110 6720 9520 15837 26589 8110 -16243 -25560 -11707 -9071 -16538 -2275
7461b275K2933j6043l6131l46m130k89R801K2788J4033K0218p83l3070j3811P797
$$ -2275 20658 4615 -31516 -31862 -35992 -36281 -26480 -3692 10341 30559 29776 -3294 -17105 -9308
7447i308j673Q858O231J725k0932N975J2033K371Q924K244r147J1825Q859J0919
$$ -9308 -10981 -2123 4108 5833 -15099 -9124 2909 5280 14204 16448 7301 19126 27985 38904
7433C8904n764k3553j4769j404k706P576O133J3592R71p712L654Q284M376j5437
$$ 38904 33140 9587 -5182 -6586 -9292 -1716 4417 18009 18980 11268 14922 23206 27582 12145
7419A2145j4372P911J707o903M821j8325q671J0003m370R142J3201J0515p966
$$ 12145 -2227 5684 7391 488 5309 -13016 -21687 -11684 -16054 -6912 6289 16804 8838
7406H838k4414j857K170J3322J4156p872j4029K534J2623j48Q684l1441j1693
$$ 8838 -15576 -17433 -15263 -1941 12215 4343 -9686 -7152 5471 5323 14007 -17434 -29127
7393b9127K476J5149J0143j0277p184Q726M239q389J963j4896O626R869j5686
$$ -29127 -26651 -11502 -1359 -11636 -18820 -10094 -5855 -14244 -12281 -27177 -20551 -10682 -26368
7380b6368L166K3136J2110J919j0871r136l201J8279J1345j4928j3904j4121J7667
$$ -26368 -23202 -66 12044 13963 3092 -6044 -9245 9034 20379 5451 -8453 -22574 -4907
7367d907M055k2022j3904l044J6991m341K30P531o789R384K0517j991j4902j0332
$$ -4907 -852 -22874 -36778 -39822 -22831 -27172 -26942 -19411 -26200 -16816 3701 1710 -13192 -23524
7353b3524n903j744J1890K4586n998m866l631j9989O670L765m185p378l238J1397
$$ -23524 -29427 -31171 -19281 5305 -693 -5559 -9190 -29179 -22509 -18744 -22929 -30307 -33545 -22148
7339b2148K0090J3990j4639l550P775o601Q531J3640J2855q404k5293j426K600
$$ -22148 -2058 11932 -2707 -6257 1518 -5083 3448 17088 29943 21539 -3754 -5180 -2580
7326b580n968M331Q879N37k786N317k23k565Q084m34O020n313j4971r946J6646
$$ -2580 -8548 -4217 4662 5199 2413 7730 7507 4942 13026 12592 18612 13299 -1672 -11618 5028
7311E028J989K796K0472l866j9402Q212r207L454q119Q252q257j6999R855J8448
$$ 5028 7017 9813 30285 26419 7017 15229 6022 9476 1357 9609 1352 -15647 -5792 12656
7297A2656k486j9535j158J9377j967j1001k3138Q85L4788K4009p409j2590j2475
$$ 12656 10170 -9365 -10523 8854 6887 -4114 -27252 -26367 8421 32430 25021 12431 -44
7284d4M512j935k080O573o793Q059J1236L531o412r676J0091O450J1404j5662
$$ -44 4468 2533 453 7026 233 8292 19528 23059 16647 6971 17062 23512 34916 19254
7270A9254k1474j2347j7053K416J1763k850J992N664J1583p143k7403j5952P130
$$ 19254 -2220 -14567 -31620 -29204 -17441 -20291 -18299 -12635 -1052 -8195 -35598 -51550 -44420
7257d4420Q42r709q586J3273K5255M860J690O249J4958q633k7493k806L925K4953
$$ -44420 -43578 -53287 -61873 -48600 -23345 -18485 -16795 -10546 4412 -4221 -31714 -34520 -30595 -5642
7243e642J2908j1985j7871m219J5120l78J4294J5005j9623r023P694j9569l600
$$ -5642 7266 -4719 -22590 -26809 -11689 -12067 2227 17232 -2391 -11414 -3720 -23289 -26889
7230b6889P824j7502j1674R947K3711q729M294r509K938K1096j7493k0178o468
$$ -26889 -19065 -36567 -48241 -38294 -14583 -23312 -19018 -28527 -25589 -4493 -21986 -42164 -48632
7217d8632O395o593K4221J0133L782J1231J2372J284j350j4974J6577l369k5803
$$ -48632 -42237 -48830 -24609 -14476 -10694 537 12909 14193 12843 -2131 14446 11077 -14726
7204a4726j6014N540L160J3081L048l750J2976m201l445o75r368O108J1296j4527
$$ -14726 -30740 -25200 -22040 -8959 -5911 -9661 3315 -886 -4331 -5006 -14374 -8266 3030 -11497
7190a1497q435J453J4882J5411j9295j141O325J7954j1857o343L442l507o866
$$ -11497 -19932 -18479 -3597 11814 -7481 -8622 -2297 15657 3800 -2543 899 -2608 -9474
7177i474M90j333L057j2788j66Q005O190N731m522k783J6197p279j4026J2126
$$ -9474 -8984 -10317 -7260 -20048 -20214 -12209 -6019 -288 -4810 -7593 8604 1325 -12701 -575
7163e75J1445J3385j7858r217j544q462l498k324J5466J5508j5112p167j0984
$$ -575 10870 24255 6397 -2820 -4364 -12826 -16324 -18648 -3182 12326 -2786 -9953 -20937
7150b0937j0706n635J398P962k795N409J1524K1246o296N71J0772n193k729n449
$$ -20937 -31643 -37278 -35880 -27918 -30713 -25304 -13780 7466 1170 1741 12513 7320 4591 -858
7136h58j247p84p570R069K336k4217O590J1370J5431j692l564R51m775j1702m014
$$ -858 -2105 -2889 -10459 -1390 946 -23271 -16681 -5311 10120 8428 4864 5815 1040 -10662 -14676
7121a4676p5K1272K4607k1457K767N058M689j2200j5594J5880J2770K053j6045
$$ -14676 -14751 6521 31128 9671 12438 17496 22185 9985 -5609 10271 23041 25094 9049
7108I049P896J5013m491j9318j3424j4276j4568N053J9596J4700k310m022r798
$$ 9049 16945 31958 27467 8149 -5275 -19551 -34119 -29066 -9470 5230 2920 -1102 -10900
7095a0900k2224N81J8413R054j2974j2026J8444l3J5528J2478o425k2396k524
$$ -10900 -33124 -32543 -14130 -5076 -18050 -30076 -11632 -11665 3863 16341 9916 -12480 -15004
7082a5004r254M317q122j8019r233J9501J3239n438r840J1519J5146p309j1721
$$ -15004 -24258 -19941 -28063 -46082 -55315 -35814 -22575 -28013 -37853 -26334 -11188 -18497 -30218
7069c0218J2799K5983M99j3893O310k309n798K347J5813q707R844j508j9489J4700
$$ -30218 -17419 8564 9063 -4830 1480 -829 -6627 -4280 11533 2826 12670 11162 -8327 6373
7055F373J9702j0761j6395j4004j4820m455L1477J0890J5055j750j3208Q419L331
$$ 6373 26075 15314 -1081 -15085 -29905 -34360 -2883 8007 23062 21312 8104 16523 19854
7042A9854Qj9368J5184j0656j772q462j6286m561K768q395o809K0963P957N658
$$ 19854 19862 494 15678 5022 3250 -5212 -21498 -26059 -23291 -31686 -38495 -17532 -9575 -3917
7028c917J0529o312j247n192o548O871J8091r642k0473q502J1006j3923J692K1324
$$ -3917 6612 300 -947 -6139 -12687 -5816 12275 2633 -17840 -26342 -15336 -29259 -27567 -6243
7014f243J4479j345j1858j652J220j3007J4912K269O316j3671j6769P030r26P30
$$ -6243 8236 6891 -4967 -6619 -5399 -18406 -3494 -1225 5091 -8580 -25349 -18319 -19245 -18515
7000a8515q006p754J5742J9059m911l60J0836J446M956M578p141k2245o052J6222
$$ -18515 -26521 -34275 -18533 526 -4385 -4745 6091 7537 12493 17071 9930 -12315 -18367 -2145
6986b145K1631J3477M987j730l415k5996k9490o35J0409q151N077P061j6893n088
$$ -2145 19486 32963 37950 36220 32805 6809 -22681 -23316 -12907 -21058 -15981 -8920 -25813 -30901
6972c0901J9951J8468J0501p825j1734j7744K3709P270j9800J754K768L326K83
$$ -30901 -10950 7518 18019 10194 -1540 -19284 4425 11695 -8105 -6351 -3583 -257 26
6959B6M275K765j5880n432K694M884Q399l384J70j045K2641P783m350k2021o379
$$ 26 4301 7066 -8814 -14246 -11552 -6668 1731 -1653 -1483 -2528 20113 27896 23546 1525 -4854
6944d854k748p720j8619q976J220J058J2521K1982m526j3320M693J0573P245J4326
$$ -4854 -7602 -15322 -33941 -42917 -41697 -40639 -28118 -6136 -10662 -23982 -19289 -8716 -1471 12855
6930A2855J4619k913n256J648R734q033k0452L239L732k2917j4403P434j672n283
$$ 12855 27474 24561 19305 20953 30687 22654 2202 5441 9173 -13744 -28147 -20713 -22385 -27668
6916b7668J5573L464l949M864N983o369J1712J2037j8262r968J1815N884j698
$$ -27668 -12095 -8631 -12580 -7716 -1733 -8102 3610 15647 -2615 -12583 -768 5116 3418
6903C418r866j0883J1005J3241M141Q781P176J597j4292j0294K782j2806j4536
$$ 3418 -6448 -17331 -6326 6915 11056 19837 27013 28610 14318 4024 6806 -6000 -20536
6890b0536P263n86L918J5169M461K506p93j9426J9167K4060j084p360k5883O071
$$ -20536 -13273 -13859 -9941 5228 9689 12195 11402 -8024 11143 35203 34119 26759 876 6947
6876F947J8102k31j2105J91j0333N61o781k1329J2717O302o503l920J7429K834
$$ 6947 25049 24818 12713 12904 2571 3132 -3649 -24978 -12261 -5959 -12462 -16382 1047 3881
6862C881j799N139j433k4909j403J8412J1353n93k229J4922P279k0177r439J1896
$$ 3881 2082 7221 5788 -19121 -20524 -2112 9241 8648 6419 21341 28620 8443 -996 10900
6848A0900p881j8621m73J0269r345P474M166k6455R788k135J0537L467n761J70
$$ 10900 3019 -15602 -16075 -5806 -15151 -7677 -3511 -29966 -20178 -22313 -11776 -8309 -14070 -13900
6834a3900R209J5009J791M795j42m857N895J9823j4612m952k359j8481o167L084
$$ -13900 -4691 10318 12109 16904 16762 11905 17800 37623 23011 18059 15700 -2781 -8948 -5864
6820e864r675n427j7136O870K1203J4683Q01k6389L81K509j3059n868K685J933
$$ -5864 -15539 -20966 -38102 -31232 -10029 4654 5455 -20934 -20553 -18044 -31103 -36971 -34286 -32353
6806c2353J6024j1216N393M744k474j0334Q19K1367J0226m966k5465P205K2919
$$ -32353 -16329 -27545 -22152 -17408 -19882 -30216 -29397 -8030 2196 -2770 -28235 -21030 1889
6793A889k378n219j4996L978J1189Q079M242j1660J779l368K100l069j249n94
$$ 1889 -489 -5708 -20704 -16726 -5537 2542 6784 -4876 -3097 -6465 -4365 -7434 -8683 -9277
6779i277R944L839j2894O12Q36k080P504J0815j7787q691Q127J2006K559J1996
$$ -9277 667 4506 -8388 -7776 -6940 -9020 -1516 9299 -8488 -17179 -9052 2954 5513 17509
6765A7509l966j1170N314J0638o252j1339j0556R521K249m110j5457q052q997
$$ 17509 13543 2373 7687 18325 12073 734 -9822 -301 1948 -2162 -17619 -25671 -34668
6752c4668Q318J9015N937j2684m064M703L7031J2350J195o580P072j0352r847
$$ -34668 -26350 -7335 -1398 -14082 -18146 -13443 23588 35938 37133 30553 37625 27273 17426
6739A7426J2468K501q325l411j127k4004m0547K3792J5980p536k107N754K5841
$$ 17426 29894 32395 24070 20659 19532 -4472 -45019 -21227 -5247 -12783 -14890 -9136 16705
6726A6705J2208L196P390j810j712m482R382j7291J998J313r884l2767k2662q79
$$ 16705 28913 32109 39499 37689 35977 31495 40877 23586 25584 26897 17013 -15754 -38416 -39295
6712c9295k786J7813J5233r16k623r830Q502L280k699L2013j1378m112j528j1915
$$ -39295 -42081 -24268 -9035 -9951 -12574 -22404 -13902 -10622 -13321 18692 7314 3202 1674 -10241
6698a0241J9443n844p125L604K3942q828j9670J0098J929m85n44k8585Q86J8690
$$ -10241 9202 3358 -3767 -163 23779 14951 -4719 5379 7308 6823 6279 -22306 -21420 -2730
6684b730P170j5676n312L456K1663j1720k9783R623K506r07j95m441J5060J1864
$$ -2730 4440 -11236 -16548 -13092 8571 -3149 -32932 -23309 -20803 -21710 -21905 -26346 -11286 578
6670E78j0720Q988P119j2750j7241j28K032N189k0374j099K1673M132k616j1570
$$ 578 -10142 -1154 5965 -6785 -24026 -24154 -22122 -16933 -37307 -38406 -16733 -12601 -15217 -26787
6656b6787m835J4499n732J9369J4943p953j7125P013q833m412N169m812J692l073
$$ -26787 -31622 -17123 -22855 -3486 11457 3504 -13621 -6608 -15441 -19853 -14684 -19496 -17804 -20877
6642b0877k285q042j6566K0705J6227K2659P333j0685n252m599K736p453O662
$$ -20877 -23162 -31204 -47770 -27065 -10838 11821 19154 8469 3217 -1382 1354 -6099 563
6629E63J6644O264k1778j1822J5036M284l513k613j0839l992P883J7251L562M96
$$ 563 17207 23471 1693 -10129 4907 9191 5678 3065 -7774 -11766 -3883 13368 16930 17426
6615A7426r769o875j6937l406M747j5199N319K170J1807L091K180k3803r777M80
$$ 17426 7657 782 -16155 -19561 -14814 -30013 -24694 -22524 -10717 -7626 -5446 -29249 -39026 -38546
6601c8546N278O205J4589J2539p431j2452j869m54J1710K001O79N964j0165j4070
$$ -38546 -33268 -27063 -12474 65 -7366 -19818 -21687 -22141 -10431 -8430 -7751 -1787 -11952 -26022
6587b6022M614j0275P413J4844j1371J0133J3473j7385J9723J4515j0437m867
$$ -26022 -21408 -31683 -24270 -9426 -20797 -10664 2809 -14576 5147 19662 9225 4358
6575D358r878M4k199L469K333J7521j3597P284J4550j0217q711j6654n306j070
$$ 4358 -5520 -5476 -7675 -4206 -1873 15648 2051 9335 23885 13668 4957 -11697 -17003 -18073
6561a8073R053R990j012O889j4727m435P697Q463J4951j2926M959n56O622J830
$$ -18073 -9020 970 -42 6847 -7880 -12315 -4618 3845 18796 5870 10829 10273 16895 18725
6547A8725J0006j2283l354k2359K021m844J1483R103j3342J92M222n431J6411
$$ 18725 28731 16448 13094 -9265 -7244 -12088 -605 8498 -4844 -4652 -430 -5861 10550
6534A0550j2468J0242J369N339m068j3410k9054N642J2084p778J2735R088j8206
$$ 10550 -1918 8324 9693 15032 10964 -2446 -31500 -25858 -13774 -21552 -8817 271 -17935
6521a7935Q206J1396J3790J2558j1075j3731k0259j8913J385n218k009j630m737
$$ -17935 -9729 1667 15457 28015 16940 3209 -17050 -35963 -34578 -39796 -41805 -43435 -48172
6508d8172k207J455J8599J6631M952o332J2395J3033K2255J4867j7346j8955o117
$$ -48172 -50379 -48924 -30325 -13694 -8742 -15074 -2679 10354 32609 47476 30130 11175 5058
6495E058j7371l793P413L274m92j2757n012m881J5581j238o901J2243M662r923
$$ 5058 -12313 -16106 -8693 -5419 -5911 -18668 -23680 -28561 -12980 -14218 -21119 -8876 -4214 -14137
6481a4137R187J0542j1292j8478k2017N841N948m803J1844K6684l587l598J2847
$$ -14137 -4950 5592 -5700 -24178 -46195 -40354 -34406 -39209 -27365 -681 -4268 -7866 4981
6468D981J0133j4581j6063j072J25j3248K0925J0790j1118q416J0934N18L046
$$ 4981 15114 533 -15530 -16602 -16477 -29725 -8800 1990 -9128 -17544 -6610 -6092 -3046
$$ [...]
##END NTUPLES=NMR SPECTRUM
##END=
