##TITLE=Analysis number 313499
Compound Code cc 19805
Book Reference 447/102
Project Code adrs
Chemist Name bos
##JCAMPDX= 6.0         $$ Bruker NMR JCAMP-DX V2.0
##DATA TYPE= NMR SPECTRUM
##DATA CLASS= NTUPLES
##ORIGIN= Bruker BioSpin GmbH
##OWNER= NMR
$$ XWIN-NMR		Version 3.5
$$ Mon Sep 12 14:18:46 2005 GMT Daylight Time (UT+1h)  MAYBRIDGE\NMR@NMR_250MHZ
##.OBSERVE FREQUENCY= 250.131544655141
##.OBSERVE NUCLEUS= ^1H
##.ACQUISITION MODE= SIMULTANEOUS (DQD)
##.ACQUISITION SCHEME= undefined
##.AVERAGES= 16
##.DIGITISER RES= 18
##SPECTROMETER/DATA SYSTEM= dpx250
##.PULSE SEQUENCE= zg30
##.SOLVENT NAME= CDCl3
##.SHIFT REFERENCE= (INTERNAL, CDCl3, 0, 16.4543)
##AUDIT TRAIL= $$ (NUMBER, WHEN, WHO, WHERE, WHAT)
$$ ##TITLE= Audit trail, XWIN-NMR		Version 3.5
$$ ##JCAMPDX= 5.01
$$ ##ORIGIN= Bruker BioSpin GmbH
$$ ##OWNER= NMR
$$ C:\u/data/dgb/nmr/ADRS/9200/pdata/1/auditp.txt
$$ ##AUDIT TRAIL=  $$ (NUMBER, WHEN, WHO, WHERE, WHAT)
(   1,<2005-09-12 14:18:22.16 +100>,<MAYBRIDGE\NMR>,<NMR_250MHZ>,
      <created by zg, POWCHK disabled, PULCHK disabled
       configuration hash MD5:
       62 19 C7 07 E1 42 D1 B7 37 6C 3D D0 77 39 F9 E6
       data hash MD5: 64K
       87 6E 4D DA 17 17 92 A7 12 13 29 59 AD 80 91 01>)
(   2,<2005-09-12 14:18:35.94 +100>,<MAYBRIDGE\NMR>,<NMR_250MHZ>,
      <Start of raw data processing
       ef LB = 0.3 FT_mod = 6 PKNL = 1 SI = 32K 
       data hash MD5: 32K
       58 06 8B 23 80 86 E0 22 E0 F7 57 4F 5B 83 F7 77>)
(   3,<2005-09-12 14:18:38.00 +100>,<MAYBRIDGE\NMR>,<NMR_250MHZ>,
      <apk 
       data hash MD5: 32K
       7A 49 7E C9 BA D6 FC 98 92 D8 19 1F 80 58 F7 CC>)
(   4,<2005-09-12 14:18:38.69 +100>,<MAYBRIDGE\NMR>,<NMR_250MHZ>,
      <abs ABSG = 5 
       data hash MD5: 32K
       BC EB 0B 37 B4 A2 A0 4C DC 1D D9 59 99 9E C2 C0>)
$$ ##END=
$$ 
$$ hash MD5
$$ C0 CD 77 AA B3 01 7C 64 15 BE 97 B5 32 68 E1 75
##$RELAX= 
##$RELAX= 
##$RELAX= 
##$RELAX= 
##$RELAX= 
##$RELAX= 
##$RELAX= 
$$ Bruker specific parameters
$$ --------------------------
##$DU= <C:\u>
##$EXPNO= 9200
##$NAME= <ADRS>
##$PROCNO= 1
##$TYPE= <nmr>
##$USER= <dgb>
##$AMP= (0..31)
100 100 100 100 100 100 100 100 100 100 100 100 100 100 100 100 100 100 
100 100 100 100 100 100 100 100 100 100 100 100 100 100 
##$AQSEQ= 0
##$AQ_mod= 3
##$AUNM= <au_zg>
##$AUTOPOS= <32 >
##$BF1= 250.13
##$BF2= 250.13
##$BF3= 250.13
##$BF4= 250.13
##$BF5= 500.13
##$BF6= 500.13
##$BF7= 500.13
##$BF8= 500.13
##$BYTORDA= 1
##$CFDGTYP= 0
##$CFRGTYP= 5
##$CHEMSTR= <none>
##$CNST= (0..31)
1 1 145 1 1 1 1 1 1 1 1 1 1 1 1 1 1 1 1 1 1 1 1 1 1 1 1 1 1 1 1 1 
##$CPDPRG= <>
##$CPDPRG1= <>
##$CPDPRG2= <>
##$CPDPRG3= <>
##$CPDPRG4= <mlev>
##$CPDPRG5= <mlev>
##$CPDPRG6= <mlev>
##$CPDPRG7= <mlev>
##$CPDPRG8= <mlev>
##$CPDPRGB= <>
##$CPDPRGT= <>
##$D= (0..31)
0 1 0 0 0 0 0 0 0 0.06 0 0 0 0 0 0 0.0002 0 0 0 0 0 0 0 0 0 0 0 0 0 0 
0 
##$DATE= 1126531100
##$DBL= (0..7)
120 120 120 120 120 120 120 120 
##$DBP= (0..7)
150 150 150 150 150 150 150 150 
##$DBP07= 0
##$DBPNAM0= <>
##$DBPNAM1= <>
$$ [...]
##$SUBNAM7= <"">
##$SUBNAM8= <"">
##$SUBNAM9= <"">
##$SW= 20.6930455092707
##$SWIBOX= (0..15)
0 0 3 0 0 0 0 0 0 0 0 0 0 0 0 0 
##$SW_h= 5175.983436853
##$TD= 65536
##$TD0= 1
##$TE= 296.16
##$TE2= 300
##$TE3= 300
##$TEG= 300
##$TL= (0..7)
0 120 120 120 120 120 120 120 
##$TP= (0..7)
150 150 150 150 150 150 150 150 
##$TP07= 0
##$TPNAME0= <>
##$TPNAME1= <>
##$TPNAME2= <>
##$TPNAME3= <>
##$TPNAME4= <>
##$TPNAME5= <>
##$TPNAME6= <>
##$TPNAME7= <>
##$TPOAL= (0..7)
0.5 0.5 0.5 0.5 0.5 0.5 0.5 0.5 
##$TPOFFS= (0..7)
0 0 0 0 0 0 0 0 
##$TUNHIN= 0
##$TUNHOUT= 0
##$TUNXOUT= 0
##$USERA1= <user>
##$USERA2= <user>
##$USERA3= <user>
##$USERA4= <user>
##$USERA5= <user>
##$V9= 5
##$VALIST= <valist>
##$VCLIST= <CCCCCCCCCCCCCCC>
##$VD= 0
##$VDLIST= <DDDDDDDDDDDDDDD>
##$VPLIST= <PPPPPPPPPPPPPPP>
##$VTLIST= <TTTTTTTTTTTTTTT>
##$WBST= 1024
##$WBSW= 4
##$XGAIN= (0..3)
0 0 0 0 
##$XL= 0
##$YL= 0
##$YMAX_a= 320407
##$YMIN_a= -313029
##$ZGOPTNS= <>
##$ZL1= 120
##$ZL2= 120
##$ZL3= 120
##$ZL4= 120
##$ABSF1= 16.4543
##$ABSF2= -4.238873
##$ABSG= 5
##$ABSL= 3
##$ALPHA= 0
##$AQORDER= 0
##$ASSFAC= 0
##$ASSFACI= 0
##$ASSFACX= 0
##$ASSWID= 0
##$AUNMP= <proc_1d>
##$AZFE= 0.1
##$AZFW= 0.1
##$BCFW= 0
##$BC_mod= 0
##$BYTORDP= 0
##$COROFFS= 0
##$CY= 12.5
##$DATMOD= 1
##$DC= 0
##$DFILT= <>
##$DTYPP= 0
##$F1P= 14.0000005364418
##$F2P= -0.99999901652339
##$FCOR= 0.5
##$FTSIZE= 32768
##$FT_mod= 6
##$GAMMA= 0
##$GB= 0
##$INTBC= 1
##$INTSCL= 1
##$ISEN= 128
##$LB= 0.3
##$LEV0= 0
##$LPBIN= 0
##$MAXI= 10000
##$MC2= 0
##$MEAN= 0
##$ME_mod= 0
##$MI= 0
##$NCOEF= 0
##$NC_proc= -2
##$NLEV= 6
##$NOISF1= 0
##$NOISF2= 0
##$NSP= 0
##$NTH_PI= 0
##$NZP= 0
##$OFFSET= 16.4543
##$PC= 1
##$PHC0= -76.35424
##$PHC1= 6.820545
##$PH_mod= 1
##$PKNL= yes
##$PPARMOD= 0
##$PSCAL= 4
##$PSIGN= 0
##$REVERSE= no
##$SF= 250.130016932449
##$SI= 32768
##$SIGF1= 0
##$SIGF2= 0
##$SINO= 400
##$SIOLD= 32768
##$SREGLST= <1H.CDCl3>
##$SSB= 0
##$STSI= 32768
##$STSR= 0
##$SW_p= 5175.98343685301
##$SYMM= 0
##$S_DEV= 0
##$TDeff= 65536
##$TDoff= 0
##$TI= <Analysis number 999999
Compound Code 99
Book Reference 9
Project Code 9>
##$TILT= no
##$TM1= 0
##$TM2= 0
##$TOPLEV= 0
##$USERP1= <user>
##$USERP2= <user>
##$USERP3= <user>
##$USERP4= <user>
##$USERP5= <user>
##$WDW= 1
##$XDIM= 32768
##$YMAX_p= 279542452
##$YMIN_p= -280035
$$ End of Bruker specific parameters
$$ ---------------------------------
##NTUPLES= NMR SPECTRUM
##VAR_NAME=  FREQUENCY,     SPECTRUM/REAL,   SPECTRUM/IMAG
##SYMBOL=    X,             R,               I
##VAR_TYPE=  INDEPENDENT,   DEPENDENT,       DEPENDENT
##VAR_FORM=  AFFN,          ASDF,            ASDF
##VAR_DIM=   32768,         32768,           32768
##UNITS=     HZ,            ARBITRARY UNITS, ARBITRARY UNITS
##FACTOR=    0.157963299565203, 1,           1
##FIRST=     4115.71431929153, 0,            0
##LAST=      -1060.26911756148, 0,           0
##MIN=       -1060.26911756148, -280035,     0
##MAX=       4115.71431929153, 279542452,    0
$$ Real data points
##PAGE= N=1
##DATA TABLE= (X++(R..R)), XYDATA
$$ [...]
19568A2059R286J5782l155Q702k7864j8139l6817k13J6177q191J7018j9162J3494
$$ 12059 21345 37127 33972 42674 14810 -3329 -40146 -40359 -24182 -32373 -15355 -34517 -21023
19555b1023P112K7303J4740k4769k1472j8270j806P178J068K4262J6370k430k2439
$$ -21023 -13911 13392 28132 3363 -18109 -36379 -38185 -31007 -29939 -5677 10693 8263 -14176
19542a4176O01K3799k371j6898R835J2747j0140J0930J2228r861p963j8739r601
$$ -14176 -13575 10224 7853 -9045 790 13537 3397 14327 26555 16694 8731 -10008 -19609
19529a9609P552k036J4860J7951N142J2016J3255J6822j5392l9443k1031q071
$$ -19609 -12057 -14093 767 18718 23860 35876 49131 65953 50561 11118 -9913 -17984
19517a7984J3275l733k022J5893r6j0083k9604o313O213K3769K7854k81J1789
$$ -17984 -4709 -8442 -10464 5429 5333 -4750 -34354 -40667 -34454 -10685 17169 16888 28677
19504B8677l416m271j8190k3374k1781o316J3959Q023r248J4524J9343o1p191
$$ 28677 25261 20990 2800 -20574 -42355 -48671 -34712 -26689 -35937 -21413 -2070 -2131 -9322
19491i322R17k692Q805K5032O347l6478j5800p73L0758J0245j0000j3953j5678
$$ -9322 -8405 -11097 -2292 22740 29087 -7391 -23191 -23964 6794 17039 7039 -6914 -22592
19478b2592j9490J941J6140M265M049J593j808k7233j4383K5727N770J3848P181
$$ -22592 -42082 -40141 -24001 -19736 -15687 -14094 -15902 -43135 -57518 -31791 -26021 -12173 -4992
19465d992L605r671r373j7346J3357N478J6265N539J7901J510k2260k78j1109
$$ -4992 -1387 -11058 -20431 -37777 -24420 -18942 -2677 2862 20763 22273 13 -265 -11374
19452a1374q77L4201j7461k3090R203j5432O806L034j5664k5734R091Q214n718
$$ -11374 -12251 21950 4489 -18601 -9398 -24830 -18024 -14990 -30654 -56388 -47297 -39083 -44801
19439d4801J2521K3325O476N427K670Q50J922j4545j469j0672q818K739o935k4444
$$ -44801 -32280 -8955 -2479 2948 5618 6468 8390 -6155 -7624 -18296 -27114 -24375 -31310 -55754
19425e5754K1340J1168q862J4830m092L0253R153Q600n943o579p634k114j5402
$$ -55754 -34414 -23246 -32108 -17278 -21370 8883 18036 26636 20693 14114 6480 4366 -11036
19412a1036j9876J1225R061J14J3375o306o092P618p782O259j9870q108q949K1466
$$ -11036 -30912 -19687 -10626 -10512 2863 -3443 -9535 -1917 -9699 -3440 -23310 -31418 -40367 -18901
19398a8901N990j1252O640L0417J4473j3727p055l398k4112M055K5406K4565p438
$$ -18901 -12911 -24163 -17523 12894 27367 13640 6585 3187 -20925 -16870 8536 33101 25663
19385B5663j7539M070N730J0511q995k3012J0944J8660j5273m471r447j5133K0425
$$ 25663 8124 12194 17924 28435 19440 -3572 7372 26032 10759 6288 -3159 -18292 2133
19372B133O123J833L388j9307M641L906o400K6257J2970k4588k3025k8857n576
$$ 2133 8256 10089 13477 -5830 -1189 2717 -3683 22574 35544 10956 -12069 -40926 -46502
19359d6502j634p212L624K5942l224m398L0014K0272J0730L1900O76m0265P81
$$ -46502 -48136 -55348 -51724 -25782 -29006 -33404 -3390 16882 27612 59512 60188 19923 20704
19346B0704O809o12j4320j7038j7893J6624Q094J0278r940j8671o874J7137K0956
$$ 20704 27513 26901 12581 -4457 -22350 -5726 2368 12646 2706 -15965 -22839 -5702 15254
19333A5254J5508m615k6311j7268q062M450j358j5624J887Q688n244j3092K607
$$ 15254 30762 26147 -164 -17432 -25494 -21044 -22402 -38026 -36139 -27451 -32695 -45787 -43180
19320d3180L931p846R894K891o67q396r86N51K77J2194m676K2668K9193J5409
$$ -43180 -39249 -47095 -37201 -34310 -34977 -43373 -44359 -43808 -43531 -31337 -36013 -13345 15848 31257
19306C1257Q230j8574m4391l2414J3355k860j1529J6143Q444R294L363m975j0603
$$ 31257 39487 20913 -23478 -55892 -42537 -45397 -56926 -40783 -32339 -23045 -19682 -24657 -35260
19293c5260m837j5287Q190l923N66J8014J663k1210O346J8389J1672K194Q064
$$ -35260 -40097 -55384 -47194 -51117 -50551 -32537 -30874 -52084 -45738 -27349 -15677 -13483 -5419
19280e419J561J421j6330j1318j284r776K0948N1744J2435k139k5659r688M537
$$ -5419 -3858 -2437 -18767 -30085 -31369 -41145 -20197 31547 43982 41843 16184 6496 11033
19267A1033P235q987q507R3k03k1530N775J3710J3081M642j7428k9692j2373J7121
$$ 11033 18268 9281 774 867 664 -20866 -15091 -1381 11700 16342 -1086 -30778 -43151 -26030
19253b6030Q119q088r718j9257p064R661M496Q683J9677K1577l511k396J6089
$$ -26030 -17911 -25999 -35717 -54974 -62038 -52377 -47881 -39198 -19521 2056 -1455 -3851 12238
19240A2238k9232J4877J196j2461j1979p294J4401J8116j2819P889L140j2833
$$ 12238 -16994 -2117 -921 -13382 -25361 -32655 -18254 -138 -12957 -5068 -1928 -14761
19228a4761j2241l332K3769J7171R052R548k0133l678Q689k5964m5787R318K1362
$$ -14761 -27002 -30334 -6565 10606 19658 29206 9073 5395 14084 -11880 -57667 -48349 -26987
19215b6987R488j271J2957j9754j0830o316J3888J3772n815j4971K1800J0774
$$ -26987 -17499 -18770 -5813 -25567 -36397 -42713 -28825 -15053 -20868 -35839 -14039 -3265
19203c265j9750l480N184p587N988J9937K8577n453K1564P07j4310k4400l2810
$$ -3265 -23015 -26495 -21311 -28898 -22910 -2973 25604 20151 41715 42422 28112 3712 -29098
19190b9098j3661j2174k671m333L0325l38k1323M787k753J5176J0479K5825J6538
$$ -29098 -42759 -54933 -57604 -61937 -31612 -31950 -53273 -48486 -51239 -36063 -25584 241 16779
19177A6779J018K4783L722n202N592J0638j9812l3705j023N773j946J9905p058
$$ 16779 17797 42580 46302 41100 46692 57330 37518 3813 2790 8563 6617 26522 19464
19164A9464r956j525k6782m4695k144L2927L707o635K6556L2269L490j4247J4962
$$ 19464 9508 7983 -18799 -63494 -65638 -32711 -29004 -35639 -9083 23186 26676 12429 27391
19151B7391j2220k1418k161p64k0374L204j53K679R836K3194j8014l2462p15J8160
$$ 27391 15171 -6247 -8408 -9172 -29546 -26342 -26495 -23816 -13980 9214 -8800 -41262 -41977 -23817
19137b3817M1534n984j1220L17j4304j1496q612J9462Q839n63J1463m123r702
$$ -23817 17717 11733 513 830 -13474 -24970 -33582 -14120 -5281 -5844 5619 1496 -8206
19124h206j0474j3157n792K2688j100j12J4201n770n023j0304p882k3064J4868
$$ -8206 -18680 -31837 -37629 -14941 -16041 -16153 -1952 -7722 -12745 -23049 -30931 -53995 -39127
19111c9127L3681K7480J0038j1454j9387j9074l081m522M827p474k265P56o817
$$ -39127 -5446 22034 32072 20618 1231 -17843 -20924 -25446 -20619 -28093 -30358 -29602 -36419
19098c6419Q939M527M649J5788j1704j1017k2713R449J1124o242J3186q965q368
$$ -36419 -27480 -22953 -18304 -2516 -14220 -25237 -47950 -38501 -27377 -33619 -20433 -29398 -37766
19085c7766j570J4214J7055l087J1878n61L43K3806j6763j3633j7495J125r55
$$ -37766 -39336 -25122 -8067 -11154 724 163 506 24312 7549 -6084 -23579 -22454 -23409
19072b3409Q71J4546L5034m094m696J0679q302k3108k480J1324K21O25k944j4299
$$ -23409 -22538 -7992 27042 22948 18252 28931 20629 -2479 -4959 6365 6586 7211 4267 -10032
19058a0032j5489O832K4350J4534j6566k9530k0372J6121K792l9494j65J0986
$$ -10032 -25521 -18689 5661 20195 3629 -25901 -46273 -30152 -27360 -66854 -67019 -56033
19046e6033L3256K3341Q963J8208P706j3711o716L2790p332k9286j0349j5236
$$ -56033 -22777 564 9527 27735 35441 21730 15014 47804 40472 11186 837 -14399
19034a4399N123K1638P908j2892Q774Q805k024j5461P414j5229p158J4962k206
$$ -14399 -9276 12362 20270 7378 16152 24957 22933 7472 14886 -343 -7501 7461 5255
19021E255j0353J274Q70j8299j8793J5643k305m325j046p141Q766K4812j406k4296
$$ 5255 -5098 -3824 -2954 -21253 -40046 -24403 -26708 -31033 -32079 -39220 -30454 -5642 -7048 -31344
19007c1344O719J2999K1130K1478n104l1605K0341J336j2284J6466J641j380p831
$$ -31344 -24625 -11626 9504 30982 25878 -5727 14614 15950 3666 20132 21773 20393 12562
18994A2562N858J0833N787n349J0579q566j2061j2843J831k128j1151j651j663
$$ 12562 18420 29253 35040 29691 40270 31704 19643 6800 8631 6503 -4648 -6299 -7962
18981g962J6876j0226r379n913R335K9776Q224l867o699P920k2858l3675k8264
$$ -7962 8914 -1312 -10691 -16604 -7269 22507 30731 26864 20165 28085 5227 -28448 -56712
18968e6712O031K4619K1276M856o878K743R369p11J2991R305l514q814k7612J2998
$$ -56712 -50681 -26062 -4786 70 -6808 -4065 5304 4593 17584 26889 23375 14561 -13051 -53
18954e3J3574q576l702j0027r479M837j212L380J2305j1719j2106j3679j8284
$$ -53 13521 4945 1243 -8784 -18263 -13426 -14638 -11258 1047 -10672 -22778 -36457 -54741
18941e4741k050o109j2213J8783J2889J9154k729M347n033J6404N039N911j6985
$$ -54741 -56791 -62900 -75113 -56330 -43441 -24287 -27016 -22669 -27702 -11298 -6259 -348 -17333
18928a7333q717l655N173K1549J5556O231O419j1039j5000k425o534k490K907
$$ -17333 -26050 -29705 -24532 -2983 12573 18804 25223 14184 -816 -3241 -9775 -12265 -9358
18915i358r77K056K429n292K36N681K304P86J2429Q645l3790j8971J9672R447
$$ -9358 -10335 -8279 -5850 -11142 -10906 -5225 -2921 -2135 10294 18939 -14851 -33822 -14150 -4703
18901d703n775j7517j6251M338J3252K176L172R748J2642L155j6258q546j812
$$ -4703 -10478 -27995 -44246 -39908 -26656 -24480 -21308 -11560 1082 4237 -12021 -20567 -22379
18888b2379j0580j5095J3204J4545j0312j9032J1938m699j8155j0290q605J9922
$$ -22379 -32959 -48054 -34850 -20305 -30617 -49649 -37711 -42410 -60565 -70855 -79460 -59538
18876e9538J6719K6736R929r256o091L530J8081J5642m086J802J1467j6563j1248
$$ -59538 -42819 -16083 -6154 -15410 -21501 -17971 110 15752 11666 13468 24935 8372 -2876
18863b876J6792P520k2650o695O223K654J3662r672j3292m700J3299J7279J0833
$$ -2876 13916 21436 -1214 -7909 -1686 968 14630 4958 -8334 -13034 265 17544 28377
18850B8377q329p816j7337j5734J3031R821Q939j8620l5149J1317j6191K5025
$$ 28377 20048 12232 -5105 -20839 -7808 2013 10952 -7668 -42817 -31500 -47691 -22666
18838b2666J5402p195o597J5127K7260J0362j9519q620j9702k5662J2137J6058
$$ -22666 -7264 -14459 -21056 -5929 21331 31693 12174 3554 -16148 -41810 -29673 -13615
18826a3615Q20k781j9363O403q519J0939J7725k1878m186N042j1783J1490J0682
$$ -13615 -12795 -15576 -34939 -28536 -37055 -26116 -8391 -30269 -34455 -29413 -41196 -29706 -19024
18813a9024J0393J1774k421J420m023J4277J8084j5236k7216m524r50J5266K1492
$$ -19024 -8631 3143 722 2142 -1881 12396 30480 15244 -11972 -16496 -17446 -2180 19312
18800A9312k2461n2808j9998R893N976M957R645J108K832P44o037q64N467J1221
$$ 19312 -3149 -55957 -75955 -66062 -60086 -55129 -45484 -44376 -41544 -40800 -46837 -47701 -42234 -31013
18786c1013M507K4816O192l6936j0512K5884K8777o393M37j0307j6138J4048L2878
$$ -31013 -26506 -1690 4502 -32434 -42946 -17062 11715 5322 5759 -4548 -20686 -6638 26240
18773B6240Q228L662M307J4853P885K6237N4894J03134M3546p3212q7401n8018
$$ 26240 34468 38130 42437 57290 65175 91412 146306 249440 292986 219774 132373 74355
18761G4355m0601J266j3791k2472r082L603Q139j7479k2912L263q559k394O318
$$ 74355 33754 35020 21229 -1243 -10325 -6722 1417 -16062 -38974 -35711 -44270 -46664 -40346
18748d0346R124J4227j8842K0735N466j4958N690M98r613j003J233N641K0345
$$ -40346 -31222 -16995 -35837 -15102 -9636 -24594 -18904 -18406 -28019 -29022 -27789 -22148 -1803
18735a803n924m159q265K2926J6428J586l875P77j3105k0498k1191O079K2679
$$ -1803 -7727 -11886 -20151 2775 19203 20789 16914 17691 4586 -15912 -37103 -31024 -8345
18722h345O497J943j6876N556J2602L3426O886m637j0634l6418n460Q984k0875
$$ -8345 -1848 95 -16781 -11225 1377 34803 41689 37052 26418 -10000 -15460 -6476 -27351
18709b7351k732Q611J2080J3750o772Q69j5803j2535o298j318J6908J2517J4091
$$ -27351 -30083 -21472 -9392 4358 -2414 -1545 -17348 -29883 -36181 -37499 -20591 -8074 6017
18696F017N485j7822O568j033n35l703r450l0246p636P572J2122K6260n665J0604
$$ 6017 11502 -6320 248 -785 -1320 -5023 -14473 -44719 -52355 -44783 -32661 -6401 -12066 -1462
18682a462J493M782n812l337j261J4292r179P600J2039j7009j0106o000j7352
$$ -1462 31 4813 -999 -4336 -5597 8695 -484 7116 19155 2146 -7960 -13960 -31312
18669c1312J2966l170n698K4475L2304l5839l7527J117J5530p623J2545J7634
$$ -31312 -18346 -21516 -27214 -2739 29565 -6274 -43801 -42684 -27154 -34777 -22232 -4598
18657d598K8342q727j7340j5199R984J1432k2431K514N125k909J2376J6622M232
$$ -4598 23744 15017 -2323 -17522 -7538 3894 -18537 -16023 -10898 -13807 -1431 15191 19423
18644A9423j776N324k1856k0917o740K960R088L763q016J277O981L091K757j0498
$$ 19423 17647 22971 1115 -19802 -26542 -23582 -14494 -10731 -18747 -17470 -10489 -7398 -4641 -15139
18630a5139j2169P888j1692J2220J1162J9726N647L043p982J801K04r833J5170
$$ -15139 -27308 -19420 -31112 -18892 -7730 11996 17643 20686 12704 14505 14709 4876 20046
18617B0046L000o513p826j0308r982m18J882k1654p630Q807L778L0183P616j1134
$$ 20046 23046 16533 8707 -1601 -11583 -12001 -10119 -31773 -39403 -30596 -26818 3365 10981 -153
18603a53n391j6117o448l816J9351R994q015J2771J3334k4130m2897j777J8441
$$ -153 -5544 -21661 -28109 -31925 -12574 -2580 -10595 2176 15510 -8620 -51517 -53294 -34853
18590c4853K4791j2754p104K774R240l244p906K0103J2204J347R117Q518M645
$$ -34853 -10062 -22816 -29920 -27146 -17906 -21150 -29056 -8953 3251 4598 13715 22233 26878
18577B6878j3521j971q574k8319Q181L906o764k5761K630J4088J5799K5636j679
$$ 26878 13357 11386 2812 -25507 -17326 -13420 -20184 -45945 -43315 -29227 -13428 12208 10529
18564A0529k0195J4518J4025O449k5214J2722P95k95p744k43j6312o146J0009
$$ 10529 -9666 4852 18877 25326 112 12834 13629 13334 5590 5347 -10965 -17111 -7102
18551g102P576k462k0620L87O970J8372m717q247M488N850K642j6275j2144j509
$$ -7102 474 -1988 -22608 -22221 -15251 3121 -1596 -9843 -5355 495 3137 -13138 -25282 -26791
18537b6791O922J0970j0255O155N288J6889l0738l0749K9784M0126K0375r415
$$ -26791 -19869 -8899 -19154 -12999 -7711 9178 -21560 -52309 -22525 17601 37976 28561
18525B8561k9702k1669r309K845J2286J1979J5717J7895k3209k1797j3624J4372
$$ 28561 -1141 -22810 -32119 -29274 -16988 -5009 10708 28603 5394 -16403 -30027 -15655
18513a5655p654Q236J5467Q982l658q110N774N188J5166J9941j2736k1549p900
$$ -15655 -23309 -15073 394 9376 5718 -2392 3382 8570 23736 43677 30941 9392 1492
18500A492O73J0337l014M107J5260k1181l8741P179J5291P745j8828M905J8380
$$ 1492 2165 12502 9488 13595 28855 7674 -31067 -23888 -8597 -852 -19680 -14775 3605
18487C605j8915o453o366J6070K2547o411j105K1510N822M312k0680j1428j4645
$$ 3605 -15310 -21763 -28129 -12059 10488 4077 2972 24482 30304 34616 13936 2508 -12137
18474a2137P59K778J3286K9635K627l341j8755k0049j3638o220m542J5898o64
$$ -12137 -11378 -8600 4686 34321 36948 33607 14852 -5197 -18835 -25055 -29597 -13699 -14363
18461a4363m187J7069J3770j5156o899M874R417j0764j0330n436J204R072K1388
$$ -14363 -18550 -1481 12289 -2867 -9766 -4892 4525 -6239 -16569 -22005 -20801 -11729 9659
18448I659l320j490P879M688n864J5683N84k4363p513J5141J6036j5095k4035
$$ 9659 6339 4849 12728 17416 11552 27235 27819 3456 -4057 11084 27120 12025 -12010
18435a2010J43P832K3872J6791k7615k9152l655J7766K1834K0385K6508k324q519
$$ -12010 -11867 -4035 19837 36628 9013 -20139 -23794 -6028 15806 36191 62699 60375 51856
18422E1856n208j341l8133k8077j5207J4071j5287j5209j1907Q171J9899J4741
$$ 51856 46648 45307 7174 -20903 -36110 -22039 -37326 -52535 -64442 -56271 -36372 -21631
18410b1631J8491Q455L072j5644k478N324J257j4194q315P44J4052J6400J7184
$$ -21631 -3140 5315 8387 -7257 -9735 -4411 -3154 -17348 -25663 -24919 -10867 5533 22717
18397B2717r316r755n855k464j7683l229K3262N031M951N355j9573n552P836N029
$$ 22717 13401 3646 -2209 -4673 -22356 -25585 -2323 2708 7659 13014 -6559 -12111 -4275 754
18383G54J4053P111j9570Q312p525j107K752J2225k46k0952J1541m044K0784o029
$$ 754 14807 21918 2348 10660 3135 2028 4780 17005 16759 -4193 7348 3304 24088 18059
18369A8059k643P264P482n339k7942R224Q356K9143Q737k6204k6141j0681j2409
$$ 18059 15416 22680 30162 24823 -3119 6105 14461 43604 52341 26137 -4 -10685 -23094
18356b3094L6291R996R611l1899j1394k051L700J0491k0436J3547Q404q933k4498
$$ -23094 13197 23193 32804 905 -10489 -12540 -8840 1651 -18785 -5238 3166 -5767 -30265
18343c0265r595j4804L5079O499j6373J824J3292J6220K3540M387o563j7535k956
$$ -30265 -39860 -54664 -19585 -13086 -29459 -27635 -14343 1877 25417 29804 23241 5706 2750
18330B750J5040J429k5078L164K6237m123P20p869L829Q345J2091Q282J5661l0440
$$ 2750 17790 19219 -5859 -2695 23542 19419 20139 12270 16099 24444 36535 44817 60478 30038
18316C0038l7260j778m19r273q712N415J1381K8470k734o218K302k918k3105j7727
$$ 30038 -7222 -9000 -9419 -18692 -27404 -21989 -10608 17862 15128 8910 11212 8294 -14811 -32538
18302c2538j1455k3712k3501J9823R398M5628N280J2586Q243L015J3662q949J4444
$$ -32538 -43993 -67705 -91206 -71383 -61985 -16357 -11077 1509 9752 12767 26429 17480 31924
18289C1924n014j7881L1070J389j0129k4423O797k3061M489p154j6468J5763R991
$$ 31924 26910 9029 40099 41488 31359 6936 13733 -9328 -4839 -11993 -28461 -12698 -2707
18276b707L469J6202j5594p766M639k2785j8690N479L0951K4497j394Q505M160
$$ -2707 762 16964 1370 -6396 -1757 -24542 -43232 -37753 -6802 17695 16301 24806 28966
18263B8966J4408j5202o474L1804M039m5943N269K2006j6263j2550j3605K821
$$ 28966 43374 28172 21698 53502 57541 11598 16867 38873 22610 10060 -3545 -724
18251g24K6187K416k0188p083J1975K654R43p016P820J1985p025J8740K8742j3337
$$ -724 25463 27879 7691 608 12583 15237 16180 9164 16984 28969 21944 40684 69426 56089
18237E6089q798K1568r667j4479k0731J3762J3007M426k4183l4326j9245J0097
$$ 56089 47291 68859 59192 44713 23982 37744 50751 55177 30994 -3332 -22577 -12480
18225a2480M064L801K4895j2156k501J7528K004J2159J346P086L54j8210J402
$$ -12480 -8416 -4615 20280 8124 5623 23151 25155 37314 38660 45746 46100 27890 29292
18212B9292Q790N990N743O930K106N155r497m3307j9196J5821J4347M135J3509
$$ 29292 38082 44072 49815 56745 58851 64006 54509 11202 -7994 7827 22174 26309 39818
18199C9818p73k0944j4018m892K7573j0263Q897J7117O838k4462j176J065J0485
$$ 39818 39045 18101 4083 -809 26764 16501 25398 42515 49353 24891 23715 24780 35265
18186C5265K393p811K302J2434j2634m439L088j5301K6883R952l202n818q638
$$ 35265 37658 29847 32149 44583 31949 27510 30598 15297 42180 52132 48930 43112 34474
18173C4474j6366R067J4326j1466J5493J9290P834J8368j3288k0446L424J3722
$$ 34474 18108 27175 41501 30035 45528 64818 72652 91020 77732 57286 60710 74432
18161G4432K0552J2216n843j5647P938M998j1346R62K5259N4968K9310j2643k8662
$$ 74432 94984 107200 101357 85710 93648 98646 87300 88262 113521 168489 197799 185156 156494
18148A56494j5556K2106K7555N172L183j1354N673J3949P381o6M2240O7217K8920
$$ 156494 140938 163044 190599 195771 198954 187600 193273 207222 214603 214537 256777 323994 352914
18135C52914K9150K6509L1635N7287N7956M9013M2796K6614O5503J08826J18573
$$ 352914 382064 408573 440208 497495 555451 604464 647260 673874 739377 848203 966776
18124I66776J19315J05698J08221J23167J23922J23240J65622K85057M10352N60929
$$ 966776 1086091 1191789 1300010 1423177 1547099 1670339 1835961 2121018 2531370 3092299
18114C092299P54018J206646K003672L425015O527816J2190907J5498876Q293420
$$ 3092299 3846317 5052963 7056635 10481650 17009466 29200373 44699249 52992669
18106E2992669p970122j5296358j1167072o822860l907113k295306j457897j010367
$$ 52992669 45022547 29726189 18559117 11736257 7829144 5533838 4075941 3065574
18098C065574o79634m92932l67734k81725k09877j35996j08330j25646j24563
$$ 3065574 2385940 1893008 1525274 1243549 1033672 897676 789346 663700 539137
18089E39137j01594n7402r953m4862n9436k3812l0402j0677J3025j5065k9450
$$ 539137 437543 380141 370188 325326 265890 242078 211676 200999 214024 198959 169509
18078A69509l7143k0220N125M332j2394j056j1905k779L468k589k235P904j7330
$$ 169509 132366 112146 117271 121603 109209 108153 96248 93469 96937 94348 92113 100017 82687
18065H2687n04p928j8392j0678J5242O384k3557q520K334j5673p079O153j497
$$ 82687 82183 74255 55863 45185 60427 66811 43254 34734 37068 21395 14316 20469 18972
18052A8972K5083J550k7205R821J2880r984k0276q71L785K4980J3373p552m409
$$ 18972 44055 45605 18400 28221 41101 31117 10841 9970 13755 38735 52108 44556 40147
18039D0147K5651l2461k8664j7423O688l761J2799K69l7J9831R046j9765j9341
$$ 40147 65798 33337 4673 -12750 -6062 -9823 2976 3245 3208 23039 32085 12320 -7021
18026g021J19k729l352j1262o452K9566J2363j2295l018K0308j585k643j8392
$$ -7021 -6902 -9631 -12983 -24245 -30697 -1131 11232 -1063 -4081 16227 14642 11999 -6393
18013f393j2241j6709N967K0066p539k0937J2967J5444j526J85K683K6513P007
$$ -6393 -18634 -35343 -29376 -9310 -16849 -37786 -24819 -9375 -10901 -10716 -8033 18480 25487
18000B5487k360j897R191K0026J6092o80r789k4284J311k924k4267j1538K0247
$$ 25487 23127 21230 30421 50447 66539 65859 56070 31786 33097 30173 5906 -5632 14615
17987A4615J2070R281o244k2804p431K5024o372j5888j0235n879N994J5153L4344
$$ 14615 26685 35966 29722 6918 -513 24511 18139 2251 -7984 -13863 -7869 7284 41628
17974D1628O649j2090j4090j6276j2704N943J1591o934K021k905J331r806l239
$$ 41628 48277 36187 22097 5821 -6883 -940 10651 3717 5738 2833 4164 -5642 -8881
17961h881Q966J3009J3319k863j2735n065o366J0005K7433r155m7128j4438p471
$$ -8881 85 13094 26413 23550 10815 5750 -616 9389 36822 27667 -19461 -33899 -41370
17948d1370O357J925R364J1220m172K5968l737l1629k0416K618M3669K6316k3224
$$ -41370 -35013 -33088 -23724 -12504 -16676 9292 5555 -26074 -46490 -43872 -203 26113 2889
17935B889k0330L465L015n578j4302K1111L7392j8766j9453j1761K665J5010J4974
$$ 2889 -17441 -13976 -10961 -16539 -30841 -9730 27662 8896 -10557 -22318 -19653 -4643 10331
17922A0331p741m9326l8863L5858M6326Q864J3681Q812j3737j7334N542L1297
$$ 10331 2590 -46736 -85599 -49741 -3415 5449 19130 27942 14205 -3129 2413 33710
17910C3710k5950k3411J4861M1055l74k744k1606q561N146o084J2842J8476j1179
$$ 33710 7760 -15651 -790 40265 39891 37147 15541 6980 12126 6042 18884 37360 26181
17897B6181j4847k0122J2868J9353n588j1530l8958o791m61P877L516L129J3613
$$ 26181 11334 -8788 4080 23433 17845 6315 -32643 -39434 -39895 -32018 -28502 -25373 -11760
17884a1760M497n418j7375o905J3289K953l784J1343K5242O343k7546j1559m11
$$ -11760 -7263 -12681 -30056 -36961 -23672 -20719 -24503 -13160 12082 18425 -9121 -20680 -21091
17871b1091j1540J0353L822j594J9347J9290J2137k9699m7288q915K0558J3824
$$ -21091 -32631 -22278 -18456 -20050 -703 18587 30724 1025 -46263 -55178 -34620 -20796
17859b0796K322n135J0488j785J7173L783k2025q270j0579J5603M3392J2682j7248
$$ -20796 -18474 -23609 -13121 -14906 2267 6050 -15975 -24245 -34824 -19221 24171 36853 19605
17846A9605J1059k3172p214j294N851k158p009k6284l725L447M836K1037J8946
$$ 19605 30664 7492 278 -1016 4835 2677 -4332 -30616 -34341 -30894 -26058 -5021 13925
17833A3925l705k5152K649j5910m77P248J9409j0602j4710J0281K2112J5209j8024
$$ 13925 10220 -14932 -12283 -28193 -28670 -21422 -2013 -12615 -27325 -17044 5068 20277 2253
17820B253j1905r086K631K2121K717j112k033k713Q403j3179o798K1742J5663
$$ 2253 -9652 -18738 -16107 6014 8731 7619 5586 2873 11276 -1903 -8701 13041 28704
17807B8704j619l082j4888j6678j2994K088R124J8256P799q233M06K703p364m52
$$ 28704 27085 24003 9115 -7563 -20557 -18469 -9345 8911 16710 8477 8883 11586 4222 3770
17793C770M574j376j8139K4544J084r083j5823j0580l0378L544L5598J1379J1931
$$ 3770 8344 6968 -11171 13373 14457 5374 -10449 -21029 -51407 -47863 -12265 -886 11045
17780A1045J1896P83j1524k0496R233K924J0664o113j1766R165j1308k6406n748
$$ 11045 22941 23724 12200 -8296 937 3861 14525 8412 -3354 5811 -5497 -31903 -37651
17767c7651M0564K3045j9531j1155j2130k740J838K964J4728J195n181N666j179
$$ -37651 2913 25958 6427 -4728 -16858 -19598 -17760 -14796 -68 1127 -4054 1612 433
17754D33j4026j4333J3813L313J1603J8269k1170k4163J3090n06o240K5233L3686
$$ 433 -13593 -27926 -14113 -10800 803 19072 -2098 -26261 -13171 -13677 -19917 5316 39002
17741C9002j504j8906j2322j8737l046R613J6172j4166P48j1942l284l2627j6200
$$ 39002 37498 18592 6270 -12467 -15513 -5900 10272 -3894 -3146 -15088 -18372 -50999 -67199
17728f7199M4117L4811L823P690l1765j9085R709J4835L798o028J2436J0799N843
$$ -67199 -23082 11729 15552 23242 -8523 -27608 -17899 -3064 734 -5294 7142 17941 23784
17715B3784R826L488j5256k646j1475k0380Q884p83Q966L354j2733j1525J6676
$$ 23784 33610 37098 21842 19196 7721 -12659 -3775 -4558 4408 7762 -4971 -16496 180
17702A80K2698m936k1639r21o07R351j368P22j509J28l418r632M492K9619J2499
$$ 180 22878 17942 -3697 -4618 -5225 4126 2758 3480 1971 2099 -1319 -10951 -6459 23160 35659
17687C5659j0127j0125j9555J0783K370j4489m936k5405j3231O193P915L1163
$$ 35659 25532 15407 -4148 6635 9005 -5484 -10420 -35825 -49056 -42863 -34948 -3785
17675c785J3597q381j0412J9k949J280J2483j6458m109J0095J048J866R288J3421
$$ -3785 9812 1431 -8981 -8962 -11911 -10631 1852 -14606 -18715 -8620 -7572 -5706 3582 17003
17661A7003J313M263j434J9J0978j0909j1990k1769L359J3178J5268N941j1419
$$ 17003 18316 22579 21145 21164 32142 21233 9243 -12526 -9167 4011 19279 25220 13801
17648A3801j6596j1875J7870K067j231J4166p291j9421J8114M197J194o706K135
$$ 13801 -2795 -14670 3200 5267 4036 18202 10911 -8510 9604 13801 14995 8289 10424
17635A0424R126k358j4693o179j2954r471j9766K84J5160J7072j129k728n664
$$ 10424 19550 17192 2499 -3680 -16634 -26105 -45871 -45587 -30427 -13355 -14484 -17212 -22876
17622b2876Q394M046j2045M859j832K4625N722J732k3426j2827k1636J8400p535
$$ -22876 -14482 -10436 -22481 -17622 -19454 5171 10893 12625 -10801 -23628 -45264 -26864 -34399
17609c4399M746J1860l926M807k4537J5370q001o051K884o080j8505j0339J1213
$$ -34399 -29653 -17793 -21719 -16912 -41449 -26079 -34080 -40131 -37247 -43327 -61832 -72171 -60958
17596f0958Q886J4070J6011k297J954j5477l0673J083J5520K6124P883R630J0101
$$ -60958 -52072 -38002 -21991 -24288 -22334 -37811 -68484 -67401 -51881 -25757 -17874 -8244 1857
17583A857J5928o097j3863J1958J4122k307k5205j6413l352J0315K3059n880j7280
$$ 1857 17785 11688 -2175 9783 23905 21598 -3607 -20020 -23372 -13057 10002 4122 -13158
17570a3158o513o978k693L3617L4102k547k8520l6603N111K4578j214j5142j1282
$$ -13158 -19671 -26649 -29342 4275 38377 35830 7310 -29293 -24182 396 -818 -15960 -27242
17557b7242P100p062k2324j8322l670K0240K1264J854K382P213O273j1579J6487
$$ -27242 -20142 -27204 -49528 -67850 -71520 -51280 -30016 -28162 -25780 -18567 -12294 -23873 -7386
17544g386K6054j5831j3180K1291O244k0952l640Q019Q412k1114j0419K547j6094
$$ -7386 18668 2837 -10343 10948 17192 -3760 -7400 619 9031 -12083 -22502 -19955 -36049
17531c6049N322p381k2127L425J2304o126L4393Q705j3567R189K412p491k0888
$$ -36049 -30727 -38108 -60235 -56810 -44506 -50632 -16239 -7534 -21101 -11912 -9500 -16991 -37879
17518c7879L086L0179M9k6194L317j9245J5152K9833k01J0831m927q472r512k9424
$$ -37879 -34793 -4614 -4565 -30759 -27442 -46687 -31535 -1702 -1903 8928 4001 -4471 -13983 -43407
17504d3407k0482j5595n30P973J6583M598P690J9748m067J0456J6814l610l9581
$$ -43407 -63889 -79484 -80014 -72041 -55458 -50860 -43170 -23422 -27489 -17033 -219 -3829 -43410
17491d3410j3169J8152K3461K1385n339k4094J1608K5655p990j1152j4304J5373
$$ -43410 -56579 -38427 -14966 6419 1080 -23014 -11406 14249 6259 -4893 -19197 -3824
17479c824K1677J699k2063j4671l055j0945j1900R239J2041P08J6145L6789J8339
$$ -3824 17853 19552 -2511 -17182 -20237 -31182 -43082 -33843 -21802 -21094 -4949 31840 50179
17466E0179o532r134j2830J1401o708l1256k362L1013q570l0886J6401j332j690
$$ 50179 43647 34513 21683 33084 26376 -4880 -7242 23771 15201 -15685 716 -616 -2306
17453b306n992R47q255K1860P258J5003Q947L1279J1084J7001K7012P1578N7589
$$ -2306 -8298 -7351 -15606 6254 13512 28515 37462 68741 79825 96826 123838 195416 253005
17440B53005n607o8055n4721j6320m4488j7178j8568k3040N661J3795M617K8437
$$ 253005 247398 179343 124622 108302 63814 46636 28068 5028 10689 24484 29101 57538
17428E7538j1945j6797K514j5313l3220l61M737R40j1896J311M3670Q482k1013
$$ 57538 45593 28796 31310 15997 -17223 -17584 -12847 -11907 -23803 -22492 21178 29660 8647
17415H647k2286O1R972j783J78j740k2700k512J2140j6296r924M863K5949M4980
$$ 8647 -13639 -13578 -3606 -5389 -5211 -6951 -29651 -32163 -20023 -36319 -46243 -41380 -15431 29549
17401B9549J3024P377L228p515l4317j7784R005O27N120k5326n422J3858j0325
$$ 29549 42573 49950 53178 45663 11346 -6438 2567 3194 8314 -17012 -22434 -8576 -18901
17388a8901K345k73J164j1581l857j7159K3388L0347Q584J1365j5572K529J934
$$ -18901 -16556 -16829 -15665 -27246 -31103 -48262 -24874 5473 14057 25422 9850 12379 14313
17375A4313l38j2845k3496o257M021J0367j9060p940k124j0631r055R919J0463
$$ 14313 13975 1130 -22366 -28623 -24602 -14235 -33295 -41235 -43359 -53990 -63045 -53126 -42663
17362d2663J7720J5992M009n577N463K4227r62k735j3808k2117l480K894m903
$$ -42663 -24943 -8951 -4942 -10519 -5056 19171 18209 15474 1666 -20451 -23931 -21037 -25940
17349b5940J2601J6346j9268k0008j0394O647k0542J4737K1815K0079J0563q408
$$ -25940 -13339 3007 -16261 -36269 -46663 -40016 -60558 -45821 -24006 -3927 6636 -1772
17337a772M725k968l3875r104J0827L3114j3035k45R27K772P357K920q937q382
$$ -1772 2953 -15 -33890 -42994 -32167 947 -12088 -12333 -11406 -8634 -1277 1643 -7294 -15676
17323a5676J5301j2212K3323P852l7242j8681L4134M0349L828j4537P138q785
$$ -15676 -375 -12587 10736 18588 -18654 -37335 -3201 37148 40976 26439 33577 24792
17311B4792J0820j3556q331q962j0050L430J9122M204j3455j8465R049j2433j3983
$$ 24792 35612 22056 13725 4763 -5287 -1857 17265 21469 8014 -10451 -1402 -13835 -27818
17298b7818j4760Q728J0160j4153m60J29J1654k0797J4353p057k053J9002J2254
$$ -27818 -42578 -33850 -23690 -37843 -38303 -38174 -26520 -47317 -32964 -40021 -42074 -23072 -10818
17285a0818j718q833J613J9788m066J46l886k2071l178R375O057k0575j05k654
$$ -10818 -12536 -21369 -19756 32 -4034 -3888 -7774 -29845 -33023 -23648 -17591 -38166 -38271 -40925
17271d0925J6146L0814N092j9764k2118K3565L9285j8148q511k1649Q201K045
$$ -40925 -24779 6035 11127 -8637 -30755 -7190 32095 13947 5436 -16213 -8012 -5967
17259e967O925J5286l507j8763j3826R113n632n548K4994J0065N28J727j4464
$$ -5967 958 16244 12737 -6026 -19852 -10739 -16371 -21919 3075 13140 13668 15395 931
17246I31k347q733K319j2900k2921L479J3576K3657J8273J9497j5176k395P72
$$ 931 -1416 -10149 -7830 -20730 -43651 -40172 -26596 -2939 15334 34831 19655 17260 18032
17233A8032K582N429j2018m156J2791J3473n686j4313k6443j7227K2991K717q046
$$ 18032 20614 26043 14025 9869 22660 36133 30447 16134 -10309 -27536 -4545 -1828 -9874
17220i874n91J4243p369j4724J6564K1202j6432l7009J8440L1396j040j3470R10
$$ -9874 -10465 3778 -3591 -18315 -1751 19451 3019 -33990 -15550 15846 14806 1336 2246
17207B246k838m930m785k7110J103K7791J242K0559K6393Q040l067K506k4805
$$ 2246 -592 -5522 -10307 -37417 -36314 -8523 -7281 13278 39671 47711 44644 47150 22345
17194B2345k4463j9276n134J2279J9337J787j0119j7533l948L330n613J1181L2810
$$ 22345 -2118 -21394 -26528 -14249 5088 6875 -3244 -20777 -24725 -21395 -27008 -15827 16983
17181A6983P874j3000k055J5539m492o461Q870j2499r768K2243K0091j74n337
$$ 16983 24857 11857 9802 25341 20849 14388 23258 10759 991 23234 43325 43151 37814
17168C7814j3654p931j9305K00J455P162Q352n682m61m231q856J0869k9812J13
$$ 37814 24160 16229 -3076 -2876 -1421 5741 14093 8411 7950 3719 -5137 5732 -24080 -23967
17154b3967K8482R667l0154j7836j0320N430Q822J0316J7424Q016R290M42k6277
$$ -23967 4515 14182 -15972 -33808 -44128 -38698 -29876 -19560 -2136 5880 15170 15612 -10665
17141a0665J5184J4019j9957n138N486J6972n1793n178K7704O633M88j9928m731
$$ -10665 4519 18538 -1419 -6557 -1071 15901 -35892 -41070 -13366 -6733 -6245 -26173 -30904
17128c0904K6712M796o841q162J1214n103k2787p819N691J3714m764K4227J8289
$$ -30904 -4192 604 -6237 -14399 -3185 -8288 -31075 -38894 -33203 -19489 -24253 -26 18263
17115A8263K1779k1892l0450l9415r749K4416K236P079Q465P776O722J452r921
$$ 18263 40042 18150 -12300 -51715 -61464 -37048 -34812 -27733 -19268 -11492 -4770 -3318 -13239
17102a3239j6068K3657m653p642P510R157R618j3920k3806J0002o053j1854P294
$$ -13239 -29307 -5650 -10303 -17945 -10435 -1278 8340 -5580 -29386 -19384 -25437 -37291 -29997
17089b9997J546j4139k3433P775L6007K7044o695j3967J2917K3487j5984k6234
$$ -29997 -28451 -42590 -66023 -58248 -22241 4803 -1892 -15859 -2942 20545 4561 -21673
17077b1673q08K93K4533J0177n203N495J2229J439j5622n474r235P440K5866J8891
$$ -21673 -22481 -22188 2345 12522 7319 12814 25043 26482 10860 5386 -3849 3591 29457 48348
17063D8348l314Q093j2918l746k6133l54J1834n234n529l0152Q768K5981o782
$$ 48348 45034 53127 40209 36463 10330 9976 21810 16576 11047 -19105 -10337 15644 8862
17050H862j9479K0011O305K613L816m596k8419j1945j2624P874q98N658K9700
$$ 8862 -10617 9394 15699 18312 22128 17532 -10887 -22832 -35456 -27582 -28480 -22822 6878
17037F878J0349k303j1008O112K0611j580k7656j6393Q69J0820j2319j4249J2618
$$ 6878 17227 14924 3916 10028 30639 29059 1403 -14990 -14121 -3301 -15620 -29869 -17251
17024a7251J4539j3990j0702J1647J3901j7610n906L829K0901J6289R933n534
$$ -17251 -2712 -16702 -27404 -15757 -1856 -19466 -25372 -21543 -642 15647 25580 20046
17012B0046R460M796j9782k4297J3925J5215k5457M942o373n264K332J2948K2555
$$ 20046 29506 34302 14520 -9777 4148 19363 -6094 -1152 -7525 -12789 -10457 2491 25046
16999B5046p090j4043q249p308j3514J1227K4485J8736L1014J1016k3784q742
$$ 25046 17956 3913 -4336 -11644 -25158 -13931 10554 29290 60304 71320 47536 38794
16987C8794j4834j4985J3561j8838k2790P476m974K3521J8684R260j0201o923
$$ 38794 23960 8975 22536 3698 -19092 -11616 -16590 6931 25615 34875 24674 17751
16975A7751Q95L669L509m771J3332k0926J1923j0558j0287k975n554l44K3446
$$ 17751 18646 22315 25824 21053 34385 13459 25382 14824 4537 1562 -3992 -4336 19110
16962A9110J3617j835l1717k4235p700k4155K6148O05j5010l9J6810N694j0294
$$ 19110 32727 30892 -825 -25060 -32760 -56915 -30767 -30162 -45172 -45211 -28401 -22707 -33001
16949c3001k5307K2288K7324J2182L887j2373m847N885O508q834M887k8080l328
$$ -33001 -58308 -36020 -8696 3486 7373 -5000 -9847 -3962 2546 -6288 -1401 -29481 -32809
16936c2809K929L862J244J2950J5502J2774l183j9991K2037n853j5744N72j1970
$$ -32809 -29880 -26018 -24774 -11824 3678 16452 13269 -6722 15315 9462 -6282 -5710 -17680
16923a7680j2018J0837N407j2264J0553L5327J3481m712K195o551k5470J0876
$$ -17680 -29698 -18861 -13454 -25718 -15165 20162 33643 28931 31126 24575 -895 9981
16911I981K7073k3583j2028j2017M1252m313m5439k9073K1460K1453n062j3022
$$ 9981 37054 13471 1443 -10574 30678 26365 -19074 -48147 -26687 -5234 -10296 -23318
16899b3318j5378PK454P629j6392O599m236K3069M713J2436j987j489j2697J089
$$ -23318 -38696 -38689 -36235 -28606 -44998 -38399 -42635 -19566 -14853 -2417 -4404 -5893 -18590 -17501
16885a7501K6194J5048r906n984p266p398J3807O427p288p138q055j6735m543
$$ -17501 8693 23741 13835 7851 585 -6813 6994 13421 6133 -1005 -9060 -25795 -30338
16872c0338P41p185j824R899J326p674J6745J6809L76J5099j1478k4869j2842
$$ -30338 -29597 -36782 -38606 -28707 -27381 -35055 -18310 -1501 -1125 13974 2496 -22373 -35215
16859c5215m679K588J8354j183j1O971L2857K1951k2059k7623M449K2156K4902
$$ -35215 -39894 -37306 -18952 -20135 -20146 -13175 19682 41633 19574 -8049 -3600 18556 43458
16846D3458j8138r295k3296r214o559J3768N575l892P272Q855k2644k1037L219
$$ 43458 25320 16025 -7271 -16485 -23044 -9276 -3701 -7593 -321 8534 -14110 -35147 -31928
16833c1928K4278J527L1159J0361k3165k4346l984n289J130k4121J7150J3565
$$ -31928 -7650 -6123 25036 35397 12232 -12114 -16098 -21387 -20257 -44378 -27228 -13663
16821a3663j533j959J1915K6750k3756n040j6308j1216j9706o921J0331Q787K3697
$$ -13663 -15196 -17155 -5240 21510 -2246 -7286 -23594 -34810 -54516 -61437 -51106 -42319 -18622
16808a8622m853l475n006j1616J1381n162n231J8419o475J8919K3959O759k8798
$$ -18622 -23475 -26950 -31956 -43572 -32191 -37353 -42584 -24165 -30640 -11721 12238 18997 -9801
16795i801K906j7380k8763j5948R065K6377K130J103J4631Q737j2594m768K6295
$$ -9801 -6895 -24275 -53038 -68986 -59921 -33544 -31414 -30311 -15680 -6943 -19537 -24305 1990
16782A990J1900l999k2544l7313o771L5131J9696j7720j3532J0339J1509p646
$$ 1990 13890 9891 -12653 -49966 -56737 -21606 -1910 -19630 -33162 -22823 -11314 -18960
16770a8960J9063L2416l294j3381k1881k0155J7960r178k5308n054L4824J4430
$$ -18960 103 32519 29225 15844 -6037 -26192 -8232 -17410 -42718 -47772 -12948 1482
16758A482m471P008J0436J4051p969k5349j0203J0798l604O040K924j2476j3422
$$ 1482 -2989 4019 14455 28506 20537 -4812 -15015 -4217 -7821 -1781 1143 -11333 -24755
16745b4755o381o012J1745K1016q227m091m483K965J6459O66m0144J6568N572
$$ -24755 -31136 -37148 -25403 -4387 -12614 -16705 -21188 -18223 -1764 -1098 -41242 -24674 -19102
16732a9102Q543J1093J6846L116p086J1473j60O303j3419j063q335N115L61J8646
$$ -19102 -10559 534 17380 20496 13410 24883 24723 31026 17607 16544 8209 13324 13685 32331
16718C2331j2075k7684j0484O507P748m124n829j3025K5355K5394J3279k704j5414
$$ 32331 20256 -7428 -17912 -11405 -3657 -7781 -13610 -26635 -1280 24114 37393 34689 19275
16705A9275p541j1678k868l3562j5005K0649R360J5837j407q908j0771O523J1126
$$ 19275 11734 56 -2812 -36374 -51379 -30730 -21370 -5533 -6940 -15848 -26619 -20096 -8970
16692h970J4430J6170p518j5180L137Q776j143J2250j6351o522j595P862J6240
$$ -8970 5460 21630 14112 -1068 2069 10845 9702 21952 5601 -921 -2516 5346 21586
16679B1586O538M771R261j348l4258l4880l043J5917J1144L0370Q186l2366k1611
$$ 21586 28124 32895 42156 40808 6550 -28330 -31373 -15456 -4312 26058 34244 1878 -19733
16666a9733K2644J3266l182J2663J0274L776k2215M190L2740p239m2620k7523
$$ -19733 2911 16177 12995 25658 35932 39708 17493 21683 54423 47184 4564 -22959
16654b2959J5390J7803J1121N630j3002O813p804j5634m251q442j0236J0641m857
$$ -22959 -7569 10234 21355 26985 13983 20796 12992 -2642 -6893 -15335 -25571 -14930 -19787
16641a9787m001K5586K9461O413r304K220L219k5254j480j6066K086K3682Q756
$$ -19787 -23788 1798 31259 37672 28368 30588 33807 8553 7073 -8993 -6907 16775 25531
16628B5531K1395K4394K0565N997J0713j698L4464j0834j7518j9349J6466K4013
$$ 25531 46926 71320 91885 97882 108595 106897 141361 130527 113009 93660 110126 134139
16616A34139O167n476M3030N1518O7186O8467N5800J14567K34293M55582Q71261
$$ 134139 140306 134830 177860 229378 296564 365031 420831 535398 769691 1225273 2096534
16605B096534J365855J081579k10369j340586j115785o77301m08670k41723j87575
$$ 2096534 3462389 4543968 4333599 2993013 1877228 1199927 791257 549534 361959
16596C61959j05598l4072m6810m1488l3398k5083J1152Q400j7593l5510k8460
$$ 361959 256361 222289 175479 133991 100593 75510 86662 95062 77469 41959 13499
16585A3499J473m203j993k313J341K0320N211j9383j8493j7890L583K3972O856
$$ 13499 14972 10769 8776 6463 7804 28124 33335 13952 -4541 -22431 -18848 5124 11980
16572A1980J0929p776m348K1443l2870k1929l980K5140R460p307n995Q118O085
$$ 11980 22909 15133 10785 32228 -642 -22571 -26551 -1411 8049 742 -5253 2865 8950
16559H950j6884j3937n833J72K1897K4842N737j2986j4660J3532J7204j6812q500
$$ 8950 -7934 -21871 -27704 -27532 -5635 19207 24944 11958 -2702 10830 28034 11222 2722
16546B722N47K335J3475l389l222J5878K0648k7343k0109K475L016j2677l3900
$$ 2722 3269 5604 19079 15690 12468 28346 48994 21651 1542 4017 7033 -5644 -39544
16533c9544n378N6644M1089m10j4378j1403j697m661j1917J9937o745l3536k2402
$$ -39544 -44922 11722 52811 52401 38023 26620 24923 20262 8345 28282 21537 -11999 -34401
16520c4401J0784j7342j983R003J2348K417p607J4823n078k231L450n256J7570
$$ -34401 -23617 -40959 -42942 -33939 -21591 -19174 -26781 -11958 -17036 -19267 -15817 -21073 -3503
16507c503J0054O68L670J1791O562K913j939r931k1923r430J5499J810R886Q469
$$ -3503 6551 7219 10889 22680 29242 32155 30216 20285 -1638 -11068 4431 6241 16127 24596
16493B4596r007k1580R243K7247m02k6509m0565o295K7711J7288p052J6048J0080
$$ 24596 15589 -5991 3252 30499 30097 3588 -36977 -43272 -15561 1727 -5325 10723 20803
16480B0803p999j5176j583N519l567l0768j5081J032m967J4895J0970j0456J7436
$$ 20803 12804 -2372 -3955 1564 -2003 -32771 -47852 -46820 -51787 -36892 -25922 -36378 -18942
16467a8942J4649n650K0648K6592K7891q887k2371l029j9193l641J310Q808m083
$$ -18942 -4293 -9943 10705 37297 65188 56301 33930 30901 11708 8067 9377 18185 14102
16454A4102n936r595L438j1880m928K4349L562k6710j8470J1082J8050j5430Q704
$$ 14102 8166 -1429 2009 -9871 -14799 9550 13112 -13598 -32068 -20986 -2936 -18366 -9662
16441i662J5308N380N083j1883n101j2270J0950j587o675p425P843J1141O495
$$ -9662 5646 11026 16109 4226 -875 -13145 -2195 -3782 -10457 -17882 -10039 1102 7597
16428G597J8760o896Q153k8217k5048j1256j2254K670r584j1978J735J9755J6099
$$ 7597 26357 19461 27614 -603 -25651 -36907 -49161 -46491 -56075 -68053 -66318 -46563 -30464
16415c0464J6074M809K705l3749j7151R947p665K640K0944K466k377R104J8973
$$ -30464 -14390 -9581 -6876 -40625 -57776 -47829 -55494 -52854 -31910 -29444 -31821 -22717 -3744
16402c744J2516j1288O970n443O617J0789J172j0844m703M403k0162k3602k1593
$$ -3744 8772 -2516 4454 -989 5628 16417 17589 6745 2042 6445 -13717 -37319 -58912
16389e8912P342M7629K1184j6090o061O445L337O082k668j8763j0165J6852L330
$$ -58912 -51570 -3941 17243 1153 -4908 1537 4874 10956 8288 -10475 -20640 -3788 -458
16376d58m365l841K6612j981o885L376m2479q499L4709P631L715p027r707J584
$$ -458 -4823 -8664 17948 15967 9082 12458 -30021 -38520 -3811 3820 7535 508 -9199 -7615
16362g615Q361l636k976o952l0294k0303k427K1255J1501J8214J5120j2739k843
$$ -7615 746 -2890 -5866 -12818 -43112 -63415 -65842 -44587 -33086 -14872 248 -12491 -15334
16349a5334j1820m110k120N635l07J4416j1545m431P81J7527K2843M788l1591
$$ -15334 -27154 -31264 -33384 -27749 -28056 -13640 -25185 -29616 -28835 -11308 11535 16323 -15268
16336a5268l875J0640J890k06k749j416j0533J7705R38l4884j5583Q503J7574
$$ -15268 -19143 -8503 -6613 -6819 -9568 -10984 -21517 -3812 -2874 -37758 -53341 -44838 -27264
16323b7264J1263K9329j8441j9696k6106k0331K845J1574K7630L7188K862k0727
$$ -27264 -16001 13328 -5113 -24809 -50915 -71246 -68401 -56827 -29197 7991 10853 -9874
16311i874K0712j1236r372L565L953l26j3538o77J1955l788L175j3424J8423J3826
$$ -9874 10838 -398 -9770 -6205 -2252 -2578 -16116 -16793 -4838 -8626 -5451 -18875 -452 13374
16297A3374o982k0401k6648P321r707O696J8087K0625J5698N593k7458j2526K2780
$$ 13374 6392 -14009 -40657 -33336 -43043 -36347 -18260 2365 18063 23656 -3802 -16328 6452
16284F452J0177J066k4851K136j8295M622J6282J1730J822o94q799n302l914O550
$$ 6452 16629 17695 -7156 -5020 -23315 -18693 -2411 9319 11141 10447 1648 -3654 -7568 -1018
16270a018J1381P1R576j3190j0287J1683P404J2093J5010J1993j3385l0126l3099
$$ -1018 10363 10434 20010 6820 -3467 8216 15620 27713 42723 54716 41331 11205 -21894
16257b1894k830L2638l287j5043Q51n987k6074R329N4434O53l2646j0573J7130
$$ -21894 -24724 7914 4627 -10416 -9565 -15552 -41626 -32297 22137 22790 -9856 -20429 -3299
16244c299L5831q725k1698n333M8206j4222j9380N306L673j2585j1973j907J546
$$ -3299 32532 23807 2109 -3224 44982 30760 11380 16686 20359 7774 -4199 -6106 -4560
16231d560O243L177q052J9400J3483q102k8728o668j1363J1932J0892J3872J7129
$$ -4560 1683 4860 -3192 16208 29691 21589 -7139 -13807 -25170 -13238 -2346 11526 28655
16218B8655q616j5106j9685l707M923Q925J1760j7599k4042J309L3993J3667k1575
$$ 28655 20039 4933 -14752 -18459 -13536 -4611 7149 -10450 -34492 -33183 810 14477 -7098
16205g098p826K1252k0436k5699o702J273J0099L387J0757m75j9539j8675K3702
$$ -7098 -14924 6328 -14108 -39807 -46509 -45236 -35137 -31750 -20993 -21468 -41007 -59682 -35980
16192c5980J7110l666R000J2399L2515J786k1190k4960j8713l879m063J4946j634
$$ -35980 -18870 -22536 -13536 -1137 31378 33164 11974 -12986 -31699 -35578 -39641 -24695 -26329
16179b6329P264L0192j8697L556J0275J5826l224J0590N317l352l7696l2487L904
$$ -26329 -19065 11127 -7570 -4014 6261 22087 18863 29453 34770 31418 -6278 -38765 -34861
16166c4861J2644M914N567R695k2874O573J9079P459p577M428J8088Q004j9619
$$ -34861 -22217 -17303 -11736 -2041 -24915 -18342 737 8196 619 5047 23135 31139 11520
16153A1520q482K3564n531j9830j815j3701K1378J7511l764O63l4294l0464K440
$$ 11520 3038 26602 21071 1241 -574 -14275 7103 24614 20850 21513 -12781 -43245 -40805
16140d0805L0550N073P9m729L221M558r941J9550n136j9771k8869J1563J3922
$$ -40805 -10255 -5182 -5103 -9832 -6611 -2053 -11994 7556 2420 -17351 -46220 -34657 -20735
16127b0735J2928K1226k457j3701j8047p321J9834l338o178O360p449r25n840
$$ -20735 -7807 13419 10962 -2739 -20786 -28107 -8273 -11611 -17789 -11429 -18878 -19803 -25643
16114b5643J8963J3514J4034j0741k2401q807k1721K4332j1215L452j8487j0757
$$ -25643 -6680 6834 20868 10127 -12274 -21081 -42802 -18470 -29685 -26233 -44720 -55477
16102e5477K7789M2901N25l167K062j4505J7314j709j7228k4747J465j057L1125
$$ -55477 -27688 15213 15738 12571 14633 128 17442 15733 -1495 -26242 -24777 -25834 5291
16089E291J3741k370J0892N603k580j4842j6179n997j4004N285J9523J367j1815
$$ 5291 19032 16662 27554 33157 30577 15735 -444 -6441 -20445 -15160 4363 5730 -6085
16076f085k8584P48P174J9975M078j0875O03K0212m87k1615J3131j177k7666p15
$$ -6085 -34669 -33921 -26747 -6772 -2694 -13569 -12966 7246 6759 -14856 -1725 -2902 -30568 -31283
16062c1283R807J6157r946n716q156Q513J0097o138L9057n904r040j8035j0412
$$ -31283 -21476 -5319 -15265 -20981 -29137 -20624 -10527 -16665 22392 16488 7448 -10587 -20999
16049b0999K3580J3850J9788R371J057J203K5061q179j9346J127J521k2604q422
$$ -20999 2581 16431 36219 45590 46647 47850 72911 64732 45386 46513 48034 25430 17008
16036A7008J1599q437l0428J0882K2657l362k2184J6103K2384J0903l1267q697
$$ 17008 28607 20170 -10258 624 23281 19919 -2265 13838 36222 47125 15858 7161
16024G161o100j1519j5015q121P554l264P133l739l193J5826j2622Q841J5687
$$ 7161 1061 -10458 -25473 -33594 -26040 -29304 -22171 -25910 -29103 -13277 -25899 -17058 -1371
16011a371j1852j3626L1326K8498n826j7053l102J2500J517j6446r121J3145o835
$$ -1371 -13223 -26849 4477 32975 27149 10096 6994 19494 21011 4565 -4556 8589 1754
15998A754k4102l965J0859m370n049K8899p047k0723K813J2125q43M036n727j5116
$$ 1754 -22348 -26313 -15454 -19824 -24873 4026 -3021 -23744 -20931 -8806 -9649 -5613 -11340 -26456
15984b6456K1330J7455J8944K6238l8898m3010J0464N874O462J6387K1383N203
$$ -26456 -5126 12329 31273 57511 18613 -24397 -13933 -8059 -1597 14790 36173 41376
15972D1376k4161l4128n470R874K6420o475J2340j7696m558q042K54K6986L7269
$$ 41376 17215 -16913 -22383 -12509 13911 7436 19776 2080 -2478 -10520 -10266 16720 53989
15959E3989J491j5599l5232j4500j5855l524L1049l278j5264J9840J5923k344
$$ 53989 55480 39881 4649 -9851 -25706 -29230 1819 -1459 -16723 3117 19040 16696
15947A6696k39O093Q890l8329k2822J9691l950m662J3356L2917j2673j7581P33
$$ 16696 16457 22550 31440 -6889 -29711 -10020 -13970 -18632 -5276 27641 14968 -2613 -1880
15934a880r896Q407j624L0871J1823L121k0576m4084n326L321j4382o76L81Q696
$$ -1880 -11776 -3369 -4993 25878 37701 40822 20246 -23838 -29164 -25843 -40225 -40901 -40520 -31824
15920c1824J6683K5781p033o520r236j2159k3590J8154K6985Q098K5446O145m875
$$ -31824 -15141 10640 3607 -2913 -12149 -24308 -47898 -29744 -2759 5339 30785 36930 32055
15907C2055q031k5495k3508J0571m934K341J3061K252l0472p841K4060L3609j3667
$$ 32055 24024 -1471 -24979 -14408 -19342 -17001 -3940 -1688 -32160 -40001 -15941 17668 4001
15894D001j1150j079j0793j3360L967Q303J0309J1455O454J8770j4214k4975j3023
$$ 4001 -7149 -8228 -19021 -32381 -28414 -20111 -9802 1653 8107 26877 12663 -12312 -25335
15881b5335N514M376r909j6923n238K3368K1316J3884K2791O868n869j8056j4040
$$ -25335 -19821 -15445 -25354 -42277 -47515 -24147 -2831 11053 33844 40712 34843 16787 2747
15868B747k61m31j5826n895J2478R20k2082j9016O05J2685O860N540O039O334
$$ 2747 2486 2055 -13771 -19666 -7188 -6268 -28350 -47366 -46761 -34076 -27216 -21676 -15637 -9303
15854i303k1806Q991P966J7438j583j1808P396r474K6218j5321r964K0413l224
$$ -9303 -31109 -22118 -14152 3286 1703 -10105 -2709 -12183 14035 -1286 -11250 9163 5939
15841E939j2026J2527J6850J3458j5434l4135j6870K5429J4075o395k5091j7555
$$ 5939 -6087 6440 23290 36748 21314 -12821 -29691 -4262 9813 3418 -21673 -39228
15829c9228J839l22J3315L7869l544k3155l6106Q631J3892j0316K6997L128j5308
$$ -39228 -37389 -37711 -24396 13473 9929 -13226 -49332 -40701 -26809 -37125 -10128 -7000 -22308
15816b2308j1086j1645J5708M489M09L74j3078p459L1429J0148k148k002Q362
$$ -22308 -33394 -45039 -29331 -24842 -24433 -24059 -37137 -44596 -13167 -3019 -5167 -7169 1193
15803A193J2965l0761m155O471j007L456M56J2622J7866j4039k7218k8081j1373
$$ 1193 14158 -16603 -20758 -14287 -15294 -11838 -11382 1240 19106 5067 -22151 -50232 -61605
15790f1605n974K7452J0223K4249J4375J7132J3442q907k048j1700R913k120p057
$$ -61605 -67579 -40127 -29904 -5655 8720 25852 39294 30387 28339 16639 26552 24432 17375
15777A7375Q115J581j0699n81j0246j243K689K28o009N940j2627j483j9332n718
$$ 17375 25490 27071 16372 15791 5545 4302 6991 7219 1210 7150 -5477 -6960 -26292 -32010
15763c2010R556K3613m876O139j1773q647J9429O963k2149o670M579l405J2166
$$ -32010 -22454 1159 -3717 2422 -9351 -17998 1431 8394 -13755 -20425 -15846 -19251 -7085
15750g085J9994K078j8612J2494M78j262j1695k3581j3534K3302L5709O604N699
$$ -7085 12909 14987 -3625 8869 9347 8085 -3610 -27191 -40725 -17423 18286 24890 30589
15737C0589j1690j2325L355K374O776k9934k6304K3406J5010K4455q206j7334
$$ 30589 18899 6574 9929 12303 19079 -10855 -37159 -13753 1257 25712 17506 172
15725A72k6600p753j816k383Q977J0654P256Q548J6255o966J119K0586p840j2965
$$ 172 -26428 -34181 -35997 -38380 -29403 -18749 -11493 -2945 13310 6344 7463 28049 20209 7244
15711G244o775j612P552L257m391j4455j1425k27K5412k972j287j4375n913M2988
$$ 7244 469 -1143 6409 9666 5275 -9180 -20605 -20832 4580 1608 321 -14054 -19967 23021
15697B3021K3991j588o004n719K737k7976N145r559l3177j1721O559J2481N616
$$ 23021 47012 45424 39420 33701 36438 8462 13607 4048 -29129 -40850 -34291 -21810 -16194
15684a6194J7198P427j3227l2591J2593K4102j1857k9005M497O683Q624J1943
$$ -16194 1004 8431 -4796 -37387 -24794 -692 -12549 -41554 -37057 -30374 -21750 -9807
15672i807n419j4089l962K860M994J3142K1764J1183L082n471k4916q21p900j6806
$$ -9807 -15226 -29315 -33277 -30417 -25423 -12281 9483 20666 23748 18277 -6639 -7460 -15360 -32166
15658c2166Q045K6869K0543M871K6425k5319j2536p198j2357p645o745K0220J7358
$$ -32166 -24121 2748 23291 28162 54587 29268 16732 9534 -2823 -10468 -17213 3007 20365
15645B0365j4890l1665J5617K6665J0633k3101N810K038n855K5009M937J1004
$$ 20365 5475 -26190 -10573 16092 26725 3624 9434 11472 5617 30626 35563 46567
15633D6567j3947j5179j7896N328P744N509N64J124j0770j3012k0233n800k002
$$ 46567 32620 17441 -455 4873 12617 18126 18690 19814 9044 -3968 -24201 -30001 -32003
15620c2003J6245J4174K2492P141j7158p259l916m548r309j0172r654l390k093
$$ -32003 -15758 -1584 20908 28049 10891 3632 -284 -4832 -14141 -24313 -33967 -37357 -39450
15607c9450j4528Q044J2320K2692j2103O032l28L4584j5138P524J6448j0055l5235
$$ -39450 -53978 -45934 -33614 -10922 -23025 -16993 -17321 17263 2125 9649 26097 16042 -19193
15594a9193k9870J0465R198N818J5346L293l505j550k367P124L336j0182o165
$$ -19193 -49063 -38598 -29400 -23582 -8236 -4943 -8448 -9998 -12365 -5241 -1905 -12087 -18252
15581a8252K6902L0861n595m7J4187j4641l5960l6898j5040J9695J2055k2700
$$ -18252 8650 39511 33916 33869 48056 33415 -2545 -39443 -54483 -34788 -22733 -45433
15569d5433p3J2356o416k3193K4176L7222K7879K496k7250j3477K1417K1561J6803
$$ -45433 -45506 -33150 -39566 -62759 -38583 -1361 26518 29014 1764 -11713 9704 31265 48068
15556D8068p819j7134l1181l20O454q396J3724Q210M001Q272k1502p412k1171
$$ 48068 40249 23115 -8066 -8386 -1932 -10328 3396 11606 15607 23879 2377 -5035 -26206
15543b6206J6892L1375J2629r706k267P96J2012j4794K925r357K0328j904m155
$$ -26206 -9314 22061 34690 24984 22717 23513 35525 20731 23656 14299 34627 32723 28568
15530B8568J1661q662q855o736n717k5655k0459J2607J616J0105l72j5088N024
$$ 28568 40229 31567 22712 15976 10259 -15396 -35855 -23248 -21632 -11527 -11899 -26987 -21963
15517b1963K2571J9369R270j6141l7926p290Q239Q730q961J1367J9952R110o382
$$ -21963 608 19977 29247 13106 -24820 -32110 -23871 -15141 -24102 -12735 7217 16327 9945
15504I945J6622N715m958k952j2488K686p499J3885J9337k972m0299k1033N331
$$ 9945 26567 32282 27324 24372 11884 14570 7071 20956 40293 37321 -2978 -24011 -18680
15491a8680j6040J5916K6178k68N266L27j3872N693j5011j4152P117j5502k0177
$$ -18680 -34720 -18804 7374 7106 12372 12699 -1173 4520 -10491 -24643 -17526 -33028 -53205
15478e3205o586n067k407Q283J3873L0389j81r207J9481J5991j4697j9582J3588
$$ -53205 -59791 -64858 -67265 -58982 -45109 -14720 -14901 -24108 -4627 11364 -3333 -22915 -9327
15465i327R585J7408Q849j6972j8049p271M182O381j2823l433J6162K9616R23
$$ -9327 258 17666 26515 9543 -8506 -15777 -11595 -5214 -18037 -21470 -5308 24308 25231
15452B5231r453P468J6646K1707j4843l8247k4012K9674m880j7669o38L1339R738
$$ 25231 15778 23246 39892 61599 46756 8509 -15503 14171 9291 -8378 -9016 22323 32061
15439C2061R710n458j4789j3480M851K6810j4926p057j2721k1663J0973n218p016
$$ 32061 41771 36313 21524 8044 12895 39705 24779 17722 5001 -16662 -5689 -10907 -17923
15426a7923J0194j1395l096J047k746J1595J331J4838R73k3633k8958o854o13
$$ -17923 -7729 -19124 -22220 -21173 -23919 -12324 -10993 3845 4818 -18815 -47773 -54627 -55240
15413e5240J6536K9930J1186j083Q572n89j8739n679J2651j0627p845j5873J5998
$$ -55240 -38704 -8774 2412 1329 9901 9312 -9427 -15106 -2455 -13082 -20927 -36800 -20802
15400b0802K9707j0655k2832k1851L3377L3555r46l3062Q369K6447K458l744k3994
$$ -20802 8905 -1750 -24582 -46433 -13056 20499 19553 -13509 -5140 21307 23765 20021 -3973
15387c973N207k4469o373M287p113k832J1915K9354J5721j7975J6104O440j1950
$$ -3973 1234 -23235 -29608 -25321 -32434 -35266 -23351 6003 21724 3749 19853 26293 14343
15374A4343p885j3827r375J4166K8570J2301n356j9414k7121j9165n0J4270J1375
$$ 14343 6458 -7369 -16744 -2578 25992 38293 32937 13523 -13598 -32763 -32813 -18543 -7168
15361g168O785K5643Q709O821N549j838r829j2487k9768o832j9153J4724L4051
$$ -7168 -383 25260 33969 40790 46339 44501 34672 22185 -7583 -14415 -33568 -18844 15207
15348A5207j0497j0440k190n994j0302l476J8634K2242J4910k0941k145P470j3460
$$ 15207 4710 -5730 -7920 -13914 -24216 -27692 -9058 13184 28094 7153 5008 12478 -982
15335i82R982J3348n239j1194L334n374O275K292k548m162J9113K2666k2755k56
$$ -982 9000 22348 17109 5915 9249 3875 10150 12442 9894 5732 24845 47511 24756 24500
15321B4500J1252J2898j2090j9487j2363k114K2683N097j8645j7089K6200J6823
$$ 24500 35752 48650 36560 17073 4710 2596 25279 30376 11731 -5358 20842 37665
15309C7665k1060r325r385L393J4244j2234J2669J6k0289K0182r239j0123j719
$$ 37665 16605 7280 -2105 1288 15532 3298 15967 15983 -4306 15876 6637 -3486 -5205
15296e205R924j6943l6787J7617N37k067L2562P418O990L620k9327l8112o871
$$ -5205 4719 -12224 -49011 -31394 -30857 -32924 -362 7056 14046 17666 -11661 -49773 -56644
15283e6644K0553K8048J7742q762k780j0660k321m559n92L7105J9290p169k4451
$$ -56644 -36091 -8043 9699 937 -1843 -12503 -14824 -19383 -19975 17130 36420 29251 4800
15270D800k2865j3107q114r576j1801J3432J4132J0661K8114J2072p944j7526
$$ 4800 -18065 -31172 -39286 -48862 -60663 -47231 -33099 -22438 5676 17748 9804 -7722
15258g722o509K1551j220j9883o229k293j0197q551j6989J0696J191O762q028
$$ -7722 -14231 7320 6100 -13783 -20012 -22305 -32502 -41053 -58042 -47346 -46155 -39393 -47421
15245d7421J0596K5507K3097J7624p564j5670j508M584J6596K7984J699k7833
$$ -47421 -36825 -11318 11779 29403 21839 6169 4661 9245 25841 53825 55524 27691
15233B7691j1944J0440J361j8645j598l26k8074J0505J6968J776J800r785J3573
$$ 27691 15747 26187 27548 8903 7305 6979 -21095 -10590 6378 8154 9954 169 13742
15220A3742J1759l867l2722j1758j2821m953O66K0448j303k1618j0883p750J0897
$$ 13742 25501 21634 -11088 -22846 -35667 -40620 -39954 -19506 -20809 -42427 -53310 -61060 -50163
15207e0163J6220J1393q265M438J8181J2703J0920j0139J0355K55j1260J699j5631
$$ -50163 -33943 -22550 -30815 -26377 -8196 4507 15427 5288 15643 15898 4638 6337 -9294
15194i294l072j0759R095p11k932K5729J6440J0010M865k4513l1153J4229K9673
$$ -9294 -12366 -23125 -14030 -14741 -17673 8056 24496 34506 39371 14858 -16295 -2066 27607
15181B7607J2431J927j4666k0030r516M641J8225K2341J7457j4755l0095q015
$$ 27607 40038 41965 27299 7269 -2247 2394 20619 42960 60417 45662 15567 7552
15169G552Q78K3978R347K0476J5734j7000k6669N007J007j8381k6441J371J7272
$$ 7552 8430 32408 41755 62231 77965 60965 34296 39303 40310 21929 -4512 -3141 14131
15156A4131k0365k5255l35R945J1791J7326j8405k464R374J5215J8754N069k3372
$$ 14131 -6234 -31489 -31824 -21879 -10088 7238 -11167 -13631 -4257 10958 29712 34781 11409
15143A1409l3629m852M989M7970L8097l056k6094j0477M084M775j0034n148q839
$$ 11409 -22220 -27072 -22083 25887 63984 60928 34834 24357 28441 33216 23182 18034 9195
15130I195N893j1862j229J7939j9247j0361K842J1145J174j00j1248j7040l4609
$$ 9195 15088 3226 1997 19936 689 -9672 -6830 4315 5489 5389 -5859 -22899 -57508
15117e7508j2364L1268N728j1342J1632J2371J6671J4382K852M131L949J4894
$$ -57508 -69872 -38604 -32876 -44218 -32586 -20215 -3544 10838 13690 17821 21770 36664
15105C6664n820j0944j3670j8023l472Q672M776J0514J837N172j7172j0692l012
$$ 36664 30844 19900 6230 -11793 -15265 -6593 -1817 8697 10534 15706 -1466 -12158 -15170
15092a5170k0520j7929J3130K2305Q93j6600j810Q959P547J6757n203j5028l5906
$$ -15170 -35690 -53619 -40489 -18184 -17291 -33891 -35701 -26742 -19195 -2438 -7641 -22669 -58575
15079e8575K99M4594J2444n789K4760j7901p507k8825l376J2548J872L296K8028
$$ -58575 -58276 -13682 -1238 -7027 17733 -168 -7675 -36500 -39876 -27328 -25456 -22160 5868
15066E868M823K369j5269j8786j2129J199j2658O451L4794J5729j1967k566m237
$$ 5868 10691 13060 -2209 -20995 -33124 -31925 -44583 -38132 -3338 12391 424 -2142 -6379
15053f379j0619j436n527J8801K5272J5042k7924l5631N686K8216J5358j990k3997
$$ -6379 -16998 -18434 -23961 -5160 20112 35154 7230 -28401 -22715 5501 20859 18869 -5128
15040e128j628m643M975L615M452K7206J0928j96k7298k0541j894R028O602K1233
$$ -5128 -6756 -11399 -6424 -2809 1643 28849 39777 39581 12283 -8258 -10152 -1124 5478 26711
15026B6711O501l3477k5575N957K1756R274p293O06j4958q727J687J318r427O641
$$ 26711 33212 -265 -25840 -19883 1873 11147 3854 4460 -10498 -19225 -17538 -16220 -25647 -19006
15012a9006Q767j5613j331J8981K0773O016o792k6531j75r050K4154m635l0026
$$ -19006 -10239 -25852 -27183 -8202 12571 18587 11795 -14736 -14911 -23961 193 -4442 -34468
14999c4468J0326K821K176r095O122K9591J6863J2670J114j7706k3325j2865J8266
$$ -34468 -24142 -21321 -19145 -28240 -22118 7473 24336 37006 38120 20414 -2911 -15776 2490
14986B490N848P726j4060p808J4468k8913j8647J5502J6138J8879N244l9848l4555
$$ 2490 8338 16064 2004 -5804 8664 -20249 -38896 -23394 -7256 11623 16867 -22981 -57536
14973e7536J0172M4129L0742R518j8182p745n879j3909k0857j8715K0497K5636
$$ -57536 -47364 -3235 27507 37025 18843 11098 5219 -8690 -29547 -48262 -27765 -2129
14961b129n532j4922j8028Q068J0157L5242J7330j4442J096R836j2373m936O847
$$ -2129 -7661 -22583 -40611 -32543 -22386 12856 30186 15744 16840 26676 14303 9367 16214
14948A6214j2276l5332N188J2513Q151m435Q231J5639Q838k218j4785k7625J9200
$$ 16214 3938 -31394 -26206 -13693 -5542 -9977 -1746 13893 22731 20513 5728 -21897 -2697
14935b697K1256M129m2318k1023P820N116J0151N00j881o533K1000P535j3767
$$ -2697 18559 22688 -19630 -40653 -32833 -27717 -17566 -17066 -18947 -25480 -4480 3055 -10712
14922a0712l2039m448J7331P372J0771m355o338L5337O309l0021k1306N275L071
$$ -10712 -42751 -47199 -29868 -22496 -11725 -16080 -22418 12919 19228 -10793 -32099 -26824 -23753
14909b3753r832j0562L5281r43O64J9280o473Q152q655J1005K2241P852r140j1151
$$ -23753 -33585 -44147 -8866 -9809 -9145 10135 3662 11814 3159 14164 36405 44257 35117 23966
14895B3966r064k4870k7561J1613K560j3529j0710J9938K0248N315R262o200q047
$$ 23966 14902 -9968 -37529 -25916 -23356 -36885 -47595 -27657 -7409 -2094 7168 968 -7079
14882g079j8435n329m700L9740N375O253m51k0276K598l4709j1664J5884L776
$$ -7079 -25514 -30843 -35543 4197 9572 15825 15374 -4902 -2304 -37013 -48677 -32793 -29017
14869b9017J3167M021M730P143Q102n982K794j7027j3488O568K2645L076J2735
$$ -29017 -15850 -11829 -7099 44 8146 2164 4958 -12069 -25557 -18989 3656 6732 19467
14856A9467J3037k2409j5972K048L512l856K2495m176l580R437J1310l125j4348
$$ 19467 32504 10095 -5877 -3829 -317 -4173 18322 14146 10566 20003 31313 28188 13840
14843A3840K0481o619k1840o750Q269N986j4274K097J648J2670k1120j2254J0023
$$ 13840 34321 27702 5862 -888 7381 13367 -907 1190 2838 15508 -5612 -17866 -7843
14830g843R884j6601L0115O508j9180m0216j5439K1023O507J3885p262K7298L650
$$ -7843 2041 -14560 15555 22063 2883 -37333 -52772 -31749 -25242 -11357 -18619 8679 12329
14817A2329j8674J6102l466P517Q5l975j2513j1008l848j892K729K0870L544j7924
$$ 12329 -6345 9757 6291 13808 13893 9918 -2595 -13603 -17451 -19343 -16614 4256 7800 -10124
14803a0124k1681J713J5567J0920J7430K0862n924j7909j0580j02J9735k107P676
$$ -10124 -31805 -30092 -14525 -3605 13825 34687 28763 10854 274 172 19907 17800 25476
14790B5476k8652j7566J1059l747j3181R705L913o228J7207K3549L838J0655p206
$$ 25476 -3176 -20742 -9683 -13430 -26611 -16906 -12993 -19221 -2014 21535 25373 36028 28822
14777B8822o94K1004j3169j8021k849o767O140R783L5198J2379j8126K108k1807
$$ 28822 28128 49132 35963 17942 15093 8326 14466 24249 59447 71826 53700 55808 34001
14764C4001M91k0261l438j5657k0712L0632J9329j4033q728k9105j9181N504J2577
$$ 34001 34492 14231 10793 -4864 -25576 5056 24385 10352 1624 -27481 -46662 -41158 -28581
14751b8581L4294Q511o347j3248K5162N743m39n122l9956j611K6174j3901P733
$$ -28581 5713 14224 7877 -5371 19791 25534 25095 19973 -19983 -21594 4580 -9321 -1588
14738a588J0171J2363j2567j7691J9327L212l042q772r767J0876K590q124N864
$$ -1588 8583 20946 8379 -9312 10015 13227 10185 1413 -8354 2522 5112 -3012 2852
14725B852L3561J333j4052k3137j9222O824Q729K4207J5593j3425k3873j6754
$$ 2852 36413 37746 23694 557 -18665 -11841 -3112 21095 36688 23263 -610 -17364
14713a7364k0629M421R962l1836j3757J3467K6316O419J074P040L193L1460n970
$$ -17364 -37993 -33572 -23610 -55446 -69203 -55736 -29420 -23001 -21927 -14887 -11694 19766 13796
14700A3796k543q726k3720j3928m665J1568K7180m838J2241j1362k1870n186O161
$$ 13796 11253 2527 -21193 -35121 -39786 -28218 -1038 -5876 6365 -4997 -26867 -32053 -25892
14687b5892K9089J0230L0583N219p241j0844l296l4867p677P833j8164K165k91
$$ -25892 3197 13427 44010 49229 41988 31144 27848 -7019 -14696 -6863 -25027 -22862 -23153
14674b3153j8864R431J7665o068l944K6281M456j5171N415M613l670J563K4366
$$ -23153 -42017 -32586 -14921 -20989 -24933 1348 5804 -9367 -3952 661 -3009 -1446 22920
14661B2920L423r493J7194Q966k1610j3777m170k5273J6209Q311q37k652P064
$$ 22920 26343 16850 34044 43010 21400 7623 3453 -21820 -5611 2700 1863 -789 6275
14648F275m028j6715M518K326o663p497l258J3215p469p656k0288q691K7802L6003
$$ 6275 2247 -14468 -9950 -7624 -14287 -21784 -25042 -11827 -19296 -26952 -47240 -55931 -28129 7874
14634G874J0864O403L861j7697l739N431j3303o768K5259K533l923N208k1384
$$ 7874 18738 25141 29002 11305 7566 12997 -306 -7074 18185 20718 16795 22003 619
14621F19k4399j18l358j3285L9005n326m4J4138k845L153J3481j097k562N762
$$ 619 -23780 -23898 -27256 -40541 -1536 -6862 -6906 7232 4387 7540 21021 19924 17362 23124
14607B3124p791j2934p357J2178J3233j0912r228j2961n845K784Q108J1713j6355
$$ 23124 15333 2399 -4958 7220 20453 9541 313 -12648 -18493 -15709 -7601 4112 -12243
14594a2243j7333K0755L4180K0531L801K02J7159j5094j5078l6992j7685k2331
$$ -12243 -29576 -8821 25359 45890 49691 49893 67052 51958 36880 -112 -17797 -40128
14582d0128r748L0530L9050l781k4743j7685J4223J5312k138m637k0430J9475
$$ -40128 -49876 -19346 19704 15923 -8820 -26505 -12282 3030 892 -3745 -24175 -4700
14570d700N0145Q248k4750j9289K444p259L350j7649j3406R337J9370m368k7617
$$ -4700 45445 53693 28943 9654 12098 4839 8189 -9460 -22866 -13529 5841 1473 -26144
14557b6144J8237L844k0088J6568K6858n009N139k562r207p87o714L705K3769
$$ -26144 -7907 -4063 -24151 -7583 19275 14266 19405 16843 7636 6849 135 3840 27609
14544B7609J4370j5227j0592m53k150J7426J1342j4096j075j0826j1936K537p663
$$ 27609 41979 26752 16160 15707 13557 30983 42325 28229 27154 16328 4392 6929 -734
14531g34n207n120J5726M324k0574p620J4436k45N538J156o896q194k834p398
$$ -734 -5941 -11061 4665 8989 -11585 -19205 -4769 -5014 524 1680 -5216 -13410 -16244 -23642
14517b3642J0670K5996J0344J69JK037r412J4059L167N078j0177k0056j3245l3204
$$ -23642 -12972 13024 23368 23537 23538 25575 16163 30222 33389 38467 28290 8234 -5011 -38215
14503c8215n681K3890J9300P598L721q447k707k3467o763R790q216K917j3355
$$ -38215 -43896 -20006 -706 6892 10613 2166 -541 -24008 -30771 -20981 -29197 -26280 -39635
14490c9635K5861K8176L896o015N900Q470L328l461k7357k077k06n93l224J6879
$$ -39635 -13774 14402 18298 12283 18183 26653 29981 26520 -837 -2914 -3120 -3713 -6937 9942
14476I942P866o31J2114J1994k1388k7005Q280J3612K54K176m428J5663K6058
$$ 9942 17808 17177 29291 41285 19897 -7108 1172 14784 15038 17214 12786 28449 54507
14463E4507j4234L830r919n211l425j2046j734M742M621J2368N673k3281p673
$$ 54507 40273 44103 34184 28973 25548 13502 11768 16510 21131 33499 39172 15891 8218
14450H218J607j1971j2885L1446p263k3129m48N04O452p18j3321J4856m99Q098
$$ 8218 9825 -2146 -15031 16415 9152 -13977 -14425 -13921 -7469 -8187 -21508 -6652 -7151 947
14436I47N381J0258J3437j7690j0792Q278o943K309O537m323J9667j295k604j1310
$$ 947 6328 16586 30023 12333 1541 9819 2876 5185 11722 7399 27066 25771 23167 11857
14422A1857J3489k1881q649J3106n695j5107N161J836K5797J5670l0409j8610
$$ 11857 25346 3465 -5184 7922 2227 -12880 -7719 -5883 19914 35584 5175 -13435
14410a3435J3015K0740J765k271J0445j8726j0056j7696P654J9305j9219j0963
$$ -13435 -420 20320 22085 19814 30259 11533 1477 -16219 -8565 10740 -8479 -19442
14398a9442K1006L7045J2089k7605P868R284J180K544j9818j5440J4054j2603
$$ -19442 1564 38609 50698 23093 30961 40245 41425 43969 24151 8711 22765 10162
14386A0162j5026l4127J8553O854k0786n168K330K7437N103m912L4571L33j7434
$$ 10162 -4864 -38991 -20438 -13584 -34370 -39538 -37208 -9771 -4668 -9580 24991 25324 7890
14373G890j0518q76L5626J9829j1573j1896J0787l0379j5855M229p573l819J1211
$$ 7890 -2628 -3504 32122 51951 40378 28482 39269 8890 -6965 -2736 -10309 -14128 -2917
14360b917O059R274k973Q25j2329r844Q80L1126K1478J4366l845j5307l542j3341
$$ -2917 3142 12416 9443 10268 -2061 -11905 -11025 20101 41579 55945 52100 36793 33251 19910
14346A9910j6276j9673K0716J5205O505R119n688J9543l698k7777j7011j1174
$$ 19910 3634 -16039 4677 19882 26387 35506 29818 49361 45663 17886 875 -10299
14334a0299l942l502P465j792J769K2464k351j4564l720j2861J0856R914P320
$$ -10299 -14241 -17743 -10278 -12070 -10301 12163 9812 -4752 -8472 -21333 -10477 -563 6757
14321F757l557k8437P544J0976r762K205M416j2516k392L3876J1408j3497P543
$$ 6757 3200 -25237 -17693 -6717 -16479 -14274 -9858 -22374 -24766 9110 20518 7021 14564
14308A4564K0680j3546l3280J9282J4548J361k3033k094K974r679J1250n152j2320
$$ 14564 35244 21698 -11582 7700 22248 23609 576 -1518 1456 -8223 3027 -2125 -14445
14295a4445N162J6259L2134R010J4755j9996m6965n692L2671L262r177J2620r687
$$ -14445 -9283 6976 39110 48120 62875 42879 -4086 -9778 22893 26155 16978 29598 19911
14282A9911j3288M804J888j923n184J7709J9070q431p990P48p298l507L01p620
$$ 19911 6623 11427 13315 11392 6208 23917 42987 34556 26566 27314 20016 16509 16810 9190
14268I190j5617M970K4764j284P135M002j4539k5517O492q53Q936R02j352J354
$$ 9190 -6427 -1457 23307 22023 29158 33160 18621 -6896 -404 -1257 7679 8581 7229 8583
14254H583J1372q060l4772n930k94L013R324l264p51J9464k8559o559Q519J7938
$$ 8583 19955 11895 -22877 -28807 -29101 -26088 -16764 -20028 -20779 -1315 -29874 -36433 -27914 -9976
14240i976J5325Q753j604J6838K3238P485j5089j3983r037k341o427k113L657
$$ -9976 5349 14102 12498 29336 52574 60059 44970 30987 21950 19609 13182 11069 14726
14227A4726j951k9259l75K042K5391K7273R388k3092k4636M369P492m339l076
$$ 14726 12775 -16484 -16859 -14817 10574 37847 47235 24143 -493 3876 11368 7029 3953
14214C953J111N800J1352n056J7335R200l177%N694j4815j8874k171K354O701
$$ 3953 5064 10864 22216 17160 34495 43695 40518 40518 46212 31397 12523 10352 12706 19407
14200A9407m972O899M030p50p188k8955k8178J5609M3907R772o078n381Q702K2958
$$ 19407 14435 21334 25364 24614 17426 -11529 -39707 -24098 19809 29581 23503 18122 26824 49782
14186D9782j818r558k8213k0838j8409J2696J4408k878j531J7997j3842j1516
$$ 49782 47964 38406 10193 -10645 -29054 -16358 -1950 -4828 -6359 11638 -2204 -13720
14174a3720j7701j0897r088J6214n226m963L3315L5443o711R206j2693P52l455
$$ -13720 -31421 -42318 -51406 -35192 -40418 -45381 -12066 23377 16666 25872 13179 13931 10476
14161A0476J6934J1695j2161j1149k648P433L9279J1261P841k2644m0153k195
$$ 10476 27410 39105 26944 15795 13147 20580 59859 71120 78961 56317 16164 13969
14149A3969K60J216K3593J1245k6734j7365m451P526J971j7332k7962R506M3j8645
$$ 13969 14229 15445 39038 50283 23549 6184 1733 9259 11230 -6102 -34064 -24558 -24515 -43160
14135d3160j3951K1778L8597k762N264n733N086J4708R697k2386q929K4193j1224
$$ -43160 -57111 -35333 3264 502 5766 33 5119 19827 29524 7138 -1791 22402 11178
14122A1178M13Q308K257j2414k329K7476J1878n454r878L082L97k5070l531j1359
$$ 11178 11591 19899 22156 9742 7413 34889 46767 41313 31435 34517 34914 9844 6313 -5046
14108e046j8617M666K4421j2656L56L584n896K3084q26q060o907J6424J5723J5204
$$ -5046 -23663 -18997 5424 -7232 -6876 -3292 -9188 13896 13070 5010 -1897 14527 30250 45454
14094D5454k0001j7893Q763P760O484j586k9220k0261K1601L4166j643j9993j3186
$$ 45454 25453 7560 16323 24083 30567 28981 -239 -20500 1101 35267 33624 13631 445
14081D45n70L504O082R173k570K6462L0442j5284n7476j2167j351m774j7705n529
$$ 445 -125 3379 9461 18634 16064 42526 72968 57684 208 -11959 -13310 -18084 -35789 -41318
14067d1318L0768L304j4223r499k936l658N817L7875J672j4606k048R061j615
$$ -41318 -10550 -7246 -21469 -30968 -33904 -37562 -31745 6130 7802 -6804 -8852 209 -1406
14054a406n495j2861K0069P771P738J8213J3710J9790r396j5708j3341j129Q411
$$ -1406 -6901 -19762 307 8078 15816 34029 47739 67529 58133 42425 29084 27955 36366
14041C6366j9422q904j225O84O846o27K9847J1074N169r057j9318k2319m504m154
$$ 36366 16944 8040 6815 7499 14345 13718 43565 54639 59808 50751 31433 9114 4610 456
14027D56m515J312J1782j2714j1766N866R566K3360r107j7445l8730M937K5100
$$ 456 -4059 -2747 9035 -3679 -15445 -9579 -13 23347 14240 -3205 -41935 -36998 -11898
14014a1898K9326k699m081j2831J2547l2819Q702K4673Q619j2614m862O858M469
$$ -11898 17428 14729 10648 -2183 10364 -22455 -13753 10920 19539 6925 2063 8921 13390
14001A3390j7985j8369J6608K3765Q020K5668r582p304R509L213j8045k4654N759
$$ 13390 -4595 -22964 -6356 17409 25429 51097 41515 34211 43720 46933 28888 4234 9993
13988I993K250k3127j4133j3116M4033J9331j3636J6904J2719j0913O744j1252
$$ 9993 12243 -10884 -25017 -38133 5900 25231 11595 28499 41218 30305 37049 25797
13976B5797j9261K025J2899J3028J1685J3017j3358m5237k4455j0683P622L1037
$$ 25797 6536 8561 21460 34488 46173 59190 45832 595 -23860 -34543 -26921 4116
13964D116M0793P891j330j8407j4185Q353J054j0471q055L855j2305q144K9398
$$ 4116 44909 52800 51470 33063 18878 27231 28285 17814 9759 13614 1309 -6835 22563
13951B2563k304o55O239R157j0981q57k959j897P060J6498j244N215l479k5528
$$ 22563 20259 19604 25843 35000 24019 23162 20203 18306 25366 41864 40620 45835 42356 16828
13937A6828K3039L1307P524k0M614P471J100j6253J9723N0799K8408L7673P4223
$$ 16828 39867 71174 78698 78678 83292 90763 91863 75610 95333 146132 174540 212213 286436
13924B86436J43280J77440K41076J28278j01733k36020j83546j29177q4661o4625
$$ 286436 429716 607156 848232 976510 874777 638757 455211 326034 241373 176748
13914A76748m6413j5647j9618j7173j8958K489m917k7748k528j800o071r956k5684
$$ 176748 130335 114688 95070 77897 58939 61428 56511 28763 26235 24435 18364 8408 -17276
13901a7276O088Q039O111K0423j2978j1918R853J1041j0548k6437j0798J3141
$$ -17276 -11188 -3149 2962 23385 10407 -1511 8342 19383 8835 -17602 -28400 -15259
13889a5259Q264l579p630J2428J3386L02k0144K891K3060K1568j2749q213k0834
$$ -15259 -6995 -10574 -18204 -5776 7610 7912 -12232 -9341 13719 35287 22538 14325 -6509
13876f509J265K4296L1497O191j9977j7990j8875P005J7052K5209K476J629j1152
$$ -6509 -5244 19052 50549 56740 36763 18773 -102 6903 23955 49164 51640 53269 42117
13863D2117j9007N406J3994J4041k2300k6953J556K7832K3878O836j173M955j3494
$$ 42117 23110 28516 42510 56551 34251 7298 8854 36686 60564 67400 66227 71182 57688
13850E7688k7898k2972L6470J8800Q834N06l8121l5260J2891K6103J1388N430
$$ 57688 29790 6818 43288 62088 70922 71428 33307 -1953 10938 37041 48429 53859
13838E3859m562j6739r120L910K0953J1261J5636j2063j9019r776k185m599k4235
$$ 53859 49297 32558 23438 27348 48301 59562 75198 63135 44116 34340 32155 27556 3321
13825C321J0862J3808R003k2716O719J4981k1340l3198j8794K0177N2562M1622
$$ 3321 14183 27991 36994 14278 20997 35978 14638 -18560 -37354 -17177 35385 77007
13813G7007n003l592j4489K2826J0686k6427J0347K4205J9145K6046N842K0665
$$ 77007 72004 68412 53923 76749 87435 61008 71355 95560 114705 140751 146593 167258
13801A67258N8163J04781J32927K54648L70746K98553m8365l55300l18453k25449
$$ 167258 225421 330202 463129 717777 1088523 1387076 1338711 983411 664958 439509
13791D39509j45068o3819m4864k0595l3044k3782q323q507j9469J3167p917l0131
$$ 439509 294441 230622 185758 165163 132119 108337 100014 91507 72038 85205 77288 47157
13779D7157K440N053P987J1563L1844K5451j669l4886l5259j7664j2076j6685
$$ 47157 49597 54650 62637 74200 106044 131495 129826 94940 59681 42017 29941 13256
13767A3256J9062R616j8529P224R976o739J2734J6715P020j2492j6776j7086K835
$$ 13256 32318 41934 23405 30629 40605 33866 46600 63315 70335 57843 41067 23981 26816
13754B6816J7506j4637J0352r355M888Q349M239P706L463m4200k7894K8678J056
$$ 26816 44322 29685 40037 30682 35570 43919 48158 55864 59327 15127 -12767 15911 16967
13741A6967m0064K849O032j301L929p108k9239J1847L1349N775j6847J0393K0976
$$ 16967 -23097 -20248 -14216 -15517 -11588 -18696 -47935 -36088 -4739 1036 -15811 -5418 15558
13728A5558r278J564K2416J2284J1651J3630j3998k5994K0361O095J1372L826
$$ 15558 6280 7844 30260 42544 54195 67825 53827 27833 48194 54289 65661 69487
13716F9487M873K0343m01j7612N129J0393J563o626o386q624j3766m66k3154l415
$$ 69487 74360 94703 94302 76690 81819 92212 93775 87149 80763 72139 58373 57907 34753 31338
13702C1338J7022N781m73k4658o639L723J2886J6766k7234k4285n525q849P443
$$ 31338 48360 54141 53668 29010 22371 26094 38980 55746 28512 4227 -1298 -10147 -2704
13689b704Q046k2052q452j0269J3097J969J2058k2107j9286M664K7263M4162K1263
$$ -2704 5342 -16710 -25162 -35431 -22334 -20365 -8307 -30414 -49700 -45036 -17773 26389 47652
13676D7652n176r958j7868j7599j0030Q492K1142K1309K6029j7733j6137j2794
$$ 47652 42476 32518 14650 -2949 -12979 -4487 16655 37964 63993 46260 30123 17329
13664A7329p91j4096k1208p060K4083L2486K0226k3323k6131p673K1035p465l5323
$$ 17329 16538 2442 -18766 -25826 -1743 30743 50969 27646 1515 -6158 14877 7412 -27911
13651b7911L192K6428L7457k963j4267k3792l8116l0382M722j5574j4887l6808
$$ -27911 -24719 1709 39166 36203 21936 -1856 -39972 -70354 -65632 -81206 -96093 -132901
13639a32901l4527l1731K1116O1338J15562Q6878L0407J041Q605J434j1156j1880
$$ -132901 -167428 -199159 -178043 -116705 -1143 85735 116142 117183 125788 127222 116066 104186
13627A04186k9904O765p389l235j0755M654k623k900p866J3183k332J3246l621
$$ 104186 74282 81047 73658 70423 59668 64322 61699 58799 50933 64116 61784 75030 71409
13614G1409m868J9825J6642K0779J1427j2166j8920j4293J9393J6360L14J6034
$$ 71409 66541 86366 103008 123787 135214 123048 104128 89835 109228 125588 125902 141936
13602A41936M6281J3478l8487l1909j6434l760l1016l7314j4963O851M759J2972
$$ 141936 188217 201695 163208 131299 114865 111105 80089 42775 27812 34663 39422 52394
13590E2394R836J0173j4806j7866J6592K7676K2557J0547N944p128n905n023K7072
$$ 52394 62230 72403 57597 39731 56323 83999 106556 117103 123047 115919 110014 104991 132063
13577A32063M169l486K7764M2146N438k0471j5005k9586N257J2774j2090P050
$$ 132063 136232 132746 160510 202656 208094 187623 172618 143032 148289 161063 148973 156023
13565A56023L136j9993r192j0283l1K489K956J4050j8103m2219p271l989L161
$$ 156023 159159 139166 129974 119691 119660 122149 125105 139155 121052 78833 71562 67573 70734
13552G0734J917J2161l891K8805L7377O00k052k1931L161l747j704j9072r969
$$ 70734 72651 84812 80921 109726 147103 147703 145651 123720 126881 123134 121430 102358 92389
13539I2389K478O766Q783l758M4503L4722k7858j464J3167K5982L0147J2449j2988
$$ 92389 94867 101633 110416 106658 151161 185883 158025 156561 169728 195710 225857 238306 225318
13526B25318k3960k289J1124j8462k5429J3586K4868J8919J1799j7841k3900K389
$$ 225318 201358 199069 210193 191731 166302 179888 204756 223675 235474 217633 193733 196122
13514A96122K1601P451j0390J1400L1670L7184L469j0299K5866J5377J5042L1497
$$ 196122 217723 225174 214784 226184 257854 295038 298507 288208 314074 329451 344493 375990
13502C75990N694Q314J7730L0562K0809l782K3609L943K2241J1914J3980N5382
$$ 375990 381684 389998 407728 438290 459099 455317 478926 482869 505110 517024 531004 586386
13490E86386K6358J2097O892K9229K6499M0987N7626O0429M0854L0603M5739O2939
$$ 586386 612744 624841 631733 660962 687461 728448 786074 846503 887357 917960 963699 1026638
13478A026638J05170J02409O7177R3588J06917J21754J60255K04310K53796K86138
$$ 1026638 1131808 1234217 1301394 1394982 1501899 1623653 1783908 1988218 2242014 2528152
13468B528152K51647K64715L41972M06507M41315M88249M86433M70257N59736
$$ 2528152 2779799 3044514 3386486 3792993 4234308 4722557 5208990 5679247 6238983
13459F238983O85651Q94405J140489J323181J486143J888951K818911M330797
$$ 6238983 6924634 7819039 8959528 10282709 11768852 13657803 16476714 20807511
13451B0807511O992173J1573999J9965375L5125438N0791775M2201035k46692
$$ 20807511 27799684 39373683 59339058 94464496 145256271 187457306 187210614
13444A87210614m4050464m6949563l2761862k0572120j2644578q035196n313097
$$ 187210614 143160150 96210587 63448725 42876605 30232027 22196831 16883734
13437A6883734l629343k494454j686621j298219j223306j128967r09639o90758
$$ 16883734 13254391 10759937 9073316 7775097 6551791 5422824 4513185 3822427
13429C822427n85483m65158l51189k81718k52351k23210j76790j16522n8475n2437
$$ 3822427 3236944 2771786 2420597 2138879 1886528 1663318 1486528 1370006 1311531 1259094
13419A259094o1184o9904q0153n1784l5289p1294p9992m5835k8358m0913k9592
$$ 1259094 1197910 1128006 1047853 996069 960780 889486 809494 763659 735301 694388 664796
13408F64796k7300n0384m7783l5623j8148k3126k9440j2976q495m7966k8636j3613
$$ 664796 637496 587112 539329 503706 485558 462432 432992 420016 411521 363555 334919 321306
13396C21306k716K798j9635j4214o981l149j3777j1678j8261j0850N604n983j1866
$$ 321306 318590 321388 301753 287539 280558 277409 263632 251954 233693 222843 228447 222464 210598
13383B10598K4452m485o720j15J144P459m431j7597j9251O141l3592j6055R622
$$ 210598 235050 230565 223845 223730 224874 232333 227902 210305 191054 197195 163603 147548 157170
13370A57170n546O919j113j4063r578L689l0190j8431L1162L2407l806m844J876
$$ 157170 151624 158543 157430 143367 133789 137478 107288 88857 120019 152426 148620 143776 145652
13357A45652j7033j9965R82J2114j0665j9462j5814J4406J2050p702k0566k4911
$$ 145652 128619 108654 109636 121750 111085 91623 75809 90215 102265 94563 73997 49086
13345D9086p060r819o104J1575L6164m676j8023J5942J845j7082O313j4231r199
$$ 49086 42026 32207 26103 37678 73842 69166 51143 67085 68930 51848 58161 43930 34731
13332C4731M084J4881K694j6767j1613m553l679L1948J1306n751j3002l5527q771
$$ 34731 38815 53696 56390 39623 28010 23457 19778 51726 63032 57281 44279 8752 -19
13319a9m19k8802M585J2042l189O560J6316N2929K7589L71k2083l8612j750J6487
$$ -19 -438 -29240 -24655 -12613 -15802 -9242 7074 60003 87592 87963 65880 27268 25518 42005
13305D2005l0264l0353j1600o694J1784J8560M0687L7807j5116m0588k7129r339
$$ 42005 11741 -18612 -30212 -36906 -25122 -6562 34125 71932 56816 16228 -10901 -20240
13293b0240K928k0857n0481k0377J7094L1107J7146r556R580q814J2481P04o503
$$ -20240 -17312 -38169 -88650 -109027 -91933 -60826 -43680 -53236 -43656 -52470 -39989 -39285 -45788
13280d5788j1969J1825K7460o646L094o864K1119l055q644M263j3724L164J9847
$$ -45788 -57757 -45932 -18472 -25118 -22024 -28888 -7769 -10824 -19468 -15205 -28929 -25765 -5918
13267e918N296l0317n215K8522K3408p301k8591m2273l1198j6N0672Q1890R1816
$$ -5918 -622 -30939 -36154 -7632 15776 8475 -20116 -62389 -93587 -93603 -42931 38959 130775
13254A30775P1194k0752j6580k8851m3151k9832j5232p97Q012J171J2304Q913
$$ 130775 201969 181217 164637 135786 92635 62803 47571 46774 54786 55957 68261 77174
13242G7174O91j7531n886J5789o854j1775J721l215M841L945k5009j5767j9748
$$ 77174 77865 60334 54448 70237 63383 51608 53329 50114 54955 58900 33891 18124 -1624
13229a624P990J5186M335p276O162J7647o432k978L214r6k127J0550j108m643
$$ -1624 6366 21552 25887 18611 24773 42420 35988 33010 36224 36128 34001 44551 43443 38800
13215C8800J2093K2961n974N07j6917j6435L181n675L995m230j9900j1666P588
$$ 38800 50893 73854 67880 68387 51470 35035 38216 32541 36536 32306 12406 740 8328
13202H328o58o360K3278K9919L8088K8681J1430n266j3828p84l3769l4087Q063
$$ 8328 7670 1310 24588 54507 92595 121276 132706 127440 113612 112828 79059 44972 53035
13189E3035q845j5928m796P965k4071K922M6219L0995k1093k9218l9615m212K3511
$$ 53035 44190 28262 23466 31431 7360 10282 56501 87496 66403 37185 -2430 -6642 16869
13176A6869j7096m469R732J4388J6219J5124r749j5532J1872j4133r690K271k4778
$$ 16869 -227 -4696 5036 19424 35643 50767 41018 25486 37358 23225 13535 15806 -8972
13163h972J1900L1696j3020l671J3315j2008r884j190K7332M7961O3314P9601
$$ -8972 2928 34624 21604 17933 31248 19240 9356 8166 35498 83459 146773 226374
13151B26374Q4675K8612n3191p0789o7108n8361m1372m2684R866Q676M88k0646
$$ 226374 311049 339661 286470 215681 148573 90212 48840 6156 16022 24698 25186 4540
13139D540J3245J4575L5735J2549m3209l0046J6503K4697J088n472l1922j4751
$$ 4540 17785 32360 68095 80644 37435 7389 23892 48589 49677 44205 12283 -2468
13127b468K479Q910P850l93R664J299j5269K962L287J1552K7366Q154j4777j3528
$$ -2468 11 8921 16771 16378 26042 27341 12072 15034 18321 29873 57239 65393 50616 37088
13113C7088r292k2266K587K1904M4170M0089M1229Q3830L4874k0364n8166n3596
$$ 37088 27796 5530 8117 30021 74191 114280 155509 239339 274213 253849 195683 142087
13101A42087m0786l7108J1162k2242M600J2628Q643m1340j3810k400R851l101
$$ 142087 101301 64193 75355 53113 57713 70341 78984 37644 23834 21434 31285 28184
13089B8184j4381j7030j5953J632L143K4063J7395J4810j8351l911k5650k2712
$$ 28184 13803 -3227 -19180 -17548 -14405 9658 27053 41863 23512 19601 -6049 -28761
13077b8761Q358J8802j8175j8302J1955q90J2730N200o901N602Q364n044R22L3039
$$ -28761 -20403 -1601 -19776 -38078 -26123 -27013 -14283 -9083 -15984 -10382 -2018 -7062 -6140 26899
13063B6899J0078j3937K9482O2243J3855k5362q915j6170k8171j4512j2089k074
$$ 26899 36977 23040 52522 114765 128620 103258 94343 78173 50002 35490 23401 21327
13051B1327n564j010j4233k0411r880N9J1487J4752K1730j642j6545k4178m053
$$ 21327 15763 14753 520 -19891 -29771 -29712 -18225 -3473 18257 16615 70 -24108 -28161
13038b8161N835K0110l72o500J0754m485Q963o783J2989J0903R48j9701N707k428
$$ -28161 -22326 -2216 -2588 -9088 1666 -2819 6144 -639 12350 23253 24201 4500 10207 7779
13024G779j0462k3667K177J6517n161j8540N97O054j3722J6354L424m284K0464
$$ 7779 -2683 -26350 -24173 -7656 -12817 -31357 -30760 -24706 -38428 -22074 -18650 -22934 -2470
13011b470K6742N61m1386l442M2179K5767j2495n655p817k0684l521n266J8967
$$ -2470 24272 24833 -16553 -19995 22184 47951 35456 29801 21984 1300 -2221 -7487 11480
12998A1480R757j9339j3305L2015K0511J0528Q500r060j8209j9081m043m626m3
$$ 11480 21237 1898 -11407 20608 41119 51647 60147 51087 32878 13797 9754 5128 5085
12985E085j2383N049Q755Q038L635M027Q321K847K370J9264k3986p42J1716J0431
$$ 5085 -7298 -2249 6506 14544 18179 22206 30527 33374 35744 55008 31022 30280 41996 52427
12971E2427J4604K5688L9945O5144R9684J67980K59039J84055j3245j84071k18119
$$ 52427 67031 92719 132664 197808 297492 465472 724511 908566 895321 711250 493131
12960D93131j69077j02522o4831l9154l9771j5535O25o648j8076l9303k9155Q893
$$ 493131 324054 221532 156701 117547 77776 62241 62866 56218 38142 -1161 -30316 -21423
12948b1423J2664k0725j1445L267K7643J7130K4320J1016j8115M695k2873j4394
$$ -21423 -8759 -29484 -40929 -37662 -10019 7111 31431 42447 24332 29027 6154 -8240
12936h240q241j7876K4368K4824K0148Q909j3066j5843J0136l037j4561l5019
$$ -8240 -16481 -34357 -9989 14835 34983 43892 30826 14983 25119 22082 7521 -27498
12924b7498p043o692J2621J7358k265j8042o815j198L087j4470L152M3330J7388
$$ -27498 -34541 -41233 -28612 -11254 -13519 -31561 -38376 -39574 -36487 -50957 -47805 -4475 12913
12911A2913k3326j1622J5396J865P402K1726m485k2791j4042L0558N54o853j6913
$$ 12913 -10413 -22035 -6639 -4774 2628 24354 19869 -2922 -16964 13594 14148 7295 -9618
12898i618K668L2333J3731n808j4207j7836j5070R380J9593j151j7826k9244R786
$$ -9618 -6950 25383 39114 33306 19099 1263 -13807 -4427 15166 14015 -3811 -33055 -23269
12885b3269J4627q437n698L891J7026J5715O718j4441k7630n764M953P728r78
$$ -23269 -8642 -17079 -22777 -18886 -1860 13855 20573 6132 -21498 -27262 -22309 -14581 -15559
12872a5559j6564K783R486j6686r668J8696p657J2236R777J1278J7188K8522m295
$$ -15559 -32123 -29340 -19854 -36540 -46208 -27512 -35169 -22933 -13156 -1878 15310 43832 39537
12859C9537j4553k6711m752J6732k1706k1249q069J7743M284J3193J0089j6890
$$ 39537 24984 -1727 -6479 10253 -11453 -32702 -40771 -23028 -18744 -5551 4538 -12352
12847a2352j7181q490K362J6976J0374r311J3310K519k3224o002P19j5680K0619
$$ -12352 -29533 -38023 -35661 -18685 -8311 -17622 -4312 -1793 -25017 -31019 -30300 -45980 -25361
12834b5361J9932J9873j3278m966J7425J8266j3012J8549P90Q26N549j185n725
$$ -25361 -5429 14444 1166 -3800 13625 31891 18879 37428 38218 39044 44593 43408 37683
12821C7683R142j2042l7945k6843J584J2106J0430j2928p62L469J8198L472k2883
$$ 37683 46825 34783 -3162 -30005 -28421 -16315 -5885 -18813 -19575 -16106 2092 5564 -17319
12808a7319n776r604L7075J6318m582K38K7888o520q696j1973N696o185p707J8466
$$ -17319 -23095 -32699 4376 20694 16112 16350 44238 37718 29022 17049 22745 16560 8853 27319
12794B7319Q586L465j2545j3537p07j117j3520l439J2067j1634k9150K981L9972
$$ 27319 35905 39370 26825 13288 12581 11464 -2056 -5495 6572 -5062 -34212 -31231 8741
12781H741j2183j6883J4143L4855n599p383p476j9869J2191M586q990n726L145
$$ 8741 -3442 -20325 -6182 28673 23074 15691 8215 -11654 537 5123 -3867 -9593 -6448
12768f448j4883k2252O816K0194m550K3971K3956J5007j6819J2812N791k1041
$$ -6448 -21331 -43583 -36767 -16573 -21123 2848 26804 41811 24992 37804 43595 22554
12756B2554j7819o953j4336m870O039m168k466j6857J1782J2571Q327K610r366
$$ 22554 4735 -2218 -16554 -21424 -15385 -19553 -22019 -38876 -27094 -14523 -6196 -3586 -12952
12743a2952P232J1220P72PJ4737l634j8612J772K3891j6470L594j023p768j5635
$$ -12952 -5720 5500 6272 6279 21016 17382 -1230 542 24433 7963 11557 10534 2766 -12869
12729a2869J1066j0444j4063R242K5652J4973j6335l953k056j764k74Q41M893
$$ -12869 -1803 -12247 -26310 -17068 8584 23557 7222 3269 1213 -551 -825 16 4909
12716D909N164j1942j082q01j687q07n199N793K7802N180J344n705j7330J4378
$$ 4909 10073 -1869 -2951 -3752 -5439 -6246 -11445 -5652 22150 27330 28674 22969 5639 20017
12702B0017j1193j8787J918m503j2109J3063L2967J5077n661j838l4991j4617
$$ 20017 8824 -9963 -8045 -12548 -24657 -11594 21373 36450 30789 28951 -6040 -20657
12690b0657K7686J0120q929J1928J0984j5756l3578k0092Q760J9050J3376O234
$$ -20657 7029 17149 8220 20148 31132 15376 -18202 -38294 -29534 -10484 2892 9126
12678I126n531J9418J9357j3989j1304j3102k2480o900j7447n663j8377r097J8999
$$ 9126 3595 23013 42370 28381 17077 3975 -18505 -25405 -42852 -48515 -66892 -75989 -56990
12665e6990K1869J3814N556L722P745J4524j874j9941m995j6093j4260J0311J7675
$$ -56990 -35121 -21307 -15751 -12029 -4284 10240 8366 -11575 -16570 -32663 -46923 -36612 -18937
12652a8937K5273J9499J2407j6623l4122J1008L872J870Q015R363k0779j4329
$$ -18937 6336 25835 38242 21619 -12503 -1495 2377 4247 12262 21625 846 -13483
12640a3483J8786J2200k4536k2943Q152K4063Q570o171K391j2871k3191m662P811
$$ -13483 5303 17503 -7033 -29976 -21824 2239 10809 4638 7029 -5842 -29033 -33695 -25884
12627b5884J4566p994j3703R323k221N78K9096J6085J0406J6642r674j0716j7731
$$ -25884 -11318 -19312 -33015 -23692 -25913 -25335 3761 19846 30252 46894 37220 26504 8773
12614H773j8168l915l0498j4194K0755L1951L1570k028J3128j9088k4869J6237
$$ 8773 -9395 -13310 -43808 -58002 -37247 -5296 26274 24246 37374 18286 -6583 9654
12602I654M215j9397O334P492j0413J2732n423k6536N991m05k1125L621J5246
$$ 9654 13869 -5528 806 8298 -2115 10617 5194 -21342 -15351 -15756 -36881 -33260 -18014
12589a8014P122m522j315j724n949n329O216K5251J930J8992j3748r920Q711k8899
$$ -18014 -10892 -15414 -16729 -18453 -24402 -29731 -23515 1736 3666 22658 8910 -1010 7701 -21198
12575b1198J2217K1427J125O701n831k323k3016J5930j411J2214N754o976J6280
$$ -21198 -8981 12446 13571 20272 14441 12118 -10898 5032 3621 15835 21589 14613 30893
12562C0893j0351j7856J5226l304k6380K13L0126P950j6355k4549r55N03N538
$$ 30893 20542 2686 17912 14608 -11772 -11559 18567 26517 10162 -14387 -15342 -14839 -9301
12549i301j0218r429o761P890P414N459J3170j6155r606K0830J5420n275P162
$$ -9301 -19519 -28948 -35709 -27819 -20405 -14946 -1776 -17931 -27537 -6707 8713 3438 10600
12536A0600j1381j1181J4299o395L754k775r310l830K0952J5198j0427j6973r558
$$ 10600 -781 -11962 2337 -4058 -304 -3079 -12389 -16219 4733 19931 9504 -7469 -17027
12523a7027J1357J5208l890l1340r636j209k593n183K0005K3644r128l421k0546
$$ -17027 -5670 9538 5648 -25692 -35328 -36537 -39130 -44313 -24308 -664 -9792 -13213 -33759
12510c3759m513K1022J0879p453K872J6456K8007K0543k4942n7454j6884L0382
$$ -33759 -38272 -17250 -6371 -13824 -10952 5504 33511 54054 29112 -28342 -45226 -14844
12498a4844K3240J2255k2615l6516n212K9073L3939R23k4736j18J1429j3503j69
$$ -14844 8396 20651 -1964 -38480 -43692 -14619 19320 20243 -4493 -4611 6818 -6685 -6854
12485f854J1903j3494N23j0201O887R013o952q321N056J0804n593K0079J1529
$$ -6854 5049 -8445 -7922 -18123 -11236 -2223 -9175 -17496 -12440 -1636 -7229 12850 24379
12472B4379J3855O703n3436j941O693j1168R746M478M480K3583O332j7353l2518
$$ 24379 38234 44937 -8499 -10440 -3747 -14915 -5169 -691 3789 27372 33704 16351 -16167
12459a6167j6131J383n374j2632K5433L8031K630m8812k893L2513J7914j3866
$$ -16167 -32298 -30915 -36289 -48921 -23488 14543 17173 -31639 -34532 -2019 15895 2029
12447B029k5250j1468j193P657K6771k1391J2923j1444k880K3038m929j1823J5948
$$ 2029 -23221 -34689 -35882 -28225 -1454 -22845 -9922 -21366 -24246 -1208 -6137 -17960 -2012
12434b012L0343J1665j5829k6616l0331k0333J2755P664K2763j244n714K3321
$$ -2012 28331 39996 24167 -2449 -32780 -53113 -40358 -32694 -9931 -11175 -16889 6432
12422F432K0802n412l3317n761j048J1709K3179n870j4629j8855j0400J6759J9085
$$ 6432 27234 21822 -11495 -17256 -18304 -6595 16584 10714 -3915 -22770 -33170 -16411 2674
12409B674K222n162J1156P852Q112P464j1981o731K324Q690J2848j3683j9657
$$ 2674 4896 -266 10890 18742 26854 34318 22337 15606 17930 26620 39468 25785 6128
12396F128q116J466J8802L993J548k4984j8119n038J2091L8459K7612N842o710
$$ 6128 -1988 -522 18280 22273 23821 -1163 -19282 -24320 -12229 26230 53842 59684 52974
12383E2974j6531j5950n449j3132k2607K5566L014l0089J9002K1722Q303j5973
$$ 52974 36443 20493 15044 1912 -20695 4871 7885 -22204 -3202 18520 26823 10850
12371A0850l474K2656n76k2945k2898J4471J4912k62j5387j222M020J7424j1396
$$ 10850 7376 30032 29456 6511 -16387 -1916 12996 12734 -2653 -3875 145 17569 6173
12358F173k1891j6845j5763J1930J9859L377k632j6139K5241J3369J4083K276
$$ 6173 -15718 -32563 -48326 -36396 -16537 -13160 -15792 -31931 -6690 6679 20762 23038
12346B3038j2958j0631k1245K989L5855j3575l784j063n83j609q74O428j917J6028
$$ 23038 10080 -551 -21796 -18807 17048 3473 -311 -1374 -1957 -3566 -4440 1988 71 16099
12332A6099n644l033k5416j1005J8284J5331K0656P477k0825j2268J1163p465
$$ 16099 10455 7422 -17994 -28999 -10715 4616 25272 32749 11924 -344 10819 3354
12320C354M201J0070j4934j4676N022r7J489J7212l31j340O675k864o103J818
$$ 3354 7555 17625 2691 -11985 -6963 -7060 -5571 11641 11310 9970 16645 13781 7678 9496
12306I496K0105l529k095p983j1752N382L277j6372q602Q150K252j439L1804J0377
$$ 9496 29601 26072 23977 15994 4242 9624 12901 -3471 -12073 -3923 -1671 -3110 28694 39071
12292C9071o226j6465j7017J7746p454J404j9845k1622o939K988Q928K1345R117
$$ 39071 32845 16380 -637 17109 9655 11059 -8786 -30408 -37347 -34359 -25431 -4086 5031
12279E031j287L1949K3527j1724k3852J0465j8512J450r719K0802J570l9455j1976
$$ 5031 3744 35693 59220 47496 23644 34109 15597 17047 7328 28130 29700 -9755 -21731
12266b1731J0767l815J5941q780k3458J753p725K078l148j885q924o427J8164
$$ -21731 -10964 -14779 1162 -7618 -31076 -29323 -37048 -34970 -38118 -40003 -48927 -55354 -37190
12253c7190J9480j5091j456m557k361p340r773M0291L9724j8447k3228M356j1997
$$ -37190 -17710 -32801 -34257 -38814 -41175 -48515 -58288 -17997 21727 3280 -19948 -15592 -27589
12240b7589j2038K2873L0407j0317j6777n000O069k816Q028P618K1375m073j1057
$$ -27589 -39627 -16754 13653 3336 -13441 -18441 -12372 -15188 -7160 458 21833 17760 6703
12227F703K5787P568n133j1285r898p279L765J6058O798k2926j8487J642J2552
$$ 6703 32490 40058 34925 23640 13742 6463 10228 26286 33084 10158 -8329 -6687 5865
12214E865J358j3602L022j8374j6644J2723M8256L3297n990j0552j966J7921p738
$$ 5865 7223 -6379 -3357 -21731 -38375 -25652 22604 55901 49911 39359 37393 55314 47576
12201D7576Q680J3421k1200l0267m989q164N786J6970p596j6674J4492J0571p100
$$ 47576 56256 69677 48477 18210 13221 5057 10843 27813 20217 3543 18035 28606 21506
12188B1506j062l5565p561M646j141n406n372M756J7244K9555J6483j9946q097
$$ 21506 20444 -15121 -22682 -18036 -19177 -24583 -29955 -25199 -7955 21600 38083 18137 10040
12175A0040j1094p179K0654j1174r83j2419J7696K2939o710n699j0711j6112j643
$$ 10040 -1054 -8233 12421 1247 264 -12155 5541 28480 21770 16071 5360 -10752 -12395
12162a2395N665j1490J5928K2092J4815M930k2436j6598K4336m66j9404k0992
$$ -12395 -6730 -18220 -2292 19800 34615 39545 17109 511 24847 24381 4977 -16015
12150a6015m513L748k0162K5965J6845p574l011j6988q278j258J5908K4492R45
$$ -16015 -20528 -16780 -36942 -10977 5868 -1706 -4717 -21705 -29983 -31241 -15333 9159 10104
12137A0104j1546p452J3000O387K451o366J459J4760j2762j6463n667r95J6780
$$ 10104 -1442 -8894 4106 10493 12944 6578 8037 22797 10035 -6428 -12095 -13090 3690
12124C690K2231k4065l520J1060j1995k9066j9953m5p236K186K7625K0931p940
$$ 3690 25921 1856 -1664 9396 -2599 -31665 -51618 -51663 -58899 -56713 -29088 -8157 -16097
12111a6097m534K4054P740J0031J0754j567j5701j2232N568O925O545N311M662
$$ -16097 -20631 3423 11163 21194 31948 30381 14680 2448 8016 14941 21486 26797 31459
12098C1459k8277k2188j1244J8028K070l412k050L1696K1244j2405j6916q07J9492
$$ 31459 3182 -19006 -30250 -12222 -10152 -13564 -15614 16082 37326 24921 8005 7198 26690
12085B6690q540m806K8465n795l1684j3250N834L936R916j0147l168k653j103
$$ 26690 18150 13344 41809 36014 4330 -8920 -3086 850 10766 619 -2549 -5202 -6305
12072f305k644J6791K9036J8766k0772j6335M977N367R860M347j9620j1488k610
$$ -6305 -8949 7842 36878 55644 34872 18537 23514 28881 38741 43088 23468 11980 9370
12059I370j0918j213J9847J9667J1274q045J6897j5591m2946k2187K859M270l048
$$ 9370 -1548 -2761 17086 36753 48027 39982 56879 41288 -1658 -23845 -20986 -16716 -19764
12046a9764J721j1385j5098L580K7359m455j624L4606R898q033j5737j3290j1335
$$ -19764 -18043 -29428 -44526 -40946 -13587 -18042 -19666 14940 24838 16805 1068 -12222 -23557
12033b3557M006o746K1199j4639k2394K80J1868K4712K1558O574j4000j6075k1342
$$ -23557 -19551 -26297 -5098 -19737 -42131 -41851 -29983 -5271 16287 22861 8861 -7214 -28556
12020b8556n501L7598J5433r463R785m380r221J6291N087k4032R760J6394j1372
$$ -28556 -34057 3541 18974 9511 19296 14916 5695 21986 27073 3041 12801 29195 17823
12007A7823j0860j7716j5230j1563J1045M6392J6427J3357m184J476n893n312
$$ 17823 6963 -10753 -25983 -37546 -26501 19891 36318 49675 45491 46967 41074 35762
11995C5762k0551l2618k6248J7326K3647r84K6217J1266k0257k1040n951P75j740
$$ 35762 15211 -17407 -43655 -26329 -2682 -3666 22551 33817 13560 -7480 -13431 -12656 -14396
11982a4396q802J6090K5076J2381N559n3198j5786J5116M0427J1940r611j1284
$$ -14396 -23198 -7108 17968 30349 35908 -17290 -33076 -17960 22467 34407 24796 13512
11970A3512M222j0201Q565k0533o108N657K4480n286j6622p975j8517J3971L1823
$$ 13512 17734 7533 16098 -4435 -10543 -4886 19594 14308 -2314 -10289 -28806 -14835 16988
11957A6988q490k6528K580L0972K752m444J7460L1319J7879k8739m6703k0767
$$ 16988 8498 -18030 -15450 15522 18274 13830 31290 62609 80488 51749 5046 -15721
11945a5721J90L3507j0619k6236j4557p427O132K8063K8024K0234j8884q432K923
$$ -15721 -15531 17976 7357 -18879 -33436 -40863 -34731 -6668 21356 41590 22706 14274 17197
11932A7197J9262j0972j3314q201k020j1434l797J8110J7112n166j7391r557N952
$$ 17197 36459 25487 12173 3972 1952 -9482 -13279 4831 21943 16777 -614 -10171 -4219
11919d219N721o717J1677n606j6436N152J6137J058m0670j5015j5868l459M826
$$ -4219 1502 -5215 6462 856 -15580 -10428 5709 6767 -33903 -48918 -64786 -68245 -63419
11906f3419k953J9354K2695J56J3427L308p809R054K4980J0053p612J7724q002
$$ -63419 -66372 -47018 -24323 -24167 -10740 -7432 -15241 -6187 18793 28846 21234 38958 30956
11893C0956k315l613l773K00L526q36j199j9846j8958p631p582J1435L4171k1279
$$ 30956 28641 25028 21255 21455 24981 24145 22946 3100 -15858 -23489 -31071 -19636 14535 -6744
11879f744M663p58k009r41N915j1908m499K412Q09j6208J1946K5303J0358P248
$$ -6744 -2081 -2839 -4848 -5789 126 -11782 -16281 -13869 -13060 -29268 -17322 7981 18339 25587
11865B5587j4343J0455j075R742J6244K649M841O427k4246j5686l437o387O591
$$ 25587 11244 21699 20624 30366 46610 49259 54100 60527 36281 20595 17158 10771 17362
11852A7362j393P010P087l712p513n600J5825j99k719j6278q650l5390O561K4300
$$ 17362 15969 22979 30066 26354 18841 13241 29066 28867 26148 9870 1220 -34170 -27609 -3309
11838c309M32k064K3154J9062j0844j8620J7814K444L174J78j7518K1383J1461
$$ -3309 -2877 -4941 18213 37275 26431 7811 25625 28069 31243 31421 13903 35286 46747
11825D6747l4005J168j6327j2210N209p273J703K9831L1808M74k2612l623k0745
$$ 46747 12742 13910 -2417 -14627 -9418 -16691 -14988 14843 46651 47125 24513 20890 145
11812A45O407N626k2638l0653K1281K1792L73M361k1437j985j2912j5908j6J0292
$$ 145 6552 12178 -10460 -41113 -19832 1960 2333 6694 -14743 -16728 -29640 -45548 -45564 -35272
11798c5272L3432K4077R876k1186k2652j726j271R685O212J6865J113J761J2858
$$ -35272 -1840 22237 32113 10927 -11725 -13451 -14722 -5037 1175 18040 19153 20914 33772
11785C3772L141k2926k4103j4432K666Q232J2371L45P70J6669p819j7500R624
$$ 33772 36913 13987 -10116 -24548 -21882 -13650 -1279 -934 -164 16505 8686 -8814 810
11772H10k9745R048l451j4388J625J7796K1415J249L57J5784o080k7198k9049
$$ 810 -28935 -19887 -23338 -37726 -36101 -18305 3110 4359 4716 20500 14420 -12778 -41827
11759d1827Q814P319Q730j5142k3522l80P726J3363P556J6557J298j1249j4826
$$ -41827 -33013 -25694 -16964 -32106 -55628 -56008 -48282 -34919 -27363 -10806 -9508 -20757 -35583
11746c5583J3488K8050K580q058r947L239R400J3200N96k245j5563n498J429J5304
$$ -35583 -22095 5955 8535 477 -9470 -6231 3169 16369 16965 14720 -843 -6341 -4912 10392
11732A0392L598j030J3084j5039q116M2252P516j5701o108j4745j2696j8917J1736
$$ 10392 13990 12960 26044 11005 2889 45141 52657 36956 30848 16103 3407 -15510 -3774
11719c774O724Q743r25o801J0598J0827M092n299o580j2615j3858j6775l64K4575
$$ -3774 2950 11693 10768 3967 14565 25392 29484 24185 17605 4990 -8868 -25643 -26007 -1432
11705a432P593j5155J5181K6470J0869P269Q59q770M97J1011j1100j8351j9808
$$ -1432 6161 -8994 6187 32657 43526 50795 51654 42884 43381 54392 43292 24941 5133
11692E133j2197J8628J0594M45J0021J0806J1400k6375k3522o683J8204N928J2546
$$ 5133 -7064 11564 22158 22603 32624 43430 54830 28455 4933 -1750 16454 22382 34928
11679C4928K889m094r513O078J2497j925j6040k187K1j5524J8197K589l0930r662
$$ 34928 37817 33723 24210 30288 42785 40860 24820 22633 22654 7130 25327 27916 -3014 -12676
11665a2676R381L012O998K0697R040o445j597O724j9834J0979K5351O85k7911
$$ -12676 -3295 -283 6715 27412 36452 30007 28410 35134 15300 26279 51630 52315 24404
11652B4404q133P038L167o088k1886o654k033L473J2258N564J47j7817Q257K0812
$$ 24404 16271 23309 26476 20388 -1498 -8152 -10185 -6712 5546 11110 11257 -6560 1697 22509
11638B2509r315l4126j9076O203Q500L603R692J2139P098j780R78K250J1030r431
$$ 22509 13194 -20932 -40008 -33805 -25305 -21702 -12010 129 7227 5447 6425 8675 19705 10274
11624A0274m475R900o50p16J2925R760J383j197J1750M660j0689l190J6662j87
$$ 10274 5799 15699 15049 14333 27258 37018 38401 37204 48954 53614 42925 39735 56397 56210
11610E6210k274l2447l1825o952R141N150O495K1236r492j1868l327J7521k7159
$$ 56210 53936 21489 -10336 -17288 -8147 -2997 3498 24734 15242 3374 47 17568 -9591
11597i591j3374K765k6050p245L1022J2748r630L8402R715k7438q707J1325k744
$$ -9591 -22965 -20200 -46250 -53495 -22473 -9725 -19355 19047 28762 1324 -7383 3942 1198
11584A198l681J7777j6682j798l790o571K3680K5030j3485j6812j6518O902J1057
$$ 1198 -2483 15294 -1388 -3186 -6976 -13547 10133 35163 21678 4866 -11652 -4750 6307
11571F307Q660J439P296r546O239K8624J0746j6998r859j4608J086k6716J36J0681
$$ 6307 14967 16406 23702 14156 20395 49019 59765 42767 32908 18300 19386 -7330 -7194 3487
11557C487J9910N444k9389N34L0040k605k0124J8053O438j6983q064J2996j9866
$$ 3487 23397 28841 -548 -14 30026 27421 7297 25350 31788 14805 6741 19737 -129
11544a29J8918J1654L868k666P367J4787J6580J0524j1237k1218J9540M7637L7439
$$ -129 18789 30443 34311 31645 39012 53799 70379 80903 69666 48448 67988 115625 153064
11531A53064J6741k7035j8731M347J871j4311P776k127R087L1528J6995N1888
$$ 153064 169805 142770 124039 128386 130257 115946 123722 121595 130682 162210 179205 231093
11519B31093J44056J87099K93468L58784K51613o2922l18540l38376k37254j79085
$$ 231093 375149 562248 855716 1214500 1466113 1403191 1084651 746275 509021 329936
11509C29936j00950l0524n1720k2354p651P91k0337j2279R030o531m1841r028
$$ 329936 228986 198462 146742 124388 116737 117528 97191 84912 93942 87411 45570 36542
11497C6542P637k52O041j2530p584J6153j0420J5337j0190J478m222k7599l394
$$ 36542 44179 43927 49968 37438 29854 46007 35587 50924 40734 42212 37990 10391 6997
11484F997P085J9303K879k1430j1032l615q897n652r372L1667P494J9679J6168
$$ 6997 14082 33385 36264 14834 3802 187 -8710 -14362 -23734 7933 15427 35106 51274
11471E1274k4553j6342m461r693O441j0345r308J0090J6309R158j5934l909J3997
$$ 51274 26721 10379 5918 -3775 2666 -7679 -16987 -6897 9412 18570 2636 -1273 12724
11458A2724O231M31J549j2062j017K3235L4483r10l4088l749L5775L982j1415
$$ 12724 18955 19386 20935 8873 7856 31091 65574 64664 30576 26827 62602 66584 55169
11445E5169N021J1369m790L339k647O470j3110Q03k0513M944o36k4363p878K5623
$$ 55169 60190 71559 66769 70108 67461 73931 60821 61624 41111 46055 45419 21056 13178 38801
11431C8801K3715l460O494P15L667M229R649J5512p412j3701J4624j2689m4402
$$ 38801 62516 59056 65550 66265 69932 74161 83810 99322 91910 78209 92833 80144 35742
11418C5742l7887j6376R72L897L0357j409J8389J9782q598j6792J2356J8079K5480
$$ 35742 -2145 -18521 -17549 -13652 16705 15296 33685 53467 44869 28077 40433 58512 83992
11405H3992k0166k9770m087K0510j6524l1061J689Q119J0392J8902J7944N404
$$ 83992 63826 34056 29969 50479 33955 2894 4583 12702 23094 41996 59940 65344
11393F5344J0620O847j0323j2941Q264J5281j2431j748M676l90L258k860j1361
$$ 65344 75964 82811 72488 59547 67811 83092 70661 68913 73589 73199 76457 73597 62236
11380F2236r705K0718K1345J244j9699j7567k9935J8404P33M0028P343k8169m742
$$ 62236 52531 73249 94594 95838 76139 58572 28637 47041 47774 87802 95145 66976 62234
11367F2234L327j3970P101N260m622j1994j2236k868K1158J1310L1933r946j0293
$$ 62234 65561 51591 58692 63952 59330 47336 35100 32232 53390 64700 96633 86687 76394
11354G6394j1573o461J4175L083k3692j9038J8427K6463j721l2809l1232l7646
$$ 76394 64821 58360 72535 75618 51926 32888 51315 77778 76057 43248 12016 -25630
11342b5630j3934Q340q060Q286L4360J2681J6694O13j5664j1815J5778N291j8814
$$ -25630 -39564 -31224 -39284 -30998 3362 16043 32737 33350 17686 5871 21649 26940 8126
11329H126l120K9527K3337p82k3782l0699n908j643p281j0763P756K5097J8180
$$ 8126 5006 34533 57870 57088 33306 2607 -3301 -4944 -12225 -22988 -15232 9865 28045
11316B8045n839j1858r410p24l737K3472J8155P78j2318j1832O315j4554l2273
$$ 28045 22206 10348 938 214 -3523 19949 38104 38882 26564 14732 21047 6493 -25780
11303b5780m4978n0239p2150m6269m0619J2133J15470J70811J11572M8412k753
$$ -25780 -70758 -120997 -193147 -239416 -280035 -267902 -152432 18379 129951 178363 175610
11292A75610l600R152J196j2565O119N437J89k2748j5486p571n793J0617J0117
$$ 175610 172010 181162 182358 169793 175912 181349 181538 158790 143304 135733 129940 140557 150674
11279A50674j2752n841J0415M2958J2401p390N315J4176k2767l162J6678K5931
$$ 150674 137922 132081 142496 185454 197855 190465 195780 209956 187189 184027 200705 226636
11267B26636O883p180J2747N8481K3272n5959o1810l9484k7604j3181J4307m182
$$ 226636 233519 226339 239086 297567 320839 264880 203070 163586 135982 122801 137108 132926
11255A32926j2069j3013j738J4557R949K734K9290N3789J448o295K3960l0301
$$ 132926 120857 107844 106106 120663 130612 133346 162636 216425 217873 211578 235538 205237
11243B05237l0813o499k711P215J9059J7072N959K3013K5490P019o552m845m5589
$$ 205237 174424 167925 165214 172429 191488 208560 214519 237532 263022 270041 263489 258644 213055
11230B13055n6751q818K2818J6081L307M927o250j452m790J2217M072k7194r049
$$ 213055 156304 147486 170304 186385 189692 194619 188369 186917 182127 194344 198416 171222 162173
11217A62173J2919J648N4j325j6743o588o82J848J6799K940Q175m709J2257M3318
$$ 162173 175092 176740 176794 175469 158726 152138 151456 153304 170103 173043 181218 176509 188766 232084
11203B32084L869p644n742J5141J8542J0672j7247k9837k385R052J6177L171k890
$$ 232084 235953 228309 222567 237708 256250 266922 249675 219838 217453 226505 242682 245853 242963
11190B42963K2498R618K7568J3385l513Q154P466J8177j9481J217L3355L4036
$$ 242963 265461 275079 302647 316032 312519 320673 328139 346316 326835 328052 361407 395443
11178C95443J5366j5562P154L278O975K5401J8723J0174K082k884K4619N2684
$$ 395443 410809 395247 402401 405679 412654 438055 456778 466952 469034 466150 490769 543453
11166E43453N3947M8655K3524J334j868K2759M9835J8408J9174J9800N2753M0440
$$ 543453 597400 646055 669579 670913 669045 691804 741639 760047 779221 799021 851774 892214
11154H92214M3034N3372M4494N8967M8532N0131P6514N3275P6388J01025R7694
$$ 892214 935248 988620 1033114 1092081 1140613 1190744 1267258 1320533 1396921 1497946 1595640
11143A595640Q8720Q1570J33378J43162J73493J81191K11248K36210K61704L06479
$$ 1595640 1684360 1765930 1899308 2042470 2215963 2397154 2608402 2844612 3106316 3412795
11133C412795L98331N70517P58385R74160J068033J039165J123986J566092K103055
$$ 3412795 3811126 4381643 5140028 6114188 7182221 8221386 9345372 10911464 13014519
11124A3014519K759650L411365K735334K14970j902137j464852k25193P13691
$$ 13014519 15774169 19185534 21920868 22135838 20233701 18768849 18543656 19257347
11116A9257347J467456K610005M299325P055670J1848755K0126642L5280553N9136284
$$ 19257347 20724803 23334808 27634133 34689803 46538558 66665200 101945753 161082037
11108A61082037P3292045M5168370k2475292o8549632o2028000m2357669k6453150
$$ 161082037 234374082 279542452 257067160 188517528 126489528 84131859 57678709
11101E7678709j6294081j0370556o821171m581591l242395k524660k250361j965376
$$ 57678709 41384628 31014072 24192901 19611310 16368915 13844255 11593894 9628518
11093I628518j517073j138834q76966p31344n70013m21392k57447r3225J7082
$$ 9628518 8111445 6972611 6095645 5364301 4794288 4372896 4115449 4022224 4039306
11084D039306n6900l12321m74145l72156k96560k51190j88099j35792j04803l6509
$$ 4039306 3982406 3670085 3195940 2823784 2527224 2276034 2087935 1952143 1847340 1810831
11074A810831l19L4033R2798K25442M36055Q40353J355519J364853L97225j017267
$$ 1810831 1810512 1844545 1937343 2162785 2598840 3439193 4794712 6159565 6556790 5539523
11064E539523j484793j138263p14737m70572l20922k12570j43059j01634q3648
$$ 5539523 4054730 2916467 2201730 1731158 1410236 1197666 1054607 952973 869325
11055H69325o5305o0780o4881l7304m6598k1574j8562k8583k1165K177K2962k9555
$$ 869325 804020 743240 678359 641055 594457 572883 554321 525738 504573 506750 529712 500157
11043E00157n1633k7173l7059l2043j1834j9842l0250j4154M366k0609j1044n243
$$ 500157 448524 421351 384292 352249 340415 320573 290323 276169 280535 259926 248882 243639
11031B43639j6281k711L4276k0443m6313j4684J4850n133J6925K474o566J411
$$ 243639 227358 224647 258923 238480 192167 177483 192333 187200 204125 206599 200033 201444
11019B01444j1075j4301k1545j2285Q22J7552o42R773L674L494j6133j2754j0643
$$ 201444 190369 176068 154523 142238 143060 160612 159970 169743 173417 176911 160778 148024 137381
11006A37381j3516j4012L153K8146l122J7745J1614k1234N275l3208j8602r524
$$ 137381 123865 109853 113006 141152 138030 155775 167389 146155 151430 118222 99620 90096
10994I0096l848l7261k1684j375J5204J2748J6083n946N687j0694o111J894J185
$$ 90096 86248 48987 27303 25928 41132 53880 69963 64017 69704 59010 52899 54793 55978
10981E5978M153o01j879k3606J711n1640j3277L3259Q2920M0959M381j8915j8452
$$ 55978 60131 59530 57651 34045 35756 -15884 -29161 4098 87018 127977 132358 113443 94991
10968I4991k1195j0573P703J9079M979o906j2080j2447p031j099P327k2007j6560
$$ 94991 73796 63223 70926 90005 94984 88078 75998 63551 56520 55421 62748 40741 24181
10955B4181q356o629m7090o8971l1178R56J9464K9742K6032J585o785k6503Q759
$$ 24181 15825 9196 -37894 -106865 -138043 -137087 -117623 -87881 -61849 -60264 -67049 -93552 -84793
10942h4793K6500Q017K3577p162L234J4075l063R446K1135M360p955n077p93l7301
$$ -84793 -58293 -50276 -26699 -33861 -30627 -16552 -19615 -10169 10966 15326 7371 2294 1501 -35800
10928c5800k5382R744N393Q796J1995j2497K729j2138j3506j0485R2547J60856
$$ -35800 -61182 -51438 -46045 -37249 -25254 -37751 -35022 -47160 -60666 -71151 21396 182252
10916A82252J57144M1736m6434k7984n6864p1744n3129k8131j3495r36o3264j4366
$$ 182252 339396 381132 334698 306714 249850 178106 124977 96846 83351 82415 19151 4785
10904D785J3945K280M065j291M257J7890K598j8600l164R321r314j1726N075K1557
$$ 4785 18730 21010 25075 23784 28041 45931 48529 29929 26765 36086 26772 15046 20121 41678
10890D1678J652o240O481K923P438j5848M666j1821j9085J7630j185J241K824
$$ 41678 43330 37090 43571 46494 53932 38084 42750 30929 11844 29474 28289 29530 32354
10877C2354n179K0654M5235Q576j439k7113m8502j6964O409J0031J8924J7201
$$ 32354 27175 47829 93064 101640 100201 73088 24586 7622 14031 24062 42986 60187
10865F0187K027k2595j1794K5549P079j9565k1604j8675k686Q396K5407n86P919
$$ 60187 62214 39619 27825 53374 60453 40888 19284 609 -2077 6319 31726 31140 39059
10852C9059M571n756J3896P779J1773J3520j3249j0737k1402j6050M4972K5303
$$ 39059 43630 37874 51770 59549 71322 84842 71593 60856 39454 23404 68376 93679
10840I3679l341j1202K088Q023m3129j9404j3126r717k428K4740J0152j2282j6911
$$ 93679 90338 79136 81224 89247 46118 26714 13588 3871 1443 26183 36335 24053 7142
10827G142J250j0951J3271J5819J1381j0838K9994j2975l7417k4761j0518K1902
$$ 7142 8392 -2559 10712 26531 37912 27074 57068 44093 6676 -18085 -28603 -6701
10815f701J0886l75K532J357j1356k2803N364J4912Q578l132P381J8449J5352
$$ -6701 4185 3810 6342 7699 -3657 -26460 -21096 -6184 2394 -738 6643 25092 40444
10802D0444N663Q187J6350K6876J4831k0304j225l8733m4949R994o34l871J6703
$$ 40444 46107 54294 70644 97520 112351 92047 90822 52089 7140 17134 16500 12629 29332
10789B9332O341q609J3915N512J8367L335p20l0286l1688j2433J7842P998R304
$$ 29332 35673 27064 40979 46491 64858 68193 67473 37187 5499 -6934 10908 18906 28210
10776B8210l693l833k6809j4951K4465J5270K2662J0632J0630k46k3668L1230
$$ 28210 24517 20684 -6125 -21076 3389 18659 41321 51953 62583 62337 38669 69899
10764F9899L2475M3041K4684R757j7202J3583Q71j4979J5791L2384M1038N6959
$$ 69899 102374 145415 170099 179856 162654 176237 177108 162129 177920 210304 251342 308301
10752C08301O4933Q0499R4737J68888K73255M34385P31951J308269J592051Q07984
$$ 308301 373234 453733 548470 717358 990613 1424998 2156949 3465218 5057269 5865253
10742E865253p64578j530036j207878p74583m83318l07935j89328j49067r5593
$$ 5865253 5100675 3570639 2362761 1588178 1104860 796925 607597 458530 362937
10733C62937p3304o0018m4699k8932l0109m0919j790o190J6650J7227J6314m525
$$ 362937 289633 229615 184916 155984 125875 84956 83166 76976 93626 110853 127167 122642
10721A22642l0669k7754n926L4167k031k3373n779J8682m379m180K9565L2210
$$ 122642 91973 64219 58293 92460 90429 67056 61277 79959 75580 71400 100965 133175
10709A33175M7365P321k8230k5255O7q245m752K0451M3887L0366N5045O8510J32745
$$ 133175 180540 187861 159631 134376 134443 126198 121446 141897 185784 216150 271195 339705 472450
10696D72450K33143L48450L32811P4400k58209l61825k69837j71515r5306o3895
$$ 472450 705593 1054043 1386854 1461254 1203045 841220 571383 399868 304562 240667
10686B40667m5013n0526k7373k1731l2264j3507M499j0032J7643j3239j7095J3903
$$ 240667 195654 145128 117755 96024 63760 50253 54752 44720 62363 49124 32029 45932
10674D5932M694j1680o197L186q347o426M217J3576N22J4125J1682k4550j0379
$$ 45932 50626 38946 32749 35935 27588 21162 25379 38955 39477 53602 65284 40734 30355
10661C0355J5172K7217O907J6763J7136K071j6284j9959j2275P576k2990m4236
$$ 30355 45527 72744 79651 96414 113550 115621 99337 79378 67103 74679 51689 7453
10649G453j5188N554L741J9097Q514j780p609k6176J3090K5543R227k1224j2044
$$ 7453 -7735 -2181 1560 20657 29171 27391 19782 -6394 6696 32239 41466 20242 8198
10636H198n328K2991M344j3653k9707J4451j3416j921K477r220J8793M1599k129
$$ 8198 2870 25861 30205 16552 -13155 1296 -12120 -14041 -11564 -20784 -1991 39608 37479
10623C7479k1033m479p064j8409L188k475j4689K7758K9665K207j9785j8061J8580
$$ 37479 16446 11967 4903 -13506 -10318 -12793 -27482 276 29941 32148 12363 -5698 12882
10610A2882J3614k5898P627J9874L956l6561O065J6174j1968O109k128k1880p273
$$ 12882 26496 598 8225 28099 32055 -4506 1559 17733 5765 11874 9746 -12134 -19407
10597a9407J8780L3300O412k516r801k806J4931p713K696p00j4258Q2q503n29
$$ -19407 -627 32673 39085 36569 26768 23962 38893 31180 33876 33176 18918 19000 10497 9968
10583I968p660j9061r045K5934K338j2635p587j7081J8879J6160J2376J160m0228
$$ 9968 2308 -16753 -25798 136 2474 -10161 -17748 -34829 -15950 210 12586 13746 -26482
10570b6482J742J6343p120J5595O085Q202j4380n594J701o518j5154K2921K2683
$$ -26482 -24740 -8397 -15517 78 6163 14365 -15 -5609 -3908 -10426 -25580 -2659 20024
10557B0024q077m2933j1503J3624K3893R018q06R744j7793l4588j4739K0757M0426
$$ 20024 11947 -30986 -42489 -28865 -4972 4046 3240 12984 -4809 -39397 -54136 -33379 7047
10544G047J7043K6690J6191m7029m4763k8615j406K2276K4077p876j8437j0433
$$ 7047 24090 50780 66971 19942 -24821 -53436 -54842 -32566 -8489 -16365 -34802 -45235
10532d5235r827J3612M2918P79P165O390k894o799j6654k3772K560R478J2835
$$ -45235 -55062 -41450 1468 2247 9412 15802 12908 6109 -10545 -34317 -31757 -22279 -9444
10519i444j0190j4277J6096J4464R542J7284m186k0084m397r025o015K6104J6592
$$ -9444 -19634 -33911 -17815 -3351 6191 23475 19289 -795 -5192 -14217 -20232 5872 22464
10506B2464p231j2680n529J4339L6781J6102j4070j6060J132K867j0203r350j7636
$$ 22464 15233 2553 -2976 11363 48144 64246 50176 34116 35248 38115 27912 18562 926
10493I26L399Q7j7433N617J0921J3231R263r649k8648L010K767Q173M033j6264
$$ 926 4325 4412 -13021 -7404 3517 16748 26011 16362 -12286 -9276 -6509 1664 5697 -10567
10479a0567m59K1233J6205j673k3788J1838J1930r873j1140J7998n323j5563K7970
$$ -10567 -11026 10207 26412 24739 951 12789 24719 14846 3706 21704 16381 818 28788
10466B8788J4290k8460M479k0569r24p162m570J8654J1006j6993j0254L5l6804
$$ 28788 43078 14618 19097 -1472 -2396 -9558 -14128 4526 15532 -1461 -11715 -11680 -48484
10453d8484j4421K4674J397K3933K6876j5932o023p043j7232j5116J4000J7561
$$ -48484 -62905 -38231 -36834 -12901 13975 -1957 -7980 -15023 -32255 -47371 -33371 -15810
10441a5810K1165m251k8545L567Q96J3505J8085Q447r143m827j198o211q499K7400
$$ -15810 5355 1104 -27441 -23874 -22978 -9473 8612 17059 7916 3089 1891 -4320 -12819 14581
10427A4581p176k0639r879r620N144l27q814J1713j3963j6953J953K2218P711
$$ 14581 7405 -13234 -23113 -32733 -27589 -27916 -36730 -25017 -38980 -55933 -53980 -31762 -24051
10414b4051l507J4725Q461N595j5797L529j3692J7672j4378n511J9822j7126j2744
$$ -24051 -27558 -12833 -4372 1223 -14574 -11045 -24737 -7065 -21443 -26954 -7132 -24258 -37002
10401c7002J5957J2034o51K0798J8574k4043o377j9967q244j1273k3359K1625
$$ -37002 -21045 -9011 -9662 11136 29710 5667 -710 -20677 -28921 -40194 -63553 -41928
10389d1928J7348M0379J3269J8627J8917j6339j2657j6457J1000p501j0933j4238
$$ -41928 -24580 15799 29068 47695 66612 50273 37616 21159 32159 24658 13725 -513
10377e13l632J073k11m899K0534K411M890Q390J980j2868M06K5424j2680l1191
$$ -513 -4145 -3072 -3283 -8182 12352 14763 19653 28043 30023 17155 17561 42985 30305 -886
10363h86j2237o675r919J6944o58l581k752j1102K1424K6705J2938k3259j2153
$$ -886 -13123 -19798 -29717 -12773 -13431 -17012 -19764 -30866 -9442 17263 30201 6942 -5211
10350e211N538K7859M596J5389r606p08j213j2797j6972r137l2153J5636N260
$$ -5211 327 28186 32782 48171 38565 37857 36644 23847 6875 -2262 -34415 -18779 -13519
10337a3519K7737J1296P992k8870K952k2175J0301K1948R962m9353m0311o439
$$ -13519 14218 25514 33506 4636 7588 -14587 -4286 17662 27624 -21729 -62040 -68479
10325f8479L7280K7944l814L247Q219Q47k2591l0101L1899J6463K1312J4621n934
$$ -68479 -31199 -3255 -7069 -3822 4397 5244 -17347 -47448 -15549 914 22226 36847 30913
10312C0913j3395k2307r67k2210l541P717j1772j165L8355j4736k5992p649K4493
$$ 30913 17518 -4789 -5756 -27966 -31507 -23790 -35562 -36727 1628 -13108 -39100 -46749 -22256
10299b2256r335j1671J2339N333m476K245r777K6853P260o208k889r34j2286n356
$$ -22256 -31591 -43262 -30923 -25590 -30066 -27821 -37598 -10745 -3485 -9693 -12582 -13516 -25802 -31158
10285c1158R950J4005O264j6330o542k2120j2041J3801J2481j7328J0590L5508
$$ -31158 -21208 -7203 -939 -17269 -23811 -45931 -57972 -44171 -31690 -49018 -38428 -2920
10273b920K603j9427j0565k6282J0951N894K8249J646j6673K0084M305l8353J8133
$$ -2920 -317 -19744 -30309 -56591 -45640 -39746 -11497 -9851 -26524 -6440 -2135 -40488 -22355
10260b2355J0487J0637j432j9063K122M590P970P512J5908N208J1678j0182N679
$$ -22355 -11868 -1231 -2663 -21726 -19604 -15014 -7044 468 16376 21584 33262 23080 28759
10247B8759j9902o382N410J0127l404j9352k9809n051o767P191M456J1142J9461
$$ 28759 8857 2475 7885 18012 14608 -4744 -34553 -39604 -46371 -39180 -34724 -23582 -4121
10234d121K948l943Q708M778l105J827k1981r904l244K0158R106p560l929j50
$$ -4121 -1173 -5116 3592 8370 5265 7092 -14889 -24793 -28037 -7879 1227 -6333 -10262 -10412
10220a0412j7032O593K2539L4206m348r664j3458J595m576j1913J209O554J0009
$$ -10412 -27444 -20851 1688 35894 31546 21882 8424 10019 5443 -6470 -5261 1293 11302
10207A1302L763r890l722j924k9061m7224J4046L5221J8850K0440K592N51m314
$$ 11302 15065 5175 1453 -471 -29532 -76756 -62710 -27489 -8639 11801 14393 14944 10630
10194A0630k290k5109q836K0089j3276K241j276Q92K4380J0425l338j6601P56
$$ 10630 8340 -16769 -25605 -5516 -18792 -16551 -17827 -16935 7445 17870 14532 -2069 -1313
10181a313r832n232M540j2059k4910J4871Q168R310j1409J3450K724m095m606
$$ -1313 -11145 -16377 -11837 -23896 -48806 -33935 -25767 -16457 -27866 -14416 -11692 -15787 -20393
10168b0393R361j6088K1515J8136P625r422J94J514M767j0220J1649n341j7587
$$ -20393 -11032 -27120 -5605 12531 20156 10734 10928 12442 17209 6989 18638 13297 -4290
10155d290j604k0620O208K028J2629j2591l156Q952j4682o112n375p365J3108
$$ -4290 -5894 -26514 -20306 -18278 -5649 -18240 -21396 -12444 -27126 -33238 -38613 -45978 -32870
10142c2870L0840J8862j4048o036J1385l950l2417O741L3089K0285J5982k4824
$$ -32870 -2030 16832 2784 -3252 8133 4183 -28234 -21493 11596 31881 47863 23039
10130B3039j5185j7291p352M126N411m7r15M36n868k813J372j1145o203J5634
$$ 23039 7854 -9437 -16789 -12663 -7252 -7299 -8214 -7778 -13646 -16459 -15087 -26232 -32435 -16801
10116a6801k0723Q879J1399J0417J8074j1617l0190J0764J3665R85J2417L6814
$$ -16801 -37524 -28645 -17246 -6829 11245 -372 -30562 -19798 -6133 -5148 7269 44083
10104D4083J2639k6840k589J1629l341j3518l6579l43J0598Q899J7316j3258P744
$$ 44083 56722 29882 27293 38922 35581 22063 -14516 -14859 -4261 4638 21954 8696 16440
10091A6440j606O120J6863l1785k1411J8635J5275p276j249j7386j2778O949q395
$$ 16440 14834 20954 37817 6032 -15379 3256 18531 11255 10006 -7380 -20158 -13209 -21604
10078b1604N88J4695j8807K0762J3968M502j6661N159Q079k2706j468R187j6178
$$ -21604 -21016 -6321 -25128 -4366 9602 14104 -2557 2602 10681 -12025 -13493 -4306 -20484
10065b0484N048K894P527J9343N771j5004L18p965k0341n043l925M612J1774J3439
$$ -20484 -15436 -12542 -5015 14328 20099 5095 5413 -2552 -22893 -27936 -31861 -27249 -15475 -2036
10051b036k738J8046J890k7718j4795O419J5835K6691O206n421j1837j1527J0360
$$ -2036 -4774 13272 15162 -12556 -27351 -20932 -5097 21594 27800 22379 10542 -985 9375
10038I375N27j422j6741k3313J497k006j9655K3018P165M522j4601J3354J1329
$$ 9375 9902 8480 -8261 -31574 -30077 -32083 -51738 -28720 -21555 -17033 -31634 -18280 -6951
10025f951P510j924J1014R28l047j0788K1481j2380k5313J222M774Q869P452R88
$$ -6951 559 -1365 9649 10577 7530 -3258 18223 5843 -19470 -18248 -13474 -4605 2847 3835
10011C835Q321j1256j0431L470J6130j2455j1297J6107J6339q204k1295n49J5589
$$ 3835 12156 900 -9531 -6061 10069 -2386 -13683 2424 18763 10559 -10736 -11285 4304
9998D304J4822k3674j9371p115J264M87k9761K8506L7118J5535Q239l596j4832
$$ 4304 19126 -4548 -23919 -31034 -29770 -29283 -59044 -30538 6580 22115 30354 26758 11926
9985A1926k914n013r909r829k556K1493J0864K334k6862j2291J0223N937L357
$$ 11926 9012 3999 -5910 -15739 -18295 3198 14062 16396 -10466 -22757 -12534 -6597 -3240
9972c240L014j9165R840L0032L822n880R059J109l19r535j620J9574J1953k2953
$$ -3240 -226 -19391 -9551 20481 24303 18423 27482 28591 28272 18737 17117 36691 48644 25691
9958B5691k8673N355J2148J0962J7832l091J0889j351l257j0955K57J211L0048
$$ 25691 -2982 2373 14521 25483 43315 40224 51113 49762 46505 35550 35807 37018 67066
9945F7066J1578j4842j840J0019L7012K1258k5837j2057l3065l1883l7255J690
$$ 67066 78644 63802 61962 71981 108993 130251 104414 92357 59292 27409 -9846 -8156
9933h156K2714j6686j5498K813K6344j1193q721J1040J9089p733m915Q767j0199
$$ -8156 14558 -2128 -17626 -14813 11531 338 -8383 2657 21746 14013 9098 17865 7666
9920G666n137J0396K39k2889k0299O664J2428J0349R531l0095L075K8840j4514
$$ 7666 2529 12925 13164 -9725 -30024 -23360 -10932 -583 8948 -21147 -18072 10768 -3746
9907c746k9242j1872K46J5610L3459O791r361J5399J8050K935o107k3586r61k872
$$ -3746 -32988 -44860 -44614 -29004 4455 11246 1885 17284 35334 38269 32162 8576 7615 4743
9893D743j4017p653K3869L3263J5531J2049k2569K208n38n429j4648k7198K1176
$$ 4743 -9274 -16927 6942 40205 55736 67785 45216 47424 46886 41457 26809 -389 20787
9880B0787K5127j7898n311q597k6779p434J804o126Q818n341O32K8308L7963J068
$$ 20787 45914 28016 22705 14108 -12671 -20105 -18301 -24427 -15609 -20950 -20318 7990 45953 47021
9866D7021r984j3256P428N904J0515P016L228J4267N361j1640l911L900K7804
$$ 47021 37037 23781 31209 37113 47628 54644 57872 72139 77500 65860 61949 65849 93653
9853I3653K6034o837k9198P258K1367N1917Q6808J25308K12127L01463L14738
$$ 93653 119687 112850 83652 90910 112277 164194 251002 376310 588437 889900 1204638
9842A204638J20109j71063l21877k91387j86301j25411p8162k9571r592l1414
$$ 1204638 1324747 1153684 831807 540420 354119 228708 150546 120975 111383 79969
9832G9969k5119q549J3579q030r153J2854K4289k931k2498j5350j1600p702q438
$$ 79969 54850 46301 59880 51850 42697 55551 79840 76909 54411 39061 27461 19759 11321
9819A1321m472K2003M551J263j0979n871p770P63L526J5389L13j6751r913P575
$$ 11321 6849 28852 33403 34666 23687 17816 10046 10809 14335 29724 30037 13286 3373 10948
9805A0948l188j923m366K5066K5504k4466n2045K773K4808J8113k3310r673n812
$$ 10948 7760 5837 1471 26537 52041 27575 -24470 -21697 3111 21224 -2086 -11759 -17571
9792a7571r34q559L425K028n507K2514K0689k9892k4592j9172K9030R736j481
$$ -17571 -18505 -27064 -23639 -21611 -27118 -4604 16085 -13807 -38399 -57571 -28541 -18805 -20286
9779b0286k0267J5657R946K0452J4227k0392j4246N468P383j4170M924l078j6401
$$ -20286 -40553 -24896 -14950 5502 19729 -663 -14909 -9441 -2058 -16228 -11304 -14382 -30783
9766c0783N832J3984P177l544K764q184n376K7744R816n711j3257j9439J090R258
$$ -30783 -24951 -10967 -3790 -7334 -4570 -12754 -18130 9614 19430 13719 462 -18977 -17887 -8629
9752h629l046Q742o910j5338n354J7471K9683M23m839J1193N527r41p837l1187
$$ -8629 -11675 -2933 -9843 -25181 -30535 -13064 16619 17042 12203 23396 28923 27982 20145 -11042
9738a1042j2835J2830O230j186L643N271k4775j1484j692K959J8230k1446Q533
$$ -11042 -23877 -11047 -4817 -6003 -2360 2911 -21864 -33348 -35040 -32081 -13851 -35297 -26764
9725b6764q984J8901J5116r193J3939j6239j2394P393l3375j2535J5007L3526
$$ -26764 -35748 -16847 -1731 -10924 3015 -13224 -25618 -18225 -51600 -64135 -49128 -15602
9713a5602R872l253Q120L663L947P567J0937L489J0472Q860o924l7617L8666k945
$$ -15602 -5730 -8983 -863 2800 6747 14314 25251 28740 39212 48072 41148 3531 42197 39252
9699C9252k6428j296J1719J2497N112j4347m7133N237L105j4716J3451j164J3609
$$ 39252 12824 11528 23247 35744 40856 26509 -20624 -15387 -12282 -26998 -13547 -14711 -1102
9686a102P876J4808k7218r442J4335J1622q213n867p469K3520l103j4179j4770
$$ -1102 6774 21582 -5636 -15078 -743 10879 2666 -3201 -10670 12850 9747 -4432 -19202
9673a9202j4181O866J6189K68n35N028P228p205j3539m131j4035j552L8634J5480
$$ -19202 -33383 -26517 -10328 -10060 -10595 -5567 1661 -5544 -19083 -23214 -37249 -38801 -167 15313
9659A5313m536Q957k3136J0245N875k2475p604J5350P205j0123r439P66J4232
$$ 15313 10777 19734 -3402 6843 12718 -9757 -17361 -2011 5194 -4929 -14368 -13602 630
9646F30o869j1969K929M765j0305P621K3469N524j3970m612J5768J7508O539L888
$$ 630 -6239 -18208 -15279 -10514 -20819 -13198 10271 15795 1825 -2787 12981 30489 37028 40916
9632D0916j2297l8816q479p345j6871n800K3063p893J5793L061q020J119J868
$$ 40916 28619 -10197 -18676 -26021 -42892 -48692 -25629 -33522 -17729 -14668 -22688 -21569 -19701
9619a9701J7396K0656k643O235J9838j0175k8125J3826N575j454Q336j4440j5596
$$ -19701 -2305 18351 15708 21943 41781 31606 3481 17307 22882 21428 29764 15324 -272
9606b72j7469j1142P026K6217M662K4157Q612R664k9094k0204p726K794O039L784
$$ -272 -17741 -28883 -21857 4360 9022 33179 41791 51455 22361 2157 -5569 -2775 3264 7048
9592G048J7675M109k6481n454J2071j4134m590R992J042M092J969o426o07j1225
$$ 7048 24723 28832 2351 -3103 8968 -5166 -9756 236 1278 5370 7339 913 306 -10919
9578a0919j1859m170Q355L7862L0459j0492j2953l1878M47L295k83Q325k9430
$$ -10919 -22778 -26948 -18593 19269 49728 39236 26283 -5595 -5148 -1853 -2136 6189 -23241
9565b3241k6915R220K5458r87k271o171l636O561j333L297J2139r42N709j332
$$ -23241 -50156 -40936 -15478 -16465 -18736 -24907 -28543 -21982 -23315 -20018 -7879 -8821 -3112 -4444
9551d444O432j5446q730k5223J1813K5118Q085J568J878J2774q565j3794lj592
$$ -4444 1988 -13458 -22188 -47411 -35598 -10480 -2395 -827 1051 13825 5260 -8534 -8537 -10129
9537a0129J1595J4821J6000j8558l0736J1596M99J1474k525o874j7039q470K5055
$$ -10129 1466 16287 32287 13729 -17007 -5411 -4912 6562 4037 -2837 -19876 -28346 -3291
9524c291L2821j1035N450p72l522m493k232l1968j275K7681j084q165l0277j8304
$$ -3291 29530 18495 23945 23173 19651 15158 12926 -19042 -20317 7364 6280 -1885 -32162 -50466
9510e0466K328Q002j31M968J8171K020N855N670o640P793l2584r192O773J0683
$$ -50466 -48138 -40136 -40267 -35299 -17128 -15108 -9253 -3583 -10223 -2430 -35014 -44206 -37433 -26750
9496b6750K5749K3130Q166J389o332m5574J2787J6240q208J0419J8725j253k0835
$$ -26750 -1001 22129 30295 31684 25352 -20222 -7435 8805 597 11016 29741 28488 7653
9483G653j0190L3479J8111k6050k4562p467j7831K445J4936j5865r352K3397L0814
$$ 7653 -2537 30942 49053 23003 -1559 -9026 -26857 -24412 -9476 -25341 -34693 -11296 19518
9470A9518J1592k2871k5321O78J282R087M568r260j3262k3091K8262M8044J9030
$$ 19518 31110 8239 -17082 -16404 -15122 -6035 -1467 -10727 -23989 -47080 -18818 29226 48256
9457D8256j5809J325N647k4940j7548q44P92P138k1320p181j2384L812K1545q120
$$ 48256 32447 33772 39419 14479 -3069 -3913 -3121 4017 -17303 -24484 -36868 -33056 -11511 -19631
9443a9631l015N844J1l286K1074o436n435R23K4177J7656J0105j0141k7935j1587
$$ -19631 -22646 -16802 -16791 -20077 997 -5439 -10874 -9951 14226 31882 41987 31846 3911 -7676
9429g676l490J4029j1066P68J5274K218J491N765k3914q881j4360k640j2642N369
$$ -7676 -11166 2863 -8203 -7435 7839 10057 11548 17313 -6601 -15482 -29842 -32482 -45124 -39755
9415c9755n376j1195J3473K1150N246K4991P570l1707j4077K9439k3215j0615
$$ -39755 -45131 -56326 -42853 -21703 -16457 8534 16104 -15603 -29680 -241 -23456 -34071
9403c4071K0844Q113K3432J3642J2224j3877j8515J472L706k9030Q330M127n516
$$ -34071 -13227 -5114 18318 31960 44184 30307 11792 13264 16970 -12060 -3730 397 -5119
9390e119Q895P251J0730j1641j784J1019j1892K672L332J7500p148J0689o81K80
$$ -5119 3776 11027 21757 10116 8332 19351 7459 10131 13463 30963 23815 34504 33823 34103
9376C4103l2993k6814J7214j2595R268j6936r428K1628k95j0138q394M2120L1224
$$ 34103 1110 -25704 -8490 -21085 -11817 -28753 -38181 -16553 -16848 -26986 -35380 6740 37964
9363C7964k8893k6789j1249j8203p109L5171K1538k4016Q565Q150l024J7341Q546
$$ 37964 9071 -17718 -28967 -47170 -54279 -19108 2430 -21586 -13021 -4871 -7895 9446 17992
9350A7992J1316J150n125N18J6710j4928j4866J8203j9092P936l175n711K3628
$$ 17992 29308 30458 25333 25851 42561 27633 12767 30970 11878 19814 16639 10928 34556
9337C4556j7920o911J1596r8j6019N849p228k140J258k989K742J4591L870J5067
$$ 34556 16636 9725 21321 21223 5204 11053 3825 1685 2943 -46 2696 17287 21157 36224
9323C6224j1021J0959J4455L865j6543k2077j3403k0109j0899J5605K2868K658
$$ 36224 25203 36162 50617 54482 37939 15862 2459 -17650 -28549 -12944 9924 12582
9311A2582J4198L773k0125p784r167K7201N207N999J87j1275L438j4166j0824
$$ 12582 26780 30553 10428 2644 -6523 20678 25885 31884 32071 20796 24234 10068 -756
9298g56q822J3286Q759j6525P18J3115J7012J1854m560M696j105j5085j0352J7554
$$ -756 -9578 3708 12467 -4058 -3340 9775 26787 38641 34081 38777 37672 22587 12235 29789
9284B9789K5541M173p156k2639P038j2797L148J2188j8165J3762Q820l7750p286
$$ 29789 55330 59503 52347 29708 36746 23949 27097 39285 21120 34882 43702 5952 -1334
9271a334Q858R098R184M827j215P382n215K760j4997l264n336Q459K3462r050
$$ -1334 7524 16622 25806 30633 29418 36800 31585 34345 19348 16084 10748 19207 42669 33619
9257C3619q776q163J219j176J724J1172K691k4137J9248K1926J74j3953p99K3510
$$ 33619 24843 16680 17899 16723 18447 29619 32310 8173 27421 49347 49521 35568 34769 58279
9243E8279J5884p828q616K0542K812K912N362k9045r439N146J2689o679K34q244
$$ 58279 74163 66335 57719 78261 81073 83985 89347 60302 50863 56009 68698 62019 62253 54009
9229E4009n73o79P760J5381L2943L4095m760k7796k1433j0376J558m875p960j5508
$$ 54009 53436 52757 60517 75898 108841 142936 138176 110380 88947 78571 80129 75254 67294 51786
9215E1786L6654K8007j588l554j406M63J6524N570K8984j0096M10J6423m228R352
$$ 51786 88440 116447 114859 111305 109899 110362 126886 132456 161440 151344 151754 168177 163949 173301
9201A73301L2235J9246Q131Q475j8817J3729K1373L0575L7936O816K9960K2843
$$ 173301 205536 224782 232913 241388 222571 236300 257673 288248 326184 333000 362960 385803
9189C85803K5575N4219N0131O3426M9892M3505K9886M9811N9089P1866J02289
$$ 385803 411378 465597 515728 579154 629046 672551 702437 752248 811337 883203 985492
9178I85492J27964R9585J11779J55860K02346K27651K43594K88437M14056M72993
$$ 985492 1113456 1213041 1324820 1480680 1683026 1910677 2154271 2442708 2856764 3329757
9168C329757N25041O27189O80862O86569O10712L68928Q1971k14646m50414o00653
$$ 3329757 3854798 4481987 5162849 5849418 6460130 6829058 6911029 6696383 6245969 5645316
9158E645316o61070o72860o24898m88203m32111l52938l14763k77633k41281k10675
$$ 5645316 4984246 4311386 3686488 3198285 2766174 2413236 2098473 1820840 1579559 1368884
9148A368884j55137j28869r4855j23157j01468o5012m1293l0083m1251o6969m0630
$$ 1368884 1213747 1084878 990023 866866 765398 700386 659093 629010 587759 520790 480160
9137D80160n2030j1169K288l0126m4119l1737l2767j2800k2058k2822R318J344
$$ 480160 428130 416961 419249 389123 345004 313267 280500 267700 245642 222820 232138 233482
9125B33482j9851j7335k5146l82J7260j0538k7030j2910j8974j0782P316k695
$$ 233482 213631 196296 171150 170768 188028 177490 150460 137550 118576 107794 115110 112415
9113A12415J0084k1192O467J3538p424J118l964m5943l4456r766K1633K462k5422
$$ 112415 122499 101307 107774 121312 113888 115006 111042 65099 30643 20877 42510 44972 19550
9100A9550L731K1793m34L545O025o197k060K0636k8962J0447M255l258k2880j426
$$ 19550 23281 45074 44640 48185 54210 48013 45953 66589 37627 48074 52329 49071 26191 24765
9086B4765Q791r123M167k4841K0502L8878R852M358K3915n422k8308m4758K010
$$ 24765 33556 24433 28600 3759 24261 63139 72991 77349 101264 95842 67534 22776 24786
9073B4786J049R000J9548J290n62j7219o322J0997p358n886k248M966L3620J0522
$$ 24786 25835 34835 54383 55673 55111 37892 31570 42567 35209 29323 27075 32041 65661 76183
9059G6183r534j5753j4854k4775L942K4642j4695l317N777k841N27K4141J515
$$ 76183 66649 50896 36042 11267 15209 39851 25156 21839 27616 24775 25302 49443 50958
9046E0958l5761j9521K1097J2680j9659O215J1336O751J842k4132p082J0559O522
$$ 50958 15197 -4324 16773 29453 9794 16009 27345 34096 35938 11806 4724 15283 21805
9033B1805j4662j4006J0287J3615K064k0574j5408K454k952O004L2415j494k5887
$$ 21805 7143 -6863 3424 17039 19103 -1471 -16879 -14425 -17377 -11373 21042 19548 -6339
9020f339N631K3102j6985k1989L9030L2623r976j8115J2224J3085k3512n122j2308
$$ -6339 -708 22394 5409 -16580 22450 55073 45097 26982 39206 52291 28779 23657 11349
9007A1349O353L9527j2168k124r642n423O48J1980J2181l7165q356K107L1323
$$ 11349 17702 57229 45061 42937 33295 27872 28520 40500 52681 15516 7160 9267 40590
8994D0590k618j6607l080j7074p382J334r265Q790K3348l294J905J5490N174q784
$$ 40590 37972 21365 18285 1211 -6171 -4837 -14102 -5312 18036 14742 16647 32137 37311 28527
8980B8527j7553j8949P440J8171l325k8023N888L4971j82l872J3819R858n719
$$ 28527 10974 -7975 -535 17636 14311 -13712 -7824 27147 26965 23093 36912 46770 41051
8967D1051j7716K592J1592N494l1909j2332j0218M700J8184J3566O839M597k701
$$ 41051 23335 25927 37519 43013 11104 -1228 -11446 -6746 11438 25004 31843 36440 33739
8954C3739k6571M770J0431j4584j926J7881j2169k976L956p333m010N445K297
$$ 33739 7168 11938 22369 7785 5859 23740 11571 8595 12551 5218 1208 6653 8950
8941H950O074k389r809j5522o19o805o304K6077J3671l849j5879J3188j5938Q880
$$ 8950 15024 12635 2826 -12696 -13315 -20120 -26424 -347 13324 9475 -6404 6784 -9154 -274
8927b74j8910P950J2677j960m636j325n560K6375j6306Q405L583k6681k4211J655
$$ -274 -19184 -11234 1443 -517 -5153 -6478 -12038 14337 -1969 6436 10019 -16662 -40873 -39218
8913c9218j0189J0065K9348J7884J439J225J8734K983k2603j1001M341n252q974
$$ -39218 -49407 -39342 -9994 7890 9329 10554 29288 32271 9668 -1333 3008 -2244 -11218
8900a1218N916Q803J2201q388R134K4470l246r47k7981n4188l6583J1143K3482
$$ -11218 -5302 3501 15702 7314 16448 40918 37672 36725 8744 -45444 -82027 -70884 -47402
8887d7402N308j954K8382N712M925P207j4243J0055J0029R353J138m499k439L547
$$ -47402 -42094 -44048 -15666 -9954 -5029 2178 -12065 -2010 8019 17372 18510 14011 11572 15119
8873A5119M403j61j5255k808Q888m681n479K2251l643O036K7657R78O097J1927
$$ 15119 19522 19361 4106 1298 10186 5505 26 22277 18634 24670 52327 53305 59402 71329
8859G1329L2683M4394L6562k3396l7777m3178k4182j2485n662j4084j1152o006
$$ 71329 104012 148406 184968 161572 123795 80617 56435 43950 38288 24204 13052 7046
8847G046J654k0722m09P548o619j2313l181O376P855N622j2184K819J3210k0945
$$ 7046 8700 -12022 -12431 -4883 -11502 -23815 -26996 -20620 -12765 -7143 -19327 -16508 -3298 -24243
8833b4243L795K3025o563m8860Q176k897l648m627Q842K2192L6387J484j7134
$$ -24243 -20448 2577 -3986 -52846 -44670 -47567 -51215 -55842 -47000 -24808 11579 13063 -4071
8820d071k0902l095J5317K8076q339p358K1143k293j756J350J6216j0048j6624
$$ -4071 -24973 -28068 -12751 15325 6986 -372 20771 18478 16722 18072 34288 24240 7616
8807G616n386L743J6879J5022n925j5799k1728m588J1636j2773N16K4459J0843
$$ 7616 2230 5973 22852 37874 31949 16150 -5578 -10166 1470 -11303 -10787 13672 24515
8794B4515p941j9505j9646n342J4635J670J1107K083M533l6946k9083L68K9212
$$ 24515 16574 -2931 -22577 -27919 -13284 -11614 -507 1576 6109 -30837 -59920 -59552 -30340
8781c0340R998r56N980N203l711k6166p744K067K1407O697K4934L4221l602k4964
$$ -30340 -20342 -21298 -15318 -10115 -13826 -39992 -47736 -45669 -24262 -17565 7369 41590 37988 13024
8767A3024J0610K9782j6695k8380k1311j5338Q44j0709J2194J1114J7574J5757
$$ 13024 23634 53416 36721 8341 -12970 -28308 -27464 -38173 -25979 -14865 2709 18466
8755A8466J7070O420q324m3264p842j9777j2007K9572J3873N255k413j3403j4392
$$ 18466 35536 41956 33632 -9632 -17474 -37251 -49258 -19686 -5813 -558 -2971 -16374 -30766
8742c0766j644R539N576P020J276n708J1259l410o994j8876N911K1858J6603j1800
$$ -30766 -32410 -22871 -17295 -10275 -8999 -14707 -3448 -6858 -13852 -32728 -26817 -4959 11644 -156
8728a56J5300K7337J1070r124l726j2561n670J5115K546O386k328r582k1185J5775
$$ -156 15144 42481 53551 44427 40701 28140 22470 37585 40131 46517 44189 34607 13422 29197
8714B9197J3044j5718m232J9847n23l041k8764j0773J6986J068K2421r71k175
$$ 29197 42241 26523 22291 42138 41615 38574 9810 -963 16023 17091 39512 38541 36366
8701C6366L469L817k1768q214J0976L139p758R142L595M711q068j302L530J5326
$$ 36366 39835 43652 21884 13670 24646 27785 20027 29169 32764 37475 29407 28105 31635 46961
8687D6961J5738j2264j6247K7941K3635K030l7461k0502P326Q886l593l7967j460
$$ 46961 62699 50435 34188 62129 85764 87794 50333 29831 37157 46043 42450 4483 3023
8674C023Q393K2116J2453J4222J999K409k0863k4438Q352q647J6468rk913O490
$$ 3023 11416 33532 45985 60207 62206 64615 43752 19314 27666 19019 35487 35478 32565 39055
8660C9055J7689L1792j5196k1335J3117p46J5085N982m326k1753j511N921k0168
$$ 39055 56744 88536 73340 52005 65122 64376 79461 85443 81117 59364 57853 63774 43606
8647D3606K3900M8378L6619M9793P2713R4886L0875n5195r6491m0554j7336m1143
$$ 43606 67506 115884 152503 202296 275009 369895 400770 345575 249084 208530 191194 150051
8635A50051n2397r443N80m048P223J6792q156r356j6814J3034O200l372j0191
$$ 150051 97654 88211 88791 84743 91966 108758 100602 91246 74432 87466 93666 90294 80103
8622H0103K9550L9693J8671j3141j5246P511P720Q188R232K8270o315J0763J9609
$$ 80103 109653 149346 168017 154876 139630 147141 154861 163049 172281 200551 194236 204999 224608
8609B24608N985J4281p285j813k2753K6575J6112P393R756K8295Q4972J63240
$$ 224608 230593 244874 237589 235776 213023 239598 255710 263103 272859 301154 386126 549366
8597E49366J87583J25235m5893k12332j78662j13535n8587j8034l3031m838k6658
$$ 549366 736949 862184 816291 603959 425297 311762 253175 235141 202110 197272 170614
8586A70614j5230o158k9694O736O786j4578j2251j8531j2913j8943j0777N738
$$ 170614 155384 149226 119532 126268 133054 118476 106225 87694 74781 55838 45061 50799
8574E0799J0685m060k3379R86J2196k0640j79M060L171o222k885j4370L733L323
$$ 50799 61484 57424 34045 35031 47227 26587 26408 30468 33639 27417 24532 10162 13895 17218
8560A7218J7665o513Q346L6761O444J9624M0710M2577R6721Q5136M116p7093j10207
$$ 17218 34883 28370 36716 73477 79921 99545 140255 182832 279553 364689 368805 291712 181505
8547A81505n2045m0449k3620r831k1158j5259Q126O173J3229L2396l7951l6891
$$ 181505 129460 89011 65391 55560 34402 19143 27269 33442 46671 79067 41116 4225
8535D225N859j254r933P56J4675k4231j0649J0225j3624J2281K8551J6685J1161
$$ 4225 10084 8830 -1103 -347 14328 -9903 -20552 -10327 -23951 -11670 16881 33566 44727
8522D4727P025p149o176k6766j7324O547J0005P153l764J852j254L178O638J4371
$$ 44727 51752 44603 38427 11661 -5663 884 10889 18042 14278 16130 14876 18054 24692 39063
8508C9063k687k2911l3327J7549j314n568l106j9470K0520L6211J2242j5790j6588
$$ 39063 36376 13465 -19862 -2313 -3627 -9195 -12301 -31771 -11251 24960 37202 21412 4824
8495D824n038o422l392J4943l069J0609J9366k8573k6346J6962j361R789P868
$$ 4824 -214 -6636 -10028 4915 1846 12455 31821 3248 -23098 -6136 -7497 2292 10160
8482A0160K81K0846J46q424Q941J0504j7536l1332L227n328R061J195P117P900
$$ 10160 10441 31287 31433 23009 31950 42454 24918 -6414 -3187 -8515 546 1741 8858 16758
8468A6758N135K565N263J2471k8855k6239J6773O790l5841K0744J0567J583K0817
$$ 16758 21893 24458 29721 42192 13337 -12902 3871 10661 -25180 -4436 6131 7714 28531
8455B8531j689J022L074n665M597m48k7677k4364R95O446P011Q403J5593L89n99
$$ 28531 26842 27864 30938 25273 29870 29422 1745 -22619 -21624 -15178 -8167 236 15829 16218 15619
8440A5619j6541Q631K5750K564j0373j1686l773N009l74j0206j9049M326J1287
$$ 15619 -922 7709 33459 36023 25650 13964 10191 15200 14826 4620 -14429 -10103 1184
8427A184J3098J3629k874j5879j8240j0656J1272Q862J6343J4249o453j0614k6459
$$ 1184 14282 27911 25037 9158 -9082 -19738 -8466 396 16739 30988 24535 13921 -12538
8414a2538r651k4856J8858K8586l447J907J3174m064j8835J230J7038j306j1796
$$ -12538 -22189 -47045 -28187 399 -3048 -1141 12033 7969 -10866 -9636 7402 6096 -5700
8401e700K3394j1833r12j674m702k671q702K865J6650K1180K473K45q27l590J5791
$$ -5700 17694 5861 4949 3275 -1427 -4098 -12800 -9935 6715 27895 30368 30613 29786 26196 41987
8386D1987Q745N367L33o507J489q912O460p895P027j856M109j2969j8391r536
$$ 41987 50732 56099 56432 49925 51414 42502 48962 41067 48094 46238 50347 37378 18987 9451
8372I451m553L1370J1393R568O356m4649j1798J2889p366l364K646j9085j7579
$$ 9451 4898 36268 47661 57229 63585 18936 7138 20027 12661 9297 11943 -7142 -24721
8359b4721K1675M437p492J529N750K9659J4484j5176j2686m4532j7523K1352J1414
$$ -24721 -3046 1391 -6101 -4572 1178 30837 45321 30145 17459 -27073 -44596 -23244 -11830
8346a1830J9395K965j8414k790J4970P619k3089j1279Q457K273J5720J3480r035
$$ -11830 7565 10530 -7884 -10674 4296 11915 -11174 -22453 -13996 -11723 3997 17477 8442
8333H442J6474J9346p437j6808j2012j5977r622R152K1035K780j6029k160j195
$$ 8442 24916 44262 36825 20017 8005 -7972 -17594 -8442 12593 15373 -656 -2816 -4011
8320d011o647J5265K860n275o249K7904J0009J770k5462j4249K3647J9104q159
$$ -4011 -10658 4607 7467 2192 -4057 23847 33856 35626 10164 -4085 19562 38666 30507
8307C0507k6138j6822j6400R06J8982J253J7360J3094j1711j5083k0344m487K839
$$ 30507 4369 -12453 -28853 -27947 -8965 -7712 9648 22742 11031 -4052 -24396 -28883 -26044
8294b6044J2963K5383L2006Q72k9444J0693M854P825N498K939r050k4039J3630
$$ -26044 -13081 12302 44308 45180 15736 26429 31283 39108 44606 47545 38495 14456 28086
8281B8086J6665K477k1391J2682j1418m8133l432J3229j0616J468n993j3596l3708
$$ 28086 44751 47228 25837 38519 27101 -21032 -24464 -11235 -21851 -20383 -26376 -39972 -73680
8268g3680J746K8225K28L029m49K5545N340n611J253n700J1342P592j5642j3724
$$ -73680 -71934 -43709 -43481 -40452 -40901 -15356 -10016 -15627 -14374 -20074 -8732 -1140 -16782 -30506
8254c0506R732K4520L024k6832j4448L5763K0735m501o027j7512j9626o331j0213
$$ -30506 -20774 3746 6770 -20062 -34510 1253 21988 17487 11460 -6052 -25678 -32009 -42222
8241d2222J363Q520p3j5910m500J7972J7040J8188q34j3068M741J4520l3827l4119
$$ -42222 -40859 -32339 -32412 -48322 -52822 -34850 -17810 378 -456 -13524 -8783 5737 -28090 -62209
8227f2209K5196J4253K1334j6886o190K4473J2558m076J857l714O37j0402j6812
$$ -62209 -37013 -22760 -1426 -18312 -24502 -29 12529 8453 10310 6596 7233 -3169 -19981
8214a9981k4213L434J6442J2793o786J546L5913J7495l4511R95J7575K5244l755
$$ -19981 -44194 -40760 -24318 -11525 -18311 -16765 19148 36643 2132 3127 20702 45946 42191
8201D2191j2270l7314m7629K150J2801J3945L8035J169j2455l811Q834n589j686
$$ 42191 29921 -7393 -55022 -52872 -40071 -26126 11909 13078 623 -3188 5646 57 -1629
8188a629r445k1301M492J3102K6949p168j2253p489j0149K0120K1631k248J2607
$$ -1629 -11074 -32375 -27883 -14781 12168 5000 -7253 -14742 -24891 -4771 16860 14612 27219
8175B7219q248k256j0338k8953j5748k5544P901K0079L26j024K5198Q406r939
$$ 27219 18971 16715 6377 -22576 -38324 -63868 -55967 -35888 -35562 -36586 -11388 -2982 -12921
8162a2921j7581J8032J6947L817N339k853J7466j8965j9340J066L9789J5993O95
$$ -12921 -30502 -12470 4477 8294 13633 10780 28246 9281 -10059 -8993 30796 46789 47484
8149D7484K6345M476k0968j9988J4593P311j0454j5574k593j7792K579j1955m110
$$ 47484 73829 78305 57337 37349 51942 59253 48799 33225 30632 12840 15419 3464 -646
8136f46J325k779P182q777K1344p573n436j0839k656P296k792K075P812k4203
$$ -646 679 -2100 5082 -3695 17649 10076 4640 -6199 -8855 -1559 -4351 -2276 5536 -18667
8122a8667p874K6400L1438m924j0072L027j2351q441q13O198K5971J9887j4432
$$ -18667 -26541 -141 31297 26373 16301 19328 6977 -1464 -2277 3921 29892 49779 35347
8109C5347j792j2676j4441M393N736m190l8002P874K1680l078m025l559j4897
$$ 35347 33555 20879 6438 10831 16567 12377 -25625 -17751 3929 851 -3174 -6733 -21630
8096b1630j1216N697O815J48l090n794J500J8257r762j6401J2192j1559j2132
$$ -21630 -32846 -27149 -20334 -20186 -23276 -29070 -27570 -9313 -19075 -35476 -23284 -34843 -46975
8083d6975L3090J7088j3799Q720O270j307J0352j2856J1340N019j9683k1466k2451
$$ -46975 -13885 3203 -10596 -1876 4394 3087 13439 583 11923 16942 -2741 -24207 -46658
8070d6658j6470l60K1755R991n138L3023K9389J6562L723p007P223O844n591J51
$$ -46658 -63128 -63488 -41733 -31742 -36880 -3857 25532 42094 45817 38810 46033 52877 47286 47437
8056D7437m315j3610j0804r653J775m324k2319R820o078K2240J0766r449J1880
$$ 47437 43122 29512 18708 9055 10830 6506 -15813 -5993 -12071 10169 20935 11486 23366
8043B3366L1314J9424k387l976J0309K559j7924J7445K653k5049o13K2279j8370
$$ 23366 54680 74104 71717 67741 78050 80609 62685 80130 82783 57734 57121 79400 61030
8030F1030k2157Q982R455N275J0429L712k081r801Q909K197K454N183R793J3533
$$ 61030 38873 47855 57310 62585 73014 76726 74645 64844 73753 75950 78404 83587 93380 106913
8016A06913l3596l1446j3749J5981K6308J1628J0334l4083l1059J4453K3549J1446
$$ 106913 73317 41871 28122 44103 70411 82039 92373 58290 27231 41684 65233 76679
8004G6679K2086N384J8686O0239M0465L1667L5768J8820N900j6740m3238n6156
$$ 76679 98765 104149 122835 183074 223539 255206 290974 309794 315694 298954 255716 199560
7992A99560m1949j8033o239J5857L4331J4380M5445J3644k4866m3758l5662m2159
$$ 199560 157611 139578 133339 149196 183527 197907 243352 256996 232130 188372 152710 110551
7980A10551m1546k4155M038Q613r396j3548k9799j3519O675L1345O354o59P04
$$ 110551 69005 44850 48888 57501 48105 34557 4758 -8761 -2086 29259 35613 34954 35658
7967C5658J2058J2032J3335J928l100J545J0438N998J4190N143j2999J9454J9680
$$ 35658 47716 59748 73083 75011 71911 73456 83894 89892 104082 109225 96226 115680 135360
7954A35360L4267J8892n477l2344O75M486m742K838L4596M719K6052J1773l8985
$$ 135360 169627 188519 183042 150698 151373 155859 151117 153955 188551 193270 219322 231095 192110
7941A92110m2544j5427m5489j2167J0341j6662j6717q85k227J1116k4518j8066
$$ 192110 149566 134139 88650 76483 86824 70162 53445 52560 50333 61449 36931 18865
7929A8865K503M212K912N016j1223p060M6696J3851j2284k5610j7919p557J6459
$$ 18865 21368 25580 28492 33508 22285 15225 61921 75772 63488 37878 19959 12402 28861
7916B8861J8268J4014K8841r130P764q49J2404J8566l543k3356l6298n805j0222
$$ 28861 47129 61143 89984 80854 88618 87769 100173 118739 115196 91840 55542 49737 39515
7903C9515Q65J3445R27k2331j6316j6013j4580K3813K0447J7929J9969j1520l4521
$$ 39515 40380 53825 54752 32421 16105 92 -14488 9325 29772 47701 67670 56150 21629
7890B1629o419J437m556j496j844K9407j430o358r467p558J1954K6772k9795l4532
$$ 21629 15210 16647 12091 10595 8751 38158 36728 30370 20903 13345 25299 52071 22276 -12256
7876a2256j1122J1660L1157J6840k7627m7632j8704J9101K1221L7872K0739j0508
$$ -12256 -23378 -11718 19439 36279 8652 -38980 -57684 -38583 -17362 20510 41249 30741
7864C0741k2023J0939M371R060j8769j7866r07K5735n60q223m42J7396O869j1192
$$ 30741 8718 19657 24028 33088 14319 -3547 -4454 21281 20721 12498 12056 29452 36321 25129
7850B5129o028J3479k4532Q681J4102q428r782J1028k920p714J245p46k7861Q047
$$ 25129 19101 32580 8048 16729 30831 22403 12621 23649 20729 13015 14260 13514 -14347 -6300
7836f300K0095j1116r522M4R330j857J77j4896j6190j1241J4080m698K7204o205
$$ -6300 13795 2679 -6843 -6799 2531 674 851 -14045 -30235 -41476 -27396 -32094 -4890 -11095
7822a1095k6156L021J7451L292Q188J1162L633k3269Q5m12K223j742J5866J1971
$$ -11095 -37251 -34230 -16779 -13487 -5299 5863 9496 -13773 -13688 -14100 -11877 -13619 2247 14218
7808A4218j7285k0717k1314K115O284J5065J974K4275J2728j8305k7118l477N818
$$ 14218 -3067 -23784 -45098 -42983 -36699 -21634 -19660 4615 17343 -962 -28080 -31557 -25739
7795b5739l566J8874j042p273J8561J2724k169L249Q036j8454j7157j552j0424
$$ -25739 -29305 -10431 -11473 -18746 -185 12539 10370 13619 21655 3201 -13956 -15508 -25932
7782b5932q034O440P329R601R681j029o230j1991j4208j2523J0028R065L284K0016
$$ -25932 -33966 -27526 -20197 -10596 -915 -1944 -8174 -20165 -34373 -46896 -36868 -27803 -24519 -4503
7768d503J5864n176q771J1265j0470j4089j3819k4342j4259R670L028J280J0266
$$ -4503 11361 6185 -2586 8679 -1791 -15880 -29699 -54041 -68300 -58630 -55602 -54322 -44056
7755d4056k940J7879J0903L510q255P660j2034j3539J4285n253m490K4690L9448
$$ -44056 -46996 -29117 -18214 -14704 -22959 -15299 -27333 -40872 -26587 -31840 -36330 -11640 27808
7742B7808j8325k5121J1247J7250j1617L722j403R993R412k5065m471J8050q880
$$ 27808 9483 -15638 -4391 12859 1242 4964 3561 13554 22966 -2099 -6570 11480 2600
7729B600j9343N710K29J8806j3918m025l349p279K354m844N489j1408J4376l321
$$ 2600 -16743 -11033 -10804 8002 -5916 -9941 -13290 -20569 -18215 -23059 -17570 -28978 -14602 -17923
7715a7923J1060K3578K718J8981N823J313j9103l9353r199J5982L31J8499l82
$$ -17923 -6863 16715 19433 38414 44237 45550 26447 -12906 -22105 -6123 -5792 12707 12325
7702A2325p303N894j2533j005L987o057j8649N666O232J6156J2947j1417j565
$$ 12325 5022 10916 -1617 -2622 1365 -4692 -23341 -17675 -11443 4713 17660 6243 4678
7689D678n455q92j626M637l8735m764L7660J7985j6497l469K078o754m851K7530
$$ 4678 -777 -1669 -3295 1342 -37393 -42157 -4497 13488 -3009 -6478 -4400 -11154 -16005 11525
7675A1525r535j9654P237q635M32J0340k2122l900J6968j2173k5073K6874K39
$$ 11525 1990 -17664 -10427 -19062 -18630 -8290 -30412 -34312 -17344 -29517 -54590 -27716 -27477
7662b7477L3558K730k5076J2880L1631o376l3306K4391k282j0188J2843J4512
$$ -27477 6081 8811 -16265 -3385 28246 21870 -11436 12955 10673 485 13328 27840
7650B7840m0193j8001J6787l451J8693K132J240l897j1694j8747k798K7737N129
$$ 27840 -12353 -30354 -13567 -17018 1675 3807 5047 1150 -10544 -29291 -32089 -4352 777
7637G77j5985K25L1816M8078m069l4684p219m208l2420j5798J5797J5499J3108
$$ 777 -15208 -14983 16833 64911 60842 26158 18939 14731 -17689 -33487 -17690 -2191 10917
7624A0917q023k8728J7709J767J5020j253J2608j5503p591J594j764N377N628
$$ 10917 2894 -25834 -8125 -6358 8662 7409 20017 4514 -3077 -1483 -3247 2130 7758
7611G758o782l3085k0740L0033J9239j3326J832K1135m444j5039J4617J8927r553
$$ 7758 976 -32109 -52849 -22816 -3577 -16903 -15071 6064 1620 -13419 1198 20125 10572
7598A0572L336M084N597k8840q285J0935j3893K284M131n005k827j564j1876R284
$$ 10572 13908 17992 23589 -5251 -13536 -2601 -16494 -14210 -10079 -15084 -17911 -19475 -31351 -22067
7584b2067Q796k6687J8039K1842P224O898p392l0071L126J6245K805J0210J2261
$$ -22067 -13271 -39958 -21919 -77 7147 14045 6653 -23418 -20292 -4047 -1242 8968 21229
7571B1229M303l1465r220j6254j159P764p29O115P337j331J3566J1208M905j074
$$ 21229 25532 -5933 -15153 -31407 -32566 -24802 -25531 -19416 -12079 -13410 156 11364 16269 15195
7557A5195l4148J095L2942K5201O865j1410j1389j4450k0663j8707K0667p606
$$ 15195 -18953 -17858 15084 40285 47150 35740 24351 9901 -10762 -29469 -8802 -16408
7545a6408N895K2457J832j7861J63N810j6096Q132L8768R130l5173q044K0106
$$ -16408 -10513 11944 13776 -4085 -3922 1888 -14208 -6076 32692 41822 6649 -1395 18711
7532A8711J0456j4523o179n981N056R812L151q364j5838l887P97j2544Q031Q69
$$ 18711 29167 14644 8465 2484 7540 17352 20503 12139 -3699 -7586 -6789 -19333 -11302 -10433
7518a0433P897J9395J804k2364L864L2410l0557l5955L3551L581k415j1k666p376
$$ -10433 -2536 16859 18663 -3701 163 32573 2016 -33939 -388 3193 778 767 -1899 -9275
7504i275k88O839Q6P600L849k2271l161M397M995J9463k2441j4158N820Q564Q902
$$ -9275 -9563 -2724 -2638 4962 8811 -13460 -16621 -12224 -7229 12234 -10207 -24365 -18545 -9981 -1079
7489a079k0807r645J6326M368l19j2557M456J5375r096r360r002o446J7770O650
$$ -1079 -21886 -31531 -15205 -10837 -11156 -23713 -19257 -3882 -12978 -22338 -31340 -37786 -20016 -13366
7475a3366n082J4844l979R354N480k4963l8728o430M1246R052M651j1403j1529
$$ -13366 -18448 -3604 -7583 1771 7251 -17712 -56440 -62870 -21624 -12572 -7921 -19324 -30853
7462c0853j871J5384K7614K4423j7342k7572P901K9292j8986j7903o307L1854
$$ -30853 -32724 -17340 10274 34697 17355 -10217 -2316 26976 7990 -9913 -16220 15634
7450A5634J3669n982l369j199l298K0880J1632l1857j9995r485L3920Q737k615
$$ 15634 29303 23321 19952 18753 15455 36335 47967 16110 -3885 -13370 20550 29287 26672
7437B6672p419O815k4386n506q44m775j6428O876L5402O813J4j8892k3300k9564
$$ 26672 19253 26068 1682 -3824 -4668 -9443 -25871 -18995 16407 23220 23234 4342 -18958 -48522
7423d8522j6597k155K3100L0528j0345R398L6356J1643j0448j5178L828k3166
$$ -48522 -65119 -67274 -44174 -13646 -23991 -14593 21763 33406 22958 7780 11608 -11558
7411a1558K149K1147o51l579J8110L181k0448j2077k105k324m969Q398K9184j1807
$$ -11558 -9409 11738 11087 7508 25618 28799 8351 -3726 -5831 -8155 -13124 -4726 24458 12651
7397A2651l5467R780q889r319J8262Q658j7p867M565J5526J9216Q050l448l6880
$$ 12651 -22816 -13036 -21925 -31244 -12982 -4324 -4341 -12208 -7643 7883 27099 35149 31701 -5179
7383e179j1401k650N788K420p577J3194M0675J7786k7702k089j241O022k914j3729
$$ -5179 -16580 -19230 -13442 -11022 -18599 -5405 35270 53056 25354 23265 22024 28046 25132 11403
7369A1403k428q968k0219J6177J2256N144m430l4467K6010l61k6971j4846J2019
$$ 11403 8975 7 -20212 -4035 8221 13365 8935 -25532 478 117 -26854 -41700 -29681
7356b9681K4265L2451p194k4215Q166J3162l1410l1740K2426J0410l587J0228
$$ -29681 -5416 27035 19841 -4374 3792 16954 -14456 -46196 -23770 -13360 -16947 -6719
7344f719j1237o291n01J2418m115o665j877j4659M343L21Q055o033J3376R448
$$ -6719 -17956 -24247 -24748 -12330 -16445 -23110 -24987 -39646 -35303 -34982 -26927 -32960 -19584 -10136
7330a0136J4781K2095m627n87J9796m778k9999j1323l3677O993L228j8747J026
$$ -10136 4645 26740 22113 21526 41322 36544 6545 -4778 -38455 -31462 -28234 -46981 -45955
7317d5955K6600K626j7010m844l21m289R711J9179K4053p217j282L514N529L779
$$ -45955 -19355 -16729 -33739 -38583 -38904 -43193 -33482 -14303 9750 2533 1251 4765 10294 14073
$$ [...]
##END NTUPLES=NMR SPECTRUM
##END=
