##TITLE=Analysis number 319283
Compound Code cc 20809
Project Code adrs
Chemist Name synnovation
##JCAMPDX= 6.0         $$ Bruker NMR JCAMP-DX V2.0
##DATA TYPE= NMR SPECTRUM
##DATA CLASS= NTUPLES
##ORIGIN= Bruker BioSpin GmbH
##OWNER= nmr
$$ XWIN-NMR		Version 3.5
$$ Tue May  9 11:40:27 2006 GMT Daylight Time (UT+1h)  MAYBRIDGE\nmr@NMR_250MHZ
##.OBSERVE FREQUENCY= 250.131544655141
##.OBSERVE NUCLEUS= ^1H
##.ACQUISITION MODE= SIMULTANEOUS (DQD)
##.ACQUISITION SCHEME= undefined
##.AVERAGES= 16
##.DIGITISER RES= 18
##SPECTROMETER/DATA SYSTEM= dpx250
##.PULSE SEQUENCE= zg30
##.SOLVENT NAME= CDCl3
##.SHIFT REFERENCE= (INTERNAL, CDCl3, 0, 16.522)
##AUDIT TRAIL= $$ (NUMBER, WHEN, WHO, WHERE, WHAT)
$$ ##TITLE= Audit trail, XWIN-NMR		Version 3.5
$$ ##JCAMPDX= 5.01
$$ ##ORIGIN= Bruker BioSpin GmbH
$$ ##OWNER= nmr
$$ C:\u/data/dgb/nmr/ADRS/3930/pdata/1/auditp.txt
$$ ##AUDIT TRAIL=  $$ (NUMBER, WHEN, WHO, WHERE, WHAT)
(   1,<2006-05-09 11:39:44.13 +100>,<MAYBRIDGE\nmr>,<NMR_250MHZ>,
      <created by zg, POWCHK disabled, PULCHK disabled
       configuration hash MD5:
       84 BC 41 DB A1 6E 1D 46 DA 25 12 A5 C1 ED C5 3A
       data hash MD5: 64K
       79 54 17 AA C1 03 39 33 82 44 14 89 D2 8C 91 0F>)
(   2,<2006-05-09 11:40:04.55 +100>,<MAYBRIDGE\nmr>,<NMR_250MHZ>,
      <Start of raw data processing
       ef LB = 0.3 FT_mod = 6 PKNL = 1 SI = 32K 
       data hash MD5: 32K
       03 6A C6 50 B7 A9 91 09 18 DF 82 E9 9E 2D 66 1D>)
(   3,<2006-05-09 11:40:10.16 +100>,<MAYBRIDGE\nmr>,<NMR_250MHZ>,
      <apk 
       data hash MD5: 32K
       79 13 1C 17 2C D8 F7 AA 2E 6B 6C 29 20 00 12 F4>)
(   4,<2006-05-09 11:40:11.67 +100>,<MAYBRIDGE\nmr>,<NMR_250MHZ>,
      <abs ABSG = 5 
       data hash MD5: 32K
       E7 F8 3E AA 08 2B 9B E9 CA F6 A2 3A 7B DC BC 1F>)
$$ ##END=
$$ 
$$ hash MD5
$$ F0 83 A7 37 9A 1A BD 7D 5F 85 B9 56 E6 EA AB 1A
##$RELAX= 
##$RELAX= 
##$RELAX= 
##$RELAX= 
##$RELAX= 
##$RELAX= 
##$RELAX= 
$$ Bruker specific parameters
$$ --------------------------
##$DU= <C:\u>
##$EXPNO= 3930
##$NAME= <ADRS>
##$PROCNO= 1
##$TYPE= <nmr>
##$USER= <dgb>
##$AMP= (0..31)
100 100 100 100 100 100 100 100 100 100 100 100 100 100 100 100 100 100 
100 100 100 100 100 100 100 100 100 100 100 100 100 100 
##$AQSEQ= 0
##$AQ_mod= 3
##$AUNM= <au_zg>
##$AUTOPOS= <20 >
##$BF1= 250.13
##$BF2= 250.13
##$BF3= 250.13
##$BF4= 250.13
##$BF5= 500.13
##$BF6= 500.13
##$BF7= 500.13
##$BF8= 500.13
##$BYTORDA= 1
##$CFDGTYP= 0
##$CFRGTYP= 5
##$CHEMSTR= <none>
##$CNST= (0..31)
1 1 145 1 1 1 1 1 1 1 1 1 1 1 1 1 1 1 1 1 1 1 1 1 1 1 1 1 1 1 1 1 
##$CPDPRG= <>
##$CPDPRG1= <>
##$CPDPRG2= <>
##$CPDPRG3= <>
##$CPDPRG4= <mlev>
##$CPDPRG5= <mlev>
##$CPDPRG6= <mlev>
##$CPDPRG7= <mlev>
##$CPDPRG8= <mlev>
##$CPDPRGB= <>
##$CPDPRGT= <>
##$D= (0..31)
0 1 0 0 0 0 0 0 0 0.06 0 0 0 0 0 0 0.0002 0 0 0 0 0 0 0 0 0 0 0 0 0 0 
0 
##$DATE= 1147171179
##$DBL= (0..7)
120 120 120 120 120 120 120 120 
##$DBP= (0..7)
150 150 150 150 150 150 150 150 
##$DBP07= 0
##$DBPNAM0= <>
##$DBPNAM1= <>
##$DBPNAM2= <>
$$ [...]
##$SUBNAM7= <"">
##$SUBNAM8= <"">
##$SUBNAM9= <"">
##$SW= 20.6930455092707
##$SWIBOX= (0..15)
0 0 3 0 0 0 0 0 0 0 0 0 0 0 0 0 
##$SW_h= 5175.983436853
##$TD= 65536
##$TD0= 1
##$TE= 295.16
##$TE2= 300
##$TE3= 300
##$TEG= 300
##$TL= (0..7)
0 120 120 120 120 120 120 120 
##$TP= (0..7)
150 150 150 150 150 150 150 150 
##$TP07= 0
##$TPNAME0= <>
##$TPNAME1= <>
##$TPNAME2= <>
##$TPNAME3= <>
##$TPNAME4= <>
##$TPNAME5= <>
##$TPNAME6= <>
##$TPNAME7= <>
##$TPOAL= (0..7)
0.5 0.5 0.5 0.5 0.5 0.5 0.5 0.5 
##$TPOFFS= (0..7)
0 0 0 0 0 0 0 0 
##$TUNHIN= 0
##$TUNHOUT= 0
##$TUNXOUT= 0
##$USERA1= <user>
##$USERA2= <user>
##$USERA3= <user>
##$USERA4= <user>
##$USERA5= <user>
##$V9= 5
##$VALIST= <valist>
##$VCLIST= <CCCCCCCCCCCCCCC>
##$VD= 0
##$VDLIST= <DDDDDDDDDDDDDDD>
##$VPLIST= <PPPPPPPPPPPPPPP>
##$VTLIST= <TTTTTTTTTTTTTTT>
##$WBST= 1024
##$WBSW= 4
##$XGAIN= (0..3)
0 0 0 0 
##$XL= 0
##$YL= 0
##$YMAX_a= 362769
##$YMIN_a= -533449
##$ZGOPTNS= <>
##$ZL1= 120
##$ZL2= 120
##$ZL3= 120
##$ZL4= 120
##$ABSF1= 16.522
##$ABSF2= -4.171173
##$ABSG= 5
##$ABSL= 3
##$ALPHA= 0
##$AQORDER= 0
##$ASSFAC= 0
##$ASSFACI= 0
##$ASSFACX= 0
##$ASSWID= 0
##$AUNMP= <proc_1d>
##$AZFE= 0.1
##$AZFW= 0.1
##$BCFW= 0
##$BC_mod= 0
##$BYTORDP= 0
##$COROFFS= 0
##$CY= 12.5
##$DATMOD= 1
##$DC= 0
##$DFILT= <>
##$DTYPP= 0
##$F1P= 14.0000005364418
##$F2P= -0.99999901652339
##$FCOR= 0.5
##$FTSIZE= 32768
##$FT_mod= 6
##$GAMMA= 0
##$GB= 0
##$INTBC= 1
##$INTSCL= 1
##$ISEN= 128
##$LB= 0.3
##$LEV0= 0
##$LPBIN= 0
##$MAXI= 10000
##$MC2= 0
##$MEAN= 0
##$ME_mod= 0
##$MI= 0
##$NCOEF= 0
##$NC_proc= -3
##$NLEV= 6
##$NOISF1= 0
##$NOISF2= 0
##$NSP= 0
##$NTH_PI= 0
##$NZP= 0
##$OFFSET= 16.522
##$PC= 1
##$PHC0= 161.3915
##$PHC1= 26.84529
##$PH_mod= 1
##$PKNL= yes
##$PPARMOD= 0
##$PSCAL= 4
##$PSIGN= 0
##$REVERSE= no
##$SF= 250.13
##$SI= 32768
##$SIGF1= 0
##$SIGF2= 0
##$SINO= 400
##$SIOLD= 32768
##$SREGLST= <1H.CDCl3>
##$SSB= 0
##$STSI= 32768
##$STSR= 0
##$SW_p= 5175.98343685301
##$SYMM= 0
##$S_DEV= 0
##$TDeff= 65536
##$TDoff= 0
##$TI= <Analysis number 999999
Compound Code 99
Book Reference 9
Project Code 9>
##$TILT= no
##$TM1= 0
##$TM2= 0
##$TOPLEV= 0
##$USERP1= <user>
##$USERP2= <user>
##$USERP3= <user>
##$USERP4= <user>
##$USERP5= <user>
##$WDW= 1
##$XDIM= 32768
##$YMAX_p= 461747689
##$YMIN_p= -183042
$$ End of Bruker specific parameters
$$ ---------------------------------
##NTUPLES= NMR SPECTRUM
##VAR_NAME=  FREQUENCY,     SPECTRUM/REAL,   SPECTRUM/IMAG
##SYMBOL=    X,             R,               I
##VAR_TYPE=  INDEPENDENT,   DEPENDENT,       DEPENDENT
##VAR_FORM=  AFFN,          ASDF,            ASDF
##VAR_DIM=   32768,         32768,           32768
##UNITS=     HZ,            ARBITRARY UNITS, ARBITRARY UNITS
##FACTOR=    0.157963299565203, 1,           1
##FIRST=     4132.6476996994, 0,             0
##LAST=      -1043.33573715361, 0,           0
##MIN=       -1043.33573715361, -183042,     0
##MAX=       4132.6476996994, 461747689,     0
$$ Real data points
##PAGE= N=1
##DATA TABLE= (X++(R..R)), XYDATA
$$ [...]
22470 48426 63528 35700 20646 41777 31367 -10810 -24697 -42875 -46754 -30992 -41073 -46054
22458 -46054 -38447 -26739 -56466 -21762 31608 58244 51437 2839 -35716 -44004 -55576 -40934
22446 -40934 4910 14910 15329 39978 21263 -3222 -23644 -24678 2362 -23098 -47769 -49752
22434 -49752 -51649 8622 52010 27736 6569 9701 15299 17043 -11826 -39680 -22132 -33838
22422 -33838 4201 11562 9390 14329 54975 51889 43598 13570 -33394 -67702 -55292 -48278 -30015
22409 -30015 -30122 -89109 -83507 -54342 -67257 -45584 -2090 -26832 -8537 553 -31863 -46386
22397 -46386 -10025 27673 -8208 -21978 -8944 8559 30508 -21898 -69528 -69145 -14355 29364
22385 29364 -8908 -34515 -47183 -86362 -87150 -69443 -52498 -31855 8947 26272 27382 20003
22373 20003 23901 26987 25420 27487 23786 1025 -36649 -67405 -85696 -77821 -58422 -20327 18984
22360 18984 16392 14635 3232 26694 48701 27444 -4688 17038 44162 -7433 -23289 1466
22348 1466 40536 28811 71617 75721 23696 -14924 -29130 -15066 -25429 -37178 -43024 -32494
22336 -32494 7921 -20675 -31647 -44166 -41409 -13672 -24571 -16662 -30132 5967 17192 13885
22324 13885 43797 38222 -4762 -19658 -25141 -1532 -8010 -53209 -55564 -50228 -18967 13576 -10105
22311 -10105 -22296 -22308 -44705 -33627 -21944 -48062 -82254 -66730 -77112 -66794 -40289 -17611
22299 -17611 23110 45428 24804 -23086 -55832 -77589 -33375 -4819 10368 23642 29347 -22179
22287 -22179 -35348 -68783 -32008 -15060 28638 35543 56538 84377 65787 9257 -37746 -60777
22275 -60777 -80845 -82621 -42089 -37090 -36608 -23250 -41172 -76043 -47262 -23719 -20534 18282 -972
22262 -972 -72782 -76830 -69155 -37153 21476 71514 76102 12614 -5919 16021 26911 32018 29494
22249 29494 26837 12502 -22626 -12832 9210 44930 55788 36825 48157 54235 18970 20682
22237 20682 65791 53143 30229 16753 -22212 -18089 -3122 -25874 -53411 -38857 -24551 -29284
22225 -29284 -1216 37256 8047 -17161 -15454 -7606 -45346 -13105 32916 51068 40013 3708
22213 3708 -26982 -32993 -4391 -13011 -10218 -30825 -52950 -48787 -45254 -15190 -6908 2253 -26963
22200 -26963 -15876 2453 7855 28665 70607 74810 33142 -22165 -15065 -68848 -79468 -30163
22188 -30163 26348 57985 17849 -29596 -71853 -43157 11814 42851 3782 12233 37809 59484
22176 59484 88508 112758 95306 72660 2020 -43870 -16358 -384 -504 -37012 -80584 -61378
22164 -61378 -24861 28946 42938 -7128 5079 17934 14085 -19887 -23081 7553 19173 -20775
22152 -20775 -29536 -16058 -2693 12738 17580 67992 68541 11331 -15294 -31333 -47290 -71814
22140 -71814 -66655 -47501 6111 64193 41243 17838 -24749 -3155 -12652 -25797 -23153 -34449
22128 -34449 -34729 -23808 -4583 22788 57713 52566 2378 6355 -3040 -40855 -10905 22838 -6371
22115 -6371 29286 34009 32722 10290 7980 42204 72475 62607 44823 41060 42873 21255 25129
22102 25129 7685 1557 24720 -26464 -27577 -19611 -16028 -23998 -17441 -26522 -35656 -50687 7307
22089 7307 30156 15258 -6032 -41031 -34453 9881 31689 54882 37785 35475 39317 871
22077 871 -22893 -5769 -29417 -46972 -5004 37052 20443 20125 27119 20465 21344 50539 71472
22064 71472 40212 56366 13728 -11074 -969 -34884 -43252 -24702 -48622 -69685 -10197 32109
22052 32109 31464 16100 -7279 718 7748 16619 -9599 -4211 82952 112171 96808 65961 19227
22039 19227 -4039 -32238 -8247 28436 -19810 -52323 -20805 -3846 -27789 -42515 -89335 -65752
22027 -65752 -19864 14531 39291 7718 -111 19683 26856 -25000 -29279 35132 80999 61915
22015 61915 54465 53031 73491 82381 42437 32900 33979 42525 44612 60551 63086 60068 64805 34974
22001 34974 10877 6478 17868 -40076 -66158 -20128 -16414 -15434 7421 19195 -34098 -36311 -46787
21988 -46787 -58668 -44453 -36118 -44758 -50053 -67568 -47662 -43210 -46760 -48816 -41891 -40733 -39320
21975 -39320 -34924 -42076 -5264 28693 -1119 -30462 -32888 -56623 -55438 -37312 -27928 -8422 12960
21962 12960 -4881 -16335 -55284 -80435 -76171 -65159 -46288 -49244 -54384 -69411 -25263 -24306 -46749
21949 -46749 -75375 -61569 -47417 -47668 -3012 -2415 8515 7796 -13576 21632 47666 34668 8110
21936 8110 -36999 -4174 28778 -7714 12542 -429 -33845 17490 35672 24165 -22315 -39146
21924 -39146 -32365 -64145 -55793 -64207 -55076 -29353 -19274 -35667 -82 -10248 13378 18376 -4833
21911 -4833 27137 60185 37056 -11706 -15439 -28164 -41783 -71604 -60118 -13773 4345 14250
21899 14250 12323 -51141 -81502 -60639 -47394 -64012 -73780 -72536 -73979 -52272 4897 2672 -3965
21886 -3965 39764 59633 45025 -1712 -35316 -47424 -59485 -22676 -17390 -9041 5714 -4788
21874 -4788 -59191 -80869 -63496 -16155 -18935 -24874 -9401 27595 14928 11083 -12771 -17671 1477
21861 1477 -4975 -8290 -28983 -21436 -7614 -34719 -64030 -44500 -31352 -14555 42717 18541
21849 18541 -12555 -33858 -9493 33802 1916 -28513 30936 16001 5855 -26419 -4643 23355
21837 23355 69383 74131 8624 -30243 -56040 -50014 -17117 7369 20387 274 14982 16263
21825 16263 49341 42904 42863 70433 25465 3771 -18773 -19435 -11469 -35509 -13507 49768 48465
21812 48465 67239 33557 52701 51388 3589 -3432 36435 62233 2165 -7226 27128 38113
21800 38113 53964 43116 30541 52568 7126 -23744 -21236 -34099 -35654 -30031 -7288 -13413
21788 -13413 -9893 9500 23290 32142 33003 37189 37148 18273 17851 -11372 -22857 -22594 -33310 -62455
21774 -62455 -112300 -113799 -63500 -45920 -25272 -60929 -32097 -43361 -33468 -37719 -54083 -73435
21762 -73435 -36808 -19182 17218 4072 -32556 -48789 -55963 -44479 -20707 -25736 -26042 -25794 28738
21749 28738 20565 -17391 -43465 -30904 -14030 -31007 -28924 -15578 6813 7227 -13417 -21863 -8355
21736 -8355 -8673 -23977 -29465 -60130 -75506 -44301 -40508 -67967 -46702 -51973 -62296 -126386 -128446
21723 -128446 -112510 -47463 -3730 -4542 -32313 -62119 -59165 -19671 18286 15528 -7081 -15120
21711 -15120 -58210 -60647 -31862 -39374 -65367 -118043 -123927 -64241 -9700 21163 74163 74608 13082
21698 13082 -23521 -21485 -22527 -18079 -10344 3021 23658 -4748 -15428 -21162 -30481 899 5365
21685 5365 14243 30143 16689 12255 5376 -43272 -28635 -15272 -5964 -22688 -14753 -25213 -70794
21672 -70794 -71639 -49596 -10713 -42715 -29264 40227 49390 46783 13284 -17934 -34406 -16555
21660 -16555 10792 9193 9900 11440 -17925 6223 27730 45577 34317 -34368 -65538 -19812
21648 -19812 1170 1742 2155 -22709 -48042 -21478 -36801 -47358 -14313 6221 -7527 -12618 -11829
21635 -11829 -26165 -61813 -28734 -13404 -13944 12036 23906 18639 -21118 -34793 -26002 -58068
21623 -58068 -75620 -68448 -44659 -42252 -20428 -17977 -27930 -7777 36729 54055 20467 -26083
21611 -26083 -20642 -32632 -32938 -43602 -38482 -51963 -75023 -68426 -48797 -16609 -9121 -4184 -7243
21598 -7243 7095 8581 -12141 -37961 -29056 -23910 -23618 1359 26639 66011 32045 6756 29884
21585 29884 19442 -51256 -66047 -69744 -50213 -1256 -957 -18334 6346 11182 -44777 -50389 -39325
21572 -39325 -38661 -37853 -34524 -35437 -41677 -37237 -26101 -8705 5597 15248 -6817 -57029 -44098 -57922
21558 -57922 -51803 -7653 -15651 8342 10435 9339 -3123 -28864 -26685 -29420 -13511 -11040 -40421
21545 -40421 -16806 -29412 -29301 17671 33813 -16025 -10200 5345 -13125 -25628 -9788 -28077
21533 -28077 -6943 -34849 -49101 -16129 -39803 -60970 -71454 -72306 -60411 -70531 -111913 -116767
21521 -116767 -86420 -75449 -39669 -15804 7683 13469 4501 -8290 -61772 -25607 3871 -2840
21509 -2840 -12037 -15721 -16612 -2781 8455 -17273 -17319 -38052 -50234 -58748 -65558 -52649 -45838 -27362
21495 -27362 18648 10529 16311 3223 -22830 -43210 -16954 -25092 -34310 -12986 -27979 -43584
21483 -43584 -44944 -8390 16762 44955 36522 50472 55045 52330 22694 36835 25195 54653
21471 54653 51216 20392 -13992 -30313 -68703 -70401 -68473 -58812 -52316 17673 54582 35391 27036
21458 27036 964 -38778 -26678 -65 16752 21665 65657 99972 87211 41768 -8297 -19859
21446 -19859 8025 -10243 -22357 -10442 -20521 -35635 -17269 11923 21366 19632 -17491 -6112
21434 -6112 -10593 -1261 5072 40026 84013 89898 103937 70974 54430 33674 -10461 14701 69056
21421 69056 62915 -10820 -69424 -92842 -37597 26925 200 -22632 -8546 -18056 -46253 -68355
21409 -68355 -40512 -18250 -29385 -36048 -41579 -15720 -6313 -32494 30282 34428 2181 -12115
21397 -12115 -33280 -12747 -8862 -22706 -48099 -44623 -77743 -68464 17333 106531 94097 66941
21385 66941 55770 31235 8129 -32885 -40732 -66858 -40417 4077 -20472 -28490 -25518 -5960
21373 -5960 -13604 2536 -32973 -31650 -10683 -20813 22853 44525 4359 -533 4283 25753 20137
21360 20137 -33848 -36727 -48856 -45619 -27995 -22254 -40136 -8861 9836 38351 63491 86035
21348 86035 76813 34274 31208 35598 28847 13156 13963 -19485 -78191 -45496 -23291 -19642 8216
21335 8216 3141 -14885 -35808 -36197 -26912 -59353 -86657 -83630 -73851 -72298 -91908 -92358 -56992 4717
21321 4717 37233 19090 2074 -56927 -55705 -18145 54479 74421 53634 3759 -35245 5718
21309 5718 40468 32027 13938 26108 82351 97471 92162 52122 4578 -7681 12205 33532
21297 33532 38728 29889 -7688 -41922 -9186 33283 29413 1330 -10878 5787 35376 61375
21285 61375 51812 33786 12225 -16377 -32191 -22237 -28081 -27455 -37765 -82702 -44355 -41531 13019
21272 13019 55868 21962 -60698 -57346 14948 17092 26953 35721 34798 86021 77393 75246 53053
21259 53053 17654 9691 10458 -15849 -10572 -51858 -57857 -35990 -33807 7389 28799 -36311 -58340
21246 -58340 -11626 22979 12574 -110 12181 34752 44084 74456 79618 43983 5442 1244
21234 1244 21876 8672 -33430 -105405 -48180 1748 6724 40528 56837 68464 70379 71744
21222 71744 17860 -23113 -15576 -15017 -5094 5024 -9434 33428 63021 44006 9265 6100 18459
21209 18459 38891 90972 109652 88265 34104 -25096 -61412 -59968 6797 53778 44821 11004
21197 11004 19585 -15978 -36956 -24919 29205 36649 8401 24134 -6593 -44089 -56812 -31276
21185 -31276 4245 8386 -2159 -16908 6300 29516 25731 -3444 10033 28461 -17431 -69393
21173 -69393 -30388 30130 4724 4471 -2834 -18967 20141 -12880 -17560 -14772 -7714 -5365 -28981
21160 -28981 6166 22777 -28814 -41136 -23724 -10494 20425 27612 22939 27695 1285 -11920
21148 -11920 -29866 -24818 12398 -12818 -57739 -27715 -29970 -56266 -10092 29930 68880 55424
21136 55424 28592 49945 77700 66014 28325 7490 -14982 -39857 -68373 -88618 -87164 -79483
21124 -79483 -88878 -59359 -7768 -32117 -50492 -35982 -21740 10030 50080 43491 59025 16427
21112 16427 -16526 -26041 -6138 39076 86768 44220 24173 -15843 -41302 -21413 -12275 5119
21100 5119 21944 13942 1252 1708 -17863 -48547 -22325 -7338 -740 -19062 7673 16594 4014
21087 4014 -9802 -11811 4201 34381 1698 -28947 -39443 -53636 -19409 -13974 -9757 4027
21075 4027 25736 30514 16080 5871 -5706 -45919 -57167 -3993 30569 20071 26356 19294
21063 19294 -5834 -28926 -10330 2461 30693 25266 -14387 -22415 -9812 -10917 -5014 27357
21051 27357 39425 28262 29158 32177 32963 16534 23080 28288 -18701 -50461 -54408 -101147 -146225
21038 -146225 -117901 -52715 -41459 -53073 -34575 2394 -11068 -16301 -641 -30077 -11355 12885
21026 12885 -26827 -38272 -9421 -9121 4421 -20278 -31982 -41592 -67144 -58020 -21585 -43573
21014 -43573 -57723 -46206 -29221 3458 27890 19752 18835 48199 1140 -57019 -59746 -49555
21002 -49555 -13755 30413 -14778 -36731 -14248 -14668 88 11141 56037 21685 -2280 -8244
20990 -8244 -14503 -31651 -39494 -60074 -84873 -70332 -53946 -56228 -63210 -28871 -4330 -1250 -13801
20977 -13801 -31291 -8707 -23160 -55865 -79468 -82110 -69879 -22497 -14584 -44156 -93851 -85314
20965 -85314 -35281 -37116 -54579 -57392 -90397 -68886 -29585 -2467 18372 37899 41417 -2535
20953 -2535 14183 -3867 -4235 32270 35851 3176 -8291 11250 43799 39820 29799 1495 -13955
20940 -13955 -23819 -22034 -36215 -31078 -32639 -91264 -125567 -86151 -34007 -14757 10182 20616
20928 20616 37722 67172 78756 59043 31857 32049 20285 17744 54493 39747 15305 36330
20916 36330 62157 33967 -18259 -30887 25735 76742 58260 19424 -1746 -7212 7502 -10291
20904 -10291 25858 35968 29345 34918 20385 2390 2098 20972 15958 -25722 -3263 7615 -15476
20891 -15476 -353 11411 13764 3408 10142 17472 -3256 -23482 -6435 -21076 -54813 -81209
20879 -81209 -89263 -81978 -38594 -37020 -45465 -14806 263 24411 29389 14318 21944 23530 44023
20866 44023 50478 64782 80644 56076 42247 2272 -23742 -22797 -40918 -52979 19 52165
20854 52165 47753 -130 -10612 -22224 -27288 4898 52407 24715 -26056 -48303 -69968 -42025
20842 -42025 -14980 -7187 7695 44458 42253 46909 82387 74239 62512 -6427 -17459 -20430 -32988
20829 -32988 -1323 15722 2306 -51881 -56572 -34893 -76901 -89333 -21928 -13870 -37288 -64806
20817 -64806 -94205 -103425 -64381 -46260 -54235 -22931 3483 -33827 -95332 -46084 1807 -9969
20805 -9969 -19717 3470 -2701 -2178 -65758 -140717 -102967 -40769 -50392 -101176 -111188 -104748 -106147
20792 -106147 -110342 -103737 -86931 -92489 -114256 -115509 -94047 -109602 -91907 -65556 -26030 19147
20780 19147 40335 37608 2826 -5707 22195 11601 -4864 -20250 -57339 -38707 -10816 -12259
20768 -12259 -4752 -17330 -32826 25279 50862 12212 -27983 -2179 27460 -763 -23473 -94284
20756 -94284 -108994 -74994 -39461 -60097 -110366 -78399 -41207 -60876 -55013 -39628 -42079 -35005
20744 -35005 -50175 -48488 -19457 -1659 -19089 -35997 -3770 -24312 -65974 -92546 -92211 -61195
20732 -61195 -38575 -39952 -7299 16458 -28784 -65922 -14962 27200 6337 -4466 34561 40857
20720 40857 15208 16361 -18417 -32796 -39483 -32276 -34535 -64149 -29150 14461 18228 -14425 5934
20707 5934 -12472 -32522 -15057 -40308 -51649 -14676 15288 5377 1161 -331 -29216 -99816
20695 -99816 -110382 -113127 -78087 -52282 10011 1911 -854 4078 -58077 -94164 -76898 -74946 -34209
20682 -34209 -11617 -19514 -21567 3383 33674 49760 49249 52912 48517 61552 48736 49494 53677
20669 53677 -13985 -37491 -32360 -15142 -22589 -14655 -859 22934 -501 -27165 -52729 -40062
20657 -40062 -51811 -53222 -26127 -29617 -35628 -38464 -57653 -61739 -51998 -40048 -41105 -53192 -29084
20644 -29084 -5904 -25102 -33512 -74188 -99434 -108282 -67958 -38195 -25380 11372 -2666 -8584
20632 -8584 -1255 19200 17872 16165 11408 -20224 -24228 -17382 3489 31621 48412 42153 25480
20619 25480 40074 29225 3109 9843 10688 -14630 -29449 -19495 965 10663 1444 -17987 -1724
20606 -1724 12419 -12654 -6069 970 -12725 -18334 -6174 9654 25169 11522 -47490 -29682
20594 -29682 -5908 -19074 -22555 4751 25431 20477 -33107 -18431 83704 48069 43043 58310
20582 58310 68199 39281 38035 47981 31540 30094 40064 22674 19419 -19206 -72048 -77996 -59286
20569 -59286 -480 29037 76578 36810 -32664 -9792 -25290 -75467 -90228 -42559 -21506 43536
20557 43536 47292 -18869 -29147 -21981 -33063 -28363 -1889 19328 17907 33075 26375 -7529 -34703
20544 -34703 -52146 -63071 -65934 -14078 -6186 11547 34641 8830 -15791 5059 24580 57302
20532 57302 45270 48701 103970 68337 17336 19476 23062 21333 -3220 -20291 -5684 -34545
20520 -34545 -29611 -14271 -31586 -23175 10023 13472 16349 24433 -15393 -19774 -25853 -15450 -5059
20507 -5059 -45395 -31548 -2595 -36251 -73734 -66676 -41438 -25213 -12919 -31891 -52896 -63531
20495 -63531 -33634 -55891 -79695 -57329 -24444 -30058 -62689 -89134 -102079 -57712 -12444 13987
20483 13987 -4218 -35724 -48006 -22371 10311 42757 34566 37505 31066 35068 36513 41037 24773
20470 24773 3240 -25189 -24990 -7682 -20780 -28788 26506 54643 75677 64150 74353 100950
20458 100950 90349 67756 32789 -27813 -81954 -43648 -10098 -5264 3768 29442 46082 39904
20446 39904 19750 27834 6615 -44879 -89422 -105428 -75880 -102114 -27010 26269 -4814 -9194
20434 -9194 12961 12513 10426 17767 21548 -20184 -23055 -33610 -45617 -47611 -59005 -66349 -64184 -31547
20420 -31547 1474 10907 34613 37730 25116 29301 1843 -34535 -36297 -24487 -9099 -24923
20408 -24923 -13453 -1479 -8391 -20813 -53692 -46117 -39215 -48281 -39162 1501 -5569 -72459 -49016
20395 -49016 -3300 -19402 6496 29826 48271 37527 12479 -20888 -48372 -35310 5759 17667
20383 17667 32236 -3059 -9506 15151 12401 12166 6721 -12799 13556 39283 5269 -43854 -49790
20370 -49790 -42261 7489 18195 17121 18092 -35715 -37593 -6880 -1179 14230 23584 -16156 9008
20357 9008 18125 35255 20541 -15884 -25243 11091 47960 8805 -33465 -9981 23946 15875
20345 15875 10445 11510 -13568 -31055 -24420 -14823 346 -670 16814 22125 10031 74168 54619
20332 54619 9803 -10794 -29647 -2634 5836 -5487 -30160 -892 12475 -7623 -49631 -58363
20320 -58363 -43118 -31737 -46258 -52963 -39084 -50557 -41500 -9919 1607 29428 5163 -22934
20308 -22934 -38929 -36372 -33680 -52179 -26008 9230 7034 -7554 8555 -1911 -44830 -50969
20296 -50969 -10599 12816 14000 -712 -32492 11080 73691 72231 51314 41127 45038 34269
20284 34269 17080 8850 31804 33326 32191 41310 35355 -20478 -49876 -9140 12577 15534 -5712
20271 -5712 436 53747 97370 107740 66822 48184 52322 49465 19761 -6840 -35148 -76316
20259 -76316 -76976 -51180 -40334 -26436 -37093 -47590 -53109 -53603 -47084 -53142 -39802 -857 32868
20246 32868 13786 -38382 -61916 -37611 -13314 32839 58362 59035 33931 21021 -13377 -33299
20234 -33299 -33058 -17401 -24893 -39050 -66666 -58304 -33363 -17853 27741 40348 13490 -29053
20222 -29053 -22146 106 -6482 -13021 7867 46648 4002 -18838 -10952 15246 21266 19740 -13095
20209 -13095 10321 8600 18698 18812 51028 75834 82796 90561 76939 -13087 -67407 -84000 -73441
20196 -73441 -71191 -80413 -32960 8342 12387 13474 -21716 -22269 1591 15195 31064 17482 -11835
20183 -11835 -19984 946 -21106 -26449 -13198 -14325 15937 44607 47529 1084 -28492 -15280
20171 -15280 -13553 -50225 -54330 -44556 3938 20162 -15376 -43364 -45409 -58254 -80495 -31623
20159 -31623 26351 16169 -14628 -49989 -15922 -27674 11613 31368 28892 51945 1702 -45686
20147 -45686 -20891 56425 33640 21086 49820 34734 36663 61528 79468 37428 -17875 -50224
20135 -50224 -42975 -52795 -44843 -22713 -138 7615 17902 13079 36013 13593 12891 22548 7809
20122 7809 -31587 -39683 -32683 7204 -13938 -42404 -56214 -90481 -117698 -16075 56582 -5526
20110 -5526 -60964 -49317 -17196 -9281 -22391 -27439 -42402 -70767 -47657 -54169 -35960 5318
20098 5318 9530 20124 51121 35860 18297 8821 39541 -12187 -11519 -3802 -8527 26371 26833
20085 26833 26103 5144 36041 19727 -6483 -49889 -51738 -15085 15931 3713 -1961 6565 -22841
20072 -22841 -54307 -10028 9652 28912 9912 -25379 -6595 22635 -4141 -41640 -81511 -81117
20060 -81117 -54821 -50308 -52719 -77680 -33636 27945 13631 -7297 15838 2429 -53705 -57842
20048 -57842 6756 -12070 -35135 -16112 -5536 -60513 -81246 -59990 -42054 -42941 -46883 -34859
20036 -34859 -10339 -79911 -97918 -80324 -77682 -66888 -56758 -69112 -35743 -21721 -67907 -41582
20024 -41582 5095 33599 56040 69666 40405 11202 46909 31953 29673 44415 52181 50103
20012 50103 18387 -42833 -47932 -7492 22818 26668 29139 47334 10006 -35184 -29932 -3924
20000 -3924 -17429 -33708 -37481 -52664 -92256 -31327 -28036 -36028 -29272 10491 26084 34838 -12994
19987 -12994 -15533 -51412 -43667 -52379 -48118 -41907 -45225 -37121 -21005 -22345 18555 47613 21471
19974 21471 5140 10801 27262 29044 -12933 -21923 33830 37451 31163 12894 31974 57732 -12222
19961 -12222 -41392 -38542 -18699 -4556 -9149 -27067 -32418 -68877 -95560 -37999 -28477 -34868 -3875
19948 -3875 12920 6173 796 33156 17170 -15694 -25496 -29703 -27890 1396 15985 -30324 -68573
19935 -68573 -25443 -3912 -7433 -25031 -48473 -51989 -44100 -53169 -56196 -56692 -59353 -74029 -89443
19922 -89443 -52551 -35597 -96808 -91334 -101076 -88068 -23310 33885 20906 18620 13773 16319 21324
19909 21324 35244 14684 32706 9521 -46544 -54667 -33590 -17577 2983 -27629 -43125 -10229
19897 -10229 -16658 -11543 -24146 3648 1817 -13553 -20901 -6714 -20700 -8322 -26839 -223
19885 -223 10451 -6586 -20928 -33569 2984 -28624 -47208 -48579 -77086 -93630 -69677 24992
19873 24992 47543 23321 19452 4755 -2270 -45554 -19116 26703 44126 10495 30226 27316
19861 27316 21793 -28980 -39017 -36021 -34773 -23693 -37322 -36498 -13783 -15628 8282 -344 -41662
19848 -41662 -43720 -51744 -2464 9669 23452 32610 22517 -18188 -42758 -55451 -52668 -59809 -27294
19835 -27294 11208 -42089 -51509 -43189 -53661 -42553 -67225 -55647 -22936 -31168 -25252 -39619
19823 -39619 -34975 3596 24862 4842 6623 31077 24733 44803 53141 62867 2791 6153 17546
19810 17546 5763 -2211 12389 17036 5717 -13187 -36034 -28879 -38832 -52212 -45120 -47841 -46792
19797 -46792 -60911 -55287 -24197 1473 -3408 -10254 -27708 -49824 -50367 -36599 -17856 -11471 -2652
19784 -2652 5134 -9338 19672 24712 -4792 -46839 -57215 -33999 -29736 -19684 -11736 15238 -9735
19771 -9735 -9833 29684 42255 46269 74600 50697 -17971 -37001 -53976 -65848 -22686 -27053 -33790
19758 -33790 -96 22369 47663 35638 -5704 -17582 -16587 -5058 16775 -13388 -9871 13299
19746 13299 25453 21605 -7208 -6193 -15070 -4041 36702 54987 -3636 -16849 -43151 -79398
19734 -79398 -90957 -56383 -10623 -15821 -21900 -60635 -112617 -148832 -82457 -43124 -60730 -57679
19722 -57679 -25628 -3383 -2659 -20397 -37414 -44523 -26989 -10050 -36578 -61432 -30381 60176
19710 60176 83855 81092 58988 29966 32495 15606 -11210 -44526 -81643 -47354 19951 30095
19698 30095 -21123 -63344 -33144 2613 32988 5773 4381 20284 51121 35058 -15059 -39881
19686 -39881 -31849 -5891 -26103 -49600 -39908 -12986 -32391 -17183 10507 40088 67915 76616
19674 76616 21989 -32360 -37480 -36520 44474 87604 57796 -4340 -69391 -74383 -85354 -40925
19662 -40925 -21995 -63463 -38033 10592 43394 82967 111494 65167 34653 32365 44527 3256
19650 3256 -24174 -28158 -39147 -33049 27518 77751 58900 43310 23506 -12958 -43128 -1593
19638 -1593 -24460 -54509 -32540 -8803 -32001 -70735 -41606 27914 64795 59064 20849 -12938
19626 -12938 -45859 -58917 -46502 -33159 31105 48813 55290 -777 -16803 -21520 -3493 47001
19614 47001 75789 52786 -1364 -5559 -14373 -11861 -12079 -4788 -36827 -18341 10322 -1107 -30406
19601 -30406 -49421 -72262 -56852 -53800 -28238 -37952 -22274 -27275 -48143 -65860 -60004 -56019 -37984
19588 -37984 -69251 -44441 11661 8281 -37769 -5987 -4477 -26430 -45535 -71359 -70034 -53965
19576 -53965 -6015 -10134 -27750 -54153 8781 73924 24623 -12281 -36381 -30396 7196 58032
19564 58032 65993 34315 33575 52076 34565 7035 36958 74848 61137 52249 14318 347
19552 347 -40255 -17141 22939 43355 1491 -38617 -37771 8388 1650 20776 -10858 -23575 -20123
19539 -20123 -23054 -65924 -103233 -56235 -19916 -35100 -38264 -12191 -17238 -42533 -1632 4074
19527 4074 -7090 16506 687 -37135 21316 33216 86879 99056 91609 85297 99898 100763 75819
19514 75819 42822 64538 1272 -57827 -76995 -18528 32562 4719 -42255 -57244 -47562 -60673
19502 -60673 -86685 -89438 -45997 28379 75416 78658 76272 34565 6759 -4288 -21926 11990
19490 11990 -4466 -17585 -25331 -1205 -31458 -88421 -88073 -71456 -63971 -45186 -6920 2562 19682
19477 19682 57382 43312 71134 62190 43205 -26680 -52326 -35419 -49541 -26545 -32183 -41226
19465 -41226 -26863 -25406 10163 7245 -22094 -46192 -54787 -77943 -35457 -23409 -24520 3138
19453 3138 37451 34973 60997 83368 50249 29908 -14204 -16195 23396 41894 29199 -17346
19441 -17346 -56696 -55213 10891 43440 15207 -55023 -91410 -69088 -52750 -32936 -23254 10567
19429 10567 29390 7971 -27362 -10272 25336 48617 42241 48987 37602 6878 -53202 -53558
19417 -53558 -23449 20623 15699 -8349 41669 63982 39935 31107 -23266 -38219 -14971 30330
19405 30330 -3034 -15221 -24647 -3220 19629 22909 72702 46612 30044 41924 24853 -3297
19393 -3297 -31349 -3130 -18076 -25824 -8723 -17430 -19917 -46220 -60457 -44906 -30241 -11968
19381 -11968 21041 7324 -19479 -25486 -14794 -13346 -15908 -8831 -31806 14632 25242 6206
19369 6206 -993 -24177 -12443 -22522 -25469 -4365 62911 61649 59596 78003 59043 73159 59844
19356 59844 7730 -23377 -22485 -10606 -34612 -31245 33262 33236 7357 -6258 -14463 -7126 -9037
19343 -9037 3126 30500 37294 16457 7770 -37032 -104762 -71599 -55249 -85090 -95876 -89576
19331 -89576 -107106 -109482 -56564 -67467 -68324 -32311 -11198 -24894 -25593 -8234 40644 90965 80239
19318 80239 36895 48216 63402 90689 71104 53760 -1478 -28206 -54437 -23310 47135 66785
19306 66785 41408 1901 -26591 8580 53807 64094 71900 38100 25638 35685 18695 -17873
19294 -17873 -27296 13169 1666 37588 47066 6331 -68730 -63282 -22411 -14198 9836 38703
19282 38703 64553 44585 24623 20556 32316 20942 10018 -281 28674 26166 43893 59812
19270 59812 -4530 -40863 -25434 -24800 -2785 6285 -7166 34393 63071 47830 20741 5293
19258 5293 21289 74479 83446 61467 2425 -40138 -27939 -11022 -25891 -17756 -20515 -36797
19246 -36797 -33949 15136 4349 22700 19204 -2268 2262 30898 22446 16147 929 2041 4867
19233 4867 18213 8895 -28355 -36152 -29163 -20291 -7097 -30775 -45797 -44135 -30054 -27337 -56272
19220 -56272 -69335 -73693 -20202 29763 29779 8801 -9039 -3470 -21983 -37874 17910 42903 23898
19207 23898 34990 17115 14751 12107 -10404 6005 66611 80969 30806 5374 -27583 -63931
19195 -63931 -64732 -42836 -63237 -73389 -47593 -32520 -60183 -62395 -26462 -26023 -37645 15682 19197
19182 19197 -37427 -46063 -61251 -43317 -39943 -46350 -43470 -25368 -37386 -42769 -33416 14205 49225
19169 49225 13676 6355 20056 7351 -4832 -10902 -23448 -2748 26028 46703 47105 27419
19157 27419 -3831 8731 19988 21505 10514 22727 8479 39777 35369 49133 47511 -8912
19145 -8912 7221 -31934 -85810 -115363 -91969 -46569 -82327 -62376 -50220 -71765 -58059 -26024
19133 -26024 -9045 -476 8133 13885 38374 91229 66584 40515 19755 -20340 12733 25294
19121 25294 4479 -6254 -46449 -51214 -47880 -20773 -38663 -44449 -20023 18858 28323 -11025
19109 -11025 -22583 17266 -28330 -23594 5770 58239 57718 21434 19026 32150 33764 -7803 -32667
19096 -32667 -10838 -23745 -46794 -4056 7936 13841 29540 -12874 -29378 -26458 -71176 -55168
19084 -55168 -18750 -11062 1620 -15656 -32312 -50396 -59822 -61745 -39456 -5827 -22872 -2304
19072 -2304 -2004 51662 52764 24401 14612 28297 81074 69117 39310 37886 -8526 -56529 -91055
19059 -91055 -81004 -46934 -13262 -1272 -22256 -21861 -31029 -52365 -54399 -40803 -32512 -52327 -40470
19046 -40470 -9922 7486 36278 39453 29395 36647 19274 -19350 -54092 -49335 -26301 -8080
19034 -8080 26803 36673 -12105 -11644 12756 17893 5532 21672 -8582 -11172 -14522 -6281 -23829
19021 -23829 -20796 -26775 -20802 -40870 -40275 -52664 -40344 -3884 21466 68518 85331 81777 57853
19008 57853 30125 25056 26733 40582 51964 32225 43295 109000 118690 57645 -7035 18330
18996 18330 38456 9494 655 5952 12547 15114 14956 22417 31933 86720 57993 31276 22245
18983 22245 45114 72497 13185 3571 32392 37559 -3264 -12490 4811 30087 87102 82820
18971 82820 36964 53845 100040 93235 117077 74989 15523 3233 -958 12740 35007 -2110
18959 -2110 -9393 -33636 -43988 -13819 -33707 -43765 21479 58960 -1194 -26460 33271 90917
18947 90917 69379 65139 22152 38636 70718 64722 73014 49655 28550 48718 21608 22600 24075
18934 24075 52029 33769 8563 -2515 37112 40572 -802 -24938 -35645 24669 74654 59267
18922 59267 56010 42021 -789 -12063 -23790 -40570 -38197 15884 98502 144376 120981 46150
18910 46150 22056 -593 -9678 -42730 -2793 42071 49300 36425 -23263 -63937 -36337 6433
18898 6433 5753 43694 44900 43605 48409 38280 10291 -27341 -37809 -3858 16815 35897 47719
18885 47719 40024 20786 -1912 -31353 -39915 26254 39013 54347 76919 70378 109082 110902
18873 110902 110925 62397 14768 -52060 -69187 -54287 -34165 -13545 31254 82748 68211 89447
18861 89447 81783 81832 57602 37625 53436 54204 53513 50366 100374 114907 118412 126069 123273 135212
18847 135212 172316 171289 157511 159788 131894 83217 84266 84216 109128 126564 125973 180608 213079
18834 213079 236762 232389 247122 195854 146303 155606 147722 158507 120078 144954 159231 174298
18822 174298 138485 69037 7708 -17752 1539 29636 57561 48879 58033 80867 60344 36505
18810 36505 18529 -41139 -52907 -16715 42271 35483 22980 35920 75166 75181 85230 56913
18798 56913 53367 37319 14398 -12607 -11747 1378 63462 113218 72558 17749 14697 6068 4925
18785 4925 12124 29151 44947 77479 102207 69594 2631 -10519 -4607 17738 2728 -11264
18773 -11264 13329 33352 106042 78432 32102 39887 133911 215596 261475 285867 291942 268852
18761 268852 238879 209868 132416 100741 43168 8884 1493 29033 11662 19287 -595 -8167
18749 -8167 19301 15654 -25368 22041 26831 47534 75010 58402 46263 32368 -1413 -36299
18737 -36299 -44889 12945 49104 72779 79333 74461 57963 42591 37817 38727 35579 -9054 -34989
18724 -34989 -3044 23210 -11029 -27214 39446 85644 84427 80514 28895 27314 45456 41907
18712 41907 24418 23198 14831 19961 11359 10499 -5634 -23274 -45755 -57762 -36572 31512 70526
18699 70526 13833 6973 40130 25973 -3194 -14706 5550 16611 22471 26703 17468 19893 25462
18686 25462 -21034 -36178 -7787 -33768 -41540 -2264 19594 44540 44044 50419 34780 4975
18674 4975 -5905 -5664 39161 47681 16512 18836 22289 46313 76341 67997 53635 53605 62161 -25141
18660 -25141 -32465 9714 27307 14462 -15072 4211 40547 51626 9026 -22189 -31562 -17757
18648 -17757 -8320 3388 20482 51454 39844 23848 32972 1107 -9380 28337 28598 28154 4753
18635 4753 -14779 21027 79270 77641 97850 49295 -5787 37654 59374 47307 81722 93587
18623 93587 75200 79725 112957 112712 57681 -5829 -40270 -38481 -2339 38633 63786 46307
18611 46307 61316 83666 71411 56297 34228 1850 19005 28236 65381 88955 78827 55876
18599 55876 36171 46309 8884 33477 55262 66715 99397 110242 83565 73451 41292 35554
18587 35554 32393 41600 47273 72721 101974 73783 58492 37330 35298 52328 24985 31553 40326
18574 40326 55347 70500 74669 80219 34537 29986 32693 22607 215 47227 53766 54567 34015
18561 34015 23767 29964 64215 90242 62340 43781 34840 51742 72631 49520 41570 40326
18549 40326 13478 38465 24561 64064 88245 39969 15024 14887 5655 18769 41057 22750
18537 22750 -15354 -5122 10339 82187 87023 88258 78087 76915 64347 35125 25967 5372
18525 5372 69060 81369 50788 105432 100458 48816 69145 79528 49286 35135 15025 12453
18513 12453 22322 22670 22656 41661 49876 25437 8224 -11367 -23174 21158 50740 1477 -28357
18500 -28357 -10936 -3476 12917 34832 -15309 -10173 20098 46544 64627 45103 25677 1504
18488 1504 -27431 -15446 -2739 622 -11502 1343 78911 62832 69971 43310 17241 18990
18476 18990 44446 90182 132917 149977 66407 57794 74058 1986 12112 37733 18792 72680
18464 72680 97531 56281 21627 18113 46572 68147 89150 49819 -8094 -25059 8383 51053
18452 51053 80163 79039 27915 10618 35375 67683 143090 127664 96491 83866 71340 18342
18440 18342 9382 27811 28157 43669 61713 52372 65477 41845 22394 42417 48587 74060 132128
18427 132128 138282 114235 109724 132369 92386 62447 50276 67651 68475 23109 51887 80056
18415 80056 57644 88994 110133 133207 103625 72844 48644 11720 -3069 -22934 -23757 43840
18403 43840 68605 66875 63589 101658 94579 44267 10114 32232 43083 50019 60405 78112
18391 78112 100480 64907 74151 70336 64740 64283 44030 65276 71562 64224 121868 158209 120067
18378 120067 39575 44002 28525 6346 49472 83226 103055 164811 222487 198625 151028 199067
18366 199067 271370 298469 299843 308103 332353 309390 270927 244139 266169 305768 309969 285909
18354 285909 249088 238985 262847 302510 262248 230568 201225 214422 257265 248367 242947 240444
18342 240444 217426 198194 184571 159917 165735 157346 124620 149621 182088 147362 136891 120487
18330 120487 93738 103576 72541 69825 103844 124859 138839 140580 97241 80377 101041 147722
18318 147722 178718 149278 125363 98883 95111 102989 92223 74248 83457 93493 103036 91625
18306 91625 145583 172365 161770 150383 106440 119966 160441 151288 142183 140581 144255 116171
18294 116171 116614 153367 142013 144006 99449 95726 118526 135650 146890 162127 112866 130314
18282 130314 122236 83508 60871 65305 48359 50757 41427 73768 68825 84741 113989 140339
18270 140339 169392 172706 178768 155676 153440 134195 144876 137057 133850 100929 121021 133598
18258 133598 113868 114137 134834 132388 140966 120019 160713 201539 184712 190041 185779 175030 155435
18245 155435 148376 98637 60274 67877 87181 103193 131961 110530 104616 124377 144611 178368
18233 178368 192625 149203 170212 178615 139629 90432 111068 134796 132586 98196 109880 126715
18221 126715 78316 69059 128494 151134 189321 221317 217945 201051 213527 214268 231656 229376
18209 229376 190480 144600 154745 168548 197126 195933 185275 166608 146259 159770 189941 169330
18197 169330 172671 185628 185558 171505 152685 146460 195714 194836 151448 154011 178779 140670 135313
18184 135313 157604 150827 132479 160461 166753 173762 184798 176138 182670 249652 254307 216073 176008
18171 176008 146992 158839 184398 228090 256416 212889 196447 208601 240260 238196 228580 219173
18159 219173 194508 180999 217861 272624 304490 303565 268411 283265 302654 335954 319783 327969
18147 327969 359693 357875 350082 384772 401936 415238 412984 468828 491102 475145 488159 528385
18135 528385 549144 534568 496089 515036 560652 586303 594615 610818 638782 722364 818864 921045
18123 921045 1015066 1150915 1294257 1414006 1581844 1779460 2022959 2273364 2563122 3011508
18113 3011508 3645276 4550797 5930181 8130149 11903129 18625720 29364485 39940019
18105 39940019 45443226 47878032 39185918 25068620 16098552 11486380 8965352 7352674
18097 7352674 6321227 5626405 5045818 4556229 4128023 3750313 3488649 3282621 3109103
18088 3109103 2981498 2857827 2778457 2696312 2622063 2510787 2429433 2339801 2268267 2180465 2108155
18077 2108155 2048436 2012638 1980931 1925443 1887038 1843579 1786304 1752652 1755639 1779632 1824981
18066 1824981 1842284 1844648 1834614 1769381 1711423 1681583 1645395 1622453 1608992 1599727 1564889 1482451
18054 1482451 1382693 1290373 1224716 1165078 1120305 1093833 1072575 997411 982414 947697 942008
18043 942008 918351 909169 891444 856648 795607 806305 795055 742029 681397 637646 642267 692526
18031 692526 689786 677032 612659 569526 566751 599069 594387 613214 643879 673233 662843 563586
18019 563586 516595 564781 557098 549660 551175 574725 569966 556358 532088 499560 475137 441951
18007 441951 470752 508434 442043 408264 392873 413587 482423 526852 490942 462789 421487
17996 421487 433128 436425 375810 407213 423519 428569 394565 365962 387322 420969 451026 490408
17984 490408 562989 606246 631228 649640 699631 715310 690335 649290 619405 573661 611581
17973 611581 625403 608486 607523 566280 541726 469852 386276 311016 333601 334084 353835 331628
17961 331628 301959 287966 259369 206740 178428 201783 249623 264574 228366 219136 236035 243606
17949 243606 310977 332415 331529 307049 276416 235708 195449 197902 180768 199814 216114 216141 233744
17936 233744 255950 204788 149460 132020 131299 152078 167822 176542 199389 205394 231824 213919
17924 213919 201926 201720 163040 141600 137845 127404 173578 164729 176029 210551 227411 200253
17912 200253 171879 194781 199171 191876 188370 133120 147801 167854 160280 139237 126289 154080
17900 154080 177132 179895 147104 139603 155220 154460 129301 94365 86131 140062 146580 103275 73049
17887 73049 85561 132568 136996 148703 144854 170540 157951 118230 116809 120493 105017 135040
17875 135040 131269 132514 165060 189554 165733 143433 113588 77055 109648 142284 130267 122054
17863 122054 144331 162568 153978 185133 202208 176272 170340 236332 247736 301609 339441 324285
17851 324285 389377 432496 404374 391321 412380 445693 495267 533773 501747 446145 419631
17840 419631 435763 413148 385494 316051 276572 303527 313771 292655 261922 261127 248456 223508
17828 223508 238719 271887 257221 228269 187557 224325 264886 214017 186838 207623 223434
17817 223434 235612 261865 211995 151547 139045 186677 239480 203434 167918 179821 195778
17806 195778 189610 148238 143510 168756 219029 249019 283608 242007 232360 216786 188090 193464
17794 193464 161669 135453 213296 218894 233589 247446 257897 244596 251261 304228 327137 322931
17782 322931 353855 345344 283145 237204 276546 293693 323392 345434 346068 406336 462979 565335
17770 565335 632799 704083 821168 965304 1109513 1218613 1274195 1290633 1236316 1164393 1104330
17759 1104330 1153389 1234352 1315968 1438540 1494764 1476089 1485377 1442300 1325760 1245120 1198327
17748 1198327 1148568 1077788 980832 848125 725307 718586 704395 668213 579253 529917 555379
17737 555379 545653 558125 544328 508527 495021 487673 447695 423897 393391 408963 422929 419129
17725 419129 407323 395850 393554 410315 418802 407742 473690 470324 454046 472426 455660 434453
17713 434453 434080 399653 406548 467228 480436 460619 413165 379151 346762 322779 299481 294832
17701 294832 296479 341426 335786 338076 377391 399570 401897 386001 325674 298037 274156 294237
17689 294237 341133 376312 384416 393409 380112 351920 343242 335729 302346 331908 336460 333043 397574
17676 397574 443230 401611 364842 349231 331436 354835 390729 400556 467677 472622 457826 446952
17664 446952 431866 340651 288795 252178 248639 262532 297055 321061 332689 377071 401792 403663
17652 403663 369310 342369 344781 339893 381144 383204 405905 372442 373955 367684 356570 400060
17640 400060 392666 397374 403774 418468 432926 425018 401557 410159 415156 413479 396719 431582 462266
17627 462266 451241 461656 500842 517234 527603 510375 493942 487408 545144 571692 557196 569563
17615 569563 556163 476503 464216 523646 586752 565177 501414 466580 433917 436592 460877 478508
17603 478508 499248 509368 518701 529139 487900 490308 504016 554481 599345 590265 566754 576857
17591 576857 560193 564219 545472 532136 493791 448075 477649 473807 513604 556515 538254 551694
17579 551694 558986 531284 524120 523051 534191 592149 582926 558898 575529 581954 555403 568276
17567 568276 558118 551541 555419 576709 569105 563908 580931 571423 578101 639574 708445 638408 589782
17554 589782 605718 631434 654308 685978 716220 713562 731017 723909 763974 789514 796274 814527
17542 814527 807168 841708 797247 779554 809771 828483 846390 889311 844554 837251 897746 935018
17530 935018 986727 1003804 1016459 1044588 1044591 1102869 1151139 1205169 1303021 1388310 1477013 1552860
17518 1552860 1597054 1580197 1567496 1598419 1635494 1700188 1808668 1904909 1983497 1972860 1964314
17507 1964314 2016688 2037420 2046564 2119938 2284487 2365668 2442132 2561129 2666295 2777773 2853974
17496 2853974 2886979 2978511 3150383 3315838 3491088 3709685 3861563 4044400 4209401 4414193
17486 4414193 4690240 5030771 5500678 6038286 6667007 7489996 8531385 9901085 11760226
17477 11760226 14441546 18372019 24247731 32932851 44591324 57137218 67155903 72241604
17469 72241604 70690696 63991784 58228941 58204761 64658670 74733465 83503809 86927305
17461 86927305 82245514 69265002 53521637 40657058 31944437 26227887 22414696 19735163
17453 19735163 17762486 16233854 14961755 13932706 13071487 12367668 11771069 11189697 10708690
17444 10708690 10392677 10135250 9895645 9670107 9507101 9305544 9015266 8682785 8324400
17435 8324400 8021676 7822608 7704476 7612999 7512754 7418513 7276300 7056530 6816962 6626779
17425 6626779 6483472 6345511 6254166 6227106 6266762 6326326 6409459 6442954 6398321 6298183 6201180
17414 6201180 6178724 6224032 6325826 6473768 6605889 6686345 6774804 6801317 6788813 6870801 7010013
17403 7010013 7272810 7629104 8092999 8661703 9384808 10312329 11573326 13400488 16104268
17394 16104268 20187406 26330491 35227405 46960895 60281693 72700991 81214420 83532349
17386 83532349 79962991 73313601 67610534 65917949 68447010 72891568 76030980 75000932
17378 75000932 68839216 58772404 47557470 37855893 30683459 25760835 22312561 19849749
17370 19849749 18036440 16601389 15466689 14481867 13592814 12838263 12207271 11703925 11217934
17361 11217934 10782166 10437748 10138423 9867994 9599415 9273929 8941749 8603069 8239914
17352 8239914 7958365 7724783 7501202 7307388 7119490 6930144 6753695 6531521 6279581
17343 6279581 6030104 5830336 5625959 5447395 5291590 5151397 5027206 4919130 4732317
17334 4732317 4588876 4454690 4310500 4166744 4069039 3981797 3923577 3886471 3824977 3730050
17324 3730050 3612152 3438559 3295465 3191233 3121534 3013189 2922652 2839395 2825711 2769072
17314 2769072 2697480 2663451 2641874 2572479 2507016 2484342 2418998 2369641 2368699 2322358 2277418 2242758
17302 2242758 2180822 2102217 2071588 2020872 1991961 1954500 1884778 1796085 1741081 1738847 1711447
17291 1711447 1666337 1601775 1614319 1621818 1653511 1644244 1575416 1520283 1503686 1462082 1398082 1321475
17279 1321475 1294658 1307312 1307075 1341288 1322440 1257280 1217294 1135456 1073873 1049991 1039066 1003498
17267 1003498 999929 983350 971782 974881 975510 917805 878633 851363 863355 897406 868292 866223
17255 866223 835390 759382 672713 669154 649890 637367 627958 589667 549624 514329 517912 536642
17243 536642 530975 545405 518451 498781 507763 524615 562819 509720 454313 441714 382573 353646
17231 353646 346161 363095 396618 426748 390718 323767 302444 279543 248089 267244 318684 341584
17219 341584 339255 317881 344363 392797 398896 374644 345426 329728 329531 304456 278653 252646
17207 252646 276647 260026 278847 291781 277242 209983 211740 192754 175001 169274 173387 167459
17195 167459 175069 186643 181427 146066 148553 127239 118968 128447 109473 85913 49320 83498
17183 83498 128665 120570 88665 50074 43691 28671 34834 45123 49364 57272 44613 5985 36362
17170 36362 81758 122789 139164 128804 96556 67364 69901 69554 98301 99190 66512 12819 -29828
17157 -29828 -46725 -26704 15367 82536 97915 84176 65951 58008 46236 1851 -26181 4179
17145 4179 22984 27415 8231 -31908 -49166 -48001 -27946 -2224 7328 -11388 -5993 -9780 -34232
17132 -34232 -52906 -57855 -35399 -34273 -35114 -50179 -72371 -62956 -47423 -55218 -50319 -79116 -75768
17119 -75768 -67332 -37543 -12560 -534 -20714 -14292 49696 81258 61928 -16220 -111288 -144067
17107 -144067 -149940 -97466 -57963 -33086 -39840 -49230 -32924 -36552 -14023 -23079 -39960 -24334
17095 -24334 -51747 -9857 -34723 -37636 -16336 18407 3162 -44675 -16789 -14262 -50695 -33839
17083 -33839 -42511 -71216 -69997 -43416 -53664 -36859 -25201 -53922 -41490 -22805 -38564 -92345
17071 -92345 -73881 -29176 -40682 -37142 -10904 4962 6794 -7859 -53884 -42536 -19286 -35498
17059 -35498 -10619 -36553 -41280 -35446 -41516 -55930 -80292 -89159 -72931 -17279 -27443 -28596 7819
17046 7819 50863 26743 -16565 -32744 -32117 -41057 -65986 -51438 -54723 -40550 -55980 -88920 -126986
17033 -126986 -132356 -99798 -88632 -87917 -35231 -16406 -17592 -45534 -39740 -15938 520 -1578 1819
17020 1819 15131 -2712 -41638 -31846 -38769 -56138 -58889 -66141 -55123 -72540 -76780 -38095 45184
17007 45184 24586 -6948 24625 13341 -18155 -54558 -59171 -39476 -49769 -34041 -8231 10090
16995 10090 6567 -26877 -40527 -81338 -65916 -71226 -54656 -66009 -71815 -26692 -13569 -36814
16983 -36814 -31352 -32516 -31755 10475 13755 32739 43488 60255 38021 19322 11427 18245 33293
16970 33293 57624 5177 -47185 -35875 -20850 -42831 -35267 -51634 5523 15487 17660 1382
16958 1382 -15392 -1186 18798 4372 -7460 14304 21107 26185 -5775 -23441 -8874 -21544
16946 -21544 -27261 7117 -44614 -81013 -79268 -66629 -22860 -24861 -47622 -47285 -38211 -6046 40083
16933 40083 61006 34698 -13878 -733 -26716 -46558 -17152 -6235 7344 19746 37811 113994
16921 113994 110748 90512 42235 16161 9594 -10569 -52277 -43248 4286 15709 12283 11925 -30596
16908 -30596 -18016 -12353 -33757 -24205 -262 29555 21169 2473 -7611 -10499 -11113 -5862 13445
16895 13445 -2587 3987 14573 -4216 -26582 -37407 -15808 9455 18166 2015 16073 15799
16883 15799 49225 94590 133339 145192 101958 61667 55803 76124 124790 166782 178598 163752
16871 163752 148374 166949 251321 314395 358402 406384 393525 340827 319825 319377 365621 380356
16859 380356 411995 404621 384933 339781 280263 220176 162650 142335 140189 131466 146940 92968
16847 92968 59183 50644 69591 40613 30388 80838 93854 78408 59632 39163 43336 40570
16835 40570 85697 88368 92391 138462 118544 75907 90751 97420 68397 63353 71181 117373 130466
16822 130466 141207 159987 161537 129055 107780 88771 90135 89752 75575 59096 53941 87099
16810 87099 165445 165693 186473 174942 129044 101284 84873 108716 124223 85188 91023 130649
16798 130649 164187 178403 164020 181593 261690 298237 282141 317870 379660 466793 497149
16787 497149 491675 469723 444549 420075 453390 475932 461195 516069 511081 445366 368992 316907
16775 316907 287259 253381 264115 267686 252375 214569 197392 169902 162664 155569 171314 171835
16763 171835 199866 183190 155870 176993 168728 150952 141694 120874 133528 146270 130414 152428
16751 152428 154943 206671 239590 220234 189809 200430 234549 209329 140880 86194 113693 140966
16739 140966 164135 178357 164496 189998 183359 182270 170002 210762 221555 246992 207902 183876
16727 183876 188045 190144 170609 178663 187829 183537 209175 227972 275310 296787 261265 234662
16715 234662 211777 240561 227879 216686 211884 198966 196729 193730 140835 167198 218710 202960
16703 202960 205547 225397 226782 171347 175689 220319 209219 201637 184790 197652 266866 283902
16691 283902 267022 247495 235891 228621 245185 288830 300277 272974 284878 296054 311329 295131
16679 295131 238777 167965 172017 182158 197508 227729 262878 321692 345172 312033 318819 293009
16667 293009 273269 251327 261393 319692 338743 324254 311562 287038 266547 263001 280661 281541
16655 281541 299273 274215 221148 232321 244965 245532 258413 296051 294851 326459 375510 365515
16643 365515 342588 323742 297657 295461 317140 321554 312202 296199 295009 302686 353271 374922
16631 374922 335824 307021 318220 342287 356229 306468 327442 378890 363855 347838 352302 373016
16619 373016 347910 363499 371916 377427 382720 413620 410870 416807 395585 405419 381075 339929 330350
16606 330350 367845 442413 444444 460269 467308 448876 425550 463623 479878 472069 477934 454235
16594 454235 425859 422697 418509 447539 485160 479102 449478 430970 432250 502224 529302 474736
16582 474736 481155 585603 561530 515003 439360 440081 459418 448831 432985 450618 496898 528381
16570 528381 550808 569821 593457 577375 547723 546866 503931 474498 464059 501426 533067 544054
16558 544054 532560 507720 505229 533668 556590 515574 513397 582405 589859 614812 603801 623180
16546 623180 669444 660560 669749 666924 654733 637517 639051 654052 628706 642949 651418 676182
16534 676182 717993 762754 778218 797700 803627 816479 783957 754372 742258 707502 703207 690579
16522 690579 699460 749818 785078 748990 707485 747816 794287 794457 761180 767271 760880 729923
16510 729923 741501 804300 856095 882591 941838 949754 888760 869720 937034 969482 959279 927756
16498 927756 924449 936778 952375 952002 967395 989352 999219 989632 979013 986038 1024491 1031336 1079577
16485 1079577 1144282 1163623 1155576 1127521 1087541 1052323 1045310 1023027 1050672 1089454 1093411 1125828
16473 1125828 1091824 1112925 1141872 1157364 1142538 1125529 1109956 1123421 1174911 1250169 1277487
16462 1277487 1304599 1307964 1332137 1343553 1378884 1387598 1355469 1393031 1438786 1414638 1376185 1409117
16450 1409117 1429041 1465568 1521880 1530015 1542849 1555843 1564602 1556670 1542588 1527223 1583514 1614369
16438 1614369 1607899 1614742 1637736 1678797 1710930 1721447 1763496 1790205 1820158 1818796 1802866 1798226
16426 1798226 1825922 1841242 1851540 1900501 1916570 1890665 1942500 2038127 2081435 2094781 2070227
16415 2070227 2058765 2078114 2072580 2077838 2113235 2141022 2188433 2250943 2277080 2293107 2285607 2297795
16403 2297795 2336045 2385819 2445433 2475141 2507467 2547603 2573983 2606650 2630397 2638099 2628932 2661664
16391 2661664 2673694 2714876 2748755 2711715 2753482 2773178 2798747 2838720 2884747 2933333 2976768
16380 2976768 2977551 3022959 3076035 3145893 3236000 3259528 3249444 3270911 3315221 3343502 3368865 3417543
16368 3417543 3451049 3505500 3572014 3606759 3615935 3670216 3728240 3760828 3785281 3826359 3859829
16357 3859829 3871821 3937960 3989741 4020066 4092600 4147438 4143612 4162843 4207681 4250455 4318204
16346 4318204 4361064 4420504 4445022 4443753 4436214 4490862 4525111 4540298 4609733 4717571 4773827
16335 4773827 4790464 4852101 4894344 4948860 4999707 5040944 5093170 5132939 5131988 5147595 5188271 5259826
16323 5259826 5292410 5375322 5387210 5396557 5439761 5477787 5511441 5549349 5568847 5579250 5593922
16312 5593922 5662555 5735033 5772970 5824243 5888564 5907281 5873427 5852972 5856953 5897737 5950855
16301 5950855 5995600 5985656 6008303 6039180 6015263 6028151 6093014 6174770 6239648 6240539 6205113 6183956
16289 6183956 6112916 6066391 6097732 6169811 6216037 6237798 6263317 6265654 6197155 6151760 6135569
16278 6135569 6136065 6130741 6118728 6135709 6114139 6064181 6065175 6061333 6077863 6046801 6018388 5989376
16266 5989376 5972782 5967401 5957675 5930058 5877960 5824694 5812113 5831776 5828619 5793068 5737276 5686137
16254 5686137 5667453 5649231 5613370 5576325 5525333 5499772 5477027 5433623 5400176 5348559 5352127
16243 5352127 5349249 5329710 5271478 5213903 5193913 5152781 5089871 5069483 5032407 5001095 4998439 4974088
16231 4974088 4964056 4915316 4868492 4852017 4820422 4741805 4662231 4602283 4622977 4629661 4570792
16220 4570792 4499366 4439821 4397916 4367929 4316596 4238849 4237637 4259881 4218024 4160274 4108247
16209 4108247 4033872 3980643 3969811 3913942 3881422 3906707 3893408 3806829 3713131 3678669 3687510
16198 3687510 3692361 3705181 3689430 3612044 3530720 3480039 3489551 3438243 3387972 3337605 3308013 3294235
16186 3294235 3272531 3244449 3213651 3223610 3231242 3199515 3169551 3131056 3113523 3056620 3025680 2995284
16174 2995284 2950460 2929138 2910064 2915140 2889240 2811341 2764104 2732874 2675020 2629166 2608266
16163 2608266 2620920 2624781 2649112 2667019 2665570 2652015 2618554 2585485 2520400 2482051 2433070 2404411
16151 2404411 2388289 2361908 2380262 2337971 2305133 2266097 2238156 2219337 2265257 2281584 2255399
16140 2255399 2226999 2191742 2180921 2167195 2099119 2062008 2069994 2034414 2018404 1989287 1971754
16129 1971754 1982421 1952741 1902307 1877327 1859741 1880272 1875474 1876323 1847547 1821819 1800724 1753630
16117 1753630 1731992 1695683 1692456 1717719 1732982 1710432 1695224 1645266 1608717 1614088 1605975 1563691
16105 1563691 1529989 1470104 1469077 1466068 1462183 1451468 1427201 1392029 1406162 1429693 1462314 1437922
16093 1437922 1415676 1371278 1362324 1377920 1368993 1357770 1371003 1329311 1254235 1247759 1270766 1254018
16081 1254018 1203756 1194999 1212994 1243425 1252952 1212070 1192202 1185364 1200222 1196004 1170797 1172074
16069 1172074 1200764 1231056 1261523 1222397 1127537 1075291 1084070 1059888 1050682 1048895 1048155 1035004
16057 1035004 1012419 1014816 1005362 993033 1003624 1004046 1020487 1016374 978717 976461 985787 956357 924898
16044 924898 937114 968835 952117 951325 963975 930843 859657 838774 863789 889889 913758 880010
16032 880010 816844 811431 825022 855719 868974 886287 876518 844856 808564 782569 785307 798840
16020 798840 785092 766955 741944 755337 769327 769670 747187 717061 674255 651027 653739 672385
16008 672385 671972 626267 650449 662351 650835 670193 711750 686274 662508 680826 707095 651899
15996 651899 636136 640740 664977 662357 628300 643028 640391 606845 603852 590444 593600 611366
15984 611366 563712 531516 526596 547140 559546 577736 574509 569055 563178 585052 569238 569275 555546
15971 555546 516031 507211 486704 499942 505999 535681 532714 545615 523628 523260 531901 523319 496510
15958 496510 508470 518738 491061 475100 465156 463752 453621 437144 426961 435047 430324 416152
15946 416152 410839 433398 408015 375482 386630 438704 485701 483251 450738 434301 449541 436614
15934 436614 411456 412465 435901 437085 388370 363125 375929 385136 374148 329231 353636 378790
15922 378790 360002 352062 331569 328587 345602 403041 409214 398781 333693 326259 360645 381269
15910 381269 363226 369288 366226 365254 396736 367848 310115 307561 304172 318203 344896 309887 311821
15897 311821 293362 329423 380793 375631 328007 358570 414155 364634 299085 268542 271617 304366
15885 304366 321097 283745 255164 234349 257785 259439 258247 260049 248495 278056 313411 319706
15873 319706 307684 282025 250807 220373 230521 258232 220897 218448 184447 173725 209194 233061
15861 233061 232055 250522 220014 195541 234758 279359 333438 297090 226968 197618 208291 193442
15849 193442 169894 196356 221426 230238 204040 191586 207941 176414 168946 185082 209416 208452
15837 208452 191726 186370 165237 151146 194270 202818 189972 179182 208702 207729 222725 211335
15825 211335 212790 188187 188025 193855 184372 164556 166056 175297 176818 209445 201096 184834 184356 205878
15811 205878 205376 203508 197012 184232 190905 174783 171382 173654 176689 200351 213092 209664 238094
15798 238094 201064 174443 202903 187606 151920 92334 58572 46179 89781 143940 145339 125334
15786 125334 146930 120480 82257 85016 138558 151519 168580 158713 150374 170881 188856 205809
15774 205809 204199 187898 167714 160283 186327 171418 156879 126508 144233 164213 195401 222186
15762 222186 207115 158769 131006 90644 105237 120085 121739 139776 122651 131987 97198 90018
15750 90018 96768 100445 116109 95502 117006 150413 192190 180232 144127 113148 128595 125083
15738 125083 126102 129070 126932 124160 79644 80137 52017 25816 7506 20905 79417 96406 66525
15725 66525 77671 78567 47962 38850 80211 114436 96110 112503 94825 96226 66978 52501
15713 52501 61429 45701 59251 60344 61923 80383 57595 30681 43692 76575 93467 85660
15701 85660 72033 82081 74827 94843 100015 94177 92681 97774 149809 130584 126654 65501 65762
15688 65762 81918 99311 120355 68417 51297 68386 115144 90650 104387 80564 3829 6461
15676 6461 32682 76640 73035 71772 87495 66770 90730 59469 61831 55743 87853 108048 51666
15663 51666 46086 46257 7213 6798 63847 71645 39461 47975 63259 86843 78746 91762 82193
15650 82193 33009 -355 4529 36067 52488 48218 5487 -14083 -22978 8413 -10845 20459
15638 20459 16879 26234 41459 93711 145156 118659 91440 53822 75957 123524 95591 38621
15626 38621 38778 48206 46714 62786 53949 19300 8504 -1970 -11416 4928 78429 112415 106919
15613 106919 81363 58972 66273 35570 41443 55502 24355 -20521 -24497 -5970 -36022 -10748
15601 -10748 40148 61985 76770 84944 81392 57634 47613 73962 86189 39308 3624 12686
15589 12686 32926 36256 61135 37696 -24588 -42064 -37537 -4393 12388 -7957 13876 19461
15577 19461 75383 79890 65046 47111 -1606 -3184 -42339 -21936 41360 44488 17386 29029
15565 29029 83773 73138 66874 45077 39208 20859 -10168 -45341 -46456 -16475 10801 15650
15553 15650 -28979 -15055 28432 56331 96967 96295 40147 11561 8570 -1538 -1135 26545 42068
15540 42068 84614 98220 76461 46559 40190 40883 39341 -10407 -12892 15302 72584 78497 52180
15527 52180 2108 9536 -40426 -58269 -57716 -44075 2252 22539 61272 29358 -1506 -10685
15515 -10685 54278 84274 72207 80506 84181 65755 5023 -12660 842 -29068 -30000 21989
15503 21989 13610 15017 64351 43481 45531 30969 7314 -25123 -39779 -22231 -9893 22606
15491 22606 31159 40600 61803 68821 55029 49341 60151 87659 74588 -11702 -3659 48416 39608
15478 39608 -12774 -7375 28388 60680 81108 64030 18843 2250 -43259 -16380 15069 6182
15466 6182 11008 -7034 10085 1180 -13919 8991 10763 -15909 -40994 -18848 4915 20122
15454 20122 10388 10355 6735 -9808 -27751 6211 -7822 -8561 24613 1686 7117 20265 3750
15441 3750 6338 28215 50394 64698 22933 -1617 -17235 -4313 33863 4356 -4867 26688
15429 26688 52648 48401 25964 7051 10620 -5367 -9277 -9726 -14413 -20039 -13710 -30131 -41307
15416 -41307 -9829 25512 40512 21457 80566 103798 88585 84841 90605 70772 65291 51011
15404 51011 34646 31442 35204 47495 114579 109756 30348 -15714 2784 20189 -16810 -30414
15392 -30414 -26265 -33039 -47412 -39145 -10217 20083 1315 9744 3047 -7448 -4928 951 -6275
15379 -6275 6383 40553 56014 67610 52978 54673 37408 35950 26353 -19818 -14900 36229 48779
15366 48779 31016 62081 46500 49323 39968 -288 -37100 -24125 -26598 -29913 27322 27770 14538
15353 14538 -13778 -12141 -24332 -1530 -11707 -1930 45357 60342 16958 3946 33534 45993
15341 45993 -3963 -21747 -51243 -57080 -45588 1746 18395 5715 -7916 -3633 -29143 -31474
15329 -31474 -21803 -17159 -50990 -950 -1972 9026 38003 27813 15262 15781 20626 20273 -19863
15316 -19863 687 16544 12076 5843 -8268 5504 -12649 -42018 -24223 9360 8570 6218 6726
15303 6726 17989 14369 -22269 -32448 -17641 -6860 52940 89271 72769 32182 17717 15328
15291 15328 16388 -11616 -7367 -28532 -29801 -23604 -35034 -34521 -7625 13398 6336 109 6187
15278 6187 -11441 -26973 -501 1362 7071 -8182 579 -8940 3075 -2987 22574 28612 11523
15265 11523 -5786 -24956 29880 16021 17119 82195 50752 22213 23965 -21605 -55422 -97966
15253 -97966 -120066 -96237 -68397 -67332 -103797 -87363 -61664 -39071 -5253 -3909 3590 33533
15241 33533 83 -52466 -60591 -14484 -2854 10836 -14254 -35634 -32777 -11670 -17221 3541
15229 3541 -1487 -31326 -7552 -13128 -22899 -33699 -44928 -95615 -92165 -78693 -69962 -59992 -35922
15216 -35922 -39286 -73018 -46686 -33399 -44953 -20945 -44350 -70477 -112694 -139660 -89057 -50602
15204 -50602 -28137 -15597 -9407 -31926 -16054 -21461 -34966 11068 41465 -565 -18516 -45527
15192 -45527 -53104 -35915 -65204 -83686 -96132 -72785 -74905 -97603 -128081 -129259 -53607 -17201
15180 -17201 -24305 -30510 -17437 -55649 -95277 -99429 -74856 -43707 15511 52820 -25471 -51814
15168 -51814 -32614 -11377 1276 27231 -15275 -51439 -17958 8696 -9421 -14988 -17262 -48393
15156 -48393 -67755 -23235 19323 1802 66022 86329 46489 40679 -18804 -49309 -49134 -14333
15144 -14333 417 -39087 -86444 -94926 -52268 -29836 -20720 -24716 -28707 -53038 -27482 -15006
15132 -15006 -29906 5591 40958 69369 46825 30774 19763 11101 -23654 -47447 -44226 -76144
15120 -76144 -66486 -34090 -34314 -31848 -33361 -24307 -26485 -49171 -51256 -26913 -14378 -32980 -56605
15107 -56605 -56144 -29221 -37649 -54010 -64698 -24732 -50657 -48701 -13451 -56645 -57653 -41513 -38420
15094 -38420 -18060 -8751 -41225 -73645 -95501 -81228 -57862 -69524 -79569 -48731 -22292 -46269
15082 -46269 -33640 -71058 -65931 -54238 -55641 -30468 -8104 -11842 3621 19344 37169 29773
15070 29773 37687 17203 41738 42245 35454 50154 17715 -16294 -10369 23045 41428 -23826 -44980
15057 -44980 -45555 -24139 -682 -20106 -19780 -49814 -3434 12310 17 -29946 -45307 -44455 -20303
15044 -20303 -3132 -33549 -84468 -101106 -111850 -116613 -76990 -64525 -51126 -53786 -11493 -4198
15032 -4198 -28302 -52160 -39255 -25004 -4217 -15274 -10989 2775 9094 99 -51262 -51201 -7050
15019 -7050 16824 18436 37817 32163 14970 5290 15681 13479 21915 27218 -7051 -37703 -14754
15006 -14754 -3583 -6250 -19038 -44845 -39786 7352 28297 22994 16995 53437 91368 107513
14994 107513 214785 340428 426518 431229 336632 235088 167942 72801 -3362 19625 20400
14983 20400 26606 -2475 1639 -21930 -48205 -50375 -32230 -39120 -45695 -75574 -86792 -58461 -65244
14970 -65244 2087 36289 -17897 -49738 -55386 -41230 -7315 2373 -8610 -25267 -53851 -55675
14958 -55675 -57928 -56667 -68122 -84936 -83872 -7076 40157 32826 72080 85821 57361 21317
14946 21317 17275 24816 29348 -29337 -97428 -79756 -70202 -36339 -36764 -10482 -25559 -57450 -56296
14933 -56296 -24805 10419 -29224 -69710 -49098 -18374 3293 -16123 -37070 -30813 -3315 -25387
14921 -25387 20841 71425 103205 62948 73793 86805 45747 19749 -10524 -49884 -55557 -45764
14909 -45764 -30573 -18609 -8082 54022 117532 116504 85747 61459 49027 -718 -52382 -72642
14897 -72642 -74275 -72616 -24862 3585 -609 30 -23448 -45296 -27712 -35426 -7859 -9770 -67672
14884 -67672 -84054 -108418 -64015 -42242 -35032 -34347 -34356 -19534 25986 22572 -20689 -34904 -9848
14871 -9848 -69488 -64779 -3361 1693 12861 46076 53059 35487 35603 56837 57102 43023 20024
14858 20024 15109 396 -3137 -33739 -51316 -28564 11952 25562 51456 101786 77077 29290
14846 29290 6929 17156 8867 40768 12782 -20081 -15908 -2383 -11902 -28219 -6482 17778
14834 17778 6504 -45645 -55661 -42289 -56774 -49797 -14903 4196 -29341 -28703 -58871 -81869
14822 -81869 -85578 -76961 -27172 39686 23086 -3138 19106 2832 -9565 -23681 -30890 -15808
14810 -15808 17634 49926 72349 77108 69156 28583 -35727 -67463 -48688 -11220 14699 34605
14798 34605 12178 1161 7108 13238 6361 6727 -13615 4246 -4892 -3239 -14918 -79053 -67075
14785 -67075 -42245 49592 45410 15885 7175 -16487 -20257 -1881 23280 17696 47025 22080
14773 22080 -21427 -36765 7983 -5574 20947 -2641 -33875 -21215 -24081 41167 68587 30984
14761 30984 -19331 -48050 -22451 -24528 -51092 -93633 -116222 -122412 -95082 -60665 -36911 14306
14749 14306 25611 -1761 -34199 -34837 -26397 -43850 -39712 -26051 -69848 -85888 -71716 -33033
14737 -33033 -48685 -86423 -57450 -20561 -7552 23332 18317 22868 16694 11956 9827 1358 -5839
14724 -5839 10747 43461 61048 14123 -20924 -74399 -84492 -74403 -84947 -64647 -18689 -32609
14712 -32609 -51705 -62955 -24085 -18954 -21501 -8591 -8835 1178 3800 21664 -8729 -4324 -12174
14699 -12174 -30470 -31838 -20068 -21001 -45961 -37121 -25743 -874 -26159 -59736 -60019 -52917 -48338
14686 -48338 -49123 -37693 -22255 -16824 -2351 -14409 -5492 -31447 -25820 -56725 -83456 -31973 -10123
14673 -10123 38753 47812 1725 -54257 -76513 -41875 -23342 -20581 -16119 -25465 8677 22235
14661 22235 18732 15016 25267 3665 -2452 -51465 -57941 -42374 -55633 -59215 -37545 -26295 -4633
14648 -4633 -56982 -72580 -53757 -32243 -33682 13165 14724 47849 18265 -1279 -256 16968
14636 16968 2787 21089 13419 17538 19494 17904 11768 -15576 -32271 -38579 -8292 14798 53051
14623 53051 6538 -18447 -11632 -22685 -37518 6953 45049 -2750 11932 43882 68328 53298
14611 53298 -6930 -43572 -46515 -57826 620 46181 28875 21206 30083 -13292 -55761 -84556
14599 -84556 -43539 -35192 -61769 -47992 -35822 -54467 -66543 -49577 21525 36246 31328 14190
14587 14190 25520 33529 -1554 -22446 -32595 -79297 -113718 -50947 49541 62493 45701 41591
14575 41591 20645 22499 -1370 30322 78062 52582 65124 95735 64950 79366 76817 31481
14563 31481 46955 71071 66049 51860 59646 82971 63090 48737 34661 34291 60402 53049 42500
14550 42500 30334 28510 49016 70220 89229 24713 -60032 -55728 18022 82871 28406 -8595
14538 -8595 -7937 -12109 -12820 16896 -7379 -28646 35871 66905 54221 16671 -5321 15234 19379
14525 19379 35882 14105 28488 26032 30594 67905 64316 16131 -8862 -5822 14392 -21683
14513 -21683 -32028 -30109 -17552 -23800 -31347 -19806 -17686 1342 -23643 -47749 -52202 -27901 -40339
14500 -40339 -34429 -38643 -42800 -11802 31235 44500 44710 48057 600 5696 76363 106102 55507
14487 55507 55498 55389 35939 7534 5587 16983 -37902 -56820 -37565 -2191 42458 25911 -41048
14474 -41048 -56382 -102240 -130096 -86874 -97310 -115187 -57796 -10570 14670 30631 55904 58500
14462 58500 45223 56508 19829 -37430 -15588 25541 18234 -21656 -36688 1690 7538 -12015
14450 -12015 -23883 -22606 -16196 -12151 4710 -7197 -15238 -6635 44267 48199 55301 56075 78966
14437 78966 31830 34421 -19473 -36045 -33273 -33504 -22664 -22578 -12289 -13950 -459 -30298 -32551
14424 -32551 57104 84941 52782 54706 71790 48016 23264 -14574 -5459 27047 70428 104618
14412 104618 92469 118721 130586 170846 167114 172720 182344 178005 123712 125193 147785 131435
14400 131435 121974 125323 138377 147852 160814 155145 205971 233176 247068 273619 296543 386348
14388 386348 437423 461959 558086 685906 855594 1045577 1131194 1195089 1184399 1026105 903159
14377 903159 795330 726828 640975 547044 528327 514581 510816 521893 534374 494440 525294
14366 525294 604835 715801 857464 1075820 1312032 1650895 2176431 2837630 3515619 4028336
14356 4028336 4189202 3966467 3478432 2885652 2347421 1940271 1627186 1324601 1120076
14347 1120076 1000528 916730 857395 803793 686509 633393 594888 574866 567320 499430 454216
14336 454216 470010 473528 452133 436632 407421 414545 439192 404795 413425 392021 340867 325733
14324 325733 329067 276761 262079 235588 239343 228594 225081 212667 228389 212760 195823 220583
14312 220583 217112 230053 237074 225029 181545 157125 198446 241161 217510 199039 160321 134166
14300 134166 95608 101029 158805 202460 190919 167692 169845 164013 145500 122337 108228 100038
14288 100038 94230 92313 116860 138614 138894 149191 163278 155883 136645 89880 60951 34210
14276 34210 47792 81913 107275 162725 150688 124540 153694 170910 124164 108305 116228 91518
14264 91518 92430 94814 116402 100800 75465 55984 96215 111403 43794 69562 105174 74467
14252 74467 73190 93062 99171 115331 107720 96654 88854 58745 37658 7035 30234 47429
14240 47429 30978 16871 36347 57309 99473 121360 126360 107489 86735 52165 47427 47754
14228 47754 35979 24388 -4218 -9586 -13820 -48433 14772 39507 56873 72806 41750 27907
14216 27907 9391 57461 97269 96768 56729 43033 50734 60655 66990 70578 58830 84535 103364
14203 103364 91042 65255 88080 164025 149473 144936 168063 148001 115360 85360 63127 56219
14191 56219 92466 150203 193167 173354 164820 213018 229769 256731 224887 184231 189011 172279
14179 172279 145835 134660 135079 130861 127802 92121 74694 88589 174176 158159 115430 142521
14167 142521 177315 169334 159071 161419 150431 118225 128820 106024 91051 74707 71307 84528
14155 84528 154609 169084 158194 164707 163203 140669 127453 83140 44422 59706 73594 99440
14143 99440 112805 81403 31262 18215 22623 45380 50500 78753 117512 105411 73584 109091
14131 109091 130067 149857 155112 174119 171802 99234 97252 132552 122938 126930 126328 84299 53833
14118 53833 47427 76945 74194 17087 36189 47922 59535 67571 63001 67252 90319 114233 122774
14105 122774 176656 193546 144311 121683 116261 143281 160745 153780 185855 202771 221270 224002
14093 224002 212127 221710 194336 108434 20604 27464 103191 153882 161347 160137 119177 133079
14081 133079 179175 175469 151825 147013 183640 194144 197116 211202 208370 218586 246527 241667
14069 241667 200873 228556 255014 278202 306003 335173 309521 321151 398560 470802 492090
14058 492090 458194 418296 376814 335907 262853 279617 276280 251126 270034 270319 282001 285326
14046 285326 258346 248428 225155 219120 261631 291246 340589 376448 389536 376330 381027 384918
14034 384918 387034 391742 405741 366248 352444 382824 394495 417222 430539 409930 374556 382778
14022 382778 454278 501096 511350 508430 508594 528659 547650 532303 506424 468685 488423 503216
14010 503216 469563 466226 461975 530666 584263 612789 651428 639190 643415 719606 740122 733669
13998 733669 733294 784529 843366 856049 865239 900256 966930 1048524 1039480 994782 992747 1031589
13986 1031589 1117140 1106485 1137240 1223113 1284198 1370550 1419791 1488543 1539735 1536997 1553168
13975 1553168 1639897 1763091 1827074 1895242 1997851 2101263 2236125 2320847 2383334 2516826
13965 2516826 2644568 2778079 2961069 3145877 3397891 3582747 3809863 4105227 4425105
13956 4425105 4801786 5225273 5729068 6287586 6947951 7753385 8727105 9935039 11378553
13947 11378553 13036530 14926315 17126457 19770758 22988379 27075215 32560679 40040391
13939 40040391 50492352 65311127 86397133 115401422 151698336 189997972 221142779
13932 221142779 236085561 229285299 202621895 166253024 131816713 105019235 85701329
13925 85701329 71840133 61732221 54098105 48198211 43522909 39746585 36636910 34019619
13917 34019619 31749871 29785828 28119584 26690317 25386252 24240253 23134746 22120759
13909 22120759 21160305 20243224 19443846 18676287 17923175 17219301 16554750 15983297 15463779
13900 15463779 15012525 14550492 14085267 13647556 13240858 12883535 12526470 12210822 11870442
13891 11870442 11505962 11190238 10894141 10530562 10206524 9933883 9659330 9417437 9148350
13882 9148350 8890070 8663639 8470743 8275913 8136197 7928121 7730494 7501122 7251512
13873 7251512 7058416 6889415 6753498 6594653 6444334 6292901 6145044 6023848 5891676
13864 5891676 5747245 5556745 5398123 5269498 5197077 5108265 5036856 5023972 4996942 4919152
13854 4919152 4833396 4742883 4632638 4534671 4436133 4340479 4189738 4047770 3950096 3895657 3838861
13843 3838861 3727253 3623501 3567277 3488917 3490058 3507140 3429060 3338904 3288163 3240769 3173869
13832 3173869 3123471 3107150 3041768 2980558 2956218 2918037 2852658 2739664 2682363 2618645 2587926
13821 2587926 2492649 2472657 2430827 2381958 2316397 2254730 2226893 2204434 2173569 2173214 2167601 2166838
13809 2166838 2142562 2109990 2038115 1949179 1878170 1783726 1742942 1702842 1639705 1616924 1579227
13798 1579227 1564865 1554265 1521267 1518203 1481100 1479296 1500284 1532249 1525819 1423890 1364655 1339949
13786 1339949 1312391 1289528 1246318 1174414 1139477 1130833 1146345 1116199 1048897 1013517 998148
13775 998148 1007297 985668 929213 870901 880829 927055 939013 918409 914924 854844 837259 845778
13763 845778 837760 828023 826213 802418 775525 781003 768950 766605 757780 733757 706710 690012 693133
13750 693133 676072 668282 657205 645491 633752 597602 553868 529262 505153 509506 485538 482868
13738 482868 466065 419417 460376 483533 493408 473830 429844 380979 389703 453241 506409 480997
13726 480997 424399 404661 401261 428708 446354 360196 325681 367585 411375 439753 407222 407234
13714 407234 372743 356288 378921 365400 385069 385592 383481 418113 406836 398653 367949 392641
13702 392641 330107 297167 309850 326197 315069 302624 287181 278337 286955 266167 287407 263051
13690 263051 242103 252370 266722 262417 236813 228915 231508 161431 117833 150748 146749 134856
13678 134856 142938 168823 191275 195808 173195 111837 121427 176887 131427 118398 138305 158489
13666 158489 138014 136059 124926 94292 119643 128091 110291 136904 120537 71145 52504 79346
13654 79346 104688 127944 152375 156192 113799 68470 76990 66295 59831 85434 110480 102751
13642 102751 120712 150051 135645 108107 74973 55533 66177 99223 132402 117301 90078
13631 90078 60516 52912 55328 98950 92576 49205 34094 36035 47114 49481 28889 49237 94380
13618 94380 86178 37906 46691 50995 48501 63423 6991 -8237 -22562 -5763 21418 8522
13606 8522 13126 37628 37206 41162 32971 -12705 -30457 -15745 -10157 -23254 -54030 -75314 -20116
13593 -20116 20262 8065 29485 26276 25311 27245 52565 59743 33218 -947 -842 27777 -12511
13580 -12511 -23119 -15357 -38121 -75029 -83499 -39401 7637 -16251 -25930 -9808 -44955 -29173
13568 -29173 20416 46871 5193 16614 5202 -4054 -38567 -5347 13053 4772 -18891 -4182
13556 -4182 -2029 16420 11666 -28669 -16119 -45579 -63806 -30210 -41306 -41293 -18640 -5473 9486
13543 9486 23169 24475 -5957 16806 15314 -14732 -16153 16354 42552 63695 36379 -6105
13531 -6105 8733 37343 21613 -26125 -26374 -25497 388 32545 7471 -30307 -11174 16395 23053
13518 23053 35384 28051 11332 30910 -5195 -21356 -60744 -82393 -7107 17586 -5893 -28614
13506 -28614 -41690 -75032 -80511 -65182 -26349 -44576 -87743 -85060 -28592 -7681 -16654 10561
13494 10561 -4616 4313 -10255 14420 46061 51827 60802 81894 119116 191647 206136 230577
13482 230577 291505 359328 467724 605481 770052 933461 1002585 975302 901231 734834
13472 734834 590039 491545 416492 363471 318406 268700 216789 163386 145394 119547 86819
13461 86819 81311 106920 107161 75750 77251 81664 98697 119899 84115 44879 7596 -23569 6075
13448 6075 19271 57024 28498 11641 70218 112897 88318 82746 119632 74314 54736 82991
13436 82991 88898 80196 98375 64625 11000 -6787 20611 70759 55345 42291 43667 -11130
13424 -11130 -6121 4146 -28153 -8094 11789 -18364 -38653 -47863 -30814 -63915 -72296 -79667
13412 -79667 -61683 -76040 -63704 -97241 -111816 -125012 -126407 -88835 -71862 -30387 12760 -25936
13400 -25936 -84215 -123358 -135739 -113784 -121779 -107243 -50302 -49361 -60354 -57281 -67795 -20880
13388 -20880 -26604 -87143 -71995 -47792 -81357 -98024 -104443 -75164 -10229 -33753 -65346 -59477
13376 -59477 -44572 -51333 -30174 -21881 -29356 -18779 3762 -23400 -70588 -117954 -52390 27686
13364 27686 23152 21016 14564 -26220 -38164 -52045 -55133 -15804 6573 -19288 -41181 -63561
13352 -63561 -94229 -55987 -42496 -63058 -77655 -61359 -74160 -39147 -18540 -5887 2862 -25974
13340 -25974 -52707 -56844 -21867 -7306 10977 -41018 -69229 -61998 -31800 28230 44389 -25159
13328 -25159 -41607 -63588 -15464 10370 -3823 -29985 -30452 -52940 -112605 -160095 -183042 -91080
13316 -91080 -50944 -49994 -54770 -44288 -73127 -45682 -28909 -78267 -110975 -78048 -70029 -76882 -100802
13303 -100802 -39316 16443 -55945 -52823 -20518 -37059 -39405 -66571 -68480 -58959 -15060 -4992
13291 -4992 -798 -34832 -57672 -47922 -33911 -48720 -59724 -32621 -34133 -26705 -10120 -38448 -77961
13278 -77961 -61776 -84343 -59520 -11769 2980 -41818 -87208 -92245 -117801 -142061 -119172 -94221
13266 -94221 -127819 -126756 -119520 -104218 -89716 -14715 37902 2738 -34682 -68033 -71364 -62014
13254 -62014 -27807 3300 -7341 -45239 -55319 -65043 -76992 -79775 -44651 -7583 32564 52641
13242 52641 -36412 -95178 -93287 -116976 -87289 -10655 11225 15520 20285 -17986 -42423 -17578
13230 -17578 47133 -1436 -31923 -44576 -40681 -10303 14292 8516 -4185 -48024 -72356 -75584
13218 -75584 -77007 -46297 -33873 -21815 -25259 -10598 14484 46735 32663 30174 -7905 -64844
13206 -64844 -37459 -38113 -25690 18645 -43464 -89994 -127402 -95794 -55764 -31486 -44531 -5736
13194 -5736 -10121 -12230 -43291 -74565 -57961 -43075 -55153 -47987 -17239 -49926 -71250 -46310
13182 -46310 -8176 18634 28419 -3150 -15820 -26937 -60074 -53791 -47249 -51301 -30991 -8141
13170 -8141 35422 21439 -35780 -54797 -74033 -85878 -100634 -73743 -29475 -30921 -61036 -33447
13158 -33447 1641 -19744 -45497 -57124 -40801 -40645 -32288 -56146 -106148 -72574 -67995 -107176
13146 -107176 -88820 -77607 -101214 -98782 -98150 -58750 -12491 6660 -44234 -43597 -58617 -47887
13134 -47887 -13581 -45642 -57611 -87983 -99508 -99835 -102080 -82574 -74647 -21319 18815 -12981
13122 -12981 -25568 -43860 -37391 -65586 -61161 -46311 -61881 -58439 -50951 -111362 -153560 -113771
13110 -113771 -112575 -55690 -37405 -59119 -59549 -54005 -33212 -27250 -18043 -16912 -8104 -19484 -56904
13097 -56904 -58630 -64958 -98962 -97087 -65369 -8313 2552 -29516 -126 40697 90754 84091
13085 84091 28791 29015 13361 -21857 -42230 -59990 -95804 -54241 -47337 -71317 -92742 -79820
13073 -79820 -93658 -104586 -113073 -138288 -151622 -179799 -146497 -80969 -58305 -96228 -87012 -71043
13061 -71043 -71650 -74057 -90918 -62398 -39302 -39697 -64001 -72525 -73087 -35608 -11473 -41754 -38627
13048 -38627 -29313 -10546 -17437 -31122 -26119 -22894 -9095 8203 34083 14974 10255 -9464 -31802
13035 -31802 -51852 -68482 -89441 -71830 -40559 12325 13332 7513 1885 -10695 -4002 16851
13023 16851 1895 -8641 -32259 -46175 -61306 -32629 -13443 -15601 -3746 1387 -15267 34389
13011 34389 -5954 -4795 -42154 -34017 -45770 -49117 -50760 -26265 -27598 -5920 22732 72423 43649
12998 43649 18546 -17705 -50239 -44990 6073 59172 86797 77450 28635 32344 40917 28673
12986 28673 26403 39489 25007 47389 118098 199322 325897 505154 661943 781102 755258
12975 755258 666213 529092 348199 206604 132479 146906 120059 58378 62540 89695 91082
12964 91082 90946 75800 73108 81271 57503 79324 124492 141213 141262 137884 145411 126865 118750 103325
12950 103325 109138 110882 158868 220634 268832 325794 419136 585890 767227 1123768 1599770
12939 1599770 2059788 2402991 2450627 2176641 1689461 1208270 899014 714984 616786 568707
12929 568707 480618 424766 332974 251479 258909 262818 218087 180027 165665 140930 115771 100315
12917 100315 111215 121935 130959 149911 179163 197384 157910 163721 174564 164042 115765 93423
12905 93423 73568 44921 41732 73449 78844 71400 63280 83866 48862 54568 59240 69739 75505
12892 75505 77717 8592 9178 35936 29562 27732 5662 14052 45790 78690 123590 87964 68610
12879 68610 47646 16785 10647 52115 43447 62624 70245 90108 15024 5660 18735 27034 34944
12866 34944 46709 63501 30991 58565 108692 161459 177603 196350 227063 235148 217765 153619
12854 153619 164714 171855 114718 30528 16047 68700 93112 101316 81546 22318 -9367 728
12842 728 -13186 -47485 -35539 -11247 -38266 -28367 -24794 9119 70849 58863 50397 -10306 -72473
12829 -72473 -51540 -52398 -50859 -18129 -15620 -41421 -27332 6447 21720 -31320 -59354 -30445
12817 -30445 -4036 -33387 -40874 -1744 -22498 -52390 -78917 -80873 -91219 -114706 -121449 -97884
12805 -97884 -75673 -85370 -82357 -66885 -54937 -58730 -44336 -6967 -34291 -92111 -125468 -77593
12793 -77593 -71282 -56567 -62753 -61561 -53543 -61169 -24806 22282 19052 20985 39801 86149 91288
12780 91288 46944 47312 95048 72009 65470 36113 14505 2306 43066 83667 118766 156414
12768 156414 104283 87342 114575 93656 122144 141789 103551 57043 16572 48833 80311
12757 80311 159727 233152 311878 325454 292335 305961 317225 297936 263456 248397 216421 156632
12745 156632 119001 97193 42280 1676 -11878 -10665 12638 34759 66943 53119 58375 62399
12733 62399 90736 128797 69192 39524 47435 37489 -9376 -32512 43306 93960 117271 127903
12721 127903 113766 145512 171996 160843 116036 119977 103782 124951 128495 126012 132485 114484
12709 114484 128940 83880 23545 31315 69705 94179 94080 64267 24386 19533 15450 35433 27060
12696 27060 84706 165952 236211 277863 288283 267482 201707 173121 131232 51249 -9716 -21582
12684 -21582 -46681 -57357 -34820 -13368 15884 5423 -24070 -39355 23535 17543 -19978 -38943
12672 -38943 -27535 14881 60444 60550 50123 26066 56155 109310 131362 134185 135425 179916
12660 179916 172483 128698 103888 82434 78937 77606 59597 58337 33665 -144 10995 34383
12648 34383 19351 26410 19246 27601 5415 -37162 -12233 49408 43490 25666 71741 94640
12636 94640 109732 83222 31924 32726 93680 178312 208249 254385 383063 480717 490651 498331
12624 498331 457296 415561 289259 182033 156412 153643 155148 166419 239491 333229 391546
12613 391546 397498 444549 473023 519837 665776 875071 1115213 1478337 2054356 2988764
12603 2988764 4344696 5877137 7125925 7734711 7445053 6393845 4994192 3724757
12595 3724757 2848581 2334279 1991181 1760000 1570583 1399176 1323770 1253294 1221611 1191703
12585 1191703 1089034 1033856 1016153 995880 933923 849252 796794 737688 713430 734970 744129
12574 744129 708718 687074 710694 761254 784112 819536 867179 905174 905555 866576 840146 843647
12562 843647 847967 912153 894127 874500 925464 952120 906287 878643 879263 877172 896580 924394
12550 924394 951932 1040416 1167654 1267113 1327689 1421971 1481210 1489474 1593920 1801885 2009276
12539 2009276 2262368 2535900 2811210 3012678 3036981 2962223 2843705 2684502 2568170 2516366
12529 2516366 2539847 2657222 2803487 2895827 3078139 3240258 3455666 3727286 4004502 4457360
12519 4457360 4997970 5625366 6421927 7421750 8663723 10081449 11711063 13747205 16325011
12510 16325011 19675486 23875851 29112155 35702695 44442218 57363762 78167894 113376632
12502 113376632 172340552 257938275 351309036 428788270 461747689 430217718 348273774
12495 348273774 251037626 179017380 135885366 110109829 93654130 82238860 73577644
12488 73577644 66298466 59900136 54268000 49508459 45677211 42647840 40332211 38518448
12480 38518448 37005247 35677091 34448018 33177043 31869947 30564002 29255678 27999043
12472 27999043 26889677 25921395 25020316 24185705 23422305 22732943 22076820 21427405 20798352
12463 20798352 20183449 19653407 19180092 18716480 18239164 17773989 17261531 16740583 16327208
12454 16327208 15951985 15599497 15275999 14999180 14840068 14821617 14914650 15000889 14954859 14693332
12444 14693332 14187969 13527861 12823132 12153184 11569508 11128587 10870636 10685686 10440898
12435 10440898 10249057 10013558 9682605 9369513 9093639 8917728 8765083 8587008 8393301
12426 8393301 8210732 8072065 7945085 7864742 7746553 7616614 7490069 7349454 7233886 7138584
12416 7138584 7004659 6828082 6685709 6575618 6425553 6269422 6129434 5974984 5871234
12407 5871234 5805559 5705446 5629265 5542550 5423977 5324297 5246359 5127560 5055670 4992052 4888543
12396 4888543 4770150 4674541 4611323 4551835 4454440 4337517 4206363 4063896 3962777 3933386
12386 3933386 3859800 3773960 3727011 3679385 3640344 3604039 3575809 3495513 3440814 3449271 3454566 3453250
12374 3453250 3432487 3355260 3221118 3061122 2877557 2752882 2668918 2606027 2582877 2601309
12364 2601309 2604971 2580053 2555316 2474461 2386992 2361317 2311183 2304690 2262952 2220192 2178268 2132729
12352 2132729 2084648 2031147 1954622 1862492 1862824 1888971 1860283 1871738 1781877 1695736 1686532 1665669
12340 1665669 1623521 1586841 1600239 1605425 1590407 1608331 1588824 1564293 1599979 1621486 1551830
12329 1551830 1476663 1438629 1425140 1416476 1409263 1422828 1399191 1337031 1289838 1260112 1288257 1291245
12317 1291245 1271262 1254789 1278511 1298465 1311778 1264190 1212805 1115955 1041771 1020401 992590
12306 992590 964618 981242 1027970 1044556 1003518 973734 986878 967703 952309 949438 956487 944587
12294 944587 907321 889163 835614 803107 816860 830161 843006 872819 863029 825482 799052 765478
12282 765478 732618 724348 715958 689694 661381 656420 643715 652843 674557 689185 651493 620040
12270 620040 615429 633064 635576 621870 574619 545521 497575 477456 474048 473548 484206 496689
12258 496689 487721 465106 472344 502035 528181 540528 515451 480376 431136 405529 402436 435576
12246 435576 430151 427885 428358 425648 437070 443366 425224 446290 424425 408957 394886 416587 413114
12233 413114 330273 314798 340657 325173 318472 322739 335930 382037 341143 326782 324620 307477
12221 307477 279026 262033 266016 281015 263588 243054 212649 217485 173148 170917 163572 203219
12209 203219 258241 284773 297103 231388 163383 174741 180570 197158 209100 187800 164125 149037
12197 149037 175941 207059 181075 178843 178828 183764 232611 259684 216464 178467 158401 178364
12185 178364 214693 228985 247236 252058 226440 215135 234208 213392 182170 169654 178121 192492
12173 192492 190975 161865 155916 150437 163740 137757 69184 78316 127699 165915 156379 132249
12161 132249 138879 146869 164562 157753 180104 203255 201272 192796 209814 248946 257064 194803 134791
12148 134791 142864 153332 155347 117690 127833 76068 65266 90927 93664 98555 90789 130859
12136 130859 163332 156493 143571 97764 93175 121086 113149 91241 105686 126814 135170 88199
12124 88199 82963 103650 89144 52880 16639 57396 80587 94094 95943 101215 111228 127418
12112 127418 138294 105395 93714 114289 80550 65541 66563 93305 75304 73566 61732 88895
12100 88895 109866 100679 125016 103777 78597 106003 115127 76715 108265 135459 123959 110590
12088 110590 133465 119960 133110 148533 133476 86812 42866 33507 24161 2825 38185 62646
12076 62646 53540 103590 155104 115748 76889 102761 118658 109287 150699 177957 176002 129107
12064 129107 136359 186853 209731 215301 227837 273444 392105 593144 877779 1240670 1696891
12053 1696891 2132429 2328295 2219843 1887059 1426610 1071632 859436 708585 559640
12044 559640 443048 353103 333094 325545 311127 262928 200275 184065 179708 161866 140747 110902
12032 110902 81789 92033 124954 165829 173345 208486 178000 168463 188466 154783 116789 125917
12020 125917 84732 38653 79519 145335 174700 198580 205378 181288 191221 196696 178443 198471
12008 198471 178489 150776 134536 114130 111281 75013 83379 154343 174756 206236 178042 122074
11996 122074 140842 161312 167019 137965 135527 180203 182790 164492 151795 73054 58572 29642
11984 29642 16447 54781 73892 71574 102624 97386 69380 53461 63841 33268 -1285 13530
11972 13530 50440 28431 65905 98315 106030 69855 66959 28146 19716 68959 120861 154082
11960 154082 132924 104566 114921 112810 99887 41693 14022 22122 44435 97581 66274 48382
11948 48382 52753 41029 42271 20222 -17140 1811 -23625 -26904 34507 49136 40465 22129
11936 22129 -3039 2885 45035 56254 57311 54352 15172 20327 36273 54026 18863 -26890
11924 -26890 250 29086 106380 126957 84300 42611 69310 82842 52346 55983 41991 34412
11912 34412 32943 12352 6549 -28503 -34900 300 -11142 7703 28783 34102 30861 14941 5730
11899 5730 24344 34143 12201 -15786 -44015 -67325 -49328 -29106 -29583 -27838 -17344 3711 -8897
11886 -8897 -12337 -13356 18214 34808 32704 -27142 -55711 -16020 52287 68993 56740 31383
11874 31383 33342 30345 58038 65887 38724 40441 61792 97065 70988 26629 43803 39569 38829
11861 38829 47939 43276 -14150 -57347 -50777 -101935 -113490 -71181 -33527 12848 -3314 4604
11849 4604 49417 42078 28178 23196 40570 82579 124084 101135 68506 72616 75450 32894 9229
11836 9229 30297 -11778 -34252 -51485 -38089 -23046 -29616 492 19300 17037 26209 190
11824 190 -13389 21841 25749 47496 19752 4054 3404 -6275 12695 -19585 -3510 26319 44449
11811 44449 41603 34873 -10647 -38794 -27288 -10722 13205 85703 37351 4803 2465 19170
11799 19170 17561 -46655 -36029 -9725 -13785 5829 31877 -8859 -37486 -35204 -55938 -21713
11787 -21713 -13719 -41912 -51477 -54178 -69867 -44223 -32696 -66950 -72275 -22558 -11945 -25354
11775 -25354 4731 4301 4027 -9809 -8793 -12948 -27755 -15753 -24612 -2592 -41017 -49633 -20312
11762 -20312 -29908 464 57626 76362 59821 72817 40186 -9884 -11515 11218 59311 55735
11750 55735 13746 1646 -10256 -53512 -40299 -58076 -44835 29407 44043 -17632 -50987 -38221
11738 -38221 -32405 -40985 -26828 -9497 -3772 -26021 -31817 -22486 -6156 32997 46686 55418 32401
11725 32401 10022 3647 25938 17586 -1119 -17717 -25785 -15059 -6432 20995 56493 36020
11713 36020 -58896 -28447 32213 4518 -4351 9327 -1239 -30606 -72862 -67985 -54305 -81585
11701 -81585 -121848 -165702 -166278 -104634 -72244 -89862 -86812 -62297 -62494 -26909 -9227 32928 74247
11688 74247 62208 45054 -4514 3285 6609 6939 -6528 -29255 -19330 -21089 -29160 -12556 1120
11675 1120 4580 -7738 -9163 -3799 5639 -18127 2084 48222 96420 72381 30261 -3465 -42516
11662 -42516 -42858 -25252 -34433 -52717 -83198 -79952 -74311 -61638 -52117 -44284 -54740 -74679 -77884
11649 -77884 -103499 -108258 -81376 -26128 -12509 7774 7886 -28671 -26909 -56679 -68625 -73151 -48750
11636 -48750 -61281 -102648 -110991 -52164 -1479 -13170 -229 30630 38356 27745 24150 29454
11624 29454 17604 -17677 -22308 -20626 -3976 -759 -5384 4692 7987 8848 11710 24452 11753
11611 11753 -18297 -59670 -32193 -22053 38236 41963 46209 42686 -25983 -64974 -43631 -48130
11599 -48130 -20492 -3890 11287 43371 78987 63857 -17081 -7853 14741 -13719 -44922 -34848
11587 -34848 4926 9692 -10086 -42074 -46576 12748 57884 96858 64302 -12164 -34147 -75820
11575 -75820 -74409 2990 26599 -3900 -16010 -60596 -95955 -39560 -15145 -25793 -33327 -17380
11563 -17380 24538 3881 2161 10962 14855 2332 842 -8429 -27662 -52880 -65782 -84131 -15482
11550 -15482 18892 -185 -38812 -67571 -82532 -88788 -73292 -54942 -54101 -18377 13768 16946
11538 16946 -794 264 -21771 -47875 -35981 -11978 384 -3643 -13285 -23959 -11517 -71980
11526 -71980 -127171 -87935 -27552 -27271 -53752 -88034 -59762 -39531 -38863 -78500 -53462 -61869 -32204
11513 -32204 -30423 -42448 -25436 -34309 -12511 786 -24218 -19411 -12160 -21743 1294 -4406 -12883
11500 -12883 -5364 15117 11566 33134 18712 -13244 -34278 -31651 -48414 -62031 -30037 -50238
11488 -50238 -41963 -13048 7721 34510 70667 78376 77908 47493 -7712 15280 27272 24377 -36668
11475 -36668 -88667 -76605 -47140 -39910 15834 16294 16525 25503 -4580 -36297 -19907 -32899 -38505
11462 -38505 -50907 -35539 -6759 -12710 -9167 -31099 -59803 -88751 -104713 -100404 -44366 -33388
11450 -33388 1114 54002 27379 -19007 -38547 -61731 -84858 -62121 -31562 -3525 -454 -5305
11438 -5305 -24041 6953 15818 -21257 -77876 -45641 45431 37086 18887 21686 -19310 -27168 -9984
11425 -9984 32597 81742 78722 39059 8511 -10220 4839 3438 -9542 5621 -19485 -10234
11413 -10234 -15227 -6094 60430 77499 85096 93845 66539 62485 57152 -6854 -25729 -28693 -23784
11400 -23784 -58987 -81046 -87644 -90073 -123451 -81565 -72889 -104589 -65055 -78478 -71203 -52558
11388 -52558 -89269 -87879 -62418 -57933 -88901 -60366 -35787 30399 60989 75105 67298 58724
11376 58724 -7467 -58683 -103815 -142211 -62051 30838 52685 6225 -4649 -2010 -9872 -8373
11364 -8373 -39193 -54050 -60473 8420 22772 -13768 -39408 -39751 -6579 -1701 -13412 -31520 -31473
11351 -31473 -39230 -46528 -60860 -45481 -77368 -113955 -109296 -92276 -107010 -85751 -51434 -54606
11339 -54606 -79065 -86277 -38212 4651 -20512 8691 9603 -45632 -75168 -58143 -55133 -61580 -78442
11326 -78442 -44619 -42212 -8140 -815 -6690 -4858 24066 14496 25786 32210 14361 -14799 -62627
11313 -62627 -89537 -76577 -17458 38244 38332 20307 24031 24246 48450 1747 -32890 -14116 -28312
11300 -28312 -57853 -60270 -18774 -32866 -10415 -52639 -85212 -119649 -84668 -57560 -36588 -16950
11288 -16950 -28723 -81391 -90467 -42484 -1293 57833 46761 8115 -15121 8683 45041 43499
11276 43499 29855 29709 41763 -11933 -45764 -29020 6005 34602 66632 135531 156632 152580
11264 152580 93045 87722 100115 72350 29285 65489 62314 47743 7860 -4966 -38255 -63083
11252 -63083 -92721 -94170 -102265 -114075 -72830 -61960 -50226 18392 12928 -10915 -8574 -20840
11240 -20840 -31636 -8974 -523 -6335 49516 27541 2573 -5134 -37681 -41088 -27692 -11502
11228 -11502 1083 9273 -10074 3340 2146 21594 20060 60327 50479 26514 41227 -10704
11216 -10704 -56155 -46684 -31261 -20839 -17734 -27378 -8082 25038 35281 1104 -22845 -29418
11204 -29418 -30299 -42638 -6823 33052 3705 2583 -8454 -19016 -13517 8420 -21484 -80852
11192 -80852 -74164 -64095 -74445 -55214 -27759 -33127 -32356 -10381 -5588 -28942 -55677 -81952 -103265
11179 -103265 -107390 -96910 -84810 -74871 -81244 -53035 -26966 -9897 20673 31741 32843 -17977
11167 -17977 -25790 -45850 -60647 -49592 -66651 -45492 -19271 -43708 -37688 -32056 -19139 -13921
11155 -13921 -31847 -10316 24029 33147 15587 11804 -33527 -53646 -71626 -62148 -37775 -43007
11143 -43007 -30529 4637 36178 40141 37216 17685 -3618 14782 19726 19914 25783 41706 42791
11130 42791 16083 4185 29138 29851 30084 28385 45493 71256 55846 34550 34624 -2844 -26923
11117 -26923 -2851 16304 11986 -86 -22823 -49990 -21102 -14198 -23050 -470 43407 31051
11105 31051 17736 -4329 -5397 -23662 -27009 978 22311 44655 34088 88347 114590 49632
11093 49632 -1932 15383 46486 55276 19440 30968 7300 -30821 -61170 -62855 -40770 -34844
11081 -34844 -38208 -2236 18417 44567 51847 10442 -43961 -70013 -6938 27964 27871 51102 60215
11068 60215 90556 99973 131398 138995 74327 41550 30663 13536 14383 34101 -10083 4330
11056 4330 53630 57879 66177 104884 77601 61190 56694 -5749 253 23408 4417 36513 60241
11043 60241 69000 64470 77764 78641 62582 34316 7978 -4753 50707 67347 66408 88728 112028
11030 112028 126734 80932 65442 27511 18282 -11744 3591 14531 27638 18059 -7385 40868
11018 40868 68604 62964 80323 124344 126006 85677 73611 79562 85257 91253 66777 24197 11350
11005 11350 -20014 -19524 45019 98286 54665 39112 58098 76381 121186 119573 101633 67416
10993 67416 57299 89202 93988 91480 38481 -22400 10225 26719 43482 85952 66105 43701
10981 43701 52460 40926 -15403 -20888 -640 -22125 17451 60858 70221 49153 20638 2846
10969 2846 -6346 31655 52238 26494 47051 36162 59936 79075 106145 101212 120277 97005
10957 97005 102360 127404 143555 151504 96749 81764 58460 62838 55226 54972 119623 143629 75321
10944 75321 27109 -18500 -15139 10350 54657 100345 109840 79432 23221 -11291 2073 31096
10932 31096 4831 6231 36212 30934 -6317 31227 71853 54216 19634 60551 87395 64926
10920 64926 59415 71422 86708 71896 35995 1782 17392 52489 73560 103673 104583 97383
10908 97383 78197 17153 -2850 33252 84794 95926 124347 161802 193050 169190 139688 140736
10896 140736 164207 155209 146612 128288 109244 79416 118788 113221 97857 134274 196650 165946
10884 165946 124868 99500 67351 58928 52779 62794 24480 -24533 -2128 36810 34833 52778
10872 52778 82575 125352 78250 55845 55564 52440 40844 66986 27155 8737 8162 10330 24485
10859 24485 4327 6304 20944 15033 58158 99071 82883 40860 24751 67351 64135 47360
10847 47360 49060 32661 52696 31491 30184 77597 86115 63701 90368 110779 116721 101730
10835 101730 117076 151327 135080 127181 105255 62547 34784 30581 42119 78771 89702 120654
10823 120654 134415 88163 34423 12364 -5277 39833 64093 57636 66355 79831 30332 5504
10811 5504 -11971 11481 14219 2227 -12691 9292 73673 88717 89226 72284 96605 108450
10799 108450 129644 119229 90692 66722 77770 102749 98686 92215 91500 110042 96384 63450
10787 63450 50830 33097 32028 74491 82389 116956 85743 40926 33602 17172 914 -7105
10775 -7105 26927 66760 82625 78459 65878 69211 44823 58103 75908 63576 68580 40418
10763 40418 65670 111182 122710 125531 83231 65067 57602 53149 101469 90044 93778 113182
10751 113182 136323 165003 143796 155698 160076 123738 76145 112937 176984 187842 163179 155835
10739 155835 124030 65484 66847 96194 76638 99133 105751 47064 70630 129067 125463 92624
10727 92624 86055 91687 85860 42646 41608 61855 105114 152297 147266 159916 189558 171659 168278
10714 168278 167409 134637 126067 133232 83810 52576 45251 76903 64709 1512 1413 33821 76771
10701 76771 80001 96781 102371 92763 72407 61633 94986 83345 105088 86528 33715 8887
10689 8887 -23076 -54481 -16616 42950 58959 29869 -968 12842 9056 -15972 -18336 4701
10677 4701 42324 37170 57974 35671 3072 -4468 41343 60108 39185 68789 70483 85681
10665 85681 96582 88350 82264 55771 68713 103645 113229 76244 36893 95668 44781 8346
10653 8346 47555 56458 52394 53079 61806 30151 28853 24083 58049 27910 58755 78680 79402 77816
10639 77816 95814 81341 57241 34005 61766 71549 70906 80607 104649 55325 85347 107200
10627 107200 81634 61572 69740 82945 52316 45716 84566 81938 64051 95697 99617 107093
10615 107093 101890 100195 126479 119052 126867 130662 142809 150764 149773 133976 146537 145946 151448 140364
10601 140364 117366 88590 65192 46987 33038 52720 111763 95853 87414 104289 129167 143488
10589 143488 133708 150275 138924 87909 82136 63750 96755 83264 26442 8135 -3224 11849
10577 11849 -5843 1256 21128 29598 34615 58808 88220 122210 112484 79114 84089 104418 104785
10564 104785 9016 17234 10354 35056 88533 72872 48677 64291 84217 67906 59412 75647
10552 75647 100855 104133 139761 137859 65621 61542 70631 30923 45087 51428 8417 -19104 -1587
10539 -1587 68414 120184 138646 105023 80630 100149 79617 82962 77241 54731 67038 99002
10527 99002 85882 111960 143525 140323 90493 89782 74135 76264 80845 73334 67634 76838 91320
10514 91320 102930 95583 96085 74251 64180 94621 96996 79388 87607 95681 91301 121659 121997
10501 121997 119845 127508 111047 94396 87137 47263 41597 68679 74096 48395 48861 75996 59631
10488 59631 119769 103123 93096 79539 97259 105519 98869 98159 87841 88995 88773 102240 90838
10475 90838 96190 118504 144591 139650 89550 48796 84082 76002 51354 74465 69228 88779
10463 88779 78259 68591 90822 130782 156027 120270 61701 45098 64680 99816 130410 114240
10451 114240 113651 124807 132073 107508 106155 157280 210575 230651 249442 203737 151425 145864
10439 145864 184258 186367 186029 169159 168942 152680 130214 115486 95814 68183 49926 38018
10427 38018 67599 71851 53308 75455 92297 147652 231870 201466 213069 215185 160551 131461
10415 131461 91078 72431 107643 97021 107811 111806 107670 113603 115940 107311 72540 99766
10403 99766 75584 50444 41065 30687 13767 81247 126200 124953 125380 136362 142265 174307 155683
10390 155683 145065 149333 174546 191406 181361 151636 155707 147590 112255 118846 165615 200397
10378 200397 145935 120502 124276 135929 154292 152417 113490 102163 130126 128056 102798 79993
10366 79993 90797 91890 94787 92077 111264 130806 102915 98115 118588 78103 101735 86471
10354 86471 84172 70495 49461 57124 49684 56437 66440 82559 34953 54685 57007 4212 19821
10341 19821 96683 75375 64202 89241 134157 107463 108589 94288 110498 105543 64574 57748
10329 57748 80805 87235 107007 105886 76579 99921 144002 128558 132948 118885 108203 99641
10317 99641 98800 145130 146287 117900 115205 138832 81330 91853 84474 106660 156625 122997 67486
10304 67486 57938 61156 73528 72134 73023 72280 114969 135795 131194 95895 80800 115065 101610
10291 101610 137768 147690 167007 180734 174736 168138 144137 134591 146100 136356 94598 102860 126373
10278 126373 128726 164575 162341 111072 147318 179842 215721 234269 214432 185898 184739 179773
10266 179773 155618 143862 103306 87099 122331 184937 196937 127408 79163 44547 21160
10255 21160 38162 62344 46109 60922 71443 83036 130655 123838 128109 122253 107433 110770
10243 110770 92621 90630 71111 77135 110421 155870 185638 177124 185558 191126 213808 252626
10231 252626 201496 156730 161044 134210 128046 99888 84290 92307 106185 115441 57355 53871
10219 53871 58328 35328 50580 24580 11021 6464 11234 19256 42967 122272 149890 116997
10207 116997 128421 118493 117597 155218 163857 129788 116326 120447 113066 100249 77399 85361 92345
10194 92345 117129 125393 143011 172421 144171 135936 107085 112347 150837 132561 99796 107619
10182 107619 107896 113765 130521 149541 143980 102227 40638 21725 42839 72519 82981 121553
10170 121553 135876 97174 90453 108996 131025 158887 165334 166449 147561 89714 91304 66863
10158 66863 89904 128079 93217 96422 76566 62576 115456 188509 169453 158886 150404 181025
10146 181025 173265 112760 117391 125188 142162 138031 129449 124229 136251 132995 146525 159571 196460
10133 196460 159877 133259 153170 152659 129113 129718 137355 154578 114270 56657 81876 109699
10121 109699 125078 103346 115775 123572 122876 111372 118918 103556 139156 135471 103027 117681
10109 117681 124270 150384 111521 113235 105907 94995 103525 137839 142409 109926 61167 81816
10097 81816 68919 98140 93007 116341 146642 161932 159356 150250 148675 124115 94908 103795 98937
10084 98937 129920 154656 186849 156552 146911 177662 139601 117414 132202 122560 98189 104343
10072 104343 142393 138054 136363 110410 121630 115883 114269 155696 164911 121041 138620 125531
10060 125531 96813 115156 134119 155901 155409 122935 110898 130973 160885 167031 126439 90635
10048 90635 108196 147716 146356 116431 122595 192557 207088 205381 139882 93003 95229 116898
10036 116898 184052 188486 189935 146807 147062 93111 86986 162759 183230 178440 206679 203199 165897
10023 165897 166236 160971 152836 141476 91187 106295 159320 160759 123308 160659 159172 161803 187884
10010 187884 197214 186264 176550 165557 139365 82616 34026 47600 71790 104325 115872 135170
9998 135170 121936 127120 154110 135080 129679 151521 154937 163864 169250 154511 199894 192137 165771
9985 165771 207461 207609 146680 116930 100184 139409 159858 155544 156273 136614 111728 147603 187520
9972 187520 177006 161723 151939 159007 195383 173799 174870 193754 211762 210988 194213 182855 183680
9959 183680 197897 190718 169890 169222 190198 188185 131095 106928 133855 128187 110375 88234 128626
9946 128626 165133 171683 196858 202573 195336 231973 259581 258471 271022 235037 223488 208004
9934 208004 160298 131956 151694 132350 91707 104216 126250 111048 96794 122673 149893 152305
9922 152305 189957 206829 206380 197376 196126 246213 248252 179926 179659 186281 186537 227710 227407 182511
9908 182511 190036 201524 187483 199524 191145 175828 143447 164835 191788 213858 244520 244958
9896 244958 228553 196014 179220 173614 197464 207040 200390 205330 194080 179002 178489 187769 171786
9883 171786 207843 212728 201750 154048 137679 146876 150981 164486 149056 137470 166996 164411
9871 164411 164213 153253 181572 222353 199985 223231 209702 185198 147762 156054 135627 150350
9859 150350 187456 158895 106168 91462 128858 154834 171931 138806 186356 236992 209690 210384
9847 210384 246846 189568 144481 129861 183054 222800 199186 223968 218490 225565 249078 242495
9835 242495 208175 228004 247911 207796 156551 155174 168799 143795 105948 114940 146180 155814
9823 155814 201594 222479 245829 209470 153756 126541 152937 143363 121236 100376 159621 224281
9811 224281 208936 167541 149457 103278 102575 135096 196546 255914 243308 227418 224150 216218
9799 216218 206611 196530 171766 150294 168784 189960 194436 177483 171070 116118 159238 197081
9787 197081 200139 212034 181248 134987 120879 137301 166565 176551 207183 189716 186701 203147
9775 203147 215181 212451 248227 250950 173714 144404 169990 228295 203105 203876 214528 195385
9763 195385 173000 163577 146373 166440 160199 133951 135597 136981 118496 112050 101391 130683 168742
9750 168742 165283 167594 186020 163528 140627 143940 109453 133556 143349 132346 144585 205550
9738 205550 268117 265686 209068 181750 193322 187653 172564 162803 161748 195870 249507 240914 227627
9725 227627 188801 189870 192694 181308 150295 176840 211295 199288 207445 252223 277380 251048
9713 251048 217467 207668 202532 212506 221268 250976 294643 273453 185538 137540 164412 141629
9701 141629 114508 124125 111336 104044 95247 94998 143918 160920 163694 159635 145135 150722 144947
9688 144947 146887 165766 145110 161111 206162 200251 192159 198361 167808 168105 162733 173241 203204
9675 203204 182887 172449 237996 255324 183175 159561 167632 160086 143718 167758 194648 151785
9663 151785 141057 175159 152342 120544 134457 124101 107520 94337 127118 223721 242125 192687
9651 192687 197766 174808 147790 139926 178002 149495 145396 163588 111966 131677 145292 190112
9639 190112 214936 182914 119804 130460 125966 141681 132529 99033 91419 123886 170081 230405
9627 230405 218855 171436 171291 187815 160655 186835 247887 243789 165946 90143 65224 70798
9615 70798 73866 96827 122109 124987 169464 197822 175386 157327 160717 193971 194849 201048 179920
9602 179920 143188 147682 147100 135278 140626 135156 136021 158312 204276 194178 173087 137257 112914
9589 112914 114613 138696 156636 169203 161128 135749 133800 195074 207291 209144 174840 163959
9577 163959 162418 183362 188438 190272 181320 167605 126505 143991 178809 186256 187311 159739 157564
9564 157564 124827 70304 43354 80274 105842 92965 119112 147071 119147 134393 145018 182373
9552 182373 184170 220178 201737 164396 160307 155176 123516 124848 114936 112162 86028 69837 68363
9539 68363 96237 89156 76722 98285 146778 184141 165406 155545 115342 127169 121199 138269
9527 138269 187531 222191 212312 147098 115203 121081 133387 139875 165179 170606 175144 188753 200879
9514 200879 170863 140883 141543 143793 156628 176215 152525 172496 148404 127356 132542 146322
9502 146322 114032 158365 190536 215677 251471 230439 224985 202085 184260 171217 178444 157228
9490 157228 195178 224782 200484 141967 90696 103483 135861 150715 144452 125862 113855 139235
9478 139235 188067 152007 123707 99673 113918 101812 74451 107833 136851 121874 125595 117272
9466 117272 112497 103644 66471 59388 106609 174337 184484 164662 171023 151074 160721 159402 162057
9453 162057 128220 96819 70369 46656 72497 66588 58639 108111 118465 71387 57833 52174
9441 52174 56722 83630 89554 89559 79082 52246 63556 93324 110228 124053 178204 170014 153457
9428 153457 135365 118442 151219 189792 203412 165315 146637 151572 94738 81617 91410 83736
9416 83736 76721 63965 81031 122039 166223 174754 161787 142413 111690 118418 117767 64137 37636
9403 37636 43243 122014 136000 131713 131019 120356 129214 143820 124991 91421 48180 57859 68037
9390 68037 91744 120783 141903 99844 93394 64208 58223 52749 57938 29353 37518 62786 62519
9377 62519 90452 104864 115755 141234 119633 122090 129527 103003 68281 61179 48756 70717
9365 70717 49186 49015 41243 37908 33345 51637 41720 35600 79738 102730 101288 81227 79155 59041
9351 59041 12564 -231 48686 84164 108689 115405 157506 163815 99274 65332 77212 81161
9339 81161 76900 81401 62008 78014 92518 55186 64032 62037 45791 73419 21713 3827 62580
9326 62580 123490 99397 113351 116179 94982 111427 85716 71706 93527 103353 102090 126253
9314 126253 128925 134687 91348 88982 70723 37366 33885 42750 64961 54404 70767 101555 143652
9301 143652 179450 165174 130251 116093 89512 73748 111583 91605 74927 80137 63860 48940
9289 48940 35125 53910 41132 12179 57860 76427 95568 90273 83039 67669 94104 139834
9277 139834 156791 123534 120663 102675 121598 90165 75548 89787 96879 104457 70357 38985
9265 38985 988 -30260 -33820 -35719 -28549 -37947 -14404 21974 30714 30127 44291 29399 27864
9252 27864 58867 48291 67567 69769 80924 38000 36740 46962 40668 51045 69189 70535 57361
9239 57361 88172 118913 92328 41931 23264 40689 63035 45502 50158 66048 84809 88585
9227 88585 71243 78962 117271 115878 99085 74688 88698 113198 84904 58179 71602 65537
9215 65537 126419 191685 178109 150494 127616 111472 108786 108665 126469 139506 85893 52789
9203 52789 58078 92502 133491 128371 71764 53464 63879 53326 69356 66397 69895 69169 25657
9190 25657 21483 43236 48590 66402 65135 77229 124875 105857 103081 139410 173269 183069 174387
9177 174387 155067 152950 145122 162493 145321 152454 128889 89488 92890 73309 56190 39406
9165 39406 67779 112221 137856 125659 105788 60605 51899 35062 66609 95770 124988 131494
9153 131494 92608 82626 94259 111290 106402 123330 135345 109132 71673 88573 70403 73257
9141 73257 59082 32513 -420 -14050 40104 51476 82286 98064 116789 107972 78544 52336
9129 52336 62946 56626 88110 95252 95962 126008 157764 183955 178411 153333 112820 103388 113034
9116 113034 113667 101022 101908 114631 131394 73363 54896 106454 125194 93857 79732 61024
9104 61024 93618 76920 88941 123747 82446 72012 68641 26122 40529 39461 7343 15426
9092 15426 37447 66060 48953 15157 6194 32925 47523 36527 10575 -6344 -4210 -14217
9080 -14217 -27030 -9298 39773 74967 83314 75717 59992 51013 95325 117073 114651 57229 47878
9067 47878 86511 75122 81906 51615 37104 53799 86719 39352 72688 81688 81326 65803 29423
9054 29423 28112 44455 57740 43059 30356 -1198 -20860 -28497 3537 73621 110362 117137
9042 117137 100159 81684 58203 52255 66480 69220 99699 82711 79898 86089 133832 117732
9030 117732 84407 22086 4902 24030 75996 84165 52535 28208 60665 54931 47595 68732
9018 68732 72708 40972 -5947 10398 15796 14166 31447 32602 24573 54603 66875 54350 41248
9005 41248 -4854 55861 70087 109558 152333 132360 95167 68967 48397 17927 -15579 -10616
8993 -10616 27853 50868 45269 -1954 -28655 -30419 18948 21131 3826 -251 -27349 -41835 -54765
8980 -54765 -35510 21322 56550 57309 44437 218 1632 3707 10692 33328 19117 -14043 1406
8967 1406 10540 -20708 -12197 -29633 -29404 27117 81204 80472 47942 67796 31296 31394 51783 64800
8953 64800 85778 64091 58617 35123 21218 221 29435 51099 -7739 -37057 4731 -29370
8941 -29370 -60019 -54301 -40877 -41300 -17151 10650 -5276 13165 -23558 -44069 -39553 -24284 5585
8928 5585 21912 40366 37132 21302 -3764 -14027 -10490 -5985 6730 -18142 -48161 -70833 -38364
8915 -38364 8662 56410 41035 33959 38887 35266 -6079 -18980 -22344 -41466 -33487 -45817 -57868
8902 -57868 5298 40096 43570 37372 69421 65657 -21716 -54950 -37846 32034 26647 16838 39901
8889 39901 83784 123237 81761 51675 55560 72143 59596 40919 -19215 -39858 -34865 -12596
8877 -12596 -21331 -5188 50239 87180 90542 82261 36552 -15108 -44096 -10560 26856 60527
8865 60527 46897 8754 -19430 -27194 -53667 -71175 -92695 -88640 -40350 -38601 -66698 -29078
8853 -29078 52241 88719 96971 92844 49867 37818 73088 9776 -15583 -12855 7319 42607
8841 42607 46427 36443 1891 16127 52152 95585 102329 82106 6250 -16717 -12970 28383 69051
8828 69051 63401 42715 30327 13372 -15666 -9085 -28327 -29071 44303 29118 -3499 12845 1161
8815 1161 -12905 -27146 -33924 -61032 -47709 -35153 -27935 -30449 -11072 8593 15301 3727 4371
8802 4371 19543 16293 27846 23166 28871 -8788 -16352 -6786 13096 16634 5895 19079 -28036
8789 -28036 -51983 -30419 8841 20077 -29689 -70567 -93666 -96971 -60872 -32175 -28618 -6487
8777 -6487 14095 -4702 -24585 -13527 -12790 -14748 -5031 -6732 -5581 681 15763 16210 15021 21014
8763 21014 -17666 -24136 -41522 -17185 17588 4742 -5655 14750 -70012 -132975 -129201 -62762
8751 -62762 -21826 -23257 -52702 -51691 -47859 -51808 -13214 -5568 -30777 -14534 13049 -56662 -74755
8738 -74755 -76275 -75596 -27477 6535 16602 13382 42545 54189 68125 67921 28319 13091 14271
8725 14271 18896 9441 12779 -22264 -49603 -15740 8896 4422 19263 1020 -22930 1816 2774
8712 2774 20359 1786 -26114 -35986 7857 30758 7824 -22769 -25695 -3940 26836 7153
8700 7153 -3246 27193 50065 37422 20139 27004 21629 -29810 -50212 -29226 -396 13402
8688 13402 1184 1833 -10213 -43388 -32554 -9428 8288 -32735 -36344 -43566 -53637 -36888 21922
8675 21922 23031 17761 11600 7658 -26657 -5077 36939 29687 67673 104303 66767 20171 -8211
8662 -8211 2516 -178 -27094 -4094 -15109 -44042 -70463 -101917 -18237 29398 46329 40416
8650 40416 18517 -11185 -50089 21401 18209 -6816 34894 37712 53262 12058 27235 24642
8638 24642 -22125 -28349 15765 66105 67867 40041 55651 42720 48615 61992 42479 -4139
8626 -4139 -28225 -54912 -4264 38002 51917 52202 26979 4089 -14810 -52168 -20118 -42672
8614 -42672 -75716 -40429 -19414 -36011 -29849 16833 27657 -26212 -43614 -56596 -48535 -30347
8602 -30347 26121 17987 -597 11598 70379 50211 17848 5332 -32370 -9863 11175 16581
8590 16581 40680 38388 54402 37514 33519 14420 20787 9985 29282 76747 83700 27224 24540
8577 24540 43515 42190 36392 38693 -23337 -49727 25645 54372 39307 84596 42789 23580
8565 23580 30907 9631 29205 72828 107006 84514 78442 76737 60156 31439 -39040 -20279
8553 -20279 6029 -8060 -266 8421 42600 45914 -1974 -49615 -18020 -40679 -26903 -20798 -52769
8540 -52769 -41044 -49629 -25325 -21038 -5691 23436 43484 69405 91264 67303 -175 43048
8528 43048 83109 111431 203918 264274 238670 116078 57448 83605 114274 79515 68824 58557
8516 58557 59174 72377 50065 47552 4628 15247 52126 99329 56645 37753 73284 78803 49182
8503 49182 60165 66899 25450 11923 609 26986 11357 6522 -1610 -2228 -19461 27145 83738
8490 83738 138225 196296 177600 153179 157117 123475 71669 61824 62125 70437 52129 12117 -1641
8477 -1641 53907 74269 91022 38226 -2963 30799 68962 53562 21632 44691 2065 -19352
8465 -19352 -58586 -88671 -44110 1018 17961 50593 77267 87601 88478 71984 58913 23542
8453 23542 -20676 -3941 1263 46744 68985 59495 70928 91194 61261 39176 79416 95248
8441 95248 88327 79832 52025 48112 92717 110120 86330 -8019 -63664 -122000 -109921 -54569
8429 -54569 -54162 -29760 -27321 -35842 -11277 -11658 -50711 -60661 -39957 -984 -6491 -43411 -20452
8416 -20452 -19407 -30503 -28797 -15020 -15967 8985 14347 7035 11271 14792 -27559 -70227 -63977 -38728
8402 -38728 -58333 -70291 -80601 -52479 -6382 29234 19529 9054 24381 19712 30479 8487
8390 8487 -32213 4931 -1344 22781 36454 16189 -24868 -25759 -14225 -15767 -9654 -24116 -50918
8377 -50918 -86943 -102782 -54364 -30616 27458 43637 34968 65575 88574 56626 18134 52427
8365 52427 65799 29634 -12527 2586 8315 1936 -5175 55476 52875 -1114 -32661 -20655 -4179
8352 -4179 13350 -15218 -43115 -45186 -16302 2154 27314 37442 37800 -13982 -19936 -4872 12902
8339 12902 3497 -26906 -25145 18295 36309 37232 31789 31130 1959 -67797 -85917 -74994 -39619
8326 -39619 -7905 11536 28615 20916 7135 -2915 -11689 15376 4353 19843 35560 51789
8314 51789 20678 33499 67832 49554 38175 40611 18340 13905 40232 62420 23150 3157
8302 3157 29012 36895 32821 -8269 -32094 -30626 -28306 -20635 2795 2476 18292 46195 60940
8289 60940 64446 66834 -280 -64353 -17602 33422 64935 65177 56905 106667 135263 129127 118783
8276 118783 76882 47655 84633 75703 63276 23268 41437 30584 876 49791 43913 14737
8264 14737 -12692 -27445 8663 39200 51996 50673 29203 -12755 -42035 -79275 -33303 31354
8252 31354 61572 44130 39041 14472 3999 706 28925 70165 54917 32268 37485 25914
8240 25914 16125 52348 48812 13364 40093 99119 87392 60696 40963 27886 15129 12053
8228 12053 -4213 -2962 -27574 -3531 34999 37795 33837 58577 63331 65466 49729 38415 44153
8215 44153 45940 32895 46463 58563 13816 -4631 -25742 -66421 -72008 -20688 2403 -9256
8203 -9256 -7919 -484 -13729 -13724 11851 -2538 -17546 -27153 -27467 -40065 -50167 -43924 -17495 7534
8189 7534 44287 37770 33723 11862 -19488 -41768 -24148 -4445 12385 -12946 21770 43037
8177 43037 16279 2176 -1041 -39421 -24529 -9040 -59851 -84039 -7394 57739 14460 -10304
8165 -10304 -7530 23736 28561 11586 4006 -9087 -19294 -24616 -25805 -72338 -26787 20572 911
8152 911 36779 85963 107474 82495 37961 -3886 -6880 18238 5846 -18083 32015 61891
8140 61891 22906 -9226 -8211 -29473 -67639 -48470 -15938 6986 10625 8917 -7570 18128
8128 18128 23784 21244 8833 14084 -11703 -2559 25341 48331 41078 -8798 -5992 -14624 -24437
8115 -24437 5042 -13937 -22612 -7948 7167 -48660 -71693 -77393 -72654 -45410 -19845 -5858
8103 -5858 18364 6806 -4435 -16932 -1737 -9135 20871 36439 20186 13814 15142 7794 31104
8090 31104 36214 1463 -1162 -34298 -57693 -7119 19895 34945 9203 27275 13103 -33294
8078 -33294 -48686 -69257 -76983 -37309 -9393 -35623 -52408 -31459 -36890 -40731 -8403 55093
8066 55093 59039 48600 48641 33775 17050 -2774 -23629 -10260 14069 15486 -47276 -59498 -49010
8053 -49010 -9326 19418 4367 -8159 16030 78582 124228 77018 30311 -5677 -52152 -59931
8041 -59931 -60110 -23019 -3166 -32716 -52297 -86633 -101820 -52936 -54987 -48950 -4215 -4977 -32840
8028 -32840 -33871 -40391 -83714 -87302 -48396 -64882 -60894 -42798 -38870 -23516 12886 -2431 7474
8015 7474 -2509 -48405 -56837 -48076 -31956 -39938 -17316 -16295 -6598 9256 4763 -25780 -26777 -19972
8001 -19972 -1845 11437 -9070 -50742 -52061 -68570 -52395 -18154 -32770 -26980 -133 -11775
7989 -11775 5235 -2730 -7105 -16268 -32074 -31984 -69795 -96881 -91056 -15629 -16280 -44978 -36303 -12208
7975 -12208 9192 4098 -12385 -28941 -24526 3080 -16723 -8770 26083 -178 -18206 -7626
7963 -7626 1452 20157 27099 31739 39042 -1289 -42222 -2474 25472 12072 47649 61649 37368
7950 37368 44538 14341 -29179 -41740 8189 8640 33782 52718 88717 69618 61116 20741 -46237
7937 -46237 -49276 -31964 -31842 22131 43247 16205 25836 4241 -35637 -26927 23048 45957 63937
7924 63937 49749 -4529 -31417 -16773 -14899 -27954 5883 -5205 -13329 14533 15139 3821 18934
7911 18934 49671 36051 54919 97214 81164 65086 35406 6932 -28060 -91247 -84423 -34900
7899 -34900 -29351 -34394 -18389 2537 19174 -4630 -2456 11714 -3904 -23039 -9476 32311
7887 32311 72831 66880 6697 -16308 20502 -15784 -9803 36591 28450 -41844 -107104 -126733
7875 -126733 -105158 -60281 -59148 -38042 -52324 -42244 -39295 -57142 -68813 -38306 -2836 -53627
7863 -53627 -60469 -19343 4649 -21592 -27705 -16088 -34754 -85703 -53333 -56782 -113810 -96024
7851 -96024 -76276 -45652 10542 2882 -29577 -46782 -45354 -29582 -28154 -31676 -67505 -90815 -71998
7838 -71998 -56205 -56168 -27688 4147 -38737 -46480 -45891 -39687 -57215 -37497 -38614 -48757 -30858
7825 -30858 -7776 32074 35950 12873 -26465 10021 25548 39094 60738 37138 25963 -10590
7813 -10590 -24753 -3686 5825 -35631 -51102 -22638 -12014 -16720 -12018 12700 48715 29683
7801 29683 -1327 9156 21098 40269 21060 -12741 -20983 24346 31501 -2487 -36859 -41258
7789 -41258 32465 51774 30160 75261 124528 120937 84142 49526 -3660 51804 68459 45830
7777 45830 -3561 -33704 -27991 10759 11632 16490 12577 -17474 -42627 -2139 -14045 -27955 -15747
7764 -15747 -38327 -53697 -70474 -75831 -57885 -39302 -37476 -51731 -43075 -59979 -72331 -57973
7752 -57973 -62414 -48375 7524 39429 55941 79941 72111 33195 -38274 -96656 -84346 -60159
7740 -60159 -64860 -79223 -69633 -36794 -11606 -27409 -18337 -29190 -49263 -52588 -34989 -50894 -30963
7727 -30963 45426 25016 7955 61688 77480 21139 19034 57341 85499 80417 34229 15813
7715 15813 10043 31221 -4203 -50409 -56939 -46945 -61736 -68558 -92780 -85431 -25755 11207 5865
7702 5865 -38608 -34376 -3297 -38664 -54343 -35677 -33920 -38175 -37354 -32628 6712 8659 11176 -9648
7688 -9648 -15228 14348 27306 10738 1235 -9240 -13909 27191 63190 5523 -29479 -16559 32962
7675 32962 813 -15160 16542 -20688 -29141 -20445 3352 -11756 20621 11979 -38795 -91368
7663 -91368 -65138 -44152 -4817 2762 26675 -54038 -57295 -35675 -28863 -47489 -85120 -102120
7651 -102120 -70231 -62593 -62535 -92713 -117693 -48953 -19066 -27429 -22418 -52149 -50068 -76296 -62597
7638 -62597 2000 -5522 -24199 -30788 -95901 -92037 -79839 -61896 -37622 9564 11625 -8090 7136
7625 7136 20279 6135 -59510 -86161 -77657 -54140 -7204 2248 -20746 -47427 -74433 -76242 -36299
7612 -36299 1700 -34203 -54444 -43929 -32717 -2937 -66523 -76889 -23199 25559 15949 -50686
7600 -50686 -68057 -50816 -53224 944 41829 76123 43563 67967 69220 62563 81729 82491 63934
7587 63934 51528 38734 24601 10806 14666 13217 14553 22217 -22931 -76086 -90380 -73924 -36346
7574 -36346 -48286 -82509 -49815 2035 27640 36143 7423 -21426 736 31043 33667 -18594
7562 -18594 -45322 -65344 -38341 14128 21038 65341 95479 64772 26684 50565 53850 35200
7550 35200 790 -10169 -25441 -37514 -38671 -54528 -65719 -82945 -85293 -98931 -72299 -62089
7538 -62089 -16641 -12511 -20859 -60 -22323 -38480 -43334 -13168 -14671 -3647 14433 -5007 -50560
7525 -50560 -61095 -84417 -95646 -100001 -83905 -54036 -29180 -22090 -81939 -60393 -70624 -63789
7513 -63789 -60801 -58433 -49713 -42814 -87998 -104271 -98198 -95600 -44428 -15395 -12174 -12789 -22760 -39010
7499 -39010 -8483 7406 -17096 -38591 -16594 30725 45490 31376 24435 5019 -23883 -18987
7487 -18987 -55096 -8089 18973 31034 58209 48513 44234 -4991 -32063 -39796 -23373 -12098
7475 -12098 3342 2399 4058 -9728 -9376 24376 262 -24203 10255 16673 -2340 -44315 -64089
7462 -64089 -49884 -23961 -4288 17923 -18647 11229 22858 27634 28471 -10405 -43022 -22408
7450 -22408 -9642 -9334 -42880 -76255 -83274 -95622 -73894 -63770 -70745 -30237 -19137 -31303 -30006
7437 -30006 -37153 -65433 -57051 -70402 -118167 -123721 -45239 -12426 -34827 -22740 -31347 -27929 -34656
7424 -34656 -61070 -62251 -60660 -68022 -68802 -47010 -41365 -6718 38717 25650 27353 22489 28279 42397
7410 42397 29846 -28125 -22254 -4631 -10467 -3130 -10570 -13401 -33507 -16907 24078 45959 32708
7397 32708 -1407 -32457 -41955 -18896 -38089 -41939 -22527 -40916 -65779 -124263 -96663 -32374
7385 -32374 10830 -6560 -11045 -39617 -39679 -15090 11763 36433 36986 64479 72474 39192 20514
7372 20514 -134 35151 32823 12529 5299 -19740 -6768 -4299 -20794 -6584 -12663 -28164 -24059
7359 -24059 -9183 5856 1232 -22881 -15114 -37461 -68519 -64164 -65744 -53795 9831 52062 20446
7346 20446 -31381 -16741 -4456 -15256 -11053 -21357 -7556 8850 -3779 3624 -16908 -38428
7334 -38428 -63512 -51982 -14292 -32662 -68194 -111099 -86595 -57685 -36992 -57253 -58653 -23570
7322 -23570 -9925 15179 18318 -22089 -92016 -98159 -50230 -63613 -77618 -56465 -76222 -85318
7310 -85318 -64135 -41778 11903 53485 43538 14951 -18212 -19279 5768 30522 30426 -30223 -25939
7297 -25939 1475 5186 10666 37371 44379 41441 41500 14215 -36468 -18928 -14566 -9127 -5932 -30113
7283 -30113 -35950 -30884 -57869 -63631 -53372 -37335 -10860 21053 9138 -1724 13848 -7503
7271 -7503 -43988 -17676 -34348 -61402 -56930 -101231 -88371 -58042 -52431 -30775 -35128 -61810 -54143
7258 -54143 -10196 -10108 34688 47609 50716 30774 -26657 -37893 -15332 32153 33856 -13252 -36668
7245 -36668 -30191 6587 40734 68080 83790 69382 57736 36922 22546 2270 1889 -8161
7233 -8161 -66870 -58052 -14583 12458 6236 -13936 -30439 8505 6569 -33442 -50140 -57581 -36500
7220 -36500 -17418 -7895 39012 55655 46750 -15425 -30260 -27519 -15733 -30377 -20642 -25400 -54747
7207 -54747 -25947 -19756 -60604 -61602 -52626 -59500 -88269 -88876 -80051 -59707 -64514 -25482 -28987 -35044
7193 -35044 -29724 -38225 -24697 -20145 -30293 19818 18233 -39116 -90466 -65546 -72188 -122219 -103603
7180 -103603 -65224 -63759 -63046 -62540 -37752 -28884 3225 13979 17055 21204 -5762 -33548 -29119
7167 -29119 -4185 -31671 -77891 -70947 -41421 -27028 -50127 -22479 -8180 -26699 19914 71846
7155 71846 42849 3248 -3335 -22399 -15259 -11792 1497 14993 -52779 -91650 -61925 -50196
7143 -50196 -28545 29692 50644 63434 24313 4190 29716 61187 22757 -49778 -39751 -3586
7131 -3586 11870 28052 26317 20354 42435 21090 26161 58218 39814 2012 -15539 -48916 -66481
7118 -66481 -15219 36727 37364 -4790 -39794 -9931 -30256 -95593 -87271 -61671 -53352 -2355 -8710
7105 -8710 -38557 -8352 -3719 -22447 -51776 -60260 -53552 -38025 -24841 -15516 16085 20439 20340 18254
7091 18254 49355 32840 1488 25638 37996 28132 33527 50681 55474 74587 72208 71434 81107
7078 81107 61050 18005 25618 32432 16377 29291 21927 -26907 -46757 9765 52597 50556 39615
7065 39615 26071 3310 -1685 -10750 -46211 -41639 -79582 -88965 -81400 -61606 -15764 1443 46665
7052 46665 54926 -42113 -99854 -90477 -55859 -26600 -35493 -47410 -42611 -37152 -29517 -46729 -77145
7039 -77145 -80391 -74979 -94356 -60793 -17171 -8871 -37351 -19717 -2009 -42763 -60510 -45869
7027 -45869 -45953 -13270 -2594 -580 -21565 -6295 12908 -18979 -23053 -59045 -31195 -25776 37521
7014 37521 13968 -59915 -59035 -31819 -20382 -7236 -36217 -44399 -35687 -48897 -46127 -74549 -84342
7001 -84342 -29919 -26733 -61685 -82641 -46018 -20034 -25736 -9514 293 10275 5609 -22904 -18485
6988 -18485 -14432 -8611 28495 26245 26869 17594 -42973 -51550 -52941 -45160 -28353 -75906 -111734 -92549
6974 -92549 -85950 -71346 -89548 -92299 -79845 -71632 -82430 -39684 5345 104 -9863 8537 -4661
6961 -4661 -11018 9393 -1591 -29888 28749 14914 -25874 -17312 -3122 -15142 -19383 -25187 -30451
6948 -30451 -12594 -8912 -22403 -29492 1322 -13425 745 -15641 -62206 -37214 -1060 24840
6936 24840 10808 15871 32101 13362 -21402 -35285 -25549 -17702 8314 28401 30180 -7447 8561
6923 8561 31713 29348 696 -29279 -61976 -38279 -13857 17054 24173 8696 -765 -34627 -64799
6910 -64799 -87594 -79955 -76374 -43524 -37506 -43684 -26051 -37297 -25921 -30492 -30400 -25365 -12118 -8941
6896 -8941 -63435 -75203 -7701 39167 62285 69429 35681 -49500 -72568 -32425 -17730 -26981
6884 -26981 -72477 -33489 39439 24648 -22849 -25192 -8413 -6783 -27872 -54782 -53383 383
6872 383 33836 5960 -6379 -31842 -47447 -60200 -86196 -81339 -50019 -46486 -39927 -44785 -49686
6859 -49686 -42586 -35307 -53618 -46115 -23293 -33219 -13908 -9719 -17106 -68501 -116223 -132898 -88120
6846 -88120 -47974 -41736 -36906 -36895 -35778 -4976 -15326 -62528 -117082 -138583 -146493 -109939 -83912
6833 -83912 -86172 -117059 -90248 -52367 -51536 -28663 -30034 4398 -7883 -39679 -38131 -64766 -58730
6820 -58730 -18562 -5660 -15546 10156 -8244 -27159 -56064 -97008 -125977 -144125 -136341 -90316
6808 -90316 -82785 -41009 -21574 5241 -11835 -4532 10498 -36451 -37115 -9952 41265 35282 18024
6795 18024 4030 -69229 -101572 -45754 1828 14885 10385 -36048 -67851 -43139 -29183 -33960
6783 -33960 1112 10091 -10865 18363 39536 7009 30282 22178 -18529 -28217 -4679 53642
6771 53642 50823 -1036 -43191 -56267 -90627 -99766 -59983 -18924 -30863 -36801 -44310 -45181 -6040
6758 -6040 2640 -19169 14653 20001 22516 9520 -31445 -76983 -52698 14723 -6065 -35028 -18261
6745 -18261 38503 38013 32873 13443 -39862 -48533 -26786 -26117 -36913 31106 88430 120696 78129
6732 78129 31211 59731 76936 37766 -37625 -60510 -50445 -25856 -21075 -9950 -34644 -18276
6720 -18276 -31735 -102030 -76320 -60945 -32433 1027 28347 12063 12694 29893 25150 -11798
6708 -11798 -59622 1410 30863 6358 -15201 -29725 -25941 -28791 -6595 -11286 -48779 -46536 -72124
6695 -72124 -64876 -10698 2580 -29675 -36759 -30638 -13310 31355 19542 -22987 -40444 -36335 -30899
6682 -30899 -5453 25271 4946 -62735 -67371 -36951 -21189 22089 26847 -12766 -20747 -10101
6670 -10101 25822 87739 52889 -15947 -48044 -58091 -31596 -36542 -26995 -59636 -71965 -74269
6658 -74269 -40460 -14641 22827 47109 53467 13118 1894 -8412 -9954 -29702 -49213 -33737
6646 -33737 17959 2758 -45399 -59308 -58412 -51433 -69465 -67438 -67223 -80389 -77807 -80341 -43993
6633 -43993 -2267 17256 18100 -26859 -73040 -62438 -49169 2438 42548 21777 -10412 -30805
6621 -30805 -58940 -65214 -56349 -65604 -40764 -18006 -12173 -38072 13361 25329 -21290 -30729 8422
6608 8422 42209 11672 -19718 -29857 -40637 -17197 43273 60288 57138 44959 5238 -14262
6596 -14262 -17347 -62826 -100638 -85742 -44926 -32942 -51372 -26316 -27239 -13189 -17907 -7481 -33367
6583 -33367 -85107 -95363 -25385 -6674 -7259 -24794 -24452 -14434 -12870 -5366 28824 -122 -51494
6570 -51494 -63604 -97625 -97726 -103536 -58648 -32002 -6911 -8428 13787 40247 31674 51848 24574
6557 24574 10535 17475 11153 1413 16236 -11479 -20755 -61073 -87367 -74100 -73949 -74647 -72548 -70092
6543 -70092 -30655 -25287 -44985 -38807 -46729 -15251 39705 64594 30385 -24763 -37714 -7234
6531 -7234 -11651 4688 28341 27263 9740 -26264 -11112 -33496 -58219 -41296 -63543 -75743
6519 -75743 -58145 -69117 -69258 -78222 -40982 -58781 -55334 -33673 -22323 -432 1756 -15753 35524
6506 35524 88908 95763 56082 -267 -24832 897 8317 -17650 -63612 -39753 -22659 30801
6494 30801 27010 22444 -7090 147 7963 -16934 -54233 -42845 -35397 -46880 -45045 -57627 -18633
6481 -18633 -50507 -72280 -53510 5862 39291 53016 34810 -22695 -24750 2179 33124 27270
6469 27270 2484 -58243 -79262 -84912 -9861 45953 -3513 -12444 1449 -23968 -44971 -69427
6457 -69427 -36605 4407 -23402 -51731 -60276 -45019 -57324 -29655 -14885 -23825 -17099 -37401
6445 -37401 -55541 -75122 -75684 -112790 -89001 -90402 -41947 -41732 -40940 -19705 25441 29485 22565 6517
6431 6517 -24122 -22725 -2054 -10627 -60849 -46009 -18926 33205 73683 43251 14296 -30310
6419 -30310 -103414 -111565 -100527 -64948 -37612 -32204 -37019 -44202 21541 26600 -29558 -30434 -3202
6406 -3202 32666 21146 3503 34203 35783 4361 -12601 -78521 -80358 -71399 -23064 -10599 -81596
6393 -81596 -64926 -21083 4385 7179 -50055 -53736 -39591 -36518 -65489 -56038 -8866 24539 -6063
6380 -6063 19914 46036 24641 27510 48735 64891 77240 47571 -8323 -10338 -22295 18691
6368 18691 55462 42150 10766 -33828 -48115 -35210 -24568 -7067 -13620 -51450 -45680 -32673
6356 -32673 -23638 -60833 -66120 -31942 -61357 -94025 -126935 -121976 -78519 -44744 -14501 18545
6344 18545 -10213 -7934 4386 24493 16465 -5394 -27341 -52656 -8122 9515 -10285 -25926
6332 -25926 -30795 -21867 7925 -22070 -69733 -90214 -80890 -81884 -46966 -55767 -77706 -37000 -25932
6319 -25932 12286 53389 89879 51472 2048 24015 54573 44698 -9080 7592 24225 30300
6307 30300 7377 32537 70586 34077 -45425 -71378 -33996 -34345 -21987 -8976 -19114 -35750
6295 -35750 -26067 -29953 26242 13824 22675 4149 -50022 -37335 -32943 -20467 -35157 -43610 -57404
6282 -57404 -69913 -28812 -21623 -65237 -99783 -112388 -67188 -40346 -1564 12381 -14460 -26313
6270 -26313 -28957 -16388 -5525 -37114 -35988 -18481 -50283 -60585 -67814 -48042 -44077 -50123 -38898
6257 -38898 -7666 18855 30236 18028 15009 -1533 -3790 1092 22556 40306 55939 65370 24911
6244 24911 7357 7793 26937 37919 24688 24570 8424 15152 14270 -15203 -22074 -15900 -36995 -48023
6230 -48023 -58244 -59856 -48644 -13118 -42696 -31898 -36374 -63190 -86306 -74574 -46805 -53284
6218 -53284 -50092 -44845 -53538 -73315 -64758 -68314 -64281 -6879 -22096 -91437 -111626 -108493 -115978
6205 -115978 -89960 -36268 10328 -12659 -7425 -4983 -23211 -15180 30374 25518 50572 38235
6193 38235 59343 34194 16219 52155 33399 17636 -4675 -18092 -6531 17000 -845 -24453
6181 -24453 -18945 -31174 -44666 -17005 -31737 -71632 -83587 -14976 -18322 -39699 -12055 21414
6169 21414 32725 12711 -3730 -2706 -85695 -71370 -14413 -50884 -46832 -42863 -21848 -32726
6157 -32726 -43035 -44898 -3719 15989 10247 -2212 -24645 -74936 -60004 -5792 54777 71348
6145 71348 43831 -45424 -78280 -20854 -10104 -19519 -18465 -14681 -20512 -20648 -19528 -12466 12488
6132 12488 25891 36780 56533 59411 -320 -30724 -15063 -11196 -18616 -50342 -52460 -35637 -52995
6119 -52995 -51721 -26186 1638 19606 15308 17659 49494 9345 -35798 -4321 17114 47000
6107 47000 120519 143142 101755 34971 3606 14913 -18445 -19555 -1872 -13689 -18877 31805
6095 31805 19662 -28124 -14409 3487 29454 -9581 17163 49907 56694 29311 -1211 -1954
6083 -1954 -9319 -1394 37425 32823 23175 -19927 -9096 20386 19088 10877 -30839 -52083 -31600
6070 -31600 -21647 -8263 -22186 -54619 -59114 -49548 -30348 -18921 -48330 -72056 -42396 -22303
6058 -22303 -50690 -48045 -12102 -3182 -773 -11126 -47681 -94537 -86134 -86242 -84376 -69860 -67465
6045 -67465 -44572 -62811 -63244 -48487 -34312 -9335 -28822 -28029 -45201 -41963 1851 8349 -1542
6032 -1542 -35129 -49154 -18913 -15948 -14020 25819 14366 -10703 -44145 -74715 -68604 -63401 -66286
6019 -66286 -70978 -22947 -473 -9242 -14095 -18397 -14164 2829 -10631 -2292 -20356 -21476 -17644
6006 -17644 -31009 -58317 -49898 -38090 -11089 -1411 -4338 -13826 -32602 -27823 -26537 -53797 -58562
5993 -58562 -1570 22165 12130 -32941 -45410 27696 71420 39383 -50415 -56455 -78271 -70571
5981 -70571 -28532 -15218 -37211 -13371 -24544 -22552 -24018 -42869 -33459 -62588 -100655 -85868
5969 -85868 -71147 -89308 -77788 -7757 -1014 2013 23216 69195 66145 50046 65042 65296 26366
5956 26366 3082 -16115 -2950 -46654 -39766 -13946 -32938 -12990 -2288 22756 30659 43539
5944 43539 33607 29860 23736 17703 48256 30303 35390 22910 -15768 -10264 10866 31135 11551
5931 11551 -31407 -24339 -7118 -10008 21035 26227 57528 55091 23220 -2965 -10561 -24201 -24973
5918 -24973 -17265 -16293 -7347 -26574 -61968 -74291 -64444 -63537 -68856 -59801 -35030 -22133 -43804 -52015
5904 -52015 -37529 -47731 8 35972 5464 -26045 -46502 -44090 -46461 -43702 -32920 -15009
5892 -15009 -12336 65994 47206 -32944 -43777 -39330 -14609 5730 -366 -69615 -80965 -76319 -81626
5879 -81626 -48194 -16462 1260 23978 -11318 -10847 -42786 -96554 -101474 -46617 925 18609
5867 18609 26991 18572 34230 46362 7458 1957 -22785 -18251 19526 -15940 -12496 26918 47458
5854 47458 51790 31148 2136 -29739 -46575 -43517 -28622 -16200 -6348 -30125 -45479 -72054
5842 -72054 -50328 -3625 -30010 -28380 -17712 -15631 -38340 -15029 -14473 33271 50800 36214 19777
5829 19777 -6228 -25066 -38986 -19033 -18159 -27861 -32087 -19822 402 -9461 -6846 -19643 -56805
5816 -56805 -50275 -37836 4030 13524 -10985 -33429 -76601 -96039 -76367 -52957 -33096 -23920
5804 -23920 -18925 -32962 -34965 -31261 -16444 -24282 -21514 -14944 -34592 -18950 -24294 -8284 -28233
5791 -28233 -49385 -19188 -22430 -50047 -38425 -19991 -8388 -22427 -37763 -57128 -57538 -31008
5779 -31008 -47687 -66915 -41262 -67162 -67491 -29350 -24085 -59275 -79665 -60655 -49681 11523
5767 11523 48755 59869 42169 32785 34474 4890 -24349 -13964 -6614 10692 4814 -28088 -42245
5754 -42245 -23417 -25421 -32521 -40054 -48576 -67981 -57697 -38705 -35296 -21235 -20625 -41459 -43404
5741 -43404 -42430 -24471 -5714 336 -15851 -33642 -31271 -12895 -44340 -67959 -67494 -45653 -10083
5728 -10083 7193 13331 64041 96475 93871 44907 23665 52025 50193 17095 19182 8711 -10660
5715 -10660 -28942 -24825 -3127 -8494 -52090 -22238 13893 5768 12628 43239 46082 24104 -8019
5702 -8019 -33160 -58197 -43419 -26475 -55241 -68391 -36939 -24563 -40934 -46885 -22046 16958
5690 16958 15272 12142 25923 429 -4813 -10125 -20622 -66166 -63384 -4854 11012 17894 23577
5677 23577 4489 17291 -13111 -27066 -33855 -1900 -11094 -25427 -2257 14454 5212 -10129
5665 -10129 -11632 -14377 -16551 20486 21193 29263 18349 -6142 -21772 -45171 -73530 -85577 -101558
5652 -101558 -92173 -54317 -35167 -46098 -71806 -84516 -86371 -41213 8855 -20365 -60411 -110078
5640 -110078 -115629 -78691 -48263 15427 39859 -18821 -59745 -75922 -74019 -57274 -37867 -14366
5628 -14366 -25597 -4302 10735 -5258 -24430 21596 19866 -9613 -9603 1312 18305 14455 1982
5615 1982 -11976 -2827 -6485 29010 21095 -13757 -41757 -51921 -31308 -6782 -31670 -42693 2207
5602 2207 36834 30901 25173 -4286 13620 10644 -8786 26147 22263 2946 9603 20368 28488
5589 28488 35041 12942 2646 -6779 -66757 -82965 -52870 -20053 -48224 -74319 -85128 -105330
5577 -105330 -93416 -59440 -36273 -14946 -40732 -74173 -100957 -110076 -107312 -45242 -16770 -31504
5565 -31504 -17122 -37863 -33887 -28254 -35440 -6104 11823 22511 6964 34313 29210 14014 40874
5552 40874 44752 27308 21314 18063 -14387 -37904 10325 11350 4198 14952 23618 3606 -25655
5539 -25655 -44838 -68437 -66313 -100278 -95339 -27458 -12592 -26937 -36288 -34843 12835 58360 62104
5526 62104 51060 52367 57454 39452 39796 26649 14277 12113 35814 43077 20824 728 7134
5513 7134 24920 -4658 -32729 -49951 -49703 -61562 -29278 -15246 -31005 -58395 -96751 -99539 -69107
5500 -69107 -48092 -47414 -45290 -36642 -28782 -35314 -58576 -60591 -30948 -7503 -39221 -71333 -23563
5487 -23563 17597 -21323 -60696 -33041 -42782 -62469 -60521 -66722 -79582 -126638 -118881 -27323 -20207
5474 -20207 -40507 -45948 -15768 -2230 28717 28785 -10616 17758 58486 35964 46231 66885 51547
5461 51547 3935 -42952 -67237 -92177 -96856 -93699 -67335 -48501 -58763 -67996 -59253 -34515 -13027
5448 -13027 -22716 -10007 28438 35061 2373 2280 8838 -41057 -50854 -33655 1340 29753 53386
5435 53386 17957 -28990 -27464 5043 3057 13281 32946 48523 25523 12839 -34402 -12634
5423 -12634 24500 23283 10313 16628 7397 18784 -5861 -10788 -21485 -54156 -45282 -7364 14808
5410 14808 43841 38027 29916 -1876 14176 15464 20975 10205 27056 13486 30417 45271 25766
5397 25766 41837 39073 11170 -2828 -8836 -25851 -44999 -28431 -33032 -30677 6479 32134 26414
5384 26414 9518 -11002 7135 54428 21701 3516 -20253 -20373 -23091 -20800 -28495 -19820 -11905
5371 -11905 5203 -3167 -19596 -52036 -32530 14224 10205 13451 -14403 -68475 -54662 -39521
5359 -39521 -53704 -70276 -86217 -94972 1233 65721 62325 37465 48857 50779 46971 2900 -938
5346 -938 16939 24425 37152 37284 -2424 -64458 -106371 -49965 -7662 -6214 17537 3036 -131
5333 -131 -19788 -52471 35989 68869 20954 -4516 -34394 -21332 -302 -4913 -3023 11840 -10920
5320 -10920 -44152 -46830 -15579 13353 -456 -26112 -29369 -130 21194 -36019 -7427 3749
5308 3749 -27905 -41739 -31133 -41642 18796 22520 -31122 -62387 -21906 -5951 -506 29310
5296 29310 90179 52199 25808 9026 -16374 -70606 -96377 -46490 -40867 -53886 -58240 -71428
5284 -71428 -23879 -30260 -7610 21047 1870 -4443 4521 10515 20300 1254 19360 51318 53361
5271 53361 55086 88991 56706 45317 63091 44938 23233 62401 78742 46597 53663 67315
5259 67315 81326 30896 -12678 -10417 -7436 -3463 -12357 -34362 -42918 -67025 -67220 -42345 -49064
5246 -49064 -26234 -62432 -52777 6709 46963 60479 59781 22943 -9152 -5660 -10329 -5759 -6537
5233 -6537 640 -8955 -24548 -32560 -11809 19679 35562 12306 -43408 -42459 -37821 -53835 -38821
5220 -38821 23343 36725 20434 9440 -9228 812 27951 30946 -18444 -41189 3645 3752
5208 3752 24984 -14663 -56322 -62628 -61120 -81760 -78414 -13922 23123 49541 11903 9033 13271
5195 13271 -31989 -31763 -5326 -25742 -1996 15982 33597 -16354 -51983 -58096 -28091 -10866
5183 -10866 21663 42808 13054 26051 -13913 -23503 -44035 -62575 -79616 -43548 -5054 20744
5171 20744 6627 8016 -6151 -32304 -49450 -39736 -20416 22074 11087 5120 15341 7385 11718
5158 11718 39262 63139 48802 37007 36594 10693 -18127 -13458 -27026 -33487 -35590 -16234 -21656
5145 -21656 -25725 -2931 5106 9657 26002 29741 10124 -23622 -18801 12048 -28465 -29023 -12753
5132 -12753 32982 45667 5316 12136 23027 17719 58336 63297 44861 59522 51545 23175 25949
5119 25949 1783 17923 47231 3627 10633 25508 13231 -35467 -97734 -129336 -100720 -78115
5107 -78115 -74192 -41044 -7380 521 -23824 -33664 -16026 -22669 -27510 -48091 -6971 43893 61229
5094 61229 22749 -9101 -45965 -22966 3330 4832 -18462 6327 26163 49416 53960 28756
5082 28756 24830 6505 19729 -21680 -10512 -18524 -58081 -77656 -68540 -43684 -16804 -44706
5070 -44706 -29918 -22332 -21988 -39165 -46314 -49974 -73382 -50937 -33184 -67634 -70972 -50730 -6955
5057 -6955 -20241 -15734 -18695 -58036 -19411 31119 47551 44731 33050 38309 69469 66693 47884
5044 47884 77265 64816 -3015 18265 63602 82865 82158 64881 60235 1802 3924 6783 17664
5031 17664 8691 -29979 -71574 -16235 -10509 -40169 -49999 -431 -25506 -56492 2921 26536
5019 26536 -28454 -58060 -38586 -1763 9223 -30485 -38958 -68126 -124612 -109629 -84987 -61706
5007 -61706 -19366 -27673 -42315 -12130 23431 43075 40768 63251 39725 7037 9744 -17837
4995 -17837 -61751 -90013 -79006 -43894 -18116 -8756 15255 44083 45326 -9986 -26358 -35338
4983 -35338 -19519 3599 9426 29056 41142 39667 13707 -23936 -45393 -70491 -53155 -2320
4971 -2320 7408 -19577 -71695 -74684 -29499 14335 30752 48148 14231 -225 72331 85307
4959 85307 76697 80533 34872 26605 19324 30325 1255 -4260 -10720 9705 -9523 -22236 -54673
4946 -54673 -82338 -44629 -36142 -31878 -52548 -82080 -33055 28464 46975 53149 76669 81963 46487
4933 46487 43421 8191 -16355 -4615 -9991 4606 -12014 -35317 -18916 -1051 -36697 -59281
4921 -59281 -67688 -63348 -64442 -14370 48749 37706 -4552 -38252 -39225 -15427 -788 -23134 5262
4908 5262 48603 37117 28116 11408 16241 52732 67381 90281 68225 6950 -53115 -65093
4896 -65093 -55220 -58989 -7481 53132 44511 389 -14095 -8802 -21408 -27490 -38517 28444 45887
4883 45887 53162 52403 23917 -28908 41133 46764 -7278 -49204 -78324 -58918 -55063 -11895 14161
4870 14161 -15864 -50918 -8403 30509 5923 -56925 -32820 16430 8055 -8462 45015 46519
4858 46519 51462 119987 98600 56221 16264 3823 4871 -7144 -27626 -28695 -98 -9960 -1612
4845 -1612 2128 -1393 7157 -2162 -10639 -3179 16442 40496 43914 -7473 -2432 2750 1859 18018
4831 18018 18466 2942 -7415 7765 -300 -32609 -75168 -41487 -24653 -13611 34553 61193
4819 61193 84213 80904 52598 -9650 -43178 -34121 -1091 -4090 30538 56818 45081 7698
4807 7698 -7436 -5895 -20704 -3965 -2061 -45708 -41653 -37186 -71049 -56500 -39153 -21835 -21309
4794 -21309 -34384 -39933 -46623 -16348 28168 56396 53774 7055 15402 -15474 -26491 -17114 -2202
4781 -2202 -14488 8230 23738 17190 23886 -12404 -39373 -58523 -38300 -56487 -88844 -49089
4769 -49089 -23374 -36815 -46330 -72540 -74535 -83320 -97447 -110754 -91220 -63781 -12968 -1298
4757 -1298 -495 -11307 -25091 -2120 10968 13612 -29098 -40955 -85736 -96167 -93782 -67296 -68763
4744 -68763 -55618 -32513 -5937 20345 -8516 6263 8532 3863 4866 -24191 -41239 -50965 -46275
4731 -46275 -50901 -61901 -59375 -37824 -59135 -82012 -92816 -63049 -1169 56064 33927 29604
4719 29604 6321 17617 28983 12902 13705 -37763 -58220 -3358 -13485 3609 38613 62499
4707 62499 54082 -27377 -29059 17955 36110 21001 -1939 -8006 -2790 26641 17013 -22038 -4305
4694 -4305 9308 8094 31105 53877 37446 28801 16597 -34149 -47000 -5549 -40605 -10983
4682 -10983 28602 13063 -20667 -10661 -25808 -79942 -97059 -12869 -7732 -39918 -30647 5263
4670 5263 46231 -1003 -60451 -73583 -41164 -27958 -45481 -28386 -25641 -3488 -28299 -33877
4658 -33877 -32465 -72445 -84295 -39411 -55224 -65786 -39794 -45229 -24461 -55231 -44260 -16647
4646 -16647 1010 13081 31396 30024 45545 67129 31938 14585 41641 78301 58006 52427
4634 52427 19531 -25370 -43208 -15683 22057 18821 33079 11067 21672 -7702 -28543 -27445
4622 -27445 -26176 -2613 20785 17060 8828 35694 30848 18556 -6511 -42176 -30797 -43300 -52835
4609 -52835 -10839 -2273 31536 21558 -14078 -29997 -26921 -28992 -11438 31634 -717 -45641 -41693
4596 -41693 -22372 -15828 3141 5050 -14 -36891 -51133 7387 -19371 -70794 -64356 -58050 -66342
4583 -66342 -119016 -93664 -41609 14675 24771 11737 -1938 -10076 2839 -9887 -45332 -62554
4571 -62554 -52058 -30293 -83298 -60160 -36534 -56625 -36367 -5243 19661 24103 4800 -8478
4559 -8478 -8611 -21125 -31515 -26240 -11394 32848 25641 2275 -25545 28607 45428 19429 -24868
4546 -24868 -15955 -31917 14837 29324 -13379 -27584 -34214 -1907 23297 17997 9875 7596 79
4533 79 16198 11540 3250 4701 17835 -28164 17501 38676 -18359 -2339 -29247 -34657 10188
4520 10188 33127 10534 13864 22353 6653 33368 52556 31554 -20402 -32373 7993 26488
4508 26488 31507 -1477 -32900 -89000 -86158 -78664 -1862 -24141 -68265 -66328 -99281 -134524 -126938
4495 -126938 -100927 -91721 -84139 -20456 41954 15973 6942 39372 27012 50899 70210 88864
4483 88864 102020 104433 52813 8149 -3382 8525 18237 19918 40558 11567 -13694 -15828 1275
4470 1275 5182 -8230 -49461 -24996 -4826 768 -14971 -52084 -68930 -40864 -37566 -27224 -12577
4457 -12577 -33645 772 28807 54885 62428 59921 44552 39811 6323 3934 18701 22687 30430
4444 30430 33070 18522 -1183 -40607 -39134 -49312 -64534 -25293 27222 5417 2119 22203
4432 22203 4579 4877 -1662 -27475 -65338 -96454 -78093 -83692 -52311 -10680 -14043 -10029 5499
4419 5499 -16249 -5101 1740 -12097 -42624 -52964 -29938 -13887 4456 25770 22773 25997 29893
4406 29893 35729 18935 17380 60533 43763 -16527 -31110 -63790 -53581 -18313 14473 9106
4394 9106 -26282 -34035 13227 47714 27366 32680 45303 25729 18590 10696 -51918 -74079 -59614
4381 -59614 -98736 -77440 -40279 -30416 -55219 -53244 -15402 -13308 -25555 -11928 15205 17440 26053
4368 26053 31509 51605 34484 -4026 -40259 -23849 -38372 37578 67456 38545 40616 60344
4356 60344 42825 33043 -5635 -29291 27225 49071 32685 28235 38912 56156 87521 50873
4344 50873 27247 37280 29657 39703 31682 58041 48379 34018 34374 929 -42416 -45719 -40586
4331 -40586 -11511 18815 16065 1047 20800 8537 11267 12250 22460 43383 -3087 -39275 -62683
4318 -62683 -64152 -70462 -41014 -7617 2191 2593 8339 -1116 -31014 40794 45467 50470 55903 34280
4304 34280 11388 21783 38947 10695 -19615 -19913 -25925 -12719 -12215 36855 26792 5765 27604
4291 27604 17751 -10586 -3126 25391 36541 48793 24408 -10075 36310 66540 100810 84971
4279 84971 27040 22249 11099 9858 11538 11317 -187 -27293 6173 55284 57329 26384 -13942
4266 -13942 -25320 3428 10031 27254 24256 -2367 -33753 -14709 -41773 -28118 -20709 -19316 -44696
4253 -44696 -61446 -81604 -51697 12217 17274 25359 26158 -7722 -43060 -27546 -75702 -92781 -52959
4240 -52959 -13205 -7655 19258 12232 -22958 -15572 19003 -3966 -39155 -87740 -89289 -44199 -23013
4227 -23013 -11711 -12258 -12493 34497 44985 23220 3340 5708 16391 32481 -21558 -37550 -43017
4214 -43017 -39247 869 21348 -7309 -33290 -57395 -91048 -54516 -28146 -21173 93 42051
4202 42051 67339 92197 121734 81716 31166 19573 9812 -24967 -30713 -63815 -75227 -9650
4190 -9650 45096 29635 -28014 19169 30700 5805 19754 135 -1119 -55392 -44627 2041
4178 2041 -21220 -70129 -56331 -30607 15116 16149 -22953 -50902 -66532 -34886 -27264 -56754
4166 -56754 -3543 36726 50190 -18898 -55247 -52059 -72311 -102641 -115341 -48020 17432 48337
4154 48337 66777 39823 -17104 -15204 -10640 -24887 -12379 -2524 841 1142 6140 13872 -5818
4141 -5818 -20566 -24069 -64520 -40177 11089 60750 70592 80376 38883 -6768 -32339 -8966 -13734
4128 -13734 -36575 -19080 -22369 -11312 -25410 -23418 -9969 24009 13682 -31221 -50750 -22574
4116 -22574 23759 49019 49846 43003 12576 -2501 11771 31228 39158 38173 -17862 -43186 -3947
4103 -3947 15642 18326 11254 -3553 -11539 19970 51125 36570 6057 5452 -9662 5436 46172
4090 46172 47986 -1534 24239 39581 11445 -9489 -13525 -23911 -24002 -36580 -27928 -41477 -21132
4077 -21132 -36208 -15178 -3940 -6064 -4653 -2790 -2041 -19873 -45641 -53685 -45005 -5088 -16148
4064 -16148 -27555 -13528 -13932 -5320 -34194 -71874 -75571 -77770 -44796 -15924 24438 60067 49096
4051 49096 20398 29831 34868 39698 27656 8713 4841 2955 -32392 -19552 -7453 -33638 10003
4038 10003 14977 -45378 -77585 -66097 -28874 -36744 -5359 -16122 -2735 27801 11463 11871 -1040
4025 -1040 -12588 -32830 -103941 -86453 -155 19166 20031 58990 53781 -23478 -29291 774 2571
4012 2571 -5235 -19046 -14906 -532 38095 23668 2861 23779 44319 48330 3240 7338 33231
3999 33231 69702 82960 63057 49558 12864 2089 25187 12383 15282 20401 36560 41123
3987 41123 29241 38541 25247 22112 48308 57607 59727 76661 38139 16218 959 5123 10832
3974 10832 36783 68377 7858 -14856 -26829 1361 12419 7342 20732 24620 22758 35111
3962 35111 4847 -28128 -49643 -27062 -31639 -21405 -34588 -42396 -42297 -32593 -60809 -45320 212
3949 212 10048 24166 24517 10596 -19364 -21971 18399 23783 22612 35037 57019 20428 -7615
3936 -7615 4587 17831 21834 13110 37298 49381 18871 -27787 -49550 -15637 52245 42960 37884
3923 37884 36265 -13973 -34551 11275 39832 -179 -854 -13493 16120 50256 47101 15456 -27204
3910 -27204 -20852 48103 72742 37622 20188 26984 9372 -1934 28290 -4509 6433 48393
3898 48393 81435 54210 1820 -10890 -51390 -66279 -62147 -39750 33609 55057 34940 44568
3886 44568 37744 13091 19521 33883 18508 9243 -26150 -10053 -2493 -2988 18542 -8493 -19536
3873 -19536 -13670 -45722 -61837 -14148 -19013 -39071 -20869 25271 45080 31081 38335 4847
3861 4847 -20630 4614 10915 -6563 -22249 -45074 -34783 3085 39882 13872 -14494 -37657
3849 -37657 -36290 -40846 -43073 -7064 74255 65597 40917 20145 65574 74481 46175 61597 21912
3836 21912 -18443 -7532 10262 -5047 -4923 10948 7762 -10050 966 -21597 -28949 -9894 -26158
3823 -26158 -42264 -84127 -70939 -36448 -24719 -25550 1888 -12289 -17176 -53643 -74290 -30274
3811 -30274 8057 6405 -11585 -12427 4684 8421 50365 10049 -36827 4869 28747 31542 -20027
3798 -20027 -32969 -18471 -27210 -22829 -22876 -22528 -15792 -17 17213 13995 -34452 -41169 -40188 -27595
3784 -27595 16740 -10603 -101434 -117054 -30150 -26846 -30359 -11207 10810 29890 9423 13933
3772 13933 45528 13430 -6491 -11342 -4879 -19781 -43615 -9208 8341 18814 31633 42094
3760 42094 63658 83904 56975 37301 11414 -11858 -24070 20173 44913 26459 52356 68008
3748 68008 45724 33533 -1076 -8497 -14032 14198 41038 15764 1910 9943 656 13089 13959
3735 13959 -19066 -25382 16547 63675 39331 29148 45685 79037 105807 93479 104835 97043
3723 97043 50087 41313 29673 30920 77158 104963 85781 76294 44917 46028 67571 64647 59614
3710 59614 25408 28882 18466 -18884 18134 24742 -5306 -47485 -15692 -23977 -16275 29620 40466
3697 40466 57850 44934 29316 29506 29142 7929 19458 53632 3901 -60222 -76181 -65163 -42595
3684 -42595 -46595 -75319 -62311 -17790 13524 18220 -13659 -44245 -45576 -11009 2790 -5851 10770
3671 10770 19937 -6570 -34775 -11354 -12866 -26465 -22415 -19328 -21347 -2557 59126 45883 44207
3658 44207 24405 -29375 -23184 15330 69574 52866 77924 77831 45075 27141 -16678 -46760 -13716
3645 -13716 24121 27376 -37580 -22853 -3886 2030 11339 -2964 -27427 -4265 37820 18080
3633 18080 33006 81273 84013 -1175 -10136 -24297 -16634 -19717 -19636 -7941 13197 34128 10811
3620 10811 23674 41363 16197 28328 35993 62541 82931 62233 27279 25584 43901 19445
3608 19445 -19670 -57007 -59389 -54460 -10530 -3539 -24128 -68537 -86999 -49955 -4163 -3189 -14350
3595 -14350 32894 35337 -12352 -21111 -45916 -67086 -43169 -23413 -6882 -74160 -66648 -24750
3583 -24750 6974 1762 3897 5266 -7777 -14897 39025 51257 77505 28244 35462 43484 37422
3570 37422 35870 40787 27438 -19760 -24906 -25430 -16619 -61437 -64779 -17796 9533 37660 58224
3557 58224 18717 17442 57598 21796 -7531 -34041 -56762 -40088 -40171 -58152 -41536 10849 51151
3544 51151 13853 -30610 -28604 11498 46275 41035 -5033 -55090 -55185 -3814 3045 -37986 -36086
3531 -36086 9904 54467 48367 58422 54718 39583 42573 65605 76646 51257 47174 18630 46298
3518 46298 37757 -24773 -22815 -23091 -43509 -68902 -70586 -28915 -53378 -46525 -20318 -41736 -42952
3505 -42952 -21931 -12677 -23550 -69598 -37778 -12389 14617 8420 -10601 -9774 16325 26145 -7818
3492 -7818 -30213 -38534 -33258 -45341 -56366 -2318 58348 59428 21932 15606 33845 31091 22723
3479 22723 -22435 -46464 -43374 -50654 -9849 6263 26262 32421 46840 41654 53815 64185 11075
3466 11075 -24999 -9763 3167 20846 4666 -46053 -60484 -47274 -9450 33286 -9406 -10314
3454 -10314 42236 64695 60158 30500 -94 -32811 -24541 -32585 -59962 -55329 -32819 -19640 -8365
3441 -8365 -63050 -71391 -31204 -6777 -15339 9833 43523 28633 2147 -23710 -49143 -51804 -20929
3428 -20929 -18537 -14626 24106 41943 27616 -20115 -36095 -44958 -6958 19937 4163 -52371
3416 -52371 -95676 -79350 -102928 -109567 -76678 -20252 28986 32500 47390 94418 28595 2472
3404 2472 21186 893 -11520 -952 4792 32903 34232 19019 7801 -10245 19854 29360 6034
3391 6034 11127 33316 57858 64482 14251 -26495 -51233 12685 45966 2406 -35341 -51406
3379 -51406 -16012 23896 -926 2862 23998 57817 38813 61785 87652 95094 78507 82945
3367 82945 92390 36460 4738 -18412 -11482 3181 44792 51579 35047 13582 27010 46246
3355 46246 22022 20895 11984 13585 8091 28690 24764 266 -6660 17917 63494 78274 13797
3342 13797 -54544 -37048 -31948 14006 69512 93917 88693 30733 49537 74283 49675 26787
3330 26787 35754 1063 -6956 -2647 -13746 -4640 -4971 8506 30492 16000 2276 47366 73493
3317 73493 38115 -5493 -12371 -35820 3153 55711 58763 19862 4673 -18591 -17242 1858
3305 1858 -32697 -23769 -28186 -26177 -59679 -17056 24909 14090 -373 3619 -32009 -22754 3032
3292 3032 22780 5314 -15156 -1905 30529 38162 29656 16203 -13355 -27927 -8264 24090
3280 24090 5228 -38310 -8560 17926 12304 6668 36266 39547 14474 19323 31910 11391 -24861
3267 -24861 24758 35743 22879 35815 36551 31031 23963 26561 7043 -21595 295 -9194 -3597
3254 -3597 21020 43994 32689 14731 -26317 -42810 -71074 -35946 8617 21492 12824 -18639
3242 -18639 -32898 -36352 15232 38380 1251 -40597 -40294 -48634 -29415 -1292 -4374 -30547 21132
3229 21132 -569 43100 63050 21088 8262 -34675 -69618 -61691 109 55867 51879 28645
3217 28645 26733 15832 15649 34901 29263 -4838 -17351 -34208 -37678 -23366 -49783 -52391 -45817
3204 -45817 -37332 -20895 -17767 -21268 -26176 -31460 -33129 -3502 -25725 -51255 -43055 -52616 -54989 -16714
3190 -16714 -34215 -56085 -34651 -6674 17901 32961 19760 -34812 -43357 9998 35410 40005
3178 40005 44726 48757 29816 29999 51008 80039 77762 103910 77738 17774 32929 3562 -45899
3165 -45899 -43432 -3803 474 -38184 -12279 16992 39245 65277 59166 74071 89966 39307
3153 39307 3761 7922 3292 17677 36807 80940 44715 30579 53491 46835 -13453 -19561 -47835
3140 -47835 -46257 -36549 -53745 -34640 -8410 21769 36317 61848 64935 39770 36980 38411 34131
3127 34131 49256 37743 47813 55534 24841 37408 38182 19086 4268 23523 25369 -399 -27934
3114 -27934 -1030 9999 -5604 -21998 22767 14301 -8604 2558 1868 -12361 -33829 -42655 -46019
3101 -46019 -17000 13848 28272 21123 582 -7237 -17905 -47700 -68079 -62624 -34743 1926
3089 1926 62129 52662 -2998 4471 57673 55100 75521 70957 41693 49451 50073 60435 47313
3076 47313 29723 30413 31888 34067 29633 23608 42614 10665 -33378 -37782 -13291 -30775 -48518
3063 -48518 -5718 41186 -159 -34682 -20209 -15275 -9806 -9436 -6787 62356 98978 113410 71484
3050 71484 54889 57898 37173 -17101 -14257 38399 60105 -3597 -12778 -19730 -66061 -90599 -76909
3037 -76909 -70638 -41714 -15138 -21494 -496 49359 31442 30974 37113 70533 80750 48642 13108
3024 13108 29231 34762 50343 25009 -7202 -11994 9777 37533 49365 46377 20654 44446
3012 44446 55273 27311 -6413 1991 -6960 -5577 -456 22079 39355 54142 28632 22318 19993
2999 19993 -3029 26962 48777 12583 15814 25400 26859 57920 37376 -22688 -57534 -46049
2987 -46049 -7360 -4412 -32668 -33823 -62075 -46062 -18089 9073 13023 -20143 -20676 -24117 4128
2974 4128 49626 41628 17428 -2385 -16315 -27213 -5323 30374 -5488 -16036 -21197 -17524 -19770
2961 -19770 -38918 -67099 -69091 -28040 3552 16909 -18426 -7241 38373 22925 -25842 -39700
2949 -39700 -71436 -28819 6049 32115 39420 55643 -9908 -62059 -19132 30081 62840 87487
2937 87487 84149 55934 73689 39080 449 6463 32186 15990 -50867 -66369 -10925 -10068 -14120
2924 -14120 12661 28285 -16022 -22905 24971 56889 40307 53766 65541 69945 38095 16832
2912 16832 12928 -19874 -48203 -653 71796 38180 -15423 -12371 22274 37958 38445 23029 33920
2899 33920 -15162 -33040 -32403 -50633 -35010 31713 88718 112798 100859 49609 47338 73810
2887 73810 66460 29422 12472 -2317 20546 8318 11987 -11238 40638 118627 104300 56183
2875 56183 -11776 206 53588 76792 39544 -10592 -17893 24002 42701 30074 7229 -15378
2863 -15378 -9859 24376 51423 39595 21338 7386 -10031 -14050 -20442 161 14040 465
2851 465 -12345 7090 53558 79012 47883 40258 8931 3305 63429 50597 21772 18344 28204
2838 28204 40029 21039 12746 16391 4696 18606 18090 23112 22241 3482 1742 14276 20255 47209
2824 47209 48923 29886 31482 52971 18785 6057 19863 76024 89929 73976 61018 23372
2812 23372 -7949 -19283 9094 45755 21536 13616 20473 -11684 -51427 -23906 31876 82051
2800 82051 134390 93877 36769 38429 84542 93631 42907 30271 -2525 1566 21595 72033
2788 72033 83982 68187 57456 51792 24555 37211 49976 50369 44181 31455 34601 30152 1190
2775 1190 -1310 -26561 -69748 -49674 -16360 67547 83947 48543 37626 90939 104784 104826 55716
2762 55716 5530 3555 4567 -24658 -11948 14064 22115 -28508 -39861 -15412 -25845 -42493
2750 -42493 -37885 -7505 -2283 -14878 -12947 -10709 -32220 -68712 -111996 -85415 -38257 -10807 -6697
2737 -6697 17321 18980 15865 15121 -3179 -24714 -15717 4534 54363 28153 38361 41044 -2136
2724 -2136 5292 29851 17172 22017 -12662 -663 30742 25412 5855 -26289 -53376 -68839 -27238
2711 -27238 4085 -19182 -26204 -19013 -21101 -51691 -63025 -16260 -22149 -22873 -3406 -13211 -41129
2698 -41129 -45154 -2744 28993 39417 29235 42414 43883 30773 78731 79550 22617 14239 19192
2685 19192 -14961 -7283 35017 67900 76852 59429 40349 12891 -573 -6752 11468 34489
2673 34489 -6121 -20640 -15337 -1718 8307 -6334 10986 56969 48523 57007 71568 59771
2661 59771 12705 -10963 -29455 -38803 -6403 4968 -362 -7671 -12903 19800 38093 21390 12748
2648 12748 19705 -3292 12284 14716 3288 -20722 -26779 -29973 13282 79853 50411 42040 22126
2635 22126 -7081 4572 24764 29889 10817 32127 27385 14727 -6859 9338 20137 9327
2623 9327 26645 69941 59193 53726 36635 26796 53481 61413 21350 4208 -33096 -50285 -43824
2610 -43824 -69042 -97818 -80643 -90803 -77479 -52784 -50922 -35765 -14559 -19443 52537 110941
2598 110941 145240 134220 99993 30966 8653 -35820 -46802 -37007 8190 -21047 -36 45128
2586 45128 51979 13359 -23886 -17875 37348 58008 73065 60494 25879 16882 19195 17051 10769
2573 10769 14586 -5010 -2052 20168 13714 64965 25788 16359 21077 24671 53509 27818 35611
2560 35611 46034 42327 -37261 -91525 -89745 -69782 -17952 -33082 -45725 -20342 -30414 -52321
2548 -52321 -9840 2825 38493 32553 56147 35718 -58532 -35252 -21465 -42834 -23041 47701
2536 47701 93349 78363 62500 48710 -4903 -41643 21509 35791 25889 36435 8550 -12133
2524 -12133 5102 -5376 -49695 -52349 -37537 16572 10028 10041 -700 -630 2000 -44653 11364 26864
2510 26864 50322 71150 63601 46742 4905 -27196 -5508 5658 -7205 3647 51858 74580
2498 74580 71526 71961 -7160 -60700 -38814 -36588 16069 52514 13926 19315 2059 28120 48346
2485 48346 22932 -18849 -26732 -35692 -60915 -6487 23594 33177 42739 16974 43935 60912 73793
2472 73793 73745 60330 7684 -27742 -8528 4858 11010 16129 38695 13562 1500 -31133 -9342
2459 -9342 10974 27663 9216 12490 35165 -5436 -11892 7965 20447 5182 -26706 -23232 -2620
2446 -2620 2232 24058 16931 22787 -2247 -17121 -18925 -8725 -20449 -28473 -51362 -43157 -29427
2433 -29427 -11223 -2288 6262 17344 -13077 6167 -17170 -51262 -37141 -5458 -3242 -584 39621
2420 39621 29476 -20967 6029 41838 73258 42221 21561 39937 13150 -7050 -7022 41847
2408 41847 90323 64929 15815 12235 25985 -21205 -45783 -29521 37611 89775 80752 72778
2396 72778 63340 57677 31689 -60372 -53707 -19170 -25127 -27203 -3148 14247 9935 -3255 -14794
2383 -14794 -23229 -43674 -56627 -46778 -29459 -19446 -16549 -23171 -37787 -7167 -581 -16956 -31090
2370 -31090 -76883 -58822 -54542 -84779 -100676 -94847 -60889 -1573 46009 74335 93580 70915
2358 70915 57628 68625 76064 66298 48445 58384 89983 37186 19829 26870 -27872 -92293 -45287
2345 -45287 -7969 7338 67894 99563 58947 15331 -2696 -35359 -6298 8309 -20102 -58808
2333 -58808 -63291 -73301 -25766 17199 -9361 -10056 10634 -24568 -3986 24595 -5884 -31431
2321 -31431 -37300 -58680 -73538 -38025 -17424 -2973 52591 55521 17659 -15227 -29869 -20355
2309 -20355 -3047 1365 25521 20156 32103 -17646 -43210 907 16268 14170 9921 24602 25406
2296 25406 50421 98103 113940 63611 66679 58226 44027 -7431 -43616 -31377 -19589 30814
2284 30814 20887 18214 9424 12000 558 -4388 25832 10474 11599 35969 48308 63753 35244
2271 35244 30852 39283 54416 60979 62883 53130 64928 53177 42395 34544 21129 15621 21177
2258 21177 2127 -48712 -54599 -35236 -17841 -21112 -43589 -12024 35679 20507 -9458 -3530
2246 -3530 -2591 -3809 -12156 -21094 -17151 3689 26009 37873 33019 27660 29516 42567 47810 26111
2232 26111 32344 57152 38699 37812 2168 -19242 6516 55897 87696 24915 -26432 -47460
2220 -47460 -38789 -47584 -19117 -29189 -47334 -3369 6706 9034 44176 19947 8509 7686 44115
2207 44115 19286 -9001 -19574 -18974 -9555 25720 50667 44708 27342 54330 89682 63294 49919
2194 49919 18254 21315 55605 76716 28749 27766 56663 21268 -20871 -11178 -8770 -22746 4345
2181 4345 36566 33447 17547 -2929 12250 15082 -19875 -48686 -7459 1905 26727 14482 28277
2168 28277 40760 27374 33792 25114 -32539 -28556 -33439 -48128 14108 5158 -27906 20603 20937
$$ [...]
##END NTUPLES=NMR SPECTRUM
##END=
