##TITLE=Analysis number 313777
Compound Code cc 21904
Project Code adrs
Chemist Name ugmt
##JCAMPDX= 6.0         $$ Bruker NMR JCAMP-DX V2.0
##DATA TYPE= NMR SPECTRUM
##DATA CLASS= NTUPLES
##ORIGIN= Bruker BioSpin GmbH
##OWNER= NMR
$$ XWIN-NMR		Version 3.5
$$ Wed Sep 21 09:06:44 2005 GMT Daylight Time (UT+1h)  MAYBRIDGE\NMR@NMR_250MHZ
##.OBSERVE FREQUENCY= 250.131544655141
##.OBSERVE NUCLEUS= ^1H
##.ACQUISITION MODE= SIMULTANEOUS (DQD)
##.ACQUISITION SCHEME= undefined
##.AVERAGES= 16
##.DIGITISER RES= 18
##SPECTROMETER/DATA SYSTEM= dpx250
##.PULSE SEQUENCE= zg30
##.SOLVENT NAME= CDCl3
##.SHIFT REFERENCE= (INTERNAL, CDCl3, 0, 16.522)
##AUDIT TRAIL= $$ (NUMBER, WHEN, WHO, WHERE, WHAT)
$$ ##TITLE= Audit trail, XWIN-NMR		Version 3.5
$$ ##JCAMPDX= 5.01
$$ ##ORIGIN= Bruker BioSpin GmbH
$$ ##OWNER= NMR
$$ C:\u/data/dgb/nmr/ADRS/9720/pdata/1/auditp.txt
$$ ##AUDIT TRAIL=  $$ (NUMBER, WHEN, WHO, WHERE, WHAT)
(   1,<2005-09-21 09:06:21.08 +100>,<MAYBRIDGE\NMR>,<NMR_250MHZ>,
      <created by zg, POWCHK disabled, PULCHK disabled
       configuration hash MD5:
       62 19 C7 07 E1 42 D1 B7 37 6C 3D D0 77 39 F9 E6
       data hash MD5: 64K
       CC 90 AB 01 84 68 CE 63 7E 1A 0F B0 D1 52 73 F8>)
(   2,<2005-09-21 09:06:35.60 +100>,<MAYBRIDGE\NMR>,<NMR_250MHZ>,
      <Start of raw data processing
       ef LB = 0.3 FT_mod = 6 PKNL = 1 SI = 32K 
       data hash MD5: 32K
       4C DA 73 10 07 77 46 18 F6 3D 19 3F 5D 42 9F 67>)
(   3,<2005-09-21 09:06:37.56 +100>,<MAYBRIDGE\NMR>,<NMR_250MHZ>,
      <apk 
       data hash MD5: 32K
       F9 89 CB 61 B1 70 B4 71 85 5E 0E 4C CB 39 B5 6B>)
(   4,<2005-09-21 09:06:38.30 +100>,<MAYBRIDGE\NMR>,<NMR_250MHZ>,
      <abs ABSG = 5 
       data hash MD5: 32K
       EE A4 72 4C 3B 22 5E 3F 99 D7 04 AC DF 88 FE AC>)
$$ ##END=
$$ 
$$ hash MD5
$$ 60 39 FE CA 0D 2E 71 56 22 F9 89 2B 83 01 BF 90
##$RELAX= 
##$RELAX= 
##$RELAX= 
##$RELAX= 
##$RELAX= 
##$RELAX= 
##$RELAX= 
$$ Bruker specific parameters
$$ --------------------------
##$DU= <C:\u>
##$EXPNO= 9720
##$NAME= <ADRS>
##$PROCNO= 1
##$TYPE= <nmr>
##$USER= <dgb>
##$AMP= (0..31)
100 100 100 100 100 100 100 100 100 100 100 100 100 100 100 100 100 100 
100 100 100 100 100 100 100 100 100 100 100 100 100 100 
##$AQSEQ= 0
##$AQ_mod= 3
##$AUNM= <au_zg>
##$AUTOPOS= <3 >
##$BF1= 250.13
##$BF2= 250.13
##$BF3= 250.13
##$BF4= 250.13
##$BF5= 500.13
##$BF6= 500.13
##$BF7= 500.13
##$BF8= 500.13
##$BYTORDA= 1
##$CFDGTYP= 0
##$CFRGTYP= 5
##$CHEMSTR= <none>
##$CNST= (0..31)
1 1 145 1 1 1 1 1 1 1 1 1 1 1 1 1 1 1 1 1 1 1 1 1 1 1 1 1 1 1 1 1 
##$CPDPRG= <>
##$CPDPRG1= <>
##$CPDPRG2= <>
##$CPDPRG3= <>
##$CPDPRG4= <mlev>
##$CPDPRG5= <mlev>
##$CPDPRG6= <mlev>
##$CPDPRG7= <mlev>
##$CPDPRG8= <mlev>
##$CPDPRGB= <>
##$CPDPRGT= <>
##$D= (0..31)
0 1 0 0 0 0 0 0 0 0.06 0 0 0 0 0 0 0.0002 0 0 0 0 0 0 0 0 0 0 0 0 0 0 
0 
##$DATE= 1127289979
##$DBL= (0..7)
120 120 120 120 120 120 120 120 
##$DBP= (0..7)
150 150 150 150 150 150 150 150 
##$DBP07= 0
##$DBPNAM0= <>
##$DBPNAM1= <>
##$DBPNAM2= <>
##$DBPNAM3= <>
$$ [...]
##$SUBNAM7= <"">
##$SUBNAM8= <"">
##$SUBNAM9= <"">
##$SW= 20.6930455092707
##$SWIBOX= (0..15)
0 0 3 0 0 0 0 0 0 0 0 0 0 0 0 0 
##$SW_h= 5175.983436853
##$TD= 65536
##$TD0= 1
##$TE= 294.16
##$TE2= 300
##$TE3= 300
##$TEG= 300
##$TL= (0..7)
0 120 120 120 120 120 120 120 
##$TP= (0..7)
150 150 150 150 150 150 150 150 
##$TP07= 0
##$TPNAME0= <>
##$TPNAME1= <>
##$TPNAME2= <>
##$TPNAME3= <>
##$TPNAME4= <>
##$TPNAME5= <>
##$TPNAME6= <>
##$TPNAME7= <>
##$TPOAL= (0..7)
0.5 0.5 0.5 0.5 0.5 0.5 0.5 0.5 
##$TPOFFS= (0..7)
0 0 0 0 0 0 0 0 
##$TUNHIN= 0
##$TUNHOUT= 0
##$TUNXOUT= 0
##$USERA1= <user>
##$USERA2= <user>
##$USERA3= <user>
##$USERA4= <user>
##$USERA5= <user>
##$V9= 5
##$VALIST= <valist>
##$VCLIST= <CCCCCCCCCCCCCCC>
##$VD= 0
##$VDLIST= <DDDDDDDDDDDDDDD>
##$VPLIST= <PPPPPPPPPPPPPPP>
##$VTLIST= <TTTTTTTTTTTTTTT>
##$WBST= 1024
##$WBSW= 4
##$XGAIN= (0..3)
0 0 0 0 
##$XL= 0
##$YL= 0
##$YMAX_a= 464290
##$YMIN_a= -280840
##$ZGOPTNS= <>
##$ZL1= 120
##$ZL2= 120
##$ZL3= 120
##$ZL4= 120
##$ABSF1= 16.522
##$ABSF2= -4.171173
##$ABSG= 5
##$ABSL= 3
##$ALPHA= 0
##$AQORDER= 0
##$ASSFAC= 0
##$ASSFACI= 0
##$ASSFACX= 0
##$ASSWID= 0
##$AUNMP= <proc_1d>
##$AZFE= 0.1
##$AZFW= 0.1
##$BCFW= 0
##$BC_mod= 0
##$BYTORDP= 0
##$COROFFS= 0
##$CY= 12.5
##$DATMOD= 1
##$DC= 0
##$DFILT= <>
##$DTYPP= 0
##$F1P= 14.0000005364418
##$F2P= -0.99999901652339
##$FCOR= 0.5
##$FTSIZE= 32768
##$FT_mod= 6
##$GAMMA= 0
##$GB= 0
##$INTBC= 1
##$INTSCL= 1
##$ISEN= 128
##$LB= 0.3
##$LEV0= 0
##$LPBIN= 0
##$MAXI= 10000
##$MC2= 0
##$MEAN= 0
##$ME_mod= 0
##$MI= 0
##$NCOEF= 0
##$NC_proc= -4
##$NLEV= 6
##$NOISF1= 0
##$NOISF2= 0
##$NSP= 0
##$NTH_PI= 0
##$NZP= 0
##$OFFSET= 16.522
##$PC= 1
##$PHC0= -75.79787
##$PHC1= 7.04101
##$PH_mod= 1
##$PKNL= yes
##$PPARMOD= 0
##$PSCAL= 4
##$PSIGN= 0
##$REVERSE= no
##$SF= 250.13
##$SI= 32768
##$SIGF1= 0
##$SIGF2= 0
##$SINO= 400
##$SIOLD= 32768
##$SREGLST= <1H.CDCl3>
##$SSB= 0
##$STSI= 32768
##$STSR= 0
##$SW_p= 5175.98343685301
##$SYMM= 0
##$S_DEV= 0
##$TDeff= 65536
##$TDoff= 0
##$TI= <Analysis number 999999
Compound Code 99
Book Reference 9
Project Code 9>
##$TILT= no
##$TM1= 0
##$TM2= 0
##$TOPLEV= 0
##$USERP1= <user>
##$USERP2= <user>
##$USERP3= <user>
##$USERP4= <user>
##$USERP5= <user>
##$WDW= 1
##$XDIM= 32768
##$YMAX_p= 377024562
##$YMIN_p= -241403
$$ End of Bruker specific parameters
$$ ---------------------------------
##NTUPLES= NMR SPECTRUM
##VAR_NAME=  FREQUENCY,     SPECTRUM/REAL,   SPECTRUM/IMAG
##SYMBOL=    X,             R,               I
##VAR_TYPE=  INDEPENDENT,   DEPENDENT,       DEPENDENT
##VAR_FORM=  AFFN,          ASDF,            ASDF
##VAR_DIM=   32768,         32768,           32768
##UNITS=     HZ,            ARBITRARY UNITS, ARBITRARY UNITS
##FACTOR=    0.157963299565203, 1,           1
##FIRST=     4132.6476996994, 0,             0
##LAST=      -1043.33573715361, 0,           0
##MIN=       -1043.33573715361, -241403,     0
##MAX=       4132.6476996994, 377024562,     0
$$ Real data points
##PAGE= N=1
##DATA TABLE= (X++(R..R)), XYDATA
$$ [...]
23607B4431O249J1004j2139j6543j5216L6304j5981m9304P35P643K2072j059k3403
23594b5207o324J8881Q646k1035K4851L0545M414j0171m9000j7394Q186J9500
23582a4108J8433j18j7212k1766K8810J4915q993k5236L341L7112r12k83j409
23569A2574q951Q495n291R949Q948J1081j9138j7640q577P626L7331n031k8641
23556B735o666K9014j5500J3283L5870p898j4420l1720j434j7208P377K8355M178
23543B5966J2345o251j4443J736M532j1334j2964k1076J0158R526l314j0595J3
23530a5701K0108j581k0490l389K1319K2562O376K4995j5411k1022J2439J7791
23518D7996p027r682j2925j7611p421k2531k29j0237j2135l398P533L0868J0593
$$ y = [24431, 30680, 41684, 29545, 13002, -2214, 34090, 18109, -31195, -30460, -22817, -745, -1804, -25207, -31531, -12650, -4004, -25039, -188, 30357, 34771, 24600, -24400, -41794, -33608, -14108, 4325, 4207, -13005, -34771, -5961, 8954, -39, -25275, -21934, 15178, 14266, 13983, 12574, 3623, 12118, 6827, 16776, 25724, 36805, 17667, 27, -8550, -924, 36407, 31376, 2735, -3931, 25083, 9583, 22866, 58736, 50838, 36418, 4698, 3264, -13944, -6567, 21788, 25966, 38311, 32060, 17617, 19353, 23885, 12551, -413, -21489, -11331, -1805, -5119, -15714, -15701, 4407, 2826, -17664, -21053, 266, 22828, 29204, 54199, 38788, 17766, 30205, 47996, 40969, 31287, 18362, 751, -6670, -29201, -29430, -39667, -51802, -55200, -47667, -16799, -6206]
23505f206j3566j594J1084l088J8627J6718l2330n702l534K1199R667r251K611
23492D635q29q394J0756Q742r089l80K3393j4812j9949L375L4821q43J4556K244
23478D8226j8464P361j3816q645k4643r752J3984J4549J824q682Q223K616n067
23465G714m867J3423j8206N339K3001l0867m2226P471K363m413J3808P89J2430
23452a4241M20j0685J2859k943k0104J9460J5831J9189N710N284q28k3961j519
23439D472j3753j2081M2619J4362j2137K6642P118l137r452l0801r633J1249j6764
23426a296l6156Q847L0623l448j6612j54K8608K39k5461J2910K142k078k142L809
23412a69J5552o5k7266j3903K9986J4434J2038j0392j4876j8694k6921K2710K5524
$$ y = [-6206, -19772, -21366, -10282, -13370, 5257, 21975, -10355, -16057, -19591, 1608, 11275, 2024, 4635, 3806, -4588, 6168, 14910, 5821, 5441, 28834, 14022, -5927, -2552, 32269, 31426, 45982, 48226, 29762, 37123, 23307, 14662, -9981, -19733, -5749, 8800, 10624, 1942, 10165, 12781, 7714, 2847, 16270, -1936, 3403, 26404, -4463, -46689, -39218, -36855, -41268, -27460, -26671, -14241, -13821, -24506, -11647, -14590, -34694, -15234, 597, 19786, 25496, 30780, 29952, 5991, 4472, -9281, -21362, 21257, 35619, 23482, 50124, 57242, 54105, 44653, 13852, 4219, 15468, -1296, -37452, -28605, 2018, -1430, -18042, -18196, 10412, 10651, -14810, -1900, 242, -1836, -3978, -169, 15383, 15318, -11948, -25851, 4135, 18569, 30607, 20215, 5339, -13355, -40276, -17566, 7958]
23399G958N433J2345O761l1543L3347k4712k909R691J6306J633j0645m148l0767
23386a1250k2313K9765N0498L167l1737l0664M197J6478L5613K3555j0889k7550
23374B8870J8044K1023K0036j6990k0967r167J5287K3539l6289r369j6429k203
23362A5385k3970p153J0070J6298P541K100q497o25K7274J5563k0017m0326j0207
23349a6564p41K3087O111J9556k381p032j2262K5798Q861n045j5375o678o912
23336A0423R398L338o713M331k1668r119k1467J8756o788k749J3948K3084R010
23323B3784K0099K3771J818j2297P196n651M777N536m3387k3378o068q8M02Q482
23309D996J3032j3519k0611O815N9064K9624j3605k9700r088K9755j3386j0309
$$ y = [7958, 13391, 25736, 32497, 954, 34301, 9589, 6680, 16371, 32677, 34310, 23665, 19517, -11250, -33563, -3798, 46700, 49867, 18130, -12534, -8337, 8141, 43754, 67309, 56420, 28870, 46914, 67937, 87973, 70983, 50016, 40849, 56136, 79675, 43386, 34017, 17588, 15385, -8585, -15738, -5668, 10630, 18171, 20271, 11774, 11149, 38423, 53986, 33969, -6357, -16564, -17305, 5782, 11893, 31449, 29068, 22036, 9774, 35572, 44433, 39388, 24013, 17335, 10423, 19821, 23159, 16446, 20777, -891, -10010, -31477, -12721, -19509, -22258, -8310, 14774, 23784, 43883, 67654, 69472, 57175, 64371, 58720, 63497, 69033, 25646, 2268, -3800, -3888, -3486, 4996, 18028, 4509, -16102, -9287, 49777, 79401, 65796, 36096, 27008, 56763, 43377, 33068]
23297C3068l296j4069Q212J3627L60j9425R606k6704k6536L478J9980K2952k5691
23284d438o352p776n398P325P503J3258L949J3881o070j85k3646j2263J5106J5645
23270A0539j4719J9124M519J4677k825K5715M272k5453k5257k7277L031K6616
23258A2962J3260M226k2398q311L9255K0388k2527j5918k320K4611j3158m0081
23246a0011j0866K1642L6066K0409L561J0984Q656k0772j4153n175j0486J3796
23234D3651q878j6568j1117Q832J0890m52j4192O562K852j228k850j5351J104
23221C255n335l1112j796K7525Q949K1928J1879p040j0318K5657K788l217K1256
23208F4419j4964j5242n656l605j168M327K9187j2800j0863J7010L809K0052k0121
$$ y = [33068, 29772, 15703, 23915, 37542, 37902, 18477, 28083, 1379, -25157, -21679, -1699, 21253, -4438, -10790, -18566, -23964, -16639, -9136, 4122, 8071, 21952, 15882, 15697, -7949, -20212, -5106, 10539, -4180, 14944, 19463, 34140, 31315, 57030, 61302, 35849, 10592, -16685, -13654, 12962, 26222, 30448, 8050, -261, 38994, 59382, 36855, 20937, 18617, 43228, 30070, -10011, -20877, 765, 36831, 57240, 60801, 71785, 80441, 59669, 45516, 40341, 29855, 43651, 34773, 18205, 7088, 15920, 26810, 26358, 12166, 18728, 21580, 20352, 17502, 2151, 3255, -2080, -33192, -34988, -7463, 1486, 23414, 35293, 28253, 17935, 43592, 46380, 43163, 64419, 49455, 34213, 28557, 24952, 23784, 28111, 57298, 44498, 33635, 50645, 54454, 74506, 54385]
23195E4385m8268l5910J9858L2999j458J5178l55k7373l2059L0584N1698J027
23183F0306j4682k6528j0524k355q443m735J4182J0484q921j4548J0941K6368
23171C1545N783q133K1301J3431k874Q233K0813M16k2358j9015L055M038k371
23158E3864Q700J4883k2074l2246J2163R403K3899J9592K721o861l1266j5655
23146C7123r672k4061M252K0401N796Q646K25q369j2892M37l679L459P717P772
23132C7155j4380K592o145k4507J8909J6542O797N0163J072l5507n271J2048Q267
23119F7735j4764m450K8079J1657m697j8838K0002K6196K701l7744k0167R834
23107F5544R933K9930L6225m025J4524K7777K6517n092j3205L6854M9539L8081
$$ y = [54385, 6117, -29793, -9935, 23064, 21606, 36784, 36429, 9056, -23003, 7581, 59279, 60306, 45624, 19096, 8572, 6217, -2226, -6961, 7221, 17705, 8784, -5764, 5177, 31545, 37328, 29195, 50496, 63927, 61053, 69286, 90099, 90515, 68157, 49142, 52197, 56235, 53864, 62564, 77447, 55373, 23127, 35290, 44693, 68592, 88184, 90905, 84044, 52778, 37123, 27451, 3390, 7642, 28043, 33839, 42485, 42710, 34341, 21449, 21886, 18207, 21666, 29383, 37155, 22775, 25367, 19222, -5285, 13624, 30166, 36963, 87126, 88198, 52691, 47420, 59468, 67735, 52971, 48521, 76600, 88257, 83560, 64722, 84724, 110920, 113621, 75877, 55710, 65544, 75477, 105407, 141632, 137607, 152131, 179908, 206425, 201333, 188128, 224982, 274521, 312602]
23095C12602N2675R9895J30003J97128K98008L55563L66158J88544o2618k89070
23085A648888l98221l56739k85298j83568j20436o6206n8708l4994m5467j8569
23075H0682O285l579L042j2760j1566l1144j0021J7400J8215J0708q153j6835
23063D2274j9360J0639R923j9108l2665K109L7833L2606j3834Q703J8314k0715
23051E6719P127L1526j5561m6626j8902J7650L3384j810k4872j5263n552k050
23039A5770L071L4720K0206n878j4925k8506l824R825q010J111L4469J9373j6929
23026F0473l0780k3j0925l387N858M974p101j576O767O272j6610k167P821n854
23012A3742O158j0141r918J964J1121J5396q605J8980L0459J9430l1169n0177
$$ y = [312602, 365277, 465172, 595175, 792303, 1090311, 1445874, 1812032, 2000576, 1937958, 1648888, 1250667, 893928, 608630, 425062, 304626, 238420, 179712, 144718, 99251, 80682, 86967, 83388, 86430, 73670, 62104, 30960, 20939, 38339, 56554, 67262, 59109, 42274, 22914, 33553, 43476, 24368, -8297, -6188, 31645, 64251, 50417, 59120, 77434, 56719, 63846, 95372, 79811, 33185, 14283, 31933, 65317, 63507, 38635, 23372, 17820, 15770, 18841, 53561, 73767, 67889, 52964, 24458, 20634, 30459, 22449, 23560, 58029, 77402, 60473, 29693, 29670, 18745, 15358, 21216, 26190, 19089, 17513, 24280, 30552, 13942, 11775, 19596, 13742, 19900, 9759, -159, 1805, 12926, 28322, 19717, 38697, 69156, 88586, 57417, 7240]
23000G240n407K5015J3679J856o982j1150j8196J7610j2859o194L1654K3600o307
22987E3559l2430k8698m778R084M464p384L498J807j1698q453J7539J0493l479
22974C524Q297K4064o164r745J1418n8p15P654j4080j9888K6217O201k4933j0967
22960H25j4979R764K3641P006J346J5657J2765j1085Q071J851j6631J2790J0804
22947F1825J853j2227j8612L788j5896p792J9130L3877j1018m997k9036r998k6773
22934a5876l991M1143L3213J2913N607N004k4851k3129j4205K537K4169m913r421
22921B8200J3729m692q237j350K718k8124n729o563M1233K7062k3531l275j846
22908B9595k4542r769J5302J7575K7115N701o152Q085j6473j8287R380J0905R576
$$ y = [7240, 1833, 26848, 40527, 42383, 35401, 24251, 6055, 23665, 10806, 4612, 36266, 59866, 53559, 21129, -7569, -12347, -3263, 1201, -6183, -2685, -878, -12576, -21029, -3490, 7003, 3524, 11821, 35885, 29721, 19976, 31394, 31336, 30621, 38275, 24195, 4307, 30524, 36725, 11792, 825, -14154, -4390, 19251, 26257, 27603, 43260, 56025, 44940, 53011, 54862, 38231, 51021, 61825, 63678, 51451, 32839, 36627, 20731, 12939, 32069, 65946, 54928, 49931, 20895, 10897, -15876, -19867, 21276, 54489, 67402, 73009, 78013, 53162, 30033, 15828, 18365, 42534, 37621, 28200, 41929, 37237, 29000, 27650, 30368, 2244, -3485, -10048, 31185, 58247, 34716, 31441, 29595, 5053, -4716, 10586, 28161, 55276, 60977, 54825, 62910, 46437, 28150, 37530, 48435, 58011]
22895E8011K478k136l087m420j3184m851J1038J3253J4338O961k3872l4697K5303
22882D5135M1363P869k2475j8944k0664K5803O141j4734R38J50L466K1824K1347
22869I7219q877o844j150k979K0759p9k5287j8303l0569L1207n41n400j3500o057
22855B9599Q97N367j9728j4360r749l8340j1604J7572P298q748o929l5304O851
22842g7178m173m0236l9606k2733k7500k3881o096P603P6591P0186R6677O5390
22830G5044K4432n414J9880M035l728j9717k6561J852J6357K2112L2489o09k0831
22817A19341P699m813j2089K099j0194J2464k482k2586j3170j200k104j1562K172
22804F3575L5543J0432J991J8522m051p972M282o790J4821L0515L7396J8090R093
$$ y = [58011, 60489, 58353, 55266, 50846, 37662, 32811, 43849, 57102, 71440, 78401, 54529, 19832, 45135, 86498, 94367, 71892, 52948, 32284, 58087, 64228, 49494, 50432, 50582, 54048, 75872, 97219, 88342, 81498, 80348, 77369, 98128, 98049, 72762, 54459, 23890, 55097, 54556, 49156, 35656, 29599, 30496, 35863, 16135, 1775, -7974, -46314, -57918, -40346, -33048, -41796, -48725, -84029, -77178, -81351, -121587, -161193, -183926, -211426, -235307, -241403, -233800, -157209, -87023, 9654, 75044, 99476, 94062, 113942, 117977, 114249, 94532, 67971, 69823, 86180, 108292, 140781, 140172, 119341, 127040, 122227, 110138, 112237, 102043, 114507, 112025, 89439, 76269, 75069, 72965, 61403, 63575, 99118, 109550, 111541, 130063, 126012, 118040, 122322, 115532, 130353, 160868, 198264, 216354, 225447]
22791B25447J9310K8578l369O219P680j6858j9235m5437j6623k1544j6676l3230
22779A14262j8290j9112r329K1739M241j6689J353p502m576L525n829J2013J1117
22766H6923j9824j5846m938L370Q118k107M632J3626J0286J1318p242J1542j7076
22753H2782p793j2791M250L6065k5324k9911J1031j2730l5843r89J0143R223J0833
22740C8946J0370O137q281m295l940o385k1802k0146j5461j4519k8581J626N9246
22727g085Q0494R3571O4666Q489J0415K1260j8053j0659m526m389n335k5024j1844
22714A91980J7698p673j0205J3104j3993k4121K7870N8145M160j3643k5951J211
22702B18582k4906N708J6543j8287k527K9194O988k3996k2581J9546k4187o8816
$$ y = [225447, 244757, 273335, 269966, 276185, 283865, 267007, 247772, 202335, 185712, 164168, 147492, 114262, 95972, 76860, 67531, 89270, 93511, 76822, 78175, 70673, 66097, 69622, 63793, 75806, 86923, 67099, 51253, 46315, 49685, 57803, 55696, 60328, 73954, 84240, 95558, 88316, 99858, 82782, 74989, 62198, 66448, 102513, 77189, 47278, 58309, 45579, 9736, 8747, 18890, 28113, 38946, 49316, 55453, 47172, 42877, 38937, 32552, 10750, -9396, -24857, -39376, -67957, -66331, -7085, 73409, 166980, 231646, 240135, 250550, 271810, 253757, 243098, 238572, 234183, 228848, 203824, 191980, 209678, 202005, 191800, 204904, 190911, 166790, 194660, 252805, 256965, 243322, 217371, 218582, 193676, 199384, 215927, 197640, 195113, 224307, 231295, 207299, 184718, 204264, 180077, 111261]
22690A11261l2051L4049J5337R69Q607K9511J7052M5678K2143q176L709K6118
22678B74207J3906k2804R76O091K0166O732m431k8631n103J4349K7751K0492J0531
22665C34232M3971N2801N7196K2290J8090l8382l0076l9167m7946l0269J0958
22654C53698l5338j9923m31l188j4212j3224K5007j408m526K4976M5646N759k124
22641C60712L1364j62N776N934j9776k1759j5458J8275J5102L9261K8864K6997
22629D75130L5879q459j5604J95O516L6338M6872N6314O6957Q5824J07790J46779
22617A040531K07034L12960L91770M27300L67883J70023r8989l26671k71810j12962
22607B107069J36173M32918P22768Q82243Q13334L87221k28171o91462r92638
$$ y = [111261, 79210, 113259, 128596, 129565, 138172, 167683, 184735, 230413, 252556, 244380, 248089, 274207, 288113, 265309, 266285, 272376, 292542, 299274, 294843, 266212, 261109, 275458, 303209, 323701, 334232, 378203, 431004, 488200, 510490, 528580, 490198, 460122, 420955, 373009, 342740, 353698, 318360, 298437, 298006, 294818, 280606, 267382, 292389, 290981, 286455, 311431, 357077, 362836, 360712, 392076, 391914, 397690, 403624, 383848, 362089, 346631, 364906, 380008, 419269, 448133, 475130, 511009, 502550, 486946, 487141, 493657, 529995, 576867, 633181, 700138, 785962, 893752, 1040531, 1247565, 1560525, 1952295, 2379595, 2747478, 2917501, 2818512, 2491841, 2220031, 2107069, 2243242, 2676160, 3398928, 4281171, 5094505, 5481726, 5253555, 4562093, 3569455]
22598C569455r45139o49502l97867k67666j28678m6267j8312j7430n408K4900
22588A118086M632Q24L7606M2760J6824N96L4494M8883M7146M9681O0708K5135
22576A487375P071M1045J12566J31240J45089J65179J28975J46007J71159K04936
22566B740642K04994K10316K37867K92306K85185L24687L63765M12663M97171
22557E569596N98788P11350Q56231J102113J335918J578922J798646J993381K260399
22548A7805344K708919L430940M445598N823190P752333J0557451J5391868K4196362
22540I2112005L8827113N8002391P3061352P2063576M2958125q275378n4531588
22533C14217596q0596513p6677270n3530561l2814975k0309361j3263025r197794
$$ y = [3569455, 2624316, 1974814, 1576947, 1309281, 1180603, 1134336, 1116024, 1098594, 1093186, 1118086, 1122718, 1123542, 1161148, 1203908, 1220732, 1221328, 1255822, 1304705, 1351851, 1401532, 1462240, 1487375, 1494446, 1535491, 1648057, 1779297, 1924386, 2089565, 2218540, 2364547, 2535706, 2740642, 2945636, 3155952, 3393819, 3686125, 3971310, 4295997, 4659762, 5072425, 5569596, 6168384, 6879734, 7735965, 8838078, 10173996, 11752918, 13551564, 15544945, 17805344, 20514263, 23945203, 28390801, 34213991, 41966324, 52523775, 67915643, 92112005, 130939118, 188941509, 262002861, 334066437, 377024562, 368749184, 314217596, 233621083, 156943813, 103413252, 70598277, 50288916, 37025891, 27828097]
22526B7828097o586491m791877l415722k449699j877653j434766j072236q26789
22518E372864o31721n29207m53035l73749l74297l15150k71810k38977k16943
22509A967975j95238j82572j44144r3639r8731o0890o9326o9535m4253n812j5607
22498I88228o0104o8865m9281n7796k0652k0687l3547m5100o0440m7480l2598
22487D91678n1333k7087j893P220k2773m753k4019L1603M4859l898j2435o632
22475D20537j7451j2587J6106J1399J5589K8137k1645k2294k3069M4424L2456
22464D71602Q9230J13428J79663K69939L95733L95827K59917J2350k64077m56031
22454A467581m53553k83209j93129j00448r6213m8217j349k7683p5090k0479J300
$$ y = [27828097, 21241606, 16449729, 13034007, 10584308, 8706655, 7271889, 6199653, 5372864, 4741143, 4211936, 3758901, 3385152, 3010855, 2695705, 2423895, 2184918, 1967975, 1772737, 1590165, 1446021, 1352382, 1253651, 1192761, 1123435, 1053900, 1009647, 1003835, 988228, 928124, 859259, 809978, 752182, 731530, 710843, 677296, 632196, 571756, 524276, 491678, 440345, 413258, 411365, 418585, 395812, 391059, 367040, 398643, 443502, 439604, 427169, 420537, 403086, 390499, 406605, 418004, 433593, 461730, 440085, 417791, 394722, 439146, 471602, 560832, 674260, 853923, 1123862, 1519595, 1915422, 2175339, 2187689, 1923612, 1467581, 1014028, 730819, 537690, 437242, 341029, 292812, 291463, 263780, 188690, 168211, 169511]
22443A69511k3913j8876j6608M778k2373k7969l5316J6391L0484J2468m375n188
22431G9014k7426l5147m197J0876K7288m632J31j2834r424R416N424K919J1274
22418E2682r774J6395M5532r360l6213l0784l3091K1233L5634K1091j505k383
22406F9457j8063J0645j9231m2325k6385r702L9947Q821M824j1924l1733M788
22394b0881K2032k2456J4584L4018L3828j9972q190j3450J741N504K8420P301
22382F2479k428j3956o135k7594n2894k6379J1738J4223k8157o791k3809j6158
22370a15861K4439j457k7212k2941M82L2063K8812J6760K859K482k2119J4676
22358f7017P560l8419k9042K993j3084j1245p82j1056l4879j7422o920N0573R9099
$$ y = [169511, 145598, 126722, 110114, 114892, 92519, 64550, 29234, 45625, 76109, 88577, 84202, 79014, 51588, 16441, 12244, 23120, 50408, 45776, 45907, 33073, 23649, 33065, 38489, 41408, 52682, 42908, 59303, 104835, 95475, 59262, 28478, -4613, 16620, 52254, 73345, 71840, 69457, 51394, 62039, 42808, 483, -25902, -35604, 4343, 13164, 17988, 6064, -25669, -20881, 1151, -21305, -6721, 27297, 61125, 41153, 32963, 19513, 21254, 26758, 55178, 62479, 60051, 46095, 39960, 12366, -40528, -66907, -55169, -40946, -69103, -75894, -99703, -115861, -91422, -92879, -120091, -143032, -142550, -110487, -81675, -64915, -62056, -59574, -81693, -67017, -59457, -97876, -126918, -123925, -137009, -148254, -149036, -160092, -194971, -212393, -219313, -168740, -69641]
22345f9641Q6653L9452N6982N1569M13J395m1480m7472j9700j1545J577K514k2556
22332B8161k0363K635M371J3417J1561k485O959j993j5461k4295k7359R291K6431
22319A0870J7779j7565j6515j160J9295M357J2694L841J0855j1009j662J5176
22307D6956k4727J914K559j7072L382J3751K608j668j2741O315n331J749J6590
22294C4285j1971j4817k5193p945J7540J0329j16l50N574P975N093k3750j2695
22281a6041N992K065r140l4342O022J2276m764l716k1020r217J8902k059m62Q208
22267d7296K1721K8950j0593j6122Q559n318n368l4775j351n390l253K0389J8663
22254c1184j6644L133Q269J1854j8989k0002q616k5737j5179K633j7733J806J1385
$$ y = [-69641, 17012, 56464, 113446, 165015, 165428, 166823, 125343, 77871, 58171, 46626, 48203, 50717, 28161, 7798, 10433, 14804, 28221, 39782, 37297, 44256, 42263, 26802, 2507, -24852, -15561, 10870, 28649, 11084, -5431, -6591, 12704, 17061, 29755, 33596, 44451, 33442, 31780, 46956, 22229, 24143, 26702, 9630, 13012, 26763, 29371, 27703, 14962, 21277, 15946, 17695, 34285, 22314, 7497, -17696, -25641, -8101, 2228, 2112, 1762, 7336, 15311, 20404, -3346, -16041, -10049, -7984, -17124, -51466, -45444, -33168, -37932, -41648, -62668, -71885, -52983, -55042, -55504, -47296, -25575, 3375, -7218, -23340, -14781, -20099, -25467, -60242, -61593, -66983, -70236, -49847, -31184, -47828, -44695, -36426, -24572, -43561, -63563, -72179, -97916, -113095, -110462, -128195, -126389, -115004]
22241a15004L6149M1636R1440R2650L9694L2214J8128j9935k0852j6756k3417
22230A55947l7407l5560j5985k527M123j3659J8102l9521j9820j911J3149m324
22218B0607m2237j3326P842j886Q198J820K0959L5273J1987j6778M067m904j8666
22205A2956l6529J380K6541P858N287K1360k183k3748k9666o290O215J0210n112
22192a1721k3631R559J0643Q627r598m814J5325L2030l011j0257k811K6841P893
22179D5075k3024k6415j7203j3218k4541K4619L2948j467O363l4606l3567K1620
22167d3416Q848n447o974K1689K3093k2672P440M412O692L5903M766j6595l170
22154A4569l9926J376J677j2172M063n496p27o072J7244j4647K3636L9211M843
$$ y = [-115004, -78855, -37219, 54221, 146871, 186565, 218779, 236907, 216972, 196120, 179364, 155947, 118540, 82980, 66995, 64468, 68591, 54932, 73034, 33513, 13693, 11782, 24931, 20607, -21630, -34956, -27114, -29000, -20802, -18982, 1977, 37250, 49237, 32459, 36526, 31622, 12956, -23573, -22193, 4348, 12206, 17493, 38853, 36670, 12922, -16744, -23034, -16819, -6609, -11721, -35352, -25793, -15150, -6523, -16121, -20935, -5610, 26420, 23409, 13152, 10341, 37182, 45075, 22051, -4364, -21567, -34785, -59326, -34707, -1759, -3226, 3137, -31469, -65036, -43416, -34568, -40015, -46989, -25300, -2207, -24879, -17439, -13027, -6335, 29568, 34334, 17739, 14569, -25357, -23981, -22304, -34476, -30413, -35909, -36636, -42708, -25464, -40111, -16475, 22736, 27579]
22141B7579k8751n1218J1171L0826q687l104l558j5518K5840L6805k0004n0514
22129d9133k2033k2467o860K1125J2472K1945L4211P099n610l60k2066l1246K6033
22116c6890L0671j4667n755J7171J2567P426k0270j3688K0745J5959l982o943
22104B344j3630K545j5012N073l0307k1971J4033J2057K5319J703N070m130k2782
22091c9688J393Q682R277J3514Q072Q380M100j6813M411q247m1411n85L7244m171
22077a5842l074j2318k927K7370N427r137m822L781K0315K1558p355l1947l9782
22064d8753k646P316J946N1568N828p978k179J0137J1759j1831R342k5146k6366
22051b7003l037P683J9521l6578m780R797p05j1040k6361J7455Q869K197K2277
$$ y = [27579, -1172, -52390, -41219, -10393, -19080, -22184, -25742, -41260, -15420, 21385, 1381, -49133, -71166, -93633, -100493, -79368, -66896, -44951, -10740, -3641, -9251, -9611, -31677, -62923, -36890, -6219, -20886, -26641, -9470, 3097, 10523, -9747, -23435, -2690, 13269, 9287, 2344, -11286, -8741, -23753, -18680, -48987, -70958, -56925, -44868, -19549, -17846, -12776, -16906, -39688, -38295, -29613, -20336, -6822, 1250, 9630, 13730, -3083, 1328, -6919, -48330, -48915, -11671, -15842, -18916, -31234, -34161, -6791, -1364, -10501, -15323, -11542, 8773, 30331, 22976, -8971, -48753, -51399, -44083, -42137, 9431, 15259, 7281, 5102, 15239, 26998, 15167, 24509, -637, -27003, -30040, -22357, -2836, -39414, -44194, -34397, -35102, -46142, -72503, -55048, -46179, -43982, -21705]
22038b1705Q102k788n929P816R198k965j3155O097J729k4163J5455K5257l073
22025a24R599j6200j7034j244l699J1199J2702K284K480R16p7j0274l016r438
22011b1926K1802P295k3091k5330K2430K0265j2981j2967J8972n153J8529L0873
21999C8718J1464q689k0790M45K5372M919k317n663Q536J8217J9827J3293M476
21986A07808L5689J1553P561K5145N9703R3082R7060J78154K32370K92709L79443
21975A520277L32174J16569j85794l75173m12096l18494k29800j31425p8524n3450
21965A84264o5400n4394l3853m421j684q734k8636l6088J8972K9369K281J0993
21953A2669j9480k2096j822L8925Q219J7795J6455j2292j6013k7323j2635R005
$$ y = [-21705, -13603, -16391, -22320, -14504, -5306, -8271, -21426, -15329, -13600, -37763, -22308, 2949, -124, 9475, -6725, -23759, -25003, -28702, -17503, -4801, -2517, -37, 879, 802, -9472, -12488, -21926, -124, 7171, -15920, -41250, -18820, 1445, -11536, -24503, -5531, -10684, 7845, 38718, 50182, 41493, 20703, 21148, 46520, 51439, 49122, 43459, 51995, 70212, 90039, 103332, 107808, 143497, 155050, 162611, 187756, 247459, 340541, 437601, 615755, 848125, 1140834, 1520277, 1852451, 1969020, 1783226, 1408053, 995957, 677463, 447663, 316238, 237714, 184264, 118864, 64470, 30617, 26196, 24512, 15778, -12858, -48946, -29974, -605, 1676, 12669, -6811, -28907, -30729, 8196, 16415, 34210, 50665, 38373, 22360, -4963, -17598, -8593]
21941h593J1679l0874P755P538p701l95j0096o268R764L556r408J7944M102Q504
21927b493J7923q166r781N70k5625k6381j5061m990J7006o66Q822L0608o518j4951
21913c9703j4918j9012l784J9398P434j0568N3K2983K622K321j6839n28J3175
21900c7366J5518Q351K0215R839k5315o352j2236k515J8915l598o624J4586J9357
21887A2775l74N13j3090M424O879Q453J750k9612j6626Q772J6987l1847k1579
21874e2575N167n531J2126J0466J0633O221j927J281J2714K1414l505k0362k2028
21861b5906l6766o656L909K1321L2890K5509j3152o60O078j2141j2425O371J8701
21848G073K750r622O611o13j5670k650l7998p011L4191L5969J1080r908k0953
$$ y = [-8593, 3086, -27788, -20033, -12495, -20196, -20591, -30687, -36955, -27191, -23635, -33043, -15099, -10997, -2493, 15430, 7264, -2517, -1947, -27572, -53953, -69014, -74004, -56998, -57664, -48842, -18234, -24752, -39703, -54621, -73633, -77417, -58019, -50585, -61153, -61100, -38117, -35495, -33174, -50013, -50541, -37366, -21848, -13497, 6718, 16557, -8758, -15110, -27346, -29861, -10946, -14544, -21168, -6582, 12775, 12401, 12914, -176, 4248, 11127, 19580, 21330, -8282, -24908, -16136, 851, -30996, -52575, -47408, -52939, -40813, -30347, -19714, -13493, -15420, -14139, -1425, 19989, 16484, -3878, -25906, -62672, -69328, -65419, -44098, -11208, 14301, 1149, 489, 6567, -5574, -17999, -11628, 7073, 9823, 201, 6812, 6199, -9471, -12121, -50119, -57130, -22939, 13030, 24110, 14202, -6751]
21835f751k494j761J2958n918L727m353j3531j1972K2973J8701J5327q848k238
21822A5820r206j2393K0981R429k5306m0978j275m863M392p295J1497Q308L47
21809c0542K0492M1750O015m948p100j13j2129l1509k2522J9111R537N946K1675
21796A5663J8364o829L46J0617p223l4905O266M613l4366j6668o463J6178J4709
21783a9698M241r852l2898j7205J4616L5599N708J5863K3887J0854j3008o31k1112
21770c636j5874j480q683J3676K3869l819k2406k274O027Q323j4539L954K9737
21757A2875K998k9298l7928j5539J981J8949J5337L2352L8059q402K778m639O91
21744C0214o727k6871l3195k8100K6940K2501l7351j1390K8803K7143q482J7759
$$ y = [-6751, -9245, -11006, 1952, -3966, -239, -4592, -18123, -30095, -7122, 11579, 26906, 18058, 15820, 6614, -5779, 15202, 24631, -675, -41653, -42928, -47791, -43399, -50694, -39197, -30889, -30542, -10050, 31700, 37715, 32767, 25667, 25554, 13425, -18084, -40606, -21495, -11958, -6012, 15663, 34027, 27198, 27544, 38161, 30938, -3967, 2299, 6912, -27454, -44122, -50585, -34407, -19698, -15457, -25309, -58207, -75412, -60796, -25197, -19489, -3626, 20261, 31115, 18107, 17476, -3636, -19510, -20990, -29673, -15997, 7872, 4053, -18353, -20627, -14600, -6277, -20816, -16862, 12875, 15873, -13425, -51353, -66892, -64911, -45962, -30625, 1727, 39786, 31384, 34162, 29523, 30214, 23487, -3384, -36579, -64679, -37739, -15238, -52589, -63979, -35176, -8033, -16515, 1244]
21732A244j9209m0341L640Q756o868K9297K0556J6689K6027j6242k5176k4615
21720b6242k7233J0996K8076K3498N509k6378j5095P297m505j7400j0280j7770
21708f9527p873K1163L2141K2091j1714O310J1073j843M835j986k2720j482J0536
21695h996N531J6492o73q552k8348J6889j046j483J4762p22k682J1802j6791o768
21681a0585j957L706J0353R687m692j7953k4819R937J8240m419k1192L244K685
21668b7765j207P371j2105j6139j494L275p386K4966Q06k068M460J1777L5217
21655A9708j1186k4024J7991J7407N406l6089l9893K1303K3777K0560J5647O492
21643C7099k4568K14j4502j7725j6582r96K8353K5530q122K397J8272k403n358
$$ y = [1244, -17965, -58306, -54666, -45910, -52778, -23481, -2925, 13764, 39791, 23549, -1627, -26242, -53475, -42479, -14403, 9095, 14604, -11774, -26869, -19572, -24077, -41477, -51757, -69527, -77400, -56237, -24096, -2005, -13719, -7409, 3664, 1821, 6656, 4670, -18050, -19532, -8996, -3465, 13027, 12354, 3802, -24546, -7657, -8703, -10186, 4576, 3854, 1172, 12974, -3817, -10585, -12542, -8836, 1517, 11204, 6512, -11441, -36260, -26323, -8083, -12502, -33694, -30450, -27765, -28972, -21601, -33706, -49845, -51339, -48064, -55450, -30484, -29678, -31746, -27286, -15509, 19708, 8522, -15502, 2489, 19896, 25302, -10787, -50680, -29377, -5600, 14960, 30607, 37099, 12531, 12745, -1757, -19482, -36064, -37060, -8707, 16823, 8701, 11098, 29370, 26967, 21609]
21630B1609n253k3010j1518L597o735k1979j2213k2835M598J2131J4625j800q654
21617e7437j9815P458O894J0780p145J5000J4120m43j2800K3623o346k3327K0960
21604b8478L5137J0076J4397j7665k1258k1323M314J8660J7578k6399k6157L541
21592c7577m685J7775J7435q457L9549J8241j6056k6488l2764r269J2984L9246
21580I934M173j6074l0441L5004K5431J30Q345k6610o347K185J557j9294k2571
21567c4578k9292q641L1286L4968j251l221l975k3515K439j7656J0720J8012j1127
21554c5831J6867J510K4567p78N843j7244l6869k5024k269L4809L2375Q709k7794
21541b1129j8447j7377m570j6140J2308L4820J5018J8071R578j6461j8611o45
$$ y = [21609, 16356, -6654, -18172, -14575, -21310, -43289, -55502, -78337, -73739, -61608, -46983, -48783, -57437, -77252, -69794, -62900, -52120, -59265, -44265, -30145, -30588, -43388, -19765, -26111, -49438, -28478, 6659, 16735, 31132, 13467, -7791, -29114, -24800, -6140, 11438, -14961, -41118, -37577, -42262, -24487, -7052, -15509, 24040, 42281, 26225, -263, -33027, -42296, -29312, 9934, 14107, -1967, -32408, 2596, 28027, 28157, 36502, 9892, 3545, 5730, 7287, -12007, -34578, -63870, -72511, -41225, -6257, -7508, -10729, -14704, -38219, -35780, -53436, -42716, -24704, -35831, -18964, -17454, 7113, 6335, 12178, -5066, -41935, -66959, -69228, -34419, -2044, 6665, -21129, -39576, -56953, -61523, -77663, -65355, -30535, -15517, 2554, 12132, -4329, -22940, -23585]
21529b3585K0670o415k0077n223K4000L003k1232Q827j934J2005j1083j2056J9884
21516a3216L9850K2273k4207r185j4222L201J7866J4264q764k6770k098J5326
21504A4318n433j4688k3863m0360J7788Q316j3397L9142M1993L0196J335j3705
21492D1642J1168m208k1063R30n012j3910m782j4208j0087P231p868L189J6727
21479b51r47k4809q205J4799J9111J9421L308l4202j9910L0556J3524j7056j1356
21466a6017p16j2944j758J3620j1128K6324K5687O49m0935j8921j5881J2977Q002
21453c1041m789J0282O342Q462r340j6748L772K9075j11k123J8901j8239j8523
21440b4080J0390m815j6482j1861j8360K1193J7672J7437j1798J2659L232J556
$$ y = [-23585, -2915, -9330, -29407, -34630, -10630, -7627, -28859, -20032, -21966, -9961, -21044, -33100, -13216, 26634, 48907, 24700, 15515, 1293, 4494, 22360, 36624, 27860, 1090, -1008, 14318, 8885, -5803, -29666, -70026, -52238, -43922, -57319, -18177, 23816, 54012, 55347, 41642, 52810, 48602, 27539, 28469, 23457, 9547, 4765, -9443, -19530, -12299, -20167, -16978, -251, -1198, -26007, -34212, -19413, -302, 19119, 22427, -11775, -31685, -1129, 12395, -4661, -16017, -16733, -29677, -31435, -17815, -28943, -2619, 23068, 23717, -17218, -36139, -52020, -39043, -31041, -35830, -25548, -19206, -10744, -20084, -36832, -33060, -3985, -4096, -6219, 12682, -5557, -24080, -13690, -18505, -34987, -46848, -65208, -44015, -26343, -8906, -20704, -8045, -4813, -3257]
21428c257l278j1708k8482K6512J8175j5801Q254n287k0635L581J5697J4167L9480
21415C7418j4812j5493j7491M964J137J5218o694Q511J3579k2662k2595j7369
21403c6289L678j404M285J4673k762r893L206k9598J4516R229q879j980J5611
21390b5607K4936j2364j4850J3216J9117Q108M3453J7933j2445l6738o479L404
21378B1684l1440j0965N93j1275J3584P972J8629q441k1900K6709n788j6632J9970
21365B700J2244l2853l0975J3962L419o266J1353L3219J0632j612q964j8063j0811
21352b2015J3137P77n271J0940K8522K7902J8315k6951k9500o308j6928K350l157
21339h187k4486j8484J3641K2188M539J1058L1663J1531k6785m515J0941o195
$$ y = [-3257, -6535, -18243, -46725, -20213, -2038, -17839, -9585, -14872, -35507, -31926, -16229, -2062, 37418, 22606, 7113, -10378, -5414, -4277, 10941, 4247, 12758, 26337, 3675, -18920, -36289, -32611, -34015, -29730, -15057, -17819, -27712, -24506, -54104, -39588, -30359, -39238, -41218, -25607, -671, -13035, -27885, -14669, 4448, 12556, 56009, 73942, 61497, 24759, 18280, 21684, -9756, -20721, -20128, -31403, -17819, -9847, 8782, 341, -21559, 5150, -638, -17270, 2700, 14944, -17909, -48884, -34922, -31503, -37769, -26416, 6803, 17435, 15823, 6859, -11204, -22015, -8878, -8101, -13372, -2432, 26090, 53992, 72307, 45356, 15856, 9548, -7380, -5030, -8187, -32673, -51157, -37516, -15328, -10789, 269, 31932, 43463, 16678, 12163, 23104, 16909]
21327A6909j5481p476o960K7678J821j2264m784Q987J1647J1707j7676k8305j6554
21314c0751J0445n671k664J5656O418j662k1577O504J398j5886p205N5m185M471
21300d4654K5793j9621K972R396K0158K6945O797o940k0973j1375j923k5679J739
21287c7365J7647R030l404j5183J0913K3668k2993j5740J1881J4045J3502K234
21275H235l7915J9631K264L03j3739L2091j1854k6946J318L3765l777L314K936
21262I626n784j6412N7J4680J2702j3966m199J6561J1972O546J7895p453k9113
21249A3112o604j8370Q235j047P999J185n940r691R089Q507Q201L227j4704j3032
21235i833O984q079j0104o041j4620j3547L218R788L3457P307k2467j6143K8364
$$ y = [16909, 1428, -6048, -13008, 14670, 16491, 4227, -557, 8430, 20077, 31784, 14108, -14197, -30751, -20306, -25977, -28641, -12985, -6567, -8229, -29806, -23302, -21904, -37790, -44995, -44940, -49125, -44654, -18861, -38482, -35510, -26114, -5956, 20989, 27786, 20846, -127, -11502, -13425, -39104, -37365, -19718, -10688, -14092, -29275, -18362, 5306, -17687, -33427, -21546, -7501, 6001, 8235, -29680, -10049, -7785, -7482, -21221, 10870, -984, -27930, -26612, 7153, 3376, 6690, 9626, 3842, -12570, -12513, 2167, 14869, 903, -3296, 13265, 25237, 31783, 49678, 42225, 13112, 6508, -11862, -3627, -4674, 3325, 4510, -1430, -11121, -2032, 6475, 14676, 17903, 3199, -9833, -2849, -10928, -21032, -27073, -41693, -55240, -52022, -42234, -8777, -1470, -23937, -40080, -11716]
21222a1716L0418O889j2452k5004J4296K4419o178m249M042Q5l356k6251j0957
21209b0014K9987J4988K688p233m3815K485J2559J1896j316m296j1463J8900K9075
21196C4441N504O562J750k1236N618l737k3458q799L62L7082J8023j2394j6054
21183B3664r58j869j9509j2825n641N445K308K0433o013j9359M492K0499l892
21170F775K278N699j1436R287k8421o374l513Q139J6732J21Q378r852n137Q415
21156A091Q377j9752k0722J1262L949k474Q469M4l787N018J2950O718M73J4739
21142B6355J2437m896n508j3724M43L806K2061J0525j2049j4627j9381M723J847
21129A2012J088M196K681L863k8004j7499k936o494j886M973J6828R700K427M967
$$ y = [-11716, 18702, 25591, 13139, -11865, 2431, 26850, 20672, 16423, 20465, 20550, 17194, -9057, -20014, 9973, 24961, 27649, 20416, -23399, -20914, -8355, 3541, 2225, -2071, -13534, 5366, 34441, 39945, 46507, 48257, 27021, 32639, 28902, 5444, -3355, -2993, 34089, 52112, 39718, 23664, 22706, 20837, 1328, -11497, -17138, -11693, -9385, 11048, 5035, -14324, -9832, 10667, 6775, 9053, 14752, 3316, 12603, -15818, -22192, -25705, -17566, -834, -713, 7665, -2187, -7324, 1091, 9468, -10284, -31006, -19744, -15795, -18269, -9800, -9756, -13543, -8525, 4425, 11143, 11616, 26355, 38792, 33896, 28388, 14664, 15107, 18913, 40974, 51499, 39450, 24823, 5442, 10165, 12012, 13100, 17296, 19977, 23840, -4164, -21663, -24599, -31093, -32979, -28006, -11178, -1478, 949, 5916]
21115E916Q500j9722J675J9823N768O513R074j278R475n7006k3040R10K538j6679
21101d7533J061K4846J6120p494j3633r793k197K2960R554M31R019K7411l323
21088B7429j6115N973k9901Q267J9342j1424L58r73J399j538Q294j5387J6024
21075A1748k498k2882l82l298J160K5316R1j7854j6581j7042L1893l100K457J583
21061i389j0451K3186J591k829Q193l371L939J3421n649J2535l7114l2553M088
21048c4403J6713j287L1561L2954k1056k699j7651k3266k5557J4502K8683j691
21036c197j2543J770j0254N048r741r667L531L2930P363M635m599L393J7143J3248
21022C9060l509k8495p161k0245L7700J0401k2680j2859K618J9256K2641R859
$$ y = [5916, 14416, -5306, -3631, 16192, 21960, 28473, 37547, 36269, 45744, -11262, -34302, -33392, -30854, -47533, -46472, -21626, -5506, -13000, -26633, -36426, -38623, -15663, -6109, -5678, 3341, 30752, 27429, 11314, 17287, -12614, -4347, 14995, 3571, 3929, 2956, 4355, 2817, 11111, -4276, 11748, 9250, -13632, -14014, -17312, -16152, 9164, 9255, -8599, -25180, -42222, -10329, -13429, -10972, -9389, -19840, 3346, 4937, 2108, 10301, 6930, 10869, 24290, 18641, 31176, -5938, -38491, -34403, -17690, -18977, 12584, 45538, 24482, 21783, 4132, -19134, -44691, -30189, -1506, -3197, -15740, -13970, -24224, -19176, -28917, -38584, -35053, -2123, 5240, 9875, 5276, 8669, 25812, 39060, 35551, 7056, -105, -20350, 17350, 27751, 5071, -7788, -5170, 14086, 36727, 46586]
21010D6586l2685p574K2307J6363O113k8203k0052O2J7119J9199q586j4215O215
20997B2649M463P283J3805l596l3323K9188O15k3657q505Q974J2267m643K370
20984B7890J4632J0408J5320j9546m2165M654l234K254j2774r348L7827O732O654
20971C9304j561J428R241J5069L549R385j6395k6447J7225K238j6455m045K208
20958C4744K078l371L782n289k8230m667L301j1722k2048l8543K1326r829j3213
20945g1681R731M1969J0635l1598q455M552J2722L2596J2181j5851j3468o713
20933b3380O770L4347n401l8762k7764N975J2390J0882J9610O244L244K574Q374
20920A5103J2755j6682M963J5336K5786o902j4564k0464m059O209k9696J4615
$$ y = [46586, 13901, 6327, 28634, 44997, 51110, 22907, 2855, 2917, 20036, 39235, 30649, 16434, 22649, 27112, 34395, 48200, 44604, 11281, 40469, 41084, 17427, 8922, 17896, 30163, 25520, 27890, 42522, 52930, 68250, 48704, 6539, 11193, 7959, 10213, -2561, -11909, 25918, 32650, 39304, 37743, 39171, 48412, 63481, 67030, 76415, 60020, 33573, 50798, 53036, 36581, 32536, 34744, 36822, 33451, 37233, 31944, 3714, -953, 2348, -9374, -31422, -69965, -48639, -58468, -71681, -61950, -19981, -9346, -40944, -49399, -44847, -32125, 471, 12652, -3199, -16667, -23380, -16610, 17737, 12336, -26426, -54190, -48215, -35825, -24943, -5333, 911, 4155, 6729, 15103, 27858, 11176, 16139, 31475, 57261, 50359, 35795, 15331, 11272, 17481, -12215, 2400]
20908B400l618j3052J978J077J3866j3371j3715m84N770J5399M4854J8944q730
20895E1318p454J87k1270j2300K684Q102R738J3791N148K793K5159J210l6320
20882D2786l109k0650j3665l193m3863n498L9509L4817K3739O368k1552k6422
20870I267m157J5436l1537R475L7685j8023j7536l88L9496J7716j0558j933Q14
20857D5757k6458L563Q523j6287Q340k7898j3626J4593j8530J6429K7976l653
20845A8729j3774j0197J9541J9569K2444o575k0577R967r497k4212j493K1356
20833B5281J185j3148l3228Q996J0540M847N780M937J413P365j0078m085r856
20820e1N153M721J100N836N387r234j0026J4922o098j4235k3217Q27M219O765
$$ y = [2400, -1218, -14270, -12292, -11215, 2651, -10720, -24435, -24919, -19149, -3750, 41104, 60048, 51318, 43864, 44051, 22781, 10481, 13165, 21267, 31005, 44796, 49944, 52737, 77896, 79106, 42786, 39677, 19027, 5362, 2169, -41694, -47192, -7683, 27134, 50873, 57241, 35689, 9267, 5110, 20546, -10991, -1516, 36169, 18146, 610, 222, 39718, 57434, 46876, 44943, 45757, 19299, 22862, 31385, 15098, 23438, -4460, -18086, -3493, -22023, -5594, 22382, 18729, 4955, -5242, 14299, 33868, 56312, 49737, 29160, 39127, 29630, 5418, 3925, 25281, 26466, 13318, -19910, -10914, -374, 4473, 10253, 15190, 16603, 23968, 13890, 9805, -51, 5102, 9823, 10923, 16759, 22146, 12912, 2886, 17808, 11710, -2525, -25742, -24915, -20696, -13931]
20806a3931Q230N396l432q586J9077M650l6363o653K2599K0099K27n077K2132
20793B8368j3589K532k8146l0748j503P774r301n320n282J6195J7275k2920Q136
20780c6529J7856L775K0272R346O903J8879J6500K1793l5107k4194J4747q553
20768B5688j6053J9681o947r41L842r326j3612K6444J2027R931j1151o40j1788
20755B7155N866q283k5017j6269J5946n206j5240J8066K1775K1317k9327j9088
20743h305J0130R007k2977p785j0257k5125N588L9421K0734J6074j4678j3419
20731a592q941Q601M2430j6536j2673j4609r79J3755Q236L672j740q769l946r285
20717b376K4168K5073k4603j8492j103j0749o517j5539K0717M494p091J0839N139
$$ y = [-13931, -5701, -305, -3737, -12323, 6754, 11404, -24959, -31612, -9013, 11086, 11313, 6236, 28368, 14779, 17311, -10835, -41583, -43086, -35312, -44613, -49933, -55215, -39020, -21745, -44665, -36529, -18673, -14898, 5374, 14720, 21623, 40502, 57002, 78795, 43688, 19494, 34241, 25688, 9635, 29316, 22369, 21428, 25270, 15944, 2332, 28776, 40803, 50734, 39583, 38943, 27155, 33021, 24738, -279, -16548, -602, -5808, -21048, -2982, 18793, 40110, 10783, -8305, 1825, 10832, -12145, -19930, -30187, -55312, -49724, -10303, 10431, 26505, 11827, -1592, -10533, -1932, 40498, 23962, 11289, -3320, -4299, 9456, 17692, 21364, 19624, 10855, 6909, -2376, 21792, 46865, 22262, 3770, 2667, -8082, -14599, -30138, -9421, -4927, -12018, -1179, 3960]
20704C960j5723q354J4699J8059j9625j0160k248K5560J3875J6989j4432k6034
20692c434Q54Q535P608o400j8075m256J727K4096q198L797K1082R658j2323k6751
20678b080L065O627J3920j1464n763M871k6531K817M3211k067L949Q64j9804m459
20664G156r784N495K6621j1122Q510k3438l2933m970P587O092J7501J2784k1550
20651a2051J0941L3780n459k392m256M649J6921k7875j1097n788j3358p31M388
20638a2328O647j1177L8648P578j5372j2337j6996J3184J2760L8426J8967p061
20626F0939j8852l7724j816K3567q122k207J5276K284l4251j7534N781L0663J4598
20613C2602o617j1787q025l31J7072r788J845j742l16K5887m064o794k450o3J6370
$$ y = [3960, -11763, -20117, -5418, 12641, -6984, -17144, -19392, 6168, 20043, 37032, 22600, -3434, -2580, 5955, 13563, 7163, -10912, -15168, -13441, 10655, 2457, 6254, 27336, 36994, 24671, -2080, 985, 7612, 21532, 10068, 4305, 9176, -17355, -14538, 28673, 26606, 30555, 31419, 11615, 7156, -2628, 2867, 29488, 18366, 26876, 3438, -29495, -34465, -26878, -20786, -3285, 9499, -12051, -1110, 32670, 27211, 24819, 20563, 25212, 42133, 14258, 3161, -2627, -15985, -16716, -12328, -5681, -16858, 21790, 29368, 13996, 1659, -15337, -2153, 10607, 49033, 68000, 60939, 42087, 4363, 2547, 26114, 17992, 15785, 31061, 33345, -906, -18440, -12659, 18004, 32602, 25985, 14198, 6173, 5842, 22914, 13126, 14971, 13229, 12913, 38800, 34736, 27942, 25492, 25429, 41799]
20598D1799J958n998l4348j5278o728K0631R421J3263R502o412n903J0570j3585
20585A8892Q011O595J1238J9387j691k2303k1774j7788J1090R12l6383O140J7073
20572f01J1474l229J2458J4343L08P596r661O837Q728k1657n4170k0485L1030
20559a7029M4898P010R073k0681o286j1876l489l936l540q295J0157L5728J6465
20546D8199K574J4593k3116m0727j8506J4931o305M1290J8158j4931p864m070
20534B4226O705k7723J5803J793j8868J537K4238J6498M964l5390k6057k1898
20522c4172Q200J5442q307J1166J5258J2451j525k50M028M194J7486Q472m438
20509D8005J5132k9432p916l886K1480p720j9800Q308K6328k297J639P677l9646
$$ y = [41799, 43757, 37759, 3411, -11867, -18595, 2036, 11457, 24720, 34222, 27810, 21907, 32477, 18892, 26903, 33498, 44736, 64123, 62432, 40129, 18355, 567, 11657, 12569, -23814, -17674, -601, 10873, 7644, 20102, 34445, 34753, 42349, 32688, 39525, 48253, 26596, -27574, -48059, -17029, 27869, 34879, 43952, 23271, 16985, 5109, 1620, -2316, -5856, -14151, -3994, 31734, 48199, 50773, 65366, 42250, 1523, -16983, -2052, -8357, 32933, 51091, 36160, 28296, 24226, 30931, 3208, 19011, 20804, 1936, 3473, 27711, 44209, 49173, 13783, -12274, -34172, -25972, -10530, -18837, -7671, 7587, 20038, 18513, 18263, 22291, 26485, 43971, 52443, 48005, 63137, 33705, 25789, 21903, 43383, 35663, 15863, 24171, 50499, 48202, 49841, 57518, 17872]
20496A7872R94Q070k7590j7711J1173j1042j4889Q923L9722l841j0745J2984n509
20483H411J7028q477R080K44K863K3148K2293k0370k9628j6527j0964N628N592
20470H321P576m846J571K0692J314Q50O45N927k8862q076k5154J295J1334J0165
20456B752J2597Q016k767K0246M295O103j1245j6390J2408j4216q507P493M336
20443B5121R960M424J4377K915q830r459r765k7804j4979O201M299J5218J6672
20430B8350j6957j0400q854m951K4127M307m068j2148L2826K4795l5267k9129
20418g369K4731L6490M782L985j7136r086m577j2815k426J550N97K2782o886j261
20404C3361J3855k1104k0734n347m581R631r480K5478L2865J5127J9638Q560l6584
$$ y = [17872, 18866, 26936, -654, -18365, -7192, -18234, -33123, -24200, 15522, 11681, 936, 13920, 8411, 25439, 16962, 26042, 26286, 29149, 52297, 74590, 54220, 24592, 8065, -2899, 2729, 8321, 15897, 11051, 12622, 33314, 34628, 35478, 36123, 42050, 13188, 5112, -20042, -18747, -7413, 2752, 15349, 23365, 20598, 40844, 45139, 51242, 39997, 23607, 36015, 21799, 13292, 20785, 25121, 35081, 39505, 53882, 56797, 47967, 38508, 28743, 939, -14040, -7839, -3540, 11678, 28350, 11393, 993, -7861, -12812, 11315, 15622, 11554, -594, 32232, 57027, 21760, -7369, 17362, 53852, 58634, 62619, 45483, 36397, 31820, 19005, 16579, 18129, 18726, 41508, 34622, 33361, 47216, 26112, 5378, 31, -4550, 5081, -4399, 21079, 53944, 69071, 88709, 97269, 60685]
20391F0685k6306r02l6544q919K0323m076p467j9664j5514J8346L8097K9347k818
20378D4588J12O17M2477L0347l6730j3753k2725j1647J3558q509j5401n462j9382
20365a910J5126O250m1502n0634J9751M1589K3883L3063K3566n006k3687k7595
20353A2894j7125L791K3299K5966n1q878j417j6084j1566J5391M568O601j444
20340C5945m016k4529k3949k0814J5060l840K8281o336n961J5959K1760n10l0683
20327c633n341O319J5604J2775R092j5917j6431J145J671K3390J3330j2145M20
20314C0279J4697Q729k8387p180R2m529j89O996J0332R427o849k5243j801K1641
20300B8015J7881K1622J9444k7614k4394k1642k961R826q671K266j0642j3228
$$ y = [60685, 34379, 33477, -3067, -11986, 8337, 4261, -3206, -22870, -38384, -20038, 18059, 47406, 44588, 44700, 45317, 87794, 118141, 81411, 67658, 44933, 33286, 46844, 38335, 22934, 17472, -1910, 13216, 19466, -22036, -72670, -52919, -11330, 12553, 45616, 69182, 64176, 40489, 12894, -4231, -440, 22859, 48825, 48774, 39896, 38479, 22395, 10829, 26220, 30788, 37389, 35945, 31929, 7400, -16549, -37363, -22303, -26143, 2138, -4198, -10159, 5800, 27560, 27050, -3633, -8974, -2655, 12949, 25724, 34816, 18899, 2468, 3613, 5284, 28674, 42004, 29859, 30279, 44976, 53705, 25318, 18138, 18230, 13701, 13512, 20508, 30840, 40267, 33418, 8175, 6374, 28015, 45896, 67518, 86962, 59348, 34954, 13312, 10351, 20177, 11506, 13772, 3130, -10098]
20288a0098J1438R512K0625N903k1042k2550M079L1248J627k1113J0949M5148
20276F5726J4478j8539m2036k7618Q140R019K43o05J1785K1819k1556k5634j932
20263f710K3533K1227J8584J5188P79o209m3267O825K4655J1102P064p520n41
20250F4710K8950J015l2761k1563J7341K214P823j1778p737j8919j6593o719m8
20237E935J0438R403k0405j3197J2666J5611J350j1848r09l270K2338J5805j171
20224D2746k089M732N134J728J488j0051l8227M697J3699Q39m69k0670P53l746
20210E64m943L805j5270O190J2901K6063J7270L5608k6731k4497J5255l0772P072
20197B2515K0615M115p574N209j5111Q286J3025O355j8951o08K4502O101j6710
$$ y = [-10098, 1340, 10852, 31477, 37380, 16338, -6212, -2133, 29115, 30742, 9629, 20578, 65726, 80204, 61665, 19629, -7989, 151, 9170, 9413, 8808, 20593, 42412, 20856, -4778, -6710, 16823, 38050, 56634, 71822, 72601, 66392, 23125, 29950, 54605, 65707, 72771, 65251, 64710, 93660, 94675, 61914, 40351, 57692, 59906, 67729, 55951, 48214, 29295, 12702, 5983, 5935, 16373, 25776, 5371, -7826, 4840, 20451, 21801, 9953, 9044, 5774, 28112, 43917, 42746, 40657, 45389, 50523, 52251, 53739, 43688, 5461, 10158, 23857, 24696, 24227, 3557, 4310, 564, -4379, -574, -15844, -9654, 3247, 29310, 46580, 82188, 55457, 30960, 46215, 15443, 22515, 43130, 47245, 39671, 44880, 29769, 38055, 51080, 57435, 38484, 37876, 62378, 68479, 51769]
20184E1769l1619j9846J4059K6183o421m9260j702n308M593J8679L3652o344J4154
20171D2589O232l4473J6897O460Q562n906k2466P801O558J2528K1073R44L094
20158F9893o094k4279o183M6247L5424p809m8959P726L999j5071m474j2718j3577
20145B4125J0866N227J0762j6758m8585m888J3737Q60L8315K2005L516J1361j3932
20132E6611k7830K5850K1424l0717l2690R92o189q552Q282J5111k8603k076K7936
20119A9549L4489m843j2524k7830j4733L3430K6350O404j2475j3820K0775O645
20107F1417n141m25k8876k4106K5130L572j3631R044J1548k974j6948J0995J7533
20094D7138j6646k2751o301L2151p923K1884J5415k9912j0583J555K8134K2989
$$ y = [51769, 20150, 304, 14363, 40546, 34125, -15135, -16837, -22145, -17552, 1127, 34779, 28435, 42589, 48821, 14348, 31245, 37705, 46267, 40361, 17895, 25696, 32254, 44782, 65855, 66799, 69893, 63799, 39520, 33337, 79584, 115008, 107199, 58240, 65966, 69965, 54894, 50420, 37702, 24125, 34991, 40218, 50980, 34222, -14363, -19251, -5514, -4654, 33661, 55666, 59182, 70543, 56611, 28781, 54631, 76055, 45338, 12648, 13640, 7451, -1101, 7181, 22292, -6311, -8387, 19549, 54038, 49195, 36671, 8841, -5892, 27538, 53888, 60292, 47817, 33997, 54772, 61417, 56276, 55851, 26975, 2869, 27999, 31571, 17940, 26984, 38532, 35558, 18610, 29605, 47138, 30492, 7741, 1440, 33591, 25668, 47552, 62967, 33055, 22472, 24027, 52161, 75150]
20082G5150k1353j4284n879l4636O673P965L1042K6756j0661j6517k973P057J6569
20069F4909j0821k0800j6084k0534K2249K5227J438j9579J0643Q850N224j8360
20057C2362k6470L781K209L571Q842m401j2139L4412J7920P721K8429k5609j8300
20044E2328K552L549L451l0981k2143j1401R907m122J3055J6494K480J682l2144
20031D707q240K0677m402k1153J550O916J7517L1656P735R275k3816J2449Q127
20018F2998j6809j4601j910j6217o562J7674O57q756J2291J9323m247k314k6595
20005A4932K6513R803k5440j3287k228K4052L6597k47k3148m820L727J1029M027
19992F1510O45J9177J2219m243j6705k9176k3498p898P703n147o846o694n389
$$ y = [75150, 53797, 39513, 33634, -1002, 5671, 13636, 44678, 71434, 60773, 44256, 41283, 48340, 64909, 54088, 33288, 17204, -3330, 18919, 44146, 45584, 26005, 36648, 45498, 50722, 32362, 5892, 9673, 11882, 15453, 24295, 19894, 7755, 42167, 60087, 67808, 96237, 70628, 52328, 54880, 58429, 61880, 30899, 8756, -2645, 7262, 3140, 16195, 32689, 35169, 36851, 4707, -3533, 17144, 12742, -8411, -6861, 55, 17572, 49228, 56963, 66238, 42422, 54871, 62998, 46189, 31588, 29678, 13461, 6899, 24573, 25230, 16474, 28765, 48088, 43841, 41527, 14932, 41445, 51248, 25808, 12521, 10293, 34345, 70942, 70695, 47547, 42727, 46454, 57483, 61510, 62155, 81332, 93551, 89308, 72603, 43427, 19929, 12031, 19734, 14587, 7741, 1047, -4342]
19979d342J1563J5588j9194M568J6324K5022q145m723R622L5978o806k6194O332
19966E5593O315j7547k071J7708j8520k0289K9805R851k5823j5705J5960P798
19954D3075J4421k808M471J9475j5897j8136J5400K7171j8606J2619l03o495j5373
19941E9014k8098J2867K2673j1125K006J1679k8940Q990J1196P748j0389m964
19929E2657N134p423p160j2344O614J2731J3282L6170J5061l1436k9533p537R035
19916E5251M0122j1443j9539j6042j0031j0094p21K3599K076p987m874L1362K3898
19903I5577K85l8259J1981L5732n494l1743p236J5681j6301p707k0352j8871K2449
19890C5742R891j1589L74K2520p99J4442J0411J6768p185k044j8133k7987j3110
$$ y = [-4342, 7221, 22809, 3615, 8183, 24507, 49529, 41384, 36661, 46283, 82261, 75455, 49261, 55593, 61908, 44361, 42290, 59998, 41478, 21189, 50994, 60845, 35022, 19317, 35277, 43075, 57496, 54688, 59159, 78634, 62737, 44601, 60001, 87172, 68566, 81185, 80882, 74387, 59014, 30916, 43783, 66456, 55331, 57337, 69016, 40076, 49066, 60262, 68010, 57621, 52657, 57791, 50368, 43208, 30864, 37478, 50209, 63491, 99661, 114722, 83286, 53753, 46216, 55251, 95373, 83930, 64391, 48349, 38318, 28224, 27503, 51102, 53178, 45191, 40317, 71679, 95577, 95862, 57603, 69584, 105316, 99822, 68079, 60843, 76524, 60223, 52516, 32164, 13293, 35742, 45633, 34044, 34418, 56938, 56139, 70581, 80992, 97760, 90575, 88531, 70398, 42411, 29301]
19877B9301j5854o642J1847l55p53j4151J4579K4124n086N888K92P609Q885j2919
19863D6765l4020q471J62P216M7788J5616k3648J3969J5770K774n832J3037k5491
19850F5635l5857P329J7972K1724J1362k3027k4665j4828L4705K5784r871r745
19838F6518j1846r79o769L2924K1856j6184Q99R090k2256k1424l044L945J6222
19825F8952j454K8230o204n700p71q576L229n713j9730R172J4527M365l411N832
19811H2748j0278n837Q459R217K1941n233j894r737j2860J1558J0742J090l4828
19798F5088j1609l62J1598R333j5318m276P74k632j1761R718L673J3977J4026
19785H2229K813j1277k6852P766n595j673M368k0392j2140K0466J4753K3251J5114
$$ y = [29301, 13447, 6805, 18652, 18297, 17544, 3393, 17972, 42096, 37010, 42898, 43190, 50799, 59684, 46765, 12745, 4274, 4436, 11652, 59440, 75056, 51408, 65377, 81147, 83921, 78089, 91126, 65635, 29778, 37107, 55079, 76803, 88165, 65138, 40473, 25645, 60350, 86134, 76263, 66518, 54672, 53693, 46924, 79848, 101704, 85520, 86419, 95509, 73253, 51829, 48785, 52730, 68952, 67498, 95728, 89524, 83824, 83053, 74477, 77706, 71993, 52263, 61435, 75962, 80327, 76916, 82748, 72470, 66633, 75092, 84309, 106250, 101017, 99123, 89386, 76526, 88084, 98826, 99916, 65088, 53479, 53117, 64715, 74048, 58730, 54454, 55228, 52596, 40835, 50553, 54226, 68203, 82229, 85042, 73765, 46913, 54679, 49084, 47411, 51779, 31387, 19247, 39713, 54466, 77717, 92831]
19772I2831l3245k1377Q703K4195L2367j290o631l03r540k7312j2841j8723Q110
19759C4944Q619J5912P793Q91L3665K7790j3305j0109K2952o796l3411k0790J601
19746F9756K6507j4240J185K7689o000k3199j5507j6830k6817r044K5650K7723
19734F6873L5655K065n030k1488j6657j0294k4382J0705q131N981M3374o744m376
19721F7551k5502p761L4041Q687j7507r324P478j202J9076p520j8007r57K925
19708E1978l962P654M918r611J4290k0115j6697L0083N3948R095j3009p419j9594
19695H1559j4481J2100L859j3423L75j2237N497K0263J0074k0382j6051o614k124
19682D8415j1176J9244K7852R727J5657N9102P200o0547m5154K708l12K2010K3023
$$ y = [92831, 59586, 38209, 46912, 71107, 103474, 102184, 95553, 95250, 85710, 58398, 45557, 26834, 34944, 43563, 59475, 67268, 68159, 101824, 129614, 116309, 106200, 129152, 122356, 88945, 68155, 69756, 96263, 82023, 83208, 110897, 104897, 81698, 66191, 49361, 22544, 13500, 39150, 66873, 102528, 104593, 99563, 78075, 61418, 51124, 26742, 37447, 29316, 35297, 78671, 71927, 67551, 42049, 34288, 68329, 77016, 59509, 50185, 57663, 56461, 75537, 68017, 50010, 49053, 51978, 48016, 55670, 60588, 50977, 65267, 45152, 28455, 58538, 112486, 121581, 108572, 101153, 81559, 67078, 79178, 83037, 69614, 69989, 57752, 63249, 83512, 93586, 73204, 57153, 50539, 48415, 37239, 56483, 84335, 94062, 109719, 168821, 176021, 115474, 70320, 73028, 72716, 94726, 117749]
19669A17749J4k912k9547k4830N717L4629K4956m048k0752k7727J5652K9281O702
19656A24884L0030O626j8404n944M1994K0532J0410L1433M1225M3344O0663N8427
19644D45220O1952K0899m248K3939J7216l4218j0200J9373M5403L6043J7717J7735
19632F56831M3274L7260o862l8263m1205k7257m7426l2571k4648n686R489K4343
19620E47279J5735J004m799l2476j9214o8231r1440o8258n4505m4151k8762j9453
19608A32729p308j2422j4253p926j2369l042J1130o471l322L0255j9034J754K0917
19595A10638K0643k778J352j5445l2223j2344K5887K1683k2793k2592k7176k1398
19583B3454N31K0089K0083K5980l624q878P7K0347J316p878J0198L5868j5477
$$ y = [117749, 117763, 114851, 85304, 60474, 66191, 100820, 125776, 121728, 100976, 73249, 88901, 118182, 124884, 154914, 161540, 143136, 137192, 179186, 199718, 210128, 241561, 282786, 326130, 386793, 445220, 507172, 528071, 523823, 547762, 564978, 530760, 520560, 539933, 585336, 621379, 639096, 656831, 700105, 737365, 730503, 692240, 651035, 623778, 576352, 543781, 519133, 513447, 522936, 547279, 563014, 564018, 559219, 526743, 507529, 439298, 347858, 279600, 225095, 180944, 152182, 132729, 125421, 112999, 98746, 90820, 78451, 75409, 86539, 80068, 76746, 107001, 87967, 89721, 110638, 131281, 128503, 129855, 114410, 82187, 69843, 95730, 117413, 94620, 72028, 44852, 23454, 23985, 44074, 64157, 90137, 86513, 77635, 77712, 98059, 99375, 91497, 101695, 137563, 122086]
19570A22086l6438J1515K2836j3030m2468j819j7469P118J6799N802Q713M617
19558H8262J6919L2528K7496j7802k8332J6925P536N176l3700J3999k903j8547
19546A07557M287k0692J008j3686p20J0097R168J6319k3143j4377J0401o802k84
19533G9133L0001m755l3280k9669N3092R885P86J5121k467j816J4377O244j1851
19520A24801J8829Q953l0831L48n396J0697J7843N624k6498J6904J7480j9548
19508A39206j1572R288J4427J0495o929j174k7152l6447j037J0659P916r495O030
19495A04215K3386j0296L78J4048m10j2148k1159m902K8263K657J435r298k1251
19482I4918N157J8182n704j2844K3544M066j6784l5999P493K9509K7437k9543
$$ y = [122086, 85648, 97163, 119999, 106969, 64501, 62682, 45213, 52331, 69130, 74932, 83645, 88262, 105181, 137709, 165205, 147403, 119071, 135996, 143532, 148708, 115008, 129007, 126104, 107557, 111844, 91152, 92160, 78474, 77754, 87851, 97019, 113338, 90195, 75818, 86219, 79417, 79133, 109134, 104379, 71099, 41430, 94522, 104407, 105193, 120314, 117847, 116031, 130408, 136652, 124801, 143630, 152583, 121752, 122100, 116704, 127401, 145244, 150868, 124370, 141274, 158754, 139206, 127634, 136922, 151349, 161844, 154915, 153741, 126589, 90142, 89105, 99764, 107680, 98185, 104215, 127601, 117305, 117683, 131731, 131321, 119173, 98014, 93112, 121375, 124032, 125467, 116169, 94918, 100075, 118257, 112553, 99709, 123253, 127319, 110535, 74536, 82029, 111538, 138975, 109432]
19470A09432j0181m388l6979O974K1296L853O141J4504K7872K0121P810j5910
19458A50545l8036P277K487k486M95P743J5080j1349j3299o166M121P04q803J8593
19444A26906J4023q821l6930k5413k889n212Q291l162k3778L92k259j366N572
19431D5354J9221O566L242J7802j286Q061J3999j038k533L672r959K3173P6753
19418B03027Q3946P6923L4973J4590l0486m8137N276L6678Q0930R7588P9344R381
19406F44033m1639p6002n9480k9512l2439r062K9500N428K0463k750m0164q0546
19394C27830o1664j2339o777o107q669j4186J3770r75J4073J9532K3454K0949
19382C08891l271M04o475j5013N366j5576K9941R196L068M2464N3452N7198O4065
$$ y = [109432, 99251, 94863, 57884, 64858, 86154, 90007, 96148, 110652, 138524, 158645, 166455, 150545, 112509, 119786, 122273, 119787, 120282, 128025, 143105, 131756, 118457, 112291, 116412, 117116, 108313, 126906, 140929, 132108, 95178, 69765, 66876, 61664, 69955, 66793, 43015, 43407, 41148, 39782, 45354, 64575, 71141, 74383, 92185, 90899, 98960, 112959, 111921, 109388, 113060, 103101, 126274, 203027, 286973, 363896, 398869, 413459, 382973, 334836, 340112, 376790, 457720, 555308, 634652, 644033, 602394, 526392, 466912, 437400, 404961, 395899, 425399, 430827, 451290, 448540, 408376, 327830, 266166, 253827, 247050, 240943, 232274, 218088, 231858, 230883, 244956, 264488, 287942, 308891, 305620, 306024, 299549, 284536, 289902, 274326, 304267, 313463, 316531, 358995, 412447, 469645, 533710]
19369E33710K9161j2368l5962k5414L603Q5820J19873Q0688P981o7056r6972j00802
19357E22262l3317j1580J5377L7581J711P490l4431l4097l4729m0368m2464k3823
19345C29612m1881J8243N4527O4031O6153P0412J10981R9753J33263J61798J47010
19334A213902O9078q101j0288l2232q5490k0881N4271J25069J86717J71240J13722
19323A777007R4296J02590m44j34358j66567j45832j44240j50740r5670K0721
19313A156763Q0716J37995J23651J2867o4915j15358j46461j79725k06230j69421
19303F29882q4611l2141k2223o899M88k3678N577L6811M1326J6016K5878J3483
19291E99909J4016k674k9857k2169P050Q270l559J3223j2875m0953r146J2311
$$ y = [533710, 562871, 550503, 514541, 489127, 492730, 578550, 698423, 779111, 787092, 720036, 623064, 522262, 488945, 477365, 492742, 530323, 532034, 539524, 505093, 470996, 436267, 395899, 353435, 329612, 287731, 305974, 360501, 424532, 490685, 561097, 672078, 771831, 905094, 1066892, 1213902, 1282980, 1274879, 1264591, 1232359, 1146869, 1125988, 1180259, 1305328, 1492045, 1663285, 1777007, 1871303, 1973893, 1973449, 1839091, 1672524, 1526692, 1382452, 1231712, 1136042, 1156763, 1237479, 1375474, 1499125, 1511992, 1447077, 1331719, 1185258, 1005533, 799303, 629882, 545271, 513130, 490907, 484008, 484496, 460818, 466395, 503206, 544532, 560548, 586426, 599909, 613925, 611251, 581394, 559225, 566275, 574545, 570986, 584209, 571334, 530381, 521235, 533546]
19279E33546K9044M6966n807L676m431j9292l2321k4784N0418M6717q41j24m9071
19266E73696q3333l3732l115R314J371j6743j3151p351q673j045k0640J6308K7402
19253D40308J2133J7290j829L7981L8080K8012j3518K0387M4550J7241M1731N0422
19241G32788L3137k5169m1635k3781K9488M0573L5733K3004j3331j8758k7915
19230G44134K369L6331K4262N4908J00888M4769K3365J8985L3753J5552M152j8859
19218A084609n1635r9841j30828q3057p3107m6964m6275l2234j4339J804J9451
19207E27584j802j6420J115M654N015Q1388J9808k1579j6340o667J3550K2977
19195F13283K1599P470N815L6537K1703K0523K5049m298R584K7715K6345K7820
$$ y = [533546, 562590, 609556, 603749, 607425, 602994, 583702, 551381, 526597, 577015, 623732, 622891, 622767, 573696, 490363, 456631, 453516, 462830, 464201, 447458, 434307, 426956, 418283, 417238, 396598, 412906, 440308, 452441, 469731, 467902, 505883, 543963, 571975, 558457, 578844, 623394, 640635, 682366, 732788, 765925, 740756, 699121, 675340, 704828, 745401, 781134, 804138, 790807, 772049, 744134, 746503, 782834, 807096, 862004, 962892, 1007661, 1031026, 1050011, 1083764, 1099316, 1103468, 1084609, 1032974, 933133, 802305, 719248, 646141, 599177, 552902, 520668, 506329, 508133, 527584, 525782, 509362, 510477, 515131, 520146, 601534, 621342, 599763, 583423, 576756, 590306, 613283, 634882, 642352, 648167, 684704, 706407, 726930, 751979, 747681, 757265, 784980, 811325, 839145]
19183H39145N5212N8703Q6884P4121J10132J01766J23913J28671J51725J18151
19173A848423P4249M9564J0389j4371l2756n2284k9980Q016L947M8735P2442J23889
19161B110263J61867J43503J75568K32669K67666L21150L81184M39113M33850
19152D666833M85133N38440N11219N30732O25683P63614R03539J149185J409991
19143A1584369J885204K476648L295338M708862O956024R766946J1856516J1713724
19135F4243631Q737725M198553J749983K168510K107461J43406n24965K905307
19127H5729611P501850R442618Q350602P182490P816963O043903j256245r848901
19119A20962891j2228678q403577n292450o204695p377169l940404K356149O233188
$$ y = [839145, 894357, 953060, 1039944, 1114065, 1224197, 1325963, 1449876, 1578547, 1730272, 1848423, 1922672, 1972236, 1982625, 1968254, 1935498, 1883214, 1853234, 1861250, 1865197, 1913932, 1986374, 2110263, 2272130, 2415633, 2591201, 2823870, 3091536, 3412686, 3793870, 4232983, 4666833, 5151966, 5690406, 6201625, 6732357, 7358040, 8121654, 9025193, 10174378, 11584369, 13469573, 15946221, 19241559, 23950421, 30906445, 40673391, 52529907, 64243631, 72981356, 77179909, 78929892, 81098402, 83205863, 83349269, 82824304, 85729611, 93231461, 102674079, 111024681, 118207171, 126024134, 132068037, 130811792, 120962891, 108734213, 100330636, 95038186, 88833491, 81456322, 77515918, 79872067, 86105255]
19111H6105255N340976M83086l943718n673709q284114j3138237j5418830j2863569
19103C2607140q794732n737882l811658k636965j946528j476345j131819q49912
19095F221299o02981m01452k44535j63479j62613k98427m55738m95304m63722
19086B933048l62405k36873k06056j38663o0190n9051r8887j64020j50105j70408
19076A286390j08621p7807p1385k0740o4266l2754j5245N314j768k8641l7167
19065H33310o5501j0842l195J2929K3235J2675J5554k2452N1084P2812J12282
19054A031891J64057J19783L8890m7756r3642n5758J0161J02209K10086K47050
19044A726971J74228K5413j25944k78187k72798j53090q204R7200J31753O6306
$$ y = [86105255, 91446231, 91929317, 87985599, 82311890, 74027776, 60889539, 45470709, 32607140, 23812408, 18074526, 14262868, 11625903, 9679375, 8203030, 7071211, 6221299, 5618318, 5216866, 4972331, 4808852, 4646239, 4347812, 3892074, 3396770, 2933048, 2570643, 2333770, 2127714, 1989051, 1928861, 1869810, 1770923, 1606903, 1456798, 1286390, 1177769, 1099962, 1028577, 1007837, 943571, 910817, 895572, 900886, 899118, 870477, 833310, 767809, 756967, 753772, 766701, 789936, 802611, 818165, 795713, 846797, 919609, 1031891, 1195948, 1315731, 1354621, 1306865, 1213223, 1157465, 1167626, 1269835, 1479921, 1726971, 1901199, 1926612, 1800668, 1522481, 1249683, 1096593, 1088389, 1185589, 1317342, 1383648]
19034A383648P476j03674k08057j88666j23947r4369o3259m5171j5148j8746L5859
19023E65946L6543J6291q287l1635j3362j7812k9519j6793p002k5501K8565J4150
19011E11584k277J1009J8157L3455J5492L8795L7256O4988R4525N3487m2339m6838
18999G87294m1952P31J9325R3981J15938J15827R4281J7660j5180J2415J0999
18988A211319j138o4263p8839n8052n0881j4586Q1543R4528N3380l0818q9021
18977A053172r7287q3563j8228K3161J1218K3597j9449j0492J7184N186m4505
18966H59994o0672m7527l953n101r900o763o074L6805L4488P3516J31046J79822
18954A175681K28012K35083J37942j8801j60056j20660p4047R130R6433J78179
$$ y = [1383648, 1391124, 1287450, 1079393, 890727, 766780, 672411, 609152, 563981, 548833, 530087, 565946, 602489, 618780, 610493, 578858, 565496, 547684, 518165, 501372, 494370, 468869, 497434, 511584, 509307, 520316, 538473, 571928, 587420, 626215, 663471, 728459, 822984, 876471, 834132, 787294, 745342, 746073, 765398, 859379, 975317, 1091144, 1185425, 1203085, 1187905, 1200320, 1211319, 1210181, 1145918, 1067079, 1009027, 958146, 943560, 1025103, 1119631, 1173011, 1142193, 1053172, 955885, 872322, 854094, 877255, 888473, 912070, 892621, 882129, 899313, 904499, 859994, 799322, 751795, 747842, 742741, 732841, 726078, 720004, 756809, 791297, 864813, 995859, 1175681, 1403693, 1638776, 1776718, 1757917, 1597861, 1477201, 1403154, 1412284, 1508717, 1686896]
18944A686896J29646R4928N3637J8335N3235J14079P4838j5326j22204j38856
18934A949208p4917O8565J67396K16223K36672J67309O1781j269L648P9700J43133
18923C017449K03324K38761K23766K31110K75245L40438M31383N07888O18771
18914F088135Q42904J094025J411886J911819K840695M396390O559802Q411432
18906C3557088Q154673M790218j366703o072125n529625j882259K355937P087633
18898D1094837J2076609J4822654J2125410K654939j0375603j7091661j4355526
18891D0951659q631487l871185Q0147L613159N944433N535285J564280m950155
18883D0236136r252173q466464n606713l380959k067533j292410p50301l73225
$$ y = [1686896, 1816542, 1911470, 1965107, 1983442, 2036677, 2150756, 2225594, 2210268, 2088064, 1949208, 1874291, 1942856, 2110252, 2326475, 2563147, 2730456, 2792237, 2790968, 2794616, 2874316, 3017449, 3220773, 3459534, 3683300, 3914410, 4189655, 4530093, 4961476, 5469364, 6088135, 6931039, 8025064, 9436950, 11348769, 14189464, 18585854, 25145656, 33557088, 41711761, 46501979, 45135276, 39063151, 33533526, 31651267, 34007204, 41094837, 53171446, 67994100, 80119510, 82774449, 72398846, 55307185, 40951659, 32320172, 28448987, 28529134, 32142293, 38086726, 43622011, 45186291, 40236136, 30983963, 22517499, 16910786, 13529827, 11462294, 10169884, 9419583, 9046358]
18875I046358r5136J01339K24710L37305M91667O43699Q67408J325936J879648
18866A4822934K680786L955800N952090Q736730J1400344J1601946P769792o3943
18858F6856479p030869p105020k031443M391379J1307519J7790275K0419649J5316318
18850A19914287J357122j5458933k3494182j9756793j1674993m428987J726882
18843D8184403O725133Q711454N808542k278937j1839914j5112049j1781112p575342
18835B0842178m854825l276254k317792j758239j334880r96640p44249n09155
18827E050144l35032k04030j46940j26828j66936j84680j93539j63986j44658
18818C383515q4783j2439Q2663J10595J29610J61302J78945J69753J91566J67920
$$ y = [9046358, 8951222, 9052561, 9277271, 9614576, 10106243, 10749942, 11617350, 12943286, 14822934, 17503720, 21459520, 27411610, 36148340, 47548684, 59150630, 66920422, 66856479, 59825610, 52720590, 50689147, 55080526, 66388045, 84178320, 104597969, 119914287, 121271409, 105812476, 82318294, 62561501, 50886508, 46457521, 48184403, 54909536, 63620990, 69429532, 67150595, 55310681, 40198632, 28417520, 20842178, 15987353, 12711099, 10393307, 8635068, 7300188, 6303548, 5559299, 5050144, 4715112, 4511082, 4364142, 4237314, 4070378, 3885698, 3692159, 3528173, 3383515, 3298732, 3286293, 3368956, 3479551, 3609161, 3770463, 3949408, 4119161, 4310727, 4478647]
18808D478647J45688J91942J55495R2611R9351P5076J4706L7660J55123L75456
18798E821755O54111J011980J615740K440234L504856M510977M604973L028079
18790B7192705k04507l301309l772721k137118O2074K322370M715851O657824
18782C1535169O851670M487569j29254l893908m121523k996076l237031m406551
18774B4090065m369668k879567j057164O84626K559588M604066N987724N366582
18766C4986252K076993l158704o933320o869246m829226k966636j782852j033784
18758I489477n49445k80926q1504N9544J75623L49010N71966Q62117J140866J556468
18748A3293196K090099K815805M052885O161886R457638J3829789J7456903J6930936
$$ y = [4478647, 4624335, 4816277, 4971772, 5064383, 5163734, 5238810, 5253516, 5291176, 5446299, 5821755, 6475866, 7487846, 9103586, 11543820, 15048676, 19559653, 24164626, 27192705, 26988198, 23686889, 19914168, 17777050, 17839124, 20161494, 24877345, 31535169, 38386839, 42874408, 42745154, 38851246, 34729723, 31733647, 28496616, 24090065, 19720397, 16840830, 15783666, 16468292, 19027880, 23631946, 29619670, 34986252, 37063245, 33904541, 26971221, 20101975, 15272749, 12306113, 10523261, 9489477, 8940032, 8659106, 8577602, 8637146, 8812769, 9161779, 9733745, 10595862, 11736728, 13293196, 15383295, 18199100, 22251985, 28413871, 37871509, 51701298, 69158201, 86089137]
18740H6089137R855614k933643j4170495j5728374j0196579l557767K535775Q172425
18732F0066093J2644350J4077491J1624005O499464L145521L062848N44217q249553
18724A03414436j8021165j9738113j4228973p614030k142706K705377O975792
18717E1350618R219930P386568Q82788q151182j3288533j1842369p952263m838679
18709B2766878k794814j437093m37548L47504J049004J917378L052885M774449
18701B9238643P477631J1415517J5942681J9179731J9252467J4453201P651124
18694A24610995K124994k409910o645571j3037755j8797763k1396072j8922167
18687D5526751j3445611q777069n727688l819567k590770j785008j226538q34772
$$ y = [86089137, 95944751, 93011108, 78840613, 63112239, 52915660, 49357893, 51893668, 60066093, 72710443, 86787934, 98411939, 104911403, 108056924, 111119772, 111663989, 103414436, 85393271, 65655158, 51426185, 43812155, 41669449, 44374826, 51350618, 60570548, 67957116, 68839904, 60688722, 47400189, 35557820, 27605557, 22766878, 19972064, 18534971, 18097423, 18444927, 19493931, 21411309, 24464194, 29238643, 36716274, 48131791, 64074472, 83254203, 102506670, 116959871, 124610995, 126735989, 124326079, 117680508, 104642753, 85844990, 64448918, 45526751, 32081140, 23304071, 17576383, 13756816, 11166046, 9381038, 8154500, 7319728]
18679G319728n84078l82034k29655r8119J5260P3821L4929P6539M2717N3160P8215
18668F400483Q5846R4289J64886K74811L77830N22056P81580J071744J402480
18659A1176005J839120K521307L490034N084276P477775J0472046J3006463J4002644
18651F9069670J2233376Q751529N678525K579630j110254m942445q882170j1449444
18643G1928417j0703296q561034p137804p197476p652301p571002o150860m178777
18635A2775867k707975j796196j266278r23104o63116m95096k77960j87173j73155
18626D285814j48071j01885p8276n2760o9181n6613o0863r4248j22685j14871
18616C386361m0639R443Q7914J39700K22386L06194L84050N25117O83474R48357
$$ y = [7319728, 6735650, 6353616, 6123961, 6025842, 6041102, 6114923, 6149852, 6226391, 6269108, 6322268, 6400483, 6486329, 6580618, 6745504, 7020315, 7398145, 7920201, 8701781, 9773525, 11176005, 13015125, 15536432, 19026466, 24110742, 31588517, 42060563, 55067026, 69069670, 81303046, 90054575, 95733100, 98312730, 97202476, 92260031, 83377861, 71928417, 61225121, 52664087, 45526283, 38328807, 30676506, 23105504, 16954644, 12775867, 10067892, 8271696, 7005418, 6082314, 5419198, 4924102, 4646142, 4458969, 4285814, 4137743, 4035858, 3957582, 3904822, 3835641, 3779028, 3718165, 3623917, 3501232, 3386361, 3345722, 3355165, 3443079, 3582779, 3805165, 4111359, 4495409, 5020526, 5704000, 6652357]
18606F652357J367308J970332K955097M215545N242034N467068M299657K391638
18598C4561036N19131j509479l466787m822811n542439n361672m065674k666324
18590G644981j734814j171013q11239n49445l38493k38738j72760j74428j49359
18581B304692j29274j68604j64920j52049j18097n9128l0313j13589j64611j25584
18571A078523j03080j14034r5095o9788q3682q3076p5574j6497L950R853j9077
18560D32423n706m566p819n942j9358K2049R0293J02018J20499Q9840K660j9366
18548G97025n0024q2635n1313k2746J0584N1619P5510J20817J78221K66218K91462
18537A584738J94704M9306j86261l04559k39878j52296j39086r7298M617N1642
$$ y = [6652357, 8019665, 9989997, 12945094, 17160639, 22402673, 27869741, 32169398, 34561036, 35080167, 33570688, 30103901, 25281090, 19738651, 14376979, 10311305, 7644981, 5910167, 4739154, 3927915, 3378470, 3039977, 2801239, 2628479, 2454051, 2304692, 2175418, 2006814, 1841894, 1689845, 1571748, 1512620, 1482307, 1368718, 1204107, 1078523, 975443, 861409, 766314, 696526, 612844, 529768, 454194, 437697, 441647, 451500, 432423, 426717, 422151, 414332, 408390, 389032, 411081, 501374, 603392, 723891, 813731, 816391, 797025, 747001, 664366, 613053, 590307, 600891, 652510, 728020, 848837, 1027058, 1293276, 1584738, 1779442, 1828748, 1642487, 1337928, 1098050, 945754, 806668, 709370, 713987, 765629]
18527G65629R2699J66202K06379K06192J45169m790j29795k29699k47810k22726
18517G47450j73452q5606o7755r239P239K3920M1181P2840N9040j334r6932j29597
18505C87755r1569j6891L766j8670j4600k8315q492L0671P061J311n743O973l1827
18492B21430k3955k7202l5259j9730j1474M469P911l256j3361O315q75j4279J8498
18479A09232K7952K026k961p160m387m479q21r298j3277O171O867J02J5128k0319
18465A04776k0970J7862j1934l0614l272M865J030p671J6007J5173j836n551J6837
18452I4702j2902l5277J0435K5555K3447J7644k8087k0914J9942L9461N185r909
18440A29282k0896j3678o648m751j9017J2513K9477o415J2389Q919R332R766R50
$$ y = [765629, 858328, 1024530, 1230909, 1437101, 1582270, 1577480, 1447685, 1217986, 970176, 747450, 573998, 488392, 420637, 411398, 418637, 442557, 483738, 556578, 615618, 614284, 517352, 387755, 296186, 279295, 283061, 264391, 249791, 221476, 212984, 243655, 250716, 252027, 246284, 253257, 221430, 197475, 170273, 135014, 115284, 103810, 108279, 116190, 112934, 99573, 105888, 105013, 90734, 109232, 137184, 139210, 136249, 129089, 124702, 120223, 119402, 110104, 96827, 102998, 109865, 109967, 125095, 104776, 83806, 101668, 89734, 59120, 55848, 60713, 61743, 54072, 70079, 85252, 83416, 77865, 94702, 81800, 46523, 56958, 82513, 105960, 123604, 95517, 74603, 94545, 134006, 139191, 129282, 108386, 94708, 88060, 83309, 64292, 76805, 106282, 99867, 112256, 121175, 130507, 140273, 141223]
18427A41223K7225J8767k1678m6181l9475k130K1379j1100k5579K4917L2046n34
18415A18880o54o698j0746k3790j7072P457N21K801q851j6368j2001P314J369
18402D2162K7548J0825K1250K9946J9219J1148K2860L7199K6741K053o197J1539
18390B56293k74k6081O632K9443J5398K0740J7073O8982O5949L4515k5338k3141
18378D40191k2707j3004P493O5162O3477P0186K4797K0548m3517p6980q6079m7082
18366D02485l8158j2340o935K3747K1671j2170q804k9508o2151k4960k0399q533
18354B23945J3026m399r60k948L137M5122K2806O126l755J3966j1389J5977L5100
18341C55754K4400K7829K9328l693J2060J1347l5058m2854j9505J4357M5495M2652
$$ y = [141223, 168448, 187215, 165537, 119356, 79881, 77751, 99130, 88030, 62451, 87368, 119414, 118880, 118226, 111528, 100782, 76992, 59920, 67377, 67898, 70699, 61848, 45480, 33479, 40793, 42162, 69710, 80535, 101785, 131731, 150950, 162098, 184958, 222157, 248898, 250951, 244754, 256293, 256019, 229938, 236570, 266013, 281411, 302151, 319224, 388206, 454155, 488670, 463332, 440191, 417484, 404480, 411973, 477135, 540612, 610798, 635595, 656143, 612626, 535646, 449567, 402485, 364327, 351987, 345052, 368799, 390470, 378300, 369496, 339988, 277837, 252877, 232478, 223945, 236971, 232572, 231612, 228664, 231801, 276923, 299729, 305855, 302100, 316066, 304677, 320654, 355754, 380154, 407983, 437311, 433618, 445678, 457025, 421967, 379113, 359608, 373965, 419460, 462112]
18329D62112N4747L2207Q984l4334p3674m0983k7726k2815J0979L3591N0498K0536
18317D74122J9972R654k8252k3774k1329m3398r231N5100O3678N0572J54269K47784
18305I49167L12549M01147M12949L02143J6793k37200l86161m23661k90528k31558
18295H25640j51117p7925m4619l8467l1792j4159L0327O5301O0724J46756K52379
18284A023048L29063M00346M01912K86083L4420k28616l92566m41288l83483k26563
18274H02356j60261q3556m8074j2658L053j2589m3969m0830l9278j6887m05K8340
18262C75242O601n8310q8628n4945j7735K2032J05343J09340L3187k2926n9264
18251C49937n5539m2612k7531j3139k1354j5578M127m4528k5969J8537J7921K4065
$$ y = [462112, 516859, 549066, 558050, 523716, 450042, 409059, 381333, 358518, 369497, 403088, 453586, 474122, 494094, 503748, 475496, 451722, 430393, 386995, 377764, 432864, 496542, 547114, 701383, 949167, 1261716, 1662863, 2075812, 2377955, 2394748, 2157548, 1771387, 1347726, 1057198, 825640, 674523, 596598, 551979, 513512, 481720, 467561, 497888, 563189, 623913, 770669, 1023048, 1352111, 1752457, 2154369, 2440452, 2474872, 2246256, 1853690, 1412402, 1028919, 802356, 642095, 558539, 510465, 497807, 500860, 488271, 444302, 403472, 364194, 347307, 346902, 375242, 381843, 323533, 234905, 179960, 162225, 184257, 289600, 398940, 432127, 409201, 349937, 294398, 251786, 224255, 211116, 189762, 174184, 178311, 133783, 107814, 126351, 144272, 168337]
18239A68337J7739K609N424J770j4962m1427k6163r917r356L5944K4344L4782
18227A89124N0723O1224M4291L3752K3401K7852M246M6165P0010K5981k7988l6684
18215E12097k0677O181O0459N8262q892k4299k1880l5815k0911O823K8905O3324
18203F03577L4661j2454l2617j3717K6492K0919j3219j7006k7639o2581o0018
18192D46398l2076o442K4801K3124L8299Q3768Q7412M1389J8247K1107j9574n9456
18180F66997p5104q9295p2612l0329m501j6533r425J3390N4480M8249N8187O3509
18168F07013J16n8470l6809n243l691K7230L9213O8280K9611K5998r664n6854
18156F26730o3266p8588r2307o5097r394L8114M2293J9385L8005N3716P897q941
$$ y = [168337, 186076, 188685, 194109, 195879, 180917, 139490, 113327, 103410, 94054, 129998, 154342, 189124, 239847, 301071, 345362, 379114, 402515, 430367, 434613, 480778, 550788, 576769, 548781, 512097, 491420, 497601, 558060, 616322, 607430, 583131, 561251, 525436, 504525, 511348, 540253, 603577, 638238, 625784, 593167, 579450, 605942, 626861, 613642, 596636, 568997, 506416, 446398, 414322, 407880, 432681, 455805, 494104, 577872, 665284, 706673, 724920, 746027, 726453, 666997, 591893, 502598, 429986, 399657, 395156, 378623, 369198, 382588, 437068, 485317, 543504, 607013, 607129, 548659, 511850, 506607, 502916, 530146, 569359, 637639, 667250, 693248, 683584, 626730, 563464, 484876, 392569, 327472, 318078, 356192, 398485, 417870, 455875, 509591, 517488, 508547]
18144E08547m725L3178L4988J5617N9353R7260J06568J64667J83254J64063J11565
18133A474335O3614M3073j0360n543J0630O2487J31054J83578K23089K38532J97269
18122B611758J64983J24870J09258J68285K60818M20327N78005P12894Q68759
18113F019957J177052J794288L016028N248307Q382373J0752609R165267L015534
18105D8571415p827300j3361422j0197008n974048l512387k161659j396354r04922
18097C236315o21279m34006k76901j99116j77985j32299q8485n0486K0912L8215
18087A314885P3456J6545o422K6052r782r479j9030J3698Q4214J31903K33496
18076A849536K34090K07596J65800J01434l0730j63887k85229k65485j66317p843
$$ y = [508547, 503822, 537000, 571988, 587605, 646958, 744218, 850786, 1015453, 1198707, 1362770, 1474335, 1537949, 1581022, 1570662, 1565119, 1575749, 1638236, 1769290, 1952868, 2175957, 2414489, 2611758, 2776741, 2901611, 3010869, 3179154, 3439972, 3860299, 4438304, 5151198, 6019957, 7197009, 8991297, 12007325, 17255632, 25638005, 36390614, 45555881, 48571415, 40744115, 27382693, 17185685, 11211637, 7699250, 5537591, 4141237, 3236315, 2615036, 2181030, 1904129, 1705013, 1527028, 1394729, 1306244, 1255758, 1276670, 1314885, 1388341, 1404886, 1398464, 1424516, 1414734, 1405255, 1386225, 1399923, 1484137, 1616040, 1849536, 2083626, 2291222, 2457022, 2558456, 2527726, 2363839, 2078610, 1813125, 1646808, 1638965]
18066A638965Q6144J42956K12496K36079J47273k117k21930l50365l44828k67799
18056A276874j34661j25862j02262n7289j5817k4519l0076j7697L4014j708k4728
18045G76269J9349K6876M589K6222K8286j731j3056m043J1552k681J2015K5501
18033I09148O4546P9993R2166J06349J58971J72793J34970J18328J32481P5969
18023B045714k3921r9838j21328n3667L0546J45482K11587J61568K4217j23210
18013B197150k01177j59115j02865p8963L359J4338J6218L7351N8361O0856Q9778
18002A935291Q4779O4602P6910Q7749R5191J23162J41924J77807J66101J49107
17992C102623J72619K41673K63856L51959M69161N88604P47633R24743R93178
$$ y = [1638965, 1725109, 1868065, 2080561, 2316640, 2463913, 2461796, 2239866, 1889501, 1544673, 1276874, 1142213, 1016351, 914089, 856800, 840983, 816464, 786388, 768691, 802705, 800997, 776269, 795618, 822494, 827083, 853305, 881591, 879860, 866804, 862761, 874313, 871632, 883647, 909148, 973694, 1053687, 1145853, 1252202, 1411173, 1583966, 1718936, 1837264, 1969745, 2045714, 2021793, 1921955, 1800627, 1746960, 1777506, 1922988, 2134575, 2296143, 2320360, 2197150, 1995973, 1836858, 1733993, 1655030, 1658389, 1672727, 1688945, 1726296, 1784657, 1845513, 1935291, 2020070, 2084672, 2161582, 2249331, 2344522, 2467684, 2609608, 2787415, 2953516, 3102623, 3275242, 3516915, 3780771, 4132730, 4601891, 5190495, 5938128, 6862871, 7856049]
17983G856049Q35473M73263P6802j03853O9386L19357N48430Q38905J167724J555670
17973A3637206J951427K316745K603349K749829K888734L295570M131775N797444
17965C9372079Q819690J4042321K2254275L2996447M1171056L7596256J8258120
17958B14510244j4234840l6342584l3143082k0665133j1989156o027176J383694
17951I3491967J1350778K3839694L8158948N0040153N2544451L8577870J0157795
17944C18161656k1237012m3878621n3013517m8995386l5160960k0176146q507364
17937H7192650O38265Q714591J6948542K5722919L2686012L0177168J2518154
17930B14598301k0214692m6718451m6008747l1716751j9917541j2663018q129116
$$ y = [7856049, 8691522, 9164785, 9241587, 9137734, 9207120, 9526477, 10074907, 10913812, 12081536, 13637206, 15588633, 17905378, 20508727, 23258556, 26147290, 29442860, 33574635, 39372079, 48191769, 62234090, 84488365, 117484812, 158655868, 196252124, 214510244, 200275404, 163932820, 130789738, 110124605, 98135449, 92108273, 93491967, 104842745, 128682439, 166841387, 216881540, 269425991, 308003861, 318161656, 296924644, 253046023, 200032506, 151037120, 115876160, 95700014, 87192650, 87830915, 96545506, 113494048, 139216967, 171902979, 202080147, 214598301, 194383609, 147665158, 101656411, 69939660, 50022119, 37359101, 29229985]
17923B9229985n233463l454769k443564j981028j835487j821423j842225j632703
17915H985323j240481q39528n01075k61737l6221J57451K36338J59150q9341l46158
17905F223721o44140q28998q32328o46044m47631l28121k55694j96866j47378
17896A896521j30509j03583q2305o5954o6475o7540p6409n6638n6111n2510n7898
17885A080589k7337m5633l9469l7394k8263j5080o2373l1667k2040k1289l1301
17874G18743k0379K0422J8964L418l3938k2926k0111l426j6312l5459k7488l0462
17862E51046m2341k5021k1535M575K4193K6028j4178k5007q731j6052r286j1698
17850D31993k3295l6143n1329j5569o999j2178N687O36M608J8634Q130KP277k3891
$$ y = [29229985, 23996522, 20541753, 18098189, 16117161, 14281674, 12460251, 10618026, 8985323, 7744842, 6905314, 6404239, 6142502, 6106281, 6263732, 6500070, 6659220, 6569879, 6223721, 5579581, 4750583, 3918255, 3272211, 2824580, 2496459, 2240765, 2043899, 1896521, 1766012, 1662429, 1580124, 1514170, 1447695, 1380155, 1303746, 1247108, 1190997, 1138487, 1080589, 1053252, 1007619, 968150, 930756, 902493, 887413, 825040, 793373, 771333, 750044, 718743, 698364, 718786, 737750, 741168, 707230, 684304, 664193, 660767, 644455, 608996, 581508, 551046, 508705, 483684, 462149, 466724, 490917, 516945, 502767, 477760, 469029, 452977, 443691, 431993, 408698, 372555, 321226, 305657, 298658, 286480, 292167, 292803, 297411, 316045, 324175, 324177, 331454, 307563]
17836C07563n4648J238l968j0902r873m8960j8973K6833J0430j9045j7825j4382
17824A47488J1529P605m1269k7829r596O44J4267K0066Q478l0580k0044L846j2985
17811G1620j0325J2293J0869J6974L064q025J70M209J8388M050k1193l983j3098
17798H5013M263j4123n647N709j0699k8380K3641J3637j3073L168q474l3130K460
17785B4365J352l8418k7831j1702k2055l0185l4009R18K6808O488J90P632j0972
17772a07419j5103N33q499L3281N3234K9459P913j7408j5402q966l7275j3373
17760i9025j7178K430L1949L240J0408M1728N9834N2291L4197J1337l0139n0493
17748E0579j2562R179K616j2236j6988k4448J1828K5612M3241P8633L7096L339
$$ y = [307563, 252915, 254153, 250185, 239283, 229410, 180450, 161477, 188310, 198740, 179695, 161870, 147488, 159017, 166622, 125353, 97524, 87928, 88572, 102839, 122905, 131383, 100803, 80759, 84605, 71620, 61295, 73588, 84457, 101431, 104495, 96470, 96640, 100849, 119237, 123287, 102094, 98111, 85013, 89276, 75153, 69506, 75215, 64516, 36136, 59777, 73414, 60341, 63509, 55035, 21905, 24365, 25717, -12701, -40532, -52234, -74289, -104474, -138483, -137565, -110757, -104269, -104079, -96447, -107419, -122522, -121989, -130488, -97207, -43973, -14514, -6601, -24009, -39411, -48377, -85652, -99025, -116203, -113773, -81824, -78584, -68176, -26448, 33386, 85677, 119874, 131211, 101072, 50579, 38017, 47196, 49812, 37576, 20588, -3860, 7968, 33580, 76821, 155454, 192550, 195889]
17736A95889j4949j5275l0629l5879o265M342r621k6029l484M1717K1568N943
17724A27328K541k0433k6743l1136J629K1593J9630q298R274k7420j6279P859
17712E9545J3210N344K042J3181j3625J8482j2838j7598k4597L622j2361J0685
17700D5092o338j1909j0728K6102P833J515M544k4375j794L5391M622k3006M55
17687D7404j6037j8157L859J4709k970Q178q737K2107j864N884k6818p378j4014
17674F166k6183j2255P03J0636Q584k4782j5828J622j7777J4956M802K5358M1412
17661A7414N2351N0017J7538l9353k9857j6523k7874R735L145l007J4412M3007
17649I1005K4365N0503P4726N7462o859l0733l3398n0267k9100l6134m423J604
$$ y = [195889, 180940, 165665, 135036, 99157, 92892, 97234, 87613, 61584, 58100, 99817, 121385, 127328, 129869, 109436, 82693, 51557, 53186, 74779, 94409, 86111, 95385, 67965, 51686, 59545, 72755, 78099, 80141, 93322, 79697, 98179, 85341, 67743, 43146, 46768, 34407, 45092, 38754, 26845, 16117, 42219, 50052, 51567, 56111, 31736, 29942, 65333, 69955, 46949, 47404, 31367, 13210, 17069, 31778, 28808, 36986, 28249, 50356, 48492, 54376, 27558, 20180, 6166, -20017, -32272, -31569, -20933, -12349, -37131, -52959, -51337, -69114, -54158, -49356, -23998, 17414, 69765, 119782, 137320, 97967, 68110, 51587, 23713, 33448, 36593, 33586, 47998, 91005, 115370, 165873, 240599, 298061, 291202, 260469, 227071, 176804, 147704, 111570, 107147, 108751]
17637A08751O367o804Q802L0113O7949L6248K1566l4142o1483k0870j9724k1056
17625A15717l9897j2829Q833l5k014L557L5887P648k2999k2901j3160k4410n344
17612B8053J177j3091K3364J0315l0055N812n8k640m229j9352j0760M8689K5656
17599F2881k0275k5120k3693n56j8145k2571p796L128L4640R439j904j0588J055
17586a9505k504o952J034j8508j2209K4708K1320L8568Q067J899J7806j5225k3123
17573A5376j629P484M924q222M097j8029j1681M739m157K0515J7682K7633J4234
17560G2966j0455j5898p959j1795k4540l935L748j880o328q661j1436K0869L5757
17547C0453j6775o82k2496k8061J0238L1928j7392j7038J3001q016n755L9669
$$ y = [108751, 115118, 108314, 117116, 147229, 215178, 251426, 272992, 238850, 177367, 156497, 136773, 115717, 75820, 62991, 71824, 71789, 69775, 73332, 109219, 116867, 93868, 70967, 57807, 33397, 28053, 29230, 16139, 39503, 49818, 19763, 25575, 25517, 22877, 18648, -704, -11464, 37225, 62881, 42606, 17486, -6207, -6763, -24908, -47479, -55275, -52147, -17507, -8068, -9972, -20560, -19505, -22009, -28961, -27927, -46435, -58644, -33936, -12616, 25952, 34019, 35918, 53724, 38499, 15376, 13747, 21231, 26155, 17933, 22030, 4001, -7680, -2941, -7098, 13417, 31099, 58732, 72966, 62511, 46613, 38654, 26859, 2319, -1616, 2132, 252, -6076, -14737, -26173, -5304, 30453, 13678, 12996, -9500, -37561, -27323, 4605, -12787, -29825, -16824, -24840, -30595, 9074]
17535I074L8031K148r091j9452j6836O115n438J0129j393j8984r986k377k804
17522b0864K5465Q571P660p976o548k4501L013J8544J0923j3541k2815J5293J2017
17509E241O168K5556M176J4989P339j1521j0143K590k5572j0124N889j2660J0406
17496A2334Q787o083R285J7937m613j0175j6412N350K8780r045j5191m655Q679
17483B4978q04k3191L424M138q708J7236j1928M664K8494k0406j3636j1767J088
17470f418k540J1201n14p795K7128R761O000M690j9866j2640m9649j1240K8554
17457b3328K4364q339P910j2823O46k384L975J5872M284P238j1776J6666J4266
17444C6571K9136M2087N8480O7593M4698R188o2612p6345o1562l6548l3128K722
$$ y = [9074, 47105, 49253, 40162, 20710, 3874, 9989, 4551, 14680, 13287, -5697, -15683, -18060, -20864, 4601, 13172, 20832, 12856, 6308, -18193, -15180, 3364, 14287, 746, -22069, -6776, 5241, 11409, 36965, 41141, 56130, 63469, 51948, 41805, 44395, 18823, 8699, 14588, 1928, 12334, 21121, 15038, 24323, 42260, 37647, 27472, 11060, 16410, 45190, 36145, 20954, 16299, 24978, 24174, 983, 4407, 8545, -163, 17073, 5145, 9809, 38303, 17897, 4261, -7506, -6418, -8958, 2243, 1729, -6066, 21062, 30823, 36823, 41513, 21647, 9007, -40642, -51882, -23328, 1036, -7303, 607, -12216, -11570, -13954, -9979, 5893, 10177, 17415, 5639, 22305, 36571, 65707, 107794, 166274, 233867, 278565, 287753, 225141, 148796, 87234, 50686, 17558, 20280]
17432B0280J0458r973M323o663j4548q648K1184J9063J5278R390k4507p281o89
17419B7667k9204m150J8295r181N601j723j0359o944j6144K214l759k3167J3749
17406c7105J0940l752J5576J0913J5585j909P139l6547J2087K9223M187J8995
17394D5332k1513j0369P952O703J7293L9601J4606l4918j2676J2989m464J9383
17382G9919K0947K8117M0118M3278J12911J28823O9711M2897Q227o5900o7666
17371D41382n8396j8345R1l430N9530J06291J80799K08404K05794J46611M8840
17360A317571l4683j22753j62531j73168j43975q9146l2763L6300P0370R1382
17350G56604J85739K65986K61097J32947r2818k69371k93219k45054j49723p4216
$$ y = [20280, 30738, 20765, 25088, 18425, 3877, -4771, 16413, 35476, 50754, 60144, 35637, 28356, 27667, -1537, -5687, 12608, 3427, 9028, 7305, -3054, -9998, -26142, -23928, -27687, -50854, -37105, -26165, -29917, -14341, -3428, 12157, 10248, 17387, -19160, -7073, 22150, 26337, 45332, 23819, 13450, 21402, 28105, 45398, 84999, 99605, 64687, 52011, 65000, 60536, 79919, 100866, 128983, 169101, 212379, 325290, 454113, 523824, 566721, 574948, 509048, 441382, 382986, 364641, 364732, 361302, 420832, 527123, 707922, 916326, 1122120, 1268731, 1317571, 1282888, 1160135, 997604, 824436, 680461, 591315, 558552, 594852, 665222, 756604, 942343, 1208329, 1469426, 1602373, 1509555, 1240184, 946965, 701911, 552188, 477972]
17340D77972o7041k8330k4853N049O8882Q5873P6328M0742p0576j00703j16570
17329C46773q7670m9429k1483j6082j724o207L660l4642m734L383M896J2475M295
17316A53511o851R477N0061L0207M2831P2612J01390J01744J03683O4561K521
17305G25747m5347r3830p4285l3967K8475P3378R7595J68293K50318L34349L92508
17294A823234L56438K53757N7031p2808n9572J6335K2527q0451k21124l10088
17284A785279k36821k02451j54194q1623q747M9074M4172K2523R7053J96569K93725
17273A804559L71647L13390J17285j20699j69178j20830j03707j64147l36065
17264A592255l72141k90806j92618j05665k7735J9118M4146K6404k2667p6320
$$ y = [477972, 410931, 382601, 357748, 362797, 431679, 517552, 593880, 634622, 564046, 463343, 346773, 259103, 209674, 188191, 172109, 170385, 164178, 167838, 133196, 128462, 131845, 136741, 149216, 153511, 146660, 156137, 206198, 236405, 279236, 351848, 453238, 554982, 658665, 723226, 725747, 680400, 586570, 512285, 478318, 506793, 580171, 677766, 846059, 1096377, 1430726, 1823234, 2179672, 2433429, 2490460, 2417652, 2358080, 2374415, 2396942, 2316491, 2095367, 1785279, 1548458, 1346007, 1191813, 1110190, 1101443, 1150517, 1194689, 1217212, 1314265, 1510834, 1804559, 2176206, 2489596, 2606881, 2486182, 2317004, 2196174, 2092467, 1928320, 1592255, 1220114, 929308, 736690, 631025, 603290, 622408, 666554, 692958, 670291, 593971]
17254E93971r7800j32066j01533o3829o191j3175k9779m7102j4706J0944q954
17243H9780J7723m074n400j4728k9430J4538j3197J5043J4953R61k3697J5869
17231G8341K473j845j3673k5445J4636J449k2622K0419K2208k2708j3763j6148
17219B3322j4570M325n100J0519K3959L3119L694n780k0020q240j5435m032n864
17206A9897J2340J8103j8413J657P920J1485k864j9855p964m501L720M186m310
17193B1401N307J403k7461k3927J7628J2161K7697j077n569j4035k3367J0794
17181I55N799n044J9420L4486Q353J2280j7243k7481o618o855k3401k779L0070
17168B1942K0975M831J0403P199K1090K3230l562q475M008k3182o447j2462j8712
$$ y = [593971, 496171, 364105, 262572, 198743, 192552, 179377, 149598, 102496, 87790, 98734, 89780, 107503, 103429, 98029, 83301, 53871, 68409, 55212, 70255, 85208, 86169, 62472, 78341, 80814, 78969, 65296, 39851, 54487, 55936, 33314, 53733, 75941, 53233, 39470, 23322, 8752, 13077, 7977, 18496, 42455, 75574, 79268, 73488, 53468, 45228, 29793, 25761, 19897, 32237, 50340, 31927, 33584, 41504, 52989, 50125, 30270, 22306, 17805, 21525, 25711, 21401, 26708, 28111, 650, -23277, -5649, 6512, 34209, 33132, 27563, 13528, -9839, 955, 6754, 1710, 21130, 55616, 63969, 76249, 59006, 31525, 24907, 18052, -5349, -8128, 21942, 42917, 47748, 58151, 65350, 86440, 109670, 106108, 97633, 101641, 78459, 72012, 59550, 40838]
17155D0838R612P629j3581j125M886J0035K3259j9879r712J4899L468J2459j5725
17142F7063k1708j5412P988j402K425R974J1403r46j615M88R390R50j2689L493
17128E9402k2774j9798J3759L167r255k2476k4399Q025L7820Q992k2859r544M4787
17115D4847J507j3917j231m392N178R121p913p37j3068j4831j0865j0610N937
17102a0974L113N910j2901k5152k3417L123m418L3154K9438L0253k5637j6304
17090a3812N707k0579j456J4288J4492J1852L124J348J5665R551K2029k8502k2858
17077A0849L913N963K0012J8275r426Q659k7988j8511Q761p768r583r967k0887
17064b7698k1128l0899L234j186N668j7423l9777l4803k7314j1722J4186m652
$$ y = [40838, 50450, 58079, 44498, 43373, 48259, 58294, 81553, 61674, 51962, 66861, 70329, 82788, 67063, 45355, 29943, 37931, 36529, 38954, 48928, 60331, 59385, 57770, 58258, 67648, 68598, 55909, 59402, 36628, 16830, 30589, 33756, 24501, 2025, -22374, -14349, 23471, 32463, 9604, 60, 44847, 46354, 32437, 31206, 26814, 31992, 41113, 33200, 32463, 19395, 4564, -6301, -16911, -10974, -7861, -1951, -14852, -40004, -63421, -60298, -64716, -31562, -2124, 28129, 2492, -13812, -8105, -28684, -30140, -15852, -1360, 10492, 13616, 14964, 30629, 40180, 62209, 33707, 10849, 14762, 20725, 40737, 59012, 49586, 58245, 30257, 11746, 20507, 12739, 3156, -6811, -27698, -48826, -79725, -76491, -77677, -72009, -89432, -129209, -164012, -191326, -203048, -188862, -193514]
17052a93514M0733O9798M8222k6280J8584K4718l3616l3530k4420m348q674l9814
17040a62141j2190M0245N3969M5874M6584L7894M3877J3594k3062j4850j1394
17029E8400j1310l220P57m7581k5306N1250O6418M0851L953Q453J8822J2052l0249
17016A43290k838K326p554J5744J5477K3855P317K3918L2041l9392k6283K169
17004A90070O627j0698j8065N314J0297K3625L1811K213K6616J8676l3866k1335
16992B31285l3105J0817L001r009j206n502k4881l994K430M2837N396P648K2167
16979B47884l7527l0862n510l5219k1140K2655j056K453Q075l9626k3081N972
16967I3018Q378q493M788J4659k1919q976o646o393M2750J7845L277m2271k3005
$$ y = [-193514, -152781, -82983, -34761, -61041, -42457, -17739, -51355, -84885, -109305, -113653, -122327, -162141, -174331, -134086, -80117, -34243, 12341, 50235, 94112, 107706, 84644, 69794, 58400, 47090, 43870, 44627, -2954, -28260, 22990, 89408, 130259, 134212, 142665, 161487, 173539, 143290, 140452, 142778, 135224, 150968, 166445, 190300, 197617, 221535, 253576, 214184, 187901, 190070, 196697, 185999, 167934, 173248, 183545, 207170, 238981, 241194, 267810, 286486, 252620, 231285, 198180, 208997, 211998, 202989, 201783, 196281, 171400, 167406, 169836, 212673, 218069, 225717, 247884, 210357, 179495, 173985, 138766, 117626, 140281, 139225, 141678, 149753, 110127, 87046, 93018, 101396, 92903, 97691, 112350, 90431, 81455, 74809, 68416, 111166, 129011, 132288, 90017, 67012]
16954F7012J2209j7124j9994j9526n174j3190R605J7368M6452N8428L3979K1791
16942A91836L103l5262m028k63l7914j3213k5927q540J9728K9644K8102M9278
16930A96544P0671N7484K4914k1305k3984k396l128m764k3595j6560l329J4150
16918B64702N9054N3636L1053j6284l8975J1218K3095K846j6025j8421k3914L039
16906C35024q418J3108M2755j4685r786n201j329j2210o935k6700k3687Q037K7501
16893C17474L2k136p985J2332K3806k2900K3794K3597L0622K7595L3501J7760
16881D77492K026K6438J2963j6206Q415j8729n729K4660O810O486j4581N7821
16869E67866M6711K5357J9629L4383N982l8983n4393l2303k6872K5740J1099N341
$$ y = [67012, 79221, 62097, 42103, 22577, 17403, 4213, 13818, 31186, 77638, 136066, 170045, 191836, 194939, 159677, 155649, 155386, 117472, 104259, 78332, 69792, 89520, 119164, 147266, 196544, 267215, 324699, 349613, 328308, 304324, 301928, 298800, 294036, 270441, 253881, 250552, 264702, 323756, 377392, 408445, 392161, 353186, 364404, 387499, 390345, 374320, 355899, 331985, 335024, 326606, 339714, 382469, 367784, 357998, 352797, 351468, 339258, 332323, 305623, 281936, 289973, 317474, 317506, 315370, 307385, 319717, 343523, 320623, 344417, 368014, 398636, 426231, 459732, 477492, 479518, 505956, 518919, 502713, 511128, 492399, 486670, 511330, 518140, 524626, 510045, 567866, 614577, 639934, 659563, 693946, 699928, 660945, 606552, 574249, 547377, 573117, 584216, 589557]
16857E89557K3806L4124L3504L9852q156l9671j0233n435m4483l3297j0729L268
16845E72107j027K5369K5796L7454J0600j8538R446M102J260K2916N540k1359
16833F73666k0515J6264k942L0601M8643M4247J9498M048L7424M9748J4889K4039
16821I39610m161k0834Q406K2398J5455O841J1593L9034L1125O6030O0299N6444
16809A232240M0823M0857K4702K5192P9018M9972L2870O5821N7068Q0821J00627
16798A830011J03147R7701P3973P8627J30710J53943J51921J46340K20626J96131
16788C183130J79258K30497L01026L32394M21627N28806P04571Q55968R44772
16779G682049Q77284O04206K79921R1338L2778K36625N55509Q42616J074822J363951
$$ y = [589557, 613363, 647487, 680991, 720843, 712687, 673016, 662783, 657348, 612865, 579568, 568839, 572107, 571080, 596449, 622245, 659699, 670299, 651761, 661207, 665309, 666569, 689485, 695025, 673666, 653151, 669415, 666473, 697074, 745717, 789964, 809462, 813510, 850934, 900682, 915571, 939610, 935449, 914615, 923021, 945419, 960874, 967715, 979308, 1018342, 1049467, 1115497, 1175796, 1232240, 1273063, 1313920, 1338622, 1363814, 1442832, 1492804, 1525674, 1591495, 1648563, 1729384, 1830011, 1933158, 2030859, 2104832, 2183459, 2314169, 2468112, 2620033, 2766373, 2986999, 3183130, 3362388, 3592885, 3893911, 4226305, 4647932, 5176738, 5881309, 6737277, 7682049, 8559333, 9163539, 9443460, 9534798, 9567576, 9804201, 10359710, 11202326, 12277148, 13641099]
16769A3641099J648111K044577K403748K684524L008884L426100M160476N584211
16761C8601730Q141402J2453958J9191904K8473361L7231366L8481209K6368346
16754B08943276Q26523k5794246l4258334k6558371j6706041r274859j888192
16747I5289756P084386J7815771K9960534M1325115M7124842M1677560K2914450
16740C03192414l967060l0420061m7581430m9995194l9983557k5960697j3709560
16733I1574855m042063L967602J1477272J9293712K6424675K7997442J7950415
16726A94643910n262617l1680413m1798168l4449238k3385749j5326811j0037441
16719C2703473o605447m421561l045581k154584j717949j541087j506616j393901
$$ y = [13641099, 15289210, 17333787, 19737535, 22422059, 25430943, 28857043, 33017519, 38601730, 46743132, 59197090, 78388994, 106862355, 144093721, 182574930, 208943276, 209769799, 183975553, 149717219, 123158848, 106452807, 97177948, 95289756, 102374142, 120189913, 150150447, 191475562, 238600404, 280277964, 303192414, 299225354, 268805293, 221223863, 171228669, 131245112, 105284415, 91574855, 87532792, 91500394, 102977666, 122271378, 148696053, 176693495, 194643910, 189381293, 157700880, 115902712, 81453474, 58067725, 42740914, 32703473, 26098026, 21676465, 18630884, 16476300, 14758351, 13217264, 11710648, 10316747]
16711A0316747j196991r46389p42303n74445m05481j96695p6817n680p5914j52188
16701E943844k80871m49122n80547o21889n47492m22967l58822k73072j88100
16692B220962j45854j02166q1171j02832j10460r7032r8945m8641l4930l9110
16682A359821n5777l0107l5962m6824o1857o7974o0336l5539j0226l7589m225
16671I13405J2588k747m6767n6226j0023k2602n4993o9718l8657m3614k5765j5287
16659E39594K626j1619k4148k4731k3517R015N735k0386n099l221n822j688n2200
16646C84539k9364o027j1008K5950o657l4813p234j8355K2708J5821K227l7353
16634C00434k4886j0259k8276o0627j3300K9478J1131J5590K1128J2732j5959
$$ y = [10316747, 9119756, 8173367, 7431064, 6856619, 6451138, 6254443, 6177626, 6171946, 6096032, 5943844, 5662973, 5213851, 4633304, 4011415, 3463923, 3040956, 2682134, 2409062, 2220962, 2075108, 1972942, 1891771, 1788939, 1678479, 1581447, 1482502, 1433861, 1398931, 1359821, 1304044, 1273937, 1237975, 1191151, 1129294, 1061320, 1000984, 965445, 955219, 917630, 913405, 925993, 923246, 876479, 820253, 810230, 787628, 732635, 662917, 624260, 580646, 554881, 539594, 542220, 530601, 506453, 481722, 458205, 467220, 472955, 452569, 447470, 444249, 438427, 436739, 384539, 355175, 349148, 338140, 364090, 357433, 322620, 315386, 297031, 319739, 335560, 337787, 300434, 275548, 265289, 237013, 176386, 163086, 192564, 203695, 219285, 240413, 253145, 237186]
16623B37186l4406k9056n954q986r835j0624o095O12J2945j0633j3898M39j7746
16610A03949K898j2281p206M058k0425k8071J840N750Q464J5628j0908j7965m090
16597D1641j2610J626K4988J0421R54k4067K979K1760J9021j0215m7231j5701
16585A3566Q750P224Q744N804k5881l8371j4412r025j6075k675j6341k982m386
16572h6060J0050r603j3712l8626J098P11m352R536L4012P5035L0366L867k9871
16559a7549k0327l1387l2293r054k7495k3723J5387L0424P1962L8227O3503O7314
16547A24989L2435K5476l1503n4064k6501k4694j8263r080q61K4339K2909M0126
16535A05308M8212J5968R711m793j1772k7142j3895j7723j0355j2649j8195L76
$$ y = [237186, 202780, 173724, 167770, 158784, 148949, 138325, 132230, 132842, 145787, 135154, 121256, 121695, 103949, 106847, 94566, 87360, 91418, 70993, 42922, 44762, 50512, 58976, 74604, 63696, 45731, 41641, 29031, 30657, 55645, 66066, 67020, 42953, 45932, 67692, 86713, 76498, 29267, 13566, 22316, 29540, 38284, 44088, 18207, -20164, -34576, -43601, -59676, -62351, -78692, -81674, -86060, -76010, -85613, -99325, -137951, -136853, -136142, -140494, -130958, -96946, -21911, 8455, 12322, -17549, -37876, -69263, -101556, -110610, -138105, -161828, -146441, -116017, -44055, -5828, 57675, 124989, 157424, 182900, 151397, 97333, 70832, 46138, 27875, 18795, 17934, 42273, 65182, 105308, 153520, 169488, 179199, 174406, 162634, 135492, 121597, 103874, 93519, 80870, 62675, 63051]
16523F3051K1680j6334O569J793n869N166N809J4797J6402k2742k9535J3146l389
16510G0544k8814m8288o419J1272K8487o2k932k139K3917L2018j0510m7773j4433
16497D868j3534j1618J6086J3408L378J355J1056K2120p218k7133K222N907N867
16484B6764K2704P644n483k1983j0394K244R770j3585K071J7262m641J3801O516
16471E2690k5312l6089j4205l0250j7435J2308J7006j6941K702K1892P563R109
16459a6962j7088J9542N4276N7818N8519M137l5187m4406k5429l4549q999k800
16447H872J058M319N1736N3738N8284N0005M7438K9741j7702p4281m0232k4025
16435A48951n1268k8373K511j0609K5455L3399L5455K2705R981j3491m04m477
$$ y = [63051, 84731, 68397, 74966, 76759, 70890, 76056, 81865, 96662, 113064, 90322, 60787, 73933, 70544, 41730, -6558, -12977, -1705, 26782, 26720, 23788, 21649, 45566, 77584, 67074, 19301, 4868, -8666, -20284, -4198, 9210, 12588, 13943, 24999, 47119, 39901, 12768, 14990, 20897, 26764, 49468, 57112, 51629, 29646, 19252, 21496, 31266, 17681, 19752, 37014, 32373, 46174, 52690, 27378, -8711, -22916, -53166, -70601, -58293, -41287, -58228, -55526, -33634, -26071, -16962, -34050, -14508, 39768, 97586, 156105, 160242, 125055, 80649, 55220, 20671, 11672, 8872, 9930, 14249, 65985, 119723, 178007, 228012, 275450, 305191, 287489, 213208, 172976, 148951, 97683, 69310, 71821, 61212, 86667, 120066, 155521, 178226, 188207, 174716, 174312, 169835]
16423A69835k917j5982j5038l1041m4577j6785o464R378n104M892J2553K3472
16411H2222R113j650P687j195k5490l3187j1389L354j4421k5805J9753L0347k2489
16398A6850p846p051k5597m692L8890K4669k6746k2445L099q913j7080j0283o034
16385e3179J275K7559R903J7138J8887k1870j6777J0890J7831l118L758M137j2663
16372C771K0462n480J0953J4590N673k7697m0704Q690K62n965P053K2007j7774
16359d159m463J040J750J934k9563k3158K2110L0217J8358k1085J9955j3433j1791
16346a2288J206K1066J3035K1951p216m0691o884M686l717k6047n027K9571L7946
16333B7591Q195k8486j3551N603p327K3334r030J8810k3721o370o800k1693j9036
$$ y = [169835, 166918, 150936, 135898, 104857, 60280, 43495, 37031, 46409, 41305, 46197, 58750, 82222, 91335, 89685, 97372, 96177, 70687, 37500, 26111, 29465, 15044, -10761, 8992, 39339, 16850, 9004, 1953, -23644, -28336, 10554, 35223, 8477, -13968, -10869, -19782, -36862, -47145, -53179, -51904, -24345, -14442, 2696, 21583, -287, -17064, -6174, 11657, 8539, 12297, 16434, 3771, 24233, 18753, 29706, 44296, 49969, 22272, -18432, -9742, -9480, -15445, -8392, 13615, -4159, -8622, -7582, -5832, -3898, -33461, -56619, -34509, -4292, 14066, -7019, 12936, -497, -12288, -11082, 9984, 23019, 44970, 37754, -2937, -9821, -5135, -8852, -34899, -39926, -10355, 27591, 35786, 7300, -6251, -648, -7975, 15359, 6329, 25139, 1418, -4952, -11752, -33445, -52481]
16320e2481J3130r201j0809J5231K4141K4742J0652O269O966o559m3257k808K2975
16307a009j6663m066J4706J2521k197j0216k0572k7945r957l3525p160J0288L7215
16294e8580J7018m616p916J0487L7028n729k7122m066J6641l068M2526J1212k5499
16281a684r29J8200k900j7330j1989l9745k4022P087K1208J3274r400n864P336
16268d6758R176M3907N4796l122q947l3862l2389J8783O870m064m067m962j1602
16255a6241j2672K065L1152k4540k4435k7312k0339R559L4647K6481k028J1761
16243a1902j9372J6200j1824O850K723K4487J3977K772K0051K9054l253N709J650
16230G7122j2202M173J1178j3109P391L0563J6975O5699R1914J03072N9746L8142
$$ y = [-52481, -39351, -48552, -59361, -44130, -19989, 4753, 15405, 21674, 28640, 22081, -21176, -23984, -1009, -17672, -21738, -7032, 5489, 3292, -6924, -27496, -55441, -65398, -98923, -106083, -95795, -58580, -41562, -46178, -54094, -43607, -6579, -12308, -39430, -43496, -26855, -29923, 12603, 23815, -1684, -2613, 15587, 12687, -4643, -16632, -56377, -80399, -73312, -52104, -38830, -48230, -54094, -46758, -37582, 6325, 61121, 57999, 49052, 15190, -17199, 1584, 8454, 4390, 323, -4639, -16241, -28913, -26848, 4304, -20236, -44671, -71983, -92322, -82763, -48116, -21635, -23663, -11902, -31274, -15074, -26898, -20048, -17325, 7162, 21139, 23911, 43962, 73016, 69763, 75472, 77122, 64920, 69093, 80271, 67162, 74553, 105116, 122091, 187790, 279704, 382776, 442522, 480664]
16218D80664N6024M785o8495r6732n9468p2904n768J9996O2257Q9165J02551J32481
16206F44556J47829J20529L7726l5604o5092q9075p1597l531K9197N0761M9426
16195H15125k5863j1586m518J941Q470l368l3316l9824l3144j1126J1994O7986
16183G42771O9516N753m8773r8544j40852j17132q0280n9222l9816q813J2669
16172B37277N2658M5282Q3284P7428K1820o6327o8961r1169j02347p3142k5799
16161I0004l6764k0101j3158Q231j856j4978k6283l2585j2571J4624K5087J2237
16149h113J694j3355r391J3527J1279M813j9758l061N140K7075J777p190l387
16136A050k3334k4625J1724K1425J3899j2862l8634k4736L7468K6347r844R414
$$ y = [480664, 536688, 541473, 472978, 376246, 316778, 243874, 238106, 258102, 320359, 409524, 512075, 644556, 792385, 912914, 950640, 915036, 849944, 760869, 689272, 685741, 714938, 765699, 815125, 789262, 777676, 773158, 775099, 783569, 780201, 746885, 707061, 673917, 662791, 674785, 742771, 812287, 818040, 769267, 670723, 529871, 412739, 332459, 273237, 233421, 224608, 237277, 289935, 335217, 418501, 495929, 517749, 451422, 382461, 291292, 188945, 115803, 90004, 53240, 33139, 19981, 28212, 26356, 11378, -14905, -47490, -60061, -45437, -20350, -8113, -6419, -19774, -29165, -15638, -4359, 454, -19304, -22365, -17225, 9850, 11627, 4437, 1050, -22284, -46909, -35185, -13760, 139, -12723, -51357, -76093, -38625, -12278, -22122, -12708]
16124a2708K5580j227k0540J3692j2548j9835j759L1105J9776k0911m3491O867
16112c5999J4986j5117l5060K7115K9708K9459J3914k9684k2398J4507L306j9494
16100b4757k6215J4980K7373n594n727L0704j6475q228q874k5693j4521J8872
16088d4155J8885K695o394o446J0912k1637p21L4495K892J0491r135j1021j5266
16075c4405J7700j2585j0692Q655J0176q177P62K0819P598l21j3528j4883k6094
16062e4975m506J9131J0092K5907J5299j744j5969m245J9064K2998N735o197l4081
16049c491l569M988M026Q991R541k6193k2555k0965J1498J5094L569K4780o171
16036d57r536J0921Q7J818q920k6579j7623J92L2457Q02j866K2276J2565o048
$$ y = [-12708, 12872, 11645, -8895, 4797, -7751, -27586, -29345, 1760, 21536, 625, -42866, -35999, -21013, -36130, -71190, -44075, -14367, 15092, 29006, -678, -23076, -8569, -5263, -24757, -50972, -35992, -8619, -14213, -19940, 10764, -5711, -13939, -22813, -48506, -63027, -44155, -25270, -22575, -28969, -35415, -24503, -46140, -46861, -12366, -9474, 1017, -8118, -19139, -34405, -16705, -29290, -39982, -31327, -21151, -29328, -28566, -7747, -149, -470, -13998, -28881, -54975, -59481, -40350, -30258, -4351, 10948, 9204, -6765, -11010, 8054, 31052, 36787, 30590, -3491, -7060, -2072, 1954, 10945, 20486, -5707, -28262, -49227, -37729, -22635, -19066, 5714, -457, -9993, 928, 1015, 2833, -6087, -32666, -50289, -50097, -17640, -16838, -18704, 3572, 16137, 10089]
16022A0089k139r235K172l5144m7829k0200L2493P830R885J1843m972R251J5447
16009b0509K1205j8741j6303k421K2952J2723J875j7979K4501M960Q438R78j5876
15996E803l9656R315N019j7650K2904Q501J3929J3678r725p871J765k1673j0774
15983b6435R322j0014L8704k0812j550K2188j744j5536J1312k9435j0209j1481
15971d5690j1794J2661K6668M051J2331k3436l688P834j8584r429K5367K0960
15959b749R44Q853J5191j9136j2032l7024L590j5242m129o237K3448j0281l336
15946e8140Q585J1536R76L3445R067P355m767l237j6545J7484K1234L311q298
15933B2006j4353O603n511j2861l9470j1352j1260r051K0648K5998J3753j3920
$$ y = [10089, 7950, -1285, 887, -34257, -82086, -102286, -69793, -61963, -52078, -40235, -45207, -35956, -20509, 696, -18045, -34348, -36769, -13817, -1094, 781, -17198, 7303, 12263, 20701, 21679, 5803, -33853, -24538, -19519, -37169, -14265, -5764, 8165, 21843, 12118, 4247, 6012, -15661, -26435, -17113, -27127, 11577, -9235, -10785, 11403, 9659, -5877, 5435, -24000, -34209, -45690, -57484, -44823, -18155, -14104, -1773, -25209, -28897, -21063, -39647, -49076, -23709, -2749, -1805, 7048, 22239, 3103, -8929, -45953, -42363, -57605, -61734, -67971, -44523, -54804, -58140, -49555, -38019, -37043, -3598, 5469, 12824, 8057, 4820, -11725, 5759, 26993, 30304, 22006, 7653, 14256, 8745, -4116, -43586, -54938, -66198, -75249, -54601, -28603, -14850, -28770]
15921b8770o920O617k6558r498j2199J2137J8164l263J5652J2916J8920k3708
15909b6510q913J402p449J3653P796r018J4667J8990J477k4397j360k450j4667
15896c6779R572J7649n436k305o658k514J1750O919j6014k6888O335Q759q160
15883d3770J1085K5449L4101l984j4304o196q620j5058o707l922J4700K9036K4498
15870C6308j2090k6431k4030N878j637K993J9009O638j658j6100k548J365j1584
15857b3887L200j7892k4970R701n951J8662M622q552J5439K4048k4562k5388L450
15844e2080L3452q43j6422k7386l129J9736J3004J4674R911l1777j920M557J7379
15831b0844K2040J3610J5283q509j2428m277n43r708j4342N06N87q063j3287l209
$$ y = [-28770, -35690, -29073, -55631, -65129, -77328, -65191, -47027, -50290, -34638, -21722, -2802, -26510, -35423, -34021, -41470, -27817, -20021, -29039, -14372, 4618, 6095, -18302, -19662, -22112, -36779, -27207, -9558, -14994, -17299, -23957, -26471, -14721, -7802, -23816, -50704, -44369, -35610, -43770, -32685, -7236, 26865, 22881, 8577, 2381, -6239, -21297, -28004, -31926, -17226, 11810, 36308, 24218, -2213, -26243, -20365, -22002, -19009, 0, 6638, 4980, -11120, -13668, -12303, -23887, -20687, -38579, -63549, -53848, -59799, -41137, -36515, -45067, -29628, -5580, -30142, -55530, -52080, -18628, -19471, -35893, -63279, -66408, -46672, -33668, -18994, -9083, -40860, -42780, -38223, -20844, 1196, 14806, 30089, 21580, 9152, 4875, 4332, -5376, -19718, -19212, -18625, -26688, -39975, -43184]
15817d3184N864M842j4765j60K0343O590k7190k8054k55K0182L2421j995K197
15804b3164K075j6764J2079O409j6706L817J8418j0466k4938J8535R68r522j1546
15791e0805l1J2562k6741n460o102k2631J4103P703J8319L1749M854J0387j0155
15778b2248j9389j4j2880L420N675K395J7179L2600K9140k9611k9579q552j3804
15765d5668j696R510l677o429J7595n613P724j7003J2525J0580N208J5719k3208
15752b4433q554R078O404m195Q993Q489j7217o913K0877k025j5022k4318p746
15739e6582Q758J3665K0879j1570k0664k8892N396J9718q579L3066k29Q018M177
15726a2839J4466P733l3283j7047l068j0360K4515K5769K3724J723r479L812k2592
$$ y = [-43184, -37320, -32478, -47243, -47403, -27060, -20470, -47660, -75714, -75969, -55787, -23366, -25361, -23164, -21089, -37853, -25774, -19365, -36071, -32254, -13836, -24302, -49240, -30705, -29737, -39259, -50805, -50836, -38274, -65015, -70475, -76577, -99208, -85105, -77402, -59083, -27334, -22480, -12093, -22248, -41637, -41651, -54531, -51111, -45436, -43041, -25862, 6738, 35878, 6267, -23312, -31864, -45668, -47364, -37854, -41531, -47960, -30365, -35978, -28254, -45257, -32732, -22152, -16944, -1225, -24433, -32987, -23909, -17505, -21700, -12707, -4218, -21435, -28348, -7471, -9496, -24518, -48836, -56582, -47824, -34159, -13280, -24850, -45514, -74406, -69010, -49292, -57871, -24805, -25034, -17016, -12839, 1627, 9360, -23923, -40970, -44038, -54398, -29883, -4114, 19610, 21333, 11854, 15666, -6926]
15713f926k3292j6456j594J8425P026k556J26M581k2840O839K2248J3602l3936
15700c4753k7109q00J0662Q329K4861K1647Q330j9145k5095j6482j6927M26J4819
15687e1237J7074J4220j968j0062j6297l756O268R519r998N989R263J7920J381
15674a1684o239j4935L852o53j3861l013P385q585J3338J4141M570K160Q773j9100
15660b3851P427k7274L701P863O264O473O756J6907Q899m750j2638l336j8503
15647b6062J4651q799p068K6286N973j8867O07k2082p550r528j3001K79J7040
15634d8121L1583Q144k932j6165O598q556J1566J7928J9286N45j6618J2167O567
15621B1992l2897j9257j1882J1342K0604J632j3667j3575j1672K511J8536l679
$$ y = [-6926, -30218, -46674, -48268, -29843, -22817, -25373, -25247, -20666, -43506, -36667, -14419, -817, -34753, -61862, -62662, -52000, -43671, -18810, 2837, 11167, -7978, -33073, -49555, -66482, -66056, -51237, -34163, -19943, -21911, -31973, -48270, -52026, -45758, -36239, -46237, -40248, -30985, -13065, -11684, -17923, -32858, -29006, -29659, -43520, -46533, -39148, -47733, -34395, -20254, -15684, -13524, -4751, -23851, -16424, -43698, -39997, -32134, -25870, -19397, -12641, 4266, 13165, 8415, -4223, -7559, -26062, -11411, -20210, -27278, -992, 4981, -13886, -13279, -35361, -42911, -52439, -65440, -65161, -48121, -16538, -8394, -11326, -27491, -20893, -29449, -17883, 45, 19331, 19876, 3258, 15425, 21992, -10905, -30162, -42044, -30702, -10098, -8466, -22133, -35708, -47380, -44869, -26333, -30012]
15609c0012l366M0240J2317k7368l3543k2935o21K1721J3087K2055j5588j7615
15597d1628j0503K43J1952M76K1578J2050k470k404m560J21K023q594Q00K7828
15583F912j4298k3761j1923K7339K0380o041j5038j4089k149J53J8258l411k0359
15570c8027J4246J2823J0285P521J2235j0129L240K1926K4118n545J3823k8495
15558C8021j8079M657k1486l9315L376K1994J6383j3267L398k0119j3361mj444
15545c9246j2126j6437O246q14J0908J8639K8765K3263o611R467j0841k5360j2650
15532b6797k149j5748j4314K8073J5550J1990J077q417K775J1569K8897n335j3192
15519A3979j5997k560r871J0621K2634j3493o039k6195j8348m358K9845L7780
$$ y = [-30012, -33378, 6862, 19179, -8189, -41732, -64667, -65288, -43567, -30480, -8425, -24013, -41628, -52131, -51888, -39936, -39460, -17882, -5832, -8302, -10706, -15266, -15145, -13122, -21716, -20916, 6912, -7386, -31147, -43070, -15731, 4649, -1392, -16430, -30519, -32668, -32515, -14257, -17668, -38027, -23781, -10958, -673, 6848, 19083, 8954, 12194, 34120, 58238, 52693, 66516, 38021, 19942, 24599, 3113, -36202, -32826, -10832, 5551, -7716, -4318, -24437, -37798, -37802, -39246, -51372, -67809, -61563, -62377, -51469, -32830, -4065, 19198, 12587, 22054, 11213, -14147, -26797, -28946, -44694, -59008, -30935, -15385, -3395, -2318, -10735, -7960, 3609, 32506, 27171, 13979, -2018, -4578, -14449, -3828, 18806, 5313, -726, -26921, -45269, -49627, -19782, 17998]
15507A7998q696o332R577j5199l2951m629K6202r77P338J9349j7857j2121J3966
15494d332k1938K5330K4911k6402j9563L794J1709o983n163p949J806j275j2081
15481c8136m377L4457J994J1194Q705o34q648M445J1162J7727l3798j9499m758
15468b0166J3207R349q747J2655J331k1936j885K294K2736p034j1411p753J9985
15455B625K613j4196j5643J3938J5402k1596R139L040r021p117J1321m415m594
15442a8504o723R400J0966K0222p83j0494o6M273M625j6359O316J2320M15j0846
15428D762r60j7563j7108m824j0353r872J0992M4001O599J2639j7338k2951J955
15415b0021J1012n608p39J5603Q398l454m116o759n086K7466J5049l4869n003
$$ y = [17998, 9302, 2970, 12547, -2652, -35603, -40232, -14030, -15007, -7669, 11680, -6177, -18298, -4332, -26270, -940, 23971, -2431, -21994, -18200, -6491, -13474, -18637, -26586, -24780, -26055, -38136, -42513, -8056, -6062, 5132, 13837, 13203, 4555, 9000, 20162, 37889, 4091, -15408, -20166, -6959, 2390, -6357, 6298, 7629, -14307, -16192, -13898, 8838, 1804, -9607, -17360, 2625, 5238, -8958, -24601, -10663, 4739, -16857, -7718, -4678, -13699, -20816, -9495, -13910, -18504, -25227, -15827, -4861, 15361, 14578, 4084, 4018, 8291, 12916, -3443, 2873, 15193, 15608, 4762, 3802, -13761, -30869, -35693, -46046, -55918, -44926, -925, 5674, 18313, 975, -21976, -20021, -9009, -14617, -15356, 247, 8645, 5191, 1075, -5684, -10770, 16696, 31745, -3124, -8127]
15402h127R595m877j9079l068j2609J3696l804J8084K5919J6232j8478j2873j3444
15389a2833M734r029r41j7423k5084L0913j1438L9610R921j7100q960n661J8756
15376d535Q453j2507j8172n238J795j0945q173q200K9851K3307N457P122J224
15363I439j1359K19j8604k331j1197k5692Q258l0371r112L5128M0208K1137J057
15350F780P765l2181J698P401q355j4902k3347J1085M1068j0638j9085J1097N912
15337a5702J147l507N324l575J6187O630k2813j2779p698K554Q728k4414R264
15324d0654K4328J8285j4485j2810L451L1419j351N278n532P180j1030j329p319
15311d569Q129j7866l6570k0964K4452K9627Q926q567J2601M534j0162J306J7043
$$ y = [-8127, 1468, -3409, -22488, -25556, -38165, -24469, -28273, -10189, 15730, 31962, 13484, 611, -12833, -8099, -17128, -18069, -35492, -60576, -29663, -41101, -1491, 8430, -8670, -17630, -23291, -4535, 3918, -8589, -26761, -31999, -30204, -41149, -49322, -57522, -27671, -4364, 1093, 8215, 9439, -1920, -1701, -20305, -22636, -33833, -59525, -51267, -81638, -90750, -55622, -15414, 5723, 6780, 14545, -17636, -15938, -8537, -16892, -31794, -55141, -44056, -2988, -13626, -32711, -21614, -15702, -14555, -18062, -12738, -16313, -126, 6504, -16309, -29088, -36786, -34232, -25504, -49918, -40654, -16326, 1959, -12526, -25336, -21885, 9534, 8183, 13461, 7929, 15109, 4079, 2750, -4569, 3560, -14306, -50876, -71840, -47388, -17761, -8835, -17402, -4801, -267, -10429, -9123, 7920]
15298G920J3713j4011j0535J718j0436j190J4494Q481O224j4689K2194J1650q665
15285B6868l4013o467J1641R649o867m528j2322j1282R947l198J7341R832q674
15272b073j7442J0520P621J3071j4101l7391l706J1934m738j4675J899m365j5797
15259f9243N117J0931O5923K2040k9816k6271Q18P495o032j1115R6L7914o413
15246A444j7097J387O601j4341J4134L7930J1391r66r652k302j0326j4452k1614
15233a7863j9569J3778K9129J6169n469k343k3965O220J6832O098j554q68P320
15220B3915K9292j6697o4089k1836K2975J4479n486j4074P49j0245l498M9193
15208D678J5379j1021k4976J3780L397J6380l797l32j5095j0984j7436j3811j9840
$$ y = [7920, 21633, 7622, -2913, -1195, -11631, -12821, 1673, 10154, 16378, 1689, 23883, 35533, 26868, -7145, -13612, -1971, 7678, 811, -3717, -16039, -27321, -17374, -20572, -3231, 6601, -2073, -19515, -8995, -1374, 11697, -2404, -39795, -43501, -31567, -36305, -50980, -49081, -53446, -69243, -64126, -53195, 12728, 34768, 4952, -21319, -20501, -13006, -19038, -30153, -30057, 7857, 1444, -15653, -14266, -7665, -22006, -7872, 30058, 41449, 40483, 30831, 28529, 18203, 3751, -17863, -37432, -23654, 5475, 21644, 16175, 13832, -10133, -3913, 12919, 19017, 17463, 16595, 23915, 53207, 36510, -27579, -49415, -26440, -11961, -17447, -31521, -30772, -41017, -44515, 4678, 20057, 9036, -15940, -2160, 1237, 17617, 13820, 13488, -1607, -12591, -30027, -43838, -63678]
15195f3678J9029q088j6230M4471L9472j349J2487j0748j8519J2133J2669N409
15183B7058j9952n778n792j0414J8203n65m525J2767J3737j0601j4991j4186j8205
15170c3244L112J374k0923o906M454O836J826Q055j5088K47P194p633J5102k0976
15156e6570R962l953k3222M926K7344J355q835K6780J0294J1199r98j1421J034
15143a2105J1276L006j7101O050P279j9761J4312K6414j3788k7774k5703J0741
15131c7154K801L012P891j535p543J2650J689L703N695K1572O156j1920k7883
15118b0866L214J7131q21J7165n965p152j3437L38J9331K113j3276j3430N332
15105a0323o062O118K656l7363l3557J9907K1950m140l609J3978k2360K5797J7140
$$ y = [-63678, -44649, -52737, -68967, -24496, 14976, 13627, 26114, 15366, -3153, 8980, 21649, 27058, 7106, 1328, -4464, -14878, 3325, 2760, -1765, 11002, 24739, 14138, -853, -15039, -33244, -30132, -28758, -49681, -56587, -52133, -45297, -43471, -35416, -50504, -50257, -43063, -50696, -35594, -56570, -46608, -50561, -73783, -68857, -41513, -40158, -48993, -22213, -11919, -720, -1718, -13139, -12105, -829, 2177, -14924, -8874, -1595, -21356, -7044, 19370, 5582, -22192, -47895, -37154, -34353, -31341, -23450, -24985, -32528, -19878, -18189, -14486, -8791, 12781, 18937, 7017, -20866, -17652, -521, -1342, 15823, 9858, 2706, -10731, -10393, 8938, 11051, -2225, -15655, -10323, -16385, -10267, -7611, -44974, -78531, -58624, -36674, -40814, -44423, -30445, -52805, -27008, -9868]
15092i868j2062P062J1691n97n951Q091m767m514k5110K1253K5941j475k5455
15079a5761L975k005q496j1369K5524K1717k2210q279q398k1262K640K0497K1774
15066a653m971k6428J2586J8004J77q294l840J1771J7025J289L299J1526K4482
15053E4973J6083l4709m5851k2472j6070K8423J6298n677O604R450J0780K8742
15041D6574j9016l7264K602J0342O296J183l704K9686l7605k0155J2298P901J390
15028E28k1940k2527j0848J4431M7123J6093m523j1979R222l948m1455j3856L033
15015d0646J1919K9409L1706p113r204o1K2171p633l5283L248k482M14p144j1638
15001b2337J3018J8636K5249R9j1551R312j3061j822k3412l7013M535J9549k451
$$ y = [-9868, -21930, -14868, -3177, -3774, -9725, -1634, -6401, -10915, -36025, -14772, 11169, 9694, -15761, -11786, -13791, -22287, -33656, -8132, 13585, -8625, -16904, -25302, -46564, -43924, -23427, -1653, -6624, -33052, -20466, -2462, -2285, -10579, -14419, -2648, 14377, 15666, 18965, 30491, 54973, 71056, 36347, -9504, -31976, -48046, -19623, -3325, -9002, -2398, 7052, 17832, 46574, 27558, -9706, -7104, 3238, 9534, 10717, 7013, 36699, -906, -21061, -8763, -862, 528, -21412, -43939, -54787, -40356, 6767, 22860, 18337, 6358, 15580, 11632, -29823, -43679, -40646, -28727, 682, 32388, 25275, 16071, 16010, 38181, 30548, -4735, -1487, -3969, -3555, -10699, -22337, -9319, 9317, 34566, 34665, 23114, 32426, 19365, 17543, -5869, -42882, -38347, -18798, -21249]
14988b1249o546J4271J4987J2010j9460n148P048k2845k053J1728J9574L3573
14976C5890N090J3230k3050j7647J2207j296m950n344j4540k1041j5376r232K909
14963d3150K7483J2476P115l2402r757K7019o567J3128K8406L782j8205k2849
14951a3521O417J3612j732N499k098o256k3815O167P581j8443j0043O159o909
14938c7382O99J3508K0436o619n925J6194r60k0889R193Q897J3873k5181l806
14925a7962l596N128N0904m805J965j8295k5982P789m561J4308j3769o280l269
14912a8425j942J4233K4708P666n7446k3110Q331J062K4563L3922n805j7169j2022
14899b1434J774o435k0008K0553J0783K2758K6194n184j3329l3306L960J0013
$$ y = [-21249, -27795, -13524, 1463, 13473, -5987, -11135, -4087, -26932, -28985, -17257, 2317, 35890, 40980, 54210, 31160, 13513, 25720, 24424, 19474, 14130, -410, -21451, -36827, -46059, -43150, -15667, -3191, 3924, -28478, -38235, -11216, -17783, -4655, 23751, 27533, 9328, -13521, -7104, 6508, 4776, 10275, 8177, 1921, -21894, -15727, -8146, -26589, -36632, -30473, -37382, -36683, -23175, -2739, -9358, -15283, 911, -49, -20938, -11745, -2848, 11025, -14156, -17962, -21558, -16430, 34474, 29669, 31634, 13339, -12643, -4854, -9415, 4893, -8876, -15156, -18425, -20367, -6134, 18574, 26240, -31206, -54316, -45985, -44923, -20360, 13562, 7757, -9412, -21434, -19660, -26095, -46103, -25550, -14767, 7991, 34185, 29001, 15672, -17634, -13674, -3661]
14887c661J7993R150j4681j2079K093l443k0690m787K1078N479j5825j1604O225
14874b4752N705M065L201K4550m64j9703r068M194k9562j5592O765L3220j9225
14861c6666j4362j419p410L2282L0861J266R188J949j3902k6706j9207J4935L562
14848b5629j1014m651O752J2827K6457j5070j0084J7250j3542j7731J3655R056
14836a1724O348m1j2917J0634R355P630j2825l287l3463l201k1960L2419j276
14823c4308N690l631l2525j2391j0176J0573J9871J2597R132L914Q891J7873J8617
14810A4127Q688q028k862j066j7530o805q385J4186j9337l451K786k7541j7209
14797g2427O556K2957L3230K966Q280O043j1200R540K3471o618J645j2576l0544
$$ y = [-3661, 14332, 23482, 8801, -3278, -1185, -4628, -25318, -30105, -9027, -3548, -19373, -30977, -24752, -19047, -14982, -11781, 12769, 12305, -7398, -16466, -12272, -41834, -57426, -50661, -17441, -36666, -51028, -52447, -59857, -27575, 3286, 4552, 13740, 15689, 1787, -24919, -44126, -29191, -25629, -36643, -41294, -34542, -21715, 4742, -10328, -20412, -3162, -16704, -34435, -20780, -11724, -5376, -5417, -18334, -7700, 1655, 9285, -3540, -6827, -40290, -43491, -65451, -33032, -34308, -28618, -32249, -64774, -77165, -87341, -76768, -56897, -44300, -35168, -31254, -22363, -4490, 14127, 22815, 14787, 11925, 10859, -6671, -13476, -21861, -7675, -27012, -30463, -27677, -55218, -72427, -65871, -42914, -9684, -6718, 1562, 7605, -3595, 5945, 29416, 22798, 24443, 11867, -18677]
14784a8677k3006O006J8437Q343K5343K8515j6161j8726J7017R137j1955Q697
14772C2970j3882j0476J4563M3345N5718K4937j1542j7623K2967r187l6300k3899
14760G1591j9109o232j5542j0386n519J1138R126J552r236l6264j632j7006r144
14747c6663L0099J5611N812n872l346K718k202J52j4422j3437K165P304L4046
14734B1965K982J1638n992l1968K2479l538j7167j4094j8095n596L012K2468j5472
14721b7378k4782J888K0869J7602r122j3128J8811L0457k0114k2992m939K5919
14709f909J9642l6706l5528o694J969N335J737J7968j706o394O589j230N490p291
14695d3728K547J9297j5513J2037j662M078J0083r30j3474j2122m136L233K5191
$$ y = [-18677, -41683, -35677, -17240, -8897, 16446, 44961, 28800, 10074, 27091, 36228, 24273, 32970, 19088, 8612, 23175, 66520, 122238, 147175, 135633, 118010, 140977, 131790, 95490, 71591, 52482, 46250, 30708, 20322, 14803, 25941, 35067, 36619, 27383, -8881, -10513, -27519, -36663, -6564, 9047, 14859, 8987, 5641, 8359, 6157, 6309, -8113, -21550, -19385, -12081, 21965, 24947, 36585, 30593, -1375, 21104, 17566, 399, -13695, -31790, -37386, -34374, -11906, -27378, -52160, -50272, -29403, -11801, -20923, -34051, -15240, 15217, -4897, -27889, -32828, -6909, 12733, -23973, -59501, -66195, -64226, -58891, -57154, -39186, -40892, -47286, -40697, -41927, -36437, -43728, -41181, -21884, -37397, -25360, -27022, -22944, -12861, -13791, -27265, -39387, -43523, -40290, -15099]
14682a5099o032j4041L825M169J3887j5375r912m489m051J2448J8897k641L8566
14669B0152K281j393r06P813j0445l6264L506L681l675K5138k0681m1424J4456
14656c7761N447J5229K092j3720m669J5147K8372o068k8243p658J176K5241J5835
14643A0420r189Q845m920k3855k4340j127J6380K6631O857L812m443j6333j1288
14630b2550l696j4751j771K4310j139K5827P514j0058k2014K920r115J9706j0233
14617a5050K892M307l191m619N386J7914q48j085J6059J2916r847j7834j4253
14604g253j3764j5305o703K0897L9633K5956J8094K7811J1222n2246l5135r276
14592C931n100j9867o202L8037P642R002k3857l1707l3420Q28n315k855M6679
$$ y = [-15099, -21131, -35172, -31347, -27178, -13291, -28666, -38578, -43067, -47118, -34670, -15773, -18414, 20152, 22433, 21040, 20134, 27947, 17502, -18762, -15256, -11575, -15250, 9888, -10793, -52217, -37761, -32314, -17085, -14993, -28713, -33382, -18235, 10137, 4069, -24174, -31832, -30656, -5415, 10420, 1231, 10076, 5156, -18699, -43039, -44166, -27786, -1155, 5702, 9514, 5071, -11262, -22550, -26246, -40997, -42768, -18458, -19597, 6230, 13744, 3686, -18328, -15408, -24523, -4817, -15050, -12158, -7851, -11042, -15661, -10275, 7639, 6791, 5706, 21765, 34681, 24834, 7000, -7253, -21017, -36322, -43025, -22128, 17505, 43461, 61555, 89366, 100588, 48342, 13207, 3931, -1169, -21036, -27238, 10799, 18441, 27443, 3586, -28121, -61541, -60713, -66028, -68883, -22204]
14579b2204J6600L565q846k6324j8379J4440m02J884J2773J2206j1034r969L735
14566c1955J7638L470J3179j937k8852j3482M099r406P132L0270K9908L073r331
14553A3806J890j155J9473j4064j6963J3471l6794k4553K145p988J7521l936O251
14540c0896q75K6127L0072o565J0779n345J4154J187j6501k3413m562j3972O664
14527a3146l238J916m92k1399j7800M8111J0913L0080N257j6193p811L056Q56
14514B0110j8321j3703K8K5195K3773J7623q008l6123j0229P578o354q250J7863
14501A1182o558k5955k3738k94K6962K3953L961J6212l4136m9264J0704L3832
14489a3139J2474R306o061j4361m166j7508R424J5216J1873j9373J3201J3430
$$ y = [-22204, -5604, -2039, -10885, -37209, -55588, -41148, -41550, -39666, -26893, -14687, -25721, -35690, -31955, -14317, -10847, 2332, 395, -28457, -41939, -37840, -47246, -40114, -9844, 20064, 23137, 13806, 15696, 14541, 34014, 19950, 2987, 16458, -20336, -44889, -42744, -50732, -33211, -37147, -30896, -31771, -5644, 24428, 17863, 28642, 23297, 37451, 38638, 22137, -1276, -5838, -19810, -13146, -16384, -14468, -14960, -36359, -54159, -6048, 4865, 34945, 40202, 24009, 16198, 19254, 20110, 1789, -11914, -11886, 13309, 37082, 54705, 46697, 10574, 345, 7923, 1569, -6681, 11182, 4624, -21331, -45069, -45363, -18401, 5552, 9513, 25725, -8411, -57675, -46971, -13139, -665, 8641, 2580, -11781, -15947, -33455, -24031, -8815, 3058, -16315, -3114, 10316]
14477A0316K25J0632Q012p331j836j9870m1859n538L1576K6535K1866j2503k3455
14464c230k123J9241r19K3239J1270j8814J740j0789k7690j9378K0100j354k2777
14451c1484j9075N049n367K2391L0885M5758q4j7945l2028j0639j3461M3412J4664
14438C2076j6584k2334R267l3011P388K5017K4924p208m936L548r097k339R475
14425A6186J6263J2600j2428k0470p03R454j3936k2735n893K223O479L6291K2104
14412D5435j6558k1832K716P294k6580j5702L129N62k0758j6067K4914K9084J2881
14399H518J8939j5634P745K392j8211j6020k0497k724L1813L8355j0004j9544
14387E128j3678L3315k646j5309J6038M4144J1621k1388k9018k874k7575J5048
$$ y = [10316, 10541, 21173, 29185, 21854, 20018, 148, -41711, -47249, -15673, 10862, 32728, 20225, -3230, -5353, 13888, 12969, 36208, 47478, 28664, 30404, 19615, -8075, -27453, -7353, -8707, -31484, -50559, -45510, -50877, -28486, 2399, 48157, 48073, 30128, -1900, -12539, -26000, 17412, 32076, 15492, -6842, 2425, -30586, -23198, 1819, 26743, 19535, 14599, 18147, 9050, 6711, 16186, 32449, 45049, 32621, 12151, 11448, 20902, 6966, -15769, -21662, -19439, -12960, 23331, 45435, 28877, 7045, 9761, 17055, -9525, -25227, -22098, -21536, -42294, -58361, -33447, -4363, 8518, 27457, 11823, 19568, 21960, 3749, -12271, -32768, -35492, -3679, 34676, 24672, 5128, -8550, 24765, 22119, 6810, 22848, 66992, 78613, 57225, 28207, 25333, -2242, 12806]
14375A2806J5780j875k400J5369r046q318L7737o533k4984N334k2489J20J5147
14362B6648k860l7836j0107j5267o105J2735O704L7190L0707J2543l4255l4024
14350a3927m158j709J2133L794q499j0415q694j1545l576j4303j19j7681J8454
14337f0245K7393j033j1612L4845O000o646N296j698J5831J7331J1533J455k9833
14324H617j6674j0002k487m645r740O897J7145K3788J0367k49j8551n714Q383
14311G135J2490l261R445P834J927k2130k3869j6023L3855L907J4680j511k0581
14298C898N647P501M619n279m914m683l6328l6324j1801J6003p14J2914J2999
14285c6462n044J6949j0774J8948J0735P009L837p404j4006j1434K2326J3382
$$ y = [12806, 28586, 26711, 24311, 39680, 30634, 22316, 60053, 53520, 28536, 33870, 11381, 11501, 26648, 23788, -14048, -24155, -39422, -45527, -32792, -26088, 11102, 41809, 54352, 20097, -13927, -18085, -19794, -7661, -3867, -12366, -22781, -31475, -43020, -46596, -60899, -61018, -78699, -60245, -32852, -33885, -45497, -10652, -4652, -11298, -6002, -7700, 8131, 25462, 36995, 38450, 8617, -8057, -18059, -20546, -25191, -34931, -28034, -10889, 12899, 23266, 23017, 4466, -1248, 7135, 19625, 16364, 25809, 33643, 35570, 13440, -10429, -26452, 7403, 11310, 25990, 24479, 3898, 9545, 17046, 21665, 16386, 11472, 6789, -29539, -65863, -77664, -61661, -62375, -49461, -36462, -41506, -24557, -35331, -16383, -5648, 1361, 5198, -2206, -16212, -27646, -5320, 8062]
14273H062P529M797M743p872j3872p931j4151J7307N841o099l8720o684J5694
14260c1356K7296j9889j9269K6893m20L085K861J23O903M423r397J2434j0068
14247f381j169q861J5583J6054p494k6399l6219k2696J1439K9432K4317k1044
14235c3438j1535R581K6315P019j0155k3106p81r745J0228J6862n188j7622K1956
14222a9609O697j4435K8116J7721J3175J3934k911k6304j2584j4939j444K3626
14210A1043R76M525j3251m3696k433K0294l0538R40J4207M1558J8046m869n443
14197A1359j1432j7541J3091N443L30K169k6809J3196K1768j2442R871J8325J2482
14184C9810k956j9478l7305P376P095J3937J0180r785j8745j9966o453L5287M1786
$$ y = [8062, 15591, 20388, 25131, 17259, 3387, -4544, -18695, -1388, 4453, -1646, -40366, -47050, -31356, -4060, -23949, -43218, -16325, -16745, -13660, -10799, -10676, -3773, 650, -8747, 3687, -6381, -7550, -16411, -828, 15226, 7732, -18667, -54886, -77582, -66143, -36711, -12394, -33438, -44973, -35392, -9077, -2058, -12213, -35319, -36100, -45845, -35617, -18755, -23943, -41565, -19609, -12912, -27347, 769, 18490, 31665, 45599, 42688, 16384, 3800, -11139, -12583, 11043, 12019, 16544, 3293, -40403, -42836, -22542, -53080, -52140, -37933, 3625, 21671, 16802, 11359, -73, -17614, -4523, 920, 1250, 3419, -23390, -10194, 11574, -868, 9003, 27328, 39810, 36854, 17376, -19929, -12553, -5458, 8479, 18659, 8874, -9871, -29837, -36290, -1003, 40783]
14171D0783L496j742m721J8921J8747j8420l6851K0542j1480j9074l2415j3666
14159c5880K486O048K2366K8928J7701j1361j0334K751j3875M928l37o31j0524
14146B266l822j9157P297K1654J6752J2299j9835q543J3082L2370k836j5558j2222
14133B3747p566J3396K0669r95L355K291R485j8915k6047k2496P07j1712m219
14120a8300J353N746o445L038N334q772N658k495J3678K3713j0264K384J7402
14107C2030p783r294K0061j141q759L592j5324j2721k632k0305j5004M989K873
14094b9418j4252o461P986J780J531J1526n115r238L3910J024J7m781j4179k9548
14080e5218P314J5181K4046K9074j7267R064p899j8373n0574n709J9168J3461
$$ y = [40783, 44279, 42537, 37816, 56737, 75484, 57064, 20213, 40755, 29275, 10201, -22214, -35880, -33394, -27346, -4980, 23948, 41649, 30288, 19954, 22705, 8830, 13758, 13421, 12790, 2266, -1556, -20713, -13416, 8238, 24990, 37289, 17454, 8911, 21993, 54363, 51527, 35969, 23747, 16181, 29577, 50246, 49251, 52606, 54897, 64382, 45467, 19420, -3076, -2369, -14081, -18300, -16947, -11201, -17646, -14608, -9274, -18046, -12388, -14883, -1205, 22508, 12244, 14628, 32030, 24247, 14953, 35014, 33873, 25114, 28706, 13382, 661, -1971, -22276, -37280, -32291, -29418, -43670, -50131, -42145, -40365, -38834, -27308, -32423, -41661, -7751, -6727, -6710, -11491, -25670, -55218, -47904, -32723, -8677, 20397, 3130, 12194, 4295, -14078, -64652, -70361, -51193, -37732]
14068c7732L718Q848K0496K0613r541P627k2833J6443L2301J7980j09k0948j5365
14055B1498K876r1l509j9177l3657r813j247J8479R051m554j0992N379J3834L200
14041h723j9945J3839q608k3040q266K0206M0074J8887j494k1528j1124j9610
14029b9332j6294o030K0021J2124J5613R743Q643o162Q240O593k4151K745p473
14016e720J473K4099J2072j5190j1652n522k702J3165j325j4849k330k1791J5166
14003a5106l433j1332j7133J989K2967M558R03j3138J8168J0738j1260Q255q100
13990a1924J5111k216K0577J2975j156j3310J6081j0174r226m63K192m158J3384
13977B7693J8832k2889k35k0248m4257K2018L4293q335j5821o023J0346m221n963
$$ y = [-37732, -34014, -25166, -4670, 15943, 6402, 14029, -8804, 7639, 39940, 57920, 57811, 36863, 21498, 24374, 24283, 20774, 1597, -32060, -41873, -43120, -24641, -15590, -20144, -31136, -25757, -11923, -8723, -28668, -14829, -23437, -46477, -54743, -34537, 5537, 24424, 22930, 1402, -9722, -29332, -45626, -51656, -31635, -19511, -3898, 5845, 14488, 8326, 16566, 23159, -992, 1753, -5720, -4247, 19852, 31924, 16734, 5082, -440, -3142, 10023, 8698, -6151, -8481, -30272, -15106, -18539, -29871, -47004, -45015, -22048, -17490, -16587, -29725, -11557, -819, -12079, -3824, -11924, 3187, 971, 21548, 34523, 33367, 20057, 36138, 25964, 16738, 16275, 18467, 14309, 27693, 46525, 23636, 23401, 3153, -41104, -19086, 15207, 6872, -8949, -14972, -4626, -8847, -14810]
13964a4810j0631j6794J4207K4450K3026k0691q332j8665j5086k30K5844L4137
13952A6425M5165J1077O422l0391l7820J5773J1466k6017k8347j474N723J6139
13940D141J0976J1021k221j3087l1166n071J4009Q890M982L481J1567P542j0074
13927A4990P736J6318j2060j8218j4591k2603p520p11R637n584J993J3061J0249
13914g303J2062J1381j3139j5315j0014K1757L8329K617k7831k915M729n854k5601
13901a7097Q712L019K4616q101l8945j0397M2845j3054j1739O869p838P183J5013
13888A086j1921j4602M798j856j5418j8702r713j5568o32L3380M1336K9571K9494
13875E1253L691k837k9598l204J061k1319p04J5241K3211k3896k1828O455n549
$$ y = [-14810, -25441, -42235, -28028, -3578, 19448, -1243, -9575, -28240, -43326, -43556, -17712, 16425, 61590, 72667, 79089, 48698, 10878, 26651, 38117, 12100, -16247, -17721, -11998, 4141, 15117, 26138, 23917, 10830, -20336, -25407, -11398, -2508, 2474, 5955, 17522, 25064, 14990, 22726, 39044, 26984, 8766, -5825, -28428, -35948, -36659, -27022, -32606, -30613, -17552, -7303, 4759, 16140, 3001, -12314, -22328, -571, 37758, 40375, 12544, 9629, 14358, 8504, -17097, -8385, -5366, 19250, 11149, -27796, -38193, 4652, -8402, -20141, -13272, -21110, -13927, 1086, -10835, -25437, -20639, -22495, -37913, -56615, -66328, -81896, -82528, -49148, -7812, 21759, 51253, 54944, 52107, 22509, 19305, 20366, -953, -1657, 13584, 36795, 12899, -8929, -2474, -8023]
13862h023k3483M0602J1631M60r430J3716j9150k1358M77O214Q970n0962P85K3380
13848b6171J4425N252J3264O557j8923M046k769j5077K039Q561Q286J7180j5895
13835G75o88N072J4791N231k595j090J7923Q177l1230k6999k0530n021Q012L821
13821b4351k4751N970L3044K792k2040K4378J5200l0600m1374K416O246M527K213
13808d6330K2228J0831J2627L3458J4267o214k1864j0585p491Q0L401J1183m951
13795A0640j0024K848n227l7745j0402j4888J4422R077l853j1651K2819K3259
13783a0725o730k8404k577K9128L3500Q053r12l2186k2482l103N663K4281j962
13770h456J7248J4915k1280l0791k0667K2173q270P6N680R340j446N314p505j9772
$$ y = [-8023, -31506, 9096, 20727, 21187, 11757, 25473, 6323, -15035, -14558, -8344, 626, -50336, -49551, -26171, -11746, -6494, 6770, 13327, -5596, -1550, -4319, -19396, -17357, -8796, -510, 16670, 775, 87, 5159, 19950, 25181, 22586, 21496, 39419, 47596, 16366, -10633, -31163, -36184, -28172, -24351, -49102, -43132, -10088, -7296, -29336, -4958, 10242, -20358, -61732, -59316, -53070, -48543, -46330, -24102, -13271, -644, 32814, 47081, 40867, 19003, 8418, 927, 1007, 4408, 15591, 10640, 616, 3464, -1763, -39508, -49910, -64798, -50376, -41299, -45152, -56803, -33984, -10725, -17455, -45859, -48436, -19308, 14192, 22245, 21333, -10853, -33335, -36438, -30775, -6494, -8456, 8792, 23707, 2427, -28364, -49031, -26858, -35128, -35052, -29372, -20032, -21478, -16164, -23669, -43441]
13756d3441j2915J9275J7561K1035N016J0727J0240O376j4890j3452k3429j0172
13744b8069M12P175K3360L410k2707o938K1363K9039q510k6805j7064q317O922
13731b6729J9208q257k4331J0523L4655p970m162j118r391q278J6645J350k0653
13718b8508j7k6400j0014J0852J984j8371L655J8546K0206J2882L0920K9246K777
13705D7758J7042R113p245p034q026k3140l0514k2913J6766j82j530j339J7109
13692E865k0804L063j7382r123P618J5107L271j7069J6988r54o82k3794j5464
13679e3360K9233J3088K5572M485k6191k2700Q661Q804R874j0108r17J7597r44
13666C094P540O273j5918j3021j1516j4106J4750K0355J0338J744q577J371K0294
$$ y = [-43441, -56356, -37081, -19520, 1515, 6531, 17258, 27498, 33874, 18984, 5532, -17897, -28069, -27657, -20482, 2878, 6288, -16419, -23357, -1994, 27045, 18535, -8270, -25334, -33651, -26729, -7521, -15778, -40109, -29586, 5069, -2901, -7063, -8181, -17572, -25850, -9205, -7855, -28508, -28525, -54925, -64939, -54087, -52103, -70474, -66819, -48273, -28067, -15185, 15735, 44981, 47758, 64800, 73913, 66668, 59634, 51608, 28468, -2046, -24959, -8193, -8375, -9905, -11244, 5865, -14939, -11876, -29258, -38381, -30763, -15656, -12385, -29454, -12466, -13420, -14102, -37896, -53360, -24127, -11039, 14533, 19018, -7173, -29873, -21212, -12408, -2534, -12642, -13559, 4038, 3094, 10634, 16907, 989, -12032, -23548, -37654, -22904, -2549, 7789, 9533, 956, 2327, 22621]
13653B2621l045M268k231j1949p929l694J004R210Q243r118N227o775j0607k9060
13639c3835M142J697P270M899R763K6119j6402n3145m008K3612m40J7924J499
13626a0905L0305P64K0534j5519k299j0273j3975m74n479j4415J8743n72o076
13613i641O710p844K682J3932j3354l669m441J3807N5025N425l2211j8814K2831
13600C0438J7203Q679l3811j8241l070k363q040j2366r887R708R183k760J1194
13587d133K3371K5170m932k0083P791J2993J5420k9789j0659J8537J1086j8943
13575B5829j6001n01j4542K226J0497l395j0170o414M674J3014J3375m575k9568
13562a5551k0599j6194j2022J0803q704K39J7850K0519P10n316K066J3009J1500
$$ y = [22621, 19576, 23844, 21613, 9664, 1735, -1959, -955, 8255, 16498, 7380, 12607, 5832, -4775, -33835, -29693, -27996, -20726, -15827, -6064, 20055, 3653, -49492, -53500, -29888, -30328, -12404, -10905, 19400, 20164, 40698, 25179, 22880, 12607, -1368, -1842, -7321, -21736, -2993, -3565, -9641, -2931, -10775, -8093, 5839, -7515, -11184, -15625, -1818, 53207, 58632, 26421, 7607, 30438, 47641, 56320, 22509, 4268, 1198, -1165, -9205, -21571, -31458, -21750, -12567, -15327, -4133, 19238, 44408, 39476, 19393, 27184, 40177, 55597, 25808, 15149, 33686, 44772, 25829, 9828, 9327, -5215, -2989, 7508, 4113, -6057, -12471, -7797, 5217, 18592, 14017, -15551, -36150, -52344, -64366, -53563, -62267, -62028, -44178, -23659, -22949, -28265, -26199, -13190, -1690]
13549a690k0379o445j0875p502O385J4996J0766K5028j8512o927O469r486L092
13536a5080J8403R169J7790m344o072l03k8490m495N292j6581l97J7983j8075
13523b5200QK973m470K6414O487L587L048M605J9467J6183k9040j4375K6814k933
13509C3568j7034J7581l0918r022M299o334k4337k0739K871J5261n25l196L5639
13496b886M0287R175k5419l0006j0306L289J1462J1508J0511O984j6016K222j6788
13483e983p832o894J0409j1600k4584k1021P678L5487j1952r629J1543k480K5057
13470a1801K3898J5956k4302k9344N168j833j392r129J8136j8068J536J2529L1744
13457A3098l050J6429j5534k5167l793p41M617J2201J1449L407k7591k5827J3470
$$ y = [-1690, -22069, -28514, -39389, -46891, -40506, -25510, -14744, 10284, -8228, -15155, -8686, -18172, -15080, 3323, 12492, 30282, 25938, 19866, 19563, -8927, -13422, -8130, -24711, -25108, -7125, -25200, -25192, -22219, -26689, -275, 6212, 9799, 12847, 17452, 36919, 53102, 24062, 9687, 36501, 33568, 16534, 34115, 3197, -5825, -1526, -7860, -32197, -52936, -50065, -34804, -35329, -38525, -2886, 37401, 46576, 21157, -8849, -19155, -15866, -4404, 7104, 17615, 24599, 8583, 10805, -5983, -13815, -20709, -10300, -21900, -46484, -67505, -59827, -24340, -36292, -45921, -34378, -36858, -11801, 12097, 28053, 3751, -25593, -20425, -22258, -23650, -32779, -14643, -32711, -31175, -18646, 13098, 10048, 26477, 10943, -14224, -18017, -18758, -14141, -1940, 9509, 12916, -14675, -40502, -27032]
13444b7032J8925J3526j1962n399L0876l206k3073r573m264J0569m560K3565l5451
13431b7059j4848J4933j678J3499K2480k580p395L195L0059J449j7732j0640r578
13418e895R387J2707k4539n477j2367M547L968j1596J6770M0334J2758j5598n900
13405A9099P071j1617J3927j1372k1729R410J0020P481o556j0885r201P272m180
13392a260K6723j3448M002j9491j639j0796k130j0060k3190J0733Q219O827L778
13379b1732j5136K1551j3393q053j5258J3529M0262n571J0624M91l3235L769j7444
13366c9596k1516J6856P651K5297L628j2516K8908N829J3542O703l2143%N925
13353H568J3732M136k4047j2963q766k330j0678N206j2135j6159k872K4980L6503
$$ y = [-27032, -8107, 5419, -6543, -11942, 18934, 15728, -7345, -16918, -21182, -10613, -15173, 8392, -27059, -41907, -26974, -28652, -15153, 7327, 4747, -2648, 547, 30606, 32055, 14323, 3683, -5895, 3492, 16199, -8340, -13817, -26184, -21637, -17669, -29265, -12495, 27839, 40597, 24999, 19099, 26170, 14553, 28480, 17108, -4621, 4789, 14809, 22290, 15734, 4849, -4352, 2920, -1260, 25463, 12015, 16017, -3474, -5113, -15909, -18039, -28099, -51289, -40556, -32337, -25510, -21732, -36868, -15317, -28710, -36763, -52021, -38492, 1770, -3801, 6823, 7314, -25921, -22152, -39596, -61112, -44256, -36605, -11308, -7680, -20196, 8712, 14541, 28083, 34786, 2643, 2643, 8568, 22300, 26436, 2389, -10574, -19340, -21670, -32348, -27142, -39277, -55436, -58308, -33328, 3175]
13340C175N859j7433O0k3666m422N7427j133p364o918j1975o697J5591q779j2716
13326a8991j2802J1974M5235J4406j6930j3008Q528O262M832k328j3828j581j5686
13313c917p243J6600o153P746K4336j7577J4452K4720O27k044j4886j1334J7570
13300D2897Q591K251J460l0168j7890J4084N146J7121q264j4633P60m154N996
13287B3197J9432R109k5117k5702n188J5343M885L2598M690k4861k8279O204N395
13274A1706j69j4159m033P825J950k545k3810J6907L1784N513j8253o335J337
13261G718l3094j4861J6386K1839O396Q737m120K047j7807J3390l508j94J7503
13248B0432Q092k7468j1845k2597M610K9246K7214l0844j0743O757J3294K6321
$$ y = [3175, 9034, -8399, -8339, -32005, -36427, 21000, 19867, 12503, 5585, -6390, -13087, 2504, -6275, -18991, -31793, -19819, 25416, 39822, 22892, 9884, 18412, 24674, 29506, 27178, 13350, 11769, -3917, -11160, 5440, -713, 7033, 31369, 13792, 28244, 52964, 53591, 51547, 36661, 25327, 42897, 51488, 53739, 55199, 25031, 7141, 21225, 26371, 43492, 35228, 20595, 21355, 17201, 23197, 42629, 51738, 26621, 919, -4269, 11074, 15959, 48557, 53247, 28386, 107, 6311, 11706, 11537, -2622, -6655, 1170, 3120, 575, -23235, -6328, 25456, 30969, 12716, 6381, 7718, -25376, -40237, -23851, -2012, 4384, 13121, 9001, 11048, -6759, 6631, 3123, 2929, 20432, 28524, 1056, -10789, -33386, -28776, 470, 27684, -3160, -13903, -7146, 6148, 32469]
13236C2469N416m4845L405N405j7723l4550J6625K2647Q707K3179j5849r214P167
13223B839K0837L0307L214k7378j0922j3092j5452O548Q300K5963K6509k213m1067
13210A4393l288N165j0593j2238q718r901q615J1913J2151n672j0199K3564K2978
13197B0940j2079j5614j2969N581J546l30J1489Q395p628K6022p204k0088q481
13184a0420K0874j3918J4335o03Q183J469q935J6197r600k6997j7219o538M484
13171b8688L2769J6748n326O313P287J29j9811k1205j5899o722J427K5157j2613
13158b0434k7701k7542m637J9352L6100R581N360Q37n343j0472K3000j2176j5187
13145b9262N121j0827n505J8449K73J721j5322n600L1102o992m2876M400O106
$$ y = [32469, 37885, -6960, -3555, 1850, -15873, -50423, -33798, -11151, -2444, 20735, 4886, -4328, 2839, 23676, 53983, 57197, 29819, 18897, 5805, -9647, -3099, 5201, 31164, 57673, 55460, 14393, 11105, 16270, 5677, -6561, -15279, -25180, -33795, -21882, -9731, -15403, -25602, -2038, 20940, 8861, -6753, -19722, -14141, -12595, -12925, -1436, 6959, -669, 25353, 18149, -1939, -10420, 10454, -3464, 10871, 10268, 18451, 19920, 10985, 27182, 17582, -9415, -26634, -33172, -28688, 4081, 20829, 15503, 21816, 29103, 29232, 9421, -11784, -27683, -34405, -32978, -7821, -20434, -48135, -75677, -80314, -60962, -24862, -15281, -9921, -9084, -14427, -24899, -1899, -14075, -29262, -24141, -34968, -40473, -22024, -21751, -20030, -35352, -40952, -9850, -16842, -59718, -55318, -49212]
13132d9212J1795N571k3044M708K3909m849k964K9115M5718j7404j7262j2280
13120f199O506K9057K2913J2916k808l4321j165n455m775J2170k24R535k6713
13107A1437K7172N2805j2667k7197j2832m602N877j5519l775j8508m250Q207J6548
13094B2696k0101j2124Q312K156p137m159K5050j6721l7697j4605J8420K2301
13082a3609j954O536J6780J6040J3306k3053j9385R929R268l0471K0534K020J626
13069G567O140n746N815J3118j0639l1184j7555J6120M235K6296N321Q140M715
13056C2343j2513k5608j2750J3492j814J1422o456K8330J7691k8896n978P739
13044A7002J530k2019J385J0240j2465j0975J5351P379K2503M49o1352O382k464
$$ y = [-49212, -37417, -31846, -54890, -50182, -26273, -31122, -34086, -4971, 40747, 23343, 6081, -6199, 307, 29364, 52277, 65193, 62385, 28064, 26899, 21444, 16669, 28839, 28615, 38150, 11437, 38609, 91414, 78747, 51550, 38718, 34116, 39993, 24474, 20699, 2191, -2059, 6148, 22696, 2595, -9529, -1217, 939, -6198, -10357, 14693, -2028, -39725, -54330, -35910, -13609, -15563, -9027, 7753, 23793, 37099, 14046, -5339, 4590, 13858, -16613, 3921, 5941, 7567, 13707, 7961, 13776, 26894, 16255, -14929, -32484, -16364, -12129, 14167, 19488, 27628, 32343, 19830, -5778, -18528, -5036, -6850, 4572, -1884, 26446, 44137, 15241, 9263, 17002, 18532, -3487, -2102, 8138, -4327, -15302, 49, 7428, 29931, 30380, -30972, -24590, -27054]
13031b7054J129J7256J4880J0394L47n938k1333j9880q989r10K1884K6806K4344
13018C2936j0352j3903k1332p191R265Q157J209k5655m330K3464j2564n166J7315
13005h147N881k1056k9359J3456m93K110K5889M477J9500J2994j4933p673j7183
12992a4537J2733K6332j6759l1941j9629o450J5773J5117n37R984q298j149K9725
12979A0364p220L646P940k1135j7528J5904K7571K156r859k2295j7834o333R059
12966b5564K7070n753j9470J0427J9793J3568J4521m049l7967j1401n017L957
12954a9885J947j872K0976L2297j7603q989J4856j1219P52J9399k3434Q086J2134
12941B7445l0517m480j2321J2226K6812o657j0040j818J1523J0036m411K6228
$$ y = [-27054, -25925, -8669, 6211, 16605, 16952, 11014, -10319, -30199, -39188, -40098, -18214, 8592, 32936, 22584, 8681, -12651, -19842, -10577, -2420, -1211, -26866, -31196, -7732, -20296, -25462, -8147, -2266, -23322, -52681, -39225, -39718, -37608, -11719, -7242, 12258, 25252, 10319, 2646, -14537, -1804, 24528, 7769, -24172, -43801, -50251, -34478, -19361, -19898, -9914, -18212, -19361, 10364, 3144, 6790, 14730, -6405, -23933, -8029, 19542, 21698, 11839, -10456, -28290, -34623, -25564, 1506, -4247, -23717, -13290, 6503, 20071, 34592, 30543, -7424, -18825, -23842, -19885, -17938, -19810, 1166, 33463, 15860, 6871, 21727, 10508, 11260, 30659, 7225, 15311, 27445, -3072, -7552, -19873, -7647, 19165, 12508, 2468, 650, 12173, 22209, 17798, 44026]
12929D4026J5415j1834j1791k2416O035J9047J6352m874l2216j6733o221J921
12917c289L0364J8851j692n6091l6396l4681O381L6998K5693J1511L620l193q687
12904a0611J4710J8961J3143k3064j6124n638J5363K5353J892k8800j530L2095
12892C5750j251l2489k0714K2788m128Q508k5901j61j293J5488L519j0046Q512
12879a418j1013j2645j3716J2616K2931K5448J5178k4308m2805J3987J5796M455
12867D506L761R007q104j8071J690k2352P621j5565K6879K442j5150N839P671
12854i826J7642O472j0696K822K851L097j1704J0045j1346p185K3701R598j722
12841B3749o726M025o047j6651r473j3478R236J1345k6423N969k0012j1114L1336
$$ y = [44026, 59441, 47607, 35816, 13400, 19435, 38482, 54834, 49960, 17744, 1011, -5210, -3289, 27075, 45926, 44234, -11857, -48253, -82934, -76553, -39555, -13862, -2351, 1269, -1924, -10611, 4099, 23060, 36203, 13139, -2985, -8623, 6740, 32093, 33985, 5185, 3655, 35750, 34499, 2010, -18704, 4084, -44, 8464, -17437, -17598, -18891, -3403, 116, -9930, -1418, -12431, -25076, -38792, -26176, -3245, 22203, 37381, 13073, -29732, -15745, 51, 4506, 8267, 17274, 9170, -8901, -7211, -29563, -21942, -37507, -10628, -8186, -23336, -17497, -9826, 7816, 14288, 3592, 6414, 9265, 12362, 658, 10703, -643, -7828, 15873, 25471, 23749, 17023, 21048, 15001, -1650, -11123, -24601, -15365, -4020, -30443, -24474, -44486, -55600, -24264]
12828b4264L3610O946k856m818J4319J4599L0306j6285j7328p789k9362O323m058
12815f57J4338J5601j4746j9744k4628j0383j5672J2106J5108J1968j0817J4453
12803a3073J664J4311j8614k4518j9824o836L0941J5572K8302J1445P229N971
12791C2570P740j4146k4365j410J8944Q207j7354J3651q149m924m128m227n244
12778b835M079J2849j1363l7423j6091R134Q682J3032M409M778J6921P836r754
12765D254p611p528j9250J2529K6359j9643L42L0880j744n507k2810j4126K770
12752b1085J1901j444L068K0744j7854L210J6223j8071k516n553n027R672j9531
12739b6263j4078N720M1513L1440n064j1476j0109n795k5853R0O089L349r874
$$ y = [-24264, 9346, 16292, 13436, 8618, 22937, 37536, 67842, 51557, 34229, 26440, -2922, 3401, -657, 13681, 29282, 14536, -5208, -29836, -40219, -55891, -43785, -28677, -16709, -27526, -13073, -11409, 2902, -15712, -40230, -60054, -66890, -35949, -20377, 7925, 19370, 26599, 32570, 40310, 26164, 1799, 389, 19333, 27540, 10186, 23837, 15688, 10764, 6636, 2409, -2835, 1244, 14093, 2730, -34693, -50784, -41650, -32968, -19936, -15527, -10749, 6172, 14008, 4254, -3357, -10885, -30135, -17606, 8753, -10890, -10548, 20332, 18588, 13081, -9729, -23855, -21085, -9184, -10628, -7560, 13184, -4670, -1460, 14763, -3308, -5824, -11377, -16404, -6732, -26263, -40341, -34621, 6892, 38332, 33268, 21792, 11683, 5888, -19965, -19875, -13786, -10437, -20311]
12726b0311j8148J1772J9516j8869l725J6308N834J6893m076K1473r57j8452l1870
12713b4612L233O578L8332K0890j0395k5254m187J9863j6304L055L4713o428k2830
12700A6654m749m073K3414r377k2532j6667M397Q051j3680o153M2857L9156M050
12687F1348q982j9330q08L3180j3317l3403l4980j1304J9797J4924m839k2911
12675b0625k9337J7633P968L2732J6907J537l363m2848l7163J2006J0685J8507
12663a5361K7067k038K82j8741j0381O008j9392L004p957P572N365L530K6252
12650E210p09j7275j4137k2336J1435K0362m697N350K4758K856k945j4407J456
12637e079j4283N700N265K313n403N566J2897M022m867M811l2463P741N06m801
$$ y = [-20311, -38459, -26687, -7171, -26040, -29765, -13457, -7623, 9270, 5194, 26667, 25710, 7258, -24612, -21379, -14801, 23531, 44421, 34026, 8772, 4585, 24448, 8144, 11199, 45912, 39484, 16654, 11905, 7832, 31246, 21869, -663, -17330, -12933, -4882, -18562, -24715, 18142, 57298, 61348, 52366, 33036, 32228, 65408, 52091, 18688, -16292, -27596, -7799, 7125, 2286, -20625, -49962, -32329, -24361, 8371, 25278, 26815, 23452, -19396, -56559, -44553, -33868, -15361, 11706, 9668, 9950, -8791, -19172, -13164, -32556, -29552, -37509, -29937, -24572, -21042, 5210, 4501, -12774, -26911, -49247, -37812, -17450, -22147, -16797, 7961, 10817, 7872, -6535, -5079, -19362, -13662, -8397, -6084, -11487, -5921, 6976, 10998, 6131, 10942, -21521, -13780, -13274, -18075]
12623a8075J1151L3444J89l2277j83j865K1529J1407j4321J2754p372n3164j7030
12610e3813L5739J9249j0526K738K7366J9293j1698l2595J788j261J3674K090
12598A2044k4645r954n741J0375N072J0667r1P924P594J0264l250J3194j3248
12585B0205K049m062j4703J7252L863j4853j3682k2289l46j7955m26K871K1274
12572b0802K036L4482j9705l4936j855m637M212K5374K3148k9365k3085j1249
12560e6382N135L731k0596r557L1152M0952M6629K5037O590k3473j7327j1547
12548B0344N459j5730l1744P79K3017m719m984N106K565L501j0409m804N921J8189
12534A2491J6656k30p231k2974j3889K4718J1622n399j0656J181O630r286J5786
$$ y = [-18075, -6924, 26520, 26709, -5568, -5751, -7616, 13913, 25320, 10999, 23753, 16381, -36783, -53813, -18074, 1175, -9351, -6613, 20753, 40046, 28348, -4247, -2459, -3720, 9954, 12044, -12601, -22555, -28296, -17921, -12849, -2182, -2273, 5651, 13245, 23509, 20259, 33453, 20205, 22254, 18192, 3489, 20741, 24604, 9751, -3931, -26220, -26566, -44521, -44947, -42076, -20802, -18766, 15716, -3989, -38925, -40780, -45417, -41205, -15831, 7317, -22048, -45133, -56382, -51247, -47516, -68112, -77669, -46517, -5565, 41064, 66101, 72691, 49218, 31891, 20344, 25803, 10073, -21671, -20892, 2125, -2594, -7578, -2472, 93, 3594, -6815, -11619, -5698, 12491, 29147, 28917, 21686, -1288, -15177, 9541, 21163, 15764, 5108, 6289, 12919, 3633, 19419]
12521A9419K7002j1065M471l9148j3099L7140k2312j6130m321N171J2560J6716
12509A6404l052k7533j5316j3254m041j4133J020M638J6878L1905K7714m109M319
12496B1440K250q048Q695j0302M945J6451K2081J031o519j1635j1159j8983r385
12483H62J2712J0328r205P06R034n558J9316L312k7520k5944L865N542l827k5306
12469c1683l4565o427M4955L447j6072K0678J9250J7815j856j1559l977K0145
12457B0151n470J1131O435m823R503j5550j1806J0540j1392l3675P242R644J0634
12444B564J21J4395Q037j2462m0256R4O053K1199j8661j2165q022L1089Q067P2
12430A25M953o998j1304J0622k4566O12L6547j152j1986j4405J0796K8269n901
$$ y = [19419, 46421, 35356, 39827, 679, -12420, 24720, 2408, -13722, -18043, -12872, -312, 16404, 13352, -14181, -29497, -42751, -46792, -60925, -59905, -55267, -38389, -6484, 21230, 17121, 21440, 23690, 15642, 24337, 14035, 18980, 35431, 57512, 58543, 52024, 40389, 29230, 10247, 862, 13574, 23902, 14697, 15403, 24437, 18879, 38195, 41507, 13987, -11957, -8092, -2550, -6377, -31683, -66248, -72675, -27720, -24273, -40345, -19667, -417, 17398, 15542, 3983, 6, 20151, 14681, 25812, 32247, 27424, 36927, 21377, 9571, 20111, 8719, -24956, -17714, -8070, 2564, 2685, 17080, 25117, 12655, -27601, -27507, -21454, -255, -18916, -31081, -39103, -8014, 53, 125, 5078, -1920, -13224, -2602, -27168, -26556, 9991, 8839, -3147, -17552, -6756, 21513, 15612]
12417A5612j4379J026Q763J1568O916k813j7788j6681l418O198j8658L214K2704
12404B264L1654k8454m3866Q885K1703J0372o245r588K8099j3470o073j7145J053
12391b0811K8111K8057o639q739q414N748j0737k5717N762N202j2908O169J9188
12378D272J1993P912j5647j5170j0520J3495K6473k2787n375J7095J7387r376
12366A9752k5912L058J1049j189J6660l1837l1101j5430J4352K0555L758j681
12354a7966J8077J1193k387j8107j4207j1990L3310j066q268k102J0850M5395
12342D2732j6264l5362j5633L1258J1153R01o761q867j5418k3165K3725K5404
12330A3703M185J1617J101m290j1288K1286j010N98p842j3709q125j5519J0140
$$ y = [15612, 1233, 2259, 11022, 22590, 29506, 26693, 8905, -7776, -11194, -4996, -23654, -20440, 2264, 33918, 5464, -38402, -29517, -7814, 2558, -3687, -13275, 14824, 1354, -4719, -21864, -20811, 7300, 35357, 28718, 19979, 11565, 17313, 6576, -19141, -13379, -8177, -21085, -14916, 4272, 16265, 24177, 8530, -6640, -17160, -3665, 22808, 21, -5354, 11741, 29128, 19752, -6160, -3102, 7947, 6758, 23418, -8419, -39520, -54950, -40598, -20043, -16285, -17966, 111, 11304, 8917, -9190, -23397, -35387, -2077, -3143, -11411, -13513, -2663, 42732, 26468, -8894, -24527, 6731, 17884, 18785, 12024, 3157, -12261, -35426, -11701, 13703, 17888, 29505, 30606, 26316, 15028, 36314, 35304, 35902, 28060, 14351, 6226, -9293, 847]
12317H47l1293j4364J8708J1978J4825J9062j8755k1277o957Q632J9714r713o708
12304a5301J0913Q63l1438J6059K8259n535l8315k4948K1526J4780k0833J267
12292d2703L1052K7372R040j7775j5191j894r102p555R574J5806J294q090L0718
12279B2546M0587o169k1386r995P248k3908k1106k250J0842n98j0732q708j5845
12266c9474P914o666J8379L0774J4319j0505j3645j236o295j279j5982J4540J4421
12253E265J4467j6733j0009p689J8602q048q842L819J7210J7033j4191k4909j1916
12240b5941J0901R80J0674P244K1409j6375j8809o838K3742L0665K0804Q825K652
12227F9933k0084k8944l1460j0922p70q058j1017J105J4892J4152M919K5501K737
$$ y = [847, -30446, -44810, -26102, -14124, 701, 19763, 1008, -20269, -27226, -18594, 1120, -8593, -15301, -4388, -3525, -34963, -18904, 9355, 3820, -34495, -59443, -37917, -23137, -43970, -42703, -11651, 15721, 24761, 6986, -8205, -10099, -19201, -26756, -17182, -1376, -82, -8172, 22546, 63133, 56964, 35578, 25583, 32831, 8923, -12183, -14433, -3591, -4189, -14921, -23629, -39474, -31560, -38226, -19847, 10927, 25246, 14741, 1096, -140, -6435, -7714, -23696, -9156, 5265, 19732, 2999, -7010, -14699, 3903, -4145, -12987, -9168, 8042, 25075, 10884, -14025, -25941, -15040, -14060, -3386, 3858, 25267, 8892, -9917, -16755, 6987, 37652, 58456, 67281, 69933, 49849, 20905, -10555, -21477, -22247, -30305, -41322, -40217, -25325, -11173, -6254, 19247, 21984]
12214B1984j177P926M599J866l8444j4110m274k0073m124J234K2718p144r490
12201c8509J0422k570r893K3k100l038J443m133q20K2611K2872n156K8596K1885
12187D1633q937l4531q754j1371J4880j1150j7699O464J4623O630j1191J9932
12175E29K6939R995J705j1296j1273j3341k2329k0871L9175L6819K2881q690j2493
12162C7750L235R581k7681k9228k4467j2161O175n551R386K8646K9397K6606k7587
12149B4101k6036l640j7749l9441l0867O608O867K5636J3874L9658P020L6081
12137D2112J3776k990Q60l0815l0172J1735j8786j8496o572k478J4366J3032J1088
12124c340o408N083j401r299J1555R192o520k5210J5430K0528J852j9336N944
$$ y = [21984, 20807, 28733, 33332, 35198, -3246, -17356, -21630, -41703, -45827, -44593, -21875, -29019, -38509, -28087, -30657, -40550, -40527, -42627, -45665, -44222, -48355, -49175, -26564, -3692, -8848, 19748, 41633, 32696, -1835, -10589, -21960, -7080, -18230, -35929, -29465, -14842, -8212, -19403, 529, 27468, 37463, 39168, 27872, 16599, 3258, -19071, -39942, -767, 36052, 58933, 50243, 37750, 40985, 50566, 22885, -6343, -30810, -42971, -36796, -42347, -32961, -4315, 25082, 51688, 24101, -1935, -5575, -23324, -62765, -93632, -87024, -80157, -54521, -40647, -989, 6031, 42112, 55888, 52898, 53758, 22943, -7229, 4506, -14280, -32776, -39348, -41826, -27460, -14428, -3340, -9748, -4665, -6066, -15365, -3810, 5382, -1138, -26348, -10918, 9610, 11462, -7874, -1930]
12111a930j1317K7531L2208L749L622J0017j6665l5919l9639p779N5206j379k8184
12098a0479N995L1625J3825j4386k9785m282K667j1799L4008K7850J5470O24l8168
12085B3165j8070r940j327k324J650j5333N045J6269J0319N04q219k087J791J8837
12071B0280o419j2582P548O873j245k7456j6241J0163J7168J3974j8444k8048
12059c4429n147M7706K6378j0998p565k5695q720J5992K3981k9080m6111r881
12047f3569M724J8912K3578J0725K3633Q342k925P618l3351l1002Q316P142k448
12034b0305j8114L364J8720M4670J7596R988J3925k2375l6450j0628K1181N294
12022B6866k7153j5142P724J100q239J6295R01j2119q538K4212j0149K10J0966
$$ y = [-1930, -13247, 14284, 46492, 50241, 53863, 63880, 47215, 11296, -28343, -36122, 19084, 17705, -10479, -4484, 27141, 40966, 26580, -3205, -7487, -4820, -16619, 17389, 45239, 60709, 61333, 23165, 5095, -4845, -6172, -8496, -6846, -22179, -17134, -865, 9454, 9958, 1739, -348, 1443, 20280, 13861, 1279, 8827, 15700, 14455, -13001, -29242, -19079, -1911, 12063, -6381, -34429, -39576, 8130, 34508, 23510, 15945, -9750, -18470, -2478, 21503, -7577, -53688, -63569, -58845, -39933, -16355, -5630, 18003, 26345, 23420, 31038, -2313, -33315, -24999, -17857, -20305, -38419, -35055, -16335, 28335, 45931, 55919, 69844, 47469, 11019, 391, 21572, 26866, -287, -15429, -7705, -6605, -14844, 1451, 2352, -9767, -18305, 5907, -4242, -4032, 6934]
12009F934k6246l6011j0940K3968L3168k6452n453K6443K2123l737o66m142O277
11996E266p625n653K5640L4074J984l0424j7254p302k0064k7921k3387n399J0353
11983f7712J8213K368J7028J6824L4549M488l2468m046m660J1783J2261j824k2298
$$ y = [6934, -19312, -55323, -66263, -42295, -9127, -35579, -41032, -14589, 7534, 3797, 3131, -1011, 5266, -2359, -8012, 17628, 51702, 53686, 23262, 6008, -1294, -21358, -49279, -72666, -78065, -67712, -49499, -47131, -30103, -13279, 21270, 25758, -6710, -10756, -15416, -3633, 8628, 6804, -15494]
$$ [...]
##END NTUPLES=NMR SPECTRUM
##END=
