##TITLE=Analysis number 315482
Compound Code cc 23124
Book Reference 423/44/6
Project Code adrs
Chemist Name bruced
##JCAMPDX= 6.0         $$ Bruker NMR JCAMP-DX V2.0
##DATA TYPE= NMR SPECTRUM
##DATA CLASS= NTUPLES
##ORIGIN= Bruker BioSpin GmbH
##OWNER= NMR
$$ XWIN-NMR		Version 3.5
$$ Mon Nov 21 13:52:23 2005 GMT Standard Time (UT+0h)  MAYBRIDGE\NMR@NMR_250MHZ
##.OBSERVE FREQUENCY= 250.131544655141
##.OBSERVE NUCLEUS= ^1H
##.ACQUISITION MODE= SIMULTANEOUS (DQD)
##.ACQUISITION SCHEME= undefined
##.AVERAGES= 16
##.DIGITISER RES= 18
##SPECTROMETER/DATA SYSTEM= dpx250
##.PULSE SEQUENCE= zg30
##.SOLVENT NAME= CDCl3
##.SHIFT REFERENCE= (INTERNAL, CDCl3, 0, 16.522)
##AUDIT TRAIL= $$ (NUMBER, WHEN, WHO, WHERE, WHAT)
$$ ##TITLE= Audit trail, XWIN-NMR		Version 3.5
$$ ##JCAMPDX= 5.01
$$ ##ORIGIN= Bruker BioSpin GmbH
$$ ##OWNER= NMR
$$ C:\u/data/dgb/nmr/ADRS/12740/pdata/1/auditp.txt
$$ ##AUDIT TRAIL=  $$ (NUMBER, WHEN, WHO, WHERE, WHAT)
(   1,<2005-11-21 13:51:42.42 +000>,<MAYBRIDGE\NMR>,<NMR_250MHZ>,
      <created by zg, POWCHK disabled, PULCHK disabled
       configuration hash MD5:
       62 19 C7 07 E1 42 D1 B7 37 6C 3D D0 77 39 F9 E6
       data hash MD5: 64K
       88 C2 A8 9A FD E9 D0 EE 26 FA A9 94 1B 48 1C C3>)
(   2,<2005-11-21 13:52:00.59 +000>,<MAYBRIDGE\NMR>,<NMR_250MHZ>,
      <Start of raw data processing
       ef LB = 0.3 FT_mod = 6 PKNL = 1 SI = 32K 
       data hash MD5: 32K
       E5 87 5A 10 64 EA B8 46 5C 32 21 38 A9 E7 40 DF>)
(   3,<2005-11-21 13:52:05.85 +000>,<MAYBRIDGE\NMR>,<NMR_250MHZ>,
      <apk 
       data hash MD5: 32K
       A1 F1 35 7B 48 61 B9 1D 2A 14 40 0A 50 E5 3D 17>)
(   4,<2005-11-21 13:52:07.42 +000>,<MAYBRIDGE\NMR>,<NMR_250MHZ>,
      <abs ABSG = 5 
       data hash MD5: 32K
       65 9F AC 59 1B 2B F8 8E 81 2A 48 4C 4A 89 51 C7>)
$$ ##END=
$$ 
$$ hash MD5
$$ A0 F1 EB 32 37 23 33 C7 6C 0A E8 4D EB C6 CD E9
##$RELAX= 
##$RELAX= 
##$RELAX= 
##$RELAX= 
##$RELAX= 
##$RELAX= 
##$RELAX= 
$$ Bruker specific parameters
$$ --------------------------
##$DU= <C:\u>
##$EXPNO= 12740
##$NAME= <ADRS>
##$PROCNO= 1
##$TYPE= <nmr>
##$USER= <dgb>
##$AMP= (0..31)
100 100 100 100 100 100 100 100 100 100 100 100 100 100 100 100 100 100 
100 100 100 100 100 100 100 100 100 100 100 100 100 100 
##$AQSEQ= 0
##$AQ_mod= 3
##$AUNM= <au_zg>
##$AUTOPOS= <28 >
##$BF1= 250.13
##$BF2= 250.13
##$BF3= 250.13
##$BF4= 250.13
##$BF5= 500.13
##$BF6= 500.13
##$BF7= 500.13
##$BF8= 500.13
##$BYTORDA= 1
##$CFDGTYP= 0
##$CFRGTYP= 5
##$CHEMSTR= <none>
##$CNST= (0..31)
1 1 145 1 1 1 1 1 1 1 1 1 1 1 1 1 1 1 1 1 1 1 1 1 1 1 1 1 1 1 1 1 
##$CPDPRG= <>
##$CPDPRG1= <>
##$CPDPRG2= <>
##$CPDPRG3= <>
##$CPDPRG4= <mlev>
##$CPDPRG5= <mlev>
##$CPDPRG6= <mlev>
##$CPDPRG7= <mlev>
##$CPDPRG8= <mlev>
##$CPDPRGB= <>
##$CPDPRGT= <>
##$D= (0..31)
0 1 0 0 0 0 0 0 0 0.06 0 0 0 0 0 0 0.0002 0 0 0 0 0 0 0 0 0 0 0 0 0 0 
0 
##$DATE= 1132581100
##$DBL= (0..7)
120 120 120 120 120 120 120 120 
##$DBP= (0..7)
150 150 150 150 150 150 150 150 
##$DBP07= 0
##$DBPNAM0= <>
##$DBPNAM1= <>
$$ [...]
##$SUBNAM7= <"">
##$SUBNAM8= <"">
##$SUBNAM9= <"">
##$SW= 20.6930455092707
##$SWIBOX= (0..15)
0 0 3 0 0 0 0 0 0 0 0 0 0 0 0 0 
##$SW_h= 5175.983436853
##$TD= 65536
##$TD0= 1
##$TE= 294.16
##$TE2= 300
##$TE3= 300
##$TEG= 300
##$TL= (0..7)
0 120 120 120 120 120 120 120 
##$TP= (0..7)
150 150 150 150 150 150 150 150 
##$TP07= 0
##$TPNAME0= <>
##$TPNAME1= <>
##$TPNAME2= <>
##$TPNAME3= <>
##$TPNAME4= <>
##$TPNAME5= <>
##$TPNAME6= <>
##$TPNAME7= <>
##$TPOAL= (0..7)
0.5 0.5 0.5 0.5 0.5 0.5 0.5 0.5 
##$TPOFFS= (0..7)
0 0 0 0 0 0 0 0 
##$TUNHIN= 0
##$TUNHOUT= 0
##$TUNXOUT= 0
##$USERA1= <user>
##$USERA2= <user>
##$USERA3= <user>
##$USERA4= <user>
##$USERA5= <user>
##$V9= 5
##$VALIST= <valist>
##$VCLIST= <CCCCCCCCCCCCCCC>
##$VD= 0
##$VDLIST= <DDDDDDDDDDDDDDD>
##$VPLIST= <PPPPPPPPPPPPPPP>
##$VTLIST= <TTTTTTTTTTTTTTT>
##$WBST= 1024
##$WBSW= 4
##$XGAIN= (0..3)
0 0 0 0 
##$XL= 0
##$YL= 0
##$YMAX_a= 496482
##$YMIN_a= -391574
##$ZGOPTNS= <>
##$ZL1= 120
##$ZL2= 120
##$ZL3= 120
##$ZL4= 120
##$ABSF1= 16.522
##$ABSF2= -4.171173
##$ABSG= 5
##$ABSL= 3
##$ALPHA= 0
##$AQORDER= 0
##$ASSFAC= 0
##$ASSFACI= 0
##$ASSFACX= 0
##$ASSWID= 0
##$AUNMP= <proc_1d>
##$AZFE= 0.1
##$AZFW= 0.1
##$BCFW= 0
##$BC_mod= 0
##$BYTORDP= 0
##$COROFFS= 0
##$CY= 12.5
##$DATMOD= 1
##$DC= 0
##$DFILT= <>
##$DTYPP= 0
##$F1P= 14.0000005364418
##$F2P= -0.99999901652339
##$FCOR= 0.5
##$FTSIZE= 32768
##$FT_mod= 6
##$GAMMA= 0
##$GB= 0
##$INTBC= 1
##$INTSCL= 1
##$ISEN= 128
##$LB= 0.3
##$LEV0= 0
##$LPBIN= 0
##$MAXI= 10000
##$MC2= 0
##$MEAN= 0
##$ME_mod= 0
##$MI= 0
##$NCOEF= 0
##$NC_proc= -2
##$NLEV= 6
##$NOISF1= 0
##$NOISF2= 0
##$NSP= 0
##$NTH_PI= 0
##$NZP= 0
##$OFFSET= 16.522
##$PC= 1
##$PHC0= 80.22343
##$PHC1= 10.88599
##$PH_mod= 1
##$PKNL= yes
##$PPARMOD= 0
##$PSCAL= 4
##$PSIGN= 0
##$REVERSE= no
##$SF= 250.13
##$SI= 32768
##$SIGF1= 0
##$SIGF2= 0
##$SINO= 400
##$SIOLD= 32768
##$SREGLST= <1H.CDCl3>
##$SSB= 0
##$STSI= 32768
##$STSR= 0
##$SW_p= 5175.98343685301
##$SYMM= 0
##$S_DEV= 0
##$TDeff= 65536
##$TDoff= 0
##$TI= <Analysis number 999999
Compound Code 99
Book Reference 9
Project Code 9>
##$TILT= no
##$TM1= 0
##$TM2= 0
##$TOPLEV= 0
##$USERP1= <user>
##$USERP2= <user>
##$USERP3= <user>
##$USERP4= <user>
##$USERP5= <user>
##$WDW= 1
##$XDIM= 32768
##$YMAX_p= 273075514
##$YMIN_p= -71179
$$ End of Bruker specific parameters
$$ ---------------------------------
##NTUPLES= NMR SPECTRUM
##VAR_NAME=  FREQUENCY,     SPECTRUM/REAL,   SPECTRUM/IMAG
##SYMBOL=    X,             R,               I
##VAR_TYPE=  INDEPENDENT,   DEPENDENT,       DEPENDENT
##VAR_FORM=  AFFN,          ASDF,            ASDF
##VAR_DIM=   32768,         32768,           32768
##UNITS=     HZ,            ARBITRARY UNITS, ARBITRARY UNITS
##FACTOR=    0.157963299565203, 1,           1
##FIRST=     4132.6476996994, 0,             0
##LAST=      -1043.33573715361, 0,           0
##MIN=       -1043.33573715361, -71179,      0
##MAX=       4132.6476996994, 273075514,     0
$$ Real data points
##PAGE= N=1
##DATA TABLE= (X++(R..R)), XYDATA
$$ [...]
20010c638J4048R681J5426n614j1215L825Q281M8q058n350j6636R649J9505K811
$$ -3638 10410 20091 35517 29903 18688 22513 30794 30842 22784 17434 798 10447 29952 32763
19996C2763j0224k0317j103P057Q694O839n389l0091k4741M811P124J3788P563
$$ 32763 22539 2222 1119 8176 16870 23709 18320 -11771 -36512 -31701 -24577 -10789 -3226
19983c226J3457o439P468Q956p929j4677J1982L871q565j414k266j1202k710j303
$$ -3226 10231 3792 11260 20216 12287 -2390 9592 13463 4898 3484 1218 -9984 -12694 -13997
19969a3997j1388J1255J8465O877j6170Q006J8773J8695Q269k1250q846P024p1
$$ -13997 -25385 -14130 4335 11212 -4958 3048 21821 40516 48785 27535 18689 25713 25642
19956B5642j0554o163j9542j935J0210q190r766M560l747N547O427p135m374J8805
$$ 25642 15088 8925 -10617 -12552 -2342 -10532 -20298 -15738 -19485 -13938 -7511 -14646 -19020 -215
19942b15J2166j4417o125J2553j981j103p772j1940R827n807q90Q345P180L566
$$ -215 11951 -2466 -8591 3962 1981 878 -6894 -18834 -9007 -14814 -15704 -7359 -179 3387
19928C387p657j0623R328P055l008j0332p091J2142J3311j4074O598P374k157
$$ 3387 -4270 -14893 -5565 1490 -1518 -11850 -18941 -6799 6512 -7562 -964 6410 4253
19915D253n249o739O710o795P989Q806q599p69j0162p643n16P009J7777J1953
$$ 4253 -996 -7735 -1025 -7820 169 8975 376 -393 -10555 -18198 -18714 -11705 6072 18025
19901A8025R136J682j9069l644q351K186m7k0058N975R335L245o492j3808J2019
$$ 18025 27161 28843 9774 6130 -2221 -35 -82 -20140 -14165 -4830 -1585 -8077 -21885 -9866
19887i866K9461J3178r906j6465j0318K57J2786J7205k612j93p184j3917P799
$$ -9866 19595 32773 22867 6402 -3916 -3659 9127 26332 23720 23527 16343 2426 10225
19874A0225m481m254R430Q665k073r52j2798q912r423j646J992n66j646J2783
$$ 10225 5744 1490 10920 19585 17512 16560 3762 -5150 -14573 -16219 -14227 -14793 -16439 -3656
19860c656M979j5023o561m736K255K0689L803j1301k096j5515M414Q152N795J0204
$$ -3656 1323 -13700 -20261 -24997 -22742 -2053 1750 -9551 -11647 -27162 -22748 -14596 -8801 1403
19846A403q211k979J738m771j2522R659K1095N206L184j951p805j0445J946Q367
$$ 1403 -6808 -9787 -8049 -12820 -25342 -15683 5412 10618 13802 11851 4046 -6399 -4453 3914
19832C914M646l590R8k2144j1512N828K6200K1468r811j4867N860J005J8649j4126
$$ 3914 8560 4970 5068 -17076 -28588 -22760 3440 24908 15097 230 6090 7095 25744 11618
19818A1618q796k774j0249p601N476Q441K640N232K186J086J6231N683k041q890
$$ 11618 2822 48 -10201 -17802 -12326 -3885 -1245 3987 6173 7259 23490 29173 27132 18242
19804A8242k0650R868O305J568L35j0049N19J8443L26m960Q676M9j0076j8877
$$ 18242 -2408 7460 13765 15333 15668 5619 6138 24581 24907 19947 28623 28672 18596 -281
19790b81J503P215r406K581R868J4202J2253j3356j0157K002J2346M423Q91L075
$$ -281 1222 8437 -969 1612 11480 25682 37935 24579 14422 16424 28770 33193 34084 37159
19776C7159r630j4501q784k061r368J1665R302j6923k435J6261n777K978Q232
$$ 37159 27529 13028 4244 2183 -7185 4480 13782 -3141 -5576 10685 4908 7886 16118
19763A6118M35j4641j3373p214q353L783j729m515J0085q51J3754K0546J6576
$$ 16118 16553 1912 -11461 -18675 -27028 -23245 -24974 -29489 -19404 -20255 -6501 14045 30621
19750C0621J3442l233j5364j1826n569N340p538m432O380k3330j225J772R849
$$ 30621 44063 40830 25466 13640 8071 13411 5873 1441 7821 -15509 -16734 -14962 -5113
19737e113J4874o626J947K3793O531j051O431r104K212M876q806L794l974n783
$$ -5113 9761 3135 5082 28875 35406 34355 40786 31682 33894 38770 29964 33758 29784 24001
19723B4001r215n622k105K1232p748j4196J3668j0126j1146J1952O208J1353n186
$$ 24001 14786 9164 7059 28291 20543 6347 20015 9889 -1257 10695 16903 28256 23070
19710B3070j5474j0996J221j538j1536P236K6070M000N974k004L257j174N509
$$ 23070 7596 -3400 -2179 -3717 -15253 -8017 18053 22053 28027 26023 29280 28106 33615
19697C3615l810k131J763K75m325j719J824M077j9702j605P607l12p553n761J473
$$ 33615 29805 27674 29437 29712 25387 23668 25492 29569 9867 8262 15869 15557 8004 2243 3716
19682C716L772q952M447K791L241J1529J838j0285m040N434l184R998j4187L590
$$ 3716 7488 -1464 2983 5774 9015 20544 22382 12097 8057 13491 10307 20305 6118 9708
19668I708R666J1050j1225j0191K194k386J85L451l660J3163j527j002K024m980
$$ 9708 19374 30424 19199 9008 11202 8816 9001 12452 8792 21955 20428 19426 21450 16470
19654A6470j4173o072N243M407O993J8480P497j2376K213K8186J7360j7754k8047
$$ 16470 2297 -3775 1468 5875 12868 31348 38845 26469 28682 56868 74228 56474 28427
19641B8427M407R54O371M045j6628j3075j3385n300R503K1551J5777P583K763
$$ 28427 32834 33788 40159 44204 27576 14501 1116 -4184 5319 26870 42647 50230 52993
19628E2993k0030j0725R35J121j4684l58j463O677L115j0748L691J6515J0135
$$ 52993 32963 22238 23173 24294 9610 9252 7789 14466 17581 6833 10524 27039 37174
19615C7174j1163N645j9533J905N750n789Q095Q319o990Q485J1631j2630o689
$$ 37174 26011 31656 12123 14028 19778 13989 22084 30403 23413 31898 43529 30899 24210
19602B4210j0976p846q757p872J0152p70N981M610j1400j3835L538M146O098R939
$$ 24210 13234 5388 -3369 -11241 -1089 -1859 4122 8732 -2668 -16503 -12965 -8819 -2721 7218
19588G218J8423J1439j2930m690j1972Q94p585O789J9170l97j706n228L94J0910
$$ 7218 25641 37080 24150 19460 7488 8382 797 7586 26756 26359 24653 19425 19819 30729
19574C0729N333p256j216O279N278M944j6985k12r083P370q842J193M629J1318
$$ 30729 36062 28806 27590 33869 39147 44091 27106 26894 17811 25181 16339 17532 22161 33479
19560C3479m327j1521j4008j3099j3508J247J3142J9112J9833M71j48j8647k9423
$$ 33479 29152 17631 3623 -9476 -22984 -21737 -8595 10517 30350 30821 30673 12026 -17397
19547a7397J3857K3168n152k258q619M300N530m392l435L754K0390j2099j1809
$$ -17397 -3540 19628 14476 12218 3599 7899 13429 9037 5602 9356 29746 17647 5838
19534E838J1641J3754P905j6851Q210O24o323l4965j6730k869L160O793J2311
$$ 5838 17479 31233 39138 22287 30497 31121 24798 -10167 -26897 -29766 -26606 -19813 -7502
19521g502J3108j605J910N784J6393J067K805M408kj167n877j163k063j7891Q66
$$ -7502 5606 4001 5911 11695 28088 29155 31960 36368 36366 35199 29322 28159 26096 8205 9071
19506I071O60N677m211K1897R206l753j9279J757j3052K2057J8430j1226j432
$$ 9071 9731 15408 11197 33094 42300 38547 19268 21025 7973 30030 48460 37234 35802
19493C5802J014N717k801p798j0552n899k590N636j0029r721j6732l188J960m92
$$ 35802 36816 42533 39732 31934 21382 15483 12893 18529 8500 -1221 -17953 -21141 -19181 -19673
19479a9673M781Q574Q511K6258l532R444n897r236K435j824l293r320K850J5567
$$ -19673 -14892 -6318 2193 28451 24919 34363 28466 19230 21665 19841 16548 7228 10078 25645
19465B5645P083j1203r861m464J1469r24n774R945N624j4546j1219J908N704R078
$$ 25645 32728 21525 11664 7200 18669 17745 11971 21916 27540 12994 1775 3683 9387 18465
19451A8465p845JJ7723j4877k9402j150J0945J3756M873r07l681j0562p009J3883
$$ 18465 10620 10621 28344 13467 -15935 -17085 -6140 7616 12489 11582 7901 -2661 -9670 4213
19437D213K1435O496q63k0156r581K4374r850j0435m867M245P494M751j3340l428
$$ 4213 25648 32144 31281 11125 1544 25918 16068 5633 766 5011 12505 17256 3916 488
19423D88L87K927k762k532J0208q76q073p520J972K809J4797J1467k6601j5635
$$ 488 875 3802 1040 -1492 8716 7840 -233 -7753 -5781 -2972 11825 23292 -3309 -18944
19409a8944J1419R526P775p848j77j2334O758J7327J2135O585Q009l411j9173
$$ -18944 -7525 2001 9776 1928 1751 -10583 -3825 13502 25637 32222 40231 36820 17647
19396A7647j8492Q633K289p489p775M528P978p21L379N565N061M985j873k620
$$ 17647 -845 7788 10077 2588 -5187 -659 7319 6598 9977 15542 20603 25588 23715 21095
19382B1095k1458j3080O204m53J9332K3279M144k1596q609J4527K606L46Q446
$$ 21095 -363 -13443 -7239 -7692 11640 34919 39063 17467 8858 23385 25991 26337 34783
19369C4783q083J609M325r847j2937J842j0027l191J8028J999M962J2179L211
$$ 34783 26700 28309 32634 22787 9850 11692 1665 -1526 16502 18501 23463 35642 38853
19356C8853k0104j1754k460p76k086r29o115J163J8713M514k645o114j139J6809
$$ 38853 18749 6995 4535 3759 1673 744 -5371 -4208 14505 19019 16374 10260 9121 25930
19342B5930R197k1019k542J0855J4717L763o198j3905l703J376j390j391O713
$$ 25930 35127 14108 11566 22421 37138 40901 34703 20798 17095 18471 17081 15690 22403
19329B2403J0500M146k1891j933m142j1069r621j4554n384J9023J0020M443R022
$$ 22403 32903 37049 15158 13225 9083 -1986 -11607 -26161 -31545 -12522 -2502 1941 10963
19316A0963R733M830J4588l927q580m938R10J4268j9588j0747K6722L0718l409
$$ 10963 20696 25526 40114 36187 27607 22669 23579 37847 18259 7512 34234 64952 61543
19303F1543k0199n587p387j5167m681R277r553R297J6163j8408j5272p698M631
$$ 61543 41344 35757 28370 13203 8522 17799 8246 17543 33706 15298 26 -7672 -3041
19290c041l935q948N51K8909L1911N9m554r358J044M635o130J5959k388j227m020
$$ -3041 -6976 -15924 -15373 13536 45447 45506 40952 31594 32638 37273 31143 47102 44714 43487 39467
19275C9467k061n933k481j5447K091L545j0073L913L752q648Q26Q382L080r764
$$ 39467 37406 31473 28992 13545 15636 19181 9108 13021 16773 8125 8951 17333 20413 10649
19261A0649j981J0638j5077j236J2579O360n64J0244P787j205n572L225J3951
$$ 10649 8668 19306 4229 2993 15572 21932 21368 31612 39399 38194 32622 35847 49798
19248D9798M441k0105j5594j4182J727P724Q421J8436l361Q117j2456R176R290
$$ 49798 54239 34134 18540 4358 6085 13809 22230 40666 37305 45422 32966 42142 51432
19235E1432L933m659r226r370p389l750j0846J0642K7865L204j908r84o285p546
$$ 51432 55365 50706 41480 32110 24721 20971 10125 20767 48632 51836 49928 48944 42659 35113
19221C5113L674L247M19n154K152K971r271j0338P602j982O783P530Q915J1406
$$ 35113 38787 42034 42453 37299 39451 42422 33151 22813 30415 28433 35216 42746 51661 63067
19207F3067k2842n35l307j7861j2878q633j9996K2244J6822K182Q199j5853O87
$$ 63067 40225 39690 36383 18522 5644 -2989 -22985 -741 16081 18263 26462 10609 11296
19194A1296N361K508J833L628K830J4439J2806j3627J452J2245J6693q583j7564
$$ 11296 16657 19165 20998 24626 27456 41895 54701 41074 42526 54771 71464 62881 45317
19181D5317j6012l191J1580J3498n524m777N677o563r98l595l467q9O707M24j4374
$$ 45317 29305 26114 37694 51192 45668 40891 46568 40005 39007 35412 31945 31856 38563 38987 24613
19166B4613m242O40j3747j5059J542Q845j0545l373k95J6604J1899J2010k795
$$ 24613 20371 21011 7264 -7795 -6253 2592 -7953 -11326 -11621 4983 16882 28892 26097
19153B6097J628L174r985n437M722j767M369R658L489j065j933q238K976r717
$$ 26097 27725 30899 20914 15477 20199 18432 22801 32459 35948 34883 32950 24712 27688 17971
19139A7971r496J1383L641q07o693L237R754j1493r709l067J1253n314j401J3754
$$ 17971 8475 19858 23499 22692 15999 19236 28990 17497 7788 4721 15974 10660 9259 23013
19125B3013N336J250k115j7397Q537R169L227J941p298m358J660J3614j0553j4448
$$ 23013 28349 29599 27484 10087 18624 27793 31020 32961 25663 21305 22965 36579 26026 11578
19111A1578j140J6391K907j0103O973j491J634L618r449r895O906k249K819J1766
$$ 11578 10438 26829 29736 19633 26606 25115 26749 30367 20918 11023 17929 15680 18499 30265
19097C0265J4293O130j1493r908l40j758K321J449J3849R182K448m764m140N658
$$ 30265 44558 50688 39195 29287 28947 27189 29510 30959 44808 53990 56438 51674 47534 53192
19083E3192O229Q03r852N526M230J0021J9071J4552K2967L4557M1252K3452L84
$$ 53192 59421 60224 50372 55898 60128 70149 89220 103772 126739 161296 202548 226000 226384
19070B26384K954r768j4645K5861M9028J1788j0151l1354m5921k5277j4419l7905
$$ 226384 229338 219570 204925 230786 279814 291602 281451 250097 204176 178899 164480 126575
19058A26575j7563j5547p576p565m128L4096L7898M3422M9991M8291J6893n158
$$ 126575 109012 93465 85889 78324 74196 108292 146190 189612 239603 287894 304787 299629
19046B99629l536K5771N0974N4892K3160M405j2460l9199k9789o739j2197j5677
$$ 299629 296093 321864 372838 427730 450890 455295 442835 403636 373847 367108 354911 339234
19034C39234o2330o3654l8008l1981k0338k4687j5951n953j0547k59r015p940
$$ 339234 276904 213250 175242 143261 122923 98236 82285 76332 65785 65526 56511 48571
19022D8571m871Q227j190j718L823Q763J5676L2422K3269L6273N2814L6436K510
$$ 48571 43700 51927 50737 49019 52842 61605 77281 109703 132972 169245 222059 258495 261005
19009B61005K618r745l3664k383M9586L2250k2750m1964l3656k5493k5823k2004
$$ 261005 263623 253878 220214 217831 267417 299667 276917 234953 201297 175804 149981 127977
18997A27977j7390r902q452j3704N994o392q672l141M977L011M474l643r171k1185
$$ 127977 110587 100685 92233 78529 84523 78131 69459 66318 71295 74306 78780 75137 65966 44781
18983D4781k620P257l69J2588q856O474j07O524J5391j7700j2645R835J5685L6764
$$ 44781 42161 49418 49049 61637 52781 59255 59148 65672 81063 63363 50718 60553 76238 113002
18969A13002M7039K7390R351j997k7037k4655j0954J8117K1377K6999J0989j6339
$$ 113002 160041 187431 196782 194785 167748 143093 132139 150256 171633 198632 209621 193282
18957A93282k3705j1007J392r383J2922L1843K3321J1195k9214l2810k8586n554
$$ 193282 169577 158570 159962 150579 163501 195344 218665 229860 200646 167836 139250 133696
18945A33696k1103j91K2100M1473Q107k1023j9955j0749q50p235k4778k6187j9329
$$ 133696 112593 112402 134502 175975 184082 163059 143104 132355 131505 124270 99492 73305 53976
18932E3976m46O135J3155k646k973J1647K212r417j1803j2194J2105M289p194
$$ 53976 53530 59665 72820 70174 67201 78848 81060 71643 59840 47646 59751 64040 56846
18919E6846j3012l870J1988J0871l762j2431n787R532J1009j3987n032j6724M242
$$ 56846 43834 39964 51952 62823 59061 46630 40843 50375 61384 47397 42365 25641 29883
18906B9883J3261J3465j277J3798n764j7330Q653K0798J3443o046m945k0761j6275
$$ 29883 43144 56609 55332 69130 63366 46036 54689 75487 88930 82884 77939 57178 40903
18893D0903k173l425R018P859j9431j2597J261j1012P172J0902j23P557J4223
$$ 40903 38730 35305 44323 52182 32751 20154 21415 10403 17575 28477 28354 35911 50134
18880E0134Q832J919p177j2754j1800M984J3852N547J4161K186l834K3409j519
$$ 50134 58966 60885 53708 40954 29154 34138 47990 53537 67698 69884 66050 89459 87940
18867H7940j3745K257j0977j9441O714P726n012m098N95j722M704k767j2646n328
$$ 87940 74195 76452 65475 46034 52748 60474 55462 51364 51959 50237 54941 52174 39528 34200
18853C4200J567K868n1L657J2346p145M521k357J9407K1268j0882o300k4122l0214
$$ 34200 35767 38635 38584 42241 54587 47442 51963 49606 69013 90281 79399 73099 48977 18763
18839A8763J2199K7549j95K336J6965L292Q776j7354O238K2729j0370L550J0543
$$ 18763 30962 58511 58316 60652 77617 80909 89685 72331 78569 101298 90928 94478 105021
18826A05021q237o628j2551o14l835j0435o532m155N567o626r954J4208K0895
$$ 105021 96784 90156 77605 76991 73156 62721 56189 52034 57601 50975 41021 55229 76124
18813G6124k317K271j484m837l027j6591N486M344j292P389O618L0138J4l369
$$ 76124 73807 76078 74594 69757 66730 50139 55625 59969 58677 66066 72684 102822 102836 99467
18799I9467j5771j188j2106J0565J0780J265k0510j2305R916J3013o214l321j5580
$$ 99467 83696 82508 70402 80967 91747 93012 72502 60197 70113 83126 76912 73591 58011
18786E8011j0334P957K1263J532j320J4174K831j4259j6540R716J0812j717O576
$$ 58011 47677 55634 76897 78429 77109 91283 94114 79855 63315 73031 83843 82126 88702
18773H8702K4135M5r20q9P613P465M705K9181L5672O1924J1958j6363k3165l8497
$$ 88702 112837 112882 111962 111873 119486 126951 131656 160837 196509 258433 270391 254028 230863 192366
18759A92366l0533k8741j9982k7759p303r471o737J9336J4235j6247p529n773
$$ 192366 161833 133092 113110 85351 78048 68577 61840 81176 95411 79164 71635 65862
18747F5862j0487K3151K0271n718k2820j0726Q432J1513Q339K865L50K2468K741
$$ 65862 55375 78526 98797 93079 70259 59533 67965 79478 87817 90682 91032 113500 116241
18734A16241J2294o712j8275o243n02J202r098J1999P507k349j0132o117K587
$$ 116241 128535 121823 103548 97305 96803 98005 88907 100906 108413 106064 95932 89815 92402
18721I2402r971j9032j3682J620J2392J2406J4256L279J164J655k021J795N433
$$ 92402 82431 63399 49717 51337 63729 76135 90391 93670 94834 96489 94468 96263 101696
18708A01696K2895R188p88j5874O131j722j850j0285M378K3740K691j3752j7478
$$ 101696 124591 133779 132991 117117 123248 121526 119676 109391 113769 137509 140200 126448 108970
18695A08970N632k204Q13l70r708j6268r262J1721J8394J459J3938J3655p523
$$ 108970 114602 112398 113211 112841 103133 86865 77603 89324 107718 109177 123115 136770 129247
18682A29247N809J2312n880o228O64K5234J2798J2735P145j4937j7597k034p753
$$ 129247 135056 147368 141488 135260 135924 161158 173956 186691 193836 178899 161302 159268 151515
18669A51515Q137J2723O949j476K584j1455j2567K19P261R175K1815j5011j056
$$ 151515 159652 172375 179324 177848 180432 168977 156410 156629 163890 173065 194880 179869 178813
18656A78813j1470K305N230J7561M336j6390r733k25j1306k36n954l255P309o782
$$ 178813 167343 169648 174878 192439 196775 180385 170652 170427 159121 158885 152931 149676 156985 150203
18642A50203j8315j173L1186J8396n545l487J6484N328p354j1165J0140O257j1561
$$ 150203 131888 130715 161901 180297 174752 171265 187749 193077 185723 174558 184698 190955 179394
18629A79394q570N451q502K296N814n533J17j912L810p352J3808J9130N424j4808
$$ 179394 170824 176275 167773 170069 175883 170350 170467 168555 172365 165013 178821 197951 203375 188567
18615A88567R689n604q671J6310P140P048K0300K138l674j3899q593Q184P647
$$ 188567 198256 192652 183981 200291 207431 214479 234779 236917 233243 219344 210751 218935 226582
18602B26582J8037K5762N194j0184m698k656K1723Q786n544p144l729K3909J2483
$$ 226582 244619 270381 275575 265391 260693 258037 279760 288546 283002 275858 272129 296038 308521
18589C08521J6169p288j6285K1969L3376K2150N214K4304K0400O131R234K0931
$$ 308521 324690 317402 301117 323086 356462 378612 383826 408130 428530 434661 443895 464826
18577D64826M7831P4201O1959N5648L4796J2377J7158K3934K5389L9369M0850
$$ 464826 512657 586858 648817 704465 739261 751638 768796 792730 818119 857488 898338
18566H98338L7548L8926O604K0635L7799O5068R9908R7288J26578J39173J20184
$$ 898338 935886 974812 981416 1002051 1039850 1104918 1204826 1302114 1428692 1567865 1688049
18555A688049J47970J43525J99676K77247L47694M01030L77886M19937N31298
$$ 1688049 1836019 1979544 2179220 2456467 2804161 3205191 3583077 4003014 4534312
18546D534312P29128J144007J871573L188160N637642Q252310P070243L160300
$$ 4534312 5263440 6407447 8279020 11467180 17104822 25357132 32427375 35587675
18538C5587675j232201k320922j298095L27079L551495N376899K832644j701146
$$ 35587675 34355474 32034552 30736457 31063536 34615031 39991930 42824574 41123428
18530D1123428n173460n034799n175500n379694m757444l088361j525161n47638
$$ 41123428 35949968 30915169 25739669 20359975 15602531 12514170 10989009 10441371
18522A0441371J52499R35076K177443M373345P590659Q375533M825563J47404
$$ 10441371 10593870 11528946 13706389 18079734 25670393 34045926 38871489 39018893
18514C9018893k761973k059145p14123K124474N319752M119884m5636m844996
$$ 39018893 36256920 34197775 33483652 35608126 40927878 45047762 45002126 40157130
18506D0157130n910995n828451o254545o048931m619102k820916j670117j071360
$$ 40157130 34246135 28417684 22163139 16114208 11495106 8674190 7004073 5932713
18498E932713p40299n51139m20208l59889l28827k60568k26046k05704j86896
$$ 5932713 5192414 4641275 4221067 3861178 3532351 3271783 3045737 2840033 2653137
18489B653137j42665j16658r9556q5453o7511n9325r9395j23511p7405n4372j8102
$$ 2653137 2510472 2393814 2294258 2208805 2141294 2081969 1982574 1859063 1781658 1727286 1709184
18478A709184J357L1041M5529N9685P9662L7509k0816j4725L3694P4219R9201
$$ 1709184 1710541 1741582 1787111 1846796 1926458 1963967 1943151 1928426 1962120 2036339 2135540
18467B135540J81020K63859K71738L01369L86982N25127P12223J001244J499605
$$ 2135540 2316560 2580419 2852157 3153526 3540508 4065635 4777858 5779102 7278707
18458G278707K455530M424719Q080773J1052523O647823j387547l522327k238017
$$ 7278707 9734237 14158956 22239729 33292252 39940075 38552528 35030201 32792184
18450C2792184j667205l16821L633674M610403j141464n194989m599637m193417
$$ 32792184 31124979 30808158 34441832 39052235 37910771 32715782 28116145 23922728
18442B3922728n016833n024821l535468k056306j188637o80982l12175o0572J5067
$$ 23922728 18905895 13881074 10345606 8289300 7100663 6419681 6107506 6046934 6062001
18433F062001L4086J56346K45087L18347N29624R43621J522989K632539N033396
$$ 6062001 6096087 6252433 6497520 6815867 7345491 8289112 9812101 12444640 17478036
18424A7478036R269900J2358599O838198k180868m228775k720348k250815p11016
$$ 17478036 26747936 39106535 45944733 43763865 39535090 36814742 34563927 33852911
18416C3852911L813999M660145j684896n805368n031691m730110n750680n595086
$$ 33852911 37666910 42327055 40642159 34836791 29805100 25074990 19324310 13729224
18408A3729224l906504k321776j442948r46611o39659m46395l54444l07713l10808
$$ 13729224 9822720 7500944 6057996 5111385 4471726 4025331 3670887 3363174 3052366
18399C052366k81409k14934j76563j61935j29004j24513j36051j47504j53278
$$ 3052366 2770957 2556023 2379460 2217525 2088521 1964008 1827957 1680453 1527175
18390A527175j46026j45753j35229q7784l2502k5810n3698n9293n0134o1394o9802
$$ 1527175 1381149 1235396 1100167 1012383 979881 954071 900373 841080 790946 729552 659750
18379F59750o9157o8776n3200j3017j3513j2122j8259l788K4526K7467M3994K0194
$$ 659750 590593 521817 468617 455600 442087 429965 411706 407918 432444 459911 503905 524099
18367E24099J7444M1366L1105j4357k9313j2047k3137o7722o8329m7071l7647
$$ 524099 541543 582909 614014 599657 570344 558297 535160 467438 399109 352038 314391
18356C14391m2773j6432l3479L623J6817K3366L9807O1817J07243R0250J1783
$$ 314391 271618 255186 221707 225330 242147 265513 305320 367137 474380 564630 576413
18345E76413m5914p1626o4380n1344m4382k8511r234L6746N9676L777l5342k6088
$$ 576413 530499 458873 394493 343149 298767 270256 261022 297768 357444 361221 325879 299791
18333B99791l3830n8143l8660k4292j2409p866j4352q409J0201P700n951q507
$$ 299791 265961 207818 169158 144866 132457 124591 110239 101830 112031 119731 113780 105273
18321A05273J193J2708R625m677r051p509K732J0533Q203R46j4239k3609j1883
$$ 105273 106466 119174 128799 124122 115071 107562 110294 120827 129030 129976 115737 92128 80245
18308H0245p871J2606K3586P619j3583q825j1952j2299P726k385m702J7656j1003
$$ 80245 72374 84980 108566 116185 102602 93777 81825 69526 77252 74867 70165 87821 76818
18295G6818M821o135j8266Q35m81N755k214J112j2739o984J0120M425p237k0624
$$ 76818 81639 75504 57238 58073 57592 63347 61133 62245 49506 42522 52642 57067 49830 29206
18281B9206j630J2550J7197o220j7641L230q361j3494m943J2699K4335q583k4255
$$ 29206 27576 40126 57323 51103 33462 36692 28331 14837 9894 22593 46928 38345 14090
18268A4090K2597R574O340j174j188L637K26L83J488o492P989J7517m243k2012
$$ 14090 36687 46261 52601 51427 50239 53876 54102 54485 55973 49481 57470 74987 70744 48732
18254D8732j0796N200k166P226j0818j5163J3656J3935q311o597q381j2069K873
$$ 48732 37936 43136 40970 48196 37378 22215 35871 49806 41495 34898 26517 14448 17321
18241A7321K0239k0170p289K0474J6302q598m674l432J0879J766j8647k3759M300
$$ 17321 37560 17390 10101 30575 46877 38279 33605 30173 41052 42818 24171 412 4712
18228D712J3191M743K410m829j4352j407j5640K81N65K2876L145K571O134j489
$$ 4712 17903 22646 25056 20227 5875 4468 -11172 -10891 -10326 12550 15695 18266 24400 22911
18214B2911j8408K242J6494P810N936p481r90N330j0395m775J2965J6734J2832
$$ 22911 4503 6745 23239 31049 36985 29504 28514 33844 23449 18674 31639 48373 61205
18201F1205K6251L754m425j6461p831l73n515j0923K148P754R533o669j4785j077
$$ 61205 87456 91210 86785 70324 62493 62120 56605 45682 47830 55584 65117 58448 43663 42586
18187D2586j1988J4472J2080R088Q673J535J754j4380r388j2392M175K641l409
$$ 42586 30598 45070 57150 66238 74911 76446 78200 63820 54432 42040 46215 48856 45447
18174D5447M457J3398J0062j0298r782L041J1530j2221n143J0879P396O691j901
$$ 45447 49904 63302 73364 63066 53284 56325 67855 55634 50491 61370 68766 75457 73556
18161G3556l49n327J1434J5967p465j6555q459l077P200L0370L6466k277o64Q433
$$ 73556 73207 67880 79314 95281 87816 71261 62802 59725 66925 97295 133761 131484 130820 139253
18147A39253L157p316n735j9928r2J0995K4048K5286P082j666p817J6756K1722
$$ 139253 142410 135094 129359 109431 109339 120334 144382 169668 176750 175084 167267 184023 205745
18134B05745J4205m720J5405J7330J2263L3586N8838M4777P411J2557M0906L5574
$$ 205745 219950 215230 230635 247965 260228 293814 352652 397429 404840 417397 458303 493877
18122D93877M0023O0742Q0698J16446J18774J29791J80817K21665K72404L47348
$$ 493877 533900 594642 675340 791786 910560 1040351 1221168 1442833 1715237 2062585
18112B062585M85675O83972J096963J905793L652750P383186J0657096K814533
$$ 2062585 2548260 3232232 4329195 6234988 9887738 17270924 27928020 30742553
18104C0742553m906357l763401k832014m167684n234858l590311j939454j103633
$$ 30742553 25836196 22072795 19240781 15073097 9838239 6247928 4308474 3204841
18096C204841o82405m51379l21114k45302k11257j49301j12127r1273r0825q9369
$$ 3204841 2522436 2071057 1749943 1504641 1293384 1144083 1031956 940683 849858 760489
18086G60489p4767o2397m4998m7816n6175l9917r181k9077m1560l5240k7315j4379
$$ 760489 685722 623325 578327 530511 474336 434419 425238 396161 354601 319361 292046 277667
18074B77667k0655j7517n693j3900o079j7918K475j4859j5049j4887j9375l904
$$ 277667 257012 239495 233802 219902 213823 195905 198380 183521 168472 153585 134210 130306
18062A30306o171n712l762N031J1675J2666o26j2635N550j2105r66J792k6083
$$ 130306 124135 118423 114661 119692 131367 144033 143407 130772 136322 124217 123251 125043 98960
18049I8960j6533J0093k847P475k399n000J2862J3405N063m147p281n296q789
$$ 98960 82427 92520 89673 97148 94749 89749 102611 116016 121079 116932 109651 104355 95566
18036I5566J3920k145j549j733J4342M814j202Q235n739j1968M35Q621j2492l302
$$ 95566 109486 107341 105792 104059 118401 123215 122013 130248 124509 112541 112976 121597 109105 105803
18022A05803n183J058O509l076j5112J4259K419m817o956o909r87n99o15J4262
$$ 105803 100620 101678 108187 105111 89999 104258 106677 101860 94904 87995 87008 86409 85794 100056
18008A00056J7125J3009R491J0519K2701L6508N9711L5877k572k6089l786R043
$$ 100056 117181 130190 139681 150200 172901 209409 269120 304997 302425 276336 272550 281593
17996B81593J6502K5865J960J665o87l1995k9409j8931k3886k6054J3111M677
$$ 281593 298095 323960 325920 327585 326898 294903 265494 246563 222677 196623 209734 214411
17984B14411J555J7766o208L5145O5517P8749O7587K5651n54j0801k5373j5685
$$ 214411 215966 233732 227524 262669 328186 406935 474522 500173 499619 488818 463445 447760
17972D47760K6614N4783L8204m999k5834k2505o726N597M3479M7633L6615j8337
$$ 447760 474374 529157 567361 562362 536528 514023 507297 512894 556373 604006 640621 622284
17960F22284j716k222n715M178J2589K3523M7623Q7209R1051Q0302O4280J03219
$$ 622284 620568 618346 612631 616809 629398 652921 700544 787753 878804 959106 1023386 1126605
17948A126605J23959Q1444L2706O2751J02332J45728J95125K67098L81196M50779
$$ 1126605 1250564 1332008 1364714 1427465 1529797 1675525 1870650 2137748 2518944 2969723
17938B969723M44055N51308P91359J211670K011003L577189O743072J2027290
$$ 2969723 3413778 3965086 4756445 5968115 7979118 11556307 18299379 30326669
17930C0326669J1715565q46635n865807m324687m349144o416061o351780m035134
$$ 30326669 42042234 41195599 35329792 31005105 26655961 20239900 13888120 9852986
17922I852986k217158j224726p01908m12299k23322l0508J49335K67766M07773
$$ 9852986 7635828 6411102 5709194 5296895 5073573 5043065 5192400 5460166 5867939
17913E867939O07099R43353J587390K708231M923130R129366J2528902M347996
$$ 5867939 6475038 7418391 9005781 11714012 16637142 25766508 38295410 42643406
17905D2643406m689407m078033k795447l480294l241864J367361P983104Q338624
$$ 42643406 37953999 33875966 31080519 27600225 24358361 25725722 33708826 42047450
17897D2047450k098958n819217m326463m329053o043835n760384l646457k098569
$$ 42047450 39948492 34129275 29802812 25473759 19429924 13669540 10023083 7924514
17889G924514j267168p80034m94105l15238j82342n7475P9019K50343M50888P57489
$$ 7924514 6657346 5877312 5383207 5067969 4885627 4828152 4907171 5157514 5608402 6365891
17879F365891J353370K306183M223497Q021243J0892570K981687m989353m365051
$$ 6365891 7719261 10025444 14248941 22270184 33162754 36144441 31155088 26790037
17871B6790037l579101m862322n826721m156772k360820j325153q24676n73794
$$ 26790037 23210936 18348614 12521893 8365121 6004301 4679148 3854472 3280678
17863C280678m40168l37806k59768j79310r8014m1584l7667q8696p6598o7583
$$ 3280678 2840510 2502704 2242936 2063626 1965612 1924028 1886361 1797665 1721067 1653484
17853A653484p1874j27942j34510j40583j35576r3913p8385m5622j2330M7109
$$ 1653484 1581610 1453668 1319158 1178575 1042999 949086 870701 825079 812749 859858
17843H59858O5757m688r8738r2926p6393q1434q8946n5989m7901l9864m7367l9382
$$ 859858 925615 920927 822189 729263 652870 571436 482490 426501 378600 338736 291369 251987
17831B51987k0674L076L834l576j2916r062j3095j4210L484J6838L3875j030k6576
$$ 251987 231313 234389 238223 234647 221731 212669 199574 185364 188848 205686 239561 238531 211955
17818B11955j7119k7483n759l398J37n542J4957r944j6650l670j9407k1969p049
$$ 211955 194836 167353 161594 158196 158333 152791 167748 157804 141154 137484 118077 96108 89059
17805H9059o122n021j3318l534k320m917j4158j4960m256Q237j7097l786J91K959
$$ 89059 82937 77916 64598 61064 58744 53827 39669 24709 20453 28690 11593 7807 7998 10957
17791A0957n607m37K5647J8869r413j7880j0296m664O388O679Q000j490j1861
$$ 10957 5350 4913 30560 49429 40016 22136 11840 7176 13564 20243 28243 26753 14892
17778A4892l885K231o427j3127j61P576M301R431K3552j4303m255m225j1338p364
$$ 14892 11007 13238 6811 -6316 -6477 1099 5400 14831 38383 24080 19825 15600 4262 -3102
17764c102O24J4689P457P527j8011q942K532p8j1751j505J3768J2411J678j051
$$ -3102 -2478 12211 19668 27195 9184 242 2774 2696 -9055 -10560 3208 15619 17297 16246
17750A6246K713O63J120l865n986k196J1474j5467j5770J1669J8786j2662L88
$$ 16246 18959 19622 20742 16877 10891 8695 20169 4702 -11068 601 19387 6725 7113
17737G113P657m593k067j419J543j831o620q958j3355n077k146Q231p005k3261
$$ 7113 14770 10177 8110 6691 8234 6403 -217 -9175 -22530 -27607 -29753 -21522 -28527 -51788
17723e1788J514K0723K1318O205m459M716K0935r905o559J0116o091j2803J3224
$$ -51788 -50274 -29551 -8233 -2028 -6487 -1771 19164 9259 2700 12816 6725 -6078 7146
17710G146j372k5989j629l319r247K280N349J3473n22m253k16J9625N05j2895
$$ 7146 5774 -20215 -21844 -25163 -34410 -32130 -26781 -13308 -13830 -18083 -18299 1326 1831 -11064
17696a1064k911o972Q36R424P362j0572m377K0665j1506Q95K558k617o52n930
$$ -11064 -13975 -20947 -20111 -10687 -3325 -13897 -18274 2391 -9115 -8220 -5662 -8279 -8931 -14861
17682a4861M064m864n757j105r930O321l435K34J937O683J274J5817N36j1503
$$ -14861 -10797 -15661 -21418 -22523 -32453 -26132 -29567 -29333 -27396 -20713 -19439 -3622 -3086 -14589
17668a4589Q370l116j3021L827j0211L624J6324N505L212O349m07q385k010q7
$$ -14589 -6219 -9335 -22356 -18529 -28740 -25116 -8792 -3287 -75 6274 5867 -2518 -4528 -4615
17654d615q388O235o263L055J8931j544j0740K437j8203n236M023j6143K85Q036
$$ -4615 -13003 -6768 -13031 -9976 8955 7411 -3329 -892 -19095 -24331 -20308 -36451 -36166 -28130
17640b8130J0667l659j6969R513n77J9681P8k0454m189J7342M675r18k592l433
$$ -28130 -17463 -21122 -38091 -28578 -29155 -9474 -9396 -29850 -34039 -16697 -12022 -12940 -15532 -18965
17626a8965P600K464j138k1017r877J7342J7669J1849O514P649j6270j3921J4240
$$ -18965 -11365 -8901 -10039 -31056 -40933 -23591 -5922 5927 12441 20090 3820 -10101 4139
17613D139n030j845j38k024j2079P792N078m56J1419k86j5190k1281j0255j1872
$$ 4139 -891 -2736 -2874 -4898 -16977 -9185 -4107 -4563 6856 6570 -8620 -29901 -40156 -52028
17599e2028J4650J1736Q342j936Qj236N191R092P802Q129J3813N919m203o824
$$ -52028 -37378 -25642 -17300 -19236 -19228 -20464 -15273 -6181 1621 9750 23563 29482 25279 18455
17585A8455r156k070J076o541r742k960k81O206m330O944R341j819n288n315R286
$$ 18455 9299 7229 8305 1764 -7978 -10938 -11219 -5013 -9343 -2399 6942 5123 -165 -5480 3806
17570C806N625k431p730O69m45l161Q874L143m967q987j0262N847m390L06n109
$$ 3806 9431 7000 -730 -61 -506 -3667 5207 8350 3383 -5604 -15866 -10019 -14409 -14103 -19212
17555a9212o150M835m559Q1R651J1459O372l183M460P451p369j5569K959M948
$$ -19212 -25362 -20527 -25086 -25005 -15354 -3895 2477 -706 3754 11205 3836 -11733 -8774 -3826
17541c826m240n56j9088m080K8190R348j7284o422J4413j3921k0237J9512J0297
$$ -3826 -8066 -8622 -27710 -31790 -3600 5748 -11536 -17958 -3545 -17466 -37703 -18191 -7894
17528g894K1635m086M132m624j3419n725M742r893k2414J0068J5901l01M586L615
$$ -7894 13741 9655 13787 9163 -4256 -9981 -5239 -15132 -37546 -27478 -11577 -11878 -7292 -3677
17514c677R096j93q977k0841p725J6155J5663o264J820R542l130K576J3211O26
$$ -3677 5419 5226 -3751 -24592 -32317 -16162 -499 -6763 -4943 4599 1469 4045 17256 17882
17500A7882j2943L25k1018j0754Q889j0026J7407K4353J5195j9806k5707J3691
$$ 17882 4939 5264 -15754 -26508 -17619 -27645 -10238 14115 29310 9504 -16203 -2512
17488b512m908m975J876P98N502J1512O240Q300L1020N1799M3813P3947J11290
$$ -2512 -7420 -12395 -10519 -9721 -4219 7293 13533 21833 52853 104652 148465 222412 333702
17475C33702J11892J11976P1480j0636n3301m0805o6956r8368q5081o5011p7011
$$ 333702 445594 557570 629050 618414 565113 524308 457352 358984 273903 208892 131881
17464A31881l8310k2153k3901j4549j289J2835n168k918M648p254p501O414m061
$$ 131881 93571 71418 47517 32968 31679 44514 39346 36428 41076 33822 26321 32735 28674
17451B8674q444L998j3983j4786J2404l170J0886Q929J4789J8767L8645M5267
$$ 28674 20230 24228 10245 -4541 7863 4693 15579 24508 39297 58064 96709 141976
17439A41976M5330k4353l2917J2339o668n2619l7977m7343j4231P554l560j757
$$ 141976 187306 162953 130036 142375 135707 83088 45111 -2232 -16463 -8909 -12469 -14226
17427a4226J242q394K3520m23j3921Q042N228K758O701k209q100K78O614L9j1434
$$ -14226 -12984 -21378 2142 1719 -12202 -4160 1068 3826 10527 8318 218 496 7110 7149 -4285
17412d285n463J3984J1450n353j6818q497J3068J2092N608j3649j997J5189r37
$$ -4285 -9748 4236 15686 10333 -6485 -14982 -1914 10178 15786 2137 140 15329 14392
17399A4392o52j0100l130m768J8536J9415J9648K2591L1048O0149M2420k5813
$$ 14392 13740 3640 510 -4258 14278 33693 53341 75932 106980 167129 209549 183736
17387A83736j9477O261l5756l0983k6704q901j5734r473k3389j425R588k964J825
$$ 183736 164259 170520 134764 103781 77077 68176 52442 42969 19580 18155 27743 24779 26604
17374B6604N31P23L859n978J6317M5296K4693L4877O1403K3813k5431l1742k5051
$$ 26604 27135 27858 31717 25739 42056 87352 112045 146922 208325 232138 206707 174965 149914
17361A49914r732j4547R981N3534L7042j8951l0823l0498l6901k1587j7207q979
$$ 149914 140182 125635 135616 189150 226192 207241 176418 145920 109019 87432 70225 61246
17349F1246j4871Q474j3808m766j2659k081K2193N828L79j5245j1265l537J6507
$$ 61246 46375 54849 41041 36275 23616 21535 43728 49556 49935 34690 23425 19888 36395
17336C6395K5354L7638L9723N378j479L739J1578l4541k1396j2561l4791m1439
$$ 36395 61749 99387 139110 144488 143009 146748 158326 123785 102389 89828 55037 13598
17324A3598j2502Q22L237J4065J300j3042O031J2139M556j5176j5095k720K034
$$ 13598 1096 1918 5155 19220 20520 7478 13509 25648 30204 15028 -67 -2787 -753
17311g53k681j129j0705N351J4127J0422p71n541j1364Q833j102o618J3105K3445
$$ -753 -3434 -4563 -15268 -9917 4210 14632 13861 8320 -3044 5789 4687 -1931 11174 34619
17297C4619p622j0240j4200p552o866J2435J9913J4837j3572k1328j5267r676
$$ 34619 26997 16757 2557 -4995 -11861 574 20487 35324 21752 424 -14843 -24519
17285b4519J442J9136K442j3814o829n47J2833P577l772N357Q890N3j1458o877
$$ -24519 -23077 -3941 -1499 -15313 -22142 -22689 -9856 -2279 -6051 -694 8196 8249 -3209 -10086
17271a0086k010q211Q871K7514L978O871j4151J4396K88j3786j7564n877O796
$$ -10086 -12096 -20307 -11436 16078 20056 26927 12776 27172 27460 13674 -3890 -9767 -2971
17258b971J0394J1592p648m592j1813J042K744J65j687n24K012J0176j3601p373
$$ -2971 7423 19015 11367 6775 -5038 -3996 -1252 -1087 -2774 -3298 -1286 8890 -4711 -12084
17244a2084Q699J9236p6O15M808j944n960l297j4121m810j0342j0632l137K3070
$$ -12084 -3385 15851 15775 16390 21198 19254 13294 9997 -4124 -8934 -19276 -29908 -33045 -9975
17230i975Q207p571L321J7487J5504j3782n791k3607m801J1925J2784j1646j4006
$$ -9975 -1768 -9339 -6018 11469 26973 13191 7400 -16207 -21008 -9083 3701 -7945 -21951
17217b1951J4052k112q808M613m229p784J8882K7803M627p894q63n273j6345M602
$$ -21951 -7899 -10011 -18819 -14206 -18435 -26219 -7337 20466 25093 17199 16336 11063 -5282 -680
17203f80K4007k354j353n99o763k69J672j3155L439J6715J9628l154k1882o77
$$ -680 23327 20973 19620 19021 12258 11989 13661 506 3945 20660 40288 37134 15252 14575
17189A4575K4299q48P624j2663k3074N580N095j6668J4420J909L668l656l064
$$ 14575 38874 38026 45650 32987 9913 15493 20588 3920 18340 20249 23917 20261 17197
17176A7197n450k311j679j1929J763n464m574M199l112l113M009k381O623J6434
$$ 17197 11747 9436 7757 -4172 -2409 -7873 -12447 -8248 -11360 -14473 -10464 -12845 -6222 10212
17162A0212N740L926M460R769P653J2535j1793p478M473J5606K5062K6221O206
$$ 10212 15952 19878 24338 34107 41760 54295 42502 35024 39497 55103 80165 106386 112592
17149A12592k3292k6296k7807j5608j1051j8544k1082J0963J9971N49L389l247
$$ 112592 89300 63004 35197 19589 8538 -10006 -31088 -20125 -154 395 3784 537
17137E37J2738Q607M442m102Q127k420M656j42p66P485j0631j1808R842N165j3368
$$ 537 13275 21882 26324 22222 30349 27929 32585 32443 31677 39162 28531 16723 26565 31730 18362
17122A8362M719K119j184j420j2940j310j635N968k46Q736l776J2833J2675K614
$$ 18362 23081 25200 24016 22596 9656 8346 6711 12679 12433 21169 17393 30226 42901 45515
17108D5515N254L094K756j5205l0968j1173m73j384N218J0331J5658l767J1018
$$ 45515 50769 53863 56619 41414 10446 -727 -1200 -2584 2634 12965 28623 24856 35874
17095C5874K5804J5133r562k3901j2930O751r539k1122j5457j0539Q083O815J0492
$$ 35874 61678 76811 67249 43348 30418 37169 27630 6508 -8949 -19488 -11405 -4590 5902
17082E902J6594Q06m357J352N609J2886N982q529q286j084k1317P054O591l862
$$ 5902 22496 23302 18945 20297 25906 38792 44774 36245 27959 26875 5558 12612 19203 15341
17068A5341n208Q677m62m323O80l994K248m64o513P371P579R129n081j4118P88
$$ 15341 10133 18810 18348 14025 14705 10711 12959 12495 5982 13353 20932 30061 24980 10862 11650
17053A1650m405M115K5224K1045J887J689Q88o224n886J7179k330Q847Q128m558
$$ 11650 7245 11360 36584 57629 59516 61205 62093 55869 49983 67162 64832 73679 81807 77249
17039G7249j076m166M359Q745O950J1932l281p653J393J5221J2064P751j0932
$$ 77249 76173 72007 76366 85111 92061 103993 100712 93059 94452 109673 121737 129488 118556
17026A18556q644J5487L990J1473J6533J7107L9574O8546K5782p409K4897N9807
$$ 118556 109912 125399 129389 140862 157395 174502 214076 282622 308404 300995 325892 385699
17014C85699P2927j8977l3484o133j1755m5531p1667o4591m8796k4580l1479m1197
$$ 385699 458626 439649 406165 400032 388277 342746 271079 206488 157692 133112 101633 60436
17002F0436Q75J7737J283P111M500P078J1956r678j0652o372P220K4498M214o678
$$ 60436 61311 79048 80331 87442 91942 99020 110976 101298 90646 84274 91494 115992 120206 113528
16988A13528j3881P262K1046Q695j0218l234J6355J0972O694p226q135O198J4807
$$ 113528 99647 106909 127955 136650 126432 123198 139553 150525 157219 149993 141858 148056 162863
16975A62863P64n415j611p073k82J1897O580M852k914j234J3774m676N281R186
$$ 162863 163627 158212 156601 149528 149246 161143 167723 172575 169661 168427 182201 177525 182806 191992
16961A91992j8299j6709j971J2711Q046mR151J1705M279K0521Q436K202J2641
$$ 191992 173693 156984 155013 167724 175770 175766 184917 196622 200901 221422 229858 232060 244701
16948B44701K7834J4288k657L125J5308K9181M1481K6967M9850K5039J5970K4975
$$ 244701 272535 286823 284166 287291 302599 331780 373261 400228 450078 475117 491087 516062
16936E16062M1965M3786L0889O0006R2046J08273J23612J65442J86916J70092
$$ 516062 558027 601813 632702 692708 784754 893027 1016639 1182081 1368997 1539089
16926A539089J04788L7200M113k0231j5044J1824N5655J04829J30127J58981K22928
$$ 1539089 1643877 1681077 1685190 1664959 1649915 1661739 1717394 1822223 1952350 2111331 2334259
16915B334259L04930L98826N01929O07909O78706P72764Q78804J049133J330147
$$ 2334259 2639189 3038015 3539944 4147853 4826559 5599323 6478127 7527260 8857407
16906H857407J780500K616057M186225P139039J2048923J7513696K1769304K2384903
$$ 8857407 10637907 13253964 17440189 24579228 36628151 54141847 75911151 98296054
16898I8296054J6802181P329092l740937j2118720j7026795j8850304j7590184
$$ 98296054 115098235 122427327 118686390 106567670 89540875 70690571 53100387
16891E3100387j4760516j1164985p725629m884457k999461j910206j283688q96185
$$ 53100387 38339871 27174886 19449257 14564800 11565339 9655133 8371445 7475260
16883G475260o41316n10157m99601n18312n32172n21109n03462m34610l89564
$$ 7475260 6833944 6323787 5824186 5305874 4773702 4252593 3749131 3314521 2924957
16874B924957l33768k69814k15917j41818r3446n6802k0050K8707j3875n2167
$$ 2924957 2591189 2321375 2105458 1963640 1870194 1813392 1793342 1822049 1808174 1756007
16864A756007j14361j47541j38964j45250j63432j25808j02789p6030o8566o9976
$$ 1756007 1641646 1494105 1355141 1209891 1046459 920651 817862 741832 673266 603290
16854F03290m5728l0874n459k7177l2883m168j6463l6001k5247j7271j5488r285
$$ 603290 557562 526688 521229 494052 461169 457001 440538 404537 379290 362019 346531 337246
16842C37246J090o846j0588k9465l0492m925k6914j2843j6170r301L535k1520
$$ 337246 338336 331490 320902 291437 260945 256020 229106 216263 200093 190792 194327 172807
16830A72807l1764j8750j5874j1330o348J7960n606j6500q256K518q351q758J5009
$$ 172807 141043 122293 106419 95089 88741 106701 101095 84595 76339 78857 70506 61748 76757
16817G6757n750k3671L925l124q449K414J855j500j490o404J0412J3805K205L296
$$ 76757 71007 47336 51261 48137 39688 42102 43957 42457 40967 34563 44975 58780 60985 64281
16803F4281L768j077r938m176m31J0094Q50J8799M2566L0432L1256J4691J5069
$$ 64281 68049 66972 57034 52858 52427 62521 63371 82170 124736 155168 186424 201115 216184
16790B16184p454j892k3088k7084l1900r965l569j9439k0533k1111m922P642K0121
$$ 216184 208730 206838 183750 156666 124766 114801 111232 91793 71260 50149 45227 52869 72990
16777G2990Q527j6713r39J8566Q21j1409N826j6477j8302j9201k3132j39K7469
$$ 72990 81517 64804 63865 82431 83252 71843 77669 61192 42890 23689 557 418 27887
16764B7887J204Q164m791k0558j4972O186q131j0731M715n735n529M376P328j6209
$$ 27887 29091 37255 32464 11906 -3066 3120 -5011 -15742 -11027 -16762 -22291 -17915 -10587 -26796
16750b6796l777J9434L988l098k838K764K133j261J1518J1635M028rj1260J788
$$ -26796 -30573 -11139 -7151 -10249 -13087 -10323 -8190 -9451 2067 13702 17730 17721 6461 8249
16736H249p341P88j1845J9697L847Q235J017r086r273j2723J0323k3696p171n691
$$ 8249 908 1696 -10149 9548 13395 21630 22647 13561 4288 -8435 1888 -21808 -28979 -34670
16722c4670r945k661J4701O183l879r770N413Q608K0653m46O818R490j1183j6554
$$ -34670 -44615 -47276 -32575 -26392 -30271 -40041 -34628 -26020 -5367 -5813 1005 10495 -688 -17242
16708a7242J4016R721r725j5056j8716J2175M725N783k1807k0083M554J0536M563
$$ -17242 -3226 6495 -3230 -18286 -37002 -24827 -20102 -14319 -36126 -56209 -51655 -41119 -36556
16695c6556J527N229J1392J0096K592Q233J2080o201p953m611j1368r450j7330
$$ -36556 -35029 -29800 -18408 -8312 -5720 2513 14593 8392 439 -4172 -15540 -24990 -42320
16682d2320p497J1327J4239J545p838m834K0278Q978L029O041J0409j5775k7887
$$ -42320 -49817 -38490 -24251 -22706 -30544 -35378 -15100 -6122 -3093 2948 13357 -2418 -30305
16669c0305j4061r06j693J0171P286O12o348K7727M138n941j2627k367k933m302
$$ -30305 -44366 -45272 -46965 -36794 -29508 -28896 -35244 -7517 -3379 -9320 -21947 -24314 -27247 -31549
16655c1549O531J1111P108r19j978K720R210L602o251j7928j1627Q400N932J5698
$$ -31549 -25018 -13907 -6799 -7718 -9696 -6976 2234 5836 -415 -18343 -29970 -21570 -15638 60
16641F0J3483J4509O864j1035j4005K74o823l0515j6712J1977R207o99P193K1635
$$ 60 13543 28052 34916 23881 9876 10150 3327 -27188 -43900 -31923 -22716 -23415 -16222 5413
16627E413M333n707L475j0544K549j1281q719l176o711J5827l590J4402P096Q267
$$ 5413 9746 4039 7514 -3030 -481 -11762 -20481 -23657 -30368 -14541 -18131 -3729 3367 11634
16613A1634J053p61p638o696k101r821j578R209O770K547P307k002k1366j3802
$$ 11634 12687 11926 4288 -2408 -4509 -14330 -15908 -6699 71 2618 9925 7923 -13443 -27245
16599b7245q605k012m01j908K082O257k063J3938K0619J0324k2862j8070j678
$$ -27245 -35850 -37862 -38263 -40171 -38089 -31832 -33895 -19957 662 10986 -11876 -29946 -31624
16586c1624n95m420j0458R873R174O461M791M535O693L496P408p35j598o977k728
$$ -31624 -32219 -36639 -47097 -37224 -28050 -21589 -16798 -12263 -5570 -2074 5334 4599 3001 -3976 -6704
16571f704N803J4756j8242N390P876q091l518Q113o494j148o523n44k732j1902
$$ -6704 -901 13855 -4387 1003 8879 788 -2730 5383 -1111 -2259 -8782 -9326 -12058 -23960
16557b3960j351J1803J2500j3026n422n390q986L642J9002n848j1246l75J2879
$$ -23960 -25311 -13508 -1008 -14034 -19456 -24846 -33832 -30190 -11188 -17036 -28282 -28657 -15778
16544a5778j356j68j0215j3527J3000J9189J8871L916o047k724j436j4882j1231
$$ -15778 -17134 -17302 -27517 -41044 -28044 -8855 10016 13932 7885 5161 3725 -11157 -22388
16531b2388Q163K5915k03j6016j4965N632R71j0865P005j923L942J226Q813O459
$$ -22388 -14225 11690 11487 -4529 -19494 -13862 -12891 -23756 -16751 -18674 -14732 -13506 -4693 1766
16517A766j215O24j2574j7843O628J7091L419n623j7311M617r07m606j0963m110
$$ 1766 551 1175 -11399 -29242 -22614 -5523 -2104 -7727 -25038 -20421 -21328 -25934 -36897 -41007
16503d1007O917J3221m513j3351l957L746m11m786R859P444K767o435n815M690
$$ -41007 -34090 -20869 -25382 -38733 -42690 -38944 -39355 -44141 -34282 -26838 -24071 -30506 -36321 -31631
16489c1631j906j8224N878J9199K1787K685J1584j654j1645j4007Q052P069m498
$$ -31631 -33537 -51761 -45883 -26684 -4897 -2212 9372 7718 -3927 -17934 -9882 -2813 -7311
16476g311n330J0636M079l1130j0122P890Q824O518n91j6076J6257K0955r61Q094
$$ -7311 -12641 -2005 2074 -29056 -39178 -31288 -22464 -15946 -16537 -32613 -16356 4599 3638 11732
16462A1732l43n760O83l766j4030Q423J0746O842K911p914j0913k8668n90M825
$$ 11732 11389 5629 6312 2546 -11484 -3061 7685 14527 17438 9524 -1389 -30057 -30647 -25822
16448b5822O279K131j8638j1130R777K2391J6518j3527j1046N411k730P778q222
$$ -25822 -19543 -17412 -36050 -47180 -37403 -15012 1506 -12021 -23067 -17656 -20386 -12608 -20830
16435b0830r037L056K4010J5830n454k3442O388K9853r994j8120m386J0842P17
$$ -20830 -29867 -26811 -2801 13029 7575 -15867 -9479 20374 10380 -7740 -12126 -1284 -567
16422e67j5612l378Q577J6719j2903j3557J0702J9806J3205K665j1571j5216j3477
$$ -567 -16179 -19557 -10980 5739 -7164 -20721 -10019 9787 22992 25657 14086 -1130 -14607
16409a4607J403K268K561Q343j1106K13j994p468J0706J2197O937O134p232j3939
$$ -14607 -13204 -10936 -8375 -32 -11138 -10925 -12919 -20387 -9681 2516 9453 15587 8355 -5584
16395e584j4183j235J8028O523J5146K154J145j1603N679R251j8274L972k438
$$ -5584 -19767 -21002 -2974 3549 18695 20849 21994 10391 16070 25321 7047 11019 8581
16382H581j8408j3029J1044j7365j5508K694J5935R240K896j176j35J1276k148
$$ 8581 -9827 -22856 -11812 -29177 -44685 -41991 -26056 -16816 -13920 -15096 -15231 -3955 -6103
16369f103j709P07m306M478R003J7063J2034j0377p315j735j6672J2016P729m895
$$ -6103 -7812 -7105 -11411 -6933 2070 19133 31167 20790 13475 11740 -4932 7084 14813 9918
16355I918J8574k985k3014r116N383O701Q553k532k2664l320N729N449J998N079
$$ 9918 28492 25507 2493 -6623 -1240 5461 14014 11482 -11182 -14502 -8773 -3324 -1326 3753
16341C753j0252O57N819J3147J0456j0999j8108k1847j185J5049L974J2648Q034
$$ 3753 -6499 -5842 -23 13124 23580 12581 -5527 -27374 -28559 -13510 -9536 3112 11146
16328A1146J278P081r223l883K9051L1869J9687N5303Q1850J09605J22594J01988
$$ 11146 12424 19505 10282 6399 35450 67319 87006 142309 224159 333764 456358 558346
16316E58346Q3717K510l6891o4884q1265j04489q6163p0044n5825n6804k5182
$$ 558346 642063 644573 607682 542798 461533 357044 270881 200837 145012 88208 63026
16305F3026k3337o556p426K723j3363l896n517n358j1003n373j4630R37P184J3983
$$ 63026 39689 33133 25707 28430 15067 11171 5654 296 -10707 -16080 -30710 -29773 -22589 -8606
16291h606J5811J6833K828j3147L017k732j7168m310N247J9440K173j7166j850
$$ -8606 7205 24038 26866 13719 16736 14004 -3164 -7474 -2227 17213 19386 2220 370
16278C70L755O38o692R10R957j4135j5341J1901Q308M528J1155j373n101j5670
$$ 370 4125 4763 -1929 -1019 8938 -5197 -20538 -8637 -329 4199 15354 13981 8880 -6790
16264f790O436Q228J3472k927l937L70L247l900m200n771j3377n406K578J520
$$ -6790 -354 7874 21346 18419 14482 14852 18099 14199 9999 4228 -9149 -14555 -11977 -10457
16250a0457k021O316Q444j3286J3668L494j4674r194j6525n869J6552J9260N594
$$ -10457 -12478 -6162 2282 -11004 2664 6158 -8516 -17710 -34235 -40104 -23552 -4292 1302
16237A302j0114j3828J8428Q55J7030J2409j235j0825j5139l986J6649K97j5430
$$ 1302 -8812 -22640 -4212 -3357 13673 26082 24847 14022 -1117 -5103 11546 11843 -3587
16224c587P797m58j838J94j5931j7799K3830Q67j316n454K81M772M79n030l646
$$ -3587 4210 3752 1914 2108 -13823 -31622 -7792 -6925 -8241 -13695 -13414 -8642 -8163 -13193 -16839
16209a6839Q295P56Q800J427P821J3289K275n081q189o789r180L939K2140O019
$$ -16839 -8544 -7788 1012 2439 10260 23549 25824 20743 12554 5765 -3415 524 22664 28683
16195B8683j2998l2424l390J241k321P797N318P571p115o868k46J2168L843q526
$$ 28683 15685 -16739 -20129 -18888 -21209 -13412 -8094 -523 -7638 -14506 -14752 -2584 1259 -7267
16181g267j302j9756j52Q575J1581J1039j3983o331P155k098j6083k947L072j3684
$$ -7267 -8569 -28325 -28477 -19902 -8321 2718 -11265 -17596 -10441 -12539 -28622 -31569 -28497 -42181
16167d2181J089K5170J1274k979j3894L017P180K945j1464j1016P721J2256N855
$$ -42181 -41092 -15922 -4648 -7627 -21521 -18504 -11324 -8379 -19843 -30859 -23138 -10882 -5027
16154e027R868K179p670K21M977p706P994k738j361l351n079n623R674j1947n967
$$ -5027 4841 7020 -650 -429 4548 -3158 4836 2098 737 -2614 -7693 -13316 -3642 -15589 -21556
16139b1556M745R97Q497k0j1398q817j0107n900K1271R292P032Q50n084o162J0312
$$ -21556 -16811 -15814 -7317 -7337 -18735 -27552 -37659 -43559 -22288 -12996 -5964 -5114 -10198 -16360 -6048
16124f048P847R391n782k3397N482J955k768L044o261m525n382R751J1623N478
$$ -6048 1799 11190 5408 -17989 -12507 -10552 -13320 -10276 -16537 -21062 -26444 -16693 -5070 408
16110D08j0205K669k201k724P430l643j0631M198M94l921j469O97L644J5319P329
$$ 408 -9797 -7128 -9329 -12053 -4623 -8266 -18897 -14699 -14205 -18126 -19595 -18898 -15254 65 7394
16095G394L492J1225j2493k0782j7089n676J4523o138J0066J6786R585Q079M412
$$ 7394 10886 22111 9618 -11164 -28253 -33929 -19406 -25544 -15478 1308 10893 18972 23384
16082B3384r793m300Q496l445j8418j4879n259N034k962K426K4091O485n680m946
$$ 23384 13591 9291 17787 14342 -4076 -18955 -24214 -19180 -22142 -19716 4375 10860 5180 234
16068B34o870J322q043j342N683n332m670l281J0656P57L662J157J898J1522Q77
$$ 234 -6636 -5314 -13357 -14699 -9016 -14348 -19018 -22299 -11643 -10886 -7224 -6067 -4169 7353 8230
16053H230J2706o991k1349O108k786J31M326J3639k0772k0972j230N393Q509J1495
$$ 8230 20936 13945 -7404 -1296 -4082 -3951 375 14014 -6758 -27730 -28960 -23567 -15058 -3563
16039c563J5377Q89j6996j5691N899n664J1869J5866k255l1294O087O230J2576
$$ -3563 11814 12703 -4293 -19984 -14085 -19749 -7880 7986 5731 -25563 -19476 -13246 -670
16026f70J4271M966j3232k383j7623k2310o120P241J4895j57J741J5319j1511
$$ -670 13601 18567 5335 2952 -14671 -36981 -43101 -35860 -20965 -21122 -19381 -4062 -15573
16013a5573k2780j2446J2452J9221Q637J922N972Q264o378p357K210J2921J4411
$$ -15573 -38353 -50799 -38347 -19126 -10489 -8567 -2595 5669 -709 -8066 -5856 7065 21476
16000B1476n51j3554o982R25r998K0119p849r979j3394k013N467K963m277P03
$$ 21476 20925 7371 389 1314 -8684 11435 3586 -6393 -19787 -21800 -16333 -13370 -17647 -16944
15986a6944n032j3379m078l084K1435Q796p233P084J0591j1415K1276J6974j860
$$ -16944 -21976 -35355 -39433 -42517 -21082 -12286 -19519 -12435 -1844 -13259 8017 24991 23131
15973B3131M962J2605Q338m250K083q450p494j0121q569p239j3102J0936K126
$$ 23131 28093 40698 49036 44786 46869 38419 30925 20804 12235 4996 -8106 2830 4956
15960D956N948j912j2304N016k425J403R583O346P338l771k5590j9311Q477J7107
$$ 4956 10904 8992 -3312 1704 -721 682 10265 16611 23949 20178 -5412 -24723 -16246 861
15946H61n044O628J862j6287r498L695J2822j2590k3160K4383J4954j7452r186
$$ 861 -4183 2445 4307 -11980 -21478 -17783 -4961 -17551 -40711 -16328 -1374 -18826 -28012
15933b8012K8462J4441J601k109j0133o715O604Q767j0234j3562q157J5915N406
$$ -28012 450 14891 16492 14383 4250 -2465 4139 12906 2672 -10890 -19047 -3132 2274
15920B274M99j1774n764m447N160o924Q116P382n948k323J2598J9510q734k3034
$$ 2274 2773 -9001 -14765 -19212 -14052 -20976 -12860 -5478 -11426 -13749 -1151 18359 9625 -13409
15906a3409j4343O574K295j1620k862r338J3474J5820J9997N221P888r618L11
$$ -13409 -27752 -21178 -18883 -30503 -33365 -42703 -29229 -13409 6588 11809 19697 10079 10390
15893A0390N692o088J426j487o020j956j4029m527L39Q075J0337n121K69N020
$$ 10390 16082 9994 11420 9933 3913 1957 -12072 -16599 -16260 -8185 2152 -2969 -2700 2320
15879B320j1193j9580k1176q056J7721J8854Q498o61l937P804J5688Q52o977r065
$$ 2320 -8873 -28453 -49629 -57685 -39964 -21110 -12612 -13273 -17210 -9406 6282 7134 157 -8908
15865h908j8852r246P454K283k3665K662J1304M33J9362L051K083J3773m808j4830
$$ -8908 -27760 -37006 -29552 -27269 -50934 -48272 -36968 -36535 -17173 -14122 -12039 1734 -3074 -17904
15851a7904N755l894P262J2974j4318j684J0611Q900r828o160J2787K1679M989
$$ -17904 -12149 -16043 -8781 4193 -10125 -11809 -1198 7702 -2126 -8286 4501 26180 31169
15838C1169q579l2277l664L736j1896L320l996J6300J8152L15q995P744K2416
$$ 31169 22590 -9687 -13351 -9615 -21511 -18191 -22187 -5887 12265 12580 3585 11329 33745
15825C3745n866k4294l596o248k0905j491J8731K1960R778q564l4140k1377N908
$$ 33745 27879 3585 -11 -6259 -27164 -28655 -9924 12036 21814 13250 -20890 -42267 -36359
15812c6359J7396k313r459L226k4914P542O309J0767K1075J6595q976j9199r259
$$ -36359 -18963 -21276 -30735 -27509 -52423 -44881 -38572 -27805 -6730 9865 889 -18310 -27569
15799b7569J7219J3834q653j458k3138j202J247n490J1173Q343j442Q945J2188
$$ -27569 -10350 3484 -5169 -6627 -29765 -30967 -29720 -35210 -24037 -15694 -17136 -8191 3997
15786C997M509n700o271j0074j0443r403J7405P547j494Q448K785l626l668J0339
$$ 3997 8506 2806 -3465 -13539 -23982 -33385 -15980 -8433 -9927 -1479 1306 -2320 -5988 4351
15772D351j9425o759p93J0483J0230K981n742r9J6840R95p669p001p485j6592
$$ 4351 -15074 -21833 -22626 -12143 -1913 1068 -4674 -4773 12067 13062 5393 -1608 -9093 -25685
15758b5685j4629K4614J7671p320L201j5988L613J4657n512k5558O836J0336J3432
$$ -25685 -40314 -15700 1971 -5349 -2148 -18136 -14523 134 -5378 -30936 -24100 -13764 -332
15745c32J5525q629r223L183p499P341J607k1120j8765K2314l885n927p186j724
$$ -332 15193 6564 -2659 524 -6975 366 1973 -19147 -37912 -15598 -19483 -25410 -32596 -34320
15731c4320L783L491N327J38K0714K2697M316O781j9370k3079n202K232P898m785
$$ -34320 -30537 -27046 -21719 -21581 -867 21830 26146 32927 13557 -9522 -14724 -12492 -4594 -9379
15717i379L359Q725M769j6940j6346q52J3527J0661m838K582K2594P393j4613
$$ -9379 -6020 2705 7474 -9466 -25812 -26664 -13137 -2476 -7314 -4732 17862 25255 10642
15704A0642k1137j9404O411J3597p663N414J1276p406k0396m696Q434J6343o752
$$ 10642 -10495 -29899 -23488 -9891 -17554 -12140 -864 -8270 -28666 -33362 -24928 -8585 -15337
15691a5337N421n867J0279J2373j743J0577p95J2211n69k3039o734Q341q932j2731
$$ -15337 -9916 -15783 -5504 6869 5126 15703 14908 27119 26550 3511 -3223 5118 -3814 -16545
15677a6545o331J1056J1063O830J272M957j0112j6486M937J0072j3605l603m876
$$ -16545 -22876 -11820 -757 6073 7345 12302 2190 -14296 -9359 713 -12892 -16495 -21371
15664b1371k307l72m601n161j1294K205J3049J3145J0240Q341l688j3053L315
$$ -21371 -23678 -24050 -28651 -33812 -45106 -42901 -29852 -16707 -6467 1874 -1814 -14867 -11552
15651a1552P08J781J8918J9927J0940r140j6754j0064j1717j3602R982k517j2798
$$ -11552 -10844 -9063 9855 29782 40722 31582 14828 4764 -6953 -20555 -10573 -13090 -25888
15638b5888J7593K4102k946m037o847N382J811k232j6417j0365K49J1872M993
$$ -25888 -8295 15807 12861 8824 1977 7359 9170 6938 -9479 -19844 -19595 -7723 -2730
15625b730j009j7157O53R265N919j2487k0366O314l53J1976J3571N492R61j5587
$$ -2730 -3739 -20896 -20243 -10978 -5059 -17546 -37912 -31598 -31951 -19975 -6404 -912 49 -15538
15611a5538j697J0929p41o547K105M940R975J8430L090k0771j4143L772J0802
$$ -15538 -17235 -6306 -7047 -13594 -11489 -6549 3426 21856 24946 4175 -9968 -6196 4606
15598D606K243m257j8292o429N271J016M549J3796p901N648N33J74k356k0403
$$ 4606 6849 2592 -15700 -22129 -16858 -15842 -11293 2503 -5398 250 783 957 -1399 -21802
15584b1802J2776J7482J010j2701j5076j037M374m741K072j2309l158J3993N683
$$ -21802 -9026 8456 9466 -3235 -18311 -19348 -14974 -19715 -17643 -29952 -33110 -19117 -13434
15571a3434r738O926p490J2072J3863M54p692q698p256J4897Q056q719O287l494
$$ -13434 -23172 -16246 -23736 -11664 2199 2653 -5039 -13737 -20993 -6096 1960 -6759 -472 -3966
15557c966K310j3817j2737l508J3561K6753m147k3001L563P001K190L667l794
$$ -3966 -1656 -15473 -28210 -31718 -18157 8596 4449 -18552 -14989 -7988 -5798 -2131 -5925
15544e925K1963r441j9386J0483m115j0947j2359l763K494P316k767J0807J9636
$$ -5925 16038 6597 -12789 -2306 -6421 -17368 -29727 -33490 -30996 -23680 -26447 -15640 3996
15531C996j665j2721M192P202k912K678M858J5264j0315o681j4675k992J3485
$$ 3996 2331 -10390 -6198 1004 -1908 770 5628 20892 10577 3896 -10779 -13771 -286
15518b86j083j79j2407k4790j6087K1239K0852J2554J3541L820j4674k3954P776
$$ -286 -1369 -1548 -13955 -38745 -54832 -33593 -12741 -187 13354 17174 2500 -21454 -13678
15505a3678O360j0323J8128n855j9486J5256P712j0685k902M155L022K57J408
$$ -13678 -7318 -17641 487 -5368 -24854 -9598 -1886 -12571 -15473 -11318 -8296 -8039 -6631
15492f631J1751K068J0046q479J51J3454J562j0537R834K1445l132k6664k2595
$$ -6631 5120 7188 17234 8755 8906 22360 23922 13385 23219 44664 41532 14868 -7727
15479g727M874J4982N494j1721n218q983l902j4917l821J7411J5623k0070p882
$$ -7727 -2853 12129 17623 5902 684 -8299 -12201 -27118 -30939 -13528 2095 -17975 -25857
15466b5857r379M606Q366J1463L965J3406j7738o646K3312l017k259l576k0300
$$ -25857 -35236 -30630 -22264 -10801 -6836 6570 -11168 -17814 5498 2481 222 -3354 -23654
15453b3654k64J0067J785O432P910j667J890j0993j0959J363M020o553N030j4967
$$ -23654 -23918 -13851 -12066 -5634 2276 609 2499 -8494 -19453 -18090 -14070 -20623 -15593 -30560
15439c0560J7208M454J0631n928L126j637k108L65n732j3167J0775K166N213l848
$$ -30560 -13352 -8898 1733 -4195 -1069 -2706 -4814 -4449 -10181 -23348 -12573 -10407 -5194 -9042
15425i042k156Q05n891q331j2352J1331n557P011J2151J28j7222r075Q205M146
$$ -9042 -11198 -10393 -16284 -24615 -36967 -25636 -31193 -24182 -12031 -11903 -29125 -38200 -29995 -25849
15411b5849n031n094Q222J5102j0529L100M209O270N306R825k024j4655N396J8438
$$ -25849 -30880 -35974 -27752 -12650 -23179 -20079 -15870 -9600 -4294 5531 3507 -11148 -5752 12686
15397A2686j317N69o581j3645k322P197O441o972r400k591j2113j6144J2586J2678
$$ 12686 11369 11938 5357 -8288 -10610 -3413 3028 -3944 -13344 -15935 -28048 -44192 -31606 -18928
15383a8928J3993K781m06m596j6017m379J2786l365j2641k47J1294J2243M073
$$ -18928 -4935 -2154 -2560 -7156 -23173 -27552 -14766 -18131 -30772 -31019 -19725 -7482 -3409
15370c409J211p313j0760R087J253L984M60J0325K0890J0944j4865q913K754P96
$$ -3409 -2198 -9511 -20271 -11184 -9931 -5947 -5487 4838 25728 36672 21807 12894 15648 16444
15356A6444L096P23O647p167p433j9905j863O138j5427J5398P762p695q795P547
$$ 16444 19540 20263 26910 19743 12310 -7595 -9458 -3320 -18747 -3349 4413 -3282 -12077 -4530
15342d530J2471k803j333K876j3874j2920j96M424K0145R887J1275Q806p486o120
$$ -4530 7941 5138 3805 6681 -7193 -20113 -20309 -15885 4260 14147 25422 34228 26742 20622
15328B0622r495j4766j5191R67J734J2196q970j1711J6203N922N587N82J293j0787
$$ 20622 11127 -3639 -18830 -17863 -16129 -3933 -12903 -24614 -8411 -2489 3098 3680 4973 -5814
15314e814m674J2001R458J9379j2622j8206J027M767j5468p890r126J9328P298
$$ -5814 -10488 1513 10971 30350 17728 -478 549 5316 -10152 -18042 -27168 -7840 -542
15301e42j9087j32J2058L216J678N224j2858P858N013K517k7304J1489K811j1369
$$ -542 -19629 -19761 -7703 -4487 -2809 2415 -10443 -2585 2428 4945 -22359 -10870 -8059 -19428
15287a9428P635J6135J1990l1628j6073M310K5537J1836o142l788m481q333l403
$$ -19428 -11793 4342 16332 -15296 -31369 -27059 -1522 10314 4172 384 -4097 -12430 -15833
15274a5833K239Q095K485J5300r488j7025k0710l828K9096J4950k858j4110n984
$$ -15833 -13594 -5499 -3014 12286 2798 -14227 -34937 -38765 -9669 5281 2423 -11687 -17671
15261a7671M457M44j112n558J0166Q210n343j478n026R92K2879Q714j1208K921
$$ -17671 -13214 -12770 -13882 -19440 -9274 -1064 -6407 -7885 -12911 -11919 10960 19674 8466 11387
15247A1387o019j1569Q97k3708R623J0541q539o198N393J726o73O410J3363m92
$$ 11387 5368 -6201 -5304 -29012 -19389 -8848 -17387 -23585 -18192 -16466 -17139 -10729 2634 2142
15233B142K3987R44l917j9261j2172o16r140j1013J9002J3011j1129j0160L914
$$ 2142 26129 27073 23156 3895 -8277 -8893 -18033 -29046 -10044 2967 -8162 -18322 -14408
15220a4408Q428O464J0785J591L201j4055k0135M477L1272J328j0244j116P658
$$ -14408 -5980 484 11269 12860 16061 2006 -18129 -13652 17620 18948 8704 7588 15246
15207A5246K340o631j2702o188Q767P376P544j964M04r670J606o305j1741P402
$$ 15246 17586 10955 -1747 -7935 832 8208 15752 13788 14192 4522 6128 -177 -11918 -4516
15193d516J6157k201j1836L321K025j0077j9985n817J4539J143N498J4336N581
$$ -4516 11641 9440 -2396 925 2950 -7127 -27112 -32929 -18390 -17247 -11749 2587 8168
15180H168R419k82k1496j7383N397J0639L12m852j1244L916k351J2595K1504j1269
$$ 8168 17587 17305 -4191 -21574 -16177 -5538 -5226 -10078 -21322 -17406 -19757 -7162 14342 3073
15166C073j9642q374K2491O623j562j2345O643Q020j7430k3341j472J4350K9834
$$ 3073 -16569 -24943 -2452 4171 2609 -9736 -3093 4927 -12503 -35844 -37316 -22966 6868
15153F868J0439Q355o318k266j539N959k464j0636m130j4422j639j289J6377J95
$$ 6868 17307 25662 19344 17078 15539 21498 19034 8398 4268 -10154 -11793 -13082 3295 3490
15139C490j9995l495J0960N65o286m11n93J0040J6472R077J1718j330k3624L155
$$ 3490 -16505 -20000 -9040 -8475 -14761 -15172 -15765 -5725 10747 19824 31542 30212 6588 9743
15125I743L411o59p525k735K829n095j5251L741J52J1159q711j415m51P382r110
$$ 9743 13154 12495 4970 2235 5064 -31 -15282 -11541 -11389 -230 -8941 -10356 -10807 -3425 -12535
15110a2535q231M853M02r405J774J8442J503R186j566l930l263k862M593r838
$$ -12535 -20766 -15913 -15511 -24916 -23142 -4700 -3197 5989 4423 493 -2770 -5632 -1039 -10877
15096a0877M858k252k981j9244N298O584k564P083L173N135k083M507J0747m882
$$ -10877 -6019 -8271 -11252 -30496 -25198 -18614 -21178 -14095 -10922 -5787 -7870 -3363 7384 2502
15082B502K830l42o197j2274J656k012n656r119k357R356J3092O034N221k0771
$$ 2502 5332 4990 -1207 -13481 -11825 -13837 -19493 -28612 -30969 -21613 -8521 -2487 2734 -18037
15068a8037M924J1473p418Q130R172q775o659J752j796j32j0992K023J1272j5667
$$ -18037 -13113 -1640 -9058 -928 8244 -531 -7190 -5438 -7234 -7366 -18358 -16335 -5063 -20730
15054b0730j6641l670J7277K6170r238J6500M350r580m486O874q858k125o222
$$ -20730 -37371 -41041 -23764 2406 -6832 9668 14018 4438 -48 6826 -2032 -4157 -10379
15041a0379m345M845p770K470N063Q024L626n320j7162q187J7903K1961r938j7993
$$ -10379 -14724 -9879 -17649 -15179 -10116 -2092 1534 -3786 -20948 -29135 -11232 10729 791 -17202
15027a7202J8883K3371J373m853o053p633j9618M750J5144J2123j2337l742l145
$$ -17202 1681 25052 26425 21572 15519 7886 -11732 -6982 8162 20285 7948 4206 1061
15014A061M944J0463o448j0829J2671O212r741n239K515j3899m316j0214J4578
$$ 1061 6005 16468 10020 -809 11862 18074 8333 3094 5609 -8290 -12606 -22820 -8242
15001h242K0014O54j1919k751J1819M969q234L821Q030r352k994K561K840j062
$$ -8242 11772 12426 507 -2244 9575 14544 6310 10131 18161 8809 5815 8376 11216 10154
14987A0154N491k559q343R300J4695P870O976j3004j8468k0356L294Q694m934
$$ 10154 15645 13086 4743 14043 28738 36608 43584 30580 12112 -8244 -4950 3744 -1190
14974a190P489o580l22J1237j1236o734j1935K061M246O996L772m985P650L282
$$ -1190 6299 -281 -603 10634 -602 -7336 -19271 -17210 -12964 -5968 -2196 -7181 469 3751
14960C751q898j1083j2970j6739j1252J9783J8707R359M439J0248Q786j2919l640
$$ 3751 -5147 -16230 -29200 -45939 -57191 -37408 -18701 -9342 -4903 5345 14131 1212 -2428
14947b428k339n613N857N520J069j2932N074R688L662q147K595p3L832r57m580
$$ -2428 -4767 -10380 -4523 997 2066 -10866 -5792 3896 7558 -589 2006 1933 5765 4808 228
14932B28j5850j2965M827J0722Q044J2834J121j7758q372l477J4123K5869J0438
$$ 228 -15622 -28587 -23760 -13038 -4994 7840 8961 -8797 -17169 -20646 -6523 19346 29784
14919B9784q098k1528n864J886J1101J0361l462j907J6799M793j9581p073J305
$$ 29784 21686 158 -5706 -3820 7281 17642 14180 12273 29072 33865 14284 7211 8516
14906H516P743p449n032N062p277k417n599O786N769j6245p147K0807Q947m625
$$ 8516 16259 8810 3778 8840 1563 -854 -6453 333 6102 -10143 -17290 3517 12464 7839
14892G839q892l111p912M576n061k1893K3876J7437p77K78M158r636m022J1098
$$ 7839 -1053 -4164 -12076 -7500 -12561 -34454 -10578 6859 6082 6360 10518 882 -3140 7958
14878G958K367J256N267k8976r950K3081K793p981M687k2380k264j3114p524O901
$$ 7958 10325 11581 16848 -12128 -22078 1003 3796 -4185 502 -21878 -24142 -37256 -44780 -37879
14864c7879M083J3602J415k497P696R095k560n282N771n6Q418J9174J538j1924
$$ -37879 -33796 -20194 -18779 -21276 -13580 -4485 -7045 -12327 -6556 -6612 1806 20980 22518 10594
14850A0594M727j434q334K927J1269J1354k4388j5643j1504K5525K3617J3710
$$ 10594 15321 13887 5553 8480 19749 31103 6715 -8928 -20432 5093 28710 42420
14838D2420O555J4295O978L1564M7743P8579O3226L6489R804k2284m9922o8873
$$ 42420 48975 63270 70248 101812 149555 228134 291360 327849 337653 315369 265447 196574
14826A96574n1217k0997k1005k9759j2674k3866j0167M172j442k1788n918j863
$$ 196574 145357 124360 103355 73596 60922 37056 26889 31061 29619 7831 1913 50
14814E0M430P427m70n051j2819j1570Q91K3355R735p78k199l668J1537q320j0898
$$ 50 4480 11907 11437 6386 -6433 -18003 -17112 6243 15978 15200 13001 9333 20870 12550 1652
14799A652O757j7246j1952L533O481K555J3841J6376m141q116j4819j1563j668
$$ 1652 8409 -8837 -20789 -17256 -10775 -8220 5621 21997 17856 9740 -5079 -16642 -18310
14786a8310P426j67O851j613q90o266q582L576J4310K1727M105k930j8622k9928
$$ -18310 -10884 -11051 -4200 -5813 -6703 -12969 -21551 -17975 -3665 18062 22167 19237 615 -29313
14772b9313O652J8378J2731k96j1219M643j0010n781J1235K6033N124l1396k3312
$$ -29313 -22661 -4283 8448 8152 -3067 1576 -8434 -14215 -2980 23053 28177 -3219 -26531
14759b6531P558J4876J2544J2376j3731j1097m923J31M759J5134j8189p699L419
$$ -26531 -18973 -4097 8447 20823 7092 -4005 -8928 -8797 -4038 11096 -7093 -14792 -11373
14746a1373m681K152R973J1016q776j2447N922N431r263n659N895J9579j3335
$$ -11373 -16054 -13902 -3929 7087 -1689 -14136 -8214 -2783 -12046 -17705 -11810 7769 -5566
14733e566k1342m455J1325J2152J6581j1890p478J8557L0P901p456j3421L900
$$ -5566 -26908 -31363 -20038 -7886 8695 -3195 -10673 7884 7914 15815 8359 -5062 -1162
14720a162J6928j2569j4654J1818Q512n209j4907l721j4043L384K268J1757K0246
$$ -1162 15766 3197 -11457 361 8873 3664 -11243 -14964 -29007 -25623 -23355 -11598 8648
14707H648p045L054K0168K909k0271p755M284L450L118l642J733m905j965q304
$$ 8648 1603 4657 24825 27734 7463 -292 3992 7442 10560 6918 8651 3746 1781 -6523
14693f523O060O148J2794L467N327j0522j0559p232n563P535p739p572M859J858
$$ -6523 -463 5685 18479 21946 27273 16751 6192 -1040 -6603 932 -6807 -14379 -9520 -7662
14679g662l470K99K633K4208M689N879R6n895m33l642j3792J100Q902j4241m352
$$ -7662 -11132 -10833 -8200 16008 20697 26576 26672 20777 20344 16702 2910 4010 12912 -1329 -5681
14664e681J332o741L572K2476j348j1039O928J3475l00m125j2351K147j2647j3856
$$ -5681 -4349 -11090 -7518 14958 13610 2571 9499 22974 22674 18549 6198 8345 -4302 -18158
14650a8158j7557J2486m558N018J7335K4738N860l447J073P153k650O029j2213
$$ -18158 -35715 -23229 -27787 -22769 -5434 19304 25164 21717 22790 29943 27293 33322 21109
14637B1109k5693j8057j855J6620n141j0979J0032J9004l838k403k056J4631P438
$$ 21109 -4584 -22641 -24496 -7876 -13017 -23996 -13964 5040 1202 -1201 -3257 11374 18812
14624A8812k024j6640k0308R139J1434q325j862O553J901N972l213p927p935R594
$$ 18812 16788 148 -20160 -11021 413 -7912 -9774 -3221 -1320 4652 1439 -6488 -14423 -4829
14610d829R750Q923k0222J5855N970P215j1939m836J8878q163n199j362J288l922
$$ -4829 4921 13844 -6378 9477 15447 22662 10723 5887 24765 16602 11403 10041 11329 7407
14596G407J3430l254q61O928m79P662R240N299j7460O381k213r159l397j6598
$$ 7407 20837 17583 16722 23650 23171 30833 40073 45372 27912 34293 32080 22921 19524 2926
14582B926o779P573j5597n024J1895m183J3317N339J4412K444j4130q493j0756
$$ 2926 -3853 3720 -11877 -16901 -5006 -9189 4128 9467 23879 26323 12193 3700 -7056
14569g056q562J7147J3316Q230O927j0357k1170l785o421K1423k0m955j1146j1957
$$ -7056 -15618 1529 14845 23075 30002 19645 -1525 -5310 -11731 9692 9672 4717 -6429 -18386
14555a8386R785P056L688R526n130P95m204O760j504J5162M082L422P50j950k8888
$$ -18386 -8601 -1545 2143 11669 6539 7334 3130 9890 8386 23548 27630 31052 31802 29852 964
14540I64J204J4446J2722l780l680k41l383l1032p421J6793L444K6180J0754k7044
$$ 964 2168 16614 29336 25556 21876 21635 18252 -12780 -20201 -3408 36 26216 36970 9926
14526I926l571J2886J1553k4757RM668K0929o839j8279l40J0952N109O230J1320
$$ 9926 6355 19241 30794 6037 6046 10714 31643 24804 6525 6185 17137 22246 28476 39796
14512C9796j653j2500N984k013j5441j5019K714P306K974J5175K404k3066r633
$$ 39796 38143 25643 31627 29614 14173 -846 1868 9174 12148 27323 29727 6661 -2972
14499b972R887o925k1048j8823Q009J8975O578L394p226j0369p072M110L447R111
$$ -2972 6915 -10 -21058 -39881 -31872 -12897 -6319 -2925 -10151 -20520 -27592 -23482 -20035 -10924
14485a0924L479m607J0826J5775r929j1482r133L413J9465J0169q018l099J8302
$$ -10924 -7445 -12052 -1226 14549 4620 -6862 -15995 -12582 6883 17052 9034 5935 24237
14472B4237O015k6259j2167J1935r680j3310q610k072K0003q941Q013J8989K596
$$ 24237 30252 3993 -8174 3761 -5919 -19229 -27839 -29911 -9908 -18849 -10836 8153 10749
14459A0749n113K3409Q975k021j0227r869R70k900L657q770M096J0014j5661k2792
$$ 10749 5636 29045 38020 35999 25772 15903 16873 13973 17630 8860 12956 22970 7309 -15483
14445a5483p641J4420K736r881N574P67J909N879J1732J3839q841J979j8494k368
$$ -15483 -23124 -8704 -5968 -15849 -10275 -9508 -7599 -1720 10012 23851 15010 16989 -1505 -3873
14431c873M204L928J0055J4969r621p040o733M260Q354j426j925K77L0051k935
$$ -3873 331 4259 14314 29283 19662 12622 5889 10149 18503 17077 15152 15429 45480 42545
14417D2545k1527n26M488q343M12R658J674r132K1538J1895j875J042K4061K5895
$$ 42545 21018 20492 24980 16637 17049 26707 28381 19249 40787 52682 50807 51849 75910 101805
14403A01805j691J9592M1406M1686N6445Q1107J73788L07450L40915K18482J19523
$$ 101805 100114 119706 161112 202798 259243 340350 514138 821588 1162503 1380985 1500508
14392A500508l8050j91585k40479k15470j90326j80629j32317o4549m4420m1314
$$ 1500508 1462458 1270873 1030394 814924 624598 443969 311652 247103 202683 161369
14382A61369j9459k1205j0327j6977q583J2455J6805P346k4823j0894j3328k9930
$$ 161369 141910 120705 110378 93401 84818 97273 114078 121424 96601 85707 72379 42449
14370D2449j1432j1748N607J215j1950J85M843k979j3737Q23j028J0433J4250
$$ 42449 31017 19269 24876 26091 14141 14326 19169 16190 2453 3276 2248 12681 26931
14357B6931M349R621K110k311k2617N42J460J3519J760j470J6010P853L831j4902
$$ 26931 31280 40901 43011 40700 18083 18625 20085 33604 35364 33894 49904 57757 61588 46686
14343D6686k7179o916R835J455q359j0086K0210K246j284K552P634J547N988j681
$$ 46686 19507 12591 22426 23881 15522 5436 25646 27892 26608 29160 36794 38341 44329 42648
14329D2648r601K39K781k0344r378K197J9951j2513k2454J9392J8738o319p785
$$ 42648 33047 33286 36067 15723 6345 8542 28493 15980 -6474 12918 31656 25337 17552
14316A7552j8586n330l958q452J4301J8469J0275L273P120O53j1193k519M335
$$ 17552 -1034 -6364 -10322 -18774 -4473 13996 24271 27544 34664 35317 24124 21605 25940
14303B5940J3733k52J91n70P887Q955k922m169k896L414l186j0979N780r982j154
$$ 25940 39673 39421 39612 39042 46929 55884 52962 48793 45897 49311 46125 35146 40926 30944 29790
14288B9790P041j1718j2492J099O944p753m462J0061Q538Q250m159j7841J987
$$ 29790 36831 25113 12621 13720 20664 12911 8449 18510 27048 35298 31139 13298 15285
14275A5285j182N945J2291K239j059j8601j0440q855Q172O036r076k246J53p097
$$ 15285 14103 20048 32339 34578 33519 14918 4478 -4377 3795 9831 755 -1491 -1338 -8435
14261h435J7559J0988J40r028O75Q172j53j0352m073J006K585R39J7607j524n467
$$ -8435 9124 20112 20252 11224 11899 20071 19918 9566 5493 6499 9084 10023 27630 26106 20639
14246B0639O946p976j4394J491J556k49R350J9550K266r641N38l470Q614O725
$$ 20639 27585 19609 5215 6706 8262 8013 17363 36913 39179 29538 30076 26606 35220 41945
14232D1945j8228k65K825J2335Q587j1207j2091N705L533l034l536R183J4800
$$ 41945 23717 23452 26277 38612 47199 35992 23901 29606 33139 30105 26569 35752 50552
14219E0552R270j3804k669M605r644k6967q654J0261P034J7367O410j1359j0758
$$ 50552 59822 46018 43349 47954 38310 11343 2689 12950 19984 37351 43761 32402 21644
14206B1644j1983j571Q236P434n655j1898p267J5113p882k0303k994j617J6970
$$ 21644 9661 8090 16326 23760 18105 6207 -1060 14053 6171 -14132 -17126 -18743 -1773
14193a773K2101P32N331P611J0131m744k324O758r991p822M679l912l123N292
$$ -1773 20328 21060 26391 34002 44133 39389 37065 43823 33832 26010 30689 26777 23654 28946
14179B8946q79K549P653P067p134j83Q755M743j944l671J0354L4584N9226L0243
$$ 28946 28067 30616 38269 45336 38202 38019 46774 51517 49573 45902 56256 90840 150066 180309
14165A80309K7449N917k0199l7607m2292j9244p531j8570j451P42j203l98M896
$$ 180309 207758 213675 193476 155869 113577 94333 86802 68232 66781 67523 66320 65922 70818
14152G0818o700j4878j9415n970N771L679o809n669K4918J6235R409J1166j0456
$$ 70818 64118 49240 29825 23855 29626 33305 26496 20827 45745 61980 71389 82555 72099
14139G2099J610m047j1329r6J0122P559m944j0526n825O816J4171N790q007j1229
$$ 72099 73709 69662 58333 58237 68359 75918 70974 60448 54623 61439 75610 81400 73393 62164
14125F2164o255O144L261j003j3612J028j66M298K4184q373r936l191J0132J9646
$$ 62164 55909 62053 65314 64311 50699 51727 51561 55859 80043 71670 61734 58543 68675 88321
14111H8321J1708J576j1739j6423q765j703j0870Q029j3213j8526j2462k7441
$$ 88321 100029 101605 89866 73443 64678 62975 52105 60134 46921 28395 15933 -11508
14099a1508k8325M545J9590K3188M0325J5592p253j5771J073O786j266J5215l953
$$ -11508 -39833 -35288 -15698 7490 47815 63407 56154 40383 41456 48242 46976 62191 58238
14086E8238k2246j1961k0151K404J0001J2866l682K5538J9346p205j9494j7924
$$ 58238 35992 24031 3880 6284 16285 29151 25469 51007 70353 63148 43654 25730
14074B5730J4958m451j2802m056j501Q317J0480K3518Q866m169K314J7187J3167
$$ 25730 40688 36237 23435 19379 17878 26195 36675 60193 69059 64890 67204 84391 97558
14061I7558k649j3247r791n000P607J1225P684M366j605q363J3899L1282K6238
$$ 97558 94909 81662 71871 66871 74478 85703 93387 97753 96148 87785 101684 132966 159204
14048A59204o409j7532o559J9543K5368j95k2140J0959L5845K4727K300p516j2620
$$ 159204 152795 135263 128704 148247 173615 173420 151280 162239 198084 222811 225111 217595 204975
14035B04975k7596j062Q507m7182l5895j5255m824K521M73j840m049o337l607
$$ 204975 177379 176317 184824 137642 101747 86492 81668 84189 84662 82822 78773 72436 68829
14022F8829J4747j911p566K833J088k0473n428J9856J5600K0678J9866J2010r06
$$ 68829 83576 81665 74099 76932 78020 57547 52119 71975 87575 108253 128119 140129 139223
14009A39223P608J4754M243q956o048J1186J7812n909k596L79R276J5698l703
$$ 139223 146831 161585 165828 156872 150824 162010 179822 173913 171317 171696 180972 196670 192967
13996A92967n99L251M378J0540J6447J6283K0012J8888k878j5503L484k251o55
$$ 192967 192368 195619 199997 210537 226984 243267 263279 282167 279289 263786 267270 265019 264364
13983B64364J9488J4584J233K9888J493o763L700J5174q752q173m89J39M075J7408
$$ 264364 283852 298436 299669 329557 331050 324287 327987 343161 334409 326236 325747 325886 329961 347369
13969C47369K4541K2927L1704L4364J4781L2427M0713L2934P2867J15008J87718
$$ 347369 371910 394837 426541 460905 475686 508113 548826 581760 654627 769635 957353
13958I57353K61538J36893N3795J12534J96249J13573q5276j18244o4253m2224
$$ 957353 1218891 1355784 1409579 1522113 1718362 1831935 1746659 1628415 1564162 1521938
13948A521938m5513k1830K0280O3382R6994J09601J13322J16027J63566J67721
$$ 1521938 1476425 1454595 1474875 1538257 1635251 1744852 1858174 1974201 2137767 2305488
13938B305488J69506K13427K38997K85586L24856M28306N75507P12790Q11738
$$ 2305488 2474994 2688421 2927418 3213004 3537860 3966166 4541673 5254463 6066201
13929F066201R88672R91137R24638J058660J142941J457283J953135K361239K768795
$$ 6066201 7054873 8046010 8970648 10029308 11172249 12629532 14582667 16943906 19712701
13920A9712701L374667M551221O753175J0916333J9056988L5311482N9194612
$$ 19712701 23087368 27638589 34391764 45308097 64365085 99676567 158871179
13913A58871179O0327049L4832648J9044638j7915861l8107017m0478809l8758872
$$ 158871179 219198228 254030876 273075514 255159653 217052636 176573827 137814955
13906A37814955l7517101l1466654k0021847j1651868p290337m941747l668746
$$ 137814955 100297854 68831200 48809353 37157485 29867148 24925401 21256655
13899B1256655k852258k129509j554436j295465j170271j065153j127683j058874
$$ 21256655 18404397 16274888 14720452 13424987 12254716 11189563 10061880 9003006
13891I003006r72640q83955q08073p00769n74058m67543l80341l15510k81750
$$ 9003006 8030366 7146411 6338338 5637569 5063511 4595968 4215627 3900117 3618367
13882C618367k71391k77399k39458j98564j67502j36572j26113j25956j41310
$$ 3618367 3346976 3069577 2830119 2631555 2464053 2327481 2201368 2075412 1934102
13873A934102j53219j27655r5057p8952o5525n8606o6390m6713l8523m1042l4397
$$ 1934102 1780883 1653228 1558171 1479219 1413694 1355088 1288698 1241985 1203462 1162420 1128023
13862A128023n7237n2687l1528n1388m9507l0275l4269j8768k8938m9676m5073
$$ 1128023 1070786 1018099 986571 935183 885676 855401 821132 802364 773426 723750 678677
13851F78677j6990l9074k3521k7374l0327k8872l4742m1446k9240j122j0881j3752
$$ 678677 661687 622613 599092 571718 541391 512519 477777 436331 407091 405969 395088 381336
13839C81336j7725K625j2805j7616k6209p459r403j8951l097k357k800j1663j7006
$$ 381336 363611 366236 353431 335815 309606 302147 292744 273793 270696 268339 265539 253876 236870
13826B36870q989j6099j0195r147K955M071J1136j7028q792J852o30j2851q737
$$ 236870 227881 211782 201587 192440 195395 199466 210602 193574 184782 186634 186004 173153 164416
13813A64416l082L4365P240j0424L524J5930m902p652k013j1389k09m915o167
$$ 164416 161334 195699 202939 192515 196039 211969 207067 199415 197402 186013 185804 180889 174722
13800A74722J0340Q180P503N891J8400J2827q004j7292J3353j7119J045j3541
$$ 174722 185062 193242 200745 206636 225036 237863 229859 212567 225920 208801 209846 196305
13788A96305R749P832L1161j4983l0976k7364l3706j5040q167k3932m316j6816
$$ 196305 206054 213886 245047 230064 199088 171724 138018 122978 114811 90879 86563 69747
13776F9747j2116J0051j6017j0695j8578J6300J2828K2132K052j1213j3962q340
$$ 69747 57631 67682 51665 40970 22392 38692 51520 73652 75704 64491 50529 42189
13764D2189j344L679n560j4004j9481K4758L911p612K3327K5073K7918J9831L975
$$ 42189 40845 44524 38964 24960 5479 30237 34148 26536 49863 74936 102854 122685 126660
13751A26660p531q375Q643k235L46N787j1395j1869q278j451j1361k3264N591
$$ 126660 119129 110754 119397 117162 117508 123295 111900 100031 91753 90302 78941 55677 61268
13738F1268J0070R020k0906k4021M602J3223K994j4249k527J6327Q092K21J9936
$$ 61268 71338 80358 59452 35431 40033 53256 56250 42001 39474 55801 63893 64114 84050
13725H4050K0293J4085J4537p385k8659k1443n421l90k5886j9196j1165j0664
$$ 84050 104343 118428 132965 125580 96921 75478 70057 69667 43781 24585 13420 2756
13713B756j8489m454N946K0159J2143j1203n888K4479R022M812j9042p317o426
$$ 2756 -15733 -20187 -14241 5918 18061 6858 970 25449 34471 39283 20241 12924 6498
13700F498k0724m419J2130K3848Q711J378L255j9555k3851M379J6184j1804L195
$$ 6498 -14226 -18645 -6515 17333 26044 27422 30677 11122 -12729 -8350 7834 -3970 -775
13687g75J5528j4372j0056m829J3081L527j5053M138j734J057O350k683N027j007
$$ -775 14753 381 -9675 -14504 -1423 2104 -12949 -8811 -10545 -9488 -3138 -5821 -794 -1801
13673a801j0094J1640J6067J4583J9894n17P56N74j0720J4227J7167N111P745
$$ -1801 -11895 -255 15812 30395 50289 49772 50528 51102 40382 54609 71776 76887 84632
13660H4632r974q810m605k230M344K7866j9586l7171P343K574N988m079o58m031
$$ 84632 74658 65848 61243 59013 63357 91223 71637 34466 41809 44383 50371 46292 45634 41603
13646D1603m223p918J1907Q130k852Q963R915j3669r756j2174Q798R100k0063
$$ 41603 37380 29462 41369 49499 46647 55610 65525 51856 42100 29926 38724 47824 27761
13633B7761q492L702j2511N694L1004J2666l565m845j0697j6666n088o908n1O844
$$ 27761 19269 22971 10460 16154 47158 59824 56259 51414 40717 24051 18963 12055 12004 18848
13619A8848P549j7826p099K2974k959j8045J294k4206R93J6563J9943L200K219
$$ 18848 26397 8571 1472 24446 21487 3442 4736 -19470 -18477 -1914 18029 21229 23448
13606B3448l876k17j0504j1578n471L707m039R227J7676P210P78N040j4806l816
$$ 23448 19572 19355 8851 -2727 -8198 -4491 -8530 697 18373 25583 26361 31401 16595 12779
13592A2779p74j4652j0493K305J9175R664Q783l381j1930l100j462N364J6378
$$ 12779 12005 -2647 -13140 -10835 8340 18004 26787 23406 11476 8376 6914 12278 28656
13579B8656p943k2100J776P660m51N272K440L881J4435K4874O320m702O487k817
$$ 28656 20713 -1387 389 8049 7598 12870 15310 19191 33626 58500 64820 60118 66605 63788
13565F3788j4487m30K947j4153o684j2591Q862K0015j6125j1653M722k1401j3522
$$ 63788 49301 48871 51818 37665 30981 18390 27252 47267 31142 19489 24211 2810 -10712
13552a0712k76r633J921J3163K4459J5766k325O523O411L629R63o339k4347k4622
$$ -10712 -10988 -20621 -18700 -5537 18922 34688 32363 38886 45297 48926 49889 43550 19203 -5419
13538e419N960L709j4110l450J959n62K028r27L747L998P648j1323k1349j410
$$ -5419 541 4250 -9860 -13310 -11351 -11913 -9885 -10812 -7065 -3067 4581 -6742 -28091 -29501
13524b9501O901J1585j014J969P010J4335j5086l390j217Q741M141j8889O521
$$ -29501 -22600 -11015 -12029 -10060 -3050 11285 -3801 -7191 -8408 333 4474 -14415 -7894
13511g894K3244J8403O235J451J0908K939o425j7742j8353j0309P720J5720O008
$$ -7894 15350 33753 39988 41439 52347 55286 48861 31119 12766 2457 10177 25897 31905
13498C1905o337L835Q121j7830m917R057j4459o882L61j778K0709Q183j5351r313
$$ 31905 25568 29403 37524 19694 14777 23834 9375 2493 2854 1076 21785 29968 14617 5304
13484E304N878J6067j9755j1519Q925j3257O572J017j163K0222Q22p424j1278
$$ 5304 11182 27249 7494 -4025 4900 -8357 -1785 -768 -1931 18291 19113 11689 411
13471D11L064n243j5419j1874J6710J7537J3380N776p389j3828j7331j413K2174
$$ 411 3475 -1768 -17187 -29061 -12351 5186 18566 24342 16953 3125 -14206 -15619 6555
13458F555J435r398J7761p181m022r391K225N1l032Q784J2624K282M818N774K1726
$$ 6555 7990 -1408 16353 9172 5150 -4241 -2016 -1965 -4997 3787 16411 18693 23511 29285 51011
13443E1011l522k160R997j3734Q81j664k185K0168K0514P170O358J6060J3348
$$ 51011 47489 45329 55326 41592 42473 40809 38624 58792 79306 86476 92834 108894 122242
13430A22242J4038M9777J03949J31986J86939L06700L11982J78864Q8361j07756
$$ 122242 136280 186057 290006 421992 608931 915631 1227613 1406477 1494838 1387082
13420A387082k23592k19196k04437j82929j59482j02426o8827l4995l6804k8952
$$ 1387082 1163490 944294 739857 556928 397446 295020 226193 191198 154394 125442
13410A25442j515L911J497j2035r252j0861l3199r652L0419M178j5474j9111k5842
$$ 125442 123927 127838 129335 117300 108048 97187 63988 54336 84755 88933 73459 54348 28506
13397B8506j0244K271J4658J752j1339j1013j3139P989O815P08j2771J695J7795
$$ 28506 18262 20533 35191 36943 25604 14591 1452 9441 16256 16964 4193 5888 23683
13384B3683J9418r801k605q108l007m923o311q135J0077m003p162N503m60R306
$$ 23683 43101 33300 30695 22587 19580 14657 8346 211 10288 6285 -877 4626 4166 13472
13370A3472J1413r678J1527R244k4863k5517k270k692J386J4704r72M340J8704
$$ 13472 24885 15207 26734 35978 11115 -14402 -16672 -19364 -17978 -3274 -4246 94 18798
13357A8798J7842K871o814j4161j7908O299J191l844o633j4435p515J3502J8255
$$ 18798 36640 39511 32697 18536 628 6927 8118 4274 -2359 -16794 -24309 -10807 7448
13344G448L242N120j1595m68q157O95K3307N770J0011o024k1893r31P37l469r479
$$ 7448 10690 15810 4215 3747 -4410 -3715 19592 25362 35373 29349 7456 6525 7262 3793 -5686
13329e686K221J4853R776j0112n029K563P72P372P955j9560O130P140j8859J293
$$ -5686 -3465 11388 21164 11052 6023 8586 9358 16730 24685 5125 11255 18395 -464 829
13315H29Q092J2310L86o935r456O077l475j0832k400l867J2221K5008r731j6225
$$ 829 8921 21231 21617 14682 5226 11303 7828 -3004 -5404 -9271 2950 27958 18227 2002
13301B002j103K661L989j5373q434m599J0984P230N855L128m014j171k263Q139
$$ 2002 899 3560 7549 -7824 -16258 -20857 -9873 -2643 3212 6340 2326 1155 -1108 7031
13287G031Q745k136j3378P301P634L260n123p653m977K1420k035l01J4150j3830
$$ 7031 15776 13640 262 7563 15197 18457 13334 5681 704 22124 20089 19788 33938 20108
13273B0108J226J0246j6212k8789q170o07k695J9983J8886j5828j2459m283j879
$$ 20108 21334 31580 15368 -13421 -21591 -22198 -24893 -4910 13976 -1852 -14311 -18594 -20473
13260b0473l581J6351k690J037J8448P984n157R22P634l864j5841L708J836J0200
$$ -20473 -24054 -7703 -10393 -9356 9092 17076 11919 12841 20475 16611 770 4478 6314 16514
13246A6514J6730k949p877p432j7013j8622J0171J4689P752n01J399j5655j3280
$$ 16514 33244 30295 22418 14986 -2027 -20649 -10478 4211 11963 11462 12861 -2794 -16074
13233a6074k110J2809r85N02L125J7528O408L554p691k3650o439N597J8063J2130
$$ -16074 -18184 -5375 -6360 -5858 -2733 14795 21203 24757 17066 -6584 -13023 -7426 10637 22767
13219B2767M78j5944j1195r561j3969J1322K1814O107J4829K200J55l10p0j0969
$$ 22767 23245 7301 -3894 -13455 -27424 -16102 5712 11819 26648 28848 29003 28693 28623 17654
13205A7654O12L2912J0965K2190J9607L9770K3751k5101l3772l705k895j1409
$$ 17654 18266 51178 62143 84333 103940 143710 167461 142360 108588 104883 101988 90579
13193I0579j4295l1978j1530m346l750m266j6622j515q972P925J5452j959j2551
$$ 90579 76284 44306 32776 28430 24680 20414 3792 2277 -6695 1230 16682 14723 2172
13180B172j9689n52k998n44k597J7155M910j4100J6100J9884n812P790J8303p080
$$ 2172 -17517 -18069 -21067 -21611 -24208 -7053 -2143 -16243 -143 19741 13929 21719 40022 32942
13166C2942k559J8904J57j2436Q091K547K0600K9961O0236P7496R7663J09765
$$ 32942 30383 49287 49444 37008 45099 47646 68246 98207 158443 235939 333602 443367
13154D43367M3703n631m5920p1116n7728p8111o5778n6801l5748o879J900q852
$$ 443367 487070 481439 435519 364403 306675 228564 162786 105985 70237 63358 65258 56406
13142E6406j5247j6838j0810Q432J8546J3808P468j5131p762l445M273r44P740
$$ 56406 41159 24321 13511 21943 40489 54297 61765 46634 38872 35427 39700 38756 46496
13129D6496l516L587n4j8940K116N573n023J4636J2033O39J5052p007j3670O378
$$ 46496 42980 46567 46513 27573 29689 35262 30239 44875 56908 57547 72599 65592 51922 58300
13115E8300K9499M0866M1267O2166R3172R3016P2335J1654k2689n4459q2809p8586
$$ 58300 87799 128665 169932 232098 325270 418286 490621 502275 479586 425127 342318 263732
13103B63732o5756o0144l7691j9767m416j9466r252o950k0331n520J1489O298
$$ 263732 197976 137832 100141 80374 75958 56492 47240 40290 19959 14439 25928 32226
13091C2226K218J023k1958j1557n809l919J2234J4178K6108K889k3428j5932j9900
$$ 32226 34444 35467 13509 1952 -3857 -7776 4458 18636 44744 47633 24205 8273 -11627
13078a1627k07R140L941j163M298J2431J2480m859J668K2568J1810J5632L1826
$$ -11627 -11834 -2694 1247 84 4382 16813 29293 24434 26102 48670 60480 76112 107938
13065A07938L2979K3028J976j0402j6256m494l8634l7873j8625k78n583k236K48
$$ 107938 140917 163945 165921 155519 139263 134769 96135 58262 39637 39359 33776 31540 31788
13052C1788j9030j7314l604J2215N788N57J3790N847l253j3245k769l547O883
$$ 31788 12758 -4556 -8160 4055 9843 10400 24190 30037 26784 13539 10770 7223 14106
13039A4106j149p86k009j484M473k411k977r479M122O455k4292q804L0962N438
$$ 14106 12957 12171 10162 8678 13151 10740 7763 -1716 2406 8861 -15431 -24235 6727 12165
13025A2165j410q178m819J6009j931j3622k2150M454J6127N086q4q789j214j1884
$$ 12165 10755 2577 -2242 13767 11836 -1786 -23936 -19482 -3355 1731 1647 -7142 -8356 -20240
13011b0240j0031J0165J512J9521K0382n185j5965O87j1065j7005j5230O640K8079
$$ -20240 -30271 -20106 -18594 927 21309 16124 159 846 -10219 -27224 -42454 -35814 -7735
12998g735J3832j4004k094P601r58o252N049P51j1323m839J2385P209k3476N651
$$ -7735 6097 -7907 -10001 -2400 -3358 -9610 -4561 -3810 -15133 -19972 -7587 -378 -23854 -18203
12984a8203K7703l717M09l050j3172Q175J4831N971k432k2716j2679O634J3004
$$ -18203 9500 5783 6192 3142 -10030 -1855 12976 18947 16515 -6201 -18880 -12246 758
12971G58J1734o981M226K357P614r80p523j3003j7565q304K161M410Q331j1663
$$ 758 12492 5511 9737 12094 19708 18728 11205 -1798 -19363 -27667 -25506 -21096 -12765 -24428
12957b4428m304Q273J1083J9239p97P255L390j1428J296Q27p642k645k3568m644
$$ -24428 -28732 -20459 -9376 9863 9066 16321 19711 8283 9579 10406 2764 119 -23449 -28093
12943b8093O982Q997m001M373j147q633P432O664O451o459p799o474j2564J3455
$$ -28093 -21111 -12114 -16115 -11742 -12889 -21522 -14090 -7426 -975 -7434 -15233 -21707 -34271 -20816
12929b0816J9813m200p184m657n613o845l249J2244l949R35O138j1194q223J1195
$$ -20816 -1003 -5203 -12387 -17044 -22657 -29502 -32751 -20507 -24456 -23521 -17383 -28577 -36800 -25605
12915b5605J1130J4266R70M051K0200N908k07m78j8215o615j954J802p798J584
$$ -25605 -14475 -209 761 4812 25012 30920 30713 30235 12020 5405 3451 5253 -2545 -961
12901i61j693M748l478q73k701j5890j2676R525L16p638R947J0914Q207k257l070
$$ -961 -2654 2094 -1384 -2257 -4958 -20848 -33524 -23999 -23683 -31321 -21374 -10460 -2253 -4510 -7580
12886g580p541Q277J2238j2771j5591P967J538J2066R822J1346R225q129j4361
$$ -7580 -15121 -6844 5394 -7377 -22968 -15001 -13463 -1397 8425 19771 28996 20867 6506
12873F506n616j437p796L741P581j805m975l643M060n997l628K2681Q375l449
$$ 6506 890 -547 -8343 -4602 2979 1174 -3801 -7444 -3384 -9381 -13009 9672 18047 14598
12859A4598m826K432l24j6889m381k109R007R744j4512O34J4973j1091j5915R211
$$ 14598 9772 12204 11880 -5009 -9390 -11499 -2492 7252 -7260 -6626 8347 -2744 -18659 -9448
12845i448J0832j4522P018K2077O969N802Q561j3751l843j7081o199K4338K843
$$ -9448 1384 -13138 -6120 15957 22926 28728 37289 23538 19695 2614 -3585 20753 23596
12832B3596k0639q040n755j1160o365J2691n036J5020P925o198J1624J4425j1406
$$ 23596 2957 -5083 -10838 -21998 -28363 -15672 -20708 -5688 2237 -3961 7663 22088 10682
12819A0682k0704J7891m396j7125M439N418j0873r717J6472J0882l844O878O038
$$ 10682 -10022 7869 3473 -13652 -9213 -3795 -14668 -24385 -7913 2969 -875 6003 12041
12806A2041k1790q584l318q624N096O757J3099J6748Q023Q742k52m338l667k213
$$ 12041 -9749 -18333 -21651 -30275 -25179 -18422 -5323 11425 19448 28190 27938 23600 19933 17720
12792A7720l896j0125p904l735J295q342j2373j510J5071J8800k991r577L446
$$ 17720 13824 3699 -4205 -7940 -6645 -14987 -27360 -28870 -13799 5001 2010 -7567 -4121
12779d121J1186J5977R39j3692k0407k1820J1998K6897J3875o989j058O369J2624
$$ -4121 7065 23042 23981 10289 -10118 -31938 -19940 6957 20832 13843 12785 19154 31778
12766C1778L864r891l714l068q454j7646j5738o048k127M627K4406O562l511J2423
$$ 31778 35642 25751 22037 18969 10515 -7131 -22869 -28917 -31044 -26417 -2011 4551 1040 13463
12752A3463o878k378k168R884Q90J0954J2267j9625j5740J0749l450p386R397
$$ 13463 6585 4207 2039 11923 12813 23767 36034 16409 669 11418 7968 582 9979
12739I979J5739r69R61o084j2474j3057j5281L709J1916M499N246K174j228K347
$$ 9979 25718 24749 25710 19626 7152 -5905 -21186 -17477 -5561 -1062 4184 6358 5130 7477
12725G477J3408j3127k7677j4215J0615P45o922K0023K3260K368o521n23k059
$$ 7477 20885 7758 -19919 -34134 -23519 -22774 -29696 -9673 13587 15955 9434 8911 6852
12712F852J1113j1425k7261m735P504j7534J0695P034L460n041J4883O401q828
$$ 6852 17965 6540 -20721 -25456 -17952 -35486 -24791 -17757 -14297 -19338 -4455 1946 -6882
12699f882n22R608J6q812k215q869J4742J3336j021j852J9332o107m880j818J2536
$$ -6882 -7404 2204 2220 -6592 -8807 -17676 -2934 10402 9381 7529 26861 20754 15874 14056 26592
12684B6592p187N912K574k1419j6657m130J2216j413j3140J2099L535l135J634
$$ 26592 19405 25317 27891 6472 -10185 -14315 -2099 -3512 -16652 -4553 -1018 -4153 -2519
12671b519J0111K955j977r379K778Q729j382k018n386o029p858j3145L824O442
$$ -2519 7592 10547 8570 -809 1969 10698 9316 7298 1912 -4117 -11975 -25120 -21296 -14854
12657a4854R799J1982r782l525P93J5765R79j0415q714O305o072j721M279l77
$$ -14854 -5055 6927 -2855 -6380 -5587 10178 11157 742 -7972 -1667 -7739 -9460 -5181 -5558
12643e558m486Q61o826q136Q22P515J8728K4107j0090r868O698k422j280M41O323
$$ -5558 -10044 -9183 -16009 -24145 -23323 -15808 2920 27027 16937 7069 13767 11345 10065 10506 16829
12628A6829J479k3960o315J4220P526j6124R299J0957n657j9580k627N061K1838
$$ 16829 18308 -5652 -11967 2253 9779 -6345 2954 13911 8254 -11326 -13953 -8892 12946
12615A2946J074j1446R34p268j1815O490q41K752r43j4052m298Q038o052r627
$$ 12946 14020 2574 3508 -3760 -15575 -9085 -9926 -7174 -8117 -22169 -26467 -18429 -24481 -34108
12601c4108N541j0619K0229K1729R015N99L361n528l115n887j935J907r116M384
$$ -34108 -28567 -39186 -18957 2772 11787 12386 15747 10219 7104 1217 -718 1189 -7927 -3543
12587c543R058J0204j1096q743M556K408K866J143J3966q37p498l658P206Q485
$$ -3543 5515 15719 4623 -4120 436 2844 5710 6853 20819 19982 12484 8826 16032 24517
12573B4517j1163j4145o743P977K2295L617j4839j2746L087J8040M28R344O552
$$ 24517 13354 -791 -7534 443 22738 26355 11516 -1230 1857 19897 20325 29669 36221
12560C6221j8882j3777r796p772M602r5J3321Q878j3235j8508O692o999J832K0013
$$ 36221 17339 3562 -6234 -14006 -9404 -9499 3822 12700 -535 -19043 -12351 -19350 -17518 2495
12546B495N869J7196r907j2694j3132j071k425M495n08N426l846m588L75M079
$$ 2495 8364 25560 15653 2959 -10173 -11244 -13669 -9174 -9682 -4256 -8102 -12690 -12315 -8236
12532h236l23l135j1907P602J625j2176N426Q839J0998m790j5767j6843J754J3821
$$ -8236 -8559 -11694 -23601 -15999 -14374 -26550 -21124 -12285 -1287 -6077 -21844 -38687 -36933 -23112
12518b3112K1113o333m662L500Q077m029q863Q235J2977M975k5812Q040Q588j381
$$ -23112 -1999 -8332 -12994 -9494 -1417 -5446 -14309 -6074 6903 11878 -13934 -5894 2694 1313
12504A313n809K957m703r04K225M793l333j724p439j1074J1627Q044j242l983
$$ 1313 -4496 -1539 -6242 -7146 -4921 -128 -3461 -5185 -12624 -23698 -12071 -4027 -5269 -9252
12490i252J6610k442M632O39j9387m641o568J2328j166j5228P854N315J049N713
$$ -9252 7358 4916 9548 10187 -9200 -13841 -20409 -8081 -9247 -24475 -16621 -11306 -10257 -4544
12476d544P969J3013M394L362j89l06L2j6992k266n094k050n809n316N841J5875
$$ -4544 3425 16438 20832 24194 24005 23699 23731 6739 4473 -621 -2671 -8480 -13796 -7955 7920
12461G920o976j5736m436k171K136m869J8736K0818j1556N525J110k0092k418
$$ 7920 944 -14792 -19228 -21399 -19263 -24132 -5396 15422 3866 9391 10501 -9591 -12009
12448a2009m759M825m808J7655K3803m75j4942j7385n730J1132J7317r29p472
$$ -12009 -16768 -11943 -16751 904 24707 24232 9290 -8095 -13825 -2693 14624 13695 6223
12435F223N025j1975O336j28j4812l712K070J1342J4520M887j7649K232q605j6134
$$ 6223 11248 -727 5609 5481 -9331 -13043 -10973 369 14889 19776 2127 4359 -4246 -20380
12421b0380j1541J7470J8741P573j313j5948N320J3799M28j8905j2037k535r202
$$ -20380 -31921 -14451 4290 11863 10550 -5398 -78 13721 14149 -4756 -16793 -19328 -28530
12408b8530K8585J1659n805N21k337o887M283J29L652n882n149o663j8795N52
$$ -28530 55 11714 5909 6430 4093 -2794 1489 1618 5270 -612 -5761 -12424 -31219 -30667
12394c0667Q342L602J2087N076j310J0791O587j4496q71K25N250k567m592M883
$$ -30667 -22325 -18723 -6636 -1560 -2870 7921 14508 12 -859 -634 4616 2049 -2543 2340
12380B340J1000L997m530o870O791R916J5471m2k2330j5233l600k375J1166N381
$$ 2340 13340 17337 12807 5937 12728 22644 38115 38073 15743 510 -3090 -5465 5701 11082
12366A1082L51P840j537K844o204k721r278j2811j5427l306K1137R366j1324j0164
$$ 11082 11433 19273 17736 20580 14376 11655 2377 -10434 -25861 -29167 -8030 1336 -9988 -20152
12352b0152O91J5700P520j116R005l933j5480K1683J7401j0311k2744O806o26
$$ -20152 -19461 -3761 3759 2643 11648 7715 -7765 13918 31319 21008 -1736 5070 4444
12339D444m566r55J6038O534M801q76O446k0739j5330M970K540J428p369n654
$$ 4444 -122 -1077 14961 21495 26296 25420 31866 11127 -4203 767 3307 4735 -2634 -8288
12325h288L157P904q255j4484m134J3156m897n793k811J2685J8142N35p567j7595
$$ -8288 -5131 2773 -5482 -19966 -24100 -10944 -15841 -21634 -24445 -11760 6382 6917 -650 -18245
12311a8245k1504K624Q809J4370J8801p283l803J0714J6271m211q250J0137l46
$$ -18245 -39749 -37125 -28316 -13946 4855 -2428 -6231 4483 20754 16543 8293 18430 18084
12298A8084K621J586j113O204O90k130j7276k1166J0336Q175o532l554p167J418
$$ 18084 20705 22291 21178 27382 28072 25942 8666 -12500 -2164 6011 -521 -4075 -11242 -9824
12284i824O694N129q401j3527M041O411L846J7783Q10j4861q210R284L196m783
$$ -9824 -3130 1999 -6402 -19929 -15888 -9477 -5631 12152 12962 -1899 -10109 -825 2371 -2412
12270b412M296q320K969M791j744l593p531j2774J3556K433k000O50j6372j2263
$$ -2412 1884 -6436 -3467 1324 -420 -4013 -11544 -24318 -10762 -8329 -10329 -9679 -26051 -38314
12256c8314N022p42J440J0005M49P247K605J721R645N80l93n834R654J0531Q867
$$ -38314 -33292 -34034 -32594 -22589 -22140 -14893 -12288 -10567 -922 -342 -735 -6569 3085 13616 22483
12241B2483K3034r115j2755q370j1543o401q345O150N643j0426O373n370k4517
$$ 22483 45517 36402 23647 15277 3734 -2667 -11012 -4862 781 -9645 -3272 -8642 -33159
12228c3159j5705J7845K1216O626R190L875P013O644k810r267L536J0607j6773
$$ -33159 -48864 -31019 -9803 -3177 6013 9888 16901 23545 20735 11468 15004 25611 8838
12215H838k809l795j6250j569J3278J2039R117j305r68M116R117n179k6468j517
$$ 8838 6029 2234 -14016 -15585 -2307 9732 18849 17544 16576 20692 29809 24630 -1838 -3355
12201c355K0913N288n611J3873K341k130K867N180q350k4572j9258q67J5825M030
$$ -3355 17558 22846 17235 31108 33449 31319 34186 39366 31016 6444 -12814 -13681 2144 6174
12187F174j2098K762Q941o958q116p862J6242J6997n814q910R7j4941j833O926
$$ 6174 -5924 -3162 5779 -1179 -9295 -17157 -915 16082 10268 1358 1455 -13486 -15319 -8393
12173h393J919k3323j2042K925J3156M503R478K476j3844j3614J610J1659P349
$$ -8393 -6474 -29797 -41839 -38914 -25758 -21255 -11777 -9301 -23145 -36759 -35149 -23490 -16141
12160a6141m844O484Q053R067J2411j027k1207P894K0561N292n582k4011j0601
$$ -16141 -20985 -14501 -6448 2619 15030 14003 -7204 690 21251 26543 20961 -3050 -13651
12147a3651R143K5320L753j2757k9793j2773M505J022P079m647J754J683L136
$$ -13651 -4508 20812 24565 11808 -17985 -30758 -26253 -25231 -18152 -22799 -21045 -19362 -16226
12134a6226Q394O991j5454k670j9798k7233N126K3296K0622P199L021J8684K6134
$$ -16226 -7832 -841 -16295 -18965 -38763 -65996 -60870 -37574 -16952 -9753 -6732 11952 38086
12121C8086m917r369j8085K884R774k541q817l401m300n320J3210l085j3073M347
$$ 38086 33169 23800 5715 8599 18373 15832 7015 3614 -686 -6006 7204 4119 -8954 -4607
12107d607j206j3394q723J9165N745J0894J616J9118J3631k3226l4443p670J1517
$$ -4607 -5813 -19207 -27930 -8765 -3020 7874 9490 28608 42239 19013 -15430 -23100 -11583
12094a1583J0499R667L385j5263l864K027M282l768q504n818J4966J3029J854
$$ -11583 -1084 8583 11968 -3295 -7159 -5132 -850 -4618 -13122 -18940 -3974 9055 10909
12081A0909j1009j3617q457K765J2973Q791L575J093R085J4369p659l124R159
$$ 10909 -100 -13717 -22174 -19409 -6436 2355 5930 7023 16108 30477 22818 19694 28853
12068B8853M066j7540o999n77j5750r561k274J2876m457M227J7151n611k994j0122
$$ 28853 32919 15379 8380 7803 -7947 -17508 -19782 -6906 -11363 -7136 10015 4404 1410 -8712
12054h712n880N629n619j1711j2963L696J0937O166j0524J693Q813k603L926J6580
$$ -8712 -14592 -8963 -14582 -26293 -39256 -35560 -24623 -18457 -28981 -27288 -18475 -21078 -17152 -572
12040e72N129j0088J297o120P407L208l415k040J6686q96r652N408k0669j1407
$$ -572 4557 -5531 -4234 -10354 -2947 261 -3154 -5194 11492 10596 944 6352 -14317 -25724
12026b5724J8915J5602j3936k3912Q607k060Q01l268K0536K4448L502j1935N958
$$ -25724 -6809 8793 -5143 -29055 -20448 -22508 -21707 -24975 -4439 20009 23511 11576 17534
12013A7534j859q626P23m057o36j6594J0169J1797j1271R891Q386L7J386r34n938
$$ 17534 15675 7049 7772 3715 3079 -13515 -3346 8451 -2820 7071 15457 15494 16880 15946 10008
11998A0008m941p000j079L888N502K258j644p513J1592P098k2480j7953P159o86
$$ 10008 5067 -1933 -3012 876 6378 8636 6992 -521 11071 18169 -4311 -22264 -15105 -15791
11984a5791k166q402K825J0368O034J6345m63r225J9755J0410k2855j1297M597
$$ -15791 -17957 -26359 -23534 -13166 -7132 9213 8750 -475 19280 29690 6835 -4462 135
11971A35j282M007j2514L88q7M954Pr07m37L453L44K353m164j3579M762j34m144
$$ 135 -1147 2860 -9654 -9266 -9353 -4399 -4392 -5299 -5736 -2283 -1939 414 -3750 -17329 -12567 -12701 -16845
11954a6845n091J7204R533N539o143j7849j466Q132R052j1361j4074N436O77l772
$$ -16845 -21936 -4732 4801 10340 4197 -13652 -15118 -6986 2066 -9295 -23369 -17933 -17256 -21028
11940b1028Q658N915j69n017J249O962r288J0571K330j9599j2304J7463j2477
$$ -21028 -12370 -6455 -6624 -11641 -10392 -3430 -12718 -2147 183 -19416 -31720 -14257 -26734
11927b6734j0226J8024K5001R470j739j788p615m159P967n050o007j5875J1469
$$ -26734 -36960 -18936 6065 15535 13796 12008 4393 234 8201 3151 -2856 -18731 -7262
11914g262J7322K172o113O763o335k0950m631j7045R824J9590j7705j5778Q374
$$ -7262 10060 12232 6119 12882 6547 -14403 -19034 -36079 -26255 -6665 -24370 -40148 -31774
11901c1774J6485j763p590P251N158K4010N912R697o877k0695Q97K863O256K943
$$ -31774 -15289 -17052 -24642 -17391 -12233 11777 17689 27386 20509 -186 711 3574 9830 12773
11887A2773L278O024K615o663j8728j4249J5068k545K134j094n06R640Q644Q12
$$ 12773 16051 22075 24690 18027 -701 -14950 118 -2427 -293 -1387 -1893 7747 16391 17203
11873A7203J190j0929q19N661J0031N030j4422m694J339L280K146r422j4728J2539
$$ 17203 18393 7464 6645 12306 22337 27367 12945 8251 9590 12870 15016 5594 -9134 3405
11859C405K985m419Q656J102j540R691q655L271J6638j3992j4009J358J064N880
$$ 3405 6390 1971 10627 11729 10189 19880 11225 14496 31134 17142 3133 4491 5555 11435
11845A1435m354p958k643P938q986O184J6315k536J7373o708j5289k933q267l139
$$ 11435 7081 -877 -3520 4418 -4568 1616 17931 15395 32768 26060 10771 7838 -429 -3568
11831c568j1698j5634m672P714J7935Q417m221Q484M495P32r64L290j1453l885
$$ -3568 -15266 -30900 -35572 -27858 -9923 -1506 -5727 2757 7252 7984 7020 10310 -1143 -5028
11817e028j314o600k773J3274M612j2280j0393L375K8604N819j3853j2087O514
$$ -5028 -6342 -12942 -15715 -2441 2171 -10109 -20502 -17127 11477 17296 3443 -8644 -2130
11804b130r1N287Q911m011j7337k0982K107Q244J8462o1o795J1988N320L09L502
$$ -2130 -2221 3066 11977 7966 -9371 -30353 -28246 -20002 -1540 -1601 -8396 3592 8912 9221 12723
11789A2723j6980l206J913k024Q054j0478p901o267r09J6878n858p452J2461l947
$$ 12723 -4257 -7463 -5550 -7574 480 -9998 -17899 -24166 -25075 -8197 -14055 -21507 -9046 -12993
11775a2993p668P564k012p759J6624J6565J7J117j3773p388j4609M165J5077j2040
$$ -12993 -20661 -13097 -15109 -22868 -6244 10321 10338 11455 -2318 -9706 -24315 -20150 -5073 -17113
11761a7113j7245j3217J5707N495J8332n652o863J2273J7183j0122l735p791J1535
$$ -17113 -34358 -47575 -31868 -26373 -8041 -13693 -20556 -8283 8900 -1222 -4957 -12748 -1213
11748a213K307j3918O175J7760J7636o826m0336j3870L061K0145K0435l039l251
$$ -1213 1094 -12824 -6649 11111 28747 21921 -18415 -32285 -29224 -9079 11356 8317 5066
11735E066n650p061m818m874j3475J583R524J5116J9871M211n266r917j5224J1050
$$ 5066 -584 -7645 -12463 -17337 -30812 -29229 -19705 -4589 15282 19493 14227 4310 -10914 136
11721A36M122p504J1924k136k2567n380J736n435R153K359o837J6126P91m728
$$ 136 4258 -3246 8678 6542 -16025 -21405 -19669 -25104 -15951 -13592 -20429 -4303 -3512 -8240
11707h240R338R728n707N348j864k14j4590n90p408P037P744K928P2J4214J6385
$$ -8240 1098 10826 5119 10467 8603 8389 -6201 -6791 -14199 -7162 582 3510 3582 17796 34181
11692C4181j3329j4046P140K615r715N186q274q746J3499M178r045M529M463o73
$$ 34181 20852 6806 13946 16561 6846 12032 3758 -4988 8511 12689 3644 8173 12636 11963
11678A1963j9110o543K436J042L593J0639L963L917J110j7128l96K060j1595L211
$$ 11963 -7147 -13690 -11254 -10212 -6619 4020 7983 11900 13010 -4118 -4514 -2454 -14049 -10838
11664a0838P622M387J436M100K262j0882L644j7134J0870J5478r944L555K666
$$ -10838 -3216 1171 2607 6707 8969 -1913 1731 -15403 -4533 10945 1001 4556 7222
11651G222P948J3350n401k5790m792n490J7802j7344r977k881O51K789L632J6324
$$ 7222 15170 28520 23119 -2671 -7463 -12953 4849 -12495 -22472 -25353 -24702 -21913 -18281 -1957
11637a957J5785j1959m587M743j9649j2550O238p688J0639K3238J194q644l665
$$ -1957 13828 1869 -2718 2025 -17624 -30174 -23936 -31624 -20985 2253 3447 -5197 -8862
11624h862R785j1282o89K7266K0329N937j1361j5959j7669J5217K1900M31k852
$$ -8862 923 -10359 -11048 16218 36547 42484 31123 15164 -2505 12712 34612 35043 32191
11611C2191j2395K496o893j2005j2520n10l332L076K671Q857K321P279k740q433
$$ 32191 19796 22292 15399 3394 -9126 -9636 -12968 -9892 -7221 1636 3957 11236 8496 63
11597F3q089J4445k2739r170J1771Q082J4234K7088m053j3653k3500o656l044
$$ 63 -8026 6419 -16320 -25490 -13719 -5637 8597 35685 31632 17979 -5521 -12177 -15221
11584a5221J7069l839j6193N332o856J0407R115J647j6055J2464M885K565j823
$$ -15221 1848 -1991 -18184 -12852 -19708 -9301 -186 1461 -14594 -2130 2755 5320 3497
11571C497O362k657m003K287O145j4773P628l741M515P175n180j0056P172n117
$$ 3497 9859 7202 3199 5486 11631 -3142 4486 745 5260 12435 7255 -2801 4371 -746
11557g46M591q915j2378J126J0006M431o211L244l591r582k369L772o328n077
$$ -746 3845 -5070 -17448 -16322 -6316 -1885 -8096 -4852 -8443 -18025 -20394 -16622 -22950 -28027
11543b8027J0231j1989p247J4146K3603P556n810k547P359p529l692K874K391
$$ -28027 -17796 -29785 -37032 -22886 717 8273 2463 -84 7275 -254 -3946 -1072 1319
11530A319p657n350o169m495k185j80K0477Q962j2836j2875P44K543O271n652
$$ 1319 -6338 -11688 -17857 -22352 -24537 -24717 -4240 4722 -8114 -20989 -20245 -17702 -11431 -17083
11516a7083o829p434l662R901P60J4053J5227p251M354K972p132O2m829M403O18
$$ -17083 -23912 -31346 -35008 -25107 -24347 -10294 4933 -2318 2036 5008 -2124 -2062 -6891 -2488 -1870
11501a870j4665l053K998Q739J3323M535n486o913j1864j1888Q711J7138m336
$$ -1870 -16535 -19588 -16590 -7851 5472 10007 4521 -2392 -14256 -26144 -17433 -295 -4631
11488d631j400N104J2367N286J0541P388l2751j6386Q464K2100n45j1215j483
$$ -4631 -6031 -927 11440 16726 27267 34655 1904 -14482 -6018 16082 15537 4322 2839
11475B839K021m019P40k838r301n29J1675j977r121j235J8532M261J217o294j3478
$$ 2839 4860 841 1581 -1257 -10558 -11087 588 -1389 -10510 -11745 6787 11048 12265 5971 -7507
11460g507r32o266J348P748O846J828j120j0585J174Q034P89k358L44N229k308
$$ -7507 -8439 -14705 -13357 -5609 1237 3065 1945 -8640 -7466 568 1357 -1001 -657 4572 2264
11445B264j9m516o716l17L445n300p088R05L030m544O572j0604K767J2142K36
$$ 2264 2245 -2271 -8987 -9304 -5859 -11159 -18247 -17342 -14312 -18856 -12284 -22888 -20121 -7979 -7743
11430g743J0744P129j2117N399J0209q10k1190j2406J7065J2137R77k648l947
$$ -7743 3001 10130 -1987 3412 13621 12811 -8379 -20785 -3720 8417 9394 6746 2799
11417B799J043J5132J3087k4262k1559n275O793J2044M690K053n986j3051Q229
$$ 2799 3842 18974 32061 7799 -13760 -19035 -12242 -198 4492 6545 559 -12492 -4263
11404d263J510L12N704j1386q638K512j59O393J4888M358k0490q909J2235N375
$$ -4263 -2753 -2441 3263 -8123 -16761 -14249 -14408 -8015 6873 11231 -9259 -18168 -5933 -558
11390e58N38K587k214O139O744j1380j3806j2493l819k582J9996j483k0963K278
$$ -558 -20 2567 353 6492 13236 1856 -11950 -24443 -28262 -30844 -10848 -12331 -33294 -31016
11376c1016J5606O631M466O270J5672j3270j544k142k844j052k206J1039M552
$$ -31016 -15410 -8779 -4313 1957 17629 4359 2815 673 -2171 -3223 -5429 5610 10162
11363A0162J485n447j4197n565m81L005l967q785L301L723J2582R488p816j2816
$$ 10162 11647 6200 -7997 -13562 -14043 -11038 -15005 -23790 -20489 -16766 -4184 5304 -2512 -15328
11349a5328M025N294L488J5383K874n933j9649k1777K426R073J7791P714j0133
$$ -15328 -11303 -6009 -2521 12862 15736 9803 -9846 -31623 -29197 -20124 -2333 5381 -4752
11336d752K297N695j6250m183J0554R549q100j4342Q871J759q61J013K0634R057
$$ -4752 -2455 3240 -13010 -17193 -6639 2910 -5190 -19532 -10661 -8902 -9763 -8750 11884 20941
11322B0941q616L112m473j3974J0301j26j0969l043j0914K010J1399K593o128
$$ 20941 12325 15437 10964 -3010 7291 7165 -3804 -6847 -17761 -15751 -4352 -1759 -7887
11309g887n150n285o30J2096J960J0754J83L071k481j1041O399J7727j131r654
$$ -7887 -13037 -18322 -18952 -6856 -4896 5858 6041 9112 6631 -4410 1989 19716 18585 8931
11295H931j7062j7182J2619K2948P945L818J7150J0095K920O337P939m645K694
$$ 8931 -8131 -25313 -12694 10254 18199 22017 39167 49262 52182 58519 66458 61813 64507
11282F4507o412j2363P655r313j2814J097n717o394J0660k5248k4126K372m009
$$ 64507 58095 45732 53387 44074 31260 32357 26640 20246 30906 5658 -18468 -16096 -20105
11269b0105J170N60N476K856p555K3191J4762k3149k7139K249L593j818l513J3223
$$ -20105 -18935 -18375 -12899 -10043 -17598 5593 20355 -2794 -29933 -27684 -24091 -25909 -29422 -16199
11255a6199J1951J2787j8551m298J6614k184j8564j678M782j5567R364K1070K853
$$ -16199 -4248 8539 -10012 -14310 2304 120 -18444 -20122 -15340 -30907 -21543 -473 2380
11242B380Q733j4566O102k673j9994j519n170J8417K3082J1273K536O713q664
$$ 2380 11113 -3453 2649 -24 -20018 -21537 -26707 -8290 14792 26065 28601 35314 26650
11229B6650o856k0581j445J0800Q822l491j1659j2219p583J3249o10J808J9262
$$ 26650 19794 -787 -2232 8568 17390 13899 2240 -9979 -17562 -4313 -4923 -3115 16147
11216A6147j666N973k680J28j5818k1805l12J7854J8468J5083k453L615k4934
$$ 16147 14481 20454 17774 17902 2084 -19721 -20033 -2179 16289 31372 28919 32534 7600
11203G600n280j2685q160J3317J9078o595o987R537n062l592J2482r216j3464
$$ 7600 2320 -10365 -18525 -5208 13870 7275 288 9825 4763 1171 13653 4437 -9027
11190i027J7941J8005R784r296j3598P47j501N438m229M124M545j9414k1062n220
$$ -9027 8914 26919 36703 27407 13809 14556 13055 18493 14264 18388 22933 3519 -17543 -22763
11176b2763K0609J199o908M035J4733K3234K6240M409o710j4166j3047L583k1936
$$ -22763 -2154 -955 -7863 -3828 10905 34139 60379 64788 58078 43912 30865 34448 12512
11163A2512o943N804M639j8292r03J0864n285P497o540m880R161p387j4611r278
$$ 12512 5569 11373 16012 -2280 -3183 7681 2396 9893 3353 -1527 7634 247 -14364 -23642
11149b3642j4828p406K747J566J3662K0347K2922J984j4037J0544k756j1758J0987
$$ -23642 -38470 -45876 -43129 -41563 -27901 -7554 15368 17352 3315 13859 11103 -655 10332
11136A0332l833k3533J91J590M038J7779R255r337j5771n74Q461L31j6857M587
$$ 10332 6499 -17034 -16843 -15253 -11215 6564 15819 6482 -9289 -9863 -1402 -1071 -17928 -13341
11122a3341R243J2690Q508N829o732p924j1734q236r9J201n735J7529J0919m803
$$ -13341 -4098 8592 17100 22929 16197 8273 -3461 -11697 -11796 -10595 -16330 1199 12118 7315
11108G315J6321L395o215j032n997o343m756N10l068j953J3140P220p109R583
$$ 7315 23636 27031 20816 19784 13787 7444 2688 3198 130 -1823 11317 18537 11428 21011
11094B1011m228q262m346k1158l187K322M761K4558j3969j0894J5819m140l3480
$$ 21011 16783 8521 4175 -16983 -20170 -17848 -13087 11471 -2498 -13392 2427 -1713 -35193
11081c5193j805J3970K4610K4367O143j943o552j4187j3856k808M803R197L910
$$ -35193 -36998 -23028 1582 25949 32092 30149 23597 9410 -4446 -7254 -2451 6746 10656
11068A0656m831p064J868Q529n348N470M830J6850K110q058k4928k1936p878J7016
$$ 10656 5825 -1239 629 9158 3810 9280 14110 30960 33070 25012 84 -21852 -29730 -12714
11054a2714N568r557R543k516p462M975r097J160Q377Q185R892N42p051l830P834
$$ -12714 -7146 -16703 -7160 -9676 -17138 -12163 -21260 -20100 -11723 -3538 6354 6896 -155 -3985 3849
11039C849L202L155J1868j4737j1499m22m316P913J0908k2187j5306J0359J3496
$$ 3849 7051 10206 22074 7337 -4162 -4584 -8900 -987 9921 -12266 -27572 -17213 -3717
11026c717K972R471k0324N970J1239L942j0246k843N367k3833l600J5338J4761
$$ -3717 -745 8726 -11598 -5628 5611 9553 -693 -3536 1831 -22002 -25602 -10264 4497
11013D497l389m020J4486K566j4400Q266m251k553j7684r616Q051P035p020N321
$$ 4497 1108 -2912 11574 14140 -260 8006 3755 1202 -16482 -26098 -18047 -11012 -18032 -12711
10999a2711J6278r383j8021p398R708K3281O053J370J5088N828J037j1043j8969
$$ -12711 3567 -5816 -23837 -31235 -21527 1754 7807 9177 24265 30093 31130 20087 1118
10986A118k413m859J2156J876J1649Q343k3143j0220J479j002J2606N097J6849
$$ 1118 -1295 -6154 6002 7878 19527 27870 4727 -5493 -4014 -5016 7590 12687 29536
10973B9536P039m563n089K330K664j4000k9791j0546Q533Q263K138R656p227j1339
$$ 29536 36575 32012 26923 29253 31917 17917 -11874 -22420 -13887 -5624 -3486 6170 -1057 -12396
10959a2396P388K547p155N181K2862m234q006L056p023p667j6740K167J4988J8088
$$ -12396 -5008 -2461 -9616 -4435 18427 14193 6187 9243 2220 -5447 -22187 -20020 -5032 13056
10945A3056O73p475K787j3592J085m159N314n049L923M935n876Q682l19j1322
$$ 13056 13729 6254 9041 -4551 -3466 -7625 -2311 -7360 -3437 1498 -4378 4304 3985 -7337
10931g337n427j886K0436J1271q301J2138J6866M186k0000j9016n985P990J1772
$$ -7337 -12764 -14650 5786 17057 8756 20894 37760 41946 21946 2930 -3055 4935 16707
10918A6707J717j9601n921J7252J4835q693j810j8014p016M478J0023J7327J931
$$ 16707 18424 -1177 -7098 10154 24989 16296 14486 -3528 -10544 -6066 3957 21284 23215
10905B3215k400m344l334j1283l4473J0407J6922m790o715J4787J3363N29o77
$$ 23215 20815 16471 13137 1854 -32619 -22212 -5290 -10080 -16795 -2008 11355 11884 11207
10892A1207P303j6468k432j0247j6014K618j2111r489J1763K5723q173j5905K1978
$$ 11207 18510 2042 -390 -10637 -26651 -24033 -36144 -45633 -33870 -8147 -16320 -32225 -10247
10879a0247O352J3222L647j1288p654K4141J0362r065j2545p251q601n072Q847
$$ -10247 -3895 9327 12974 1686 -5968 18173 28535 19470 6925 -326 -8927 -13999 -5152
10866e152O364j1294K798m446k257K1770K695J1912n411j8819p103j069q284J209
$$ -5152 1212 -10082 -7284 -11730 -13987 7783 10478 22390 16979 -1840 -8943 -10012 -18296 -17087
10852a7087J2152M440k2497M958j548k411q19J1175R964K554j4545p506L416k02
$$ -17087 -4935 -495 -22992 -18034 -19582 -21993 -22812 -11637 -1673 881 -13664 -21170 -17754 -17956
10838a7956J660m405J042l224J1387p786k0308J1403J9671L084j1039j0251m520
$$ -17956 -16296 -20701 -19659 -22883 -11496 -19282 -39590 -28187 -8516 -5432 -16471 -26722 -31242
10825c1242k668J2187P742j1689r829P970J3247J2177J0291k1693O127J1425L469
$$ -31242 -33910 -21723 -13981 -25670 -35499 -27529 -14282 -2105 8186 -13507 -7380 4045 7514
10812G514l73Q161R091m682r736j8985l492M917j2877k1231n315M586J8331J5397
$$ 7514 7141 15302 24393 19711 9975 -9010 -12502 -7585 -20462 -41693 -47008 -42422 -24091 -8694
10798h694M224j3504J6186r444j5543J1647N897j4821Q489L80M691L606j192j49
$$ -8694 -4470 -17974 -1788 -11232 -26775 -15128 -9231 -24052 -15563 -15183 -10492 -6886 -8078 -8227
10784h227M177Q293J376j1936j0446K2525P707L45J059o741o376o754M760O324
$$ -8227 -4050 4243 5619 -6317 -16763 5762 13469 13814 14873 8132 1756 -4998 -238 6086
10770F086J3716P677L851q523j3870k381k636r283j3936m436P516j0929Q856K7390
$$ 6086 19802 27479 31330 22807 8937 6556 3920 -5363 -19299 -23735 -16219 -27148 -18292 9098
10756I098j3340p191m373K127O575n392k382J4333N898r100j4838p40j2778J1779
$$ 9098 -4242 -11433 -15806 -13679 -7104 -12496 -14878 -545 5353 -3747 -18585 -19325 -32103 -20324
10742b0324J1625o475P618J23M569r690j262L823P415Q221l441j571N6N716n047
$$ -20324 -8699 -15174 -7556 -7433 -2864 -12554 -13816 -9993 -2578 5643 2202 631 687 6403 1356
10727A356R213R57r54O830j8943n459J1262O770R2n275j1537O850m940Q5K97o060
$$ 1356 10569 11526 10572 17402 -1541 -7000 4262 11032 11124 5849 -5688 1162 -3778 -3693 -3396 -9456
10711i456Q636n02l900j0310k265J059L483q300K987k60N306q34q000N9N820O970
$$ -9456 -820 -1322 -5222 -15532 -17797 -16738 -13255 -21555 -18568 -18828 -13522 -14356 -22356 -22297 -16477 -9507
10695i507q63K59R433J2025j361k530j4548m539o579l603K0314Q966O222J5691
$$ -9507 -10370 -10111 -678 11347 9986 7456 -7092 -11631 -18210 -21813 -1499 7467 13689 29380
10681B9380N057k417j3165j8911n975j987L143J4003K599p2k088o345n830k222
$$ 29380 34437 32020 18855 -56 -6031 -8018 -4875 9128 11727 11655 9567 3222 -2608 -4830
10667d830J6158N460N788n940k4448j3658n440Q2R826j42J0855J1481J3645J77
$$ -4830 11328 16788 22576 16636 -7812 -21470 -26910 -26828 -17002 -17144 -6289 5192 18837 19014
10653A9014n019j1059o623J1443p880j1699o710J8511q88k675j1128j0663R252
$$ 19014 13995 2936 -3687 7756 -124 -11823 -18533 -22 -910 -3585 -14713 -25376 -16124
10640a6124J7644M069j0444j5360J723R77j039J9797J2324l647O14K524k747j78
$$ -16124 1520 5589 -4855 -20215 -18492 -17515 -18554 1243 13567 9920 10534 13058 10311 10133
10626A0133J2083q005j9134R621M042l47o145L311M537N588j2043j880m055m234
$$ 10133 22216 14211 -4923 4698 8740 8393 2248 5559 10096 15684 3641 1761 -2294 -6528
10612f528j584q734Q34J8415M881M105o144j8863k000m881K141J1382Q240n630
$$ -6528 -8112 -16846 -16012 2403 7284 11389 5245 -13618 -15618 -20499 -18358 -6976 1264 -4366
10598d366o894k937L08k0166N379J9231J4200N567j4661l845L355J1099R39n319
$$ -4366 -11260 -14197 -13889 -34055 -28676 -9445 4755 10322 -4339 -8184 -4829 6270 7209 1890
10584A890k2239P70J4736O549l016k411q162j779n131m832J6953J9012r211M272
$$ 1890 -20349 -19579 -4843 1706 -1310 -3721 -11883 -13662 -18793 -23625 -6672 12340 3129 7401
10570G401l627j173J515m465J4221o165n19Q029P783k83l696p75j4928P023k92
$$ 7401 3774 2601 4116 -349 13872 7707 7188 15217 23000 22717 19021 18246 3318 10341 10049
10555A0049O05O99n165l346R246J383m030M850k368r034p539k246o630J2224Q095
$$ 10049 10654 11353 6188 2842 12088 13471 9441 14291 11923 2889 -4650 -6896 -13526 -1302 6793
10540F793o516j8162O641K504m139Q211R931Q468m54j7966j2685J527j0116m892
$$ 6793 277 -17885 -11244 -8740 -12879 -4668 5263 13731 13277 -4689 -17374 -15847 -25963 -30855
10526c0855J2069p37r176L322k192Q114J9229m497k1117L402Q85m239J7061J4107
$$ -30855 -18786 -19523 -28699 -25377 -27569 -19455 -226 -4723 -25840 -22438 -21553 -25792 -8731 5376
10512E376r014n867p58K435j1397n515n079n948J4998N060J2703K8556J4412N042
$$ 5376 -3638 -9505 -10263 -7828 -19225 -24740 -29819 -35767 -20769 -15709 -3006 25550 39962 45004
10498D5004j0993j6557m89n895q432N230K629M685M231j078L207j4709j8403J703
$$ 45004 34011 17454 16965 11070 2638 7868 10497 15182 19413 18335 21542 6833 -11570 -9867
10484i867L952p038l697M885J2385L485o591k618l899K910J0594O137J2260J9497
$$ -9867 -5915 -12953 -16650 -11765 620 4105 -2486 -5104 -9003 -6093 4501 10638 22898 42395
10470D2395J550k4155m346J61l587j330q683m731r756M724O233J6376O715Q89
$$ 42395 43945 19790 15444 15605 12018 10688 2005 -2726 -12482 -7758 -1525 14851 21566 22455
10456B2455Q603K232K715j0010j9477J006J9813j7689j4766J919j126j5061K430
$$ 22455 31058 33290 36005 25995 6518 7524 27337 9648 -5118 -3199 -4325 -19386 -16956
10443a6956L258J100J926k948q32J891P320R983n529K762J0243j1869J1908O211
$$ -16956 -13698 -12598 -10672 -13620 -14452 -12561 -5241 4742 -787 1975 12218 349 12257 18468
10429A8468M222j303j666j5504k1303Q964K064j6449Q283J3649j115q43L534J992
$$ 18468 22690 21387 19721 4217 -17086 -8122 -6058 -22507 -14224 -575 -1690 -2533 1001 2993
10415B993j0721l1803N425K2087J1389r840j0399M12J5170P957m474k304n857
$$ 2993 -7728 -39531 -34106 -12019 -630 -10470 -20869 -20457 -5287 2670 -1804 -4108 -9965
10402i965l687J757o179L109J7127P574n727q840j6214J013J06J2354P389j6810
$$ -9965 -13652 -11895 -18074 -14965 2162 9736 4009 -4831 -21045 -20032 -19926 -7572 -183 -16993
10388a6993j3743q746K7988J8363Q70O870K824o627j0094P427J1440N916o047
$$ -16993 -30736 -39482 -11494 6869 7739 14609 17433 10806 712 8139 19579 25495 19448
10375A9448j0118k642P268R68j4150j0150j4328J2891l102l065J0593R241J303
$$ 19448 9330 6688 13956 14924 774 -9376 -23704 -10813 -13915 -16980 -6387 2854 4157
10362D157K046m16L92p479j2006o623j4676J3480K2951j0798n704k339R170J3498
$$ 4157 6203 5787 6179 -1300 -13306 -19929 -34605 -21125 1826 -8972 -14676 -17015 -7845 5653
10348E653n654j2413p210J759O953N613k2057Q536J5523K6337Q533j6262p243
$$ 5653 -1 -12414 -19624 -17865 -10912 -5299 -27356 -18820 -3297 23040 31573 15311 8068
10335H068J0701m381j2616o41J3231K833K970m335J2967j3571r496k1368J323
$$ 8068 18769 14388 1772 1131 14362 17195 20165 15830 28797 15226 5730 -15638 -14315
10322a4315J6209r485n488J2265j420q762n51O331l018j4962J5000P630J1271
$$ -14315 1894 -7591 -13079 -814 -2234 -10996 -11547 -5216 -8234 -23196 -8196 -566 10705
10309A0705J0168j2897j5291P409q913k407m53o944K887J9030N642N338q499q651
$$ 10705 20873 7976 -7315 94 -8819 -11226 -11679 -18623 -15736 3294 8936 14274 5775 -2876
10295b876L829J91m399J377R209M34J698j2278k1930N926J4192j98J806l214J7776
$$ -2876 953 1144 -3255 -1878 7331 7765 9463 -2815 -24745 -18819 -4627 -4825 -3019 -6233 11543
10280A1543M129j7123p316q246J313J1188M912j6696n537m519n48k230r043P429
$$ 11543 15672 -1451 -8767 -17013 -15700 -4512 400 -16296 -21833 -26352 -26900 -29130 -38173 -30744
10266c0744J4270O711L052j4695j1296J2371M171K332J8190j750k4367m544Q795
$$ -30744 -16474 -9763 -6711 -21406 -32702 -20331 -16160 -13828 4362 2612 -21755 -26299 -17504
10253a7504K181R97K2029Q082K338N069Q789j1303k7519j2938L33R336J1061r208
$$ -17504 -15323 -14326 7703 15785 18123 23192 31981 20678 -6841 -19779 -19446 -10110 951 -8257
10239h257l903ko357p916n474k880Q12J1888J3614J5054J7868m838j1316o131
$$ -8257 -12160 -12162 -18519 -26435 -31909 -34789 -33977 -22089 -8475 6579 24447 19609 8293 2162
10225B162K466o407r395N32R656K466N355k091p828J373j483k868j6188o645j210
$$ 2162 4628 -1779 -11174 -10642 -986 1480 6835 4744 -3084 -1711 -3194 -6062 -22250 -28895 -30105
10210c0105R956J1730J5133k044q052j3310j0933k051N743n06q31K2358R792p882
$$ -30105 -20149 -8419 6714 4670 -3382 -16692 -27625 -29676 -23933 -24439 -25270 -2912 6880 -1002
10196a002J1508p481J19O974M993l398P075J846J2086p800r049k424k284j5034
$$ -1002 10506 3025 3144 10118 15111 11713 18788 20634 32720 24920 15871 13447 11163 -3871
10182c871o409j3121Q393K6571o18L01m52o720j369k6227k357J2555r654J8351
$$ -3871 -10280 -23401 -15008 11563 10945 11246 10794 4074 2705 -23522 -25879 -13324 -22978 -4627
10168d627K2407O797k1275o786k1744M057J1827o504K182J6665K6547N491j4175
$$ -4627 17780 24577 3302 -3484 -25228 -21171 -9344 -15848 -13666 2999 29546 35037 20862
10155B0862l778j1515j4621K2286J0218j5150j5238j9843Q919L5963j0817j2423
$$ 20862 17084 5569 -9052 13234 23452 8302 -6936 -26779 -17860 18103 7286 -5137
10143e137J200R10Q845L857M141j4401l394J0888q186k3397r492J4874K5653P123
$$ -5137 -3937 -3027 5818 9675 13816 -585 -3979 6909 -1277 -24674 -34166 -19292 6361 13484
10129A3484k347k836M931q420j1364j0146q722J0678Q358j8942l951J4255l126
$$ 13484 11137 8301 13232 4812 -6552 -16698 -25420 -14742 -6384 -25326 -29277 -15022 -18148
10116a8148O302N821J763n583O786q337J5862j672j766P587k928K603L568L504
$$ -18148 -11846 -6025 -4262 -9845 -3059 -11396 4466 2794 1028 8615 5687 8290 11858 15362
10102A5362j4424j2834j0159q93J1559m943l286m733k188J3621R195K1908j859
$$ 15362 938 -11896 -22055 -22948 -11389 -16332 -19618 -24351 -26539 -12918 -3723 18185 16326
10089A6326q711p365j0279J8394l241j3034j689k833O852K441J3382K165K007
$$ 16326 7615 250 -10029 8365 5124 -7910 -9599 -12432 -5580 -3139 10243 12408 14415
10076A4415o846k66L08j542o467j274J1618q583l405j448j1964j2237Q894J3076
$$ 14415 7569 7303 7611 6069 -398 -1672 9946 1363 -2042 -3490 -15454 -27691 -18797 -5721
10062e721L432J4597l043q945j1860L13L806M449j66p575K5724M167j2555n016
$$ -5721 -2289 12308 9265 320 -11540 -11227 -7421 -2972 -3138 -10713 15011 19178 6623 1607
10048A607J1339J7310J8240n575o009L875k116R116N811k1342q969j4697j8181
$$ 1607 12946 30256 48496 42921 36912 40787 38671 47787 53598 32256 23287 8590 -9591
10035i591J626M36k192J7196P737M871j230j6006n14J0475r440j0974M948K671
$$ -9591 -7965 -7529 -9721 7475 15212 20083 18853 2847 2333 12808 3368 -7606 -2658 13
10021A3J8986K1986l248R533M1539K2074J9349N6472J08731J70907J17597r003
$$ 13 18999 40985 37737 47270 88809 110883 130232 186704 295435 466342 583939 574936
10009E74936p8956p8490p3299j03414q6881m9080m0798j6482k2310P610p295J0889
$$ 574936 495980 417490 344191 240777 153896 104816 64018 47536 25226 32836 25541 36430
9997C6430L340n729J520o241j4826Q945N858j564p884p492K564N429k721j0404
$$ 36430 39770 34041 35561 29320 14494 23439 29297 27733 19849 12357 14921 20350 17629 7225
9983G225j8691J2894L813j5166Q348J0762O64m251l295j867r652J0606J3684j0170
$$ 7225 -11466 1428 5241 -9925 -1577 9185 9849 5598 2303 436 -9216 1390 15074 4904
9969D904j1021P928J7n308p75p883J7051J4444o487m332J686j5424J631j709j1433
$$ 4904 -6117 1811 1828 -3480 -4255 -12138 4913 19357 12870 8538 10224 -5200 -3569 -5278 -16711
9954a6711l255O933K0328K553P466m18l710q918j8002M031O065O261J5342Q971
$$ -16711 -19966 -13033 7295 9848 17314 16896 13186 4268 -13734 -9703 -3638 2623 17965 26936
9940B6936J8528l051p858J412r063j0423R819O409j2711k1875n389P034k950m976
$$ 26936 45464 42413 34555 35967 26904 16481 26300 32709 19998 -1877 -7266 -232 -3182 -8158
9926h158L483o499N671J4022m29j1407R13j1807O670l692J0087J3628j1681l097
$$ -8158 -4675 -11174 -5503 8519 8090 -3317 -2404 -14211 -7541 -11233 -1146 12482 801 -2296
9912b296N82O508n164k2906l965p155J6436J1324M772j0541J1960K87n111L945
$$ -2296 -1714 4794 -370 -23276 -27241 -34396 -17960 -6636 -1864 -12405 -445 -158 -5269 -1324
9898a324l963K727J19J1788J2894L054n697m287m56K673k054j6831q113J4710
$$ -1324 -5287 -2560 -2441 9347 22241 25295 19598 15311 14855 17528 15474 -1357 -9470 5240
9884E240J863k109j2664j0190R914j802n018O237K4367J5112o90j5351M159J5588
$$ 5240 7103 4994 -7670 -17860 -7946 -9748 -14766 -8529 15838 30950 30260 14909 19068 34656
9870C4656R797j059K399q456j683J5754J9242M076j3163M738N415J0383O906J6487
$$ 34656 44453 43394 45793 37337 35654 51408 70650 74726 61563 66301 71716 82099 89005 105492
9856A05492J8611J4148K7454N0755O4018Q2888J77130L82401N88460N42893K03097
$$ 105492 124103 138251 165705 216460 280478 363366 540496 922897 1511357 2054250 2257347
9845B257347j78895k94357k91797l41931l47632k76219j71709q2158l9630m2434
$$ 2257347 2078452 1784095 1492298 1150367 802735 526516 354807 272649 233019 190585
9835A90585l0306j6900k4258j0653j2271j9345k4148m679L925Q33L641r0k6860
$$ 190585 160279 143379 119121 108468 96197 76852 52704 48025 51950 52783 56424 56334 29474
9822B9474q486Q354j1707q577Q541K2634L753k860j2541j7322j8838K344M441
$$ 29474 20988 29342 17635 9058 17599 40233 43986 41126 28585 11263 -7575 -5231 -790
9809g90J1413L249j0285k0190M093J5388J1292Q32J2794n667l944j3684j833J704
$$ -790 10623 13872 3587 -16603 -12510 2878 14170 15002 27796 22129 18185 4501 2668 4372
9795D372J441J1345p2p429q149j4084J6375J7899j6368p535l902Q518J6289J280
$$ 4372 5813 17158 17086 9657 1508 -12576 3799 21698 5330 -2205 -6107 2411 18700 19980
9781A9980k4049j2854J0659J7278M081q654o379p171J2620Q901l23j1182r635
$$ 19980 -4069 -16923 -6264 11014 15095 6441 62 -7109 5511 14412 14089 2907 -6728
9768f728K470j979L335J2880q683q962o799J007J7674K061j7160l816N366L872
$$ -6728 -4258 -6237 -2902 9978 1295 -7667 -14466 -13459 4215 6276 -10884 -14700 -9334 -5462
9754e462J4507p899m540O668J4537j2689j815J1978N886j8085j0997j249Q956
$$ -5462 9045 1146 -3394 3274 17811 5122 3307 15285 21171 3086 -7911 -9160 -204
9741b04l206l406J8915J3294j0188j3618j25Q00O983R215k340J2945j0567j7001
$$ -204 -3410 -6816 12099 25393 15205 1587 1462 2262 9245 18460 16120 29065 18498 1497
9727A497n468J2303n939J856j0211j8701n968J9868K1860O216o1k554j5016j6912
$$ 1497 -3971 8332 2393 4249 -5962 -24663 -30631 -10763 11097 17313 17252 14698 -318 -17230
9713a7230p72K712l269K199Q061J2305j9493k798o697j6130J2216K194j7234M703
$$ -17230 -18002 -15290 -18559 -16360 -8299 4006 -15487 -18285 -24982 -41112 -28896 -26702 -43936 -39233
9699c9233L2458N765j0170r35J0123j17m780J3967N258j0185J0046J6548j619
$$ -39233 -6775 -1010 -11180 -12115 -1992 -2109 -6889 7078 12336 2151 12197 28745 27126
9686B7126j4454M851m017K84M031j4463j2739j9233P583J0068q543j2128j146
$$ 27126 12672 17523 13506 13790 17821 3358 -9381 -28614 -21031 -10963 -19506 -31634 -32780
9673c2780R462L813k527o517J979r89P069J7273L413O040J6674j3780k3136l25
$$ -32780 -23318 -19505 -22032 -28549 -26570 -27559 -20490 -3217 196 6236 22910 9130 -14006 -14331
9659a4331k880p46R377K7198J1938k4907L17N07L720l66l903j3574N697J2957
$$ -14331 -17211 -17957 -8580 18618 30556 5649 5966 6473 10193 9827 5924 -7650 -1953 11004
9645A1004J379N124L962k018L550n288j3165j7597J7323L3565N656m950j1904
$$ 11004 12383 17507 21469 19451 23001 17713 4548 -13049 4274 37839 43495 38545 26641
9632B6641j2342p780r352j279J1422R132k5308k174J4729j862j9532N903J3908
$$ 26641 14299 6519 -2833 -4112 7310 16442 -8866 -11040 3689 1827 -17705 -11802 2106
9619B106m016M485m346q215j1243k726K490l864O236P823J6379K371j9886j0285
$$ 2106 -1910 2575 -1771 -9986 -21229 -23955 -21465 -25329 -19093 -11270 5109 7480 -12406 -22691
9605b2691q373N643J2742K3900j0704P084J0703Q5K186p393K490q746l24j61j282
$$ -22691 -31064 -25421 -12679 11221 517 7601 18304 18389 20575 13182 15672 6926 6602 6441 5159
9590E159P229J0599l373j8845J47K712p213O201R099J2103j8032l246K7075q993
$$ 5159 12388 22987 19614 769 916 3628 -3585 2616 11715 23818 5786 2540 29615 20622
9576B0622o69N81p413L73k114K2240M663j8750j480R940N689r255j7333o05m788
$$ 20622 19953 20534 13121 13494 11380 33620 38283 19533 18053 27993 33682 24427 7094 6489 1701
9561A701Q562P186l017j0381O958J9062j4477o912L350o28q450K45r198j0603
$$ 1701 10263 17449 14432 4051 11009 30071 15594 8682 12032 11404 2954 3199 -5999 -16602
9547a6602k55R172j2J203P233J3907q545l699r039j0002j2172j1646P940M275
$$ -16602 -16857 -7685 -7697 -6494 739 14646 6101 2402 -6637 -16639 -28811 -40457 -32517 -28242
9533b8242k234K1743n997r926K0926N188o072q852k0821O087N946J1548Q112L340
$$ -28242 -30476 -8733 -14730 -24656 -3730 1458 -4614 -13466 -34287 -28200 -22254 -10706 -2594 746
9519G46j5240K6444K9371R428j3105l2723j5479q317O030J6331O523J705k6993
$$ 746 -14494 11950 41321 50749 37644 4921 -10558 -18875 -12845 3486 10009 11714 -15279
9506a5279r132k073J009M621L72r900J2136R530J2606N05j633Q536l181P808k398
$$ -15279 -24411 -26484 -25475 -20854 -20482 -30382 -18246 -8716 3890 4395 2762 11298 8117 15925 13527
9491A3527j6161p430q110p910J4828J1761J010k086m564p754M996j636J569o164
$$ 13527 -2634 -10064 -18174 -26084 -11256 505 1515 -571 -5135 -12889 -7893 -9529 -7960 -14124
9477a4124j5337M467Q344J7784J2768j070J1082p342o72m725l65J145r315J836
$$ -14124 -29461 -24994 -16650 1134 13902 12832 23914 16572 15900 11175 10810 11955 2640 4476
9463D476J4158k177r92J1813P294k2868k8830M367K1319j165K430K17q985N934
$$ 4476 18634 16457 15465 27278 34572 11704 -17126 -12759 8560 7395 9825 10042 1057 6991
9449F991K431J1452L041N908j3864K337K089q31p319j1388n826J3488K4395p341
$$ 6991 9422 20874 23915 29823 15959 18296 20385 19554 12235 847 -4979 8509 32904 25563
9435B5563j1004J4576K027j055K319j4544j9620Q066j1170k228j418k4717M282
$$ 25563 14559 29135 31162 30107 32426 17882 -1738 6328 -4842 -7070 -8488 -33205 -28923
9422b8923J4048n771p366J8007J7570n0k240j456J727r174n593K917J1315l564
$$ -28923 -14875 -20646 -28012 -10005 7565 7515 5275 3819 5546 -3628 -9221 -6304 5011 1447
9408A447n851P914J3773p028k530J1046O015l433n968k708j0163L190N444N54
$$ 1447 -4404 3510 17283 10255 7725 18771 24786 21353 15385 12677 2514 5704 11148 11702
9394A1702j4673j5080O269K3333R815j2234l625M710m819K250N737J429j0864
$$ 11702 -2971 -18051 -11782 11551 21366 9132 5507 10217 5398 7648 13385 14814 3950
9381C950K177Q459J420L483o66m070J1818J1070j1532j6348m5R185q119J3671
$$ 3950 6127 14586 16006 19489 18823 14753 26571 37641 26109 9761 9716 18901 10782 24453
9367B4453j6736o088J035j1900N728J3141L49j239j4035j3767k204n395l663J6208
$$ 24453 7717 1629 2664 -9236 -3508 9633 9982 8743 -5292 -19059 -21263 -26658 -30321 -14113
9353a4113Q134l507j1452K062J0064J2096J2883j3386m736K931j1669J2660K190
$$ -14113 -5979 -9486 -20938 -18876 -8812 3284 16167 2781 -1955 976 -10693 1967 4157
9340D157l206K041J4821M27p299r127o80j1221n61J5261P16k0916k367Q111M062
$$ 4157 951 2992 17813 18240 10941 1814 1134 -10087 -10648 4613 5329 -15587 -17954 -9843 -5781
9325e781J0544j259r67M58j4212r572J7571K3154L976o568k765j3094j053K100
$$ -5781 4763 3504 2537 2995 -11217 -20789 -3218 19936 23912 17344 14579 1485 432 2532
9311B532P12p565m174j5153m111p761m245J5654J4791J1068n808J4819J2323P50
$$ 2532 3244 -4321 -8495 -23648 -27759 -35520 -39765 -24111 -9320 1748 -4060 10759 23082 23832
9297B3832o194J1274J0313j2163m721Q455J055j9400M271L012p204j6294O342
$$ 23832 17638 28912 39225 27062 22341 30796 31851 12451 16722 19734 12530 -3764 2578
9284B578l76N151J2196M506o663Q816p174k821R50m854j6161o49r250m086J2020
$$ 2578 2202 7353 19549 24055 17392 26208 19034 16213 17163 12309 -3852 -4501 -13751 -17837 -5817
9269e817L411L803k685N487J7638k937r964j8862n302J0789O999K652J064l90
$$ -5817 -2406 1397 -1288 4199 21837 18900 8936 -9926 -15228 -4439 2560 5212 6276 5886
9255E886o583r037j1890J0427K531o481J4964R561K520n196j389j4308o893N856
$$ 5886 -697 -9734 -21624 -11197 -8666 -15147 -183 9378 11898 6702 5313 -8995 -15888 -10032
9241a0032J2774R228j1283j423R020L231o130P977o877p215j1481P326j4060o480
$$ -10032 2742 11970 687 -736 8284 11515 5385 13362 6485 -730 -12211 -4885 -18945 -25425
9227b5425J1596K0504r57j3666P520m298k340P492J261J5671J3811j0420k2286
$$ -25425 -13829 6675 5718 -7948 -428 -4726 -7066 426 1687 17358 31169 20749 -1537
9214a537j7821J4190R241J61m701r828m565p642m920J2537J4917J0255J4260m856
$$ -1537 -19358 -5168 4073 4234 -467 -10295 -14860 -22502 -27422 -14885 32 10287 24547 19691
9200A9691j497j631j8417m769J969J3410K752j0134j404K4550R420K503m0675
$$ 19691 18194 16563 -1854 -6623 -4654 8756 11508 1374 -30 24520 33940 36443 -4232
9187d232k5431J3225K8498K6904l91k9149M77Q501M926k1796q775K1785R711K600
$$ -4232 -29663 -16438 12060 38964 38573 9424 9901 18402 23328 1532 -7243 14542 24253 26853
9173B6853J979Q542j4515K322J6540J552j2211r726K978K546r168K726K2386L5509
$$ 26853 28832 37374 22859 25181 41721 43273 31062 21336 24314 26860 17692 20418 42804 78313
9159G8313N956p227k38J2865J102P073r877k949J1337Q841Q554L4132L8394K8311
$$ 78313 84269 77042 76804 89669 90771 97844 87967 85018 96355 105196 113750 147882 186276 214587
9145B14587N6142M0835M1063N6258P2990J04160J36217J98144K73176L98734O38496
$$ 214587 270729 311564 352627 408885 481875 586035 722252 920396 1193572 1592306 2230802
9134B230802J042890J379836J026638K5252n25951n86435o69233q30352q01713
$$ 2230802 3273692 4653528 5680166 5705418 5179467 4593032 3923799 3093447 2291734
9125B291734n89767m11332k68448j87378j51269j21482p1367l8901l5812m0026
$$ 2291734 1701967 1290635 1022187 834809 683540 562058 490691 451790 415978 375952
9115C75952n2328m5220k6975m1634k6604j0735K046j5455q384r391o196k6336
$$ 375952 323624 278404 251429 209795 183191 172456 174502 159047 150663 141272 135076 108740
9103A08740j5966N491J7235k631M643j3180k8919k290L649q058k570J975J395
$$ 108740 92774 98265 115500 112869 117512 104332 75413 73123 76772 68714 66144 68119 69514
9090F9514n257j0411k0090Q095J9325O257o731j1664k2467Q448K780p717p147
$$ 69514 64257 53846 33756 41851 61176 67433 60702 49038 26571 35019 37799 30082 22935
9077B2935N228J73j3109m58K487M908P734O65j2725m456K3191j2801k8539l59
$$ 22935 28163 28336 15227 14769 17256 22164 29898 30563 17838 13382 36573 23772 -4767 -5126
9063e126K3124K3608j1606o502j5024l442j1J99J676Q524M267J3093J0039j0602
$$ -5126 17998 41606 30000 23498 8474 5032 5021 5220 6896 15420 19687 32780 42819 32217
9049C2217j6981l058J7533o277J2542Q520k79j4853k1642J0247J220q982l118
$$ 32217 15236 12178 29711 23434 35976 44496 44217 29364 7722 17969 19189 10207 7089
9036G089R444q493J0090q014j5675M674J6501R193j272j2838k7628O077K339l361
$$ 7089 16533 8040 18130 10116 -5559 -885 15616 24809 23537 10699 -16929 -10852 -8513 -11874
9022a1874p122N635L411R534J1017n544m181n056J1908P446R274L755J399j3888
$$ -11874 -18996 -13361 -9950 -416 10601 5057 876 -4180 7728 15174 24448 28203 29602 15714
9008A5714m299j2426j0809L64r220J3187K188q283j6813p42K4759K7330P549j0308
$$ 15714 11415 -1011 -11820 -11456 -20676 -7489 -5301 -13584 -30397 -31139 -6380 20950 28499 18191
8994A8191j1987j5548r838L804J2085J2256j757j3094J6390L679j500j6233o176
$$ 18191 6204 -9344 -19182 -15378 -3293 8963 7206 -5888 10502 14181 12681 -3552 -9728
8981i728J965J2202J9827l208n777J1391j7131j1779P1J943K53j2326K533J8817
$$ -9728 -7763 4439 24266 21058 15281 26672 9541 -2238 -2167 -224 29 -12297 -9764 9053
8967I053r575j8294j8134j007J1778k926l46R995O466o705L735n985J0332J1326
$$ 9053 -522 -18816 -36950 -37957 -26179 -29105 -29451 -19456 -12990 -19695 -15960 -21945 -11613 -287
8953b87L932M254p231n383P770O550O033K5230O969j8794p433N508M819q981j2227
$$ -287 3645 7899 668 -4715 3055 9605 15638 40868 47837 29043 21610 27118 31937 22956 10729
8938A0729j2675L760J4169P938Q032r733K641M040P544j1490k0410p067R488k4
$$ 10729 -1946 1814 15983 23921 31953 22220 24861 28901 36445 24955 4545 -2522 6966 6942
8924F942O014P607M978q700o582k5068M015n294J423k553K013J451p970J6270
$$ 6942 12956 20563 25541 16841 10259 -14809 -10794 -16088 -14665 -17218 -15205 -13754 -21724 -5454
8910e454L2408J3848r603k1536o691O787p465K797p202j0829k362J2635O853j3497
$$ -5454 26954 40802 31199 9663 2972 9759 2294 5091 -2111 -12940 -15302 -2667 4186 -9311
8896i311O919n554p88R233N084K155j0554o675Q165r957j201r940O178J9969p321
$$ -9311 -2392 -7946 -8734 499 5583 7738 -2816 -9491 -1326 -11283 -12484 -22424 -16246 3723 -3598
8881c598J0330L580q426M590O849P709M433k301L78K920j7669L633N300j573n563
$$ -3598 6732 10312 1886 6476 13325 21034 25467 23166 23544 26464 8795 12428 17728 16155 10592
8866A0592j3871N344P674Q429R231Q514q587j8718j1852j3815L0J5713p907m91
$$ 10592 -3279 2065 9739 18168 27399 35913 27326 8608 -3244 -17059 -17029 -1316 -9223 -9714
8852i714J1783k193j2943J7989L179k6762J524J8606j0286j644M277n222J1416
$$ -9714 2069 -124 -13067 4922 8101 -18661 -17137 1469 -8817 -10461 -6184 -11406 10
8839A0n79K0496j75r136o187O09n054l528M142L815n395j2520k349M567p893J3750
$$ 10 -569 19927 19752 10616 4429 5038 -16 -3544 598 4413 -982 -13502 -15851 -11284 -19177 -5427
8823e427J6684J2399J790j0528n390J3926N263m235l156o959o366l036O210r719
$$ -5427 11257 23656 25446 14918 9528 23454 28717 24482 21326 14367 8001 4965 11175 1456
8809A456J38J2484n345k4638q77J0338l087j535r084M588N498N43k959J1215J2407
$$ 1456 1594 14078 8733 -15905 -16782 -6444 -9531 -11066 -20150 -15562 -10064 -9521 -12480 -1265 11142
8794A1142j648O089k18j7103o540K7574R382j0413j2200j2220k0241R217J2046
$$ 11142 9494 15583 15365 -1738 -8278 19296 28678 18265 6065 -6155 -26396 -17179 -5133
8781e133R866p913M726k569n822N764J0369r997l231p163P870J4094K051q774
$$ -5133 4733 -3180 1546 -1023 -6845 -1081 9288 -709 -3940 -11103 -3233 10861 12912 4138
8767D138J1613k092j0102n145O905J0501L468K321L755j4311L665J972K997K681
$$ 4138 15751 13659 3557 -1588 5317 15818 19286 21607 25362 11051 14716 16688 19685 22366
8753B2366M402l466o299j0215l399Q959l2427n516K6079J4197k500k0608L706
$$ 22366 26768 23302 17003 6788 3389 12348 -20079 -25595 484 14681 12181 -8427 -4721
8740d721J6624p5p415j1398m16L840J968N164J7492L388j3278N671j0845R18P440
$$ -4721 11903 11828 4413 -6985 -7401 -3561 -1593 3571 21063 24451 11173 16844 5999 6917 14357
8725A4357J3875l30o704o133k114q348l3562J703J5248L0034P566P029J531o350
$$ 14357 28232 27902 21198 15065 12951 4603 -28959 -27256 -12008 18026 25592 32621 34152 27802
8711B7802p947N92j903k5368p667K4744K352m874J933M49r812K239N576R187o729
$$ 27802 19855 20447 18544 -6824 -14491 10253 12605 7731 9664 10113 301 2540 8116 17303 10574
8696A0574j1916j536R822J1889n291J3515J4338k747r11j8825n748Q381r780j2083
$$ 10574 -1342 -2878 6944 18833 13542 27057 41395 38648 37737 18912 13164 21545 11765 -318
8682c18r637K2456q789N407J2687q238j6126R244J0876R605K32r551r798J588
$$ -318 -9955 12501 3712 9119 21806 13568 -2558 6686 17562 27167 27399 17848 8050 9638
8668I638J1005L918M09k7066o282J1031O653L882j1591p315J5035N312j0690J0825
$$ 9638 20643 24561 24970 -2096 -8378 2653 9306 13188 1597 -5718 9317 14629 3939 14764
8654A4764K4428J0562m723p105J231M0606N4972J23059J64175J45665o373o5518
$$ 14764 39192 49754 45031 37926 39157 79763 134735 257794 421969 567634 561261 495743
8642D95743n5488n7453q5348q3047o5644m8045k1173k8463j2075o745M237q733
$$ 495743 440255 382802 297454 214407 148763 100718 79545 51082 39007 32262 36499 27766
8630B7766n174q134n749r920J9673K080N149K750K276J5275L301k0502l554J5422
$$ 27766 22592 14458 8709 -1211 18462 20542 25691 28441 30717 45992 49293 28791 25237 40659
8616D0659J9569j877o598Q572O549Q304J908J963J8769N143J2636L0816M8572
$$ 40659 60228 58351 51753 60325 66874 75178 77086 79049 97818 102961 115597 146413 194985
8603A94985P9971J38686L05867L74359P9883j36160j33914j16324j76392j76836
$$ 194985 274956 413642 719509 1093868 1173751 1037591 903677 787353 610961 434125
8593D34125j39069r0974m6304k5650j7523j7927j5900j6334Q279j3917k9319l690
$$ 434125 295056 204082 157778 132128 114605 96678 80778 64444 72723 58806 29487 25797
8581B5797J3477J3707k532o542M74m087k7882r200J1947N509j573p336J629o4
$$ 25797 39274 52981 50449 43907 44381 40294 12412 3212 15159 20668 19095 11759 13388 13324
8567A3324J5767R145j700J1061J4159K4706J7543j7683O853N1201P4286J23611
$$ 13324 29091 38236 36536 47597 61756 86462 104005 86322 93175 144376 218662 342273
8555C42273J56698O8837n6892m9146n2979o5660q2332r4277n7805k8138j0037
$$ 342273 498971 567808 510916 461770 408791 343131 260799 166522 108717 80579 70542
8544G0542q973r102J733l456j433M152M473P675m921k009j2455j3764q137o011
$$ 70542 61569 52467 54200 50744 49311 53463 57936 65611 60690 58681 46226 32462 24325 18314
8530A8314j4584N731L614K700k23k1757j7137K5969O055Q132M681r44n601m386
$$ 18314 3730 9461 13075 15775 15552 -6205 -23342 2627 8682 16814 21495 20551 14950 10564
8516A0564N408j3467K391n880j2067O052J7300Q674K983o824q584j2243j863j8689
$$ 10564 15972 2505 4896 -984 -13051 -6999 10301 18975 21958 15134 6550 -5693 -7556 -26245
8502b6245j656J2955J1185J1422J1125P624o724j0325p568J0231J2106k702j2253
$$ -26245 -27901 -14946 -3761 7661 18786 26410 19686 9361 1793 12024 24130 21428 9175
8489I175k246j221K589O31L689P677N964j2478j7009j1974N141R666J1936J0923
$$ 9175 6929 5708 8297 8928 12617 20294 26258 13780 -3229 -15203 -10062 -396 11540 22463
8475B2463K661j1768m642r287m914L059K733k164N499r54L267j2640n30r595j5075
$$ 22463 25124 13356 8714 -573 -5487 -2428 305 -1859 3640 2686 5953 -6687 -7217 -16812 -31887
8460c1887m461J7032K4934j012L76n849j038J523j5293n456K944Q170O712M219
$$ -31887 -36348 -19316 5618 4606 4982 -867 -1905 -382 -15675 -21131 -18187 -10017 -3305 914
8446I14J5738J3279J969k2979q061P283J3794N372L528l139Q684j3740j521j3238
$$ 914 16652 29931 31900 8921 860 8143 21937 27309 30837 27698 36382 22642 21121 7883
8432G883k268m356N877M238L301j1332J995Q69r772j1290j613J1464j0027J33
$$ 7883 5615 1259 7136 11374 14675 3343 5338 6207 -3565 -14855 -16468 -5004 -15031 -14898
8418a4898j6176n062Q183J0004J2617Q135l470p360O513Q516m481j2961j0368
$$ -14898 -31074 -36136 -27953 -17949 -5332 2803 -667 -8027 -1514 7002 2521 -10440 -20808
8405b0808J0034J1581J6093m390k4675j1329J461O042R751L918O541K812q915
$$ -20808 -10774 807 16900 12510 -12165 -23494 -22033 -15991 -6240 -2322 4219 7031 -1884
8392a884o384L102K1736K315k3341P527K5478j114j565j7768M49J2464j0016L134
$$ -1884 -8268 -5166 16570 18885 -4456 3071 28549 27435 25870 8102 8551 21015 10999 14133
8378A4133n723j992k0808n24j2234o154m437K621J2724J4707J7490l23m912j2932
$$ 14133 8410 6418 -14390 -14914 -27148 -33302 -37739 -35118 -22394 -7687 9803 9480 4568 -8364
8364h364l521Q614J4676R71P790p118J349L98j6608j209Q218o452M87P755r738
$$ -8364 -11885 -3271 11405 12376 20166 13048 14397 14795 -1813 -3022 5196 -1256 -769 6986 -2752
8349b752O888M238j9989L051J913O554m730O371n714K810j953k4364J611J8685
$$ -2752 4136 8374 -11615 -8564 -6651 -97 -4827 1544 -4170 -1360 -3313 -27677 -26066 -7381
8335g381l603K815L2945J2973j6372j8479L436O793r854P939N882j0194K187M567
$$ -7381 -10984 -8169 24776 37749 21377 2898 6334 13127 3273 11212 17094 6900 9087 13654
8321A3654o514j3325j8617m515K6824k604P774K2620k637j964p622Q937J618j7857
$$ 13654 7140 -6185 -24802 -29317 -2493 -5097 2677 25297 22660 20696 13074 22011 23629 5772
8307E772j0050L609J5871J8268n405k4128O319J7570R715j5843j2542j1465L375
$$ 5772 -4278 -669 15202 33470 28065 3937 10256 27826 37541 21698 9156 -2309 1066
8294A066j1573J092O222o262k955J0143L971K698q61L867M639j0505k04O529L158
$$ 1066 -10507 -9415 -3193 -9455 -12410 -2267 1704 4402 3541 7408 12047 1542 1338 7867 11025
8279A1025k527K115p197j4670j0447P927r798P2K8469L336j3927L053J5308l528
$$ 11025 8498 10613 3416 -11254 -21701 -13774 -23572 -23500 4969 8305 -5622 -2569 12739 9211
8265I211p985M134p85j2136K76m96J107K0339J0333n536l436M367j9719j3798
$$ 9211 1226 5360 4575 -7561 -7285 -7781 -6674 13665 23998 18462 15026 19393 -326 -14124
8251a4124J0043K3195K196L598j0009o747r237Q015P369L991J545o789k4775j3427
$$ -14124 -4081 19114 21310 24908 14899 8152 -1085 6930 14299 18290 19835 13046 -11729 -25156
8237b5156N553J8176M740n587K371J4486J6606p89O04q254j3657j3280M657J0081
$$ -25156 -19603 -1427 3313 -2274 97 14583 31189 30400 31004 22750 9093 -4187 470 10551
8223A0551Q682k889P346j1596j1480K0481q73j06n267O101o129j8875J515J5848
$$ 10551 19233 16344 23690 12094 614 21095 20222 20116 14849 20950 14821 -4054 -2539 13309
8209A3309J6543m162l374j2076j2494J0383j1574p581Q781j1363l236K4046L255
$$ 13309 29852 25690 22316 10240 -2254 8129 -3445 -11026 -2245 -13608 -16844 7202 10457
8196A0457p842l478o050q306K0403J4319J115Q72j0998k648J6149J003J278J1016
$$ 10457 2615 -863 -6913 -15219 5184 19503 20618 21490 10492 7844 23993 24996 26274 37290
8182C7290j3574j2901J4445l61o329r963O362r32l855Q944n498O107n201m127
$$ 37290 23716 10815 25260 24899 18570 8607 14969 14037 10182 19126 13628 19735 14534 10407
8168A0407q564J3638J5178l1881K405R431j8271J7248J0815j9645n528j3587k324
$$ 10407 1843 15481 30659 -1222 1183 10614 -7657 9591 20406 761 -4767 -18354 -20678
8155b0678J4731J9071J1833j0073q928o513r365j7364M885J8479J0623n203l04
$$ -20678 -5947 13124 24957 14884 5956 -557 -9922 -27286 -22401 -3922 6701 1498 1194
8142A194j174N372q719J349p462n015J079M769n004n075j815J7013M356r12l85
$$ 1194 20 5392 -3327 -1978 -9440 -14455 -13376 -8607 -13611 -18686 -20501 -3488 868 -44 -429
8127d29j0124p09Q274j0638O560l574J9815K5786J1591L576o630k4269q359p481
$$ -429 -10553 -11262 -2988 -13626 -7066 -10640 9175 34961 46552 50128 43498 19229 10870 3389
8113C389J518m089P893J8018R9k4148j1073K3617L257j8237j1939m25p682q653
$$ 3389 4907 818 8711 26729 26828 2680 -8393 15224 18481 244 -11695 -12120 -19802 -28455
8099b8455L660J8286M808m209J12k836R334j0448m434Q330J123N596N45j3932
$$ -28455 -24795 -6509 -1701 -5910 -5798 -8634 700 -9748 -14182 -5852 -4729 867 1412 -12520
8085a2520O881n393p127j3486j2277j286o768J8188L9502m026j7172o700r107
$$ -12520 -5639 -11032 -18159 -31645 -43922 -45208 -51976 -33788 5714 1688 -15484 -22184 -31291
8072c1291K130J2336Q980J53m8m708M03o523j22m015R376J6785L471p006k593
$$ -31291 -29161 -16825 -7845 -7692 -7740 -12448 -12045 -18568 -18690 -22705 -13329 3456 6927 -79 -2672
8057b672J754O45l894j7527Q097R818J3766L255n352m626p953P048J5223n210
$$ -2672 -918 -273 -4167 -21694 -13597 -3779 9987 13242 7890 3264 -4689 2359 17582 12372
8043A2372Q367J9978J980k2426l4944R188J0708j527J0449j1871j8019p167R983
$$ 12372 20739 40717 42697 20271 -14673 -5485 5223 3696 14145 2274 -15745 -22912 -12929
8030a2929j839J1790J9270M37j7743m842N665l323p957N84J1169J1856p699M366
$$ -12929 -14768 -2978 16292 16729 -1014 -5856 -191 -3514 -11471 -10887 282 12138 4439 8805
8016H805P853j9050k1018J4890K2513K845j12n444K648J083k0068Q291P391N591
$$ 8805 16658 -2392 -23410 -8520 13993 16838 16726 11282 13930 15013 -5055 3236 10627 16218
8002A6218q428j5705q854J963J2504K4520k686p483K283m097L005M529J919O144
$$ 16218 7790 -7915 -16769 -14806 -2302 22218 19532 12049 14332 10235 13240 17769 19688 25832
7988B5832K625j4822j3318j793j5787l711M859O481J833j3484k019J0792j2302
$$ 25832 28457 13635 317 -1476 -17263 -20974 -16115 -9634 -7801 -21285 -23304 -12512 -24814
7975b4814K048J7020o9K434J2875k031j2317N91j1051J2737K017k318J5463J0667
$$ -24814 -22766 -5746 -5815 -3381 9494 7463 -4854 -4263 -15314 -2577 -560 -2878 12585 23252
7961B3252j536j8912K525r64J5402j179o644j6087m887J766L731J2953p391j481
$$ 23252 21716 2804 5329 4365 19767 18588 11944 -4143 -9030 -7264 -3533 9420 2029 548
7947E48M429r6N253q68j2438k623j804r862n125J5766P753j0669o731r59J3540
$$ 548 4977 4881 10134 9266 -3172 -5795 -7599 -17461 -22586 -6820 933 -9736 -16467 -17426 -3886
7932c886M747J7669n538J168L47J7669J5799j5044n441j6001O560J3687J451o349
$$ -3886 861 18530 12992 14160 14507 32176 47975 32931 27490 11489 18049 31736 33187 26838
7918B6838q941M04p156K875K667l251J437J855q474j188K603j0878q751K216L506
$$ 26838 17897 18301 11145 14020 16687 13436 14873 16728 8254 7066 9669 -1209 -9960 -7744 -4238
7903d238j1099N987K335J0205P358O680l385R896m771O116J415j9514j1555k248
$$ -4238 -15337 -9350 -7015 3190 10548 17228 13843 23739 18968 25084 26499 6985 -4570 -6818
7889f818N73J5033j6080j199J9827J7303l795p795J219R495j6727j3895L59j0434
$$ -6818 -6245 8788 -7292 -8491 11336 28639 24844 17049 18268 27763 11036 -2859 -2500 -12934
7875a2934J461O433j2581O222J9326J2959N297J4403j0982j5853K5610j5417j2948
$$ -12934 -11473 -5040 -17621 -11399 7927 20886 26183 40586 29604 13751 39361 23944 10996
7862A0996j0438O848J0874p894q618o852l665J3O957J8417P392j1446j4356q692
$$ 10996 558 7406 18280 10386 1768 -5084 -8749 -8736 -1779 16638 24030 12584 -1772 -10464
7848a0464J0665J2473j916J294p218j8148L409m575P428J5707L079j8463n437
$$ -10464 201 12674 10758 12052 4834 -13314 -9905 -14480 -7052 8655 11734 -6729 -12166
7835a2166K541r044L248N977N754J362K71J4926j1232J84K246n466J1694l738
$$ -12166 -9625 -18669 -15421 -9444 -3690 -2328 -2057 12869 1637 1821 4067 -1399 10295 6557
7821F557q221p347q176j0681R18R522k789J5971J003m066k301Q164j1423J0457
$$ 6557 -1664 -9011 -17187 -27868 -26950 -17428 -20217 -4246 -3243 -7309 -9610 -1446 -12869 -2412
7807b412R780j3219l234J6933j0328P73Q489R875j608j4192L865Q836K1360P622
$$ -2412 7368 -5851 -9085 7848 -2480 -1707 6782 16657 15049 857 4722 13558 34918 42540
7793D2540k1562r119q358m254M245o523K015q737M52Q381P768r168K576J8041
$$ 42540 20978 11859 3501 -753 3492 -3031 -1016 -9753 -9301 -920 6848 -2320 256 18297
7779A8297R894k3060j1828J027m975J4209p508J1752J325l058j1737M135J6423
$$ 18297 28191 5131 -6697 -5670 -10645 3564 -3944 7808 9133 6075 -5662 -1527 14896
7766A4896j785o968R412K266r808m476o880K0116Q936j7444r955r006O678m812
$$ 14896 13111 6143 15555 17821 8013 3537 -3343 16773 25709 8265 -1690 -10696 -4018 -8830
7752h830k79L352J838p46O314J0829M060R094m532j4228O983L565m527j788k283
$$ -8830 -9109 -5757 -3919 -4665 1649 12478 16538 25632 21100 6872 13855 17420 12893 11105 8822
7737H822P559j3109p053M561l968o722J627j288J0494o214m067J6217m46n696
$$ 8822 16381 3272 -3781 780 -3188 -9910 -8283 -9571 923 -5291 -9358 6859 6413 717
7723G17N964P576P291p809p877m224J1596M032j7646j4495J028j5226M240K4746
$$ 717 6681 14257 21548 13739 5862 1638 13234 17266 -380 -14875 -13847 -29073 -24833 -87
7709h7J701o090J1726L962r347r048L243O004j9381J6748J2490j6321N340J8917
$$ -87 1614 -4476 7250 11212 1865 -7183 -3940 2064 -17317 -569 11921 -4400 940 19857
7695A9857Q750j490K382n578L304R329J062o822j9855k44k294j8050k1259k18
$$ 19857 28607 27117 29499 23921 27225 36554 37616 30794 10939 10695 8401 -9649 -30908 -31126
7681c1126L741j0244L156J2757J9199K344p743J075K1621N345j1077k714Q892
$$ -31126 -27385 -37629 -34473 -21716 -2517 -173 -7916 -6841 14780 20125 9048 6334 15226
7668A5226M196J368J409p995k8135j469J2912N759l995Q716p2J079L587j2133
$$ 15226 19422 20790 22199 14204 -13931 -15400 -2488 3271 -724 7992 7920 8999 12586 453
7654D53q153J5509J0178j6577k3869j4694j789N875j35J2401K851J4024M527m910
$$ 453 -7700 7809 17987 1410 -22459 -37153 -38942 -33067 -33202 -20801 -17950 -3926 601 -4309
7640d309J0137p13o897k721K237m484R97J287O233q545j8762O147O509n424L671
$$ -4309 5828 5115 -1782 -4503 -2266 -6750 -5753 -4466 1767 -6778 -25540 -19393 -12884 -18308 -14637
7625a4637L665j2047K1089P870n768R01j0016n500N315L992r946r709P825J5727
$$ -14637 -10972 -23019 -1930 5940 172 1073 -8943 -14443 -9128 -5136 -15082 -24791 -16966 -1239
7611a239N115P306L641j9203q687J4994K3859N963l391j0258j3512j5331N397
$$ -1239 3876 11182 14823 -4380 -13067 1927 25786 31749 28358 18100 4588 -10743 -5346
7598e346j5105k450J58Q696J2442j0943l367J3208J1172R183m89J632O317r593
$$ -5346 -20451 -22901 -22743 -14047 -1605 -12548 -15915 -2707 8465 17648 17159 18791 25108 15515
7584A5515J698J2817p733K166o795p026r122N703M595j5415M581j0609K718r426
$$ 15515 17213 30030 22297 24463 17668 10642 1520 7223 11818 -3597 984 -9625 -6907 -16333
7570a6333R117J0921l705j5816j6817r385P915J6195J6995J166n033J445P052
$$ -16333 -7216 3705 0 -15816 -32633 -42018 -34103 -17908 -913 253 -4780 -3335 3717
7557C717P055j573m421J086Q396k0037k815O524O719j7459j524J9053j5229p535
$$ 3717 10772 9199 4778 5864 14260 -5777 -8592 -2068 4651 -12808 -14332 4721 -10508 -18043
7543a8043p436o473J0387l951J0980K8486j794m516o422K291K180K2725Q764r304
$$ -18043 -25479 -31952 -21565 -25516 -14536 13950 12156 7640 1218 3509 5689 28414 37178 27874
7529B7874O893l949k3355P306P865m211j9496j1091N500L42j299R526M080r77
$$ 27874 34767 30818 7463 14769 22634 18423 -1073 -12164 -6664 -6322 -7621 1905 5985 5008
7515E008O489n274M417k459j5807j407J2969Q039r82q039p453J963j904q852o440
$$ 5008 11497 6223 10640 8181 -7626 -9033 3936 11975 10993 2954 -4499 -2536 -4440 -13292 -19732
7500a9732J5073K778J2253L704M995R265j8176O179O20j027k4227q473o29J8162
$$ -19732 -4659 -1881 10372 14076 19071 28336 10160 16339 16959 15932 -8295 -16768 -17397 765
7486G65J5702J4036m544N11k1690j1813M346Q946J553p059J856j0276n824J1104
$$ 765 16467 30503 25959 26470 4780 -7033 -2687 6259 7812 753 2609 -7667 -13491 -2387
$$ [...]
##END NTUPLES=NMR SPECTRUM
##END=
