##TITLE=Analysis number 319695
Compound Code cc 24801
Project Code adrs
Chemist Name endeavour
##JCAMPDX= 6.0         $$ Bruker NMR JCAMP-DX V2.0
##DATA TYPE= NMR SPECTRUM
##DATA CLASS= NTUPLES
##ORIGIN= Bruker BioSpin GmbH
##OWNER= nmr
$$ XWIN-NMR		Version 3.5
$$ Wed May 24 13:30:40 2006 GMT Daylight Time (UT+1h)  MAYBRIDGE\nmr@NMR_250MHZ
##.OBSERVE FREQUENCY= 250.131544655141
##.OBSERVE NUCLEUS= ^1H
##.ACQUISITION MODE= SIMULTANEOUS (DQD)
##.ACQUISITION SCHEME= undefined
##.AVERAGES= 16
##.DIGITISER RES= 18
##SPECTROMETER/DATA SYSTEM= dpx250
##.PULSE SEQUENCE= zg30
##.SOLVENT NAME= DMSO
##.SHIFT REFERENCE= (INTERNAL, DMSO, 0, 16.522)
##AUDIT TRAIL= $$ (NUMBER, WHEN, WHO, WHERE, WHAT)
$$ ##TITLE= Audit trail, XWIN-NMR		Version 3.5
$$ ##JCAMPDX= 5.01
$$ ##ORIGIN= Bruker BioSpin GmbH
$$ ##OWNER= nmr
$$ C:\u/data/dgb/nmr/ADRS/5110/pdata/1/auditp.txt
$$ ##AUDIT TRAIL=  $$ (NUMBER, WHEN, WHO, WHERE, WHAT)
(   1,<2006-05-24 13:30:17.65 +100>,<MAYBRIDGE\nmr>,<NMR_250MHZ>,
      <created by zg, POWCHK disabled, PULCHK disabled
       configuration hash MD5:
       84 BC 41 DB A1 6E 1D 46 DA 25 12 A5 C1 ED C5 3A
       data hash MD5: 64K
       57 1F B7 CE 1E 92 B8 7E CB 65 1D 2B D8 15 31 EF>)
(   2,<2006-05-24 13:30:30.66 +100>,<MAYBRIDGE\nmr>,<NMR_250MHZ>,
      <Start of raw data processing
       ef LB = 0.3 FT_mod = 6 PKNL = 1 SI = 32K 
       data hash MD5: 32K
       76 2D 0F E6 9E 2E 2E 5F C9 00 0A 3C 68 F5 0A 63>)
(   3,<2006-05-24 13:30:32.29 +100>,<MAYBRIDGE\nmr>,<NMR_250MHZ>,
      <apk 
       data hash MD5: 32K
       7D 89 90 EB 3F 6A B4 88 92 61 F1 74 A0 E5 BF B3>)
(   4,<2006-05-24 13:30:33.30 +100>,<MAYBRIDGE\nmr>,<NMR_250MHZ>,
      <abs ABSG = 5 
       data hash MD5: 32K
       C9 73 3B E2 7A 5A 3B 24 37 68 25 AF DC 83 62 FE>)
$$ ##END=
$$ 
$$ hash MD5
$$ 61 23 8A 24 12 C7 03 ED DF 36 F9 A9 ED E1 DE 4A
##$RELAX= 
##$RELAX= 
##$RELAX= 
##$RELAX= 
##$RELAX= 
##$RELAX= 
##$RELAX= 
$$ Bruker specific parameters
$$ --------------------------
##$DU= <C:\u>
##$EXPNO= 5110
##$NAME= <ADRS>
##$PROCNO= 1
##$TYPE= <nmr>
##$USER= <dgb>
##$AMP= (0..31)
100 100 100 100 100 100 100 100 100 100 100 100 100 100 100 100 100 100 
100 100 100 100 100 100 100 100 100 100 100 100 100 100 
##$AQSEQ= 0
##$AQ_mod= 3
##$AUNM= <au_zg>
##$AUTOPOS= <33 >
##$BF1= 250.13
##$BF2= 250.13
##$BF3= 250.13
##$BF4= 250.13
##$BF5= 500.13
##$BF6= 500.13
##$BF7= 500.13
##$BF8= 500.13
##$BYTORDA= 1
##$CFDGTYP= 0
##$CFRGTYP= 5
##$CHEMSTR= <none>
##$CNST= (0..31)
1 1 145 1 1 1 1 1 1 1 1 1 1 1 1 1 1 1 1 1 1 1 1 1 1 1 1 1 1 1 1 1 
##$CPDPRG= <>
##$CPDPRG1= <>
##$CPDPRG2= <>
##$CPDPRG3= <>
##$CPDPRG4= <mlev>
##$CPDPRG5= <mlev>
##$CPDPRG6= <mlev>
##$CPDPRG7= <mlev>
##$CPDPRG8= <mlev>
##$CPDPRGB= <>
##$CPDPRGT= <>
##$D= (0..31)
0 1 0 0 0 0 0 0 0 0.06 0 0 0 0 0 0 0.0002 0 0 0 0 0 0 0 0 0 0 0 0 0 0 
0 
##$DATE= 1148473816
##$DBL= (0..7)
120 120 120 120 120 120 120 120 
##$DBP= (0..7)
150 150 150 150 150 150 150 150 
##$DBP07= 0
##$DBPNAM0= <>
##$DBPNAM1= <>
##$DBPNAM2= <>
$$ [...]
##$SUBNAM6= <"">
##$SUBNAM7= <"">
##$SUBNAM8= <"">
##$SUBNAM9= <"">
##$SW= 20.6930455092707
##$SWIBOX= (0..15)
0 0 3 0 0 0 0 0 0 0 0 0 0 0 0 0 
##$SW_h= 5175.983436853
##$TD= 65536
##$TD0= 1
##$TE= 294.16
##$TE2= 300
##$TE3= 300
##$TEG= 300
##$TL= (0..7)
0 120 120 120 120 120 120 120 
##$TP= (0..7)
150 150 150 150 150 150 150 150 
##$TP07= 0
##$TPNAME0= <>
##$TPNAME1= <>
##$TPNAME2= <>
##$TPNAME3= <>
##$TPNAME4= <>
##$TPNAME5= <>
##$TPNAME6= <>
##$TPNAME7= <>
##$TPOAL= (0..7)
0.5 0.5 0.5 0.5 0.5 0.5 0.5 0.5 
##$TPOFFS= (0..7)
0 0 0 0 0 0 0 0 
##$TUNHIN= 0
##$TUNHOUT= 0
##$TUNXOUT= 0
##$USERA1= <user>
##$USERA2= <user>
##$USERA3= <user>
##$USERA4= <user>
##$USERA5= <user>
##$V9= 5
##$VALIST= <valist>
##$VCLIST= <CCCCCCCCCCCCCCC>
##$VD= 0
##$VDLIST= <DDDDDDDDDDDDDDD>
##$VPLIST= <PPPPPPPPPPPPPPP>
##$VTLIST= <TTTTTTTTTTTTTTT>
##$WBST= 1024
##$WBSW= 4
##$XGAIN= (0..3)
0 0 0 0 
##$XL= 0
##$YL= 0
##$YMAX_a= 330496
##$YMIN_a= -357909
##$ZGOPTNS= <>
##$ZL1= 120
##$ZL2= 120
##$ZL3= 120
##$ZL4= 120
##$ABSF1= 16.522
##$ABSF2= -4.171173
##$ABSG= 5
##$ABSL= 3
##$ALPHA= 0
##$AQORDER= 0
##$ASSFAC= 0
##$ASSFACI= 0
##$ASSFACX= 0
##$ASSWID= 0
##$AUNMP= <proc_1d>
##$AZFE= 0.1
##$AZFW= 0.1
##$BCFW= 0
##$BC_mod= 0
##$BYTORDP= 0
##$COROFFS= 0
##$CY= 12.5
##$DATMOD= 1
##$DC= 0
##$DFILT= <>
##$DTYPP= 0
##$F1P= 14.0000005364418
##$F2P= -0.99999901652339
##$FCOR= 0.5
##$FTSIZE= 32768
##$FT_mod= 6
##$GAMMA= 0
##$GB= 0
##$INTBC= 1
##$INTSCL= 1
##$ISEN= 128
##$LB= 0.3
##$LEV0= 0
##$LPBIN= 0
##$MAXI= 10000
##$MC2= 0
##$MEAN= 0
##$ME_mod= 0
##$MI= 0
##$NCOEF= 0
##$NC_proc= -5
##$NLEV= 6
##$NOISF1= 0
##$NOISF2= 0
##$NSP= 0
##$NTH_PI= 0
##$NZP= 0
##$OFFSET= 16.522
##$PC= 1
##$PHC0= 165.08
##$PHC1= 5.632681
##$PH_mod= 1
##$PKNL= yes
##$PPARMOD= 0
##$PSCAL= 4
##$PSIGN= 0
##$REVERSE= no
##$SF= 250.13
##$SI= 32768
##$SIGF1= 0
##$SIGF2= 0
##$SINO= 400
##$SIOLD= 32768
##$SREGLST= <1H.DMSO>
##$SSB= 0
##$STSI= 32768
##$STSR= 0
##$SW_p= 5175.98343685301
##$SYMM= 0
##$S_DEV= 0
##$TDeff= 65536
##$TDoff= 0
##$TI= <Analysis number 999999
Compound Code 99
Book Reference 9
Project Code 9>
##$TILT= no
##$TM1= 0
##$TM2= 0
##$TOPLEV= 0
##$USERP1= <user>
##$USERP2= <user>
##$USERP3= <user>
##$USERP4= <user>
##$USERP5= <user>
##$WDW= 1
##$XDIM= 32768
##$YMAX_p= 328599067
##$YMIN_p= -1283603
$$ End of Bruker specific parameters
$$ ---------------------------------
##NTUPLES= NMR SPECTRUM
##VAR_NAME=  FREQUENCY,     SPECTRUM/REAL,   SPECTRUM/IMAG
##SYMBOL=    X,             R,               I
##VAR_TYPE=  INDEPENDENT,   DEPENDENT,       DEPENDENT
##VAR_FORM=  AFFN,          ASDF,            ASDF
##VAR_DIM=   32768,         32768,           32768
##UNITS=     HZ,            ARBITRARY UNITS, ARBITRARY UNITS
##FACTOR=    0.157963299565203, 1,           1
##FIRST=     4132.6476996994, 0,             0
##LAST=      -1043.33573715361, 0,           0
##MIN=       -1043.33573715361, -1283603,    0
##MAX=       4132.6476996994, 328599067,     0
$$ Real data points
##PAGE= N=1
##DATA TABLE= (X++(R..R)), XYDATA
$$ [...]
$$ plain form
15647 1984 25454 -31810 -31568 94102 -24230 142481 267719 164055 14135 11193 -1210
15636 -1210 3340 -126216 99162 295495 177632 30433 58337 -149477 -347454 -262031 -323128
15625 -323128 -164760 71477 25550 96050 77647 -102609 -222128 -230092 -193826 -228944 -238273
15614 -238273 -167509 2387 134187 168299 -29408 -59754 -1152 -39663 262955 165385 157355
15603 157355 71240 -206349 -303907 -315210 -204804 -42699 -239045 -369837 -170368 -23066
15593 -23066 -99864 67407 155989 198998 397168 371618 393373 341491 111263 64846 7067
15582 7067 -65117 64848 -66084 -425440 -304709 -228360 -46524 123942 -19248 -23909 193470
15571 193470 374105 359375 407496 435181 212198 -13519 32295 -133997 -37736 -219175
$$ packed form
15647A984K3470n7264K42J25670j18332J66711J25238j03664j49920k942j2403
15636a210M550j29556K25378J96333j17863j47199K7904k07814j97977Q5423o1097
15625c23128J58368K36237m5927P0500j8403j80256j19519p964L6266l5118r329
15614b38273P0764J69896J31800L4112j97707l0346N8602l8511L02618r7570q030
15603A57355q6115k77589r7558j1303J10406J62105j96346j30792J99469J47302
15593b3066p6798J67271Q8582M3009J98170k5550K1755n1882k30228m6417n7779
15582G067p2184J29965j30932l59356J20731P6349J81836J70466j43190m661K17379
15571A93470J80635j4730M8121K7685k22983k25717M5814j66292R6261j81439
$$ plain form
15561 -219175 -488315 -521348 -433107 -268177 -119236 -87703 -96005 -115248 -342408 -326988 3872
15550 3872 185256 179375 81817 -90389 57845 254562 283594 272942 384723 199871 -3212
15539 -3212 -111286 151780 68354 -256409 -349841 -441439 -393604 -583232 -444228 -143599 132336
15528 132336 92893 55724 17446 73246 -84001 163089 173039 17319 -461213 -463764 -512881
15517 -512881 -572876 -303676 -227759 -62610 -147791 -308200 -186990 -209669 -198769 -81282
15507 -81282 112205 109757 -60835 -344765 -396784 -398143 -71538 -54164 -331794 -11061 277653
15496 277653 185618 360976 366090 217280 229408 194896 297054 241344 84058 -126662 -87288
15485 -87288 -38131 98510 261608 203578 335394 317409 213360 -91261 -320635 -232130
$$ packed form
15561b19175k69140l3033Q8241J64930J48941L1533q302j9243k27160J5420L30860
15550C872J81384n881r7558j72206J48234J96717K9032j0652J11781j84852k03083
15539c212j08074K63066q3426l24763r3432r1598M7835j89628J39004L00629K75935
15528A32336l9443l7169l8278N5800j57247K47090R950j55720m78532k551m9117
15517e12881n9995K69200P5917J65149q5181j60409J21210k2679J0900J17487
15507h1282J93487k448j70592k83930n2019j359L26605J7374k77630L20733K88714
15496B77653r2035J75358N114j48810J2128l4512J02158n5710j57286k10720L9374
15485h7288M9157J36641J63098n8030J31816j7985j04049l04621k29374Q8505
$$ plain form
15475 -232130 -80613 -114639 -380691 -255512 -193799 -141525 -198938 -212103 -137970 -215649 -185324
15464 -185324 -29601 101554 236201 11875 -61205 91634 91083 373 -196964 -124421 -103322
15453 -103322 -89853 9872 -102460 -372814 -346634 -74911 15087 141318 149709 -25450 -464443
15442 -464443 -639143 -334344 -115986 49281 209155 201150 -185576 -549381 -424519 -499097
15432 -499097 -617268 -371996 -127502 60641 -52056 -322576 -319033 -358200 -390022 -353008
15422 -353008 -219399 -281760 -227633 -282211 -110322 -86090 -331543 -273435 -206669 -475151 -453278
15411 -453278 -74637 -106519 -306361 -129265 43756 -43055 51318 69074 24510 -100809
15401 -100809 -383068 -309618 -107076 -208514 -216361 -128064 47471 15895 -181205 -127213 -66969
$$ packed form
15475b32130J51517l4026k66052J25179O1713N2274n7413j3165P4133p7679L0325
15464a85324J55723J31155J34647k24326p3080J52839n51r0710j97337P2543K1099
15453a03322J3469R9725j12332k70354K6180K71723Q9998J26231Q391j75159m38993
15442d64443j74700L04799K18358J65267J59874q005l86726l63805J24862p4578
15432d99097j18171K45272K44494J88143j12697k70520L543l9167l1822L7014
15422c53008J33609o2361N4127n4578J71889K4232k45453N8108O6766k68482K1873
15411d53278L78641l1882j99842J77096J73021q6811R4373J7756m4564j25319
15401a00809k82259P3450K02542j01438p847Q8297J75535l1576j97100N3992O0244
$$ plain form
15390 -66969 -289842 -263498 -82481 -43792 97916 358681 302631 284730 265848 181163 151485
15379 151485 202823 10721 -268377 -305161 -1222 165848 -94376 -162797 185754 254378
15369 254378 53124 -184257 -206196 -240406 -105353 -74775 -34820 -147729 -298711 -189393
15359 -189393 -113060 6636 144977 164704 277293 289424 221170 212908 213157 -30562 52282
15348 52282 250198 166154 57255 -197136 -394485 -264244 -171985 -51889 -179883 -35248
15338 -35248 -21719 -58957 -29240 -117954 -273842 -91290 -8530 41141 228846 85205 -167632
15327 -167632 -284349 -110152 -69663 -65879 -207295 -211203 13471 243291 135139 237719
15317 237719 372920 335491 231569 145919 -44674 224622 201526 -24157 112538 107491
$$ packed form
15390f6969k22873K6344J81017L8689J41708K60765n6050j7901j8882q4685k9678
15379A51485N1338j92102k79098l6784L03939J67070k60224o8421L48551O8624
15369B54378k01254k37381k1939l4210J35053L0578L9955j12909j50982J09318
15359a89393P6333J19696J38341J9727J12589J2131o8254q262K49k43719Q2844
15348E2282J97916q4044j08899k54391j97349J30241R2259J20096j27994J44635
15338c5248J3529l7238K9717q8714j55888J82552Q2760M9671J87705j43641k52837
15327a67632j16717J74197M0489L784j41416l908K24674K29820j08152J02580
15317B37719J35201l7429j03922q5650j90593K69296k3096k25683J36695n047
$$ plain form
15307 107491 34755 207607 306160 64143 -210177 -208614 -15116 52361 -216935 -377679
15297 -377679 -99010 -163597 -146356 261598 486007 643029 505929 96749 -187461 -462803
15287 -462803 -520972 -342387 -126125 -51070 -65679 -66516 -43871 -132666 -251484 -417665 -259445
15276 -259445 -178360 -28636 -150092 106046 73410 22480 -100596 48459 -104947 -263003
15266 -263003 -244196 12722 -56214 -223561 -356748 -299470 -123248 -8721 -152590 -39420
15256 -39420 -191181 -519055 -260983 -92323 -76168 -136989 -217098 -356325 -287272 -52601
15246 -52601 -72817 156682 59321 42506 227376 286088 208209 257612 377676 276993 -62828
15235 -62828 -46770 -101966 39583 158632 46650 -31679 82352 54527 35517 -250291 -103608
$$ packed form
15307A07491p2736J72852R8553k42017k74320J563J93498O7477k69296j60744
15297c77679K78669o4587J7241M07954K24409J57022j37100m09180k84210k75342
15287d62803n8169J78585K16262P5055j4609q37K2645q8795j18818j66181J58220
15276b59445Q1085J49724j21456K56138l2636n0930j23076J49055j53406j58056
15266b63003J8807K56918o8936j67347j33187N7278J76222J14527j43869J13170
15256c9420j51761l27874K58072J68660J6155o0821q0109j39227O9053K34671
15246e2601k0216K29499r7361j6815J84870N8712p7879M9403J20064j00683l39821
15235f2828J6058n5196J41549J19049j11982p8329J14031k7825j9010k85808J46683
$$ plain form
15224 -103608 -34771 -46012 -158883 -209901 -46647 9128 127785 -27804 -22768 48172 -79664
15213 -79664 -30835 -101638 -290836 -145638 317107 302739 -83957 258467 261064 -53743 -219357
15202 -219357 -141922 43019 68870 -276165 -451636 -382229 -133436 -96930 38319 172052
15192 172052 85866 -197025 119696 234715 335961 361097 228781 248384 65849 12840
15182 12840 40128 -26412 64542 321152 236637 39583 -102349 -197174 -213991 120884 207232
15171 207232 197140 180614 -42628 -211166 -192624 -82840 90288 275582 109894 -211881
15161 -211881 -203049 68323 242786 42003 -33119 -23421 -38504 -86918 33210 145723 162910
15150 162910 139236 77549 -85093 -396911 -392080 -268933 -389342 -296860 -132443 -197178 -333787
$$ packed form
15224a03608O8837j1241j12871n1018J63254N5775J18657j55589N036P0940j27836
15213g9664M8829p0803j89198J45198M62745j4368l86696L42424K597l14807j65614
15202b19357P7435J84941K5851l45035j75471O9407K48793L6506J35249J33733
15192A72052q6186k82891L16721J15019J01246K5136j32316J9603j82535n3009
15182A2840K7288o6540R0954K56610q4515j97054j41932r4825j6817L34875Q6348
15171B07232j0092j6526k23242j68538J8542J09784J73128J85294j65688l21775
15161b11881Q832K71372J74463k00783p5122R698j5083m8414J20128J12513J7187
15150A62910k3674o1687j62642l11818M831J23147j20409R2482J64417o4735j36609
$$ plain form
15139 -333787 -353431 -50805 134096 -9128 114796 372051 260479 93259 187294 22085
15129 22085 -287792 -386538 -456627 -262528 -176193 -200747 -73844 1622 209666 385443 278885
15118 278885 229977 249705 261071 -3750 85132 113535 245576 421695 115770 -244184
15108 -244184 -50696 -121779 -208709 -175841 65619 379467 516423 181881 131283 224412
15098 224412 225275 37373 81617 -218341 -323727 -24863 151063 99575 -75964 -256378
15088 -256378 -214585 -173194 -232168 -1180 148682 42757 30345 322635 350737 404732 252188
15077 252188 69764 -43207 -105251 -83859 -307120 -326360 -269527 -211995 -72557 10250 272460
15066 272460 315357 81139 4228 -1264 -62534 -336657 -275098 -212787 -426299 -432942 -140909
$$ packed form
15139c33787j9644L02626J84901j43224J23924K57255j11572j67220R4035j65209
15129B2085l09877r8746p0089J94099Q6335k4554J26903P5466K08044J75777j06558
15118B78885m8908J9728J1366k64821Q8882K8403J32041J76119l05925l59954
15108b44184J93488p1083q6930L2868K41460L13848J36956l34542n0598R3129
15098B24412Q63j87902M4244k99958j05386K98864J75926n1488j75539j80414
15088b56378M1793M1391n8974K30988J49862j05925j2412K92290K8102N3995j52544
15077B52188j82424j12971o2044K1392k23261j9240N6833N7532J39438Q2807K62210
15066B72460M2897k34218p6911n492o1270k74123O1559O2311k13512o643K92033
$$ plain form
15055 -140909 199536 265996 268927 159775 25280 52299 36993 -52426 -181442 -122871 -7458
15044 -7458 -66689 -63230 1193 97926 112341 78640 -168254 -225770 47521 113042 -97193
15033 -97193 -110638 64542 29164 6994 126346 389746 16092 -274654 -262432 -203216 -244785
15022 -244785 -208848 19654 -57 31673 80429 53619 -192003 -256593 34215 169732 193480
15011 193480 137687 8850 -196763 -373878 -314881 82493 376617 93411 147157 79697
15001 79697 -75869 -34780 197365 -17103 87482 60170 -66802 -121527 -271601 -310369
14991 -310369 27419 187997 8745 189794 389522 572298 380718 -3334 125522 335123
14981 335123 79242 51683 191074 530044 533675 513439 424636 369595 210961 143659 -265504
$$ packed form
15055a40909L40445O6460K931j09152j34495K7019j5306q9419j29016N8571J15413
15044g458n9231L459O4423R6733J4415l3701k46894n7516K73291O5521k10235
15033i7193j3445J75180l5378k2170J19352K63400l73654k90746J2222N9216m1569
15022b44785L5937K28502j9711L1730M8756k6810k45622o4590K90808J35517K3748
15011A93480n5793j28837k05613j77115N8997L97374K94124k83206N3746o7460
15001G9697j55566M1089K32145k14468J04585k7312j26972n4725j50074l8768
14991c10369L37788J60578j79252J81049J99728J82776j91580l84052J28856K09601
14981C35123k55881k7559J39391L38970L631k0236q8803n5041j58634o7302m09163
$$ plain form
14970 -265504 -539790 -182649 -65609 84946 216487 -114671 -111487 -106715 -63739 30676 77978
14959 77978 60825 123846 192071 238799 -3210 -146381 -70097 33848 116516 50695 -54920
14948 -54920 8597 8192 -71347 -180395 -263786 -381536 -155266 99283 19582 -25844 -33568
14937 -33568 -1131 114729 2376 -70843 110699 252042 392350 535322 604591 407979
14927 407979 -72034 -112863 44040 22550 -207160 -171194 -436947 -605602 -399709 -213086
14917 -213086 -210649 -174321 -33167 -85203 -134512 -22794 -181687 -338965 -199124 -269147 -231866
14906 -231866 -181779 -54444 -38757 26892 -96512 -148290 -138160 -133680 -26022 256184 226610
14895 226610 280341 233980 175977 66671 -50842 -119933 -31432 -24292 -49723 68983 132802
$$ packed form
14970b65504k74286L57141J17040J50555J31541l31158L184M772M2976R4415M7302
14959G7978j7153O3021O8225M6728k42009j43171P6284J03945Q2668o5821j05615
14948e4920O3517m05p9539j09048q3391j17750K26270K54549p9701m5426p724
14937c3568L2437J15860j12353p3219J81542J41343J40308J42972O9269j96612
14927D07979m80013m0829J56903k1490k29710L5966k65753j68655K05893J86623
14917b13086K437L6328J41154n2036m9309J11718j58893j57278J39841p0023L7281
14906b31866N0087J27335J5687O5649j23404n1778J0130M480J07658K82206k9574
14895B26610N3731m6361n8003j09306j17513o9091Q8501P140k5431J18706O3819
$$ plain form
14884 132802 217337 123896 114519 96322 203758 59142 134339 192615 310426 177761 222472
14873 222472 149487 -90925 -249280 -154127 94195 206536 201900 97052 221727 272482
14863 272482 177755 24831 -47151 85726 15860 -25713 72971 233454 181596 72789 -64263
14852 -64263 131083 309400 36240 176746 445364 407939 202280 88192 284525 359812
14842 359812 424527 171798 -197110 -100874 404180 470351 348390 344480 128848 107422 -91356
14831 -91356 -287047 -206031 3518 -13606 62054 97256 145579 -67003 -370418 -249164 -167994
14820 -167994 -237311 -361536 -357213 -285677 -410475 -704442 -845795 -479286 -151096 8964
14810 8964 -102631 -222338 -268196 -326071 -418846 -464892 -231326 27343 18682 45143 35274
$$ packed form
14884A32802Q4535r3441r377j8197J07436j44616P5197N8276J17811j32665M4711
14873B22472p2985k40412j58355R5153K48322J12341m636j04848J24675N0755
14863B72482r4727j52924p1982J32877o9866m1573R8684J60483n1858j08807j37052
14852f4263J95346J78317k73160J40506K68618l7425k05659j14088J96333P5287
14842C59812O4715k52729l68908R6236N05054O6171j21961l910k15632k1426j98778
14831i1356j95691Q1016K09549j7124P5660L5202M8323k12582l03415J21254Q1170
14820a67994o9317j24225M323P1536j24798k93967j41353L66509L28190J60060
14810H964j11595j19707m5858n7875r2775m6046K33566K58669q661K6461r869
$$ plain form
14799 35274 43977 -136263 6684 29450 -86109 -89315 182634 -54684 -295517 -88031 270885
14788 270885 290544 147405 109457 204843 132205 284110 370278 392990 379729 196683 -106117
14777 -106117 -189220 -181775 -127795 15681 64976 -4816 16676 10655 14558 127489 160362 212424
14765 212424 155523 184946 96116 -116571 -172616 11154 188073 328118 249560 -285820
14755 -285820 -553262 -388375 -422537 -521796 -521522 -373885 -155975 -118676 -67844 -188695 -119770
14744 -119770 -25925 16045 16732 -26726 123851 215835 76729 198945 388763 406553 322317
14733 322317 137847 -124113 183399 124911 -65521 -30483 46939 -123247 -6908 160431
14723 160431 26838 -283764 -388347 -100624 175661 5448 -18730 32511 -14037 -145962
$$ packed form
14799C5274Q703j80240J42947K2766j15559l206K71949k37318k40833K07486L58916
14788B70885J9659j43139l7948R5386p2638J51905Q6168K2712j3261j83046l02800
14777a06117q3103P445N3980J43476M9295o9792K1492o021L903J12931L2873N2062
14765B12424n6901K9423q8830k12687n6045J83770J76919J40045p8558n35380
14755b85820k67442J64887l4162r9259K74J47637K17910L7299N0832j20851O8925
14744a19770R3845M1970O87m3458J50577R1984j39106J22216J89818J7790q4236
14733C22317j84470k61960L07512n8488j90432L5038P7422j70186J16339J67339
14723A60431j33593l10602j04583K87723K76285j70213k4178N1241m6548j31925
$$ plain form
14713 -145962 -122145 78441 298417 44067 -17597 154484 90103 217660 -4199 -244844
14703 -244844 -104117 126716 322903 66189 -28490 -67359 -328431 -317874 -244462 -72186
14693 -72186 -64766 47351 24080 -235151 -360957 -326147 -85817 -58193 -255180 -180070 -43909
14682 -43909 193305 160469 -213156 -214791 -248163 -201834 -81934 -126293 -88411 -35909 -40642
14671 -40642 -130156 -305373 -242525 -266500 -239493 39717 168996 216579 278025 335153 447862
14660 447862 214516 -15845 -103196 111895 265347 204712 204814 293543 361471 275102 210849
14649 210849 523303 550386 453793 689696 462545 12507 60652 138111 213551 410836
14639 410836 296567 265435 126866 33649 149512 247923 180137 113889 -186357 -225018 -211699
$$ packed form
14713a45962K3817K00586K19976k54350o1664J72081o4381J27557k21859k40645
14703b44844J40727K30833J96187k56714r4679l8869k61072J0557P3412J72276
14693g2186P420J12117k3271k59231j25806L4810K40330K7624j96987P5110J36161
14682d3909K37214l2836l73625j635l3372M6329J19900m4359L7882N2502m733
14671d0642q9514j75217O2848k3975K7007K79210J29279M7583O1446N7128J12709
14660D47862k33346k30361q7351K15091J53452o0635J02Q8729O7928q6369o4253
14649B10849L12454K7083r6593K35903k27151m50038M8145P7459P5440J97285
14639D10836j14269l1132j38569r3217J15863R8411o7786o6248l00246l8661J3319
$$ plain form
14628 -211699 -267723 -272473 -254274 -119327 92539 124087 244206 65909 -37438 -207429
14618 -207429 -318056 -250147 -248011 -334504 -176651 -181716 -263191 -236289 -317366 -163142 80232
14607 80232 98853 100232 -93655 -81035 2847 4485 77150 -61732 -123161 -106129 -314786
14596 -314786 -439645 -205487 175818 215481 -17674 -74071 -94802 -184972 -310722 -580746
14586 -580746 -688957 -236287 -340849 -307325 -401363 -503756 -533909 -194384 69886 41228
14576 41228 -30728 -68636 -81054 -15029 69217 340963 392631 62751 -29488 -120026 -100373
14565 -100373 129037 -36946 -78925 42137 71950 3285 118758 135658 402950 236127
14555 236127 100236 -157566 -212903 -22394 -214771 -209346 -107796 -251010 -182312 147456
$$ packed form
14628b11699n6024m750J8199J34947K11866L1548J20119j78297j03347j69991
14618b07429j10627O7909K136q6493J57853n065q1475K6902q1077J54224K43374
14607H0232J8621J379j93887J2620Q3882J638P2665j38882o1429J7032k08657
14596c14786j24859K34158L81305L9663k33155n6397k0731r0170j25750k70024
14586e80746j08211M52670j04562L3524r4038j02393l0153L39525K64270k8658
14576D1228p1956l7908j2418O6025Q4246K71746N1668l29880r2239r0538J9653
14565a00373K29410j65983m1979J21062K9813o8665J15473J6900K67292j66823
14555B36127j35891k57802n5337J90509j92377N425J01550j43214O8698L29768
$$ plain form
14545 147456 457312 547151 365297 140003 116762 20190 -226130 -174359 -188103 -201632 -106029
14534 -106029 -169074 110797 218668 313884 358151 182309 -139890 -317250 -388844 -385142 -310208
14523 -310208 -381338 -371049 -369895 -327086 -174683 -301069 -344202 -435494 -414201 -438569 -579115
14512 -579115 -398511 81410 358106 232578 110464 214504 140182 -39556 41366 33878
14502 33878 -68375 -88394 -124524 -214950 -141664 80321 70428 -122089 -50273 -28220 300563
14491 300563 538438 349728 270755 271070 177580 102541 91772 198037 297448 267000 162660
14480 162660 -14857 54020 122785 279610 270538 102590 2696 244951 297164 387204 285491
14469 285491 155989 344840 332949 391421 279536 105785 52566 -200467 -353327 -398508
$$ packed form
14545A47456L09856Q9839j81854k25294k3241r6572k46320N1771j3744j3529R5603
14534a06029o3045K79871J07871R5216M4267j75842l22199j77360p1594L702P4934
14523c10208p1130J0289J154M2809J52403j26386m3133r1292K1293k4368j40546
14512e79115J80604M79921K76696j25528j22114J04040p4322j79738Q0922p488
14502C3878j02253k0019l6130r0426P3286K21985r893j92517P1816K2053L28783
14491C00563K37875j88710p8973L15r3490p5039j0769J06265R9411l0448j04340
14480A62660j77517O8877O8765J56825r072j67948r9894K42255N2213R0040j01713
14469B85491j29502J88851j1891N8472j11885j73751n3219k53033j52860m5181
$$ plain form
14459 -398508 -244135 -257252 -246582 -424842 -383241 -288349 -242386 -118119 -103755 -62800 168850
14448 168850 223291 119815 -34069 -90053 -32842 87302 176875 163365 93248 18742 -23950
14437 -23950 73363 333780 397114 448141 424537 -13667 -164501 -69524 273627 338277 225796
14426 225796 242586 -117627 -147002 118207 277495 266470 273266 219623 78353 -92963 -48090
14415 -48090 -79169 -300794 -466768 -340049 -481426 -621802 -569506 -383823 -5920 81218
14405 81218 153532 397648 542810 470582 246474 171736 170739 -2322 221762 271598 250783
14394 250783 360200 384050 127475 -112010 -81773 183269 113119 134783 244494 480459
14384 480459 384932 104440 137053 377360 387672 23235 -56441 65498 187120 249825
$$ packed form
14459c98508J54373j3117J0670j78260M1601R4892M5963J24267J4364M0955K31650
14448A68850N4441j03476j53884n5984N7211J20144Q9573j3510p0117p4506m2692
14437b3950R7313K60417O3334N1027k3604m38204j50834R4977L43151O4650j12481
14426B25796J6790l60213k9375K65209J59288j1025O796n3643j41270j71316M4873
14415d8090l1079k21625j65974J26719j41377j40376N2296J85683L77903Q7138
14405H1218P2314K44116J45162p2228k24108p4738r97j73061K24084M9836k0815
14394B50783J09417K3850k56575k39485L0237K65042p0150K1664J09711K35965
14384D80459r5527k80492L2613K40307J0312l64437p9676J21939J21622O2705
$$ plain form
14374 249825 78979 -112823 -340398 -263829 -44366 -181529 -266454 -41252 29351 -43286
14364 -43286 -332173 -639754 -641329 -373188 -56847 288318 374648 525508 455399 318401
14354 318401 318230 108631 85285 213113 235501 -37461 -81164 98873 254853 278043 107385
14343 107385 -73895 -65162 68315 216340 418469 622811 386050 57079 12925 157245
14333 157245 233987 108599 195658 163309 -209807 -198286 222149 238970 185374 46789 43598
14322 43598 201547 426232 265584 75803 205604 253801 86704 -114935 -186735 -57390
14312 -57390 -310477 -331620 -387149 -403738 -131279 1819 15594 160088 358904 276971 246010
14301 246010 287797 249459 25435 -222042 -344890 -292361 -389341 -371243 -361050 -431929 -379494
$$ packed form
14374B49825j70846j91802k27575P6569K19463j37163q4925K25202P0603p2637
14364d3286k88887l07581j575K68141L16341L45165Q6330J50860p0109j36998
14354C18401j71k09599k3346J27828K2388k72962m3703J80037J55980K3190j70658
14343A07385j81280Q733J33477J48025K02129K04342k36761l28971m4154J44320
14333A57245P6742j25388Q7059l2349l73116J1521M20435J6821n3596j38585l191
14322D3598J57949K24685j60648j89781J29801M8197j67097k01639p1800J29345
14312e7390k53087k1143n5529j6589K72459J33098J3775J44494J98816q1933l0961
14301B46010M1787l8338k24024k47477j22848N2529r6980J8098J0193p0879N2435
$$ plain form
14290 -379494 -324872 -273710 -92081 106449 209248 172085 -86938 -25391 -163258 -190208
14280 -190208 -233628 -316600 -265641 -117965 -23684 -5763 -168631 -247307 -188379 -152527 -230677
14269 -230677 -253717 -103258 -168125 46272 59967 -225123 -70903 38073 96225 70081
14259 70081 -170847 -76878 16706 -70868 -82048 165013 -3274 -95142 64095 97734 194869
14248 194869 271996 166718 214388 210913 3377 25620 158637 57191 -83338 26055
14238 26055 230095 378949 251798 30821 -25116 -90221 -212618 -159637 -171058 -326097
14228 -326097 -236200 -219229 -297800 -259912 3678 184436 257623 69544 201623 244461 55951
14217 55951 101979 -109811 -226341 -262044 -237765 -201175 -220969 -163328 5191 -48338 -181946
$$ packed form
14290c79494N4622N1162J81629J98530J02799l7163k59023O1547j37867k6950
14280a90208m3420q2972N0959J47676R4281J7921j62868p8676N8928L5852p8150
14269b30677k3040J50459o4867K14397J3695k85090J54220J08976N8152k6144
14259G0081k40928R3969R3584q7574j1180K47061j68287r1868J59237L3639R7135
14248A94869P7127j05278M7670l475k07536K2243J33017j01446j40529J09393
14238B6055K04040J48854j27151k20977n5937o5105j22397N2981j1421j55039
14228c26097Q9897J6971p8571L7888K63590J80758P3187j88079J32079M2838j88510
14217E5951M6028k11790j16530l5703K4279L6590j9794N7641J68519n3529j33608
$$ plain form
14206 -181946 -205991 -223102 -184915 -200989 -207728 -480069 -411896 -129493 -205432 -148289 48101
14195 48101 118683 19150 -114383 -116616 -200859 -132968 -172633 -345112 -135662 55263 -52063
14184 -52063 -94191 -16319 189961 215172 12783 -81267 -51513 -133492 -28215 317236 358253
14173 358253 248863 104651 109509 82291 -127342 -441160 -697831 -462656 -221557 -359146
14163 -359146 -248790 -178213 -104965 -121113 54148 63697 59792 32928 162620 224666 84339
14152 84339 95006 119594 82561 -184702 -258075 -70077 -7207 -51106 -70475 -227046 -358836
14141 -358836 -282511 -204814 -150330 -196500 -174174 20025 241304 -106336 191376 163758 -11562
14130 -11562 34433 267133 368703 328601 441070 263356 80113 -49994 -92307 -169477
$$ packed form
14206a81946k4045j7111L8187j6074o739k72341O8173K82403p5939N7143J96390
14195D8101P0582r9533j33533k233q4243O7891l9665j72479K09450J90925j07326
14184e2063m2128P7872K06280K5211k02389r4050K9754q1979J05277L45451M1017
14173C58253j09390j44212M858k7218k09633l13818k56671K35175K41099j37589
14163c59146J10356P0577P3248j6148J75261R549l905k6864J29692O2046j40327
14152H4339J0667K4588l7033k67263p3373J87998O2870m3899j9369j56571j31790
14141c58836P6325P7697N4484m6170K2326J94199K21279l47640K97712k7618j75320
14130a1562M5995K32700J01570m0102J12469j77714j83243j30107m2313p7170
$$ plain form
14120 -169477 -225093 -171391 5971 12634 -291144 -201644 -300703 -321477 -426312 -392908 -268107
14109 -268107 -317877 -132082 150665 25630 -2445 -54870 -19775 40340 254233 328127 250999
14098 250999 65865 -5383 -135 232493 68681 -171012 -9309 222908 301830 147404
14088 147404 50302 244551 269293 294897 455208 485011 290036 213777 246166 441138 97896
14077 97896 -131731 -246860 -391224 -483982 -383677 -139965 -6870 -85028 -251071 -275155
14067 -275155 -92121 73355 -102463 -337153 -362798 -166583 270274 200148 -19337 -139833
14057 -139833 -94358 -113731 -214881 -203188 -195373 -187187 -81282 21963 -161121 -282394 -73442
14046 -73442 -283359 -402581 -247215 -272941 -201352 -213184 -214613 -326599 -354770 -340654 -34726
$$ packed form
14120a69477n5616N3702J77362O663l03778Q9500r9059k0774j04835L3404J24801
14109b68107m9770J85795K82747j25035k8075n2425L5095O0115K13893P3894p7128
14098B50999j85134p1248N248K32628j63812k39693J61703K32217P8922j54426
14088A47404r7102J94249K4742K5604J60311K9803j94975p6259L2389J94972l43242
14077I7896k29627j15129j44364r2758J00305K43712J33095p8158j66043k4084
14067b75155J83034J65476j75818k34690k5645J96215M36857p0126k19485j20496
14057a39833M5475j9373j01150J1693P815Q186J05905J03245j83084j21273K08952
14046g3442k09917j19222J55366k5726P1589j1832j429j11986k8171J4116L05928
$$ plain form
14035 -34726 159079 73517 -114956 -165312 -320965 -166530 152799 7842 -375186 -490495
14025 -490495 -180820 19556 83846 373819 621395 657650 392705 209781 143831 166838
14015 166838 18885 118224 295638 113326 144223 273742 244836 365375 316152 417789
14005 417789 398133 357012 196414 186542 232258 106441 -98278 -141998 165981 339166 391376
13994 391376 511184 536727 508269 638898 334971 149061 30376 -73230 -159720 -202410
13984 -202410 -303940 -225602 128887 183469 233374 138817 4743 -109688 -191972 -232921 -117227
13973 -117227 -113929 -166733 107538 109897 134770 187899 193900 213551 139327 60064 -50885 55186
13961 55186 316906 211569 -63817 -249019 -105857 -148527 -320115 -359005 -345357 -189587
$$ packed form
14035c4726J93805q5562j88473n0356j55653J54435L19329j44957l83028j15309
14025d90495L09675K00376O4290K89973K47576L6255k64945j82924o5950K3007
14015A66838j47953R9339J77414j82312L0897J29519k8906J20539m9223J01637
14005D17789j9656m1121j60598r872M5716j25817k04719m3720L07979J73185N2210
13994C91376J19808K5543k8458J30629l03927j85910j18685j03606q6490m2690
13984b02410j01530P8338L54489N4582M9905r4557j34074j14431q2284m0949J15694
13973a17227L298n2804K74271K359K4873N3129O001J9651p4224p9263j10949J06071
13961E5186K61720j05337k75386j85202J43162m2670j71588l8890J3648J55770
$$ plain form
13951 -189587 -298790 -303971 -14906 201436 226676 72313 5832 61244 187893 335129
13941 335129 341264 314390 353026 338494 141289 -70677 -334057 -365384 -199601 -22456 -32935
13930 -32935 -243633 -110099 220912 319917 227156 -244212 -330621 -185648 -228315 -67566
13920 -67566 -86203 -47457 -24368 144515 145712 2645 -25786 -35119 -209102 -157140 -304551
13909 -304551 -270823 64887 33981 -173515 -13264 294955 280294 67306 -218123 -144850
13899 -144850 -234636 -183723 -76665 60626 -22141 119667 -149075 -207275 29209 43470
13889 43470 -97370 -231942 -257935 -163516 -97012 -107152 -180526 -208065 -304978 -365497 -343461
13878 -343461 -244088 -54892 217145 309445 108374 -98889 -179800 -176951 -95961 228546 334647
$$ packed form
13951a89587j09203n181K89065K16342K5240j54363o6481N5412J26649J47236
13941C35129O135k6874L8636j4532j97205k11966k63380l1327J65783J77145j0479
13930c2935k10698J33534L31011R9005r2761m71368q6409J44973m2667J60749
13920f7566j8637L8746K3089J68883J197j43067k8431r333j73983N1962j47411
13909c04551L3728L35710l0906k07496J60251L08219j4661k12988k85429P3273
13899a44850q9786N0913J07058J37291q2767J41808k68742n8200K36484J4261
13889D3470j40840j34572k5993R4419O6504j0140p3374k7539r6913o0519K2036
13878c43461R9373J89196K72037R2300k01071k07263q0911K849Q0990L24507J06101
$$ plain form
13867 334647 441094 522056 403665 375339 535543 432980 220116 83730 -89979 -68580
13857 -68580 -42916 190494 312854 333396 386234 300781 169232 155925 89030 -12163 196511
13846 196511 288040 323274 301965 -145390 -112922 118935 202063 413448 376459 113160 9277
13835 9277 251019 481977 307666 203067 52165 24023 -102903 -29058 -76046 -71063 -299569
13824 -299569 -232588 -47675 181015 95487 -121981 -134171 69819 -64861 -128656 -52450
13814 -52450 177083 198960 -3467 -55584 -33733 141562 363166 414577 94512 122084 209081
13803 209081 237521 244744 320777 245846 57096 81855 198246 31901 187957 186373 234524
13792 234524 421290 111620 -88473 -49345 -90109 -68483 -87786 -111178 75087 388501
$$ packed form
13867C34647J06447Q0962j18391k8326J60204j02563k12864j36386j73709K1399
13857f8580K5664K33410J22360K0542N2838q5453j31549j3307o6895j01193K08674
13846A96511R1529L5234k1309m47355L2468K31857Q3128K11385l6989k63299j03883
13835I277K41742K30958j74311j04599j50902k8142j26926P3845m6988M983k28506
13824b99569O6981J84913K28690q5528k17468j2190K03990j34680o3795P6206
13814e2450K29533K1877k02427n2117K1851J75295K21604N1411l20065K7572Q6997
13803B09081K8440P223P6033p4931j88750K4759J16391j66345J56056j584M8151
13792B34524J86766l09670k00093L9128m0764K1626j9303k3392J86265L13414
$$ plain form
13782 388501 566621 486711 301514 -59598 -174701 -134893 126659 222510 407948 -85931
13772 -85931 -534042 -303200 -9272 27920 50504 -13097 9155 304383 352996 162144 334424
13761 334424 392554 306029 251035 52417 34912 -33165 -50938 -80842 5178 253188 146593
13750 146593 36761 -230636 -315434 -279749 -388292 -600557 -451128 -115398 79526 133469
13740 133469 49451 -44591 64674 183477 359014 270922 -14533 -130220 -425645 -282733
13730 -282733 -245758 -253762 -198278 -99964 26629 204060 177030 55575 -95056 -113136 -30055
13719 -30055 -61413 -355895 -227201 138738 254512 225009 345857 342097 285456 177170 -72856
13708 -72856 -115237 -36487 -57221 -54571 -186541 -564431 -584970 -505529 -465578 -512943 -364517
$$ packed form
13782C88501J78120p9910j85197l61112j15103L9808K61552R5851J85438m93879
13772h5931m48111K30842K93928L7192K2584o3601K2252K95228M8613j90852J72280
13761C34424N8130q6525n4994j98618j7505o8077j7773k9904Q6020K48010j06595
13750A46593j09832k67397q4798L5685j08543k12265J49429L35730J94924N3943
13740A33469q4018r4042J09265J18803J75537q8092k85455j15687k95425J42912
13730b82733L6975q004N5484R8314J26593J77431k7030j21455j50631j8080Q3081
13719c0055l1358k94482J28694L65939J15774k9503J20848l760n6641j08286k50026
13708g2856m2381P8750k0734K650j31970l77890k0539P9441L9951m7365J48426
$$ plain form
13697 -364517 -215092 -78092 -67822 -139582 -289772 -329656 -188445 -208358 -87688 -77296
13687 -77296 72922 223088 100594 -116327 -338131 -170850 -25283 239966 31602 -138586
13677 -138586 -233404 -285179 -175750 -50290 -22060 295709 405441 110257 -68981 134141
13667 134141 222409 -189819 -416616 -404494 -433219 -263876 -219380 -346790 -155127 40840
13657 40840 -103968 -176148 -269202 -147558 -163962 30835 73973 -60241 -359088 -493654
13647 -493654 -307234 -275841 -292701 35248 21389 27436 292926 235273 -58158 -248196 -142484
13636 -142484 -15790 312233 335290 262435 -289583 -443943 -327627 -262564 -218998 -299216
13626 -299216 -225861 -81632 112232 223904 175505 318698 23207 -109338 -1542 124604
$$ packed form
13697c64517J49425J37000J0270p1760j50190l9884J41211j9913J20670J0392
13687g7296J50218J50166j22494k16921k21804J67281J45567K65249k08364j70188
13677a38586r4818n1775J09429J25460K8230L17769J09732k95184j79238K03122
13667A34141Q8268m12228k26797J2122k8725J69343M4496j27410J91663J95967
13657D0840j44808p2180r3054J21644j6404J94797M3138j34214k98847j34566
13647d93654J86420L1393j6860L27949j3859O047K65490n7653k93431j90038J05712
13636a42484J26694L28023K3057p2855n52018j54360J16316O5063M3566q0218
13626b99216P3355J44229J93864J11672m8399J43193k95491j32545J07796J26146
$$ plain form
13616 124604 380620 307100 57960 44064 142636 -110499 -335095 -442520 -404481 -228015
13606 -228015 -4146 -205224 -110937 41631 109873 128351 362816 469412 305249 303675
13596 303675 244843 -59300 -61862 -50437 33758 138688 324054 242572 -111825 -258938 -90204
13585 -90204 65185 265518 285060 286410 175479 156597 131679 32464 32763 192278 581498
13574 581498 465654 463861 449841 322226 288826 183800 200187 78163 99615 230594 238442
13563 238442 141975 102463 -17419 -18710 80300 -147860 -143184 -131549 16615 -11052 111397
13552 111397 160685 18111 -274527 -397750 -165341 19741 16706 -58429 -46308 30402 -98721
13541 -98721 -107410 -161142 -226622 -76396 -124840 -263034 -355833 -376273 -87094 51054 77138
$$ packed form
13616A24604K56016p3520k49140j3896R8572k53135k24596j07425L8039J76466
13606b28015K23869k01078R4287J52568O8242J8478K34465J06596j64163j574
13596C03675n8832l04143k562J1425Q4195J04930J85366q1482l54397j47113J68734
13585i0204J55389K00333J9542J350j10931j8882k4918r9215K99J59515L89220
13574E81498j15844j793j4020j27615l3400j05026J6387j22024K1452J30979P848
13563B38442r6467l9512j19882j291R9010k28160M676J1635J48164k7667J22449
13552A11397M9288j42574k92638j23223K32409J85082l035p5135J2121P6710j29123
13541i8721q689n3732o5480J50226m8444j38194r2799k0440K89179J38148K6084
$$ plain form
13530 77138 -250744 -413188 -131610 46635 75768 257260 319272 420178 107719 99871
13520 99871 383503 361723 306905 262274 267788 259057 189604 207983 218215 278939 259027 235793
13508 235793 238341 169433 35889 -25625 -132929 -175166 -4797 65435 -55918 -190243 -185735
13497 -185735 -127830 30447 131811 -66270 -34919 -57178 103149 67671 -79453 -91621
13487 -91621 6023 -66319 -136890 -92306 124155 78857 -136230 -352357 -479002 -307840 -335943
13476 -335943 -179574 -42708 172992 353308 379196 152238 -65384 17106 279997 661444
13466 661444 657551 414605 139152 112476 274650 281862 70145 -4130 -39074 -48239 -42274
13455 -42274 -34731 -52306 -76090 97449 178696 119766 68025 -39472 226719 157495 95763
$$ packed form
13530G7138l27882j62444K81578J78245K9133J81492O2012J00906l12459p848
13520I9871K83632k1780n4818m4631N514q731o9453J8379J0232O0724j9912k3234
13508B35793K548o8908j33544o1514j07304m2237J70369P0232j21353j34325M508
13497a85735N7905J58277J01364j98081L1351k2259J60327l5478j47124j2168
13487i1621R7644p2342p0571M4584K16461m5298k15087k16127j26645J71162k8103
13476c35943J56369J36866K15700J80316K5888k26958k17622Q2490K62891L81447
13466F61444l893k42946k75453k6676J62174P212k11717p4275l4944r165N965
13455d2274P543j7575k3784J73539Q1247n8930n1741j07497K66191o9224o1732
$$ plain form
13444 95763 196887 113415 61727 62488 -188775 -155684 99490 34220 -85779 -136582 -141267
13433 -141267 -143910 -54989 96701 34898 -66910 -189195 -251241 -347115 -205767 -136756 3304
13422 3304 72817 246053 365479 434414 378377 237873 45501 -139862 88349 160318 22110
13411 22110 14631 -107871 -120790 -44967 -117083 -271070 -284763 -232256 -230774 -131971 -200681 -162521
13399 -162521 -351118 -437496 -59027 20990 -417709 -474258 -300210 -111482 206837 260942
13389 260942 233707 260684 118306 95602 110038 180935 18544 -176813 -310852 -72075
13379 -72075 -57751 11564 -108624 -265292 -193812 -78331 -50992 -232195 -316478 -248464 -305356
13368 -305356 -288500 -79944 -100635 127925 480328 220592 -13859 67852 1926 -87933
$$ packed form
13444I5763J01124q3472n1688P61k51263L3091K55174o5270j19999n0803m685
13433a41267k643Q8921J51690o1803j01808j22285o2046r5874J41348O9011J40060
13422C304O9513J73236J19426O8935n6037j40504j92372j85363K28211P1969j38208
13411B2110p479j22502j2919P5823p2116j53987j3693N2507J482R8803o8710L8160
13399a62521j88597q6378L78469Q0017m38699n6549J74048J88728L18319N4105
13389B60942k7235K6977j42378k2704J4436P0897j62391j95357j34039K38777
13379g2075J4324O9315j20188j56668P1480J15481K7339j81203q4283O8014n6892
13368c05356J6856K08556k0691K28560L52403k59736k34451Q1711o5926q9859
$$ plain form
13358 -87933 101735 131291 -281067 -205825 -51125 137292 152454 150743 240379 142827 47579
13347 47579 -7496 59282 113195 177303 226665 265922 302382 287410 158310 -63899 -229275
13336 -229275 -82285 379 6017 -20718 -187780 -271792 -127877 -107802 -389791 -581442 -444800
13325 -444800 -174125 -247750 -309863 -500382 -251904 91021 90699 293346 107008 -180044
13315 -180044 -29989 -167597 -221441 -147212 -186615 -78763 -69571 105177 2110 -14023 -66714
13304 -66714 -253030 -295032 -52379 -70279 -110227 -187205 -240690 -179610 -99802 -53740 -29895
13293 -29895 -217043 -1386 345797 216473 40166 278116 438768 315785 42137 99412
13283 99412 -26026 -100654 -156547 -199357 -259542 -266900 -334287 -391295 -378797 92120 310673
$$ packed form
13358h7933J89668K9556m12358P5242J54700J88417J5162j711Q9636r7552r5248
13347D7579n5075O6778N3913O4108M9362L9257L6460j4972j29100k22209j65376
13336b29275J46990Q2664N638k6735j67062q4012J43915K0075k81989j91651J36642
13325d44800K70675p3625o2113j90519K48478L42925l22K02647j86338k87052
13315a80044J50055j37608n3844P4229l9403J07852R192J74748j03067j6133n2691
13304f6714j86316m2002K42653j7900l9948p6978n3485O1080P9808M6062K3845
13293b9895j87148K15657L47183j29324j76307K37950J60652j22983k73648N7275
13283I9412j25438p4628n5893m2810o0185p358o7387n7008J2498M70917K18553
$$ plain form
13272 310673 174668 151787 103992 60739 -65760 -165190 -15110 -69900 68130 17570 33224
13261 33224 149424 320136 262556 133898 -19017 -3905 188847 131723 174860 -157197
13251 -157197 -236428 -7766 437186 269077 243848 201854 117844 116162 -104593 -174239 -39620
13240 -39620 -102575 -342730 -156112 -20288 122406 163893 -78770 -271423 -89421 149462
13230 149462 180307 -91745 -236401 -96673 23235 198858 250435 259722 514468 450116
13220 450116 184911 139885 193478 345632 189550 66456 268267 284383 77635 -457822
13210 -457822 -532590 -360934 -262425 -288699 -345669 -452470 -97150 146710 355453 349068 327394
13199 327394 139556 93058 -57781 -100005 -65058 24151 201623 338915 124116 -199039
$$ packed form
13272C10673j36005k2881m7795m3253j26499r9430J50080n4790J38030n0560J5654
13261C3224J16200J70712n7580j28658j52915J5112J92752n7124M3137l32057
13251a57197p9231K28662M44952j68109k5229m1994q4010j682k20755o9646J34619
13240c9620o2955k40155J86618J35824J42694M1487k42663j92653J82002K38883
13230A49462L0845k72052j44656J39728J19908J75623N1577R287K54746o4352
13220D50116k65205m5026N3593J52154j56082j23094K01811J6116k06748n35457
13210d57822p4768J71656R8509k6274n6970j06801L55320K43860K08743o385k1674
13199C27394j87838m6498j50839m2224L4947Q9209J77472J37292k14799l23155
$$ plain form
13189 -199039 -222454 -153100 -67390 114757 -101761 -144367 -189686 56737 121439 121767 281402
13178 281402 193845 219026 92032 272568 570076 553101 536480 342347 -99551 -263324
13168 -263324 -118114 30069 -22188 -110283 -28392 -9829 -240673 -291216 12177 103252 301850
13157 301850 264740 81100 -203782 48608 161898 162590 -52727 -260058 -270102 -247989 -293895
13146 -293895 -156626 -38646 15791 227154 474814 291475 120987 159525 77545 -32029
13136 -32029 -296737 -42148 270429 46593 -66939 128626 217948 205874 505121 498480
13126 498480 283142 382976 381491 493376 168794 -142328 -156795 -263761 -285152 -248051 -211214
13115 -211214 105749 90776 -120369 -296962 -365338 -276724 -359931 -321276 -283775 -337952 -270669
$$ packed form
13189a99039k3415O9354Q5710J82147k16518m2606m5319K46423O4702L28J59635
13178B81402q7557K5181j26994J80536K97508j6975j6621j94133m41898j63773
13168b63324J45210J48183n2257q8095Q1891J8563k30844n0543L03393R1075J98598
13157C01850l7110j83640k84882K52390J13290O92k15317k07331j0044K2113m5906
13146b93895J37269J17980N4437K11363K47660j83339j70488L8538q1980j09574
13136c2029k64708K54589L12577k23836j13532J95565Q9322j2074K99247o641
13126D98480k15338R9834j485J11885l24582l11122j4467j06966k1391L7101L6837
13115b11214L16963j4973k11145j76593o8376Q8614q3207L8655L7501n4177O7283
$$ plain form
13104 -270669 -204789 -206826 -151350 -180597 -303581 -251188 -42730 64616 -57668 19512 78987
13093 78987 7368 -71565 -100051 16644 -15762 -132997 -104914 210098 222533 137212 42883
13082 42883 4128 186445 94122 118695 -190249 -127913 13516 66281 65758 157666 255157
13071 255157 375869 80869 -37203 211918 347800 265860 210715 174065 -5201 186576
13061 186576 247320 227064 154126 -38847 -220674 -200024 -97441 248429 343241 241749
13051 241749 2258 -96463 -126990 -165129 -17113 192667 197159 88927 48214 103941 286592
13040 286592 164258 -82472 89726 225245 64004 48483 91295 112280 117112 66589 -13977
13029 -13977 -45441 68726 8342 -16368 263991 359001 275309 220788 93135 20886 -259793
$$ packed form
13104b70669O5880k037N5476k9247j22984N2393K08458J07346j22284P7180N9475
13093G8987p1619p8933k8486J16695l2406j17235K8083L15012J2435q5321r4329
13082D2883l8755J82317r2323K4573l08944O2336J41429N2765n23R1908R7491
13071B55157J20712k95000j18072K49121J35882q1940n5145l6650j79266J91777
13061A86576O0744k0256p2938j92973j81827K0650J02583L45870R4812j01492
13051B41749k39491r8721l0527l8139J48016K09780M492j08232m0713N5727J82651
13040B86592j22334k46730J72198J35519j61241j5521M2812K0985M832n0523q0566
13029a3977l1464J14167o0384k4710K80359R5010q3692n4521j27653p2249k80679
$$ plain form
13018 -259793 -134198 -163175 -128335 -138639 -163103 -278199 -338933 -117627 -203214 -467489 -531517
13007 -531517 -431380 -263511 -103947 -37229 -16716 -75603 -144098 -95938 153246 185894 156447
12996 156447 192573 196453 72660 -214599 -240812 -87524 105320 209701 15088 -42979
12986 -42979 52483 155337 296432 285821 284522 89269 -19223 -41216 -171304 12535 227252
12975 227252 186082 111860 219052 146517 -351929 -283839 -88833 -133877 -304085 -103688
12965 -103688 211813 88977 -238041 -260065 12703 -78024 -128429 -146524 -719 44520
12955 44520 -264842 -384034 -331875 -167147 -181315 -191689 -68900 -26538 -8468 -47057 -81871
12944 -81871 -171528 -266208 -273722 43120 299504 372918 157083 -118630 -277938 -301515 -178953
$$ packed form
13018b59793J25595k8977L4840j0304k4464j15096o0734K21306q5587k64275o4028
13007e31517J00137J67869J59564O6718K0513n8887o8495M8160K49184L2648k9447
12996A56447L6126L880j23793k87259k6213J53288J92844J04381j94613n8067
12986d2979R5462J02854J41095j0611j299j95253j08492k1993j30088J83839K14717
12975B27252m1170p4222J07192p2535m98446O8090J95006m5044j70208K00397
12965a03688L15501j22836l27018k2024K72768r0727n0405j8095J45805M5239
12955D4520l09362j19192N2159J64728j4168j0374J22789M2362J8070l8589l4814
12944h1871q9657r4680p514L16842K56384P3414k15835k75713j59308k3577J22562
$$ plain form
12933 -178953 -157456 93186 -47866 -211787 -431909 -413138 -334695 -145641 -116110 -184769
12923 -184769 29327 138265 48460 50621 180015 90099 109602 125385 162831 133051 -30678
12912 -30678 -49268 -125330 165190 343724 251867 210425 70385 153943 299524 23551 -279180
12901 -279180 -424319 -244361 2433 293516 324818 336268 485479 277936 139436 109083
12891 109083 265102 317145 137347 128523 147458 83582 33951 -10959 -178158 -204194 -47590
12880 -47590 -14393 17244 33196 -18250 -59755 47193 93130 233681 251123 129347 -49700
12869 -49700 -223993 -115331 -80396 -64176 -64467 129441 109091 15358 147551 177159 192079
12858 192079 236025 250493 183577 35621 -57962 -369330 -351721 -266498 -386134 -367902 -355020
$$ packed form
12933a78953K1497K50642j41052j63921k20122J8771P8443J89054K9531o8659
12923a84769K14096J08938q9805K161J29394q9916J9503J5783L7446k9780j63729
12912c0678j8590p6062K90520J78534r1857m1442j40040Q3558J45581k75973l02731
12901b79180j45139J79958K46794K91083L1302J1450J49211k07543j38500l0353
12891A09083J56019N2043j79798q824J8935o3876m9631m4910j67199k6036J56604
12880d7590L3197L1637J5952n1446m1505J06948M5937J40551J7442j21776j79047
12869d9700j74293J08662L4935J6220k91J93908k0350r3733J32193K9608J4920
12858A92079M3946J4468o6916j47956r3583l11368J7609Q5223j19636J8232J2882
$$ plain form
12847 -355020 -317116 -200362 123655 471372 536096 250845 98113 -191733 -238698 -97568
12837 -97568 -113854 -104285 -16454 22829 113470 4133 -83915 -65658 -62838 -331856 -205640
12826 -205640 -251697 -191708 -90806 -26640 -178266 -348471 -301452 -304063 -411567 -556849 -442975
12815 -442975 -400498 -188451 -50706 55109 37371 150413 134288 217805 292773 131065
12805 131065 36618 153424 303026 239966 362898 450519 539058 336448 334336 553308 333528
12794 333528 95172 -3011 -83987 135666 215572 34553 -215128 -357534 -420990 -254218
12784 -254218 -129810 13715 -142810 -347781 -261796 -112841 -50709 -190473 -117926 170584
12774 170584 139701 196291 72430 63003 189123 331038 543455 476933 278125 207731 369697
$$ packed form
12847c55020L7904J16754L24017L47717O4724k85251j52732k89846m6965J41130
12837i7568j6286R569Q7831L9283R0641j09337q8048J8257K820k69018J26216
12826b05640m6057N9989J00902O4166j51626j70205M7019k611j07504j45282J13874
12815d42975M2477K12047J37745J05815j7738J13042j6125Q3517P4968j61708
12805A31065r4447J16806J49602o3060J22932Q7621Q8539k02610k112K18972k19780
12794C33528k38356r8183q0976K19653P9906j81019k49681j42406o3456J66772
12784b54218J24408J43525j56525k04971Q5985J48955O2132j39764P2547K88510
12774A70584l0883N6590j23861r427J26120J41915K12417o6522j98808p0394J61966
$$ plain form
12763 369697 314464 -30497 -18359 133433 176102 172900 303285 510101 648397 689406 610874
12752 610874 542885 577796 317114 347157 450461 415620 435518 344844 386665 466018 189905
12741 189905 112640 91298 211444 396397 362474 336588 247366 42865 -106873 -154650 -127434
12730 -127434 98083 95951 -184293 -167515 31886 -13970 -17892 -44884 -98526 143802 308239
12719 308239 319130 294252 261222 190469 510668 354386 36450 -154694 -189983 -142683 12713
12708 12713 132904 142925 210485 63110 -259533 -326153 -256974 59623 -16597 -228518 -232447
12697 -232447 -142326 -178333 -197602 -263829 -177288 -236043 -160445 -113939 -103772 -180193 -170947 -153873
12685 -153873 -85864 31953 -98025 -427324 -363654 63565 356879 406844 435529 42302
$$ packed form
12763C69697n5233l44961J2138J51792M2669l202J30385K06816J38296M1009p8532
12752F10874o7989L4911k60682L0043J03304l4841J9898r0674M1821P9353k76113
12741A89905p7265k1342J20146J84953l3923k5886q9222k04501j49738m7777K7216
12730a27434K25517k132k80244J6778J99401m5856l922k6992n3642K42328J64437
12719C08239J0891k4878l3030p0753L20199j56282l17936j91144l5289M7300J55396
12708A2713J20191J0021O7560j47375l22643o6620O9179L16597p6220k11921l929
12697b32447R0121l6007j9269o6227Q6541n8755P5598M6506J0167p6421R246J7074
12685a53873O8009J17817j29978l29299O3670M27219K93314M9965K8685l93227
$$ plain form
12675 42302 -38382 -151121 -284164 -263440 -166525 -214391 -273133 -137630 -4355 -6909 136958
12664 136958 -24799 -11992 274511 320691 181742 25254 -16232 -180500 -72042 128414
12654 128414 76122 151693 170285 -108355 -176096 -53476 149849 63149 9215 -942 65027
12643 65027 200343 242494 35020 -57556 30951 -34337 -14660 115323 128875 248258 562907
12632 562907 359857 804 145743 274331 157188 20355 -43606 26144 300055 458820
12622 458820 457090 504469 582491 442290 198827 253687 516586 473540 374482 343717 326180
12611 326180 295775 201688 145062 146823 104822 48148 147150 21110 -158388 -245777 -49357
12600 -49357 -125046 -327100 -62770 163894 -42635 -346661 -358898 -337338 -297342 -218736 -58260
$$ packed form
12675D2302q0684j12739j33043K0724R6915m7866n8742J35503J33275k554J43867
12664A36958j61757J2807K86503M6180j38949j56488m1486j64268J08458K00456
12654A28414n2292P5571J8592k78640o7741J22620K03325q6700n3934j0157O5969
12643F5027J35316M2151k07474r2576Q8507o5288J9677J29983J3552J19383L14649
12632E62907k03050l59053J44939J28588j17143j36833o3961O9750K73911J58765
12622D58820j730M7379P8022j40201k43463N4860K62899m3046r9058l0765j7537
12611C26180l0405r4087n6626J761m2001n6674R9002j26040j79498q7389J96420
12600d9357p5689k02054K64330K26664k06529l04026j2237K1560L9996P8606J60476
$$ plain form
12589 -58260 119286 224817 52127 -26948 -8498 200262 184875 148224 71798 -22029 -143762
12578 -143762 -93832 -6404 85676 196154 137912 198200 76225 -199088 -405240 -470773 -386614
12567 -386614 -253637 -347860 -449515 -408871 -352102 -303994 -246566 133778 79254 107914 137646
12556 137646 -33394 142864 386927 279348 186571 226064 194163 89024 26486 165343
12546 165343 331712 312234 216872 266535 287593 242899 415772 438726 404693 291872 319622
12535 319622 391534 516019 452157 342987 345948 160610 -202569 -195061 91268 156134 325465
12524 325465 223078 135887 -10127 -19915 142595 216697 247854 231272 15610 9223 -9854
12513 -9854 149886 192548 53581 1849 -9836 -93805 115511 453589 520200 471973 366582
$$ packed form
12589e8260J77546J05531j72690p9075J8450K08760j5387l6651p6426r3827j21733
12578a43762M9930Q7428R2080J10478n8242O0288j21975k75313k06152o5533Q4159
12567c86614J32977r4223j01655M0644N6769M8108N7428L80344n4524K8660K9732
12556A37646j71040J76258K44063j07579r2777L9493l1901j05139o2538J38857
12546A65343J66369j9478r5362M9663K1058m4694J72873K2954l4033j12821K7750
12535C19622P1912J24485o3862j09170K961j85338l63179P508K86329O4866J69331
12524C25465j02387q7191j46014r788J62510P4102L1157j6582k15662o387j9077
12513i854J59740M2662j38967n1732j1685q3969K09316L38078O6611m8227j05391
$$ plain form
12502 366582 282144 327548 302779 79261 253098 329014 309230 225024 12064 13661 246077
12491 246077 302514 264024 431661 167014 -14350 127239 418164 642404 587830 478797
12481 478797 460812 355504 428556 461941 211277 132967 506207 471656 295372 122850
12471 122850 144882 291665 297601 271338 273470 310563 481660 414324 294642 305521 318933
12460 318933 470930 499451 349536 159592 136164 292627 161899 -81059 -137385 -133890
12450 -133890 -38825 191922 -22677 -197769 -315481 -432567 -217794 -171207 45946 115153
12440 115153 60689 179443 319022 309242 232336 430131 459524 506760 290489 148472 91876
12429 91876 347860 329831 83535 -86009 -54753 -20947 112312 122840 20152 42813 15395
$$ packed form
12502C66582q4438M5404k4769k23518J73837P5916j9784q4206k12960J597K32416
12491B46077N6437l8490J67637k64647j81364J41589K90925K24240n4574j09033
12481D78797j7985j05308P3052L3385k50664p8310L73240l4551j76284j72522
12471A22850K2032J46783N936k6263K132L7093J71097o7336j19682J0879J3412
12460C18933J51997K8521j49915j89944k3428J56463j30728k42958n6326L495
12450a33890R5065K30747k14599j75092j17712j17086K14773M6587K17153O9207
12440A15153n4464J18754J39579r780p6906J97795K9393M7236k16271j42017n6596
12429I1876K55984j8029k46296j69544L1256L3806J33259J0528j02688K2661k7418
$$ plain form
12418 15395 437974 550947 498604 555771 422900 110264 53995 187013 354621 393846
12408 393846 444910 717074 775455 372994 236975 482895 677056 468366 198917 218886
12398 218886 475542 400565 88906 -171909 134636 160476 292688 294281 225208 284399 177032
12387 177032 266056 382742 409384 422715 248104 91171 273759 197820 -47713 -116238
12377 -116238 11135 116273 224095 270465 348766 217422 94804 147120 237603 451329
12367 451329 421668 263210 260491 54569 16947 179966 388524 367288 243814 173618 273034
12356 273034 139824 25759 189690 370762 208087 175657 297541 526894 642362 328272
12346 328272 111233 369589 378175 303519 223954 104354 353319 167941 -4586 79330
$$ packed form
12418A5395M22579J12973n2343N7167j32871l12636n6269J33018J67608L9225
12408C93846N1064K72164N8381m02461j36019K45920J94161k08690k69449J9969
12398B18886K56656p4977l11659k60815L06545K5840J32212J593o9073N9191j07367
12387A77032Q9024J16686K6642J3331j74611j56933J82588p5939k45533o8525
12377a16238J27373J05138J07822M6370P8301j31344j22618N2316R0483K13726
12367D51329k9661j58458k719k05922l7622J63019K08558k1236j23474p0196R9416
12356B73034j33210j14065J63931J81072j62675l2430J21884K29353J15468l14090
12346C28272k17039K58356Q586p4656p9565j19600K48965j85378j72527Q3916
$$ plain form
12336 79330 280107 213172 269286 -47069 -94967 29270 85183 376009 455051 514605 340675
12325 340675 315406 395009 295856 360353 521521 446292 547877 361411 231476 262026 362370
12314 362370 455954 296907 163160 147442 263306 248363 321056 389781 425698 235981 328065
12303 328065 335338 146375 126527 -44933 -163691 116829 326756 281917 69293 158915
12293 158915 159397 188312 176367 311150 447440 561948 633634 701766 727975 973020 984957
12282 984957 788825 527836 437116 475384 637506 689097 869459 746900 525565 445688
12272 445688 275474 305518 277944 165859 107526 103699 -13588 189796 227626 7903 120023
12261 120023 189496 544815 653405 480826 359526 451916 433758 397716 237933 319888
$$ packed form
12336G9330K00777o6935N6114l16355m7898J24237N5913K90826P9042N9554j73930
12325C40675k5269P9603r9153O4497J61168p5229J01585j86466j29935L0550J00344
12314C62370R3584j59047j33747j5718J15864j4943P2693O8725L5917j89717R2084
12303C28065P273j88963j9848j71460j18758K80520K09927m4839k12624Q9622
12293A58915M82K8915j1945J34783J36290J14508P1686O8132K6209K45045J1937
12282I84957j96132k60989r0720L8268J62122N1591J80362j22559k21335p9877
12272D45688j70214L0044k7574j12085n8333l827j17287K03384L7830k19723J12120
12261A20023O9473L55319J08590j72579j21300R2390j8158l6042j59783Q1955
$$ plain form
12251 319888 288049 158189 175374 579937 633061 735780 818290 508040 368130 325995
12241 325995 232448 123221 219630 512651 752247 792907 651311 730360 605421 668751
12231 668751 689341 824814 743375 449818 431356 555704 602468 744105 620641 208409
12221 208409 78876 153267 230057 513704 652126 753544 442678 304992 316199 283568
12211 283568 204887 262065 442194 498764 583168 714186 800796 721942 962390 1007895 928996
12200 928996 981088 783657 577776 601338 638151 851703 987718 960562 731934 555126
12190 555126 586091 647962 647946 513801 542390 600491 938300 913912 860932 873918 1107132
12179 1107132 940272 741128 635837 911818 1272330 1370158 1417799 1149139 788009 551323
$$ packed form
12251C19888l1839j29860J7185M04563N3124J02719Q2510l10250j39910m2135
12241C25995r3547j09227R6409K93021K39596M0660j41596P9049j24939O3330
12231F68751K0590J35473q1439k93557j8462J24348M6764J41637j23464m12232
12221B08409j29533P4391P6790K83647J38422J01418l10866j37686J1207l2631
12211B83568p8681N7178J80129N6570Q4404J31018Q6610p8854K40448M5505p8899
12200I28996N2092j97431k05881K3562L6813K13552J36015k7156k28628j76808
12190E55126L0965O1871j6j34145K8589N8101L37809k4388n2980J2986K33214
12179A107132j66860j99144j05291K75981L60512R7828M7641k68660l61130k36686
$$ plain form
12169 551323 520407 636947 746308 969263 958440 987526 984380 1064586 1135601 829554 717008
12158 717008 794786 673918 800723 1014505 838657 878534 739687 593336 761966 636189
12148 636189 555535 761893 891947 848950 1112026 1094358 975588 834991 905834 1083278
12138 1083278 924388 1165629 1406125 1391137 1362591 1144555 1188023 1399871 1364146 1225613
12128 1225613 1191996 1496427 1549020 1352719 1202045 1214622 1261324 1262210 979767 847583 1020391
12117 1020391 1256601 1433602 1505033 1719275 1589922 1520072 1743846 1784989 1796023 1544063
12107 1544063 1267496 1343528 1280496 1514484 1731640 1762375 1795344 1755018 1713703 1668398 1664042
12096 1664042 1513887 1599885 1658096 1662263 1594138 1575096 1499228 1651857 1728460 1870932 1817282
$$ packed form
12169E51323l0916J16540J09361K22955j0823K9086l146Q0206P1015l06047j12546
12158G17008P7778j20868J26805K13782j75848L9877j38847j46351J68630j25777
12148F36189q0654K06358J30054m2997K63076j7668j18770j40597P0843J77444
12138A083278j58890K41241K40496j4988k8546k18036M3468K11848l5725j38533
12128A225613l3617L04431N2593j96301j50674J2577M6702Q86k82443j32184J72808
12117A020391K36210J77001P1431K14242j29353o9850K23774M1143J1034k51960
12107A544063k76567P6032o3032K33988K17156L0735L2969m0326m1315m5305m356
12096A664042j50155Q5998N8211M167o8125j9042p5868J52629P6603J42472n3650
$$ plain form
12085 1817282 1812094 1690095 1698251 1797872 1846278 1866631 1960980 1824156 1933532 2073926 2077776
12074 2077776 2276056 2260546 2180277 1993337 2122552 2312131 2338934 2392953 2459908 2375109
12064 2375109 2399658 2347797 2499583 2538202 2550750 2528118 2410377 2208863 2025339 2192288
12054 2192288 2543644 2716937 2933438 3044930 3198915 3195285 3147118 3163048 3103045 3167865
12044 3167865 3449456 3471893 3184969 3226125 3307154 3235082 3433681 3482148 3648297 3916062
12034 3916062 4137523 4142266 4009619 4108248 4308364 4429874 4400799 4488667 4261404 4251373
12024 4251373 4241403 4406804 4499937 4782642 4704435 4620809 4626592 4765164 5117038 5492815 5480054
12013 5480054 5463616 5449918 5494868 5540342 5335195 5384890 5784124 6003493 5961733 6099932
$$ packed form
12085A817282n188j21999Q156R9621M8406K0353R4349j36824J09376J40394L850
12074B077776J98280j5510q0269j86940J29215J89579K6803N4019O6955q4799
12064B375109K4549n1861J51786L8619J2548k2632j17741k01514j83524J66949
12054B192288L51356J73293K16501J11492J53985l630m8167J5930o0003O4820
12044C167865K81591K2437k86924M1156Q1029p2072J98599M8467J66149K67765
12034C916062K21461M743j32647R8629K00116J21510k9075Q7868k27263j0031
12024D251373r970J65401R3133K82705p8207q3626N783J38572L51874L75777j2761
12013E480054j6438j3698M4950M5474k05147M9695L99234K19369m1760J38199
$$ plain form
12003 6099932 6302822 6377946 6951117 7149286 7066105 7054032 7162784 7418212 7674539 7813902
11993 7813902 8301277 8646531 8905942 9205777 9143470 9206755 9599777 9893458 10161049 10339873
11983 10339873 10357203 10576445 10704210 10862945 11331698 11976342 12602138 12913009 13112536
11974 13112536 13651164 14202368 14776783 15175914 15546572 16487121 17147780 17591258 18274446
11965 18274446 18947777 19721689 20653637 21537247 22328726 23152294 24023968 24941596 26194109
11956 26194109 27488958 28936259 30469024 31891666 33050126 34245296 35836747 37828754
11948 37828754 39918314 42198850 44555042 47065516 49683724 52222163 55104087 58253338
11940 58253338 61626060 64930948 68290945 71991633 76131461 80513538 84977657 89467210
$$ packed form
12003F099932K02890P5124N73171J98169q3181j2073J08752K55428K56327J39363
11993G813902M87375L45254K59411K99835o2307O3285L93022K93681K67591J78824
11983A0339873J7330K19242J27765J58735M68753O44644O25796L10871J99527
11974A3112536N38628N51204N74415L99131L70658R40549O60659M43478O83188
11965A8274446O73331P73912R31948Q83610P91479Q23568Q71674R17628J252513
11956B6194109J294849J447301J532765J422642J158460J195170J591451J992007
11948C7828754K089560K280536K356192K510474K618208K538439K881924L149251
11940E8253338L372722L304888L359997L700688M139828M382077M464119M489553
$$ plain form
11932 89467210 94139662 98927825 103688988 108385321 112786409 116993936 121188453 124934051
11924 124934051 128229930 130915238 132774306 133853783 134443448 134573946 133876072 132623518
11916 132623518 130632033 128084537 125103898 121659888 117873842 114078232 110231261 106431532
11908 106431532 102542283 98363083 94397749 90483085 86536512 82994033 79693966 76538799
11900 76538799 73658763 70529133 67403472 64827594 62065595 59636897 57363266 55151281
11892 55151281 53363671 51374543 49593960 47887792 46344996 44575962 42949210 41363419
11884 41363419 40034496 38615235 37181776 36038055 34998021 33711887 32454598 31549135
11876 31549135 30940932 29999222 28631134 27661034 26915065 26002388 25221047 24476986 23927076
$$ packed form
11932H9467210M672452M788163M761163M696333M401088M207527M194517L745598
11924A24934051L295879K685308J859068J079477N89665J30498o97874j252554
11916A32623518j991485k547496k980639l444010l786046l795610l846971l799729
11908A06431532l889249m179200l965334l914664l946573l542479l300067l155167
11900G6538799k880036l129630l125661k575878k761999k428698k273631k211985
11892E5151281j787610j989128j780583j706168j542796j769034j626752j585791
11884D1363419j328923j419261j433459j143721j040034j286134j257289r05463
11876C1549135o08203r41710j368088r70100p45969r12677p81341p44061n49910
$$ plain form
11867 23927076 23398325 22461681 21556974 21165323 20708553 19892830 19016493 18431845 18223055
11858 18223055 17934277 17512039 17217239 16817985 16325761 15695334 15077638 15011132 14837646
11849 14837646 14470536 14148698 13708940 13175223 12779376 12351876 11959782 11570484 11345328
11840 11345328 11374501 11313455 10930016 10631368 10336662 10143115 9963711 9752843 9323144 9310079
11830 9310079 9229467 9009408 8763709 8476434 8143881 7921922 7778958 7619618 7777420 7546685
11820 7546685 7353421 7230329 6975215 6960420 6716311 6475956 6186995 5979681 5979043 5868376
11810 5868376 5483053 5148779 5258644 5309545 5120279 4905634 4790067 4760899 4593975 4460924
11800 4460924 4362160 4441947 4465542 4198908 3963653 3880612 3940690 4035014 4012240 3811950 3758940
$$ packed form
11867B3927076n28751r36644r04707l91651m56770q15723q76337n84648k08790
11858A8223055k88778m22238k94800l99254m92224o30427o17696o6506j73486
11849A4837646l67110l21838m39758n33717l95847m27500l92094l89298k25156
11840A1345328K9173o1046l83439k98648k94706j93547j79404k10868m29699j3065
11830I310079q0612k20059k45699k87275l32553k21959j42964j59340J57802k30735
11820G546685j93264j23092k55114j4795k44109k40355k88961k07314o38j10667
11810E868376l85323l34274J09865N0901j89266k14645j15567k9168j66924j33051
11800D460924r8764P9787K3595k66634k35255q3041O0078R4324k2774k00290n3010
$$ plain form
11789 3758940 3767942 3715791 3722222 3637601 3652658 3453891 3232914 3300109 3420517 3406935 3375921
11778 3375921 3369917 3328539 3222988 3161090 2888356 2614501 2618637 2751039 2761491 2633890 2477939
11767 2477939 2603527 2613593 2576444 2548706 2779213 2697070 2761203 2663512 2928615 3055768
11757 3055768 2449426 1837380 1799119 1948101 2162263 2204321 2274711 2179713 1952793 1856090
11747 1856090 1975647 1782586 1781674 1788500 2038121 2286198 2191976 2224502 2324322 2227894 1739295
11736 1739295 1375822 1470784 1888777 2254240 1963982 1861468 1896260 1678896 1635724 1750153
11726 1750153 1708461 1830301 1799808 1520400 1213256 1278313 1543552 1662885 1563236 1554592
11716 1554592 1279978 1183473 1405839 1572042 1426325 1309558 1478496 1498400 1240499 887229
$$ packed form
11789C758940R002n2151O431q4621J5057j98767k20977O7195J20408j3582l1014
11778C375921o004m1378j05551o1898k72734k73855M136J32402J0452j27601j55951
11767B477939J25588J0066l7149k7738K30507q2143O4133r7691K65103J27153
11757C055768o06342o12046l8261J48982K14162M2058P0390r4998k26920r6703
11747A856090J19557j93061r12O826K49621K48077r4222L2526R9820r6428m88599
11736A739295l63473R4962M17993L65463k90258j02514L4792k17364m3172J14429
11726A750153m1692J21840l0493k79408l07144O5057K65239J19333r9649q644
11716A554592k74614r6505K22366J66203j45717j16767J68938J9904k57901l53270
$$ plain form
11706 887229 1004251 960112 1138059 1321133 1050518 985931 1061222 1252825 1089276 848711
11696 848711 871113 835181 948772 928956 1091042 1083004 846873 648817 844791 1048888
11686 1048888 1101231 1256719 1481788 1531168 1369850 1473421 1597962 1357158 1215524 1184747
11676 1184747 1108068 1156807 957661 993734 1102631 991119 1017301 1128041 1225545 969210
11666 969210 720481 609164 786976 1046753 1018681 1031245 933926 978736 1081903 1212601
11656 1212601 1079453 855595 768787 704125 367687 308179 511949 551053 827925 794347
11646 794347 912589 817233 689296 613886 695547 568731 436232 491842 799429 958053
11636 958053 861165 635363 456272 466379 366387 191907 568354 761938 662782 410368
$$ packed form
11706H87229J17022m4139J77947J83074k70615o4587P5291J91603j63549k40565
11696H48711K2402l5932J13591j9816J62086q038k36131j98056J95974K04097
11686A048888N2343J55488K25069M9380j61318J03571J24541k40804j41634l0777
11676A184747p6679M8739j99146L6073J08897j11512K6182J10740R7504k56335
11666I69210k48729j11317J77812K59777k8072J2564r7319M4810J03167J30698
11656A212601j33148k23858q6808o4662l36438n9508K03770L9104K76872l3578
11646G94347J18242r5356j27937p5410Q1661j26816j32499N5610L07587J58624
11636I58053r6888k25802j79091J0107r9992j74480L76447J93584r9156k52414
$$ plain form
11626 410368 267722 345081 516717 356908 244213 466844 552977 820198 773247 675802
11616 675802 604898 767895 631252 551793 334679 136936 314276 355511 285262 209340
11606 209340 499544 588868 479125 482227 635189 589528 499454 631095 578294 265131 344811
11595 344811 421712 243702 342796 396922 465807 545253 366791 291787 319811 318505 98525
11584 98525 3780 10897 342975 445471 311410 309363 290029 252943 173646 -93291 -229058
11573 -229058 70650 85716 285405 586100 641405 701666 824029 605903 267089 678798
11563 678798 744692 410310 291707 228128 347351 285114 99164 -143330 -40064 100876
11553 100876 162428 51130 155608 96256 103660 37469 -25616 360291 503409 542235 720479
$$ packed form
11626D10368j42646P7359J71636j59809j12695K22631Q6133K67221m6951r7445
11616F75802p0904J62997j36643p9459k17114j97743J77340M1235p0249p5922
11606B09340K90204Q9324j09743L102J52962m5661r0074J31641n2801l13163P9680
11595C44811P6901j78010R9094N4126O8885P9446j78462p5004K8024j306k19980
11584I8525r4745P117L32078J02496j34061k047j9334l7086p9297k66937j35767
11573b29058K99708J5066J99689L00695N5305O0261J22363k18126l38814M11709
11563F78798O5894l34382j18603o3579J19223o2237j85950k42494J03266J40940
11553A00876O1552j11298J04478n9352P404o6191o3085L85907J43118L8826J78244
$$ plain form
11542 720479 649941 407183 399582 229839 95537 138823 527597 673602 726033 680989 529271
11531 529271 375611 200704 372623 667633 595254 583682 569619 589463 460807 550425
11521 550425 315575 247861 275672 406406 469598 294736 426167 479320 509623 582334 468307
11510 468307 272299 189338 69746 387221 692223 690323 724267 529148 165800 419639
11500 419639 538753 433163 378112 225455 56731 298605 584258 836787 1018168 1093693
11490 1093693 787077 585747 332075 211341 310653 300154 219309 -59157 -108105 -213648
11480 -213648 -155869 -63862 56771 86428 163033 423397 556979 442018 222214 246264
11470 246264 288011 122805 180192 482778 545468 223794 108734 75137 87936 220751
$$ packed form
11542G20479p0538k42758p601j69743j34302M3286L88774J46005N2431m5044j51718
11531E29271j53660j74907J71919K95010p2379j1572j4063J9844j28656Q9618
11521E50425k34850o7714K7811J30734O3192j74862J31431N3153L0303P2711j14027
11510D68307j96008q2961j19592L17475L05002j900L3944j95119l63348K53839
11500D19639J19114j05590n5051j52657j68724K41874K85653K52529J81381P5525
11490A093693l06616k01330k53672j20734R9312j0499q0845k78466m8948j05543
11480b13648N7779R2007J20633K9657P6605K60364J33582j14961k19804K4050
11470B46264M1747j65206N7387L02586O2690l21674j15060l3597J2799J32815
$$ plain form
11460 220751 238740 295152 308469 176044 98153 136183 253667 432897 453819 391858 246688
11449 246688 108986 252969 262538 209705 267644 303634 144508 117670 124574 174818 218016
11438 218016 102508 -68596 -150065 -74504 88943 247289 249049 339314 213295 50358
11428 50358 12077 104337 72305 -50547 -103396 -182914 -92080 -110368 -205789 -126916 -4368
11417 -4368 -83149 -307269 -130608 14842 149552 78950 -191040 -268946 -166802 14259
11407 14259 -26232 28482 285018 497985 410870 130557 263816 234570 168249 285571 444513
11396 444513 650088 690056 473768 -85116 -103430 -163303 -357423 -386039 -84589 274846
11386 274846 489419 709833 570128 419278 479174 416536 488912 313163 110365 275705
$$ packed form
11460B20751J7989N6412J3317j32425p7891L8030J17484J79230K0922o1961j45170
11449B46688j37702J43983R569n2833N7939L5990j59126k6838O904N0244M3198
11438B18016j15508j71104q1469P5561J63447J58346J760R0265j26019j62937
11428E0358l8281R2260l2032j22852n2849p9518R0834j8288r5421P8873J22548
11417d368p8781k24120J76661J45450J34710p0602k69990p7906J02144J81061
11407A4259m0491N4714K56536K12967q7115k80313J33259k9246o6321J17322J58942
11396D44513K05575L9968k16288n58884j8314n9873j94120k8616L01450L59435
11386B74846K14573K20414j39705j50850N9896o2638P2376j75749k02798J65340
$$ plain form
11376 275705 304512 337450 391192 159527 237696 491245 539410 462611 353808 382499 329092
11365 329092 265083 259556 186365 44822 -52807 -249027 -111452 82545 115898 116429 76640
11354 76640 260233 283386 197045 50221 -99122 -160205 -117230 -55566 -85073 -149404 -84951
11343 -84951 -155979 -263310 -315042 -90415 216768 450576 505413 448106 143986 11803
11333 11803 195127 399092 167828 4170 -109460 1001 137792 -69835 -58340 102241
11323 102241 16654 -3299 100804 59399 146409 149853 -172543 -536823 -457063 -308651 -362828
11312 -362828 -183210 23424 28681 52639 76484 -632 -242951 -250157 -246996 87631 166766
11301 166766 91488 134747 44805 103011 252329 309540 106844 -172798 -11993 211249
$$ packed form
11376B75705K8807L2938N3742k31665P8169K53549M8165p6799j08803K8691n3407
11365C29092o4009n527p3191j41543r7629j96220J37575J93997L3353N31l9789
11354G6640J83593K3153q6341j46824j49343o1083M2975O1664k9507o4331O4453
11343h4951p1028j07331n1732K24627L07183K33808N4837n7307l04120j32183
11333A1803J83324K03965k31264j63658j13630J10461J36791k07627J1495J60581
11323A02241q5587j9953J04103m1405Q7010L444l22396l64280P9760J48412n4177
11312c62828J79618K06634N257K3958K3845p7116k42319p206L161L34627P9135
11301A66766p5278M3259q9942N8206J49318N7211k02696k79642J60805K23242
$$ plain form
11291 211249 255761 251389 253534 -105121 -282262 -151912 -59169 94013 177613 406601 603590
11280 603590 705058 442452 22397 46212 63452 50678 280190 854944 761166 421941
11270 421941 308044 127860 167942 81539 182756 350213 252834 -48832 -38530 -11722
11260 -11722 83084 181488 226465 302897 229939 -86480 -156538 -93785 162909 215934 264119
11249 264119 248438 250014 152510 290438 193454 149816 301802 398598 472933 371713 273850
11238 273850 327361 355160 475168 364421 274002 78955 166508 349444 240987 205464
11228 205464 238633 284174 350931 378887 316184 -32223 61601 157701 145993 47251 -143686
11217 -143686 -253587 -188407 -147079 15233 337345 449505 392276 612305 507413 411824
$$ packed form
11291B11249M4512m372K145l58655j77141J30350R2743J53182Q3600K28988J96989
11280F03590J01468k62606m20055K3815J7240j2774K29512N74754r3778l39225
11270D21941j13897j80184M0082q6403J01217J67457r7379l01666J0302K6808
11260a1722R4806R8404M4977P6432p2958l16419p0058O2753K56694N3025M8185
11249B64119j5681J576r7504J37928r6984m3638J51986R6796P4335j01220r7863
11238B73850N3511K7799J20008j10747r0419j95047Q7553J82936j08457l5523
11228B05464L3169M5541O6757K7956o2703l48407R3824R6100j1708r8742j90937
11217a43686j09901O5180M1328J62312L22112J12160n7229K20029j04892r5589
$$ plain form
11207 411824 219175 -10111 129224 -2433 93310 276325 132269 -59978 -62681 98399
11197 98399 150519 362792 220901 79267 -63508 -212214 -360720 -216629 -45856 4759
11187 4759 49951 136657 128825 112132 44311 83035 -68797 65350 128256 133962 305427 375175
11175 375175 283090 273120 256992 448663 380877 254793 78733 32520 -55213 -261519 -246492
11164 -246492 6192 134159 176748 234520 294607 94330 -207063 -228518 -178461 -58477
11154 -58477 121013 279418 539877 376581 275750 122336 43571 92551 216531 24228
11144 24228 20774 538927 541244 220301 103257 -50661 -247760 -164066 -199887 -38960 -30750
11133 -30750 53746 197316 297439 272946 315789 413226 314103 134229 -239027 -499708 -204837
$$ packed form
11207D11824j92649k29286J39335j31657R5743J83015j44056j92247k703J61080
11197I8399N2120K12273j41891j41634j42775j48706j48506J44091J70773N0615
11187D759M5192Q6706p832j6693o7821L8724j51832J34147O2906N706J71465O9748
11175C75175r2085r970j6128J91671o7786j26084j76060m6213q7733k06306J5027
11164b46492K52684J27967M2589N7772O0087k00277l01393k1455N0057J19984
11154e8477J79490J58405K60459j63296j00831j53414p8765M8980J23980j92303
11144B4228l454N18153K317l20943j17044j53918j97099Q3694l5821J60927Q210
11133c0750Q4496J43570J00123k4493M2843R7437r9123j79874l73256k60681K94871
$$ plain form
11122 -204837 -7276 123611 106165 39757 -239437 -419507 -345427 -41854 103493 139680
11112 139680 114624 -50777 -101407 -151599 -188941 -81109 17431 202239 268739 286466 447927
11101 447927 379082 297298 449545 621207 364081 257599 237801 25958 -197921 -256029
11091 -256029 40690 193225 160703 150566 130128 354802 168667 43327 191672 221433
11081 221433 11239 -143170 -115601 203116 335975 312035 253463 177340 162013 29418
11071 29418 50230 100234 -32519 -8342 58919 173720 250841 220265 209495 324492 136444
11060 136444 320748 248341 281142 345285 253849 381364 355334 70830 -175999 -169468 30653
11049 30653 198596 188766 243972 227792 320319 279580 373694 601375 399786 144815 138358
$$ packed form
11122b04837J97561J30887j7446o6408k79194j80070P4080L03573J45347L6187
11112A39680k5056j65401n0630n0192l7342J07832R8540J84808O6500J7727J61461
11101D47927o8845q1784J52247J71662k57126j06482j9798k11843k23879n8108
11091b56029K96719J52535l2522j0137k0438K24674j86135j25340J48345K9761
11081B21433k10194j54409K7569L18717J32859k3940n8572p6123j5327j32595
11071B9418K0812N0004j32753K4177O7261J14801P7121l0576j0770J14997j88048
11060A36444J84304p2407L2801O4143r1436J27515k6030k84504k46829O531K00121
11049C0653J67943r830N5206j6180R2527m0739R4114K27681k01589k54971o457
$$ plain form
11038 138358 290323 762148 727359 489254 579942 587153 554575 690033 672929 441505 513563
11027 513563 894360 942542 916097 989819 1180286 1340730 1194416 1007683 889092 862549
11017 862549 997781 1316784 1640369 1723035 1967639 2055571 1832461 1644107 1396436 1553714
11007 1553714 1729998 1931424 1791696 1608096 1738388 1684240 1568058 1294507 1222339 1380719
10997 1380719 1361328 1212090 1047061 975933 855466 1038999 1275425 1087968 838356 857030
10987 857030 894487 769542 600544 644688 747318 429451 471737 225222 210097 127917
10977 127917 -50782 277755 432847 484647 370839 389640 253899 264481 411925 611151
10967 611151 661053 625662 598232 620570 711118 564065 402912 482206 451725 399418 407563
$$ packed form
11038A38358J51965M71825l4789k38105R0688P211l2578J35458j7104k31424P2058
11027E13563L80797M8182k6445P3722J90467J60444j46314j86733j18591k6543
11017H62549J35232L19003L23585Q2666K44604Q7932k23110j88354k47671J57278
11007A553714J76284K01426j39728j83600J30292n4148j16182k73551p2168J58380
10997A380719j9391j49238j65029p1128j20467J83533K36426j87457k49612J8674
10987H57030L7457j24945j68998M4144J02630l17867M2286k46515j5125q2180
10977A27917j78699L28537J55092N1800j13808J8801j35741J0582J47444J99226
10967F11151M9902l5391k7430K2338R0548j47053j61153P9294l0481n2307Q145
$$ plain form
10956 407563 344183 456267 576098 571499 649690 581858 449707 192725 -2239 -55487 -98414
10945 -98414 -186643 121234 342086 146036 -92666 36496 312330 271582 290280 274199
10935 274199 352549 213913 172198 227689 208812 39354 -82995 104393 179557 62081
10925 62081 34443 144140 177491 -32009 -71173 -7049 -316655 -402372 -256943 3120 151856
10914 151856 85774 -144488 -378113 -438144 -485648 -100868 122996 63185 194994 371197
10904 371197 357686 87636 -127782 -154613 -215218 -166655 -111623 -89852 -44034 -9585 33364
10893 33364 35727 -134611 140571 312463 325206 299074 412276 331944 169264 19973 -155036
10882 -155036 -148055 -166582 -191573 -19705 209601 96238 208468 220801 296138 575730 590026
$$ packed form
10956D07563o3380J12084J19831m599P8191o7832j32151k56982j94964n3248m2927
10945i8414q8229L07877K20852j96050k38702J29162K75834m0748J8698j6081
10935B74199P8350j38636m1715N5491j8877j69458j22349J87388P5164j17476
10925F2081k7638J09697L3351k09500l9164O4124l09606q5717J45429K60063J48736
10914A51856o6082k30262k33625o0031m7504L84780K23864n9811J31809J76203
10904C71197j3511k70050k15418k6831o0605M8563N5032K1771M5818L4449M2949
10893C3364K363j70338K75182J71892J2743k6132J13202q0332j62680j49291j75009
10882a55036O981j8527k4991J71868K29306j13363J12230J2333P5337K79592J4296
$$ plain form
10871 590026 447815 374504 190918 -113321 -277866 -153615 -31623 -115132 -83207 190583
10861 190583 227345 112138 -277612 -221607 -253522 -151858 309132 727149 699602 595412
10851 595412 454295 318413 275736 48570 26297 308532 407748 340444 212534 49912
10841 49912 35858 -11408 72554 49824 274431 473356 383606 242260 259716 179561 333552
10830 333552 511327 488561 600347 629772 662963 788794 649473 684549 699390 506737
10820 506737 378099 312151 219601 58637 116708 158876 463060 536076 538890 200513 136680
10809 136680 249146 632161 829461 798561 813439 684759 512401 624539 409662 320491
10799 320491 317305 -117509 -319910 -144549 23301 120822 421933 248525 98920 230993
$$ packed form
10871E90026j42211p3311j83586l04239j64545J24251J21992q3509L1925K73790
10861A90583L6762j15207l89750N6005l1915J01664M60990M18017k7547j04190
10851E95412j41117j35882m2677k27166k2273K82235R9216o7304j27910j62622
10841D9912j4054m7266Q3962k2730K24607J98925q9750j41346J7456q0155J53991
10830C33552J77775k2766J11786K9425L3191J25831j39321L5076J4841j92653
10820E06737j28638o5948r2550j60964N8071M2168L04184P3016K814l38377o3833
10809A36680J12466L83015J97300l0900J4878j28680j72358J12138k14877q9171
10799C20491l186m34814k02401J75361J67850R7521L01111j73408j49605J32073
$$ plain form
10789 230993 244213 99199 112375 315106 411155 349304 186327 256287 236850 261691 -12097
10778 -12097 -272139 -73829 98677 151026 147343 16677 -146431 238723 499828 623609
10768 623609 534359 392647 151059 38291 229632 291855 387194 511293 262435 236175
10758 236175 373331 278336 350877 539140 523783 268560 341545 514383 491018 617819
10748 617819 628433 631751 717461 559545 463787 390695 381988 498392 527697 184740 5709
10737 5709 292898 276814 382821 269541 115473 72904 249461 477035 647708 434894
10727 434894 399686 510122 410643 297275 716867 760552 793444 808191 853647 1000784 891199
10716 891199 808015 973176 1149930 1247089 1103600 1050000 1269973 1179357 1029651 1209183
$$ packed form
10789B30993J3220j45014J3176K02731R6049o1851j62977O9960j9437K4841k73788
10778a2097k60042J98310J72506N2349l683j30666j63108L85154K61105J23781
10768F23609q9250j41712k41588j12768J91341O2223R5339J24099k48858k6260
10758B36175J37156r4995P2541J88263j5357k55223P2985J72838k3365J26801
10748F17819J0614L318Q5710j57916r5758p3092q707J16404K9305l42957j79031
10737E709K87189j6084J06007j13280j54068m2569J76557K27574J70673k12814
10727D34894l5208J10436r9479j13368M19592M3685L2892J4747M5456J47137j09585
10716H91199q3184J65161J76754R7159j43489n3600K19973r0616j49706J79532
$$ plain form
10706 1209183 1059318 1283244 1413230 1385309 1139234 1081466 1194290 1130346 934099 971833
10696 971833 974270 1103504 1279526 1386339 1295450 1416531 1437520 1329937 1288320 1223341 1326967
10685 1326967 1387726 1262819 1316244 1411711 1482361 1567487 1253052 943323 898990 1010595
10675 1010595 929683 1050731 994029 915478 1075094 997316 832343 879464 989154 821230
10665 821230 978743 1391979 1254632 1478045 1815306 1852965 1627214 1404411 1592272 1721565
10655 1721565 1919367 2075073 2024167 1973121 1783618 1886520 2250825 2485492 2839664 2931109
10645 2931109 2883780 3165314 3407556 3499939 3373882 3243029 3342342 3192803 3147864 3190985
10635 3190985 3114873 2991273 3202757 3425352 3659366 4150095 4544990 5097752 5743265 6606180
$$ packed form
10706A209183j49865K23926J29986k7921k46075n7768J12824o3944j96247L7734
10696I71833K437J29234J76022J06813r0889J21081K0989j07583m1617o4979J03626
10685A326967O0759j24907N3425R5467P0650Q5126l14435l09729m4333J11605
10675A010595q0912J21048n6702p8551J59616p7778j64973M7121J09690j67924
10665H21230J57513M13236j37347K23413L37261L7659k25751k22803J87861J29293
10655A721565J97802J55706n0906n1046j89503J02902L64305K34667L54172R1445
10645B931109m7329K81534K42242R2383j26057j30853R9313j49539m4939M3121
10635C190985p6112j23600K11484K22595K34014M90729L94895N52762O45513Q62915
$$ plain form
10625 6606180 7437335 8148169 8931963 9646283 10461266 11494140 12593851 14037757 15930599
10616 15930599 18628051 22243514 27144938 33205121 41149699 51463172 63638745 76143991
10608 76143991 87511421 97268876 104850449 109437432 110819466 110508253 111363731 116064653
10600 116064653 126521129 143170071 164668693 187638606 208155202 223632804 232861270
10593 232861270 234132131 227595285 216658393 208157611 207714498 217135114 236253983 262584906
10585 262584906 289580816 311658292 325427863 328599067 319350682 298200408 270866329
10578 270866329 246110415 230247442 225253669 229446802 239502369 250518599 258120705
10571 258120705 259765124 254267976 240630825 219355218 195170404 173997035 159001919
$$ packed form
10625F606180Q31155P10834P83794P14320Q14983J032874J099711J443906J892842
10616A5930599K697452L615463M901424O060183P944578J0313473J2175573J2505246
10608G6143991J1367430R757455P581573M586983J382034l11213Q55478M700922
10600A16064653J0456476J6648942K1498622K2969913K0516596J5477602R228466
10593B32861270J270861o536846j0936892q500782m43113R420616J9118869K6330923
10585B62584906K6995910K2077476J3769571L171204r248385k1150274k7334079
10578B70866329k4755914j5862973m993773M193133J0055567J1016230P602106
10571B58120705J644419n497148j3637151k1275607k4184814k1173369j4995116
$$ plain form
10564 159001919 150607431 147348381 147096396 147216473 146121113 142137475 135072334 125065309
10556 125065309 112298163 98404855 85790580 75563382 67538144 61107502 56037334
10549 56037334 52162275 48679254 45911201 43665785 41747699 39781237 37829897 36074598
10541 36074598 34741729 33579870 32165692 30869466 29767873 28711165 27495615 26404299
10533 26404299 25671371 24794791 24100291 23537401 22752414 21919888 21252379 20610785 19861142
10524 19861142 19343563 18808054 18153333 17587153 17076995 16632254 16197713 15921121 15529258
10515 15529258 14784126 14053302 13769762 13579093 13155892 12857946 12414816 11918375 11581652
10506 11581652 11205250 10954058 10678911 10343892 10138581 9712093 9514440 9238884 8758705
$$ packed form
10564A59001919q394488l259050k51985J20077j095360l983638p065141j0007025
10556A25065309j2767146j3893308j2614275j0227198q025238o430642n070168
10549E6037334l875059l483021k768053k245416j918086j966462j951340j755299
10541C6074598j332869j161859j414178j296226j101593j056708j215550j091316
10533B6404299p32928q76580o94500n62890p84987q32526o67509o41594p49643
10524A9861142n17579n35509o54721n66180n10158m44741m34541k76592l91863
10515A5529258p45132p30824k83540j90669m23201k97946m43130m96441l36723
10506A1581652l76402k51192k75147l35019k05311m26488j97653k75556m80179
$$ plain form
10497 8758705 8572532 8380802 8147044 7686692 7446219 7341863 7470425 7338101 7087620
10488 7087620 6927132 6678726 6341837 6208387 6121656 5974273 5836708 5448969 5142500 5221321
10478 5221321 5072161 4941218 4873254 4637842 4307509 4233128 4185643 4048473 3792741 3634922
10468 3634922 3566859 3346428 3113115 2856526 2896973 3005397 2861869 2856502 2803184 2839092
10458 2839092 2833741 2516412 2173442 2079111 2067670 2164155 2309907 2093413 2035450 2186534
10448 2186534 1934811 1619499 1477943 1352649 1592534 1440168 1156514 1351031 1553436
10439 1553436 1577646 1441456 1291462 1193778 1136627 1187810 1140381 1032935 1225764 1359961
10429 1359961 1093452 1022169 942198 770878 823656 858694 757185 845841 781363 684275 521043
$$ packed form
10497H758705j86173j91730k33758m60352k40473j04356J28562j32324k50481
10488G087620j60488k48406l36889j33450q6731j47383j37565l87739l06469P8821
10478E221321j49160j30943o7964k35412l30333p4381m7485j37170k55732j57819
10468C634922o8063k20431k33313k56589M0447J08424j43528n367n3318L5908
10458B839092n351l17329l42970r4331j1441R6485J45752k16494n7963J51084
10448B186534k51723l15312j41556j25294K39885j52366k83654J94517K02405
10439A553436K4210j36190j49994r7684n7151N1183m7429j07446J92829J34197
10429A359961k66509p1283p9971j71320N2778L5038j01509Q8656o4478r7088j63232
$$ plain form
10418 521043 394797 474350 677513 785380 690193 611586 507890 663084 811063 828340
10408 828340 621624 361178 301897 391854 682834 1028267 1039715 943215 870189 998070
10398 998070 1071116 881160 660590 561873 691734 661795 670338 708971 869923 1052815 840239
10387 840239 827008 968633 976664 998597 809130 971552 1093465 1048836 828573 745765 554145
10376 554145 549086 564940 635245 578201 618019 541878 552707 818880 960784 959992 719320
10365 719320 470685 466064 606087 676887 696634 644466 679961 596851 428573 313882 369810
10354 369810 298337 317839 348360 467813 516030 481033 332514 409429 485980 651764 693286
10343 693286 688591 419830 244900 304020 306541 314678 497922 660119 652703 425922 254723
$$ packed form
10418E21043j26246P9553K03163J07867r5187p8607j03696J55194J47979J7277
10408H28340k06716k60446n9281Q9957K90980L45433J1448r6500p3026J27881
10398I98070P3046j89956k20570r8717J29861k9939Q543L8633J60952J82892k12576
10387H40239j3231J41625Q031K1933j89467J62422J21913m4629k20263q2808j91620
10376E54145n059J5854P0305n7044L9818p6141J0829K66173J41904p92k40672
10365G19320k48635m621J40023P0800J9747n2168L5495q3110j68278j14691N5928
10354C69810p1473J9502L0521J19453M8217l4997j48519P6915P6551J65784M1522
10343F93286m695k68761j74930N9120K521Q137J83244J62197p416k26781j71199
$$ plain form
10332 254723 221680 226545 376890 619149 464995 261857 149844 422175 298271 357672
10322 357672 429403 402040 474008 561738 443401 568912 525860 333301 200337 264487 146340
10311 146340 371229 347580 309836 355174 191768 217892 284032 216048 466968 600591 432370
10300 432370 453274 412230 324033 286705 148725 161997 -127696 -324787 -215532 -222401 -34698
10289 -34698 300681 514385 260798 93508 191555 108978 -15658 203449 375627 228321
10279 228321 -69995 -237218 -167091 -226259 -402449 -117613 231507 291974 194910 205508
10269 205508 67802 -15076 22931 2358 163468 25101 -68208 54812 114729 204787 39080
10258 39080 -240468 -310968 -38464 176856 165959 302 109802 146246 -8650 -19645
$$ packed form
10332B54723l3043M865J50345K42259j54154k03138j12013K72331j23904N9401
10322C57672P1731k7363P1968Q7730j18337J25511m3052j92559j32964O4150j18147
10311A46340K24889k3649l7744M5338j63406K6124O6140o7984K50920J33623j68221
10300D32370K0904m1044q8197l7328j37980J3272k89693j97091J09255o869J87703
10289c4698L35379K13704k53587j67290R8047q2577j24636K19107J72178j47306
10279B28321k98316j67223P0127n9168j76190K84836L49120O0467r7064J0598
10269B05508j37706q2878L8007k0573J61110j38367r3309J23020N9917R0058j65707
10258C9080k79548p0500K72504K15320j0897j65657J09500L6444j54896j0995
$$ plain form
10248 -19645 -119786 -87871 233387 344767 -83356 -201996 -122231 -39742 99209 72920
10238 72920 223712 340100 293327 143261 231046 286019 207015 173360 201862 104467 52214
10227 52214 171288 -95717 -261767 -347117 -27826 82214 154345 343169 395047 340627
10217 340627 234479 143846 85473 37418 95572 85684 -88984 -198306 -452134 -317164 -107880
10206 -107880 -229542 -199375 -18200 96317 61793 107204 -8682 82031 316984 145611
10196 145611 -19534 42515 81540 42269 -45644 40642 130818 -132880 -233902 -239746 -153504
10185 -153504 9103 -108217 -228087 14909 -68832 -146761 -115287 -7730 269401 423502
10175 423502 535277 569338 581489 626199 647110 951990 1022220 860289 651653 368410
$$ packed form
10248a9645j00141L1915L21258J11380m28123j18640P9765Q2489J38951k6289
10238G2920J50792J16388m6773j50066Q7785N4973p9004l3655K8502r7395n2253
10227E2214J19074k67005j66050q5350L19291J10040P2131J88824N1878n4420
10217C40627j06148r0633n8373m8055N8154r888j74668j09322k53828J34970K09284
10206a07880j21662L0167J81175J14517l4524M5411j15886R0713K34953j71373
10196A45611j65145O2049L9025l9271q7913Q6286R0176k63698j01022n844Q6242
10185a53504J62607j17320j19870K42996q3741p7929L1474J07557K77131J54101
10175D23502J11775L4061J2151M4710K0911L04880P0230j61931k08636k83243
$$ plain form
10165 368410 267590 532536 743394 1003549 1320066 1354634 1338616 1275492 1398316 1150449
10155 1150449 796855 654915 931257 1191511 1389034 1435576 1617674 1636134 1563929 1603743
10145 1603743 1861228 1706710 1460150 1368041 1169289 1103229 1062138 1281835 1122597 1200625
10135 1200625 1558124 1799353 1663572 1563232 1411237 1165862 1066940 910131 1062394 1038313
10125 1038313 879842 1000248 926233 728456 901410 747249 558558 418503 361792 727768
10115 727768 766643 602180 600177 675346 754664 581559 203541 90641 268806 193558 122654
10104 122654 197528 72814 -28666 -26091 52431 162700 35736 309987 396361 59463
10094 59463 -204420 -321627 -350268 -369546 -258438 -139075 -115338 -261174 -353622 -97097
$$ packed form
10165C68410j00820K64946K10858K60155L16517L4568j6018o3124J22824k47867
10155A150449l53594j41940K76342K60254J97523M6542J82098J8460p2205L9814
10145A603743K57485j54518k46560r2109j98752o6060m1091K19697j59238P8028
10135A200625L57499K41229j35781j00340j51995k45375r8922j56809J52263k4081
10125A038313j58471J20406p4015j97777J72954j54161j88691j40055n6711L65976
10115G27768L8875j64463k003P5169P9318j73105l78018j12900J78165p5248p0904
10104A22654P4874j24714j01480K575P8522J10269j26964K74251Q6374l36898
10094E9463k63883j17207k8641j9278J11108J19363K3737j45836r2448K56525
$$ plain form
10084 -97097 83426 31742 -30642 33704 -18376 34523 172799 126578 212349 -3913 -358866
10073 -358866 -175056 15960 -42219 -128821 -154223 47649 -37599 -119566 95019 327230
10063 327230 319400 46936 12258 159208 -62726 -268613 -147934 -100631 178479 259854
10053 259854 510701 334160 96453 18109 178192 249204 146836 219152 32229 -75571
10043 -75571 60255 32557 -115589 -148843 -264792 -540575 -539117 -535831 -346650 83289 167652
10032 167652 160469 140907 -13846 -165957 -246262 -334560 -277205 -161517 -265211 -122476 33949
10021 33949 49298 83792 81524 38927 -14133 -45253 83493 107968 147369 240424 260234 143572
10009 143572 36721 -102306 -10895 93525 304709 440037 248558 -172003 -237354 -219655
$$ packed form
10084i7097J80523n1684o2384O4346n2080N2899J38276m6221Q5771k16262l54953
10073c58866J83810J91016n8179q6602k5402K01872q5248q1967K14585K32211
10063C27230p830k72464l4678J46950k21934k05887J20679M7303K79110Q1375
10053B59854K50847j76541k37707p8344J60083P1012j02368P2316j86923j07800
10043g5571J35826k7698j48146l3254j15949k75783J458L286J89181M29939Q4363
10032A67652p183j9562j54753j52111q0305q8298N7355J15688j03694J42735J56425
10021C3949J5349L4494k268m2597n3060l1120J28746K4475L9401R3055J9810j16662
10009A43572j06851j39027R1411J04420K11184J35328j91479m20561o5351J7699
$$ plain form
9999 -219655 -115189 104377 377736 364973 392920 111225 34753 16379 81219 -226744 -204805
9988 -204805 -211675 -30219 -3583 -199976 -128742 -15847 48635 68387 -85716 -90364 -402846
9977 -402846 -410139 -136176 -4228 -207301 -209441 -93068 -78114 -163870 -148244 -254018 -344935
9966 -344935 -248029 -39408 73442 -189626 -338763 -193753 -94135 -280781 -267016 -170336
9956 -170336 -73147 -107270 11291 -64913 -116982 -78667 -120114 -403412 -540200 -305835 117740
9945 117740 354392 170456 -2912 53040 -20528 -137225 -296175 16052 -31204 -211086
9935 -211086 146109 295843 371279 442150 466383 477039 812663 1114495 1490290 2385214
9925 2385214 3996398 6391551 8977563 10208163 11210837 11830457 11872715 9787432 6525144
$$ packed form
9999b19655J04466K19566K73359j2763K7947k81695p6472j8374O4840l07963K1939
9988b04805o870J81456K6636j96393P1234J12895O4482J9752j54103m648l12482
9977d02846p293K73963J31948k03073k140J16373J4954q5756J5626j05774r0917
9966c44935R6906K08621J12850k63068j49137J45010R9618j86646J3765R6680
9956a70336R7189l4123J18561p6204n2069L8315m1447k83298j36788K34365M23575
9945A17740K36652j83936j73368N5952p3568j16697j58950L12227m7256j79882
9935b11086L57195J49734P5436P0871K4233J0656L35624L01832L75795Q94924
9925B385214J611184K395153K586012J230600J002674O19620M2258k085283l262288
$$ plain form
9916 6525144 4057316 2876442 2202851 1967729 1813511 1496702 1222063 1001494 877410
9907 877410 823741 698268 591352 517273 538144 216972 109546 224155 261180 333210 566309
9896 566309 577014 515464 425089 400218 519197 388639 230855 65770 4631 114027 29212
9885 29212 -386986 -415760 -224075 -272552 -210637 -10740 -177204 -206025 54002 166800 83437
9874 83437 -143487 -164321 -99373 178483 337976 318149 249970 180882 -91758 -284593 -400487
9863 -400487 -481309 -399970 -68387 195831 104925 163906 321182 -3413 -157894 -138868 -327973
9852 -327973 -335359 -229731 -336047 -374607 -451279 -435680 -364070 -182270 69742 60161 242321
9841 242321 196500 24520 28009 44116 106375 -163874 -99228 -83642 -233781 -56042 96385
$$ packed form
9916F525144k467828j180874o73591k35122j54218l16809k74639k20569j24084
9907H77410n3669j25473j06916p4079K0871l21172j07426J14609L7025P2030K33099
9896E66309J0705o1550r0375k4871J18979j30558j57784j65085o1139J09396q4815
9885B9212m16198k8774J91685m8477O1915J99897j66464k8821K60027J12798q3363
9874H3437k26924k0834O4948K77856J59493j9827o8179o9088k72640j92835j15894
9863d00487q0822Q1339L31583K64218r0906N8981J57276l24595j54481J9026j89105
9852c27973p386J05628j06316l8560p6672J5599P1610J81800K52012r581J82160
9841B42321m5821j71980L489J6107O2259k70249O4646J5586j50139J77739J52427
$$ plain form
9830 96385 113826 -26404 -328157 -320556 -252706 -238190 -94720 -242131 -359316 -218361 -61638
9819 -61638 -207641 -136528 -30733 323513 373456 65996 25616 -8435 184225 356543 329020
9808 329020 168305 -80741 -246727 -194596 21755 50742 -47313 -206488 -372662 -445433
9798 -445433 -286772 -77481 -297367 -502511 -482375 -563220 -429045 121133 267765 -37334
9788 -37334 -262499 -98120 198695 221498 87063 -162203 -235103 -207906 -66152 -77363 -6242
9777 -6242 -101271 -139281 -187350 -232338 -195395 -87062 370422 333545 47627 5952 30909
9766 30909 234118 250575 305267 -41310 -316295 -69315 209900 152206 113385 253659 339321
9755 339321 320276 175838 32893 3876 -117016 58040 132257 133186 184309 -71719 -150055
$$ packed form
9830I6385J7441j40230l01753P601O7850J4516J43470j47411j17185J40955J56723
9819f1638j46003P1113J05795L54246M9943l07460m0380l4051J92660J72318k7523
9808C29020j60715k49046j65986N2131K16351K8987r8055j59175j66174p2771
9798d45433J58661K09291k19886k05144K0136q0845J34175N50178J46632l05099
9788c7334k25165J64379K96815K2803j34435k49266p2900K7197J41754j1211P1121
9777f242r5029l8010m8069m4988L6943J08333M57484l6877k85918m1675K4957
9766C0909K03209J6457N4692l46577k74985K46980K79215n7694l8821J40274Q5662
9755C39321j9045j44438j42945k9017j20892J75056P4217R29N1123k56028p8336
$$ plain form
9744 -150055 -283497 -60821 99128 221094 53531 52424 77664 120944 129876 319034 446986
9733 446986 60509 -379123 -478073 -490622 -197503 101229 342809 548769 391989 178534
9723 178534 327763 94510 143460 265918 191496 308318 450199 265231 139107 25235
9713 25235 -9789 -40143 -190324 55402 352392 297747 382436 390150 244134 34586 -325536
9702 -325536 -268489 -100788 -154213 -103505 332368 183698 142646 246529 229319 107488 -14459
9691 -14459 -274443 -51048 129367 226320 335414 184254 129913 246544 284366 346449 411736
9680 411736 603242 648382 554640 392809 165958 47472 -177893 -218677 -427536 -656984
9670 -656984 -580178 -280141 -38829 -6200 7878 -176143 -205181 -204113 -372297 -158939 -107655
$$ packed form
9744a50055j33442K22676J59949J21966j67563j107K5240M3280Q932J89158J27952
9733D46986l86477m39632r8950j2549K93119K98732K41580K05960j56780k13455
9723A78534J49229k33253M8950J22458p4422J16822J41881j84968j26124j13872
9713B5235l5024l0354j50181K45726K96990n4645Q4689P714j46016k09548l60122
9702c25536N7047J67701n3425N0708M35873j48670m1052J03883j7210j21831j21947
9691a4459k59984K23395J80415R6953J09094j51160n4341J16631L7822O2083O5287
9680D11736J91506M5140r3742j61831k26851j18486k25365m0784k08859k29448
9670f56984P6806L00037K41312L2629J4078j84021k9038J068j68184K13358N1284
$$ plain form
9659 -107655 -76775 290759 379930 314187 438159 599158 258231 90724 65179 427855
9649 427855 628859 721384 698140 248548 359670 589987 701131 499984 397656 369874
9639 369874 124644 -9232 17859 -22954 132084 173584 190530 191214 -19918 -37081 165136
9628 165136 152724 24088 -142146 -19497 -43564 -30713 113786 40173 69254 111687 283024
9617 283024 83542 199828 148604 168177 287362 260407 190984 15680 120184 51375 145123
9606 145123 203408 118986 48263 -16111 -204304 -312335 -152701 -60472 -212990 -217291 -347120
9595 -347120 -502295 -454212 -237334 -12104 -141303 -182771 -178892 -26646 352257 223758
9585 223758 6024 30075 -4755 158442 354100 382293 112692 75417 35833 -64897 82880
$$ packed form
9659a07655L0880L67534Q9171o5743J23972J60999l40927j67507k5545L62676
9649D27855K01004R2525k3244m49592J11122K30317J11144k01147j02328k7782
9639C69874k45230j33876K7091m0813J55038M1500J6946O84k11132j7163K02217
9628A65136j2412j28636j66234J22649k4067J2851J44499p3613K9081M2433J71337
9617B83024j99482J16286n1224J9573J19185k6955o9423j75304J04504o8809R3748
9606A45123N8285q4422p0723o4374j88193j08031J59634R2229j52518m301j29829
9595c47120j55175M8083K16878K25230j29199m1468L879J52246L78903j28499
9585B23758k17734K4051l4830J63197J95658K8193k69601l7275l9584j00730J47777
$$ plain form
9574 82880 77301 -49894 -69080 107527 -25671 -206247 -163707 -8097 64193 -58507 -233377
9563 -233377 -327159 -181237 78810 157423 286199 225666 100365 -7306 -148318 -454290
9553 -454290 -583657 -445915 -240535 -274508 -303104 -131366 106622 -24523 -71504 137600
9543 137600 179619 135262 222451 411231 160832 38022 70935 9380 -388040 -405446 -330150
9532 -330150 -160456 278381 562820 308890 161361 -125806 -293377 -287702 -245573 -94381
9522 -94381 124071 45434 11157 189313 418246 493216 268175 284588 56482 191516 288249
9511 288249 41281 -308933 -76569 -71136 -105317 -18181 82908 -128857 -85346 -32832 203033
9500 203033 19894 -92222 -118949 -160344 -342509 -404339 -427918 -654570 -444923 -157001
$$ packed form
9574H2880n579j27195j9186J76607j33198j80576M2540J55610P2290j22700j74870
9563b33377r3782J45922K60047P8613J28776o0533j25301j07671j41012l05972
9553d54290j29367J37742K05380l3973k8596J71738K37988j31145m6981K09104
9543A37600M2019m4357Q7189J88780k50399j22810L2913o1555l97420j7406P5296
9532c30150J69694M38837K84439k53930j47529k87167j67571N675M2129J51192
9522i4381K18452p8637l4277J78156K28933P4970k25041J6413k28106J35034R6733
9511B88249k46968l50214K32364N433l4181Q7136J01089k11765M3511N2514K35865
9500B03033j83139j12116k6727m1395j82165o1830k3579k26652K09647K87922
$$ plain form
9490 -157001 -173203 -66714 -9575 -188448 -418177 -313069 -123763 -67996 957 47321 -52602
9479 -52602 -93902 -214387 -152679 18902 -54067 -93307 -134022 -94896 31273 -69878 -85897
9468 -85897 198599 507097 389313 172554 117783 -36714 -107644 -31413 -130093 -385738 -638253
9457 -638253 -508684 -330282 31987 259173 149611 -65096 -113711 -149702 -83106 -134000
9447 -134000 9359 -149629 -536782 -561090 -331449 -138999 57913 118741 120279 200025 154985
9436 154985 64504 244561 337010 82506 38627 -30669 -161326 -144734 95604 91030 -39761
9425 -39761 -134852 -210449 -79850 -57171 -223614 -180267 -48152 -141653 -132346 26611 160704
9414 160704 122671 2790 27561 29429 -200917 -421865 -470285 -329138 -92713 22056 139453
$$ packed form
9490a57001j6202J06489N7139j78873k29729J05108J89306N5767O8953M6364r9923
9479e2602m1300j20485O1708J71581p2969l9240m0715L9126J26169j01151j6019
9468h5897K84496L08498j17784k16759n4771j54497p0930P6231r8680k55645k52515
9457f38253J29569J78402L62269K27186j09562k14707m8615l5991O6596n0894
9447a34000J43359j58988l87153k4308K29641J92450J96912O0828J538P9746m5040
9436A54985r0481J80057R2449k54504m3879o9296j30657J6592K40338m574j30791
9425c9761r5091p5597J30599K2679j66443M3347J32115r3501R307J58957J34093
9414A60704l8033j19881K4771J868k30346k20948m8420J41147K36425J14769J17397
$$ plain form
9403 139453 -64372 -88534 -71636 -261716 -290769 -141601 194133 239862 -25771 182108
9393 182108 166845 10139 -14068 -101055 -14502 -131635 -375202 -425306 -399433 -301282 -166389
9382 -166389 5115 -40378 -121083 -220311 -189657 85069 267760 249769 125961 35824 -76912
9371 -76912 -44977 270378 268762 52220 25796 167720 78586 341786 504883 190920 237945
9360 237945 134570 -126284 -345811 -135347 -29543 -13805 99223 -205907 -294317 -586099
9350 -586099 -593478 -376949 -209172 -127013 -141761 -264871 -482115 -469925 -446796 -333831 -121804
9339 -121804 8479 -16228 -180039 -383056 -403250 -365164 -506169 -427501 -433193 -444633 -256936
9328 -256936 -196721 -49624 -171961 -274054 -241278 30354 72532 -294075 -396363 -450043
$$ packed form
9403A39453k03825k4162J6898j90080k9053J49168L35734M5729k65633K07879
9393A82108j5263j56706k4207q6987Q6553j17133k43567n0104K5873R8151J34893
9382a66389J71504m5493q0705r9228L0654K74726J82691j7991j23808r0137j12736
9371g6912L1935L15355j616k16542k6424J41924q9134K63200J63097l13963M7025
9360B37945j03375k60854k19527K10464J05804J5738J13028l05130q8410k91782
9350e86099p379K16529J67777Q2159j4748j23110k17244J2190K3129J12965K12027
9339a21804J30283k4707j63811k03017k0194L8086j41005P8668n692j1440J87697
9328b56936O0215J47097j22337j02093L2776K71632M2178l66607j02288n3680
$$ plain form
9318 -450043 -531819 -347519 -216144 -172370 -185725 -220473 -379740 -270199 -238725 -176334 -310113
9307 -310113 -514449 -312776 -778 142799 24154 33931 -35836 -62255 18436 186910 240654
9296 240654 -207203 -177907 -122149 -107316 -198214 -245022 -264939 -59370 20960 -184427 -116585
9285 -116585 -62088 -2461 -8047 -215904 -215940 119100 195586 16195 -132645 -149827 -63865 -45892
9273 -45892 -38541 -60708 -11166 181239 -23779 -86630 -227130 -259439 -233303 -301161 -284885
9262 -284885 -229095 -177907 -60020 -26674 -31023 -87272 -104904 -31089 -104818 50672 50032 -253128
9250 -253128 -317371 -221855 -185431 -81661 -44941 -107677 133598 299872 285114 259689 347214
9239 347214 636672 362907 203544 22747 91174 122176 48825 158150 315045 268312
$$ packed form
9318d50043q1776J84300J31375M3774j3355l4748j59267J09541L1474O2391j33779
9307c10113k04336K01673L11998J43577j18645R777o9767k6419Q0691J68474N3744
9296B40654m47857K9296N5758J4833r0898m6808j9917K05569Q0330k05387O7842
9285a16585N4497N9627n586k07857l6L35040P6486j79391j48840j7182Q5962J7973
9273d5892P351k2167M9542J92405k05018o2851j40500l2309K6136o7858J6276
9262b84885N5790N1188J17887L3346m349n6249j7632P3815p3729J55490o40l03160
9250b53128o4243R5516L6424J03770L6720o2736K41275J66274j4758k5425Q7525
9239C47214K89458k73765j59363j80797O8427L1002p3351J09325J56895m6733
$$ plain form
9229 268312 83496 -91696 187678 339629 241299 207375 137112 210968 -13021 -280290
9219 -280290 -220907 -214217 -109921 -117490 -380765 -590783 -539164 -309528 -220038 -268493 -265677
9208 -265677 -171990 -332833 -515676 -365144 -393920 -323960 -189600 89988 142330 73638 -67377
9197 -67377 -200715 -179329 21662 39988 -90184 -90637 -123636 -352674 -537154 -539889 -347152
9186 -347152 -357851 -416860 -345425 -181858 -124395 8231 54543 -125913 27035 85317 253788
9175 253788 168330 -5950 -282874 -361825 -110847 -97243 -108626 -56195 -45397 26916 73367
9164 73367 133895 226038 76729 179591 622168 723099 608313 612062 264617 -44944 -155752
9153 -155752 -164590 -107428 -167525 640 19035 -55462 58094 212229 316348 334074 234416
$$ packed form
9229B68312j84816j75192K79374J51951r8330l3924p0263P3856k23989k67269
9219b80290N9383O690J04296p569k63275k10018N1619K29636Q9490m8455K816
9208b65677R3687j60843j82843J50532k8776O9960J34360K79588N2342o8692j41015
9197f7377j33338K1386K00991J8326j30172m53l2999k29038j84480k735J92737
9186c47152j0699n9009P1435J63567N7463J32626M6312j80456J52948N8282J68471
9175B53788q5458j74280k76924p8951K50978J3604j1383N2431J0798P2313M6451
9164G3367O0528R2143j49309J02862M42577J00931j14786L749l47445l09561j10808
9153a55752q838N7162o0097J68165J8395p4497J13556J54135J04119J7726r9658
$$ plain form
9142 234416 233597 428400 293844 -42268 -238153 -366242 -541136 -529835 -274044 -118029
9132 -118029 101911 237592 7874 -161714 -96948 11746 -23803 -11205 181636 270190
9122 270190 297692 -140902 -337607 -377023 -181807 -193860 -258036 -12131 191489 189518 109470
9111 109470 14039 -56559 -57745 113796 276535 199394 63984 12990 -29642 -346227 -345937
9100 -345937 -398153 -313232 -136962 117645 56772 -158377 -242568 -161177 -38119 -31763 -228049
9089 -228049 -167399 253850 322863 446080 316676 221233 145969 40342 -74585 -148106 38702
9078 38702 146112 48361 201768 31534 43294 -74623 -224827 -324550 -268720 -215329 -536444
9067 -536444 -418402 -260386 -156264 -99360 -182439 -387773 -428622 -428570 -501670 -445883 -283292
$$ packed form
9142B34416q19J94803j34556l36112j95885j28089j74894J1301K55791J56015
9132a18029K19940J35681k29718j69588O4766J08694l5549J2598J92841Q8554
9122B70190K7502m38594j96705l9416J95216j2053o4176K45905K03620j971q0048
9111A09470r5431p0598j186J71541J62739p7141j35410n0994m2632l16585K90
9100c45937n2216Q4921J76270K54607o0873k15149q4191Q1391J23058O356j96286
9089b28049O0650M21249O9013J23217j29404r5443p5264j05627j14927p3521J86808
9078C8702J07410r7751J53407j70234J1760j17917j50204r9723N5830N3391l21115
9067e36444J18042J58016J04122N6904q3079k05334m0849N2p3100N5787J62591
$$ plain form
9056 -283292 -294092 73021 103893 97070 278274 447527 229909 11153 22948 -161243 -36769
9045 -36769 63326 279399 111661 -90870 -59097 187226 194744 205986 72655 -140225 -69821
9034 -69821 -150604 -435188 -403856 -319693 -94612 127675 24440 -23589 11808 -206073 -187374
9023 -187374 -65880 75280 -2117 -296277 -323394 -173568 -149409 -302675 -284882 -356079 -302956
9012 -302956 -433810 -425668 -119209 69321 3319 -127299 -239263 -275943 -71738 -22567 102553
9001 102553 34326 168679 -8529 -112708 -47419 -12051 -265235 -130996 -38053 -154796
8991 -154796 20745 -30006 94215 299034 354979 275875 -115326 -126513 -1576 85312 135254
8980 135254 242605 242301 185771 207123 426392 367262 414719 318887 265806 179610 3367
$$ packed form
9056b83292j0800L67113L0872o823J81204J69253k17618k18756J1795j84191J24474
9045c6769J00095K16073j67738k02531L1773K46323P518J1242j33331k12880P0404
9034f9821q0783k84584L1332Q4163K25081K22287j03235m8029L5397k17881J8699
9023a87374J21494J41160p7397k94160k7117J49826K4159j53266J7793p1197N3123
9012c02956j30854Q142L06459J88530o6002j30618j11964l6680K04205M9171J25120
9001A02553o8227J34353j77208j04179O5289L5368k53184J34239R2943j16743
8991a54796J75541n0751J24221K04819N5945p9104l91201j1187J24937Q6888M9942
8980A35254J07351l04n6530K1352K19269n9130M7457r5832n3081q6196j76243
$$ plain form
8969 3367 -1710 -41229 -120761 -246040 -144558 -327600 -391115 -408708 -349268 23857 472730
8958 472730 340366 79594 87764 -2584 20314 274277 323995 114374 37760 182812 42431
8947 42431 92019 129008 123748 148016 241581 189179 222631 152935 129311 90146 -79770 -130549
8935 -130549 7663 8224 -25109 118288 7914 -275100 -440061 -484919 -387744 -259513 -315164
8924 -315164 -63084 -92136 -170979 -361326 -707677 -538416 -393307 -372387 -399947 -414106 -338105
8913 -338105 -234656 -61882 33464 -93512 -78603 65859 87967 50307 71070 -213938 -336226
8902 -336226 -248644 -154452 -265927 -53828 66178 -181178 -68780 151842 273736 245705
8892 245705 130454 39749 67475 285808 251030 -4889 -74370 91418 -103333 -172043 77163
$$ packed form
8969C367n077l9519p9532j25279J01482j83042o3515j7593N9440L73125M48873
8958D72730j32364k60772Q170r0348K2898K53963M9718k09621p6614J45052j40381
8947D2431M9588L6989n260K4268R3565n2402L3452o9696k3624l9165j69916n0779
8935a30549J38212N61l3333J43397j10374k83014j64961m4858R7175J28231n5651
8924c15164K52080k9052p8843j90347l46351J69261J45109K0920k7560j4159P6001
8913c38105J03449J72774R5346j26976J4909J44462K2108l7660K0763k85008j22288
8902c36226Q7582R4192j11475K12099J20006k47356J12398K20622J21894k8031
8892B45705j15251r0705K7726K18333l4778k55919o9481J65788j94751o8710K49206
$$ plain form
8881 77163 -68732 -308200 -309430 -198017 23210 315031 487630 336397 137207 182650
8871 182650 336688 419081 141304 40432 77958 93812 112464 132203 62435 -78632 -98563
8860 -98563 -54310 45427 150970 110778 198310 251953 238722 318873 162936 238303 303030
8849 303030 71532 -9636 -99880 71964 1908 -9826 100808 -124406 -210183 -225736 -160337
8838 -160337 -3785 26861 -31040 15249 -17804 -32718 -112832 -188312 -480861 -388105 -55708
8827 -55708 68283 -128581 -152208 216879 133603 125135 117598 82392 -198105 -314842 -166647
8816 -166647 26425 197297 200371 196218 255671 418297 643386 214445 -46209 -150265 -257761
8805 -257761 -317771 -130156 37862 74088 -155819 -148874 -156625 -324125 -173793 -47525 -57737
$$ packed form
8881G7163j45895k39468j230J11413K21227K91821J72599j51233j99190M5443
8871A82650J54038Q2393k77777j00872L7526J5854J8652J9739o9768j41067j9931
8860i8563M4253R9737J05543m0192Q7532N3643j3231Q0151j55937P5367O4727
8849C03030k31498q1168r0244J71844p0056j1734J10634k25214q5777j5553O5399
8838a60337J56552L0646n7901M6289l3053j4914q0114p5480k92549R2756L32397
8827e5708J23991j96864k3627L69087q3276q468p537l5206k80497j16737J48195
8816a66647J93072J70872L074m153N9453J62626K25089m28941k60654j04056j07496
8805b57761o0010J87615J68018L6226k29907O945p751j67500J50332J26268j0212
$$ plain form
8794 -57737 -82486 70517 77920 -29791 92743 129402 94672 185940 384883 259961 329983
8783 329983 241538 87995 22038 -20350 -244374 -449801 -375640 -459091 -515087 -339744 -126518
8772 -126518 -290659 -519473 -431081 -180311 399 155029 -6359 81326 95579 -29540
8762 -29540 -38417 -30241 135922 -109311 -321454 -290538 -235902 40191 233063 337281 222731
8751 222731 -3748 -25080 -45037 -22978 -19308 -205988 -154148 -38182 262538 211281 150265
8740 150265 32122 225944 200315 13540 -43196 113556 121845 49981 254189 355521 282589
8729 282589 206466 267370 426181 331380 204184 27986 -80987 -227330 -240225 -205512 -164585
8718 -164585 -92598 -17579 -347013 -364631 -233862 27156 249270 171456 -60018 -127814 -268104
$$ packed form
8794e7737k4749J53003P403j07711J22534L6659l4730R1268J98943j24922P0022
8783C29983q8445j53543o5957m2388k24024k05427P4161q3451n5996J75343K13226
8772a26518j64141k28814Q8392K50770J80710J54630j61388Q7685J4253j25119
8762b9540q877Q176J66163k45233k12143L0916N4636K76093J92872J04218j14550
8751B22731k26479k1332j9957K2059L670j86680N1840J15966L00720n1257o1016
8740A50265j18143J93822k5629j86775n6736J56752Q289p1864K04208J01332p2932
8729B82589p6123O0904J58811r4801j27196j76198j08973j46343j2895L4713M0927
8718a64585P1987P5019l29434j7618J30769K61018K22114p7814k31474o7796j40290
$$ plain form
8707 -268104 -311951 -155472 199402 247872 113645 43828 -179818 -404033 -277877 70011
8697 70011 279855 421818 440630 255670 64184 -281577 -262154 -249081 -471392 -690331
8687 -690331 -470492 -196441 107182 274445 -11883 -40185 -63644 -167528 -42142 -30265
8677 -30265 -246215 -316837 -212023 -157739 -60647 167913 349636 405909 175592 -156780 -131836
8666 -131836 144385 107976 297493 366297 346776 218507 198121 258059 144970 345692 431166
8655 431166 150816 23826 13820 203678 90041 108322 146394 217099 302502 171253 -52995
8644 -52995 -148668 -124704 -224435 -185556 -107125 157072 166293 380023 92838 -6343 -57876
8633 -57876 -161085 -253326 -230491 -30781 148388 211591 2042 -125238 -57449 -187154 -460236
$$ packed form
8707b68104m3847J56479L54874M8470j34227o9817k23646k24215J26156L47888
8697G0011K09844J41963J8812j84960j91486l45761J9423J3073k22311k18939
8687f90331K19839K74051L03623J67263k86328k8302k3459j03884J25386J1877
8677c0265k15950p0622J04814N4284R7092K28560J81723N6273k30317l32372K4944
8666a31836K76221l6409J89517O8804j9521j28269k0386N9938j13089K00722Q5474
8655D31166k80350j26990j0006J89858j13637J8281L8072P0705Q5403j31249k24248
8644e2995r5673K3964r9731L8879P8431K64197R221K13730k87185r9181n1533
8633e7876j03209r2241K2835J99710J79169O3203k09549j27280O7789j29705k73082
$$ plain form
8622 -460236 -257493 -241001 -139349 8601 53635 -157038 -152001 -105469 -181352 -245096 43261
8611 43261 -2382 -37841 93287 117429 49930 112661 200037 248721 61517 139884 -31877
8600 -31877 22115 182942 176231 116901 117934 -99575 -171367 167980 354837 329732 49158
8589 49158 -115262 -307399 -410364 -348354 -228370 -90327 154317 122103 123746 -67163 -92300
8578 -92300 -307332 -465079 -514387 -176305 -88944 -209285 -292787 -184504 40771 411799
8568 411799 400431 280653 137524 37044 -68396 -159109 -32484 237109 -94254 -101637
8558 -101637 46637 163677 72756 -16126 54083 278234 366149 124871 -117398 -223886
8548 -223886 -103039 -93791 -136184 -139918 21613 53195 187986 22816 -35944 46087 41221
$$ packed form
8622d60236K02743J6492J01652J47950M5034k10673N037M6532p5883o3744K88357
8611D3261m5643l5459J31128K4142o7499O2731Q7376M8684j87204P8367j71761
8600c1877N3992J60827o711n9330J033k17509p1792L39347J86857k5105k80574
8589D9158j64420j92137j02965O2010J19984J38043K44644l2214J643j90909k5137
8578i2300k15032j57747m9308L38082Q7361j20341q3502J08283K25275L71028
8568D11799j1368j19778j43129j00480j05440r0713J26625K69593l31363p383
8558a01637J48274J17040r0921q8882P0209K24151Q7915k41278k42269j06488
8548b23886J20847R248m2393l734J61531L1582J34791j65170n8760Q2031m866
$$ plain form
8537 41221 88671 76546 180370 288961 233209 187105 304424 541577 484898 232566 -8905
8526 -8905 -104435 28524 -252418 -371184 -248450 -110798 86604 95662 99943 -35858 -115267
8515 -115267 -239321 -464480 -190866 -105377 46974 135475 86380 61070 -5380 109324 58661
8504 58661 122439 332117 354678 315890 178558 -35614 -159320 -278676 -487836 -571802 -381226
8493 -381226 -258041 -391871 -373836 -210339 -150429 -5333 -63653 -74739 -49736 -27979 -33850
8482 -33850 152303 230038 139757 319849 293752 106915 135857 232970 251247 87674 -71170
8471 -71170 -105107 -46019 -76409 -211655 -356070 -266512 -183709 -387445 -351967 95657 46213
8460 46213 -188665 -131472 281583 297444 190713 147004 15367 -34141 -105779 -90785 20072
$$ packed form
8537D1221M7450j2125J03824J08591n5752m6104J17319K37153n6679k52332k41471
8526h905r5530J32959k80942j18766J22734J37652J97402R058M281j35801p9409
8515a15267j24054k25159K73614Q5489J52351Q8501m9095k5310o6450J14704n0663
8504E8661O3778K09678K2561l8788j37332k14172j23706j19356k09160q3966J90576
8493c81226J23185j33830J8035J63497N9910J45096n8320j1086K5003K1757n871
8482c3850J86153P7735r0281J80092k6097j86837K8942R7113J8277j63573j58844
8471g1170l3937N9088l0390j35246j44415Q9558Q2803k03736L5478M47624m9444
8460D6213k34878N7193M13055J5861j06731m3709j31637m9508p1638J4994J10857
$$ plain form
8449 20072 -43936 83444 29376 -3585 -106330 -406788 -456403 -358568 -53804 11280 202917
8438 202917 437659 581495 613856 424783 264434 261814 102656 156391 248717 246206 147915
8427 147915 392070 442874 326683 487456 350306 383782 302123 348565 256931 147680 159358
8416 159358 269358 97207 -6627 -220535 -186345 -3933 77815 -13014 -181989 -167314
8406 -167314 -44830 3868 -79967 -188715 -42630 27418 6225 79013 372550 296293 185362
8395 185362 201815 452016 291019 98164 -2137 -12011 -41612 -64157 -53861 -300690 -492919
8384 -492919 -575732 -642073 -423547 -310891 -386780 -412012 -501945 -681475 -523712 -271631 -421043
8373 -421043 -650892 -517420 -203685 -66530 146866 277219 174639 81260 165108 352157
$$ packed form
8449B0072o4008J27380n4068l2961j02745l00458m9615R7835L04764O5084J91637
8438B02917K34742J43836L2361j89073j60349k620j59158N3735R2326k511r8291
8427A47915K44155N0804j16191J60773j37150L3476q1659M6442r1634j09251J1678
8416A59358J10000j72151j03834k13908L4190J82412Q1748r0829j68975J4675
8406a67314J22484M8698q3835j08748J46085P0048k1193P2788K93537p6257j10931
8395A85362J6453K50201j60997j92855j00301r874k9601k2545J0296k46829j92229
8384d92919q2813o6341K18526J12656p5889k5232q9933j79530J57763K52081j49412
8373d21043k29849J33472L13735J37155K13396J30353j02580r3379Q3848J87049
$$ plain form
8363 352157 114170 187071 81965 -158429 -459567 -335534 -136332 -224233 -143591 60567
8353 60567 195217 384040 156825 205399 -62283 -158875 -93387 65421 -82311 -388402
8343 -388402 -347319 -465525 -542741 -297177 -6698 -38933 -36765 -17174 13203 118716 42068
8332 42068 -262305 -116814 186676 342261 186789 -8509 -384454 -491986 -610499 -570674
8322 -570674 -284499 -190991 -267319 -75636 120671 129037 -1774 -178765 -184392 -90964 -73046
8311 -73046 -104073 -79588 -65353 -222178 -217717 -54722 184713 158814 10058 85792 268159
8300 268159 304939 -130847 -493901 -440292 -491082 -333615 -52999 -55825 -79957 15613 135907
8289 135907 237308 9409 -282981 -480766 -238279 -109531 100235 300735 183588 43327
$$ packed form
8363C52157k37987P2901j05106k40394l01138J24033J99202q7901Q0642K04158
8353F0567J34650J88823k27215M8574k67682r6592O5488J58808j47732l06091
8343c88402M1083j18206p7216K45564K90479l2235K168J9591L0377J05513p6648
8332D2068l04373J45491L03490J55585j55472j95298l75945j07532j18513L9825
8322e70674K86175R3508p6328J91683J96307Q366j30811j76991n627R3428J7918
8311g3046l1027K4485J4235j56825M461J62995K39435k5899j48756P5734J82367
8300B68159L6780m35786l63054N3609n0790J57467K80616k826k4132R5570J20294
8289A35907J01401k27899k92390j97785K42487J28748K09766K00500j17147j40261
$$ plain form
8279 43327 26840 -160700 -229101 -177743 -72724 38497 76722 84226 -73376 -45447 -85786
8268 -85786 20809 142139 154010 194816 235313 81290 -26522 -221186 -203563 -122132 -187123
8257 -187123 -201601 -94544 -27096 -37106 -81503 -200742 -161652 -61972 203199 50006 104100
8246 104100 -38984 -126971 3172 225666 255282 296661 382232 454657 186679 147340 139538
8235 139538 56586 31873 -204252 -34234 6392 143516 321298 182024 2330 -205136
8225 -205136 -244415 -137122 -172125 -402102 -326863 -237563 -14909 208112 74221 22614 213322
8214 213322 238258 -18512 33624 51945 -87985 -226794 -97342 76327 17903 89182 -79384
8203 -79384 48263 64655 73331 279616 297817 368471 329661 -127372 -35305 251114 54530
$$ packed form
8279D3327j6487j87540o8401N1358J05019J11221L8225P504j57602K7929m0339
8268h5786J06595J21330J1871M0806M0497j54023j07812j94664J7623Q1431o4991
8257a87123j4478J07057O7448j0010m4397j19239L9090R9680K65171j53193N4094
8246A04100j43084q7987J30143K22494K9616M1379Q5571P2425k67978l9339p802
8235A39538q2952k4713k36125J70018M0626J37124J77782j39274j79694k07466
8225b05136l9279J07293l5003k29977P5239Q9300K22654K23021j33891n1607J90708
8214B13322K4936k56770N2136J8321j39930j38809J29452J73669n8424P1279j68566
8203g9384J27647J6392Q676K06285J8201P0654l8810m57033R2067K86419j96584
$$ plain form
8192 54530 -104528 -198044 -237039 -245477 -48896 10531 -130910 -111142 22740 -22978 116888
8181 116888 167845 -70944 -264683 -254936 -168898 -177838 -245045 -226590 -36527 318490 407523
8170 407523 95164 -292239 -188043 -89843 -79111 -189172 -315402 -27943 -119146 -314807
8160 -314807 -266732 187222 444015 345827 356700 235522 -63224 -16513 142717 182684 98121
8149 98121 130581 42297 91394 322885 258176 277161 448471 564042 328845 281577 442745
8138 442745 525241 270320 7991 57714 -39145 -159038 -111299 -6851 108159 122259 50968
8127 50968 188080 304750 161442 -53123 89489 463526 283088 19284 40510 -87760
8117 -87760 -89912 -59889 91534 -156772 -225716 -324457 -419446 -452207 -481106 -318853 -61567
$$ packed form
8192E4530j59058r3516l8995q438J96581N9427j41441J9768J33882m5718J39866
8181A16888N0957k38789j93739R747Q6038q940o7207J8455J90063L55017Q9033
8170D07523l12359l87403J04196R8200J0732j10061j26230K87459r1203j95661
8160c14807M8075M53954K56793r8188J0873j21178k98746M6711J59230L9967q4563
8149I8121L2460q8284M9097K31491o4709J8985J71310J15571k35197m7268J61168
8138D42745Q2496k54921k62329M9723r6859j19893M7739J04448J15010J4100p1291
8127E0968J37112J16670j43308k14565J42612L74037j80438k63804K1226j28270
8117h7760k152L0023J51423k48306o8944r8741r4989l2761k8899J62253K57286
$$ plain form
8106 -61567 84202 189365 353766 459759 417899 429607 220645 189019 468388 466706 143800
8095 143800 -4756 146789 175017 337793 71821 286624 342038 223285 206740 17016
8085 17016 -118834 -87385 174779 80010 -85671 -181831 -283675 -222991 -157226 -61643 243459
8074 243459 170972 126578 252062 179862 -71939 -215574 -152228 -310184 -307979 -213092 -205183
8063 -205183 -101902 24008 -150511 -187879 -60080 86585 76164 143617 -94829 -49911
8053 -49911 -177483 -108453 -70636 16230 194148 141729 -43282 -41499 -35549 -83845 182060
8042 182060 429915 453229 558959 579574 445365 171077 -232014 -51091 -174912 -293994
8032 -293994 -244081 41619 -242493 -447424 -247191 -144117 15360 218435 228460 247836
$$ packed form
8106f1567J45769J05163J64401J05993m1860J1708k08962l1626K79369j682l22906
8095A43800j48556J51545K8228J62776k65972K14803N5414j18753j6545j89724
8085A7016j35850L1449K62164r4769j65681r6160j01844O0684O5765R5583L05102
8074B43459p2487m4394J25484p2200k51801j43635O3346j57956K205R4887P909
8063b05183J03281J25910j74519l7368J27799J46665j0421O7453k38446M4918
8053d9911j27572O9030L7817Q6866J77918n2419j85011J783N950m8296K65905
8042A82060K47855K3314J05730K0615j34209k74288m03091J80923j23821j19082
8032b93994M9913K85700k84112k04931K00233J03074J59477K03075J0025J9376
$$ plain form
8022 247836 120443 -100394 -310077 -325815 -234018 -248800 -100647 -9249 35174 71557 59065
8011 59065 -53009 -208115 -82843 -186116 -291304 -505341 -724347 -632191 -450817 -399700
8001 -399700 -185359 -23186 -167662 -261804 -383943 -343733 -232307 -490992 -396325 -345543
7991 -345543 -410027 -734799 -930559 -620109 -143569 21372 -122187 -121106 -139587 -230455 -170667
7980 -170667 -408940 -354046 -136862 -96860 -26804 -20403 92088 3405 -2944 362540 239768
7969 239768 90112 59029 -41123 -68021 279384 380325 177771 89699 -76703 -156979
7959 -156979 -304950 -262386 -343392 -393086 -190500 146413 481188 595119 584001 341065
7949 341065 123296 66423 396258 424890 249865 212550 95209 98348 270450 169424 254740
$$ packed form
8022B47836j27393k20837k09683j5738R1797j4782J48153R1398M4423L6383j2492
8011E9065j12074j55106J25272j03273j05188k14037k19006R2156J81374N1117
8001c99700K14341J62173j44476r4142j22139M0210J11426k58685R4667N0782
7991c45543o4484l24772j95760L10450M76540J64941j43559J081j8481r0868N9788
7980a70667k38273N4894K17184M0002P0056O401J12491q8683o349L65484j22772
7969B39768j49656l1083j00152k6898L47405J00941k02554q8072j66402q0276
7959a56979j47971M2564q1006m9694K02586L36913L34775J13931j1118k42936
7949C41065k17769n6873L29835K8632j75025l7315j17341L139J72102j01026Q5316
$$ plain form
7938 254740 346570 403516 296643 172225 56227 -15284 17896 -219128 -546123 -474788 -154663
7927 -154663 -74755 -182231 2041 174493 -63463 -49500 9900 -183803 -81618 -93574
7917 -93574 53542 358835 318423 97424 -169705 -20369 47377 -41989 22419 33112 -22761
7906 -22761 26055 223931 -41860 -227411 -81441 443711 444491 254057 -95568 -142621 43533
7895 43533 150261 143743 118930 132173 -93597 -220884 -96022 -31049 -94038 -1137 139089
7884 139089 49302 -17819 -121081 -300195 -341848 -311219 -248088 -41584 125341 126483 158657
7873 158657 15907 -62708 164748 283039 -34516 -39527 201017 19918 -227360 -396046
7863 -396046 -84956 -233840 -237722 174891 158741 108176 163105 231509 534651 588684 355180
$$ packed form
7938B54740R1830N6946j06873j24418j15998p1511L3180k37024l26995P1335L20125
7927a54663P9908j07476J84272J72452k37956J3963N9400j93703J02185j1956
7917i3574J47116L05293m0412k20999k67129J49336O7746q9366O4408J0693n5873
7906b2761M8816J97876k65791j85551J45970N25152P80j90434l49625m7053J86154
7895D3533J06728o518k4813J3243k25770j27287J24862O4973o2989R2901J40226
7884A39089q9787o7121j03262j79114m1653L0629O3131K06504J66925J142L2174
7873A58657j42750p8615K27456J18291l17555n011K40544j81099k47278j68686
7863c96046L11090j48884l882M12613j6150n0565N4929O8404L03142N4033k33504
$$ plain form
7852 355180 72267 168745 186161 90228 69539 -79664 -180677 -65552 235222 -71407
7842 -71407 -507420 -616541 -269738 -301924 -382837 41144 298226 384383 173259 -29190
7832 -29190 -50880 57696 197342 12288 -341854 -248849 -16712 -17737 -61675 -61107 57017
7821 57017 -79785 -324223 -76723 -93974 -988 -6550 -82529 -180321 -157984 -41615 50454
7810 50454 -51295 -28422 96466 164986 197876 119191 -32668 113756 281157 144092 87703
7799 87703 147423 35105 -61120 -113127 -113606 138634 207461 211084 239069 -118030 -160408 40094
7787 40094 243701 293632 265961 332541 420250 289534 88899 -23741 -217190 -136136 -119218
7776 -119218 -116349 34971 126270 177341 132868 105225 224828 397439 289305 312854 261147
$$ packed form
7852C55180k82913R6478J7416r5933k0689j49203j01013J15125L00774l06629
7842g1407m36013j09121L46803l2186q0913M23981K57082Q6157k11124k02449
7832b9190k1690J08576J39646j85054l54142R3005K32137j025m3938N68J18124
7821E7017j36802k44438K47500j7251R2986n562p5979r7792K2337J16369R2069
7810E0454j01749K2873J24888O8520L2890p8685j51859J46424J67401j37065n6389
7799H7703N9720j12318r6225n2007m79K52240O8827L623K7985l57099m2378K00502
7787D0094K03607M9931k7671O6580Q7709j30716k00635j12640j93449Q1054J6918
7776a19218K869J51320R1299N1071m4473k7643J19603J72611j08134K3549n1707
$$ plain form
7765 261147 140591 -24743 151252 82371 123075 350118 382414 389372 364735 152872 43194
7754 43194 -18737 -108075 67825 125027 121649 198295 378177 260608 164247 381155 530033
7743 530033 401913 325995 134810 31121 11418 138326 463437 189116 -119489 -131122
7733 -131122 -233648 -587746 -400578 -380621 -341953 -128431 12178 79013 8288 -117235
7723 -117235 -155950 -310811 -459048 -230167 -53096 237346 363157 210292 118724 144813
7713 144813 226773 19416 -61648 -99946 -211106 -445133 -206039 -117755 -120559 -148566 -219132
7702 -219132 -355856 -373337 -535268 -532399 -421485 -389392 -146472 115819 326335 119403
7692 119403 -114281 -137239 -226907 -474851 -441526 -223717 -198129 -451443 -684573 -521865
$$ packed form
7765B61147j20556j65334J75995o8881M0704K27043L2296O958k4637k11863j09678
7754D3194o1931q9338J75900N7202l378P6646J79882j17569r6361K16908J48878
7743E30033j28120p5918j91185j03689j9703J26908L25111k74321l08605j1633
7733a31122j02526l54098J87168J9957L8668K13522J40609O6835p0725j25523
7723a17235l8715j54861j48237K28881J77071K90442J25811j52865r1568K6089
7713A44813Q1960k07357q1064l8298j11160k34027K39094Q8284k804k8007p0566
7702b19132j36724j7481j61931K869J10914L2093K42920K62291K10516k06932
7692A19403k33684k2958q9668k47944L3325K17809K5588k53314k33130J62708
$$ plain form
7682 -521865 -470409 -594317 -517556 -325305 -144252 -239246 -289548 -255495 -250413 -234715 -233542
7671 -233542 74639 -116214 -352944 -561491 -304473 -397762 -323861 -262850 -485052 -242476
7661 -242476 -274372 -304555 -101512 -2885 26709 -216 -114799 -27325 -153096 -173090 -154007
7650 -154007 -258821 -234855 -173043 167310 229229 59369 136105 171202 -42917 -101856 -354247
7639 -354247 -438728 -384499 -278920 -311327 -285007 -52397 -134264 -270063 -264733 -264348 -293700 -320316
7627 -320316 -98047 83732 207494 145682 51865 -272572 -286667 -370145 -455186 -446412 -176237
7616 -176237 107878 119941 62158 153542 52862 -9668 65551 154577 116434 67634 -97113
7605 -97113 -334379 -320032 -331302 -155217 -160341 -270803 -168924 128706 -29033 -56197 -73456
$$ packed form
7682e21865N1456j23908P6761J92251J81053r4994n0302L4053N082J5698J173
7671b33542L08181j90853k36730k08547K57018r3289P3901O1011k22202K42576
7661b42476l1896l0183K03043R8627K9594k6925j14583Q7474j25771j9994J9083
7650a54007j04814K3966O1812L40353O1919j69860P6736L5097k14119n8939k52391
7639c54247q4481N4229J05579l2407K6320K32610q1867j35799N330L85k9352k6616
7627c20316K22269J81779J23762o1812r3817l24437j4095q3478q5041Q774K70175
7616a76237K84115J2063n7783R1384j00680o2530P5219Q9026l8143m8800j64747
7605i7113k37266J4347j1270J76085n124j10462J01879K97630j57739k7164j7259
$$ plain form
7594 -73456 24113 175978 388632 196311 -246140 -276084 -113744 -18203 86606 236846
7584 236846 325054 181627 -109914 -432880 -401132 -118642 46602 2812 -183238 -432580
7574 -432580 -391886 -223826 -398647 -447537 -334857 -228335 -163666 -192179 -92003 8834
7564 8834 25520 51586 -170845 -236333 -329051 -315865 -453234 -415959 -273642 -179685 -386246
7553 -386246 -329676 -240942 -231396 -32843 8242 -71462 50583 141262 73691 -158921 -406562
7542 -406562 -305120 -121599 149087 259907 73301 -56961 -49769 -150733 -237984 -271431
7532 -271431 -15168 -26929 -159853 -250768 -146780 -1930 -152130 24953 -80670 -100110
7522 -100110 156568 67346 -170097 -2169 315766 291342 261227 125043 33539 -214607
$$ packed form
7594g3456R7569J51865K12654j92321m42451k9944J62340R5541J04809J50240
7584B36846Q8208j43427k91541l22966L1748K82490J65244m3790j86050k49342
7574d32580M0694J68060j74821m8890J12680J06522O4669k8513J00176J00837
7564H834J6686K6066k22431o5488r2718J3186j37369L7275J42317R3957k06561
7553c86246N6570Q8734R546J98553M1085p9704J22045R0679o7571k32612k47641
7542d06562J01442J83521K70686J10820j86606j30262P192j00964q7251l3447
7532b71431K56263j1761j32924r0915J03988J44850j50200J77083j05623j9440
7522a00110K56678q9222k37443J67928L17935k4424l0115j36184r1504k48146
$$ plain form
7512 -214607 -397306 -329241 -110403 -11277 -113497 -10290 -91418 167276 276772 260615
7502 260615 90036 -165699 -195488 -220671 -336362 -266247 -455740 -538054 -428890 -466258 -312306
7491 -312306 -235674 -243800 -323990 -316259 -323659 -259914 -290302 -447160 -324526 -37378 70405
7480 70405 64064 100804 -4778 -81551 -188209 -104244 -289978 -262990 8299 55344 -117381
7469 -117381 -221892 -69884 200842 230382 41256 3576 181657 250847 270161 249540 216187
7458 216187 345358 -11778 7502 -101933 -399893 -463443 -194574 9920 -25368 -101578
7448 -101578 -471531 -551787 -621668 -589298 -284340 -343696 -217782 -133331 -180264 -114311 78934
7437 78934 127550 -8920 -134228 -166196 -106188 -25793 9546 155835 315734 175468 -128170
$$ packed form
7512b14607j82699O8065K18838R9126j02220J03207q1128K58694J09496j6157
7502B60615j70579k55735k9789k5183j15691P0115j89493q2314J09164l7368J53952
7491c12306P6632q126q0190P731p400O3745l0388j56858J22634K87148J07783
7480G0405o341L6740j05582p6773j06658Q3965j85734K6988K71289M7045j72725
7469a17381j04511J52008K70726K9540j89126l7680J78081O9190J9314k0621l3353
7458B16187J29171l57136J9280j09435k97960o3550K68869K04494l5288p6210
7448a01578l69953q0256o9881L2370L04958n9356J25914Q4451m6933O5953J93245
7437G8934M8616j36470j25308l1968O0008Q0395L5339J46289J59899j40266l03638
$$ plain form
7426 -128170 -162157 -123199 123283 291803 232011 172789 65739 112254 26843 -62057 15832
7415 15832 227851 241719 254969 148904 -112133 -183519 -144427 -90305 5465 130666 83173
7404 83173 176693 195031 -17882 -372481 -397407 -91753 52500 44762 -40472 -174342 -84190
7393 -84190 -186050 -209688 -197922 54649 97482 -88756 -240365 -234316 -44111 110101 103490
7382 103490 -20647 -150512 -276777 -94084 101595 -3063 -86434 -302708 -469541 -237408
7372 -237408 -84129 -340096 -306681 -132898 -44018 108061 14352 -217187 -99131 -84161
7362 -84161 -208806 -55788 47776 -127083 -293525 -240058 -302166 -423047 -409059 -262679
7352 -262679 -278195 -155566 -164231 -373270 -344136 -386793 -78788 -869 -2788 -101319 22885
$$ packed form
7426a28170l3987L8958K46482J68520n9792n9222j07050M6515q5411q8900P7889
7415A5832K12019J3868J3250j06065k61037p1386L9092N4122R5770J25201m7493
7404H3173R3520J8338k12913l54599k4926L05654J44253p738q5234j33870R0152
7393h4190j01860k3638J1766K52571M2833j86238j51609O049J90205J54212o611
7382A03490j24137j29865j26265J82693J95679j04658q3371k16274j66833K32133
7372b37408J53279k55967L3415J73783Q8880J52079r3709k31539J18056J4970
7362h4161j24645J53018J03564j74859j66442N3467o2108j20881J3988J46380
7352b62679j5516J22629q665k09039K9134m2657L08005P7919j919r8531J24204
$$ plain form
7341 22885 -53869 -117215 -134473 -35713 -15067 -47392 -145822 -202481 -30693 118751 108777 -14059
7329 -14059 -51490 224934 58677 -37963 -55458 54681 177004 443791 417702 196708 236483
7318 236483 403388 263809 -106876 -353497 -455134 -215270 -35231 -3023 -97242 -153400
7308 -153400 -347494 -282209 -129542 -45839 2232 64194 219761 651570 568231 277808 101547
7297 101547 116754 -229242 -343975 -153983 -96608 -219170 -237190 -52078 -49191 -148152 -113103
7286 -113103 129769 94997 191401 108023 -188464 -111996 333159 314036 311932 128097 86986
7275 86986 18187 -257801 -491448 -457758 -317394 -225142 -333346 -241076 -201720 -45786 -47568
7264 -47568 44436 -71998 -154789 -1334 171295 -69352 -48625 137005 153187 -34501 -113836
$$ packed form
7341B2885p6754o3346j7258R8760K0646l2325r8430n6659J71788J49444r974j22836
7329a4059l7431K76424j66257r6640j7495J10139J22323K66787k6089k20994L9775
7318B36483J66905j39579l70685k46621j01637K39864J80039L2208r4219n6158
7308a53400j94094O5285J52667Q3703M8071O1962J55567M31809q3339k90423j76261
7297A01547J5207l45996j14733J89992N7375j22562j8020J85112K887r8961L5049
7286a13103K42872l4772R6404q3378k96487P6468M45155j9123k104j83835m1111
7275H6986o8799k75988k33647L3690J40364R2252j08204R2270L9356J55934j782
7264d7568R2004j16434q2791J53455J72629k40647K0727J85630J6182j87688p9335
$$ plain form
7253 -113836 -128574 21359 -106246 -284696 -389202 -323618 -182315 -262719 -412866 -119491
7243 -119491 -84761 37515 21210 -228344 -347921 -274395 -280257 -375063 -372205 -458059 -92547
7232 -92547 -57919 -128799 -143098 -226661 104660 217829 -44486 -236202 -94934 45735 -27076
7221 -27076 -224028 -135107 -174635 -132727 86595 238673 141726 113424 204024 135514 100808
7210 100808 216275 234802 77443 -139832 -98632 -168888 50425 290095 212485 300633 148560
7199 148560 36766 -53492 213582 300177 168534 -15154 -200623 -293733 -292418 -385457 -449119
7188 -449119 -559459 -804246 -760344 -454514 -412850 -332299 11569 90951 -126606 -306255
7178 -306255 -188462 65508 -131513 -53694 118311 156527 -76343 -422277 -253771 35645
$$ packed form
7253a13836j4738J49933j27605j78450j04506O5584J41303q0404j50147K93375
7243a19491L4730J22276j6305k49554j19577P3526n862r4806K858q5854L65512
7232i2547L4628p0880j4299q3563L31321J13169k62315j91716J41268J40669p2811
7221b7076j96952Q8921l9528M1908K19322J52078r6947k8302R0600o8510l4706
7210A00808J15467J8527j57359k17275M1200p0256K19313K39670p7610Q8148j52073
7199A48560j11794r0258K67074Q6595j31643j83688j85469r3110J315r3039o3662
7188d49119j10340k44787M3902L05830M1664Q0551L43868P9382k17557j79649
7178c06255J17793K53970j97021P7819J72005L8216k32870l45934J68506K89416
$$ plain form
7168 35645 342318 253198 237800 182430 237330 92146 -208771 -400191 -455426 -273250 -98822
7157 -98822 86886 64434 -85766 -30244 7276 151066 198888 128550 174934 395543 482275
7146 482275 400905 189174 185501 49332 -10757 34035 64583 78727 -75214 -276597 -11264
7135 -11264 215854 224506 180681 142587 220772 366020 206345 -94011 32427 -57966 -179285
7124 -179285 -70835 -32228 -80387 6725 -233803 -210430 -52926 -186078 -105575 63884 348996
7113 348996 112370 -259529 -334434 -172005 -175557 -197210 18769 40189 90749 176600 82841
7102 82841 16817 -4943 69450 20308 -200364 -119947 -229435 -66918 -246054 -221369 -185875
7091 -185875 -109499 -69161 -136621 -311950 -75031 107732 173423 322309 605895 580297 100696
$$ packed form
7168C5645L06673q9120j5398n5370N4900j45184l00917j91420n5235J82176J74428
7157i8822J85708k2452j50200N5522L7520J43790M7822p0338M6384K20609Q6732
7146D82275q1370k11731l673j36169o0089M4792L0548J4144j53941k01383K65333
7135a1264K27118Q652m3825l8094P8185J45248j59675l00356J26438r0393j21319
7124a79285J08450L8607m8159Q7112k40528K3373J57504j33152Q0503J69459K85112
7113C48996k36626l71899p4905J62429l552k1653K15979K1420N0560Q5851r3759
7102H2841o6024k1760P4393m9142k20672Q0417j09488J62517j79136K4685L5494
7091a85875P6376M0338o7460j75329K36919J82763O5691J48886K83586k5598m79601
$$ plain form
7080 100696 -180986 -70787 -19822 -40836 -110909 -8876 84663 62406 194838 212324 167784
7069 167784 -19598 50438 80096 -70238 85469 185760 397683 375165 36390 -169059
7059 -169059 -295704 -86075 48780 -16368 -25387 112536 128840 38795 135078 261351 326607
7048 326607 -5237 -98193 8792 136765 101034 83207 89914 151218 90240 -100933 -271118
7037 -271118 -377085 -387109 -308308 -170778 249676 209733 -53456 -25288 86887 230554
7027 230554 182542 204790 215785 -54084 -247758 -242088 -274982 -442177 -388895 -307120 -85558
7016 -85558 87036 46640 86550 74499 117550 269854 186134 200592 94361 -27644 -78003
7005 -78003 -240402 -129 193532 364157 96120 -116137 -26250 -62559 -180945 -186310 -130806
$$ packed form
7080A00696k81682J10199N0965k1014p0073J02033R3539k2257J32432J7486m4540
7069A67784j87382P0036K9658j50334J55707J00291K11923k2518l38775k05449
7059a69059j26645K09629J34855o5148r019J37923J6304r0045R6283J26273O5256
7048C26607l31844r2956J06985J27973l5731j7827O707O1304o0978j91173j70185
7037b71118j05967j0024P8801J37530M20454l9943k63189K8168J12175J43667
7027B30554m8012K2248J0995k69869j93674N670l2894j67195N3282Q1775K21562
7016h5558J72594m0396L9910j2051M3051J52304q3720J4458j06231j22005n0359
7005g8003j62399K40273J93661J70625k68037k12257Q9887l6309j18386n365N5504
$$ plain form
6994 -130806 -244380 -334116 -97638 -81706 -142446 -242145 -200373 -188826 -275580 -314030 -219937
6983 -219937 -336607 -398991 -219532 -155919 -263203 -176894 -109809 124033 -85186 -254975
6973 -254975 -150399 -54471 -63457 -221667 -120583 -290257 -455984 -426704 -227508 -164814 -206845
6962 -206845 3376 -247526 -430319 -215870 27286 141612 45105 -81034 27723 83602
6952 83602 10542 -145050 -184751 -90382 -32234 4006 91956 103893 58010 157869 351963
6941 351963 341913 224427 -110958 -328118 -40327 60030 -261371 -351824 -376754 -237332
6931 -237332 -143091 -127855 -114677 -45878 108366 131017 170725 17680 -1726 184410 117024
6920 117024 9667 138152 258869 199167 67432 -259752 -409009 -331732 -118287 -80688
$$ packed form
6994a30806j13574q9736K36478J5932o0740r9699M1772J1547q6754l8450R4093
6983b19937j16670o2384J79459O3613j07284Q6309O7085K33842k09219j69789
6973b54975J04576R5928q986j58210J01084j69674j65727K9280J99196O2694m2031
6962b06845K10221k50902j82793K14449K43156J14326r6507j26139J08757N5879
6952H3602p3060j55592l9701R4369N8148L6240Q7950J1937m5883R9859J94094
6941C51963j0050j17486l35385k17160K87791J00357l21401r0453k4930J39422
6931b37332R4241J5236J3178O8799J54244K2651L9708j53045j9406J86136o7386
6920A17024j07357J28485J20717n9702j31735l27184j49257P7277K13445L7599
$$ plain form
6910 -80688 -247306 -176451 246687 144420 -48990 -291372 -251979 -38334 171897 92878
6900 92878 -30933 35329 36928 15960 8662 -86392 -208461 -264314 -58405 -169055 -300790
6889 -300790 -348406 -452492 -363062 -158196 -90018 -153547 -210573 -94843 -24323 25562 12109
6878 12109 -118314 -212749 -150094 45531 30111 -284121 -65442 -21364 37196 168039 110705
6867 110705 131717 304461 205384 -21634 59991 8682 174714 227475 245843 21134 -121391
6856 -121391 -115468 -108730 -199463 -159004 -112513 -196368 -260462 -143117 -78657 79388 180112
6845 180112 18834 -102747 -339121 -451139 -297761 -150591 -230748 -188839 -190822 -157613 87703
6834 87703 36352 84025 23035 -152297 -143555 -129307 -53474 -114992 -181027 -5643 246946
$$ packed form
6910h0688j66618P0855M23138j02267j93410k42382L9393K13645K10231p9019
6900I2878j23811O6262J599k0968p298r5054j22069n5853K05909j10650j31735
6889c00790m7616j04086Q9430K04866O8178o3529n7026J15730P0520M9885j3453
6878A2109j30423r4435O2655J95625j5420l14232K18679M4078N8560J30843n7334
6867A10705K1012J72744r9077k27018Q1625n1309J66032N2761J8368k24709j42525
6856a21391N923O738r0733M0459M6491q3855o4094J17345O4460J58045J00724
6845A80112j61278j21581k36374j12018J53378J47170q0157M1909j983L3209K45316
6834H7703n1351M7673o0990j75332Q742J4248P5833o1518o6035J75384K52589
$$ plain form
6823 246946 71609 -14661 -136371 14844 113379 241882 82989 213175 24241 -272434
6813 -272434 -413263 -333764 -139910 -255353 -323483 -208550 -70983 -205296 -176615 -107735
6803 -107735 -231258 -166220 -283023 -294360 -136984 -354284 -366439 -329729 -130265 -185476 -219160
6792 -219160 -321689 -315840 -394052 -283210 -351572 -199967 -230552 -132304 -54581 -151409 -173592
6781 -173592 -135228 -247547 -123073 233647 293151 363393 539494 301063 237923 178502 89083
6770 89083 328956 352274 192274 36362 185657 127423 -66288 9324 -40699 100794 319337
6759 319337 327856 123635 -26267 238754 276343 118633 61043 63495 -64560 -151953 -327052
6748 -327052 -68922 71084 50280 -3446 -34906 -102223 -439736 -444512 -250150 -143449 -206901
$$ packed form
6823B46946j75337q6270j21710J51215R8535J28503j58893J30186j88934k96675
6813b72434j40829P9499J93854j15443o8130J14933J37567j34313K8681O8880
6803a07735j23523O5038j16803j1337J57376k17300j2155L6710J99464n5211l3684
6792b19160j02529N849p8212J10842o8362J51605l0585R8248P7723r6828k2183
6781a73592L8364j12319J24474L56720N9504P0242J76101k38431o3140n9421q9419
6770H9083K39873K3318j60000j55912J49295n8234j93711P5612n0023J41493K18543
6759C19337Q519k04221j49902K65021L7589j57710n7590K452j28055q7393j75099
6748c27052K58130J40006k0804n3726l1460o7317l37513m776J94362J06701o3452
$$ plain form
6737 -206901 -156309 -135892 -134240 -127872 25007 83274 17873 -148810 -305888 -260153 -163447
6726 -163447 323815 381663 297975 -1033 -247049 -29372 85809 -45048 -41877 83161
6716 83161 100183 141120 241571 232541 57556 -30464 63612 -119970 -225919 -89467 56198
6705 56198 193012 439844 369391 86689 -17973 143269 284934 -15005 -353356 -308110
6695 -308110 -236887 -217494 -213513 -198151 -165951 -159192 -233562 -293745 -387007 -208503 -258671 -234861
6683 -234861 46525 179871 100211 -7628 -42864 8732 152605 369893 250367 144180
6673 144180 140158 209725 394919 343080 49183 -13534 46028 350745 448979 219380 37654
6662 37654 -209351 -321358 -68834 27803 122028 -89870 -84512 -154148 -195207 -246006 -278078
$$ packed form
6737b06901N0592K0417J652O368J52879N8267o5401j66683j57078M5735R6706
6726a63447M87262N7848q3688k99008k46016K17677J15181j30857L171J25038
6716H3161J7022M0937J00451r030j74985q8020R4076j83582j05949J36452J45665
6705E6198J36814K46832p0453k82702j04662J61242J41665k99939l38351M5246
6695c08110P1223J9393L981J5362L2200O759p4370o0183r3262J78504n0168K3810
6683b34861K81386J33346p9660j07839l5236N1596J43873K17288j19526j06187
6673A44180m022O9567J85194n1839k93897o2717N9562L04717R8234k29599j81726
6662C7654k47005j12007K52524R6637R4225k11898N358o9636m1059n0799l2072
$$ plain form
6651 -278078 -22629 222861 138134 40156 -186155 114518 394553 192741 37269 -102084
6641 -102084 -70785 -143235 -60693 -26931 -51566 -127437 -296488 -224127 -255795 -319682 -189169
6630 -189169 -238943 -92761 -27076 -7306 -21555 -277874 -458745 -639848 -461453 -8068
6620 -8068 125950 134127 167534 -135383 -169221 -120125 -41652 -130333 -275835 -190896 -67026
6609 -67026 69162 202699 356456 171162 131584 70753 33790 -61253 -86534 -166415 -134889
6598 -134889 176854 330615 210285 214821 167806 62746 202053 275384 -12216 -220134
6588 -220134 -297915 -186013 36163 192323 168167 135375 323629 156343 -220126 -228177 -349749
6577 -349749 -409887 -538885 -273869 -126737 -5764 -99516 -22546 124842 87123 -216050
$$ packed form
6651b78078K55449K45490q4727r7978k26311L00673K80035k01812j55472j39353
6641a02084L1299p2450Q2542L3762k4635p5871j69051P2361l1668o3887J30513
6630a89169m9774J46182O5685J9770j4249k56319j80871j81103J78395M53385
6620h068J34018Q177L3407l02917l3838M9096P8473q8681j45502Q4939J23870
6609f7026J36188J33537J53757j85294l9578o0831l6963r5043k5281p9881L1526
6598a34889L11743J53761j20330M536m7015j05060J39307P3331k87600k07918
6588b20134p7781J11902K22176J56160k4156l2792J88254j67286l76469q051j21572
6577c49749o0138j28998K65016J47132J20973r3752P6970J47388l7719l03173
$$ plain form
6567 -216050 -471216 -379949 -207397 -357317 -374545 -497864 -387884 -156881 -66425 -191880
6557 -191880 -177003 1404 -191283 -275631 -468848 -396252 -580857 -588687 -425042 -238582 -90551
6546 -90551 47325 30304 -191968 -303540 -334528 -411662 -374268 -273882 -3223 183210 357332
6535 357332 602811 505187 455871 306378 143753 9477 -129091 -188705 -213198 -260018 -337896
6524 -337896 -217119 -219236 -181162 -108530 1375 -237076 -120819 -137799 -61766 -137564 -205458
6513 -205458 -255167 -70970 45515 166077 310880 304668 154624 276831 200827 -4170
6503 -4170 -14405 31511 69943 219011 18304 -322350 -328175 -329580 -420013 -401049 80052 316068
6491 316068 206153 -105488 -196409 -360975 -128468 366635 273074 -77041 1575 132468
$$ packed form
6567b16050k55166R1267J72552j49920j7228j23319J09980K31003R0456j25455
6557a91880J4877J78407j92687q4348j93217P2596j84605p830J63645J86460J48031
6546i0551J37876j7021k22272j11572l0988p7134L7394J00386K70659J86433J74122
6535C57332K45479r7624m9316j49493j62625j34276j38568n9614k4493m6820p7878
6524c37896J20777k117L8074P2632J09905k38451J16257j6980P6033p5798o7894
6513b05458m9709J84197J16485J20562J44803o212j50044J22207p6004k04997
6503d170j0235M5916L8432J49068k00707l40654n825j405r0433J8964M81101K36016
6491C16068j09915l11641r0921j64566K32507M95103r3561l50115P8616J30893
$$ plain form
6481 132468 99603 -108149 -231082 70400 90846 39053 109543 -5237 -31316 -73988 -104954
6470 -104954 15076 -12409 -127030 -210771 -30415 -198871 -177236 -51954 -102274 -207719
6460 -207719 -541455 -622687 -223715 46697 156164 315991 363246 199265 79379 -24581
6450 -24581 -123191 -306972 -183687 -10133 255297 194524 69975 -32332 -132611 -117836
6440 -117836 158135 234551 135534 -80791 -185239 -55301 97858 56914 150778 132754 -48221
6429 -48221 -139958 -374808 -548578 -483063 -393866 -214967 -311511 -458035 -449667 -491649 -516345
6418 -516345 -355246 -295478 29689 334168 316650 92885 86391 40146 212501 325179 233019
6407 233019 41970 113280 146474 -234838 -296800 -250006 -404464 -407673 -386512 -420485 -152312
$$ packed form
6481A32468l2865k07752j22933L01482K0446n1793P0490j14780k6079m2672l0966
6470a04954J20030k7485j14621q3741J80356j68456K1635J25282n0320j05445
6460b07719l33736q1232L98972K70412J09467J59827M7255j63981j19886j03960
6450b4581r8610j83781J23285J73554K65430o0773j24549j02307j00279J4775
6440a17836K75971P6416r9017k16325j04448J29938J53159m0944R3864j8024j80975
6429d8221r1737k34850j73770O5515Q9197J78899r6544j46524Q368m1982k4696
6418e16345J61099N9768L25167L04479j7518k23765o494m6245J72355J12678r2160
6407B33019j91049P1310L3194l81312o1962M6794j54458l209K1161l3973K68173
$$ plain form
6396 -152312 -64655 10839 29877 108817 109075 -56352 -27022 16481 -91127 -204319 -58907
6385 -58907 148744 41329 -157527 -133521 84400 78036 -128538 -458592 -572058 -488969 -556056
6374 -556056 -418458 -174320 -107931 -158721 -64766 -328601 -349895 -172128 -37012 220474
6364 220474 296664 281190 131854 53326 -80529 -89918 -167601 -34838 156257 142061 -75979
6353 -75979 -142395 -235216 13790 182747 -67593 -115994 -14931 -66577 -145567 -105618 -173272
6342 -173272 21593 119281 142545 119381 86791 262465 104891 -233283 -151342 89462 266454
6331 266454 445361 399015 248683 137397 306125 332577 339459 -27460 -53063 47355 145856
6320 145856 217724 14650 -21114 139428 -23836 -102658 -128692 -122833 -183279 -362911 -431358
$$ packed form
6396a52312Q7657P5494J9038P8940K58j65427K9330M3503j07608j13192J45412
6385e8907K07651j07415j98856K4006K17921o364k06574l30054j13466Q3089o7087
6374e56056J37598K44138O6389n0790R3955k63835k1294J77767J35116K57486
6364B20474P6190j5474j49336p8528j33855r389p7683J32763J91095j4196k18040
6353g5979o6416r2821K49006J68957k50340m8401J01063n1646p8990L9949o7654
6342a73272J94865R7688K3264k3164l2590J75674j57574l38174Q1941K40804J76992
6331B66454J78907m6346j50332j11286J68728K6452O882l66919k5603J00418R8501
6320A45856P1868k03074l5764J60542j63264p8822k6034N859o0446j79632o8447
$$ plain form
6309 -431358 -276403 -125120 -95928 -187763 -282643 -343881 -240862 327554 348232 159155 49214
6298 49214 -83401 -241604 -308379 -326205 -62650 241040 187213 315937 142641 -121375
6288 -121375 -303404 -301040 -314381 -271188 -33128 424216 539477 226894 49315 -159735
6278 -159735 -223235 -151595 54244 208502 223269 392687 294360 129801 82997 118611 75862
6267 75862 35417 -97015 -17304 -47066 -36523 -88216 -175920 -128075 -68966 -143746 -55321 250742
6255 250742 80699 245928 126069 -93547 -78455 -8127 301791 459371 179608 -322999
6245 -322999 -555262 -273904 -117818 -31107 -97456 2690 -82079 -77845 92774 21809 -128395
6234 -128395 -191415 -186908 -120124 76452 67855 -22054 63827 76556 226053 377822 266916
$$ packed form
6309d31358J54955J51283K9192r1835r4880o1238J03019N68416K0678j89077j09941
6298D9214j32615j58203o6775j7826K63555L03690n3827J28724j73296k64016
6288a21375j82029K364j3341M3193K38060M57344J15261l12583j77579k09050
6278a59735o3500P1640K05839J54258J4767J69418r8327j64559m6804L5614m2749
6267G5862m0445j32432P9711k9762J0543n1693q7704M7845N9109p4780Q8425L06063
6255B50742j70043J65229j19859k19616J5092P0328L09918J57580k79763n02607
6245c22999k32263K81358J56086Q6711o6349J00146q4769M234J70619p0965j50204
6234a28395o3020M507O6784J96576q597q9909Q5881J2729J49497J51769j10906
$$ plain form
6223 266916 241468 269747 484733 590579 215608 -159497 -152197 -245494 -399312 -245889 -20921
6212 -20921 -26910 -74585 -20451 -45383 -4311 -81826 -345870 -561003 -601889 -215990 215351
6201 215351 13246 -177154 -323174 -282391 -151041 -236673 -293655 -400966 -257227 -110659
6191 -110659 -117843 -29579 73433 -46690 -297947 -123485 253360 12713 116187 341725
6181 341725 419958 248820 263942 34456 35175 -29218 -222868 -74719 93036 268110 98316
6170 98316 106644 304391 304264 360172 265402 270510 244781 191431 132643 -30074 -287452 -184381
6158 -184381 -96035 -214038 -275331 -286675 -141473 -75265 27381 203467 129791 192532 65491
6147 65491 -74415 -272206 -36851 75565 -201351 -165997 -8855 -8430 -28205 -21556 -71500
$$ packed form
6223B66916k5448K8279K14986J05846l74971l75105P300r3297j53818J53423K24968
6212b0921n989m7675N4134k4932M1072p7515k64044k15133m0886L85899M31341
6201B15351k02105j90400j46020M0783J31350q5632n6982j07311J43739J46568
6191a10659p184Q8264J03012j20123k51257J74462L76845k40647J03474K25538
6181C41725P8233j71138J5122k29486P19o4393j93650J48149J67755J75074j69794
6170I8316Q328J97747j27N5908r4770N108k5729n3350n8788j62717k57378J03071
6158a84381Q8346j18003o1293j1344J45202O6208J02646J76086p3676O2741j27041
6147F5491j39906j97791K35355J12416k76916L5354J57142M25j9775O649m9944
$$ plain form
6136 -71500 87035 62910 155121 108212 29118 -132293 -126285 -43579 -176128 -246762 -86684
6125 -86684 17283 -121807 83478 58223 -126383 -274679 -100652 62866 -102346 -107385
6115 -107385 107481 133330 114779 73455 145079 173804 111738 -71641 -22945 105876 158957
6104 158957 301549 580532 529969 392988 85048 -344303 -614036 -518698 -459568 -232766
6094 -232766 -19999 168352 46103 -158725 -165119 -195561 -23475 86185 19649 57312 115169
6083 115169 30821 119765 18908 -280206 -410717 -144128 77413 -145905 -142956 90051
6073 90051 181976 231249 372796 -432 -205659 -346425 -168026 155868 22805 -128965
6063 -128965 -363042 -531334 -519832 -469764 -443270 -205065 171169 -50405 64791 229545
$$ packed form
6136g1500J58535k4125R2211m6909p9094j61411O008Q2706j32549p0634J60078
6125h6684J03967j39090K05285k5255j84606j48296J74027J63518j65212n039
6115a07385K14866K5849j8551m1324P1624K8725o2066j83379M8696J28821N3081
6104A58957J42592K78983n0563j36981l07940m29351k69733R5338N9130K26802
6094b32766K12767J88351j22249k04828o394l0442J72086J09660o6536L7663N7857
6083A15169q4348Q8944j00857k99114j30511K66589K21541k23318K949K33007
6073I0051R1925M9273J41547l73228k05227j40766J78399L23894j33063j51770
6063a28965k34077j68292J1502N0068K6494K38205L76234k21574J15196J64754
$$ plain form
6053 229545 242206 153893 85557 31599 102421 307707 448106 23125 -273983 -223552 -34772
6042 -34772 58130 -70343 65766 65542 76518 104776 71442 38122 -64459 -30368 9241 -58512
6030 -58512 254655 280200 33391 -96360 -38338 -97542 -66186 -20619 17316 10097 81919
6019 81919 82722 -50789 -183547 -32575 64888 221840 215186 264008 288396 83786 -209267
6008 -209267 -259541 -229289 -129965 -293668 -456482 -334035 -171519 -45931 -137157 -101084 -26910
5997 -26910 23238 -72255 -80087 -380427 -601194 -528829 -474753 -180737 120674 -87444 43454
5986 43454 161094 38302 -334925 -267370 -155178 -60489 -203 27487 36799 -274692 -300887
5975 -300887 -224565 -163772 -33784 52366 8532 59107 9778 47785 118549 69827 -10545
$$ packed form
6053B29545J2661q8313o8336n3958P0822K05286J40399m24981k97108N0431J88780
6042c4772R2902j28473J36109k24J0976K8258l3334l3320j02581L4091L9609o7753
6030e8512L13167K5545k46809j29751N8022n9204L1356M5567L7935p219P1822
6019H1919Q03j33511j32758J50972R7463J56952o654M8822K4388k04610k93053
6008b09267n0274L0252R9324j63703j62814J22447J62516J25588r1226L6073P4174
5997b6910N0148r5493p832l00340k20767P2365N4076K94016L01411k08118J30898
5986D3454J17640j22792l73227O7555J12192R4689O0286K7690R312l11491k6195
5975c00887P6322O0793J29988Q6150m3834N0575m9329L8007P0764m8722q0372
$$ plain form
5964 -10545 -23104 -288828 -401176 -89613 -31293 -106189 -256984 -323868 -522635 -345480 125639
5953 125639 141530 43681 -14340 76255 156503 144012 195201 65358 73616 116585 439486
5942 439486 249765 -49595 -182352 -126408 -96768 6050 -101461 -54904 264257 97635
5932 97635 108933 57437 196360 280627 267107 295014 305376 255717 166127 52339 243614
5921 243614 173564 -113426 -167731 -183344 -239617 -175560 -32397 85692 148217 -47150 -419132
5910 -419132 -558330 -201992 177354 247630 353022 314466 414102 470826 193282 -95289
5900 -95289 -23015 -170296 -318437 -226354 -184695 24475 -228403 -443692 -499918 -481609 -361553
5889 -361553 -88194 10646 -71413 -44526 173362 282870 154492 57462 -47939 46236 163926
$$ packed form
5964a0545j2559k65724j12348L11563N8320p4896j50795o6884j98767J77155M71119
5953A25639J5891r7849n8021R0595Q0248j2491N1189j29843Q258M2969L22901
5942D39486j89721k99360j32757N5944K9640J02818j07511M6557L19161j66622
5932I7635J1298n1496J38923Q4267j3520K7907J0362m9659q9590j13788J91275
5921B43614p0050k86990n4305j5613n6273O4057J43163J18089O2525j95367l71982
5910d19132j39198L56338L79346P0276J05392l8556R9636N6724k77544k88571
5900i5289P2274j47281j48141R2083M1659K09170k52878k15289n6226J8309J20056
5889c61553K73359R8840q2059K6887K17888J09508j28378r7030j05401R4175J17690
$$ plain form
5878 163926 100969 -238903 -148928 119714 68684 126019 207254 23781 -160588 -174166 -168456
5867 -168456 18510 209623 -30600 -180070 -172864 -70419 -425987 -559781 -301985 95324
5857 95324 282220 203601 24974 19254 34716 -78647 -375577 -158496 248128 308352 202480
5846 202480 309897 247213 60816 -325966 -288048 177117 475188 428623 322418 -6400
5836 -6400 690 -22273 -104661 113214 230089 192764 -51954 -77849 71481 317633 440951
5825 440951 97959 -104536 -97690 -187297 -105778 16051 -127937 -271518 -274125 -130825 -77544
5814 -77544 -219242 -389726 -349496 17797 375173 340981 -59697 -314466 -317053 -180755 -185403
5803 -185403 -87662 41154 40920 -160634 -177295 -283447 -239019 -40566 200477 274558 139210
$$ packed form
5878A63926o2957l39872Q9975K68642n1030N7335Q1235j83473j84369j3578N710
5867a68456J86966J91113k40223j49470P206J02445l55568j33794K57796L97309
5857I5324J86896p8619j78627n720J5462j13363k96930K17081M06624O0224j05872
5846B02480J07417o2684j86397l86782L7918M65165K98071m6565j06205l28818
5836f400P090k2963q2388K17875J16875l7325k44718k5895J49330K46152J23318
5825D40951l42992k02495O846q9607Q1519J21829j43988j43581k607J43300N3281
5814g7544j41698j70484M0230L67293L57376l4192m00678k54769k587J36298m648
5803a85403R7741J28816k34k01554j6661j06152M4428J98453K41043P4081j35348
$$ plain form
5792 139210 35154 -79375 104566 264788 139401 103440 -213836 -436436 -640008 -239586
5782 -239586 -13042 195916 70420 -144014 -172562 72919 84221 50122 25124 -76721
5772 -76721 -38637 88073 279936 248803 394131 469275 258627 193620 -44951 -195643 -150134
5761 -150134 -247283 -228819 -34782 -459 -202903 -171645 -170634 -398165 -343396 -386762 -498598
5750 -498598 -594934 -667790 -351971 -304198 -458313 -292949 -173763 -369873 -475935 -432849
5740 -432849 -521185 -455048 -11877 186577 340136 351112 225998 281439 168788 113456 102690
5729 102690 -9058 19172 -153575 -112587 -160381 -209968 -251883 -68494 -73516 -327798 -316611
5718 -316611 -282838 -298577 -73669 81289 446996 297172 201604 188949 14054 31324 -182068
$$ packed form
5792A39210j04056j14529J83941J60222j25387l5961l17276k22600k03572M00422
5782b39586K26544K08958j25496k14434k8548K45481J1302l4099k4998j01845
5772g6721L8084J26710J91863l1133J45328P5144k10648o5007k38571j50692M5509
5761a50134r7149J8464J94037L4323k02444L1258J011k27531N4769m3366j11836
5750d98598r6336p2856L15819M7773j54115J65364J19186j96110j06062M3086
5740d32849q8336O6137M43171J98454J53559J0976j25114N5441j12651n5332j0766
5729A02690j11748K8230j72747M0988m7794m9587m1915J83389n022k54282J1187
5718c16611L3773j5739K24908J54958L65707j49824r5568j2655j74895J7270k13392
$$ plain form
5707 -182068 -43273 -63731 -377913 -363524 -240485 61999 235912 268634 178258 85887 -62912
5696 -62912 6895 -33003 -252143 -355329 -254774 -166266 -206482 -86562 -247545 -130240 132199
5685 132199 200191 123470 117445 92381 5751 54100 -20732 -67370 87886 46133 -267050
5674 -267050 -218726 -137652 260 170949 133329 -55790 48863 43948 -63119 70631 124000
5663 124000 184743 202234 -49008 -283444 -284873 -6067 120887 256106 353290 314542 100851
5652 100851 125985 126652 77072 89256 204079 208911 206013 239298 266512 202829 112321 194508
5640 194508 135170 186952 213569 248416 220351 371147 335820 260659 203864 263540 209494
5629 209494 51203 125013 65393 68840 43402 9549 -170113 -136562 -306789 -448392 -313650
$$ packed form
5707a82068J38795k0458l14182J4389J23039L02484J73913L2722r0376r2371j48799
5696f2912O9807l9898k19140j03186J00555Q8508m0216J19920j60983J17305K62439
5685A32199O7992p6721o025k5064q6630M8349p4832m6638J55256m1753l13183
5674b67050M8324Q1074J37912J70689l7620j89119J04653m915j07067J33750N3369
5663A24000O0743J7491k51242k34436j429K78806J26954J35219R7184l8748k13691
5652A00851K5134O67m9580J2184J14823M832k898L3285K7214o3683r0508Q2187
5640A94508n9338N1782K6617L4847k8065J50796l5327p5161n6795N9676n4046
5629B09494j58291P3810n9620L447k5438l3853j79662L3551j70227j41603J34742
$$ plain form
5618 -313650 -377936 -448514 -352692 -289353 26174 169022 280677 68023 -114408 -323114
5608 -323114 -280055 -221350 -268217 -1986 141572 104379 184510 267620 170459 153331 136443
5597 136443 -5484 -28833 -23153 -8034 143613 169569 30483 33110 52878 18955 -84193
5586 -84193 -54159 -212832 -272578 -178982 56249 128837 29100 -26251 -39799 -75478 -210555
5575 -210555 -546350 -628655 -634592 -425365 -92244 277410 186498 -49728 -95285 -107263 57014
5564 57014 354601 169678 -113396 -199959 -119236 -160633 -41137 66096 3400 41603 175397
5553 175397 274420 244711 442105 416110 417968 336660 64124 -44872 202044 479177 332575
5542 332575 192526 8227 97174 257551 137118 92975 114477 140345 291965 319148 324544
$$ packed form
5618c13650o4286p0578R5822O3339L15527J42848J11655k12654j82431k08706
5608c23114M3059N8705m6867K66231J43558l7193Q0131Q3110r7161j7128j6888
5597A36443j41927k3349N680J5119J51647K5956j39086K627J9768l3923j03148
5586h4193L0034j58673n9746R3596K35231P2588r9737n5351j3548l5679j35077
5575b10555l35795q2305n937K09227L33121L69654r0912k36226m5557j1978J64277
5564E7014K97587j84923k83074q6563Q0723m1397J19496J07233o2696L8203J33794
5553A75397R9023k9709J97394k5995J858q1308k72536j08996K46916K77133j46602
5542C32575j40049j84299Q8947J60377j20433m4143K1502K5868J51620K7183N396
$$ plain form
5531 324544 360756 -4961 -175281 -161251 -58182 205321 210318 132506 72883 294273 368214
5520 368214 115821 -130647 -355731 -445328 -418660 -222455 -74748 -103115 -356317 -346889 -80011
5509 -80011 -18798 -44815 -33684 -15845 14798 -140701 -60212 49108 -26278 -149048 70510
5498 70510 175447 418994 453450 562633 290067 -42923 -21492 245241 195806 94551
5488 94551 48904 -25968 -2825 118137 69361 -38490 -203932 -182099 -435884 -539092 -439275
5477 -439275 -508197 -512351 -296005 -155673 -17614 -154274 -178170 -57385 -117069 -66808 93238
5466 93238 10130 -32580 -141662 -249344 -226725 -149880 -120036 -159051 -195166 -297555 -287158
5455 -287158 -282317 -428411 -446896 -292553 -87354 -54848 -9295 20487 -108076 -39994 45588
$$ packed form
5531C24544L6212l65717j70320J4030J03069K63503M997p7812n9623K21390P3941
5520C68214k52393k46468k25084q9597K6668J96205J47707k8367k53202R428K66878
5509h0011O1213k6017J1131J7839L0643j55499Q0489J09320p5386j22770K19558
5498G0510J04937K43547L4456J09183k72566l32990K1431K66733m9435j01255
5488I4551m5647p4872K3143J20962m8776j07851j65442K1833k53785j03208R9817
5477d39275o8922m154K16346J40332J38059j36660k3896J20785n9684N0261J60046
5466I3238q3108m2710j09082j07682K2619P6845K9844l9015l6115j02389J0397
5455b87158M841j46094j8485J54343K05199L2506M5553K9782j28563O8082Q5582
$$ plain form
5444 45588 -54186 -50028 -249528 -272216 -82118 -20205 65265 40969 -104825 -201263 -272964
5433 -272964 2813 112894 28375 -1715 -55042 86642 183297 116674 132291 219633 246568
5422 246568 -24224 -77636 95525 152358 107177 -72079 -95838 -53635 13032 12277 -20308
5411 -20308 86754 42845 -141974 -425667 -639212 -441643 -237311 -14467 68669 91477
5401 91477 73442 -71533 -110486 49647 130701 -33531 -130196 -64644 101940 249930 55205
$$ packed form
5444D5588r9774M158j99500k2688J90098O1913Q5470k4296j45794r6438p1701
5433b72964K75777J10081q4519l0090n3327J41684R6655o6623J5617Q7342K6935
5422B46568k70792n3412J73161N6833m5181j79256k3759M2203O6667p55l2585
5411b0308J07062m3909j84819k83693k13545J97569K04332K22844Q3136K2808
5401I1477j8035j44975l8953J60133Q1054j64232r6665O5552J66584J47990j94725
$$ [...]
##END NTUPLES=NMR SPECTRUM
##END=
