##TITLE=Analysis number 318974
Compound Code cc 24813
Project Code adrs
Chemist Name endeavour
##JCAMPDX= 6.0         $$ Bruker NMR JCAMP-DX V2.0
##DATA TYPE= NMR SPECTRUM
##DATA CLASS= NTUPLES
##ORIGIN= Bruker BioSpin GmbH
##OWNER= nmr
$$ XWIN-NMR		Version 3.5
$$ Tue Apr 25 18:02:17 2006 GMT Daylight Time (UT+1h)  MAYBRIDGE\nmr@NMR_250MHZ
##.OBSERVE FREQUENCY= 250.131544655141
##.OBSERVE NUCLEUS= ^1H
##.ACQUISITION MODE= SIMULTANEOUS (DQD)
##.ACQUISITION SCHEME= undefined
##.AVERAGES= 16
##.DIGITISER RES= 18
##SPECTROMETER/DATA SYSTEM= dpx250
##.PULSE SEQUENCE= zg30
##.SOLVENT NAME= CDCl3
##.SHIFT REFERENCE= (INTERNAL, CDCl3, 0, 16.4493)
##AUDIT TRAIL= $$ (NUMBER, WHEN, WHO, WHERE, WHAT)
$$ ##TITLE= Audit trail, XWIN-NMR		Version 3.5
$$ ##JCAMPDX= 5.01
$$ ##ORIGIN= Bruker BioSpin GmbH
$$ ##OWNER= nmr
$$ C:\u/data/dgb/nmr/ADRS/3180/pdata/1/auditp.txt
$$ ##AUDIT TRAIL=  $$ (NUMBER, WHEN, WHO, WHERE, WHAT)
(   1,<2006-04-25 18:01:49.33 +100>,<MAYBRIDGE\nmr>,<NMR_250MHZ>,
      <created by zg, POWCHK disabled, PULCHK disabled
       configuration hash MD5:
       84 BC 41 DB A1 6E 1D 46 DA 25 12 A5 C1 ED C5 3A
       data hash MD5: 64K
       F0 61 7A 5F FB 4A 96 77 9E 37 36 52 6C 4B 05 E9>)
(   2,<2006-04-25 18:02:06.62 +100>,<MAYBRIDGE\nmr>,<NMR_250MHZ>,
      <Start of raw data processing
       ef LB = 0.3 FT_mod = 6 PKNL = 1 SI = 32K 
       data hash MD5: 32K
       E5 29 F3 5C 20 7E 44 29 D3 80 DE 73 08 89 C4 2C>)
(   3,<2006-04-25 18:02:08.33 +100>,<MAYBRIDGE\nmr>,<NMR_250MHZ>,
      <apk 
       data hash MD5: 32K
       2D 5D 73 53 90 B5 A1 D7 CD D7 4F 5F 3C 22 FB B6>)
(   4,<2006-04-25 18:02:09.08 +100>,<MAYBRIDGE\nmr>,<NMR_250MHZ>,
      <abs ABSG = 5 
       data hash MD5: 32K
       DA D1 4F 7B 22 AD A7 9D 27 9F D4 31 11 00 6F C4>)
$$ ##END=
$$ 
$$ hash MD5
$$ FB 2D 0B 76 B5 90 C0 53 69 A1 0F 7B 83 F2 73 65
##$RELAX= 
##$RELAX= 
##$RELAX= 
##$RELAX= 
##$RELAX= 
##$RELAX= 
##$RELAX= 
$$ Bruker specific parameters
$$ --------------------------
##$DU= <C:\u>
##$EXPNO= 3180
##$NAME= <ADRS>
##$PROCNO= 1
##$TYPE= <nmr>
##$USER= <dgb>
##$AMP= (0..31)
100 100 100 100 100 100 100 100 100 100 100 100 100 100 100 100 100 100 
100 100 100 100 100 100 100 100 100 100 100 100 100 100 
##$AQSEQ= 0
##$AQ_mod= 3
##$AUNM= <au_zg>
##$AUTOPOS= <11 >
##$BF1= 250.13
##$BF2= 250.13
##$BF3= 250.13
##$BF4= 250.13
##$BF5= 500.13
##$BF6= 500.13
##$BF7= 500.13
##$BF8= 500.13
##$BYTORDA= 1
##$CFDGTYP= 0
##$CFRGTYP= 5
##$CHEMSTR= <none>
##$CNST= (0..31)
1 1 145 1 1 1 1 1 1 1 1 1 1 1 1 1 1 1 1 1 1 1 1 1 1 1 1 1 1 1 1 1 
##$CPDPRG= <>
##$CPDPRG1= <>
##$CPDPRG2= <>
##$CPDPRG3= <>
##$CPDPRG4= <mlev>
##$CPDPRG5= <mlev>
##$CPDPRG6= <mlev>
##$CPDPRG7= <mlev>
##$CPDPRG8= <mlev>
##$CPDPRGB= <>
##$CPDPRGT= <>
##$D= (0..31)
0 1 0 0 0 0 0 0 0 0.06 0 0 0 0 0 0 0.0002 0 0 0 0 0 0 0 0 0 0 0 0 0 0 
0 
##$DATE= 1145984508
##$DBL= (0..7)
120 120 120 120 120 120 120 120 
##$DBP= (0..7)
150 150 150 150 150 150 150 150 
##$DBP07= 0
##$DBPNAM0= <>
##$DBPNAM1= <>
##$DBPNAM2= <>
$$ [...]
##$SUBNAM7= <"">
##$SUBNAM8= <"">
##$SUBNAM9= <"">
##$SW= 20.6930455092707
##$SWIBOX= (0..15)
0 0 3 0 0 0 0 0 0 0 0 0 0 0 0 0 
##$SW_h= 5175.983436853
##$TD= 65536
##$TD0= 1
##$TE= 295.16
##$TE2= 300
##$TE3= 300
##$TEG= 300
##$TL= (0..7)
0 120 120 120 120 120 120 120 
##$TP= (0..7)
150 150 150 150 150 150 150 150 
##$TP07= 0
##$TPNAME0= <>
##$TPNAME1= <>
##$TPNAME2= <>
##$TPNAME3= <>
##$TPNAME4= <>
##$TPNAME5= <>
##$TPNAME6= <>
##$TPNAME7= <>
##$TPOAL= (0..7)
0.5 0.5 0.5 0.5 0.5 0.5 0.5 0.5 
##$TPOFFS= (0..7)
0 0 0 0 0 0 0 0 
##$TUNHIN= 0
##$TUNHOUT= 0
##$TUNXOUT= 0
##$USERA1= <user>
##$USERA2= <user>
##$USERA3= <user>
##$USERA4= <user>
##$USERA5= <user>
##$V9= 5
##$VALIST= <valist>
##$VCLIST= <CCCCCCCCCCCCCCC>
##$VD= 0
##$VDLIST= <DDDDDDDDDDDDDDD>
##$VPLIST= <PPPPPPPPPPPPPPP>
##$VTLIST= <TTTTTTTTTTTTTTT>
##$WBST= 1024
##$WBSW= 4
##$XGAIN= (0..3)
0 0 0 0 
##$XL= 0
##$YL= 0
##$YMAX_a= 286578
##$YMIN_a= -332251
##$ZGOPTNS= <>
##$ZL1= 120
##$ZL2= 120
##$ZL3= 120
##$ZL4= 120
##$ABSF1= 16.4493
##$ABSF2= -4.243872
##$ABSG= 5
##$ABSL= 3
##$ALPHA= 0
##$AQORDER= 0
##$ASSFAC= 0
##$ASSFACI= 0
##$ASSFACX= 0
##$ASSWID= 0
##$AUNMP= <proc_1d>
##$AZFE= 0.1
##$AZFW= 0.1
##$BCFW= 0
##$BC_mod= 0
##$BYTORDP= 0
##$COROFFS= 0
##$CY= 12.5
##$DATMOD= 1
##$DC= 0
##$DFILT= <>
##$DTYPP= 0
##$F1P= 14.0000005364418
##$F2P= -0.99999901652339
##$FCOR= 0.5
##$FTSIZE= 32768
##$FT_mod= 6
##$GAMMA= 0
##$GB= 0
##$INTBC= 1
##$INTSCL= 1
##$ISEN= 128
##$LB= 0.3
##$LEV0= 0
##$LPBIN= 0
##$MAXI= 10000
##$MC2= 0
##$MEAN= 0
##$ME_mod= 0
##$MI= 0
##$NCOEF= 0
##$NC_proc= -5
##$NLEV= 6
##$NOISF1= 0
##$NOISF2= 0
##$NSP= 0
##$NTH_PI= 0
##$NZP= 0
##$OFFSET= 16.4493
##$PC= 1
##$PHC0= 169.7298
##$PHC1= 8.743266
##$PH_mod= 1
##$PKNL= yes
##$PPARMOD= 0
##$PSCAL= 4
##$PSIGN= 0
##$REVERSE= no
##$SF= 250.130018181925
##$SI= 32768
##$SIGF1= 0
##$SIGF2= 0
##$SINO= 400
##$SIOLD= 32768
##$SREGLST= <1H.CDCl3>
##$SSB= 0
##$STSI= 32768
##$STSR= 0
##$SW_p= 5175.98343685301
##$SYMM= 0
##$S_DEV= 0
##$TDeff= 65536
##$TDoff= 0
##$TI= <Analysis number 999999
Compound Code 99
Book Reference 9
Project Code 9>
##$TILT= no
##$TM1= 0
##$TM2= 0
##$TOPLEV= 0
##$USERP1= <user>
##$USERP2= <user>
##$USERP3= <user>
##$USERP4= <user>
##$USERP5= <user>
##$WDW= 1
##$XDIM= 32768
##$YMAX_p= 426091482
##$YMIN_p= -839932
$$ End of Bruker specific parameters
$$ ---------------------------------
##NTUPLES= NMR SPECTRUM
##VAR_NAME=  FREQUENCY,     SPECTRUM/REAL,   SPECTRUM/IMAG
##SYMBOL=    X,             R,               I
##VAR_TYPE=  INDEPENDENT,   DEPENDENT,       DEPENDENT
##VAR_FORM=  AFFN,          ASDF,            ASDF
##VAR_DIM=   32768,         32768,           32768
##UNITS=     HZ,            ARBITRARY UNITS, ARBITRARY UNITS
##FACTOR=    0.157963299565203, 1,           1
##FIRST=     4114.46389967733, 0,            0
##LAST=      -1061.51953717568, 0,           0
##MIN=       -1061.51953717568, -839932,     0
##MAX=       4114.46389967733, 426091482,    0
$$ Real data points
##PAGE= N=1
##DATA TABLE= (X++(R..R)), XYDATA
$$ [...]
$$ plain form
18022 6373412 6394026 6210695 5978063 5891957 5803665 5659618 5733859 5795014 5535857 5616646
18012 5616646 5421758 5097303 4948778 4836630 4661257 4606629 4554885 4462142 4408910 4399668
18002 4399668 4377251 4065727 4036590 4171045 4150493 3919092 3964792 4072410 3850685 3779442
17992 3779442 3923174 3894982 3819237 3578633 3295754 3340244 3637141 3590963 3453759 3392181
17982 3392181 3342804 3412741 3803055 4111210 4135065 4138949 3881484 3679888 3603516 3309843
17972 3309843 3284644 3184756 2959661 2838176 2728851 2827701 2878586 2903166 2759555 2716278
17962 2716278 2592360 2707562 2783984 2692718 2503029 2374008 2436496 2543944 2517058 2415957
17952 2415957 2408806 2157068 1976043 1879646 1962695 2096921 1918361 1567500 1549907 1652086
$$ packed form
18022F373412K0614j83331k32632q6106q8292j44047P4241O1155k59157Q0789
18012E616646j94888l24455j48525j12148j75373n4628n1744r2743n3232r242
18002D399668k2417l11524k9137J34455k0552k31401M5700J07618k21725p1243
17992C779442J43732k8192p5745k40604k82879M4490K96897m6178j37204o1578
17982C392181m9377O9937L90314L08155K3855L884k57465k01596p6372k93673
17972C309843k5199r9888k25095j21485j09325R8850N0885K4580j43611m3277
17962B716278j23918J15202P6422r1266j89689j29021O2488J07448k6886j01101
17952B415957p151k51738j81025r6397Q3049J34226j78560l50861j7593J02179
$$ plain form
17942 1652086 1651782 1611239 1813334 1974714 1967593 1730017 1658397 1485737 1312523 1268972 1596501
17931 1596501 1664299 1868400 1747988 1919752 2035225 2065355 1795807 1503378 1454784 1617948
17921 1617948 1571147 1542245 1449658 1336766 976695 839880 786644 834337 1134006 1149192
17911 1149192 1186857 1252498 1176526 1073283 1024274 1067199 1210465 1340539 1266128 1079040
17901 1079040 1091289 907437 603602 441230 767288 855213 807158 1081805 1232803 1042180
17891 1042180 846605 894500 942451 885455 778337 849646 964485 915467 1043488 1139909
17881 1139909 1077861 1061024 912223 846434 907828 705057 476605 238176 332303 502259
17871 502259 699977 795718 749258 527326 697858 639598 592276 796132 804933 843870 812661
$$ packed form
17942A652086l04m0543K02095J61380p121k37576p1620j72660j73214m3551L27529
17931A596501O7798K04101j20412J71764J15473L0130k69548k92429m8594J63164
17921A617948m6801k8902r2587j12892l60071j36815n3236M7693K99669J5186
17911A149192L7665O5641p5972j03243m9009M2925J43266J30074p4411j87088
17901A079040J2249j83852l03835j62372L26058Q7925m8055K74647J50998j90623
17891A042180j95575M7895M7951n6996j07118P1309J14839m9018J28021R6421
17881A139909o2048j6837j48801o5789O1394k02771k28452k38429R4127J69956
17871E02259J97718R5741m6460k21932J70532n8260m7322K03856Q801L8937l1209
$$ plain form
17860 812661 676344 859010 823644 778949 876402 617781 660680 403574 361311 539976
17850 539976 783311 715923 525795 526095 326582 128142 353010 689182 906371 867108
17840 867108 574688 480409 416792 584251 462010 476102 706380 799515 807578 903409 1030222
17829 1030222 1103810 1201616 1112543 993762 1025909 891823 365702 165583 61007 171675
17819 171675 281736 275983 385617 554491 351230 82283 267786 399503 421535 489096
17809 489096 477520 587307 799791 593059 438708 251980 47571 191100 312786 191326
17799 191326 169997 431724 603370 633466 585292 674482 744466 973417 1111797 1094188 908237
17788 908237 611386 517719 578683 473399 383739 460172 343712 286375 340713 368658 309519
$$ packed form
17860H12661j36317J82666l5366m4695R7453k58621M2899k57106m2263J78665
17850E39976K43335o7388j90128L00j99513j98440K24868L36172K17189l9263
17840H67108k92420r4279o3617J67459j22241J4092K30278R3135Q063R5831J26813
17829A030222P3588R7806q9073j18781L2147j34086n26121k00119j04576J10668
17819A71675J10061n753J09634J68874k03261k68947J85503J31717K2032O7561
17809D89096j1576J09787K12484k06732j54351j86728k04409J43529J21686j21460
17799A91326k1329K61727J71646L0096m8174Q9190O9984K28951J38380j7609j85951
17788I08237k96851r3667O0964j05284q9660P6433j16460n7337N4338K7945n9139
$$ plain form
17777 309519 379476 405621 417054 374501 365475 409286 488840 396603 365605 370899 219103 39330
17765 39330 -191704 -209777 -34806 63972 138937 329901 150323 94819 194738 142181 -98903
17754 -98903 -154248 -134757 -99974 51963 44162 30692 221784 246600 161663 225029 1044
17743 1044 -140284 -169401 -13051 -232379 -254517 -18873 235102 268645 198832 16348 25722
17732 25722 -90269 3709 255480 431731 335453 210301 160434 -61452 -175692 -104976
17722 -104976 -15560 172245 212402 153133 332145 733705 911550 748148 640587 406980
17712 406980 326518 524313 635861 850558 735851 501111 738612 682605 612056 520846
17702 520846 488151 616815 610848 616838 504248 266667 5164 -151871 -116037 -124309 -119936
$$ packed form
17777C09519O9957K6145J1433m2553r026M3811P9554r2237l0998N294j51796j79773
17765C9330k31034j8073J74971R8778P4965J90964j79578n5504R9919n2557k41084
17754i8903n5345J9491L4783J51937p801j3470J91092K4816q4937O3366k23985
17743A044j41328k9117J56350k19328k2138K35644K53975L3543o9813j82484R374
17732B5722j15991R3978K51771J76251r6278j25152m9867k21886j14240P0716
17722a04976Q9416J87805M0157n9269J79012M01560J77845j63402j07561k33607
17712D06980q0462J97795J11548K14697j14707k34740K37501n6007p0549r1210
17702E20846l2695J28664n967N990j12590k37581k61503j57035L5834q272M373
$$ plain form
17691 -119936 -255415 -124410 109371 268214 238495 181750 -50074 8619 251701 380768
17681 380768 343111 407964 553391 514217 604291 781574 945131 1147952 1178395 1121185 1130062
17670 1130062 984235 1105726 1045641 1009865 1093100 971218 962453 1068269 1207336 1176975
17660 1176975 868015 920352 1016438 1087512 1006528 682722 507618 363239 364962 709776
17650 709776 635246 474034 312384 493996 602666 581400 543653 366924 433047 483453
17640 483453 436542 492004 562288 352031 601830 921632 965650 1143606 801085 332345
17630 332345 169810 120536 148055 -68698 -15248 185561 462978 503299 469278 326389
17620 326389 142739 122974 194901 222377 302598 249333 257183 394928 297020 216745 351612
$$ packed form
17691a19936j35479J31005K33781J58843k9719n6745k31824N8693K43082J29067
17681C80768l7657O4853J45427l9174R0074J77283J63557K02821L0443n7210Q877
17670A130062j45827J21491o0085l5776Q3235j21882q765J05816J39067l0361
17660A176975l08960N2337R6086P1074q0984l23806j75104j44379J723L44814
17650G09776p4530j61212j61650J81612J08670k1266l7747j76729O6123N0406
17640D83453m6911N5462P0284k10257K49799L19802M4018J77956l42521m68740
17630C32345j62535m9274K7519k16753N3450K00809K77417M0321l4021j42889
17620C26389j83650j9765P1927K7476Q0221n3265P850J37745r7908q0275J34867
$$ plain form
17609 351612 317498 145422 -1143 -249293 -534061 -455447 84794 12010 -85875 -229514
17599 -229514 -128966 179179 383494 250931 278979 618660 536182 341176 182415 195701
17589 195701 346367 203797 6261 173151 316356 117766 10164 86803 11507 109905
17579 109905 188046 297304 314778 318011 446773 204558 88384 93362 226552 267595 26420
17568 26420 -339808 -259689 -56061 -44899 49796 109913 99972 176371 346159 316894 339757
17557 339757 76713 135100 159961 218546 293858 383402 538852 548181 459620 255899 63477
17546 63477 126608 211512 80701 106314 443786 458521 276977 337767 506478 452859 265286
17535 265286 318126 309906 346885 303499 98626 208124 330018 57595 -156395 -155475 -76662
$$ packed form
17609C51612l4114j72076j46565k48150k84768P8614N40241p2784r7885j43639
17599b29514J00548L08145K04315j32563K8048L39681q2478j95006j58761J3286
17589A95701J50666j42570j97536J66890J43205j98590j07602P6639p5296R8398
17579A09905P8141J09258J7474L233J28762k42215j16174M978J33190M1043k41175
17568B6420l66228Q0119K03628J1162R4695O0117r941P6399J69788k9265K2863
17557C39757k63044N8387K4861N8585P5312Q9544J55450R329q8561k03721j92422
17546F3477O3131Q4904j30811K5613L37472J4735j81544O0790J68711n3619j87573
17535B65286N2840q220L6979m3386k04873J09498J21894k72423k13990R20P8813
$$ plain form
17524 -76662 -200515 -100727 192159 -63027 -345186 -308886 -85782 -78603 -32543 174243 245459
17513 245459 188208 143566 174700 409800 250052 33 -67002 221529 564799 341455
17503 341455 215467 318462 255470 263970 299085 283250 182529 183287 166478 237884 372210
17492 372210 293439 93019 -110054 -8381 -94569 -103444 150134 219877 151163 234002 86774
17481 86774 -108020 -126509 -277259 -355453 -218961 -134869 -271787 -165133 31595 40974 325069
17470 325069 377235 155838 -70025 117672 238252 267077 187806 151091 -204609 -169997
17460 -169997 -52443 125323 291561 399998 584957 187035 141001 28908 -189247 -363050
17450 -363050 -360592 -93888 114640 245503 180131 -34888 -67245 311308 842743 1075295
$$ packed form
17524g6662j23853R9788K92886k55186k82159L6300K23104P179M6060K06786P1216
17513B45459n7251m4642L1134K35100j59748k50019o7035K88531L43270k23344
17503C41455j25988J02995o2992Q500L5115j5835j00721P58j6809P1406J34326
17492C72210p8771k00420k03073J01673q6188q875K53578O9743o8714Q2839j47228
17481H6774j94794j8489j50750p8194J36492Q4092j36918J06654J96728R379K84095
17470C25069N2166k21397k25863J87697J20580K8825p9271l6715l55700L4612
17460a69997J17554J77766J66238J08437J84959l97922m6034j12093k18155j73803
17450c63050K458K66704K08528J30863o5372k15019l2357L78553N31435K32552
$$ plain form
17440 1075295 1300969 1629230 1678970 1094092 401408 308983 84019 141230 226381 20187
17430 20187 63645 130774 66641 -44162 -37866 -151675 -37401 -35031 -294813 -421240 -541948
17419 -541948 -458428 -92631 23196 15751 -223348 -362319 -27016 93856 92295 -12702
17409 -12702 -128764 -188090 -151224 47934 333383 146625 74716 -212270 -237432 -213083 -375900
17398 -375900 -233596 -136144 -219759 36778 40426 -1980 88991 -5069 77519 107087 142357
17387 142357 150014 203293 218877 180826 254325 100279 21878 81865 55907 16511 -112090
17376 -112090 -86500 143330 222560 93381 -34925 -55180 58987 90363 188317 122924 -111164
17365 -111164 52602 58185 46582 113280 182641 531586 525544 498999 629923 655871 421415
$$ packed form
17440A075295K25674L28261M9740n84878o92684r2425k24964N7211Q5151k06194
17430B0187M3458O7129o4133j10803O296j13809J14274K370k59782j26427j20708
17419e41948Q3520L65797J15827p445k39099j38971L35303J20872j561j04997
17409a2702j16062n9326L6866J99158K85449j86758p1909k86986k5162K4349j62817
17398c75900J42304R7452q3615K56537L648m2406R0971r4060Q2588K9568L5270
17387A42357P657N3279J5584l8051P3499j54046p8401N9987k5958l9396j28601
17376a12090K5590K29830P9230j29179j28306k0255J14167L1376R7954o5393k34088
17365a11164J63766N583j1603O6698O9361L48945o042k6545J30924K5948k34456
$$ plain form
17354 421415 179874 347415 318733 18329 -174307 -126697 30816 11402 64232 110860
17344 110860 122738 302441 506850 552911 281711 46673 -96125 -137431 -108018 53895
17334 53895 122493 226860 159213 9799 183308 354195 266727 156926 209204 232448 59716
17323 59716 -87724 -113208 237993 416392 443872 319186 74576 33830 72059 -46815
17313 -46815 172628 202701 81764 -27866 -138787 -281110 -189098 -7917 -50404 -47735 6371
17302 6371 181940 203671 1402 -65319 -28691 237946 437255 576592 412829 164254
17292 164254 111303 13515 -162361 -193942 -71400 155730 223367 353323 225939 272827
17282 272827 102628 -20546 100174 30610 -44306 -191750 -106347 197418 300984 217128
$$ packed form
17354D21415k41541J67541k8682l00404j92636M7610J57513j9414N2830M6628
17344A10860J1878J79703K04409M6061k71200k35038j42798m1306K9413J61913
17334E3895O8598J04367o7647j49414J73509J70887q7468j09801N2278K3244j72732
17323E9716j47440k5484L51201J78399K7480j24686k44610m0746L8229j18874
17313d6815K19443L0073j20937j09630j10921j42323R2012J81181m2487K669N4106
17302F371J75569K1731k02269o6721L6628K66637J99309J39337j63763k48575
17292A64254n2951r7788j75876l1581J22542K27130O7637J29956j27384M6888
17282B72827j70199j23174J20720o9564p4916j47444Q5403L03765J03566q3856
$$ plain form
17272 217128 136928 96315 -218615 -258788 44242 167674 388499 688472 511024 350610
17262 350610 122294 183363 191280 143174 132228 402817 663546 493460 352762 161315
17252 161315 203870 291606 47152 29930 -13608 -29192 -52219 -177948 -38231 96821 270106
17241 270106 115036 -115969 -283686 -234016 -130549 -266293 -331218 -171695 -182973 -42335
17231 -42335 113551 -78069 -137420 -99731 -76227 -68073 -72894 -5474 61921 188178 209099
17220 209099 -84060 -164647 -291839 -184983 -263571 -49230 134277 104560 23511 4806
17210 4806 68837 -17250 -76907 -94743 -103433 -31792 -199839 15425 -40754 -100360 -189665 -310177
17198 -310177 -308974 -139081 -238049 -320894 -196802 -58941 -205549 -217971 -229185 -356615 -296341
$$ packed form
17272B17128q0200m0613l14930m0173L03030J23432K20825K99973j77448j60414
17262C50610k28316O1069P917m8106j0946K70589K60729j70086j40698j91447
17252A61315M2555Q7736k44454j7222m3538j5584k3027j25729J39717J35052J73285
17241B70106j55070k31005j67717M9670J03467j35744o4925J59523j1278J40638
17231d2335J55886j91620n9351L7689K3504Q154m821O7420O7395J26257K0921
17220B09099k93159q0587j27192J06856p8588K14341J83507k9717q1049j8705
17210D806O4031q6087n9657j7836q690P1641j68047K15264n6179n9606q9305j20512
17198c10177J203J69893r8968q2845J24092J37861j46608j2422j1214j27430O0274
$$ plain form
17187 -296341 -17485 -63396 -110063 -267896 -220271 -241890 -392675 -386818 -231307 -257298 -126822
17176 -126822 -230977 -314155 -330692 -318464 -374962 -212144 -465340 -513127 -317648 -185047
17166 -185047 157607 443987 170729 -223364 -280052 -249948 -161565 -102280 -91318 -71841 -23451
17155 -23451 316432 509836 448156 358259 296154 185028 -33000 -113202 8019 -97766
17145 -97766 131741 398782 427637 634748 646398 426971 88077 -94924 68981 60087
17135 60087 -186160 -155607 -74758 -128065 -150210 -230810 -377614 -201966 -144296 -205096 -389934
17124 -389934 -346127 6835 369588 258042 -60879 -163572 -228487 -296093 -233203 -55287
17114 -55287 -92389 -194556 65422 160763 140430 -8934 -89688 34523 77897 -99584 -235069
$$ packed form
17187b96341K78856m5911m6667j57833M7625k1619j50785N857J55511k5991J30476
17176a26822j04155q3178j6537J2228n6498J62818k53196m7787J95479J32601
17166a85047L42654K86380k73258l94093n6688L0104Q8383N9285J0962J9477M8390
17155b3451L39883J93404o1680q9897o2105j11126k18028q0202J21221j05785
17145i7766K29507K67041K8855K07111J1650k19427l38894j83001J63905q894
17135F0087k46247L0553Q0849n3307k2145q0600j46804J75648N7670o0800j84838
17124c89934M3807L52962L62753j11546l18921j02693o4915o7606O2890J77916
17114e5287l7102j02167K59978R5341k0333j49364q0754J24211M3374j77481j35485
$$ plain form
17103 -235069 -216578 -214052 -326502 -260635 -249042 -410986 -585852 -585196 -362104 -187868 -43334
17092 -43334 61847 -218696 -167106 -40349 -52428 -32906 195703 353520 445436 385158 194601
17081 194601 -50830 7630 161917 201480 -96762 -116564 92659 235387 415188 246497
17071 246497 -54172 -117428 -52779 -76911 -121513 -263651 -92015 -23710 -93973 60402 204900
17060 204900 268341 205963 24926 166832 299882 259506 195093 177577 20303 -130960
17050 -130960 -73814 -278940 -233867 -353037 -130207 218072 436767 452684 508710 544546
17040 544546 619284 575056 278015 13214 -59011 127677 34928 -152176 -276857 -150505
17030 -150505 98792 184283 22650 162736 464542 567067 474731 263732 274395 112937
$$ packed form
17103b35069J8491K526j12450O5867J1593j61944j74866O56K23092J74236J44534
17092d3334J05181k80543N1590J26757j2079J9522K28609J57817R1916o0278j90557
17081A94601k45431N8460J54287L9563k98242j9802K09223J42728J79801j68691
17071B46497l00669o3256O4649k4132m4602j42138J71636O8305p0263J54375J44498
17060B04900O3441o2378j81037J41906J33050m0376o4413j7516j57274j51263
17050a30960N7146k05126M5073j19170K22830L48279K18695J5917N6026L5836
17040E44546P4738m4228k97041k64801p2225J86688r2749j87104j24681J26352
17030a50505K49297Q5491j61633J40086L01806J02525r2336k10999J0663j61458
$$ plain form
17020 112937 42824 293414 420057 409729 15212 -180788 26652 -24267 -119316 72665
17010 72665 71828 -238190 -85041 58229 64090 -112082 27972 157746 319729 183620 161967
16999 161967 130860 19178 22470 14679 -70557 -50240 58122 143182 2405 -57533 -68107
16988 -68107 105415 149701 267138 238329 141397 16788 162157 228827 75548 -143204
16978 -143204 -302370 -338266 -429313 -368168 -143750 49094 89328 65881 -1497 -28470 -55738
16967 -55738 74519 267068 248271 7980 -317785 -390037 -250511 -316974 -100368 132500
16957 132500 99553 214961 141155 -122610 -319007 -369259 -362659 -397749 -560758 -544278 -463286
16946 -463286 -482615 -300792 -148290 -12417 95930 289071 286661 198836 164538 -11181
$$ packed form
17020A12937p0113K50590J26643j0328l94517j96000K07440n0919r5049J91981
17010G2665q37l10018J53149J43270N861j76172J40054J29774J61983j36109k1653
16999A61967l1107j11682L292p791q5236K0317J08362Q5060j40777n9938j0574
16988f8107J73522M4286J17437k8809r6932j24609J45369O6670j53279k18752
16978a43204j59166l5896r1047O1145K24418J92844M0234k3447o7378k6973k7268
16967e5738J30257J92549j8797k40291l25765p2252J39526o6463K16606K32868
16957A32500l2947J15408p3806k63765j96397n0252O600l5090j63009J6480Q0992
16946d63286j9329J81823J52502J35873J08347J93141k410q7825l4298j75719
$$ plain form
16936 -11181 -68440 -173294 -437602 -356702 -252492 -265080 -438616 -102537 104813 155473
16926 155473 -84064 -383466 -243804 -201991 -460426 -360937 -26158 -116343 -268987 -97457
16916 -97457 -64217 -114226 -182257 -163718 50173 -202630 -197799 -123433 -50645 -157334 -225258
16905 -225258 -289184 -368244 -240836 29169 3300 -108480 -152470 -89408 -107996 84393 41607
16894 41607 215502 291277 288652 242883 148374 -126385 -210389 -7281 91586 -96092 -178114
16883 -178114 -147136 -186356 -74692 -119029 -217089 24425 202078 195881 80479 226550 397466
16872 397466 243076 171211 -43302 -209856 -265903 -227794 25279 225469 182669 77432
16862 77432 202354 173534 12805 -65577 -92810 65715 62115 157640 68980 -145362 32869
$$ packed form
16936a1181n7259j04854k64308Q0900J04210j2588j73536L36079K07350N0660
16926A55473k39537k99402J39662M1813k58435R9489L34779r0185j52644J71530
16916i7457L3240n0009o8031J8539K13891k52803M831P4366P2788j06689o7924
16905b25258o3926p9060J27408K70005k5869j11780m3990O3062j8588J92389m2786
16894D1607J73895P5775k625m5769r4509k74759q4004K03108R8867j87678q2022
16883a78114L0978l9220J11664m4337r8060K41514J77653o197j15402J46071J70916
16872C97466j54390p1865k14513j66554n6047L8109K53073K00190m2800j05237
16862G7432J24922k8820j60729p8382k7233J58525l600R5525q8660k14342J78231
$$ plain form
16851 32869 390847 320618 319969 341155 408185 252321 47682 -27984 -200248 -155856 -108625
16840 -108625 117449 58372 -72273 -155718 -46449 208418 48441 -19580 91208 127005
16830 127005 234838 12181 -239880 -387158 -604430 -708059 -644495 -610705 -478568 -394136
16820 -394136 -228621 -156361 -43413 285582 519699 477755 477639 516598 145580 238535 99359
16809 99359 73110 146604 60938 -31910 81136 23789 -112780 -128704 10782 -131864 -186402
16798 -186402 -21205 101479 -11090 -185339 -395461 -241474 -373054 -375903 -154214 -244993
16788 -244993 -698041 -687884 -125166 32332 -222018 -224334 -160308 -205037 -384475 -409911 -408687
16777 -408687 -247929 124620 117835 -78193 -48697 26199 -82974 26247 -189543 -448818
$$ packed form
16851C2869L57978p0229o49K1186O7030j55864k04639p5666j72264M4392M7231
16840a08625K26074n9077j30645q3445J09269K54867j59977o8021J10788L5797
16830A27005J07833k22657k52061j47278k17272j03629O3564L3790J32137Q4432
16820c94136J65515P2260J12948L28995K34117m1944j16L8959l71018R2955j39176
16809I9359k6249P3494q5666r2848J13046n7347j36569j5924J39486j42646n4538
16798a86402J65197J22684j12569j74249k10122J53987j31580k849K21689r0779
16788b44993m53048J0157N62718J57498k54350k316O4026m4729j79438k5436J224
16777d08687J60758L72549o785j96028K9496P4896j09173J09221k15790k59275
$$ plain form
16767 -448818 -591632 -552361 -223505 26648 -126524 -194922 -129295 -2025 75284 -73939
16757 -73939 -198084 -190545 -282200 -15206 -15167 -56358 -3169 14472 -83646 -33465 -24233 36460
16745 36460 -67691 -94770 -31271 -116825 -258223 -212700 -163380 -69883 137459 297530 253824
16734 253824 148645 201621 173531 8179 -98009 -120016 -318254 -425381 -362909 -392667
16724 -392667 -465815 -424547 -346443 -333703 -292125 -231774 -75800 48232 105623 93083 -20595
16713 -20595 -167200 -156413 -79087 -80665 -272476 -596934 -447125 -181122 -90716 -100868 -140524
16702 -140524 -14202 357763 625992 734134 548396 278761 41278 -13525 -71850 -162025
16692 -162025 62415 76413 -45748 -284023 -245213 -18627 38305 -335001 -352685 11622
$$ packed form
16767d48818j42814L9271L28856K50153j53172o8398O5627J27270P7309j49223
16757g3939j24145P539r1655K66994L9m1191N3189J7641r8118N0181R232O0693
16745C6460j04151k7079O3499q5554j41398M5523M9320R3497K07342J60071m3706
16734B53824j05179N2976k8090j65352j06188k2007j98238j07127O2472k9758
16724c92667p3148M1268P8104J2740M1578O0351J55974J24032N7391j2540j13678
16713b0595j46605J0787P7326j578j91811l24458J49809K66003R0406j0152l9656
16702a40524J26322L71965K68229J08142j85738k69635k37483n4803n8325r0175
16692a62025K24440J3998j22161k38275L8810K26586N6932l73306j7684L64307
$$ plain form
16682 11622 179216 261968 219816 66883 -62138 -110481 -278974 -262406 -59569 -93637 31796
16671 31796 -117605 -121897 122289 345046 237605 36020 -39473 72196 -157267 -4108
16661 -4108 85059 325845 473244 272974 54998 4557 68804 -104426 -85789 -136592 79611
16650 79611 -8733 55899 -100477 -71734 -68958 -159784 -92408 308550 261450 -74554 -164939
16639 -164939 145231 151260 -61602 27777 90211 125705 64784 218149 254172 61915 -54888
16628 -54888 26017 -51743 -70126 43145 -41492 -66306 42039 72682 -106261 -237253 -215570
16617 -215570 -222905 -143353 -98217 -4493 211835 229756 145263 180727 126925 10502 -244089
16606 -244089 -132280 -155994 -141427 -27028 67437 -198479 -329715 -194570 -439097 -526427
$$ packed form
16682A1622J67594Q2752m2152j52933j29021m8343j68493J6568K02837l4068J25433
16671C1796j49401m292K44186K22757j07441k01585p5493J11669k29463J53159
16661d108Q9167K40786J47399k00270k17976n0441O4247j73230J8637n0803K16203
16650G9611q8344O4632j56376K8743K776r0826O7376M00958m7100l36004r0385
16639a64939L10170O029k12862Q9379O2434L5494o0921J53365L6023j92257j16803
16628e4888Q0905p7760j8383J13271q4637k4814J08345L0643j78943j30992K1683
16617b15570p335P9552M5136R3724K16328J7921q4493L5464n3802j16423k54591
16606b44089J11809k3714J4567J14399R4465k65916j31236J35145k44527q7330
$$ plain form
16596 -526427 -375283 -220604 -460805 -349962 -447276 -373928 -345489 -516776 -548115 -415736
16586 -415736 -151160 50236 128485 100138 -87336 -54654 -109656 -154900 -208635 -90985 -47782
16575 -47782 76138 278162 593222 613428 413674 109262 64013 -82649 -208159 -322909
16565 -322909 -501430 -422829 -144518 -254291 -350630 -356441 -104059 -15510 -164485 31467
16555 31467 321911 500505 349002 297630 5671 -172598 176811 124287 50810 42901 -7981
16544 -7981 -63272 -67463 -116311 -28183 -258818 -351426 -280424 61512 97639 -156894 -484281
16533 -484281 -627561 -425402 -517046 -431176 -321370 -90079 138661 345138 189702 56875
16523 56875 -181089 -319858 -261132 -11896 -267563 -456184 -413564 -203054 -262306 -64030
$$ packed form
16596e26427J51144J54679k40201J10843r7314P3348K8439j71287l1339J32379
16586d15736K64576K01396P8249k8347j87474L2682n5002m5244n3735J17650M3203
16575d7782J23920K02024L15060K0206j99754l04412m5249j46662j25510j14750
16565c22909j78521P8601K78311j09773r6339n811K52382Q8549j48975J95952
16555C1467K90444J78594j51503n1372k91959j78269L49409n2524p3477p909n0882
16544g981n5291m191m8848Q8128k30635r2608P1002L41936L6127k54533l27387
16533d84281j43280K02159r1644Q5870J09806K31291K28740K06477j55436j32827
16523E6875k37964j38769N8726K49236k55667j88621M2620K10510n9252J98276
$$ plain form
16513 -64030 -61861 -108440 -84772 235880 310575 185922 13350 161743 72479 112751 370881
16502 370881 432889 373329 315950 410716 284285 -83167 -406982 -456627 -184115 146200
16492 146200 173174 71362 64832 34898 183944 23035 -18789 182302 83495 39468 102780
16481 102780 126544 329684 279950 115060 -106653 -62500 -174614 -227395 44091 63788
16471 63788 -38508 16330 -62283 -90586 -275258 -247789 -155123 -243752 -73781 167912 -166327
16460 -166327 -388104 -221995 7333 132694 -25136 -158924 -57576 96114 -56901 -266700
16450 -266700 -149752 51114 34049 -36938 14639 5732 -147261 -134114 -243242 -51271 251147
16439 251147 231840 127385 189663 367015 228002 336734 335631 83373 -117365 101148
$$ packed form
16513f4030K169m6579K3668L20652P4695j24653j72572J48393q9264M0272K58130
16502C70881O2008n9560n7379R4766j26431l67452l23815m9645K72512L30315
16492A46200K6974j01812o530k9934J49046j60909m1824K01091r8807m4027O3312
16481A02780K3764K03140m9734j64890k21713M4153j12114n2781K71486J9697
16471F3788j02296N4838p8613k8303j84672K7469R2666q8629J69971K41693l34239
16460a66327k21777J66109K29328J25361j57830j33788J01348J53690j53015k09799
16450b66700J16948K00866j7065p0987N1577q907j52993J3147j09128J91971L02418
16439B51147j9307j04455O2278J77352j39013J08732j103k52258k00738K18513
$$ plain form
16429 101148 56529 -10657 65905 213181 -19313 -112564 -84620 -35630 -92943 -28185 -27592
16418 -27592 -150837 -169846 -191792 -203952 -100306 9596 -127270 -62341 -56686 -335981 -523482
16407 -523482 -370751 -189254 -164262 -376603 -176046 -118877 -236137 -525851 -566937 -218187
16397 -218187 24524 -85429 -87422 -100672 -102649 -100487 -381273 -331860 -137648 29807 58979
16386 58979 -64593 -228683 -212427 -7593 170155 97552 -18311 -215985 -333801 -135477
16376 -135477 -31008 178448 123762 -32461 -134738 -142629 -204644 -295606 -223098 -22335 184844
16365 184844 96185 11010 -26069 92378 174331 19759 -361391 -470513 -217125 -111616
16355 -111616 -96434 -226252 -173310 -11629 105501 28735 212984 177414 72943 -133543
$$ packed form
16429A01148m4619o7186P6562J47276k32494r3251K7944M8990n7313O4758N93
16418b7592j23245j9009k1946j2160J03646J09902j36866O4929N655k79295j87501
16407e23482J52731J81497K4992k12341K00557N7169j17260k89714m1086L48750
16397b18187K42711j09953j993j3250j977K162k80786M9413J94212J67455K9172
16386E8979j23572j64090J6256K04834J77748p2603j15863j97674j17816J98324
16376a35477J04469K09456n4686j56223j02277p891o2015r0962P2508K00763K07179
16365A84844q8659q5175l7079J18447Q1953j54572l81150j09122K53388J05509
16355a11616J5182j29818N2942J61681J17130p6766J84249l5570j04471k06486
$$ plain form
16345 -133543 -362210 -454976 -334402 -19115 41055 -95172 -179688 -287359 -147020 -174983
16335 -174983 -179879 -223828 -281989 -117773 -51366 -102872 -174753 -173333 -196687 -333121 -606785
16324 -606785 -420547 -5061 -197264 116 193946 117617 -66592 93989 18612 -56129
16314 -56129 189493 77977 -57733 -241414 9556 -163633 -239970 -228177 -80858 101333
16304 101333 226060 50471 85056 -14518 -246917 -404112 -259384 -53993 -102907 -300659
16294 -300659 -493585 -619077 -142594 -28080 -57797 -86135 -76893 -57598 -47149 -10431 8760
16283 8760 -23372 -94222 11368 6488 -107877 -101918 -143524 -75857 93827 129974 227161 -25903
16271 -25903 -116243 -44105 18252 -106976 166061 233813 184211 189350 121067 -42287 12841
$$ packed form
16345a33543k28667r2766J20574L15287O0170j36227q4516j07671J40339k7963
16335a74983m896m3949n8161J64216O6407n1506p1881J420k3354j36434k73664
16324f06785J86238M15486j92203J97380J93830p6329j84209J60581p5377p4741
16314e6129K45622j11516j35710j83681K50970j73189p6337J1793J47319J82191
16304A01333J24727j75589L4585r9574k32399j57195J44728K05391m8914j97752
16294c00659j92926j25492M76483J14514k9717k8338R242J9295J0449L6718J9191
16283H760l2132p0850J05590m880j14365N959m1606O7667J69684L6147R7187k53064
16271b5903r0340P2138O2357j25228K73037O7752m9602N139o8283j63354N5128
$$ plain form
16260 12841 43483 -113541 -100881 -533165 -733032 -553684 -398176 -61315 39896 -107411
16250 -107411 -265016 -183546 126494 254037 162532 -281702 -454653 -700624 -430180 -153944
16240 -153944 -62827 -245041 -333385 -60238 -46203 -85833 -98659 -353664 -344156 -88233 -189486
16229 -189486 -318840 -443472 -466150 -291556 -400413 -355421 174 -15083 -153173 20148
16219 20148 -110273 61936 130781 -50603 -153738 -235302 -234528 678 301228 271440 234796
16208 234796 323202 228371 -34683 -81117 136299 147417 -181006 -317469 -159682 -15601
16198 -15601 -221632 -171196 -58569 -45950 -105911 -229150 -95102 19838 -13519 15207 140213
16187 140213 5449 -107243 -106861 -104972 -58184 28870 -130946 -347527 -548473 -514907 -293678
$$ packed form
16260A2841L0642j57024J2660m32284j99867J79348J55508L36861J01211j47307
16250a07411j57605Q1470L10040J27543r1505m44234j72951k45971K70444K76236
16240a53944R1117j82214q8344K73147J4035l9630j2826k55005R508K55923j01253
16229a89486j29354j24632k2678J74594j08857M4992L55595j5257j38090J73321
16219B0148j30421J72209O8845j81384j03135q1564P74K35206L00550k9788l6644
16208B34796Q8406r4831k63054m6434K17416J1118l28423j36463J57787J44081
16198a5601k06031N0436J12627J2619n9961j23239J34048J14940l3357K8726J25006
16187A40213j34764j12692L82J889M6788Q7054j59816k16581k00946L3566K21229
$$ plain form
16176 -293678 -51460 -39488 -161344 -175721 -168697 -100628 239093 437971 384249 331797 277554
16165 277554 -48352 -178790 -186040 -265511 -353035 -210616 -73091 54893 159743 412167
16155 412167 282434 34085 52892 247487 344660 252112 120069 151104 97606 27324 77608
16144 77608 145771 149628 123721 106739 217468 284108 234828 -47720 3733 70421 -48075
16133 -48075 -169193 -277003 -289832 -300118 -435935 -280531 -102343 -130460 -104195 -251818
16123 -251818 -214238 -499044 -495313 -460658 -408041 -333688 -223086 -67110 70503 237451 386604
16112 386604 251621 156680 22287 66199 74640 -84960 -249969 -340937 -169723 -89417 78764
16101 78764 181043 318447 318141 343261 238021 190128 95814 -257493 -353081 -416900 -355929
$$ packed form
16176b93678K42218J1972j21856j4377P024O8069L39721J98878n3722n2452n4243
16165B77554l25906j30438p250p9471q7524J42419J37525J27984J04850K52424
16155D12167j29733k48349J8807J94595R7173r2548j32043L1035n3498p0282N0284
16144G7608O8163L857k5907j6982J10729O6640m9280k82548N1453O6688j18496
16133d8075j21118j07810j2829j0286j35817J55404J78188k8117K6265j47623
16123b51818L7580k84806L731L4655N2617P4353J10602J55976J37613J66948J49153
16112C86604j34983r4941j34393M3912Q441j59600j65009r0968J71214Q0306J68181
16101G8764J02279J37404l06K5120j05240m7893r4314l53307r5588o3819O0971
$$ plain form
16090 -355929 -274310 -136839 59071 50815 12080 38190 194602 272150 343977 118731 -185134
16079 -185134 -328166 -144566 149704 246642 158217 115098 -22895 -167556 -291200 -382130
16069 -382130 -182299 -67829 1899 78337 242746 355085 389660 287351 193118 152288
16059 152288 -166927 -226653 -203167 75021 173855 30193 -67105 -143580 -253230 -83015
16049 -83015 53154 63405 38532 95355 243630 -40288 -258242 -26904 157866 293198
16039 293198 113990 6969 -96810 -280372 -359570 -182542 75523 64622 244 -11745
16029 -11745 -6810 200220 460782 666864 563048 630416 531626 363710 249217 260560 11809
16018 11809 -186186 -68340 -69955 -190498 -160319 -309835 -403048 -370853 -270298 1591 71864
$$ packed form
16090c55929Q1619J37471J95910q256l8735K6110J56412P7548P1827k25246l03865
16079a85134j43032J83600K94270R6938q8425m3119j37993j44661j23644r0930
16069c82130J99831J14470O9728P6438J64409J12339L4575j02309r4233m0830
16059A52288l19215n9726K3486K78188R8834j43662r7298p6475j09650J70215
16049h3015J36169J0251k4873N6823J48275k83918k17954K31338J84770J35332
16039B93198j79208j07021j03779j83562p9198J77028K58065j0901o4378j1989
16029a1745M935K07030K60562K06082j03816O7368r8790j67916j14493J1343k48751
16018A1809j97995J17846j615j20543L0179j49516r3213L2195J00555K71889P0273
$$ plain form
16007 71864 64221 146206 -22197 -153624 -118386 40167 -172743 -452986 -398780 -345317 -430009
15996 -430009 -228192 -81526 43913 114749 108426 -280773 -326926 -12096 151703 118598
15986 118598 22028 105932 60122 228754 287800 141429 52982 -49098 -85224 94154 36945
15975 36945 228165 193154 50651 105642 -16957 -108358 -32358 -119192 -233466 -100393 155087
15964 155087 -127948 -47495 123437 -24053 -69138 36189 121527 -26626 -103934 -168530
15954 -168530 -63954 -7995 -71916 -117031 -181972 22140 237252 313976 351848 299495 -113524
15943 -113524 -148735 49675 208859 282834 144851 4384 281370 392801 216430 88989
15933 88989 -67156 -168828 -80501 -72955 -330056 -524684 -438944 -233436 -140035 -82776 -17708
$$ packed form
16007G1864p643Q1985j68403j31427L5238J58553k12910k80243N4206N3463q4692
15996d30009K01817J46666J25439P0836o323l89199m6153L14830J63799l3105
15986A18598r6570Q3904m5810J68632N9046j46371q8447j02080l6126J79378n7209
15975C6945J91220l5011j42503N4991j22599r1401P6000q6834j14274J33073K55480
15964A55087k83035Q0453J70932j47490m5085J05327Q5338j48153p7308o4596
15954a68530J04576N5959o3921m5115o4941K04112K15112P6724L7872n2353m13019
15943a13524l5211J98410J59184P3975j37983j40467K76986J11431j76371j27441
15933H8989j56145j01672Q8327P546k57101j94628Q5740K05508R3401N7259O5068
$$ plain form
15922 -17708 -204553 -410194 -446055 -229926 38691 175259 44981 226866 303430 156050
15912 156050 161582 127192 68218 357502 482222 462688 506497 296261 -52616 25059 220589
15901 220589 289674 146897 106305 331981 448465 241668 106187 71293 57095 245673
15891 245673 110477 -3 -153327 -132699 -46230 1927 -14484 -15220 94017 153453 87342
15880 87342 -27779 63367 124677 -42300 -217544 -79421 134007 239640 108338 198309
15870 198309 251657 157037 -106417 -122398 32419 -25994 40342 22290 -59078 -85881 -128940
15859 -128940 10431 195111 303831 240534 255505 420612 433263 411266 242707 330679
15849 330679 261009 43812 -12624 -217789 -374271 -391917 -463488 -458946 -355183 -160143 -69435
$$ packed form
15922a7708j86845k05641l5861K16129K68617J36568j30278J81885P6564j47380
15912A56050N532l4390n8974K89284J24720j9534M3809k10236l48877P7675J95530
15901B20589O9085j42777m0592K25676J16484k06797j35481l4894j4198J88578
15891B45673j35196j10480j53324K0628Q6469M8157j6411p36J09237N9436o6111
15880H7342j15121R1146O1310j66977j75244J38123K13428J05633j31302Q9971
15870A98309N3348r4620k63454j5981J54817n8413O6336j8052q1368k6803m3059
15859a28940J39371J84680J08720o3297J4971J65107J2651k1997j68559Q7972
15849C30679o9670k17197n6436k05165j56482j7646p1571M542J03763J95040R0708
$$ plain form
15838 -69435 -111673 -98197 -258619 -243884 -88619 35167 -22074 -84064 -98929 2212 238759
15827 238759 382661 276574 243736 155109 39676 47453 138032 319471 183831 164572 268731
15816 268731 174228 163062 153317 -41063 52974 176423 121194 104517 33794 -57110 -83489
15805 -83489 -132371 -36501 5656 56615 -3702 30958 283604 129138 -15087 -23128 -79646
15794 -79646 -34513 -73442 -214010 -255959 -220040 -159736 -69293 119262 73159 -61184 -273795
15783 -273795 -354717 -208097 -384832 -432725 -397991 -196241 -136730 -143218 -188187 148226 261381
15772 261381 160940 74167 420945 418492 219081 226204 109257 116312 28054 -13533 -43234
15761 -43234 -116457 -18298 196865 319492 258698 217728 124587 109991 -60792 -43118 -85231
$$ packed form
15838f9435m2238J3476j60422J4735J55265J23786n7241o1990j4865J01141K36547
15827B38759J43902j06087l2838q8627j15433P777R0579J81439j35640j9259J04159
15816B68731r4503j1166r745j94380R4037J23449n5229j6677p0723r0904k6379
15805h3489m8882R5870M2157N0959o0317L4660K52646j54466j44225q041n6518
15794g9646M5133l8929j40568m1949L5919O0304R0443J88555m6103j34343k12611
15783b73795q0922J46620j76735m7893L4734K01750N9511o488m4969L36413J13155
15772B61381j00441q6773L46778k453j99411P123j16947P055q8258m1587k9701
15761d3234p3223R8159K15163J22627o0794m0970r3141j4596j70783J7674m2113
$$ plain form
15750 -85231 -104577 -34343 -72473 -10721 280616 514075 431552 335022 355755 416725 360072
15739 360072 180330 211004 193156 100403 -146198 -289054 -465975 -288826 -88704 -35008
15729 -35008 -97558 -26828 -643 -139235 -329909 -234325 -130052 -145273 -135068 -134187 -208089
15718 -208089 -53363 -209847 -313018 -279222 -187211 -74592 33722 114414 151617 44580
15708 44580 -173247 -106282 -111705 -155882 -199074 -179072 -231842 -293708 -390935 -57258 121864
15697 121864 213393 201894 132244 147264 141607 51670 -215767 -24385 36697 228943 388880
15686 388880 33629 -265504 -550017 -615770 -504795 -211975 -207442 -96780 -25345 185020
15676 185020 123516 43467 119458 216521 172421 145191 -185323 -276003 -297132 -403352 -138681
$$ packed form
15750h5231j9346P0234l8130O1752K91337K33459q2523r6530K0733O0970n6653
15739C60072j79742L0674j7848r2753k46601j42856j76921J77149K00122N3696
15729c5008o2550P0730K6185j38592j90674R5584J04273j5221J0205Q81p3902
15718b08089J54726j56484j03171L3796R2011J12619J08314Q0692L7203j07037
15708D4580k17827O6965n423m4177m3192K0002n2770o1866r7227L33677J79122
15697A21864R1529j1499o9650J5020n657q9937k67437J91382O1082J92246J59937
15686C88880l55251k99133k84513o5753J10975K92820M533J10662P1435K10365
15676A85020o1504q0049P5991R7063m4100k7230l30514r0680k1129j06220K64671
$$ plain form
15665 -138681 -21515 128232 170935 308224 383522 398224 648993 660121 473103 344325
15655 344325 74908 45629 -53026 -34680 102481 -107920 -276094 4306 159596 39456
15645 39456 -242025 -145935 -65813 -242310 -333324 -208221 -11209 -123351 -204932 -363189
15635 -363189 -391391 -462686 -571754 -528684 -374781 -30708 155147 101537 43036 -204492
15625 -204492 -359115 -569358 -425624 -187045 -4808 73620 3547 120846 210130 19331
15615 19331 -260571 -375333 -274766 -546274 -591558 -519022 -428632 -84896 36756 -94602
15605 -94602 37811 86952 -32426 37129 -156369 -341048 -111403 -220794 -470500 -454374
15595 -454374 -123604 73478 26097 2423 -25058 -548 -16144 71562 -65833 -145059 -122479
$$ packed form
15665a38681J17166J49747M2703J37289P5298J4702K50769J1128j87018j28778
15655C44325k69417k9279r8655J8346J37161k10401j68174K80400J55290j20140
15645C9456k81481R6090Q0122j76497r1014J25103J97012j12142q1581j58257
15635c63189k8202p1295j09068M3070J53903L44073J85855n3610n8501k47528
15625b04492j54623k10243J43734K38579J82237P8428p0073J17299Q9284j90799
15615A9331k79902j14762J00567k71508m5284P2536R0390L43736J21652j31358
15605i4602J32413M9141j19378O9555j93498j84679K29645j09391k49706J6126
15595d54374L30770J97082m7381k3674k7481K4510j5596Q7706j37395p9226K2580
$$ plain form
15584 -122479 -30785 -9252 -79214 -100940 -110635 -169973 -340453 -424509 -521220 -364216 -305778
15573 -305778 -74922 40287 264298 228527 -10497 -140916 -129193 -84714 -128789 -403267
15563 -403267 -431945 -215126 -111532 -346347 -126992 8422 -176880 -288476 -53704 75230
15553 75230 33197 -60103 -97419 -5481 70038 524617 614989 358753 81747 -81039 -272425
15542 -272425 -315867 -176933 -319252 -325407 -233284 -57625 7788 129187 70275 -799 -48843
15531 -48843 83771 162292 34537 38956 89626 -179384 -314477 -210832 -232759 -295524 -203948
15520 -203948 -221926 -318823 -302215 -332778 -291623 -183449 -29822 -47346 185887 317529 320143
15509 320143 93907 -51854 -37187 -44849 397039 526834 300893 42082 123071 206987
$$ packed form
15584a22479R1694K1533o9962k1726r695n9338j70480q4056r6711J57004N8438
15573c05778K30856J15209K24011l5771k39024j30419J1723M4479m4075k74478
15563d03267k8678K16819J03594k34815K19355J35414j85302j11596K34772J28934
15553G5230m2033r3300l7316R1938P5519M54579R0372k56236k77006j62786j91386
15542b72425m3442J38934j42319o155R2123J75659O5413J21399n8912p1074m8044
15531d8843J32614P8521j27755M419N0670k69010j35093J03645k1927o2765R1576
15520b03948j7978r6897J6608l0563M1155J08174J53627j7524K33233J31642K614
15509C20143k26236j45761J4667p662M41888J29795k25941k58811Q0989Q3916
$$ plain form
15499 206987 205362 164798 17066 -184044 -3384 145396 106510 -28640 100855 -14041
15489 -14041 -192669 -125355 7488 211719 440127 637247 444660 303996 107557 189954
15479 189954 96900 53093 -239228 -381792 -81917 -9617 -141171 -223688 -438056 -290067
15469 -290067 -165423 -356313 -211178 -49702 -133300 -342456 -136913 -55385 -189909 -206382
15459 -206382 -320690 -388146 -77305 126577 60038 250433 3806 -136350 -275226 -131527
15449 -131527 9347 128643 -122638 7677 211071 229051 226602 163824 62649 106205
15439 106205 76012 25958 164909 364420 172646 317000 376893 589728 424140 -64920
15429 -64920 -54886 -106613 -146666 -166262 -193500 -295321 -219759 -111877 4104 91942 -69855
$$ packed form
15499B06987j625m0564j47732k01110J80660J48780l8886j35150J29495j14896
15489a4041j78628O7314J32843K04231K28408J97120j92587j40664j96439Q2397
15479A89954r3054m3807k92321j42564K99875P2300j31554q2517k14368J47989
15469b90067J24644j90890J45135J61476q3598k09156K05543Q1528j34524j6473
15459b06382j14308o7456L10841K03882o6539J90395k46627j40156j38876J43699
15449a31527J40874J19296k51281J30315K03394J7980k449o2778j01175M3556
15439A06205l0193n0054J38951J99511j91774J44354N9893K12835j65588m89060
15429f4920J0034n1727m0053j9596k7238j01821P5562J07882J15981Q7838j61797
$$ plain form
15418 -69855 -283700 -77787 -7092 -177020 -245011 -307098 -252945 -275675 -166242 -191089 -54739
15407 -54739 8001 85969 163621 78705 -236765 -420554 -575348 -654350 -393300 -275295 -329114
15396 -329114 -375529 -347334 -142922 127210 261324 72574 -45015 -179606 -202222 -259717
15386 -259717 -281603 -345860 -510391 -419882 -376959 -335274 -331860 -381041 -307078 -45123 40354
15375 40354 113888 220756 -16747 -24080 125558 209375 178216 176154 207394 -7660 -69315
15364 -69315 -351650 -461263 -469667 -568775 -458896 -513895 -505579 -264017 -9422 -24470 -132140
15353 -132140 -208664 -394503 -290318 -371816 -485205 -294261 -241453 -315883 -307475 -289453 -226435
15342 -226435 -276670 -167742 -24677 29280 26635 161546 105203 225234 19439 -111882
$$ packed form
15418f9855k13845K05913P0695j69928o7991o2087N4153k2730J09433k4847J36350
15407e4739O2740P7968P7652q4916l15470j83789j54794p9002K61050J18005n3819
15396c29114m6415K8195K04412K70132J34114j88750j17589j34591k2616n7495
15386b59717k1886o4257j64531R0509M2923M1685L414m9181P3963K61955Q5477
15375D0354P3534J06868k37503p333J49638Q3817l1159k062L1240k15054o1655
15364f9315k82335j09613q404r9108J09879n4999Q316K41562K54595j5048j07670
15353a32140p6524j85839J04185q1498j13389J90944N2808p4430Q408J8022O3018
15342b26435n0235J08928J43065N3957k645J34911n6343J20031k05795j31321
$$ plain form
15332 -111882 -139750 -162106 70431 297623 230824 121204 -1476 -235088 -372533 -415252
15322 -415252 -179952 82698 55745 66479 -128468 -286826 -111189 52604 66840 314784
15312 314784 71591 119165 -32171 -16177 105110 99945 204519 61257 -139233 -205585
15302 -205585 -30760 -20139 -143851 -89746 -223651 -260888 -402465 -166493 -197690 -37329
15292 -37329 96926 -13107 -35979 -217187 -140163 -31947 12966 14860 -83537 180566 154265
15281 154265 34202 -135263 -312296 -153093 223502 31283 -101957 -201638 -117788 -20955
15271 -20955 153894 263472 272873 18355 -176515 -125379 211960 212235 58214 -149348 -167598
15260 -167598 -307246 -321613 -228382 -99684 24374 -127084 1193 122891 11901 -195377
$$ packed form
15332a11882k7868k2356K32537K27192o6799j09620j22680k33612j37445m2719
15322d15252K35300K62650k6953J0734j94947j58358J75637J63793J4236K47944
15312C14784k43193M7574j51336J5994J21287n165J04574j43262k00490o6352
15302b05585J74825J0621j23712N4105j33905l7237j41577K35972l1197J60361
15292c7329J34255j10033k2872j81208P7024J08216M4913J894r8397K64103k6301
15281A54265j20063j69465j77033J59203L76595j92219j33240r9681Q3850R6833
15271b0955J74849J09578R401k54518j94870N1136L37339K75j54021k07562j8250
15260a67598j39648j4367R3231J28698J24058j51458J28277J21698j10990k07278
$$ plain form
15250 -195377 -199519 -279463 -291637 -513718 -245426 69505 301211 232449 -14267 14267 125773
15239 125773 40102 -203243 -178650 113508 84888 -85667 -65318 110248 74304 -39649
15229 -39649 51495 -34696 -959 -69198 -132442 -158784 -337496 -589207 -669723 -595216 -723486
15218 -723486 -243979 -26886 -69177 -227210 -260522 -206801 -96028 105399 38044 -130987
15208 -130987 -136761 -90195 -216461 -248593 -25612 280522 140718 -84520 -126737 -180907 -80475
15197 -80475 -45507 -164371 -149659 -33751 191962 347109 385545 362742 88649 8222 -206482
15186 -206482 -198078 -148822 -238980 -170406 -12685 90259 86359 -26023 -70032 -257683 -320602
15175 -320602 -243058 -270218 -498700 -471811 -280646 51047 130972 -126181 -243874 -155318
$$ packed form
15250a95377m142p9944j2174k22081K68292L14931K31706o8762k46716K8534J11506
15239A25773q5671k43345K4593K92158k8620j70555K0349J75566l5944j13953
15229c9649R1144q6191L3737o8239o3244k6342j78712k51711q0516P4507j28270
15218g23486M79507K17093m2291j58033l3312N3721J10773K01427o7355j69031
15208a30987n774M6566j26266l2132K22981L06134j39804k25238m2217n4170J00432
15197h0475L4968j18864J4712J15908K25713J55147L8436k2803k74093q0427k14704
15186b06482Q404M9256r0158O8574J57721J02944l900j12382m4009j87651o2919
15175c20602P7544k7160k28482K6889J91165L31693P9925k57153j17693Q8556
$$ plain form
15165 -155318 9881 145292 213815 59593 -59916 -129978 205415 357474 123121 13618
15155 13618 54621 89257 111754 15547 -83382 29508 38746 94031 -5920 -161017 -245543
15144 -245543 -201130 -261268 -325089 -5829 93592 75818 -60071 -263619 -255619 -366482 -59233
15133 -59233 193689 194111 31304 -163752 -302742 -361535 -219713 -19167 -50117 -315448 -301647
15122 -301647 -132797 -31322 -358011 -436117 -580241 -558681 -229554 32229 -93281 -129983
15112 -129983 -83007 65064 -141544 -139152 66737 125246 -278577 -344187 -15219 114323
15102 114323 372031 359943 243938 -5986 -80453 -347576 -382285 -202672 -36586 185856
15092 185856 202609 -87976 64783 235128 40892 -57144 -49741 -88983 -63873 -129257 -105982
$$ packed form
15165a55318J65199J35411O8523j54222j19509p0062L35393J52059k34353j09503
15155A3618M1003L4636K2497r6207r8929J12890R238N5285r9951j55097q4526
15144b45543M4413o0138o3821L19260R9421j7774j35889k03548Q000j10863L07249
15133e9233K52922M22j62807j95056j38990n8793J41822K00546l0950k65331J3801
15122c01647J68850J01475l26689p8106j44124K1560L29127K61783j25510l6702
15112a29983M6976J48071k06608K392K05889N8509m03823o5610L28968J29542
15102A14323K57708j2088j16005k49924p4467k67123l4709J79613J66086K22442
15092A85856J6753k90585J52759J70345j94236r8036P403l9242K5110o5384K3275
$$ plain form
15081 -105982 71042 334372 510773 436966 337543 223966 290529 263382 336327 212966
15071 212966 135169 490 -11305 67298 188879 222408 200091 117858 -229138 -186137 -186020
15060 -186020 -56997 77553 68535 -3537 -57243 -190408 -229043 -84202 -153957 -213935 -219971
15049 -219971 -347667 -640473 -641023 -369464 -258837 -323208 -114351 137573 73164 -112005
15039 -112005 -27961 53844 -19184 -69880 -140927 34169 -96310 -70372 72768 133240 270691
15028 270691 166791 184242 -48526 -10086 273172 248434 34559 -158496 28544 85032
15018 85032 -287937 -427979 -408180 -443545 -257928 -137575 -55994 -464089 -562032 -466825 -275812
15007 -275812 -158432 -337920 -453608 -448520 -443111 -374047 -84147 26836 67817 -150882 11669
$$ packed form
15081a05982J77024K63330J76401p3807r9423j13577O6563k7147P2945j23361
15071B12966p7797j34679j1795P8603J21581L3529k2317q2233l46996M3001J17
15060a86020J29023J34550r018p2072n3706j33165l8635J44841o9755n9978o036
15049b19971j27696k92806n50K71559J10627o4371K08857K51924o4409j85169
15039a12005Q4044Q1805p3028n0696p1047J75096j30479K5938J43140O0472J37451
15028B70691j03900J7451k32768L8440K83258k4738k13875j93055J87040N6488
15018H5032l72969j40042J9799l5365J85617J20353Q1581m08095r7943R5207J91013
15007b75812J17380j79488j15688N088N409O9064K89900J10983M0981k18699J62551
$$ plain form
14996 11669 219009 89770 245904 214045 251582 129029 -84073 58137 80516 85133 -130256
14985 -130256 -200401 -239168 -353449 -289747 -163447 -82530 -159511 -165566 -156686 61484 46078
14974 46078 85240 29268 -150755 169808 70229 -192632 -308144 -127152 -40671 42197 -62084
14963 -62084 112050 163506 96654 112460 101571 -69950 -168246 -89344 -5596 39741 35929
14952 35929 175478 236935 289408 241233 28317 26498 186598 116502 26273 -94253 -397440
14941 -397440 -492347 -208213 -16101 47044 9232 115600 194329 -32528 -139638 -191572
14931 -191572 -386266 -377464 83243 252805 47766 102315 -28142 -30929 6911 19235 168228
14920 168228 115080 38010 -108837 -38934 -61127 -270673 -78923 102505 -163474 -225772
$$ packed form
14996A1669K07340j29239J56134l1859L7537j22553k13102J42210K2379M617k15389
14985a30256p0145l8767j14281O3702J26300Q0917p6981o055Q880K18170j5406
14974D6078L9162n5972j80023L20563r9579k62861j15512J80992Q6481Q2868j04281
14963f2084J74134N1456o6852J5806j0889j71521r8296P8902Q3748M5337l812
14952C5929J39549O1457N2473m8175k12916j819J60100p0096r0229j20526l03187
14941c97440r4907K84134J92112O3145l7812J06368P8729k26857j07110n1934
14931a91572j94694Q802M60707J69562k05039N4549j30457k787L7840J2324J48993
14920A68228n3148p7070j46847O9903k2193k09546J91750J81428k65979o2298
$$ plain form
14910 -225772 -150047 -324973 -382307 -118387 148342 35041 78502 153050 160450 133133 175747
14899 175747 238338 492843 565977 364734 -17411 -122455 -33069 53998 -64272 35038
14889 35038 -17262 47677 85422 -50899 -368555 -416990 -77693 -92082 -183827 -382321 -500160
14878 -500160 -56467 192282 141839 294666 118075 -137638 -205486 -257324 -11795 107327
14868 107327 114861 142329 284839 361449 240004 78292 -116045 -85303 -11801 -168525 -315439
14857 -315439 -124324 84856 -173213 -274196 -216068 -117596 -131102 -174172 -201841 -200731 -119185
14846 -119185 61002 -63005 -53973 -174365 -158966 48244 95568 -38073 -110577 -127080 -11740
14835 -11740 -58131 40960 64347 -125060 -161597 23686 141690 280717 129208 24146
$$ packed form
14910b25772P5725j74926n7334K63920K66729j13301M3461P4548P400k7317M2614
14899A75747O2591K54505P3134k01243l82145j05044Q9386Q7067j18270R9310
14889C5038n2300O4939L7745j36321l17656m8435L39297j4389r1745j98494j17839
14878e00160M43693K48749n0443J52827j76591k55713o7848n1838K45529J19122
14868A07327P534K7468J42510P6610j21445j61712j94337L0742P3502j56724j46914
14857c15439J91115K09180k58069j00983N8128R8472j3506m3070k7669J110Q1546
14846a19185J80187j24007R032j20392J5399K07210M7324j33641p2504j6503J15340
14835a1740m6391R9091K3387j89407l6537J85283J18004J39027j51509j05062
$$ plain form
14825 24146 -2152 61699 14513 160871 120895 -28072 -121437 -248654 -183787 -45743 -142259
14814 -142259 -164897 138454 -2124 25510 138910 16734 -312545 -442036 -478890 -407198
14804 -407198 -339879 52245 237969 276713 -70811 -132381 -78368 -48092 -129772 -211812 -74977
14793 -74977 52716 -27521 24482 99697 -131573 -140881 -111723 -222060 -242329 -89818 -81147
14782 -81147 -69280 -24412 -112815 -244480 -223773 191424 264113 107766 -45093 -321785 -583591
14771 -583591 -670472 -508852 -152050 -61970 5209 301391 325646 184837 87583 -38422
14761 -38422 195468 97740 -43829 14740 -191307 -469295 -452248 -279783 23196 299289
14751 299289 108967 -94173 -142324 1083 86989 -14700 -62513 47034 67119 -69850
$$ packed form
14825B4146k6298O3851m7186J46358l9976j48967r3365j27217O4867J38044r6516
14814a42259k2638L03351j40578K7634J13400j22176l29279j29491l6854P1692
14804d07198O7319L92124J85724L8744l47524o1570N4013L0276q1680q2040J36835
14793g4977J27693q0237N2003P5215k31270r308K9158j10337k0269J52511Q671
14782h1147J1867M4868q8403j31665K0707M15197P2689j56347j52859k76692k61806
14771e83591q6881J61620L56802R0080O7179K96182K4255j40809r7254j26005
14761c8422K33890r7728j41569N8569k06047k77988J7047J72465L02979K76093
14751B99289j90322k03140m8151J43407Q5906j01689m7813J09547K0085j36969
$$ plain form
14741 -69850 -137035 5577 -108327 -88416 -2260 -138790 -244215 -10056 -20597 -132417
14731 -132417 -169318 -8880 352057 350498 199226 174055 223326 322155 341025 242072 316638
14720 316638 518097 463088 310808 144484 43189 131716 131059 35707 -181752 -280532 85046
14709 85046 365996 129450 -3086 -122303 -206591 -437825 -483071 -519553 -627640 -616104
14699 -616104 -565357 -264196 -139992 -355899 -287969 -118243 -101303 -320705 -511398 -579338
14689 -579338 -638580 -603246 -358010 -228902 -382881 -263905 -95108 21734 86019 164139
14679 164139 291414 446563 497753 423521 369724 414912 269419 156583 101423 46358 -64985
14668 -64985 -96419 112091 102555 112164 -108263 -29968 -200680 -246349 -206469 -308877 -83649
$$ packed form
14741f9850o7185J42612j13904J9911Q6156j36530j05425K34159j0541j11820
14731a32417l6901J60438L60937j559j51272k5171M9271R8829J8870r8953P4566
14720C16638K01459n5009j52280j66324j01295Q8527o57r5352k17459r8780L65578
14709H5046K80950k36546j32536j19217q4288k31234m5246l6482j08087J1536
14699f16104N0747L01161J24204k15907O7930J69726J6940k19402j90693o7940
14689e79338n9242L5334K45236J29108j53979J18976J68797J16842O4285P8120
14679A64139J27275J55149N1190p4232n3797M5188j45493j12836n5160n5065j11343
14668f4985l1434K08510r536R609k20427P8295j70712m5669L9880j02408K25228
$$ plain form
14657 -83649 34005 -13776 49350 28057 -86812 28928 104813 152707 55328 -162247 -59415
14646 -59415 60890 177962 95012 45219 -60166 -32215 -79977 -8668 288424 414997 239251
14635 239251 354522 164529 315438 459298 517863 491127 300665 121402 145065 7209
14625 7209 35069 158410 -104909 -326704 -132378 -41866 47207 132146 88700 51606 101752
14614 101752 255653 208660 206240 273935 100318 129477 248176 144800 321466 319772 95633
14603 95633 122246 -11314 -52451 45121 -85780 -263522 -4976 178167 256035 404252
14593 404252 419882 288856 443722 407924 403951 420611 421822 528523 350631 153354 290049
14582 290049 498756 357808 273634 312317 305599 399802 574897 503273 264027 355064 433030
$$ packed form
14657h3649J17654m7781O3126k1293j14869J15740P5885M7894r7379k17575J02832
14646e9415J20305J17072q2950m9793j05385K7951m7762P1309K97092J26573j75746
14635B39251J15271j89993J50909J43860N8565k6736j90462j79263K3663j37856
14625G209K7860J23341k63319k21795J94326R0512Q9073Q4939m3446l7094N0146
14614A01752J53901m6993k420O7695j73617K9159J18699j03376J76666j694k24139
14603I5633K6613j33560m1137R7572j30901j77742K58546J83143P7868J48217
14593D04252J5630j31026J54866l5798l973J6660J211J06701j77892j97277J36695
14582B90049K08707j40948q4174L8683o718R4203J75095p1624k39246R1037P7966
$$ plain form
14571 433030 292184 367228 457656 589765 406014 305017 190539 44056 108117 276333
14561 276333 315900 9685 -123978 -157200 -126121 -15391 -212155 -30310 8458 -9626
14551 -9626 -66478 -108433 -79103 25382 183646 372144 466913 727532 682248 489038 437371
14540 437371 293038 141191 -51513 -79526 -207999 -207263 -100246 -99748 -71078 60568 -146975
14529 -146975 -12308 224493 342675 333764 253715 15209 -219696 -229261 -259568 13332 292687
14518 292687 488267 516309 682193 677584 756282 1054571 990495 1179084 1568898 1899253
14508 1899253 2349526 2889810 3755383 4533592 5366623 6376216 7248104 7950203 8304259
14499 8304259 8282943 8422865 8556896 8926591 9011650 9062050 9208427 9055283 8555673 7969850
$$ packed form
14571D33030j40846P5044R0428J32109j83751j00997j14478j46483O4061J68216
14561B76333L9567l06215j33663l3222L1079J10730j96764J81845L8768j8084
14551i626n6852m1955K9330J04485J58264J88498R4769K60619m5284j93210n1667
14540D37371j44333j51847j92704k8013j28473P36J07017M98K8670J31646k07543
14529a46975J34667K36801J18182q911q0049k38506k34905r565l0307K72900K79355
14518B92687J95580K8042J65884m609P8698K98289o4076J88589L89814L30355
14508A899253M50273N40284Q65573P78209Q33031J009593Q71888P02099L54056
14499H304259k1316J39922J34031L69695Q5059N0400J46377j53144m99610n85823
$$ plain form
14489 7969850 7204801 6480846 5487640 4662891 4086291 3638750 3198957 2840782 2368213
14480 2368213 1711012 1527065 1570272 1476581 1488180 1435676 1298922 1029922 948116 800593
14470 800593 1238773 1357730 1161346 1024244 1082439 1078396 1074329 1080812 1178612 968515 913147
14459 913147 800781 585679 557077 542155 646779 605530 538833 672091 780923 769516
14449 769516 1039368 755906 427071 545380 770914 543476 191515 345598 573606 788270
14439 788270 706407 568844 350615 303583 444311 692012 521539 303102 398773 487211
14429 487211 350710 421969 426245 448298 582221 811151 673606 545249 309643 270851
14419 270851 238232 107903 -75788 -17047 240656 497300 296701 39001 366507 433639
$$ packed form
14489G969850p65049p23955r93206q24749n76600m47541m39793l58175m72569
14480B368213o57201j83947M3207r3691J1599n2504j36754k69000q1806j47523
14470H00593M38180J18957j96384j37102N8195m043m067O483R7800k10097n5368
14459I13147j12366k15102k8602j4922J04624m1249o6697J33258J08832j1407
14449G69516K69852k83462l28835J18309K25534k27438l51961J54083K28008K14664
14439G88270q1863j37563k18229m7032J40728K47701j70473k18437R5671Q8438
14429D87211j36501P1259M276K2053J33923K28930j37545j28357k35606l8792
14419B70851l2619j30329j83691N8741K57703K56644k00599k57700L27506O7132
$$ plain form
14409 433639 316234 288431 353525 543519 485214 357491 337186 317834 312406 444994 319650
14398 319650 -7162 75693 244904 342908 431175 404766 409711 489827 143848 -135469 -67873
14387 -67873 161507 211462 218790 87884 -22268 -51688 24173 84688 34793 204917 296200
14376 296200 305005 61988 -12072 -84173 -119982 -6171 -102317 -372370 -411144 -131430 110038
14365 110038 42038 3938 27131 -10561 -222615 -259236 -82095 74374 10966 -192083 -162526
14354 -162526 130557 370291 556080 429046 261852 177974 64621 188579 320686 281657
14344 281657 60745 5591 71194 -54721 -267105 -153995 -18588 26971 36322 128779 25592
14333 25592 -181158 -43839 72779 213923 262157 90162 125945 121537 45349 -278417 -192512
$$ packed form
14409D33639j17405k7803O5094J89994n8305j27723k0305j9352n428J32588j25344
14398C19650l26812Q2855J69211R8004Q8267k6409M945Q0116l45979k79317O7596
14387f7873K29380M9955P328j30906j10152k9420P5861O0515m9895J70124R1283
14376B96200Q805k43017p4060p2101l5809J13811r6146k70053l8774K79714K41468
14365A10038o8000l8100K3193l7692k12054l6621J77141J56469o3408k03049K9557
14354a62526K93083K39734J85789j27034j67194q3878j13353J23958J32107l9029
14344B81657k20912n5154O5603j25915k12384J13110J35407M5559R351R2457j03187
14333B5592k06750J37319J16618J41144M8234j71995L5783m408p6188l23766Q5905
$$ plain form
14322 -192512 152690 305195 85189 24452 7387 -338603 -518307 -335743 -73753 -105689
14312 -105689 -38209 123407 188281 173512 74475 208270 382444 373015 208648 118578 201947
14301 201947 192277 -40798 -149433 -79681 -254444 -195101 -169578 -141486 -31737 -57278 -131519
14290 -131519 37557 119469 -72877 53182 300458 243278 81804 3268 161122 216508
14280 216508 215085 -16604 -134204 -103816 -184508 -68943 -173631 -357591 -315683 -254268 -183145
14269 -183145 -27864 101613 145154 130190 42091 -62394 97262 318817 345817 283609
14259 283609 483186 515462 636774 708166 598815 532719 350026 330640 135686 -63582
14249 -63582 -269373 -176336 21662 -737 258607 157339 58807 311806 284343 154915
$$ packed form
14322a92512L45202J52505k20006o0737j7065l45990j79704J82564K61990l1936
14312a05689O7480J61616O4874j4769r9037J33795J74174r429j64367r0070Q3369
14301B01947r670k33075j08635O9752j74763N9343K5523K8092J09749k5541p4241
14290a31519J69076Q1912j92346J26059K47276n7180j61474p8536J57854N5386
14280B16508j423k31689j17600L0388q0692J15565j04688j83960M1908O1415P1123
14269a83145J55281J29477M3541j4964q8099j04485J59656K21555K7000o2208
14259B83609J99577L2276J21312P1392j09351o6096j82693j9386j94954j99268
14249f3582k05791R3037J97998k2399K59344j01268r8532K52999k7463j29428
$$ plain form
14239 154915 261435 349697 273911 283866 128341 131276 276738 103917 39940 -103488 -306972
14228 -306972 -291274 -317391 -380228 -233691 -58322 -53033 65135 156399 85576 86544 70949
14217 70949 79409 -110836 -243453 23187 4947 -131434 -67261 7239 87101 27560 -176137
14206 -176137 -209421 158393 -48930 -64932 84964 -121200 -328935 -393119 -197125 -78556
14196 -78556 -29130 3366 -38767 -48227 -225087 -360113 -389614 -99328 -284711 -314915 -109535
14185 -109535 -176392 -187172 -255218 71853 155057 5083 75121 162955 84023 77134 21656
14174 21656 -8245 -14421 34541 20188 -94336 -287089 -186986 -216987 -98196 -21944 65534
14163 65534 137300 150950 218114 168036 165300 109209 -65730 -174149 -118703 -172 -184725
$$ packed form
14239A54915J06520Q8262p5786R955j55525K935J45462j72821o3977j43428k03484
14228c06972J5698k6117o2837J46537J75369N289J18168R1264p0823R68j5595
14217G0949Q460j90245j32617K66640j8240j36381O4173P4500P9862n9541k03697
14206a76137l3284L67814k07323j6002J49896k06164k07735o4184J95994J18569
14196g8556M9426L2496m2133r460j76860j35026k9501K90286j85383l0204K05380
14185a09535o6857j0780o8046L27071Q3204j49974P0038Q7834p8932o889n5478
14174B1656k9901o176M8962j4353j14524j92753J00103l0001J18791P6252Q7478
14163F5534P1766J3650O7164n0078k736n6091j74939j08419N5446J18531j84553
$$ plain form
14152 -184725 -442294 -600745 -414738 -439868 -519423 -202784 -41843 178556 175138 215753
14142 215753 267682 249872 462949 486414 265566 437244 605079 498961 266765 164229
14132 164229 97164 157995 177600 293891 240590 113742 -6951 -116545 -145564 -205186 50526
14121 50526 183279 129892 128998 155132 440846 325889 -134273 -113307 126240 158875 298143
14110 298143 348715 76883 -125605 -76776 -265913 -430815 -405124 -143900 -27825 -64389
14100 -64389 -28412 -188618 175864 432185 409787 363424 81965 -5304 7429 -120943 -217928
14089 -217928 -99030 112749 3201 -212341 -283634 -216904 -148546 -210722 -399983 -291267
14079 -291267 -275816 -208818 -45519 39431 178833 260151 107490 146632 23470 -145710
$$ packed form
14152a84725k57569j58451J86007k5130p9555L16639J60941K20399l418M0615
14142B15753N1929j7810K13077K3465k20848J71678J67835j06118k32196j02536
14132A64229o7065O0831J9605J16291n3301j26848j20693j09594k9019n9622K55712
14121E0526J32753n3387q94K6134K85714j14957m60162K0966K39547L2635J39268
14110B98143N0572k71832k02488M8829j89137j64902K5691K61224J16075l6564
14100f4389L5977j60206L64482K56321k2398m6363k81459q7269J2733j28372r6985
14089b17928J18898K11779j09548k15542p1293O6730O8358o2176j89261J08716
14079b91267J5451O6998J63299Q4950J39402Q1318j52661L9142j23162j69180
$$ plain form
14069 -145710 37980 306108 123526 -104561 -7385 69326 8888 19864 297459 445756
14059 445756 407771 503204 374940 172313 212067 106280 6149 -46436 -70566 165477
14049 165477 -67465 2637 154909 219311 342376 457472 502598 396575 320903 88428
14039 88428 -71990 -203344 -34284 32379 -104994 -128397 -51625 -220185 -134577 -43887 -21330
14028 -21330 -102611 49876 126190 139305 383254 527800 422689 258399 378004 420906
14018 420906 343998 413320 603515 661761 461506 173496 194668 210857 148664 11372 -163955
14007 -163955 -236947 -179086 -284274 -311188 -335736 -346120 -155501 -71492 42225 149757 135430
13996 135430 51767 16099 -116606 -51564 131489 29052 -118943 -132354 -68261 38124
$$ packed form
14069a45710J83690K68128j82582k28087R7176P6711o0438J0976K77595J48297
14059D45756l7985R5433j28264k02627L9754j05787j00131n2585k4130K36043
14049A65477k32942P0102J52272O4402J23065J15096M5126j06023p5672k32475
14039H8428j60418j31354J69060O6663j37373k3403P6772j68560Q5608R0690K2557
14028b1330q1281J52487P6314J3115K43949J44546j05111j64290J19605M2902
14018D20906p6908O9322J90195N8246k00255k88010K1172J6189o2193j37292j75327
14007a63955p2992N7861j05188k6914k4548j0384J90619Q4009J13717J07532j4327
13996A35430q3663l5668j32705O5042J83053j02437j47995j3411O4093J06385
$$ plain form
13986 38124 211123 188030 133596 44924 -21336 -2881 306211 285197 -22391 -380300 -459659
13975 -459659 -326830 -377338 -268238 -269757 -253894 -151513 -7486 39900 -131332 -245776
13965 -245776 -140963 91304 125717 95802 254722 254466 156392 -91000 -155836 95207 7738
13954 7738 -313349 -643647 -574703 -225684 -26111 39823 -182501 -236592 -214230 127279 22106
13943 22106 -289079 -476627 -464595 -189080 22031 307834 479294 603110 444897 218276
13933 218276 250566 163262 -106066 -212739 -214274 -359577 -353958 -392525 -337881 -153198 -249600
13922 -249600 -152845 -27584 129227 155881 -83012 -189284 -21022 91735 236703 -4027
13912 -4027 -99686 -33262 -97954 -138692 20335 16809 -124199 -97407 186137 254517 147995
$$ packed form
13986C8124J72999k3093n4434q8672o6260J8455L09092k1014l07588l57909p9359
13975d59659J32829n0508J09100j519J5863J02381J44027M7386j71232j14444
13965b45776J04813K32267L4413k9915J58920k56r8074k47392o4836K51043q7469
13954G738l21087l30298O8944L49019J99573O5934k22324n4091K2362L41509j05173
13943B2106l11185j87548J2032K75515K11111K85803J71460J23816j58213k26621
13933B18276L2290q7304k69328j06673j535j45303N619l8567N4644J84683r6402
13922b49600R6755J25261J56811K6654k38893j06272J68262J12757J44968k40730
13912d027r5659O6424o4692m0738J59027l526j41008K6792K83544O8380j06522
$$ plain form
13901 147995 -37979 -51547 153055 203915 78633 -107240 -158165 -139315 -105201 -75955 -20863
13890 -20863 60177 121575 60709 -154962 -62940 246255 528628 342276 193825 185860 5783
13879 5783 -263379 -311987 -194163 -34261 30698 90984 8948 -111867 -148128 -181903 77709
13868 77709 356687 361100 -37847 -237705 -264291 -209439 -429310 -518201 -351209 -272057 -456738
13857 -456738 -381592 -350402 -162681 -83504 -249709 -180035 130356 197185 53789 141386 346055
13846 346055 263032 261539 483361 391937 407938 440993 240548 221582 330207 184996 -117130
13835 -117130 -426579 -166124 141616 162814 345599 260122 71354 97115 46429 -41959
13825 -41959 237704 320352 293411 289893 92175 -235383 -314932 -255510 -249622 48059 203766
$$ packed form
13901A47995j85974j3568K04602N0860j25282j85873n0925J8850L4114K9246N5092
13890b0863Q1040O1398o0866k15671R2022L09195K82373j86352j48451p965j80077
13879E783k69162m8608J17824J59902O4959O0286q2036j20815l6261l3775K59612
13868G7709K78978M413l98947j99858k6586N4852k19871q8891J66992P9152j84681
13857d56738P5146L1190J87721P9177j66205O9674L10391O6829j43396Q7597K04669
13846C46055q3023j493K21822r1424J6001L3055k00445j8966J08625j45211l02126
13835a17130l09449K60455L07740K1198J82785q5477j88768K5761n0686q8388
13825d1959K79663Q2648k6941l518j97718l27558p9549N9422N888K97681J55707
$$ plain form
13814 203766 119706 81479 175339 344000 287867 347292 263173 267362 427480 469718 333928
13803 333928 313524 251430 181976 213251 168389 236323 225107 -138243 -210265 108799 64111
13792 64111 -253834 -393992 -75742 -58078 -48409 -207482 -411650 -543598 -314424 210640
13782 210640 208946 152394 90053 -127106 5182 324839 357832 320978 275147 73712 -18055
13771 -18055 -114564 41517 271735 436661 149010 -59330 -242246 -420792 -252310 -276658
13761 -276658 -297225 -42893 200915 275652 160018 178588 162732 94904 -136944 -345592
13751 -345592 -378689 -216502 -60822 42323 218084 313139 82594 -5768 -420554 -392651
13741 -392651 -241931 -230066 -59122 -54696 -35150 -67790 -81399 -288169 -468620 -708974 -645021
$$ packed form
13814B03766q4060l8227R3860J68661n6133N9425q4119M189J60118M2238j35790
13803C33928k0404o2094o9454L1275m4862O7934j1216l63350p2022L19064m4688
13792F4111l17945j40158L18250J7664R669j59073k04168j31948K29174N25064
13782B10640j694n6552o2341k17159J32288L19657L2993l6854m5831k01435r1767
13771a8055r6509J56081K30218J64926k87651k08340j82916j78546J68482k4348
13761b76658k0567K54332K43808P4737j15634J8570j5856o7828k31848k08648
13751c45592l3097J62187J55680J03145J75761R5055k30545q8362m14786K7903
13741c92651J50720J1865J70944M426J9546l2640j3609k06770j80451k40354O3953
$$ plain form
13730 -645021 -631878 -430307 -206710 -299627 -505014 -342559 -373021 -613006 -638524 -333628
13720 -333628 -309366 -308806 -296982 -142753 -118762 -213853 -180936 -61079 -118131 -167590 120541
13709 120541 97562 -29405 73535 103305 99675 -125097 -278238 -214631 -279673 -424165 -400639
13698 -400639 -443864 -670318 -618463 -487087 -278173 -96924 14769 -99240 -129728 -4260
13688 -4260 -91307 -96136 -179111 -9530 230234 131830 -101005 -198430 -167097 -341996 -481649
13677 -481649 -388783 -237524 -235347 -263525 -376037 -393477 -320436 -216018 -29489 -294816 -416680
13666 -416680 -289001 -285680 -348737 -642001 -819711 -649337 -502263 -283352 -73373 -45509
13656 -45509 36750 212017 53655 153842 252386 306872 185777 3995 -28462 265667
$$ packed form
13730f45021J3143K01571K23597r2917k05387J62455l0462k39985k5518L04896
13720c33628K4262N60J1824J54229K3991r5091L2917J19857n7052m9459K88131
13709A20541k2979j26967J02940K9770l630k24772j53141O3607o5042j44492K3526
13698d00639m3225k26454N1855J31376K08914J81249J11693j14009l0488J25468
13688d260q7047m829q2975J69581K39764r8404k32835r7425L1333j74899j39653
13677d81649R2866J51259K177k8178j12512j7440P3041J04418J86529k65327j21864
13666d16680J27679L321o3057k93264j77710J70374J47074K18911K09979K7864
13656d5509Q2259J75267j58362J00187R8544N4486j21095j81782l2457K94129
$$ plain form
13646 265667 364157 286161 -64776 -210650 -210629 -93815 -164909 -52380 111938 48937 -231125
13635 -231125 -222898 -39870 -38491 -84553 93833 286582 384685 276691 25549 -47887 -36111
13624 -36111 17594 289054 373148 394817 77833 -238282 -277093 105711 132626 41611 128541
13613 128541 -41202 98842 167161 128615 89504 61045 -62508 5879 -56449 145497 281907
13602 281907 438347 386525 330515 208443 47491 143463 184371 138575 95450 -19482 29603
13591 29603 89373 27441 -67147 -92642 87314 137552 -70679 -108946 -31520 -145986 -38742
13580 -38742 -47321 -161907 245376 439819 281657 9994 4875 -233231 -408301 -351195 -272965
13569 -272965 -375356 -178889 29656 36796 -401212 -373970 -267001 -186000 -311363 -282943
$$ packed form
13646B65667R8490p7996l50937j45874K1J16814p1094J12529J64318o3001k80062
13635b31125Q227J83028J379m6062J78386J92749R8103j07994k51142p3436J1776
13624c6111N3705K71460Q4094K1669l16984l16115l8811L82804K6915r1015Q6930
13613A28541j69743J40044O8319l8546l9111k8459j23553O8387o2328K01946J36410
13602B81907J56440n1822n6010j22072j60952R5972M0908m5796m3125j14932M9085
13591B9603N9770o1932r4588k5495J79956N0238k08231l8267P7426j14466J07244
13580c8742q579j14586M07283J94443j58162k71663n119k38106j75070N7106P8230
13569b72965j02391J96467K08545P140m38008K7242J06969Q1001j25363K8420
$$ plain form
13559 -282943 -203844 -158890 4723 159583 110731 55363 -15384 -381391 -583344 -492983 -339053
13548 -339053 -454412 -591573 -482615 -464027 -472554 -354146 -129666 -180555 -101673 -166396 -369476
13537 -369476 -351957 -373302 -264041 -152741 -158815 95716 119653 -28323 -71028 -14439 73028
13526 73028 92572 158996 284344 117031 -77740 -70835 150183 27238 -167271 -253158 -329390
13515 -329390 -164403 218114 510714 251374 35474 -9854 129374 173044 259083 265264
13505 265264 311340 197018 -103575 -55411 28310 -71859 -142256 66372 308834 409204
13495 409204 252637 272420 351893 -52836 -257321 -170434 -123721 -48774 -58266 -63836 -57446
13484 -57446 -40934 -30634 -100731 -96458 -87620 -140430 -156370 -13810 208472 283714 251516 -43583
$$ packed form
13559b82943P9099M4954J63613J54860m8852n5368p0747l66007k01953R0361J53930
13548c39053j15359j37161J08958J8588q527J18408K24480n0889P8882o4723k03080
13537c69476J7519k1345J09261J11300o074K54531K3937j47976m2705N6589Q7467
13526G3028J9544O6424J25348j67313j94771O905K21018j22945j94509q5887p6232
13515c29390J64987L82517K92600k59340k15900m5328J39228M3670Q6039O181
13505B65264M6076j14322l00593M8164Q3721j00169p0397K08628K42462J00370
13495D09204j56567J9783P9473m04729k04485Q6887M6713P4947r492n570O390
13484e7446J6512J0300p0097M273Q838n2810j5940J42560K22282P5242l2198k95099
$$ plain form
13472 -43583 11717 22965 1718 268192 498400 616685 440018 315692 282039 151677
13462 151677 -68311 -366500 -486294 -321789 -337557 -263178 -270271 -253805 -408015 -173813
13452 -173813 141104 178309 73282 54152 115778 -128359 -328573 -61625 -91329 5127
13442 5127 158121 22370 48344 66215 30284 -159837 -256297 -24916 80988 105187 -993
13431 -993 -218178 -199025 -347170 -399221 -467376 -573425 -577913 -561923 -410020 -290827 -65894
13420 -65894 -98262 -160733 -82719 -28788 -221409 -133590 -22357 -31556 -8586 280180 227851
13409 227851 -113475 -126944 -110096 -38392 -70978 -145226 3135 -78322 -184694 -19445 55740
13398 55740 99886 179073 143129 -44791 -114240 -164908 -158795 1037 236926 174431 358091
$$ packed form
13472d3583N5300J1248k1247K66474K30208J18285j76667j24326l3653j30362
13462A51677k19988k98189j19794J64505j5768P4379p093J6466j54210K34202
13452a73813L14917L7205j05027j9130O1626k44137k00214K66948k9704R6456
13442E127J52994j35751K5974J7871l5931j90121r6460K31381J05904K4199j06180
13431i93k17185J9153j48145n2051o8155j06049m488J5990J51903J19193K24933
13420f5894l2368o2471P8014N3931j92621Q7819J11233r199K2970K88766n2329
13409B27851l41326j3469J6848P1704l2586p4248J48361q1457j06372J65249P5185
13398E5740M4146P9187l5944j87920o9449n0668O113J59832K35889o2495J83660
$$ plain form
13387 358091 554474 352059 140143 72991 -50295 -116388 -102218 132876 230141 304271
13377 304271 396083 371442 100494 52248 -16279 -5367 -9359 155922 205630 187545 395050
13366 395050 555050 933188 1252644 1200037 1146083 1614348 1996381 2090742 2233933 2237178
13356 2237178 1713217 1501614 1450228 1381401 1106112 897672 853793 674462 699736 602580
13346 602580 266827 212025 383316 470396 537811 590567 471850 383814 280671 -46568
13336 -46568 -161236 143596 223686 -7499 -169691 -37160 259319 210961 157493 17985
13326 17985 75039 168454 23888 27761 -23697 -72331 -186453 -267036 -332446 -44632 105087
13315 105087 264017 351847 354924 406763 349402 87410 82050 178134 274768 354899 395907
$$ packed form
13387C58091J96383k02415k11916o7152j23286o6093J4170K35094R7265P4130
13377C04271R1812k4641k70948m8246o8527J0912l992J65281M9708j8085K07505
13366C95050J60000L78138L19456n2607n3954M68265L82033R4361J43191L245
13356B237178n23961k11603n1386o8827k75289k08440m3879j79331K5274r7156
13346F02580l35753n4802J71291Q7080O7415N2756j18717q8036j03143l27239
13336d6568j14668L04832Q0090k31185j62192J32531K96479m8358n3468j39508
13326A7985N7054R3415j44566L873n1458m8634j14122q0583o5410K87814J49719
13315A05087J58930Q7830L077N1839n7361k61992n360R6084R6634Q0131M1008
$$ plain form
13304 395907 312379 114170 142776 17405 -233415 -62577 263514 299430 357572 330025
13294 330025 171998 138228 237383 128051 70257 -51698 60477 22335 -143732 -310648
13284 -310648 -389372 -106457 85581 67365 -32995 -139272 -115863 32538 125648 223515
13274 223515 444081 668258 608073 277331 57687 98608 33251 -201026 -39149 42923
13264 42923 -162875 -161603 -460953 -485834 -399844 -187198 1648 -15597 -83037 -28677 -87699
13253 -87699 -175156 95342 -94786 -211459 28201 456737 339164 269026 136867 104148
13243 104148 75289 -145616 25634 129619 218916 437012 362716 256077 290898 201153
13233 201153 82844 -107805 119806 165723 -39009 -27924 60575 -144780 -318758 -276645
$$ packed form
13304C95907q3528j98209K8606j25371k50820J70838L26091L5916N8142k7547
13294C30025j58027l3770R9155j09332n7794j21955J12175l8142j66067j66916
13284c10648p8724K82915J92038j8216j00360j06277K3409J48401R3110R7867
13274B23515K20566K24177o0185l30742k19644M0921o5357k34277J61877Q2072
13264D2923k05798J272k99350k4881Q5990K12646J88846j7245o7440N4360n9022
13253h7699q7457K70498j90128j16673K39660M28536j17573p0138j32159l2719
13243A04148k8859k20905J71250J03985Q9297K18096p4296j06639L4821q9745
13233B01153j18309j90649K27611M5917k04732J1085Q8499k05355j73978M2113
$$ plain form
13223 -276645 -362915 -302697 -77986 98515 235359 258660 94523 157163 298397 176016
13213 176016 -210776 -366872 -263346 -193501 -80370 251447 211690 268902 277896 272834 399741
13202 399741 446421 336241 402488 405950 402856 411725 229378 235904 412036 488151 256444
13191 256444 -101416 -151822 110978 105501 -16359 -36464 -75995 -7937 -67672 -43467 -60171
13180 -60171 -82389 -82667 2846 -136869 46740 82371 -239504 -324914 -27319 194911 277969
13169 277969 316225 207404 119928 190528 3960 1357 253765 392672 223072 -69596
13159 -69596 -284404 -359930 -259179 -30819 -117931 -75716 -280168 -544620 -536358 -461205 -619894
13148 -619894 -611581 -277815 -55931 -92112 65672 320077 239187 208638 198812 -2562 -39817
$$ packed form
13223b76645q6270O0218K24711J76501J36844K3301j64137O2640J41234j22381
13213A76016l86792j56096J03526O9845J13131L31817l9757N7212Q994n062J26907
13202C99741M6680j10180O6247L462l094Q869j82347O526J76132P6115k31707
13191B56444l57860n0406K62800n477j21860k0105l9531O8058n9735K4205j6704
13180f0171k2218k78Q5513j39715J83609L5631l21875q5410K97595K22230Q3058
13169B77969L8256j08821q7476P0600j86568k603K52408J38907j69600k92668
13159f9596k14808p5526J00751K28360q7112M2215k04452k64452Q262P5153j58689
13148f19894Q313L33766K21884l6181J57784K54405q0890l0549r826k01374l7255
$$ plain form
13137 -39817 -38206 -38695 -122009 117694 107786 68589 111709 -52866 -156283 -47466 143031
13126 143031 168693 252266 249739 -41133 32994 -35747 -140403 -226456 -188048 -174687 74455
13115 74455 159434 263996 205001 294160 453753 751529 523313 366676 404019 381520 308449
13104 308449 153526 312500 423348 83721 4637 112603 210829 388416 511045 376419
13094 376419 300463 259661 148299 134046 324680 310502 585583 672962 323694 49287
13084 49287 99754 281159 478835 602061 575266 699482 817912 633818 423942 373519
13074 373519 474323 419725 146782 126243 322422 705098 995759 1136774 1326200 1479476
13064 1479476 1799338 2176469 2436596 2567363 2431172 2296342 2073651 2264994 2176300 1882258
$$ packed form
13137c9817J611m89q3314K39703r908l9197M3120j64575j03417J08817J90497
13126A43031K5662Q3573k527k90872P4127o8741j04656q6053L8408J3361K49142
13115G4455Q4979J04562n8995Q9159J59593K97776k28216j56637L7343k2499p3071
13104C08449j54923J58974J10848l39627p9084J07966R8226J77587J22629j34626
13094C76419p5956m0802j11362j4253J90634j4178K75081Q7379l49268k74407
13084D9287N0467J81405J97676J23226k6795J24216J18430j84094k09876n0423
13074C73519J00804n4598k72943k0539J96179L82676K90661J41015J89426J53276
13064A479476L19862L77131K60127J30767j36191j34830k22691J91343q8694k94042
$$ plain form
13054 1882258 1866748 1782677 1721302 1858789 2023414 2042947 1777241 1391694 1031351 1148439
13044 1148439 1271042 1239847 1035529 1064646 1246982 1279677 1421699 1549515 1260807 1054199
13034 1054199 1013821 947213 1016791 1129752 1148834 1253296 1278630 1167279 1064051 1055845 1224255
13023 1224255 1532750 1511159 1245497 1324635 1263095 1032140 1074792 997741 957194 948821 1215412
13012 1215412 1100149 1084430 1198528 1194634 1396146 1537120 1313555 1284481 1559459 1456764
13002 1456764 1205523 1168671 1316997 1194793 1165693 1190478 1082617 1234514 1134771 1055010
12992 1055010 1122677 1178420 1066585 1014572 835460 858913 1252687 1549114 1447379 1368667
12982 1368667 1514349 1527649 1570343 1524060 1664272 2205062 2484016 2507494 2463509 2380328
$$ packed form
13054A882258j5510q4071o1375J37487J64625J9533k65706l85547l60343J17088
13044A148439J22603l1195k04318K9117J82336L2695J42022J27816k88708k06608
13034A054199m0378o6608O9578J12961J9082J04462K5334j11351j03228q206J68410
13023A224255L08495k1591k65662P9138o1540k30955M2652p7051m0547q373K66591
13012A215412j15263j5719J14098l894K01512J40974k23565k9074K74978j02695
13002A456764k51241l6852J48326j22204k9100K4785j07861J51897r9743p9761
12992A055010O7667N5743j11835n2013j79112K3453L93774K96427j01735p8712
12982A368667J45682J3300M2694m6283J40212N40790K78954K3478m3985q3181
$$ plain form
12972 2380328 2120033 2083966 2361642 2762158 2985627 3269993 3178816 3241328 3607435 3861984
12962 3861984 4403571 4894337 5454419 5882817 6373761 7337602 8674617 10069004 11655764
12953 11655764 13687345 16128113 18591980 21332992 24407595 28270925 32877649 38825058
12945 38825058 47615491 60599777 80567925 110174599 149636449 197979454 252402132
12938 252402132 305545252 352611071 390318944 415116961 426091482 419566055 395514442
12931 395514442 360225873 316919388 270362355 223753499 180303568 146313941 122777792
12924 122777792 106739311 95681660 87438191 80990523 75685941 70580551 66235455 62203115
12916 62203115 58580775 55075590 51860123 48753497 45983525 43885297 41947842 40336965
$$ packed form
12972B380328k60295l6067K77676M00516K23469K84366r1177O2512L66107K54549
12962C861984N41587M90766N60082M28398M90944R63841J337015J394387J586760
12953A1655764K031581K440768K463867K741012L074603L863330M606724N947409
12945C8825058Q790433J2984286J9968148K9606674L9461850M8343005N4422678
12938B52402132N3143120M7065819L7707873K4798017J0974521o525427k4051613
12931C95514442l5288569m3306485m6557033m6608856m3449931l3989627k3536149
12924A22777792j6038481j1057651q243469o447668n304582n105390m345096m032340
12916F2203115l622340l505185l215467l106626k769972k098228j937455j610877
$$ plain form
12908 40336965 38802344 37304928 36017277 34833389 33837091 32632473 31517999 30430935
12900 30430935 29697524 28879800 27705346 26733436 26161876 25703869 25125987 24389141 23811836
12891 23811836 23434597 22883656 22325740 21720635 21222235 20663664 19916618 19318708 18988805
12882 18988805 18799308 18157583 17576968 17297656 17111868 16605090 16339330 16123751 15877553
12873 15877553 15431965 14916189 14397425 13976288 13798208 13479716 13149015 12955423 12483414
12864 12483414 12177491 11859994 11392090 10942304 10952005 10763018 10845927 10623243 10231591 10010589
12854 10010589 9722973 9512929 9527412 9361531 9133693 8877902 8480726 8290895 8141203
12845 8141203 8269528 8074970 7794617 7493651 7615382 7522365 7302888 7101362 6863650 6866569
$$ packed form
12908D0336965j534621j497416j287651j183888r96298j204618j114474j087064
12900C0430935p33411q17724j174454r71910n71560m58007n77882p36846n77305
12891B3811836l77239n50941n57916o05105m98400n58571p47046n97910l29903
12882A8988805j89497o41725n80615k79312j85788n06778k65760k15579k46198
12873A5877553m45588n15776n18764m21137j78080l18492l30701j93592m72009
12864A2483414l05923l17497m67904m49786R701j88987Q2909k22684l91652k21002
12854A0010589k87616k10044J4483j65881k27838k55791l97176j89831j49692
12845H141203J28325j94558k80353l00966J21731r3017k19477k01526k37712K919
$$ plain form
12835 6866569 6660337 6629345 6495487 6244940 6052329 5868877 5597116 5487642 5586131 5721201
12825 5721201 5743232 5638588 5439167 5289305 5136962 5064749 5201395 5233106 5346298 5209200
12815 5209200 5065198 5308510 5435725 5296449 5476847 5972792 6114994 6173248 6193825 6234288
12805 6234288 6393266 6293734 6122635 5813885 5664445 5548290 5409656 5112458 5001224 5070970
12795 5070970 4921073 4812120 4839072 4896302 4589234 4287706 4259395 4107149 3954369 3838518
12785 3838518 3654882 3664462 3833480 3712240 3657277 3453001 3134092 3294092 3655776 3698590
12775 3698590 3437470 3469328 3446998 3223937 3203737 3158149 2817959 2817524 2761187 2898495 2765043
12764 2765043 2495511 2498186 2444790 2335874 2204334 2152738 2185841 2317602 2304913 2143770
$$ packed form
12835F866569k06232l0992j33858k50547j92611j83452k71761j09474R8489J35070
12825E721201K2031j04644j99421j49862j52343p2213J36646L1711J13192j37098
12815E209200j44002K43312J27215j39276J80398M95945J42202N8254K0577M0463
12805F234288J58978r9532j71099l08750j49440j16155j38634k97198j11234O9746
12795E070970j49897j08953K6952N7230l07068l01528k8311j52246j52780j15851
12785C838518j83636R580J69018j21240n4963k04276l18909J60000L61684M2814
12775C698590k61120L1858k2330k23061k0200m5588l40190m35n6337J37308j33452
12764B765043k69532K675n3396j08916j31540n1596L3103J31761j2689j61143
$$ plain form
12754 2143770 2110492 2220637 2010097 1898130 1889266 1660043 1663837 1586475 1611605 1584088 1761186
12743 1761186 1769530 1659086 1762560 1998007 2037948 2173737 2065209 1961695 1657131 1426035
12733 1426035 1334923 1321706 1154234 1056138 826448 939613 1069456 1430232 1641689 1639539
12723 1639539 1631033 1619950 1781947 2054984 2193605 2148447 2103329 1895392 1873179 1695888
12713 1695888 1470881 1589774 1993149 2529218 2830094 3348711 3633665 3753567 4140759
12704 4140759 4412588 4502523 4456955 4222623 3924834 3637936 3237357 2834754 2513975 2334647
12694 2334647 2233207 2074139 2010682 1932778 2036759 1940618 1619695 1555756 1934281 2051049
12684 2051049 2127665 2209344 2002954 1940052 1920787 1987980 1937947 1752560 1713246 1453878 1281330
$$ packed form
12754B143770l3278J10145k10540j11967q864k29223L794p7362K5130k7517J77098
12743A761186Q344j10444J03474K35447L9941J35789j08528j03514l04564k31096
12733A426035r1112j3217j67472r8096k29690J13165J29843L60776K11457k150
12723A639539q506j1083J61997K73037J38621m5158m5118k07937k2213j77291
12713A695888k25007J18893M03375N36069L00876N18617K84954J19902L87192
12704D140759K71829Q9935m5568k34332k97789k86898m00579m02603l20779j79328
12694B334647j01440j59068o3457p7904J03981r6141l20923o3939L78525J16768
12684B051049P6616Q1679k06390o2902j9265O7193n0033j85387l9314k59368j72548
$$ plain form
12673 1281330 1562815 1735275 1333338 1154594 1214176 1181077 1133382 998362 827207 673695
12663 673695 661450 756411 834349 880187 823775 797128 900863 731555 481497 635308 503133
12652 503133 408583 406778 575774 632351 645734 764935 923988 989416 926746 898103 910341
12641 910341 830713 760642 827266 755303 778058 858387 725618 636860 513901 409978 557179
12630 557179 767666 833852 673568 439703 359690 319789 396696 613846 803243 477739
12620 477739 241411 298823 719922 681916 669316 640139 619770 492335 562516 559667 619021
12609 619021 416516 327860 401257 495927 493055 394742 176157 215863 397687 558404 586608
12598 586608 636562 760630 494027 294609 327565 261583 196074 388710 323063 379684 521501
$$ packed form
12673A281330K81485J72460m01937j78744N9582l3099m7695j35020j71155j53512
12663F73695j2245R4961P7938M5838n6412k6647J03735j69308k50058J53811j32175
12652E03133r4550j805J68996N6577J3383J19201J59053O5428o2670k8643J2238
12641I10341p9628p0071O6624p1963K2755Q0329j32769q8758j22959j03923J47201
12630E57179K10487O6186j60284k33865q0013l9901P6907K17150J89397l25504
12620D77739k36328N7412M21099l8006j2600k9177k0369j27435P0181k849N9354
12609F19021k02505q8656P3397R4670k872r8313k18585L9706J81824J60717K8204
12598E86608M9954J24068k66603j99418L2956o5982o5509J92636o5647N6621J41817
$$ plain form
12587 521501 671618 852372 563149 437621 455484 427162 477122 182767 71204 275103
12577 275103 432656 345592 298387 245299 295384 229105 127204 262355 267365 169592 207245
12566 207245 159543 280379 345659 447955 472250 384273 250921 337793 372539 388507 314999
12555 314999 449846 526445 387160 233077 190576 327992 552410 415868 260470 214395
12545 214395 161413 140331 257207 107750 66274 199635 163684 83826 195048 80138
12535 80138 6958 -232489 -226627 -88648 -69558 -48985 -113563 -41342 308054 341634 190848
12524 190848 228735 287183 338879 376012 342029 350142 211254 -66180 -264991 -110920 95111
12513 95111 431859 643091 691052 1087141 1368097 1546573 1615361 1983226 2274478 2485022
$$ packed form
12587E21501J50117J80754k89223j25528J7863k8322M9960k94355j11563K03899
12577B75103J57553q7064m7205n3088N0085o6279j01901J35151N010r7773L7653
12566B07245m7702J20836O5280J02296K4295q7977j33352Q6872L4746J5968p3508
12555C14999J34847P6599j39285j54083m2501J37416K24418j36542j55398m6075
12545B14395n2982k1082J16876j49457m1476J33361l5951p9858J11222j14910
12535H0138p3180k39447N862J37979J9090K0573o4578P2221L49396L3580j50786
12524A90848L7887N8448N1696L7133l3983Q113j38888k77434j98811J54071K06031
12513I5111L36748K11232M7961L96089K80956J78476O8788L67865K91252K10544
$$ plain form
12503 2485022 2416981 2108560 1667354 1554084 1545348 1353212 1039712 579794 473404 416641
12493 416641 375241 575917 600325 270005 289925 551551 550380 365997 186339 72730
12483 72730 -20631 71125 306447 296810 283633 363472 311797 362338 402682 366603 288969 112253
12471 112253 252570 375858 237607 57559 -36276 -90698 -130563 -2213 252605 162023
12461 162023 143388 166920 372912 686874 602688 439464 494348 326381 259872 402585
12451 402585 475682 387460 373845 383113 457959 312576 250928 267423 305171 528697 449153
12440 449153 303967 79063 -210283 37509 212680 231563 270441 185659 251310 287695
12430 287695 246847 326212 18808 -105242 145273 262763 157497 133966 92167 72704
$$ packed form
12503B485022o8041l08421m41206j13270q736j92136l13500m59918j06390n6763
12493D16641m1400K00676K4408l30320J9920K61626j171j84383j79658j13609
12483G2730r3361R1756K35322r637j3177P9839n1675N0541M0344l6079p7634j76716
12471A12253J40317J23288j38251j80048r3835n4422l9865J28350K54818r0582
12461A62023j8635K3532K05992L13962q4186j63224N4884j67967o6509J42713
12451D02585P3097q8222j3615R268P4846j45383o1648J6495L7748K23526p9544
12440D49153j45186k24904k89346K47792J75171J8883L8878q4782O5651L6385
12430B87695m0848P9365l07404j24050K50515J17490j05266k3531m1799j9463
$$ plain form
12420 72704 -19805 109591 317929 434805 413744 382998 158731 150035 44294 943 -185591
12409 -185591 -139708 -102957 -286032 -291383 -197018 -30900 59645 -99313 -27090 184584 121392
12398 121392 26796 -64747 -162699 26253 -11477 -54250 -77502 -259833 -324600 -219366 -125814
12387 -125814 102411 154317 190171 137820 73362 89179 195129 254357 303251 300911 539974
12376 539974 788076 709694 731853 731593 662839 430089 12602 102680 158109 121406 128716
12365 128716 43961 -45453 -164 20513 -53757 -340724 -228395 -209231 -112310 42320 40258
12354 40258 -235618 -57 195735 166651 80575 203843 207029 -14326 7092 133285 -37471
12343 -37471 -326387 -146310 34687 -868 45542 -170250 -313460 -310943 -104835 -40969 -6231
$$ packed form
12420G2704r2509J29396K08338J16876k1061l0746k24267q696j05741m3351j86534
12409a85591M5883L6751j83075n351R4365J66118R0545j58958P2223K11674o3192
12398A21392r4596r1543r7952J88952l7730m2773k3252j82331o4767J05234R3552
12387a25814K28225N1906L5854n2351o4458J5817J05950N9228M8894k340K39063
12376E39974K48102p8382K2159k60o8754k32750m17487R0078N5429l6703P310
12365A28716q4755q9414M5289K0677p4270k86967J12329J9164R6921J54630k062
12354D0258k75876K35561J95792k9084q6076J23268L186k21355K1418J26193j70756
12343c7471k88916J80077J80997l5555M6410k15792j43210K517K06108O3866L4738
$$ plain form
12332 -6231 -133062 -261796 -167246 -110447 9770 119675 -17672 -106748 -312474 -272743 -162505
12321 -162505 -182697 -40982 144824 345310 249656 146413 93923 59360 79082 126186 227940
12310 227940 212020 132731 300216 308914 246358 199368 7669 41976 168268 -52547 -205483
12299 -205483 -358801 -1382 1633 -42534 51221 174269 324840 393940 265504 229423 53534
12288 53534 -128312 -272928 -431062 -387822 -134043 116938 5331 -142541 -304641 -380597
12278 -380597 -249532 -151857 -129602 -59634 153542 88879 -118924 -16404 3542 59229 236387
12267 236387 187763 48842 142043 58502 -111653 -149070 48543 114155 14930 1624 248833
12256 248833 273259 468118 409274 8851 -175267 -8021 373563 219420 -93769 -233835
$$ packed form
12332f231j26831j28734R4550N6799J20217J09905j37347q9076k05726L9731J10238
12321a62505k0192J41715J85806K00486r5654j03243n2490l4563J9722M7104J01754
12310B27940j5920p9289J67485Q698o2556m6990j91699L4307J26292k20815j52936
12299b05483j53318L57419L015m4167R3755J23048J50571O9100j28436l6081j75889
12288E3534j81846j44616j58134M3240K53779K50981j11607j47872j62100p5956
12278c80597J31065R7675K2255O9968K13176o4663k07803J02520J9946N5687J77158
12267B36387m8624j38921R3201q3541j70155l7417J97613O5612r9225j3306K47209
12256B48833K4426J94859n8844m00423j84118J67246L81584j54143l13189j40066
$$ plain form
12246 -233835 -419824 -426670 -102162 131011 266650 61498 -201002 -571152 -522979 -385818
12236 -385818 -207389 -145200 -195882 -20536 21624 131741 161284 165866 255580 -123260 -368842
12225 -368842 -368845 -326803 -445284 -359483 -180474 115955 285785 3955 -273585 -341752 -173595
12214 -173595 -155818 -232913 -145592 108830 358474 342782 147444 72209 133439 125383 -173472
12203 -173472 -292443 -190980 116830 228556 103338 49205 -236711 -314755 -129703 -68014
12193 -68014 -37358 -104637 -163772 -47651 -116533 -217768 -186023 -44343 -243929 -532066 -142252
12182 -142252 -17104 -201360 -39972 62180 39967 31629 -27873 158038 216066 357614
12172 357614 383360 97569 -185472 -425969 -373733 -173473 -32565 -69515 -222139 -314008
$$ packed form
12246b33835j85989o846L24508K33173J35639k05152k62500l70150M8173J37161
12236c85818J78429O2189n0682J75346M2160J10117K9543M582Q9714l78840k45582
12225c68842lM2042j18481Q5801J79009K96429J69830k81830k77540o8167J68157
12214a73595J7777p7095Q7321K54422K49644j5692j95338p5235O1230q056k98855
12203a73472j18971J01463L07810J11726j25218n4133k85916p8044J85052O1689
12193f8014L0656o7279n9135J16121o8882j01235L1745J41680j99586k88137L89814
12182a42252J25148j84256J61388J02152k2213q338n9502J85911N8028J41548
12172C57614K5746k85791k83041k40497N2236K00260J40908l6950j52624r1869
$$ plain form
12162 -314008 -582420 -405989 -128026 800 141865 49265 -18761 -269584 -439773 -597501
12152 -597501 -567282 -365073 -156719 -131358 -70561 -28034 -34786 121607 71605 -35919 -35521
12141 -35521 35075 -328931 -613249 -705816 -632268 -593898 -296238 -338844 -300216 -251954 -297258
12130 -297258 -330458 -271272 -219291 -275672 -281013 -325356 -337310 -134210 -138496 70235 -165251
12119 -165251 -37666 23314 -167345 -45764 86605 193204 177064 238094 126721 1857
12109 1857 -94235 -75517 171950 143644 -69509 -121554 -150370 -299662 -417617 -99056 106819
12098 106819 -42486 -156517 -145386 103351 135392 -202238 -415476 -447435 -292246 -91990
12088 -91990 15862 110551 19865 -19654 86317 130907 -51824 -252222 -150156 -174004 -233624
$$ packed form
12162c14008k68412J76431K77963J28826J41065r2600o8026k50823j70189j57728
12152e97501L0219K02209K08354K5361O0797M2527o752J56393n0002j07524L98
12141c5521P0596l64006k84318r2567P3548L8370K97660m2606L8628M8262m5304
12130b97258l3200N9186N1981n6381n341m4343j1954K03100m286K08731k35486
12119a65251J27585O0980j90659J21581J32369J06599j6140O1030j11373j24864
12109A857r6092J8718K47467k8306k13153n2045k8816j49292j17955L18561K05875
12098A06819j49305j14031J1131K48737L2041l37630k13238l1959J55189K00256
12088i1990J07852R4689r0686l9519J05971M4590j82731k00398J02066k3848n9620
$$ plain form
12077 -233624 -50568 223466 11538 -229888 -107521 -99678 -64099 -130631 -278656 -404950
12067 -404950 -233057 -202192 -124974 223592 466131 468002 207301 -102140 -184444 -400790
12057 -400790 -325138 -105022 -68085 -97513 164755 188917 17755 -145675 -204086 -225616 -238955
12046 -238955 -276741 -398752 -681771 -258619 351486 595475 447722 509789 454727 164228
12036 164228 193229 254454 193322 58065 -162332 96048 387486 386696 474911 408135 541611
12025 541611 392120 206329 56281 -87614 -45742 176571 435033 434196 594548 481784
12015 481784 58404 20150 249955 133144 -157689 -59292 -219035 -503153 -294137 -102412
12005 -102412 -120030 -259598 -304031 -160696 -184590 -190930 -141294 -88948 -264323 -143187 60144
$$ packed form
12077b33624J83056K74034k11928k41426J22367P843L5579o6532j48025j26294
12067d04950J71893L0865P7218L48566K42539J871k60701l09441q2304k16346
12057d00790P5652K20116L6937k9428K62268K4162j71162j63430n8411k1530j3339
12046b38955l7786j22011k83019M23152O10105K43989j47753O2067n5062k90499
12036A64228K9001O1225o1132j35257k20397K58380K91438p90Q8215o6776J33476
12025E41611j49491j85791j50048j43895M1872K22313K58462q37J60352j12764
12015D81784m23380l8254K29805j16811k90833R8397j59743k84118K09016J91725
12005a02412j7618j39568m4433J43335k3894o340M9636N2346j75375J21136K03331
$$ plain form
11994 60144 -10076 -50004 183937 484121 430138 138459 -193014 -189153 -283773 -303954 -289241
11983 -289241 -76391 -29152 34044 133301 255792 178900 51449 57354 -139104 730 238483
11972 238483 206403 18798 -346596 -141930 -2111 -65984 77249 -25533 -101739 -189769
11962 -189769 -144104 -253580 -348109 -159589 68844 52230 -81359 -201899 -394321 -397106
11952 -397106 -82660 -119984 -154143 -231264 -222716 122622 198059 50749 -218369 -200081 11796
11941 11796 -12749 44742 56223 -37266 -188382 -285490 -234876 -167481 -262707 -253550 -198022 60599
11929 60599 254984 -16393 -162606 -278255 -257332 -251715 -168431 9973 83831 -137870 -72579
11918 -72579 -229098 -38204 71931 59317 -56347 -221514 -167769 -54413 43033 -263295
$$ packed form
11994F0144p0220l9928K33941L00184n3983k91679l31473L861r4620k0181J4713
11983b89241K12850M7239O3196R9257J22491p6892j27451N905j96458J39834K37753
11972B38483l2080j87605l65394K04666J39819o3873J43233j02782p6206q8030
11962a89769M5665j09476r4529J88520K28433j6614j33589j20540j92422k785
11952c97106L14446l7324l4159p7121Q548L45338P5437j47310k69118J8288K11877
11941A1796k4545N7491J1481r3489j51116r7108N0614O7395r5226R157N5528K58621
11929F0599J94385k71377j46213j15649K0923N617Q3284J78404P3858k21701O5291
11918g2579j56519J90894J10135j2614j15664j65167N3745J13356R7446l06328
$$ plain form
11908 -263295 -58217 155392 91476 -130509 -222121 -182268 -5144 -31705 -239942 -390624
11898 -390624 -329181 -68879 -2036 -29387 -279747 -160899 80808 18052 -1066 325533
11888 325533 648884 551282 446964 508150 442871 310344 84945 37251 69102 -990 39494
11877 39494 70858 309062 377332 252602 105936 88908 25202 89777 74673 12314 -14727
11866 -14727 9022 24394 15533 -142212 -213451 -209756 -386770 -517561 -414566 -136735 -65317
11855 -65317 -167860 -89347 -276781 -253914 141747 30732 -131984 36188 -16439 -30072
11845 -30072 -269952 -373772 -179942 -85056 -249116 -330283 -189806 294590 157170 48136
11835 48136 193215 265006 323962 196339 88504 33006 -152071 -180941 84801 455210
$$ packed form
11908b63295K05078K13609o3916k21985r1612L9853J77124k6561k08237j50682
11898c90624O1443K60302O6843k7351k50360J18848K41707o2756j9118L26599
11888C25533L23351r7602j04318O1186o5279j32527k25399m7694L1851p0092M0484
11877C9494L1364K38204O8270j24730j46666j7028o3706O4575j5104o2359k7041
11866a4727K3749J5372q861j57745p1239L695j77014j30791J02995K77831P1418
11855f5317j02543P8513j87434K2867L95661j11015j62716J68172n2627j3633
11845c0072k39880j03820J93830R4886j64060q1167J40477M84396j37420j09034
11835D8136J45079P1791N8956j27623j07835n5498j85077k8870K65742L70409
$$ plain form
11825 455210 591903 290655 -15361 -287070 -211995 -135797 -210562 -175026 107890 70109
11815 70109 -4850 -60912 7383 70149 40236 -47644 -149697 -471555 -305506 -333667 -138566
11804 -138566 -30388 -66440 -52253 -32874 -58346 -166021 -149162 -160133 -205196 -342906 -214296
11793 -214296 -17350 -47080 -28268 10641 65812 -52103 -23299 27008 56694 68640 104728
11782 104728 69399 -4935 -152993 64450 189986 247461 198684 71888 -53215 -181256
11772 -181256 -307331 -21641 37945 -117351 -122143 220952 358330 219378 186057 210649
11762 210649 -42396 -339835 -349970 -360160 -295721 12683 48062 281717 391668 -75992
11752 -75992 -418293 -656999 -682085 -651280 -483814 -171918 -123121 -183107 -68735 -114281 -134492
$$ packed form
11825D55210J36693l01248l06016k71709P5075P6198p4765L5536K82916l7781
11815G0109p4959n6062O8295O2766k9913q7880j02053l21858J66049k8161J95101
11804a38566J08178l6052J4187J9379k5472j07675J6859j0971m5063j37710J28610
11793b14296J96946k9730J8812L8909N5171j17915K8804N0307K9686J1946L6088
11782A04728l5329p4334j48058K17443J25536N7475m8777j26796j25103j28041
11772a81256j26075K85690N9586j55296m792L43095J37378j38952l3321K4592
11762B10649k53045k97439j0135j0190O4439L08404L5379K33655J09951m67660
11752g5992l42301k38706k5086L0805J67466L11896M8797n9986J14372m5546k0211
$$ plain form
11741 -134492 -28987 -92926 -343437 -316405 -172333 -72317 265625 289152 293748 251910 121095
11730 121095 241238 259714 202066 204189 134284 -109742 -304189 -600870 -613304 -575130 -357216
11719 -357216 -254142 -176748 -132032 -137206 -184227 -114410 -215573 -431858 -343438 -109185 -30379
11708 -30379 -34346 -30946 -88933 48886 -98420 -155914 -231337 -156304 -20651 121522 226463
11697 226463 166287 -52064 -174392 -175067 -152694 -75434 61149 28464 38971 -83434 -322921
11686 -322921 -531648 -580426 -552607 -400292 -323905 -181777 62811 338098 329373 293544 314738
11675 314738 -95377 -302484 -211768 256 264160 431716 379277 199615 -27558 -69917
11665 -69917 -104092 37097 30651 45207 97220 64315 52023 107116 -98713 -108042 159407
$$ packed form
11741a34492J05505o3939k50511K7032J44072J00016L37942K3527M596m1838j30815
11730A21095J20143J8476n7648K123o9905k44026j94447k96681j2434L8174K17914
11719c57216J03074P7394M4716n174m7021O9817j01163k16285Q8420K34253P8806
11708c0379l967L400n7987J37819j47306n7494p5423P5033J35653J42173J04941
11697B26463o0176k18351j22328o75K2373P7260J36583l2685J0507j22405k39487
11686c22921k08727m8778K7819J52315P6387J42128K44588K75287q725l5829K1194
11675C14738m10115k07107R0716K12024K63904J67556n2439j79662k27173m2359
11665f9917l4175J41189o446J4556N2013l2905j2292N5093k05829r329K67449
$$ plain form
11654 159407 129959 115072 117521 -99811 -228543 -194540 -314970 -192244 25537 67764 76386
11643 76386 121271 78011 -34814 -84429 121833 -131691 -177577 -113048 -93963 17451 235638
11632 235638 192647 203082 3480 18433 83338 -42272 -164094 -178856 -310517 -250508 -20297
11621 -20297 200823 402754 618161 475152 211156 -464 -68484 -170931 -321663 -384899
11611 -384899 -153799 48195 158520 429553 556175 669323 306593 -161520 -180752 -97355
11601 -97355 12455 -12334 -242288 -265804 24299 133431 -49271 -168834 -292562 -466218
11591 -466218 -279903 -364537 -272223 -213261 -342348 -231601 -188908 -202180 -144249 247976 288757
11580 288757 233681 -23366 -88112 4383 144235 267904 307264 211815 63064 239519
$$ packed form
11654A59407k9448j4887K449k17332j28732L4003j20430J22726K17781M2227Q622
11643G6386M4885m3260j12825m9615K06262k53524m5886O4529J9085J11414K18187
11632B35638m2991J0435j99602J4953O4905j25610j21822j4762j31661O0009K30211
11621b0297K21120K01931K15407j43009k63996k11620o8020j02447j50732o3236
11611c84899K31100K01994J10325K71033J26622J13148l62730m68113j9232Q3397
11601i7355J09810k4789k29954k3516K90103J09132j82702j19563j23728j73656
11591d66218J86315q4634R2314N8962j29087J10747M2693j3272N7931L92225M0781
11580B88757n5076k57047o4746R2495J39852J23669L9360r5449j48751J76455
$$ plain form
11570 239519 366357 244691 279451 268488 251940 127879 103277 30061 -152464 -165089 19916
11559 19916 82811 69264 -163854 -304434 -205908 -250953 -240261 -47352 8628 36761 -71260
11548 -71260 -353243 -142014 46004 -22742 -332836 -272800 -402699 -482025 -301499 -346102
11538 -346102 -274099 -239490 -75247 -27732 1422 -188989 -305776 -239797 -198010 -160772 -391161
11527 -391161 -150830 -42636 -264549 -309973 -212158 -39637 -8312 17112 90414 256104
11517 256104 9618 -236513 -284038 -60424 -19030 -224258 -239092 -112794 71898 226547
11507 226547 305144 361479 -14656 -53335 -187687 -257970 -223783 -300280 -262912 -133503 -136524
11496 -136524 -135748 -260642 -187162 -219397 -173983 -180435 -193513 -200562 -141229 -169896 -47670 -3725
$$ packed form
11570B39519J26838j21666L4760j0963j6548j24061k4602p3216j82525j2625J85005
11559A9916O2895j3547k33118j40580R8526m5045J0692J92909N5980K8133j08021
11548g1260k81983K11229J88018o8746l10094O0036j29899p9326J80526m4603
11538c46102P2003L4609J64243M7515K9154j90411j16787O5979M1787L7238k30389
11527c91161K40331J08194k21913m5424R7815J72521L1325K5424P3302J65690
11517B56104k46486k46131m7525K23614M1394k05228j4834J26298J84692J54649
11507B26547P8597N6335l76135l8679j34352p0283L4187p6497L7368J29409l021
11496a36524P76j24894P3480l2235M5414o452j3078p049N9333k8667J22226M3945
$$ plain form
11484 -3725 -173519 -237071 65899 252166 425885 565493 529046 272506 80854 -40691
11474 -40691 -300705 -433603 -304083 161078 49164 -126247 -290144 -417200 -348956 1970
11464 1970 -23474 -22917 95063 -30765 -79470 -22616 -42290 -348493 -522163 -306843 -255127
11453 -255127 -206680 -178737 -161795 -125445 -138771 123975 71322 45863 -28990 36398 118488
11442 118488 -26360 -280779 -231435 -461783 -360110 -128695 -162428 85222 47894 -8107
11432 -8107 65816 -7065 -224229 -256918 -145821 -156073 -118905 -109318 -84614 -250849 -24302
11421 -24302 -75980 -175949 -74340 -60673 15036 -88692 5302 -42101 -253835 -281679 -145888
11410 -145888 -116708 -105115 -204135 -245077 -281670 -341360 -274225 -312158 -249131 -129157 -76698
$$ packed form
11484c725j69794o3552L02970J86267J73719J39608l6447k56540j91652j21545
11474d0691k60014j32898J29520M65161j11914j75411j63897j27056O8244L50926
11464A970k5444N57J17980j25828m8705N6854j9674l06203j73670K15320N1716
11453b55127M8447K7943J6942L6350j3326K62746n2653k5459p4853O5388Q2090
11442A18488j44848k54419M9344k30348J01673K31415l3733K47650l7328n6001
11432h107P3923p2881k17164l2689J11097j0252L7168R587K4704j66235K26547
11421b4302n1678r9969J01609J3667P5709j03728R3994m7403k11734k7844J35791
11410a45888K9180J1593r9020m0942l6593n9690O7135l7933O3027J19974N2459
$$ plain form
11399 -76698 107294 265 -92190 -151370 -196428 -172676 -67524 -207591 -68080 61819
11389 61819 47246 -34958 -246472 -323139 -317220 -86973 -71204 -232759 -296365 12808 -21028
11378 -21028 -84380 251139 164999 -39670 195413 328841 328924 168212 51817 30585 230764
11367 230764 163125 -61648 50111 150409 -61445 -60859 -5044 -29708 -94255 -66635 -267354
11356 -267354 -343979 -263783 39263 -127522 -153726 -18395 34877 15481 -200051 -199487 88199
11345 88199 180078 -8018 -139281 -405924 -490037 -279094 2901 316500 328392 327928 215099
11334 215099 226185 360310 66084 -320068 -642012 -527611 -130566 113253 253139 -31154
11324 -31154 -121985 -84645 15445 108792 54112 -25947 21195 8616 -41501 -13028 -8753 -76407
$$ packed form
11399g6698J83992j07029r2455n9180m5058K3752J05152j40067J39511J29899
11389F1819j4573q2204k11514p6667N919K30247J5769j61555o3606L09173l3836
11378b1028o3352L35519q6140k04669K35083J33428Q3j60712j16395k1232K00179
11367B30764o7639k24773J11759J00298k11854N86N5815k4664o4547K7620k00719
11356b67354p6625Q0196L03046j66785k6204J35331N3272j9396k15532N64K87686
11345H8199R1879j88096j31263k66643q4113K10943K81995L13599J1892m64j12829
11334B15099J1086J34125k94226l86152l21944J14401L97045K43819J39886k84293
11324c1154r0831L7340J00090R3347n4680q0059M7142j2579n0117K8473M275o7654
$$ plain form
11312 -76407 31819 -82653 -79940 -193775 -143425 52244 134867 119662 163292 70513 87402
11301 87402 70669 206483 33198 -174545 -257532 -21788 85961 12704 -199094 -233365
11291 -233365 -218944 -320542 -169561 15660 -86030 -101065 -113274 119131 140755 -189415
11281 -189415 -198724 222545 370984 363738 482582 457460 261803 126132 -8524 -23613 176588
11270 176588 131717 -98910 -42118 76182 -124327 -65830 -70901 -67549 -183365 -112697 18312
11259 18312 116692 327378 234964 187397 326394 403034 444720 411475 145946 177347 47810
11248 47810 31443 -66219 -24824 -149202 -109010 81796 -128602 -279060 -336595 -273017 -7062
11237 -7062 196472 98841 -80721 -96806 -20629 -17702 -288659 -458132 -302782 -111270 63618
$$ packed form
11312g6407J08226j14472K713j13835N0350J95669Q2623j5205M3630r2779J6889
11301H7402j6733J35814j73285k07743q2987K35744J07749p3257k11798l4271
11291b33365J4421j01598J50981J85221j01690j5035j2209K32405K1624l30170
11281a89415r309M21269J48439p246J18844k5122j95657j35671j34656j5089K00201
11270A76588m4871k30627N6792J18300k00509N8497n071L352j15816P0668J31009
11259A8312R8380K10686r2414m7567J38997P6640M1686l3245k65529L1401j29537
11248D7810j6367r7662M1395j24378M0192J90806k10398j50458n7535O3578K65955
11237g062K03534r7631j79562j6085P6177K927k70957j69473J55350J91512J74888
$$ plain form
11226 63618 220487 -36869 -200113 -43558 -75861 210271 512955 451603 184627 141460
11216 141460 40153 -95847 65954 19528 -64218 337969 461372 449189 236161 17860
11206 17860 -301894 -127533 38557 199215 193503 188996 58245 -47369 121852 246671
11196 246671 235063 52386 167633 233824 122817 258488 396731 411439 504678 342291
11186 342291 523147 526944 434284 437765 314468 90176 62161 -40171 -240391 -240792 -8275
11175 -8275 -42323 -58911 -318062 -704551 -685432 -263992 23696 -263482 -687363 -696685 -656095
11164 -656095 -435345 -338464 -355329 -277747 -326135 -509021 -535887 -288815 56773 176533
11154 176533 101750 -54135 -49817 96041 79413 -142878 -182549 -83138 124415 8700 53058
$$ packed form
11226F3618J56869k57356j63244J56555l2303K86132L02684o1352k66976m3167
11216A41460j01307j36000J61801m6426q3746M02187J23403j2183k13028k18301
11206A7860l19754J74361J66090J60658n712m507j30751j05614J69221J24819
11196B46671j1608j82677J15247O6191j11007J35671J38243J4708R3239j62387
11186C42291J80856L797r2660L481j23297k24292k8015j02332k00220m01K32517
11175h275l4048j6588k59151l86489J9119M21440K87688k87178m23881r322M0590
11164f56095K20750R6881j6865P7582m8388j82886k6866K47072L45588J19760
11154A76533p4783j55885M318J45858j6628k22291l9671R9411K07553j15715M4358
$$ plain form
11143 53058 324907 576265 550011 211388 -149126 -219169 -213250 -127274 -15221 -133778 -476756
11132 -476756 -624042 -271089 -56425 -37754 -170544 -120471 -13663 -282648 -395301 -422021
11122 -422021 -376728 32747 225511 9240 -215246 -169225 -95987 180794 482537 517998
11112 517998 403825 103506 -6022 40019 -56938 -369683 -432535 -412496 -59605 51794
11102 51794 -42338 42236 -160535 -308968 -227530 22466 24455 -62339 82476 176774 296432
11091 296432 212544 164548 114206 34299 120935 -37103 -19230 110691 293401 66181 -420587
11080 -420587 -653589 -595945 -618865 -408992 -365262 -466346 -391418 -65310 128089 224442
11070 224442 228154 174553 208566 67562 71917 84504 -24845 45946 -86070 -132790 -39516
$$ packed form
11143E3058K71849K51358k6254l38623l60514p0043N919Q5976J12053j18557l42978
11132d76756j47286L52953K14664J8671j32790N0073J06808k68985j12653k6720
11122d22021M5293M09475J92764k16271k24486M6021P3238K76781L01743L5461
11112E17998j14173l00319j09528M6041r6957l12745o2852K0039L52891J11399
11102E1794r4132Q4574k02771j48433Q1438K49996J989q6794J44815R4298J19658
11091B96432q3888m7996n0342p9907Q6636j58038J7873J29921J82710k27220m86768
11080d20587k33002N7644k2920K09873M3730j01084P4928L26108J93399R6353
11070B24442L712n3601L4013j41004M355J2587j09349P0791j32016m6720R3274
$$ plain form
11059 -39516 -109713 -267462 -197104 18933 -158668 -149703 -43503 293410 425648 487331 191562
11048 191562 -192963 -145419 16244 -66634 -189793 -102044 40858 309113 182310 91347
11038 91347 238613 93277 -32128 -173464 -390929 -554000 -359219 -139118 -46343 -306810
11028 -306810 -268828 -114516 -93189 -100168 200477 309202 414266 509574 361335 376995 281611
11017 281611 249664 295390 296203 310447 120069 163770 149923 118309 -77208 -202195 -157486
11006 -157486 -160316 -266208 -219401 -155347 -80670 -122962 -63934 140895 340590 336254 -23634
10995 -23634 -189582 -28046 26426 207711 115970 69754 -31157 84142 77365 -165568 -78018
10984 -78018 -64142 -209124 -244443 -324157 -278203 -289170 -188505 -284306 -132981 -15772 -97656
$$ packed form
11059c9516p0197j57749P0358K16037j77601Q965J06200L36913J32238O1683k95769
11048A91562l84525M7544J61663q2878j23159Q7749J42902K68255j26803r0963
11038I1347J47266j45336j25405j41336k17465j63071J94781K20101R2775k60467
11028c06810L7982J54312K1327o979L00645J08725J05064R5308j48239J5660r5384
11017B81611l1947M5726Q13J4244j90378M3701j3847l1614j95517j24987M4709
11006a57486k830j05892M6807O4054P4677m2292N9028K04829J99695m336l59888
10995b3634j65948J61536N4472J81285r1741m6216j00911J15299o777k42933Q7550
10984g8018J3876j44982l5319p9714M5954j0967J00665r5801J51325J17209q1884
$$ plain form
10973 -97656 -25370 89002 149179 -95480 53917 -30788 -110949 -100081 -360874 -530460 -393908
10962 -393908 -248660 -207132 -254207 -180230 -227169 -69009 135282 143078 -31396 -202963 -60512
10951 -60512 322 -191095 -141471 13559 19098 126037 65906 46883 220785 321561 291456
10940 291456 -20577 -203783 -156676 117514 163900 130979 49224 -319037 -253319 -274944 -301895
10929 -301895 -327228 -119587 299856 386769 327519 167326 163230 288660 135221 -128684
10919 -128684 -194898 -387119 -383688 -331858 -179236 -187796 -254176 -188021 -115098 -154869 -157471 -378005
10907 -378005 -361916 -134025 -23575 -40781 -267184 -661581 -515446 -384597 -355477 -424469
10897 -424469 -293074 -66989 87144 204310 -30144 73217 -157149 -70364 210582 123224
$$ packed form
10973i7656P2286J14372O0177k44659J49397q4705q0161J0868k60793j69586J36552
10962c93908J45248M1528m7075P3977m6939J58160K04291P796j74474j71567J42451
10951f0512O0834j91417M9624J55030N539J06939o0131j9023J73902J00776l0105
10940B91456l12033j83206M7107K74190M6386l2921q1755l68261O5718k1625k6951
10929c01895k5333K07641M19443Q6913n9250j60193m096J25430j53439k63905
10919a28684o6214j92221L431N1830J52622q560o6380O6155P2923l9771k602k20534
10907c78005J6089K27891J10450j7206k26403l94397J46135J30849K9120o8992
10897d24469J31395K26085J54133J17166k34454J03361k30366Q6785K80946q7358
$$ plain form
10887 123224 62965 68577 -38602 -80242 -287166 -389158 -182858 -82953 86126 123453 110703
10876 110703 296390 269032 187016 231513 279537 110244 -108645 -78113 -1486 142043 224548
10865 224548 36225 -183142 -156692 113158 171411 -108620 -92028 -114780 -3507 27659
10855 27659 -24455 -74074 -406735 -387430 -108316 137967 66969 125417 450590 445106 215554
10844 215554 56350 46819 100208 -40571 -286051 -467292 -696113 -666030 -647805 -550420 -170008
10833 -170008 215350 484072 344386 258798 157351 7209 -137948 -189400 -152074 -88034
10823 -88034 8390 131470 316793 198359 -16050 -120401 -199887 -300371 -168471 -12830
10813 -12830 53606 71757 51990 63859 116593 138244 -11941 -72371 31783 -10369 108268
$$ packed form
10887A23224o0259N612j07179m1640k06924j01992K06300R9905J69079L7327j2750
10876A10703J85687k7358q2016M4497M8024j69293k18889L0532P6627J43529Q2505
10865B24548j88323k19367K6450K69850N8253k80031J6592k2752J11273L1166
10855B7659n2114m9619l32661J9305K79114K46283p0998N8448L25173n484k29552
10844B15554j59204r531N3389j40779k45480j81241k28821L0083J8225R7385L80412
10833a70008L85358K68722j39686q5588j01447j50142j45157n1452L7326O4040
10823h8034R6424J23080J85323j18434k14409j04351p9486j00484J31900J55641
10813a2830O6436J8151j9767J1869N2734K1651j50185o0430J04154m2152J18637
$$ plain form
10802 108268 198331 114088 -67008 -121397 -256489 54693 221350 79095 -168083 -201011
10792 -201011 -96420 136908 178655 128113 45659 96978 -37779 -267742 -277314 -66310 -97350
10781 -97350 -115869 -173164 -103416 -119789 -88566 -97496 -136129 -59274 2053 -49014 -161332 -7994
10769 -7994 101717 100382 232733 250615 216231 183037 -169135 -109858 56431 157383 59415
10758 59415 -193223 -87456 96094 122545 127108 101337 -154488 -175886 -186361 -486088 -337489
10747 -337489 3926 -85472 -157002 -138210 -131415 -251611 -365845 -538111 -304260 -217632 -419674
10736 -419674 -400020 -521227 -564958 -331621 -178813 -29017 88616 -54409 -189739 -283528
10726 -283528 -449603 -386644 -379421 -163035 8977 -142993 -62277 16982 -145659 -177017 -264377
$$ packed form
10802A08268R0063q4243j81096n4389j35092L11182J66657j42255k47178l2928
10792b01011J04591K33328M1747n0542q2454N1319j34757k29963r572K11004l1040
10781i7350j8519n7295O9748j6373L1223q930l8633P6855O1327n1067j12318J53338
10769g994J09711j335J32351J7882l4384l3194l52172N9277J66289J00952r7968
10758E9415k52638J05767J83550K6451M563k5771k55825k1398j0475k99727J48599
10747c37489L41415q9398p1530J8792O795j20196j14234j72266K33851Q6628k02042
10736d19674J9654j21207m3731K33337J52808J49796J17633j43025j35330r3789
10726b83528j66075O2959P223K16386J72012j51970Q0716P9259j62641l1358q7360
$$ plain form
10715 -264377 -191890 -237441 -371221 -405243 -311539 -264251 -263117 -106969 107500 -32174 -99925
10704 -99925 -2601 -22172 -296578 -255873 -134426 -123905 -57476 -123732 -129455 -173943 -298888
10693 -298888 -194188 -124800 -248578 -359754 -451559 -440372 -201096 -192374 -226905 -153397 -161392
10682 -161392 -265978 -416718 -315153 -223046 158429 292636 415188 343154 323114 203727
10672 203727 100327 263262 -117609 -401756 -224150 -7801 -317726 -360110 -153384 118259
10662 118259 -34825 -144215 120866 278686 45441 -14418 128212 112976 -59306 51658
10652 51658 15795 -103513 -289142 -391473 -330619 -493224 -546382 -744194 -479498 -270852
10642 -270852 100519 253332 208278 -144142 -318592 -488103 -100211 25131 -136709 -96032
$$ packed form
10715b64377P2487m5551j33780l4022R3704M7288J134J56148K14469j39674o7751
10704i9925R7324j9571k74406M0705J21447J0521O6429o6256n723m4488j24945
10693b98888J04700O9388j23778j11176r1805J1187K39276Q722l4531P3508p995
10682a61392j04586j50740J01565R2107L81475J34207J22552p2034k0040j19387
10672B03727j03400J62935l80871k84147J77606K16349l09925m2384K06726K71643
10662A18259j53084j09390K65081J57820k33245n9859J42630j5236j72282J10964
10652E1658l5863j19308j85629j02331O0854j62605n3158j97812K64696K08646
10642b70852L71371J52813m5054l52420j74450j69511L87892J25342j61840M0677
$$ plain form
10632 -96032 1708 59796 363584 326013 48291 147962 330165 114531 48785 84736 -209409
10621 -209409 -207090 -38004 122878 24777 17433 288768 168150 -91970 -5556 29459 -107855
10610 -107855 -77566 -147017 -189908 63491 50320 248188 312283 -142494 -452789 -312895
10600 -312895 -118662 -23273 116524 -128228 -388933 -179496 121053 119187 61908 -118744
10590 -118744 4630 -49404 -384447 -443753 -338889 -182388 69339 123859 -106052 71851
10580 71851 287487 180578 55888 207525 114997 -275649 -323199 -5043 71053 -133167
10570 -133167 -284199 -159515 -151880 -104230 52725 -3989 -19834 159357 331221 258328 31605
10559 31605 73347 79981 18230 -222088 -328812 -239010 -198485 -97001 -156350 -398433 -358854
$$ packed form
10632i6032R7740N8088L03788l7571k77722R9671J82203k15634o5746L5951k94145
10621b09409K319J69086J60882r8101p344K71335j20618k60120Q6414L5015j37314
10610a07855L0289o9451m2891K53399j3171J97868O4095m54777l10295J39894
10600c12895J94233R5389J39797k44752k60705K09437L00549j866n7279j80652
10590a18744J23374n4034l35043n9306J04864J56501K51727N4520k29911J77903
10580G1851K15636j06909j24690J51637r2528l90646m7550L18156P6096k04220
10570a33167j51032J24684P635M7650J56955n6714j5845J79191J71864p2893k26723
10559C1605M1742O634o1751k40318j06724Q9802M0525J01484n9349k42083L9579
$$ plain form
10548 -358854 -209397 -6103 28902 152989 123805 31277 148043 339531 318517 349210
10538 349210 814634 1015894 817808 705095 784532 359542 149584 -1783 -415400 -429173
10528 -429173 -152159 -238277 -508907 -110511 -45933 -182465 -310211 -245228 -203007 -291364
10518 -291364 -320691 -215201 -328313 -369795 -227005 -48031 -203316 -459747 -553175 -518304
10508 -518304 -179067 -93594 81040 15257 -294780 -151188 13319 300482 251314 283449
10498 283449 -91485 -171476 -104801 -77185 -63639 -42311 -204475 -280336 -317348 -131717 -128472
10487 -128472 -279032 -225363 -103805 -116845 -289358 -486225 -496911 -427423 -538975 -351571
10477 -351571 -111031 61765 87231 111115 -4826 -284604 -171560 -12209 122673 -89543
$$ packed form
10548c58854J49457K03294L5005J24087k9184r2528J16766J91488k1014L0693
10538C49210M65424K01260j98086j12713P9437m24990k09958j51367m13617j3773
10528d29173K77014q6118k70630L98396O4578j36532j27746O4983M2221q8357
10518b91364k9327J05490j13112m1482J42790J78974j55285k56431r3428L4871
10508e18304L39237Q5473J74634o5783l10037J43592J64507K87163m9168L2135
10498B83449l74934p9991O6675K7616J3546K1328j62164p5861l7012J85631L245
10487a28472j50560N3669J21558j3040j72513j96867j0686O9488j11552J87404
10477c51571K40540J72796K5466K3884j15941k79778J13044J59351J34882k12216
$$ plain form
10467 -89543 -270749 -320743 -175321 63596 -30686 11533 151463 266380 161761 -43920
10457 -43920 -57447 229637 175514 -68834 -34091 -251074 -304022 -97445 -132851 -75477 -146902
10446 -146902 -32045 -90195 -71577 -72401 -75134 54819 209508 373378 471389 261794 118643
10435 118643 45965 -39210 45414 26795 -106162 -184278 -129897 48935 -168288 -247828 -322735
10424 -322735 -211953 -232576 -202407 -186798 -181140 -18255 130525 193145 -17455 -340993 -306491
10413 -306491 -100209 38712 14151 2094 -110172 -398129 -577513 -587684 -542296 -373480
10403 -373480 -189513 -39761 71189 -21735 5838 34518 -78765 -352965 -388667 -364192
10393 -364192 -184079 -45527 -125632 -163133 195436 333982 241068 92953 47708 131994
$$ packed form
10467h9543j81206m9994J45422K38917r4282M2219J39930J14917j04619k05681
10457d3920j3527K87084n4123k44348L4743k16983n2948K06577l5406N7374p1425
10446a46902J14857n8150J8618q24k733J29953J54689J63870R8011k09595j43151
10435A18643p2678q5175Q4624j8619j32957p8116N4381J78832k17223p9540p4907
10424c22735J10782k0623L0169J5609N658J62885J48780O2620k10600l23538L4502
10413c06491K06282J38921k4561j2057j12266k87957j79384j0171M5388J68816
10403c73480J83967J49752J10950r2924K7573K8680j13283k74200l5702K4475
10393c64192J80113J38552q0105l7501L58569J38546r2914j48115m5245Q4286
$$ plain form
10383 131994 -61700 -17442 124136 303553 386911 378830 132731 9432 288876 401362
10373 401362 370305 157711 -185616 -145175 -7074 -84180 -124067 -137346 146160 337904
10363 337904 532254 382318 227019 240211 250010 192733 98277 -244250 -51644 53626
10353 53626 -227094 -294771 -65806 -91756 -57831 -108159 -203454 -80104 241904 315012 85488
10342 85488 -24817 6435 -74645 -173947 -286430 -259445 -324389 -200524 -33562 -123099 78239
10331 78239 44097 -64091 -24096 -37671 -71839 -261251 -328430 -288351 -296740 -157313 -50193
10320 -50193 -58324 -279625 -372082 -355618 -394036 -370484 -480422 -451856 -268924 71936 -77690
10309 -77690 -53946 -23594 132320 190267 52678 120304 47423 -33145 -72455 -3116 159328
$$ packed form
10383A31994j93694M4258J41578J79417Q3358q081k46099j23299K79444J12486
10373D01362l1057k12594l43327M0441J38101p7106l9887j3279K83506J91744
10363C37904J94350j49936j55299J3192R799n7277r4456l42527J92606J05270
10353E3626k80720o7677K28965k5950L3925n0328r5295J23350L22008P3108k29524
10342H5488j10305L1252q1080r9302j12483K6985o4944J23865J66962q9537K01338
10331G8239l4142j08188L9995j3575l4168j89412o7179M0079q389J39427J07120
10320e0193q131k21301r2457J6464l8418K3552j09938K8566J82932L40860j49626
10309g7690K3744L0352J55914N7947j37589O7626p2881q0568l9310O9339J62444
$$ plain form
10298 159328 244364 262547 156064 104379 6703 -56032 -23086 -65573 -186418 -187119 92176
10287 92176 171273 311672 333992 232446 245074 16478 -66776 132393 367688 224741
10277 224741 -24828 -37047 33268 -95702 -235786 -336665 -139300 77402 282469 402590
10267 402590 45546 -213324 -280909 -521108 -484391 -44251 277703 405019 407033 321741
10257 321741 274927 -24846 -243323 -254506 -324021 -344822 -233927 -138365 -41902 -18327 -265044
10246 -265044 -220977 -53149 329619 585345 585930 409821 226868 397665 462302 197769
10236 197769 52923 -75251 -100279 -58114 109847 42047 -124637 -238004 -216800 -90152
10226 -90152 77736 66937 -28056 70063 66427 -6384 -78029 -179005 -163873 -42264 84418
$$ packed form
10298A59328Q5036J8183j06483n1685r7676o2735L2946m2487j20845p01K79295
10287I2176P9097J40399K2320j01546J2628k28596q3254J99169K35295j42947
10277B24741k49569j2219P0315j28970j40084j00879J97365K16702K05067J20121
10267D02590l57044k58870o7585k40199L6717M40140L21954J27316K014q5292
10257C21741m6814k99773k18477j1183o9515k0801J10895R5562R6463K3575k46717
10246b65044M4067J67828L82768K55726N85j76109j82953J70797O4637k64533
10236A97769j44846j28174k5028M2165J67961o7800j66684j13367K1204J26648
10226i0152J67888j0799r4993R8119l636p2811p1645j00976J5132J21609J26682
$$ plain form
10215 84418 230234 371150 425237 260381 440689 566569 913927 967194 589792 421140
10205 421140 432721 307992 568846 535387 461862 311754 327281 250113 232203 219135 122493
10194 122493 144866 142479 34845 98340 91880 29628 -152292 -115066 6096 -88529 62686
10183 62686 195906 92306 82988 43217 -236958 -140036 -12001 163341 160719 262874 231227
10172 231227 81535 58413 52700 230163 173005 76407 74481 219092 119818 106990 246640
10161 246640 125763 226727 -48193 -194862 8335 199268 263180 167650 203005 186342
10151 186342 73633 117253 67414 149612 130637 -73406 -116740 -242623 -472154 -172940
10141 -172940 -9879 32857 285185 513017 246564 -74301 -14593 -22728 -188666 -141498
$$ packed form
10215H4418J45816J40916N4087j64856J80308J25880L47358N3267l77402j68652
10205D21140J1581j24729K60854l3459p3525j50108J5527p7168j7910j3068r6642
10194A22493K2373k387j07634O3495o460o2252j81920L7226J21162r4625J51215
10183F2686J33220j03600r318l9771k80175R6922J28035J75342k622J02155l1647
10172B31227j49692k3122n713J77463n7158r6598j926J44611r9274j2828J39650
10161B46640j20877J00964k74920j46669K03197J90933O3912r5530L5355j6663
10151A86342j12709M3620m9839Q2198j8975k04043m3334j25883k29531K99214
10141a72940J63061M2736K52328K27832k66453l20865N9708q135j65938M7168
$$ plain form
10131 -141498 -146034 -75754 169559 52519 -134758 -77257 115599 185059 228191 -38446 -120194
10120 -120194 -2841 113711 -40583 -288118 -331008 -42950 16608 -54705 -85451 -99367
10110 -99367 119929 191143 154936 71541 149044 -76813 -201823 -226848 163241 185002 148829
10099 148829 63938 -61844 -127836 -141458 131361 207805 193857 -33956 -18646 -58729 -143198
10088 -143198 -19015 19865 -48427 -107028 -182108 73735 267460 101656 -251549 -264037
10078 -264037 -143410 5272 193238 267769 509075 542521 509220 405823 263464 142177
10068 142177 20108 154456 100302 216475 115748 44886 124208 258653 370264 530940
10058 530940 408548 536859 506226 436646 344354 414334 401458 439090 394207 403704 452564
$$ packed form
10131a41498m536P0280K45313j17040j87277N7501J92856O9460M3132k66637q1748
10120a20194J17353J16552j54294k47535m2890K88058N9558p1313l0746j3916
10110i9367K19296P1214l6207q3395P7503k25857j25010k5025L90089K1761l6173
10099A48829q4891j25782o5992j3622K72819P6444j3948k27813J5310m0083q4469
10088a43198J24183L8880o8292n8601p5080K55843J93725j65804l53205j2488
10078b64037J20627J48682J87966P4531K41306L3446l3301j03397j42359j21287
10068A42177j22069J34348n4154J16173j00727p0862P9322J34445J11611J60676
10058E30940j22392J28311l0633o9580r2292O9980j2876L7632m4883R497M8860
$$ plain form
10047 452564 275843 319419 104842 -51612 221025 83827 -120828 -194385 -57522 -151829
10037 -151829 -148540 154932 -148505 -334455 -156281 16654 -10248 -112041 -214929 -148522
10027 -148522 -34867 -149030 -368855 -292514 -110571 -65327 -163607 4941 286949 304517
10017 304517 58521 -62645 28211 183587 402255 438680 478584 393469 101666 5013
10007 5013 25645 -59660 -38968 20965 96362 75752 255745 300106 260878 266327 218748 22544
9995 22544 -65293 -89898 -31046 -3792 153541 230943 94239 86557 369584 426226 417936 466630
9983 466630 147190 75190 68804 362500 338010 426851 560033 623384 495164 116611 -110666
9972 -110666 -191149 179514 266772 326217 182255 175093 369299 371849 57094 -38942 -182937
$$ packed form
10047D52564j76721M3576k14577j56454K72637j37198k04655p3557J36863r4307
10037a51829L289L03472l03437j85950J78174J72935k6902j01793j02888O6407
10027a48522J13655j14163k19825P6341J81943M5244r8280J68548K82008J7568
10017C04517k45996j21166R0856J55376K18668L6425L9904q5115k91803r6653
10007E013K0632q5305K0692N9933P5397k0610J79993M4361l9228N449m7579j96204
9995B2544q7837k4605N8852K7254J57333P7402j36704p682K83027N6642q290M8694
9983D66630l19440p2000o386K93696k4490Q8841J33182O3351j28220l78553k27277
9972a10666q0483L70663Q7258N9445j43962p162J94206K550l14755r6036j43995
$$ plain form
9961 -182937 -483891 -677874 -148767 351732 382176 281324 205136 46621 49813 201603
9951 201603 202151 320520 320185 215184 322575 -2218 -79463 170503 177165 -79948 -269296
9940 -269296 -151282 -288208 -225412 96593 253599 264392 248656 161728 223086 182641 35097
9929 35097 -143230 -134790 -59785 -75393 -11543 -215588 -242432 -212410 -236650 -201228 -199610 -210387
9917 -210387 -195285 79757 367686 353839 217182 443815 439493 186645 197244 -17104 -129009
9906 -129009 -39936 188204 161557 190137 348647 399991 143662 -42619 -6438 120214 -109017
9895 -109017 -228773 -71372 -79524 12777 79816 147898 166164 -8718 -97582 -38097 -308682
9884 -308682 -359111 -460366 -68546 58554 -20311 -38154 107809 281726 271389 -59017
$$ packed form
9961a82937l00954j93983N29107N00499L0444j00852p6188j58515L192J51790
9951B01603N48J18369l35j05001J07391l24793p7245K49966O662k57113j89348
9940b69296J18014j36926O2796L22005J57006J0793j5736q6928O1358m0445j47544
9929C5097j78327Q440P5005j5608O3850k04045k6844L0022k4240L5422J618j0777
9917b10387J5102K75042K87929j3847j36657K26633m322k52848J0599k14348j11905
9906a29009Q9073K28140k6647K8580J58510N1344k56329j86281L6181J26652k29231
9895a09017j19756J57401q152R2301O7039O8082J8266j74882q8864N9485k70585
9884c08682n0429j01255L91820J27100p8865j7843J45963J73917j0337l30406
$$ plain form
9874 -59017 -259330 -222402 39257 6779 -130065 -63142 -128970 -437812 -628828 -373535 -167680
9863 -167680 -242418 -285120 -243964 -300232 16296 336585 687595 554214 309510 252301 270607
9852 270607 420646 236312 214143 260134 177165 152859 176880 237070 523311 562384 368080
9841 368080 209829 264007 477282 496600 333727 167188 132856 304723 292085 255978 378128
9830 378128 359727 400146 71698 -54320 24938 -11976 -91064 -299386 -393878 -245114 -271657
9819 -271657 -492137 -289668 102707 172097 159726 -163431 -396113 -133053 50669 -34065
9809 -34065 90993 241644 195209 -53253 -206466 -215936 -225248 -111112 -200459 -146515 -182934
9798 -182934 -219015 -314607 -220991 -52669 -27752 -15570 -39099 -147789 2126 20496 -10693
$$ packed form
9874e9017k00313L6928K61659l2478j36844O6923o5828l08842j91016K55293K05855
9863a67680p4738m2702M1156n6268L16528L20289L51010j33381k44704n7209J8306
9852B70607J50039j84334k2169M5991q2969k4306K4021O0190K86241L9073j94304
9841C68080j58251N4178K13275J9318j62873j66539l4332J71867j2638l6107J22150
9830C78128j8401M0419l28448j26018P9258l6914p9088k08322r4492J48764k6543
9819b71657k20480K02469L92375O9390j2371l23157k32682K63060J83722q4734
9809c4065J25058J50651m6435k48462j53213r470r312J14136q9347N3944l6419
9798a82934l6081r5592R3616J68322K4917J2182k3529j08690J49915J8370l1189
$$ plain form
9787 -10693 -162307 -255120 -32749 165009 125359 183793 69070 -47505 -79871 -260308 -238950
9776 -238950 -299498 -425552 -208465 53368 66957 1936 -26426 52586 20200 5346 -213107
9765 -213107 -311796 -307087 -31132 -91908 -192241 -7376 131359 182935 157107 215300 207889
9754 207889 242561 194495 271694 134278 -30704 -7278 61 -167817 -183911 -123782 -159220
9743 -159220 -86496 28397 56918 122191 157697 429790 305926 88093 186141 232458 205735
9732 205735 174376 92681 84070 37907 -105677 92662 131415 176254 238379 124603 -43516
9721 -43516 -67195 -84281 126859 124711 -116599 -242965 -25584 360137 393984 268434 -35054
9710 -35054 -98484 -139618 48141 301721 369160 347190 347291 97922 -70430 -78500 53378
$$ packed form
9787a0693j51614r2813K22371J97758l9650N8434j14723j16575l2366j80437K1358
9776b38950o0548j26054K17087K61833J3589o5021k8362P9012l2386j4854k18453
9765b13107r8689M709K75955o0776j00333J84865J38735N1576k5828N8193p411
9754B07889L4672m8066P7199j37416j64982K3426P339j67878j6094O0129l5438
9743a59220P2724J14893K8521O5273L5506K72093j23864k17833R8048M6317k6723
9732B05735l1359q1695q611m6163j43584J98339L8753M4839O2125j13776j68119
9721d3516k3679j7086K11140k148k41310j26366K17381L85721L3847j25550l03488
9710c5054o3430m1134J87759K53580O7439k1970J01k49369j68352q070J31878
$$ plain form
9699 53378 -1632 -29541 -144053 -84483 -7843 -120031 -55775 93376 10735 -19937 135241
9688 135241 -54232 -105340 198693 165891 147746 -26386 -2760 52025 113613 146433 427751
9677 427751 371739 124106 -48554 -136127 67017 268964 198589 -78199 -221237 -179311
9667 -179311 -121585 201356 477521 289470 11304 129051 180081 213227 238057 221401 129549
9656 129549 74353 35982 -75409 -178762 -241849 -176089 -158168 215938 299114 94044 -126785
9645 -126785 -13979 23507 -42130 95990 265541 297286 217741 196851 57410 49645 -27718
9634 -27718 -267000 -395434 -181933 151153 377525 408231 456145 207793 219597 424038
9624 424038 399070 255703 390428 115026 126138 319837 301711 -6321 49437 101189 374118
$$ packed form
9699E3378n5010k7909j14512N9570P6640j12188O4256J49151q2641l0672J55178
9688A35241j89473n1108L04033l2802j8145j74132K3626N4785O1588L2820K81318
9677D27751n6012k47633j72660q7573K03144K01947p0375k76788j43038M1926
9667a79311N7726L22941K76165j88051k78166J17747N1030L3146K4830j6656r1852
9656A29549n5196l8371j11391j03353o3087O5760J7921L74106Q3176k05070k20829
9645a26785J12806L7486o5637J38120J69551L1745p9545k0890j39441p765p7363
9634b7718k39282j28434K13501L33086K26372L0706M7914k48352J1804K04441
9624D24038k4968j43367J34725k75402J1112J93699j8126l08032N5758N1752K72929
$$ plain form
9613 374118 217553 216937 351457 385834 85981 106263 -24726 -96770 -203409 -186211 -203580
9602 -203580 -258301 -328143 -71889 59999 152403 84185 -52919 -107119 -37821 -109238 -177076
9591 -177076 21276 -40741 -38473 318722 284502 181215 192123 104168 186831 395623 281799
9580 281799 214703 60586 91747 169451 31278 -169498 -75778 236598 325410 372833 495347
9569 495347 619553 569342 586767 441446 260219 265039 124756 305012 385151 217704 84475
9558 84475 103587 85866 171405 290452 210108 53479 222847 311719 329802 365352 471268
9547 471268 349651 328357 403537 655525 863348 793677 522212 473417 219703 70628
9537 70628 -88921 -163670 -57175 -311224 -358766 -58445 164814 376859 330582 108775
$$ packed form
9613C74118j56565o16J34520L4377k99853K0282j30989p2044j06639J7198j7369
9602b03580n4721o9842K56254J31888R2404o8218j37104n4200O9298p1417o7838
9591a77076J98352o2017K268L57195l4220j03287J0908q7955Q2663K08792j13824
9580B81799o7096j54117L1161P7704j38173k00776R3720L12376Q8812M7423J22514
9569D95347J24206n0211J7425j45321j81227M820j40283J80256Q0139j67447j33229
9558H4475J9112j7721Q5539J19047q0344j56629J69368Q8872J8083L5550J05916
9547D71268j21617k1294P5180K51988K07823o9671k71465m8795k53714j49075
9537G0628j59549p4749J06495k54049m7542L00321K23259K12045m6277k21807
$$ plain form
9527 108775 -152236 -187863 -148483 -416780 -395871 -237445 -99032 25198 -64632 53848
9517 53848 264745 209944 225200 342510 314229 325900 351317 252714 266586 196261 85522
9506 85522 189325 357422 354096 230873 -147574 -268176 -54285 -88890 32288 -18529 -6091
9495 -6091 -59679 16601 203481 222045 56667 -7095 -72084 53161 179368 487881 647979
9484 647979 538088 211491 256232 495304 420747 182028 350797 275334 43050 -65632
9474 -65632 63162 236435 521379 569224 428019 205302 99125 -182266 -40398 113913
9464 113913 -28135 92296 303241 431282 346945 219300 195924 388019 417651 138265
9454 138265 -24661 93042 352510 484527 447060 334280 285821 539162 591053 476800
$$ packed form
9527A08775k61011l5627L9380k68297K0909J58426J38413J24230q9830J18480
9517E3848K10897n4801J5256J17310k8281J1671K5417r8603J3872p0325j10739
9506H5522J03803J68097l326j23223l78447j20602K13891l4605J21178n0817J2438
9495f091n3588P6280J86880J8564j65378o3762o4989J25245J26207L08513J60098
9484F47979j09891l26597M4741K39072p4557k38719J68769p5463k32284j08682
9474f5632J28794J73273K84944M7845j41205k22717j06177k81391J41868J54311
9464A13913j42048J20431K10945J28041q4337j27645k3376J92095K9632k79386
9454A38265j62926J17703K59468J32017l7467j12780m8459K53341N1891j14253
$$ plain form
9444 476800 107842 -251935 -233753 -6280 305120 288647 245382 382698 174127 -60730
9434 -60730 -134384 -75116 34455 40757 -96598 73406 225918 220739 345321 415918 430017
9423 430017 309261 161680 243774 349694 445337 258239 239331 325034 490326 444048 231040
9412 231040 599284 657513 610866 667949 470241 616501 1017086 1076971 993616 672034 714616
9401 714616 827055 716001 421671 388910 580083 430351 171034 399100 522918 603298
9391 603298 641540 397745 447329 346120 220158 373117 528685 288519 139525 77090
9381 77090 252831 169417 269417 408314 501481 571624 451822 563548 486928 483076 420423
9370 420423 265216 188408 416449 658620 671013 685237 690343 657194 751128 672437 582360
$$ packed form
9444D76800l68958l59777J8182K27473L11400j6473m3265J37316k08571k34857
9434f0730p3654N9268J09571O302j37355J70004J52512n179J24582P0597J4099
9423D30017j20756j47581Q2094J05920R5643j87098j8908Q5703J65292m6278k13008
9412B31040L68244N8229m6647N7083j97708J46260M00585N9885q3355l21582M2582
9401G14616J12439j11054k94330l2761J91173j49732k59317K28066J23818Q0380
9391F03298L8242k43795M9584j01209j25962J52959J55568k40166j48994o2435
9381G7090J75741q3414J00000J38897R3167P0143j19802J11726p6620l852o2653
9370D20423j55207p6808K28041K42171J2393J4224N106l3149R3934p8691r0077
$$ plain form
9359 582360 627185 583537 603853 583792 448679 428989 531255 494855 288072 178628 166236
9348 166236 292824 286828 148077 219521 516916 600596 373045 299156 265754 344330 683116
9337 683116 819577 829450 910725 823489 923693 1030289 760058 812136 897749 642155 511805
9326 511805 557253 593145 690581 600897 534146 481477 283276 441653 616815 313647 377372
9315 377372 302279 477240 549353 739300 962742 1295469 1300931 1142917 932359 828141
9305 828141 740143 590427 481909 571420 643057 986799 823548 850509 991050 935819 779819
9294 779819 740364 863294 871999 588035 353894 277950 480228 616086 589743 516058 739697
9283 739697 1002979 1006972 1139988 997299 951117 897649 909553 943960 1010064 1148975 1205346
$$ packed form
9359E82360M4825m3648K0316k0061j35113j9690J02266l6400k06783j09444j2392
9348A66236J26588n996j38751P1444K97395Q3680k27551p3889l3402P8576L38786
9337F83116J36461R873Q1275q7236J00204J06596k70231N2078Q5613k55594j30350
9326E11805M5448L5892R7436q9684o6751n2669j98201J58377J75162l03168O3725
9315C77372p5093J74961P2113J89947K23442L32727N462j58014k10558j04218
9305H28141q7998j49716j08518Q9511P1637L43742j63251K6961J40541n5231j56000
9294G79819l9455J22930Q705k83964k34141p5944K02278J35858k6343p3685K23639
9283G39697K63282L993J33016j42689m6182n3468J1904L4407O6104J38911N6371
$$ plain form
9272 1205346 1038468 926215 769889 650769 760792 927329 929763 1093156 1289674 1460120
9262 1460120 1434378 1438898 1478721 1516368 1370472 1444127 1330596 1284810 1580957 1622623 1362261
9251 1362261 1133251 954673 1216022 1409944 1513274 1476322 1381073 1296701 1274098 1288320
9241 1288320 1346148 1556563 1533684 1339991 1132974 1333707 1407389 1378559 1342264 1545002
9231 1545002 1542068 1295237 1216227 1170993 1081653 1151148 1142757 881459 1001559 1167462 1246784
9220 1246784 1221434 1507379 1627921 1713935 1813300 1747204 1465185 1271402 1392392 1752398
9210 1752398 2035433 1733309 1392886 1176072 1288229 1495008 1428050 1215447 1319177 1646326
9200 1646326 1586559 1536587 1661909 1705548 1626243 1639760 1527458 1531541 1712850 1705362 1803362
$$ packed form
9272A205346j66878j12253j56326j19120J10023J66537K434J63393J96518J70446
9262A460120k5742M520L9823L7647j45896P3655j13531m5786K96147M1666k60362
9251A362261k29010j78578K61349J93922J03330l6952r5249q4372k2603J4222
9241A288320N7828K10415k2879j93693k07017K00733P3682k8830l6295K02738
9231A545002k934k46831p9010m5234q9340O9495q391k61298J20100J65903P9322
9220A246784k5350K85945J20542Q6014R9365o6096k82019j93783J20990L60006
9210A752398K83035l02124l40423k16814J12157K06779o6958k12603J03730L27149
9200A646326n9767m9972J25322M3639p9305J3517j12302M083J81309p488R8000
$$ plain form
9189 1803362 1688390 1664519 1696577 1621930 1805956 1903529 1889594 1892573 1798305 1833509 1997578
9178 1997578 2454470 2593913 2365243 2206116 2135429 2305642 2406548 2284937 2083688 2035083
9168 2035083 2096681 2292818 2331254 2371765 2555450 2781296 2854208 2905116 3162109 3168651 2772242
9157 2772242 2818183 3035296 3062065 3078441 2924533 2673138 2524625 2533304 2553893 2654762 2809063
9146 2809063 3040000 3357638 3487015 3473269 3424367 3291442 3511690 3810976 3919223 4032819
9136 4032819 4056272 3865833 3788064 3918881 3891620 3851532 3912768 4188996 4203063 4258327 4343526
9125 4343526 4476889 4480615 4409628 4356138 4656789 4943673 4905433 4775217 4972012 5051110 5005675
9114 5005675 4872063 4834407 4854518 5348019 5667078 5884098 5877099 5667062 5826855 5932938
$$ packed form
9189A803362j14972k3871L2058p4647J84026R7573j3935K979r4268L5204J64069
9178A997578M56892J39443k28670j59127p0687J70213J00906j21611k01249m8605
9168B035083O1598J96137L8436M0511J83685K25846P2912N0908K56993O542l96409
9157B772242M5941K17113K6769J6376j53908k51395j48513Q679K0589J00869J54301
9146B809063K30937L17638J29377j3746m8902j32925K20248K99286J08247J13596
9136D032819K3453j90439p7769J30817k7261m0088O1236K76228J4067N5264Q5199
9125D343526J33363L726p0987n3490L00651K86884l8240j30216J96795P9098m5435
9114E005675j33612l7656K0111M93501L19059K17020o999k10037J59793J06083
$$ plain form
9104 5932938 5876907 6127416 6122474 6025318 6175454 6254296 6268093 6499472 6591597 6611880 6657825
9093 6657825 6813880 6905315 7007324 6753599 6968610 7263240 7185184 7383591 7552275 7805276
9083 7805276 7927968 8054287 8263248 8156786 8489132 8819594 8841174 8838339 8850323 9177736
9073 9177736 9292977 9576071 9669344 9911011 9998244 9951929 10105664 10495637 10630741 10823603
9063 10823603 10923086 10961925 11132299 11467768 11585568 11823906 12105504 12435897 13077151 13369576
9053 13369576 13428281 13999669 14589706 14820796 14984948 15247646 15617669 15991306 16331211 16623552
9043 16623552 16988546 17344205 17872430 18325462 18994242 19815840 20561059 21067044 21175969
9034 21175969 21671139 22489283 23089770 23430895 24252268 24776801 25494739 26434610 27579887
$$ packed form
9104E932938n6031K50509m942r7156J50136P8842J3797K31379R2125K0283M5945
9093F657825J56055R1435J02009k53725K15011K94630p8056J98407J68684K53001
9083G805276J22692J26319K08961j06462L32346L30462K1580k835J1984L27413
9073I177736J15241K83094R3273K41667Q7233m6315J53735L89973J35104J92862
9063A0823603R9483L8839J70374L35469J17800K38338K81598L30393O41254K92425
9053A3369576N8705N71388N90037K31090J64152K62698L70023L73637L39905K92341
9043A6623552L64994L55659N28225M53032O68780Q21598P45219N05985J08925
9034B1175969M95170Q18144O00487L41125Q21373N24533P17938R39871J145277
$$ plain form
9025 27579887 28483514 29252768 30345611 31380945 32310581 33378228 34678342 35819603 37026517
9016 37026517 38386031 39713460 40860080 42205741 43671936 45348775 47151079 48746290
9008 48746290 50390253 52322022 53937513 55662295 57758796 59978247 61841817 63955507
9000 63955507 66191566 68452485 70693192 72926448 74991986 77309833 79582566 81779767
8992 81779767 83801320 85664908 87437930 89264069 91084897 92813590 94177498 95480928
8984 95480928 96990714 98019937 98692245 99064152 99336506 99416483 99098970 98904490 98292516
8975 98292516 97686759 97192538 96314324 95320226 93974753 92425796 90855768 89262803 87409216
8966 87409216 85741526 84212621 82601079 80941818 78976221 77109110 75326075 73739842
$$ packed form
9025B7579887R03627P69254J092843J035334R29636J067647J300114J141261J206914
9016C7026517J359514J327429J146620J345661J466195J676839J802304J595211
9008D8746290J643963J931769J615491J724782K096501K219451J863570K113690
9000F3955507K236059K260919K240707K233256K065538K317847K272733K197201
8992H1779767K021553J863588J773022J826139J820828J728693J363908J303430
8984I5480928J509786J029223O72308L71907K72354P9977l17513j94480o11974
8975I8292516o05757m94221q78214r94098j345473j548957j570028j592965j853587
8966H7409216j667690j528905j611542j659261j965597j867111j783035j586233
$$ plain form
8958 73739842 72036692 70092654 68460354 66855715 65329383 63685663 62171894 60550566
8950 60550566 59483906 58398016 56898063 55543544 54192577 52662708 51507523 50237822
8942 50237822 48920741 47904076 46778460 45673681 44688502 43899765 42877297 41718872
8934 41718872 40727749 39776634 38718885 37776489 37068190 36502849 35555228 34775556 34388202
8925 34388202 34023627 33262218 32486054 31893288 31325485 30700795 29981698 29314764 28669950
8916 28669950 28078945 27634893 27250001 26553818 26037844 25529995 24942379 24385881 24237592
8907 24237592 23948384 23374968 22857502 22470419 22002933 21622501 21192451 20758995 20414425
8898 20414425 20283422 20010125 19681648 19265374 19142887 19021269 18737382 18486917 18216259
$$ packed form
8958G3739842j703150j944038j632300j604639j526332j643720j513769j621328
8950F0550566j066660j085890j499953j354519j350967j529869j155185j269701
8942E0237822j317081j016665j125616j104779r85179p88737j022468j158425
8934D1718872r91123r51115j057749r42396p08299n65341r47621p79672l87354
8925C4388202l64575p61409p76164n92766n67803o24690p19097o66934o44814
8916B8669950n91005m44052l84892o96183n15974n07849n87616n56498j48289
8907B4237592k89208n73416n17466l87083m67486l80432m30050m33456l44570
8898B0414425j31003k73297l28477m16274j22487j21618k83887k50465k70658
$$ plain form
8889 18216259 17869265 17798797 17716956 17262476 17062722 16814303 16525288 16570152 16889780 17440741
8879 17440741 18339223 19162241 19616678 19641645 18560313 17287998 16245795 15693531 15251508
8870 15251508 14782714 14246384 13852090 13420836 13149802 13041977 12838948 12665220 12245580
8861 12245580 11952027 11694907 11581449 11416137 11316496 11180864 11011749 10766807 10813778 10757310
8851 10757310 10550670 10518302 10293742 10379383 10418667 10253754 10115707 9766736 9552125 9451376
8841 9451376 9500108 9355199 9403676 9495902 9500164 9144118 8731276 8639760 8696094 8451279 8190288
8830 8190288 8114314 8013262 7855679 7714652 7874456 7870321 7948978 7780458 7463163 7573836
8820 7573836 7534794 7157757 6910400 6697982 6895035 6865718 6829212 6956839 6989626 6930321
$$ packed form
8889A8216259l46994p0468q1841m54480j99754k48419k89015M4864L19628N50961
8879A7440741Q98482Q23018M54437K4967j081332j272315j042203n52264m42023
8870A5251508m68794n36330l94294m31254k71034j07825k03029j73728m19640
8861A2245580k93553k57120j13458j65312r9641j35632j69115k44942M6971n6468
8851A0757310k06640l2368k24560Q5641L9284j64913j38047l48971k14611j00749
8841I451376M8732j44909M8477R2226M262l56046m12842r1516N6334k44815k60991
8830H190288p5974j01052j57583j41027J59804m135P8657j68520l17295J10673
8820G573836l9042l77037k47357k12418J97053k9317l6506J27627L2787n9305
$$ plain form
8810 6930321 6721220 6542544 6299094 6195065 6155540 6325390 6182703 6079096 6051402 5987110
8800 5987110 5969408 5750642 5585285 5613503 5359571 5108448 5039607 5097170 5072576 5107674 5153426
8789 5153426 5043832 4890239 4824599 5046060 5239662 5158332 5096090 4824679 4770700 4776898 4508069
8778 4508069 4471259 4533635 4582092 4649988 4498844 4280398 4268157 4179154 4092526 4055218 3925482
8767 3925482 4097087 4268053 4207943 3798287 3716217 3774457 3592687 3505291 3305913 3398377
8757 3398377 3579953 3471301 3554545 3628885 3481196 3118512 3014851 3156581 3216989 3102227
8747 3102227 3236230 3304719 3408705 3420136 3264295 2729208 2995136 3253891 3420096 3492439
8737 3492439 3546130 3464817 3067828 2830177 2654796 2708538 2733040 2724347 2712325 2557586 2410216
$$ packed form
8810F930321k09101j78676k43450j04029l9525J69850j42687j03607k7694o4292
8800E987110j7702k18766j65357K8218k53932k51123o8841N7563k4594L5098M5752
8789E153426j09594j53593o5640K21461J93602q1330o2242k71411n3979O198k68829
8778D508069l6810O2376M8457O7896j51144k18446j2241q9003q6628l7308j29736
8767C925482J71605J70966o0110m09656q2070N8240j81770q7396j99378R2464
8757C398377J81576j08652Q3244P4340j47689l62684j03661J41730O0408j14762
8747C102227J34003O8489J03986J1431j55841n35087K65928K58755J66205P2343
8737C492439N3691q1313l96989k37651j75381N3742K4502q693j2022j54739j47370
$$ plain form
8726 2410216 2418969 2542573 2521796 2335679 2428084 2420637 2759456 3144869 3023546 2805091 2409106
8715 2409106 2256031 2259333 2125030 2198186 2374456 2317679 2360437 2555338 2598312 2367569 2059931
8704 2059931 2153064 2296854 2346987 2517325 2451462 2021113 1806442 1770686 1644472 1845297
8694 1845297 2029822 2019532 2075933 2226754 2219422 2280055 2064784 1991971 1952451 1869813 1613750
8683 1613750 1580838 1539124 1842311 1994972 2082207 2019598 1761245 1782767 1669297 1629759 1669825
8672 1669825 1641142 1748657 1807579 1906607 1825212 1843827 1795432 1904758 1830332 1639002 1568623
8661 1568623 1695733 1671570 1540939 1206365 1229203 1347328 1162903 1068458 839433 1111951
8651 1111951 1482062 1724089 1598446 1412856 1228278 1169231 1157970 1160792 1352621 1451781
$$ packed form
8726B410216Q753J23604k0777j86117R2405p447L38819L85413j21323k18455l95985
8715B409106j53075L302j34303P3156J76270n6777M2758J94901M2974k30743l07638
8704B059931R3133J43790N0133J70338o5863m30349k14671l5756j26214K00825
8694A845297J84525j0290N6401J50821p332O0633k15271p2813l9520q2638k56063
8683A613750l2912m1714L03187J52661Q7235o2609k58353K1522j13470l9538M0066
8672A669825k8683J07515N8922R9028q1395J8615m8395J09326p4426j91330p0379
8661A568623J27110k4163j30631l34574K2838J18125j84425r4445k29025K72518
8651A111951L70111K42027j25643j85590j84578n9047j1261K822J91829R9160
$$ plain form
8641 1451781 1621829 1739437 1720180 1808866 1761280 1802972 1723233 1392991 1246826 959036
8631 959036 1004329 1049840 1192136 1278139 1292789 1397384 1736669 1729662 1672051 1487822 1522645
8620 1522645 1549391 1491650 1213787 1316727 1222826 944849 781450 952800 1086088 890599
8610 890599 649355 788617 963777 1168501 1370990 1291195 1269246 1153151 1201417 1304853
8600 1304853 1198988 1259382 1336470 1317139 1299672 1095398 922493 813132 979088 1065533
8590 1065533 980259 1072992 1156694 1320986 1319765 986613 962866 1028097 1190131 1122494 1171576
8579 1171576 1140433 1080319 1114229 981386 1120370 1020656 985426 788530 673136 785833
8569 785833 993832 1173800 977180 1143410 1312442 1250886 1259499 1287444 1359595 1285612 1042148
$$ packed form
8641A451781J70048J17608j9257Q8686m7586M1692p9739l30242j46165k87790
8631I59036M5293M5511J42296Q6003J4650J04595L39285p007n7611j84229L4823
8620A522645K6746n7741k77863J02940r3901k77977j63399J71350J33288j95489
8610H90599k41244J39262J75160K04724K02489p9795k1949j16095M8266J03436
8600A304853j05865O0394P7088j9331j7467k04274j72905j09361J65956Q6445
8590A065533q5274R2733Q3702J64292j221l33152k3747O5231J62034o7637M9082
8579A171576l1143o0114L3910j32843J38984r9714l5230j96896j15394J12697
8569G85833K07999J79968j96620J66230J69032o1556Q613K7945P2151p3983k43464
$$ plain form
8558 1042148 1120440 953557 884429 1209230 950842 695512 675933 742447 648503 778246
8548 778246 1219252 1343369 1237888 1004104 658621 686411 650326 642237 706402 612914 535641
8537 535641 537541 556663 489892 290538 375535 588843 622616 720070 505002 396395 514457
8526 514457 576680 626433 596656 532664 645134 923679 875788 779266 554787 256705 269520
8515 269520 370467 527629 731925 838165 717732 490437 437795 418513 424588 429751 719613
8504 719613 745864 794457 646923 597827 452669 356496 536657 681206 751141 600691 463851
8493 463851 387386 430594 432661 425605 501582 394198 387181 528204 530551 489703 668654 738750
8481 738750 505876 255831 371967 526917 529133 843321 963778 424686 220990 308467
$$ packed form
8558A042148P8292j66883o9128L24801k58388k55330j9579O6514r3944J29743
8548G78246M41006J24117j05481k33784l45483K7790l6085q089O4165r3488p7273
8537E35641J900J9122o6771j99354Q4997K13308L3773R7454k15068j08607J18062
8526E14457O2223M9753k9777o3992J12470K78545m7891r6522k24479k98082J2815
8515B69520J00947J57162K04296J06240j20433k27295n2642j9282O075N163K89862
8504G19613K6251M8593j47534m9096j45158r6173J80161J44549O9935j50450j36840
8493D63851p6465M3208K067p056P5977j07384p017J41023K347m0848J78951P0096
8481G38750k32874k50045J16136J54950K216L14188J20457n39092k03696Q7477
$$ plain form
8471 308467 414978 454714 188195 -29243 -13834 257274 513903 678085 677390 715476 773780
8460 773780 821642 1054146 1002073 745524 706311 779650 916053 962128 798850 622906 658775
8449 658775 642061 378102 410414 522104 468767 199656 323966 471501 203183 106898
8439 106898 276283 363502 447950 446085 477537 487205 459017 380782 455945 486428 656362 716919
8427 716919 677795 688853 688533 553085 411253 247691 362147 695213 557570 340080 615641
8416 615641 767029 922299 886994 591070 403347 358684 360284 428233 624245 670158 616255
8405 616255 355048 298110 351620 594274 664655 341464 53640 109638 321772 422411
8395 422411 423452 301948 393257 444492 291277 87692 206242 589455 717863 318311
$$ packed form
8471C08467J06511L9736k66519k17438J5409K71108K56629J64182o95L8086N8304
8460G73780M7862K32504n2073k56549l9213P3339J36403M6075j63278j75944L5869
8449F58775j6714k63959L2312J11690n3337k69111J24310J47535k68318r6285
8439A06898J69385Q7219Q4448j865L1452R668k8188p8235P5163L0483J69934O0557
8427G16919l9124J1058l20j35448j41832j63562J14456L33066j37643k17490K75561
8416F15641J51388J55270l5305k95924j87723m4663J600O7949J96012M5913n3903
8405F16255k61207n6938N3510K42654P0381l23191k87824N5998K12134J00639
8395D22411J041j21504R1309N1235j53215k03585J18550L83213J28408l99552
$$ plain form
8385 318311 -99549 -65154 18336 148919 234025 343603 458901 292244 -17954 143940
8375 143940 491773 441629 317612 284208 377587 143704 107781 261538 353289 242746 116841
8364 116841 72246 138214 20892 -37042 242748 529443 531856 424306 383230 358326 392349
8353 392349 362917 429067 396360 500395 527637 504914 711598 735820 759675 782625 620000
8342 620000 535095 644414 472460 378917 269288 214050 390902 521351 347696 154773
8332 154773 122436 217380 85008 79541 227644 98269 101414 34677 -138033 -308338 -262810
8321 -262810 -37505 26990 63650 339540 435262 465974 363839 292555 29082 6613 17428
8310 17428 35379 25303 155521 318535 179496 61554 180620 276507 290787 229534 342322
$$ packed form
8385C18311m17860L4395Q3490J30583Q5106J09578J15298j66657l10198J61894
8375A43940L47833n0144j24017l3404R3379k33883l5923J53757R1751j10543j25905
8364A16841m4595O5968j17322n7934K79790K86695K413j07550m1076k4904L4023
8353C92349k9432O6150l2707J04035K7242k2723K06684K4222K3855K2950j62625
8342F20000q4905J09319j71954r3543j09629n5238J76852J30449j73655j92923
8332A54773l2337R4944j32372n467J48103j29375L145o6737j72710j70305M5528
8321b62810K25305O4495L6660K75890R5722L0712j02135p1284k63473k2469J0815
8310A7428J7951j0076J30218J63014j39039j17942J19066R5887J4280o1253J12788
$$ plain form
8299 342322 316771 400892 507109 500108 357557 258162 96689 -86464 127757 243682 133255
8288 133255 136263 355535 222470 -28375 -165020 170480 281469 221942 61093 -230563
8278 -230563 -368736 -223228 35847 197584 178371 102549 100921 183810 222302 219955 384337
8267 384337 615596 725093 543610 329247 239961 305277 58827 -150435 -100852 75569
8257 75569 335391 251908 284432 113086 26729 65139 145200 201880 9290 -47553 171362
8246 171362 204161 20390 2912 297436 354447 385403 275534 326115 271541 30757 110339
8235 110339 185061 125767 99869 -2912 -99730 -23662 21161 -6246 -60085 -212219 101923
8224 101923 666714 698024 737356 621565 385892 190553 204449 415291 290322 90102
$$ packed form
8299C42322k5551Q4121J06217p001j42551r9395j61473j83153K14221J15925j10427
8288A33255L008K19272j33065k50845j36645L35500J10989n9527j60849k91656
8278b30563j38173J45508K59075J61737j9213p5822j628Q2889L8492k347J64382
8267C84337K31259J09497j81483k14363q9286O5316k46450k09262M9583J76421
8257G5569K59822q3483L2524j71346q6357L8410Q0061N6680j92590n6843K18915
8246A71362L2799j83771j7478K94524N7011L0956j09869N0581n4574k40784P9582
8235A10339P4722n9294k5898j02781r6818P6068M4823k7407n3839j52134L14142
8224A01923N64791L1310L9332j15791k35673j95339J3896K10842j24969k00220
$$ plain form
8214 90102 -252511 -143506 3494 -959 -3944 4788 -160913 -14501 45457 200396 274873
8203 274873 270699 170181 102752 190213 259016 206670 224539 -150779 -384249 -129587 106937
8192 106937 351836 514129 465227 496547 392898 210784 -74101 -124247 -153715 -108628 32273
8181 32273 27002 -114210 -74660 80435 114492 31490 173388 200530 32136 -102664 49792
8170 49792 -984 -140409 -121859 -142083 173939 373669 440013 406543 341783 347183 28232
8159 28232 132806 366816 250419 226479 270040 394042 567637 646184 510989 284141
8149 284141 -27286 -230224 -210828 -158502 4628 453294 499554 423498 269711 150285
8139 150285 316932 587982 457401 318759 270817 319635 309907 408126 505864 314636 135650
$$ packed form
8214I0102l42613J09005J47000m453k985Q732j65701J46412N9958J54939P4477
8203B74873m174j00518o7429Q7461O8803n2346J7869l75318k33470K54662K36524
8192A06937K44899J62293m8902L1320j03649j82114k84885n0146k9468M5087J40901
8181C2273n271j41212L9550J55095L4057q3002J41898K7142j68394j34800J52456
8170D9792n0776j39425J8550k0224L16022J99730O6344l3470o4760N400l18951
8159B8232J04574K34010j16397k3940M3561J24002J73595P8547j35195k26848
8149B84141l11427k02938J9396N2326J63130M48666M6260p6056j53787j19426
8139A50285J66647K71050j30581j38642m7942M8818r728R8219R7738j91228j78986
$$ plain form
8128 135650 58405 97977 123008 100610 145460 230145 205296 216656 257697 223123 261952 254589
8116 254589 -12933 -382552 -500226 -228355 39170 170763 218045 362961 293714 207132
8106 207132 151942 277934 160571 104889 129314 265575 353951 400699 390202 428797 155656
8095 155656 -62581 -132253 -177868 -68107 -26142 -210834 -301022 -282995 -109786 20129 -184750
8084 -184750 -336955 -359699 -286782 84707 321272 464433 280561 229706 295902 455668
8074 455668 397241 295344 170910 105171 184286 444816 249564 200838 153400 378172 379298
8063 379298 267404 298300 393331 463363 406588 475125 291740 142662 263946 343448 67841
8052 67841 13710 100232 202770 -145912 -27520 -13928 -236273 -414996 -543866 -310452
$$ packed form
8128A35650p7245L9572K5031k2398M4850Q4685k4849J1360M1041l4574L8829p363
8116B54589k67522l69619j17674K71871K67525J31593M7282J44916o9247q6582
8106B07132n5190J25992j17363n5682K4425J36261Q8376M6748j0497L8595k73141
8095A55656k18237o9672m5615J09761M1965j84692r0188J8027J73209J29915k04879
8084a84750j52205k2744P2917L71489K36565J43161j83872n0855O6196J59766
8074D55668n8427j01897j24434o5739P9115K60530j95252m8726m7438K24772J126
8063C79298j11894L0896R5031P0032n6775O8537j83385j49078J21284P9502k75607
8052F7841n4131Q6522J02538l48682J18392J3592k22345j78723j28870K33414
$$ plain form
8042 -310452 -176733 -64349 46206 311402 256590 217592 404480 358837 214340 241888
8032 241888 332403 458888 521942 200584 261588 356723 615025 806299 758850 403629 295967
8021 295967 345693 125191 148998 376485 276866 334121 288834 159503 235153 451586 436747
8010 436747 220138 89005 -53199 42285 -28251 -72879 14885 46795 145904 64954 -57666
7999 -57666 100331 230445 134546 161428 254125 107910 -34676 -206660 32216 249675
7989 249675 76723 282984 405790 563156 489312 231292 -111450 -40309 74846 -41509
7979 -41509 145835 230959 167570 167130 427154 667147 579846 286800 353855 313719 355236
7968 355236 511101 191739 54084 49228 28760 32338 -153712 -114505 93241 180146 238475
$$ packed form
8042c10452J33719J12384J10555K65196n4812l8998J86888m5643j44497K7548
8032B41888R0515J26485O3054l21358O1004R5135K58302J91274m7449l55221j07662
8021B95967M9726k20502K3807K27487r9619N7255m5287j29331P5650K16433j4839
8010D36747k16609j31133j42204R5484p0536m4628Q7764L1910R9109q0950j22620
7999e7666J57997J30114r5899K6882R2697j46215j42586j71984K38876K17459
7989B49675j72952K06261J22806J57366p3844k58020l42742P1141J15155j16355
7979d1509J87344Q5124o3389m40K60024K39993q7301k93046O7055m0136M1517
7968C55236J55865l19362j37655m856k0468L578j86050L9207K07746Q6905N8329
$$ plain form
7957 238475 148870 129746 148854 75437 30329 200376 172088 179758 86595 119829 152296 203881
7945 203881 108769 -152045 -96989 -124709 -53193 29744 -95098 -266374 -97886 55373 260828
7934 260828 164697 -40802 -70551 -152566 -99485 76098 365566 390841 206728 41215 -38258
7923 -38258 -156391 -172894 136785 427072 408952 367677 284097 186757 155796 227519 196567
7912 196567 213709 468561 603957 386959 262197 166304 165099 357576 269887 266758 264724
7901 264724 365188 489997 450734 240859 138348 17689 160413 99228 -146147 -182671
7891 -182671 8876 30378 -158339 -37285 51498 143027 377653 258095 173525 193731 241896
7880 241896 448574 447695 260831 80625 -23409 -44485 113353 94159 -34750 -206431 -355048
$$ packed form
7957B38475q9605j9124J9108p3417m5108J70047k8288P670r3163L3234L2467N1585
7945B03881r5112k60814N5056k7720P1516Q2937j24842j71276J68488J53259K05455
7934B60828r6131k05499k9749q2015N3081J75583K89468K5275j84113j65513p9473
7923c8258j18133j6503L09679K90287j8120m1275q3580r7340l0961P1723l0952
7912A96567J7142K54852J35396k16998j24762r5893j205J92477q7689l129k034
7901B64724J00464J24809l9263k09875j02511j20659J42724o1185k45375l6524
7891a82671J91547K1502j88717J21054Q8783R1529K34626j19558q4570K0206M8165
7880B41896K06678q79j86864j80206j04034k1076J57838j9194j28909j71681j48617
$$ plain form
7869 -355048 -159126 171994 401004 405165 145318 -64270 -89017 101951 90161 -158665
7859 -158665 -131248 926 71478 62115 195658 350662 299241 299729 248741 366908 379493
7848 379493 308181 34345 -37029 -61078 -164527 -211495 35511 87585 -29688 29325 -103863
7837 -103863 -142161 -65530 -46015 -17734 175380 14676 149917 153571 -28407 -87001 -141439
$$ packed form
7869c55048J95922L31120K29010M161k59847k09588k4747J90968j1790k48826
7859a58665K7417J32174P0552r363J33543J55004n1421M88n0988J18167J2585
7848C79493p1312k73836p1374k4049j03449m6968K47006N2074j17273N9013j33188
7837a03863l8298P6631J9515K8281J93114j60704J35241L654j81978n8594n4438
$$ [...]
##END NTUPLES=NMR SPECTRUM
##END=
