##TITLE=Analysis number 319284
Compound Code cc 24814
Project Code adrs
Chemist Name af chempharm
##JCAMPDX= 6.0         $$ Bruker NMR JCAMP-DX V2.0
##DATA TYPE= NMR SPECTRUM
##DATA CLASS= NTUPLES
##ORIGIN= Bruker BioSpin GmbH
##OWNER= nmr
$$ XWIN-NMR		Version 3.5
$$ Tue May  9 11:18:00 2006 GMT Daylight Time (UT+1h)  MAYBRIDGE\nmr@NMR_250MHZ
##.OBSERVE FREQUENCY= 250.131544655141
##.OBSERVE NUCLEUS= ^1H
##.ACQUISITION MODE= SIMULTANEOUS (DQD)
##.ACQUISITION SCHEME= undefined
##.AVERAGES= 16
##.DIGITISER RES= 18
##SPECTROMETER/DATA SYSTEM= dpx250
##.PULSE SEQUENCE= zg30
##.SOLVENT NAME= CDCl3
##.SHIFT REFERENCE= (INTERNAL, CDCl3, 0, 16.522)
##AUDIT TRAIL= $$ (NUMBER, WHEN, WHO, WHERE, WHAT)
$$ ##TITLE= Audit trail, XWIN-NMR		Version 3.5
$$ ##JCAMPDX= 5.01
$$ ##ORIGIN= Bruker BioSpin GmbH
$$ ##OWNER= nmr
$$ C:\u/data/dgb/nmr/ADRS/3940/pdata/1/auditp.txt
$$ ##AUDIT TRAIL=  $$ (NUMBER, WHEN, WHO, WHERE, WHAT)
(   1,<2006-05-09 11:17:35.92 +100>,<MAYBRIDGE\nmr>,<NMR_250MHZ>,
      <created by zg, POWCHK disabled, PULCHK disabled
       configuration hash MD5:
       84 BC 41 DB A1 6E 1D 46 DA 25 12 A5 C1 ED C5 3A
       data hash MD5: 64K
       D7 0F AB E2 56 01 87 0F 46 F8 FC 6A 4F EC A2 A9>)
(   2,<2006-05-09 11:17:50.49 +100>,<MAYBRIDGE\nmr>,<NMR_250MHZ>,
      <Start of raw data processing
       ef LB = 0.3 FT_mod = 6 PKNL = 1 SI = 32K 
       data hash MD5: 32K
       96 BE 25 91 3C 93 4B BB 4E 23 A2 8A C0 83 18 2E>)
(   3,<2006-05-09 11:17:52.05 +100>,<MAYBRIDGE\nmr>,<NMR_250MHZ>,
      <apk 
       data hash MD5: 32K
       AB 5F 15 F0 5F 95 B0 61 EF E0 6B B2 FF DC 42 AC>)
(   4,<2006-05-09 11:17:52.91 +100>,<MAYBRIDGE\nmr>,<NMR_250MHZ>,
      <abs ABSG = 5 
       data hash MD5: 32K
       1E 5B AD A8 C3 5B D0 C9 64 A4 E3 FE B2 5E C1 88>)
$$ ##END=
$$ 
$$ hash MD5
$$ 15 50 E7 E2 34 29 CA 77 37 8A FE EF F8 81 7D 2A
##$RELAX= 
##$RELAX= 
##$RELAX= 
##$RELAX= 
##$RELAX= 
##$RELAX= 
##$RELAX= 
$$ Bruker specific parameters
$$ --------------------------
##$DU= <C:\u>
##$EXPNO= 3940
##$NAME= <ADRS>
##$PROCNO= 1
##$TYPE= <nmr>
##$USER= <dgb>
##$AMP= (0..31)
100 100 100 100 100 100 100 100 100 100 100 100 100 100 100 100 100 100 
100 100 100 100 100 100 100 100 100 100 100 100 100 100 
##$AQSEQ= 0
##$AQ_mod= 3
##$AUNM= <au_zg>
##$AUTOPOS= <21 >
##$BF1= 250.13
##$BF2= 250.13
##$BF3= 250.13
##$BF4= 250.13
##$BF5= 500.13
##$BF6= 500.13
##$BF7= 500.13
##$BF8= 500.13
##$BYTORDA= 1
##$CFDGTYP= 0
##$CFRGTYP= 5
##$CHEMSTR= <none>
##$CNST= (0..31)
1 1 145 1 1 1 1 1 1 1 1 1 1 1 1 1 1 1 1 1 1 1 1 1 1 1 1 1 1 1 1 1 
##$CPDPRG= <>
##$CPDPRG1= <>
##$CPDPRG2= <>
##$CPDPRG3= <>
##$CPDPRG4= <mlev>
##$CPDPRG5= <mlev>
##$CPDPRG6= <mlev>
##$CPDPRG7= <mlev>
##$CPDPRG8= <mlev>
##$CPDPRGB= <>
##$CPDPRGT= <>
##$D= (0..31)
0 1 0 0 0 0 0 0 0 0.06 0 0 0 0 0 0 0.0002 0 0 0 0 0 0 0 0 0 0 0 0 0 0 
0 
##$DATE= 1147169854
##$DBL= (0..7)
120 120 120 120 120 120 120 120 
##$DBP= (0..7)
150 150 150 150 150 150 150 150 
##$DBP07= 0
##$DBPNAM0= <>
##$DBPNAM1= <>
##$DBPNAM2= <>
$$ [...]
##$SUBNAM7= <"">
##$SUBNAM8= <"">
##$SUBNAM9= <"">
##$SW= 20.6930455092707
##$SWIBOX= (0..15)
0 0 3 0 0 0 0 0 0 0 0 0 0 0 0 0 
##$SW_h= 5175.983436853
##$TD= 65536
##$TD0= 1
##$TE= 295.16
##$TE2= 300
##$TE3= 300
##$TEG= 300
##$TL= (0..7)
0 120 120 120 120 120 120 120 
##$TP= (0..7)
150 150 150 150 150 150 150 150 
##$TP07= 0
##$TPNAME0= <>
##$TPNAME1= <>
##$TPNAME2= <>
##$TPNAME3= <>
##$TPNAME4= <>
##$TPNAME5= <>
##$TPNAME6= <>
##$TPNAME7= <>
##$TPOAL= (0..7)
0.5 0.5 0.5 0.5 0.5 0.5 0.5 0.5 
##$TPOFFS= (0..7)
0 0 0 0 0 0 0 0 
##$TUNHIN= 0
##$TUNHOUT= 0
##$TUNXOUT= 0
##$USERA1= <user>
##$USERA2= <user>
##$USERA3= <user>
##$USERA4= <user>
##$USERA5= <user>
##$V9= 5
##$VALIST= <valist>
##$VCLIST= <CCCCCCCCCCCCCCC>
##$VD= 0
##$VDLIST= <DDDDDDDDDDDDDDD>
##$VPLIST= <PPPPPPPPPPPPPPP>
##$VTLIST= <TTTTTTTTTTTTTTT>
##$WBST= 1024
##$WBSW= 4
##$XGAIN= (0..3)
0 0 0 0 
##$XL= 0
##$YL= 0
##$YMAX_a= 271215
##$YMIN_a= -464142
##$ZGOPTNS= <>
##$ZL1= 120
##$ZL2= 120
##$ZL3= 120
##$ZL4= 120
##$ABSF1= 16.522
##$ABSF2= -4.171173
##$ABSG= 5
##$ABSL= 3
##$ALPHA= 0
##$AQORDER= 0
##$ASSFAC= 0
##$ASSFACI= 0
##$ASSFACX= 0
##$ASSWID= 0
##$AUNMP= <proc_1d>
##$AZFE= 0.1
##$AZFW= 0.1
##$BCFW= 0
##$BC_mod= 0
##$BYTORDP= 0
##$COROFFS= 0
##$CY= 12.5
##$DATMOD= 1
##$DC= 0
##$DFILT= <>
##$DTYPP= 0
##$F1P= 14.0000005364418
##$F2P= -0.99999901652339
##$FCOR= 0.5
##$FTSIZE= 32768
##$FT_mod= 6
##$GAMMA= 0
##$GB= 0
##$INTBC= 1
##$INTSCL= 1
##$ISEN= 128
##$LB= 0.3
##$LEV0= 0
##$LPBIN= 0
##$MAXI= 10000
##$MC2= 0
##$MEAN= 0
##$ME_mod= 0
##$MI= 0
##$NCOEF= 0
##$NC_proc= -5
##$NLEV= 6
##$NOISF1= 0
##$NOISF2= 0
##$NSP= 0
##$NTH_PI= 0
##$NZP= 0
##$OFFSET= 16.522
##$PC= 1
##$PHC0= 170.2749
##$PHC1= 3.005001
##$PH_mod= 1
##$PKNL= yes
##$PPARMOD= 0
##$PSCAL= 4
##$PSIGN= 0
##$REVERSE= no
##$SF= 250.13
##$SI= 32768
##$SIGF1= 0
##$SIGF2= 0
##$SINO= 400
##$SIOLD= 32768
##$SREGLST= <1H.CDCl3>
##$SSB= 0
##$STSI= 32768
##$STSR= 0
##$SW_p= 5175.98343685301
##$SYMM= 0
##$S_DEV= 0
##$TDeff= 65536
##$TDoff= 0
##$TI= <Analysis number 999999
Compound Code 99
Book Reference 9
Project Code 9>
##$TILT= no
##$TM1= 0
##$TM2= 0
##$TOPLEV= 0
##$USERP1= <user>
##$USERP2= <user>
##$USERP3= <user>
##$USERP4= <user>
##$USERP5= <user>
##$WDW= 1
##$XDIM= 32768
##$YMAX_p= 341742460
##$YMIN_p= -485238
$$ End of Bruker specific parameters
$$ ---------------------------------
##NTUPLES= NMR SPECTRUM
##VAR_NAME=  FREQUENCY,     SPECTRUM/REAL,   SPECTRUM/IMAG
##SYMBOL=    X,             R,               I
##VAR_TYPE=  INDEPENDENT,   DEPENDENT,       DEPENDENT
##VAR_FORM=  AFFN,          ASDF,            ASDF
##VAR_DIM=   32768,         32768,           32768
##UNITS=     HZ,            ARBITRARY UNITS, ARBITRARY UNITS
##FACTOR=    0.157963299565203, 1,           1
##FIRST=     4132.6476996994, 0,             0
##LAST=      -1043.33573715361, 0,           0
##MIN=       -1043.33573715361, -485238,     0
##MAX=       4132.6476996994, 341742460,     0
$$ Real data points
##PAGE= N=1
##DATA TABLE= (X++(R..R)), XYDATA
$$ [...]
$$ plain form
23052 15668 -51544 -134966 -99139 -45834 -44859 16065 38451 78449 25085 -44808 -23206 52668
23040 52668 57668 60538 36720 -49118 -127399 -117570 -29262 56220 90924 114007 130494 55720
23028 55720 70380 116536 45227 -11227 -43215 -45749 -49612 -155258 -63389 -44893 -160427 -105722
23016 -105722 -111831 -87455 -141650 -103272 8882 2914 24420 -22568 40572 4856 -65017 -65730
23004 -65730 -106591 -88604 -63453 -61375 -112732 -94806 -34849 29883 -59689 -65579 -51844 19509
22992 19509 119731 138092 125489 112864 52664 94716 68717 41800 69769 56611 48165 94498
22980 94498 60602 30920 13036 17820 77386 185921 188088 129912 191400 104883 96781 92729
22968 92729 34574 17342 -4222 4660 26480 -105362 -62214 -18486 15790 68546 126344 -5732
$$ packed form
23052A5668o7212q3422L5827N3305R75O0924K2386L9998n3364o9893K1602P5874
23040E2668N000K870k3818q5838p8281R829Q8308Q5482L4704K3083J6487p4774
23028E5720J4660M6156p1309n6454l1988k534l863j05646R1869J8496j15534N4705
23016a05722o109K4376n4195L8378J12154n968K1506m6988O3140l5716o9873p13
23004f5730m0861J7987K5151K078n1357J7926N9957O4732q9572n890J3735P1353
22992A9509J00222J8361j2603j2625o0200M2052k5999k6917K7969j3158q446M6333
22980I4498l3896k9682j7884M784N9566J08535K167n8176O1488q6517q102m052
22968I2729n8155j7232k1564Q882K1820j31842M3148M3728L4276N2756N7798j32076
$$ plain form
22956 -5732 19148 32553 -14983 -43862 -1103 34984 -7304 -36055 -53640 -108664 -22681 228934
22944 228934 209675 132379 138905 99589 88152 91934 157364 115623 97457 44648 -99351 -91665
22932 -91665 -46996 -55162 31578 47385 -37579 -154572 -165933 -90029 -9951 -32432 -8570 -14439
22920 -14439 -154421 -196854 -210408 -132080 -40502 -56890 -124845 -53088 -53008 -100393 -56969 -66115
22908 -66115 28932 42586 -43467 -35269 -54584 -15240 -59051 -114250 -146134 -92097 -69667 -3
22896 -3 36394 144203 186924 242739 255012 161703 87102 -6337 -37179 -142641 -38091 41071
22884 41071 -3613 -24271 -3326 -57572 -126545 -132252 -47573 59389 -40459 -112981 -67351 -77509
22872 -77509 2320 18045 83595 174360 45808 -72006 -118138 -75211 22531 42444 91920
$$ packed form
22956e732K4880J3405m7536k8879M2759L6087m2288k8751j7585n5024Q5983K51615
22944B28934j9259p7296O526l9316j1437L782O5430m1741j8166n2809j43999P686
22932i1665M4669q166Q6740J5807q4964j16993j1361P5904Q0078k2481K3862n869
22920a4439j39982m2433j3554P8328R1578j6388o7955P1757Q0m7385M3424r146
22908f6115R5047J3654q6053Q198j9315L9344m3811n5199l1884N4037K2430O9664
22896cL6397J07809M2721N5815J2273r3309p4601r3439l0842j05462J04550P9162
22884D1071m4684k0658K0945n4246o8973n707Q4679J06962r9848p2522M5630j0158
22872g7509P9829J5725O5550R0765j28552j17814m6132M2927R7742J9913M9476
$$ plain form
22861 91920 101863 -8250 -69013 -66158 -48685 986 -48308 19900 78852 119539 182682 208492
22849 208492 197298 79729 -48568 11943 -59480 -93506 -37296 -53271 67492 87969 -13921
22838 -13921 -49610 -129010 1596 123826 37916 -45464 -20051 -12063 -159938 -214232 -116922
22827 -116922 49446 198880 127918 39077 74217 116555 191970 162289 58884 22416 55522
22816 55522 21710 45788 66967 70141 121978 144012 91298 -22160 -15195 -117332 -145377 -180910
22804 -180910 -224425 -172216 -83296 -34460 123153 269328 247285 207666 145866 72625 69614
22793 69614 121798 235609 102886 -29243 -70569 -100206 -95472 -13549 -77639 -107015 -24266
22782 -24266 52632 41056 -64203 24091 -32375 -59566 40132 -31368 452 21780 -51341
$$ packed form
22861I1920R943j10113o0763K855J7473M9671m9294O8208N8952M0687O3143K5810
22849B08492j1194j17569j28297O0511p1423l4026N6210j5975J20763K0477j01890
22838a3921l5689p9400J30606J22230q5910q3380K5413P988j47875n4294R7310
22827a16922J66368J49434p0962q8841L5140M2338P5415k9681j03405l6468L3106
22816E5522l3812K4078K1179L174N1837K2034n2714j13458O965j02137k8045l5533
22804a80910m3515N2209Q8920M8836J57613J46175k2043l9619o1800p3241l011
22793F9614N2184J13811j32723j32129m1326k9637M734Q1923o4090k9376Q2749
22782b4266P6898j1576j05259Q8294n6466k7191R9698p1500L1820K1328p3121
$$ plain form
22771 -51341 35851 67374 -39596 -36667 -78678 -13613 -46083 42402 32990 34628 4024 -15605
22759 -15605 47823 100409 60266 146298 150780 87716 -46984 -13493 20831 -18220 -20811 41124
22747 41124 19073 -62739 -50838 -233 -139852 -122806 18214 -41843 -158555 -251822 -295311
22736 -295311 -178553 -115997 -101874 -183897 -163180 -62761 -29103 -14463 20638 105532 103341
22725 103341 -45252 -177085 -42386 -57947 -124479 -196820 -163661 -33731 79296 123831
22715 123831 148427 121474 93474 16391 31012 185519 68281 -75433 33424 169492
22705 169492 169801 213782 194954 108551 52853 91468 130334 132838 24069 -65796 -66655 68500
22693 68500 209233 182686 23144 -204043 -161593 55387 55649 55284 161930 106827 110520 88243
$$ packed form
22771e1341Q7192L1523j06970K929m2011O5065l2470Q8485r412J638l0604j9629
22759a5605O3428N2586m0143Q6032M482o3064j34700L3491L4324l9051k591O1935
22747D1124k2051q1812J1901N0605j39619J7046J41020o0057j16712r3267m3489
22736b95311J16758O2556J4123q2023K0717J00419L3658J4640L5101Q4894k191
22725A03341j48593j31833J34699j5561o6532p2341L3159J29930J13027M4535
22715A23831K4596k6953k8000p7083J4621J54507j17238j43714J08857J36068
22705A69492L09M3981j8828q6403n5698L8615L8866K504j08769q9865q59J35155
22693F8500J40733k6547j59542k27187M2450K16980K62l65J06646n5103L693k2277
$$ plain form
22681 88243 48865 51699 95080 102349 47229 -27347 -119767 -78716 -107534 -162905 -109327 -93112
22669 -93112 -15251 59946 -9639 -128713 -39783 40217 41588 -27225 -90650 3989 65497 117333
22657 117333 131512 134417 139532 102678 57219 90052 -15535 32582 60395 65112 -1137 -41330
22645 -41330 4291 48620 40435 -64891 -103810 -233531 -253105 -176078 -31009 55619 -52010
22634 -52010 -42029 51162 -46520 -87918 -16395 11882 -34850 -1668 -45051 -100334 -111110 -64977
22622 -64977 -55801 26705 33790 94356 -15123 -93928 -81940 -23015 -26914 -59082 -119786 -17258
22610 -17258 -1962 -100184 -126796 -172133 -222012 -232231 -117717 55751 7313 -57154 -14589
22599 -14589 -103892 -161401 -73629 102714 88835 -17142 -4859 -5538 -21447 4188 -74963 46246
$$ packed form
22681H8243l9378K834M3381P269n5120p4576r2420M1051k8818n5371N3578J6215
22669i3112P7861P5197o9585j19074Q8930Q0000J371o8813o3425R4639O1508N1836
22657A17333J4179K905N115l6854m5459L2833j05587M8117K7813M717o6249m0193
22645d1330M5621M4329q185j05326l8919j29721j9574P7027J45069Q6628j07629
22634e2010R981R3191r7682m1398P1523K8277m6732L3182m3383n5283j0776M6133
22622f4977R176Q2506P085O0566j09479p8805J1988N8925l899l2168o0704J02528
22610a7258J5296r8222k6612m5337m9879j0219J14514J73468m8438o4467M2565
22599a4589q9303n7509Q7772J76343j3879j05977J2283o79j5909K5635p9151J21209
$$ plain form
22587 46246 175636 112022 96338 189982 209764 115751 58319 76669 6905 -46658 -54658 -49863
22575 -49863 -29668 -46987 -127584 -52934 -26508 -120675 -132456 -142565 -111946 67372 187462
22564 187462 164250 170239 62253 26692 4369 -77810 -148465 -136950 -70636 -31134 11033
22553 11033 46251 -50027 -142752 -164383 -1384 110649 126822 94049 12316 -83191 -114885
22542 -114885 -7072 131008 122421 49933 76223 210654 183062 176948 87444 86002 87291 -26295
22530 -26295 94753 109149 14918 -19716 82127 154742 85265 9986 -10587 28311 27498 26342
22518 26342 -59698 -27219 18402 44515 36069 80617 163006 120764 -39962 1251 70014 49514
22506 49514 -28849 -103814 -172205 -146210 -105989 -103204 -185865 -87226 23285 21995 14270 13646
$$ packed form
22587D6246J29390o3614j5684R3644J9782r4013n7432J8350o9764n3563q000M795
22575d9863K0195j7319q0597P4650K6426r4167j1781j0109L0619J79318J20090
22564A87462k3212N989j07986l5561k2323q2179p0655J1515O6314L9502M2167
22553A1033L5218r6278r2725k1631J62999J12033J6173l2773q1733r5507l1694
22542a14885J07813J38080q587p2488K6290J34431k7592o114q9504j442J289j13586
22530b6295J21048J4396r4231l4634J01843P2615o9477p5279k0573L8898q13j156
22518B6342q6040L2479M5621K6113q446M4548Q2389m2242j60726M1213O8763k0500
22506D9514p8363p4965o8391K5995M0221K785q2661R8639J10511j290p725o24
$$ plain form
22494 13646 -4975 34838 124374 189358 106798 -4870 -66585 -112348 -173125 -200298 -166435
22483 -166435 -220167 -234187 -180158 -183658 -176379 -239629 -252458 -64095 13150 14553 -918 57838
22471 57838 82020 12499 -111905 -67893 -34899 25395 -68501 -95583 -258046 -339138 -402750
22460 -402750 -391730 -375847 -317724 -118726 10962 -50054 -82520 -130074 -81805 81159 46860
22449 46860 -8563 -29481 -19704 -156504 -215317 -22645 102421 94620 125322 35929 -91311
22438 -91311 -117043 -138517 -281790 -179281 -91541 75499 105185 -15524 -66212 -121389 -107954
22427 -107954 965 -77162 -130607 -9978 18242 -118257 -229183 -260037 -219605 -151296 -158704
22416 -158704 -154707 -172617 -152194 -142493 -180670 -128282 -81801 -130248 -87738 7062 144591 84215
$$ packed form
22494A3646j8621L9813Q9536O4984q2560j11668o1715m5763o0777k7173L3863
22483a66435n3732j4020N4029l500P279o3250j2829J88363P7245J403j5471N8756
22471E7838K4182o9521j24404M4012L2994O0294r3896k7082j62463q1092o3612
22460d02750J1020J5883N8123J98998J29688o1016l2466m7554M8269J62964l4299
22449D6860n5423k0918R777j36800n8813J92672J25066p801L0702q9393j27240
22438i1311k5732k1474j43273J02509Q7740J67040K9686j20709n0688n5177J3435
22427a07954J08919p8127n3445J20629K8220j36499j10926l0854M0432O8309p408
22416a58704L997j7910K0423R701l8177N2388M6481m8447M2510R4800J37529o0376
$$ plain form
22404 84215 30685 89190 19847 -155639 -65044 -87843 -202354 -153055 -108738 -119262 -235484
22393 -235484 -163048 -84237 -16932 -18918 -49378 -112231 -115111 -71840 -35941 -53333 -123201 -137628
22381 -137628 -145445 -102376 -45230 -117530 -181668 -118042 -151652 -187072 -207668 -286646 -347414 -243250
22369 -243250 -141687 22085 36163 6175 -61462 -37316 -108 37365 -26714 24893 64711
22358 64711 166395 270313 186865 166316 97874 29072 -3879 52124 -10742 -22687 19119
22347 19119 -50178 -164600 -182894 -110406 -137194 -56588 -40223 27795 48175 67033 -29114
22336 -29114 -41454 -58825 -120687 -125383 -115263 -150476 -154410 -214763 -306009 -349536 -429420 -444381
22324 -444381 -355128 -276280 -177125 -103395 -55755 -952 159977 61631 -17178 -74739 -166632
$$ packed form
22404H4215n3530N8505o9343j75486R0595k2799j14511M9299M4317j0524j16222
22393b35484P2436P8811O7305j986l0460o2853k880M3271L5899j7392o9868j4427
22381a37628p817M3069N7146p2300o4138O3626l3610l5420k0596p8978o0768J04164
22369b43250J01563J63772J4078k9988o7637K4146L7208L7473o4079N1607L9818
22358F4711J01684J03918q3448k0549o8442o8802l2951N6003o2866j1945M1806
22347A9119o9297j14422j8294P2488k6788Q0606J6365O8018K0380J8858r6147
22336b9114j2340j7371o1862m696J0120l5213l934o0353r1246m3527p9884j4961
22324d44381Q9253P8848R9155P3730M7640N4803J60929r8346p8809n7561r1893
$$ plain form
22313 -166632 -127042 13380 127421 30165 4939 -58414 -196027 -226995 -165155 -130707 -92523
22302 -92523 -27581 -16535 -47975 -81000 -141796 -135287 -66474 -37749 128234 221228 114092
22291 114092 25826 -76078 -124050 -133203 -168897 -255963 -261129 -9203 -61306 -109356 74885
22280 74885 306821 223034 130643 105476 43647 114249 83806 30489 459 97292 201548
22269 201548 7672 -74315 -74147 -41239 -11117 71435 20143 -7128 22784 8711 -29229 -110419
22257 -110419 -243416 -120805 -90035 9248 -13726 -46551 45559 50080 141667 296100 113865
22246 113865 -74199 -119096 -90642 55432 77994 29133 -90445 -93228 -19676 -38174 -52590
22235 -52590 4980 -79678 -138619 -15660 -28485 -206427 -226616 -91134 28783 25534 52589
$$ packed form
22313a66632L9590J40422J14041r7256k5226o3353j37613l0968O1840L4448L8184
22302i2523O4942J1046l1440l3025o0796O509O8813K8725J65983R2994j07136
22291A14092q8266j01904m7972r153l5694q7066n166K51926n2103m8050J84241
22280G4885K31936q3787r2391k5167o1829P0602l0443n3317l0030R6833J04256
22269B01548j93876q1987J68L2908L0122Q2552n1292k7271K9912j4073l7940q1190
22257a10419j32997J22611L0770R9283k2974l2825R2110M521R1587J54433j82235
22246A13865j88064m4897K8454J46074K2562m8861j19578k783P3552j8498j4416
22235e2590N7570q4658n8941J22959j2825j77942k0189J35482J19917l249K7055
$$ plain form
22224 52589 126005 112063 73280 35804 -58919 -14874 -53298 -117618 -191273 -133073 -68406 -9637
22212 -9637 86187 29962 -56232 -76033 -16328 -155176 -103752 36631 109158 -53340 -5532
22201 -5532 118114 91255 61940 105688 88603 -44872 -24101 -13563 -28107 34014 70102
22190 70102 -27629 -94761 24589 176274 207430 166119 165826 207817 118610 146947 74438 -4986
22178 -4986 -76181 -114446 -133748 -116805 -63333 -38764 -70933 -178892 -278272 -343453 -197254
22167 -197254 -84449 5478 -31865 -62090 -31794 -84436 -104371 -69322 28901 57570 -2291
22156 -2291 -66934 -65014 -83988 -41788 1676 -38368 -162828 -285872 -268153 -129500 -91540
22145 -91540 -187004 -165609 -5744 47936 33313 47938 -9184 -204521 -195863 -192159 -142064 -102602
$$ packed form
22224E2589P3416j3942l8783l7476r4723M4045l8424o4320p3655N8200O4667N8769
22212i637R5824n6225q6194j9801N9705j38848N1424J40383P2527j62498M7808
22201e532J23646k6859k9315M3748j7085j33475K0771J0538j4544O2121L6088
22190G0102r7731o7132J19350J51685L1156m1311k93M1991q9207K8337p2509p9424
22178d986p1195l8265j9302J6943N3472K4569l2169j07959r9380o5181J46199
22167a97254J12805Q9927l7343l0225L0296n2642j9935L5049R8223K8669n9861
22156b291o4643J920j8974M2200M3464m0044j24460j23044J7719J38653L7960
22145i1540r5464K1395J59865N3680j4623J4625n7122j95337Q658L704N0095L9462
$$ plain form
22133 -102602 89042 8708 -69071 83633 187178 199693 179456 131745 140980 9430 -136107
22122 -136107 -138857 -5401 -36452 30119 53543 26842 -17265 16724 36506 -13922 -30486
22111 -30486 -16183 -41459 -67283 -177387 -169548 -116497 -47232 103725 111723 48994 -62939
22100 -62939 -6803 42246 60204 163461 106037 -50531 -195892 -268510 -115312 -126977 -139776
22089 -139776 -199770 -277031 -232310 -109247 -190622 -242919 -119465 121476 71632 -100359 -105225
22078 -105225 -12510 72279 -10784 -64169 -215541 -213877 -107483 -74521 -117516 -85689 -104502
22067 -104502 -226382 -178249 -103066 -29303 -39502 -7905 69203 94737 69648 44146 -21693
22056 -21693 -21192 -43430 -62380 4713 -5815 -40616 -13256 -12225 -72396 -134052 -249005 -304715
$$ packed form
22133a02602J91644q0334p7779J52704J03545J2515k0237m7711R235j31550j45537
22122a36107k750J33456l1051O6571K3424k6701m4107L3989J9782n0428j6564
22111c0486J4303k5276k5824j10104P839N3051O9265J50957P998o2729j11933
22100f2939N6136M9049J7958J03257n7424j56568j45361p2618J53198j1665j2799
22089a39776n9994p7261M4721J23063q1375n2297J23454K40941m9844j71991m866
22078a05225R2715Q4789q3063n3385j51372J664J06394L2962m2995L1827j8813
22067a04502j21880M8133P5183P3763j0199L1597P7108K5534k5089k5502o5839
22056b1693N01k2238j8950O7093j0528l4801K7360J031o0171o1656j14953n5710
$$ plain form
22044 -304715 -309714 -328245 -237837 -173339 -143362 -179801 -177473 -117503 -69267 20930 28699 -4514
22032 -4514 1309 -30296 -66692 73464 111840 -34261 -12775 50091 33891 2455 -33020 -19031
22020 -19031 14966 4963 -145573 -177104 -89409 -106420 -126807 -39283 15122 -53541 -87219
22009 -87219 -20310 49954 221059 199228 150731 126325 131683 86060 6775 -74498 -40960 -103720
21997 -103720 -55920 -75136 -112262 -143869 -162391 -82926 -48380 -45499 -50544 16376 48883 -95767
21985 -95767 -87557 -33592 67735 117955 26815 54353 51957 61648 68281 -73741 -12882 46738
21973 46738 33162 48521 197766 8749 -136793 -109048 -72577 -39342 -36116 -34858 -24493
21962 -24493 -25241 -44181 -54642 -11166 -35988 42767 40512 1981 -69188 -70489 -122091 -199061
$$ packed form
22044c04715m999j8531R0408O4498K9977l6439K328N9970M8236R0197P769l3213
22032d514N823l1605l6396J40156L8376j46101K1486O2866j6200l1436l5475J3989
22020a9031L3997j0003j50536l1531Q7695j7011k0387Q7524N4405o8663l3678
22009h7219O6909P0264J71105k1831m8497k4406N358m5623p9285q1273L3538o2760
21997a03720M7800j9216l7126l1607j8522P9465L4546K881n045O6920L2507j44650
21985i5767Q210N3965J01327N0220r1140K7538k396R691O633j42022O0859N9620
21973D6738j3576J5359J49245j89017j45542K7745L6471L3235L226J258J0365
21962b4493p48j8940j0461M3476k4822P8755k255l8531p1169j301n1602p6970
$$ plain form
21950 -199061 -121118 -55974 3431 27747 -49656 -47963 -16930 26959 -34537 -1496 -13934 -126515
21938 -126515 -167015 -91823 58026 48691 17880 -33299 -186200 -164133 -49559 8534 17832
21927 17832 -62619 -58396 -32959 24282 41343 140702 75650 -106866 -173652 -32615 -117581
21916 -117581 -187567 -178195 -109452 -82505 -12692 -115276 -189783 -269743 -106054 110075 205010
21905 205010 165868 114059 -48930 -149122 -194220 -87835 -83088 -204928 -180401 -108537 -199709
21894 -199709 -138662 18500 49660 110561 20021 -28136 22 -4623 13373 -154505 -118083
21883 -118083 -20666 -84576 -112834 -105661 -126452 -61644 80243 141806 55123 -52203 -146157
21872 -146157 -145352 -52957 -54749 -66345 -11245 -58927 -86678 -146251 -60616 -104783 -119175 6151
$$ packed form
21950a99061P7943O5144N9405K4316p7403J693L1033M3889o1496L3041j2438j12581
21938a26515m0500P5192J49849r335l0811n1179j52901K2067J14574N8093R298
21927A7832q0451M223K5437N7241J7061R9359o5052j82516o6786J41037q4966
21916a17581o9986R372O8743K6947O9813j02584p4507p9960J63689K16129R4935
21905B05010l9142n1809j62989j00192m5098J06385M747j21840K4527P1864r1172
21894a99709O1047J57162L1160O0901r0540m8157K8158m645J7996j67878L6422
21883a18083R7417o3910k8258P173k0791O4808J41887O1563q6683j07326r3954
21872a46157Q05R2395j792j1596N5100m7682k7751n9573Q5635m4167j4392J25326
$$ plain form
21860 6151 98931 -24095 -94606 40009 91152 -80109 -86137 -63947 72861 135271 50508
21849 50508 -20938 59935 29477 75770 87432 113319 128190 29459 -52325 13706 168004
21838 168004 220123 176831 142733 149439 138204 136196 134395 29567 82587 189600 320030
21827 320030 379466 228738 78070 -80038 -61233 -33281 -131359 -106170 20613 176252
21817 176252 192966 22562 -21961 -75086 -120507 -13549 35310 -19884 -56195 -98994 -26172
21806 -26172 19234 19308 30775 121763 -86403 -308439 -263125 -164434 -100631 -135087 -247324 -306155
21794 -306155 -279153 -263541 -316564 -155417 -111858 -158451 -127627 1609 96126 136282 171374
21783 171374 129336 105746 52155 -12049 9657 -16231 -117056 -165232 -48935 -94617 -152311
$$ packed form
21860F151R2780j23026p0511J34615N1143j71261o028K2190J36808O2410q4763
21849E0508p1446Q0873l0458M6293J1662K5887J4871r8731q1784O6031J54298
21838A68004N2119m3292l4098O706j1235k008j801j04828N3020J07013J30430
21827C20030N9436j50728j50668j58108J8805K7952r8078K5189J26783J55639
21817A76252J6714j70404m4523n3125m5421J06958M8859n5194l6311m2799P2822
21806b6172M5406P4J1467R0988k08166k22036M5314R8691O3803l4456j12237n8831
21794c06155K7002J5612n3023J61147M3559m6593L0824J29236R4517M0156L5092
21783A71374m2038k3590n3591o4204K1706k5888j00825m8176J16297m5682n7694
$$ plain form
21772 -152311 -84066 28666 89169 110822 90504 119415 120996 82232 88311 87796 171100 171649
21760 171649 110640 84217 5609 15922 84938 93654 15312 -24675 -152164 -239878 -145704
21749 -145704 -24105 67040 106332 39518 1743 -81013 -140458 -69739 -56187 -147208 -158307
21738 -158307 -7321 70841 96471 68619 68376 6263 63036 103614 121773 61446 118497 142935
21726 142935 175339 63984 -47971 -105454 -27316 4642 20469 46400 -11150 -43958 -114140
21715 -114140 -90625 -64811 -23676 -64102 -87806 -186726 -135425 70698 80668 -78926 -134797
21704 -134797 -201021 -218621 -154117 -48085 46137 38066 86964 -15104 -167323 -255346 -153927
21693 -153927 -4750 -13862 97411 270074 261180 178225 129628 108512 84412 603 -84667
$$ packed form
21772a52311O8245J12732O0503K1653k0318K8911J581l8764O079n15Q3304N49
21760A71649o1009k6423p8608J0313O9016Q716p8342l9987j27489q7714R4174
21749a45704J21599R1145L9292o6814l7775q2756n9445P0719J3552r1021j1099
21738a58307J50986P8162K5630k7852k43o2113N6773M0578J8159o0327N7051K4438
21726A42935L2404j11355j11955n7483P8138L1958J5827K5931n7550l2808p0182
21715a14140K3515K5814M1135m0426k3704r8920N1301K06123R970j59594n5871
21704a34797o6224j7600O4504J06032R4222q071M8898j02068j52219q8023J01419
21693a53927J49177r112J11273J72663q894q2955m8597k1116k4100q3809q5270
$$ plain form
21682 -84667 -83446 -17899 44013 -11 -138606 -218926 -184653 -240113 -174563 12667 36170
21671 36170 -105771 -14739 94125 150849 87724 7190 -41222 -99660 -83917 -137815 -61810
21660 -61810 -8502 4997 94604 143620 59873 -158180 -161502 -203490 -243387 -282663 -169795
21649 -169795 -58857 102499 246390 87971 71051 147657 173442 70135 17779 62486
21639 62486 170323 64013 8345 11940 120160 202643 92817 29167 20293 -38079 -168421
21628 -168421 -232356 -89354 -28406 89430 154189 169061 115528 70081 1953 49586 65869
21617 65869 45749 12879 -48841 -138453 -94572 -80656 -133223 -113581 -24737 19382 90398 145496
21605 145496 4634 -133594 -272626 -220567 -60110 -65775 -134631 -241902 -353180 -282930
$$ packed form
21682h4667J221O5547O1912m4024j38595q0320L4273n5460O5550J87230K3503
21671C6170j41941R1032J08864N6724o3125q0534m8412n8438J5743n3898P6005
21660f1810N3308J3499Q9607M9016q3747k18053l322m1988l9897l9276J12868
21649a69795J10938J61356J43891j58419j6920P6606K5785j03307n2356M4707
21639F2486J07837j06310n5668L595J08220Q2483j09826o3650q874n8372j30342
21628a68421o3935J43002O0948J17836O4759J4872n3533m5447o8128M7633J6283
21617F5869k0120l2870o1720q9612M3881J3916n2567J9642Q8844M4119P1016N5098
21605A45496j40862j38228j39032N2059J60457n665o8856j07271j11278P0250
$$ plain form
21595 -282930 -285844 -231669 -109156 -84384 -121868 -140735 -164467 -97880 -20985 4004 33703
21584 33703 117214 16513 33898 -11354 -114152 -171983 -198218 -161542 -137778 -122900 -99122
21573 -99122 -103178 -132081 -199985 -121538 -140292 -182705 -217247 -108006 -133946 -125151 13438 89786
21561 89786 27658 5681 -59142 -49530 -132883 -115916 -105723 -194024 -69304 -50797 -73542 -63580
21549 -63580 29510 -13426 -100910 -94963 -75375 -115030 -78827 -122580 9102 146815 155827 40757
21537 40757 -126652 -113617 -44126 75594 201756 259649 173755 198048 180432 50779 -79206
21526 -79206 -48727 -43430 -80597 -9890 -26489 -190378 -218330 -161974 -29151 5320 -25096
21515 -25096 -103203 -90313 -83820 -135132 -200010 -110183 -30130 -107012 -234992 -25387 83713
$$ packed form
21595b82930k914N4175J22513K4772l7484j8867k3732O6587P6895K4989K9699
21584C3703Q3511j00701J7385m5252j02798n7831k6235L6676K3764J4878K3778
21573i9122m056k8903o7904P8447j8754m2413l4542J09241k5940Q795J38589P6348
21561H9786o2128k1977o4823R612q3353J6967J0193q8301J24720J8507k2745R962
21549f3580R3090m2936q7484N947J9588l9655L6203m3753J31682J37713R012j15070
21537D0757j67409J3035O9491J19720J26162N7893q5894K4293j7616j29653j29985
21526g9206L0479N297l7167P0707j6599j63889k7952N6356J32823L4471l0416
21515b5096p8107J2890O493n1312o4878Q9827Q0053p6882j27980K09605J09100
$$ plain form
21504 83713 32083 -60866 -66633 -52259 -10389 140360 134755 82358 87547 45594 -6295 -2275
21492 -2275 -19156 26866 2881 -7191 -1407 77337 55372 -20935 -24162 73432 81373 73796 72071
21479 72071 -66630 -92663 -108568 -131272 -154602 -232761 -257975 -153824 -130542 -52839 -41488
21468 -41488 -35450 64078 139141 -39801 -176913 -130825 -62782 -145557 -117829 -91215 -174468
21457 -174468 -224461 -162752 -222810 -332864 -247056 -198559 -148999 -179383 -196879 -69376 -128306
21446 -128306 -168783 -182578 -59615 -29473 35456 3513 -91234 -42030 -87697 -97947 -117271
21435 -117271 -87148 -50846 -105057 -6486 42852 57382 93826 -5376 -150637 -207276 -241404
21424 -241404 -218259 -67835 50518 133341 272960 214439 94605 11577 -131967 -202014
$$ packed form
21504H3713n1630r2949n767J4374M1870J50749n605n2397N189m1953n1889M020
21492b275j6881M6022k3985j0072N784P8744k1965p6307l227R7594P941p577j725
21479G2071j38701k6033j5905k2704k3330p8159k5214J04151K3282P7703J1351
21468d1488O038R9528P5063j78942j37112M6088O8043q2775K7728K6614q3253
21457a74468m9993O1709o0058j10054Q5808M8497M9560l0384j7496J27503n8930
21446a28306m0477j3795J22963L0142O4929l1943r4747M9204m5667j0250j9324
21435a17271L0123L6302n4211R8571M9338J4530L6444r9202j45261n6639l4128
21424b41404K3145J50424J18353Q2823J39619n8521j19834q3028j43544p0047
$$ plain form
21414 -202014 -191528 -56449 394 15897 -68130 -46823 17373 58867 171101 138405 8362
21403 8362 51114 1012 -33438 -51226 -70333 -47109 -73330 -183441 -286709 -273793 -321227
21392 -321227 -298150 -142563 -84301 -98104 -194319 -154623 -23464 -86791 -52218 10240 -25013
21381 -25013 -44049 59329 75988 124350 64992 -2639 -45757 -8913 -72729 -134018 -245374
21370 -245374 -296478 -268673 -162632 -183890 -195878 -37958 132212 194982 173164 51314 42824
21359 42824 66058 128910 110556 75691 20918 -104290 -259645 -337235 -201291 -131052 -77676
21348 -77676 83681 80885 63432 86100 49215 -31551 -119477 -90552 -73196 -76425 15853 29702
21336 29702 -8895 158604 194953 174945 121330 125248 154091 -17957 -168296 -140466 -119115
$$ packed form
21414b02014J0486J35079N6843J5503q4027K1307O4196M1494J12234l2696j30043
21403H362M2752n0102l4450j7788j9107K3224k6221j10111j03268J2916m7434
21392c21227K3077J55587N8262j3803r6215L9696J31159o3327L4573O2458l5253
21381b5013j9036J03378J6659M8362n9358o7631m3118L6844o3816o1289j11356
21370b45374n1104K7805J06041k1258j1988J57920J70170O2770k1818j21850q490
21359D2824K3234O2852j8354l4865n4773j25208j55355p7590J35944P0239N3376
21348g7676J61357k796j7453K2668l6885q0766q7926K8925J7356l229R2278J3849
21336B9702l8597J67499L6349k0008n3615L918K8843j72048j50339K7830K1351
$$ plain form
21325 -119115 -165508 -30167 12963 -2768 -97280 -185277 -81419 -100213 -152393 -69264 66246
21314 66246 131788 56758 -7211 -59004 -18643 -61619 -128184 32561 223660 128435 -37469
21303 -37469 -101208 -25945 -12131 -58285 -49877 51809 96844 165721 151128 30746 -84528
21292 -84528 -87374 -76059 -73720 63023 117635 21255 14715 34008 -69620 -115169 -104161 -59164
21280 -59164 -46395 -22021 -27680 -2114 -16225 -116100 -6334 -59859 -118917 -150919 -62030 -121104
21268 -121104 -100074 -43098 -53303 -179971 -155194 14722 70416 76471 136750 150020 152005
21257 152005 179772 128236 -5294 -84657 -121170 -211230 -205889 -133157 -83727 -99811 -51000
21246 -51000 78153 142248 43650 -51319 48542 126607 56150 6401 33006 -59190 -145279
$$ packed form
21325a19115m6393J35341M3130j5731r4512q7997J03858j8794n2180Q3129J35510
21314F6246O5542p5030o3969n1793M0361m2976o6565J60745J91099r5225j65904
21303c7469o3739P5263J3814m6154Q408J01686M5035O8877j4593j20382j15274
21292h4528k846J1315K339J36743N4612r6380o540J9293j03628m5549J1008M4997
21280e9164J2769K4374n659K5566j4111r9875J09766n3525n9058l2002Q8889n9074
21268a21104K1030N6976j0205j26668K4777J69916N5694O055O0279J3270J985
21257A52005K7767n1536j33530p9363l6513r0060N341P2732M9430j6084M8811
21246e1000J29153O4095r8598r4969R9861P8065p0457m9749K6605r2196q6089
$$ plain form
21235 -145279 -340402 -485238 -325881 -156987 -44545 120473 43666 -54820 -19379 -134200
21225 -134200 -181070 -105622 -84058 -25837 91356 -9991 -154350 -9350 106458 142525
21215 142525 123505 119471 113103 -68613 -127657 -53042 -71302 -162688 -197891 -119896 32785
21204 32785 -10409 -63324 -92860 -82202 -70231 -103595 -108403 -105727 -154365 -368873 -349863 -119852
21192 -119852 50471 83889 6264 -54342 -84756 -111921 -68233 9177 59015 -90094 -104282
21181 -104282 -32077 -16577 -13424 -75430 -150149 -72488 16429 65043 70353 158161 186372 89734
21169 89734 59350 132926 52578 -55809 -38767 136251 353886 302331 180504 77564 102433
21158 102433 41992 16891 39837 54496 75152 50075 17587 32247 38174 -140358 -192106
$$ packed form
21235a45279j95123j44836J59357J68894J12442J65018p6807r8486L5441j14821
21225a34200m6870P5448K1564N8221J17193j01347j44359J45000J15808L6067
21215A42525j9020m034o368j81716n9044P4615j8260r1386l5203P7995J52681
21204C2785m3194n2915k9536J0658J1971l3364m808K676m8638k14508J9010K30011
21192a19852J70323L3418p7625o0606l0414k7165M3688P7410M9838j49109j4188
21181a04282P2205J5500L153o2006p4719P7661Q8917M8614N310Q7808K8211r6638
21169H9734l0384P3576q0348j08387J7042J75018K17635n1555j21827j02940K4869
21158A02433o0441k5101K2946J4659K0656k5077l2488J4660N927j78532n1748
$$ plain form
21147 -192106 -18348 19417 27541 76481 -71642 -211233 -195475 -31598 157240 80072 26643
21136 26643 197580 235520 185417 197787 44083 -114902 -99955 -26567 -88514 -55878 -22990
21125 -22990 61717 77260 24665 -19391 -122190 -58252 -91983 37367 110539 -89814 -156067
21114 -156067 -129253 -110192 -12299 41609 -54326 -103269 -175931 -138633 29144 136820 26745
21103 26745 -46813 -33737 44165 94190 79357 -129339 -225366 -284472 -327590 -266318 -169415
21092 -169415 -87242 -202735 -185151 -168136 -115118 -117378 -76423 35787 153174 53775 -91828
21081 -91828 -85316 11806 27459 47220 93672 -11377 -214152 -286545 -379337 -262399 -108020
21070 -108020 103052 99832 81719 136798 56383 -26388 44542 34287 -39328 -44291 73602
$$ packed form
21147a92106J73758L7765Q124M8940j48123j39591J5758J63877J88838p7168n3429
21136B6643J70937L7940n0103J2370j53704j58985J4947P3388o1947L2636L2888
21125b2990Q4707J5543n2595m4056j02799O3938l3731J29350P3172k00353o6253
21114a56067K6814J9061R7893N3908r5935m8943p2662L7298J67777J07676j10075
21103B6745p3558J3076P7902N0025j4833k08696r6027n9106m3118O1272R6903
21092a69415Q2173j15493J7584J7015N3018k260M0955J12210J17387r9399j45603
21081i1828O512R7122J5653J9761M6452j05049k02775p2393r2792J16938J54379
21070a08020K11072l220j8113N5079q0415q2771P0930j0255p3615m963J17893
$$ plain form
21059 73602 -1247 -140823 -101764 -110877 -164077 -37315 102631 150228 53931 -2309 -22644
21048 -22644 -126431 -134266 -157691 -170173 -59345 -16149 35442 50122 110062 90015 5968
21037 5968 -20416 -18059 -30756 -86241 21224 110874 74632 29629 -28446 15646 -16201 -95872
21025 -95872 -112813 -117283 56135 66687 -9391 -145192 -123584 -90457 32378 39226 -22412
21014 -22412 -22176 34664 7561 32432 118673 29202 41720 136546 126387 213373 205396 111993
21002 111993 39886 -6542 11655 155216 215220 172746 87672 70410 -47667 -87159 -77662
20991 -77662 -29108 -81975 -88329 -43300 -90298 -153355 -185900 -16848 97697 30095 19661
20980 19661 52554 15142 124407 103644 25043 99063 74214 -1118 12662 23492 37655
$$ packed form
21059G3602p4849j39576L9059r113n3200J26762J39946M7597r6297n6240k0335
21048b2644j03787p835k3425j2482J10828M3196N1591J4680N9940k0047q4047
21037E968k6384K357j2697n5485J07465Q9650l6242m5003n8075M4092l1847p9671
21025i5872j6941m470J73418J0552p6078j35801K1608L3127J22835O848o1638
21014b2412K36N6840k7103K4871Q6241q9471J2518R4826j0159Q6986p977r3403
21002A11993p2107m6428J8197J43561O0004m2474q5074j7262j18077l9492R497
20991g7662M8554n2867o354M5029m6998o3057l2545J69052J14545o7602j0434
20980A9661L2893l7412J09265k0763p8601P4020k4849p5332J3780J0830J4163
$$ plain form
20969 37655 36429 2888 -94930 -124099 -102210 -108407 -69930 -35989 52855 51862 88591 27099
20957 27099 -185462 -107201 46369 83933 -31866 -69872 -88910 -124256 -183729 -133623 -67193
20946 -67193 -31352 -64587 -135507 -176967 -74000 60983 21063 -49828 -101451 14076 72552
20935 72552 14776 48710 51679 55454 -35224 11793 81274 9983 52722 72143 6410 -19825
20923 -19825 -26111 8762 164727 130848 38586 -32418 -25603 -112562 -125314 -172006 -152408 -123796
20911 -123796 -32418 -96003 -88237 -96099 -231227 -221687 -159594 -55602 -14563 69098 57173 30303
20899 30303 -8226 -76772 -138949 -130808 -80503 -47393 -36593 -147049 -123864 -6274 7920
20888 7920 17243 51210 -12337 -27531 57356 132174 90909 126486 -51119 -142345 -112794 -53830
$$ packed form
20969C7655j226l3541r7818k9169K1889o197L8477L3941Q8844r93L6729o1492
20957B7099k12561P8261J53570L7564j15799l8006j9038l5346n9473N0106O6430
20946f7193L5841l3235p0920m1460J02967J34983l9920p0891n1623J15527N8476
20935G2552n7776L3934K969L775r0678M7017O9481p1291M2739J9421o5733k6235
20923a9825o286L4873J55965l3879r2262p1004O815q6959j2752m6692J9598K8612
20911a23796R1378o3585P766p862j35128R540O2093J03992M1039Q3661j1925k6870
20899C0303l8529o8546o2177Q141N0305L3110J0800j10456K3185J17590J4194
20888G920R323L3967o3547j5194Q4887P4818m1265L5577j77605r1226K9551N8964
$$ plain form
20876 -53830 -7727 -154377 -111839 -104392 -116533 -29868 1149 -14842 28005 -120984 4796
20865 4796 129442 18472 121725 85217 38481 5732 151299 230730 132685 -94534 -277102
20854 -277102 -255031 -138509 -35092 46729 65838 71929 76005 -11481 -121875 -141111 -116405
20843 -116405 9778 -18216 -108210 -128713 -133012 -128852 -243226 -226676 -45650 59523 7528
20832 7528 -58501 -81492 -23377 121880 106008 39847 92103 27766 -130889 -82329 -114159
20821 -114159 -37638 35424 64724 53368 963 -48551 -22881 -125943 -86788 15801 19940
20810 19940 25279 -35013 -83468 -104139 -154470 -224145 -179601 -188884 -97302 -73286 93191 125475
20798 125475 186106 173256 98627 110140 163977 199113 103084 -134266 -60092 89301 87258
$$ packed form
20876e3830M6103j46650M2538P447j2141Q6665L1017j5991M2847j48989J25780
20865D796J24646j10970J03253l6508m6736l2749J45567P9431r8045k27219j82568
20854b77102K2071J16522J03417Q1821J9109O091M076q7486j10394j9236K4706
20843a16405J26183k7994q9994k0503m299M160j14374J6550J81026J05173n1995
20832G528o6029k2991N8115J45257j5872o6161N2256o4337j58655M8560l1830
20821a14159P6521P3062K9300j1356n2405m9514K5670j03062L9155J02589M139
20810A9940N339o0292m8455k0671n0331o9675M4544r283R1582K4016J66477L2284
20798A25475O0631j2850p4629J1513N3837L5136r6029k37350P4174J49393k043
$$ plain form
20787 87258 -126440 -235081 -132707 -93621 22163 115631 197515 96569 6845 -59739 -83005
20776 -83005 -187053 -254657 -311195 -299894 -413395 -368197 -258844 -146904 -100189 -154219 -95879
20765 -95879 -80824 -50469 26625 62532 48969 -4794 9505 -32642 -156189 -144928 -69785
20754 -69785 -63958 -71562 -70185 -45071 -44807 -158823 -169941 -143618 -157593 -114138 -76770 18479
20742 18479 41471 54408 54494 58166 -7700 6990 65094 115353 186184 137759 49783 54428 44606
20729 44606 177420 110224 20355 -46489 -81678 43216 -34357 -87653 12459 15300 -49738
20718 -49738 61888 -21295 -92119 -67756 3354 1111 -103335 -119612 48756 133980 154518
20707 154518 156714 209134 178731 91559 44709 5899 -27819 -94155 19788 -5791 -50290
$$ packed form
20787H7258k13698j08641J02374L9086J15784R3468Q1884j00946q9724o6584k3266
20776h3005j04048o7604n6538J1301j13501M5198J09353J11940M6715n4030N8340
20765i5879J5055L0355P7094L5907j3563n3763J4299m2147j23547J1261P5143
20754f9785N827p604J377K5114K64j14016j1118K6323j3975M3455L7368R5249
20742A8479K2992J2937Q6L672o5866J4690N8104N0259P0831m8425q7976M645r822
20729D4606J32814o7196q9869o6844l5189J24894p7573n3296J00112K841o5038
20718d9738J11626q3183p0824K4363P1110k243j04446j6277J68368Q5224K0538
20707A54518K196N2420l0403q7172m6850l8810l3718o6336J13943k5579m4499
$$ plain form
20696 -50290 -130754 -65903 -141621 -158175 -66035 -9663 23130 11895 -71560 -123102 -147285 26791
20684 26791 43112 23421 2761 -23797 -44562 -69721 -2390 21182 119878 80383 -156358
20673 -156358 -372034 -344378 -272796 -181027 -140035 -34062 37072 -28727 -135465 -140864 -65395
20662 -65395 86002 89674 8889 -68532 -167465 -100997 13541 48941 13192 -89642 -49476
20651 -49476 25732 -21402 -33672 74061 134447 56582 29024 -16727 27920 74392 56740
20640 56740 30782 61373 31424 -27419 -65499 -136127 -116003 -30181 -165486 -245988 -188021
20629 -188021 -146195 -76395 -31464 24132 50018 209406 267910 254380 195237 97781 58755
20618 58755 -91502 -129689 -112605 -154725 -128909 -73461 2790 70606 208609 240407 133938
$$ packed form
20696e0290q0464O4851p5718j6554R2140N6372L2793j1235q3455n1542k4183J74076
20684B6791J6321j9691k0660k6558k0765k5159O7331K3572R8696l9495k36741
20673a56358k15676K7656P1582R1769M0992J05973P1134o5799j06738n399P5469
20662f5395J51397L672q0785p7421r8933O6468J14538L5400l5749j02834M0166
20651d9476P5208m7134j2270J07733O0386p7865k7558m5751M4647M6472j7652
20640E6740k5958L0591k9949n8843l8080p0628K0124Q5822j35305q0502N7967
20629a88021M1826O9800M4931N5596K5886J59388N8504j3530n9143r7456l9026
20618E8755j50257l8187J7084m2120K5816N5448P6251O7816J38003L1798j06469
$$ plain form
20607 133938 44802 -83126 -75248 -111015 -71761 2821 -13236 -23390 -2989 23182 14103 -41616
20595 -41616 94046 100648 59914 18006 126433 133127 130668 141959 105099 39844 113848 65301
20583 65301 -46928 -6786 26340 19842 -51597 -9175 -22658 -55833 -15760 -110472 -185986 -94199
20571 -94199 -21099 115036 37335 -113685 -83402 -66372 -3763 39836 -57365 -101718 -100188
20560 -100188 -102123 -13300 125107 180807 184684 176392 137501 69542 40852 -69479 24412 34614
20548 34614 -108542 -193155 5339 105424 50111 6548 -104074 -38592 -25427 -99189 -156050
20537 -156050 -31316 11275 -33768 -66246 -158770 -176488 -137595 -53841 -49239 -93690 -139409
20526 -139409 -115323 -159273 -119325 -36781 -13396 5789 -4439 68040 147568 83643 -25095
$$ packed form
20607A33938q9136j27928P878l5767L9254P4582j6057j0154K0401K6171r079n5719
20595d1616J35662O602m0734m1908J08427O694k459J1291l6860o5255P4004m8547
20583F5301j12229M0142L3126o498p1439M2422j3483l3175M0073r4712p5514R1787
20571i4199P3100J36135p7701j51020L0283J7030O2609M3599r7201m4353J530
20560a00188j935Q8823J38407N5700L877q292l8891o7959k8690j10331R3891J0202
20548C4614j43156q4613J98494J00085n5313m3563j10622O5482J3165p3762n6861
20537a56050J24734M2591m5043l2478r2524j7718L8893Q3754M602m4451m5719
20526a39409K4086m3950L9948Q2544K3385J9185j0228P2479P9528o3925j08738
$$ plain form
20515 -25095 -19500 31918 767 35559 -63306 -205538 -210523 -143123 -8929 94438 150149
20504 150149 118073 -68909 -96838 -50761 18495 -75485 -149626 5555 90708 114152 109313
20493 109313 105411 -18932 -42285 -22293 -5959 48768 -16673 -6335 131 -30275 19871 78584
20481 78584 85165 6084 -116916 -60995 493 78357 244172 188284 81671 -34303 -75252
20470 -75252 -90667 -115210 -86399 4806 -116162 -173705 -167730 -160907 -190412 -153160 -146993 -107383
20458 -107383 -93580 -44914 -41570 -114280 -138063 -128309 -5566 29245 87934 21178 54587 105060
20446 105060 87995 -70282 -95909 -79376 -82295 -156566 -132145 -36495 -10726 -38675 -78027
20435 -78027 -104468 -24461 -2129 11897 59715 111944 47259 124157 37402 -97770 -81344
$$ packed form
20515b5095N595N1418l1151L4792r8865j42232m985O7400J34194J03367N5711
20504A50149l2076j86982k7929M6077O9256r3980p4141J55181Q5153K3444m839
20493A09313l902j24343k3353J9992J6334N4727o5441J0338O466l0406N0146N8713
20481G8584O581p9081j23000N5921O1488P7864J65815n5888j06613j15974m0949
20470g5252j5415k4543K8811R1205j20968n7543N975O823k9505L7252O167L9610
20458a07383J3803M8666L344p2710k3783R754J22743L4811N8689o6756L3409N0473
20446A05060j7065j58277k5627J6533k919p4271K4421R5650K5769k7949l9352
20435g8027k6441Q0007K2332J4026M7818N2229o4685P6898q6755j35172J6426
$$ plain form
20424 -81344 -52465 -34725 -1093 -65082 -131880 -152714 -144508 -238786 -302576 -239203 -151988 -180088
20412 -180088 -51950 -23573 -40060 -112461 -150184 -182024 -178974 -116720 -103961 50035 101227
20401 101227 19987 -27228 -27866 53470 49855 -51140 -89580 -75909 -46900 8012 108987 2595
20389 2595 -65851 -141473 -160209 -94670 -11804 52104 38688 42543 84077 29170 -103840 -175984
20377 -175984 -287730 -187873 -169323 -114444 -78131 -50343 15541 13001 -90228 -103439 -75673
20366 -75673 -26269 -26702 -74817 38308 59569 51883 29969 86922 52249 17624 -66578 323
20354 323 -52749 7827 -42892 -190309 -104547 -35920 -72600 28260 91672 96411 -3939 -65275
20342 -65275 -117413 -66147 -65055 -5747 18019 -40792 -54639 -73758 -148453 -133144 -74667 -1202
$$ packed form
20424h1344K8879J7740L3632o3989o6798k0834Q206r4278o3790O3373Q7215k8100
20412a80088J28138K8377j6487p2401l7723l1840L050O2254J2759J53996N1192
20401A01227q1240m7215o38Q1336l615j00995l8440J3671K9009N4912J00975j06392
20389B595o8446p5622j8736O5539Q2866O3908j3416L855M1534n4907j33010p2144
20377a75984j11746R9857J8550N4879L6313K7788O5884k540j03229j3211K7766
20366g5673M9404m33m8115J13125K1261p686k1914N6953l4673l4625q4202O6901
20354C23n3072O0576n0719j47417Q5762O8627l6680J00860O3412M739j00350o1336
20342f5275n2138N1266J092N9308K3766n8811j3847j9119p4695J5309N8477P3465
$$ plain form
20330 -1202 38270 35932 -26939 -24947 -163982 -178727 -72625 -28397 -9409 -124785 -207018 -254473
20318 -254473 -167610 -167816 -116362 -80902 -98331 -126322 -142273 -75048 -130952 -186182 -180324 -117149
20306 -117149 -61043 -41942 -2098 16977 48256 148712 180635 61748 29005 -45150 -29522
20295 -29522 80294 114018 144153 23653 -78703 -19963 -18658 69144 109434 113595 94466
20284 94466 -30916 -55472 -123360 -134262 -112080 -132918 -103758 -167680 -70913 22220 87307
20273 87307 -45044 -56837 13513 129536 213561 235065 203374 80019 83971 -18890 -186362
20262 -186362 -252521 -150258 -114417 -147305 -255047 -235133 -152283 -232588 -167302 -88538 -76529
20251 -76529 -5093 -28781 45043 49215 -90340 -65422 -23270 79856 102047 109424 57664 -120504
$$ packed form
20330a202L9472k338o2871J992j39035j4745J06102M4228J8988j15376q2233m7455
20318b54473Q6863k06N1454L5460j7429k7991j5951O7225n5904n5230N858O3175
20306a17149N6106J9101L9844J9075L1279J00456L1923j18887l2743p4155J5628
20295b9522J09816L3724L0135j20500j02356N8740J305Q7802M0290M161j9129
20284I4466j25382k4556o7888j0902K2182k0838K9160o3922R6767R3133O5087
20273H7307j32351j1793P0350J16023Q4025K1504l1691j23355L952j02861j67472
20262a86362o6159J02263L5841l2888j07742J9914Q2850q0305O5286P8764J2009
20251g6529P1436k3688P3824M172j39555K4918M2152J03126K2191P377n1760j78168
$$ plain form
20239 -120504 -236859 -153078 -267018 -368345 -263644 -101731 -15908 -58074 32561 -11276
20229 -11276 -98955 -9736 -107495 -82001 -9287 -12021 -47030 -194247 -237225 -139243 -19442
20218 -19442 3626 -68369 -36916 8343 -132798 -53328 144021 55797 33664 -56464 -65074
20207 -65074 97760 73639 18996 10029 43654 -66910 -253916 -149573 -164890 -143457 -126188
20196 -126188 -63986 54855 34013 -66646 -117583 -163080 -72398 -4903 15755 6554 -25746
20185 -25746 -100926 -158445 -138985 -166744 -126984 -17551 -72682 -109347 -110315 -122710 -55217 -93876
20173 -93876 -142558 -63551 -29603 -27419 -88995 26078 104816 3596 43662 50954 -69311
20162 -69311 -91258 54318 125764 107647 94129 125648 130658 167161 232177 162843 75349 28739
$$ packed form
20239a20504j16355Q3781j13940j01327J04701J61913Q5823m2166R0635m3837
20229a1276q7679Q9219r7759K5494P2714k734l5009j47217m2978R7982J19801
20218a9442K3068p1995L1453M5259j41141P9470J97349q8224k2133r0128q610
20207f5074J62834k4121n4643q967L3625j10564j87006J04343j5317K1433J7269
20196a26188O2202J18841k0842j00659n0937m5497R0682O7495K0658r201l2300
20185b5746p5180n7519J9460k7759L9760J09433n5131l6665r68j2395O7493l8659
20173i3876m8682P9007L3948K184o1576J15073P8738j01220M0066P292j20265
20162f9311k1947J45576P1446j8117j3518L1519N010L6503O5016o9334q7494m6610
$$ plain form
20150 28739 -43526 -16076 -16632 -64336 -52293 -59480 -92144 -148854 -183536 -152957 -173180 -163796
20138 -163796 -143708 -231317 -76416 -26645 -122291 85588 79997 -22025 19466 72642 118235
20127 118235 165902 296976 325298 206650 129865 51752 -42838 -35109 49724 42617 -75241
20116 -75241 67905 136321 63605 92064 53207 -11923 -53707 -8234 -32050 -32890 -74447 -192804
20104 -192804 -78105 36191 10208 145091 164355 106530 111238 -58402 4615 5016 67210
20093 67210 139120 167347 84421 51729 75286 111495 160383 128913 -550 -14284 -8829 25704
20081 25704 1826 21224 -1157 -28520 44431 -15629 8236 95382 84377 117555 161700 11281
20069 11281 -24440 48392 34412 -66921 -60557 -85274 -149088 -96091 -47141 -101139 -100628 -6169
$$ packed form
20150B8739p2265K7450n56m7704J2043p187l2664n6710l4682L0579k0223R384
20138a63796K0088q7609J54901M9771r5646K07879n591j02022M1491N3176M5593
20127A18235M7667J31074K8322j18648p6785p8113r4590P729Q4833p107j17858
20116g5241J43146O8416p2716K8459l8857o5130m1784M5473k3816q40m1557j18357
20104a92804J14699J14296k5983J34883J9264n7825M708j69640O3017M01O2194
20093F7210P1910K8227q2926l2692K3557L6209M8888l1470j29463j3734N455L4533
20081B5704k3878J9398k2381k7363P2951o0060K3865Q7146j1005L3178M4145j50419
20069A1281l5721P2832j3980j01333O364k4717o3814N2997M8950n3998N11R4459
$$ plain form
20057 -6169 17352 22440 -16692 -170396 -158299 -336 39503 45907 34793 -28416 -51231 -69691
20045 -69691 -56746 -16748 37434 7771 92678 141078 85039 12011 -33970 63398 57114 -77133
20033 -77133 -39317 -54777 -89170 -118137 -8414 114049 121223 135839 72479 -133139 -196316
20022 -196316 -195780 -236982 -187691 -37593 53895 53563 55843 8813 86850 120965 22132 32221
20010 32221 271471 385437 252101 208999 24370 -77166 46915 -67218 -46321 13664
20000 13664 68239 108196 151866 189188 211615 202083 149336 131331 168716 143485 85812 62296
19988 62296 -12248 107122 195396 156897 163915 73179 -53912 64307 159283 98383 32588
19977 32588 -5258 49966 57056 38681 30146 133501 150536 61814 -7925 67452 -10851 101359
$$ packed form
20057f169K3521N088l9132j53704J2097J57963L9839O404j1114o3209k2815j8460
20045f9691J2945L9998N4182k9663Q4907M8400n6039p3028m5981R7368o284j34247
20033g7133L7816j5460l4393k8967J09723J22463P174J4616o3360k05618o3177
20022a96316N36m1202M9291J50098R1488l32K280m7030P8037L4115r8833J0089
20010C2221K39250J13966j33336m3102j84629j01536J24081j14133K0897N9985
20000A3664N4575L9957M3670L7322K2427r532n2747j8005L7385k5231n7673k3516
19988F2296p4544J19370Q8274l8499P018r0736j27091J18219R4976o0900o5795
19977C2588l7846N5224P090j8375q535J03355J7035q8722o9739P5377p8303J12210
$$ plain form
19965 101359 197614 231777 196453 160741 -28539 -153067 -176123 -201573 -245545 -187742 -241516
19954 -241516 -182939 -60558 -140036 -137672 99921 209619 193562 76705 -38203 17721 38990
19943 38990 37178 -16902 97877 104759 100850 173039 59053 -59018 -11394 -82463 -16634 78912
19931 78912 94440 117080 148272 185651 220066 203702 186204 147539 53590 -2580 87196 107396
19919 107396 69002 92395 25092 61297 12067 -136359 -66294 -8049 -95678 -82184 -72404
19908 -72404 -14747 9800 -46301 -64447 4998 67659 64331 30826 56714 -25019 7613 28816
19896 28816 -62639 -97958 -156480 -138657 -138065 -158839 -107505 -32580 -56848 -138746 -99122 -51484
19884 -51484 -67495 -96123 -112800 -125991 -199075 -105951 -87417 -58325 -5158 -49829 -69229 -151157
$$ packed form
19965A01359R6255L4163l5324l5712j89280j24528k3056k5450m3972N7803n3774
19954b41516N8577J22381p9478K364K37593J09698j6057j16857j14908N5924K1269
19943C8990j812n4080J14779O882l909P2189j13986j18071M7624p1069O5829R5546
19931G8912J5528K2640L1192L7379L4415j6364j7498l8665r3949n6170Q9776K0200
19919A07396l8394K3393o7303L6205m9230j48426P0065N8245q7629J3494R780
19908g2404N7657K4547n6101j8146O9445O2661l328l3505K5888q1733L2632K1203
19896B8816r1455l5319n8522J7823N92k0774N1334P4925k4268q1898L9624M7638
19884e1484j6011k8628j6677j3191p3084R3124J8534K9092N3167m4671j9400q1928
$$ plain form
19872 -151157 -210686 -303314 -270127 -187962 -52901 -71022 -84944 -154306 -56182 38065 157898
19861 157898 224537 161442 36513 18180 105135 77600 -25709 55878 91207 115619 84519
19850 84519 66947 31873 -35979 -51775 -18653 24278 11683 -94327 -57816 50657 -4561
19839 -4561 -90007 -89121 3380 14528 40284 1873 -14687 -41223 -74653 -105504 -35410 -50287
19827 -50287 -206458 -261187 -210285 -161030 -192759 -185662 -165343 -109618 -84617 -43048 -84909 -62500
19815 -62500 -10292 -74430 -90605 -56544 18029 157490 161968 115385 161425 164535 50661 -74731
19803 -74731 -30949 -56391 -53692 67055 92027 30137 40545 -99764 -92338 -24510 36960 -47712
19791 -47712 -11493 -34669 -16743 -53000 -184668 -312848 -364806 -183212 -109255 -141045 -128372
$$ packed form
19872a51157n9529r2628L3187Q2165J35061j8121j3922o9362R8124R4247J19833
19861A57898O6639o3095j24929j8333Q6955k7535j03309Q1587L5329K4412l1100
19850H4519j7572l5074o7852j5796L3122M2931j2595j06010L6511J08473n5218
19839d561q5446Q86R2501J1148K5756l8411j6560k6536l3430l0851P0094j4877
19827e0287j56171n4729N0902M9255l1729P097K0319N5725K5001M1569m1861K2409
19815f2500N2208o4138j6175L4061P4573J39461M478m6583M6040L110j13874j25392
19803g4731M3782k5442K699J20747K4972o1890J0408j40309P426O7828O1470q4672
19791d7712L6219k3176J7926l6257j31668j28180n1958J81594P3957l1790J2673
$$ plain form
19780 -128372 -69621 -24829 10990 4956 -48610 -52545 4395 105812 115956 127887 116486 -78659
19768 -78659 -225546 -203853 -148827 -155905 -173734 -163136 -196300 -224874 -160175 -54679 92868
19757 92868 138859 70124 -12247 -63457 -83596 23187 68647 107228 -2781 -71445 -127023
19746 -127023 -90592 -28218 70854 150728 66285 20510 42945 105165 67724 -18195 -36328
19735 -36328 -16516 830 -19614 3229 -24284 -156833 -172210 -54613 30258 23151 -9307
19724 -9307 11002 52050 -52128 -109441 -126643 -171383 -244260 -184455 -68733 -69530 -92290 -113042
19712 -113042 -66126 83785 230063 140177 -39398 56952 198333 129422 118380 24165 20023
19701 20023 58392 144496 114178 34771 167 -27520 -161169 -270898 -135247 -14890 5138
$$ packed form
19780a28372N8751M4792L5819o034n3566l935N6940J01417J0144J1931j1401j95145
19768g8659j46887K1693N5026p078j7829J0598l3164k8574O4699J05496J47547
19757I2868M5991o8735q2371n1210k0139J06783M5460L8581j10009o8664n5578
19746a27023L6431O2374R9072P9874q4443m5775K2435O2220l7441q5919j8133
19735c6328J9812J7346k0444K2843k7513j32549j5377J17597Q4871p107l2458
19724i307K0309M1048j04178n7313j7202m4740p2877N9805J15722p97k2760k0752
19712a13042M6916J49911J46278q9886j79575R6350J41381o8911j1042r4215m142
19701B0023L8369Q6104l0318p9407l4604k7687j33649j09729J35651J20357K0028
$$ plain form
19690 5138 -117712 -83416 18013 -27439 60035 176880 156390 140139 59441 -33957 -111789
19679 -111789 -28123 88169 413 -56611 -93064 -100729 -52372 27660 -72150 -195622 -78451
19668 -78451 32401 6444 -12792 -48814 -71905 12881 -79182 -167271 -189740 -30322 28665
19657 28665 148442 187448 113680 52306 63518 80811 80010 104486 102003 27098 -54123 -102578
19645 -102578 -90373 -113306 -161795 -231512 -235945 -173424 -22912 45498 59266 25563 -23073
19634 -23073 49521 96397 121081 107772 51303 39526 -28169 -26095 19365 -44133 23631 -23808
19622 -23808 -68608 -26410 51236 67180 -39636 -78159 -107839 -153406 -10342 148411 206562
19611 206562 222511 12224 -153525 -155132 -112085 -109891 -111921 -80247 18573 10658 -12083 -98045
$$ packed form
19690E138j22850L4296J01429m5452Q7474J16845k0490j6251q0698r3398p7832
19679a11789Q3666J16292q7756n7024l6453p665M8357Q0032r9810j23472J17171
19668g8451J10852k5957j9236l6022k3091Q4786r2063q8089k2469J59418N8987
19657B8665J19777L9006p3768o1374J1212J7293q01K4476k483p4905q1221m8455
19645a02578J2205k2933m8489o9717m433O2521J50512O8410J3768l3703m8636
19634b3073P2594M6876K4684j3309n6469j1777o7695K074M5460o3498O7764m7439
19622b3808m4800M2198P7646J5944j06816l8523k9680m5567J43064J58753N8151
19611B06562J5949k10287j65749j607M3047K194k030L1674R8820p915k2741q5962
$$ plain form
19599 -98045 -101238 -108127 -80828 31559 104716 155395 102091 45080 -26843 -64553 -29388 74436
19587 74436 91465 53903 36521 81476 76468 145510 66288 85542 117009 100760 77059 31377
19575 31377 -113436 -216589 -363302 -346735 -254876 -156986 -83343 -97137 -49772 -55824 -90192
19564 -90192 14039 124166 184937 148518 -84473 -213552 -67377 -18319 -148151 -239017
19554 -239017 -199809 -85727 17059 78358 76783 121520 95871 -37519 -12514 58764 141599
19543 141599 42754 21510 130630 175365 66507 9334 62840 60529 108205 79428 271
19532 271 47428 56705 -59033 -18999 25487 -56439 19958 308156 434324 347971 101757
19521 101757 9518 132006 179515 225297 222773 210935 184431 155084 192740 102941 -35023
$$ packed form
19599i8045l193o889K7299J12387P3157N0679n3304n7011p1923l7710L5165J03824
19587G4436J7029l7562j7382M4955n008O9042p9222J9254L1467j6249k3701m5682
19575C1377j44813j03153j46713J6567R1859R7890P3643j3794M7365o052l4368
19564i0192J04231J10127O0771l6419k32991j29079J46175M9058j29832r0866
19554b39017L9208J14082J02786O1299j575M4737k5649j33390K5005P1278Q2835
19543A41599r8845k1244J09120M4735j08858n7173N3506k311M7676k8777p9157
19532B71M7157R277j15738M0034M4486q1926P6397K88198J26168q6353k46214
19521A01757r2239J22488M7509M5782k524j1838k6504k9347L7656q9799j37964
$$ plain form
19510 -35023 -117194 -87181 -159632 -93780 -62169 -206741 -210046 -83610 15144 -15987 22885
19499 22885 -90543 -174827 -111964 -38754 9482 -95048 -81420 -8471 -33790 -85922 -71445
19488 -71445 -41592 -20290 1160 37571 123603 112320 75390 69900 64434 27703 77640 64906
19476 64906 -45464 -72539 -48634 -34883 6198 -35423 -106377 -48162 59849 79497 131389
19465 131389 196898 135583 40264 168992 200759 39623 92795 190869 220330 253439 225835
19454 225835 3362 -161835 -194213 -211487 -207206 -229809 -151500 -69961 -13336 -52585 -82891
19443 -82891 -125197 -254900 -271903 -210746 -214250 -221023 -113896 -54079 -48351 -14817 -39414 -96932
19431 -96932 -74423 -136543 -288758 -302210 -189016 -177921 -70785 36014 -12878 -163748 -244556
$$ packed form
19510c5023q2171L0013p2451O5852L1611j44572l305J26436R8754l1131L8872
19499B2885j13428q4284O2863P3210M8236j04530J3628P2949k5319n2132J4477
19488g1445K9853K1302K1450L6411Q6032j1283l6930n490n466l6731M9937j2734
19476F4906j10370k7075K3905J3751M1081m1621p0954N8215J08011J9648N1892
19465A31389O5509o1315r5319J28728L1767j61136N3172R8074K9461L3109k7604
19454B25835k22473j65197l2378j7274M281k2603P8309Q1539N6625l9249l0306
19443h2891m2306j29703j7003O1157l504o773J07127N9817N728L3534k4597n7518
19431i6932K2509o2120j52215j3452J13194J1095J07136J06799m8892j50870q0808
$$ plain form
19420 -244556 -232320 -304477 -275760 -365501 -394548 -206409 -30103 36887 84354 202015 119265
19409 119265 22352 113374 144140 47668 36632 82009 105532 99471 28152 -24631 -132688
19398 -132688 -94209 -19794 22489 -3 24645 48666 31755 53319 7412 -31297 -61145
19387 -61145 -125258 -67791 -51347 -41620 -59990 -110400 -68560 24386 57816 198938 114079 -3424
19375 -3424 44574 237094 265546 287935 229874 20914 -103634 83892 225411 132411 116240
19364 116240 98288 100901 104811 202751 199498 109181 35904 -56465 -50701 -18655 53151 114429
19352 114429 116734 92826 64638 -24838 4991 177067 270552 216241 204523 151825 168528
19341 168528 248645 333574 244218 145935 119525 142362 132758 87614 147111 87499 192164
$$ packed form
19420b44556J2236p2157K8717q9741k9047J88139J76306O6990M7467J17661q2750
19409A19265r6913R1022L0766r6472j1036M5377K3523o061p1319n2783j08057
19398a32688L8479P4415M2283k2492K4648K4021j6911K1564m5907l8709k9848
19387f1145o4113N7467J6444R727j8370n0410M1840R2946L3430J41122q4859j17503
19375c424M7998J92520K8452K2389n8061k08960j24548J87526J41519r3000j6171
19364A16240j7952K613L910R7940l253r0317p3277r2369N764L2046P1806O1278
19352A14429K305k3908k8188q9476K9829J72076R3485n4311j1718n2698J6703
19341A68528Q0117Q4929q9356r8283k6410K2837r604m5144N9497n9612J04665
$$ plain form
19330 192164 190958 97984 109863 64123 44933 42558 88623 97274 84444 79339 22510 -50424
19318 -50424 -28889 -21660 -41876 -121666 -227703 -137733 -26320 77868 94492 128494 16195
19307 16195 3444 75203 173893 45217 -71868 -10330 14543 11328 -47570 19413 61662
19296 61662 58412 69572 87486 53753 40506 108902 127095 65171 44245 153845 112499 133433
19284 133433 153962 178411 188703 112382 129045 154919 244253 233901 324742 316846 227497 139000
19272 139000 188906 116880 135770 170706 147324 83885 176426 315542 280800 176388 64439
19261 64439 90615 205146 265627 284249 249768 118177 198174 286353 360320 326201 352750
19250 352750 539628 629216 590219 605357 807487 954497 1046866 1162594 1347454 1281650
$$ packed form
19330A92164j206r2974J1879m5740j9190k375M6065Q651j2830n105n6829p2934
19318e0424K1535P229k0216p9790j06037Q9970J11413J04188J6624L4002j12299
19307A6195j2751P1759R8690j28676j17085O1538K4873l215n8898O6983M2249
19296F1662l250J1160J7914l3733j3247O8396J8193o1924k0926J09600m1346K0934
19284A33433K0529K4449J0292p6321J6663K5874Q9334j0352R0841p896q9349q8497
19272A39000M9906p2026J8890L4936k3382o3439R2541J39116l4742j04412j11949
19261F4439K6176J14531O0481J8622l4481j31591P9997Q8179P3967l4119K6549
19250C52750J86878Q9588l8997J5138K02130J47010R2369J15728J84860o5804
$$ plain form
19240 1281650 1142067 1133121 1042414 831257 630055 402214 268375 231528 299145 304306 352140
19229 352140 433403 569865 542767 541480 550813 431434 155869 154778 275673 187522 185769
19218 185769 299971 361143 375062 378500 452522 414822 458544 419311 379128 280908 169728
19207 169728 147067 98703 52716 110261 211869 265611 397825 415935 350790 425521 531408
19196 531408 658463 645989 852792 953977 1056736 1274797 1409978 1429253 1415160 1367394
19186 1367394 1370227 1379061 1262047 1076532 887802 621245 415407 339279 320801 292097 341625
19175 341625 380888 424236 440120 393768 256685 148562 177296 256212 239326 217841 196306
19164 196306 184709 152459 144143 182270 190990 142126 184186 261968 294797 191839 61882
$$ packed form
19240A281650j39583q946r0707k11157k01202k27841j33839l6847O7617N161M7834
19229C52140Q1263J36462k7098j287R333j19379k75565j091J20895q8151j753
19218A85769J14202O1172J3919L438P4022l7700M3722l9233m0183r8220j11180
19207A69728k2661m8364m5987N7545J01608N3742J32214J8110o5145P4731J05887
19196E31408J27055j2474K06803J01185J02759K18061J35181J9275j4093m7766
19186A367394K833Q834j17014j85515j88730k66557k05838p6128j8478k8704M9528
19175C41625L9263M3348J5884m6352j37083j08123K8734P8916j6886k1485k1535
19164A96306j1597l2250q316L8127Q720m8864M2060P7782L2829j02958j29957
$$ plain form
19153 61882 133756 114770 113931 226556 224742 192767 59183 42806 92735 191740 280084 309489
19141 309489 296941 228534 103336 55780 140635 178609 240533 146596 122852 28615 108592
19130 108592 279408 299571 216824 217070 301542 254589 106720 87130 103918 224595 312805
19119 312805 302057 215019 230104 224818 70245 -21183 -99468 3462 202279 240764 149478
19108 149478 -12558 15527 81043 172421 74506 -5435 52956 176585 165690 176012 269702
19097 269702 303165 394131 335541 297721 176216 129137 231692 287218 293278 288093 292981 227330
19085 227330 140950 37470 112259 124561 170234 193573 191983 174735 159142 149381 128454 183209
19073 183209 350698 425763 287309 278343 259242 346165 342522 247264 196224 160162 35352
$$ packed form
19153F1882P1874j8986q39J12625j814l1975j33584j6377M9929R9005Q8344K9405
19141C09489j2548o8407j25198m7556Q4855L7974O1924r3937k3744r4237P9977
19130A08592J70816K0163q2747K46Q4472m6953j47869j9590J6788J20677Q8210
19119C12805j0748q7038J5085n286j54573r1428p8285J02930J98817L8485r1286
19108A49478j62036K8085O5516R1378r7915p9941N8391J23629j0895J0322R3690
19097B69702L3463R0966n8590l7820j21505m7079J02555N5526O060n185M888o5651
19085B27330q6380j03480P4789J2302M5673K3339j590j7248j5593r761k0927N4755
19073A83209J67489P5065j38454q966j9101Q6923l643r5258n1040l6062j24810
$$ plain form
19062 35352 27891 181952 157159 178784 121225 76351 133769 189476 217314 217521 239069 270411
19050 270411 264187 159090 195089 166050 183021 238046 236626 282540 367801 281173 221368 252482
19038 252482 373449 368604 379804 434817 239772 170382 172953 105478 190314 270655 273670 143306
19026 143306 91654 260571 258780 247732 224655 73238 56573 65943 125692 38649 160757
19015 160757 216420 33674 -157198 -128397 14131 87578 51448 42619 24919 44220 174958
19004 174958 143378 117753 207481 176053 238682 301177 355498 333555 284162 228821 265125
18993 265125 310436 349925 331145 323267 491521 607354 499245 283058 312760 335512 259322
18982 259322 174211 -45088 -43068 51273 58289 32159 161109 322649 258256 196638 324866
$$ packed form
19062C5352p461J54061k4793K1625n7559m4874N7418N5707K7838K07K1548L1342
19050B70411o224j05097L5999k9039J6971N5025j420M5914Q5261q6628n9805L1114
19038B52482J20967m845J1200N5013j95045o9390K571o7475Q4836Q0341L015j30364
19026A43306n1652J68917j791j1048k3077j51417j6665R370N9749q7043J22108
19015A60757N5663j82746j90872K8801J42528P3447l6130q829j7700J9301J30738
19004A74958l1580k5625Q9728l1428O2629O2495N4321k1943m9393n5341L6304
18993B65125M5311L9489j8780p878J68254J15833j08109k16187K9702K2752p6190
18982B59322q5111k19299K020R4341P016k6130J28950J61540o4393o1618J28228
$$ plain form
18971 324866 317478 188601 100408 87955 177059 312211 346551 404961 293079 204432 14215
18960 14215 8210 87441 261362 338531 389859 367497 337159 306699 235825 332505 412907 279040
18948 279040 221107 212971 169638 181082 223487 249328 222649 176825 234200 291550 266829 170750
18936 170750 181783 243992 327525 364626 291988 360382 413086 286258 271051 245365 174985
18925 174985 156662 297090 317517 268222 252106 278146 205127 50521 93468 158006 230836
18914 230836 257097 256778 206685 335711 308338 417414 414140 406061 533337 598108 614059 622633
18902 622633 674827 944698 1295898 1487031 1733793 1837692 1804546 1638296 1510753 1307984
18892 1307984 995102 754554 584214 462682 389111 375864 422996 571012 582974 560059
$$ packed form
18971C24866p388j28877q8193j2453Q9104J35152L4340N8410j11882q8647j90217
18960A4215o005P9231J73921P7169N1328k2362l0338l0460p0874R6680Q0402j33867
18948B79040n7933q136m3333J1444M2405K5841k6679m5824N7375N7350k4721r6079
18936A70750J1033O2209Q3533L7101p2638O8394N2704j26828j5207k5686p0380
18925A74985j8323J40428K0427m9295j6116K6040p3019j54606M2947O4538P2830
18914B30836K6261l19n0093J29026k7373J09076l274q079J27276O4771J5951Q574
18902F22633N2194K69871L51200J91133K46762J03899l3146j66250j27543k02769
18892A307984l12882k40548j70340j21532p3571j3247M7132J48016J1962k2915
$$ plain form
18882 560059 539405 537149 458358 405900 366645 279886 225284 251989 219888 145164 158734 253330
18870 253330 375933 585655 850245 1142404 1484109 1765437 1926778 2029339 2026477 2024927
18860 2024927 1877292 1625191 1275989 1017726 999546 1026826 949553 835680 676388 612796
18850 612796 599240 576248 562320 513453 555509 600409 606620 693544 694007 716846 643228 654762
18838 654762 702320 769276 838029 856599 980005 1008901 923685 824167 807735 851372 812626
18827 812626 747774 815031 741364 654975 654943 660144 597704 569306 635470 682605 758957 781394
18815 781394 765796 706792 640118 672078 636096 610208 610483 566336 638484 649200 667309 766587
18803 766587 870786 992760 1013518 1085599 1196094 1157647 1091864 983414 935593 924527 969252
$$ packed form
18882E60059k0654k256p8791n2458l9255q6759n4602K6705l2101p4724J3570R4596
18870B53330J22603K09722K64590K92159L41705K81328J61341J02561k862j550
18860B024927j47635k52101l49202k58263j8180K7280p7273j13873j59292o3592
18850F12796j3556k2992j3928m8867M2056M4900O211Q6924M63K2839p3618J1534
18838F54762M7558O6956O8753J8570J23406K8896q5216r9518j6432M3637l8746
18827H12626o4852O7257p3667q6389l2N201o2440k8398O6164M7135P6352K2437
18815G81394j5598n9004o6674L1960l5982k5888K75m4147P2148J0716J8109R9278
18803G66587J04199J21974K0758P2081J10495l8447o5783j08450m7821j1066M4725
$$ plain form
18792 969252 1118198 1217205 1234250 1141424 1069285 1199633 1237249 1288701 1296155 1362738 1295674
18781 1295674 1182692 1107562 1066478 1040121 1219618 1356915 1348496 1425210 1512466 1593895 1728511
18770 1728511 1907390 2078912 2359736 2734415 3129324 3613083 3984567 4240605 4486467
18761 4486467 4710185 4875154 4962175 5067605 5201382 5454674 5819159 6261729 6710110 7242316
18751 7242316 7845869 8526704 9453501 10740365 12468678 14582652 17538521 21783473 28364325
18742 28364325 39723999 59119240 86032851 112387900 135508791 161519583 189322207
18735 189322207 209172898 220278757 223721317 219750882 206967618 185163490 161307531
18728 161307531 140042488 116462749 89044651 67639206 54739403 46798655 41391515
$$ packed form
18792I69252J48946R9007J7045r2826p2139J30348L7616N1452P454O6583o7064
18781A295674j12982p5130m1084k6357J79497J37297q419P6714Q7256Q1429J34616
18770A728511J78879J71522K80824L74679L94909M83759L71484K56038K45862
18761D486467K23718J64969Q7021J05430J33777K53292L64485M42570M48381N32206
18751G242316O03553O80835R26797J286864J728313K113974K955869M244952O580852
18742B8364325J1359674J9395241K6913611K6355049K3120891K6010792K7802624
18735A89322207J9850691J1105859L442560l970435j2783264k1804128k3855959
18728A61307531k1265043k3579739k7418098k1405445j2899803p940748n407140
$$ plain form
18721 41391515 37525212 34732936 32618793 30866010 29362639 28379607 27483925 26748165
18713 26748165 26171470 25731697 25359453 24716829 24215759 23807634 23289235 22854834 22417875
18704 22417875 22025221 21672837 21463803 21198977 20958525 20955929 21077777 21266258 21782755 22532896
18694 22532896 23431789 24770254 26736661 29520672 33701769 40280534 51807661 72344689
18686 72344689 101162530 129534019 154109785 182039513 212362702 234180116 246194185
18679 246194185 250002843 245812941 232112838 208356711 182252426 159153824 133411169
18672 133411169 103300742 79635541 65201071 56344776 50251230 45719707 42436389
18665 42436389 39909218 37661199 35964633 34610090 33232582 32044349 31096431 30198135
$$ packed form
18721D1391515l866303k792276k114143j752783j503371r83032q95682p35760
18713B6748165n76695m39773l72244o42624n01070m08125n18399m34401m36959
18704B2417875l92654l52384k09034k64826k40452k596J21848J88481N16497P50141
18694B2532896Q98893J338465J966407K784011M181097O578765J1527127K0537028
18686G2344689K8817841K8371489K4575766K7929728L0323189K1817414J2014069
18679B46194185L808658m189902j3700103k3756127k6104285k3098602k5742655
18672A33411169l0110427k3665201j4434470q856295o093546m531523l283318
18665D2436389k527171k248019j696566j354543j377508j188233r47918q98296
$$ plain form
18657 30198135 29277649 28363295 27568325 26789655 26028634 25162823 24048547 23122045 22369585
18648 22369585 21602745 20749797 19851410 19167650 18616671 18186937 17746679 17262529 16798711
18639 16798711 16421421 16040194 15629740 15365851 14947331 14588288 14254304 13844623 13459094
18630 13459094 13063562 12684838 12379982 12070115 11847789 11660492 11431699 11131279 10859740
18621 10859740 10653365 10386641 10081039 9901278 9783105 9546424 9298821 9132718 8938351
18612 8938351 8738161 8560412 8392774 8133294 8112928 8060869 7984137 7836682 7785455 7676943
18602 7676943 7544465 7423987 7126551 6943790 6815953 6747640 6572378 6431852 6257495 6184816
18592 6184816 6092466 5914896 5778459 5587830 5483457 5408315 5319408 5318679 5333123 5371380 5234230
$$ packed form
18657C0198135r20486r14354p94970p78670p61021q65811j114276r26502p52460
18648B2369585p66840q52948q98387o83760n50979m29734m40258m84150m63818
18639A6798711l77290l81227m10454k63889m18520l59043l33984m09681l85529
18630A3459094l95532l78724l04856l09867k22326j87297k28793l00420k71539
18621A0859740k06375k66724l05602j79761j18173k36681k47603j66103j94367
18612H938351k00190j77749j67638k59480k0366n2059p6732j47455n1227j08512
18602G676943j32478j20478k97436j82761j27837o8313j75262j40526j74357p2679
18592F184816r2350j77570j36437j90629j04373p5142q8907p29J4444L8257j37150
$$ plain form
18581 5234230 5153201 5122372 4963210 4829476 4704724 4637417 4545002 4489701 4520855 4605858 4628736
18570 4628736 4463013 4332788 4203736 4088073 3919506 3665743 3446824 3353494 3315392 3275662
18560 3275662 3187580 3135364 3233182 3305600 3285493 3287640 3285829 3251226 3279242 3263698 3210139 3209320
18548 3209320 3293725 3226352 3201033 3230499 3215325 3269707 3262750 3109095 2969556 2808441 2696367
18537 2696367 2692797 2688365 2589307 2603849 2495338 2442430 2303711 2080816 1938398 1988722 1879911
18526 1879911 1884646 2030366 2194591 2222552 2129911 2040985 2075772 1999348 1991659 1949490 1930530
18515 1930530 1853478 1839854 1922839 1901201 1672187 1650414 1653965 1612203 1741225 1740431 1738267 1660257
18503 1660257 1737471 1826397 1775471 1664270 1617061 1632101 1540822 1520909 1521723 1632285 1626351
$$ packed form
18581E234230q1029l0829j59162j33734j24752o7307r2415n5301L1154Q5003K2878
18570D628736j65723j30225j29052j15663j68567k53763k18919r3330l8102l9730
18560C275662q8082n2216R7818P2418k0107K147j811l4603K8016j5544n3559q19
18548C209320Q4405o7373k5319K9466j5174N4382o957j53655j39539j61115j12074
18537B696367l570m432r9058J4542j08511n2908j38719k22895j42418N0324j08811
18526A879911M735J45720J64225K7961r2641q8926L4787p6424p689m2169j8960
18515A930530p7052j3624Q2985k1638k29014k1773L551m1762J29022p94k164p8010
18503A660257P7214Q8926n0926j11201m7209J5040r1279j9913Q14J10562n934
$$ plain form
18492 1626351 1518849 1568757 1708012 1872034 2096041 2261608 2409491 2408634 2358471 2325244
18482 2325244 2246671 2146549 2024185 1808598 1596164 1635295 1550804 1431303 1369631 1394251
18472 1394251 1407208 1279990 1217928 1236135 1356416 1379304 1358949 1282797 1324980 1359501 1314907
18461 1314907 1294138 1227806 1202705 1317733 1393403 1467105 1492893 1675086 2011011 2195391
18451 2195391 2174143 2293359 2420708 2482055 2405480 2325071 2300444 2170702 1831203 1566413
18441 1566413 1336943 1251819 1244123 1335132 1247093 1162137 1112798 1156230 1138881 1130216 1138809 1152099
18429 1152099 1065043 959383 1073364 1144027 1028591 934890 881774 1030248 1042322 945760
18419 945760 902354 1052557 1146702 1166702 1189383 1165370 1168203 1162294 1179633 1275810 1262805 1245432
$$ packed form
18492A626351j07502M9908J39255J64022K24007J65567J47883q57n0163l3227
18482B325244p8573j00122j22364k15587k12434L9131q4491j19501o1672K4620
18472A394251J2957j27218o2062J8207J20281K2888k0355p6152M2183L4521m4594
18461A314907k0769o6332k5101J15028P5670P3702K5788J82193L35925J84380
18451B195391k1248J19216J27349O1347p6575q0409k4627j29742l39499k64790
18441A566413k29470q5124p696R1009q8039q4956m9339M3432j7349q665Q593J3290
18429A152099q7056j05660J13981P0663j15436r3701n3116J48474J2074r6562
18419I45760m3406J50203R4145K0000K2681k4013K833n909J7339R6177j3005j7373
$$ plain form
18407 1245432 1277754 1406974 1508970 1520386 1455736 1433887 1443609 1421855 1431663 1346052 1360997
18396 1360997 1380676 1244734 1194192 1272597 1264319 1197528 1219228 1325851 1326033 1288849 1279467 1333980
18384 1333980 1405916 1358801 1326517 1341675 1366126 1394947 1452761 1461834 1360447 1385169 1528004
18373 1528004 1691100 1710409 1905054 2075636 2245581 2366107 2536702 2632953 2800171 2926505
18363 2926505 2949674 3064852 3165771 3179644 3093954 3038025 2954674 2855432 3098150 3498385
18353 3498385 4057661 4425201 4848258 5277940 5507222 5635397 5456014 5228817 4924503
18344 4924503 4725020 4715504 5008739 5459952 5934609 6556293 7272339 8037780 8735803 9597659
18334 9597659 10474151 11602702 13247438 15472069 18219414 22035408 27526671 35800751
$$ packed form
18407A245432L2322J29220J01996J1416o4650k1849R722k1754R808q5611J4945
18396A360997J9679j35942n0542P8405q278o6791K1700J06623J82l7184r382N4513
18384A333980P1936m7115l2284J5158K4451K8821N7814R073j01387K4722J42835
18373A528004J63096J9309J94645J70582J69945J20526J70595R6251J67218J26334
18363B926505K3169J15178J00919J3873q5690n5929q3351r9242K42718M00235
18353C498385N59276L67540M23057M29682K29282J28175j79383k27197l04314
18344D924503j99483r516K93235M51213M74657O21684P16046P65441O98023Q61856
18334I597659Q76492J128551J644736K224631K747345L815994N491263Q274080
$$ plain form
18326 35800751 49934546 75082581 114924345 162213698 204302099 239901401 268298711
18319 268298711 273489676 252641127 221905018 185257226 141207675 101743113 76423067
18312 76423067 61855792 52689786 46531344 42403110 39557850 37745762 36577138 35945403
18304 35945403 35686590 35464829 35012410 34620341 34370669 34613510 35171489 36392866 38390267
18295 38390267 41600559 46757916 54915026 68470922 92955389 134732671 189950985
18288 189950985 243006391 287133190 324950005 341742460 324798062 289310566 247551090
18281 247551090 196144634 144461088 107662926 85872113 72613877 63690568 57267529
18274 57267529 52795454 49495427 46768338 44645759 42841260 41329925 39747056 38101564
$$ packed form
18326C5800751J4133795K5148035L9841764M7289353M2088401L5599302K8397310
18319B68298711N190965k0848549l0736109l6647792m4049551l9464562k5320046
18312G6423067j4567275r166006o158442m128234k845260j812088j168624o31735
18304C5945403k58813k21761m52419l92069k49672K42841N57979J221377J997401
18295C8390267L210292N157357Q157110J3555896K4484467M1777282N5218314
18288A89950985N3055406M4126799L7816815J6792455j6944398l5487496m1759476
18281B47551090n1406456n1683546l6798162k1790813j3258236q923309o423039
18274E7267529m472075l300027k727089k122579j804499j511335j582869j645492
$$ plain form
18266 38101564 36437510 34749027 33211322 31745141 30483419 29338542 28358419 27625122
18258 27625122 27071968 26562430 26150873 25742247 25226040 24550289 23611272 22747996 22025950
18249 22025950 21250845 20507721 19865616 19437013 18960915 18513868 18039556 17558229 16970013
18240 16970013 16522967 16076185 15630115 15263497 14817871 14454936 14090896 13874421 13544333
18231 13544333 13252942 13048242 12870710 12639787 12374207 12244718 12071208 11819957 11708595
18222 11708595 11705444 11645245 11593437 11527331 11252789 11036062 10829580 10637774 10400446 10093701
18212 10093701 9784675 9382416 8940396 8631176 8498708 8362377 8167791 8093267 7968721
18203 7968721 7820927 7534646 7294884 7221757 7101033 6921395 6761917 6676143 6604438 6614368
$$ packed form
18266C8101564j664054j688483j537705j466181j261722j144877r80123p33297
18258B7625122n53154n09538m11557m08626n16207o75751r39017q63276p22046
18249B2025950p75105p43124o42105m28603m76098m47047m74312m81327n88216
18240A6970013m47046m46782m46070l66618m45626l62935l64040k16475l30088
18231A3544333k91391k04700j77532k30923k65580j29489j73510k51251j11362
18222A1708595l151o0199n1808o6106k74542k16727k06482j91806k37328l06745
18212A0093701l09026m02259m42020l09220j32468j36331j94586p4524j24546
18203G968721j47794k86281k39762p3127j20724j79638j59478q5774p1705R930
$$ plain form
18193 6614368 6650977 6562030 6424249 6225671 6164623 6040666 6028953 5840299 5632849 5551889
18183 5551889 5519192 5535650 5498246 5344246 5331018 5332109 5263571 5206444 5066916 5011039 4857370
18172 4857370 4845741 4852272 4839582 4832812 4967891 5154528 5206327 5254213 5245764 5150375 5126379
18161 5126379 4958174 4821876 4784908 4602220 4485455 4465877 4369156 4251906 4003370 3847092
18151 3847092 3768052 3652385 3495941 3513087 3426679 3280054 3183476 3106719 3078328 3212438
18141 3212438 3213282 3144080 3152461 3163152 3163595 3207914 3160851 3154681 3194378 3205304 3339348 3386788
18129 3386788 3480819 3528131 3509901 3437900 3518505 3742174 3776415 3867677 4052392 4304179 4766754
18118 4766754 5246837 5683686 6176897 6787682 7610824 8838396 10763157 13874871 19236419
$$ packed form
18193F614368L6609q8947j37781j98578o1048j23957j1713j88654k07450q0960
18183E551889l2697J6458l7404j54000j3228J091o8538n7127j39528n5877j53669
18172D857370j1629O531j2690o770J35079J86637N1799M7886q449r5389k3996
18161E126379j68205j36298l6968j82688j16765j9578r6721j17250k48536j56278
18151C847092p9040j15667j56444J7146q6408j46625r6578p6757k8391J34110
18141C212438Q44o9202Q381J0691M43M4319m7063o170L9697J0926J34044M7440
18129C386788R4031M7312j8230p2001Q0605K23669L4241R1262J84715K51787M62575
18118D766754M80083M36849M93211O10785Q23142J227572J924761L111714N361548
$$ plain form
18109 19236419 29339291 49155064 80783342 109969351 122280293 121373515 108781744
18102 108781744 79418020 50834043 34914188 26863234 22255266 19135696 16863388
18095 16863388 15237487 14001528 13013634 12036134 11108464 10541069 10128414 9740171 9288484
18086 9288484 8835134 8484794 8161850 7873538 7652736 7567557 7531511 7317976 7104986 6990059
18076 6990059 6885814 6783050 6673708 6677937 6649671 6412919 6158980 5922780 5784084 5688890
18066 5688890 5461013 5294568 5168374 5078262 4937796 4738256 4477436 4353126 4295345 4220243
18056 4220243 4093286 3999818 3954238 4066812 4086697 3954130 3956555 3900311 3830523 3691218 3685632
18045 3685632 3535324 3509600 3479469 3383155 3317429 3343899 3434489 3391399 3383514 3430900 3455479
$$ packed form
18109A9236419J0102872J9815773L1628278K9186009J2310942r06778j2591771
18102A08781744k9363724k8583977j5919855q050954m607968l119570k272308
18095A6863388j625901j235959r87894r77500r27670n67395m12655l88243m51687
18086I288484m53350l50340l22944k88312k20802q5179l6046k13535k12990j14927
18076F990059j04245j02764j09342M229k8266k36752k53939k36200j38696r5194
18066E688890k27877j66445j26194r0112j40466j99540k60820j24310n7781p5102
18056D220243j26957r3468m5580J12574J9885j32567K425n6244o9788j39305n586
18045C685632j50308k5724l0131r6314o5726K6470R0590m3090p885M7386K4579
$$ plain form
18034 3455479 3468567 3417303 3317430 3194632 3106120 3058961 3116053 3206407 3067910 2970675 2942699
18023 2942699 2815265 2698724 2800578 2797782 2729782 2809733 2776497 2714036 2513597 2491502 2514278
18012 2514278 2607035 2739466 2783288 2745969 2882820 2962894 2875562 2777700 2800925 2754114 2746342
18001 2746342 2747830 2849041 2855983 2792144 2705325 2620085 2663672 2770464 2978346 3192967 3324332
17990 3324332 3350131 3387022 3418976 3499069 3645166 3768403 4044183 4411402 4861167 5483800
17980 5483800 5921051 6457596 7015742 7366699 7753437 8215173 8713580 9306165 9712582
17971 9712582 10133110 10723179 11507795 12333267 13340237 14782158 16462590 18694985 21977373
17962 21977373 26726717 33969321 46136096 67744735 102533532 146413334 189865418
$$ packed form
18034C455479J3088n1264r9873j22798q8512m7159N7092R0354j38497r7235k7976
18023B942699j27434j16541J01854k796o8000P9951l3236o2461k00439k2095K2776
18012B514278R2757J32431M3822l7319J36851Q0074q7332r7862K3225m6811p772
18001B746342J488J01211O942o3839q6819q5240M3587J06792K07882K14621J31365
17990C324332K5799L6891L1954Q0093J46097J23237K75780L67219M49765O22633
17980E483800M37251N36545N58146L50957L86738M61736M98407N92585M06417
17971I712582M20528N90069P84616Q25472J006970J441921J680432K232395L282388
17962B1977373M749344P242604J2166775K1608639L4788797M3879802M3452084
$$ plain form
17955 189865418 224132748 244947630 255320492 260877193 260925399 255329426 240635376 211677183
17947 211677183 172605882 131846838 98466980 77435541 65204506 57435518 52095182
17940 52095182 48320386 45675351 43601317 42191301 41271375 40611743 39975974 39780790 40029916
17931 40029916 40496285 41338354 42897308 45377312 49451025 56666840 70209187 94150131
17923 94150131 127848402 164138018 195197067 215501394 225822483 231205301 232436803
17916 232436803 229026720 219537499 198892644 167823410 132768463 100834001 78998099
17909 78998099 66197859 58380507 52798080 48586561 45454615 43176389 41422186 39995830
17901 39995830 38822160 37862320 36959424 36356568 35871778 35574166 35311664 34879954 34292961
$$ packed form
17955A89865418L4267330K0814882J0372862N556701M8206n595973j4694050k8958193
17947B11677183l9071301m0759044l3379858k1031439j2231035p768988n340336
17940E2095182l774796k645035k074034j410016r19926o59632o35769j95184K49126
17931D0029916M66369Q42069J558954K480004M073713P215815J3542347K3940944
17923I4150131L3698271L6289616L1059049K0304327J0321089N382818J231502
17916B32436803l410083r489221k0644855l1069234l5054947l1934462k1835902
17909G8998099j2800240p817352n582427m211519l131946k278226j754203j426356
17901C9995830j173670r59840r02896o02856m84790k97612k62502m31710n86993
$$ plain form
17892 34292961 33607876 32987142 32455048 31936343 31852218 31713149 31862123 32550986 33669085
17883 33669085 35222029 37195922 39544748 42175921 45368458 49719507 56681795 68850872
17875 68850872 90277764 123306027 164610596 207517963 246551711 276716490 292739375
17868 292739375 292291646 276545381 248874056 214795112 180060437 151778834 136945094
17861 136945094 139267541 159062148 192814453 232771406 271610654 303722531 322785551
17854 322785551 325033533 310519016 281620006 242981341 200445116 159776057 127070113
17847 127070113 105085560 91232944 81810523 75025925 69580892 65206353 61668445 58658974
17839 58658974 56004825 53675886 51703300 50049513 48454963 46910853 45514122 44409926
$$ packed form
17892C4292961o85085o20734n32094n18705q4125j39069J48974O88863J118099
17883C3669085J552944J973893K348826K631173L192537M351049O962288J2169077
17875F8850872K1426892L3028263M1304569M2907367L9033748L0164779J6022885
17868B92739375m47729j5746265k7671325l4078944l4734675k8281603j4833740
17861A36945094K322447J9794607L3752305L9956953L8839248L2111877J9063020
17854C22785551K247982j4514517k8899010l8638665m2536225m0669059l2705944
17847A27070113k1984553j3852616r422421o784598n445033m374539l537908l009471
17839E8658974k654149k328939j972586j653787j594550j544110j396731j104196
$$ plain form
17831 44409926 43106059 41648748 40324051 38912880 37524993 36186100 34880140 33776203
17823 33776203 32788783 31784407 30844949 30043729 29327875 28579896 27977763 27458322 26864883
17814 26864883 26092233 25408515 24770508 24012562 23466547 22947293 22325027 21675254 21117429
17805 21117429 20670684 20113259 19618468 19207114 18817628 18386863 17998316 17569826 17104898
17796 17104898 16807232 16361388 16058300 15712524 15402023 15297011 15069152 14741800 14389175
17787 14389175 14146809 13883197 13480527 13141507 12844963 12636160 12417389 12105546 11797440
17778 11797440 11479369 11302942 11241271 11081412 10775575 10541285 10399224 10148081 9873731
17769 9873731 9669743 9479022 9335969 9122522 8971975 8844460 8735688 8604507 8413508
$$ packed form
17831D4409926j303867j457311j324697j411171j387887j338893j305960j103937
17823C3776203r87420j004376r39458q01220p15854p47979o02133n19441n93439
17814B6864883p72650o83718o38007p57946n46015n19254o22266o49773n57825
17805B1117429m46745n57425m94791m11354l89486m30765l88547m28490m64928
17796A7104898k97666m45844l03088l45776l10501j05012k27859l27352l52625
17787A4389175k42366k63612m02670l39020k96544k08803k18771l11843l08106
17778A1797440l18071j76427o1671j59859l05837k34290j42061k51143k74350
17769I873731k03988j90721j43053k13447j50547j27515j08772j31181j90999
$$ plain form
17760 8413508 8245024 8232512 8205363 7949360 7626508 7418139 7250718 7145759 6987922 6878232
17750 6878232 6750805 6646888 6606771 6580329 6431608 6362316 6421433 6361717 6279103 6125577
17740 6125577 6153540 6143385 6102586 6210562 6393610 6634394 6852170 6977515 6951748 6817065
17730 6817065 6754074 6615395 6347271 5954945 5705901 5433997 5369258 5341314 5069072 4885653
17720 4885653 4762905 4555197 4349466 4238197 4167650 4214542 4353459 4228402 4220415 4173890
17710 4173890 4063042 4062839 4072447 3932506 3797000 3701307 3706482 3775716 3862715 3957308 4115998
17699 4115998 4210766 4344862 4273913 4229209 4209893 3990416 3694773 3418896 3216864 3166938
17689 3166938 3080846 2869741 2659738 2596406 2501807 2536946 2543033 2459229 2443207 2578244 2399510
$$ packed form
17760H413508j68484j2512k7149k56003l22852k08369j67421j04959j57837j09690
17750F878232j27427j03917m0117k6442j48721o9292N9117n9716q2614j53526
17740F125577K7963j0155m0799J07976J83048K40784K17776J25345k5767j34683
17730F817065o2991j38679k68124l92326k49044k71904o4739k7944k72242j83419
17720D885653j22748k07708k05731j11269p0547M6892J38917j25057p987m6525
17710D173890j10848k03R608j39941j35506r5693N175O9234Q6999R4593J58690
17699D115998R4768J34096p0949m4704j9316k19477k95643k75877k02032m9926
17689C166938q6092k11105k10003o3332r4599L5139O087q3804j6022J35037j78734
$$ plain form
17678 2399510 2276329 2337227 2366704 2332883 2251074 2138266 2007389 1906016 1852951 1954081
17668 1954081 2037697 2024631 2116258 2157645 2221840 2283046 2275116 2208526 2120635 2185339 2319702
17657 2319702 2307695 2218806 2264677 2123918 2029489 1999999 1924928 1906857 1815225 1859638 1898770
17646 1898770 1775457 1749483 1695005 1624505 1456204 1460682 1647178 1646737 1394443 1388062 1505482
17635 1505482 1478905 1528026 1603478 1487395 1238889 1175194 1279038 1378260 1512598 1377962
17625 1377962 1377452 1272909 1233677 1195098 1157209 1106999 1048918 1108043 1238709 1245718 1261086
17614 1261086 1282647 1274913 1253489 1215182 1199919 1045479 946309 942679 949088 973176 1031327 1141056
17602 1141056 1141389 1246316 1198118 1057972 975955 1140838 1171138 1130636 1040844 928857 812218
$$ packed form
17678B399510j23181O0898K9477l3821q1809j12808j30877j01373n3065J01130
17668A954081Q3616j3066R1627M1387O4195O1206p930o6590q7891O4704J34363
17657B319702j2007q8889M5871j40759r4429k9490p5071j8071r1632M4413L9132
17646A898770j23313k5974n4478p0500j68301M478J86496m41k52294o381J17420
17635A505482k6577M9121P5452j16083k48506o3695J03844R9222J34338j34636
17625A377962n10j04543l9232l8579l7889n0210n8081N9125J30666P009J5368
17614A261086K1561p734k1424l8307j5263j54440r9170l630O409K4088N8151J09729
17602A141056L33J04927m8198j40146q2017J64883L0300m0502q9792j11987j16639
$$ plain form
17591 812218 765859 857828 900886 897738 849924 853457 902184 921353 760625 860922 882944
17580 882944 769886 754106 847162 824587 738213 756540 761022 694777 630067 649208 594467
17569 594467 544803 641310 707909 625580 703382 697656 571923 526904 504897 512935 571991 609870
17557 609870 591876 618583 608199 608064 672102 785465 754354 693108 642565 630141 734848
17546 734848 670479 592911 541625 549996 551230 533681 542111 505864 587296 614873 646594 680007
17534 680007 696686 501477 474242 557261 591454 542959 587820 631760 660301 559243 525272
17523 525272 557264 441034 425755 436158 422666 377974 429815 543900 642116 703545 621536
17512 621536 582672 559047 503486 559550 616823 532476 499912 552050 734691 682957 794051
$$ packed form
17591H12218m6359R1969M3058l148m7814L533M8727J9169j60728J00297K2022
17580H82944j13058j5780R3056k2575q6374J8327M482o6245o4710J9141n4741
17569E94467m9664R6507O6599q2329P7802n726j25733m5019k2007Q038N9056L7879
17557F09870j7994K6707j0384j35O4038J13363l1111o1246n0543j2424J04707
17546G34848o4369p7568n1286Q371J234j7549Q430l6247Q1432K7577L1721L3413
17534F80007J6679j95209k7235Q3019L4193m8495M4861M3940K8541j01058l3971
17523E25272L1992j16230j5279J0403j3492m4692N1841J14085R8216O1429q2009
17512F21536l8864k3625n5561N6064N7273q4347l2564N2138J82641n1734J11094
$$ plain form
17501 794051 694650 537995 507390 534514 470639 523477 438778 350689 369189 390565 377469
17490 377469 473857 617107 724952 737977 625691 653579 681929 766972 651403 520031
17480 520031 400956 413889 490888 569194 548473 554582 637038 540639 488691 506865 533921
17469 533921 588788 672600 696298 767624 739122 772757 806966 842632 970347 1145871 1173227
17458 1173227 1031757 948181 939175 912141 816672 817761 882296 859511 767362 866548 933212
17447 933212 1031716 1043080 1078479 1108358 1091752 1134445 1311613 1464454 1570619 1616957 1556985
17436 1556985 1438884 1337255 1270085 1210110 1192285 1407611 1554498 1569134 1691131 1880220
17426 1880220 1996520 2183346 2534982 2844304 3289450 3606006 3873056 4195445 4338659
$$ packed form
17501G94051r9401j56655l0605K7124o3875N2838q4699q8089J8500K1376j3096
17490C77469R6388J43250J07845J3025j12286K7888K8350Q5043j15569j31372
17480E20031j19075J2933P6999P8306k0721O109Q2456r6399n1948J8174K7056
17469E33921N4867Q3812K3698P1326k8502L3635L4209L5666J27715J75524K7356
17458A173227j41470q3576r006k7034r5469J089O4535k2785r2149R9186O6664
17447I33212R8504J1364L5399K9879j6606M2693J77168J52841J06165M6338n9972
17436A556985j18101j01629o7170n9975j7825K15326J46887J4636J21997J89089
17426A880220J16300J86826L51636L09322M45146L16556K67050L22389J43214
$$ plain form
17417 4338659 4391373 4281113 4296436 4284034 4267708 4595363 5091527 5564744 6116390 6720582
17407 6720582 7163160 7486249 7957086 8384156 8958923 10010375 11272429 13039244 15722590
17398 15722590 19907175 26475032 37541630 56669487 84082490 111802261 134446426
17391 134446426 154461645 167127546 162550207 147683420 130751514 109019004 85235886
17384 85235886 69159581 62525004 63529815 72791436 91647821 115446634 136128356
17377 136128356 153218846 167062906 168012356 154440242 136885715 116529514 91677545
17370 91677545 70210695 56856389 49040489 44163285 40748941 38155053 35769354 33652593
17362 33652593 31805793 30100985 28605903 27559397 26777248 26191727 25892910 25808810 25605540
$$ packed form
17417D338659N2714j10260J5323j2402j6326L27655M96164M73217N51646O04192
17407F720582M42578L23089M70837M27070N74767J051452J262054J766815K683346
17398A5722590M184585O567857J1066598J9127857K7413003K7719771K2644165
17391A34446426K0015219J2665901m577339j4866787j6931906k1732510k3783118
17384H5235886j6076305o634577J004811R261621J8856385K3798813K0681722
17377A36128356J7090490J3844060R49450j3572114j7554527k0356201k4851969
17370I1677545k1466850j3354306p815900m877204l414344k593888k385699k116761
17362C3652593j846800j704808j495082j046506p82149n85521k98817q4100k03270
$$ plain form
17353 25605540 25329556 24983931 24674980 24507822 24632732 25046874 25723885 26909669 28943856
17344 28943856 32289439 37822011 47527723 64320197 88908147 113882919 134387693
17337 134387693 152717717 164472560 160074407 145968143 129859965 109408188 87151039
17330 87151039 71910270 65202033 65775973 74100629 91319975 113262810 132246251 148416809
17322 148416809 161797131 163045564 150434881 133765342 114554645 91056986 70047832
17315 70047832 56501518 48239281 42774402 38833813 35790939 33523477 31767327 30174687
17307 30174687 29072665 28056002 27050957 26043973 25190507 24379314 23547527 22670898 21639926
17298 21639926 20833219 20198019 19701924 19267199 18915460 18489393 18125868 17746245 17148890
$$ packed form
17353B5605540k75984l45625l08951j67158J24910M14142O77011J185784K034187
17344B8943856L345583N532572R705712J6792474K4587950K4974772K0504774
17337A34387693J8330024J1754843m398153j4106264j6108178k0451777k2257149
17330H7151039j5240769o708237N73940Q324656J7219346K1942835J8983441J6170558
17322A48416809J3380322J248433j2610683j6669539j9210697k3497659k1009154
17315G0047832j3546314q262237n464879l940589l042874k267462j756150j592640
17307C0174687j102022j016663j005045j006984q53466q11193q31787q76629j030972
17298B1639926q06707o35200m96095m34725l51739m26067l63525l79623n97355
$$ plain form
17289 17148890 16580244 16111924 15617234 15172441 14769098 14390270 14003756 13530136 13199063
17280 13199063 13047320 12844666 12483729 12192441 11874382 11446402 11086657 10845477 10660493
17271 10660493 10381279 10267129 10057449 9779684 9525647 9106053 8724002 8513197 8311248
17262 8311248 8331331 8387407 8296584 8055107 7883065 7615793 7347494 7235152 7053461 6920485
17252 6920485 6875365 6779284 6661865 6599685 6382048 6269525 6295401 6236798 6024979 5844977
17242 5844977 5735410 5581570 5402297 5315215 5280017 5207722 5200745 5061562 5018242 4883604
17232 4883604 4783246 4624708 4546721 4509897 4492324 4429332 4258841 4076264 4055256 3869957
17222 3869957 3862648 3805439 3881454 3958679 3993358 3857179 3695326 3522191 3385549 3270079
$$ packed form
17289A7148890n68646m68320m94690m44793m03343l78828l86514m73620l31073
17280A3199063j51743k02654l60937k91288l18059m27980l59745k41180j84984
17271A0660493k79214j14150k09680k77765k54037m19594l82051k10805k01949
17262H311248K0083N6076r0823k41477j72042k67272k68299j12342j81691j32976
17252F920485m5120r6081j17419o2180k17637j12523K5876n8603k11819j80002
17242E844977j09567j53840j79273q7082l5198p2295o977j39183m3320j34638
17232D883604j00358j58538p7987l6824j7573o2992j70491j82577k1008j85299
17222C869957p309n7209P6015P7225L4679j36179j61853j73135j36642j15470
$$ plain form
17212 3270079 3240209 3304025 3239882 3137151 3098342 3130037 2977601 2939978 2842707 2828673 2831138
17201 2831138 2772301 2660490 2562371 2548591 2513276 2539641 2512794 2384929 2252183 2128896
17191 2128896 2160134 2292125 2402063 2371251 2267477 2181592 2049205 2049639 2057344 1990991 1967643
17180 1967643 1995567 1930074 1885066 1783816 1773445 1753664 1800430 1840441 1774838 1683663 1641582
17169 1641582 1623071 1555846 1450943 1410231 1331160 1330603 1443971 1494262 1515884 1393178 1314596
17158 1314596 1393331 1274069 1249078 1278883 1175587 1164521 1133921 1147197 1168681 1260959 1149213
17147 1149213 1182559 1185074 1155246 1182582 1198233 1154355 1008331 908543 846039 885450 931958
17136 931958 889521 913361 957493 964074 1009275 897096 820178 870764 862988 722128 741022
$$ packed form
17212C270079k9870O3816o4143j02731l8809L1695j52436l7623r7271j4034K465
17201B831138n8837j11811r8119j3780l5315K6365k6847j27865j32746j23287
17191B128896L1238J31991J09938l0812j03774q5885j32387M34P705o6353k3348
17180A967643K7924o5493m5008j01250j0371j9781M6766M0011o5603r1175m2081
17169A641582j8511o7225j04903m0712p9071n57J13368N0291K1622j22706p8582
17158A314596P8735j19262k4991K9805j03296j1066l0600J3276K1484R2278j11746
17147A149213L3346K515k9828K7336J5651m3878j46024r9788o2504L9411M6508
17136I31958m2437K3840M4132O581M5201j12179p6918N0586p776j40860J8894
$$ plain form
17125 741022 818600 779179 731868 691708 672107 649720 628367 642553 668925 626629 662694
17114 662694 690731 665353 658979 612531 603868 610986 561245 607664 503779 504986 573939 555074
17102 555074 349414 267278 341525 362658 398225 437807 516096 474548 288137 237383 419392
17091 419392 652076 545662 366414 369516 494657 503251 545014 557859 503868 445563 274005
17080 274005 303443 456724 475518 501216 541751 496355 472144 451323 416249 354602 419828
17069 419828 562308 615300 732626 710860 613669 540040 632184 623551 683553 710965 715183
17058 715183 649492 504944 512738 511135 542729 557731 424704 434797 491027 499584 482754 409493
17046 409493 375438 434510 528899 495385 397133 375204 331574 296275 234075 269487 233575
$$ packed form
17125G41022P7578l9421m7311m0160j9601k2387k1353J4186K6372m2296L6065
17114F62694K8037k5378o374m6448q663P118m9741M6419j03885J207O8953j8865
17102E55074k05660q2136P4247K1133L5567L9582P8289m1548j86411n0754J82009
17091D19392K32684j06414j79248L102J25141Q594M1763J2845n3991n8305j71558
17080B74005K9438J53281J8794K5698M0535m5396k4211k0821l5074o1647O5226
17069D19828J42480N2992J17326k1766r7191p3629R2144q633O0002K7412M218
17058G15183o5691j44548P794j603L1594J5002j33027J0093N6230Q557j6830p3261
17046D09493l4055N9072R4389l3514r8252k1929m3630l5299o2200L5412l5912
$$ plain form
17035 233575 215679 162345 85812 188068 301854 255655 217873 313133 289731 200939 122493
17024 122493 176124 357910 255057 105682 135395 94746 61417 27199 3492 3670 -29176
17013 -29176 2031 44900 -13181 17806 154865 154418 82994 -34642 -60523 -77027 -198893
17002 -198893 -119075 -33169 -6674 54242 138184 113163 1140 -41050 -8330 58896 171112
16991 171112 245796 268926 320258 273163 90802 125755 98732 89022 110642 44436 -80872
16980 -80872 33782 19533 -10909 39552 103556 134483 130647 57813 -54595 1855 66214
16969 66214 90496 120221 307980 347538 216985 62857 -43129 -1408 32288 71068 107152
16958 107152 94465 175039 150712 97302 96477 52064 -64451 -78074 -199137 -183819 -85339
$$ packed form
17035B33575j7896n3334p6533J02256J13786m6199l7782R5260k3402q8792p8446
17024A22493N3631J81786j02853j49375K9713m0649l3329l4218k3707J78l2846
17013b9176L1207M2869n8081L0987J37059m47p1424j17636k5881j6504j21866
17002a98893P9818Q5906K6495O0916Q3942k5021j12023m2190L2720O7226J12216
16991A71112P4684K3130N1332m7095j82361L4953k7023r710K1620o6206j25308
16980h0872J14654j4249l0442N0461O4004L0927l836p2834j12408N6450O4359
16969F6214K4282K9725J87759L9558j30553j54128j05986M1721L3696L8780L6084
16958A07152j2687Q0574k4327n3410q25m4413j16515j3623j21063J5318R8480
$$ plain form
16947 -85339 26320 132906 165664 26348 132038 248092 272679 209870 222627 75526
16937 75526 -54162 -40865 17686 14182 172783 173976 313952 357007 265461 204329 40621
16926 40621 -73004 -46465 -54870 60350 61220 63865 55507 72941 177934 189794 -21324 7848
16914 7848 98004 -994 -8521 85899 72017 15411 61162 116960 77519 -27549 -20792 35415
16902 35415 -18654 -49740 -66056 -56666 37087 194304 116428 149908 185683 355627 497721
16891 497721 756177 1028078 1146687 1062170 866600 958128 899443 604404 341533 391110
16881 391110 358307 398433 550132 676287 877700 948110 993021 931831 930797 852267 780696
16870 780696 725619 514832 415078 315909 242005 197321 53857 48702 111169 91667 28435
$$ packed form
16947h5339J11659J06586L2758j39316J05690J16054K4587o2809J2757j47101
16937G5526j29688J3297N8551l504J58601J193J39976M3055r1546o1132j63708
16926D0621j13625K6539q405J15220Q70K645q358J7434J04993J1860k11118K9172
16914G848R0156r8998p527R4420j3882n6606M5751N5798l9441j05068O757N6207
16902C5415n4069l1086j6316R390R3753J57217p7876L3480L5775J69944J42094
16891D97721K58456K71901J18609q4517j95570R1528n8685k95039k62871M9577
16881C91110l2803M0126J51699J26155K01413P0410M4911o1190j034p8530p1571
16870G80696n5077k10787r9754r9169p3904m4684j43464n155O2467j9502o3232
$$ plain form
16859 28435 142576 224324 103090 71452 205589 357648 339436 166058 -93082 -178628
16849 -178628 -147691 -74543 7568 -38011 -97200 -88919 46428 119515 135919 223180 473721
16838 473721 569527 582537 684398 746288 859129 904702 743295 636289 506615 345907
16828 345907 352467 281016 403152 574218 764531 901933 815550 901915 954772 894932 868469
16817 868469 802904 657494 419977 361339 398012 283235 209352 181260 217563 321609 201576
16806 201576 192297 184321 158728 177052 135904 31086 59318 210413 164111 74238 59241
16795 59241 99158 163234 130162 51125 103926 119160 17473 35732 97494 50167 -11813
16784 -11813 -58611 -125218 -168921 -131802 -47529 -22518 -83383 -96326 20069 -71518 -133528
$$ packed form
16859B8435J14141Q1748j21234l1638J34137J52059j8212j73378k59140q5546
16849a78628L0937P3148Q2111m5579n9189Q281J35347P3087J6404Q7261K50541
16838D73721R5806J3010J01861O1890J12841M5573j61407j07006j29674j60708
16828C45907O560p1451J22136J71066J90313J37402q6383Q6365N2857n9840k6463
16817H68469o5565j45410k37517n8638L6673j14777p3883k8092L6303J04046j20033
16806B01576r279p976k5593J8324m1148j04818K8232J51095m6302q9873j4997
16795E9241L9917O4076l3072p9037N2801J5234j01687J8259O1762m7327o1980
16784a1813m6798o6607m3703L7119Q4273K5011o0865j2943J16395r1587o2010
$$ plain form
16773 -133528 -35498 -86024 -169340 -149608 -144762 -365 79649 -28192 8401 109068 47101
16762 47101 -78125 -68487 51042 153136 88865 -2841 24404 80811 198286 195765 95514
16751 95514 -28309 6154 -29386 755 24672 40901 82775 183124 131474 -1664 -92440
16740 -92440 -84674 -42727 -38631 87075 -6672 -100658 -94325 -111152 -98522 -84220 -9113 -59317
16728 -59317 -30927 51041 91266 161590 63273 11794 -7222 -176960 -182775 -146158 -254483
16717 -254483 -149518 -62535 74416 65910 1657 9081 -35855 -42698 -161281 -163583 -156949 -31100
16705 -31100 -55997 -135087 -120333 -148730 -200444 -232888 -271655 -143313 -180343 -135715 -47490
16694 -47490 -27105 -69735 -160163 -77232 -93109 -136054 -133242 -84564 -106149 -156534 -319670 -370873
$$ packed form
16773a33528R8030n0526q3316J9732M846J44397Q0014j07841L6593J00667o1967
16762D7101j25226R638J19529J02094o4271r1706K7245N6407J17475k521j00251
16751I5514j23823L4463l5540L0141K3917J6229M1874J00349n1650j33138r0776
16740i2440P766M1947M096J25706r3747r3986O333j6827J2630J4302P5107n0204
16728e9317K8390Q1968M0225P0324r8317n1479j9016j69738n815L6617j08325
16717b54483J04965Q6983J36951q506o4253P424m4936o843j18583k302O634J25849
16705c1100k4897p9090J4754k8397n1714l2444l8767J28342l7030M4628Q8225
16694d7490K0385m2630r0428Q2931j5877m2945K812M8678k1585n0385j63136n1203
$$ plain form
16682 -370873 -232700 -190877 -125982 -117558 -92748 -18293 114536 70907 -43417 -121310 -69694
16671 -69694 -46429 -89552 -29379 49181 141582 201649 157976 167512 17603 -137770 -120949
16660 -120949 9297 -79693 -93288 -188314 -122064 -62566 -101593 -143569 -234369 -232086 -172810
16649 -172810 -96053 -29265 41934 -120689 -122835 -211483 -211796 -210522 -237021 -127099 -213155 -334513
16637 -334513 -250924 -78430 -91287 -133738 -107613 -231714 -201284 -75942 13319 35543 -14352
16626 -14352 32517 16775 -32072 9079 149492 227699 63784 50342 9107 -38242 26638
16615 26638 24507 -46200 -168366 -38068 99926 91774 66581 59652 61400 -28445 -103249 -35671
16603 -35671 5684 25343 15724 -6225 -38833 -65110 -105521 -134325 -183268 -299660 -354004 -303940
$$ packed form
16682c70873J38173M1823O4895Q424K4810P4455J32829m3629j14324p7893N1616
16671f9694K3265m3123O0173P8560R2401O0067m3673R536j49909j55373J6821
16660a20949J30246q8990j3595r5026O6250N9498l9027m1976r0800K283N9276
16649a72810P6757O6788P1199j62623k146q8648l13J274k6499J09922q6056j21358
16637c34513Q3589J72494j2857m2451K6125j24101L0430J25342Q9261K2224m9895
16626a4352M6869j5742m8847M1151J40413P8207j63915j3442m1235m7349O4880
16615B6638k131p0707j22166J30298J37994q152k5193o929J748q9845p4804O7578
16603c5671M1355J9659r619k1949l2608k6277m0411k8804m8943j16392n4344N0064
$$ plain form
16591 -303940 -165485 -154649 -63737 -25581 1918 91937 66952 -109672 -155911 -158335 -102766
16580 -102766 -127638 -137553 -126531 -79225 7890 -75508 -93115 -49129 -54477 46213 131237 155632
16568 155632 82946 -12932 -43603 -98194 -200902 -235740 -109062 -50330 -56483 11953 37380
16557 37380 -44326 -119103 -44165 25118 54561 -2689 -137463 -126886 -53243 -107422 -168971
16546 -168971 -280793 -356604 -344031 -267180 -141624 -107817 -121772 -40693 -63069 -75587 -137776
16535 -137776 -19206 17532 24489 48548 58128 33887 -3139 -75268 -138577 -142164 -109972 -45386
16523 -45386 -70953 -40801 40796 72396 100155 115526 99327 -27557 32075 144061 70371
16512 70371 80508 54661 20346 9127 122253 111584 -15197 -79764 -126566 -198441 -109130
$$ packed form
16591c03940J38455J0836R0912L8156K7499R0019k4985j76624m6239k424N5569
16580a02766k4872r915J1022M7306Q7115q3398j7607M3986n348J00690Q5024K4395
16568A55632p2686r5878l0671n4591j02708l4838J26678N8732o153O8436K5427
16557C7380q1706p4777P4938O9283K9443n7250j34774J0577P3643n4179o1549
16546a68971j11822p5811J2573P6851J25556L3807j3955Q1079k2376j2518o2189
16535a37776J18570L6738O957K4059R580k4241l7026p2129o3309l587L2192O4586
16523d5386k5567L0152Q1597L1600K7759J5371j6199j26884N9632J11986p3690
16512G0371J0137k5847l4315j1219J13126j0669j26781o4567m6802p1875Q9311
$$ plain form
16501 -109130 -84830 -43201 -54998 97818 16906 -55099 60064 96460 83483 -17583 -122104
16490 -122104 -142541 -141189 -50441 31554 68363 3894 48661 92385 86869 93754 39294 -28659
16478 -28659 -72119 -123531 -79334 -62280 -147308 -159419 -98542 -53729 -127236 -117645 -201224 -306953
16466 -306953 -101697 -85099 -116503 -171397 -188147 -172340 -119662 -61135 -59266 -114703 -206580
16455 -206580 -220512 -101258 -35334 -54174 -94427 -151840 -135329 -133680 -245449 -294155 -199042
16444 -199042 -204313 -222594 -142343 -80109 49192 137089 161826 118404 15602 -57178 -123380
16433 -123380 -45995 34439 -32673 -23931 20653 -100186 -90567 59624 11699 -96242 -138930
16422 -138930 -116781 -205879 -280869 -354475 -200004 -102193 -91434 -150221 -121527 -145747 -191287
$$ packed form
16501a09130K4300M1629j1797J52816q0912p2005J15163L6396j2977j01066j04521
16490a22104k0437J352R0748Q1995L6809o4469M4767M3724n516O885n4460o7953
16478b8659m3460n1412M4197J7054q5028j2111O0877M4813p3507R591q3579j05729
16466c06953K05256J6598l1404n4894j6750J5807N2678N8527J869n5437r1877
16455b06580j3932J19254O5924j8840m0253n7413J6511J649j11769m8706R5113
16444a99042n271j8281Q0251O2234J29301Q7897K4737m3422j02802p2780o6202
16433a23380P7385Q0434o7112Q742M4584j20839R619J50191m7925j07941m2688
16422a38930K2149q9098p4990p3606J54471R7811J0759n8787K8694k4220m5540
$$ plain form
16411 -191287 -226634 -121094 -64985 -110114 -131057 -143080 -109439 -45092 -2557 -84046 -88365
16400 -88365 -53437 -35833 30297 79230 -50979 -220164 -274883 -266208 -268939 -215543 -194730 -334811
16388 -334811 -336181 -166018 -126025 -82769 -157237 -189770 -102999 -66116 9882 51461 47587 96700
16376 96700 197541 194135 112748 37485 -102593 -91332 -137736 -145039 -15973 36886 11701
16365 11701 30122 48960 6985 82329 15746 67 52371 134014 235455 196417 144653
16354 144653 91571 -4995 -20887 170616 217235 88121 65907 162721 225938 193408 58501
16343 58501 -31881 -16027 -13700 -120003 -126208 -117865 -66793 -42710 -155734 -188079 -187634 -158097
16331 -158097 -121335 -144736 -228948 -243578 -220910 -148752 -117825 -126389 -112194 -103340 49029 68581
$$ packed form
16411a91287l5347J05540N6109m5129k0943j2023L3641O4347M2535q1489m319
16400h8365L4928J7604O6130M8933j30209j69185n4719Q675k731N3396K0813j40081
16388c34811j370J70163L9993M3256p4468l2533Q6771L6883P5998M1579l874M9113
16376I6700J00841l406q1387p5263j40078J1261m6404p303J29066N2859k5185
16365A1701J8421J8838m1975P5344o6583j5679N2304Q1643J01441l9038n1764
16354A44653n3082r6566j5892J91503M6619j29114k2214R6814O3217l2530j34907
16343E8501r0382J5854K327j06303o205Q343N1072K4083j13024l2345M45K9537
16331a58097L6762k3401q4212j4630K2668P2158L0927q564J4195Q854J52369J9552
$$ plain form
16319 68581 29555 -734 -2913 -3047 9634 -4129 28503 125153 121641 84144 15877 -63615
16307 -63615 -68642 -138132 -115830 -171979 -220466 -112811 -217548 -233154 -138321 12795 59184
16296 59184 -13275 46000 85905 202073 243360 99273 35649 8699 12570 33982 -58019
16285 -58019 -88900 -123455 -91329 -55047 -29941 -22490 -22162 -86566 -251018 -268170 -253820 -203901
16273 -203901 -149354 -241285 -245763 -230611 -285954 -281135 -238866 -167438 -203268 -216702 -208047 -145248
16261 -145248 -160408 -135392 -191113 -198641 -253923 -191501 -38566 -48270 -87534 97291 104585 -35247
16249 -35247 -65482 -29036 -19537 -87964 -89863 -54920 -44763 -26007 -75610 -41184 -87094 -17464
16237 -17464 -91685 -29161 140001 171541 132174 143697 85669 -1011 -53300 -154975 -188205
$$ packed form
16319F8581l9026l0289k179j34J2681j3763L2632R6650l512l7497o8267p9492
16307f3615n027o9490K2302n6149m8487J07655j04737j5606R4833J51116M6389
16296E9184p2459N9275L9905J16168M1287j44087o3624k6950L871K1412r2001
16285e8019l0881l4555L2126L6282K5106P451L28o4404j64452j7152J4350M9919
16273b03901N4547r1931m478J5152n5343M819M2269P1428l5830j3434Q655O2799
16261a45248j5160K5016n5721p528n5282O2422J52935r704l9264J84825P294j39832
16249c5247l0235L6446R499o8427j899L4943J0157J8756m9603L4426m5910O9630
16237a7464p4221O2524J69162L1540l9367J1523n8028q6680n2289j01675l3230
$$ plain form
16226 -188205 -116420 -90200 -143082 -184977 -123553 -37780 -10578 -113741 -162550 -133359 -80905
16215 -80905 -10354 -142504 -132487 -90791 -29334 22665 25425 25532 115330 88905 35174 35665
16203 35665 -47835 -94084 -20525 -71700 -39536 -32455 -154813 -157090 -114276 -46078 -145837 -76650
16191 -76650 -153197 -114538 -25261 -92333 -104868 -50517 -135080 -181691 -192987 -215277 -160540 -19456
16179 -19456 37117 -26472 -94720 -75499 -13932 35493 147969 2595 11191 -5185 -140564
16168 -140564 -117410 -153952 -44924 33377 -91189 -128893 -147742 -119219 -51315 22480 -106147
16157 -106147 -191722 -170059 -73163 12493 -47923 -65365 -4478 14140 -33976 -107782 -114652 -50948
16145 -50948 120355 77748 9994 -39273 -170550 -218680 -256090 -349215 -344993 -229129 -248584
$$ packed form
16226a88205P1785K6220n2882m1895O1424Q5773K7202j03163m8809K9191N2454
16215h0905P0551j32150J0017M1696O1457N1999K760J07Q9798k6425n3731M91
16203C5665q3500m6249P3559n1175L2164P081j22358k277M2814O8198r9759O9187
16191g6650p6547L8659Q9277o7072j2535N4351q4563m6611j1296k2290N4737J41084
16179a9456N6573o3589o8248J9221O1567M9425J12476j45374Q596j6376j35379
16168a40564K3154l6542J09028P8301j24566l7704j8849K8523O7904P3795j28627
16157a06147q5575K1663R6896Q5656o0416j7442O0887J8618m8116p3806o870O3704
16145e0948J71303m2607o7754m9267j31277m8130l7410r3125M222J15864j9455
$$ plain form
16134 -248584 -238266 -92835 56667 134089 -47529 -91936 -94422 -127958 -179766 -161066 -59545
16123 -59545 -118251 -150848 -69430 -40959 -144225 -250256 -272595 -138528 55883 82091 -4278
16112 -4278 -125410 -44192 -37114 8663 73304 154129 206581 196920 106620 -148 -70212 -34927
16100 -34927 16349 -159846 -230009 -200948 -56519 44507 -6718 -147611 -98227 -5402 -49038
16089 -49038 -172622 -199964 -220585 -242011 -226978 -101774 68673 -6469 -41484 5945 45704
16078 45704 54475 -30696 -130344 -218786 -219709 -147779 -88490 -65002 -80040 -239942 -279498 -275005
16066 -275005 -116281 61834 100306 65596 -59034 -111856 -158593 -181819 -161308 -132002 -108124
16055 -108124 299 89786 45284 -55290 -175981 -176616 -127128 -87614 -136947 -84551 -33245
$$ packed form
16134b48584J0318J45431J49502P7422j81618m4407k486l3536n1808J8700J01521
16123e9545n8706l2597Q1418K8471j03266j06031k2339J34067J94411K6208q6369
16112d278j21132Q1218P078M5777O4641Q0825N2452r661r0300j06768p0064L5285
16100c4927N1276j76195p0163K9061J44429J01026n1225j40893M9384R2825m3636
16089d9038j23584k7342k0621k1426J5033J25204J70447p5142l5015M7429L9759
16078D5704Q771q5171r9648q8442r23P1930N9289K3488j5038j59902l9556M493
16066b75005J58724J78115L8472l4710j24630n2822m6737k3226K0511K9306K3878
16055a08124J08423Q9487m4502j00574j20691o35M9488L9514m9333N2396N1306
$$ plain form
16044 -33245 -68464 -245964 -194521 -85623 -91211 -89328 -130552 -311669 -160408 -34692 -196657
16033 -196657 -215013 -71143 -127389 -187911 -264009 -263446 -233672 -280130 -290024 -334249 -331919 -217951
16021 -217951 -129609 -14259 64339 1887 -24226 -30035 -67102 -42280 42141 -47915 -46794 -23022
16009 -23022 97342 910 -210884 -114005 -3006 82058 193557 129013 30166 -13153 -203932
15998 -203932 -298614 -177832 -115560 -46268 50387 148562 134654 155926 99026 -26191 -143515
15987 -143515 -244538 -168306 -38453 46631 104775 193545 145574 5491 98895 190143 102177
15976 102177 -26839 -108872 -54788 -48361 -71739 -77729 -136590 -107276 18056 7610 -49123
15965 -49123 -119152 -232439 -234377 -83356 -51196 -33890 -65331 88547 55331 62891 167740
$$ packed form
16044c3245l5219j77500N1443J08898n588J883m1224j81117J51261J25716j61965
16033a96657j8356J43870n6246o0522p6098N63K9774m6458r894m4225K330J13968
16021b17951Q8342J15350P8598o2452k6113n809l7067K4822Q4421r0056J121K3772
16009b3022J20364r6432k11794R6879J10999Q5064J11499o4544r8847m3319j90779
15998b03932r4682J20782O2272O9292R6655R8175j3908K1272n6900j25217j17324
15987a43515j01023P6232J29853Q5084N8144Q8770m7971j40083R3404R1248q7966
15976A02177j29016q2033N4084O427k3378n990n8861K9314J25332j0446n6733
15965d9123p0029j13287j938J51021L2160J7306l1441J53878l3216P560J04849
$$ plain form
15954 167740 108586 60318 -37050 -79899 -127359 -75241 -185607 -224572 -126173 -31323 673
15943 673 -7328 -6766 32239 94031 16858 10503 -43310 -10914 -28180 -4123 18011 -112280 -166664
15930 -166664 -202684 -288800 -381580 -363927 -223172 -55338 -24008 -43058 -24181 14412 -79769
15919 -79769 -246169 -186579 -54736 50417 -21750 -95286 -162094 -107585 -21682 -128174 -254383
15908 -254383 -254173 -191203 -25712 191185 167362 74339 -15590 -87995 -222714 -346637 -219614
15897 -219614 -7448 104253 -77258 -59599 -167680 -287166 -214543 -10507 49088 -48798
15887 -48798 -170367 -137641 -86253 -140009 -147350 -171268 -256823 -307604 -219390 -146774 -122388 -129287
15875 -129287 -145501 -160892 -108748 -50947 23023 50113 80595 15569 -25139 9903 -20074
$$ packed form
15954A67740n9154m8268r7368m2849m7460N2118j10366l8965R8399R4850L1996
15943F73q001N62L9005O1792p7173o355n3813L2396j7266K4057K2134j30291n4384
15930a66664l6020q6116r2780J7653J40755J67834L1330j9050J8877L8593r4181
15919g9769j66400N9590J31843J05153p2167p3536o6808N4509Q5903j06492j26209
15908b54383K10O2970J65491K16897k3823r3023q9929p2405j34719j23923J27023
15897b19614K12166J11701j81511J7659j08081j19486P2623K04036N9595r7886
15887d8798j21569L2726N1388n3756p341k3918q5555n0781Q8214P2616K4386o899
15875a29287j6214j5391N2144N7801P3970K7090L0482o5026m0708L5042k9977
$$ plain form
15864 -20074 94636 124017 17525 68085 124339 105622 44576 -32149 91844 113628 6130
15853 6130 -95568 -126227 -130566 -46431 15752 -13080 -121392 -221273 -142608 -163424 -142453 -149957
15841 -149957 -180944 -97582 -66678 -968 15919 84131 157351 135057 87062 -28426 8255
15830 8255 186088 77502 53618 89714 115798 208524 69011 -40965 -90928 -175128 -201674
15819 -201674 -169257 -172513 -115180 -60326 -78596 78350 152490 185783 139888 184578 249750
15808 249750 153487 6358 -27275 -32667 -148926 -205687 -97920 145164 279845 263643 145486
15797 145486 -103451 -174548 -167556 -169995 -156253 -178295 -168476 -162024 -95303 -5200 -55304 -177985
15785 -177985 -240518 -236760 -132427 -79056 51968 174369 151761 65482 -47420 -151018 -249796
$$ packed form
15864b0074J14710K9381j06492N0560N6254j8717o1046p6725J23993K1784j07498
15853F130j01698l0659m339Q4135O2183k8832j08312r9881P8665k0816K0971p504
15841a49957l0987Q3362L0904O5710J6887O8212P3220k2294m7995j15488L6681
15830H255J77833j08586k3884L6096K6084R2726j39513j09976m9963q4200k6546
15819b01674L2417l256N7333N4854j8270J56946P4140L3293m5895M4690O5172
15808B49750r6263j47129l3633n392j16259n6761J07767K43084J34681j6202j18157
15797A45486k48937p1097O992k439J3742k2042R819O452O6721R0103n0104j22681
15785a77985o2533L758J04333N3371J31024J22401k2608q6279j12902j03598r8778
$$ plain form
15774 -249796 -118431 -62760 -53837 -13491 -10363 97480 256539 217567 154233 122653 4123
15763 4123 -154815 -200653 -197282 -204298 -239693 -269843 -178775 -62607 -76805 -159298 -196810 -151660
15751 -151660 -104163 -7620 58838 -44362 -180170 -257948 -155245 -86519 -121559 -165588 -219253
15740 -219253 -204367 -195106 -160939 -113642 -49792 -39231 -137453 -128159 61962 127261 -9789
15729 -9789 -50398 -38774 122665 261032 271828 189124 75873 23207 21276 8110 -20628
15718 -20628 25190 85373 67622 142600 244829 146112 -72842 -138168 27398 183693 294777
15707 294777 244810 156250 179932 75534 24022 -12371 -96312 -169059 -145560 -73514 387
15696 387 -6059 -35755 -46991 -38020 -206987 -185797 -198680 -62154 6064 -44375 -54642 -157215
$$ packed form
15774b49796J31365N5671Q923M0346L128J07843J59059l8972o3334l1580j18530
15763D123j58938m5838L371p016l5395l0150R1068J16168j4198q2493l7512M5150
15751a51660M7497R6543O6458j03200j35808p7778J02703O8726l5040m4029n3665
15740b19253J4886R261L4167M7297O3850J0561r8222R294J90121O5299j37050
15729i789m0609J1624J61439J38367J0796q2704j13251n2666j931j3166k8738
15718b0628M5818O0183j7751P4978J02229r8717k18954o5326J65566J56295J11084
15707B94777m9967q8560K3682j04398n1512l6393q3941p2747K3499P2046P3901
15696C87o446k9696j1236Q971j68967K1190j2883J36526O8218n0439j0267j02573
$$ plain form
15684 -157215 -158005 -66247 -64802 -56572 -12741 -76089 -128350 -94151 -19448 44153 143517 78595
15672 78595 71076 133239 -24885 -226232 -151712 -61699 -83671 -81977 -97614 -73254 -42345 -1881
15660 -1881 48846 -84902 -91832 -178091 -81816 -67837 -80813 42740 230758 112400 -45429
15649 -45429 -56497 -28123 22957 15306 50407 100116 14855 -35678 -23087 53368 68647 -29196
15637 -29196 -160277 -238165 -237233 -263413 -278566 -241552 -110636 -103514 -166189 -171154 -110706 -57273
15625 -57273 -60720 -140860 -80933 -60021 -49260 1159 92185 38686 -98660 15017 -22948
15614 -22948 -178393 -241801 -300703 -137225 8931 -57541 -158561 -120216 -74470 11112 94556
15603 94556 -6022 -110268 -141271 -148588 -195915 -120030 38201 121078 114035 18058 69933
$$ packed form
15684a57215p90R1758J445Q230M3831o3348n2261L4199P4703O3601R9364o4922
15672G8595p519O2163j58124k01347P4520R0013k1972J694j5637K4360L0909M0464
15660a881N0727j33748o930q6259R6275J3979j2976J23553J88018j18358j57829
15649d5429j1068K8374N1080p651L5101M9709q5261n0533J2591P6455J5279r7843
15637b9196j31081p7888R32k6180j5153L7014J30916P122o2675m965O0448N3433
15625e7273l447q0140N9927K0912J0761N0419R1026n3499j37346J13677l7965
15614b2948j55445o3408n8902J63478J46156o6472j01020L8345M5746Q5582Q3444
15603I4556j00578j04246l1003p317m7327P5885J58231Q2877p043r5977N1875
$$ plain form
15592 69933 100031 183055 266192 190895 235124 172502 6150 -28759 -6794 70801 -15023
15581 -15023 -99129 -152140 -40498 68300 -45786 -126152 -32605 125215 198246 130767 135396
15570 135396 117733 46225 -105521 -93804 -49064 -26430 -108868 -222803 -261389 -247865 -162501
15559 -162501 -16743 92807 114703 114911 50028 49174 74458 -4951 30945 207500 183418 164479
15547 164479 147642 34995 1466 -165670 -238360 -167369 -37004 63212 70740 12078 90484
15536 90484 59575 -150832 -145814 -59235 -89129 -48668 24197 141573 199169 140155 40707
15525 40707 -28901 34461 64271 -13220 -94439 -135093 -267334 -272777 -286437 -215066 -176123 -78272
15513 -78272 -35893 -131861 -36970 9001 62348 136228 76703 26327 81447 151051 186478 134154
$$ packed form
15592F9933L0098Q3024Q3137p5297M4229o2622j66352l4909K1965P7595q5824
15581a5023q4106n3011J11642J08798j14086q0366R3547J57820P3031o7479M629
15570A35396j7663p1508j51746J1717M4740K2634q2438j13935l8586J3524Q5364
15559a62501J45758J09550K1896K08o4883q54K5284p9409L5896J76555k4082j8939
15547A64479j6837j12647l3529j67136p2690P0991J30365J00216P528n8662P8406
15536I0484l0909k10407N018Q6579k9894M0461P2865J17376N7596n9014r9448
15525D0707o9608O3362K9810p7491q1219m0654j32241n443j3660P1371L8943R7851
15513g8272M2379r5968R4891M5971N3347P3880n9525n0376N5120O9604L5427n2324
$$ plain form
15501 134154 102715 167655 297407 247723 91576 -34584 -42644 -60750 -101953 -40220 22127
15490 22127 -3262 -39752 14967 25677 -1958 -19106 -19878 50883 34475 -99345 -118939 -29396
15478 -29396 -43019 -57513 -193564 -55580 110629 24810 -113565 -96535 -6282 -24007 -98120
15467 -98120 -106012 -76785 -136421 -135065 -123272 -68947 -116637 -218025 -226720 -97166 -109603 -176961
15455 -176961 -217992 -218321 -147021 -124167 -140688 -23453 18909 98823 11060 42757 -9950 -88813
15443 -88813 -8329 107655 85238 74516 63209 62275 67369 9231 -43242 13781 -39197 -81162
15431 -81162 -115045 -81372 -72835 21662 5768 -125400 -123043 -132059 -190834 -193763 -103659 38266
15419 38266 70749 102457 91034 3502 32881 -37499 -50348 11076 -57181 -77494 -161423 -283419
$$ packed form
15501A34154l1439O4940J29752m9684j56147j26160q060j8106m1203O1733O2347
15490B2127k5389l6490N4719J0710k7635j7148p72P0761j6408j33820j9594Q9543
15478b9396j3623j4494j36051J37984J66209q5819j38375J7030R0253j7725p4113
15467i8120p892K9227n9636J356J1793N4325m7690j01388q695J29554j2437o7358
15455a76961m1031l29P1300K2854j6521J17235M2362P9914q7763L1697n2707p8863
15443h8813Q0484J15984k2417j0722j1307r34N094n8138n2473N7023n2978m1965
15431h1162l3883L3673Q537R4497j5894j31168K357r016n8775k929R0104J41925
15419C8266L2483L1708j1423q7532K9379p0380j2849O1424o8257k0313q3929j21996
$$ plain form
15407 -283419 -307833 -185070 -44928 30013 72463 72968 46904 -44041 -66612 -69229 -23267 -52839
15395 -52839 -70862 -104949 -166898 -222640 -249125 -207778 -75159 -15117 64074 143234 101588
15384 101588 87488 1230 23576 83335 86995 -49665 -199093 -116017 -115103 -57153 -66440 -117136
15372 -117136 -106833 -36690 122938 137114 76857 93647 40180 -99903 -70992 19887 -2334
15361 -2334 -101875 -43888 -46381 -103351 -193160 -171651 -92571 -75154 -90753 -51979 -76624 -16232
15349 -16232 116862 188391 147380 26094 20884 86112 74204 -4471 -43380 -213310 -234803
15338 -234803 -76055 -80408 -71848 -62555 31334 -80220 -199050 -121533 -190525 -177731 -132974
15327 -132974 -101898 -117313 -21628 -82604 -169166 -249319 -244749 -153240 -15550 25196 -48520
$$ packed form
15407b83419k4414J22763J40142P4941M2450N05k6064r0945k2571k617M5962k9572
15395e2839j8023l4087o1949n5742k6485M1347J32619O0042P9191P9160m1646
15384A01588j4100q6258K2346N9759L660j36660j49428Q3076R14N7950r287n0696
15372a17136J0303P0143J59628J4176o0257J6790n3467j40083K8911R0879k2221
15361b334r9541N7987k493n6970q9809K1509P9080J7417j5599L8774k4645O0392
15349a6232J33094P1529m1011j21286n210O5228j1908p8675l8909j69930k1493
15338b34803J58748m353Q560R293R3889j11554j18830P7517o8992J2794M4757
15327a32974L1076j5415R5685o0976q6562q0153M570R1509J37690M0746p3716
$$ plain form
15316 -48520 -105734 -88779 48977 43716 8393 65107 -76073 -35572 -30220 -92923 -19876 164951
15304 164951 174927 81963 -34092 19200 4533 16515 41605 147683 1059 -134540 -237837
15293 -237837 -165546 4643 -71491 -126621 -150372 -128827 -41040 -83784 -223605 -270593 -178630
15282 -178630 -107902 -68040 -66264 -99193 -135033 -226277 -209747 -255991 -211908 -107882 -171749
15271 -171749 -194181 -175703 -209257 -103004 -39153 -6187 44368 15404 -128099 -125551 -53945
15260 -53945 -62406 -107200 -217804 -184539 -99885 -57635 -33751 -55605 -52955 -80321 -124662 -53244
15248 -53244 -84329 -129307 -93354 -12326 -5309 -34817 78175 59185 22716 -18747 -71962 -125585
15236 -125585 -233403 -210647 -129554 -120646 -162097 -119298 -4409 139375 166345 50098 -73492
$$ packed form
15316d8520n7214J6955J37756n261l5323N6714j41180M0501N352o2703P3047J84827
15304A64951R976r2964j16055N3292j4667J1982K5090J06078j46624j35599j03297
15293b37837P2291J70189p6134n5130k3751K1545Q7787m2744j39821m6988R1963
15282a78630P0728L9862J776l2929l5840r1244J6530m6244M4083J04026o3867
15271a71749k2432J8478l3554J06253O3851L2966N0555k8964j43503K548P1606
15260e3945q461m4794j10604L3265Q4654M2250K3884k1854K650k7366m4341P1418
15248e3244l1085m4978L5953Q1028P017k9508J12992j8990l6469m1463n3215n3623
15236a25585j07818K2756Q1093Q908m1451M2799J14889J43784K6970j16247j23590
$$ plain form
15225 -73492 -119633 -135668 -160783 -196581 -171004 -83653 87509 131978 123542 110038 2389
15214 2389 -132495 -108493 -46010 -13510 -89703 -121789 -62344 -17301 24234 -7257 21639 -60606
15202 -60606 -70983 99526 221444 208755 169235 48839 -19315 30327 123937 66466 -32870
15191 -32870 -23903 -40183 19307 30615 136589 167715 8715 -25063 -48721 -31926 726
15180 726 24566 23816 67611 -7149 -99857 -102547 -70013 -62614 69725 158425 82109 -37451
15168 -37451 -67629 -34814 47726 15314 -104699 -123558 -123179 -72494 -98028 -170675 -123615 -72908
15156 -72908 -4156 -56447 -37740 61360 17913 50374 114188 258306 307531 198426 -774
15145 -774 -90615 -38898 -14888 -72936 -40122 -45209 -68587 27227 28803 152960 186638 79823
$$ packed form
15225g3492m6141j6035k5115l5798K5577Q7351J71162M4469q436j3504j07649
15214B389j34884K4002O2483L2500p6193l2086N9445M5043M1535l1491K8896q2245
15202f0606j0377J70509J21918j2689l9520j20396o8154M9642R3610n7471r9336
15191c2870Q967j6280N9490J1308J05974L1126j59000l3778k3658J6795L2652
15180G26K3840p50M3795p4760r2708k690L2534P399J32339Q8700p6316j19560
15168c7451l0178L2815Q2540l2412j20013j8859L79N0685k5534p2647M7060N0707
15156g2908O8752n2291J8707R9100m3447L2461O3814J44118M9225j09105j99200
15145g74q9841N1717K4010n8048L2814n087k3378R5814J576J24157L3678j06815
$$ plain form
15133 79823 162098 282388 198411 54403 -12054 22121 -557 -136218 -222465 -176467 -122325
15122 -122325 116805 188820 -370 -100526 77890 235720 226446 96517 -54278 -161284
15112 -161284 -168789 -24501 165497 106438 -7949 -32654 -22065 -138673 -159087 -10069 60342
15101 60342 101036 109188 88336 83047 188134 233635 191023 76230 79325 91238 133967 114194
15089 114194 24385 64915 101054 -16119 -119541 -73756 -139422 -120400 41575 9608 36633
15078 36633 217105 236888 111472 -18929 -10528 -38542 6688 63768 59915 147800 141430 47419
15066 47419 15190 51368 88672 101767 10075 20733 36588 -10587 -30345 50344 39799 -66487
15054 -66487 -55879 -15036 -82372 -149706 -215386 -302809 -209693 -169555 40583 99988 109177 230504
$$ packed form
15133G9823Q2275J20290q3977j44008o6457L4175k2678j35661q6247M5998N4142
15122a22325K39130P2015j89190j00156J78416J57830r274j29929j50795j07006
15112a61284p505J44288J89998n9059j14387k4705J0589j16608k0414J49018P0411
15101F0342M0694Q152k0852n289J05087M5501m2612j14793L095J1913M2729j9773
15089A14194q9809M0530L6139j17173j03422M5785o5666J9022J61975l1967K7025
15078C6633J80472J9783j25416j30401Q401k8014M5230N7080l853Q7885o370r4011
15066D7419l2229L6178L7304J3095r1692J0658J5855m7175j9758Q0689j0545j06286
15054f6487J0608M0843o7336o7334o5680q7423R3116M0138K10138N9405R189J21327
$$ plain form
15042 230504 204544 65890 14765 -103094 -166771 -202255 -171980 -172296 -86532 -90133 33315
15031 33315 49315 155072 129193 59739 10216 21926 -44965 -72754 -33671 16578 27697
15020 27697 19549 -2193 37271 93071 73321 -20051 -11657 51437 -15634 3143 55539 115116
15008 115116 116139 199096 206321 278473 451078 836651 1623632 2931216 3980877 4321043
14998 4321043 4224014 3833399 2896936 1850324 1210823 835941 535616 529758 486798 421075
14988 421075 403516 388435 313267 294581 357259 222268 260553 164580 69897 78350 84528 71701
14976 71701 118545 102016 57793 31086 212463 258639 193955 302527 292846 88809 18055
14965 18055 114193 59572 8822 -38915 -167563 -121552 16729 108337 72236 17460 -60830
$$ packed form
15042B30504k5960j38654n1125j17859o3677l5484L0275l16Q5764l601J23448
15031C3315J6000J05757k5879o9454m9523J1710o6891k7789L9083N0249J1119
15020B7697q148k1742L9464N5800j9750r3372Q394O3094o7071J8777N2396N9577
15008A15116J023Q2957P225P2152J72605L85573P86981J307584J049661L40166
14998D321043r7029l90615r36463j046612o39501l74882l00325n858m2960o5723
14988D21075j7559j5081p5168j8686O2678j34991L8285r5973r4683Q453O178j2827
14976G1701M6844j6529m4223k6707J81377M6176o4684J08572r681k04037p0754
14965A8055R6138n4621n0750m7737j28648M6011J38281R1608l6101n4776p8290
$$ plain form
14954 -60830 51398 44588 71800 128174 217610 143523 149843 75832 -30150 67719 172981
14943 172981 242123 289529 292579 189527 103246 -11942 88076 144204 134785 76976 -63129
14932 -63129 -94002 -189729 -198948 -22353 115697 120845 154804 138420 21529 46240 107124
14921 107124 160526 150445 19837 -53635 -74242 -106569 111400 94471 36330 -81123 -77668
14910 -77668 -95149 -50239 -120074 -127405 -82569 -139360 -126429 -62081 -14854 -55321 -139070 32203
14898 32203 152651 103168 166057 99191 -34274 45423 122297 82368 96834 170063 101315
14887 101315 151978 53476 -2837 -86592 -161435 -148482 -169233 -80224 72346 140737 40319
14876 40319 -121104 -176595 -202040 -96639 59906 85699 -3005 3168 40439 82864 38066
$$ packed form
14954f0830J12228o810K7212N6374Q9436p4087O320p4011j05982R7869J05262
14943A72981O9142M7406L050j03052q6281j15188J00018N6128r419n7809j40105
14932f3129l0873r5727r219J76595J38050N148L3959j6384j16891K4711O0884
14921A07124N3402j0081j30608p3472k0607l2327K17969j6929n8141j17453L455
14910g7668j7481M4910o9835p331M4836n6791J2931O4348M7227m0467q3749J71273
14898C2203J20448m9483O2889o6866j33465P9697P6874l9929J4466P3229o8748
14887A01315N0663r8502n6313q3755p4843J2953k0751Q9009J52570O8391j00418
14876D0319j61423n5491k5445J05401J56545K5793q8704O173L7271M2425m4798
$$ plain form
14865 38066 -51417 -86069 48005 29633 -29948 -67060 -92302 9238 -59401 -69135 -165538
14854 -165538 -24130 75950 54516 127981 129538 94031 -21945 -71747 -96553 -54922 -187774
14843 -187774 -286686 -176779 -48709 69 49742 76842 60617 210454 206756 217505 144155
14832 144155 126513 168993 126030 22669 -14210 -42340 -13394 40533 5593 -23614 52434
14821 52434 -12181 -152157 -212343 -80890 86753 163631 59800 6413 -3805 18001 25899
14810 25899 57256 193978 195308 39049 144637 258016 198091 101384 96270 -16182 -87983
14799 -87983 -76187 -63452 29664 -28646 -132987 -42036 -28045 -151441 -160745 -153084 -155899 -106551
14787 -106551 -152113 -141902 -129788 -133657 -120729 -145157 -147903 -95374 -38680 84773 150132 253065
$$ packed form
14865C8066q9483l4652J34074j8372n9581l7112k5242J01540o8639r734r6403
14854a65538J41408J00080k1434P3465J557l5507j15976m9802k4806M1631j32852
14843a87774r8912J09907J28070M8778M9673K7100j6225J49837l698J0749p3350
14832A44155j7642M2480m2963j03361l6879k8130K8946N3927l4940k9207P6048
14821E2434o4615j39976o0186J31453J67643P6878j03831n3387j0218K1806P898
14810B5899L1357J36722J330j56259J05588J13379n9925r6707n114j12452p1801
14799h7983J1796J2735R3116n8310j04341R0951J3991j23396r304P661k815M9348
14787a06551m5562J0211J2114l869J2928k4428k746N2529N6694J23453O5359J02933
$$ plain form
14775 253065 277509 152525 44012 10316 -44972 30031 -117525 -200910 -209737 -102298 -119194
14764 -119194 -116441 -201553 -187468 -89170 -65576 -68783 41791 -46128 -29346 81767 137496
14753 137496 155224 63456 -60080 -41064 -99188 -240514 -209182 -196842 -211282 -176748 -43411
14742 -43411 -19361 -66545 -50287 -136789 -205995 -129470 -101801 -41022 -29945 -140893 -134823 -227339
14730 -227339 -301990 -230159 -59171 113382 205894 113899 71874 12296 76471 78867 75272
14719 75272 -36477 -112198 -106641 -50118 -88299 -117036 -109440 -116633 -117591 -114997 -123287 -113407 -131663
14706 -131663 -150079 -234273 -313816 -247296 -164205 -165194 -219175 -121963 -57790 1610 15489 -20896
14694 -20896 72852 6025 -38774 29401 -28440 -149094 -144943 -59915 27647 134022 196897
$$ packed form
14775B53065K4444j24984j08513l3696n5288P5003j47556q3385q827J07439j6896
14764a19194K753q5112J4085R8298K3594l207J10574q7919J6782J11113N5729
14753A37496J7728r1768j23536J9016n8124j41326L1332J2340j4440L4534J33337
14742d3411K4050m7184J6258q6502o9206P6525K7669O0779J1077j10948O070r2516
14730b27339p4651P1831J70988J72553R2512r1995m2025n9578O4175K396l595
14719G5272j11749p5721N557N6523l8181k8737P596p193r58K594q290R880j8256
14706a31663j8416q4194p9543O6520Q3091r89n3981R7212O4173N9400J3879l6385
14694b0896R3748o6827m4799O8175n7841j20654M151Q5028Q7562J06375O2875
$$ plain form
14683 196897 79486 10058 115614 236237 206035 8639 -93055 -71935 -32023 34516
14673 34516 155856 87695 9032 19317 -39634 -176406 -274285 -235162 -163442 -151427 -104387
14662 -104387 -7570 -38591 -36032 34103 -54884 -126390 -107171 -43663 -20183 -89547 -128573 16387
14650 16387 -105504 -42162 -46699 -87928 -56948 901 -30778 -108882 -97098 -116054 -29098 2818
14638 2818 -21635 -24606 -52088 51189 87947 91067 -12358 -95894 -33342 -115256 -163295 -153121
14626 -153121 -89431 -162012 -2743 25018 -71778 -108946 -151327 -30366 -17950 -22854 -7534
14615 -7534 -74879 -144653 -164512 -153659 -66417 -41673 -115363 -182928 -190092 -122432 -144752 42813
14603 42813 166765 142614 60617 61960 76935 -1034 -35023 -19907 92688 52287 44282 -32175
$$ packed form
14683A96897j17411o9428J05556J20623l0202j97396j01694K1120L9912O6539
14673C4516J21340o8161p8663J0285n8951j36772r7879L9123P1720J2015M7040
14662a04387R6817l1021K559P0135q8987p1506J9219O3508K3480o9364l9026J44960
14650A6387j21891O3342m537m1229L0980N7849l1679p8104J1784j8956Q6956L1916
14638B818k4453k971k7482J03277L6758L120j03425q3536O2552q1914m8039J0174
14626a53121O3690p2581J59269K7761r6796l7168m2381J20961J2416m904J5320
14615g534o7345o9774j9859J0853Q7242K4744p3690o7565p164O7660k2320J87565
14603D2813J23952k4151q1997J343J4975p7969l3989J5116J12595m0401q005p6457
$$ plain form
14591 -32175 -76000 -157526 -128120 -12180 -32942 -78104 -17399 64321 105058 -66498 -85572
14580 -85572 -7008 -71270 -78515 -111034 -190877 -249205 -279229 -184968 -11616 167368 253719
14569 253719 264014 132549 86888 -22188 -100513 -1679 111047 238923 209778 201189 246363
14558 246363 129215 129638 75494 73012 -13876 -158175 -308231 -238027 -110938 -63171 -110265
14547 -110265 -193908 -194255 -233830 -185408 -22592 68860 83309 173503 66212 -54068 -153600
14536 -153600 -135783 -165871 -157257 -162696 -114568 -115664 -145596 -201023 -196496 -188678 -173396 4379
14524 4379 21650 -50950 -72441 -41167 -73906 -112322 -142086 -19654 37582 -3452 43084 97154
14512 97154 108905 29056 49990 -38262 -90882 -13744 16529 73560 101765 115712 141880 58377
$$ packed form
14591c2175m3825q1526K9406J15940k0762m5162O0705Q1720M0737j71556j9074
14580h5572P8564o4262p245l2519p9843n8328l0024R4261J73352J78984Q6351
14569B53719J0295j31465m5661j09076p8325R8834J12726J27876k9145q589M5174
14558B46363j17148M23n4144k482q6888j44299j50056P0204J27089M7767m7094
14547a10265q3643l47l9575M8422J62816R1452J4449R0194j07291j20280r9532
14536a53600J7817l0088Q614n439M8128j096k9932n5427M527P818J5282J77775
14524D379J7271p2600k1491L1274l2739l8416k9764J22432N7236m1034M6536N4070
14512I7154J1751p9849K0934q8252n2620P7138L0273N7031K8205J3947K6168q3503
$$ plain form
14500 58377 14732 29031 47217 109551 154738 205968 283145 243804 120379 -13437 -94835
14489 -94835 -104410 -26322 -15936 -98926 -176036 -85409 -8935 74498 101743 55251 81522 86401
14477 86401 -15961 -75364 -7925 60211 59549 136677 100289 -21834 -44154 -7271 34473 60769
14465 60769 69341 33709 11181 137780 189345 86099 114326 218751 154803 129371 214039
14454 214039 248773 69440 10559 119946 119710 -8480 -48013 476 -28185 8065 103274
14443 103274 21492 -50084 -31182 -73387 -93384 -29150 -30675 -45364 35331 30077 -90103 31583
14431 31583 81539 60892 63182 97571 137952 -19816 -82614 -119681 -75011 -74804 -145571 -154948
14419 -154948 -244124 -344019 -316021 -160831 -46901 -26927 -27004 -10841 -65677 32747 11470 -93045
$$ packed form
14500E8377m3645J4299J8186O2334M5187N1230P7177l9341j23425j33816q1398
14489i4835r575P8088J0386q2990p7110R0627P6474Q3433K7245m6492K6271M879
14477H6401j02362n9403O7439O8136o62P7128l6388j22123k2320L6883M1744K6296
14465F0769Q572l5632k2528J26599N1565j03246K8227J04425o3948k5432Q4668
14454B14039L4734j79333n8881J09387k36j28190l9533M8489k8661L6250R5209
14443A03274q1782p1576J8902m2205j9997O4234j525j4689Q0695n254j20180J21686
14431C1583M9956k0647K290L4389M0381j57768o2798l7067M4670K07p0767r377
14419a54948q9176r9895K7998J55190J13930J9974p7J6163n4836R8424k1277j04515
$$ plain form
14407 -93045 -112721 -112320 -42952 106881 121884 -45676 -130962 -111089 -105421 -127385 -122280 -26253
14395 -26253 -39339 14972 82884 7664 -64158 -103834 -65353 -97196 -50340 68774 100861
14384 100861 127573 45728 3472 87252 163245 226986 237210 194046 136968 105661 126288
14373 126288 187094 152645 74997 71692 -7360 -10624 71965 102715 171891 197540 138419 124389
14361 124389 -24626 -15667 62917 18365 -18675 -126791 -151104 -142380 -175468 -248141 -292579
14350 -292579 -243616 -185609 -175557 -138588 -64874 -42362 -92919 -118571 -19240 129720 229513
14339 229513 179920 70197 53648 4337 60936 75624 -38004 -16930 6973 13080 56706
14328 56706 4728 53238 -10180 29600 100171 59046 5357 40193 9683 -120840 -78823
$$ packed form
14407i3045j9676M01O9368J49833J5003j67560q5286J9873N668k1964N105R6027
14395b6253j3086N4311O7912p5220p1822l9676L8481l1843M6856J19114L2087
14384A00861K6712q1845m2256Q3780P5993O3741J0224m3164n7078l1307K0627
14373A26288O0806l4449p7648l305p9052l264Q2589L0750O9176K5649n9121j4030
14361A24389j49015Q959P8584m4552l7040j08116k4313Q724l3088p2673m4438
14350b92579M8963N8007J0052L6969P3714K2512n0557k5652R9331J48960R9793
14339B29513m9593j09723j6549m9311N6599J4688j13628K1074K3903O107M3626
14328E6706n1978M8510o3418L9780P0571m1125n3689L4836l0510j30523M2017
$$ plain form
14317 -78823 -12470 88962 106042 15636 -60247 -209532 -131843 -159264 -191717 -191572 -63664
14306 -63664 61421 80200 21626 30385 42226 66358 127476 115186 64206 -64030 -121896
14295 -121896 -137069 -18954 516 -78443 -65687 -29053 11876 -3323 11855 35858 -12621
14284 -12621 -32283 50509 126929 132872 -49829 -139425 -104740 -90667 -163630 -201067 -226965 -237477
14272 -237477 -120668 -99469 -61454 6596 -31134 -18345 -28199 -71396 -137211 -229856 -243428
14261 -243428 -146684 -13578 -41203 -52222 44157 -40451 -2448 32523 113208 168373 197472
14250 197472 163997 111238 94928 89635 146386 59032 -26961 6814 106033 85433 60566 112370
14238 112370 56130 37434 -41112 -21893 24797 135052 104275 -57885 6511 218995 337266
$$ packed form
14317g8823O6353J01432J7080r0406p5883j49285P7689k7421l2453J45J27908
14306f3664J25085J8779n8574Q759J1841K4132O1118j2290n0980j28236n7866
14295a21896j5173J18115J9470p8959J2756L6634M0929j5199J5178K4003m8479
14284a2621j9662Q2792P6420N943j82701q9596L4685J4073p2963l7437k5898j0512
14272b37477J16809K1199L8015O8050l7730J2789r854m3197o5815r2645j3572
14261b43428R6744J33106k7625j1019R6379q4608L8003L4971Q0685N5165K9099
14250A97472l3475n2759j6310n293N6751q7354q5993L3775R9219k0600k4867N1804
14238A12370n6240j8696p8546J9219M6690J10255l0777j62160O4396K12484J18271
$$ plain form
14227 337266 218432 171321 15858 -60356 -53116 -129033 -181476 -92242 -123607 -123969 -139967 -107042
14215 -107042 -76954 3049 167448 171422 161056 113623 47118 20323 51676 161242 113802
14204 113802 36259 -57613 34855 21916 -5041 -40789 -4509 167348 240511 203394 224309
14193 224309 217589 211675 246633 244974 81826 -33286 -11476 160273 255815 233802 109429
14182 109429 -46733 -138177 -127381 -177407 -276867 -232829 -75853 125659 124837 77268 24027
14171 24027 -2347 58404 32867 74429 23392 63653 -32376 -175975 -278006 -181131 -31791
14160 -31791 63605 104266 23665 -85427 -23314 46650 105044 54443 88410 164379 37078
14149 37078 -50299 17540 -122744 -196403 -143105 -177221 -183551 -88072 -155619 -171526 -107716 -92525
$$ packed form
14227C37266j18834m7111j55463p6214P240p5917n2443Q9234l1365l62j5998L2925
14215a07042L0088Q0003J64399L974j0366m7433o6505k6795L1353J09566m7440
14204A13802p7543r3872R2468j2939k6957l5748L6280J71857P3163l7117K0915
14193B24309o720n914L4958j659j63148j15112K1810J71749R5542k2013j24373
14182A09429j56162r1444J0796n0026r9460M4038J56976K01512q22m7569n3241
14171B4027k6374O0751k5537M1562n1037M0261r6029j43599j02031R6875J49340
14160c1791R5396M0661q0601j09092O2113O9964N8394n0601L3967P5969j27301
14149C7078q7377O7839j40284p3659N3298l4116o330R5479o7547j5907O3810J5191
$$ plain form
14137 -92525 -193211 -214280 -231300 -164683 -127112 -84061 -38719 -12688 -5822 15904 -22495 -65429
14125 -65429 -91703 -56805 -64617 3421 -40950 -114617 -101601 -73091 -63393 -159155 -77655 4213
14113 4213 100787 101301 82861 9731 -94672 -147994 -245949 -267550 -79797 62210 118333 -5049
14101 -5049 24689 -23078 -132710 -232177 -235684 -280464 -292189 -233730 -74512 -54261 -128039 -111390
14089 -111390 -30528 33594 44582 -58459 -161046 -55646 88870 119769 12304 -16828
14079 -16828 -16057 -1700 37248 1433 107275 200595 211120 120185 87618 5546 -138099 -212819
14067 -212819 -102352 48200 23780 148981 243176 270744 244258 249368 145700 70279 22603
14056 22603 -33686 -12043 44251 197450 126659 -32478 -92089 -150260 -147872 33266 53680
$$ packed form
14137i2525j00686k1069j7020O6617L7571M3051M5342K6031O866K1726l8399m2934
14125f5429k6274L4898p812O8038m4371p3667J3016K8510R698r5762Q1500Q1868
14113D213R6574N14j8440p3130j04403n3322r7955k1601J87753J42007N6123j23382
14101e049K9738m7767j09632r9467l507m4780j1725N8459J59218K0251p3778J6649
14089a11390Q0862O4122J0988j03041j02587J05400J44516L0899j07465k9132
14079a6828P71J4357L8948l5815J05842R3320J0525r0935l2567q2072j43645p4720
14067b12819J10467J50552k4420J25201R4195K7568k6486N110j03668p5421m7676
14056B2603n6289K1643N6294J53199p0791j59137n9611n8171K388J81138K0414
$$ plain form
14045 53680 149857 185228 79528 66774 89280 170702 127020 118057 78123 124925 160824 166383
14033 166383 100852 89894 69554 -8928 -36291 81813 135120 104617 35533 -97253 -70627
14022 -70627 -41040 -91913 -143922 -69689 -41017 -22734 43459 15149 -68876 -20284 140561
14011 140561 238689 156906 55703 -40943 -43490 -50718 -99586 -152323 -136505 -46294 -31834 -59789
13999 -59789 -20292 51123 14744 37185 -19244 -17125 -28916 -18767 122016 156183 177393 204524
13987 204524 77916 16819 -79341 -118689 -167999 -122026 -115546 -28028 689 13583 43391
13976 43391 102204 44944 88090 92937 42320 13296 40431 80884 78639 117055 33583 -70645
13964 -70645 -82811 -25423 180205 248523 82437 -8189 -7135 31744 -28110 -69361 43728
$$ packed form
14045E3680R6177L5371j05700j2754K2506Q1422m3682q963l9934M6802L5899N559
14033A66383o5531j0958k0340p8482k7363J18104N3307l0503o9084j32786K6626
14022g0627K9587n0873n2009P4233K8672J8283O6193k8310q4025M8592J60845
14011A40561R8128q1783j01203r6646k547p228m8868n2737J5818R0211J4460k7955
13999e9789L9497P1415l6379K2441n6429K119j1791J0149J40783L4167K1210K7131
13987B04524j26608o1097r6160l9348m9310M5973O480Q7518K8717J2894K9808
13976D3391N8813n7260M3146M847n0617k9024K7135M0453k245L8416q3472j04228
13964g0645j2166N7388K05628O8318j66086r0626J054L8879n9854m1251J13089
$$ plain form
13953 43728 -104370 -89546 -48409 -99430 -119294 -177397 -172165 -223135 -340560 -219270 -46907
13942 -46907 30481 54763 109924 144528 138765 -1438 -89685 -108504 2007 -12093 -8472 114872
13930 114872 223067 109606 62858 16260 -60076 -105401 -93938 32495 174448 158962 45420
13919 45420 34824 71454 13484 -119004 -88446 109438 238684 368054 451598 417447 321232
13908 321232 217172 98977 87621 50545 -6219 -73232 33296 -28951 -44679 -21419 -130268
13897 -130268 -66933 -50337 -57945 70441 -38224 -113638 -28781 -30749 33380 232189 138361
13886 138361 40290 -13967 -55625 -142665 -148308 -221 114496 176352 156778 230050 304757
13875 304757 335027 385234 405003 453751 443532 368306 338332 421016 383610 384218 313327 188892
$$ packed form
13953D3728j48098J4824M1137n1021j9864n8103N232n0970j17425J21290J72363
13942d6907P7388K4282N5161L4604n763j40203q8247j8819J10511j4100L621J23344
13930A14872J08195j13461m6748m6598p6336m5325J1463J26433J41953j5486j13542
13919D5420j0596L6630n7970j32488L0558J97884J29246J29370Q3544l4151r6215
13908C21232j04060j18195j1356l7076n6764o7013J06528o2247j5728K3260j08849
13897a30268O3335J6596p608J28386j08665p5414Q4857j968O4129J98809r3828
13886A38361r8071n4257m1658q7040n643J48087J14717O1856j9574P3272P4707
13875C04757L0270N0207J9769M8748j0219p5226k9974Q2684l7406O08p0891j24435
$$ plain form
13863 188892 73569 57462 -17027 58186 126525 122680 210868 350867 237711 140303 61104
13852 61104 88446 167575 155188 168013 198264 176885 139896 -47027 -97564 -50316 -52537 43163
13840 43163 98058 73120 -34847 20707 102526 163033 199545 294339 365451 317693 339248
13829 339248 336567 258052 167489 299078 372168 280177 257258 152456 8156 53618 72870
13818 72870 130279 -1543 -213138 -124495 -99248 -46824 -8003 91420 102412 14063 36549
13807 36549 55496 94481 32536 -59378 8139 179573 164343 -914 -51395 56894 101926
13796 101926 96865 92442 45413 -60602 -137893 -130966 -148798 -137508 -51788 59822 129761 115394
13784 115394 54065 -25675 81593 -37540 -69426 -69584 -26813 -10258 33355 -30548 -124002
$$ packed form
13863A88892j15323j6107p4489P5213O8339l845Q8188J39999j13156r7408p9199
13852F1104K7342P9129j2387J2825L0251k1379l6989j86923n0537M7248k221R5700
13840D3163N4895k4938j07967N5554Q1819O0507L6512R4794P1112m7758K1555
13829C39248k681p8515r0563J31589P3090r1991k2919j04802j44300M5462J9252
13818G2870N7409j31822k11595Q8643K5247N2424L8821R9423J0992q8349K2486
13807C6549J8947L8985o1945r1914O7517J71434j5230j65257n0481J08289M5032
13796A01926n061m423m7029j06015p7291O927j7832J1290Q5720J11610O9939j4367
13784A15394o1329p9740J07268j19133l1886j58M2771J6555M3613o3903r3454
$$ plain form
13773 -124002 -84910 18177 112431 97152 137970 118660 119201 -14989 43279 72246 129541
13762 129541 143581 111159 26814 199747 288833 240351 264780 313069 174596 112515 163724
13751 163724 150107 9990 -120903 13133 -24728 -58941 -161106 -196860 -72226 -10264
13741 -10264 102181 88347 56376 42104 95842 178109 150696 109950 203204 152476 74118
13730 74118 86293 127021 24496 -94488 -113591 -34243 -67059 28474 88681 -41686 -29819
13719 -29819 79770 44415 -18637 -68922 -115801 -37146 4757 -22874 -66809 33556 63000
13708 63000 4419 29243 -34347 -11213 54331 159080 168162 251597 234544 190410 216234 220232
13696 220232 251233 186117 141156 73512 -38603 -24729 64429 173436 258529 176912 72894
$$ packed form
13773a24002L9092J03087R4254j5279M0818j9310N41j34190N8268K8967N7295
13762A29541J4040l2422q4345J72933Q9086m8482K4429M8289j38473o2081N1209
13751A63724j3617j40117j30893J34036l7861l4213j02165l5754J24634O1962
13741a0264J12445j3834l1971j4272N3738Q2267k7413m0746R3254n0728p8358
13730G4118J2175M0728j02525j18984j9103P9348l2816R5533O0207j30367J1867
13719b9819J09589l5355o3052n0285m6879P8655M1903k7631m3935J00365K9444
13708F3000n8581K4824o3590K3134O5544J04749R082Q3435j7053m4134K5824L998
13696B20232L1001o5116m4961o7644j12115J3874Q9158J09007Q5093q1617j04018
$$ plain form
13685 72894 144724 216308 264020 151164 116259 49926 -25056 -23325 24524 119030 95655 12206
13673 12206 635 87915 81474 65596 31794 73636 158409 170981 98267 154458 311058 330443
13661 330443 271659 267218 219700 124827 119904 73275 57204 87247 153456 123671 133627 149775
13649 149775 49879 45556 -12653 23339 5968 354 72848 39490 104497 144666 5788 -75874
13637 -75874 -54864 16276 163492 141110 94102 93816 81846 36489 116558 216467 320867 306482
13625 306482 135496 52906 141740 302425 312020 198241 137744 288037 215414 151375 145242
13614 145242 253525 326804 284032 212224 196634 278727 273340 274850 269632 137022 187544 262080
13602 262080 184300 -33902 87471 180756 141455 124699 214205 358060 138855 107131 141980
$$ packed form
13685G2894P1830P1584M7712j12856l4905o6333p4982J731M7849R4506k3375q3449
13673A2206j1571Q7280o441j5878l3802M1842Q4773J2572p2714N6191J56600J9385
13661C30443n8784m441m7518r4873m923m6629j6071L0043O6209k9785R956J6148
13649A49775r9896m323n8209L5992j7371n614P2494l3358O5007M0169j38878q1662
13637g5874K1010P1140J47216k2382m7008k86j1970m5357Q0069R9909J04400j4385
13625C06482j70986q2590Q8834J60685R595j13779o0497J50293p2623o4039o133
13614A45242J08283P3279m2772p1808j5590Q2093n387J510n218j32610N0522P4536
13602B62080p7780k18202J21373R3285l9301j6756Q9506J43855k19205l1724L4849
$$ plain form
13591 141980 100846 28119 23636 132239 69419 76446 195311 241837 224474 340630 410575
13580 410575 446613 441907 341809 305437 269872 287705 186436 118663 157169 112608 54800
13569 54800 165262 239602 173143 215765 152594 95242 88926 188255 210660 208740 263935 96023
13557 96023 64868 155897 62579 24669 23507 65835 54775 203454 187215 202455 317783
13546 317783 280573 285213 190515 184222 251631 155250 83796 123571 254274 295562 230086 144827
13534 144827 146144 216331 202168 234167 183892 314460 288608 128087 82188 106810 36403
13523 36403 -53306 -99998 -29716 148144 250003 102510 109403 51113 -122579 -118547 -96585
13512 -96585 -88615 -107171 -41022 65927 218121 209246 206206 143539 148927 95521 159705 194550
$$ packed form
13591A41980m1134p2727m483J08603o2820P027J18865M6526j7363J16156O9945
13580D10575L6038m706j00098l6372l5565J7833j01269o7773L8506m4561n7808
13569E4800J10462P4340o6459M2622o3171n7352o316R9329K2405j920N5195j67912
13557I6023l1155R1029r3318l7910j162M2328j1060J48679j6239J5240J15328
13546C17783l7210M640r4698o293O7409r6381p1454L9775J30703M1288o5476q5259
13534A44827J317P0187j4163L1999n0275J30568k5852j60521m5899K4622p0407
13523C6403q9709m6692P0282J77860J01859j47493O893n8290j73692M032K1962
13512i6585P970j8556O6149J06949J52194q875l040o2667N388n3406O4184L4845
$$ plain form
13500 194550 297004 202379 38434 62308 142054 172344 170840 72534 -68836 -83869 -18671
13489 -18671 4058 112476 142775 167630 339821 284840 280743 275666 388799 486049 403575
13478 403575 356616 314389 277308 233173 246985 188265 247049 191208 186593 270725 271339 384675
13466 384675 321204 145851 99923 43673 114264 193495 216101 141456 160090 219759 74908
13455 74908 24258 77172 68185 136014 113969 163031 95114 118617 332180 337182 366106 480742
13443 480742 381656 345442 306114 395506 385641 288409 255257 248190 318520 272857 317507 329459
13431 329459 326176 293509 183879 108335 156245 320026 354617 274248 284090 205078 103888
13420 103888 1956 -87083 31419 192205 196322 101383 118008 158714 235960 313209 297958
$$ packed form
13500A94550J02454r4625j63945K3874P9746L0290j504r8306j41370j5033O5198
13489a8671K2729J08418L0299K4855J72191n4981m097n077J13133R7250q2474
13478D03575m6959m2227l7081m4135J3812n8720N8784n5841m615Q4132O14J13336
13466C84675o3471j75353m5928n6250P0591P9231K2606p4645J8634N9669j44851
13455G4908n0650N2914q987O7829k2045M9062o7917K3503K13563N002K8924J14636
13443D80742r9086l6214l9328Q9392r865r7232l3152p067P0330m5663M4650J1952
13431C29459l283l2667j09630p5544M7910J63781L4591q0369R842p9012j01190
13420A03888j01932q9039J18502J60786M117r4939J6625M0706P7246P7249j5251
$$ plain form
13409 297958 366654 397252 238822 187611 197368 94727 25138 -9229 -376 76661 129530
13398 129530 137283 177391 123439 75437 117008 101898 105201 113270 101697 113560 183464 123136
13386 123136 139470 137168 149546 144747 233219 300372 237167 167943 194633 193832 146033 71545
13374 71545 45503 117060 243325 379426 347099 320018 348255 461774 429149 392573 302736
13363 302736 230426 261232 380624 474527 395579 375782 340487 295650 298071 134870 63219
13352 63219 99451 66090 114305 146392 313961 476207 431380 338749 279333 293410 302048
13341 302048 294222 225144 167508 178902 273471 280725 429998 358938 209814 309878 224009
13330 224009 210111 239952 309719 290131 343276 285449 210779 223410 224372 219338 134128 60973
$$ packed form
13409B97958O8696L0598j58430n1211R757j02641o9589l4367Q853P7037N2869
13398A29530P753M0108n3952m8002M1571j5110L303Q069j1573J1863O9904o0328
13386A23136J6334k302J2378m799Q8472O7153o3205o9224K6690q01m7799p4488
13374G1545k6042P1557J26265J36101l2327k7081K8237J13519l2625l6576q9837
13363C02736p2310L0806J19392R3903p8948j9797l5295m4837K421j63201p1651
13352F3219L6232l3361M8215L2087J67569J62246m4827r2631n9416J4077Q638
13341C02048p826o9078n7636J1394R4569P254J49273p1060j49124J00064q5869
13330B24009j3898K9841O9767j9588N3145n7827p4670J2631R62n034q5210p3155
$$ plain form
13318 60973 60995 142276 256509 243417 172291 189052 194677 164836 73153 207028 350793 272079
13306 272079 291681 279613 272678 288889 261970 235582 258283 304256 272568 190979 248143 230454
13294 230454 165409 176563 200068 279930 358289 251887 212421 296786 337200 459826 366365
13283 366365 323258 433488 421297 392336 368641 300629 350008 332576 401291 440085 376890
13272 376890 275692 248452 224552 243838 357460 322326 222121 284131 395483 388593 231643
13261 231643 156493 151273 145302 146149 245939 196952 262966 289433 190774 156056 235295 381108
13249 381108 413204 421167 387890 359868 304447 317728 269776 106947 104578 179420 237870 297312
13237 297312 189170 18930 26830 157562 263815 227614 239556 325601 340959 364590 497500
$$ packed form
13318F0973K2Q1281J14233j3092p1126J6761N625k9841r1683J33875J43765p8714
13306B72079J9602j2068o935J6211k6919k6388K2701M5973l1688q1589N7164j7689
13294B30454o5045J1154K3505P9862P8359j06402l9466Q4365M0414J22626r3461
13283C66365m3107J10230j2191k8961k3695o8012M9379j7432O8715L8794o3195
13272C76890j01198k7240k3900J9286J13622l5134j00205O2010J11352o890j56950
13261B31643p5150n220n971Q47R9790m8987O6014K6467r8659l4718P9239J45813
13249C81108L2096P963l3277k8022n5421J3281m7952j62829k369P4842N8450N9442
13237B97312j08142j70240P900J30732J06253l6201J1942Q6045J5358K3631J32910
$$ plain form
13226 497500 585868 612936 652720 554185 499450 398758 363949 431725 521164 615928 491946
13215 491946 336808 383731 311439 201297 321862 422953 408432 433515 510311 472497 340977
13204 340977 279415 229918 281378 430033 532541 520777 579048 470639 412610 382410 417148
13193 417148 508424 479364 486259 605646 505159 401039 410912 375329 320906 338974 421120
13182 421120 492115 505879 570685 597100 477493 337841 351481 332323 328919 232941 321100
13171 321100 448036 458954 367258 391061 274237 227775 268296 324126 397464 460299 458233
13160 458233 577266 679187 603688 445654 372738 403596 363494 472825 548591 604757 692533
13149 692533 631310 507946 328750 286905 377714 415277 379257 432026 415673 295432 284122
$$ packed form
13226D97500Q8368K7068L9784r8535n4735j00692l4809O7776Q9439R4764j23982
13215D91946j55138M6923p2292j10142J20565J01091j4521K5083P6796l7814j31520
13204C40977o1562m9497N1460J48655J02508j1764N8271j08409n8029l0200L4738
13193D17148R1276k9060O895J19387j00487j04120R873l5583n4423J8068Q2146
13182D21120P0995J3764O4806K6415j19607j39652J3640j9158l404r5978Q8159
13171C21100J26936J0918r1696K3803j16824m6462M0521N5830P3338O2835k066
13160D58233J19033J01921p5499j58034p2916L0858m0102J09331P5766N6166Q7776
13149F92533o1223j23364j79196m1845R0809L7563l6020N2769j6353j20241j1310
$$ plain form
13138 284122 370873 344926 277230 393155 501961 601325 537721 461094 398581 452426 490118
13127 490118 501222 419333 373319 384953 375518 413897 459804 480596 685166 665573 552100
13116 552100 613229 597882 574726 649622 617518 577430 557368 489564 422413 435407 528759
13105 528759 633269 541068 516005 566126 598966 669038 572361 646181 576674 553813 568170
13094 568170 503782 524635 509386 489894 421308 370379 326813 374195 426955 470481 614484
13083 614484 660709 702519 752899 808173 787000 649775 639264 651289 664544 610573 525196
13072 525196 604385 474836 503247 622722 676340 557375 571070 627302 717934 691124 733195
13061 733195 811221 684953 768441 796660 806341 723239 848605 898132 728126 744615 734838
$$ packed form
13138B84122Q6751k5947o7696J15925J08806R9364o3604p6627o2513N3845L7692
13127D90118J1104q1889m6014J1634r435L8379M5907K0792K04570j9593j13473
13116E52100O1129j5347k3156P4896l2104m0088k0062o7804o7151J2994R3352
13105E28759J04510r2201k5063N0121L2840P0072r6677P3820o9507k2861J4357
13094E68170o4388K0853j5249j9492o8586n0929m3566M7382N2760M3526J44003
13083F14484M6225M1810N0380N5274k1173j37225j0511J2025J3255n3971q5377
13072E25196P9189j29549K8411J19475N3618j18965J3695N6232R0632k6810M2071
13061G33195P8026j26268Q3488K8219R681q3102J25366M9527j70006J6489r777
$$ plain form
13050 734838 653739 530606 615067 658858 792038 808692 752706 774798 826687 721085 709395
13039 709395 711571 664454 725626 662374 627871 673790 729793 788903 790327 841989 775141 848142
13027 848142 928247 858266 814349 904314 945387 909959 962753 1146657 1072854 989531 914259
13016 914259 888330 875146 886397 813973 699052 743744 799796 960957 1066346 873130 864589
13005 864589 857189 892004 856546 792317 663102 674598 639783 678929 707410 720258 732793
12994 732793 689277 799681 1000414 974400 960627 1019776 1018907 866622 804935 896428 986918
12983 986918 1015561 1022086 1042315 1040887 845245 765083 889505 797478 914691 1118958 1100754
12972 1100754 1040198 1009912 919300 974339 1049184 1051356 1190207 1268125 1139333 1029441 1004011
$$ packed form
13050G34838q1099j23133Q4461M3791J33180J6654n5986K2092N1889j05602j1690
13039G09395K176m7117O1172o3252l4503M5919N6003N9110J424N1662o6848P3001
13027H48142Q0105o9981m3917Q9965M1073l5428N2794J83904p3803q3323p5272
13016I14259k5929j3184J1251p2424j14921M4692N6052J61161J05389j93216q541
13005H64589p400L4815l5458o4229j29215J1496l4815L9146K8481J2848J2535
12994G32793m3516J10404K00733k6014j3773N9149q69j52285o1687R1493R0490
12983I86918K8643O525K0229j428j95642q0162J24422r2027J17213K04267j8204
12972A100754o0556l0286r0612N5039P4845K172J38851P7918j28792j09892k5430
$$ plain form
12961 1004011 1101191 1143819 1116515 1110478 965740 844900 804556 850091 1018472 1055324 1010569
12950 1010569 1141156 1135700 1098252 1024712 1003740 1007080 1019121 1011143 1035889 1098271 1143060 1160429
12938 1160429 1252750 1281745 1115809 980685 953821 945708 850403 826538 863743 892880 1020254
12927 1020254 1241795 1314244 1195005 1139762 1023999 1119686 1351554 1360053 1378262 1332568 1094254
12916 1094254 1053561 1181011 1254401 1327331 1358341 1256937 1225696 1206269 1248441 1164435 1161745
12905 1161745 1232508 1380046 1406108 1369478 1309951 1170411 1031622 1121850 1241671 1201629
12895 1201629 1245236 1323664 1403088 1380090 1390715 1260659 1137488 1241491 1320633 1308430 1265802
12884 1265802 1332400 1409807 1503687 1588004 1567917 1523428 1576264 1545440 1433075 1310601 1330251
$$ packed form
12961A004011R7180M2628k7304o037j44738j20840m0344M5535J68381L6852m4755
12950A010569J30587n456l7448p3540k0972L340J2041p978K4746O2382M4789J7369
12938A160429R2321K8995j65936j35124k6864q113r5305k3865L7205K9137J27374
12927A020254K21541P2449j19239n5243j15763R5687K31868Q499J8209m5694k38314
12916A094254m0693J27450P3390P2930L1010j01404l1241j9427M2172q4006k690
12905A161745P0763J47538K6062l6630n9527j39540j38789R0228J19821m0042
12895A201629M3607P8428P9424k2998J0625j30056j23171J04003P9142j2203m2628
12884A265802O6598P7407R3880Q4317k0087m4489N2836l0824j12365j22474J9650
$$ plain form
12873 1330251 1336729 1346831 1355387 1366949 1317225 1394401 1321547 1381840 1445536 1465551 1460568 1410522
12861 1410522 1417637 1399778 1564687 1677454 1693281 1748799 1691057 1613475 1792259 1856416 1769861
12850 1769861 1671217 1716743 1605267 1559878 1644585 1738014 1750691 1649231 1505473 1593763 1586156
12839 1586156 1705223 1751667 1691811 1680405 1666191 1679750 1673098 1657090 1590992 1641573 1688146
12828 1688146 1676471 1655816 1713131 1675309 1749080 1977921 2043462 1955162 1813781 1751322 1676000
12817 1676000 1724363 1790451 1768452 1877605 1931425 1992776 1949273 1934982 2051678 2047314 1988793
12806 1988793 2048333 1975042 2006521 2058122 1975484 1981471 2086792 2212654 2171879 2149178 2180372
12795 2180372 2217127 2243688 2221629 2168591 2231495 2204568 2205534 2212556 2310050 2341063 2307920 2340537
$$ packed form
12873A330251O478J0102Q556J1562m9724P7176p2854O0293O3696K0015m983n0046
12861A410522P115j7859J64909J12767J5827N5518n7742p7582J78784O4157q6555
12850A769861r8644M5526j11476m5389Q4707R3429J2677j01460j43758Q8290p607
12839A586156J19067M6444n9856j1406j4214J3559o652j6008o6098N0581M6573
12828A688146j1675k0655N7315l7822P3771K28841O5541q8300j41381o2459p5322
12817A676000M8363O6088k1999J09153N3820O1351m3503j4291J16696m364n8521
12806A988793N9540p3291L1479N1601q2638N987J05321J25862m0775k2701L1194
12795B180372L6755K6561k2059n3038O2904k6927R66P022R7494L1013l3143L2617
$$ plain form
12783 2340537 2464922 2375804 2387563 2332227 2351583 2465641 2387932 2306591 2391549 2574540 2553686
12772 2553686 2527691 2664607 2780451 2720155 2673654 2695801 2746244 2769434 2714827 2582041 2512852
12761 2512852 2553029 2705476 2866610 2887851 2849786 2863715 2848480 2871344 2970702 2969810 3000937
12750 3000937 2937286 3024596 3089215 2979144 2901205 3059777 3197367 3119715 3173741 3325958
12740 3325958 3303382 3149582 3113558 3166351 3225942 3162548 3127044 3105904 3077968 3134044 3199905
12729 3199905 3304675 3425793 3371001 3382995 3526588 3621051 3812798 3888561 3930791 3949780
12719 3949780 3810318 3705653 3700675 3719003 3747755 3670923 3785149 3857757 3789729 3724363 3827121
12708 3827121 3892452 3835698 3921661 3982737 4052418 4193365 4395493 4395284 4401481 4269488 4145250
$$ packed form
12783B340537J24385q9118J1759n5336J9356J14058p7709q1341Q4958J82991k0854
12772B553686k5995J36916J15844o0296m6501K2147N0443K3190n4607j32786o9189
12761B512852M0177J52447J61134K1241l8065J3929j5235K2864R9358q92L1127
12750C000937o3651Q7310O4619j10071p7939J58572J37590p7652N4026J52217
12740C325958k2576j53800l6024N2793N9591o3394l5504k1140k7936N6076O5861
12729C199905J04770J21118n4792J1994J43593R4463J91747P5763M2230J8989
12719C949780j39462j04665m978J8328K8752p6832J14226P2608o8028o5366J02758
12708C827121O5331n6754Q5963O1076O9681J40947K02128k09O197j31993j24238
$$ plain form
12697 4145250 4314847 4432725 4496132 4520340 4624708 4577065 4551043 4607714 4546900 4508653 4631650
12686 4631650 4693556 4674478 4743854 4733292 4815345 4854250 4912604 4997521 4993524 5137395 5166040
12675 5166040 5235391 5285867 5301410 5289777 5331731 5288218 5346677 5392957 5379250 5482009 5582908
12664 5582908 5569194 5585755 5749813 5811952 5807695 5844020 5921519 5951270 5863169 5922929 6052342
12653 6052342 6022586 5991397 6086775 6257032 6410521 6607833 6681457 6700291 6770976 6825756 6856089
12642 6856089 6898572 6917884 7006010 7242546 7322420 7187583 7152490 7332533 7444679 7528349
12632 7528349 7618432 7705770 7767774 7782347 7839685 7984515 8086246 8116751 8167127 8269221 8363647
12621 8363647 8497467 8728514 8866346 8915541 8951603 9141130 9289053 9399754 9423964 9492047
$$ packed form
12697D145250J69597J17878O3407K4208J04368m7643k6022N6671o0814l8247J22997
12686D631650O1906j9078O9376j0562Q2053L8905N8354Q4917l997J43871K8645
12675E166040O9351N0476J5543j1633M1954m3513N8459M6280j3707J02759J00899
12664E582908j3714J6561J64058O2139m257L6325P7499K9751q8101N9760J29413
12653F052342k9756l1189R5378J70257J53489J97312P3624J8834P0685N4780L0333
12642F856089M2483J9312Q8126K36536P9874j34837l5093J80043J12146Q3670
12632G528349R0083Q7338O2004J4573N7338J44830J01731L0505N0376J02094R4426
12621H363647J33820K31047J37832M9195L6062J89527J47923J10701K4210O8083
$$ plain form
12611 9492047 9682663 9996884 10136701 10125826 10102126 10240593 10309022 10332678 10432534 10629838
12601 10629838 10796032 10984886 11243300 11336871 11373854 11464527 11585082 11787888 11923924 12097265
12591 12097265 12276529 12354768 12424899 12542602 12632190 12828622 12974659 13195482 13446859 13808404
12581 13808404 13951537 14104950 14318528 14593660 14834482 15006859 15095785 15221432 15491332
$$ packed form
12611I492047J90616L14221J39817j0875k3700J38467O8429K3656R9856J97304
12601A0629838J66194J88854K58414R3571L6983R0673J20555K02806J36036J73341
12591A2097265J79264P8239P0131J17703Q9588J96432J46037K20823K51377L61545
12581A3808404J43133J53413K13578K75132K40822J72377Q8926J25647K69900
$$ [...]
##END NTUPLES=NMR SPECTRUM
##END=
