##TITLE=Analysis number 318402
Compound Code cc 25104
Book Reference 442/184
Project Code adrs
Chemist Name miguelg
##JCAMPDX= 6.0         $$ Bruker NMR JCAMP-DX V2.0
##DATA TYPE= NMR SPECTRUM
##DATA CLASS= NTUPLES
##ORIGIN= Bruker BioSpin GmbH
##OWNER= nmr
$$ XWIN-NMR		Version 3.5
$$ Tue Mar 28 11:00:49 2006 GMT Daylight Time (UT+1h)  MAYBRIDGE\nmr@NMR_250MHZ
##.OBSERVE FREQUENCY= 250.131544655141
##.OBSERVE NUCLEUS= ^1H
##.ACQUISITION MODE= SIMULTANEOUS (DQD)
##.ACQUISITION SCHEME= undefined
##.AVERAGES= 16
##.DIGITISER RES= 18
##SPECTROMETER/DATA SYSTEM= dpx250
##.PULSE SEQUENCE= zg30
##.SOLVENT NAME= CDCl3
##.SHIFT REFERENCE= (INTERNAL, CDCl3, 0, 16.522)
##AUDIT TRAIL= $$ (NUMBER, WHEN, WHO, WHERE, WHAT)
$$ ##TITLE= Audit trail, XWIN-NMR		Version 3.5
$$ ##JCAMPDX= 5.01
$$ ##ORIGIN= Bruker BioSpin GmbH
$$ ##OWNER= nmr
$$ C:\u/data/dgb/nmr/ADRS/1550/pdata/1/auditp.txt
$$ ##AUDIT TRAIL=  $$ (NUMBER, WHEN, WHO, WHERE, WHAT)
(   1,<2006-03-28 11:00:28.94 +100>,<MAYBRIDGE\nmr>,<NMR_250MHZ>,
      <created by zg, POWCHK disabled, PULCHK disabled
       configuration hash MD5:
       84 BC 41 DB A1 6E 1D 46 DA 25 12 A5 C1 ED C5 3A
       data hash MD5: 64K
       2A 89 7B 4C 5C 12 58 F2 74 CE FE 93 85 22 19 26>)
(   2,<2006-03-28 11:00:42.02 +100>,<MAYBRIDGE\nmr>,<NMR_250MHZ>,
      <Start of raw data processing
       ef LB = 0.3 FT_mod = 6 PKNL = 1 SI = 32K 
       data hash MD5: 32K
       17 3B AF CE 8B 82 09 9C A4 96 C1 70 93 72 2B 06>)
(   3,<2006-03-28 11:00:43.55 +100>,<MAYBRIDGE\nmr>,<NMR_250MHZ>,
      <apk 
       data hash MD5: 32K
       9D A5 76 8B 2E E6 52 40 44 55 DF 7D 73 FF A6 B5>)
(   4,<2006-03-28 11:00:44.50 +100>,<MAYBRIDGE\nmr>,<NMR_250MHZ>,
      <abs ABSG = 5 
       data hash MD5: 32K
       12 F7 E2 F5 75 61 D5 73 49 CA 9D 48 BC AF 80 7E>)
$$ ##END=
$$ 
$$ hash MD5
$$ A6 88 65 11 17 E6 BA B2 83 99 9B BB FC 7A FA B3
##$RELAX= 
##$RELAX= 
##$RELAX= 
##$RELAX= 
##$RELAX= 
##$RELAX= 
##$RELAX= 
$$ Bruker specific parameters
$$ --------------------------
##$DU= <C:\u>
##$EXPNO= 1550
##$NAME= <ADRS>
##$PROCNO= 1
##$TYPE= <nmr>
##$USER= <dgb>
##$AMP= (0..31)
100 100 100 100 100 100 100 100 100 100 100 100 100 100 100 100 100 100 
100 100 100 100 100 100 100 100 100 100 100 100 100 100 
##$AQSEQ= 0
##$AQ_mod= 3
##$AUNM= <au_zg>
##$AUTOPOS= <11 >
##$BF1= 250.13
##$BF2= 250.13
##$BF3= 250.13
##$BF4= 250.13
##$BF5= 500.13
##$BF6= 500.13
##$BF7= 500.13
##$BF8= 500.13
##$BYTORDA= 1
##$CFDGTYP= 0
##$CFRGTYP= 5
##$CHEMSTR= <none>
##$CNST= (0..31)
1 1 145 1 1 1 1 1 1 1 1 1 1 1 1 1 1 1 1 1 1 1 1 1 1 1 1 1 1 1 1 1 
##$CPDPRG= <>
##$CPDPRG1= <>
##$CPDPRG2= <>
##$CPDPRG3= <>
##$CPDPRG4= <mlev>
##$CPDPRG5= <mlev>
##$CPDPRG6= <mlev>
##$CPDPRG7= <mlev>
##$CPDPRG8= <mlev>
##$CPDPRGB= <>
##$CPDPRGT= <>
##$D= (0..31)
0 1 0 0 0 0 0 0 0 0.06 0 0 0 0 0 0 0.0002 0 0 0 0 0 0 0 0 0 0 0 0 0 0 
0 
##$DATE= 1143540027
##$DBL= (0..7)
120 120 120 120 120 120 120 120 
##$DBP= (0..7)
150 150 150 150 150 150 150 150 
##$DBP07= 0
##$DBPNAM0= <>
##$DBPNAM1= <>
$$ [...]
##$SUBNAM7= <"">
##$SUBNAM8= <"">
##$SUBNAM9= <"">
##$SW= 20.6930455092707
##$SWIBOX= (0..15)
0 0 3 0 0 0 0 0 0 0 0 0 0 0 0 0 
##$SW_h= 5175.983436853
##$TD= 65536
##$TD0= 1
##$TE= 294.16
##$TE2= 300
##$TE3= 300
##$TEG= 300
##$TL= (0..7)
0 120 120 120 120 120 120 120 
##$TP= (0..7)
150 150 150 150 150 150 150 150 
##$TP07= 0
##$TPNAME0= <>
##$TPNAME1= <>
##$TPNAME2= <>
##$TPNAME3= <>
##$TPNAME4= <>
##$TPNAME5= <>
##$TPNAME6= <>
##$TPNAME7= <>
##$TPOAL= (0..7)
0.5 0.5 0.5 0.5 0.5 0.5 0.5 0.5 
##$TPOFFS= (0..7)
0 0 0 0 0 0 0 0 
##$TUNHIN= 0
##$TUNHOUT= 0
##$TUNXOUT= 0
##$USERA1= <user>
##$USERA2= <user>
##$USERA3= <user>
##$USERA4= <user>
##$USERA5= <user>
##$V9= 5
##$VALIST= <valist>
##$VCLIST= <CCCCCCCCCCCCCCC>
##$VD= 0
##$VDLIST= <DDDDDDDDDDDDDDD>
##$VPLIST= <PPPPPPPPPPPPPPP>
##$VTLIST= <TTTTTTTTTTTTTTT>
##$WBST= 1024
##$WBSW= 4
##$XGAIN= (0..3)
0 0 0 0 
##$XL= 0
##$YL= 0
##$YMAX_a= 461564
##$YMIN_a= -509787
##$ZGOPTNS= <>
##$ZL1= 120
##$ZL2= 120
##$ZL3= 120
##$ZL4= 120
##$ABSF1= 16.522
##$ABSF2= -4.171173
##$ABSG= 5
##$ABSL= 3
##$ALPHA= 0
##$AQORDER= 0
##$ASSFAC= 0
##$ASSFACI= 0
##$ASSFACX= 0
##$ASSWID= 0
##$AUNMP= <proc_1d>
##$AZFE= 0.1
##$AZFW= 0.1
##$BCFW= 0
##$BC_mod= 0
##$BYTORDP= 0
##$COROFFS= 0
##$CY= 12.5
##$DATMOD= 1
##$DC= 0
##$DFILT= <>
##$DTYPP= 0
##$F1P= 14.0000005364418
##$F2P= -0.99999901652339
##$FCOR= 0.5
##$FTSIZE= 32768
##$FT_mod= 6
##$GAMMA= 0
##$GB= 0
##$INTBC= 1
##$INTSCL= 1
##$ISEN= 128
##$LB= 0.3
##$LEV0= 0
##$LPBIN= 0
##$MAXI= 10000
##$MC2= 0
##$MEAN= 0
##$ME_mod= 0
##$MI= 0
##$NCOEF= 0
##$NC_proc= -2
##$NLEV= 6
##$NOISF1= 0
##$NOISF2= 0
##$NSP= 0
##$NTH_PI= 0
##$NZP= 0
##$OFFSET= 16.522
##$PC= 1
##$PHC0= 175.8649
##$PHC1= 5.52323
##$PH_mod= 1
##$PKNL= yes
##$PPARMOD= 0
##$PSCAL= 4
##$PSIGN= 0
##$REVERSE= no
##$SF= 250.13
##$SI= 32768
##$SIGF1= 0
##$SIGF2= 0
##$SINO= 400
##$SIOLD= 32768
##$SREGLST= <1H.CDCl3>
##$SSB= 0
##$STSI= 32768
##$STSR= 0
##$SW_p= 5175.98343685301
##$SYMM= 0
##$S_DEV= 0
##$TDeff= 65536
##$TDoff= 0
##$TI= <Analysis number 999999
Compound Code 99
Book Reference 9
Project Code 9>
##$TILT= no
##$TM1= 0
##$TM2= 0
##$TOPLEV= 0
##$USERP1= <user>
##$USERP2= <user>
##$USERP3= <user>
##$USERP4= <user>
##$USERP5= <user>
##$WDW= 1
##$XDIM= 32768
##$YMAX_p= 354299510
##$YMIN_p= -150765
$$ End of Bruker specific parameters
$$ ---------------------------------
##NTUPLES= NMR SPECTRUM
##VAR_NAME=  FREQUENCY,     SPECTRUM/REAL,   SPECTRUM/IMAG
##SYMBOL=    X,             R,               I
##VAR_TYPE=  INDEPENDENT,   DEPENDENT,       DEPENDENT
##VAR_FORM=  AFFN,          ASDF,            ASDF
##VAR_DIM=   32768,         32768,           32768
##UNITS=     HZ,            ARBITRARY UNITS, ARBITRARY UNITS
##FACTOR=    0.157963299565203, 1,           1
##FIRST=     4132.6476996994, 0,             0
##LAST=      -1043.33573715361, 0,           0
##MIN=       -1043.33573715361, -150765,     0
##MAX=       4132.6476996994, 354299510,     0
$$ Real data points
##PAGE= N=1
##DATA TABLE= (X++(R..R)), XYDATA
$$ [...]
$$ plain form
18895 -43195 -53140 -30554 11065 33738 42026 31204 36009 49200 52822 25934 24980 38125 47845
18882 47845 62519 67993 67568 76700 64312 65396 77200 87099 80304 57939 51573 73435 70386
18869 70386 26757 15133 13393 12961 6706 -6690 4077 15267 29304 31128 27498 38617 31117
18856 31117 25167 30947 29496 31949 49814 61271 65100 50982 45125 57214 51657 15296 24046
18843 24046 55101 42842 26315 57022 98262 88893 65075 53537 49985 42668 36438 56042
18831 56042 78459 96561 115404 124117 128828 128978 143931 154549 160814 145076 119966 119363 113672
18818 113672 111141 119155 133462 130853 132661 134715 136605 124666 132832 156376 162143 172046 181415
18805 181415 179983 176144 184790 203870 208874 209565 208585 208553 223527 228159 247267 260408 262412 305173
$$ packed form
18895d3195r945K2586M1619K2673Q288j0822M805J3191L622k6888r54J3145R720
18882D7845J4674N474m25R132j2388J084J1804R899o795k2365o366K1862l049
18869G0386m3629j1624j740m32o255j3396J0767J1190J4037J824l630J1119p500
18856C1117n950N780j451K453J7865J1457L829j4118n857J2089n557l6361Q750
18843B4046L1055j2259j6527L0707M1240r369k3818j1538l552p317o230J9604
18831E6042K2417J8102J8843Q713M711J50J4953J0618O265j5738k5110o03n691
18818A13672k531Q014J4307k609J808K054J890j1939Q166K3544N767R903R369
18805A81415j432l839Q646J9080N004O91r80l2J4974M632J9108J3141K004M2761
$$ plain form
18791 305173 351031 414190 504237 610042 734447 862429 937799 972877 962878 937370 944871
18780 944871 978349 1027085 1094119 1129249 1105701 1048391 996325 985188 996680 1008823 1058455
18769 1058455 1107309 1158013 1206012 1266160 1362737 1515123 1663525 1747295 1797524 1844182 1953832
18758 1953832 2137054 2386857 2680893 3022578 3455206 4044817 4767430 5660817 6849837
18749 6849837 8454091 10696813 13955631 18886622 26510431 37786353 52763501 69717690
18741 69717690 84787044 93334420 92937861 83803297 68947890 52974154 39181833 28873982
18733 28873982 21743857 16838693 13383376 10873994 8989273 7542697 6457700 5595530
18725 5595530 4899578 4339489 3866201 3467071 3131684 2841960 2586431 2355448 2159614
$$ packed form
18791C05173M5858O3159R0047J05805J24405J27982P5370L5078r999k5508P501
18780I44871L3478M8736O7034L5130k3548n7310n2066j1137J1492J2143M9632
18769A058455M8854N0704M7999O0148R6577J52386J48402Q3770N0229M6658J09650
18758A953832J83222K49803K94036L41685M32628N89611P22613Q93387J189020
18749F849837J604254K242722L258818M930991P623809J1275922J4977148J6954189
18741F9717690J5069354Q547376l96559r134564j4855407j5973736j3792321j0307851
18733B8873982p130125m905164l455317k509382j884721j446576j084997q62170
18725E595530o95952n60089m73288l99130l35387k89724k55529k30983j95834
$$ plain form
18716 2159614 1993816 1868168 1756928 1650642 1583565 1527453 1477664 1446662 1416951 1380423
18706 1380423 1339351 1289417 1265598 1275807 1263218 1208647 1128160 1044639 959465 900491 895210
18695 895210 924454 945012 984268 978059 929047 849868 754035 658606 583785 498515 424156 388336
18683 388336 363921 330163 285348 273093 272036 284174 258850 230949 224655 227830 238986 257173
18671 257173 248599 216908 212205 180336 151301 140649 156940 149688 155873 168904 170911 146334
18659 146334 147063 129280 112374 112487 117122 88579 69766 76664 93880 90848 81894 59943 59221
18646 59221 70061 62459 73329 103604 108855 93286 67488 65615 79406 93480 100733 91846 85680
18633 85680 111007 113501 84845 59349 55852 62553 56041 56712 63060 78255 72671 84596 97364
$$ packed form
18716B159614j65798j25648j11240j06286o7077n6112m9789l1002k9711l6528
18706A380423m1072m9934k3819J0209j2589n4571q0487q3521q5174n8974n281
18695H95210K9244K0558L9256o209m9012p9179r5833r5429p4821q5270p4359l5820
18683C88336k4415l3758m4815j2255j057J2138k5324k7901o294L175J1156J8187
18671B57173q574l1691m703l1869k9035j0652J6291p252O185J3031K007k4577
18659A46334P29j7783j6906J13M635k8543j8813O898J7216l032q954k1951p22
18646E9221J0840p602J0870L0275N251j5569k5798j873J3791J4074P253q887o166
18633H5680K5327K494k8656k5496l497O701o512O71O348J5195n584J1925J2768
$$ plain form
18620 97364 88632 93478 102063 114515 123208 137624 129801 102090 77366 61335 71769 72304 57977
18607 57977 34725 12430 41 -11822 2799 13096 17511 22204 37521 41609 24444 -6803
18595 -6803 -13137 4327 38927 44952 22978 13411 15061 23129 43823 57399 77010 85956 91342
18582 91342 113611 147786 146894 135896 122632 105526 95581 68812 45848 46716 48179 42488 27608
18569 27608 -1444 -18153 -25314 9381 25415 27722 31465 29956 30095 26230 13655 4761 -19673
18556 -19673 -20787 5558 27170 49762 50349 46703 38482 40481 43181 58291 53555 34360 12208
18543 12208 -7964 301 -10418 -24705 -22287 -11264 6736 13494 17617 26517 35800 41927 21471
18530 21471 7312 -4698 8092 17045 24359 20024 41285 45934 27764 32042 35910 14486 42042
$$ packed form
18620I7364q732M846Q585J2452Q693J4416p823k7711k4724j6031J0434N35j4327
18607E7977k3252k2295j2389j1863J4621J0297M415M693J5317M088j7165l1247
18595f803o334J7464L4600O025k1974r567J650Q068K0694J3576J9611Q946N386
18582I1342K2269L4175q92j0998j3264j7106r945k6769k2964Q68J463n691j4880
18569B7608k9052j6709p161L4695J6034K307L743j509J39l865j2575q894k4434
18556a9673j114K6345K1612K2592N87l646q221J999K700J5110m736j9195k2152
18543A2208k0172Q265j0719j4287K418J1023J8000O758M123Q900R283O127k0456
18530B1471j4159j2010J2790Q953P314m335K1261M649j8170M278L868k1424K7556
$$ plain form
18517 42042 39360 29023 17542 -2755 10798 36757 24627 10285 -6252 -8696 -306 9968
18505 9968 27302 33735 24057 18606 -3363 -4125 -2638 -1846 6449 1014 -904 -10643 -11806 -2344 7337
18490 7337 -9934 -22208 -20532 -3432 20333 27598 1429 14803 28949 19716 3691 -6371
18478 -6371 -12654 -34382 -55818 -37662 -25905 4404 3725 17276 22560 25110 27625 17811 10358
18465 10358 21689 48446 43310 18674 11527 10139 913 -32623 -24361 -17304 -9940 16305 28421
18452 28421 41809 31550 24146 16013 12607 10227 -14098 -19352 -9623 -34810 -20967 1279 11064
18439 11064 26049 12814 11174 -11516 -7207 2942 15374 27573 25601 17569 8542 8493 13468
18426 13468 8354 1803 -7545 -29847 -51261 -23309 -11985 5787 -5176 -15444 -16145 13318 31098
$$ packed form
18517D2042k682j0337j1481k0297J3553K5959j2130j4342j6537k444Q390J0274
18505I968J7334O433r678n451k1969p62J487P92Q295n435j918r739j163R462R681
18490G337j7271j2274J676J7100K3765P265k6169J3374J4146r233j6025j0062
18478f371o283k1728k1436J8156J1757L0309o79J3551N284K550K515r814p453
18465A0358J1331K6757n136k4636p147j388r226l3536Q262P057P364K6245J2116
18452B8421J3388j0259p404q133l406k380k4325n254R729k5187J3843K2246R785
18439A1064J4985j3235j640k2690M309J0149J2432J2199j972q032r027m9M975
18426A3468n114o551r348k2302k1414K7952J1324J7772j0963j0268p01K9463J7780
$$ plain form
18413 31098 31896 7977 -9978 -19424 -26186 -31545 -15476 15785 27304 14691 25987 36837 40795
18400 40795 45196 1091 895 25846 15871 -11981 -14854 -21461 -5458 23282 17281 40806 39263
18387 39263 30201 42299 41087 54505 55841 30264 26980 36196 36098 28528 16772 18019 -8501 -12949
18373 -12949 12518 38179 27154 19243 14323 4411 -13556 -8237 2292 -3864 2011 7460 -1138
18360 -1138 -22572 -25317 -25477 -37265 -39207 -43375 -20281 -1177 14023 17854 37514 39553 10872
18347 10872 1090 10530 21581 16503 13458 21810 13869 513 -8492 -19332 -3674 9935 11744
18334 11744 -3181 7134 19825 24444 30127 30182 -14685 -31261 -18027 -4975 -10612 -5274 -3707
18321 -3707 5543 2846 2838 -291 -3086 662 -6351 -11602 -1334 -8995 -12716 -16943 -24463 -13493 -8523
$$ packed form
18413C1098P98k3919j7955r446o762n359J6069L1261J1519j2613J1296J0850L958
18400D0795M401m4105j96K4951r975k7852k873o607J6003K8740o001K3525j543
18387C9263r062J2098j212J3418J336k5577l284R216r8p570j1756J247k6520m448
18373a2949K5467K5661j1025p911m920r912j7967N319J0529o156N875N449q598
18360a138k1434k745j60j1788j942m168K3094J9104J5200L831J9660K039k8681
18347A0872r782R440J1051n078l045Q352p941j3356r005j0840J5658J3609J809
18334A1744j4925J0315J2691M619N683N5m4867j6576J3234J3052n637N338J567
18321c707R250k697ql129k795L748p013n251J0268p661l721m227p520J0970M970
$$ plain form
18306 -8523 88 13584 28790 30720 39988 48630 41244 15088 13929 36831 50200 4895 -21676
18293 -21676 -24439 8663 13909 32273 42205 23178 9804 -3807 -2216 -11391 -17554 -31065 -36698
18280 -36698 -28042 -22764 -43548 -37740 -23908 -4959 -8681 -3795 18115 35229 22002 -4011 -25655
18267 -25655 -27737 -39356 -38061 -18555 -18869 -18124 -31226 -22798 970 13257 13770 20220 26934 22608
18253 22608 3898 10848 11732 2285 7094 4954 -11459 12317 11331 -5780 -9820 4400 10911 21985
18239 21985 27905 11750 -2102 -28048 -26758 -16728 -1741 -11895 -37980 -46813 -56258 -32599
18227 -32599 11486 35346 23808 956 304 13625 13414 2650 4991 -16262 -21719 -12441 -24969
18214 -24969 -21668 -19420 -16117 12123 48922 61711 58668 74928 71072 47016 29372 10600 4470
$$ packed form
18306h523Q611J3496J5206J930R268Q642p386k6156j159K2902J3369m5305k6571
18293b1676k763L3102N246J8364R932j9027j3374j3611J591r175o163j3511n633
18280c6698Q656N278k0784N808J3832J8949l722M886K1910J7114j3227k6013k1644
18267b5655k082j1619J295J9506l14P45j3102Q428K3768J2287N13O450O714m326
18253B2608j8710O950Q84r447M809k140j6413K3776r86j7111m040J4220O511J1074
18239B1985N920j6155j3852k5946J290J0030J4987j0154k6085q833r445K3659
18227c2599M4085K3860j1538k2852o52J3321k11j0764K341k1253n457R278j2528
18214b4969L301K248L303K8240L6799J2789l043J6260l856k4056j7644j8772o130
$$ plain form
18201 4470 -3003 -19499 -22061 -14904 -15088 -20377 -17082 13937 32720 10050 18116 16947 13210 13211 23215
18186 23215 43324 28447 10665 21819 29784 36453 11998 -11372 -5052 22906 27865 17128
18174 17128 -1092 -12354 -19907 2923 3387 5889 -2273 12879 41965 59229 52738 68065 56313
18161 56313 49728 47481 51372 34462 45691 68073 64963 62816 63266 66795 98312 100527 100121 104983
18147 104983 104502 99939 106849 149499 185455 233562 312790 390867 490272 566294 597716 586639
18135 586639 576540 513878 437324 391259 335564 323514 339566 355236 340060 350827 355033 357138
18123 357138 389333 424907 475800 573252 687111 787042 871506 1021862 1216906 1483925 1800971
18112 1800971 2278405 3005824 4120929 5998840 9513484 16491696 28911842 41566042
$$ packed form
18201D470p473j6496k562P157j84n289L295L1019J8783k2670Q066j169l737JJ0004
18186B3215K0109j4877j7782J1154P965O669k4455k3370O320K7958M959j0737
18174A7128j8220j1262p553K2830M64K502q162J5152K9086J7264o491J5327j1752
18161E6313o585k247L891j6910J1229K2382l110k147M50L529L1517K215m06M862
18147A04983m81m563O910M2650L5956M8107P9228P8077R9405P6022L1422j1077
18135E86639j0099o2662p6554m6065n5695j2050J6052J5670j5176J0767M206K105
18123C57138L2195L5574N0893R7452J13859R9931Q4464J50356J95044K67019L17046
18112A800971M77434P27419J115105J877911L514644O978212J2420146J2654200
$$ plain form
18104 41566042 41850203 30021646 18216958 11404568 7846335 5747044 4366268 3417077
18096 3417077 2745191 2261732 1884907 1609700 1373852 1185094 1042917 964433 885993 807794
18086 807794 742850 665044 570322 516058 480101 428342 392980 379526 364060 347215 332225
18075 332225 310658 272077 242418 208700 196732 199351 175746 169952 162841 135779 88197 70021
18063 70021 52996 54131 47741 70110 88698 84944 49366 69654 82516 45080 29638 48610
18051 48610 59854 78160 95761 96063 71411 61242 71732 74716 65733 51847 40573 13244
18039 13244 20516 32924 53887 55453 43519 20490 17502 18037 13386 11200 -3898 -19382 14220
18026 14220 38628 35647 31077 36723 13374 -10708 -16820 6600 15429 15595 32586 40777 43106
$$ packed form
18104D1566042K84161j1828557j1804688o812390l558233k099291j380776r49191
18096C417077o71886m83459l76825k75207k35848j88758j42177p8484p8440p8199
18086H07794o4944p7806r4722n4264l5957n1759l5362j3454j5466j6845j4990
18075C32225k1567l8581k9659l3718j1968K619k3605n794p111k7062m7582j8176
18063G0021j7025J135o390K2369J8588l754l5578K0288J2862l7436j5442J8972
18051D8610J1244J8306J7601L02k4652j0169J0490K984q983j3886j1274k7329
18039A3244P272J2408K0963J566j1934k3029k988N35m651k186j5098j5484L3602
18026A4220K4408k981m570N646k3349k4082o112K3420Q829J66J6991Q191K329
$$ plain form
18013 43106 40216 24552 20761 22918 24088 29733 13958 10288 28605 40031 22169 9120 7730
18000 7730 24556 32788 37847 43522 41021 37251 59637 61826 49319 54231 54445 48413 32406 30219
17986 30219 38811 26332 8923 25937 44763 37503 19366 6391 -3496 275 2998 -16307 -27432
17973 -27432 -24193 -3035 1904 -250 -6492 -32872 -27818 -16653 -13745 -28951 -16796 14547 33237
17960 33237 19966 22193 21214 14387 1726 6841 -6755 -1259 2144 5702 2600 7583 9325 11120
17946 11120 23362 21922 30847 27659 9879 25116 41701 48167 44511 29830 31239 28030 27792
17933 27792 17054 -12940 12018 27825 18361 16521 23975 6005 -9051 -26374 -43752 -30866
17921 -30866 -2360 26316 38170 38542 51426 51651 20388 21229 24036 15905 9430 4422 -7934 -8419
$$ packed form
18013D3106k890j5664l791K157J170N645j5775l670J8317J1426j7862j3049j390
18000G730J6826Q232N059N675k501l770K2386K189j2507M912K14o032j6007k187
17986C0219Q592j2479j7409J7014J8826p260j8137j2975r887L771K723j9305j1125
17973b7432L239K1158M939k154o242k6380N054J1165K908j5206J2155L1343J8690
17960C3237j3271K227r79o827j2661N115j3596N496L403L558l102M983J742J795
17946A1120J2242j440Q925l188j7780J5237J6585O466l656j4681J409l209k38
17933B7792j0738k9994K4958J5807r464j840P454j7970j5056j7323j7378J2886
17921c0866K8506K8676J1854L72J2884K25l1263Q41K807q131o475n008j2356m85
$$ plain form
17907 -8419 -11187 -1331 13847 20087 34890 29034 11518 11591 4538 -20747 -38970 -55476 -49879 -18177
17893 -18177 26449 24237 11401 8355 22064 17439 8381 7927 31580 34563 43005 35578 8199
17880 8199 2916 14164 -3330 -11514 -622 -19285 -16848 -15634 -23550 -5174 -5941 -28783 -9647
17867 -9647 13589 -1794 975 8902 -17693 -23245 847 4327 -2490 3529 17267 19808 26780
17854 26780 11092 2967 20101 22291 19580 22072 34632 33639 35459 30416 8368 21107 20703 -4194
17840 -4194 -16073 -8902 7245 15988 -2064 -4583 -7165 -12379 -12606 -12453 -21048 -28301 -31369 -52070
17826 -52070 -44684 -42892 -47564 -20922 1322 3805 18157 26202 14893 11743 31788 15284 1678
17813 1678 -1995 -1117 5863 7447 10334 3578 9683 10357 -13792 892 16385 25699 44359 26737
$$ packed form
17907h419k768R856J5178O240J4803n856j7516P3p053k5285j8223j6506N597L1702
17893a8177M4626k212j2836l046J3709m625r058m54K3653K983Q442p427k7379
17880H199n283J1248j7494q184J0892j8663K437J214p916J8376p67k2842J9136
17867i647K3236j5383K769P927k6595n552K4092L480o817O019J3738K541O972
17854B6780j5688q125J7134K190k711K492J2560r93J820n043k2048J2739m04k4897
17840d194j1879P171J6147Q743j8052k519k582n214k27J53q595p253l068k0701
17826e2070P386J792m672K6642K2244K483J4352Q045j1309l150K0045j6504j3606
17813A678l673Q78O980J584K887o756O105O74k4149J4684J5493R314J8660j7622
$$ plain form
17799 26737 8332 -140 4761 991 -4088 1327 9875 10839 26162 24794 27968 30729 39257 62720
17785 62720 32214 -3158 -17450 -24729 -10478 -2343 9988 2057 -6360 -484 16740 14253 -4910
17772 -4910 -13632 -4003 1519 2666 24727 7682 -18349 -32488 -27168 -1485 32889 8901 -3360
17759 -3360 19727 40567 41735 24092 -1453 -16074 -16631 -28144 -16730 2072 7928 4117 -5131
17746 -5131 -5501 -15029 3207 6151 11783 -11271 -34655 -38405 -52497 -74298 -79261 -56245 -29527
17733 -29527 -23681 -20993 -19597 -1542 -9264 -17403 -22777 5996 17942 11267 4381 2551 6084 9705
17719 9705 -1551 -6140 345 15201 13684 17150 23286 25188 38486 65116 50263 29312 23988
17706 23988 22400 24187 4578 -27894 -32894 -20284 -38693 -34793 -20957 -25059 -18333 7511 -531
$$ packed form
17799B6737j8405q472M901l770n079N415Q548R64J5323j368L174K761Q528K3463
17785F2720l0506l5372j4292p279J4251Q135J2331p931q417N876J7224k487j9163
17772d910q722R629N522J147K2061j7045k6031j4139N320K5683L4374k3988j2261
17759c360K3087K0840J168j7643k5545j4621n57j1513J1414J8802N856l811r248
17746e131l70r528J8236K944N632k3054k3384l750j4092k1801m963K3016K6718
17733b9527N846K688J396J8055p722q139n374K8773J1946o675o886j830L533L621
17719I705j1256m589O485J4856j517L466O136J902J3298K6630j4853k0951n324
17706B3988j588J787j9609l2472n000J2610j8409L900J3836m102O726K5844q042
$$ plain form
17693 -531 5884 13921 8838 18700 8652 777 -3409 369 -2644 8693 11293 2608 -4324 -5970
17679 -5970 -18566 -20883 -16656 -28376 -22395 -5574 10993 9299 -625 10236 4313 11753 331
17666 331 -10030 -8111 -2206 -6342 -20675 -10321 -9053 -12893 -5866 4425 10985 26060 51196
17653 51196 57043 31536 315 -15519 -21307 -16777 4660 16150 11192 13980 33348 36641 19952
17640 19952 21088 25652 5581 -1379 -8122 3468 12893 -3088 -18203 -7092 -13703 -18867 755
17627 755 22125 24492 6430 -5268 -12560 -9494 -11148 -28403 -28331 -28349 -16078 -12629 -23102 -32299
17613 -32299 -12537 -4460 -12668 -7745 9456 14687 33984 40590 13822 -22570 -27563 -22670 -14621
17600 -14621 -15599 7286 9013 3370 -10573 -27905 -31526 5068 7432 -3474 -2779 -2436 878 -4442
$$ packed form
17693e31O415Q037n083R862j0048p875m186L778l013J1337K600q685o932j646
17679e970j2596k317M227j1720N981J6821J6567j694r924J0861n923P440j1422
17666C31j0361J919N905m136j4333J0354J268l840P027J0291O560J5075K5136
17653E1196N847k5507l1221j5834n788M530K1437J1490m958K788J9368L293j6689
17640A9952J136M564k0071o960o743J1590R425j5981j5115J1111o611n164J9622
17627G55K1370K367j8062j1698p292L066j654j7255P2j8J2271L449j0473r197
17613c2299J9762Q077q208M923J7201N231J9297O606k6768l6392m993M893Q049
17600a4621r78K2885J727n643j3943j7332l621L6594K364j0906O95L43L314n320
$$ plain form
17586 -4442 -2691 -12110 -26662 -12139 -5506 -12261 -23135 -26235 -15041 -30520 -16571 19895 44772
17573 44772 46431 25917 32035 32604 12697 -12069 -11073 -29010 -34086 -30979 -10782 22771 20947
17560 20947 20204 17657 18195 29501 16280 9717 6330 12109 -1560 5508 28356 33655 23164 -8829
17546 -8829 3817 17724 26867 23295 17713 862 19440 30597 9368 20839 5962 -15963
17534 -15963 -12168 -10138 -19103 -32359 -33118 -32023 -18527 -5717 -2579 -6125 -3240 -11147 -10239 -24909
17520 -24909 -32625 -34189 -21631 4651 20344 19449 10265 2172 -873 12048 4710 -7950 -12931
17507 -12931 3830 -2304 12744 10421 529 5899 -13767 588 6280 8455 -1312 15708 24356
17494 24356 15114 24629 47631 83510 98868 150635 181324 151069 111111 58664 18266 1784
$$ packed form
17586d442J751r419j4552J4523O633o755j0874l100J1194j5479J3949L6466K4877
17573D4772J659k0514O118N69j9907k4766R96j7937n076L107K0197L3553j824
17560B0947p43k547N38J1306j3221o563l387N779j3669P068K2848N299j0491l1993
17546h829J2646J3907R143l572n582j6851J8578J1157k1229J1471j4877k1925
17534a5963L795K030q965j3256p59J095J3496J2810L138l546K885p907R08j4670
17520b4909p716j564J2558K6282J5693q95r184q093l045J2921p338j2660m981
17507a2931J6761o134J5048k323r892N370j9666J4355N692K175r767J7020Q648
17494B4356r242R515K3002L5879J5358N1767L0689l0255l9958n2447m0398j6482
$$ plain form
17482 1784 13379 25213 38176 21237 28004 30957 17171 -17616 -36098 -32976 -14135 -9764 -9792
17469 -9792 3673 4401 -3802 11431 26072 16224 9983 7676 -3076 -20583 -19058 874 9743
17456 9743 -9961 -28863 -27633 -7821 8803 18302 8926 35228 39796 32014 35073 23885 799
17443 799 -987 7601 24870 107461 199961 227392 180417 112030 77344 64426 46700 35896
17431 35896 28987 10237 9938 6728 -15097 -14438 28577 36897 33087 18552 -1511 -13727 -14762
17418 -14762 -29444 -6986 7257 3872 -39 12699 32643 29626 21105 28169 31686 38698 9969
17405 9969 -617 -13190 -27857 -44047 -57057 -35882 -5975 -13460 -26465 -20290 -5351 -6013 -20231
17392 -20231 -35211 -51059 -52325 -62856 -41243 -12186 936 7805 15531 22465 36461 58331
$$ packed form
17482A784J1595J1834J2963j6939O767K953j3786l4787j8482L122J8841M371k8
17469i792J3465P28q203J5233J4641r848o241k307j0752j7507J525J9932Q869
17456I743j9704j8902J230J9812J6624R499r376K6302M568p782L059j1188k3086
17443G99j786Q588J7269Q2591R2500K7431m6975o8387l4686j2918j7726j0804
17431C5896o909j8750k99l210k1825O59M3015Q320l810j4535k0063j2216j035
17418a4762j4682K2458J4243l385l911J2738J9944l017q521P064L517P012k8729
17405I969j0586j2573j4667j6190j3010K1175K9907p485j3005O175J4939o62j4218
17392b0231j4980j5848j266j0531K1613K9057J3122O869P726O934J3996K1870
$$ plain form
17380 58331 34612 580 -2042 -9955 -22861 -18217 1575 -6177 -18910 -21127 -15532 5305 4510
17367 4510 -2603 -19672 -28142 -31340 -35156 -21652 -35269 -51409 -43046 -10302 14374 98 -26350
17354 -26350 -39864 -32174 -12833 6675 15468 5623 3315 11422 16248 -352 3105 30177 25559
17341 25559 27579 17697 -764 -18200 -21080 -9101 3782 3927 9561 -15361 -39965 -36425 -26934
17328 -26934 -38500 -30107 -16395 -1377 4522 -11149 -4082 -17695 -30973 -17154 16038 17196
17316 17196 33138 22544 12351 13470 4476 -5512 -21971 -28013 -17465 7284 17136 18726 13381
17303 13381 2461 6515 13131 14302 4992 -4989 271 7287 -9532 -7149 -15114 -17229 -17955 -13312
17289 -13312 -20097 -35369 -31899 -29550 -28429 -18279 -13619 -13145 -23176 -36430 -11595 -9221 2482
$$ packed form
17380E8331k3719l4032k622p913j2906M644J9792p752j2733k217N595K0837p95
17367D510p113j7069q470l198l816J3504j3617j6140Q363L2744K4676j4276k6448
17354b6350j3514P690J9341J9508Q793r845k308Q107M826j6600L457K7072m618
17341B5559K020r882j8461j7436k880J1979J2883J45N634k4922k4604L540R491
17328b6934j1566Q393J3712J5018N899j5671P067j3613j3278J3819L3192J158
17316A7196J5942j0594j0193J119q994r988j6459o042J0548K4749R852J590n345
17303A3381j0920M054O616J171r310r981N260P016j6819K383p965k115p26M643
17289a3312o785j5272L470K349J121J0150M660M74j0031j3254K4835K374J1703
$$ plain form
17276 2482 21217 39636 35198 36944 38838 18233 5125 925 1249 -1358 -1490 14160 -14064 -34744
17262 -34744 -31252 -42059 -53107 -53401 -38800 -18597 -18129 -23511 -11526 -1528 -9584 -10948 -16175 -8547
17248 -8547 -1791 -5618 -12126 -15769 -16199 -21752 -23351 -25773 -7085 15008 30543 35814 35364 18585
17234 18585 15930 12832 16895 20224 10068 -12010 -9064 -3331 -17678 -30435 -36528 -9777 -984
17221 -984 -2232 5340 -1188 -10417 -3431 -10344 -12316 -18743 -24277 -23971 -4293 -2838 -13423 -20664 -34718
17206 -34718 -10961 -26809 -20186 -12327 -27999 -2485 17568 8078 -9410 920 13340 3386
17194 3386 9424 -641 -7188 7154 17694 -4389 -21990 -34641 -32893 -24943 -9399 -23283 -20952
17181 -20952 -4218 -16234 -40942 -47225 -37086 -18054 -20296 -22061 -22603 -7451 -16999 -37842 -24082
$$ packed form
17276B482J8735J8419m438J746J894k0605j3108m200L24k607j32J5650k8224k0680
17262c4744L492j0807j1048k94J4601K0203M68n382J1985R998q056j364n227P628
17248h547O756l827o508l643m30n553j599k422J8688K2093J5535N271m50j6779
17234A8585k655l098M063L329j0156k2078K946N733j4347j2757o093K6751Q793
17221i84j248P572o528r229O986o913j972o427n534L06J9678J455j0585p241j4054
17206c4718K3757j5848O623P859j5672K5514K0053r490j7488J0330J2420r954
17194C386O038j0065o547J4342J0540k2083j7601j2651J748P950J5544j3884K331
17181b0952J6734j2016k4708o283J0139J9032k242j765n42J5152r548k0843J3760
$$ plain form
17168 -24082 5313 14964 13147 19611 31641 18659 -6740 -31474 -26273 -13658 -1041 1288 2348
17155 2348 12285 5608 2195 12702 4717 -22225 -22605 -14774 -7249 185 -96 -16756 -26442 -13590
17141 -13590 -9818 -25660 -23086 -8034 -9040 -10038 -13130 -21026 3701 31579 31172 15312 3057
17128 3057 -12020 -24862 -29566 -19809 -4971 -8307 -810 -3370 -26935 -16610 19134 10739 -27241
17115 -27241 -47947 -40530 -27025 -34359 -33936 -33345 -26180 -15038 -6733 7605 2999 -1595 17943 6508
17101 6508 7916 -4466 -40393 -54084 -24081 10939 -358 14025 7071 -10018 -10219 -18994 -22771
17088 -22771 -10699 -3864 8354 21427 34629 28759 10905 9913 5071 -4166 -3504 -1737 -11371 -19284
17074 -19284 -34472 -32379 -25483 -28391 -24847 -16931 -28054 -47379 -34190 -27261 -38433 -30685 -7672
$$ packed form
17168b4082K9395R651j817O464J2030j2982k5399k4734N201J2615J2617K329J060
17155B348R937o677l413J0507p985k6942l80P831P525P434k81j6660r686J2852
17141a3590L772j5842K574J5052j006r98l092p896K4727K7878m07j5860j2255
17128C057j5077j2842m704R757J4838l336P497k560k3565J0325L5744q395l7980
17115b7241k0706P417J3505p334M23N91P165J1142Q305J4338m606m594J9538j1435
17101F508J408j2382l5927j3691L0003L5020j1297J4383o954j7089k01q775l777
17088b2771J2072O835J2218J3073J3202n870j7854r92m842r237O62J767r634p913
17074a9284j5188K093O896k908L544P916j1123j9325J3189O929j1172P748K3013
$$ plain form
17061 -7672 6567 19763 10395 10602 1773 -15213 -19639 -33202 -26723 -20254 -16391 -10112 -20220 -19421
17047 -19421 -5302 -148 1441 -797 -4725 -1521 5908 -9574 -4901 -212 -6605 -6896 -4466 -2080
17033 -2080 17169 35096 26038 4247 -15767 -6728 -18927 -21427 -18275 -15328 -4477 3308 -12957
17020 -12957 -11067 -14764 -10124 -2345 13253 30870 -1814 -41574 -40207 -46666 -31028 -32339 -51795
17007 -51795 -53132 -26590 -15149 -19382 -4647 9608 -2551 -6513 -17645 -39881 -42390 -36253 -29650
16994 -29650 -31168 -18515 -13927 3596 -4682 -6421 11653 37376 8699 -31052 -22869 1792 -14129
16981 -14129 -33109 -35926 -23229 11363 12031 -14472 -23408 -193 5761 17590 22 -10696 -20197
16968 -20197 -27504 -35791 -34326 -28135 -35778 -24008 -26229 -43755 -48983 -48198 -36846 -27663 -18261 -11458
$$ packed form
17061g672J4239J3196r368K07q829j6986m426j3563O479O469L863O279j0108P99
17047a9421J4119N154J589k238l928L204P429j5482M673M689o393k91K430K386
17033b080J9249J7927r058k1791k0014R039j2199k500L152K947J0851P785j6265
17020a2957J890l697M640P779J5598J7617l2684l9760J367o459J5638j311j9456
17007e1795j337K6542J1441m233J4735J4255j2159l962j1132k2236k509O137O603
16994b9650j518J2653M588J7523q278j739J8074K5723k8677l9751Q183K4661j5921
16981a4129j8980k817J2697L4592O68k6503q936K3215N954J1829j7568j0718r501
16968b0197p307q287J465O191p643J1770k221j7526n228P85J1352R183R402O803
$$ plain form
16954 -11458 -4267 -6167 -28251 -41149 -38864 -28507 -36393 -36762 -16155 7608 9489 -8900 -9180
16941 -9180 -7445 -9723 -3536 -6933 -2664 -17155 -38444 -38243 -28555 -7972 -12100 -8879 -2737 -8922
16927 -8922 -11180 1714 30922 19555 -16219 -5253 -8725 6579 -2427 -18606 -20183 -27248 -5677
16914 -5677 8525 15263 9427 10830 22947 9421 8359 -18897 -25300 -22447 -19122 -11913 714
16901 714 -6039 -13882 -8994 -5914 -6104 -1457 12351 5553 10187 10145 635 1569 -6678 -17334 -4432
16886 -4432 -8454 5513 -2682 -33004 -49663 -32751 -14246 -7700 2908 2761 -5078 -5333 -16725
16873 -16725 -33858 -45495 -30587 -8121 11789 25898 24027 8418 -7323 4131 26371 6018
16861 6018 7244 16270 8913 -1180 19188 39950 23546 3924 -11877 -17446 -18791 -38634 -20961
$$ packed form
16954a1458P191j900k2084j2898K285J0357p886l69K0607K3763J881j8389k80
16941i180J735k278O187l397M269j4491k1289K01R688K0583m128L221O142o185
16927h922k258J2894K9208j1367l5774J0966l472J5304r006j6179j577p065K1571
16914e677J4202O738n836J403J2117j3526j062k7256o403K853L325P209J2627
16901G14o753p843M888L080j90M647J3808o798M634m2r510R34q247j0656J2902
16886d432m022J3967q195l0322j6659J6912J8505O546J0608j47p839k55j1392
16873a6725j7133j1637J4908K2466J9910J4109j871j5609j5741J1454K2240k0353
16861F018J226R026p357j0093K0368K0762j6404j9622j5801n569j345j9843J7673
$$ plain form
16848 -20961 -32584 -13537 -8977 5169 -13622 -40103 -46438 -22995 -6576 -22774 -32843 -40005
16836 -40005 -17372 -5514 -16966 -30170 -35185 -24287 -19381 554 14965 3852 -10193 -27708
16824 -27708 -35976 -40724 -16029 297 501 -1485 5782 19678 9629 -16016 -5427 8372 -5377
16811 -5377 -10061 2289 10843 -4520 -335 23247 43336 52835 45266 21371 -4384 -9033 -4508
16798 -4508 -4852 4244 22473 9220 -2355 3533 7522 31698 34798 34009 20701 -2236 23913
16785 23913 25727 4432 -7380 -3052 19333 10256 -6606 -10109 -12111 -7783 9493 13657 8142
16772 8142 -7894 -9870 -10221 -9413 15023 23754 25510 32314 27523 32568 22715 4174 7553 30840
16758 30840 22177 3051 -4617 -5696 -12959 12196 12655 -133 -5551 -5918 3556 33152 45129 27270
$$ packed form
16848b0961j1623J9047M560J4146j8791k6481o335K3443J6419j6198j0069p162
16836d0005K2633J1858j1452j3204n015J0898M906J9935J4411j1113j4045j7515
16824b7708q268m748K4695J6326K04j986P267J3896j0049k5645J0589J3799j3749
16811e377m684J2350Q554j5363M185K3582K0089R499p569k3895k5755m649M525
16798d508l44R096J8229j3253j1575N888L989K4176L100p89j3308k2937K6149
16785B3913J814k1295j1812M328K2385r077j6862l503k002M328J7276M164n515
16772H142j6036j976l51Q08K4436Q731J756O804m791N045r853j8541L379K3287
16758C0840q663j9126p668j079p263K5155M59j2788n418l67R474K9596J1977j7859
$$ plain form
16744 27270 18496 -4279 -1406 11656 -9471 -19862 -25913 -49834 -34790 -13811 7676 -5029
16732 -5029 -11932 -7414 714 4628 5056 3511 -7616 -6022 -14311 -37105 -31206 -13793 -1355 8178
16718 8178 -10513 -31887 -34774 -24229 -27422 -36837 -30422 -12275 -8155 -11605 -11664 -11599 1109 -10840
16704 -10840 -6329 -4530 -29149 -15157 578 -1580 -4972 5052 -9202 -11672 -1567 10376 13163
16691 13163 -12677 -3318 13892 28547 30982 -5625 -25764 -31225 -13666 -9280 -13398 -4929 5121
16678 5121 -3950 -13986 -9795 -2630 13701 8209 3251 -20011 -21887 -20723 -23201 -24303 737 -7468
16664 -7468 -12643 -9834 4896 9156 -13224 -14238 -18643 -33970 -41306 -46560 -16722 8794 7633
16651 7633 -5400 -6327 8342 18181 24756 -13135 -33683 -41509 -22577 -15419 -7757 -20004 -24815
$$ packed form
16744B7270q774k2775K873J3062k1127j0391o051k3921J5044K0979K1487j2705
16732e029o903M518Q128L914M28j545j1127J594q289k2794N899J7413J2438R533
16718H178j8691k1374k887J0545l193r415O415J8147M120l450n9O5J2708j1949
16704a0840M511J799k4619J3992J5735k158l392J0024j4254k470J0105J1943K787
16691A3163k5840R359J7210J4655K435l6607k0139n461J7559M386m118Q469J0050
16678E121r071j0036M191P165J6331n492m958k3262j876J164k478j102K5040q205
16664g468n175K809J4730M260k2380j014m405j5327p336n254K9838K5516j161
16651G633j3033r27J4669R839O575l7891k0548p826J8932P158P662j2247m811
$$ plain form
16638 -24815 -22895 -10665 -19792 -17266 -25111 -25057 2011 26279 21222 -1793 -21942 -40805 -43692
16625 -43692 -20010 -23687 -36178 -32379 -33652 -19306 -7642 -3039 -26782 -25764 2621 25674 34984
16612 34984 27199 -6454 -12337 -8551 -15798 -9424 1324 -465 -6025 3918 9822 23984 20523 13975
16598 13975 1907 -4917 -13518 7062 23107 15770 4309 12920 -5008 -10146 13166 20432 14419
16585 14419 -11725 -27198 -30973 -25890 2265 -13600 -22880 -23967 -33051 -27064 -23575 -13905 -17203
16572 -17203 -26125 -19802 -22874 -19015 -21360 -18637 -27279 -21248 -15598 -18255 2372 11788 7440 -1667
16558 -1667 -1044 6413 6031 -6134 -14752 -13397 14801 11172 11560 9248 -4462 -16469 -3009 21619
16544 21619 27371 15179 12591 4873 -2126 -8396 -12859 -3923 14080 31047 45401 27607 -4723
$$ packed form
16638b4815J920J2230r127K526p845N4K7068K4268n057k3015k0149j8863k887
16625d3692K3682l677j2491L799j273J4346J1664M603k3743J018K8385K3053R310
16612C4984p785l3653n883L786p247O374J0748j789n560R943N904J4162l461o548
16598A3975j2068o824q601K0580J6045p337j1461Q611j7928n138K3312P266o013
16585A4419k6144j5473l775N083K8155j5865r280j087r084N987L489R670l298
16572a7203q922O323l072L859k345K723q642O031N650k657K0627R416m348r107
16558a667O23P457l82j2165q618J355K8198l629L88k312j3710j2007J3460K4628
16544B1619N752j2192k588p718o999o270m463Q936J8003J6967J4354j7794l2330
$$ plain form
16531 -4723 -11709 -20142 -31208 -34291 -36467 -50043 -26923 2554 906 9203 17600 1024 -15111
16518 -15111 -567 -4758 -27227 -28566 -4160 13576 -4041 4637 4702 -9299 -824 19082 19106 15741
16504 15741 4473 -12775 -25709 -26398 -12798 -24825 -28254 -14529 4866 6861 -975 -6333 23395
16491 23395 32146 13077 -2567 -28284 -28467 -37647 -31699 -12552 -10908 -22622 -47350 -60791 -48044
16478 -48044 -46032 -47346 -32236 -39357 -33543 -19009 -36539 -45325 -34232 -18329 6364 -184 -3493
16465 -3493 12307 9276 -8548 -18704 2681 13634 36944 49246 40368 29900 14673 2231
16453 2231 20123 5336 -1496 12931 18685 33906 29571 9118 3892 6052 5720 -6703 -16695
16440 -16695 -33075 -52186 -46636 -44914 -20612 -24158 -28666 -13642 10258 4906 -17276 -18805 -20227
$$ packed form
16531d723o986q433j1066l083k176j3576K3120K9477j648Q297Q397j6576j6135
16518a5111J4544m191k2469j339K4406J7736j7617Q678O5j4001Q475J9906K4l365
16504A5741j1268j7248j2934o89J3600j2027l429J3725J9395J995p836n358K9728
16491B3395Q751j9069j5644k5717j83r180N948J9147J644j1714k4728j3441J2747
16478d8044K012j314J5110p121N814J4534j7530q786J1093J5903K4693o548l309
16465c493J5800l031j7824j0156K1385J0953K3310J2302q878j0468j5227j2442
16453B231J7892j4787o832J4427N754J5221m335k0453n226K160l32j2423r992
16440a6695j6380j9111N550J722K4302l546m508J5024K3900n352k2182j529j422
$$ plain form
16427 -20227 -21369 -18124 -8756 -14420 -17553 -5950 2678 -14945 -27372 -698 8332 -8055 -7266
16414 -7266 -9489 14166 19815 -9347 -6025 -5822 -8790 -1268 10246 7075 5708 12170 16466 17385
16400 17385 21111 12350 8422 -12138 4014 8528 -8232 -33616 -23529 -9823 -8399 -25161 -37196
16387 -37196 -26054 -13125 8209 2588 15547 9998 -7235 -7099 -5466 -1378 -21211 -34786 -33524
16374 -33524 -8279 -2782 -12979 4534 12812 2739 7028 6041 1160 -9347 -20901 -32571 -16963
16361 -16963 -34613 -22258 -4880 -14869 -23996 -31441 -32520 -26790 -4950 -24802 -20050 -18730 -12060
16348 -12060 14685 26844 19563 12211 4529 -4130 -10553 -7788 6020 22494 7371 -3288 9516
16335 9516 17453 13123 -12026 -22525 -16465 -9057 9381 4973 -12329 1679 23373 4900 -14311
$$ packed form
16427b0227j142L245R368n664l133J1603Q628j7623j2427K6674R030j6387P89
16414g266k223K3655N649k9162L322K03k968P522J1514l171j367O462M296R19
16400A7385L726q761l928k0560J6152M514j6760k5384J0087J3706J424j6762j2035
16387c7196J1142J2929K1334n621J2959n549j7233J36J633M088j9833j3575J262
16374c3524K5245N497j0197J7513Q278j0073M289r87m881j0507j1554j1670J5608
16361a6963j7650J2355J7378r989r127p445j079N730K1840j9852M752J320O670
16348a2060K6745J2159p281p352p682q659o423K765J3808J6474j5123j0659J2804
16335I516P937m330k5149j0499O060P408J8438m408j7302J4008K1694j8473j9211
$$ plain form
16322 -14311 -3575 -937 -6517 -4791 -21298 -9401 4664 5871 -7981 -15214 -10180 -23195 -31213
16309 -31213 -10518 -9358 -23516 -10975 -17481 -11509 -28300 -41846 -36263 -18503 -13855 -12761 -7114
16296 -7114 -10523 -4510 12443 13963 -6676 -8262 -14210 -17742 2246 10737 5764 -11412 3991
16283 3991 15575 6527 10645 11598 -1008 877 -16036 -4704 -10191 -29950 -35787 -27923 8119
16270 8119 13481 178 -3080 -9228 -29815 -18089 -7134 247 16334 29984 389 -25884 -16294
16257 -16294 -10971 -20897 -7834 2312 21382 18468 -3228 -15427 -14301 -18998 6383 11325 5520
16244 5520 6042 -8903 5530 10581 4820 4104 5550 -15049 -21657 -19286 -11807 -24444 -12970 -3961
16230 -3961 -12318 -7820 -12800 -21238 -17316 -19248 -24990 -41144 -30356 -19078 -24129 -19261 -11230 -9619
$$ packed form
16322a4311J0736K638n580J726j6507J1897J4065J207j3852p233N034j3015q018
16309c1213K0695J160j4158J2541o506N972j6791j3546N583J7760M648J094N647
16296g114l409O013J6953J520k0639j586n948l532J9988Q491m973j7176J5403
16283C991J1584r048M118R53j2606J885j6913J1332n487j9759n837P864L6042
16270H119N362j3303l258o148k0587J1726J0955P381J6087J3650k9595k6273R590
16257a6294N323r926J3063J0146J9070k914k1696j2199J126m697K5381M942n805
16244E520N22j4945J4433N051n761p16J446k0599o608K371P479j2637J1474R009
16230c961q357M498m980q438L922j932n742j6154J0788J1278n051M868Q031J611
$$ plain form
16216 -9619 -4832 15406 24969 42132 47603 15653 2014 1420 -25280 -29057 -9201 -3079 16413
16203 16413 18173 -11868 -29498 -47389 -46901 -29648 9675 15433 14119 25053 22980 17055 14013
16190 14013 2242 -11174 -21164 -22905 -32405 -46929 -26746 -14759 3535 7510 3606 -4331 -10432
16177 -10432 -4375 2928 16059 21237 8638 6939 19150 9979 2005 -379 2422 13571 29731
16164 29731 30843 15774 13986 18528 27527 24033 -2046 -1032 -6853 5740 5397 -6266 -3833 9085
16150 9085 -888 -46266 -52248 -49490 -37780 -13088 -7380 -9891 6308 31465 19902 13370 10022
16137 10022 1284 -11871 -30573 -34158 -9349 5215 3279 353 -6960 -3733 -5814 -26044 -36087
16124 -36087 -24757 -12212 -3906 -565 7877 -2212 -10370 -444 3294 -4209 -13593 -28230 -34721
$$ packed form
16216i619M787K0238R563J7163N471l1950j3639n94k6700l777J9856O122J9492
16203A6413J760l0041j7630j7891M88J7253L9323N758j314J0934k073n925l042
16190A4013j1771j3416r990j741r500j4524K0183J1987J8294L975l904p937o101
16177a0432O057P303J3131N178j2599j699J2211r171p974k384K801J1149J6160
16164B9731J112j5069j788M542Q999l494k6079J014n821J2593l43j1663K433J2918
16150I085r973m5378n982K758J1710K4692N708k511J6199K5157j1563o532l348
16137A0022q738j3155j8702l585K4809J4564j936k926p313L227k081k0230j0043
16124c6087J1330J2545Q306L341Q442j0089q158R926L738p503r384j4637o491
$$ plain form
16111 -34721 -24955 -19933 -9350 -4471 31667 32899 23592 13202 856 18585 15583 3409 11804
16098 11804 7521 -25220 -19862 -7938 -1556 -1483 -7528 -7407 -17853 -5245 15112 22283 4511 -4083
16084 -4083 -32189 -19290 -14470 -21150 2457 -5074 -1911 -5087 -15156 -29107 -10197 -7991 -22886
16071 -22886 -41637 -30111 -27230 -38094 -23945 -1892 19224 9545 -7955 -19488 -23964 -20080
16059 -20080 -9773 14803 29203 29482 24512 24420 16969 857 -11557 2515 18617 12154 4238
16046 4238 20547 18756 6289 14471 11170 -3695 11 -640 1341 4649 -851 -7327 -17206 -13572
16032 -13572 -31177 -55196 -64368 -64081 -43496 -14729 -6562 5261 12900 11250 2220 -10274 -21587
16019 -21587 -36750 -38020 -26011 -14953 -15773 -13088 -7856 4548 8647 11237 213 -4080 1562
$$ packed form
16111c4721R766N022J0583M879L6138J232r307j0390j2346J7729l002j2174Q395
16098A1804m283l2741N358J1924O382P3o045J21j0446J2608K0357P171j7772q594
16084d083k8106J2899M820o680K3607p531L163l176j0069j3951J8910K206j4895
16071b2886j8751J1526K881j0864J4149K2053K1116r679j7500j1533m476L884
16059b0080J0307K4576J4400K79m970r2p451j6112j2414J4072J6102o463p916
16046D238J6309j791j2467Q182l301j4865L706o51J981L308n500o476r879L634
16032a3572j7605k4019r172K87K0585K8767Q167J1823P639j650r030j2494j1313
16019b1587j5163j270J2009J1058q20K685N232J2404M099K590j1024m293N642
$$ plain form
16006 1562 -12515 -13166 1334 10524 -4586 -13557 14887 8262 -7150 2212 12306 6439 -32137
15993 -32137 -26716 -15105 -12994 -29308 -37656 -26377 -19201 -13702 4152 -7947 -10858 -16569 -28316
15980 -28316 -56488 -69121 -73510 -68786 -37731 -23826 -32856 -16182 -20765 -17525 8521 19728 3560
15967 3560 -24201 -35026 -28168 5571 47672 55891 44812 23305 10157 15822 9879 6501 19895
15954 19895 27679 17689 -775 -10986 -31078 -27498 -4230 3522 -4124 -33577 -48025 -34544 -36662
15941 -36662 -17318 -22663 -24104 -12397 -24909 -23991 -32008 -50614 -48084 -35685 -53401 -47186 -39527
15928 -39527 -35890 -48072 -52296 -34319 -32665 -37299 -25686 -6440 235 -10642 -5918 6159 5066
15915 5066 -9073 10846 32399 10537 -31801 -22785 3360 -10818 -20844 -8148 2295 5999
$$ packed form
16006A562j4077o51J4500R190j5110q971K8444o625j5412R362J0094n867l8576
15993c2137N421J1611K111j6314q348J1279P176N499J7854j2099k911n711j1747
15980b8316k8172j2633m389M724L1055J3905r030J6674m583L240K6046J1207j6168
15967C560k7761j0825O858L3739M2101Q219j1079k1507j3148N665n943l378J3394
15954A9895P784r990j8464j0211k0092L580K3268P752p646k9453j4448J3481k118
15941c6662J9344n345j441J1707j2512R18q017j8606K530J2399j7716O215P659
15928c9527L637j2182m224J7977J654m634J1613J9246O675j0877M724J2077j093
15915E066j4139J9919K1553k1862m2338R016K6145j4178j0026J2696J0443L704
$$ plain form
15903 5999 2427 -18160 -26089 -21702 -23593 -19979 -13262 17070 20500 -4137 1310 -12987 -6620 -279
15889 -279 -5425 -7085 -11525 -11239 -11335 -27825 -40985 -31013 -41518 -28373 -24962 -15312 -11902 -8089 -26919
15874 -26919 -35069 -22243 -36705 -13491 -20372 -26695 -26627 -19685 -22089 -33893 -4620 -1546 1021 -407
15860 -407 5978 -11475 -8765 4660 10169 29716 43260 18803 -10772 -33258 -8977 31562 44993
15847 44993 18357 5110 5280 25237 10576 -8149 -26666 -21425 -3246 1152 9991 12741 8441
15834 8441 -2439 -20739 -20525 -200 -544 -14456 -4150 -13226 -32268 -32098 -29416 -32283 -25236 -17781
15820 -17781 -4691 -6778 -8869 -12813 1893 19008 20553 16534 10539 22365 14936 -198 -2569
15807 -2569 9355 4310 -2335 8823 5619 13805 1109 -5455 1720 7660 -7332 5613 -2401
$$ packed form
15903E999l572k0587p929M387j891L614O717L0332L430k4637N447j4297O367O341
15889b79n146j660m440K86r6j6490j3160R972j0505J3145L411R650L410L813j8830
15874b6919q150J2826j4462K3214o881o323O8O942k404j1804K9273L074K567j428
15860d07O385j7453K710J3425N509J9547J3544k4457k9575k2486K4281M0539J3431
15847D4993k6636j3247J70J9957j4661j8725j8517N241J8179M398Q839K750m300
15834H441j0880j8300K14K0325l44j3912J0306r076j9042J70K682k867P047P455
15820a7781J3090k087k091l944J4706J7115J545m019n995J1826p429j5134k371
15807b569J1924n045o645J1158l204Q186j2696o564P175N940j4992J2945q014
$$ plain form
15794 -2401 -4014 -2679 6893 13566 -9772 -41696 -41301 -26976 -20618 -21065 -26032 -34950 -34264 -4727
15780 -4727 7810 14539 14713 -6244 -9401 -28857 -42161 -30264 -27902 -19441 -15997 6481 25158
15767 25158 26959 13866 15198 17584 3420 -18712 -10471 1102 16182 8991 -5680 -3264 -22725
15754 -22725 -15473 -2018 -3274 -6468 -20263 -16772 -5755 7725 13931 -3310 109 18154 28763
15741 28763 16259 2578 -6034 -14314 -15138 -11557 1581 5833 12927 7829 -2127 2757 5665 -5990
15727 -5990 -27495 -26899 -7604 2764 16451 29500 15070 -7544 -247 5570 -6080 -8956 5515
15714 5515 16710 7755 7211 31774 44642 39434 34172 34557 42696 20992 -11713 -26480 -7964
15701 -7964 30198 36328 -610 -5747 -9589 -18766 -18534 -26985 -35680 -2706 -13789 -5049 -21377 -25628
$$ packed form
15794b401j613J335R572O673k3338l1924L95J4325O358m47m967q918O86K9537
15780d727J2537O729J74k0957l157j9456j3304J1897K362Q461L444K2478J8677
15767B5158J801j3093J332K386j4164k2132Q241J1573J5080p191j4671K416j9461
15754b2725P252J3455j256l194j3795L491J1017J3480O206j7241L419J8045J0609
15741B8763j2504j3681q612q280q24L581J3138M252P094n098r956M884K908j1655
15727e990k1505N96J9295J0368J3687J3049j4430k2614P297N817j1650k876J4471
15714E515J1195q955n44K4563J2868n208n262L85Q139k1704l2705j4767J8516
15701g964L8162O130l6938n137l842r177K32q451q695L2974j1083Q740j6328m251
$$ plain form
15687 -25628 -30181 -19676 -15545 -20171 -19750 -27449 -46814 -49029 -39908 -22043 -20442 -16255 12459 21196
15673 21196 36415 40874 18061 6416 6516 4379 7051 9505 9068 -6343 -16255 -14384 -12988 -7751
15659 -7751 3739 81 -15551 -16983 2903 -3293 1922 988 -8835 -10052 -2183 -4773 2485 -10621
15645 -10621 -19555 -4572 7004 1652 -3805 -17020 -29397 -14347 -8609 -12253 -35896 -26308 -6749
15632 -6749 7898 7132 -29677 -24064 -20006 -32397 -31121 -26286 -37452 -32251 -16565 12583 7152
15619 7152 -12734 -6046 4067 -3843 18823 22005 18233 15328 18440 11996 19477 9407 -1949
15606 -1949 -2228 -6615 -39195 -40948 -5793 3984 -12794 -7187 8467 21207 -4751 -4475 7719
15593 7719 8958 -1841 -11565 -32094 -36333 -28039 -36296 -31742 -10964 -5005 -1813 -10587 -17023 -22668
$$ packed form
15687b5628m553J0505M131m626M21p699j9365k215R121J7865J601M187K8714Q737
15673B1196J5219M459k2813j1645J00k137K672K454m37j5411r912J871J396N237
15659g751J1490l658j5632j432J9886o196N215r34r823j217P869k590P258j3106
15645a0621q934J4983J1576n352n457j3215j2377J5050N738l644k3643R588J9559
15632f749J4647p66l6809N613M058j2391J276M835j1166N201J5686K9148n431
15619G152j9886O688J0113p910K2666L182l772k905L112o444P481j0070j1356
15606a949k79m387l2580j753L5155R777j6778N607J5654J2740k5958K76J2194
15593G719J239j0799r724k0529m239Q294q257M554K0778N959L192q774o436n645
$$ plain form
15579 -22668 -15710 -15158 -10520 -4852 -15185 -27638 -9299 -2129 19329 45406 46829 20958 14709
15566 14709 11118 15416 44275 45389 33846 -4258 -16239 6756 23134 18874 15264 18096 23740
15553 23740 31185 16757 10190 10220 18283 12963 23180 35814 20591 7995 8222 -8639 -1376 11140
15539 11140 10256 18583 15177 7098 -5437 760 15746 35391 27956 16881 6736 -301 -3670
15526 -3670 -23419 -18332 -23672 -21481 -1396 8586 -9728 -15523 -23682 -22558 -21924 -39181 -56582 -51800
15512 -51800 -23997 -17444 -27270 -25987 -6610 8874 19344 19483 18738 26125 30737 15887 4494
15499 4494 3935 -3370 -27113 -10774 14281 19143 27077 26741 7660 16749 15950 4591 4399 15119
15485 15119 20518 21919 14844 13301 15644 -6910 -20314 -16352 -10921 1687 -15189 -20521 -5142
$$ packed form
15579b2668O958N52M638N668j0333j2453J8339P170K1458K6077J423k5871o249
15566A4709l591M298K8859J114j1543l8104j1981K2995J6378m260l610K832N644
15553B3740P445j4428o567L0Q063n320J0217J2634j5223j2596K27j6861P263J2516
15539A1140q84Q327l406q079j2535O197J4986J9645p435j1075j0145p037l369
15526c670j9749N087n340K191K0085R982j8314n795q159J124O34j7257j7401M782
15512e1800K7803O553r826J283J9377J5484J0470J39p45P387M612j4850j1393
15499D494n59p305k3743J6339K5055M862P934l36j9081R089p99j1359j92J0720
15485A5119N399J401p075j543K343k2554j3404L962N431J2608j6876n332J5379
$$ plain form
15472 -5142 -11485 -29998 -8647 5695 3525 -5994 -7786 -19341 -9340 16484 18637 25592 25623 29423
15458 29423 36754 8646 -2582 19217 17158 1492 -7998 -922 11189 9294 1564 -11100 -20916
15445 -20916 -3301 2583 -13785 -23076 -24676 -7365 9857 2762 -9270 -14223 -11788 -5057 19994
15432 19994 18408 -3341 -19571 -21175 -30222 -45055 -32874 -20038 -6496 -7462 11081 24942 17338
15419 17338 -5921 -17250 -7949 1182 422 -6831 -11200 -6484 -24505 -28356 -23763 -3651 19918
15406 19918 38622 18846 -13123 -17981 -2102 11272 11181 -5349 -33847 -40487 -37801 -40110 -26310
15393 -26310 -35022 -40451 -37102 -14100 11712 29876 40057 26813 25839 13035 -12857 -1999 4469
15380 4469 -5951 -4802 31460 46559 22451 -5249 -16262 -28082 -5727 -4519 -12913 -28060
$$ packed form
15472e142o343j8513K1351J4342k170r519j792j1555J0001K5824K153O955L1L800
15458B9423P331k8108j1228K1799k059j5666r490P076J2111j895p730j2664r816
15445b0916J7615N884j6368r291j600J7311J7222p095j2032m953K435O731K5051
15432A9994j586k1749j6230j604r047j4833J2181J2836J3542r66J8543J3861p604
15419A7338k3259j1329R301R131p60p253m369M716j8021l851M593K0112K3569
15406A9918J8704j9776l1969m858J5879J3374r1j6530k8498o640K686k309J3800
15393b6310q712n429L349K3002K5812J8164J0181j3244r74j2804k5892J0858O468
15380D469j0420J149L6262J5099k4108k7700j1013j1820K2355J208q394j5147
$$ plain form
15368 -28060 -38768 -40049 -37210 -40239 -34735 -42743 -33240 -2941 -17471 -20386 -31325 -39660 -31800
15355 -31800 -26366 -37975 -36347 -38890 -33939 -34346 -46675 -41058 -10650 287 20319 15025 -18417
15342 -18417 -11585 -3597 -25194 -34388 -31013 -25283 -21977 11885 32338 26628 22762 14707 8296 -11931
15328 -11931 -24039 -23934 -16332 -9733 -24976 -5443 22941 17913 8311 -12774 -37459 -35908 1983
15315 1983 7171 -6638 -11453 -9526 -5410 -2967 8340 3612 6498 14941 759 2373 29318 28558
15301 28558 19051 21973 23679 8016 -3775 -18332 -34248 -34675 -23249 -5066 -13386 -25712 -40737
15288 -40737 -58216 -42574 -25191 -38075 -33170 -11535 -5354 1950 10555 -6073 -16069 -32429 -25980
15275 -25980 -25617 -37723 -14425 21974 42578 28867 5715 -7376 -8431 -25366 -15921 -21932 -24946
$$ packed form
15368b8060j0708j281K839l029N504q008R503L0299j4530k915j0939q335P860
15355c1800N434j1609J628k543M951m07j2329N617L0408J0937K0032n294l3442
15342a8417O832P988k1597r194L375N730L306L3862K0453n710l866q055o411k0227
15328a1931j2108J05P602O599j5243J9533K8384n028r602k1085k4685J551L7891
15315A983N188j3809m815J927M116K443J1307m728K886Q443j4182J614K6945p60
15301B8558r507K922J706j5663j1791j4557j5916m27J1426J8183q320j2326j5025
15288d0737j7479J5642J7383j2884M905K1635O181P304Q605j6628r996j6360O449
15275b5980L63j2106K3298L6399K0604j3711k3152j3091j055j6935R445o011l014
$$ plain form
15262 -24946 -17355 -21910 -18497 -11476 -9482 18093 28899 13310 2815 -13252 -5326 271 -1102
15249 -1102 4334 15817 17855 15557 18522 17197 -1448 3147 9111 1873 2192 8159 7366 3529 15325
15234 15325 26829 24166 14940 -228 -78 2992 4674 -3339 -6303 -11139 6713 -10822 -33593
15221 -33593 -36987 -46579 -32450 -18000 -15886 -12742 -9876 -20641 -22066 -5436 -8988 -21472 -1833
15208 -1833 3033 -13725 -8645 5123 -1753 -13266 -13494 -7656 -10086 5478 13588 -6773 -9020 -8413
15194 -8413 -7159 -23698 -15133 -9363 8944 2101 -3340 -967 2518 17442 22210 10837 1015 3014
15180 3014 21724 21987 14763 21230 19936 38247 16272 22331 31310 30319 10239 19216 14955 18146
15166 18146 15509 6140 5359 22583 35798 39988 41009 45339 41165 24706 -4961 -11785 -11960 -8044
$$ packed form
15262b4946P591m555L413P021J994K7575J0806j5589j0495j6067P926N597j373
15249a102N436J1483K038k298K965j325j8645M595N964p238L19N967p93l837J1796
15234A5325J1504k663r226j5168J50L070J682q013k964m836J7852j7535k2771
15221c3593l394r592J4129J4450K114L144K866j0765j425J6630l552j2484J9639
15208a833M866j6758N080J3768o876j1513k28N838k430J5564Q110k0361k247O07
15194h413J254j6539Q565N770J8307o843n441K373L485J4924M768j1373r822J999
15180C014J8710K63p224O467j294J8311k1975O059Q979r91k0080Q977m261L191
15166A8146k637r369p81J7224J3215M190J021M330m174j6459k9667o824j75L916
$$ plain form
15152 -8044 -14343 -17374 -21481 -7213 3270 485 -6620 -13943 -9448 -26341 -24937 -12596 -18245 -10303
15138 -10303 5646 6843 11734 -13097 -11098 -9970 -16273 -4711 14233 18709 -7544 -4160 -3510
15125 -3510 3398 -7241 -19271 -7628 -622 -32708 -25355 -2061 10237 -9222 -5008 7376 5073
15112 5073 251 -14560 -12329 -9539 765 1395 -10318 -16970 -12642 -12214 -16143 -23389 -28429 -27877 -6625
15097 -6625 3217 -14309 -17999 -13127 -16099 -32078 -47301 -24499 -17098 -32901 -30914 -31182 -29779 -32486
15083 -32486 -13652 17256 1082 -7458 -12624 -22095 -47965 -35966 3631 23880 23847 1489 -10046
15070 -10046 -11117 -10910 -2688 -6610 12588 5917 89 9199 -10456 -26034 -22270 -32160 -16239 -20698
15056 -20698 -27481 -41057 -25511 -23763 -27436 -23857 -8085 -3067 25729 29306 5955 1611 -2599
$$ packed form
15152h044o299l031m107J4268J0483k785p105p323M495j6893J404J2341n649P942
15138a0303J5949J197M891k4831J999J128o303J1562J8944M476k6253L384O50
15125c510O908j0639j2030J1643P006l2086P353K3294J2298j9459M214J2384k303
15112E073m822j4811K231K790J0304O30j1713o652M328M28l929p246n040N52K1252
15097f625R842j7526l690M872k972j5979j5223K2802P401j5803J987k68J403k707
15083c2486J8834L0908j6174q540n166r471k5870J1999L9597K0249l3k2358j1535
15070a0046j071K07Q222l922J9198o671n828R110j9655j5578L764r890J5921m459
15056b0698o783j3576J5546J748l673L579J5772N018K8796L577k3351m344m210
$$ plain form
15043 -2599 -9719 7145 16712 14948 1019 -21843 -27674 -18572 -13654 -13735 -16647 -28483 -34685 1353
15029 1353 10221 -2257 -25705 -28674 -30884 -24883 -12510 -20598 -32950 -45690 -33960 -17799 -15450
15016 -15450 -31454 -38015 -33121 -24891 -19972 -12313 13164 21798 3118 21605 35908 14261 -16053
15003 -16053 -18747 -2942 7355 -5757 -6706 -11575 -3548 9389 -7446 -3687 9112 9206 -12097
14990 -12097 -13140 4312 19025 33419 23296 19921 21353 14989 10191 -19054 -54643 -52115 -24834
14977 -24834 -27578 -35112 -45205 -42742 -19631 9127 16907 20529 33911 20972 20838 14338 -15035
14964 -15035 -18284 -37306 -33501 -11351 -16149 -30061 -22773 -14841 -4527 6063 6397 480 -1891
14951 -1891 4318 -16492 -16733 -15377 -11541 4671 -234 1740 14921 16534 20495 22406 20413 134
$$ packed form
15043b599p120J6864R567j764j3929k2862n831R102M918q1k912j1836o202L6038
15029A353Q868j2478k3448k969k210O001J2373q088j2352j2740J1730J6161K349
15016a5450j6004o561M894Q230M919P659K5477Q634j8680J8487J4303k1647l0314
15003a6053k694J5805J0297j3112r49m869Q027J2937j6835L759J2799R4k1303
14990a2097j043J7452J4713J4394j0123l375J432o364m798k9245l5589K528K7281
14977b4834k744p534j0093K463K3111K8758P780L622J3382j2939j34o500k9373
14964a5035l249j9022L805K2150m798j3912P288P932J0314J0590L34n917k371
14951a891O209k0810k41J356L836J6212m905J974J3181J613L961J911j993k0279
$$ plain form
14937 134 -12755 939 19121 16833 -10554 -13302 -17458 -36515 -41013 -19579 3363 -212 -19775
14924 -19775 -14625 -5260 9289 -473 -12029 8734 15951 3129 -11941 -23245 -22355 -18192 -11146
14911 -11146 5823 21348 -2641 -29551 -30917 -10375 7912 18968 26809 21220 31949 26707
14899 26707 -18201 -20162 -18810 -16688 -13248 -5703 -25560 -24713 5051 28681 26557 24751 -3191
14886 -3191 -24221 -21618 -9552 -6776 -5544 -4278 -3912 -11220 -21601 -13874 -17570 -1319 2735 -708
14872 -708 -1966 -3728 4866 14242 475 -1553 -15005 -26489 -22147 -17202 -16332 -8960 -26384 -21169
14858 -21169 4626 -12642 -21155 -29937 -27343 -6720 -13248 -6213 -4426 670 -6474 -1312 4224 11317
14844 11317 -1841 -23724 -7468 16994 16326 19311 11729 18867 39993 36867 16021 1363 -2001
$$ packed form
14937A34j2889J3694J8182k288k7387k748m156j9057m498K1434K2942l575j9563
14924a9775N150R365J4549r762j1556K0763P217j2822j5070j1304Q90M163P046
14911a1146J6969J5525k3989k6910j366K0542J8287J1056P841n589J0729n242
14899B6707m4908j961J352K122L440P545j9857Q47K9764K3630k124j806k7942
14886c191k1030K603J2066K776J232J266L66p308j0381P727l696J6251M054l443
14872g08j258j762Q594R376j3767k028j3452j1484M342M945Q70P372j7424N215
14858b1169K5795j7268q513q782K594K0623o528P035J787N096p144N162N536P093
14844A1317j3158k1883J6256K4462o68K985p582P138K1126l126k0846j4658l364
$$ plain form
14831 -2001 -3649 -7903 4438 8347 21283 35334 27672 9172 576 -512 14053 23469 30391
14818 30391 44071 33003 16307 16080 -764 -20994 -27776 -21954 -3891 5860 -3332 10918 17522
14805 17522 9411 8122 2091 -6560 -34615 -26760 -15357 -13479 -32810 -24834 -4947 10052 -1593
14792 -1593 -19465 -23443 -12384 8071 19875 17548 26535 -5100 -3464 -20605 -37482 -45860 -52187
14779 -52187 -27843 -32324 -48154 -62180 -46979 -3531 3073 10268 22074 14140 6735 8712 6721
14766 6721 3580 -9684 1541 26320 31478 16833 498 38429 26908 8516 2257 -10712
14754 -10712 -26564 -1863 6449 -28801 -18528 1040 3093 6570 11292 9961 -7289 -212 496
14741 496 -6121 7989 9765 13586 578 -27115 -40960 -10795 1976 3362 6651 -5679 6767
$$ packed form
14831b001j648m254J2341L909J2936J4051p662j8500q596j088J4565R416O922
14818C0391J3680j1068j6696k27j6844k0230o782N822J8063R751r192J4250O604
14805A7522q111j289o031q651k8055P855J1403J878j9331P976J9887J4999j1645
14792a593j7872l978J1059K0455J1804k327Q987l1635J636j7141j6877q378o327
14779e2187K4344m481j5830j4026J5201M3448O604P195J1806p934p405J977j991
14766F721l141j3264J1225K4779N158j4645j6335L7931j1521j8392o259j2969
14754a0712j5852K4701Q312l5250J0273J9568K053L477M722j331j7250P077P08
14741D96o617J4110J776L821j3008k7693j3845L0165J2771J386L289j2330J2446
$$ plain form
14728 6767 241 -16453 -13750 -7105 6266 1170 22866 24141 12887 5558 -7270 -2966 6821
14715 6821 20214 -7989 -13831 -34505 -29800 -33469 -19401 -19101 -8691 9402 10557 -5748 16741
14702 16741 22773 9543 21497 36448 32086 20141 13328 -5861 -22743 -22524 -2207 7952 26893
14689 26893 31945 20934 31128 41011 37189 32666 26891 16583 5824 1712 17342 8875 13030
14676 13030 -15194 -55181 -59180 -33353 -6777 -3428 -11524 2633 4133 12154 -1694 4432 3694
14663 3694 -2536 9083 39301 48100 43488 33300 29279 30917 23432 16735 9382 2910 -11240 -18676
14649 -18676 -19172 -1645 -9501 -33708 -28404 -19109 -4896 -32068 -41123 -19769 10969 26922 12734
14636 12734 24620 25305 17000 -1494 -27453 -22767 -15205 -33556 -42010 -21968 -10939 -20277 -37598
$$ packed form
14728F767o526j6694K703O645J3371n096K1696J275j1254p329j2828M304R787
14715F821J3393k8203n842k0674M705l669J4068L00J0410J8093J155j6305K2489
14702A6741O032j3230J1954J4951m362j1945o813j9189j6882K19K0317J0159J8941
14689B6893N052j1011J0194R883l822m523n775j0308j0759m112J5630q467M155
14676A3030k8224l9987l999K5827K6576L349q096J4157J500Q021j3848O126p38
14663C694o230J1619L0218Q799m612j0188m021J638p485o697p353o472j4150p436
14649a8676m96J7527p856k4207N304R295J4213k7172r055K1354L0738J5953j4188
14636A2734J1886O85q305j8494k5959M686P562j8351q454K0042J1029r338j7321
$$ plain form
14623 -37598 -44052 -42794 -32325 -19641 -28447 -27212 -4115 -6357 4776 21077 7062 4378 3110
14610 3110 -5056 -6199 -9658 -8768 -5227 -3469 -14975 -4401 1581 -734 -20524 -16882 7566 -4919
14596 -4919 -23974 -30281 -32903 -32903 -41611 -52281 -61622 -59803 -42652 -39566 -28939 -6413 -1390 23767
14582 23767 48452 38718 33598 -641 -14054 -8132 6981 -6317 -18383 -19481 -23711 -18875 -5101
14569 -5101 -2897 -17767 -20967 -36906 -38697 -22104 -20536 -2428 -5401 16172 15202 7626 -14060
14556 -14060 -25252 -4425 -3385 -21191 -11888 -3959 -11347 -18649 -29453 -38061 -29836 -1547 13566
14543 13566 -263 -11349 -16468 -23618 -14295 782 512 135 -2646 -5292 -16919 -27818 -395
14530 -395 739 -3463 -6268 -22960 -18397 3128 14236 18082 31090 27529 33153 23268 21365 -11113
$$ packed form
14623c7598o454J258J0469J2684q806J235K3097k242J1133J6301j4015k684j268
14610C110q166j143l459Q90L541J758j1506J0574N982k315j9790L642K4448j2485
14596d919j9055o307k622%q708j0670r341J819J7151L086J0627K2526N023K5157
14582B3767K4685r734n120l4239j3413N922J5113j3298j2066j098m230M836J3774
14569e101K204j4870l200j5939j791J6593J568J8108k973K1573r70p576k1686
14556a4060j1192K0827J040j7806R303P929p388p302j0804q608Q225K8289J5113
14543A3566j3829j1086n119p150R323J5077k70l77k781k646j1627j0899K7423
14530c95J134m202k805j6692M563K1525J1108L846J3008l561N624r885j903l2478
$$ plain form
14516 -11113 -33278 -24835 -13367 -1132 11293 14808 -15877 -23229 -23382 -5673 -5103 -7329 -23448
14503 -23448 -30619 -27236 -32233 -48442 -53377 -50564 -14331 8260 21312 36987 43042 34498 26713
14490 26713 20412 11897 18079 11494 22131 30363 20422 -1663 -11348 -9435 -31304 -35404 -14707
14477 -14707 30306 35984 3665 -7701 12217 8475 12481 1483 -8573 -20566 -9626 5777
14465 5777 18075 19571 23930 11327 2388 18594 18334 10871 -6699 -4253 10773 16249 11475 -13008
14451 -13008 -33202 -36107 -15282 1816 1354 19857 35000 10327 3804 -16929 -19658 -5716 6624
14438 6624 -7046 -34037 -16100 7663 18981 12190 9821 -12443 -18657 -23598 -21333 -19497 -30937
14425 -30937 -42669 -40532 -43527 -48662 -48474 -42730 -30852 -31367 -27451 -42434 -43408 -34940 -15368 -1975
$$ packed form
14516a1113k2165Q443J1468J2235J2425L515l0685p352j53J7709N70k226j6119
14503b3448p171L383m997j6209m935K813L6233K2591J3052J5675O055q544p785
14490B6713o301q515O182o585J0637Q232r941k2085r685J913k1869m100K0697
14477a4707M5013N678l2319j1366J9918l742M006j0998j0056j1993J0940J5403
14465E777J2298J496M359j2603q939J6206k60p463j7570K446J5026N476m774k4483
14451a3008k0194k905K0825J7098m62J8503J5143k4673o523k0733k729J3942J2340
14438F624j3670k6991J7937K3763J1318o791k369k2264o214m941K265J836j1440
14425c0937j1732K137k995n135J88N744J1878n15L916j4983r74Q468J9572J3393
$$ plain form
14411 -1975 3666 -3358 4448 3017 -8832 -12781 -8980 -5879 -5196 -16807 -19656 -32264 -22157 -12049
14397 -12049 302 11025 -2377 -19001 -7144 -12701 -11577 -26233 -37342 -23232 4651 19302
14385 19302 11003 -1245 -422 -8284 -7302 -4144 5407 14848 11635 14103 -9564 -8266 -7803 -33298
14371 -33298 -60241 -51690 -28649 -22348 -7147 14673 36616 31938 9854 37985 32395 17965
14359 17965 4781 -16006 -1195 10395 9659 13081 -4221 -12666 9165 16102 -1518 21632 39678
14346 39678 39577 13551 17614 21299 6654 -5529 -13209 -7398 -6977 -1603 -4343 -14475 -42599 -41453
14332 -41453 -24254 -6450 2355 -896 -31173 -16828 -5626 -17916 13168 7287 -24373 -16619
14320 -16619 -3635 1714 5337 22781 29198 15673 12444 27329 41941 43275 11257 -24982 -43151
$$ packed form
14411a975N641p024P806j431j1849l949L801L101O83j1611k849j2608J0107J0108
14397a2049J2351J0723j3402j6624J1857n557J124j4656j1109J4110K7883J4651
14385A9302q299j2248Q23p862R82L158R551R441l213K468k3667J298M63k5495
14371c3298k6943Q551K3041O301J5201K1820K1943m678k2084K8131n590j4430
14359A7965j3184k0787J4811J1590p36L422j7302q445K1831O937j7620K3150J8046
14346C9678j01k6026M063L685j4645j2183p680N811M21N374k740j0132k8124J146
14332d1453J7199J7804Q805l251l0277J4345J1202j2290L1084n881l1660P754
14320a6619J2984N349L623J7444O417j3525l229J4885J4612J334l2018l6239j8169
$$ plain form
14307 -43151 -49667 -54631 -46265 -20956 47 -21479 -29410 -35086 -46985 -36603 -15637 -20025 -10145
14294 -10145 -6644 -24750 -29681 -21037 216 6497 906 -15801 -2391 5514 13811 14449 14794 20733
14280 20733 6675 -4992 -6345 -12381 8679 1277 -13896 8310 25457 24117 19057 -3658 11802
14267 11802 17428 19714 5068 627 1331 10757 8491 8950 15035 19110 8943 1316 8161 7728 1186
14252 1186 5276 -6925 -11819 -15199 5253 11533 -4868 -15716 -28065 -26704 -9799 12660 41680
14239 41680 34147 33237 21173 4338 -6441 -10228 3399 -10352 -23517 -28258 -35056 -30044 -28283
14226 -28283 -46930 -56420 -40520 -31199 -17487 -6301 -4282 -3370 12328 -5267 -489 16362 15918
14213 15918 23292 3413 -18272 -32468 -23414 2671 14804 -6300 -18275 -35645 -51835 -42828
$$ packed form
14307d3151o516m964Q366K5309K1003k1526p931n676j1899J0382K0966m388R880
14294a0145L501j8106m931Q644K1253O281n591j6707J3410P905Q297O38L45N939
14280B0733j4058j1667j353o036K1060p402j5173K2206J7147j340n060k2715J5460
14267A1802N626K286j4646m441P04R426k266M59O085M075j0167p627O845m33o542
14252A186M090j2201m894l380K0452O280j6401j0848j2349J361J6905K2459K9020
14239D1680p533r10j2064j6835j0779l787J3627j3751j3165m741o798N012J761
14226b8283j8647r490J5900R321J3712J1186K019R12J5698j7595M778J6851m44
14213A5918P374j9879k1685j4196R054K6085J2133k1104j1975j7370j6190R007
$$ plain form
14201 -42828 -46588 -41681 -31007 -6024 -15701 -12620 -500 4830 -6126 -2207 -5685 -17530 -14370
14188 -14370 -31969 -26774 -7723 -17560 -10823 1170 -9123 -33950 -44672 -46301 -41773 -51054 -52814
14175 -52814 -29769 -10921 9798 15082 -13686 -22996 -10591 -22226 14494 59118 48531 36980
14163 36980 26182 32066 42225 23039 -5021 -19507 -30658 -43986 -27535 -3223 -23626 -30064
14151 -30064 -18881 -16542 -18479 -25786 -16143 12581 -1620 -16637 -23171 -885 1436 13319 9516
14138 9516 13001 11469 26853 26207 19803 -4320 -4349 -18030 -6344 5081 16052 31445 7019
14125 7019 8473 15975 19191 2681 15855 23862 7318 -13226 -23459 -21690 -26559 -9319 -10611
14112 -10611 -16289 -9614 16428 17855 5203 2881 1046 10608 23703 10904 -756 8381 14907
$$ packed form
14201d2828l760M907J0674K4983r677L081J2120N330j0956L919l478j1845L160
14188a4370j7599N195J9051r837O737J1993j0293k4827j0722j629M528r281j760
14175e2814K3045J8848K0719N284k8768r310J2405j1635L6720M4624j0587j1551
14163C6980j0798N884J0159j9186k8060j4486j1151j3328J6451K4312k0403o438
14151c0064J1183K339j937p307R643K8724j4201j5017o534K2286K321J1883l803
14138I516L485j532J5384o46o404k4123k9j3681J1686J1425J0971J5393k4426
14125G019J454P502L216j6510J3174Q007j6544k0544j0233J769m869J7240j292
14112a0611n678O675K6042J427j2652k322j835R562J3095j2799j1660R137O526
$$ plain form
14099 14907 29590 21669 -18932 -33167 -41663 -37964 -34211 -16005 21402 39494 32034 7753 -14437
14086 -14437 -5015 11286 20490 10690 -33118 -32031 -21318 -5214 12015 23999 11343 -1478
14074 -1478 -710 2266 8131 15955 24692 26197 33974 23638 -2028 -17376 -13887 2614 24364 24525
14060 24525 35974 35285 42115 32405 10838 -11944 -14430 1595 -10506 -6880 74 -11724 4568
14047 4568 17968 18437 -12095 -30634 -32264 -27638 -25077 -46682 -39463 -4580 19127 18970 -2071
14034 -2071 -2569 -8440 -17308 2560 7028 -2753 -315 -5270 -9584 -1535 -9427 -2254 4842 3529 -1565
14019 -1565 2880 23634 20076 -9500 -30408 -34955 5650 15638 19685 36072 42853 30075 29682
14006 29682 16414 139 -1611 -126 12473 33028 34977 33110 36338 20543 28858 27480 10640
$$ packed form
14099A4907J4683p921m0601j4235q496L699L753J8206L7407J8092p460k4281k2190
14086a4437R422J6301R204r800m3808J087J0713J6104J7229J1984j2656j2821
14074a478P68K976N865P824Q737J505P777j0336k5666j5348L489J6501K1750J61
14060B4525J1449o89O830r710k1567k2782k486J6025j2101L626O954j1798J6292
14047D568J3400M69l0532j8539j630M626K561k1605P219L4883K3707j57k1041
14034b071m98n871q868J9868M468r781K438m955m314Q049p892P173P096j313n094
14019a565M445K0754l558k9576k0908m547M0605R988M047J6387O781j2778l93
14006B9682j3268j6275j750J485J2599K0555J949j867L228j5795Q315j378j6840
$$ plain form
13993 10640 3145 -2555 1873 1034 4922 7561 5839 14785 16097 4905 -12238 -26942 -26231 -31315
13979 -31315 -10701 -6017 -12820 -17342 -18713 4581 -6592 -17467 -4203 -3582 675 561 9606 5204
13965 5204 8649 -9173 -16065 -33518 -22785 -15143 -30122 -27069 12139 -8294 -28160 -11263 6399
13952 6399 18911 19699 16386 -4208 -11757 -8163 -6904 -16030 -14115 -29511 -16697 -3091 -22413
13939 -22413 -43049 -20611 -3143 4708 25357 30034 33907 27292 6578 11715 19779 36875 47570
13926 47570 11489 -13373 -1868 5881 -2877 -301 -3493 19571 -1600 -30795 -26068 -33987 -29906
13913 -29906 -11295 -5631 -4849 -15685 -14543 2301 21402 23056 42189 33127 12316 12864 19120
13900 19120 10164 8754 -2921 -22114 -6171 5858 -7997 -19850 -23777 -27817 -21308 -15009 -14985
$$ packed form
13993A0640p495n700M428q39L888K639j722Q946J312j1192j7143j4704P11n084
13979c1315K0614M684o803m522j371K3294j1173j0875J3264O21M257j14R045m402
13965E204L445j7822o892j7453J0733P642j4979L053L9208k0433j9866J6897J7662
13952F399J2512P88l313k0594p549L594J259r126J915j5396J2814J3606j9322
13939b2413k0636K2438J7468P851K0649M677L873o615k0714N137Q064J7096J0695
13926D7570l6081k4862J1505P749q758K576l192K3064k1171k9195M727p919M081
13913b9906J8611N664P82j0836J142J6844J9101J654J9133r062k0811N48O256
13900A9120q956j410j1675j9193J5943J2029j3855j1853l927m040O509O299K4
$$ plain form
13887 -14985 -13754 -9668 3939 7897 25710 30865 12431 17744 43445 63898 45649 37197 44043
13874 44043 32751 1009 1419 2536 -17328 -10216 -10646 -24398 -22641 -21983 -36356 -35251 -32990 -20315
13860 -20315 893 3569 4298 -3374 -4680 -5615 -6684 21006 22114 18248 15841 31892 49001 45612
13846 45612 31631 -945 -215 30806 17985 749 8053 14329 11002 21464 25136 2787 -1413
13833 -1413 -544 -10816 -13829 14159 22657 24319 -154 -11110 4346 21369 26595 8473 814
13820 814 -7761 -27827 -26777 3825 15445 20577 -14825 -19808 -19266 9698 35041 22853 11130
13807 11130 4711 6842 -13709 -22758 -7760 -6732 4437 25831 21363 30766 32082 23766 -8256
13794 -8256 -25606 -22879 -20311 3471 9890 598 6254 8225 6704 11564 37740 32221 19023 30900
$$ packed form
13887a4985J231M086J3607L958J7813N155j8434N313K5701K0453j8249q452O846
13874D4043j1292l1742M10J117j9864P112m30j3752J757O58j4373J105K261J2675
13860b0315K1208K676P29p672j306r35j069K7690J108l866k407J6051J7109l389
13846D5612j3981l2576P30L1021j2821j7236P304O276l327J0462L672k2349m200
13833a413Q69j0272l013K7988Q498J662k4473j0956J5456J7023N226j8122p659
13820H14q575k0066J050L0602J1620N132l5402m983N42K8964K5343j2188j1723
13807A1130o419K131k0551r049J4998J028J1169K1394m468R403J316q316l2022
13794h256j7350K727K568K3782O419r292N656J971j521M860K6176n519j3198J1877
$$ plain form
13780 30900 46582 37861 12503 11800 10477 19522 24965 10592 -5259 -3075 4500 8523 26648
13767 26648 25854 7884 -4968 -713 14310 30320 26287 14814 8274 22508 23412 19078 9166
13754 9166 -6570 -21249 -27879 -26347 -9772 10013 6601 -9177 -5366 -4054 -5053 -13765 -27887
13741 -27887 -34467 -28170 -24703 -7523 -12471 -4797 -6833 -10285 -17487 -17327 -8803 17197 31362 31252
13727 31252 6442 -2341 7026 -11245 -2353 10830 9978 3670 10023 32658 48667 35289 26330
13714 26330 33934 33559 41759 18792 15599 33547 47283 58524 54631 49392 38938 28610 13292
13701 13292 8627 33038 23225 -4270 2042 20994 7832 10156 -8126 -8024 -1916 17509 -3278
13688 -3278 -197 5669 -769 4958 8155 6639 9281 -778 -305 12878 16847 30498 21488 10487
$$ packed form
13780C0900J5682q721k5358p03j323R045N443j4373j5851K184P575M023J8125
13767B6648p94j7970j2852M255J5023J6010m033j1473o540J4234R04m334r912
13754I166j5736j4679o630J532J6575J9785l412j5778L811J312r99q712j4122
13741b7887o580O297L467J7180m948P674k036l452p202J60Q524K6000J4165j10
13727C1252k4810q783R367j8271Q892J3183q52o308O353K2635J6009j3378q959
13714B6330P604l75Q200k2967l193J7948J3736J1241l893n239j0454j0328j5318
13701A3292m665K4411r813k7495O312J8952j3162K324j8282J02O108J9425k0787
13688c278L081N866o438N727L197j516K642j0059M73J3183L969J3651r010j1001
$$ plain form
13674 10487 12124 7780 8038 1858 -11217 -6134 20709 27297 15888 465 -3831 9519 16572
13661 16572 10072 -7557 -3651 -31269 -53351 -43768 -16582 -22716 -36441 -43804 -36810 -50728 -36794
13648 -36794 -33067 -29840 -6004 7381 405 -4216 -1826 -22427 -948 3016 6970 27147 43231
13635 43231 21404 601 11340 9270 641 -14973 -24569 -14731 -5481 -5845 -6223 3804 18438
13622 18438 24401 14732 -20565 -31086 -9580 -10259 -24085 -16456 -17525 -22066 -20681 -12282 -7960 6246
13608 6246 -3325 -3452 -7929 -2069 -3431 4764 3557 -30246 -32505 -29526 -40944 -21642 10276 8876
13594 8876 -1316 2835 -11854 -17858 -3762 -2524 -13480 -9135 -5800 9774 25936 13741 12956
13581 12956 -13289 -17535 -8005 -10989 -13937 -1832 10096 9717 -1385 9037 -229 -20004 -10039
$$ packed form
13674A0487J637m344K58o180j3075N083K6843O588j1409j5423m296J3350P053
13661A6572o500j7629L906k7618k2082R583K7186o134j3725p363O994j3918J3934
13648c6794L727L227K3836J3385o976m621K390k0601K1479L964L954K0177J6084
13635D3231k1827k0803J0739k070q629j5614r596R838R250l64l78J0027J4634
13622A8438N963r669l5297j0521K1506o79j3826P629j069m541J385Q399M322J4206
13608F246r571j27m477N860j362Q195j207l3803k259K979j1418J9302L1918j400
13594H876j0192M151j4689o004J4096J238j0956M345L335J5574J6162j2195p85
13581A2956k6245m246R530k984k948J2105J1928l79j1102J0422r266j9775R965
$$ plain form
13568 -10039 8694 16272 -110 -13804 -19611 -25258 -35986 -42655 -42317 -25008 -9475 7148 14712
13555 14712 11509 4637 728 4042 9369 -6907 -28209 -30157 -23340 -30252 -24943 -21156 -12794 396
13541 396 28535 34939 23064 13050 -3279 1725 12654 13425 14191 -2128 -16918 -22350 -21747 -20542
13527 -20542 -15876 -12982 -14960 -824 7209 6904 -22228 -28657 -24811 -22183 -26944 -22358 3196 13164
13513 13164 11859 12336 20798 25797 30406 25566 18486 -2952 -14896 6214 17528 34822 41425
13500 41425 31780 29367 22715 5215 1704 -29100 -24579 -890 9231 8669 -2237 -31282 -36204
13487 -36204 -15020 -22233 -21375 -11685 -6201 -9945 -10825 -27509 -47103 -19673 19504 23774 36210
13474 36210 22888 14160 24283 38852 29238 10959 14052 15908 9063 -2933 -16759 -5935 9905
$$ packed form
13568a0039J8733P578j6382j3694n807n647j0728o669L38J7309J5533J6623P564
13555A4712l203o872l909L314N327j6276k1302j948O817o912N309L787Q362J3190
13541C96K8139O404j1875j0014j6329N004J0929P71P66j6319j4790n432O03J205
13527b0542M666K894j978J4136Q033l05k9132o429L846K628m761M586K5554R968
13513A3164j305M77Q462M999M609m840p080k1438j1944K1110J1314J7294O603
13500D1425r645k413o652j7500l511l0804M521K3689J0121n62j0906k9045m922
13487c6204K1184p213Q58R690N484l744q80j6684j9594K7430L9177M270J2436
13474C6210j3322q728J0123J4569r614j8279L093J856o845j1996j3826J0824J5840
$$ plain form
13461 9905 2966 -7099 4177 21082 46430 26051 4062 -22552 -23540 -23074 -17355 -24262 -35879
13448 -35879 -25997 -20724 -7797 -10480 421 2445 -1950 5069 442 -5482 202 1420 -13522 -25487
13434 -25487 -19912 -27356 -39479 -21842 -462 -5004 -15478 -11710 -21445 -22003 -4110 11802 -4950
13421 -4950 -7124 -8866 -30749 -17034 -18706 -23789 8960 -1377 -8107 -16739 -11261 -14839 -14343 -48
13407 -48 -884 -16771 -19205 -13668 -6737 14665 18647 10262 26079 30844 32925 20781 -7334 -32967
13393 -32967 -3573 26223 33879 29102 22873 18057 1913 -10176 1182 11243 2463 -2512 -9679
13380 -9679 -1423 -3809 -6584 7258 3713 -34381 -40110 -24608 -20671 -6197 -5190 -16428 -35627
13367 -35627 -32484 -12011 -16616 -26323 -31293 -29159 -21429 -10789 -7426 -7415 -11471 -6190 -5158 1301
$$ packed form
13461I905o939j0065J1276J6905K5348k0379k1989k6614r88M66N719o907j1617
13448c5879R882N273J2927k683J0901K024m395P019m627n924N684J218j4942j1965
13434b5487N575p444j2123J7637K1380m542j0474L768r735n58J7893J5912j6752
13421d950k174j742k1883J3715j672n083L2749j0337o730q632N478l578M96J4295
13407d8q36j5887k434N537O931K1402L982q385J5817M765K081j2144k8115k5633
13393c2967K9394K9796P656m777o229m816j6144j2089J1358J0061q780m975p167
13380i679Q256k386k775J3842l545l8094n729J5502L937J4474J007j1238j9199
13367c5627L143K0473m605r707m970K134P730J0640L363J1m056N281J032O459
$$ plain form
13353 1301 7663 17605 14213 22562 21890 -18309 -27080 -15848 -29365 -3840 12352 25662 30002
13340 30002 37400 43870 27615 3637 2628 -7362 -7431 7574 12037 3516 5950 5237 14101 26589
13326 26589 37653 17595 -12668 -9878 -6798 -13635 -639 -1946 -10003 -19097 -18150 -691 7655
13313 7655 2763 -4126 19169 14847 5975 20262 18610 6747 13367 -3197 -713 -19329 -16811
13300 -16811 -19313 3401 21164 25493 18575 28451 35360 42860 40287 20378 19886 42344 40866 45010
13286 45010 36729 326 -6291 -3845 3838 1122 16629 46615 59898 58653 55323 30092 25459
13273 25459 22881 29848 44497 26802 10743 12975 31500 31336 23848 19618 23523 7921 -8389
13260 -8389 -4595 -4869 -4604 19324 21915 40827 40519 36848 27383 15889 9508 6315 9512 -12348
$$ packed form
13353A301O362R942l392Q349o72m0199q771J1232j3517K5525J6192J3310M340
13340C0002P398O470j6255k3978j009r990o9J5005M463q521K434p13Q864J2488
13326B6589J1064k0058l0263K790L080o837J2996j307q057r094R47J7459Q346
13313G655m892o889K3295m322q872J4287j652j1863O620j6564K484j8616K518
13300a6811k502K2714J7763M329o918R876O909P500k573j9909m92K2458j478M144
13286D5010q281l6403o617K446P683k716J5507K9986J3283j245l330k5231m633
13273B5459k578O967J4649j7695j6059K232J8525j64p488m230L905j5602j6310
13260h389L794k74K65K3928K591J8912l08l671r465j1494o381l193L197k1860
$$ plain form
13246 -12348 -3650 -21623 -38636 -28834 -25918 -26574 -2262 31874 30377 41413 41327 49291 46980 18133
13232 18133 -7759 -18039 -18972 -22292 -30487 -20411 -5267 13362 169 -5172 14012 22279 37286
13219 37286 26499 5959 13542 15153 -9659 -28207 -44312 -50964 -54515 -54810 -46491 -40838 -25169
13206 -25169 2078 33247 41537 55982 43395 28304 34487 31538 13852 -11838 -40249 -58276
13194 -58276 -63756 -50476 -37283 -19664 8127 32685 56736 68970 72740 94563 112627 99191
13182 99191 93490 98207 126399 172304 238838 365433 592761 954265 1370470 1754482 1960337
13171 1960337 1871973 1518004 1118424 788428 550714 366908 268371 212810 183739 144061
13161 144061 105149 70720 60909 61700 67532 75776 96193 107005 101944 91319 75637 60291 43530
$$ packed form
13246a2348Q698j7973j7013R802K916o56K4312L4136j497J1036q6P964k311k8847
13232A8133k5892j0280r33l320q195J0076J5144J8629j3193n341J9184Q267J5007
13219C7286j0787k0540P583J611k4812j8548j6105o652l551k95Q319N653J5669
13206b5169K7247L1169Q290J4445j2587j5091O183k949j7686k5690k8411j8027
13194e8276n480J3280J3193J7619K7791K4558K4051J2234L770K1823J8064j3436
13182I9191n701M717K8192M5905O6534J26595K27328L61504M16205L84012K05855
13171A960337q8364l53969l99580l29996k37714j83806r8537n5561k9071l9678
13161A44061l8912l4429r811P91N832Q244K0417J0812n061j0625j5682j5346j6761
$$ plain form
13148 43530 29579 30741 43656 52577 48485 24273 17045 30226 38004 49560 44456 34357 48969
13135 48969 38237 8791 -3558 -3622 13741 21656 35186 50287 40641 25639 27678 27520 25861
13122 25861 40177 54736 72532 67737 53840 41394 31536 36851 25425 12692 15676 37893
13110 37893 42382 14553 37913 51199 18834 25291 42509 70261 53049 54740 72988 62790
13098 62790 36428 40987 60023 41903 -10110 -22075 -18359 -12635 -28592 -23210 -10317 -2347 17937
13085 17937 46790 44374 46700 51964 46604 40232 41278 50417 50208 46705 39705 31858 15115 11833
13071 11833 23048 24730 34451 53370 56429 35157 5152 37269 45547 42735 68679 67032 63924
13058 63924 51183 32745 18646 7347 -4257 12666 39722 49049 34104 8014 17691 15623
$$ packed form
13148D3530j3951J162J2915Q921m092k4212p228J3181P778J1556n104j0099J4612
13135D8969j0732k9446j2349o4J7363P915J3530J5101r646j5002K039j58j659
13122B5861J4316J4559J7796m795j3897j2446r858N315j1426j2733K984K2217
13110C7893M489k7829K3360J3286l2365O457J7218K7752j7212J691J8248j0198
13098F2790k6362M559J9036j8120n2013j1965L716N724j5957N382J2893P970K0284
13085A7937K8853k416K326N264n360o372J046R139k09l503p000p847j6743l282
13071A1833J1215J682R721J8919L059k1272l0005L2117Q278k812K5944j647l108
13058F3924j2741j8438j4099j1299j1604J6923K7056R327j4945k6090R677k068
$$ plain form
13046 15623 1099 -13859 -18651 -23791 -20817 -2227 28974 75803 98550 104925 94412 81107
13034 81107 67844 55654 36189 38625 51241 80617 125071 113224 94381 87719 80669 65133
13022 65133 59270 66004 42036 40353 56867 71029 58154 35407 34264 49525 57442 64629 67475
13009 67475 68194 73093 84871 109657 116248 97195 88146 70529 58889 53895 42734 46698 62598
12996 62598 71014 55290 71036 86489 86513 90415 101859 120959 128837 102488 104978 146909 170919
12983 170919 188194 213877 237489 238025 229615 221293 198205 184650 159817 131301 108965 113579
12971 113579 119019 84539 60790 45916 19586 22732 22455 12822 19209 19474 26208 64915 85603
12958 85603 114157 129254 125279 144030 143832 133861 110588 87241 47196 8358 -9449 12220
$$ packed form
13046A5623j4524j4958m792n140K974J8590L1201M6829K2747O375j0513j3305
13034H1107j3263j2190j9465K436J2616K9376M4454j1847j8843o662p050j5536
13022F5133n863O734k3968j683J6514J4162j2875k2747j143J5261P917P187K846
13009F7475P19M899J1778K4786O591j9053r049j7617j1640m994j1161L964J5900
12996F2598Q416j5724J5746J5453K4L902J1444J9100P878k6349K490M1931K4010
12983A70919J7275K5683K3612N36q410q322k3088j3555k4833k8516k2336M614
12971A13579N440l4480k3749j4874k6330L146k77r633O387K65O734L8707K0688
12958H5603K8554J5097l975J8751j98r971k3273k3347m0045l8838j7807K1669
$$ plain form
12946 12220 27628 47215 64772 105864 132388 128052 128972 119538 118862 104359 69123 32918 16812
12933 16812 22249 12271 -4358 14729 49642 92900 141898 163919 192978 207439 195962 176600
12921 176600 144168 107937 63605 7607 -40726 -68789 -63283 -43199 -12391 18723 46518 69916
12909 69916 87289 97084 99087 62057 43534 54569 63387 44015 24063 10926 -540 2789
12897 2789 8441 19829 33108 52546 42837 8636 787 -8049 -30647 -78135 -113237 -127132 -122941
12884 -122941 -105609 -60051 14960 43039 68622 116738 163793 172055 184982 203580 201292 195572
12872 195572 171839 144787 134216 129289 142107 137688 143242 159674 178011 187571 175314 165884
12860 165884 162297 178990 202256 204350 169506 119484 65376 16396 -4417 7140 4728 14967
$$ packed form
12946A2220J5408J9587J7557M1092K6524m336R20r434o76j4503l5236l6205j6106
12933A6812N437r978j6629J9087L4913M3258M8998K2021K9059J4461j1477j9362
12921A76600l2432l6231m4332n5998m8333k8063N506K0084L0808L1114K7795K3398
12909F9916J7373R795K003l7030j8523J1035Q818j9372j9952j3137j1466L329
12897B789N652J1388J3279J9438r709l4201p849q836k2598m7488l5102j3895M191
12884a22941J7332M5558P5011K8079K5583M8116M7055Q262J2927J8598k288n720
12872A95572k3733k7052j0571m927J2818m419N554J6432J8337R560j2257r430
12860A65884l587J6693K3266K094l4844n0022n4108m8980k0813J1557k412J0239
$$ plain form
12848 14967 16876 39333 89077 129377 128198 129213 150416 162527 154569 150917 153245 158727 157205
12835 157205 158738 163421 169469 187474 188101 189603 185826 203633 219622 223662 225464 231238 231026 229300
12821 229300 232411 230179 211310 219295 233614 239813 272940 307198 316802 306416 286007 291046 295044
12808 295044 293324 272250 284881 305562 338570 360645 371406 360635 331933 308874 313519 333961
12796 333961 373384 405793 413165 406882 393311 395570 403387 409137 420888 444210 464788 475288
12784 475288 472955 473392 502813 557792 593125 607765 627603 651618 691469 753661 822146 904380
12772 904380 955410 1007073 1056573 1125319 1177804 1237235 1293723 1359004 1400421 1456882 1541396
12761 1541396 1647892 1761521 1867884 1965904 2099975 2253949 2466909 2718813 3012445 3291930
$$ packed form
12848A4967J909K2457M9744M0300j179J015K1203J2111p958l652K328N482j522
12835A57205J533M683O048J8005O27J502l777J7807J5989M040J802N774k12j726
12821B29300L111k232j8869P985J4319O199L3127L4258R604j0386k0409N039L998
12808B95044j720k1074J2631K0681L3008K2075J0761j0771k8702k3059M645K0442
12796C33961L9423L2409P372o283j3571K259P817N750J1751K3322K0578J0500
12784D75288k333M37K9421N4979L5333J4640J9838K4015L9851O2192O8485Q2234
12772I04380N1030N1663M9500O8746N2485N9431N6488O5281M1417N6461Q4514
12761A541396J06496J13629J06363R8020J34071J53974K12960K51904K93632K79485
$$ plain form
12751 3291930 3577845 3862748 4138901 4470478 4905876 5470425 6196749 7141935 8370982
12742 8370982 9867703 11729943 13957051 16614231 19885136 24208809 30316400 39455641
12734 39455641 53892770 78045363 118572273 180148292 256359907 323961088 354299510
12727 354299510 333988369 273675826 200923434 139536077 97456737 71056385 54184032
12720 54184032 42710013 34630611 28805650 24408408 20833385 17800406 15271865 13229604
12712 13229604 11615923 10315352 9247525 8340383 7541498 6880816 6311088 5902569 5698170
12703 5698170 5675296 5761602 5860163 5794212 5519804 5029110 4415480 3803622 3296336 2885697
12693 2885697 2579183 2337686 2133837 1938587 1742165 1586844 1468298 1371990 1270535 1196647
$$ packed form
12751C291930K85915K84903K76153L31577M35398N64549P26324R45186J229047
12742H370982J496721J862240K227108K657180L270905M323673O107591R139241
12734C9455641J4437129K4152593M0526910O1576019P6211615O7601181L0338422
12727C54299510k0311141o0312543p2752392o1387357m2079340k6400352j6872353
12720E4184032j1474019q079402n824961m397242l575023l032979k528541k042261
12712A3229604j613681j300571j067827r07142p98885o60682n69728m08519k04399
12703E698170k2874Q6306R8561o5951k74408m90694o13630o11858n07286m10639
12693B885697l06514k41497k03849j95250j96422j55321j18546r6308j01455p3888
$$ plain form
12683 1196647 1141429 1085748 1037524 1005665 985964 957425 909228 865483 830450 812867 787345
12672 787345 767719 778022 764034 723809 674634 632994 588372 547789 540039 524375 515245 504289
12660 504289 500858 494570 461554 436157 415476 374378 337631 345955 355048 337432 330853 340301 337452
12647 337452 320584 309547 300303 290247 283448 265990 247012 230866 242376 255973 258319 263788
12635 263788 258054 261748 253102 229851 203327 200265 210075 202540 207470 206664 201689 194490 200161 222145
12621 222145 229813 227448 231532 221262 192737 175142 168874 179439 208940 229838 264418 300398
12609 300398 297330 289238 323481 365342 396487 410689 398871 368487 311948 224802 153924 113632
12597 113632 87575 68893 68422 65971 68720 64562 56182 62208 78889 101053 118333 104537 79425
$$ packed form
12683A196647n5218n5681m8224l1859j9701k8539m8197m3745l5033j7583k5522
12672G87345j9626J0303j3988m0225m9175m1640m4622m0583p750j5664r130j0956
12660E04289l431o288l3016k5397k0681m1098l6747Q324R093j7616o579R448k849
12647C37452j6868j1037r244j0056o799j7458j8978j6146J1510J3597K346N469
12635B63788n734L694q646k3251k6524l062R810p535M930q06m975p199N671K1984
12621B22145P668k365M084j0270k8525j7595o268J0565K9501K0898L4580L5980
12609C00398l068q092L4243M1861L1145J4202j1818l0384n6539q7146p0878m0292
12597A13632k6057j8682m71k451K749m158q380O026J6681K2164J7280j3796k5112
$$ plain form
12584 79425 80999 70946 54899 47868 31012 39349 22630 19870 68363 124831 177780 223929
12572 223929 272308 302556 309757 274101 246632 214186 184966 160631 154712 148759 139265 124288
12560 124288 116273 121303 140567 151946 146294 130011 108186 108736 94337 104384 115558 90061
12548 90061 79531 84003 89894 103941 125876 155391 173824 182448 197532 199550 174774 122069
12536 122069 70789 397 -55722 -106626 -112691 -104543 -78056 -55354 10006 61698 80028 108626
12524 108626 101252 68886 47986 35745 8847 -5034 -6954 -37797 -47128 -57084 -35255 -8293
12512 -8293 2294 13879 34016 57837 62258 55616 55798 33750 -5041 -34754 -44669 -25873 -22382
12499 -22382 -19930 1953 24610 45713 66863 76417 81883 71885 82428 106298 87917 87757 89293
$$ packed form
12584G9425J574j0053j6047p031j6856Q337j6719k760M8493N6468N2949M6149
12572B23929M8379L0248P201l5656k7469l2446k9220k4335n919n953r494j4977
12560A24288q015N030J9264J1379n652j6283k1825N50j4399J0047J1174k5497
12548I0061j0530M472N891J4047K1935K9515J8433Q624J5084K018k4776n2705
12536A22069n1280p0392n6119n0904o065Q148K6487K2702O5360N1692J8330K8598
12524A08626p374l2366k0900j2241k6898j3881j920l0843r331r956K1829K6962
12512h293J0587J1585K0137K3821M421o642J82k2048l8791k9713r915J8796L491
12499b2382K452K1883K2657K1103K1150R554N466r998J0543K3870j8381j60J536
$$ plain form
12486 89293 79117 67846 47460 24631 -2675 -7084 1553 18053 40663 39274 45702 36166 47260
12473 47260 51164 63456 57296 21098 -3849 -18765 -21127 -34550 -27036 -12550 9978 28209
12461 28209 32873 9238 13294 43320 36126 7992 1369 4744 -1764 -6435 -28193 -24079 -14188
12448 -14188 -1029 -934 10282 6404 5882 30512 42338 23057 3159 5335 -2242 2629 13651
12435 13651 23199 16783 -4024 -1553 -4503 -29324 -22182 -15024 16394 30164 55221 54456 53092
12422 53092 46941 26165 5668 -12587 -26975 -20763 -2611 26486 53419 72213 77866 70330
12410 70330 42185 37619 63671 69570 37361 39409 44654 33775 24620 29181 25134 15886 -6500
12397 -6500 119 -195 1481 1609 2791 9686 16512 30608 58773 61637 62657 59336 68086 62987 54913
$$ packed form
12486H9293j0176j1271k0386k2829k7306m409Q637J6500K2610j389O428r536J1094
12473D7260L904J2292o160l6198k4947j4916k362j3423P514J4486K2528J8231
12461B8209M664k3635M056L0026p194k8134o623L375o508m671k1758M114R891
12448a4188J3159R5J1216l878n22K4630J1826j9281j9898K176p577M871J1022
12435A3651R548o416k0807K471k950k4821P142P158L1418J3770K5057p65j364
12422E3092o151k0776k0497j8255j4388O212J8152K9097K6933J8794N653p536
12410G0330k8145m566K6052N899l2209K048N245j0879r155M561m047r248k2386
12397f500O619l14J676J28J182O895O826J4096K8165K864J020l321Q750n099q074
$$ plain form
12382 54913 49533 32348 19621 27916 32635 25231 17649 30999 28823 18394 28008 52687 56082
12369 56082 64620 54907 42926 36103 22250 9426 9362 30881 12424 -18797 -37232 -38831 -33154
12356 -33154 -29773 5225 20637 35817 17897 11251 2601 11484 37692 44534 51027 25488 -8499
12343 -8499 -7067 -6212 12033 33576 24179 35493 33927 36011 14202 15643 -1490 -14135 -5171
12330 -5171 4126 5408 -10362 -22476 -22237 -8114 -17327 -15889 -8692 7811 -56 -16083 -11017 6263
12316 6263 23474 36619 19447 -1985 -5349 7748 23090 38471 35423 23477 36771 33410
12304 33410 8082 -13764 -5026 -6934 -18697 -3573 7361 5807 8587 28597 60761 87055
12292 87055 92302 83563 75897 83355 102418 115066 125876 147972 195365 276331 420090 664511
$$ packed form
12382E4913n380j7185j2727Q295M719p404p582J3350k176j0429R614K4679L395
12369E6082Q538r713j1981o823j3853j2824o4K1519j8457l1221j8435j599N677
12356c3154L381L4998J5412J5180j7920o646q650Q883K6208O842O493k5539l3987
12343h499J432Q55J8245K1543r397J1314j566K084k1809J441j7133j2645Q964
12330e171R297J282j5770j2114K39J4123r213J438P197J6503p867j6027N066J7280
12316F263J7211J3145j7172k1432l364J3097J5342J5381l048j1946J3294l361
12304C3410k5328k1846Q738j908j1763J5124J0934j554K780K0010L2164K6294
12292H7055N247q739p666P458J9063J2648J0810K2096M7393Q0966J43759K44421
$$ plain form
12280 664511 1010233 1418274 1768930 1919541 1821811 1503685 1112029 768914 531174 384308
12270 384308 295312 237294 203903 186659 162801 170636 175231 156557 143277 129938 123885 105749
12258 105749 67453 45433 33531 4385 -12249 -9678 -10877 -8562 21517 48128 74679 97305
12246 97305 86384 78472 67011 53490 40638 27412 -4418 -22854 -15066 -9373 -16327 21245
12234 21245 26563 29972 33740 45272 60865 81963 76646 76860 53944 19138 8612 5496 -6498
12221 -6498 -7662 4990 383 -8730 -1503 5508 -10121 4305 18155 14757 -961 -2512 5187
12208 5187 13098 -3198 -7984 10717 14923 -952 -13032 -33480 -32251 -12085 8353 21895 50170
12195 50170 46058 23848 31480 46511 49784 43216 33466 21656 4789 -29977 -19064 -2405 3323
$$ packed form
12280F64511L45722M08041L50656J50611r7730l18126l91656l43115k37740j46866
12270C84308q8996n8018l3391j7244k3858P835M595j8674j3280j3339o053j8136
12258A05749l8296k2020j1902k9146j6634K571j199K315L0079K6611K6551K2626
12246I7305j0921p912j1461j3521j2852j3226l1830j8436P788N693o954L7572
12234B1245N318L409L768J1532J5593K1098n317K14k2916l4806j0526l116j1994
12221f498j164J2652m607r113P227P011j5629J4426J3850l398j5718j551P699
12208E187P911j6296m786J8701M206j5875j2080k0448J229K0166K0438J3542K8275
12195E0170m112k2210P632J5031L273o568r750j1810j6867l4766J0913J6659N728
$$ plain form
12182 3323 14895 21285 35424 27930 21627 -11043 6249 16637 23412 35266 26657 43406 46007
12169 46007 40953 15855 -3463 -15155 16844 20034 5098 15049 23363 18193 20894 34963 37245
12156 37245 73438 108847 112565 119191 164999 204888 294715 464808 613441 630141 512755
12145 512755 329910 199750 148993 100360 67282 43539 25200 15321 18398 12550 18173 30336
12133 30336 13252 11388 9924 9184 -13311 -36574 -12977 -14313 -30541 -27305 -15872 -3867 -11123
12120 -11123 -26707 5420 40337 40276 32542 5221 21874 50926 63645 67287 49596 35654 19457
12107 19457 42190 59466 35750 10343 -3637 -24489 -12714 -17419 -27695 -30697 -32660 -28740
12095 -28740 -9701 18340 23918 2382 -18240 -13623 11003 20431 12779 20760 20081 16937 32650
$$ packed form
12182C323J1572O390J4139p494o303l2670J7292J0388O775J1854q609J6749K601
12169D6007n054k5098j9318j1692L1999L190j4936R951Q314n170K701J4069K282
12156C7245L6193L5409L718O626M5808L9889Q9827J70093J48633J6700j17386
12145E12755j82845j30160n0757m8633l3078k3743j8339r879L077n848N623J2163
12133C0336j7084j864j464p40k2495k3263K3597j336j6228L236J1433J2005p256
12120a1123j5584L2127L4917o1p734k7321J6653K9052J2719L642j7691j3942j6197
12107A9457K2733J7276k3716k5407j3980k0852J1775m705j0276l002j963L920
12095b8740J9039K8041N578k1536k0622M617K4626R428p652P981o79l144J5713
$$ plain form
12082 32650 46789 49847 64842 56498 25779 -15965 -23136 -19805 -35017 -24313 -14512 -7847 1384
12069 1384 -6713 -18059 -26747 -16359 -22078 -18758 -8810 -7826 3116 227 1750 -14165 -6623 10939
12055 10939 23108 20019 32020 21904 26447 26971 22850 15985 6154 -26581 -27774 -37952 -34538
12042 -34538 -23066 -23943 -14198 -9011 -34216 -21468 6127 -5858 2016 1593 8759 11890 6954 3922
12028 3922 9952 -12899 -31549 -7075 20924 16898 26624 36148 30891 41332 55961 49363 46442
12015 46442 36104 16778 17946 27233 12348 -16157 -2446 -14772 -22326 -17639 9468 11196 8790
12002 8790 21650 21798 21989 10343 -5482 14554 31345 31407 31877 41189 56230 36574 25837 28876
11988 28876 28534 12513 15929 5094 28138 42554 50228 43264 63802 84901 102774 114566 134663
$$ packed form
12082C2650J4139L058J4995q344l0719m1744p171L331j5212J0704R801O665R231
12069A384q097j1346q688J0388n719L320R948R84J0942k889J523j5915P542J7562
12055A0939J2169l089J2001j0116M543N24m121o865r831l2735j193j0178L414
12042c4538J1472q77R745N187k5205J2748K7595j1985P874m23P166L131m936l032
12028C922O030k2851j8650K4474K7999m026R726R524n257J0441J4629o598k921
12015D6442j0338j9326J168R287j4885k8505J3711j2326p554M687K7107J728k406
12002H790J2860J48J91j1646j5825K0036J6791O2M70R312J5041j9656j0737L039
11988B8876l42j6021L416j0835K3044J4416P674o964K0538K1099J7873J1792K0097
$$ plain form
11975 134663 142258 139485 137730 125741 104871 104097 114286 114968 115114 132621 124425 105332 94447
11962 94447 51723 33632 41242 39042 48196 69197 58676 24051 15116 23412 36530 35310 48898
11949 48898 43602 16303 13647 24719 20392 4484 2959 18160 1577 367 -13620 -15755 1423
11936 1423 13145 31119 44554 47412 34597 25790 33310 46675 58263 47643 27547 21884 32835
11923 32835 38203 22910 11273 8001 -17332 -38551 -19600 21285 42290 36467 28952 18788
11911 18788 11887 9170 14989 18701 23773 46836 62001 45005 23063 26131 27330 28968 39809
11898 39809 42081 10191 -7374 8527 24250 19552 -7896 -24046 -28302 -39819 -34932 -11732
11886 -11732 3344 8020 2817 -6118 -15822 -1651 9087 10358 9701 25669 27719 8412 6518
$$ packed form
11975A34663P595k773j755j1989k0870p74J0189O82J46J7507q196j9093j0885
11962I4447m2724j8091P610k200R154K1001j0521l4625q935Q296J3118j220J3588
11949D8898n296k7299k656J1072m327j5908j525J5201j6583j210j3987k135J7178
11936A423J1722J7974J3435K858j2815q807P520J3365J1588j0620k0096n663J0951
11923C2835N368j5293j1637l272k5333k1219J8951M0885K1005n823p515j0164
11911A8788o901k717N819L712N072K3063J5165j6996k1942L068J199J638J0841
11898C9809K272l1890j7565J5901J5723m698k7448j6150m256j1517M887K3200
11886a1732J5076M676n203q935r704J4171J0738J271o57J5968K050j9307j894
$$ plain form
11873 6518 -2661 -17615 -5217 -23029 -27154 -15456 -9387 11989 23623 14943 11124 17005 24452
11860 24452 16636 28598 37351 59495 74436 86614 57797 20845 3827 6516 24657 36115
11848 36115 30749 25789 19822 32945 10925 8575 17879 12250 14515 34125 31994 8720 15858
11835 15858 23170 15522 29868 15114 -7970 -1677 5342 23668 51880 29412 10504 15703 21376
11822 21376 9892 8672 13372 24182 1230 -1356 21415 27996 29738 36945 39650 40421 24704
11809 24704 4106 -2680 -2713 -4333 -21050 -23551 -17854 -25926 -29527 -28618 -11911 -4673 13326 10252
11795 10252 2063 -12675 -7128 -11659 -12339 18881 44557 52234 40816 32339 45619 36517 6336
11782 6336 -14010 -29763 -10755 -4297 -650 16835 2800 -11334 -7825 -10853 2294 10165 9354
$$ packed form
11873F518r179j4954J2398j7812m125J1698O069K1376J1634q680l819N881P447
11860B4452p816J1962Q753K2144J4941J2178k8817l6952j7018K689J8141J1458
11848C6115n366m960n967J3123k2020k350R304n629K265J9610k131k3274P138
11835A5858P312p648J4346j4754k3084O293P019J8326K8212k2468j8908N199N673
11822B1376j1484j220M700J0810k2952k586K2771O581J742P207K705P71j5717
11809B4704k0598o786l3j620j6717k501N697q072l601R09J6707P238J7999l074
11795A0252q189j4738N547m531o80L1220K5676P677j1418q477J3280r102l0181
11782F336k0346j5753J9008O458L647J7485j4035j4134L509l028J3147P871q11
$$ plain form
11769 9354 684 -1632 9868 18786 15488 15659 -13372 -9895 -445 -13712 10569 38069 38709 16551
11755 16551 12024 10101 6831 7620 10544 -7634 -8314 -30938 -17569 -9113 -9394 -2115 2519 3131 9238
11740 9238 153 -22699 -28852 -23739 -25553 -20889 -21449 -29377 -15354 9126 2633 -6939 -29580 -29697
11726 -29697 -17150 10389 19029 11330 -24310 -35252 -28497 569 35005 37811 15370 18155 6233
11713 6233 -12506 -1640 10390 1315 -11372 7367 -13193 -21529 -20662 -29684 -28168 -15513 -6768
11700 -6768 7822 16447 23386 -4706 -23933 -22187 -14947 -16714 -12580 -16530 -9562 -13236 -17846 -29478
11686 -29478 -29387 -18270 -28228 -34896 -17937 -32159 -28975 -14087 -11190 -243 -2147 -12828 -9762
11673 -9762 8186 31187 27862 9672 589 3879 5136 20752 22697 2353 -16758 -24167 -19026
$$ packed form
11769I354q670k316J1500Q918l298J71k9031L477R450j3267K4281K7500O40k2158
11755A6551m527j923l270P89K924j8178o80k2624J3369Q456k81P279M634O12O107
11740I238r085k2852o153N113j814M664n60p928J4023K4480o493r572k2641j17
11726b9697J2547K7539Q640p699l5640j0942O755K9066L4436K806k2441K785j1922
11713F233j8739J0866J2030r075j2687J8739k0560q336Q67r022J516J2655Q745
11700f768J4590Q625O939k8092j9227J746P240j767M134l950O968l674m610j1632
11686b9478R1J1117r958o668J6959j4222L184J4888K897J0947j904j0681L066
11673i762J7948K3001l325j8190r083L290J257J5616J945k0344j9111p409N141
$$ plain form
11660 -19026 -18484 -19461 -8984 -371 15353 17613 211 -8006 -13946 -11722 -4396 1008 -4346 13219
11646 13219 11932 11960 -4580 -20705 -42910 -37503 -28568 2204 10823 19723 23643 17034 -16765 -14020
11632 -14020 -3755 -7983 2696 -954 11520 5265 169 18454 11404 5392 -19384 -30049 -4058
11619 -4058 -9341 -23455 -16608 -8103 -14368 -22119 -16723 -8237 -607 10020 26086 36642 15182
11606 15182 -5342 -6129 -364 2773 -3531 506 -1595 -11025 -6891 10958 21923 4536 -30082
11593 -30082 -23677 25797 51506 49222 34337 22967 16982 8001 -20473 -20301 -8326 -13460 -17542
11580 -17542 1671 894 -12711 -20332 -1980 21276 40214 36370 9495 -12893 -13951 -2713 22575
11567 22575 27781 32355 28121 30664 41272 36434 15128 -1396 -1405 20195 21690 6476 12002 20086
$$ packed form
11660a9026N42r77J0477Q613J5724K260j7402q217n940K224P326N404n354J7565
11646A3219j287K8j6540j6125k2205N407Q935L0772Q619Q900L920o609l3799K745
11632a4020J0265m228J0679l650J2474o255n096J8285p050o012k4776j0665K5991
11619d058n283j4114O847Q505o265p751N396Q486P630J0627J6066J0556k1460
11606A5182k0524p87N765L137o304M037k101r430M134J7849J0965j7387l4618
11593c0082O405M9474K5709k284j4885j1370n985q981k8474J72J1975n134m082
11580a7542J9213p77j3605p621J8352K3256J8938l844k6875k2388j058J1238K5288
11567B2575N206M574m234K543J0608m838k1306j6524rK1600J495j5214N526Q084
$$ plain form
11553 20086 17803 6754 -183 851 14488 10340 -14324 -8735 6919 16521 11267 -732 2797
11540 2797 19877 14216 19230 16323 10927 2801 2589 12965 23201 1559 -17623 -11859 -5901 15819
11526 15819 32587 16704 7621 3343 -4329 1029 -2646 -6458 6197 2104 14661 10846 5127
11513 5127 17487 13443 -8714 -17247 -15317 -4618 938 23755 16867 7049 -20925 -21395 15949
11500 15949 1962 -318 4528 5466 1238 -7782 4933 14177 8819 9387 17693 12750 5612 -13308
11486 -13308 -25285 -28166 -26198 3159 35129 33884 11537 -2327 14742 18356 17138 17986 2029
11473 2029 -10772 17096 12348 11603 17921 6545 8901 19881 29019 12109 14815 15101 16124 11379
11459 11379 -4032 6204 15832 -2364 -15807 -13455 -13856 -5837 26836 21221 5488 -6748 261
$$ packed form
11553B0086k283j1049o937J034J3637m148k4664N589J5654R602n254j1999L529
11540B797J7080n661N014k907n396q126k12J0376J0236k1642j9182N764N958K1720
11526A5819J6768j5883r083m278p672N358l675l812J2655m093J2557l815n719
11513E127J2360m044k2157q533J930J0699N556K2817o888r818k7974m70L7344
11500A5949j3987k280M846R38m228r020J2715R244n358N68Q306m943p138j8920
11486a3308j1977k881J968K9357L1970j245k2347j3864J7069L614j218Q48j5957
11473B029j2801K7868m748p45O318j1376K356J0980R138j6910K706K86J023m745
11459A1379j5411J0236R628j8196j3443K352m01Q019L2673n615j5733j2236P009
$$ plain form
11446 261 -230 19554 38822 30921 18189 -7798 -17438 -10608 -14379 12161 25423 10341 2717
11433 2717 20292 28460 16517 -53 -18685 -22552 -22848 -25507 -19357 -37846 -39756 -44077 -45238 -36900
11419 -36900 -7864 12725 -6427 -16902 671 22971 21975 22706 29686 30290 19251 -16607 -18148
11406 -18148 587 -3770 9919 10940 -13680 -1757 22300 14046 -5626 -16095 -236 7601
11394 7601 25988 18813 7402 -13217 -15072 -16728 -19323 -12508 3852 -6376 -20533 -8730 -13387
11381 -13387 -18356 -19384 1575 22959 8858 -7964 589 -5577 -12994 -7979 8492 15930 30228
11368 30228 17980 -1212 -15500 -3894 -3362 10192 11501 9058 4842 -4330 -5594 -7533 -20867
11355 -20867 -21807 -27780 -26809 -9950 4152 17169 23544 35858 15636 -16894 -19529 -21387 -41753
$$ packed form
11446B61m91J9784J9268p901j2732k5987r640O830l771K6540J3262j5082p624
11433B717J7575Q168j1943j6570j8632l867k96k659O150j8489j910m321j161Q338
11419c6900K9036K0589j9152j0475J7573K2300r96P31O980O04j1039l5858j541
11406a8148J8735m357J3689J021k4620J1923K4057q254j9672j0469J5859P837
11394G601J8387p175j1411k0619j855j656k595O815J6360j0228j4157J1803m657
11381a3387m969j028K0959K1384j4101j6822Q553o166p417N015J6471P438J4298
11368C0228j2248j9192j4288J1606N32J3554J309k443m216r172j264j939j3334
11355b0867r40n973R71J6859J4102J3017O375J2314k0222l2530k635j858k0366
$$ plain form
11342 -41753 -34389 -7184 4308 14714 23618 27634 32014 24664 26332 42970 53031 60535 67407
11329 67407 71878 75432 66919 61452 50359 33896 47006 60097 55365 17084 8312 14438 22406
11316 22406 23382 19332 668 18929 5432 5545 3187 -21596 -10811 -2969 -606 -3045 4867 6176
11302 6176 888 5657 15071 9812 14837 16926 8840 3064 4744 10609 -9108 12355 24281 33421
11288 33421 43278 22481 21058 26693 16469 12830 -1778 20596 52913 67676 50223 48348 50320
11275 50320 42690 12516 -42 -10378 6594 12358 9815 -809 -11976 -14279 -3168 7359
11263 7359 22832 15556 -4375 1127 -3174 6983 5121 8231 18009 12356 14596 20107 30959 24069
11249 24069 9809 24027 13773 8046 7841 1080 -13422 -1424 11421 10972 25638 31880 34500
$$ packed form
11342d1753P364K7205J1492J0406Q904M016M380p350J668J6638J0061P504O872
11329F7407M471L554q513n467j1093j6463J3110J3091m732l8281q772O126P968
11316B2406R76m050j8664J8261j3497J13k358k4783J0785P842K363k439P912J309
11302F176n288M769R414n259N025K089q086n776J680N865j9717K1463J1926R140
11288C3421R857k0797j423N635j0224l639j4608K2374L2317J4763j7453j875J972
11275E0320p630l0174j2558j0336J6972N764k543j0624j1167k303J1111J0527
11263G359J5473p276j9931N502m301J0157j862L110R778n653K240N511J0852o890
11249B4069j4260J4218j0254n727k05o761j4502J1998J2845m49J4666O242K620
$$ plain form
11236 34500 35771 33171 12742 8933 15921 3281 -2657 2917 -1964 2638 2537 11444 12231 21826
11222 21826 13947 15709 16524 -4232 5316 -2620 4853 -6024 -25704 -31672 -16052 10449 16931
11209 16931 18094 24237 19060 2129 2890 -6448 -10086 3469 2484 8664 4318 -30154 -48725 -39529
11195 -39529 -12937 18360 18240 11300 12278 9510 23094 16564 15665 16952 24722 12695 25693 26575
11181 26575 14567 21800 11852 141 -20632 -36013 -20928 -6115 -587 14419 8999 15354 37182
11168 37182 60917 45687 10388 23872 46566 40305 35363 32534 12760 4677 11702 18693 39251
11155 39251 12221 821 -6869 -14011 -10475 -4803 6618 17680 25700 29001 34042 34900 24845
11142 24845 29244 36501 32527 5318 4108 -15765 -607 11125 -2355 1633 22086 11343 -7805
$$ packed form
11236C4500J271k600k0429l809O988j2640n938N574m881M602j01Q907P87R595
11222B1826p879J762Q15k0756R548p936P473j0877j9680n968J5620K6501O482
11209A6931J163O143n177j6931P61r338l638J3555r85O180m346l4472j8571R196
11195c9529K6592L1297j20o940R78k768J3584o530q99J287P770j2027J2998Q82
11181B6575j2008P233r948j1711k0773j5381J5085J4813N528J5006n420O355K1828
11168C7182K3735j5230l5299J3484K2694o261m942k829j9774q083P025O991K0558
11155C9251k7030j1400p690p142L536N672J1421J1062Q020L301N041Q58j0055
11142B4845M399P257l974k7209j210j9873J5158J1732j3480L988K0453j0743j9148
$$ plain form
11129 -7805 9858 24464 16153 14805 9818 28645 38983 20306 9027 -12934 -3078 19226 5476
11116 5476 18266 6116 -1833 -5404 -9260 -21014 -21563 -10527 -538 1446 -14300 3292 19564
11103 19564 -7706 -18591 -25335 -56369 -40620 -6431 393 -12005 -7691 -14967 -7766 23927 29813
11090 29813 29399 22112 24219 23902 562 -15820 -4420 -6028 -6140 -20520 -38256 -37593 -6333 -313
11076 -313 -5274 10186 31950 27914 23230 17043 33600 27196 17048 1434 3159 16990 11621
11063 11621 9105 3625 1331 -4464 -26778 -17480 -5026 4269 4613 8178 958 19447 24462 -16670
11049 -16670 -41094 -34030 1072 8330 -3974 -9945 -16397 -16159 -18640 3063 18802 20070 15886
11036 15886 14737 27224 27591 19021 27985 8694 4147 3649 -6503 12212 14848 16649 4787 -7414
$$ packed form
11129g805J7663J4606q311j348m987J8827J0338j8677j1279k1961R856K2304j3750
11116E476J2790j2150p949l571l856j1754n49J1036R989J984j5746J7592J6272
11103A9564k7270j0885o744l1034J5749L4189O824j2398M314p276P201L1693N886
11090B9813m14p287K107l17k3340j6382J1400j608j12j4380j7736O63L1260O020
11076c13m961J5460K1764m036m684o187J6557o404j0148j5614J725J3831n369
11063A1621k516n480k294n795k2314R298J2454R295L44L565p220J8489N015m1132
11049a6670k4424P064L5102P258j2304n971o452K38k481K1703J5739J268m184
11036A5886j149J2487L67q570Q964j9291m547m98j0152J8715K636J801j1862j2201
$$ plain form
11022 -7414 6504 6575 15923 15760 -3743 -3646 -23503 -37705 -34126 -14225 -3736 619 6513 1456
11008 1456 -7080 -6616 3420 4512 -5271 -9801 -14227 -1933 22691 46213 39490 43590 42641 33056
10994 33056 32249 10924 4535 -4536 -19340 -3658 25264 19614 15011 15832 22366 34228 41201 46672
10980 46672 32109 44627 57919 50664 35585 44308 41313 30978 -1398 -20731 -19438 -17127 -12064
10967 -12064 39 27394 64877 106392 127433 112277 73382 39528 8355 -17363 -41533 -66303
10955 -66303 -46281 -14290 6377 18363 12136 22498 41545 84730 83218 64485 43114 15011
10943 15011 12907 -14224 -46170 -52348 -42242 -45402 -41924 -21717 -13803 13061 19216 15130 14700
10930 14700 38959 64614 58496 29824 20762 -829 -26147 -29377 -18299 -2909 7629 33164
$$ packed form
11022g414J3918P1R348j63j9503R7j9857j4202L579J9901J0489M355N894n057
11008A456q536M64J0036J092r783m530m426J2294K4624K3522o723M100r49r585
10994C3056q07k1325o389r071j4804J5682K8922n650m603Q21O534J1862O973N471
10980D6672j4563J2518J3292p255j5079Q723k995j0335l2376j9333J293K311N063
10967a2064J2103K7355L7483M1515K1041j5156l8895l3854l1173k5718k4170k4770
10955f6303K0022L1991K0667J1986o227J0362J9047M3185j512j8733k1371k8103
10943A5011k104k7131l1946o178J0106l160L478K0207P914K6864O155m086m30
10930A4700K4259K5655o118k8672r062k1591k5318l230J1078J5390J0538K5535
$$ plain form
10918 33164 37848 44380 44157 42691 27572 12804 -8703 -20693 -20577 -6852 -10372 -15174 -8711 -8525
10904 -8525 12884 20359 36106 37515 39152 47410 45351 29800 33509 58780 53422 42333 30103
10891 30103 18312 9895 11536 42174 82176 147767 196497 276266 376064 517929 744789 1061387
10879 1061387 1407989 1663282 1767100 1689120 1455729 1106836 770045 545160 408682 305872
10869 305872 222388 189238 155491 136183 127090 117798 117659 119431 116963 111112 120099 134243 114700
10856 114700 86069 85831 76522 68426 64806 55941 31173 7380 30329 56069 50867 40463 41633
10843 41633 45826 60872 63340 60928 52747 41572 14330 14209 19526 2285 -7122 17702 42375
10830 42375 32358 32728 37287 40117 47904 58703 55447 49226 66307 83662 65370 40930 14038
$$ packed form
10918C3164M684O532k23j466j5119j4768k1507j1990J16J3725l520m802O463J86
10904h525K1409P475J5747J409J637Q258k059j5551L709K5271n358j1089j2230
10891C0103j1791q417J641L0638M0002O5591M8730P9769R9798J41865K26860L16598
10879A061387L46602K55293J03818p7980k33391l48893l36791k24885j36478j02810
10869C05872q3484l3150l3747j9308r093r292j39J772k468n851Q987J4144j9543
10856A14700k8631k38r309q096l620q865k4768k3793K2949K5740n202j0404J170
10843D1633M193J5046K468k412q181j1175k7242j21N317j7241r407K4824K4673
10830D2375j0017L70M559K830P787J0799l256o221J7081J7355j8292k4440k6892
$$ plain form
10817 14038 23614 64256 75299 63673 45726 20198 7462 26048 57920 65051 45682 33480
10805 33480 25439 18760 39632 49316 35841 42011 45798 41646 28284 26897 23717 9162 4953
10792 4953 4031 6443 13876 6819 12453 16088 28136 39257 20702 34801 52002 61648 62589 66821
10778 66821 37253 31932 29911 19020 32794 38098 44271 53981 58667 63723 54331 48317 34068
10765 34068 27254 26809 41277 41444 49917 60227 72348 74516 96152 107933 100315 93086 80130
10752 80130 69077 86798 100708 89683 84933 85398 76748 63802 60909 51740 42276 30505 52615
10739 52615 50230 44579 70935 68444 68084 81069 121576 142549 138292 129900 134170 134091 177334 202684
10725 202684 208856 230550 254132 251925 234042 194747 166664 163007 149241 110382 82798 74886
$$ packed form
10817A4038R576M0642J1043j1626j7947k5528j2736J8586L1872P131j9369j2202
10805C3480q041o679K0872R684j3475O170L787m152j3362j387l180j4555m209
10792D953r22K412P433p057N634L635J2048J1121j8555J4099J7201R646R41M232
10778F6821k9568n321k021j0891J3774N304O173R710M686N056r392o014j4249
10765C4068o814m45J4468J67Q473J0310J2121K168K1636J1781p618p229j2956
10752H0130j1053J7721J3910j1025m750M65q650j2946k893r169r464j1771K2110
10739E2615k385n651K6356k491l60J2985M0507K0973m257q392M270p9M3243K5350
10725B02684O172K1694K3582k207j7883l9295k8083l657j3766l8859k7584p912
$$ plain form
10713 74886 51810 38680 18829 -16559 -22590 -13150 -17979 -11067 3080 26317 47749 60066
10701 60066 87767 126254 144732 128002 114634 100660 92492 71240 25498 -12367 -18598 -5553
10689 -5553 5404 31443 64951 121759 160289 151189 159726 172136 167613 145101 117750 88007
10677 88007 69721 15939 -28764 -38069 5131 45011 82978 137033 175949 183504 191409 183922
10665 183922 159756 127978 95018 36360 -14078 -42022 -68261 -69801 -78836 -44506 448 43351
10653 43351 88732 112764 94964 97494 100236 101396 70641 61756 52443 64727 60805 46392 38076
10640 38076 39338 59977 64013 51886 51686 38574 13230 -21424 -67687 -95750 -114202 -148854
10628 -148854 -150765 -97904 -57128 -16423 28968 84046 134921 149025 144655 151651 170593 174982
$$ packed form
10713G4886k3076j3130j9851l5388o031R440m829O912J4147K3237K1432J2317
10701F0066K7701L8487J8478j6730j3368j3974q168k1252m5742l7865o231J3045
10689e553J0957K6039L3508N6808L8530r100Q537J2410m523k2512k7351k9743
10677H8007j8286n3782m4703r305M3200L9880L7967N4055L8916P555P905p487
10665A83922k4166l1778l2960n8658n0438k7944k6239j540r035L4330M4954M2903
10653D3351M5381K4032j7800K530K742J160l0755q885r313J2284l922j4413q316
10640C8076J262K0639M036j2127k00j3112k5344l4654m6263k8063j8452l4652
10628a48854j911N2861M0776M0705M5391N5078N0875J4104m370O996J8942M389
$$ plain form
10616 174982 169074 167755 159323 144431 138159 118582 134963 153979 161583 173248 180859 166156 181206
10603 181206 170896 164179 148027 136113 110293 52732 12459 -4853 -15637 -17276 -2857 25332
10591 25332 53746 42854 53140 67946 93550 127730 141480 131631 134340 127604 113678 122827
10579 122827 141049 162217 157602 167554 174270 178569 188139 210533 231448 258755 267176 276622 275688
10566 275688 254425 234477 222553 213163 234302 245101 252028 251733 279980 319735 339954 345835
10554 345835 368398 357409 354937 361225 344395 350520 368113 369700 377560 380675 356312 343788 372671
10541 372671 386547 387481 391175 393981 389647 384329 423977 437064 469809 488894 479324 480908 494762
10528 494762 504411 521932 532046 534497 563557 595808 616021 651017 701956 741315 795189 865768
$$ packed form
10616A74982n908j319q432j4892o272j9577J6381J9016P604J1665P611j4703J5050
10603A81206j0310o717j6152j1914k5820n7561m0273j7312j0784j639J4419K8189
10591B5332K8414j0892J0286J4806K5604L4180J3750r849K709o736j3926R149
10579A22827J8222K1168m615R952O716M299R570K2394K0915K7307Q421R446r34
10566B75688k1263j9948j1924r390K1139J0799O927k95K8247L9755K0219N881
10554C45835K2563j0989k472O288j6830O125J7593J587P860L115k4363j2524K8883
10541C72671J3876R34L694K806m334n318L9648J3087L2745J9085r570J584J3854
10528D94762R649J7521J0114K451K9060L2251K0213L4996N0939L9359N3874P0579
$$ plain form
10516 865768 939281 1015755 1095419 1149396 1184211 1239982 1297433 1370682 1456047 1522373 1596380
10505 1596380 1709029 1809557 1914188 2047365 2197198 2394363 2684492 3039159 3486796
10496 3486796 4040999 4667848 5242094 5689653 5960619 6067424 6155938 6380425 6837225 7525749
10486 7525749 8475884 9684784 11179154 13118231 15664314 19131027 23942263 30790072
10478 30790072 41102501 57475722 84126858 125457656 181869045 244908705 298025327
10471 298025327 323712125 312576903 269955820 211393074 154226187 109271647 78393886
10464 78393886 58303178 44997083 35749935 29067872 24094779 20313977 17404466 15121128
10456 15121128 13308521 11868887 10718234 9801749 9070669 8534190 8200034 7952504 7709276
$$ packed form
10516H65768P3513P6474P9664N3977L4815N5771N7451P3249Q5365O6326P4007
10505A596380J12649J00528J04631J33177J49833J97165K90129L54667M47637
10496C486796N54203O26849N74246M47559K70966J06805Q8514K24487M56800O88524
10486G525749R50135J208900J494370J939077K546083L466713M811236O847809
10478C0790072J0312429J6373221K6651136M1330798N6411389O3039660N3116622
10471B98025327K5686798j1135222m2621083n8562746n7166887m4954540l0877761
10464G8393886k0090708j3306095r247148o682063m973093l780802k909511k283338
10456A5121128j812607j439634j150653r16485p31080n36479l34156k47530k43228
$$ plain form
10447 7709276 7441657 7115995 6798710 6561704 6371959 6121195 5701176 5128979 4475852
10438 4475852 3866672 3364498 2975609 2661344 2392780 2162084 1970018 1788063 1646183
10429 1646183 1526300 1415430 1317949 1261757 1203029 1150298 1101941 1086415 1064404 1026401 998280
10418 998280 951624 927059 900936 874435 854492 847537 806250 752307 710337 701499 700586 673037
10406 673037 660207 665659 709566 784311 889490 1017570 1080128 1012212 847191 687902 571145
10395 571145 500635 485699 466908 449103 449321 411026 384114 376257 330884 266978 256235 259553
10383 259553 268470 290311 297466 297548 304354 294356 266045 262783 264135 227765 232948 238197 248287 268441
10369 268441 270131 273370 266951 250455 255652 270459 249541 226185 231764 241739 244131 247791 247981
$$ packed form
10447G709276k67619l25662l17285k37006j89745k50764m20019n72197o53127
10438D475852o09180n02174l88889l14265k68564k30696j92066j81955j41880
10429A646183j19883j10870r7481n6192n8728n2731m8357j5526k2011l8003k8121
10418I98280m6656k4565k6123k6501j9943o955m1287n3943m1970q838r13k7549
10406F73037j2830N452M3907P4745J05179J28080O2558o7916j65021j59289j16757
10395E71145p0510j4936j8791j7805K18l8295k6912p857m5373o3906j0743L318
10383B59553Q917K1841P155Q2O806r998k8311l262J352l6370N183N249J0090K0154
10369B68441J690L239o419j6496N197J4807k0918k3356N579R975K392L660J90
$$ plain form
10356 247981 249077 267944 285747 306986 341166 402979 420741 437623 458094 465393 453160 410219
10344 410219 348878 279829 198423 152157 124764 105035 89367 84525 101802 118248 120614 109911
10332 109911 118610 130934 122354 120176 116346 97661 83780 68168 66469 63942 53481 47800 60798
10319 60798 86489 135606 187364 249756 297980 308275 303073 281414 270666 244934 205124 191698
10307 191698 158853 144201 145773 139496 143876 137560 107712 123803 117862 125962 148814 136747 114342
10294 114342 122210 128305 138426 112174 138180 161233 166893 183692 223429 257826 285842 282047
10282 282047 272532 233370 182571 154341 107655 36676 -22841 -57145 -57237 -15597 13117 33192
10270 33192 72742 111742 137993 136219 101071 72995 62475 65550 35117 -6268 -31744 -35735
$$ packed form
10356B47981J096J8867J7803K1239L4180O1813J7762J6882K0471P299j2233m2941
10344D10219o1341o9049q1406m6266k7393j9729j5668m842J7277J6446K366j0703
10332A09911Q699J2324q580k178l830j8685j3881j5612j699k527j0461n681J2998
10319F0798K5691M9117N1758O2392M8224J0295n202k1659j0748k5732l9810j3426
10307A91698l2845j4652J572o277M380o316k9848J6091n941Q100K2852j2067k2405
10294A14342P868O095J0121k6252K6006K3053N660J6799L9737L4397K8016l795
10282B82047r515l9162n0799k8230m6686p0979n9517l4304r2M1640K8714K0075
10270C3192L9550L9000K6251j774l5148k8076j0520L075l0433m1385k5476l991
$$ plain form
10258 -35735 -31755 1752 2414 13149 48826 60954 57379 75876 57424 33585 33689 32378 19253
10245 19253 7630 10018 12721 9196 12525 33734 44259 79530 91731 96361 109270 90285 73497
10232 73497 82929 60005 61085 82296 81696 75243 53167 11202 11505 37017 59408 67005 70344
10219 70344 50952 50091 88249 94093 70994 56923 44646 32801 -3611 -12509 -28711 -44904
10207 -44904 -26138 -6643 3901 277 16089 13174 21969 39090 44678 29703 32662 27108 15424
10194 15424 -379 -18676 -16946 -11675 -24731 -23658 1834 6159 4261 -8631 6589 19627 11924
10181 11924 13465 28751 22390 23482 48236 42119 27266 2264 -18302 -25795 -15398 -11086 -1553
10168 -1553 13810 12001 13238 26026 30082 6934 -5593 3728 8264 13755 18614 27318 59090
$$ packed form
10258c5735L980L3507O62J0735L5677J2128l575J8497j8452k3839J04j311j3125
10245A9253j1623K388K703l525L329K1209J0525L5271J2201M630J2909j8985j6788
10232G3497R432k2924J080K1211o00o453k2076m1965L03K5512K2391P597L339
10219G0344j9392q61L8158N844k3099j4071j2277j1845l6412q898j6202j6193
10207d4904J8766J9495J0544l624J5812k915Q795J7121N588j4975K959n554j1684
10194A5424j5803j8297J730N271j3056J073K5492M325j898j2892J5220J3038p703
10181A1924J541J5286o361J092K4754o117j4853k5002k0566p493J0397M312R533
10168a553J5363j809J237J2788M056k3148j2527R321M536N491M859Q704L1772
$$ plain form
10155 59090 88940 101184 82541 57305 39473 41267 53032 53652 63501 56913 38964 15040 16440
10142 16440 6969 18820 26706 18474 14906 2644 340 16107 32232 56662 62736 37728 21659
10129 21659 34176 43995 39141 26591 18689 3309 -4661 -4794 -17175 -3333 29405 28365 15281
10116 15281 17801 10448 14294 26930 29218 41451 47473 35425 28514 32815 -762 -14030 -17550
10103 -17550 -28527 -15796 -7462 -5111 2913 5346 5934 13457 16388 33117 37185 14859 16874 11237
10089 11237 -4361 -5268 9817 14515 15007 33331 35832 41808 47393 52011 67812 62543 42264 39482
10075 39482 36622 70792 110655 118820 126804 157630 165052 177128 216541 257702 345022 519701
10063 519701 776535 1091249 1427958 1695294 1787785 1694864 1458403 1125616 810353 589869
$$ packed form
10155E9090K9850J2244j8643k5236j7832J794J1765O20R849o588j7949k3924J400
10142A6440r471J1851P886q232l568j2262k304J5767J6125K4430O074k5008j6069
10129B1659J2517R819m854j2550p902j5380p970j33j2381J3842L2738j040j3084
10116A5281K520p353L846J2636K288J2233O022j2048o911M301l3577j3268l520
10103a7550j0977J2731Q334K351Q024K433N88P523K931J6729M068k2326K015n637
10089A1237j5598r07J5085M698M92J8324K501N976N585M618J5801n269k0279k782
10075C9482k860L4170L9863Q165P984L0826P422J2076L9413M1161Q7320J74679
10063E19701K56834L14714L36709K67336R2491r2921k36461l32787l15263k20484
$$ plain form
10053 589869 444017 330354 254520 200722 157977 103844 77606 64631 42442 17320 24619
10042 24619 46965 56926 71545 91700 83807 66988 60998 64925 74970 71744 57536 46830 35692
10029 35692 22816 6849 10035 1355 -7731 3798 27810 47964 55666 61912 60199 47255 26519
10016 26519 32681 25574 15073 12630 11155 6759 16255 34306 30396 40341 47749 58822 67866 73073
10002 73073 60864 37080 2192 -17894 -31494 -51681 -48320 -38659 -31267 -10993 2996 5645
9990 5645 27178 35763 34089 43063 50787 51140 18601 -14110 -15379 -18463 -10650 -10966 -26404 -18951
9976 -18951 -15225 -19461 1495 21949 31387 34439 28000 27333 44135 33079 -1612 -25235 -27733
9963 -27733 -17316 -22773 -1913 99 4223 -2898 9265 15616 22451 19559 17293 -7131 4472
$$ packed form
10053E89869j45852j13663p5834n3798m2745n4133k6238j2975k2189k5122P299
10042B4619K2346R961J4619K0155p893j6819n990L927J0045l226j4208j0706j1138
10029C5692j2876j5967L186q680r086J1529K4012K0154P702O246j713j2944k0736
10016B6519O162p107j0501k443j475m396R496J8051l910R945P408J1073R044N207
10002G3073j2209k3784l4888k0086j3600k0187L361R661P392K0274J3989K649
9990E645K1533Q585j674Q974P724L53l2539l2711j269l084P813l16j5438P453
9976a8951L726m236K0956K0454R438L052o439o67J6802j1056l4691k3623k498
9963b7733J0417n457K0860K012M124p121J2163O351O835k892k266k4424J1603
$$ plain form
9950 4472 1478 -4621 -20553 -15945 -23936 -27900 -28770 -37836 -13133 -10568 -3735 2572 -1785 18136
9936 18136 15454 15952 18719 17999 -4574 7148 14623 14579 11400 998 -8974 -16784 -24860 -30311 -45036
9921 -45036 -32638 4570 28068 19899 33083 34549 54957 49174 11802 17538 4953 -14929 -27981
9908 -27981 -8374 4831 27558 56699 34822 7778 -13844 -27479 -27470 -1068 18715 15054 30
9895 30 -6314 5548 14193 8881 -2491 7613 19546 37220 47210 48366 36268 27992 16690 11242
9881 11242 14441 8410 5968 9304 -1857 12489 28647 32866 37252 28756 25074 5043 109 6359
9867 6359 -9097 -29205 -18050 -10941 -17608 -10652 5695 -3324 -383 3454 -6597 5324 39976
9854 39976 68126 57678 35168 14040 2140 -12302 -9164 -19114 1539 -1745 -17973 -10413 5417
$$ packed form
9950D472k994o099j5932M608p991l964q70r066K4703K565O833O307m357J9921
9936A8136k682M98K767p20k2573J1722P475m4l179j0402r972p810q076n451j4725
9921d5036J2398L7208K3498q169J3184J466K0408n783l7372N736j2585j9882j3052
9908b7981J9607J3205K2727K9141k1877k7044k1622j3635RK6402J9783l661j5024
9895C0o344J1862Q645n312j1372J0104J1933J7674R990J156j2098q276j1302n448
9881A1242L199o031k442L336j1161J4346J6158M219M386q496l682k0031m934O250
9867F359j5456k0108J1155P109o667O956J6347r019K941L837j0051J1921L4652
9854C9976K8150j0448k2510k1128j1900j4442L138r950K0653l284j6228P560J5830
$$ plain form
9841 5417 21842 34067 30509 36931 45987 39367 20295 128 9699 14154 2323 -6894 1000 18831
9827 18831 19280 23106 26692 22586 14973 5313 -11934 -22053 -24869 -22544 -38498 -34644 -9363 -4314
9813 -4314 -11852 3343 26391 36544 3112 -18423 -28471 -19574 -8424 2787 5335 -1654 1979
9800 1979 13202 11201 -14139 114 23052 26070 29973 5606 -15264 -2457 -22927 -44428 -32250
9787 -32250 -25065 -4921 -3986 -4855 6359 1598 -4554 1768 5757 15109 3430 -25267 -39923 -26611
9773 -26611 -6497 -2279 2800 -266 18003 37878 16736 14337 10357 13391 17198 -12234 -3591
9760 -3591 10839 20057 -741 -2354 -2000 -1695 24183 35106 20813 13401 15368 46182 45865 20404
9746 20404 -15419 -7665 6381 15030 20590 25487 22188 6082 -5770 -14276 -16074 -5232 1406
$$ packed form
9841E417J6425J2225l558O422R056o620j9072k0167R571M455j1831r217P894J7831
9827A8831M49L826L586m106p613r660j7247j0119k816K325j5954L854K5281N049
9813d314p538J5195K3048J0153l3432k1535j0048Q897J1150J1211K548o989L633
9800A979J1223k001k5340J4253K2938L018L903k4367k0870J2807k0470k1501J2178
9787c2250P185K0144R35q69J1214m761o152O322L989R352j1679k8697j4656J3312
9773b6611K0114M218N079l066J8269J9875k1142k399l980L034L807k9432Q643
9760c591J4430R218k0798j613L54L05K5878J0923j4293p412J967L0814l17k5461
9746B0404l5823P754J4046Q649N560M897l299j6106j1852q506j798J0842O638
$$ plain form
9733 1406 176 -12615 -33400 -29857 -12730 -9021 -5487 5801 -1604 9780 16348 27470 14325
9720 14325 -8667 -12470 12643 15523 9683 9887 -12731 -17814 -16622 -27772 -19384 -26964 -11698 23282
9706 23282 26328 16830 -4447 8543 2088 -1183 -9542 -10466 11040 8119 -2019 -13396 -12323 -13638
9692 -13638 -12492 -17999 -11011 33254 19191 2059 -2015 11392 16569 -14907 -33823 -23205 -5502
9679 -5502 5643 -3729 3028 3151 16465 22326 2586 -10386 -9662 -1789 -2431 19773 30802 43543
9665 43543 56341 57548 35308 15365 3044 -8736 4486 5148 -4702 -11867 9965 12486 9037
9652 9037 23573 4656 -4203 6349 6713 1424 -3387 2364 -5828 -15972 -17515 -18006 -3766 1453
9638 1453 6514 -3944 -8924 -9817 -1777 2878 2791 -2214 1508 8157 14713 26329 29684 38312 20842
$$ packed form
9733A406j230j2791k0785L543J7127L709L534J1288p405J1384O568J1122j3145
9720A4325k2992l803K5113K880n840K04k2618n083J192j1150Q388p580J5266L4980
9706B3282L046r498k1277J2990o455l271q359r24K1506k921j0138j1377J073j315
9692a3638J146n507O988M4265j4063j7132m074J3407N177l1476j8916J0618J7703
9679e502J1145r372O757J23J3314N861j9740j2972P24P873o42K2204J1029J2741
9665D3543J2798J207k2240j9943j2321j1780J3222O62r850p165K1832K521l449
9652I037J4536j8917q859J0552L64n289m811N751q192j0144j543m91J4240N219
9638A453N061j0458m980q93Q040M655q7n005L722O649O556J1616L355Q628j7470
$$ plain form
9623 20842 -1292 23892 43933 41025 24608 19808 41360 36913 37760 49009 50128 33043 16559
9610 16559 17082 7089 14507 24988 19985 -566 -15302 6327 26870 27080 32917 44500 29460
9597 29460 34106 35488 33286 17424 12498 32724 48045 37347 44588 49365 40913 28260 27076
9584 27076 47579 81335 120623 106361 92777 98355 88503 77369 74712 95562 98528 93883 102948
9571 102948 102027 107724 108778 124402 153854 177935 178154 172209 199471 235055 263944 297731 312748
9558 312748 308315 347588 405817 440639 481756 522252 582295 660464 755928 898136 1058927
9547 1058927 1278188 1534910 1849564 2255045 2783117 3451934 4284109 5192596 6030459 6554553
9537 6554553 6595340 6147335 5347863 4485275 3724658 3073935 2542241 2107520 1773965 1527023
$$ packed form
9623B0842k2134K5184K0041k908j6417m800K1552m447Q47J1249J119j7085j6484
9610A6559N23r993P418J0481n003k0551j4736K1629K0543K10N837J1583j5040
9597B9460M646J382k202j5862m926K0226J5321j0698P241M777q452j2653j184
9584B7076K0503L3756L9288j4262j3584N578r852j1134k657K0850K966m645R065
9571A02948r21N697J054J5624K9452K4081K19n945K7262L5584K8889L3787J5017
9558C12748m433L9273N8229L4822M1117M0496O0043P8169R5464J42208J60791
9547A058927K19261K56722L14654M05481N28072O68817Q32175R08487Q37863N24094
9537F554553M0787m48005p99472q62588p60617o50723n31694m34721l33555k46942
$$ plain form
9527 1527023 1309598 1135864 983566 869270 787765 695141 613110 572231 525378 498894 453906
9516 453906 401825 396584 385023 344411 302318 269581 241928 204563 202952 195598 189129 191134 176184
9503 176184 148921 126808 113861 110597 108451 107738 129100 130073 111042 79514 62496 50854 35782
9490 35782 34806 57048 77000 80564 71935 64708 57289 69881 82435 80845 60432 43030 31751
9477 31751 37986 17167 20747 38745 40730 64409 57039 39736 40489 50664 39126 43087 38241
9464 38241 32173 28626 10648 7608 6624 -15963 -646 21864 32524 26993 38727 34356 47627
9451 47627 48214 48212 30820 -2117 -3575 2677 8238 12858 33418 33236 27081 13006 -2458 -585 24047
9436 24047 24271 49017 39254 24463 20778 31875 27086 25662 37622 40953 34850 30281 28104 26019
$$ packed form
9527A527023k17425j73734j52298j14296q1505r2624q2031m0879m6853k6484m4988
9516D53906n2081n241j1561m0612m2093l2737k7653l7365j611p354o469K005j4950
9503A76184k7263k2113j2947l264k146p13K1362R73j9031l1528j7018j1642j5072
9490C5782r76K2242J9952L564q629p227p419J2592J2554j590k0413j7402j1279
9477C1751O235k0819L580J7998J985K3679p370j7303P53J0175j1538L961m846
9464C8241o068l547j7978l040r84k2587J5317K2510J0660n531J1734m371J3271
9451D7627N87kj7392l2937j458O252N561M620K0560j82o155j4075j5464J873K4632
9436B4047K24K4746r763j4791l685J1097m789j424J1960L331o103m569k177k085
$$ plain form
9422 26019 26596 19588 5497 6289 10169 11858 24672 31949 51536 42055 35679 37356 28839 33419
9408 33419 29363 17962 20691 36341 19090 966 -6744 -13933 -13179 1436 34912 39895 33780
9395 33780 28824 13979 13429 -1925 -16145 -19661 -7414 -4259 306 20722 35735 44587 36997
9382 36997 25688 24805 23413 22783 33486 11294 -5023 755 7676 -7541 10284 38660 30455
9369 30455 5960 -4145 -25195 -37399 -18089 1908 10139 16575 31121 41262 13333 -468
9357 -468 -14799 -14967 -23451 4309 3833 -12665 -10921 -16914 -4705 14589 -16130 -31430 -36358 -32417
9343 -32417 -3090 -3149 -1217 1168 3589 402 -2425 7044 6709 -1552 8580 22729 41188 54380
9329 54380 41197 19716 20513 30810 36934 22771 13837 3995 -13622 -7894 -32474 -40512 -28175
$$ packed form
9422B6019N77p008j4091P92L880J689J2814P277J9587r481o376J677q517M580
9408C3419m056j1401K729J5650j7251j8124p710p189P54J4615L3476M983o115
9395C3780m956j4845n50j5354j4220l516J2247L155M565K0416J5013Q852p590
9382C6997j1309q83j392o30J0703k2192j6317N778O921j5217J7825K8376q205
9369C0455k4495j0105k1050j2204J9310J9997Q231O436J4546J0141k7929j3801
9357d68j4331j68q484K7760m76j6498J744n993J2209J9294l0719j5300m928L941
9343c2417K9327n9J932K385K421l187k827R469l35q261J0132J4149J8459J3192
9329E4380j3183k1481P97J0297O124j4163q934r842j7617N728k4580q038J2337
$$ plain form
9316 -28175 -28602 -47691 -49570 -35999 -13860 -285 13610 28046 28227 30063 33227 24018 16826 14148
9302 14148 25009 27911 35958 31584 26746 21487 17306 16252 2632 10021 -10 2836 10661 -3968
9288 -3968 12930 25551 16635 16583 12861 1608 -7920 -22 -16251 -4631 30316 24414 -2631 6380
9274 6380 5989 -27209 -27997 -4075 19829 22234 23152 -165 -12592 -20742 -15011 586 12262 2438
9260 2438 -16052 -14329 -17818 -21042 5220 10711 1951 -15042 -27845 -4339 2316 -12724 -10694
9247 -10694 -17780 -18148 -19596 -26957 -4066 9676 6694 4786 19203 40440 47551 28250 19423 13562
9233 13562 -883 -16385 -5385 1624 -2841 -7195 -5642 -22435 -27049 -23699 -30881 -41969 -44807
9220 -44807 -16357 4674 6068 13793 8983 -5982 -24599 -16124 10204 30657 47964 38745 15917
$$ packed form
9316b8175m27j9089j879J3571K2139J3575J3895J4436J81J836L164r209p192k678
9302A4148J0861K902Q047m374m838n259m181j054j3620P389j0031K846P825j4629
9288c968J6898J2621q916n2l722j1253r528P898j6229J1620L4947n902k7045R011
9274F380l91l3198p88K3922K3904K405R18k3317j2427q150N731J5597J1676r824
9260B438j8490J723l489l224K6262N491q760j6993j2803K3506O655j5040K030
9247a0694p086l68j448p361K2891J3742k982j908J4417K1237P111j9301q827n861
9233A3562j4445j5502J1000P009m465m354J553j6793m614L350p182j1088k838
9220d4807K8450K1031J394P725m810j4965j8617Q475K6328K0453J7307r219k2828
$$ plain form
9207 15917 16243 -7807 -34911 -46666 -12955 12726 11658 -2102 3645 8931 2673 -1761 -1620 9288
9193 9288 -313 -20342 -7018 -9695 -32702 -43213 -34305 -22144 -12023 -32981 -31015 -9809 8748
9180 8748 8168 14530 -1258 -21378 -19580 -20665 -30726 -18133 -15927 -18915 -30837 -6203 -3179 -6118
9166 -6118 -2078 -562 -8431 -2889 5966 -17714 -29003 -15299 -13787 8097 11292 -1784 12812
9153 12812 16509 1002 -6291 14881 30487 19062 8204 -7191 -26422 -12145 -17078 -9427 -5391
9140 -5391 12676 29470 36686 34677 28408 2225 -34330 -49222 -26751 -11514 2674 773 1445
9127 1445 8757 -21058 -35496 -23904 -16348 11640 33986 5737 -29341 -32677 -44925 -41072 -14620
9114 -14620 -4892 -18182 -43421 -50539 -43610 -52436 -56608 -64626 -46216 -40083 -40043 -30520 -33165 -33514 -22249
$$ packed form
9207A5917L26k4050k7104j1755L3711K5681j068j3760N747N286o258m434J41J0908
9193I288r601k0029J3324k677k3007j0511Q908J2161J0121k0958J966K1206J8557
9180H748n80O362j5788k0120J798j085j0061J2593K206k988j1922K4634L024k939
9166f118M040J516p869N542Q855k3680j1289J3704J512K1884L195j3076J4596
9153A2812L697j5507p293K1172J5606j1425j0858j5395j9231J4277m933P651M036
9140e391J8067J6794P216k009o269k6183l6555j4892K2471J5237J4188j901O72
9127A445P312k9815j4438J1592P556K7988K2346k8249l5078l336j2248L853K6452
9114a4620R728j3290k5239p118O929q826m172q018J8410O133M0R523k645l49J1265
$$ plain form
9099 -22249 -14452 -21468 -39705 -44057 -34497 -28554 -22460 -24439 -17746 -27383 -37755 -30655 -18543 -5604
9085 -5604 -8393 -19439 -18932 853 12174 12011 3521 16272 21880 3345 3890 922 -4770 11494
9071 11494 23268 19550 10377 14770 4831 -8272 4438 -1714 -5005 6957 -4108 -7131 -12055
9058 -12055 -20041 -37776 -29340 -3801 -11964 -21461 -21085 -14098 13308 16081 16767 15072 2578 -19179
9044 -19179 -23845 -10597 1478 -8355 -16675 -14543 1080 6302 -4427 13424 7311 -1807 -8113
9031 -8113 -11895 5462 7704 8346 15583 21320 7650 -17294 -24544 -15637 -3625 -5181 -19585 -15755
9017 -15755 1723 3182 -6041 -7710 -8814 -32785 -49048 -27073 894 3029 -551 14517 26096
9004 26096 16342 -9220 -35003 -54933 -55262 -41906 -39233 -32001 -32764 -23707 -15962 -7694 -15854 -17727
$$ packed form
9099b2249P797p016j8237m352R560N943O094j979O693r637j0372P100J2112J2939
9085e604k789j1046N07J9785J1321j63q490J2751N608j8535N45k968n692J6264
9071A1494J1774l718r173M393r939j3103J2710o152l291J1962j1065l023m924
9058a2055p986j7735Q436K5539q163r497L76O987K7406K773O86j695j2494k1757
9044a9179m666J3248J2075r833q320K132J5623N222j0729J7851o113r118o306
9031h113l782J7357K242O42P237N737j3670k4944p250Q907J2012j556j4404L830
9017a5755J7478J459r223j669j104k3971j6263K1975K7967K135l580J5068J1579
9004B6096r754k5562k5783j9930l29J3356K673P232p63R057P745Q268q160j873
$$ plain form
8990 -17727 -31433 -34919 -28187 -8824 -21943 -25307 -22173 -12810 864 -8636 243 -9967 3689
8977 3689 11972 11679 6666 -11696 -25653 -32017 -11037 1512 14159 22930 12513 13814 21375 6546
8963 6546 -7757 -9808 8448 25874 14811 13887 2087 -759 2432 -5616 2121 22560 31646 42490
8949 42490 10246 -20304 -26750 -18965 -23994 -24703 -12915 -6335 -7956 11034 35842 20079 -8225
8936 -8225 -16708 -5313 -2874 -5627 5571 -1891 -17331 -6909 -8483 -34005 -29802 6320 17003
8923 17003 -876 -12441 -5270 -7032 -12657 -8444 -16751 -21236 -12006 -17518 -20951 186 -7021 -1582
8909 -1582 5953 1083 -5812 9147 6242 -12563 -31846 -12261 12534 24230 39487 14164 -14454
8896 -14454 -22329 -40850 -32465 -7100 11005 11145 18288 -4443 -32457 -32415 -31793 -6752 -4059 -16409
$$ packed form
8990a7727j3706l486O732J9363j3119l364L134R363J3674r500Q879j0210J3656
8977C689Q283k93n013j8362j3957o364K0980J2549J2647Q771j0417J301P561j4829
8963F546j4303k051J8256J7426j1063r24j1800k846L191q048P737K0439R086J0844
8949D2490l2244l0550o446P785n029p09J1788O580j621J8990K4808j5763k8304
8936h225q483J1395K439k753J1198p462j5440J0422j574k5522M203L6122J0683
8923A7003j7879j1565P171j762n625M213q307m485R230n512l433K1137p207N439
8909a582P535m870o895J4959k905j8805j9283J9585K4795J1696J5257k5323k8618
8896a4454p875j8521Q385K5365J8105J40P143k2731k8014M2O22K5041K693j2350
$$ plain form
8882 -16409 -5006 -3205 8025 5461 16203 23318 17331 13254 1913 -21855 -33114 -43690 -37200
8869 -37200 -43475 -32003 3849 14740 25823 29082 49731 54715 48642 44187 39951 35750 27791
8856 27791 30100 10169 11791 20754 23539 30994 37233 32043 33373 50279 54481 78321 84133 92209
8842 92209 94016 65801 36679 29264 32281 32784 23056 27066 13038 23295 41187 55000 50784
8829 50784 37404 53220 50314 13725 1012 23984 19876 11936 10058 34596 38857 45190 63520
8816 63520 97092 82786 67004 72603 51028 47108 49031 38152 32159 47485 64148 55871 61164
8803 61164 62475 47350 42696 48968 28785 37579 48690 48695 33461 -4843 -2918 16796 47227 47888
8789 47888 39492 36364 23852 6205 12458 15866 13078 21119 26573 21714 26412 24887 23898 15358
$$ packed form
8882a6409J1403J801J1230k564J0742P115n987m077j1341k3768j1259j0576O490
8869c7200o275J1472L5852J0891J1083L259K0649M984o073m455m236m201p959
8856B7791K309j9931J622Q963K785P455O239n190J330J6906M202K3840N812Q076
8842I2209J807k8215k9122p415L017N03r728M010j4028J0257J7892J3813m216
8829E0784j3380J5816k906l6589j2713K2972m108p940j878K4538M261O333J8330
8816F3520L3572j4306j5782N599k1575l920J923j0879n993J5326J6663q277N293
8803F1164J311j5125m654O272k0183Q794J1111Nj5234l8304J925J9714L0431O61
8789D7888q396l128j2512j7647O253L408k788Q041N454m859M698j525r89q540
$$ plain form
8775 15358 19512 25811 25532 33451 32631 24405 42664 31814 21064 30458 11033 18752 13847 13483
8761 13483 13192 51239 50781 30365 11769 10599 14767 19288 17500 38846 37116 19637 21262 19070
8747 19070 13910 -1003 6933 16345 36624 42283 45157 48748 32121 15818 -7736 -2450 -10091
8734 -10091 9300 32777 40724 31305 16855 22600 21476 35493 33810 29355 10524 -8246 -9090
8721 -9090 -11003 -12876 -8717 21016 13835 7219 16983 22168 25824 20742 315 8346 31607 44732
8707 44732 41236 38944 34138 23546 17750 20365 22641 5136 -1548 8220 1113 26022 30527 23305
8693 23305 15170 12843 29623 40630 39722 17844 17282 28267 28594 35078 42012 38402 14689 13457
8679 13457 21207 34155 49830 46952 36881 43752 33268 11223 3374 17553 39965 54482 72097
$$ packed form
8775A5358M154O299k79P919q20q226J8259j0850j0750R394j9425P719m905l64
8761A3483k91L8047m58k0416j8596j170M168M521j788K1346j730j7479J625k192
8747A9070n160j4913P936R412K0279N659K874L591j6627j6303k3554N286p641
8734a0091J9391K3477P947r419j4450N745j124J4017j683m455j8831j8770q44
8721i090j913j873M159K9733p181o616R764N185L656n082k0427Q031K3261J3125
8707D4732l496k292m806j0592n796K615K276j7505o684R768p107K4909M505p222
8693B3305q135k327J6780J1007r08k1878n62J0985L27O484O934l610k3713j232
8679A3457P750J2948J5675k878j0071O871j0484k2045p849J4179K2412J4517J7615
$$ plain form
8666 72097 64996 60331 59028 60322 36394 10748 -13948 -26309 -21441 -17873 -16400 754 18924
8653 18924 31940 41737 26623 6451 -9506 -13023 -6610 15382 9449 9808 2234 -1520 5236 15771
8639 15771 29541 30929 7997 -8356 -3980 14075 30946 30507 44739 42244 27543 24103 31197
8626 31197 26434 11008 -10546 -15734 -11604 -13498 -20993 -9246 8373 30054 27743 25423 42444
8613 42444 45504 42887 29522 17840 22786 27813 33799 37143 50467 54264 46105 58166 73719
8600 73719 73560 76416 85110 92501 87276 76641 62706 52407 43973 34987 27875 24684 44382 67518
8586 67518 75616 49617 36184 48632 53349 45891 42513 42879 42336 40988 34335 41439 56974 79205
8572 79205 76788 75170 67581 58878 55276 50620 41292 20934 24307 42434 30296 15721 29332
$$ packed form
8666G2097p101m665j303J294k3928k5646k4696j2361M868L568J473J7154J8170
8653A8924J3016R797j5114k0172j5957l517O413K1992n933L59p574l754O756J0535
8639A5771J3770J388k2932j6353M376J8055J6871m39J4232k495j4701l440P094
8626C1197m763j5426k1554n188M130j894p495J1747J7619K1681k311k320J7021
8613D2444L060k617j3365j1682M946N027N986L344J3324L797q159J2061J5553
8600G3719j59K856Q694P391n225j0635j3935j0299q434q986p112l191J9698K3136
8586F7518Q098k5999j3433J2448M717p458l378L66n43j348o653P104J5535K2231
8572G9205k417j618p589q703l602m656r328k0358L373J8127j2138j4575J3611
$$ plain form
8559 29332 46220 20675 10142 29560 15505 -2784 -5521 -7175 -18396 -20539 -18312 -1430 31532
8546 31532 57263 40155 13670 6746 1560 3241 -845 -24280 -36628 -30029 -15864 -11553 7284
8533 7284 12998 -3798 -16398 11110 35503 36553 7018 -4831 -4312 -3598 -8212 -17320 -4616 8576
8519 8576 968 -145 11647 33133 46456 57151 42937 25471 33472 33388 29502 -2150 -22762
8506 -22762 -8635 1591 -325 -12925 -26238 -15826 -10834 964 -348 -25466 -36541 -18673
8494 -18673 1069 -2935 -12244 -19590 -41007 -52509 -35736 -16148 -6001 -3735 -12642 -30931 -17096
8481 -17096 -1358 3826 -13151 -38288 -34663 -40950 -41292 -21280 -14690 -17181 -31658 -37201 -29222 -13664
8467 -13664 -14925 -15675 -11391 -9131 4782 8603 19526 21183 18225 17181 15777 2440 -13680 2413
$$ packed form
8559B9332J6888k5545j0533J9418j4055j8289k737j654j1221k143K227J6882L2962
8546C1532K5731j7108k6485o924n186J681m086k3435j2348O599J4165M311J8837
8533G284N714j6796j2600K7508K4393J050k9535j1849N19P14m614r108J2704J3192
8519H576p608j113J1792K1486J3323J0695j4214j7466Q001q4l886l1652k0612
8506b2762J4127J0226j916j2600j3313J0412M992J1798j312k5118j1075J7868
8494a8673J9742m004r309p346k1417j1502J6773J9588J0147K266q907j8289J3835
8481a7096J5738N184j6977k5137L625o287l42K0012O590k491j4477n543P979J5558
8467a3664j261p50M284K260J3913L821J0923J657k958j044j404j3337j6120J6093
$$ plain form
8453 2413 15349 13329 15414 320 -30865 -12516 6827 11611 9793 2617 4377 21357 33100
8440 33100 29133 18578 -6978 -19408 -12072 -12276 -8427 -11733 6420 14284 5689 3059 -21716 -37230
8426 -37230 -24946 -42108 -33684 -13065 -14031 -19170 4955 4037 2406 14486 11485 11681 13210 -5124
8412 -5124 9361 8045 -20275 -20709 -12436 4197 3482 -2895 -15876 -21412 2323 -8143 1923 -8208
8398 -8208 -17663 -32468 -35344 -39087 -33768 -11000 3878 5300 3453 8410 -13825 -33496 -45500
8385 -45500 -36276 -21018 -1545 -20772 -29156 -11261 -4000 -18438 -21091 -7075 -8649 5965 -159
8372 -159 -7482 11134 10157 -11902 -35708 -36671 -9270 6786 -7050 -21675 -11249 -7071 -12816 -19748
8358 -19748 -9076 -11223 -10766 -5041 -2859 -7634 -15224 -4945 -25616 -30683 -25968 -21903 -22401 -14724
$$ packed form
8453B413J2936k020K085j5094l1185J8349J9343M784j818p176J760J6980J1743
8440C3100l967j0555k5556j2430P336k04L849l306J8153P864q595k630k4775j5514
8426c7230J2284j7162Q424K0619r66n139K4125r18j631J2080l001J96J529j8334
8412e124J4485j316k8320m34Q273J6633p15o377j2981n536K3735j0466J0066j0131
8398h208r455j4805k876l743N319K2768J4878J422j847M957k2235j9671j2004
8385d5500R224J5258J9473j9227q384J7895P261j4438k653J4016j574J4614o124
8372a59p323J8616r77k2059k3806r63K7401J6056j3836j4625J0426M178n745o932
8358a9748J0672k147M57N725K182m775p590J0279k0671n067M715M065m98P677
$$ plain form
8344 -14724 -9186 -1798 -1360 21119 12828 -3788 1590 -33 14581 15926 -7161 -12183 2327 10933
8330 10933 8401 11504 17554 -15739 424 23025 4072 2626 31600 40053 30030 27375 12175
8317 12175 10772 35078 32417 21927 14744 2359 9521 27834 13699 791 -105 -85 353 13345
8303 13345 19752 12866 6882 7164 1411 -2078 6864 4015 -4664 -2279 7758 29718 22070 -3572
8289 -3572 -16889 -18688 5315 3328 -12197 4654 6553 -7136 -29367 -3516 15876 34473 45486
8276 45486 32680 23753 24036 26703 23322 3894 -18438 -24083 2760 -25278 -38291 -34941 -40578
8263 -40578 -36744 -36492 -19785 -34183 -35815 -20753 -21334 -23458 -17915 -9931 -1792 -18909 -16374 -2294
8249 -2294 11045 228 -16091 -5841 13945 685 2417 13255 19276 11899 10322 -10973 4564
$$ packed form
8344a4724N538P388M38K2479q291j6616N378j623J4614J345k3087n022J4510Q606
8330A0933k532L103O050l3293J6163K2601j8953j446K8974Q453j0023k655j5200
8317A2175j403K4306k661j0490p183j2385P162J8313j4135j2908q96K0M38J2992
8303A3345O407o886n984K82n753l489Q942k849q679K385J0037K1960p648k5642
8289c572j3317j799K4003j987j5525J6851J899j3689k2231K5851J9392J8597J1013
8276D5486j2806q927K83K667l381j9428k2332n645K6843k8038j3013L350n637
8263d0578L834K52J6707j4398j632J5062n81k124N543P984Q139j7117K535J4080
8249b294J3339j0817j6319J0250J9786j3260J732J0838O021p377j577k1295J5537
$$ plain form
8236 4564 21199 33285 14359 7718 61 13034 4405 1977 5124 4221 10852 2787 -7804 8969
8222 8969 22890 2752 1782 -4412 -14908 -6159 -8695 -586 7586 21084 24043 10707 -22628 -28700
8208 -28700 -1257 13283 806 -4981 -2746 -9785 16711 33878 29818 30057 6493 -10993 -18908
8195 -18908 6590 28216 494 -13089 -25290 -46099 -47016 -43355 -55279 -35762 -40440 -53059 -43705
8182 -43705 -21453 -12717 -15810 -4279 -13564 -23310 -6787 -8389 -22109 -15676 -22368 -21900 -12895 -23039
8168 -23039 -25215 -10556 6336 14816 20500 12363 1335 3468 19219 28204 20325 -4634 -20368
8155 -20368 -20093 -20540 -30523 -24016 -34952 -14403 6245 5126 -21275 -13874 -4083 -2390 16355 7024
8141 7024 1473 3362 -9345 -16614 -1244 7954 10509 25063 22267 10213 -9920 -19507 -28574 -31081
$$ packed form
8236D564J6635J2086j8926o641p657J2973q629k428L147r03O631q065j0591J6773
8222H969J3921k0138r70o194j0496Q749k536Q109Q172J3498K959j3336l3335o072
8208b8700K7443J4540j2477n787K235p039K6496J7167m060K39k3564j7486p915
8195a8908K5498K1626k7722j3583j2201k0809r17L661j1924J9517m678j2619R354
8182d3705K2252Q736l093J1531r285r746J6523j602j3720O433o692M68R005j0144
8168b3039k176J4659J6892Q480N684q137j1028K133J5751Q985p879k4959j5734
8155b0368K75m47r983O507j0936K0549K0648j119k6401P401R791J693J8745r331
8141G024n551J889j2707p269J5370R198K555J4554k796j2054k0133r587r067k507
$$ plain form
8127 -31081 -31339 -2524 5215 2074 -2082 4147 13980 14489 22245 14650 5834 3859 7062 7768 6578
8112 6578 16886 11629 3039 -9227 6276 13495 13211 28369 55648 44467 29295 19460 18455
8099 18455 22483 22700 38980 67645 74608 48972 4050 -23402 -13466 -15577 -12865 -6994 3389
8086 3389 13518 16860 39273 38873 38535 46428 29064 11386 6640 -12192 8458 15214 11857 9813
8072 9813 33800 58406 61526 46957 29136 25120 19283 20392 28687 41676 23384 13184 8095
8059 8095 -1156 17819 38098 46984 25502 32054 60027 71452 82076 68926 61519 47207 39614
8046 39614 37198 34517 36104 20413 29131 29983 27341 47336 36967 34340 39350 40687 44146 12659
8032 12659 -6063 4695 18826 24358 16774 29116 37047 21515 10556 18489 43478 59507 58993
$$ packed form
8127c1081k58K8815P739l141m156O229R833N09P756p595q816j975L203P06j190
8112F578J0308n257q590j2266J5503P219k84J5158K7279j1181j5172r835j005
8099A8455M028K17J6280K8665O963k5636m4922k7452R936k111K712N871J0383
8086C389J0129L342K2413m00l38P893j7364j7678m746j8832K0650O756l357k044
8072I813K3987K4606L120j4569j7821m016n837J109Q295J2989j8292j0200n089
8059H095r251J8975K0279Q886k1482O552K7973J1425J0624j3150p407j4312p593
8046C9614k416k681J587j5691Q718Q52k642J9995j0369k627N010J337L459l1487
8032A2659j8722J0758J4131N532p584J2342P931j5532j0959P933K4989J6029n14
$$ plain form
8019 58993 57182 54725 53359 59778 40859 12542 8361 26717 50252 68973 79206 80274 81369
8006 81369 65351 62736 69607 66924 67291 66868 67447 63068 44859 52723 68999 63385 48950 31351
7992 31351 26956 33604 49024 60216 76532 96434 104980 84167 94975 97909 108091 111781 99584
7979 99584 76392 59522 63502 58907 54856 89972 93342 103180 101116 109386 107934 75990 53237
7966 53237 76940 83056 102328 92029 62073 41510 30525 34825 34801 35409 49220 54631 32654
7953 32654 16749 5170 29469 60682 79674 71208 46737 28647 26834 28695 45599 44587 48028
7940 48028 64969 72516 70571 73788 47580 47695 57741 74974 84199 75948 59365 54412 62095 52739
7926 52739 62113 74987 58894 44736 46605 57262 47925 24718 12269 19468 35947 40000 32420
$$ packed form
8019E8993j811k457j366O419j8919k8317m181J8356K3535J8721J0233J068J095
8006H1369j6018k615O871k683L67m23N79m379j8209P864J6276n614j4435j7599
7992C1351m395O648J5420J1192J6316J9902Q546k0813J0808K934J0182L690j2197
7979I9584k3192j6870L980m595m051L5116L370R838k064Q270j452l1944k2753
7966E3237K3703O116J9272j0299k9956k0563j0985M300k4O08J3811N411k1977
7953C2654j5905j1579K4299L1213J8992q466k4471j8090j813J861J6904j012L441
7940D8028J6941P547j945L217k6208J15J0046J7233R225q251j6583m953P683r356
7926E2739R374J2874j6093j4158J869J0657r337k3207j2449P199J6479M053p580
$$ plain form
7913 32420 26927 14549 5048 18430 15637 15440 27313 42074 42506 19406 19100 14169 15471 8561
7899 8561 17148 47890 39526 22064 32359 45195 42874 40022 32000 12682 11665 16647 -10912
7886 -10912 26 16533 27052 26757 20042 23708 13964 8115 10506 5300 679 13030 17787 19999
7872 19999 27709 17981 22894 11205 2902 7594 14249 21710 23737 21535 31875 26286 32786 48927
7858 48927 25807 6849 8085 17359 17261 22445 33370 31997 6058 -37 12900 26256 26295 24867
7844 24867 31194 40382 30625 23735 18439 -7509 -9289 11380 16216 -19874 -35820 -10135 9594
7831 9594 4894 2359 -3365 13495 18619 15249 11504 861 -18032 -17112 -25482 -30306 -24046 -17551
7817 -17551 -16791 -4253 971 4679 8467 2108 11061 5554 11800 7729 5423 4526 7339 885 -17098
$$ packed form
7913C2420n493j2378r501J3382k793j97J1873J4761M32k3100l06m931J302o910
7899H561Q587L0742q364j7462J0295J2836k321k852q022j9318j017M982k7559
7886a0912J0938J6507J0519k95o715L666r744n849K391n206m621J2351M757K212
7872A9999P710r728M913j1689q303M692O655P461K027k202J0340n589O500J6141
7858D8927k3120j8958J236R274r8N184J0925j373k5939o095J2937J3356L9j428
7844B4867O327R188r757o890n296k5948j780K0669M836l6090j5946K5685J9729
7831I594m700k535n724J6860N124l370l745j0643j8893R20q370m824O260O495
7817a7551P60J2538N224L708L788o359Q953n507O246m071k306q97K813o454j7983
$$ plain form
7802 -17098 -19148 -14042 -2526 11126 12958 22899 16123 28512 34927 28436 29719 14074 -3900
7789 -3900 -9512 -2762 -9003 -21306 -18447 -5672 -19044 -19133 -6654 -6394 -10118 -6203 -5540 22332 36160
7774 36160 33495 5019 -19314 2014 21278 12453 18349 6625 -5957 -4843 4162 -16339 -14499
7761 -14499 -1061 3447 14149 22207 25818 36282 18707 1468 -7387 -16575 -18215 -3674 13216
7748 13216 4353 746 10403 -8134 1311 22897 33298 12802 7117 488 263 2077 -14254 -28503
7734 -28503 -12030 5249 9524 -9383 -9625 -10051 -6901 -3084 -22039 -30007 -19519 -44157 -32556
7721 -32556 -27276 -34123 -33174 -37444 -20420 1729 52 -7930 -35398 -29583 -37011 -30519 -20059 -12164
7707 -12164 -1739 12119 6434 -12333 -11739 -8792 -28460 -27561 -23545 -29768 -16209 -20264 -9303 -8449
$$ packed form
7802a7098k050N106J1516J3652J832R941o776J2389O415o491J283j5645j7974
7789c900n612O750o241j2303K859J2775j3372q9J2479K60l724L915O63K7872J3828
7774C6160k665k8476k4333K1328J9264q825N896j1724j2582J114R005k0501J840
7761a4499J3438M508J0702Q058L611J0464j7575j7239q855r188j640J4541J6890
7748A3216q863l607R657j8537R445K1586J0401k0496n685o629k25J814j6331j4249
7734b8503J6473J7279M275j8907k42m26L150L817j8955p968J0488k4638J1601
7721c2556N280o847R49m270J7024K2149j677p982k7468N815p428O492J0460P895
7707a2164J0425J3858n685j8767N94K947j9668Q99M016o223J3559m055J0961Q54
$$ plain form
7693 -8449 -28950 -20782 -7439 5250 485 22783 32301 41397 40597 10763 -12719 -12096 -15291 -14787
7679 -14787 -20989 -19888 -36561 -40523 -33731 -18132 -9224 -22368 -21120 4253 18658 16281 19161
7666 19161 27960 14933 -19025 -29582 -19365 -2560 5761 1365 -6704 -13721 20570 30565 19712
7653 19712 12096 6271 8009 3837 19367 11541 9339 15069 17947 2985 2306 24331 4494 -20530
7639 -20530 -24737 -2633 10418 78 3481 1930 4499 13420 14237 10470 11004 -2945 -11917 -23851
7625 -23851 -29345 -30862 -13427 3676 -148 22848 31218 25111 20159 14147 10190 32331 28461 40463
7611 40463 33537 18665 -9993 -17285 2453 6105 -11966 -2776 -5485 7098 4974 -8218 -157
7598 -157 3386 -14748 298 -840 -7550 -17214 -27946 -26000 -30746 -24623 -24701 -17864 -723 2753 -5511
$$ packed form
7693h449k0501Q168J3343J2689m765K2298R518R096q00k9834k3482O23l195N04
7679a4787o202J101j6673l962O792J5599Q908j3144J248K5373J4405k377K880
7666A9161Q799j3027l3958j0557J0217J6805Q321m396q069p017L4291R995j0853
7653A9712p616n825J738m172J5530p826k202N730K878j4962o79K2025j9837k5024
7639b0530m207K2104J3051j0340L403j551K569Q921Q17l767N34j3949q972j1934
7625b3851n494j517J7435J7103l824K2996Q370o107m952o012l957K2141l870J2002
7611D0463o926j4872k8658p292J9738L652j8071R190k709J2583k124j3192Q061
7598a57L543j8134J5046j138o710r664j0732J946m746O123p8O837J7141L476q264
$$ plain form
7583 -5511 -10656 -33528 -30443 -26528 -18299 -7396 -5438 20853 5985 -29996 -42106 -46659 -44116
7570 -44116 -15765 -8547 -15670 -15312 11191 40013 56326 32651 4753 -362 7365 25501 12316
7557 12316 26143 30171 1864 -9931 7261 13204 15807 18681 17343 -1025 7579 23368 24277
7544 24277 15617 15696 10439 3429 4387 -6291 -4631 -22519 -25348 -19917 8541 45086 39882 28916
7530 28916 16917 -3724 -11118 -5090 -3502 11388 -483 168 -7509 -28633 -38666 -26277 -12090
7517 -12090 1851 14041 5200 -15612 -15690 -18876 -25005 -37903 -29830 -34521 -20146 -8821 -19262
7504 -19262 -32279 -32507 -35782 -23322 -19603 -16430 -19937 -20442 -22204 -2610 4031 8342 25044 18654
7490 18654 13724 11551 -17099 -20361 -15508 3010 21062 5568 -19050 -15391 -9925 6621 17024
$$ packed form
7583e511n145k2872L085L915Q229J0903J958K6291j4868l5981j2110m553K543
7570d4116K8351P218p123L58K6503K8822J6313k3675k7898n115P727J8136j3185
7557A2316J3827M028k8307j1795J7192N943K603K874j338j8368Q604J5789R09
7544B4277q660P9n257p010R58j0678J660j7888k829N431K8458L6545n204j0966
7530B8916j1999k0641p394O028J588J4890j1871O51p677k1124j0033J2389J4187
7517a2090J3941J2190q841k0812p8l186o129j2898Q073m691J4375J1325j0441
7504a9262j3017k28l275J2460L719L173l507n05j762J9594O641M311J6702o390
7490A8654m930k173k8650l262M853J8518J8052j5494k4618L659N466J6546J0403
$$ plain form
7477 17024 34684 36786 45633 35875 12179 12480 5632 20119 36153 27264 9452 8918 12327 -926
7463 -926 5526 36710 36897 32826 5466 -28001 -33834 -19113 -4904 -3600 9557 -413 -20781 -30826
7449 -30826 -19693 -19972 -38036 -28518 -30072 -46449 -27389 3922 15494 14673 -1100 -7450 1658
7436 1658 15852 1941 -10917 -25330 -14638 3617 6463 -8227 -23458 -26370 -24987 -26961 -35432
7423 -35432 -28002 -5742 -7935 -8171 -4780 5535 15616 29640 21238 14205 -3905 -22773 -30370
7410 -30370 -11493 10846 28774 29502 21736 40901 55083 37258 1940 -19459 -4246 600 -1959
7397 -1959 -3442 -10268 -16897 7565 18917 3160 -29096 -19317 -15226 -25808 -1804 10735 21069
7384 21069 23427 34072 19694 -6554 -21979 -29169 -23266 -2127 1104 -19352 -2464 -5408 4116
$$ packed form
7477A7024J7660K102Q847r758k3696L01o848J4487J6034q889j7812n34L409j3253
7463i26O452L1184J87m071k7360l3467n833J4721J4209J304J3157r970k0368j0045
7449c0826J1133k79j8064R518j554j6377J9060L1311J1572q21j5773o350R108
7436A658J4194j3911j2858j4413J0692J8255K846j4690j5231k912J383j974q471
7423c5432P430K2260k193k36L391J0315J0081J4024q402p033j8110j8868p597
7410c0370J8877K2339J7928P28p766J9165J4182j7825l5318k1399J5213M846k559
7397a959j483o826o629K4462J1352j5757l2256R779M091j0582K4004J2539J0334
7384B1069K358J0645j4378k6248j5425p190N903K1139L231k0456J6888k944R524
$$ plain form
7371 4116 -763 -30473 -56814 -47446 -35759 -15673 -4751 -29139 -36483 -26968 -18811 -10716 3571
7358 3571 25707 27481 5590 9606 6989 6082 748 16428 -212 11599 34417 19877 22393
7345 22393 12139 -15031 -17229 20106 24747 -5208 -20840 -1971 10371 -4030 -18111 -9704
7333 -9704 6069 40080 53072 41371 -435 -17681 -1398 24594 23456 13070 -793 664
7321 664 -13083 -29428 -23708 -7124 4836 10176 22570 39414 29699 20150 47755 41237 28866
7308 28866 13064 25538 31571 24833 25437 19965 14964 -1064 -34950 -47304 -27328 -23466 -31404
7295 -31404 -25465 -22593 -36968 -30405 -16932 -10192 -6611 6773 -2600 -26614 -15032 -6931 -22136
7282 -22136 -48235 -38917 -17035 15247 12038 -2459 -18349 -28217 -3882 8560 -2600 -19081
$$ packed form
7371D116m879k9710k6341R368J1687K0086J0922k4388p344R515Q157Q095J4287
7358C571K2136J774k1891M016k617r07n334J5680j6640J1811K2818j4540K516
7345B2393j0254k7170k198L7335M641k9955j5632J8869J2342j4401j4081Q407
7333i704J5773L4011J2992j1701m1806j7246J6283K5992j138j0386j3863J457
7321F64j3747j6345N720J6584J1960N340J2394J6844r715r549K7605o518j2371
7308B8866j5802J2474O033o738O04n472n001j6028l3886j2354J9976L862p938
7295c1404N939K872j4375O563J3473O740L581J3384r373k4014J1582Q101j5205
7282b2136k6099R318K1882L2282l209j4497j5890r868K4335J2442j1160j6481
$$ plain form
7270 -19081 -30296 -20544 -12455 -11983 -23905 -22016 -30530 -42799 -56418 -35869 6098 36881 25396
7257 25396 -7542 -7197 -6232 -38649 -27788 -23902 -37399 -34740 -30105 -24422 -7856 7110 7159 27550
7243 27550 25522 16014 6076 7475 2355 2751 4453 1614 3165 -19074 -44627 -46852 -15336 9791
7229 9791 9723 7124 3877 10451 10844 35201 33715 6011 -12436 -4469 -9668 -8403 8160 8082 10271
7214 10271 2274 4768 21719 15030 12844 -13843 -33446 -25412 -29248 -29062 -16991 -18458 -32600 -21374
7200 -21374 -12955 -32449 -37977 -5856 -3002 -12115 -2345 -4337 -6737 5957 8993 -5978 -57 12262
7186 12262 15961 6929 2235 -1844 -8627 -16242 -27222 -36727 -28122 -11153 -18207 -6677 6071 11635
7172 11635 -4223 -35924 -52273 -38971 -17977 11050 10291 4428 -2686 9454 1215 -21550 -21846
$$ packed form
7270a9081j1215R752Q089M72j1922J889q514j2269j3619K0549M1967L0783j1485
7257B5396l2938L45R65l2417J0861L886j3497K659M635N683J6566J4966M9K0391
7243B7550k028r508r938J399n120L96J702k839J551k2239k5553k225L1516K5127
7229I791o8k599l247O574L93K4357j486k7704j8447P967n199J265J6563p8K189
7214A0271p997K494J6951o689k186k6687j9603Q034l836J86J2071j467j4142J1226
7200b1374Q419j9494n528L2121K854r113R770j992k400J2694L036j4971N921J2319
7186A2262L699r032m694m079o783p615j0980r505Q605J6969p054J1530J2748N564
7172A1635j5858l1701j6349J3302K0994K9027p59n863p114J2140q239k2765k96
$$ plain form
7159 -21846 -16433 -26691 -18288 -8051 -15692 12517 -5230 -24641 -41779 -35219 -16084 4383 7499
7146 7499 -10892 2295 -11869 12407 34700 20463 4865 -14513 -8303 10794 7781 5347 25947
7133 25947 29759 20082 7360 10212 5841 4252 5062 -18997 -23184 -28451 -10928 -8647 -650 31
7119 31 -1643 -360 -15091 -18600 -393 7371 -720 -2775 10935 -15474 -25754 -24787 -33460 -29552
7105 -29552 -17763 5047 -1588 -14724 4864 1359 3961 15960 26291 13854 -4654 -8857 5755
7092 5755 -9520 -20071 -12321 -17883 -24838 -16988 -10317 -23319 -32280 -29160 -24108 -16366 -18541 -20972
7078 -20972 -12677 -20571 -46736 -33994 2397 7020 5760 15861 12639 26111 17720 7075 12388
7065 12388 932 1869 7822 -2235 6792 7325 29618 24557 15073 24908 10824 7515 5908 390
$$ packed form
7159b1846N413j0258Q403J0237p641K8209j7747j9411j7138O560J9135K0467L116
7146G499j8391J3187j4164K4276K2293j4237j5598j9378O210J9097l013k434K0600
7133B5947L812r677j2722K852m371j589Q10k4059m187n267J7523K281P997O81
7119C1j674J283j4731l509J8207P764q091k055J3710k6409j0280R67q673L908
7105b9552J1789K2810o635j3136J9588l505K602J1999J0331j2437j8508m203J4612
7092E755j5275j0551P750n562o955P850O671j3002q961L120N052P742k175k431
7078b0972Q295p894k6165J2742L6391M623j260J0101l222J3472q391j0645N313
7065A2388j1456R37N953j0057R027N33K2293n061r484R835j4084l309j607n518
$$ plain form
7051 390 -10577 -11766 -10886 -13432 -5259 -3339 -5858 -5078 -8932 12184 26090 10683 -11732 -12300 -8385
7036 -8385 1525 22844 34766 23780 24060 36513 31427 24547 16912 27936 50309 27637 7239
7023 7239 -5812 -24579 -27177 -26936 -24576 -13435 -26777 -5664 -4926 3147 4995 -11392 -19614 -13710
7009 -13710 -29957 -37116 -38279 -43686 -21731 -8145 -24937 -28447 -54355 -88978 -86941 -58027 -44872
6996 -44872 -31325 -6899 -1268 -10221 -8223 -4842 7386 8815 4561 -7509 -13131 -527 -199 -3725
6982 -3725 -4293 5448 -359 1357 -4957 -3225 398 8819 6362 12155 -7563 -12052 4792 -16293
6968 -16293 -24453 -22921 -21400 -12666 -10959 -10823 -10949 -30793 -37719 -53875 -44647 -45920 -27225 -29423
6954 -29423 -17216 8860 16424 11961 8931 26170 16315 11598 -1691 7851 4567 5655 -10175
$$ packed form
7051C90j0967j189Q80k546Q173J920k519P80l854K1116J3906j5407k2415n68L915
7036h385R910K1319J1922j0986K80J2453n086o880p635J1024K2373k2672k0398
7023G239j3051j8767k598K41K360J1141j3342K1113P38Q073J848j6387q222N904
7009a3710j6247p159j163n407K1955J3586j6792l510k5908l4623K037K8914J3155
6996d4872J3547K4426N631q953J998L381J2228J429m254j2070n622J2604L28l526
6982c725n68R741n807J716o314J732L623Q421k457N793j9718m489J6844k1085
6968a6293q160J532J521Q734J707J36j26j9844o926j6156R228j273J8695k198
6954b9423J2207K6076P564m463l030J7239r855m717j3289R542l284J088j5830
$$ plain form
6941 -10175 -26063 -36642 -29541 -27769 -24401 -40262 -42294 -23139 -6255 -17332 -11623 4374 10892
6928 10892 5207 -3303 -13215 7056 9164 -11183 -6974 -5028 -17405 -29923 -48086 -42831 -19348
6915 -19348 -3777 -2471 1445 257 3381 5796 3258 4316 28394 36441 29457 -2235 -39368 -55769
6901 -55769 -49980 -34704 -30067 -34350 -30384 -27447 -35480 -8375 20775 30911 31230 3678 17731
6888 17731 23527 16173 16794 -7657 -15373 -8933 -26387 -25528 -11159 -8140 -5163 6054 15995 14509
6874 14509 1187 22291 13263 -19482 -48603 -35409 -30375 -18570 -4873 -13255 -7935 -10093 -6537
6861 -6537 -2254 -17807 -15599 -3923 -5136 -25882 -14453 -4282 -15074 -18978 -26222 -20172 -11060
6848 -11060 6331 6986 11923 15359 -2082 -22944 -29201 -25210 -7134 -24948 -43444 -37688 -38458 -23681
$$ packed form
6941a0175j5888j0579P101J772L368j5861k032J9155J6884j1077N709J5997O518
6928A0892n685q510r912K0271K108k0347M209J946j2377j2518j8163N255K3483
6915a9348J5571J306L916j188L124K415k538J058K4078Q047o984l1692l7133j6401
6901e5769N789J5276M637m283L966K937q033K7105K9150J0136L19k7552J4053
6888A7731N796p354O21k4451p716O440j7454Q59J4369L019K977J1217R941j486
6874A4509j3322K1104r028l2745k9121J3194N034J1805J3697q382N320k158L556
6861f537M283j5553K208J1676j213k0746J1429J0171j0792l904p244O050R112
6848a1060J7391O55M937L436j7441k0862o257L991J8076j7814j8496N756p70J4777
$$ plain form
6834 -23681 -20700 -18294 9326 14157 -4265 -30154 -11920 8889 2113 -30737 -32397 -5110 30662
6821 30662 26123 8155 -457 16152 9017 -2686 5608 12781 730 -9737 -8889 -5544 -13684 -17823
6807 -17823 -24613 -32681 -23336 -11725 -14778 -12354 -27843 -15733 5885 10076 -3921 -339 -2804
6794 -2804 -5793 -4431 -19470 -20985 -17487 4066 -7520 -17232 -11321 4552 8054 8646 10571 7528
6780 7528 20657 11429 -1235 -9512 -17034 -2403 -12506 -9547 -12560 -19724 -27538 -14270 -7827 3745
6766 3745 16359 24745 21397 12430 -3219 -16630 -25893 -219 13522 11345 -7766 -30749 -23898
6753 -23898 -33537 -17895 -18900 -12642 -6273 -14013 5644 -13159 -30438 -20447 -22822 -28710 -32476 -33953
6739 -33953 -37326 -45975 -44458 -25715 -44243 -45001 333 31894 32842 3885 -12505 -3541 4961 33985
$$ packed form
6834b3681K981K406K7620M831j8422k5889J8234K0809o776l2850j660K7287L5772
6821C0662m539j7968q612J6609p135j1703Q294P173j2051j0467Q48L345q140m139
6807a7823o790q068R345J1611l053K424j5489J2110K1618M191j3997L582k465
6794b804k989J362j5039j515L498K1553j1586r712N911J5873L502N92J925l043
6780G528J3129r228j2664q277p522J4631j0103K959l013p164p814J3268O443J1572
6766C745J2614Q386l348q967j5649j3411r263K5674J3741k177j9111k2983O851
6753b3898r639J5642j005O258O369p740J9657j8803j7279R991k375n888l766j477
6739c3953l373q649J517J8743j8528p58M5334L1561R48k8957j6390Q964Q502K9024
$$ plain form
6725 33985 51367 23318 -2532 -7119 -805 -9188 -17610 -13536 -3815 -5470 -13340 -5567 22339 35359
6711 35359 10735 -5836 -892 8834 10142 24889 11609 9303 4659 -11567 -36868 -43875 -24346
6698 -24346 -28743 -18191 -28863 -17740 -12831 -31165 -29724 -22709 -27774 -27443 -2940 2294 -26603
6685 -26603 -32892 -38205 -17208 -4806 -24436 -36993 -31093 -10966 -9262 -1010 -19729 -39554 -31833
6672 -31833 -31288 -16809 -9348 -20186 -19223 -26695 -35169 -36816 -29179 -27865 -26799 -19432 -11377 1222
6658 1222 3024 3924 10461 17156 9878 -73 -19471 -10376 10229 6335 -10712 -10343 7202 -17674
6644 -17674 -21163 -15687 -40122 -38657 -12939 16298 24548 8740 -10412 -19911 -2462 5483 -1640
6631 -1640 -16077 -14768 -24853 -26762 -29884 -46651 -39781 -17403 1387 -12870 -27423 -19283 -1148
$$ packed form
6725C3985J7382k8049k5850m587O314q383q422M074R721j655p870P773K7906J3020
6711C5359k4624j6571M944R726J308J4747j3280k306m644j6226k5301p007J9529
6698b4346m397J0552j0672J1123M909j8334J441P015n065L31K4503N234k8897
6685b6603o289n313K0997J2402j9630j2557N900K0127J704Q252j8719j9825P721
6672c1833N45J4479P461j0838R63p472q474j647P637J314J066P367Q055J2599
6658A222J802R00O537O695p278r951j9398R095K0605l894j7047L69J7545k4876
6644a7674l489N476k4435J465K5718K9237Q250j5808j9152r499J7449P945p123
6631a640j4437J309j0085j909l122j6767O870K2378J8790j4257j4553Q140J8135
$$ plain form
6618 -1148 10131 9827 5688 10120 756 -9909 -20673 -40986 -35259 -27092 -2654 3962 -21817 -34856
6604 -34856 -33309 -42191 -45198 139 -1778 -5210 -19474 -37755 -6697 -4170 -29826 -35562 -35853 -14811
6590 -14811 -8182 -3122 -4227 -17285 -7160 1566 -15430 -18589 -20426 -4944 -19364 -15143 -2027
6577 -2027 -1865 -15141 -4844 5860 4153 -1028 -3043 4526 8279 11615 9634 -29159 -40382 -41669
6563 -41669 -49743 -29226 -26283 -29354 -29215 -27975 793 -2916 -20144 -18526 -9769 -10682 -27114 -13413
6549 -13413 -21936 -42542 -36676 -18034 827 21543 15564 -12260 -10830 996 5790 1551 3601
6536 3601 17157 528 -13223 -10104 -24736 -20594 -19271 -23126 -21343 -26665 -33389 -24579 -18405 -16860
6522 -16860 -18913 -8159 -4080 -11448 -24784 -23380 -27922 -38152 -20111 -14276 -18179 -12401 6490
$$ packed form
6618a148J1279l04m139M432r364j0665j0764k0313N727Q167K4438O616k5779j3039
6604c4856J547q882l007M5337j917l432j4264j8281L1058K527k5656n736k91K1042
6590a4811O629N060j105j3058J0125Q726j6996l159j837J5482j4420M221J3116
6577b027J62j3276J0297J0704j707n181k015P569L753L336j981l8793j1223j287
6563d1669q074K0517K943l071J39J240K8768l709j7228J618Q757r13j6432J3701
6549a3413q523k0606N866J8642J8861K0716n979k7824J430J1826M794m239K050
6536C601J3556j6629j3751L119j4632M142J323l855J783n322o724Q810O174J545
6522a6860k053J0754M079p368j3336J404m542j0230J8041N835l903N778J8891
$$ [...]
##END NTUPLES=NMR SPECTRUM
##END=
