##TITLE=Analysis number 316842
Compound Code cc 25401
Project Code adrs
Chemist Name af chempharm
##JCAMPDX= 6.0         $$ Bruker NMR JCAMP-DX V2.0
##DATA TYPE= NMR SPECTRUM
##DATA CLASS= NTUPLES
##ORIGIN= Bruker BioSpin GmbH
##OWNER= nmr
$$ XWIN-NMR		Version 3.5
$$ Fri Jan 27 14:05:41 2006 GMT Standard Time (UT+0h)  MAYBRIDGE\nmr@NMR_250MHZ
##.OBSERVE FREQUENCY= 250.131544655141
##.OBSERVE NUCLEUS= ^1H
##.ACQUISITION MODE= SIMULTANEOUS (DQD)
##.ACQUISITION SCHEME= undefined
##.AVERAGES= 16
##.DIGITISER RES= 18
##SPECTROMETER/DATA SYSTEM= dpx250
##.PULSE SEQUENCE= zg30
##.SOLVENT NAME= DMSO
##.SHIFT REFERENCE= (INTERNAL, DMSO, 0, 16.522)
##AUDIT TRAIL= $$ (NUMBER, WHEN, WHO, WHERE, WHAT)
$$ ##TITLE= Audit trail, XWIN-NMR		Version 3.5
$$ ##JCAMPDX= 5.01
$$ ##ORIGIN= Bruker BioSpin GmbH
$$ ##OWNER= nmr
$$ C:\u/data/dgb/nmr/ADRS/15310/pdata/1/auditp.txt
$$ ##AUDIT TRAIL=  $$ (NUMBER, WHEN, WHO, WHERE, WHAT)
(   1,<2006-01-27 14:05:13.04 +000>,<MAYBRIDGE\nmr>,<NMR_250MHZ>,
      <created by zg, POWCHK disabled, PULCHK disabled
       configuration hash MD5:
       62 19 C7 07 E1 42 D1 B7 37 6C 3D D0 77 39 F9 E6
       data hash MD5: 64K
       59 47 A8 76 C2 92 F7 15 D3 C0 9D BF 1D 8A 1A 19>)
(   2,<2006-01-27 14:05:27.93 +000>,<MAYBRIDGE\nmr>,<NMR_250MHZ>,
      <Start of raw data processing
       ef LB = 0.3 FT_mod = 6 PKNL = 1 SI = 32K 
       data hash MD5: 32K
       F0 12 8A B5 E2 9B D8 52 39 B1 D2 E4 0C 28 28 40>)
(   3,<2006-01-27 14:05:30.48 +000>,<MAYBRIDGE\nmr>,<NMR_250MHZ>,
      <apk 
       data hash MD5: 32K
       75 F8 80 8B B6 ED 82 84 5E DE 03 D5 72 36 ED 58>)
(   4,<2006-01-27 14:05:31.23 +000>,<MAYBRIDGE\nmr>,<NMR_250MHZ>,
      <abs ABSG = 5 
       data hash MD5: 32K
       B7 C4 C9 B7 50 CE A1 B0 D2 ED 4F 64 D5 D2 C1 F2>)
$$ ##END=
$$ 
$$ hash MD5
$$ C1 68 B2 C7 9D 9A E1 7D 21 B2 1E 0F 5C F7 76 C6
##$RELAX= 
##$RELAX= 
##$RELAX= 
##$RELAX= 
##$RELAX= 
##$RELAX= 
##$RELAX= 
$$ Bruker specific parameters
$$ --------------------------
##$DU= <C:\u>
##$EXPNO= 15310
##$NAME= <ADRS>
##$PROCNO= 1
##$TYPE= <nmr>
##$USER= <dgb>
##$AMP= (0..31)
100 100 100 100 100 100 100 100 100 100 100 100 100 100 100 100 100 100 
100 100 100 100 100 100 100 100 100 100 100 100 100 100 
##$AQSEQ= 0
##$AQ_mod= 3
##$AUNM= <au_zg>
##$AUTOPOS= <8 >
##$BF1= 250.13
##$BF2= 250.13
##$BF3= 250.13
##$BF4= 250.13
##$BF5= 500.13
##$BF6= 500.13
##$BF7= 500.13
##$BF8= 500.13
##$BYTORDA= 1
##$CFDGTYP= 0
##$CFRGTYP= 5
##$CHEMSTR= <none>
##$CNST= (0..31)
1 1 145 1 1 1 1 1 1 1 1 1 1 1 1 1 1 1 1 1 1 1 1 1 1 1 1 1 1 1 1 1 
##$CPDPRG= <>
##$CPDPRG1= <>
##$CPDPRG2= <>
##$CPDPRG3= <>
##$CPDPRG4= <mlev>
##$CPDPRG5= <mlev>
##$CPDPRG6= <mlev>
##$CPDPRG7= <mlev>
##$CPDPRG8= <mlev>
##$CPDPRGB= <>
##$CPDPRGT= <>
##$D= (0..31)
0 1 0 0 0 0 0 0 0 0.06 0 0 0 0 0 0 0.0002 0 0 0 0 0 0 0 0 0 0 0 0 0 0 
0 
##$DATE= 1138370711
##$DBL= (0..7)
120 120 120 120 120 120 120 120 
##$DBP= (0..7)
150 150 150 150 150 150 150 150 
##$DBP07= 0
##$DBPNAM0= <>
##$DBPNAM1= <>
##$DBPNAM2= <>
$$ [...]
##$SUBNAM7= <"">
##$SUBNAM8= <"">
##$SUBNAM9= <"">
##$SW= 20.6930455092707
##$SWIBOX= (0..15)
0 0 3 0 0 0 0 0 0 0 0 0 0 0 0 0 
##$SW_h= 5175.983436853
##$TD= 65536
##$TD0= 1
##$TE= 294.16
##$TE2= 300
##$TE3= 300
##$TEG= 300
##$TL= (0..7)
0 120 120 120 120 120 120 120 
##$TP= (0..7)
150 150 150 150 150 150 150 150 
##$TP07= 0
##$TPNAME0= <>
##$TPNAME1= <>
##$TPNAME2= <>
##$TPNAME3= <>
##$TPNAME4= <>
##$TPNAME5= <>
##$TPNAME6= <>
##$TPNAME7= <>
##$TPOAL= (0..7)
0.5 0.5 0.5 0.5 0.5 0.5 0.5 0.5 
##$TPOFFS= (0..7)
0 0 0 0 0 0 0 0 
##$TUNHIN= 0
##$TUNHOUT= 0
##$TUNXOUT= 0
##$USERA1= <user>
##$USERA2= <user>
##$USERA3= <user>
##$USERA4= <user>
##$USERA5= <user>
##$V9= 5
##$VALIST= <valist>
##$VCLIST= <CCCCCCCCCCCCCCC>
##$VD= 0
##$VDLIST= <DDDDDDDDDDDDDDD>
##$VPLIST= <PPPPPPPPPPPPPPP>
##$VTLIST= <TTTTTTTTTTTTTTT>
##$WBST= 1024
##$WBSW= 4
##$XGAIN= (0..3)
0 0 0 0 
##$XL= 0
##$YL= 0
##$YMAX_a= 246543
##$YMIN_a= -428100
##$ZGOPTNS= <>
##$ZL1= 120
##$ZL2= 120
##$ZL3= 120
##$ZL4= 120
##$ABSF1= 16.522
##$ABSF2= -4.171173
##$ABSG= 5
##$ABSL= 3
##$ALPHA= 0
##$AQORDER= 0
##$ASSFAC= 0
##$ASSFACI= 0
##$ASSFACX= 0
##$ASSWID= 0
##$AUNMP= <proc_1d>
##$AZFE= 0.1
##$AZFW= 0.1
##$BCFW= 0
##$BC_mod= 0
##$BYTORDP= 0
##$COROFFS= 0
##$CY= 12.5
##$DATMOD= 1
##$DC= 0
##$DFILT= <>
##$DTYPP= 0
##$F1P= 14.0000005364418
##$F2P= -0.99999901652339
##$FCOR= 0.5
##$FTSIZE= 32768
##$FT_mod= 6
##$GAMMA= 0
##$GB= 0
##$INTBC= 1
##$INTSCL= 1
##$ISEN= 128
##$LB= 0.3
##$LEV0= 0
##$LPBIN= 0
##$MAXI= 10000
##$MC2= 0
##$MEAN= 0
##$ME_mod= 0
##$MI= 0
##$NCOEF= 0
##$NC_proc= -5
##$NLEV= 6
##$NOISF1= 0
##$NOISF2= 0
##$NSP= 0
##$NTH_PI= 0
##$NZP= 0
##$OFFSET= 16.522
##$PC= 1
##$PHC0= 211.7035
##$PHC1= 72.2959
##$PH_mod= 1
##$PKNL= yes
##$PPARMOD= 0
##$PSCAL= 4
##$PSIGN= 0
##$REVERSE= no
##$SF= 250.13
##$SI= 32768
##$SIGF1= 0
##$SIGF2= 0
##$SINO= 400
##$SIOLD= 32768
##$SREGLST= <1H.DMSO>
##$SSB= 0
##$STSI= 32768
##$STSR= 0
##$SW_p= 5175.98343685301
##$SYMM= 0
##$S_DEV= 0
##$TDeff= 65536
##$TDoff= 0
##$TI= <Analysis number 999999
Compound Code 99
Book Reference 9
Project Code 9>
##$TILT= no
##$TM1= 0
##$TM2= 0
##$TOPLEV= 0
##$USERP1= <user>
##$USERP2= <user>
##$USERP3= <user>
##$USERP4= <user>
##$USERP5= <user>
##$WDW= 1
##$XDIM= 32768
##$YMAX_p= 508514155
##$YMIN_p= -24794648
$$ End of Bruker specific parameters
$$ ---------------------------------
##NTUPLES= NMR SPECTRUM
##VAR_NAME=  FREQUENCY,     SPECTRUM/REAL,   SPECTRUM/IMAG
##SYMBOL=    X,             R,               I
##VAR_TYPE=  INDEPENDENT,   DEPENDENT,       DEPENDENT
##VAR_FORM=  AFFN,          ASDF,            ASDF
##VAR_DIM=   32768,         32768,           32768
##UNITS=     HZ,            ARBITRARY UNITS, ARBITRARY UNITS
##FACTOR=    0.157963299565203, 1,           1
##FIRST=     4132.6476996994, 0,             0
##LAST=      -1043.33573715361, 0,           0
##MIN=       -1043.33573715361, -24794648,   0
##MAX=       4132.6476996994, 508514155,     0
$$ Real data points
##PAGE= N=1
##DATA TABLE= (X++(R..R)), XYDATA
$$ [...]
$$ plain form
24670 45736 71871 120764 156567 223126 93662 324271 239942 226548 213155 117675 1881
24659 1881 -188092 -229604 -102189 -58072 -79433 19085 118080 305989 297394 243965 225867
24648 225867 311371 443433 346212 262417 301095 341670 301920 174405 212038 230753 247641
24637 247641 172209 211558 336647 409632 367334 292246 42204 -129194 -122517 -252154 -263822
24626 -263822 -168441 -36618 186260 254308 -85706 -236265 -303860 -217372 3848 109562
24616 109562 184018 135532 95468 198196 152667 270856 104930 -151509 -188705 -4
24606 -4 108510 97518 718 -175079 -179869 6626 12026 -102979 -99392 68219 262532 328295
24594 328295 101178 73548 160466 282930 303433 288629 137527 72123 138433 102532 65846
$$ packed form
24670D5736K6135M8893L5803O6559j29464K30609q4329j3394j3393r5480j15794
24659A881j89973m1512J27415M4117k1361R8518R8995J87909q595n3429j8098
24648B25867Q5504J32062r7221q3795L8678M0575l9750j27515L7633J8715J6888
24637B47641p5432L9349J25089P2985m2298p5088k50042j71398O677j29637j1668
24626b63822R5381J31823K22878O8048l40014j50559o7595Q6488K21220J05714
24616A09562P4456m8486m0064J02728m5529J18189j65926k56439l7196J88701
24606dJ08514j0992r6800j75797m790J86495N400j15005L587J67611J94313O5763
24594C28295k27117k7630Q6918J22464K0503j4804j51102o5404O6310l5901l6686
$$ plain form
24583 65846 -41425 -137035 12604 200097 227429 267834 223694 198087 330535 122845 8209
24572 8209 146961 154513 218438 297560 200661 121106 254906 -57072 -202946 -45941 -280530
24561 -280530 -349078 -385333 -499129 -474249 -220719 50183 379887 139793 -69052 -7796
24551 -7796 158444 195014 172698 -10046 -9682 178707 216162 296336 225918 160006 -112649
24540 -112649 -87398 211913 263488 77163 -59230 -225533 -315025 -444004 -411088 -267841
24530 -267841 -34146 123175 287186 213721 110572 147078 364697 518286 340886 13257
24520 13257 -3571 179149 200843 31271 -41925 -108512 -187516 -172682 -156731 -21542 25703
24509 25703 47382 -25624 -94295 171210 147911 237838 278231 243070 351778 307198 208852
$$ packed form
24583F5846j07271r5610J49639J87493K7332M0405m4140k5607J32448k07690j14636
24572H209J38752P552O3925P9122r6899p9555J33800l11978j45874J57005k34589
24561b80530o8548l6255j13796K4880K53530K70902L29704k40094k08845O1256
24551g796J66240L6570k2316j82744L64J88389L7455Q0174p0418o5912k72655
24540a12649K5251K99311N1575j86325j36393j66303q9492j28979L2916J43247
24530b67841K33695J57321J64011p3465j03149L6506K17619J53589j77400l27629
24520A3257j6828J82720K1694j69572p3196o6587p9004J4834J5951J35189M7245
24509B5703K1679p3006o8671K65505k3299Q9927M0393l5161J08708m4580r8346
$$ plain form
24498 208852 220009 255654 206116 164864 263120 136032 -92703 -84941 -48395 66493 118716
24487 118716 -113312 -100730 28291 107443 132866 75778 91327 75310 -137447 -385855 -547003
24476 -547003 -468029 -343141 -280689 -21054 26212 -99464 -79776 49733 108964 141115 -31555
24465 -31555 -64841 86342 57548 95287 206919 149861 -16674 111732 107317 226871 319213
24454 319213 291327 161053 95181 58610 35922 133223 360621 231239 127002 98346 132221
24443 132221 296402 220842 170717 98082 313580 223873 88901 230960 347129 137349
24433 137349 -22641 -36420 116141 156234 101555 94746 33715 -78089 -149996 -363741 -510890
24422 -510890 -497470 -476876 -348160 -139961 89701 261316 224558 142193 -137550 -286323
$$ packed form
24498B08852J1157L5645m9538m1252R8256j27088k28735P762L6546J14888N2223
24487A18716k32028J2582J29021P9152K5423n7088J5549j6017k12757k48408j61148
24476e47003P8974J24888O2452K59635M7266j25676J9688J29509N9231L2151j72670
24465c1555l3286J51183k8794L7739J11632n7058j66535J28406m415J19554R2342
24454C19213k7886j30274o5872l6571k2688R7301K27398j29382j04237k8656L3875
24443A32221J64181p5560n0125p2635K15498q9707j34972J42059J16169k09780
24433A37349j59990j3779J52561M0093n4679o809o1031j11804p1907k13745j47149
24422e10890J3420K0594J28716K08199K29662J71615l6758q2365k79743j48773
$$ plain form
24412 -286323 -268943 -177418 -191608 -299746 -245465 -184312 65163 267434 231524 28280 113093
24401 113093 188861 207841 115815 -38627 -16846 -108263 -184858 -38253 142744 174706 101717
24390 101717 91411 109927 68482 118759 53554 255344 246942 31709 -129699 -7918 -20555
24379 -20555 -12282 199372 352110 348395 176742 145087 190587 97138 49710 86671 81174 215205
24367 215205 540592 609862 265188 52409 61757 128830 217159 227774 246352 311376 263964
24356 263964 55110 42479 -58564 -115225 54463 137683 50167 35255 69145 -115945 -376184
24345 -376184 -362265 -106467 193547 164586 -175316 -159071 129876 404657 521951 449947
24335 449947 222480 11092 -172861 -195650 -202162 -175620 -66131 -125647 -151537 -183703 86010
$$ packed form
24412b86323J7380R1525j4190j08138N4281O1153K49475K02271l5910k03244Q4813
24401A13093P5768J8980r2026j54442K1781r1417p6595J46605J80997L1962p2989
24390A01717j0306J8516m1445N0277o5205K01790q402k15233j61408J21781j2637
24379b0555Q273K11654J52738l715j71653l1655M5500r3449m7428L6961n497J34031
24367B15205L25387O9270l44674k12779R348O7073Q8329J0615J8578O5024m7412
24356B63964k08854j2631j01043n6661J69688Q3220q7516j4912L3890j85090k60239
24345c76184J3919K55798L00014k8961l39902J6245K88947K74781J17294p2004
24335D49947k27467k11388j83953k2789o512K6542J09489n9516k5890l2166K69713
$$ plain form
24324 86010 127522 170090 142786 105629 3694 85332 247492 293845 148630 21994 -52423
24313 -52423 -24790 61890 -21900 -40795 8322 149297 44141 -70671 89323 4907 -179425
24302 -179425 -244254 -171747 -115933 -159046 -177531 -172410 -247420 -42834 27753 -44265 -90271
24291 -90271 -97656 -71232 133366 122255 -114142 -82857 35022 12421 -11318 -159480 -199045
24280 -199045 11247 74642 69070 33018 -10845 56327 -205 -89516 -23247 -88544 -248114
24269 -248114 -302908 -304809 -201768 -323313 -358530 -288286 -211707 -129640 -161525 -193497 -190497
24258 -190497 -38235 -62877 -4885 70576 17131 60900 168102 233798 245059 263609 71213
24247 71213 -162375 -202105 -64182 19803 83227 58223 -114272 -155483 -43169 79978 201572
$$ packed form
24324H6010M1512M2568k7304l7157j01935Q1638J62160M6353j45215j26636p4417
24313e2423K7633Q6680q3790j8895M9117J40975j05156j14812J59994q4416j84332
24302a79425o4829P2507N5814m3113j8485N121p5010K04586P0587p2018m6006
24291i0271p385K6424K04598j1111k36397L1285J17879k2601k3739j48162l9565
24280a99045K10292O3395n572l6052m3863O7172n6532q9311O6269o5297j59570
24269b48114n4794j901J03041j21545l5217P0244P6579Q2067l1885l1972L000
24258a90497J52262k4642N7992P5461n3445M3769J07202O5696J1261J8550j92396
24247G1213k33588l9730J37923Q3985O3424k5004j72495m1211J12314J23147J21594
$$ plain form
24236 201572 160586 -85004 -23814 46127 202088 83340 33028 -38296 -149749 28113
24226 28113 232318 316414 282087 202545 91930 61809 -66701 186821 187268 -30362 -251783
24215 -251783 -226062 102189 204158 120975 36560 -85620 -267118 30985 27630 80840 24184
24204 24184 -138471 -73904 -14695 25374 97675 173460 229893 169295 17597 88506 110056
24193 110056 199269 138831 98067 173324 132942 194099 42880 -108344 -218410 -222318 -288859
24182 -288859 -224408 -128941 95312 161875 85548 -70249 -173836 63686 97027 225052
24172 225052 346969 222527 76855 77970 175954 257099 224738 158138 264828 308411 262721
24161 262721 207638 231184 91836 -104391 -256567 -289539 -173348 -33530 189761 155280
$$ packed form
24236B01572m0986k45590O1190O9941J55961j18748n0312p1324j11453J77862
24226B8113K04205Q4096l4327p9542j10615l0121j28510K53522M47k17630k21421
24215b51783K5721L28251J01969q3183q4415j22180j81498K98103l355N3210n6656
24204B4184j62655O4567N9209M0069P2301P5785N6433o0598j51698P0909K1550
24193A10056Q9213o0438m0764P5257m0382O1157j51219j51224j10066l908o6541
24182b88859O4451R5467K24253O6563p6327j55797j03587K37522L3341J28025
24172B25052J21917j24442j45672J115R7984Q1145l2361o6600J06690M3583m5690
24161B62721n5083K3546j39348j96227j52176l2972J16191J39818K23291l4481
$$ plain form
24151 155280 -9574 -76475 -155566 -21455 -40861 -199229 -285434 -203267 -68138 -44915 -10054
24140 -10054 -2955 123237 53866 93493 207887 282739 147253 184654 224701 41156 -33907
24129 -33907 6288 -224545 -342005 -269582 -133996 -85359 17918 126464 113091 -79931
24119 -79931 -276480 -347668 -250860 -269230 -79202 -135257 -135932 -80084 -348207 -392417 -290930
24108 -290930 -155672 -164038 -172421 -71310 -146445 80363 231189 176289 118647 45650 155639
24097 155639 197037 174282 73462 20443 135480 275489 293536 272738 131341 95282 175903
24086 175903 385340 420039 448661 392310 277100 263691 314731 271059 262903 101616 128391
24075 128391 86708 -147533 -182163 18738 187687 216934 15118 -50236 21357 -72257 -227053
$$ packed form
24151A55280j64854o6901p9091J34111j9406j58368q6205Q2167J35129K3223L4861
24140a0054P099J26192o9371L9627J14394P4852j35486L7401M0047j83545p5063
24129c3907M0195k30833j17460P2423J35586M8637J03277J08546j3373j93022
24119g9931j96549p1188R6808j8370J90028n6055o75N5848k68123m4210J01487
24108b90930J35258q366q383J01111p5135K26808J50826n4900n7642p2997J09989
24097A55639M1398k2755j00820n3019J15037J40009J8047k0798j41397l6059Q0621
24086A75903K09437L4699K8622n6351j15210j3409N1040m3672q156j61287K6775
24075A28391m1683k34241l4630K00901J68949K9247k01816o5354P1593r3614j54796
$$ plain form
24064 -227053 -364159 -203373 214710 378110 150656 188205 281592 371172 283948 186256
24054 186256 81200 244439 237799 96655 6567 282220 161077 -221407 -153048 -87509
24044 -87509 -71288 -108111 -179617 -245818 -211699 28971 106741 -247396 -208272 -134379 -70825
24033 -70825 -7774 94515 159317 48559 225434 179433 99872 88095 100688 1434 21774
24022 21774 171484 241901 24141 -325597 -409006 -307386 -72003 -26343 8964 94000 217269
24011 217269 170058 -53694 -79220 136304 222537 288274 224629 269951 371456 166022 -22524
24000 -22524 -34546 102226 43608 -66311 -36758 88533 108911 101782 -3528 -24474 112133
23989 112133 85794 -24334 -80121 -34828 64539 -46129 -133719 -84796 -71089 -149214 182031
$$ packed form
24064b27053j37106J60786M18083J63400k27454L7549R3387Q9580q7224r7692
24054A86256j05056J63239o640j41144r0088K75653j21143l82484O8359O5539
24044h7509J6221l6823p1506o6201L4119K40670P7770l54137L9124P3893O3554
24033g0825O3051J02289O4802j10758J76875m6001p9561j1777J2593r9254K0340
24022B1774J49710P0417k17760l49738q3409J01620K35383M5660L5307Q5036J23269
24011B17269m7211k23752k5526K15524Q6233O5737o3645M5322J01505k05434j88546
24000b2524j2022J36772n8618j09919K9553J25291K0378p129j05310k0946J36607
23989A12133k6339j10128n5787M5293R9367j10668q7590M8923J3707p8125L31245
$$ plain form
23978 182031 188712 113273 37593 -8873 -54813 144435 170592 124341 280386 326635 80268
23967 80268 -69 -25212 116414 171257 229625 171578 405241 508879 410996 396385 193865
23956 193865 182408 374171 336685 96658 5234 -88191 130937 243839 125852 43207
23946 43207 103357 107540 93408 8890 81338 60395 147053 70940 120753 -63207 -101779 -93147
23934 -93147 -30853 76144 -35930 130951 168611 115964 320222 303999 151832 83020 -27731
23923 -27731 -299626 -350195 -36452 271922 320939 267434 150370 247649 324065 383205 293129
23912 293129 -134484 -231231 -56321 75133 -9691 67829 77350 81863 108932 162038 31281
23901 31281 -24217 24308 84759 31245 -132118 -261952 -22625 75930 6569 -85740 -110763
$$ packed form
23978A82031O681p5439p5680m6466m5940J99248K6157m6251J56045M6249k46367
23967H0268q0337k5143J41626N4843N8368n8047K33663J03638r7883j4611k02520
23956A93865j1457J91763l7486k40027r1424r3425K19128J12902j17987q2645
23946D3207O0150M183j4132q4518P2448k0943Q6658p6113M9813j83960l8572Q632
23934i3147O2294J06997j12074J66881L7660n2647K04258j6223j52167o8812j10751
23923b7731k71895n0569L13743L08374M9017n3505j17064R7279P6416N9140r0076
23912B93129m27613r6747J74910J31454q4824P7520R521M513K7069N3106j30757
23901C1281n5498M8525O0451n3514j63363j29834K39327R8555o9361r2309k5023
$$ plain form
23890 -110763 -177912 22726 86827 88731 85700 194642 234556 252506 421768 352034 405640
23879 405640 314486 75015 229460 326156 -113573 -315597 -95721 234035 409697 550041
23869 550041 332655 181632 103464 257282 241351 -33776 57473 256975 241566 -118013
23859 -118013 -98994 -131594 -193728 7428 -24593 -87986 52657 175132 258127 191283 97835
23848 97835 45178 76387 186370 302691 268878 253123 139312 188208 231116 237126 176726
23837 176726 254954 78781 -317905 -352753 -93708 -25178 -107508 -52826 -56179 -94135 -109872
23826 -109872 -132647 -78668 -98566 -3711 154605 518827 483594 349622 347044 135161 -3715
23815 -3715 90590 258917 372913 253269 166906 46566 -68276 73937 70687 86818 -152303
$$ packed form
23890a10763o7149K00638O4101J904l031J08942L9914J7950J69262o9734N3606
23879D05640r1154k39471J54445R6696m39729k02024K19876L29756J75662J40344
23869E50041k17386j51023p8168J53818j5931k75127R1249J99502j5409l59579
23859a18013J9019l2600o2134K01156l2021o3393J40643J22475Q2995o6844r3448
23848I7835n2657L1209J09983J16321l3813j5755j13811M8896M2908O010o0400
23837A76726P8228j76173l96686l4848K59045O8530q2330N4682l353l7956j5737
23826a09872k2775N3979j9898R4855J58316L64222l5233j33972k578k11883j38876
23815c715R4305J68327J13996j19644q6363j20340j14842J42213l250J6131k39121
$$ plain form
23804 -152303 -300172 -249820 -75204 65993 211411 322392 395317 412798 299508 246968
23794 246968 59832 83643 137751 69325 58843 191188 181738 80827 135620 161821 158445
23783 158445 176122 21735 31486 76917 61878 162448 95562 -27048 -27433 78574 63798
23772 63798 -20109 -166744 -166328 -198902 -168142 71600 249682 296478 97709 -36955 -870
23761 -870 222212 274148 197049 194233 48441 5113 -148981 -64548 26842 155811 50746
23750 50746 -83338 -196994 -177343 -166220 -9281 72394 15735 -25000 1714 -75904 -72727
23739 -72727 -209641 -204478 -140023 -167400 -197873 -61212 81799 84627 116739 341742 355315
23728 355315 88808 81070 387746 505736 461589 307121 191646 -17885 -150238 -169718
$$ packed form
23804a52303j47869N0352J74616J41197J45418J10981P2925J7481j13290n2540
23794B46968j87136K3811N4108o8426j0482J32345r450j00911N4793K6201l376
23783A58445J7677j54387R751M5431j5039J00570o6886j22610l85J06007j4776
23772F3798q3907j46635M16l2574L0760K39742J78082M6796j98769j34664L6085
23761h70K23082N1936p7099k816j45792m3328j54094Q4433R1390J28969j05065
23750E0746j34084j13656J9651J1123J56939Q1675n6659m0735K6714p7618L177
23739g2727j36914N163O4455k7377l0473J36661J43011K828L2112K25003J3573
23728C55315k66507p738L06676J17990m4147j54468j15475k09531j32353j9480
$$ plain form
23718 -169718 -29040 -39997 89796 214082 284707 424781 223002 -9108 -121774 -50800
23708 -50800 225296 279496 381385 304558 15439 12044 144595 207551 113792 -16841 -19799
23697 -19799 818 37884 -31693 -245819 -261166 -86776 31311 161836 307733 398051 412677
23686 412677 218368 -87427 -138411 -108900 -197706 -37861 -33270 -152846 -254166 -140728
23676 -140728 148357 261032 159955 32295 141083 162106 146058 235087 163121 59136
23666 59136 95013 -78004 -318481 -318680 -84015 42239 136015 214517 392610 221700 -105981
23655 -105981 -86013 55250 141202 221491 157438 44312 -67722 -227166 -135306 -8618
23645 -8618 153885 354911 348697 173756 59604 224800 273336 229443 -29502 -8247 166364
$$ packed form
23718a69718J40678j0957J29793J24286P0625J40074k01779k32110j12666P0974
23708e0800K76096N4200J01889p6827k89119l395J32551O2956r3759j30633k958
23697a9799K0617L7066o9577k14126j5347J74390J18087J30525J45897R0318J4626
23686D12677j94309l05795n0984K9511q8806J59845M591j19576j01320J13438
23676a40728K89085J12675j01077j27660J08788K1023j6048Q9029p1966j03985
23666E9136L5877j73017k40477j99K34665J26254R3776P8502J78093j70910l27681
23655a05981J9968J41263Q5952Q0289o4053j13126j12034j59444R1860J26688
23645h618J62503K01026o214j74941j14152J65196M8536m3893k58945K1255J74611
$$ plain form
23634 166364 191108 114508 114977 81587 155056 107998 67374 -88348 108045 202142 10783
23623 10783 -289031 -424020 -275560 -60067 -154572 -110915 152145 153445 151160 147988 145897
23612 145897 226633 -28225 -103626 55409 184986 218992 199624 261234 193819 161014 114969
23601 114969 163115 389716 402764 141250 -6563 -17410 -9878 -55313 -47681 4262 -104326
23590 -104326 -146938 -41288 123760 115462 208478 164047 51008 219236 153079 35515 -38331
23579 -38331 166968 128711 7403 66042 160450 145821 -59735 112251 307731 420491
23569 420491 377063 208823 122940 23672 74437 232866 73910 165685 234944 135835 167248
23558 167248 146162 195017 207703 -159587 -330240 -159403 77494 56471 -91133 -115587
$$ packed form
23634A66364K4744p6600M69l3390P3469m7058m0624j55722J96393R4097j91359
23623A0783k99814j34989J48460K15493r4505M3657K63060J300k285l172k091
23612A45897Q0736k54858p5401J59035J29577L4006j9368O1610o7415l2805m6045
23601A14969M8146K26601J3048k61514j47813j0847P532m5435P632N1943j08588
23590a04326m2612J05650J65048q298R3016m4431j13039J68228o6157j17564p3846
23579c8331K05299l8257j21308N8639R4408j4629k05556J71986J95480J12760
23569D20491m3428j68240q5883r9268N0765J58429j58956R1775O9259r9109L1413
23558A67248k1086M8855J2686l67290j70653J70837K36897k1023j47604k4454
$$ plain form
23548 -115587 -1440 69240 105563 74778 -19827 -15149 50993 -119012 -28540 -118800 -162268
23537 -162268 -327521 -301621 -378797 -255692 -88529 -78332 41067 63972 23808 15132 41024
23526 41024 -7876 178958 426262 393830 303490 286362 314710 180809 259760 320106 234573
23515 234573 134845 137111 271884 222806 342980 108970 13479 158621 286469 212362 133964
23504 133964 93196 164870 100856 39151 -17394 3402 94168 -1322 -146343 -103055 -108067
23493 -108067 -279753 -371749 -548167 -530122 -516743 -497989 -389231 -317755 -232570 -239607 -358450
23482 -358450 -470059 -441796 -291671 -34110 106389 97468 34698 93484 35749 -111322 -121772
23471 -121772 10332 -10357 -269872 -280544 -38784 -42946 155049 311599 350047 371149 457186
$$ packed form
23548a15587J14147P0680L6323l0785r4605M678O6142j70005R0472r0260m3468
23537a62268j65253K5900p7176J23105J67163J0197J19399K2905m0164q676K5892
23526D1024m8900J86834K47304l2432r0340j7128K8348j33901P8951O0346q5533
23515B34573r9728K266J34773m9078J20174k34010r5491J45142J27848p4107p8398
23504A33964m0768P1674o4014o1705n6545K0796R0766r5490j45021M3288n012
23493a08067j71686r1996j76418J8045J3379J8754J08758P1476Q5185p037j18843
23482c58450j11609K8263J50125K57561J40499q921o2770N8786n7735j47071j0450
23471a21772J32104k0689k59515j0672K41760m162J97995J56550L8448K1102Q6037
$$ plain form
23460 457186 471453 85671 134247 251910 255569 374473 350740 125026 242391 420068
23450 420068 327522 133387 131541 170777 237006 361565 277318 174967 -32376 -164438 -151518
23439 -151518 -134083 40106 159738 224828 264010 311439 363264 182429 208188 228367 160525
23428 160525 104232 60535 38193 318924 364824 351954 401504 414789 299042 109206 109808
23417 109808 66238 116167 78856 116145 -95215 -206726 -185727 -75968 83852 -8381 -144111
23406 -144111 -66531 -30468 33324 104016 76509 42789 65752 236135 211254 19461 -126994
23395 -126994 151462 222975 108314 -19421 47852 37417 -33913 -31466 -15912 -61730 -84016
23384 -84016 131807 90415 -139525 -167490 -134454 -87374 -75378 -47095 -141004 -4639 -4353
$$ packed form
23460D57186J4267l85782M8576J17663L659J18904k3733k25714J17365J77677
23450D20068r2546j94135j846L9236O6229J24559q4247j02351k07343j32062J2920
23439a51518J7435J74189J19632O5090L9182M7429N1825j80835K5759K0179o7842
23428A60525n6293m3697k2342K80731M5900j2870M9550J3285j15747j89836O02
23417A09808m3570M9929l7311L7289k11360j11511K0999J09759J59820r2233j35730
23406a44111P7580L6063O3792P0692k7507l3720K2963J70383k4881j91793j46455
23395a26994K78456P1513j14661j27735O7273j0435p1330K447J5554m5818k2286
23384h4016K15823m1392k29940k7965L3036M7080J1996K8283r3909J36365K86
$$ plain form
23373 -4353 -175913 -184360 -42488 3140 112557 113614 164457 79644 55556 33131 -21909 36847
23361 36847 -141373 -152566 3637 51532 56810 209195 173654 26901 -7370 -22826 -148337
23350 -148337 86028 185816 98456 37641 -71537 -230076 -137697 -47859 81789 -69007
23340 -69007 -117160 -74340 148056 206345 89548 237536 488164 384302 296359 215481 129137
23329 129137 101009 111003 42232 198160 284563 399131 470964 306905 160310 422499 307382
23318 307382 -41656 -9037 141024 232721 181792 118143 119290 457 9486 83862 8603
23307 8603 -19109 -75846 -150595 -42925 75051 106875 -41813 -69146 86 -92923 -155189
23296 -155189 -222440 -307203 -154814 -92499 -317822 -285435 -5437 171127 97077 99761 -60024
$$ packed form
23373d353j71560q447J41872M5628J09417J057N0843q4813k4088k2425n5040N8756
23361C6847j78220j1193J56203M7895N278J52385l5541j46753l4271j5456j25511
23350a48337K34365R9788q7360o0815j09178j58539R2379Q9838J29648j50796
23340f9007m8153M2820K22396N8289j16797J47988K50628j03862q7943q0878q6344
23329A29137k8128R994o8771J55928Q6403J14568P1833j64059j46595K62189j15117
23318C07382l49038L2619J50061R1697n0929o3649J147j18833R029P4376p5259
23307H603k7712n6737p4749J07670J17976L1824j48688k7333O9232r3009o2266
23296a55189o7251q4763J52389O2315k25323L2387K79998J76564p4050K684j59785
$$ plain form
23285 -60024 -147907 -199652 -330596 -241200 -190992 -189607 -116764 36727 -69008 -184084 -100238
23274 -100238 116564 6584 -191728 -321492 -412694 -306992 -153185 -118452 137027 125373
23264 125373 272255 323511 210215 31754 -133089 -13836 -36021 -66980 50286 218504
23254 218504 361651 329121 187392 79578 -18831 -2896 134695 31846 38567 66688 -129459
23243 -129459 -152545 7271 149407 251848 137983 -89018 -167433 87625 283266 294965
23233 294965 -98968 -182388 -228774 43676 128417 -59590 -79604 -120428 -117680 -141738 -165663
23222 -165663 -161348 -181327 -61119 148312 218961 99001 36017 18889 10768 45523 71911
23211 71911 99922 66382 -45609 -65278 -103575 -219463 -433264 -268306 24402 -28300 108661
$$ packed form
23285f0024q7883n1745j30944Q9396N0208J385P2843J53491j05735j15076Q3846
23274a00238K16802j09980j98312j29764r1202J05702J53807L4733K55479j1654
23264A25373J46882N1256j13296j78461j64843J19253k2185l0959J17266J68218
23254B18504J43147l2530j41729j07814r8409J5935J37591j02849O721K8121j96147
23243a29459k3086J59816J42136J02441j13865k27001p8415K55058J95641J1699
23233B94965l93933q3420m6386K72450Q4741j88007k0014m0824K748k4058k3925
23222a65663M315j9979J20208K09431P0649j19960o2984j7128q121L4755K6388
23211G1911K8011l3540j11991j9669l8297j15888k13801J64958K92708n2702J36961
$$ plain form
23200 108661 186474 103229 149942 159864 200336 231828 249925 45363 -102130 -51242 53010
23189 53010 129893 149458 162571 238222 289141 203604 176257 -72252 -111399 18291 177278
23178 177278 140269 300947 415665 167689 -46759 -138373 47986 181877 167122 64641
23168 64641 -168951 -67175 -51120 54338 95915 91253 106374 111934 -1507 -183689 -124015
23157 -124015 79360 357620 424384 85894 -72008 -258769 -206896 -79670 38571 -111067
23147 -111067 2655 289389 403723 556750 625102 401724 29767 -67010 -78997 -166167
23137 -166167 -80451 -164090 -79012 -33413 44861 97324 111763 28451 10214 -127568 -289947
23126 -289947 -227931 -179361 -254359 -281356 -305304 -380264 13325 279541 248403 257024 -18433
$$ packed form
23200A08661P7813q3245M6713R922M0472L1492J8097k04562j47493N0888J04252
23189E3010P6883J9565J3113P5651N0919q5537k7347k48509l9147J29690J58987
23178A77278l7009J60678J14718k47976k14448r1614J86359J33891j4755j02481
23168F4641k33592J01776J6055J05458M1577m662J5121N560j13441j82182N9674
23157a24015K03375K78260O6764l38490j57902j86761N1873J27226J18241j49638
23147a11067J13722K86734J14334J53027O8352k23378l71957r6777j1987q7170
23137a66167Q5716q3639Q5078M5599P8274N2463J4439q3312j8237j37782j62379
23126b89947O2016M8570p4998k6997k3948p4960L93589K66216l1138Q621k75457
$$ plain form
23115 -18433 -155758 -225993 -135353 20194 62571 23658 21567 111734 171910 83476 125639
23104 125639 215124 304930 288370 205094 315880 312578 220874 17538 -160572 -100977 -152178
23093 -152178 -253024 -265816 -109057 -10611 43285 -103148 -226058 -209171 -144522 -160644 -288955
23082 -288955 -322157 -279994 -140519 -94051 -91051 -227156 -212247 119284 74294 115343 103051
23071 103051 -19330 12081 -40432 -98047 -183943 -133681 30484 -2502 52348 151110 146880
23060 146880 92107 -187049 -196046 -177063 25167 83714 52120 -92688 14965 44822 48746
23049 48746 -167925 -83679 -101040 -169192 -67353 -35609 78833 140694 45820 96352 -118429
23038 -118429 -192052 -167791 -110124 -11699 44688 158607 75948 149804 142141 72461 81997 144679
$$ packed form
23115a8433j37325p0235R0640J55547M2377l8913k091R0167O0176q8434M2163
23104A25639Q9485Q9806j6560q3276J10786l302r1704k03336j78110N9595n1201
23093a52178j00846j2792J56759R8446N3896j46433j22910J6887O4649j6122j28311
23082b88955l3202M2163J39475M6468L000j36105J4909L31531m4990M1049j2292
23071A03051j22381L1411n2513n7615q5896N0262J64165l2986N4850R8762m230
23060A46880n4773k79156q997J8983K02230N8547l1594j44808J07653K9857L924
23049D8746k16671Q4246j7361o8152J01839L1744J14442O1861r4874N0532k14781
23038a18429p3623K4261N7667R8425N6387J13919q2659P3856p663o9680R536O2682
$$ plain form
23026 144679 41969 86983 43514 -725 107049 21052 -81270 -65988 -69802 25758 136465
23015 136465 77344 51342 34032 -39201 -46547 -109136 -196625 -233292 -65891 -4826 -238871
23004 -238871 -457813 -379853 -301352 -192167 -11627 -102387 -336461 -373410 -151984 -69184
22994 -69184 -57656 -299336 -266864 -208951 -312839 -419399 -294390 17238 78165 130629 278815
22983 278815 243165 375827 220602 -43927 -116899 -118674 -215492 -167894 6787 368913 633090
22972 633090 466448 116054 35823 66420 -115215 110835 226466 337176 230901 92438
22962 92438 63337 63837 -28959 -81621 50108 189290 430031 495066 278947 96877 -86703
22951 -86703 -343717 -258449 -153491 73111 26282 152114 236949 176569 173019 -7663 124830
$$ packed form
23026A44679j02710M5014m3469m4239J07774q5997j02322J5282l814R5560J10707
23015A36465n9121k6002j7310p3233p346o2589q7489l6667J67401O1065k34045
23004b38871k18942P7960P8501J09185J80540r0760k34074l6949K21426Q2800
22994f9184J1528k41680L2472N7913j03888j06560J25009L11628O0927N2464J48186
22983B78815l5650J32662j55225k64529p2972j775r6818M7598J74681L62126K64177
22972F33090j66642l50394q0231L0597j81635K26050J15631J10710j06275j38463
22962I2438k9101N00r2796n2662J31729J39182K40741O5035k16119j82070j83580
22951h6703k57014Q5268J04958K26602m6829J25832Q4835o0380l550j80682J32493
$$ plain form
22940 124830 211620 32658 -132888 -84542 25136 168833 37335 -25678 -98793 -140555
22930 -140555 -46316 -24979 -104867 -91453 -82831 -76571 -20340 24775 -8711 6534 71254 -185472
22918 -185472 -192712 -124812 -75617 -169884 -90831 18561 107574 70782 -9553 -54312 -85237
22907 -85237 24499 -150809 -139749 54337 35657 -66551 121713 185556 23222 -32127
22897 -32127 -31676 -180650 16780 173064 295901 209031 159921 144116 145822 -813 -150267
22886 -150267 -119435 -134072 -239128 -341605 -347879 -147359 -89038 -125136 -89296 17267 -83350
22875 -83350 -135648 -103883 -229762 -198770 -233425 -35566 49516 -23810 -150373 -120428 -125176
22864 -125176 -267059 -198432 -96281 -257846 -242775 -20385 123095 226717 403589 342219
$$ packed form
22940A24830Q6790j78962j65546M8346J09678J43697j31498o3013p3115m1762
22930a40555R4239K1337p9888J3414Q622O260N6231M5115l3486J5245O4720k56726
22918a85472p240O7900M9195r4267P9053J09392Q9013l6792q0335m4759l0925
22907h5237J09736j75308J1060J94086j8680j02208J88264O3843j62334n5349
22897c2127M51j48974J97430J56284J22837q6870m9110j5805J706j46635j49454
22886a50267L0832j4637j05056j02477o274K00520N8321l6098L5840J06563j00617
22875h3350n2298L1765j25879L0992l4655J97859Q5082p3326j26563K9945m748
22864a25176j41883O8627J02151j61565J5071K22390J43480J03622J76872o1370
$$ plain form
22854 342219 251026 55282 -32194 24296 -18977 -27963 -108893 -113291 -125770 -146325 -116061 35810
22842 35810 56781 67530 54519 -126495 -182276 -166540 -18528 -41353 -3534 25265 -125286
22831 -125286 -225716 -259196 -132486 -300890 -215531 -44040 -127336 -201617 -322487 -44774
22821 -44774 195921 199401 288439 344121 38606 -133325 -125175 -373727 -286130 -191364 55019
22810 55019 408266 360622 258405 332433 518989 439211 35797 -135126 34055 185641
22800 185641 359919 436767 534310 487068 525363 482121 233429 113738 113396 -72847 -207328
22789 -207328 -145728 -49808 68043 -15807 -79711 -19850 -60632 -105522 205896 134498 -55253
22778 -55253 -89366 -11201 65029 -30185 -277118 -381449 -340710 -253441 -83639 58218 127215
$$ packed form
22854C42219r1193j95744q7476N6490m3273q986q0930m398j2479k0555L0264J51871
22842C5810K0971J0749j3011j81014n5781J5736J48012k2825L7819K8799j50551
22831a25286j00430l3480J26710j68404Q5359J71491q3296p4281j20870K77713
22821d4774K40695L480Q9038N5682l05515j71931Q150k48552Q7597R4766K46383
22810E5019L53247m7644j02217P4028J86556p9778m03414j70923J69181J51586
22800A85641J74278P6848R7543m7242L8295m3242k48692j19691l42j86243j34481
22789b07328O1600R5920J17851q3850o3904N9861m0782m4890L11418p1398j89751
22778e5253l4113P8165P6230r5214k46933j04331M0739Q7269J69802J41857O8997
$$ plain form
22767 127215 158900 252164 282161 321553 318921 137077 280722 44239 -54144 -212879 -421602
22756 -421602 -284675 -300918 -104545 -136048 -256636 -356440 -278788 -248563 -183434 -283502 -236289
22745 -236289 -24030 139046 133388 45872 -89808 -64104 -140200 -165188 -187991 -72434 -54983
22734 -54983 -124779 -54120 -94595 -219817 -123383 -191380 -72117 44557 -213354 -279105 -229801
22723 -229801 -29504 -64741 -184300 -221276 -149901 -212019 -304051 -72157 135611 251830
22713 251830 123094 -36805 -42216 3333 123250 92951 -11075 17810 -226557 -161461 -92436
22702 -92436 -99628 32777 -55564 -73289 98961 180888 357199 344768 265552 286823 -91843
22691 -91843 -335676 -268865 -115978 28215 57791 212974 144117 93247 -27469 50737 234054
$$ packed form
22767A27215L1685R3264K9997L9392k632j81844J43645k36483r8383j58735k08723
22756d21602J36927j6243J96373l1503j20588r9804P7652L0225O5129j00068M7213
22745b36289K12259J63076n658q7516j35680K5704p6096k4988k2803J15557J7451
22734e4983o9796P0659m0475j25222R6434o7997J19263J16674k57911o5751M9304
22723b29801K00297l5237j19559l6976P1375o2118r2032K31894K07768J16219
22713B51830j28736j59899n411M5549J19917l0299j04026K8885k44367O5096O9025
22702i2436p192J32405q8341j7725J72250Q1927J76311j2431p9216K1271l78666
22691i1843k43833O6811J52887J44193K9576J55183o8857n0870j20716P8206J83317
$$ plain form
22680 234054 328358 79154 -162610 -96740 -123080 -212366 66383 215172 429798 178094
22670 178094 21627 55203 92283 -7390 -55999 -151076 -265737 -246212 113484 421913 188609
22659 188609 -87631 -53652 -117764 -245502 -140250 -58592 36229 -32009 -127830 -50137 183831
22648 183831 70324 177289 195406 91104 251080 527370 456854 346816 483360 439464
22638 439464 269148 340387 233437 122848 57028 8657 -12220 -94166 -104239 -26343 92384
22627 92384 224775 79932 93272 185993 213373 62671 -83978 -116465 -97449 -16667 145248
22616 145248 262054 333026 70838 -10210 264288 135738 11697 -27695 -7894 -41174
22606 -41174 -120229 -127245 -332735 -397436 -425312 -293997 -96399 267186 512571 395073 -35585
$$ packed form
22680B34054R4304k49204k41764O5870k6340q9286K78749J48789K14626k51704
22670A78094j56467L3576L7080r9673m8609r5077j14661J9525L59696L08429k33304
22659A88609k76240L3979o4112j27738J05252Q1658R4821o8238r5821P7693K33968
22648A83831j13507J06965J8117j04302J59976K76290p0516j10038J36544m3896
22638D39464j70316P1239j06950j10589o5820m8371k0877q1946j0073P7896J18727
22627I2384J32391j44843J3340R2721K7380j50702j46649l2487J9016Q0782J61915
22616A45248J16806P0972k62188q1048K74498j28550j24041l9392J9801l3280
22606d1174p9055p016k05490o4701k7876J31315J97598L63585K45385j17498m30658
$$ plain form
22595 -35585 -163849 -286800 -158414 -163713 -313312 -473928 -558298 -207238 31996 -105345
22585 -105345 -381086 -500399 -327394 -186899 -79759 -98884 -106543 -45991 55586 42230
22575 42230 106547 -95679 -329263 -339107 -232505 -207106 -64907 -116176 -68253 -57518 -56338
22564 -56338 -4614 724 -25019 -32779 -12326 -78998 -60199 -1969 32692 -132 -30386 78741
22552 78741 46279 240811 144036 5098 -108080 -42703 77535 28232 -102254 -95877 -140860
22541 -140860 52138 15783 -53361 -163063 -409060 -423046 -92883 226394 304660 149901
22531 149901 -5354 14085 172967 223027 434935 292948 36412 55185 138923 135622 47176
22520 47176 50030 128060 174142 141154 110713 153747 44250 138474 -59185 -13166 -93848
$$ packed form
22595c5585j28264j22951J28386n299j49599j60616q4370L51060K39234j37341
22585a05345k75741j19313J73005J40495J07140j9125p659O0552J01577j3356
22575D2230O4317k02226k33584r844J06602K5399J42199n1269M7923J0735J180
22564e6338N1724N338k5743p760K0453o6672J8799N8230L4661l2824l0254J09127
22552G8741l2462J94532r6775j38938j13178O5377J20238m9303j30486O377m4983
22541a40860J92998l6355o9144j09702k45997j3986L30163L19277P8266j54759
22531A49901j55255J9439J58882N0060K11908j41987k56536J8773Q3738l301q8446
22520D7176K854P8030M6082l2988l0441M3034j09497R4224j97659M6019q0682
$$ plain form
22509 -93848 -96171 -143173 3048 2413 -177138 -128586 151605 378291 195452 -41431 -41310
22498 -41310 200935 94655 -150301 -239507 -215356 -235710 -79261 14563 -66361 -62016 36497
22487 36497 78475 36600 49762 227007 224735 185793 122721 -75284 -234470 -182701 -204320
22476 -204320 -281958 -119567 -219351 -175366 23817 221647 75539 -124758 -147003 -74745
22466 -74745 39407 28155 115614 219486 26404 -194780 -196251 -161633 115146 176951 116494
22455 116494 -16668 -203412 -159904 -80120 -35855 -83670 -296417 -369060 -19862 413759
22445 413759 229591 179335 258364 33596 -259820 -258140 -108108 -11148 -34392 -144997 -259497
22434 -259497 -194581 -120816 -260391 -122858 150499 152082 91210 303985 438343 519349 515639
$$ packed form
22509i3848k323m7002J46221o35j79551M8552K80191K26686j82839k36883J21
22498d1310K42245j06280k44956q9206K4151k0354J56449R3824q0924M345R8513
22487C6497M1978m1875J3162J77245k272l8942o3072j98005j59186N1769k1619
22476b04320p7638J62391r9784M3985J99183J97830j46108k00297k2245P2258
22466g4745J14152j1252Q7459J03872j93082k21184j471L4618K76779O1805o0457
22455A16494j33162j86744M3508P9784M4265m7815k12747p2643L49198M33621
22445D13759j84168n0256P9029k24768k93416J680J50032R6960k3244j10605j14500
22434b59497O4916P3765j39575J37533K73357J583o0872K12775J34358Q1006l710
$$ plain form
22423 515639 402320 215967 194696 12789 -58662 38838 -131079 -201568 -13175 22619
22413 22619 -112391 -195320 -12691 53300 4233 -54654 -93399 87072 342126 330992 230958
22402 230958 200781 161965 -101989 -297671 -430203 -145020 -52133 -44524 -14693 108837 165435
22391 165435 54354 130366 54231 -14053 197568 192601 121397 -1027 11983 95988 139555
22380 139555 117143 -40969 -74177 -17334 -66304 -71405 90815 120143 36503 171215 91696
22369 91696 75615 -17466 -119098 -68112 23388 115796 82397 99817 59681 -140610 -34010
22358 -34010 -37981 -229658 -139422 136541 333154 369889 372671 287100 232373 176253 128088
22347 128088 92823 96083 -53869 -180682 -159827 65747 46859 -34735 -224388 -317021 -332510
$$ packed form
22423E15639j13319j86353k1271j81907p1451R7500j69917p0489J88393L5794
22413B2619j35010q2929J82629O5991m9067n8887l8745J80471K55054j1134j00034
22402B30958l0177l8816k63954j95682j32532K85183R2887P609K9831J23530N6598
22391A65435j11081P6012p6135o8284K11621m967p1204j22424J3010Q4005M3567
22380A39555k2412j58112l3208N6843m8970n101J62220K9328q3640J34712p9519
22369I1696j6081r3081j01632N0986R1500R2408l3399J7420m0136k00291J06600
22358c4010l971j91677R0236K75963J96613L6735K782q5571n4727n6120m8165
22347A28088l5265L260j49952j26813K0855K25574j8888q1594j89653r2633j5489
$$ plain form
22336 -332510 -297739 -168170 48621 200991 166972 52878 -58542 -28535 93783 19971
22326 19971 -150028 -8773 54622 42221 -11240 147205 232562 169820 6315 -27596 45010
22315 45010 80562 104399 95733 98172 114030 165370 154685 152123 336210 363567 414783 137675
22303 137675 -264162 -430812 -398316 -346967 12951 406188 334593 73060 -327521 -515749
22293 -515749 -399726 -138243 119422 9317 1706 25417 -57977 84939 107871 2450
22283 2450 60794 136814 104604 30805 250207 412763 374458 251059 -45046 -81522 9178
22272 9178 214057 197593 178669 307806 312792 111317 83183 121691 234090 227454 346903
22261 346903 352669 198480 155275 189281 378413 246710 162369 161930 232883 183274 200615
$$ packed form
22336c32510L4771J29569K16791J52370l4019j14094j11420L0007J22318p3812
22326A9971j69999J41255O3395j2401n3461J58445Q5357o2742j63505l3911P2606
22315D5010L5552K3837q666K439J5858N1340j0685k562J84087K7357N1216k77108
22303A37675m01837j66650L2496N1349L59918L93237p1595k61533m00581j88228
22293e15749J16023K61483K57665j10105p611K3711q3394J42916K2932j05421
22283B450N8344P6020l2210p3799K19402J62556l8305j23399k96105l6476R0700
22272I178K04879j6464j8924J29137M986k01475k8134L8508J12399o636J19449
22261C46903N766j54189m3205L4006J89132j31703q4341m39P0953m9609J7341
$$ plain form
22250 200615 422231 269121 -33200 -150012 -49025 59283 1935 -64536 57058 142763
22240 142763 109445 -72209 -46051 -64227 -4752 12595 163288 262953 451017 387945 297729
22229 297729 256806 372519 564840 505688 281738 232620 105021 22850 31855 112872 224144
22218 224144 237943 203713 167126 187045 35180 -11985 38223 3723 69347 -5922 1216
22207 1216 192858 216080 149979 16650 84580 136160 309379 167253 126461 76428 -39007
22196 -39007 65179 -45601 -232758 -60428 -53960 -47683 20123 160946 211554 229249 114648
22185 114648 96956 210452 160715 152133 361577 195401 18852 -5497 65943 -62731 -3152
22174 -3152 33294 68108 276781 468315 346110 226157 189292 211269 201769 269010 418412
$$ packed form
22250B00615K21616j53110l02321j16812J00987J08308n7348o6471J21594Q5705
22240A42763l3318j81654K6158j8176N9475J7347J50693R9665J88064o3072r0216
22229B97729m0923J15713J92321n9152k23950m9118j27599q2171R005Q1017J11272
22218B24144J3799l4230l6587J9919j51865m7165N0208l4500O5624p5269P138
22207A216J91642K3222o6101j33329O7930N1580J73219j42126m0792n0033j15435
22196c9007J04186j10780j87157J72330O468O277O7806J40823N0608J7695j14601
22185A14648j7692J13496m9737q582K09444j66176j76549k4349P1440j28674N9579
22174c152L6446L4814K08673J91534j22205j19953l6865K1977r500O7241J49402
$$ plain form
22163 418412 270286 -16641 -61479 42472 85090 11926 143407 97729 52227 -160772
22153 -160772 -265407 -202921 -31080 1855 -40653 46971 -163236 -232648 -304914 -221204 -92583
22142 -92583 -105801 48996 112280 -94785 -317769 -147754 196655 451518 570835 520104
22132 520104 491612 414338 389491 393009 323180 276503 110227 6712 -54833 -162908 -10522
22121 -10522 66506 11862 30298 17593 -74344 -28285 -15932 -84997 -178080 15690 7394 26116
22109 26116 -6344 141075 152704 -115439 -105230 90224 263047 175534 2168 -3885 -57257
22098 -57257 -23646 113174 21996 -53916 -17500 43151 -10708 6060 198685 367372 421005
22087 421005 331904 260008 369377 532692 450809 337697 414235 390581 492504 463303 498469
$$ packed form
22163D18412j48126k86927m4838J03951M2618p3164J31481m5678m5502k12999
22153a60772j04635O2486J71841L2935m2508Q7624k10207o9412p2266Q3710J28621
22142i2583j3218J54797O3284k07065k22984J70015L44409K54863J19317n0731
22132E20104k8492p7274k4847L518o9829m6677j66276j03515o1545j08075J52386
22121a0522P7028n4644J8436j2705r1937M6059J2353o9065r3083J93770q296J8722
22109B6116l2460J47419J1629k68143J0209J95454J72823q7513j73366o053n3372
22098e7257L3611J36820r1178p5912L6416O0651n3859J6768J92625J68687N3633
22087D21005q9101p1896J09369J63315q1883j13112P6538k3654J01923k9201L5166
$$ plain form
22076 498469 322036 191282 131027 388488 286080 161134 182549 305499 353480 359229
22066 359229 210648 199245 215467 250321 467637 327637 291200 375802 305410 206144 33080
22055 33080 147684 316795 196405 4872 -198691 -196192 -15383 308025 500830 492541
22045 492541 493034 406576 202302 270708 385054 542447 903739 1063170 1163846 891732
22035 891732 769755 835204 825773 699520 551105 591641 481375 507508 583598 732210 699552
22024 699552 627262 455075 501243 520270 447632 362809 553620 608002 639246 723171 624429
22013 624429 550945 401410 221711 187315 202408 253608 178266 249632 224498 293226 207400
22002 207400 197571 235246 431659 629799 728217 811216 733157 632313 513616 554642 510583
$$ packed form
22076D98469j76433j30754o0255K57461j02408j24946K1415J22950M7981N749
22066C59229j48581j1403J6222L4854K17316j40000l6437Q4602p0392r9266j73064
22055C3080J14604J69111j20390j91533k03563K499J80809L23408J92805q289
22045D92541M93q6458k04274O8406J14346J57393L61292J59431J00676k72114
22035H91732j21977O5449r431j26253j48415M0536j10266K6133P6090J48612l2658
22024F99552p2290j72187M6168J9027p2638q4823J90811N4382L1244Q3925r8742
22013F24429p3484j49535j79699l4396J5093N1200p5342P1366k5134O8728q5826
22002B07400r829L7675J96413J98140R8418Q2999p8059j00844j18697M1026m4059
$$ plain form
21991 510583 490857 580353 799572 870937 995408 953194 475390 267589 450291 440944 290597
21980 290597 87892 295236 525183 576188 452938 406513 482415 488802 525224 634461 836015
21969 836015 765987 671788 517197 507157 507833 632249 601671 307398 -16556 -157403 -19953
21958 -19953 139164 284096 250940 -18835 -176957 -220275 -151564 -15150 89666 -69663
21948 -69663 -74608 65767 259959 366178 327262 355733 292999 39600 -47899 31121 16038
21937 16038 -72916 -71268 71867 85711 20008 77106 81484 121559 291279 199353 82977
21926 82977 155572 173142 172318 78600 -18852 72332 212603 206075 201738 362366 354288 263273
21914 263273 265388 66985 52390 63193 -6425 34877 36159 71050 217840 377595 324537
$$ packed form
21991E10583j9726Q9496K19219P1365J24471m2214m77804k07801J82702r347j50347
21980B90597k02705K07344K29947N1005j23250m6425P5902O387L6422J09237K01554
21969H36015p0028r4199j54591j0040O76J24416l0578k94273l23954j40847J37450
21958a9953J59117J44932l3156k69775j58122m3318O8711J36414J04816j59329
21948f9663m945J40375J94192J06219l8916K8471o2734k53399q7499P9020j5083
21937A6038q8954J648J43135J3844o5703N7098M378M0075J69720r1926j16376
21926H2977P2595J7570q24r3718r7452R1184J40271o528m337J60628q078r1015
21914B63273K115j98403j4595J0803o9618M1302J282L4891J46790J59755n3058
$$ plain form
21903 324537 216602 286410 176647 97616 86745 125261 212355 60204 74750 169010 291297
21892 291297 200306 162536 163942 84478 307698 489501 423533 131402 43419 130450 -15224
21881 -15224 -54230 -82361 40038 22952 87467 304297 428037 399225 313428 388718 418119
21870 418119 321909 198332 245317 286573 306061 294075 294453 345859 383229 389108 547388 579306
21858 579306 366468 213903 159583 157627 118674 31079 122880 54942 6486 298752 440551
21847 440551 345196 197901 171848 125353 277090 238480 184659 333520 384319 377919 336901
21836 336901 195896 182157 211252 430934 589229 516397 365013 334765 203936 236401
21826 236401 340138 521272 535076 585095 423278 160895 163134 254579 406936 375511 211105
$$ packed form
21903C24537j07935O9808j09763p9031j0871L8516Q7094j52151J4546R4260J22287
21892B91297r0991l7770J406p9464K23220J81803o5968k92131q7983Q7031j45674
21881a5224l9006k8131J22399j7086O4515K16830J23740k8812q5797P5290K9401
21870D18119r6210j23577M6985M1256J9488j1986L78N1406L7370N879J58280L1918
21858E79306k12838j52565n4320j956l8953q7595R1801o7938m8456K92266J41799
21847D40551r5355j47295k6053m6495J51737l8610n3821J48861N0799o400m1018
21836C36901j41005j3739K9095K19682J58295p2832j51384l0248j30829L2465
21826B36401J03737J81134J3804N0019j61817k62383K239R1445J52357l1425j64406
$$ plain form
21815 211105 218366 262395 238989 -19682 -148385 -41902 235567 222302 256982 254859 332963
21804 332963 442592 412768 413385 300021 264522 368262 184780 7664 41458 237397 111980
21793 111980 65053 35548 131140 291671 355155 137802 118769 353536 427022 457769 315007
21782 315007 254499 206843 176710 149482 172564 223445 368921 225351 369404 321587 336383
21771 336383 364163 291954 246082 222528 310310 522436 453266 498660 404963 400398 337711
21760 337711 390491 331710 138101 134630 220525 307346 314289 475022 450276 232072 64683
21749 64683 172107 308898 384499 207154 420393 440227 158730 2909 7738 77298 299314
21738 299314 155232 86962 190821 185693 226419 261528 420432 448812 492114 551171 610653
$$ packed form
21815B11105P261M4029k3406k58671j28703J06483K77469j3265L4680k123P8104
21804C32963J09629k9824O17j13364l5499J03740j83482j77116L3794J95939j25417
21793A11980m6927k9505R5592J60531O3484k17353j9033K34767P3486L0747j42762
21782C15007o0508m7656l0133k7228K3082N0881J45476j43570J44053m7817J4796
21771C36383K7780p2209m5872k3554Q7782K12126o9170M5394r3697m565o2687
21760C37711N2780n8781j93609l471Q5895Q6821O943J60733k4746k18204j67389
21749F4683J07424J36791P5601j77345K13239J9834k81497j55821M829O9560K22016
21738B99314j44082o8270J03859n128M0726L5109J58904K8380M3302N9057N9482
$$ plain form
21727 610653 278125 225145 237317 381384 592321 629200 461785 318148 198361 162552
21717 162552 198560 78829 148190 217574 268364 378347 408269 348498 215026 169883 310340
21706 310340 286038 191737 56894 38793 23398 144650 209142 178227 55295 316176 370480
21695 370480 351697 266767 329592 253359 350986 469573 493019 679839 703458 731131 547462
21684 547462 558600 638393 488218 559392 590994 458064 400215 674913 806163 743403 692775
21673 692775 504595 326514 329401 385607 410047 422667 576118 607937 415391 347523 340339
21662 340339 281277 317133 456843 581516 599167 425063 392556 544302 587069 638936 776910
21651 776910 688429 462771 549311 673598 765232 723441 597631 655884 733316 686641 597526
$$ packed form
21727F10653l32528n2980J2172J44067K10937L6879j67415j43637j19787l5809
21717A62552L6008j19731O9361O9384N0790J09983K9922n9771j33472m5143J40457
21706C10340k4302r4301j34843j8101j5395J21252O4492l0915j22932K60881N4304
21695C70480j8783q4930O2825p6233R7627J18587K3446J86820K3619K7673j83669
21684E47462J1138P9793j50175P1174L1602j32930n7849K74698J31250o2760n0628
21673F92775j88180j78081K887N6206K4440J2620J53451L1819j92546o7868p184
21662C40339n9062L5856J39710J24673J7651j74104l2507J51746M2767N1867J37974
21651G76910q8481k25658Q6540J24287R1634m1791j25810N8253P7432m6675q9115
$$ plain form
21640 597526 513797 510937 579035 603958 647966 614502 668013 904071 875044 859329 982837
21629 982837 919480 817091 855091 929684 837031 917891 870249 873118 820741 746375 756736
21618 756736 702764 550926 580452 687835 840212 886189 848080 771659 920414 973142 822345
21607 822345 836477 663097 695619 716974 545765 497567 713892 783136 836832 985059 901367
21596 901367 886844 907302 945776 922891 981963 810636 737140 573512 545958 666712 775355
21585 775355 887439 977544 1117380 1128503 1120002 1161909 1178089 1274094 1164879 1112384 969423
21574 969423 788503 691788 646128 602041 735450 797348 872825 885749 838549 864882 793790
21563 793790 970150 1061297 1050145 1026153 1156426 1220203 1181052 1083647 1032590 1192861 1261879
$$ packed form
21640E97526q3729k860O8098K4923M4008l3464N3511K36058k9027j5715J23508
21629I82837o3357j02389L8000P4593r2653Q0860m7642K869n2377p4366J0361
21618G56736n3972j51838K9526J07383J52377M5977l8109p6421J48755N2728j50797
21607H22345J4132j73380L2522K1355j71209m8198K16325O9244N3696J48227q3692
21596I01367j4523K0458L8474k2885N9072j71327p3496j63628k7554J20754J08643
21585G75355J12084R0105J39836J1123q501M1907J6180R6005j09215n2495j42961
21574I69423j80920r6715m5660m4087J33409O1898P5477J2924m7200K6333p1092
21563G93790J76360R1147j1152k3992J30273O3777l9151r7405n1057J60271O9018
$$ plain form
21552 1261879 1139851 1091100 1153945 1078860 994090 980940 963001 1138811 1279803 1332576 1279060
21541 1279060 1086545 1215582 1159546 1014322 1000398 1203963 1438101 1430046 1430764 1580949 1597241
21530 1597241 1470927 1403000 1318727 1294556 1122205 1118522 1113792 1125965 1418069 1582474 1558570
21519 1558570 1464455 1359667 1405640 1510586 1391098 1265252 1017299 1100722 1378067 1536326
21509 1536326 1840225 1861040 1900678 2030367 1820209 1811254 1959240 2053194 2205423 2146924
21499 2146924 2320968 2464332 2447482 2483713 2521251 2618124 2591906 2580333 2756338 2854414 2767041
21488 2767041 2957778 2957224 2880124 2910128 2798648 2871973 2989724 2946803 3093168 3360436 3483689
21477 3483689 3805632 4094550 4009778 4097107 4321252 4413920 4442769 4714350 4783500 4951028
$$ packed form
21552A261879j22028m8751O2845p5085q4770j3150j7939J75810J40992N2773n3516
21541A279060j92515J29037n6036j45224j3924K03565K34138q055P18J50185J6292
21530A597241j26314o7927q4273k4171j72351l683m730J2173K92104J64405k3904
21519A558570r4115j04788M5973J04946j19488j25846k47953Q3423K77345J58259
21509A536326L03899K0815L9638J29689k10158q955J47986R3954J52229n8499
21499B146924J74044J43364j6850L6231L7538R6873k6218j1573J76005R8076q7373
21488B767041J90737n54p7100L0004j11480P3325J17751m2921J46365K67268J23253
21477C483689L21943K88918q4772Q7329K24145R2668K8849K71581O9150J67528
$$ plain form
21467 4951028 5154967 5457504 5705355 5881531 6145972 6430110 6691175 6853177 7163920
21458 7163920 7718707 8447109 9110143 9762419 10644812 11425188 12057462 13062117 14426343
21449 14426343 15976685 17867901 20254566 23441447 27823875 34212509 43544831 56179562
21441 56179562 69496751 79141489 84029785 88083600 93392589 100275536 109376805 121145131
21433 121145131 132650951 139622329 139222582 133396731 125279982 115990672 107675165 101789879
21425 101789879 96674881 89147362 80622591 72509589 63431713 51915861 40152494 31339851
21417 31339851 25670886 22089192 19498071 17726002 16623988 15943154 15469824 15382732 15196220
21408 15196220 15225729 15767120 16476704 17601911 19167117 21221810 24272153 28628943 35198623
$$ packed form
21467D951028K03939L02537K47851J76176K64441K84138K61065J62002L10743
21458G163920N54787P28402O63034O52276Q82393P80376O32274J004655J364226
21449A4426343J550342J891216K386665L186881M382428O388634R332322J2634731
21441E6179562J3317189R644738M888296M053815N308989O882947R101269J1768326
21433A21145131J1505820O971378l99747n825851q116749r289310q315507n885286
21425A01789879n114998p527519q524771q113002r077876j1515852j1763367q812643
21417C1339851n668965l581694k591121j772069j102014o80834m73330q7092j86512
21408A5196220K9509N41391P09584J125207J565206K054693L050343M356790O569680
$$ plain form
21399 35198623 45095320 58574273 73008612 82607124 87323392 91838633 97339751 104444715
21391 104444715 114405767 126764572 136723156 141176219 139490794 133113361 123874139 112835219
21383 112835219 103568917 97614833 92235002 84338823 75628983 67176944 57242941 45089441
21375 45089441 33292160 24286887 18540831 14666373 12026793 9792658 8069947 6827817
21367 6827817 5918745 5002492 4339790 3747710 3001625 2573481 2291645 1991954 1571725
21358 1571725 1229897 980751 937571 768800 547158 521505 249706 114421 14154 -382700
21348 -382700 -490104 -409911 -437943 -468246 -503383 -546107 -652392 -548572 -381223 -441361 -539459
21337 -539459 -697055 -783122 -783650 -742765 -848576 -958460 -1071684 -1019686 -1142184 -1249389 -1276252
$$ packed form
21399C5198623R896697J3478953J4434339R598512M716268M515241N501118P104964
21391A04444715R961052J2358805R958584M453063j685425o377433r239222j1038920
21383A12835219r266302n954084n379831p896179q709840q452039r934003j2153500
21375D5089441j1797281r005273n746056l874458k639580k234135j722711j242130
21367F827817r09072r16253o62702n92080p46085m28144k81836k99691m20229
21358A571725l41828k49146m3180j68771k21642k5653k71799j35285j00267l96854
21348c82700j07404Q0193k8032l0303l5137m2724j06285J03820J67349o0138r8098
21337e39459j57596q6067n28M0885j05811j09884j13224N1998j22498j07205k6863
$$ plain form
21326 -1276252 -1219121 -1200617 -1020876 -977340 -1053554 -1186169 -1224556 -1222601 -1334201 -1350704 -1220586
21315 -1220586 -1349844 -1338823 -1241152 -1188694 -1146195 -1217589 -1260126 -1223720 -1143911 -1074311 -853147
21304 -853147 -770266 -697164 -834170 -847541 -1082893 -1278012 -1392867 -1355452 -1257238 -1056867
21294 -1056867 -962907 -599716 -601691 -884297 -992789 -1032852 -1203881 -1096158 -1018582 -1142615
21284 -1142615 -1209520 -1228905 -1216854 -1220658 -1003954 -868994 -949469 -993702 -997211 -998629 -1200623
21273 -1200623 -1274537 -1152032 -1042694 -929711 -1044482 -1161297 -1063224 -1095687 -980771 -945529
21263 -945529 -859989 -761087 -820283 -798828 -789255 -854871 -927306 -930651 -967530 -925628 -833045 -1069338
21251 -1069338 -1193104 -976994 -800818 -812449 -927855 -974375 -996820 -1083930 -1143626 -984938
$$ packed form
21326a276252N7131J8504J79741M3536p6214j32615l8387J955j11600j6503J30118
21315a220586j29258J1021R7671N2458M2499p1394m2537L6406P9809O9600K21164
21304h53147Q2881P3102j37006j3371k35352j95119j14855L7415R8214K00371
21294a056867R3960L63191j975k82606j08492m0063j71029J07723P7576j24033
21284a142615o6905j9385J2051l804K16704J34960q0475m4233l509j418k01994
21273a200623p3914J22505J09338J12983j14771j16815R8073l2463J14916L5242
21263i45529Q5540R8902n9196K1455R573o5616p2435l345l6879M1902R2583k36293
21251a069338j23766K16110J76176j1631j15406m6520k2445q7110n9696J58688
$$ plain form
21241 -984938 -807352 -650880 -682886 -936173 -1032319 -832751 -787591 -829550 -772525 -877945
21231 -877945 -792843 -455198 -446413 -745145 -896094 -886583 -985303 -1067069 -1094116 -993326 -619338
21220 -619338 -377245 -400175 -514147 -672088 -909760 -930365 -803030 -592605 -640341 -745284
21210 -745284 -737189 -840387 -760249 -921004 -813284 -607373 -658361 -756361 -916770 -1019767
21200 -1019767 -886394 -926000 -847780 -656417 -561986 -594888 -689816 -600028 -566431 -330896 -419090
21189 -419090 -653130 -748849 -765674 -795852 -789484 -686124 -712632 -800535 -783031 -643498 -684810
21178 -684810 -616255 -447560 -589677 -565411 -578774 -561407 -725376 -821286 -589182 -467660
21168 -467660 -374102 -692676 -800088 -876687 -904653 -1058556 -928792 -724656 -683403 -837112
$$ packed form
21241i84938J77586J56472l2006k53287r6146J99568M5160m1959N7025j05420
21231h77945Q5102L37645Q785k98732j50949R511r8720q1766k7047J00790L73988
21220f19338K42093k2930j13972j57941k37672k0605J27335K10425m7736j04943
21210g45284Q095j03198Q0138j60755J07720K05911n0988r8000j60409j02997
21200a019767J33373l9606P8220J91363R4431l2902r4928Q9788L3597K35535q8194
21189d19090k34040r5719j6825l0178O368J03360k6508q7903J7504J39533m1312
21178f84810O8555J68695j42117K4266j3363J7367j63969r5910K32104J21522
21168d67660R3558l18574j07412p6599k7966j53903J29764K04136M1253j53709
$$ plain form
21158 -837112 -904251 -765851 -636347 -514129 -579764 -590699 -591558 -691542 -856775 -792136 -743764
21147 -743764 -880907 -855152 -684206 -523748 -469893 -264859 -358435 -593011 -707251 -667709
21137 -667709 -783159 -729905 -635961 -480987 -309069 -358976 -466717 -578366 -690061 -687591
21127 -687591 -606467 -565803 -702259 -667714 -446697 -267765 -269284 -398487 -455745 -611721 -633305
21116 -633305 -708961 -880215 -947284 -1028220 -1112123 -781944 -833664 -815540 -485168 -585226 -672312
21105 -672312 -779820 -758641 -659704 -644230 -663657 -741916 -725126 -683862 -972805 -1089287 -937042
21094 -937042 -804270 -687285 -621319 -615095 -484051 -175799 -122446 -293758 -383606 -556025
21084 -556025 -634728 -589006 -614891 -712644 -573753 -518607 -601819 -787463 -756442 -591117 -389366
$$ packed form
21158h37112o7139J38400J29504J22218o5635j0935q59r9984j65233O4639M8372
21147g43764j37143K5755J70946J60458N3855K05034r3576k34576j14240L9542
21137f67709j15450N3254R3944J54974J71918m9907j07741j11649j11695K470
21127f87591Q1124M0664j36456L4545K21017J78932j519j29203n7258j55976k1584
21116f33305p5656j71254o7069q0936q3903L30179n1720J8124L30372j00058q7086
21105f72312j07508K1179R8937J5474j9427p8259J6790M1264k88943j16482J52245
21094i37042J32772J16985O5966O224J31044L08252N3353j71312q9848j72419
21084e56025p8703M5722k5885r7753J38891N5146q3212j85644L1021J65325K01751
$$ plain form
21073 -389366 -400492 -418062 -589476 -596758 -581882 -383025 -367892 -390374 -592160 -741820 -749461
21062 -749461 -792347 -718323 -720856 -866358 -1058398 -764947 -630856 -653088 -823543 -786314 -854534
21051 -854534 -862213 -535624 -545355 -823647 -823225 -684666 -854799 -908238 -866052 -788550 -648812
21040 -648812 -653180 -666200 -632304 -578897 -622116 -415690 -362838 -446121 -580509 -519613 -426250
21029 -426250 -381545 -636786 -800036 -861351 -626867 -444783 -329200 -293627 -376330 -284849
21019 -284849 -351377 -355464 -376196 -305908 -427946 -375866 -292662 -313106 -361548 -397113 -514814
21008 -514814 -593790 -678850 -621665 -468187 -402848 -550504 -488617 -410256 -391521 -545901 -495162
20997 -495162 -539298 -516096 -547584 -445486 -519487 -560398 -664724 -558677 -436517 -535839 -670561
$$ packed form
21073c89366j1126j7570j71414p282J4876J98857J5133k2482k01786j49660p641
21062g49461m2886P4024k533j45502j92040K93451J34091k2232j70455L7229o8220
21051h54534p679L26589r731k78292M22J38559j70133n3439M2186P7502J39738
21040f48812m368j3020L3896N3407m3219K06426N2852q3283j34388O0896R3363
21029d26250M4705k55241j63250o1315K34484J82084J15583L5573q2703R1481
21019b84849o6528m087k0732P0288j22038N2080Q3204k0444m8442l5565j17701
21008e14814p8976q5060N7185J53478O5339j47656O1887P8361J8735j54380N0739
20997d95162m4136K3202l1488J02098p4001m0911j04326J06047J22160r9322j34722
$$ plain form
20986 -670561 -699762 -699793 -788854 -578988 -371892 -338514 -710245 -822098 -705413 -606353 -484718
20975 -484718 -598391 -596520 -612104 -838640 -969015 -841247 -663297 -478604 -386462 -534281
20965 -534281 -647631 -537462 -410874 -383346 -272092 -285168 -507754 -606056 -588738 -422507
20955 -422507 -250659 -248045 -486652 -680964 -625151 -468325 -361145 -580401 -687813 -779219
20945 -779219 -859876 -706911 -617226 -605486 -583767 -547598 -633448 -612640 -684535 -675419 -478861
20934 -478861 -606004 -574141 -618037 -808819 -768483 -482402 -537156 -601548 -543458 -505213 -463336
20923 -463336 -389620 -317470 -181646 -211256 -313657 -455193 -668367 -688055 -698139 -595465
20913 -595465 -327504 -422686 -459789 -545640 -579529 -734087 -608730 -533305 -422819 -357080 -591525
$$ packed form
20986f70561k9201l1q9061K09866K07096L3378l71731j11853J16685R9060J21635
20975d84718j13673J871j5584k26536j30375J27768J77950J84693R2142j47819
20965e34281j13350J10169J26588K7528J11254j3076k22586r8302J7318J66231
20955d22507J71848K614k38607j94312N5813J56826J07180k19256j07412r1406
20945g79219q0657J52965Q9685J1740K1719L6169q5850K0808p1895R116J96558
20934d78861j27143L1863m3896j90782M0336K86081n4754o4392N8090L8245M1877
20923d63336P3716P2150J35824k9610j02401j41536k13174j9688j0084J02674
20913e95465K67961r5182l7103q5851l3889j54558J25357P5425J10486O5739k34445
$$ plain form
20902 -591525 -521350 -397556 -511874 -549894 -582202 -389177 -250931 -296067 -157741 -260735
20892 -260735 -416871 -295802 -227526 -331200 -460727 -488700 -444655 -542502 -414449 -332933
20882 -332933 -359312 -422717 -455337 -459601 -327494 -456413 -696446 -758109 -790477 -658954 -667943
20871 -667943 -454212 -260505 -272609 -348285 -410819 -361928 -270114 -394522 -386899 -538428 -506645
20860 -506645 -499683 -585397 -758385 -633904 -463641 -386795 -391539 -570198 -607319 -548385 -384601
20849 -384601 -310166 -182476 -255206 -342072 -408600 -318007 -296894 -265210 -188562 -122075 -59713
20838 -59713 12301 -58656 -192522 -166702 -241923 -289889 71752 341905 380298 387855 386479
20827 386479 288707 262286 352208 318065 310390 256722 271289 192032 -12117 -116889 -194471
$$ packed form
20902e91525P0175J23794j14318l8020l2308J93025J38246m5136J38326j02994
20892b60735j56136J21069O8276j03674j29527k7973M4045r7847J28053Q1516
20882c32933k6379o3405l2620m264J32107j28919k40033o1663l2368J31523q989
20871f67943K13731J93707j2104p5676o2534M8891R1814j24408P623j51529L1783
20860e06645O962q5714j72988J24481J70263P6846m744j78659l7121N8934J63784
20849c84601P4435J27690p2730q6866o6528R0593K1113L1684P6648O6487O2362
20838e9713P2014p0957j33866K5820p5221m7966L61641K70153L8393P557j376
20827C86479r7772k6421Q9922l4143p675n3668J4567p9257k04149j04772p7582
$$ plain form
20816 -194471 -321195 -262077 -239047 -125693 -128191 -94441 -60044 -46552 34014 -123831 -414943
20805 -414943 -562388 -387250 -428096 -431944 -215154 -142107 -214924 -402285 -532638 -573719 -423701
20794 -423701 -220393 -257789 -244036 -154940 11619 -136725 -360300 -393593 -167095 171844
20784 171844 390407 576392 763719 499571 274779 104539 72104 106617 12075 187007
20774 187007 311984 263865 163992 -180739 -424488 -510443 -481215 -260597 -133890 -84524
20764 -84524 -297928 -289963 -391001 -462164 -394749 -303594 -260538 -309561 -391903 -431328 -504042
20753 -504042 -423804 -487202 -346059 -477924 -458109 -429879 -380829 -223167 -246287 -301318 -367848
20742 -367848 -459735 -475999 -412646 -251071 -355594 -360635 -235907 -298612 -348212 -300607 -322263
$$ packed form
20816a94471j26724N9118K3030J13354k498L3750L4397J3492Q0566j57845k91112
20805d14943j47445J75138m0846l848K16790P3047p2817j87361j30353m1081J50018
20794d23701K03308l7396J3753Q9096J66559j48344k23575l3293K26498L38939
20784A71844K18563J85985J87327k64148k24792j70240l2435L4513r4542J74932
20774A87007J24977m8119r9873l44731k43749q5955K9228K20618J26707M9366
20764h4524k13404P965j01038p1163O7415R1155M3056m9023q2342l9425p2714
20753e04042Q0238o3398J41143j31865J9815K8230M9050J57662k3120n5031o6530
20742c67848r1887j6264O3353J61575j04523n041J24728o2705m9600M7605k1656
$$ plain form
20731 -322263 -443777 -726346 -598802 -309124 -118066 -425887 -596608 -334413 -277937 -403038
20721 -403038 -558029 -622491 -573088 -474022 -494180 -471385 -441822 -430366 -375401 -388948 -516975
20710 -516975 -638681 -426971 -284074 -233750 -142680 -244858 -186319 -250502 -472305 -611334
20700 -611334 -562148 -508090 -603024 -698077 -800052 -709834 -742867 -767655 -614107 -529382 -514487
20689 -514487 -403663 -262089 -99570 42956 -153805 -342587 -316359 -218351 -229101 -335066
20679 -335066 -523719 -536842 -460777 -500958 -451865 -286295 -286617 -357567 -154191 -140193 -426139
20668 -426139 -352206 -277280 -243886 -333140 -494461 -709331 -541407 -406985 -604398 -633886
20658 -633886 -452783 -318984 -324907 -242868 -275069 -299554 -628840 -843045 -841309 -840905 -805346
$$ packed form
20731c22263j21514k82569J27544K89678J91058l07821j70721K62195N6476j25101
20721d03038j54991o4462M9403R9066k0158K2795K9563J1456N4965j3547j28027
20710e16975j21706K11710J42897N0324R1070j02178N8539o4183k21803j39029
20700f11334M9186N4058r4934r5053j01975R0218l3033k4788J53548Q4725J4895
20689e14487J10824J41574J62519J42526j96761j88782K6228R8008j0750j05965
20679c35066j88653j3123P6065m0181M9093J65570l22p0950K03376J3998k85946
20668d26139P3933P4926L3394q9254j61321k14870J67924J34422j97413k9488
20658f33886J81103J33799n923Q2039l2201k4485l29286k14205J736M04L5559
$$ plain form
20647 -805346 -626653 -383992 -198959 -355458 -609615 -795952 -603404 -409971 -434570 -461231
20637 -461231 -472245 -344189 -307152 -380028 -638721 -843406 -707882 -427065 -504786 -449310
20627 -449310 -404779 -457666 -558754 -630173 -778300 -827324 -595186 -498285 -486246 -470093 -712213
20616 -712213 -732762 -537345 -414510 -368488 -257988 -289890 -140101 -244904 -287403 -169185
20606 -169185 -142125 -183408 -312112 -268453 -97436 -148106 -211023 -217472 -324066 -367378 -499981
20595 -499981 -674270 -547969 -358616 -255681 -367041 -467508 -509882 -388859 -385180 -423282
20585 -423282 -607812 -677073 -551671 -450774 -489692 -443722 -443711 -530234 -403287 -544461 -755799
20574 -755799 -862184 -845579 -738780 -490945 -297886 -312832 -242815 -384448 -392676 -333094 -412113
$$ packed form
20647h05346J78693K42661J85033j56499k54157j86337J92548J93433k4599k6661
20637d61231j1014J28056L7037p2876k58693k04685J35524K80817p7721N5476
20627d49310M4531n2887j01088p1419j48127m9024K32138R6901J2039J6153k42120
20616g12213k0549J95417J22835M6022J10500l1902J49789j04803m2499J18218
20606a69185K7060m1283j28704M3659J71017n0670o2917o449j06594m3312j32603
20595d99981j74289J26301J89353J02935j11360j00467m2374J21023L679l8102
20585d23282j84530o9261J25402J00897l8918M5970J1q6523J26947j41174k11338
20574g55799j06385J6605J06799K47835J93059j4946P0017j41633q228N9582p9019
$$ plain form
20563 -412113 -579313 -544349 -523465 -484345 -385319 -367502 -558354 -603661 -563009 -617059 -638012
20552 -638012 -507443 -460007 -478779 -340559 -350467 -458549 -386593 -425446 -553420 -477773 -234516
20541 -234516 -366099 -409909 -183679 -97673 -259628 -274786 -308938 -216448 -305580 -395193 -404214
20530 -404214 -635968 -824339 -724318 -539448 -485591 -512036 -488307 -396306 -577227 -752401
20520 -752401 -654744 -579063 -680923 -664385 -725732 -827755 -695736 -540113 -487667 -454537 -584293
20509 -584293 -493909 -471635 -558590 -565676 -416885 -429937 -387920 -468476 -446458 -401087 -232131
20498 -232131 -315104 -558745 -492931 -547150 -652561 -818350 -825683 -530740 -462100 -325392 -365516
20487 -365516 -527847 -688379 -717823 -547724 -518992 -589598 -654637 -453484 -340753 -500835
$$ packed form
20563d12113j67200L4964K0884L9120R9026J7817j90852m5307M0652n4050k0953
20552f38012J30569M7436j8772J38220r908j08082P1956l8853j27974P5647K43257
20541b34516j31583m3810K26230Q6006j61955j5158l4152R2490q9132q9613r021
20530d04214k31754j88371J00021J84870N3857k6445K3729R2001j80921j75174
20520g52401R7657P5681j01860J6538o1347j02023J32019J55623N2446L3130j29756
20509e84293R0384K2274q6955p086J48791j3052M2017q0556K2018M5371J68956
20498b32131q2973k43641O5814n4219j05411j65789p333K94943O8640J36708m0124
20487c65516j62331j60532k9444J70099K8732p0606o5039K01153J12731j60082
$$ plain form
20477 -500835 -488256 -523030 -551606 -549694 -475629 -449562 -241304 82958 110189 -333786 -485952
20466 -485952 -430455 -277050 -200921 128479 96689 31944 -21683 -241796 -568804 -449930
20456 -449930 -216177 -161332 -167866 -316896 -350601 -262167 -296039 -539762 -683322 -549207 -399341
20445 -399341 -448574 -596769 -547662 -417211 -479024 -498680 -418942 -339428 -356115 -247808 -206460
20434 -206460 -234401 -246186 -354622 -353792 -320233 -214659 -255936 -150517 -287100 -432030 -466702
20423 -466702 -250826 -314971 -386684 -419290 -322333 -200002 -399794 -224844 -229893 -299639 -336842
20412 -336842 -221913 -195860 -220985 -342115 -246776 45423 28750 -211415 -338002 -404821
20402 -404821 -208227 128630 113407 46431 20477 45461 -44685 -289865 -328075 -235961 -434803
$$ packed form
20477e00835J2579l4774k8576J912P4065K6067K08258L24262K7231m43975j52166
20466d85952N5497J53405P6129L29400l1790o4745n3627k20113l27008J18874
20456d49930K33753N4845o534j49030l3705Q8434l3872k43723j43560J34115J49866
20445c99341m9233j48195M9107J30451o1813j9656P9738P9514j6687J08307M1348
20434b06460k7941j1785j08436Q30L3559J05574m1277J05419j36583j44930l4672
20423d66702K15876o4145p1713l2606R6957J22331j99792J74950n049o9746l7203
20412c36842J14929K6053k5125j21130R5339K92199j6673k40165j26587o6819
20402d04821J96594L36857j5223o6976k5954K4984r0146k45180l8210R2114j98842
$$ plain form
20391 -434803 -370917 -170283 6972 30707 -226625 -335860 -144023 -236298 -325844 -225426
20381 -225426 -430891 -630300 -706817 -865865 -967691 -766032 -647244 -700421 -629719 -383708
20371 -383708 -426225 -422408 -109993 -116784 10461 -13340 -123906 -80481 -283742 -435504 -515621
20360 -515621 -518463 -413382 -48194 93782 -32490 -69163 -108553 -196348 -176148 -175804 -211401
20349 -211401 -212815 -200433 -116522 -190030 -381719 -467979 -507992 -548408 -629944 -754772 -683989
20338 -683989 -806034 -682811 -442356 -453502 -463069 -344558 -436213 -475401 -536161 -600951 -574713
20327 -574713 -439216 -271781 -309970 -573347 -811824 -694552 -635966 -654109 -556084 -219986
20317 -219986 -234821 -299520 -376682 -478161 -294692 -257027 -317776 -288818 -323739 -290236 -345048
$$ packed form
20391d34803O3886K00634J77255K3735k57332j09235J91837r2275q9546J00418
20381b25426k05465j99409p6517j59048j01826K01659J18788n3177P0702K46011
20371c83708m2517L817L12415o791J27245k3801j10566M3425k03261j51762q0117
20360e15621k842J05081L65188J41976j26272l6673l9390q7795K0200L44l5597
20349b11401j414J2382Q3911p3508j91689q6260m0013m0416q1536j24828P0783
20338f83989j22045J23223K40455j1146r567J18511r1655l9188o0760o4790K6238
20327e74713J35497J67435l8189k63377k38477J17272N8586j8143R8025L36098
20317b19986j4835o4699p7162j01479J83469L7665o0749K8958l4921L3503n4812
$$ plain form
20306 -345048 -428469 -462081 -342296 -325310 -465789 -539622 -264645 -322904 -153714 772
20296 772 -145863 -146916 -89371 -120067 -223867 -234583 -343146 -311420 -2847 -96517 -191480
20285 -191480 -270535 -270178 -286775 -337768 -469345 -320882 -230237 -416226 -488511 -439158 -460034
20274 -460034 -372265 -499949 -441654 -454141 -443221 -581671 -566613 -327820 -421814 -633844 -587534
20263 -587534 -542852 -643044 -436339 -332164 -614853 -801150 -600860 -446148 -464388 -476700
20253 -476700 -507865 -300746 -147735 -183664 -412675 -726791 -718987 -345378 -43662 125709
20243 125709 -101196 -360033 -286850 -271201 -203497 -321999 -492223 -296745 -179815 -114741
20233 -114741 -272383 -325370 -326662 -326177 -499669 -622134 -558516 -350627 -78159 -181005 -251485
$$ packed form
20306c45048q3421l3612J19785J6986j40479p3833K74977n8259J69190J54486
20296G72j46635j053N7545l0696j03800j0716j08563L1726L08573r3670r4963
20285a91480p9055L57j6597n0993j31577J48463R0645j85989p2285M9353k0876
20274d60034Q7769j27684N8295j2487J0920j38450J5058K38793r3994k12030M6310
20263e87534M4682j00192K06705J04175k82689j86297K00290J54712j8240j2312
20253d76700l1165K07119J53011l5929k29011l14116P804L73609L01716J69371
20243A25709k26905k58837P3183J5649O7704j18502j70224J95478J16930O5074
20233a14741j57642n2987j292M85j73492j22465O3618K07889K72468j02846p0480
$$ plain form
20222 -251485 -242580 -332883 -349334 -219278 -220739 -160764 -380405 -314247 -320094 -307351 -175444
20211 -175444 -70060 -231839 -362109 -284176 -274829 -281578 -165916 -391959 -525395 -546708 -444907
20200 -444907 -479455 -508618 -578733 -425253 -416626 -223250 -61437 -69420 -109921 -37183 -52905
20189 -52905 94299 101214 156830 365724 489944 500860 409498 557753 949173 1213712 1376505
20178 1376505 1613435 1788443 1920698 2109248 2446668 2656202 2650366 2302798 1880964 1497680
20168 1497680 898859 569326 295831 226213 23292 -81509 -74059 -55516 -221581 -304748
20158 -304748 -147643 -142524 -128102 -306156 -258555 -223325 -146667 -34875 -74901 -4772 -53800
20147 -53800 70115 153094 408991 329777 298802 229562 383825 511944 685109 827818
$$ packed form
20222b51485Q905r0303j6451J30056j461N9975k19641O6158n847J2743J31907
20211a75444J05384j61779j30270P7933R347o749J15662k26043j33436k1313J01801
20200d44907l4548k9163p0115J53480Q627J93376J61813p983m0501P2738j5722
20189e2905J47204O915N5616K08894J24220J0916r1362J48255L91420K64539J62793
20178A376505K36930J75008J32255J88550L37420K09534n836l47568m21834l83284
20168A497680n98821l29533k73495o9618k02921j04801P450J8543j66065q3167
20158c04748J57105N119J4422j78054M7601L5230P6658J11792m0026P0129m9028
20147e3800J23915Q2979K55897p9214l0975o9240J54263J28119J73165J42709
$$ plain form
20137 827818 683524 626235 686515 715556 569887 325002 200088 116404 290837 275642
20127 275642 352587 619724 577281 125118 -255398 -407290 -362947 -292261 -327686 -635682
20117 -635682 -683493 -572485 -540622 -636910 -675508 -688637 -679011 -516192 -224805 -251399 -147471
20106 -147471 -262833 -622387 -647159 -552663 -518049 -449191 -314183 -273433 -50581 -62238 -115938
20095 -115938 -203048 -215424 -380970 -487082 -278934 -169191 -320080 -320711 -245164 -289661 -219408
20084 -219408 -474164 -376557 -228565 -267058 -410198 -549632 -437419 -455379 -480237 -315963
20074 -315963 -407497 -502758 -546751 -519974 -613634 -816646 -694234 -506976 -368060 -296604 -187267
20063 -187267 -405042 -341861 -222747 -292786 -381822 -514321 -460151 -394305 -419449 -363956 -361267
$$ packed form
20137H27818j44294n7289O0280K9041j45669k44885j24914q3684J74433j5195
20127B75642P6945K67137m2443m52163l80516j51892M4343P0686l5425l07996
20117f35682m7811J11008L1863r6288l8598j3129R626J62819K91387k6594J03928
20106a47471j15362l59554k4772R4496L4614O8858J35008M0750K22852j1657n3700
20095a15938q7110j2376j65546j06112K08148J09743j50889o31P5547m4497P0253
20084b19408k54756R7607J47992l8493j43140j39434J12213j7960k4858J64274
20074c15963r1534r5261m3993K6777r3660k03012J22412J87258J38916P1456J09337
20063a87267k17775O3181J19114p0039q9036j32499N4170O5846k5144N5493K689
$$ plain form
20052 -361267 -407380 -373861 -254653 -226598 -282452 -372171 -444363 -295948 -476905 -527634 -398892
20041 -398892 -443943 -419074 -477291 -698028 -697922 -654211 -490938 -396264 -354166 -382003 -391261 -417266
20029 -417266 -573936 -752222 -760008 -747509 -845561 -920797 -815543 -517177 -508589 -535484 -377360
20018 -377360 -398049 -288012 -73245 -100676 -414329 -357610 -70065 -70364 -279321 -247141 -284146
20007 -284146 -382531 -369085 -216347 -268631 -473845 -498479 -382286 -404584 -430822 -441783 -496726
19996 -496726 -629304 -559543 -495943 -480147 -426098 -457814 -526039 -430185 -537312 -732936 -542375
19985 -542375 -229066 -101767 -265973 -506911 -595124 -627766 -559365 -578451 -491924 -245075
19975 -245075 -188529 -331075 -386265 -197728 -226531 -228117 -249567 -377746 -148065 -155385 -290855
$$ packed form
20052c61267m6113L3519J19208K8055n5854q9719p2192J48415j80957n0729J28742
20041c98892m5051K4869n8217k20737J06M3711J63273R4674M2098k7837r258k6005
20029d17266j56670j78286p786J2499r8052p5236J05254K98366Q588k6895J58124
20018c77360k0689J10037K14767k7431l13653N6719K87545k99k08957L2180l7005
20007b84146r8385J3446J52738n2284k05214k4634J16193k2298k6238j0961n4943
19996d96726j32578O9761O3600J5796N4049l1716o8225R5854j07127j95624J90561
19985e42375L13309J27299j64206k40938q8213l2642O8401j9086Q6527K46849
19975b45075N6546j42546n5190J88537k8803j586k1450j28179K29681p320j35470
$$ plain form
19964 -290855 -111212 -2880 26899 63017 63741 -20414 -436494 -610476 -551393 -449008 -284345
19953 -284345 -77419 -285222 -317393 -257958 -260907 -280510 -195964 -208705 -267774 -304113 -330615
19942 -330615 -371329 -247709 -326988 -524044 -454580 -337845 -276816 -290608 -300404 -250889 -102706
19931 -102706 -39409 143160 223755 -52555 -154963 -190256 -384239 -408387 -449478 -361464 -256295
19920 -256295 15533 73029 9358 83398 1711 -58154 -94420 -175868 -146393 -94836 -40183
19909 -40183 45724 -104679 -267576 -206836 -200480 -223067 -217410 -247446 -336199 -424479 -287857
19898 -287857 -218575 -206273 -234413 -303952 -391242 -338737 -323270 -396315 -522816 -677206 -833588
19887 -833588 -758488 -552037 -299050 -361527 -457843 -393743 -255258 -177881 -148944 -362081 -455678
$$ packed form
19964b90855J79643J08332K9779L6118P24q4155m16080j73982N9083J02385J64663
19953b84345K06926k07803l2171N9435k949j9603Q4546j2741n9069l6339k6502
19942c30615m0714J23620p9279j97056O9464J16735O1029j3792r796M9515J48183
19931a02706O3297J82569Q0595k76310j02408l5293j93983k4148m1091Q8014J05169
19920b56295K71828N7496o3671P4040q1687n9865l6266q1448K9475N1557N4653
19909d0183Q5907j50403j62897O0740O356k2587N657l0036q8753q8280J36622
19898b87857O9282J2302k8140o9539q7290N2505J5467p3045j26501j54390j56382
19887h33588P5100K06451K52987o2477r6316O4100J38485P7377K8937k13137r3597
$$ plain form
19876 -455678 -477656 -471233 -480417 -447607 -202004 -105346 -54130 -118763 27256 -136664 -290163
19865 -290163 -101395 -100448 -35114 128203 -133284 -327366 -504645 -486676 -504691 -366141 -146143
19854 -146143 -240195 -38126 -56113 -77680 57981 81453 57146 -55375 -173311 -41347
19844 -41347 -84617 -70075 -112087 -121038 -119450 -308714 -296664 -281121 -309951 -342690 -412511 -369591
19832 -369591 -119257 -101458 -172966 -83497 42226 90376 -98449 -201988 -192506 -296782 -218926
19821 -218926 -293477 -364480 -149017 -8789 -35952 -103121 -208700 -164978 -189846 -151292 -102935
19810 -102935 -62117 -174330 -208697 -107342 -261079 -214299 -160780 -240790 -415487 -468750 -309870
19799 -309870 -186109 -139771 -105674 -272377 -18605 149218 -24020 -261875 -336146 -262337
$$ packed form
19876d55678k1978O423r184L2810K45603R6658N1216o4633J46019j63920j53499
19865b90163J88768R47O5334J63317k61487j94082j77279J7969j8015J38550K19998
19854a46143r4052K02069j7987k1567J35661K3472k4307j12521j17936J31964
19844d1347m3270J4542m2012q951J588j89264J2050J5543k8830l2739o9821M2920
19832c69591K50334J7799p1508Q9469J25723M8150j88825j03539R482j04276P7856
19821b18926p4551p1003K15463J40228k7163o7169j05579M3722k4868L8554M8357
19810a02935M0818j12213l4367J01355j53737M6780N3519q0010j74697n3263J58880
19799c09870J23761M6338L4097j66703K53772J67823j73238k37855p4271P3809
$$ plain form
19789 -262337 -108937 -5023 83044 126806 112278 75182 28287 -34344 73380 -7897 -81494
19778 -81494 -18445 -17973 -37647 -155483 -55811 -73845 -185565 -203507 -161656 -69887 -117520 -249960
19766 -249960 -194458 -149160 -199447 -201948 -176303 -72212 10825 49539 -69067 82621 155051
19755 155051 79811 18881 6306 23516 -86794 -182599 -222706 -395027 -463006 -420213 -522448
19744 -522448 -456647 -331342 -232984 -294167 -192819 -35542 -138202 -332276 -273006 -215901
19734 -215901 -313397 -229130 -133581 -174245 -136363 10082 41117 -1395 9401 -40914 -168608
19723 -168608 -243768 -397711 -182934 -37149 -84530 -110085 -272720 -380131 -336479 -159301
19713 -159301 -135740 51119 147257 204924 180484 137949 306993 339566 36302 87126 226334
$$ packed form
19789b62337J53400J03914Q8067M3762j4528l7096m6895o2631J07724q1277p3597
19778h1494O3049M72j9674j17836R9672j8034j11720j7942M1851R1769m7633j32440
19766b49960N5502M5298n0287k501K5645J04091Q3037L8714j18606J51688P2430
19755A55051p5240o0930j2575J7210j10310r5805m0107j72321o7979M2793j02235
19744e22448O5801J25305R8358o1183J01348J57277j02660j94074N9270N7105
19734b15901r7496Q4267R5549m0664L7882J46445L1035m2512J0796n0315j27694
19723a68608p5160j53943K14777J45785m7381k5555j62635j07411M3652J77178
19713a59301K3561J86859R6138N7667k4440m2535J69044L2573l03264N0824J39208
$$ plain form
19702 226334 345891 363149 499575 525866 538539 680972 649014 597279 585575 584653 257023
19691 257023 219030 462649 404893 632694 697037 731368 411272 197177 278305 328635 288754
19680 288754 284030 341045 475376 479191 268113 231347 293426 212043 348306 502103 491938
19669 491938 336320 250351 196568 218847 552983 574764 553052 587593 523419 421959 411037
19658 411037 395164 569828 569228 665531 473496 449744 587234 414176 302178 529153 686999
19647 686999 834648 1018493 1017865 883346 977018 1049496 1103525 1114980 1065462 1226660 1388303
19636 1388303 1355871 1191801 1206987 1383363 1489836 1468801 1626490 1742571 2044496 2383827
19626 2383827 2496350 2839557 3473272 4133929 4963374 5278508 5424181 5595780 5556668 5876983
$$ packed form
19702B26334J19557J7258J36426K6291J2673J42433l1958n1735j1704r22l27630
19691B57023l7993K43619n7756K27801O4343L4331l20096k14095Q1128N0330l9881
19680B88754m724N7015J34331L815k11078l6766O2079q1383J36263J53797j0165
19669D91938j55618q5969n3783K2279L34136K1781k1712L4541o4174j01460j0922
19658D11037j5873J74664o00R6303j92035k3752J37490j73058j11998K26975J57846
19647F86999J47649J83845o28j34519R3672P2478N4029J1455m9518J61198J61643
19636A388303l2432j64070J5186J76376J06473k1035J57689J16081L01925L39331
19626B383827J12523L43207O33715O60657Q29445L15134J45673J71599l9112L20315
$$ plain form
19616 5876983 6305443 6789803 6759166 6209167 5658748 5451038 5374569 5365448 5481109 5723881
19606 5723881 5784058 5822183 5856022 6032201 6259849 6547146 6873392 7441166 8267355 8892948
19596 8892948 9557182 10370660 11261909 12438138 13829013 15620076 17609219 19966405 22765553
19587 22765553 26155117 30562710 36260222 43549933 53592359 68017636 89476298 122113780
19579 122113780 173701983 252569294 354325896 449746320 507844530 508514155 455510699
19572 455510699 373436394 284949488 207265610 150226042 112510826 87374401 70301802
19565 70301802 58182280 48850596 41652857 35958873 31057850 26994446 24011164 21332555
19557 21332555 18882530 16958523 15359843 13929102 12748593 11792558 10685487 9764621
$$ packed form
19616E876983M28460M84360l0637n49999n50419k07710p6469r121J15661K42772
19606E723881O0177L8125L3839J76179K27648K87297L26246N67774Q26189O25593
19596H892948O64234Q13478Q91249J176229J390875J791063J989143K357186K799148
19587B2765553L389564M407593N697512P289711J0042426J4425277K1458662L2637482
19579A22113780N1588203P8867311J01756602R5420424N8098210O69625n3003456
19572D55510699q2074305q8486906p7683878n7039568l7715216k5136425j7072599
19565G0301802j2119522r331684p197739n693984m901023m063404k983282k678609
19557B1332555k450025j924007j598680j430741j180509r56035j107071r20866
$$ plain form
19549 9764621 9003398 8225977 7642921 7337823 7112682 6816747 6422954 6313099 6221793 6019422
19539 6019422 5827345 5614961 5531759 5900998 6309327 6465692 6369162 5978784 5572894 5429481
19529 5429481 5462272 5506192 5279836 4694403 4226458 3558702 2974539 2782980 2419464 1982952
19519 1982952 1802257 1646971 1486172 1358756 1287135 1242381 1046775 873556 945426 916767
19509 916767 694617 476622 532463 577471 622291 553607 437935 315734 275233 358899 423217
19498 423217 300643 343177 434419 374211 67262 60616 183153 282831 318541 340904 211154
19487 211154 23359 204963 411813 251911 105563 111427 -40607 -114604 -83548 -24027
19477 -24027 -88005 -152789 -190007 -259137 -531965 -367284 -261336 -323733 -380238 -388209 -305169
$$ packed form
19549I764621p61223p77421n83056l05098k25141k95935l93793j09855r1306k02371
19539F019422j92077k12384q3202L69239M08329J56365r6530l90378m05890j43413
19529E429481L2791M3920k26356n85433m67945o67756n84163j91559l63516m36512
19519A982952j80695j55286j60799j27416p1621m4754j95606j73219P1870k8659
19509I16767k22150k17995N5841M5008M4820o8684j15672j22201m0501Q3666O4318
19498D23217j22574M2534R1242o0208l06949o646J22537R9678L5710K2363j29750
19487B11154j87795J81604K06850j59902j46348N864j52034p3997L1056N9521
19477b4027o3978o4784l7218o9130k72828J64681J05948o2397n6505p971Q3040
$$ plain form
19466 -305169 -152133 91342 306212 202219 107203 263879 150574 178733 219518 92503
19456 92503 61613 26929 -242367 -346370 -375154 -419145 -149779 67892 46845 -225661 -366660
19445 -366660 -198175 -113572 -261392 -51164 161611 100040 -172589 -120704 -60311 -124177
19435 -124177 -231884 -94454 -72925 -149714 -420089 -558022 -436500 -327847 -436676 -494262
19425 -494262 -442695 -425679 -555796 -605012 -431801 -183345 -149855 -304854 -405040 -388908
19415 -388908 -322129 -27234 102436 44264 -131224 -238215 -303199 -207302 -88175 -68012
19405 -68012 22019 104205 328036 492172 417190 449066 338416 426805 320931 193871 45439
19394 45439 -46101 68186 162795 249410 328472 349744 82745 -222021 -386232 -549789 -610583
$$ packed form
19466c05169J53036K43475K14870j03993r5016J56676j13305K8159M0785j27015
19456I2503l0890l4684k69296j04003k8784m3991K69366K17671k1047k72506j40999
19445c66660J68485Q4603j47820K10228K12775o1571k72629N1885O0393o3866
19435a24177j07707J37430K1529p6789k70375j37933J21522J08653j08829n7586
19425d94262N1567J7016j30117m9216J73211K48456L3490j54999j00186J6132
19415c88908O6779K94895J29670n8172j75488j06991o4984R5897J19127K0163
19405f8012R0031Q2186K23831J64136p4982L1876j10650Q8389j05874j27060j48432
19394D5439r1540J14287R4609Q6615P9062K1272k66999l04766j64211j63557o0794
$$ plain form
19383 -610583 -563838 -491057 -584820 -464058 -485552 -494892 -434937 -348632 -270241 -284298 -218875
19372 -218875 -26549 -46689 -292859 -447079 -566166 -734042 -639249 -392197 -638640 -503956
19362 -503956 -328534 -276324 -331113 -458008 -403815 -341941 -469180 -536754 -522322 -400955 -362414
19351 -362414 -341468 -235880 -211639 -110485 -58453 -173764 -269896 -185766 -181609 -395583 -390468
19340 -390468 -536252 -562771 -502983 -389534 -256268 -483553 -519591 -432533 -473044 -520550 -616946
19329 -616946 -593835 -379366 -328967 -332528 -400606 -400410 -255474 -276172 -151166 -112986 -333667
19318 -333667 -608572 -552226 -463228 -513883 -533513 -611145 -689393 -633667 -548817 -541947 -511661
19307 -511661 -429949 -541423 -431720 -322096 -435453 -592640 -531591 -353866 -556341 -682078
$$ packed form
19383f10583M6745P2781r3763J20762k1494r340N9955Q6305P8391j4057O5423
19372b18875J92326k0140k46170j54220j19087j67876R4793K47052k46443J34684
19362e03956J75422N2210n4789j26895N4193O1874j27239o7574J4432J21367L8541
19351c62414K0946J05588K4241J01154N2032j15311r6132Q4130M157k13974N115
19340c90468j45784k6519N9788J13449J33266k27285l6038Q7058m0511m7506r6396
19329f16946K3111K14469N0399l561o8078J96J44936k0698J25006L8180k20681
19318c33667k74905N6346Q8998n0655j9630p7632p8248N5726Q4850O870L0286
19307e11661Q1712j11474J09703J09624j13357j57187O1049J77725k02475j25737
$$ plain form
19297 -682078 -594826 -493299 -618025 -682345 -527447 -568436 -527814 -510441 -549705 -589899 -760616
19286 -760616 -773371 -475080 -320894 -242048 -261558 -55485 -121610 -397847 -758298 -863120
19276 -863120 -820569 -751817 -675791 -527524 -392297 -503605 -599713 -407932 -379433 -370576 -390528
19265 -390528 -610312 -769662 -614446 -450010 -462240 -528665 -547980 -713840 -782972 -690202
19255 -690202 -511591 -485427 -818118 -1011693 -1071058 -902792 -765546 -691706 -803338 -864103
19245 -864103 -874812 -932355 -821225 -713579 -612939 -630740 -628394 -502297 -339572 -485726
19235 -485726 -433994 -405147 -653058 -612139 -678680 -707616 -642007 -543072 -352621 -538273 -654268
19224 -654268 -619239 -651671 -509908 -475897 -628317 -613954 -302889 -314901 -325184 -338536 -470105
$$ packed form
19297f82078Q7252J01527j24726o4320J54898m0989M0622J7373l9264m0194j70717
19286g60616j2755K98291J54186P8846j9510K06073o6125k76237l60451j04822
19276h63120M2551O8752P6026J48267J35227j11308r6108J91781K8499Q857j9952
19265c90528k19784j59350J55216J64436j2230o6425j9315j65860o9132R2770
19255f90202J78611K6164l32691j93575n9365J68266J37246P3840j11632o0765
19245h64103j0709n7543J11130J07646J00640j7801K346J26097J62725j46154
19235d85726N1732K8847k47911M0919o6541k8936O5609R8935J90451j85652j15995
19224f54268L5029l2432J41763L4011j52420J4363L11065j2012j0283j3352j31569
$$ plain form
19213 -470105 -296187 -99094 81018 232061 231369 316485 679828 888833 1039854 982096
19203 982096 1153576 1346237 1498266 1425463 1255266 1310152 1405422 1050511 957677 1161104
19193 1161104 845106 636568 556691 339859 208589 74370 -162276 -208972 -226208 -322991
19183 -322991 -224066 -392806 -488327 -552735 -349134 -276772 -330274 -223232 -185248 -119344 -142588
19172 -142588 -124602 -165694 -337368 -326661 -175041 -155300 -395303 -458768 -574932 -501874 -264778
19161 -264778 -256148 -310812 -358476 -527262 -320859 -303667 -339595 -550414 -697508 -977243 -1043467
19150 -1043467 -757633 -558704 -428172 -447561 -411830 -534246 -706396 -640731 -540776 -570657
19140 -570657 -731246 -471087 -267064 -310147 -330008 -294097 -232366 -394585 -592971 -705764
$$ packed form
19213d70105J73918J97093J80112J51043o92Q5116L63343K09005J51021n7758
19203I82096J71480J92661J52029p2803j70197N4886R5270l54911r2834K03427
19193A161104l15998k08538p9877k16832j31270j34219k36646m6696j7236r6783
19183c22991R8925j68740r5521o4408K03601P2362n3502J07042L7984O5904k3244
19172a42588J7986m1092j71674J0707J51620J9741k40003o3465j16164P3058K37096
19161b64778Q630n4664m7664j68786K06403J7192l5928k10819j47094k79735o6224
19150a043467K85834J98929J30532j9389L5731j22416j72150O5665R9955k9881
19140e70657j60589K60159K04023m3083j9861L5911O1731j62219j98386j12793
$$ plain form
19130 -705764 -669879 -473984 -108055 -192887 -392904 -452377 -285780 -3172 -156142 -465693
19120 -465693 -507567 -420958 -295758 -271800 -217753 -312634 -335680 -328056 -226576 -134441 -291561
19109 -291561 -283953 -246123 -443659 -311393 -230659 -477126 -515625 -408063 -356561 -448656 -521462
19098 -521462 -481234 -458094 -369716 -263865 -90904 -239872 -325111 -434178 -341093 -247878 -373961
19087 -373961 -302978 -115966 -71488 -15387 21455 -47539 -63059 -270926 -211987 -188230 -338830
19076 -338830 -357496 -138998 -165349 -252570 -314882 -254465 -28220 -169765 -483163 -513163 -279190
19065 -279190 -253909 -217271 -166720 -223302 -214681 -192909 -324269 -460343 -391921 -399181 -401898 -418392
19053 -418392 -420769 -446391 -399018 -245612 -134729 -94589 -8199 176567 261234 246808 -109382
$$ packed form
19130g05764L5885J95895L65929q4832k00017n9473J66597K82608j52970l09551
19120d65693m1874Q6609J25200K3958N4047r4881k3046P624J01480R2135j57120
19109b91561P608L7830j97536J32266Q0734k46467l8499J07562N1502r2095p2806
19098e21462M0228K3140Q8378J05851J72961j48968q5239j09067R3085R3215j26083
19087c73961P0983J87012M4478N6101L6842o8994j5520k07867N8939K3757j50600
19076c38830j8666K18498k6351q7221o2312O0417K26245j41545l13398l0000K33973
19065b79190K5281L6638N0551n6582Q621K1772j31360j36074O8422p260k717j6494
19053d18392k377k5622M7373J53406J10883M0140Q6390J84766Q4667j4426l56190
$$ plain form
19042 -109382 -289426 -188506 -154136 -244997 -38164 -128693 -12974 171643 27502 83375
19032 83375 63073 139574 -16234 -2711 -95059 -333682 -353382 -210479 -129526 -117032 -68369
19021 -68369 30106 -126398 -217257 -77654 76130 154554 52291 -60320 -416 98621 -44686
19010 -44686 -87913 -98708 73055 120653 41823 -9552 -53169 -96690 -168119 -272494 -242378
18999 -242378 -323443 -404760 -220009 -14737 107389 215947 350610 167193 125100 108658
18989 108658 217705 202936 212107 200480 257944 263114 300753 499359 937448 840533 761849
18978 761849 913493 1081634 1112232 1361041 1807069 2159118 2391637 2613907 2819303 3012386
18968 3012386 3096240 3057789 2901979 2714896 2443036 2225946 2093422 1956217 1877654 1987480
$$ packed form
19042a09382j80044J00920L4370r0861K06833r0529J15719J84617j44141N5873
19032H3375k0302P6501j55808J3523r2348k38623j9700J42903Q0953J2494M8663
19021f8369R8475j56504r0859J39603J53784P8424j02263j12611N9904R9037j43307
19010d4686m3227j0795J71763M7598p8830n1375m3617m3521p1429j04375L0116
18999b42378q1065q1317J84751K05272J22126J08558J34663j83417m2093j6442
18989A08658J09047j4769R171j1627N7464N170L7639J98606M38089r6915p8684
18978G61849J51644J68141L0598K48809M46028L52049K32519K22270K05396J93083
18968C012386Q3854l8451j55810j87083k71860k17090j32524j37205p8563J09826
$$ plain form
18958 1987480 2281217 2299484 2349039 2516483 2668792 2693662 2891304 3486544 3785119 4038748
18948 4038748 4446077 5165956 5915689 6755036 7644143 8994105 10956768 13406057 16959864
18939 16959864 22526278 31032843 43652529 58393588 69263389 73955631 75685398 76889858
18931 76889858 80964985 92964281 111698226 128591213 134934825 129552647 117280005
18924 117280005 102309824 90017135 85957783 87644888 86554031 79824348 70068973 58230694
18916 58230694 45889118 35602522 28224969 22926779 19519740 17074514 15338678 13856284
18908 13856284 12528486 11406458 10544777 9877610 9416303 9198869 8856580 8477692 8233391
18899 8233391 8054795 7916469 7853856 7735657 7663619 7846240 8113152 8370052 8983580 9532991
$$ packed form
18958A987480K93737J8267M9555J67444J52309K4870J97642N95240K98575K53629
18948D038748M07329P19879P49733Q39347Q89107J349962J962663K449289L553807
18939A6959864N566414Q506565J2619686J4741059J0869801M692242J729767J204460
18931G6889858M075127J1999296J8733945J6892987O343612n382178j2272642
18924A17280005j4970181j2292689m059352J687105j090857o729683r755375j1838279
18916E8230694j2341576j0286596p377553n298190l407039k445226j735836j482394
18908A3856284j327798j122028q61681o67167m61307k17434l42289l78888k44301
18899H233391j78596j38326o2613j18199p2038J82621K66912K56900O13528N49411
$$ plain form
18889 9532991 10075442 11121414 12289568 13947991 16161835 19225592 24023980 31154397
18881 31154397 41826405 58007980 78278099 93889883 100342061 102189663 103018139 106946260
18873 106946260 121069819 146186870 169269077 178763881 173069210 157357781 137116655
18866 137116655 120163935 112444649 113159468 112310554 104383171 92106169 76764737 60501712
18858 60501712 46534414 36467732 29393239 24452359 20836865 18286890 16187300 14551298
18850 14551298 13061723 11690133 10563318 9765707 9119576 8421574 7587571 6909895 6439668
18841 6439668 6153494 5665183 5094071 4718802 4267885 3798028 3589369 3361433 3170185
18832 3170185 2834868 2640787 2517862 2446840 2244241 2124214 2078442 2185056 1965116 1567814
$$ packed form
18889I532991N42451J045972J168154J658423K213844L063757M798388P130417
18881C1154397J0672008J6181575K0270119J5611784O452178J847602Q28476L928121
18873A06946260J4123559K5117051K3082207R494804n694671j5711429k0241126
18866A37116655j6952720p719286P14819q48914p927383j2277002j5341432j6263025
18858F0501712j3967298j0066682p074493m940880l615494k549975k099590j636002
18850A4551298j489575j371590j126815p97611o46131o98002q34003o77676m70227
18841F439668k86174m88311n71112l75269m50917m69857k08659k27936j91248
18832C170185l35317j94081j22925p1022k02599j20027m5772J06614k19940l97302
$$ plain form
18822 1567814 1576252 1580139 1409174 1322039 1387213 1444222 1273582 1099489 987444 817651 793253
18811 793253 758379 739612 667614 682277 865178 855548 801351 743791 854959 739684 636620
18800 636620 597712 667586 579461 466486 618438 807828 912479 787270 538733 255401
18790 255401 182231 221874 82706 157257 333996 442026 461522 503339 429153 289945 95330
18779 95330 75275 18086 -78714 94708 227486 277564 224625 -8195 -39032 -52898 102779
18768 102779 121811 86072 26058 254282 399443 324758 92381 43333 131846 82938 -72502
18757 -72502 -294068 -309502 -450643 -567494 -564973 -354663 -299917 -375278 -462000 -350596 -194503
18746 -194503 -157277 -232010 -215350 -195319 -364315 -264923 -367217 -346798 -364597 -405157 -150790
$$ packed form
18822A567814Q438L887j70965q7135O5174N7009j70640j74093j12045j69793k4398
18811G93253l4874j8767p1998J4663J82901r630n4197n7560J11168j15275j03064
18800F36620l8908O9874q8125j12975J51952J89390J04651j25209k48537k83332
18790B55401p3170L9643j39168P4551J76739J08030J9496M1817p4186j39208j94615
18779I5330k0055n7189r6800J73422J32778N0078n2939k32820l0837j3866J55677
18768A02779J9032l5739o0014K28224J45161p4685k32377m9048Q8513m8908j55440
18757g2502k21566j5434j41141j16851K521K10310N4746p5361q6722J11404J56093
18746a94503L7226p4733J6660K0031j68996R9392j02294K0419j7799m0560K54367
$$ plain form
18735 -150790 47549 -136832 -214964 -150644 -107636 -235461 -239049 -187781 -239841 -355031 -530113
18724 -530113 -397949 -137594 -129354 -182324 -177817 -205208 -74791 -73948 -105325 -101032 -204519 -319826
18712 -319826 -546493 -320829 -344482 -159216 -37750 8979 -27598 -357542 -246369 -39385
18702 -39385 -24694 -232192 -308264 -157607 51163 -29734 -242215 -292038 -151412 -56033 -290893
18691 -290893 -559122 -506632 -281810 -198493 -316250 -358616 -510574 -551250 -441641 -396268
18681 -396268 -442144 -543620 -630468 -510885 -360626 -327001 -497910 -591683 -654262 -543743
18671 -543743 -326072 -341355 -489162 -455289 -225447 -111568 -183362 -145225 -207422 -274755 -401966
18660 -401966 -576618 -459599 -222500 -113650 -222540 -401217 -484211 -274509 -41018 3175
$$ packed form
18735a50790J98339j84381p8132O4320M3008j27825l588N1268n2060j15190j75082
18724e30113J32164K60355Q240n2970M507k7391J30417Q43l1377M293j03487j15307
18712c19826k26667K25664k3653J85266J21466M6729l6577l29944J11173K06984
18702c9385J4691k07498p6072J50657K08770q0897k12481m9823J40626R5379k34860
18691b90893k68229N2490K24822Q3317j17757m2366j51958m0676J09609M5373
18681c96268m5876j01476q6848J19583J50259L3625j70909r3773o2579J10519
18671e43743K17671j5283j47807L3873K29842J13879p1794L8137o2197o7333j27211
18660d01966j74652J17019K37099J08850j08890j78677q2994K09702K33491M4193
$$ plain form
18650 3175 136042 -40296 -202016 -200776 -378037 -614773 -489291 -445570 -352470 -327490 -307729
18639 -307729 -150158 68141 154937 -156722 -217708 -330279 -550033 -427555 -169308 18791
18629 18791 112553 -85364 21724 232894 452769 401520 360600 343653 307376 313780 501713
18618 501713 769027 737681 696803 775439 1189207 1450780 1534671 1877067 1870543 1826199 1807777
18607 1807777 1837083 1783123 1654928 1767832 1656990 1668597 1494356 1318977 1106696 902804
18597 902804 526831 280514 322949 267642 226356 380660 395234 346008 448051 503902 542560
18586 542560 697650 790288 814453 915869 1026809 870788 944376 1003946 1110911 1044729
18576 1044729 1296095 1494650 1780356 2098554 2182615 2484160 2744649 2941840 3124399 3326720
$$ packed form
18650C175J32867j76338j61720J240j77261k36736J25482M3721R3100K4980J9761
18639c07729J57571K18299Q6796l11659o0986j12571k19754J22478K58247J88099
18629A8791R3762j97917J07088K11170K19875n1249m0920j6947l6277O404J87933
18618E01713K67314l1346m0878P8636M13768K61573Q3891L42396o524m4344j8422
18607A807777K9306n3960j28195J12904j10842J1607j74241j75379k12281k03892
18597I02804l75973k46317M2435n5307m1286J54304J4574m9226J02043N5851L8658
18586E42560J55090R2638K4165J01416J10940j56021P3588N9570J06965o6182
18576A044729K51366J98555K85706L18198Q4061L01545K60489J97191J82559K02321
$$ plain form
18566 3326720 3744083 3981298 4311355 4871227 5304430 5721584 6593689 8109967 9923242
18557 9923242 12600321 16537678 22542306 32053183 46829876 64755371 76774298 78919086
18549 78919086 75249380 67537046 58517809 54355265 57991900 69872276 83180511 86886881
18541 86886881 81659522 71533451 57583968 43154259 32402437 25571271 21432370
18534 21432370 18369924 15945852 14478625 13201950 11879169 10920956 10439895 10160776
18526 10160776 9937912 9601345 9300609 8929604 9028163 9459317 9853146 10424874 11205178
18517 11205178 12214329 13871650 16043026 18830352 22828052 29000527 39055377 55162584
18509 55162584 76535592 93464882 98033517 94534581 86490852 76046766 69752355 72202355
$$ packed form
18566C326720M17363K37215L30057N59872M33203M17154Q72105J516278J813275
18557I923242K677079L937357O004628R510877J4776693J7925495J2018927K144788
18549G8919086l669706p712334r019237m162544L636635J1880376J3308235L706370
18541H6886881n227359j0126071j3949483j4429709j0751822o831166m138901
18534B1432370l062446k424072j467227j276675j322781r58213m81061k79119
18526A0160776k22864l36567l00736l71005R8559M31154L93829N71728P80304
18517A1205178J009151J657321K171376K787326L997700O172475J0054850J6107207
18509E5162584K1373008J6929290M568635l498936q043729j0444086o294411K450000
$$ plain form
18501 72202355 83450616 98117245 106547825 106682419 103132851 98712155 95328229 91836747
18493 91836747 85500932 77493660 68512166 59634479 54091758 54544575 61018755 69885597
18485 69885597 72870512 68847376 60966459 50285676 38907849 30361069 24797603 21003927
18477 21003927 18389236 16671513 15305651 14047074 12778134 11710974 11139506 10617231
18469 10617231 9986315 9351082 8767235 8591626 8328955 8105142 8251309 8510170 9006655
18460 9006655 9655418 10478233 11849417 13669752 16437677 20801966 27946465 39840443
18452 39840443 56782734 71145344 75531567 72654013 65983274 57008723 50574540 50820134
18444 50820134 58755633 70644012 77069889 74247623 66026195 54308394 41104978 30301877
$$ packed form
18501G2202355J1248261J4666629Q430580J34594l549568m420696l383926l491482
18493I1836747o335815q007272q981494q877687n542721M52817O474180Q866842
18485F9885597K984915m023136p880917j0680783j1377827q546780n563466l793676
18477B1003927k614691j717723j365862j258577j268940j067160n71468n22275
18469A0617231o30916o35233n83847j75609k62671k23813J46167K58861M96485
18460I006655O48763Q22815J371184J820335K767925M364289P144499J1893978
18452C9840443J6942291J4362610M386223k877554o670739q974551o434183K45594
18444E0820134P935499J1888379O425877k822266q221428j1717801j3203416j0803101
$$ plain form
18436 30301877 23221147 18390947 15082077 12810948 11078664 9710583 8753130 7934535
18428 7934535 7329342 6627203 6087402 5656101 5332372 5084200 4737427 4485340 4156594
18419 4156594 3612546 3261701 3011669 2717156 2455666 2514070 2739218 2779219 2682666 2586109
18409 2586109 2561965 2391192 1918288 1783169 1501167 1319553 1211208 1101447 973012 906287
18399 906287 904573 993003 877500 949578 1100515 1202491 1191462 1141869 1189450 1324126 1249475
18388 1249475 1273059 1388013 1649910 1679776 1491841 1463008 1375403 1275909 1083116 1140104
18378 1140104 1036938 918305 643177 560322 656391 793636 720885 707398 640500 607544
18368 607544 554832 516500 607400 832414 761721 623869 475244 433716 487514 544074 434991
$$ packed form
18436C0301877p080730m830200l308870k271129j732284j368081r57453q18595
18428G934535o05193p02139n39801m31301l23729k48172l46773k52087l28746
18419D156594n44048l50845k50032k94513k61490N8404K25148M0001r6553r6557
18409B586109k4144j70773m72904j35119k82002j81614j08345j09761j28435o6725
18399I06287j714Q8430j15503P2078J50937J01976j1029m9593M7581J34676p4651
18388A249475K3584J14954K61897K9866j87935k8833q7605r9494j92793N6988
18378A140104j03166j18633k75128q2855R6069J37245p2751j3487o6898l2956
18368F07544n2712l8332R0900K25014p0693j37852j48625m1528N3798N6560j09083
$$ plain form
18357 434991 409699 347849 60575 -25259 69482 24906 -51332 -232870 -192006 -29022 208044
18346 208044 188692 83227 -57661 -112161 -62997 353755 460391 226712 185457 184341 165952
18335 165952 9471 141002 238851 346435 226546 443267 593977 572747 458798 459813
18325 459813 518161 613631 536587 159875 82535 257665 507044 568970 415827 247864
18315 247864 134099 -21861 -106160 -159318 -315528 -320639 -271465 -366847 -536182 -330920 -75490
18304 -75490 -175652 -277697 -416981 -370719 -176063 -158403 -120037 -110068 -95444 -143088 -382072
18293 -382072 -327966 -156650 -32139 -3354 -42660 20172 -154798 -273182 -285001 -10644
18283 -10644 98207 110661 -105198 -206298 -124930 -26788 88971 87461 -143274 -140872 -22105
$$ packed form
18357D34991k5292o1850k87274q5834R4741m4576p6238j81538M0864J62984K37066
18346B08044j9352j05465j40888n4500M9164M16752J06636k33679m1255j116j8389
18335A65952j56481J31531R7849J07584j19889K16721J50710k1230j13949J015
18325D59813N8348R5470p7044l76712p7340J75130K49379O1926j53143j67963
18315B47864j13765j55960q4299n3158j56210n111M9174r5382j69335K05262K55430
18304g5490j00162j02045j39284M6262J94656J7660L8366R969J4624m7644k38984
18293c82072N4106J71316J24511K8785l9306O2832j74970j18384j1819K74357
18283a0644J08851J2454k15859j01100Q1368R8142J15759j510k30735K402J18767
$$ plain form
18272 -22105 120650 289603 273358 78493 -50438 -189751 -165647 -151000 -146458 -120692 -76866
18261 -76866 -85470 -47546 45176 -19821 -95254 -181356 -258166 -174396 -88856 -198931 -363368
18250 -363368 -393276 -298624 -132284 -113823 -237342 -532653 -742307 -860923 -650889 -448127
18240 -448127 -447895 -629118 -793141 -571976 -295072 -136640 -16946 -35503 -236544 -297342
18230 -297342 -63447 121123 22647 -34269 -5893 204080 270771 189420 20463 -304440
18220 -304440 -426580 -441212 -391816 -247488 -127073 -282329 -382625 -369562 -397444 -519637
18210 -519637 -428636 -347114 -463795 -393203 -215796 -221768 -376569 -393511 -422532 -207801 -267085
18199 -267085 -418981 -650801 -680580 -690713 -666370 -602138 -357635 -380827 -253997 -141085
$$ packed form
18272b2105J42755J68953j6245j94865j28931j39313K4104J4647M542K5766M3826
18261g6866q604L7924R2722o4997p5433q6102p6810Q3770Q5540j10075j64437
18250c63368k9908R4652J66340J8461j23519k95311k09654j18616K10034K02762
18240d48127K32j81223j64023K21165K76904J58432J19694j8557k01041o0798
18230b97342K33895J84570r8476n6916K8376K09973O6691q1351j68957l24903
18220c04440j22140j4632M9396J44328J20415j55256j00296J3063k7882j22193
18210e19637R1001Q1522j16681P0592J77407n972j54801j6942k9021K14731n9284
18199b67085j51896k31820k9779j0133K4343O4232K44503k3192J26830J12912
$$ plain form
18189 -141085 -176967 -243973 -253109 -258017 -418126 -440180 -470610 -401069 -384995 -434626 -292967
18178 -292967 -144883 -97610 -315526 -345996 -317337 -453991 -653695 -466935 -319033 -187925
18168 -187925 -105829 -131971 -198775 -192947 -229553 -319693 -406427 -269144 -125691 -211702 -242299
18157 -242299 -250075 -375120 -346443 -482583 -632080 -694631 -519832 -426429 -421942 -458466 -268310
18146 -268310 30184 -17739 -181214 -324665 -502714 -605525 -693398 -719387 -540506 -314013
18136 -314013 -172163 -357306 -390131 -428416 -500788 -687816 -709168 -784705 -713243 -411853 -190497
18125 -190497 -304312 -517114 -611977 -632481 -528555 -478422 -408223 -306040 -391276 -535155
18115 -535155 -475700 -476691 -472310 -425873 -312761 -39561 53897 44068 -9743 -118122 -138571 -44996
$$ packed form
18189a41085l5882o7006r136m908j60109k2054l0430O9541J6074m9631J41659
18178b92967J48084M7273k17916l0470K8659j36654j99704J86760J47902J31108
18168a87925Q2096k6142o6804N828l6606r0140q6734J37283J43453q6011l0597
18157b42299p776j25045K8677j36140j49497o2551J74799R3403M487l6524J90156
18146b68310K98494m7923j63475j43451j78049j02811q7873k5989J78881K26493
18136c14013J41850j85143l2825l8285p2372j87028k1352p5537P1462L01390K21356
18125a90497j13815k12802r4863k0504J03926N0133P0199J02183q5236j43879
18115e35155N9455r91M381M6437J13112K73200R3458r829n3811j08379k0449R3575
$$ plain form
18103 -44996 50305 19191 125376 329822 326548 126174 -227267 -107141 -64837 199442 306295
18092 306295 257859 214257 13737 -64930 -170191 -159329 -316437 -340216 -322812 -405134 -471728
18081 -471728 -639772 -609845 -397726 -406651 -360553 -417510 -238467 -37913 -9408 -39347 -159409
18070 -159409 -334177 -313760 -287378 -242195 -73550 83188 144530 95393 11094 115880 520287
18059 520287 753167 780598 796079 1015942 1209562 1287179 1323302 1350349 1507968 1830042
18049 1830042 1840505 1810092 1929006 2214005 2437190 2724828 3019975 3467193 4015648 4442873
18039 4442873 5108203 5710145 6700319 8175882 9825703 11777332 14830952 19678990 27026891
18030 27026891 37676715 50517406 62894692 72102597 75532805 73485628 69237821 65723226
$$ packed form
18103d4996R5301l1114J06185K04446l274k00374l53441J20126M2304K64279J06853
18092C06295m8436m3602k00520p8667j05261J0862j57108k3779J7404q2322o6594
18081d71728j68044K9927K12119q925M6098n6957J79043K00554K8505k9939j20062
18070a59409j74768K0417K6382M5183J68645J56738O1342m9137q4299J04786M04407
18059E20287K32880K7431J5481K19863J93620P7617L6123K7047J57619L22074
18049A830042J0463l0413J18914K84999K23185K87638K95147M47218N48455M27225
18039D442873O65330O01942R90174J475563J649821J951629L053620M848038P347901
18030B7026891J0649824J2840691J2377286R207905L430208k047177m247807l514595
$$ plain form
18022 65723226 65797394 70035289 75600722 79713057 79426896 73131061 62901624 51685600
18014 51685600 40824612 32181242 25852370 21752291 18849263 16544791 15170821 14270769
18006 14270769 13503808 13048154 12702300 12560740 12716746 13031470 13159676 13187630 13131546 13003017
17996 13003017 13248649 14013153 15181756 16675016 19062400 22159748 26589460 33430527
17988 33430527 43919072 59414480 80530558 104166009 124423600 137059827 139238426
17981 139238426 133230689 125203763 120452900 123163972 132370697 141741780 146076719 141094886
17973 141094886 126425734 106613002 85812236 67149156 52816146 42860731 35847321
17966 35847321 30754308 26680439 23674735 21640786 19994882 18458642 17236381 16179800
$$ packed form
18022F5723226P4168M237895N565433M112335k86161o295835j0229437j1216024
18014E1685600j0860988q643370o328872m100079k903028k304472j373970r00052
18006A4270769p66961m55654l45854j41560J56006L14724J28206K7954n6084j28529
17996A3003017K45632P64504J168603J493260K387384L097348M429712O841067
17988C3430527J0488545J5495408K1116078K3635451K0257591J2636227K178599
17981A39238426o007737q026926m750863K711072R206725R371083M334939m981833
17973A41094886j4669152j9812732k0800766j8663080j4333010r955415p013410
17966C5847321n093013m073869l005704k033949j645904j536240j222261j056581
$$ plain form
17958 16179800 15416015 14926175 14359184 13901519 13386119 13000493 12640891 12597915 12781577
17949 12781577 13478013 14371594 15842947 18301003 22030793 27517819 35823797 46375676
17941 46375676 56705435 64503218 67745491 66131802 62091429 58275785 57098421 59811351
17933 59811351 64574693 68073201 67866847 62814972 54754032 45351111 35924229 28118437
17925 28118437 22447388 18650665 16018463 14125277 12596386 11229454 10034287 8984810
17917 8984810 8031568 7550070 7237103 6871505 6372916 5939607 5713213 5361549 5061058
17908 5061058 4841657 4632081 4296052 4183024 3986261 3655106 3337680 3065285 2760697
17899 2760697 2636107 2822672 2815743 2619658 2508163 2324501 2295057 2076939 1854422 2006743
$$ packed form
17958A6179800p63785m89840n66991m57665n15400l85626l59602m2976J83662
17949A2781577O96436Q93581J471353K458056L729790N487026Q305978J0551879
17941D6375676J0329759P797783L242273j613689m040373l815644j177364K712930
17933E9811351M763342L498508k06354n051875q060940r402921r426882p805792
17925B8118437n671049l796723k632202j893186j528891j366932j195167j049477
17917H984810r53242m81498l12967l65598m98589m33309k26394l51664l00491
17908E061058k19401k09576l36029j13028j96763l31155l17426k72395l04588
17899B760697j24590J86565o929j96085j11495j83662k9444k18118k22517J52321
$$ plain form
17889 2006743 1969699 1917381 1950249 1984609 1966635 1899531 1679759 1670654 1859414 1693654 1441172
17878 1441172 1407344 1536868 1403099 1089744 1053801 901068 976113 779208 839829 971082
17868 971082 1124478 1252245 1120260 1024885 960377 818366 715039 475777 327048 521945
17858 521945 669304 589248 763396 876370 719181 519438 669413 790685 802376 652776
17848 652776 781162 1011223 1064357 989559 921045 756730 570214 434836 291338 341989
17838 341989 303195 245504 368108 510649 572474 569166 772674 840455 624558 388154 144617
17827 144617 78061 -5319 159274 177516 48292 -90482 97152 355752 454812 273666
17817 273666 214178 192664 263890 585999 529710 369168 348669 177301 50766 252044
$$ packed form
17889B006743l7044n2318L2868L4360j7974o7104k19772r105J88760j65760k52482
17878A441172l3828J29524j33769l13355l5943j52733P5045j96905O0621J31253
17868I71082J53396J27767j31985r5375o4508j42011j03327k39262j48729J94897
17858E21945J47359q0056J74148J12974j57189j99743J49975J21272J1691j49600
17848F52776J28386K30061N3134p4798o8514j64315j86516j35378j43498N0651
17838C41989l8794n7691J22604J42541O1825l308K03508O7781k15897k36404k43537
17827A44617o6556q3380J64593J8242j29224j38774J87634K58600R9060j81146
17817B73666n9488k1514P1226L22109n6289j60542k0499j71368j26535K01278
$$ plain form
17807 252044 264870 334957 403687 354563 416658 450871 431076 535676 384395 410439 353142
17796 353142 164841 110408 151833 -48419 -74275 -91255 30429 167985 97961 239579
17786 239579 387000 326946 53522 -22158 -39950 93946 25463 73178 40105 -22922 65693
17775 65693 408773 497649 498871 457137 402251 331750 320226 214979 263239 474366 476413
17764 476413 353777 396134 403630 451760 435464 572040 755665 481113 214256 242550 180454
17753 180454 228645 265839 336802 478367 729654 600126 426889 417017 389492 289366 227559
17742 227559 86609 60971 79307 175230 262076 307666 340052 299877 312717 300585 135014
17731 135014 28518 22875 150200 234681 225478 369249 376333 165416 254052 210464 1000
$$ packed form
17807B52044J2826P0087O8730m9124O2095L4213j9795J04600j51281K6044n7297
17796C53142j88301n4433M1425k00252k5856j6980J21684J37556p0024J41618
17786B39579J47421o0054k73424p5680j7792J33896o8483M7715l3073o3027Q8615
17775F5693L43080Q8876J222m1734n4886p0501j1524j05247M8260K11127K047
17764D76413j22636M2357P496M8130j6296J36576J83625k74552k66857K8294o2096
17753A80454M8191L7194P0963J41565K51287j29528j73237r872k7525j00126o1807
17742B27559j40950k5638J8336R5923Q6846M5590L2386m0175J2840j2132j65571
17731A35014j06496n643J27325Q4481r203J43771P084k10917Q8636m3588k09464
$$ plain form
17720 1000 -129010 -35274 123712 200027 241661 307876 78461 -36692 38347 59919 28437
17709 28437 33626 -99772 -28246 -66882 -27707 -202928 -284796 -259459 -218889 -103539 55689
17698 55689 186652 143943 154321 2091 -104784 -114723 -32167 -108749 -71134 -147445 -191581
17687 -191581 -341424 -291949 -251354 -43091 -51048 -225352 -224306 -118389 -215651 -267951 -240789
17676 -240789 -225065 -2283 125176 265134 236442 -80879 -28577 87450 28817 -99124
17666 -99124 -153855 -116836 -105636 -265952 -190727 -190077 -268525 -217911 -283147 -75248 236157
17655 236157 314349 105314 74242 -52195 -292717 -81419 -93893 -50951 45016 47855 -154096
17644 -154096 -157622 12728 -125220 -233746 -265543 -8622 -17458 -180266 -146323 133510 263240
$$ packed form
17720A000j30010R3736J58986P6315M1634O6215k29415j15153P5039K1572l1482
17709B8437N189j33398P1526l8636L9175j75221q1868K5337M0570J15350J59228
17698E5689J30963m2709J0378j52230j06875r939Q2556p6582L7615p6311m4136
17687a91581j49843M9475M0595K08263p957j74304J046J05917r7262n2300K7162
17676b40789J5724K22782J27459J39958k8692l17321N2302J16027n8633j27941
17666i9124n4731L7019J1200j60316P5225O50p8448N0614o5236K07899L11405
17655B36157P8192k09035l1072j26437k40522K11298j2474M2942R5967K839k01951
17644a54096l526J70350j37948j08526l1797K56921q836j62808L3943K79833J29730
$$ plain form
17633 263240 284109 242308 116183 -34594 -187671 -217876 -196344 -223883 -211998 -180312 -147398
17622 -147398 -238820 -416221 -410424 -273323 -440650 -518987 -310006 -102394 -76373 -82493 -258018
17611 -258018 -457396 -457696 -507840 -493869 -492369 -457896 -322053 -174017 40692 -16823 56061
17600 56061 89699 -78108 19642 75342 -6002 -136466 -138754 -196463 -271264 -310839 -139752
17589 -139752 -36711 -75763 -50190 -77915 1300 -43127 -209489 -294513 -169713 -23140 95832
17578 95832 169745 88589 10246 -2423 160866 295152 338368 245359 160018 270968 246690
17567 246690 233346 317919 212767 311959 204671 263344 333861 423775 520272 541213 654295
17556 654295 614126 572279 468821 400859 132834 108211 249100 110741 78336 106521 70286
$$ packed form
17633B63240K0869m1801j26125j50777j53077l0205K1532k7539J1885L1686L2914
17622a47398r1422j77401N797J37101j67327p8337K08981K07612K6021o120j75525
17611b58018j99378l00n0144J3971J500L4473J35843J48036K14709n7515P2884
17600E6061L3638j67807R7750N5700q1344j30464k288n7709p4801l9575J71087
17589a39752J03041l9052K5573k7725P9215m4427j66362q5024J24800J46573J18972
17578I5832P3913q1156p8343j2669J63289J34286M3216r3009q5341J10950k4278
17567B46690j3344Q4573j05152R9192j07288N8673P0517Q9914R6497K0941J13082
17556F54295m0169m1847j03458o7962k68025k4623J40889j38359l2405K8185l6235
$$ plain form
17545 70286 -12888 -383823 -429750 -383580 -126712 -184277 -127636 130321 -20445 -148544 -153746
17534 -153746 -22229 -63508 -203502 -137920 -47981 14085 1945 -117303 -164956 -72366 163680
17523 163680 334732 603710 880918 964483 989504 961715 754581 646414 662412 882888
17513 882888 972138 891920 914664 770354 728887 477927 363263 387005 414901 313833 246494
17502 246494 242632 208987 88289 -84728 97516 209497 235299 260645 477004 484798 557621
17491 557621 531619 406983 205014 291633 387427 167310 223555 314507 236782 164941 379983
17480 379983 342162 321965 427389 273139 355709 341497 408173 378369 235178 67404 5869
17469 5869 224644 499075 528268 574549 469037 149279 51116 -103857 -166907 148904 221203
$$ packed form
17545G0286q3174l70935m5927M6170K56868n7565N6641K57957j50766j28099n202
17534a53746J31517m1279j39994O5582Q9939O2066j2140j19248m7653R2590K36046
17523A63680J71052K68978K77208Q3565K5021k7789k07134j08167J5998K20476
17513H82888Q9250q0218K2744j44310m1467k50960j14664K3742K7896j01068o7339
17502B46494l862l3645j20698j73017J82244J11981K5802K5346K16359P794P2823
17491E57621k6002j24636k01969Q6619R5794k20117N6245R0952p7725p1841K15042
17480C79983l7821k0197J05424j54250Q2570j4212O6676k9804j43191j67774o1535
17469E869K18775K74431K9193M6281j05512l19758r8163j54973o3050L15811P2299
$$ plain form
17458 221203 286065 393020 315665 237528 55654 83245 300457 525214 680324 489554
17448 489554 483077 538668 753036 740330 917435 924153 875542 753067 669857 615925 402557
17437 402557 248353 -51875 -157765 -255968 -119800 51546 108868 -104083 -243721 -81873
17427 -81873 10790 29273 129310 212178 80782 -78628 -202527 -219202 -20861 -29619 21993
17416 21993 213906 187974 101101 -93588 -181295 -184267 68168 110829 351767 464670 415101
17405 415101 395709 254074 343097 291916 263753 327638 389916 393681 534297 498041 562125
17394 562125 241842 48624 -125191 -137127 -67385 -3256 -44131 17479 -3060 -312866 -391360
17383 -391360 -312545 -149497 -208976 -252441 -86370 -33413 -186586 -134416 -374705 -375733 49345
$$ packed form
17458B21203O4862J06955p7355p8137j81874K7591K17212K24757J55110j90770
17448D89554o477N5591K14368j2706J77105O718m8611j22475q3210n3932k13368
17437D02557j54204l00228j05890r8203J36168J71346N7322k12951j39638J61848
17427h1873R2663J8483J00037Q2868j31396j59410j23899j6675J98341q758N1612
17416B1993J91913k5932q6873j94689q7707k972K52435M2661K40938J12903m9569
17405D15101j9392j41635Q9023n1181k8163O3885O2278L765J40616l6256O4084
17394E62125l20283j93218j73815j1936O9742O4129m0875O1610k0539l09806p8494
17383c91360P8815J63048n9479m3465J66071N2957j53173N2170k40289j028M25078
$$ plain form
17372 49345 388892 355179 91018 64732 -225477 -187936 -272330 -344280 -395445 -548550 -525613
17361 -525613 -171344 -63252 45821 -121787 -185282 -221989 -176005 -164860 -419423 -435502
17351 -435502 -356616 -354043 -176611 -85255 -204175 -68957 48161 24367 -125909 -217292 -93858
17340 -93858 -106568 -238625 -340948 -333305 -196101 -122137 65446 -91713 -442813 -579851
17330 -579851 -513651 -360268 -260943 -235993 -182870 -273693 -414877 -455497 -345117 -246924 -243672
17319 -243672 -297614 -403942 -359882 -262784 -252538 -246376 -259561 -376597 -393039 -380850 -317680
17308 -317680 -336659 -217455 -271396 -282517 -297975 -457277 -352965 -319161 -351434 -174323 -305748
17297 -305748 -313044 -391997 -441089 -613527 -603032 -321812 -132852 -33981 -134301 -44290 -98291
$$ packed form
17372D9345L39547l3713k64161k6286k90209L7541q4394p1950n1165j53105K2937
17361e25613L54269J08092J09073j67608o3495l6707M5984J1145k54563j6079
17351d35502P8886K573J77432R1356j18920J35218J17118k3794j50276r1383J23434
17340i3858j2710j32057j02323P643J37204P3964J87583j57159l51100j37038
17330e79851O6200J53383R9325K4950N3123r0823j41184m0620J10380R8193L252
17319b43672n3942j06328M4060R7098J0246O162j3185j17036j6442J2189O3170
17308c17680j8979J19204n3941j1121j5458j59302J04312L3804l2273J77111j31425
17297c05748p296p8953m9092j72438J0495K81220J88960R8871j00320R0011n4001
$$ plain form
17286 -98291 -63496 -284185 -354158 -88139 43609 -162686 -388205 -473076 -353119 -277378
17276 -277378 -231172 -308931 -372205 -373411 -329024 -508971 -760142 -803299 -602439 -526742 -463998
17265 -463998 -249185 -110185 -174276 -256329 -311938 -265970 -132977 18094 60835 -190949
17255 -190949 -248612 -201059 -24383 -25425 -169612 -159979 -158499 -221604 -247475 -30409 -54224
17244 -54224 -58023 -217048 -407553 -507430 -172376 -34425 -171954 -275989 -285735 -140102 -538330
17233 -538330 -594344 -388795 32551 -6827 -74235 -102899 -112849 -49776 8621 -60573 -130908
17222 -130908 -213227 -314479 -304132 -274567 -279391 -353204 -303459 -233931 -231916 -253272 -340544 -313309
17210 -313309 -425112 -371447 -63904 68564 -20001 -130116 -257827 -281582 -354218 -413007
$$ packed form
17286i8291L4795k20689o9973K66019J31748k06295k25519q4871J19957P5741
17276b77378M6206p7759o3274j206M4387j79947k51171m3157K00860P5697O2744
17265d63998K14813J39000o4091q2053n5609M5968J32993J51071M2741k51784
17255a90949n7663M7553J76676j042j44187R633J480o3105k5871K17066k3815
17244e4224l799j59025j90505r9877L35054J37951j37529j04035r746J45633l98228
17233e38330n6014K05549M21346l9378o7408k8664r950O3073N8397o9194p0335
17222a30908q2319j01252J0347K9565m824p3813M9745O9528K015k1356q7272K7235
17210c13309j11803N3665L07543J32468q8565j10115j27711k3755p2636n8789
$$ plain form
17200 -413007 -362173 -391611 -378368 -471502 -320154 -98850 -66606 -212659 -139000 26982 -104457
17189 -104457 -243797 -264637 -210386 -134410 -121137 -22488 -233341 -298302 -329506 -458053 -228638
17178 -228638 -87966 -114153 -221873 -224815 -62994 -81437 35706 181848 144269 -143669
17168 -143669 -293193 -275494 -287981 -238684 -125918 -74334 -129839 -314795 -511680 -417707 -179223
17157 -179223 -147588 -95670 78243 -8997 -15688 -55789 -102721 -234569 -155643 -35110 87773
17146 87773 48128 -266492 -288557 -396122 -425515 -340167 -277559 -228799 -370089 -374498 -321741
17135 -321741 -259084 -232727 -326426 -453844 -401758 -160860 -42200 113324 309050 161075
17125 161075 -126909 -217089 -245333 -217669 -212997 -300686 -117176 67195 129745 109760 76612
$$ packed form
17200d13007N0834k9438J3243r3134J51348K21304L2244j46053P3659J65982j31439
17189a04457j39340k0840N4251P5976J3273R8649k10853o4961l1204j28547K29415
17178b28638J40672k6187j07720k942J61821j8443J17143J46142l7579k87938
17168a43669j49524J7699j2487M9297J12766N1584n5505j84956j96885R3973K38484
17157a79223L1635N1918J73913q7240o691m0101m6932j31848P8926J20533J22883
17146H7773l9645l14620k2065j07565k9393Q5348O2608M8760j41290m409N2757
17135c21741O2657K6357r3699j27418N2086K40898J18660J55524J95726j47975
17125A61075k87984r0180k8244K7664M672q7689J83510J84371O2550j9985l3148
$$ plain form
17114 76612 110341 -68661 -238334 -488328 -749073 -570429 -375361 -342891 -334944 -349908 -247794
17103 -247794 -124597 -229382 -188058 -46376 -3001 15653 12319 119926 -5054 -147798
17093 -147798 -256407 -296686 -321317 -314569 -529148 -793609 -716124 -597384 -492270 -530882 -579470
17082 -579470 -481644 -459459 -440708 -466193 -500855 -504875 -493034 -332706 -188508 -2804 -127359
17071 -127359 -113924 -10837 -54338 -147216 -126582 -255227 -311921 -139432 -196139 -473637 -551435
17060 -551435 -441906 -226726 -289508 -342716 -323704 -338986 -394526 -391912 -135546 -58186 -285503
17049 -285503 -487053 -583830 -579381 -564513 -542843 -488510 -379402 -399476 -470049 -473025 -459764
17038 -459764 -516640 -424780 -271120 -325557 -505661 -635725 -499321 -258251 -358108 -543677
$$ packed form
17114G6612L3729j79002j69673k49994k60745J78644J95068L2470P947j4964J02114
17103b47794J23197j04785M1324J41682M3375J8654l334J07607j24980j42744
17093a47798j08609m0279k4631O748k14579k64461P7485J18740J05114l8612m8588
17082e79470R7826K2185J8751k5485l4662m020J1841J60328J44198J85704j24555
17071a27359J3435J03087m3501r2878K0634j28645n6694J72489n6707k77498p7798
17060e51435J09529K15180o2782n3208J9012j5282n5540K614K56366P7360k27317
17049b85503k01550r6777M449J4868K1670N4333J09108k0074p0573k976J3261
17038d59764n6876R1860J53660n4437j80104j30064J36404K41070r9857j85569
$$ plain form
17028 -543677 -601156 -469868 -71349 222001 131309 -173028 -101385 -141289 -254296 -308129
17018 -308129 -284265 -326576 -277729 55146 -172424 -381740 -558668 -633457 -497322 -515774
17008 -515774 -567484 -501342 -448785 -152624 -179808 -338037 -303458 -341987 -487466 -483831 -442617
16997 -442617 -261537 -214008 -264498 -198119 -67630 -239392 -355964 -329215 -291130 -100222
16987 -100222 15227 25545 -91653 -127526 -149031 -165810 -99643 -145030 -266762 -198380 -84031
16976 -84031 -221048 -178276 -91207 -230940 -146296 -54154 -20575 26504 7350 -57312 55305
16965 55305 121050 -42811 -79863 -48828 -191610 -221149 -149539 -108150 -166204 -178561 -218664
16954 -218664 -127570 -172628 -274965 -231943 -445999 -369075 -323526 -265468 -210734 -400217 -445640
$$ packed form
17028e43677n7479J31288L98519K93350r0692l04337P1643l9904j13007n3833
17018c08129K3864m2311M8847L32875k27570k09316j76928p4789J36135j8452
17008e15774n1710O6142N2557K96161k7184j58229L4579l8529j45479L635M1214
16997d42617J81080M7529n0490O6379J30489j71762j16572K6749L8085J90908
16987a00222J15449J0318j17198l5873k1505j6779O6167m5387j21732O8382J14349
16976h4031j37017M2772Q7069j39733Q4644R2142L3579M7079j9154o4662J12617
16965E5305O5745j63861l7052L1035j42782k9539P1610M1389n8054j2357m0103
16954b18664R1094m5058j02337M3022k14056P6924M5549N8058N4734j89483m5423
$$ plain form
16943 -445640 -557753 -473779 -407431 -443341 -559630 -653253 -680403 -592148 -355244 -223077 -104323
16932 -104323 -63894 -50059 -17868 -169219 -316388 -275078 -285808 -333808 -357088 -158883 4574
16921 4574 -101072 -326944 -249342 -326653 -451806 -362775 -493968 -485589 -499409 -411609 -529745
16910 -529745 -362106 -401615 -286738 -220916 -235719 -277806 -191140 -341358 -562460 -474085 -208049
16899 -208049 -75784 -86140 130350 121580 125899 166818 183123 278150 345919 158802 96696
16888 96696 114413 14420 -103826 -210098 -281098 -58013 -57762 -35588 108622 156726 1114
16877 1114 -152158 -213867 -279257 -50988 105864 -55154 -109179 1816 -59578 52467 -35713
16866 -35713 -293768 -285371 -27217 66025 -97278 -169956 -94016 -13763 48432 -117502 -96384
$$ packed form
16943d45640j12113Q3974O6348l5910j16289r3623k7150Q8255K36904J32167J18754
16932a04323M0429J3835L2191j51351j47169M1310j0730m8000k3280J98205J63457
16921D574j05646k25872P7602p7311j25153Q9031j31193Q379j3820Q7800j18136
16910e29745J67639l9509J14877O5822j4803m2087Q6666j50218k21102Q8375K66036
16899b08049J32265j0356K16490q770M319M0919J6305R5027O7769j87117o2106
16888I6696J7717r9993j18246j06272p1000K23085K51K2174J44210M8104j55612
16877A114j53272o1709o5390K28269J56852j61018n4025J10995o1394J12045q8180
16866c5713k58055Q397K58154R3242j63303p2678P5940Q0253O2195j65934K1118
$$ plain form
16855 -96384 -190682 -167641 -190818 -26167 88519 91158 -78724 79965 -37441 -12492 95369
16844 95369 -26911 -78690 -56991 -66823 31550 -54421 -132486 -169552 -187061 -308363 -116912
16833 -116912 -20858 -143316 -374384 -549344 -474924 -296265 -248509 -242123 -254021 -367677 -219289
16822 -219289 -168952 -5429 17363 -25815 -90497 77117 203277 -28972 -263876 -338752
16812 -338752 -245844 -196699 -309562 -450496 -471230 -517984 -412148 -287868 -309298 -313565 -327943
16801 -327943 -269298 -280236 -285380 -286585 -294235 -239726 -121965 -4790 -228461 -262101 -284724
16790 -284724 -210221 -132402 -136584 -191661 -112502 -93435 65277 145901 141066 56830 -42736 -114434
16778 -114434 -33102 -161614 -63911 -85270 -97261 -149486 -227621 -140489 -115815 -112797 50143
$$ packed form
16855i6384r4298K3041k3177J64651J14686K639j69882J58689j17406K4949J07861
16844I5369j22280n1779K1699r832R8373q5971p8065l7066j7509j21302J91451
16833a16912R6054j22458k31068j74960P4420J78659M7756O386j1898j13656J48388
16822b19289N0337J63523K2792m3178o4682J67614J26160k32249k34904p4876
16812c38752R2908M9145j12863j40934k0734m6754J05836J24280k1430m267j4378
16801c27943N8645j0938n144j205p650N4509J17761J17175k23671l3640k2623
16790b84724P4503P7819m182n5077P9159J9067J58712Q0624m835q4236r9566p1698
16778a14434Q1332j28512R7703k1359j1991n2225p8135Q7132K4674L018J62940
$$ plain form
16767 50143 78082 -53560 -47879 -167809 -225350 -280885 -326679 -293337 -274183 -296434 -217223
16756 -217223 -392900 -329860 -211367 -513326 -348530 -365761 -151264 -103862 -107782 -162759 -139925
16745 -139925 -55492 -350487 -631178 -647957 -636400 -277261 -57339 -199480 -531732 -773565
16735 -773565 -717483 -731532 -425544 -233799 -197062 46523 -123256 -154111 -224488 -334780
16725 -334780 -166801 -33868 -106211 -69681 54009 -111229 -257488 -487686 -361298 -419113
16715 -419113 -442860 -191925 -128149 -411794 -608921 -630580 -573334 -408647 -295367 -76050
16705 -76050 95407 225630 145358 28076 -154122 -273820 -269108 -293515 -115116 101655
16695 101655 186125 156588 124856 32591 -33166 48859 -30778 -98900 -271441 -376858 -422385
$$ packed form
16767E0143K7939j31642N681j19930n7541n5535m5794L3342J9154k2251P9211
16756b17223j75677O3040J18493l01959J64796j7231K14497M7402l920n4977K2834
16745a39925Q4433k94995k80691j6779J1557L59139K19922j42141l32252k41833
16735g73565N6082j4049L05988J91745L6737K43585j69779l0855p0377j10292
16725c34780J67979J32933p2343L6530J23690j65238j46259k30198J26388n7815
16715d19113k3747K50935O3776k83645j97127k1659N7246J64687J13280K19317
16705g6050J71457J30223q0272j17282j82198j19698M712k4407J78399K16771
16695A01655Q4470k9537l1732r2265o5757Q2025p9637o8122j72541j05417m5527
$$ plain form
16684 -422385 -264827 -348410 -195498 -115758 -183606 -246051 -206197 -37375 53424 94524 33351
16673 33351 43324 62960 2664 -1569 -163836 -223456 -228073 -429585 -272921 -160196 -304406
16662 -304406 -366021 -292817 -245434 -304386 -338186 -378006 -268329 -412455 -467199 -426551 -257907
16651 -257907 -259903 -257381 -246075 -77659 -84706 -75303 45525 72378 118016 -22584 20445 -235357
16639 -235357 -518056 -591436 -564815 -249679 -124125 -132104 -72732 -310576 -477527 -290244
16629 -290244 -310304 -601411 -404156 -220588 -346546 -431236 -299974 -335715 -111442 79657
16619 79657 4283 -11836 -186003 -111620 -95331 -116375 -238871 -135415 64252 265391 259509
16608 259509 112813 -165599 -170003 -326703 -478269 -302570 -44989 -107863 -95886 -168665
$$ packed form
16684d22385J57558q3583J52912P9740o7848o2445L9854J68822R0799M1100o1173
16673C3351R973J9636o0296m233j62267n9620m617k01512J56664J12725j44210
16662c04406o1615P3204M7383n8952l3800l9820J09677j44126n4744M0648J68644
16651b57907j996K522J1306J68416p047R403J20828K6853M5638j40600M3029k55802
16639b35357k82699p3380K6621L15136J25554p979N9372k37844j66951J87283
16629b90244k0060k91107J97255J83568j25958q4690J31262l5741K24273J91099
16619G9657p5374j6119j74167P4383J6289k1044j22496J03456J99667K01139n882
16608B59509j46696k78412m404j56700j51566J75699K57581o2874J1977p2779
$$ plain form
16598 -168665 -280962 -477052 -558614 -278492 927 -221508 -472425 -500190 -374133 -302396
16588 -302396 -362250 -380532 -191484 -229124 -198887 -120561 -200944 -354299 -277590 -155370 -537
16577 -537 64320 108519 77039 -262868 -446998 -525682 -442081 -382915 -452231 -312935 -143813
16566 -143813 -97261 -41030 -83262 -207023 -222448 -244043 -284604 -186844 -348965 -261057 -318517
16555 -318517 -320368 -457253 -393315 -98990 -114684 -142858 -280834 -276891 -221288 -81351 -164775
16544 -164775 -350181 -271578 -161836 -261343 -275060 -300162 -251311 -347317 -363349 -243881 -142492
16533 -142492 152813 168302 -18710 -44679 -23734 -168806 -399156 -439165 -449891 -409383 -366249
16522 -366249 -243492 -99374 -197654 -203991 -199835 -225383 -393493 -324181 -220472 -257004 -579596
$$ packed form
16598a68665j12297j96090q1562K80122K79419k22435k50917k7765J26057P1737
16588c02396n9854j8282J89048l7640L0237P8326q0383j53355P6709J22220J54833
16577e37O4857M4199l1480l39907j84130p8684Q3601N9166o9316J39296J69122
16566a43813M6552N6231m2232j23761j5425k1595m0561R7760j62121Q7908n7460
16555c18517j851j36885O3938K94325j5694k8174j37976L943N5603J39937q3424
16544a64775j85406P8603J09742r9507j3717k5102M8851r6006j6032J19468J01389
16533a42492K95305J5489j87012k5969K0945j45072k30350m0009j0726M0508M3134
16522c66249J22757J44118r8280o337M156k5548j68110O9312J03709l6532l22592
$$ plain form
16511 -579596 -617526 -394992 -50946 -113988 -167397 140361 117122 -180921 -354715 -283994
16501 -283994 -392318 -352769 -220793 -241088 -185789 -233113 -287154 -173780 -107474 -91987 -146802
16490 -146802 -21084 -16438 -147150 -143933 -280849 -365344 -365595 -143075 -143151 -44357 202748 289882
16478 289882 107375 -86185 -119122 -61307 -56037 110835 57284 -113622 -56206 -100478 -222235
16467 -222235 -114382 -197494 -366566 -451984 -404252 -448205 -445571 -553945 -391909 -280788 -211602
16456 -211602 -331409 -147707 -177753 -240711 -283948 -117247 -249561 -218092 -200771 -242789 -248725
16445 -248725 -232401 -140265 249873 390866 277809 5137 -268934 -415140 -294428 -59868
16435 -59868 40138 -14930 -137107 -40015 41542 -48572 -112760 -103240 116351 29907 -22185
$$ packed form
16511e79596l7930K22534L44046o3042n3409L07758k3239k98043j73794P0721
16501b83994j08324L9549J31976k0295N5299m7324n4041J13374O6306J5487n4815
16490a46802J25718M646j30712L217j36916q4495k51K22520p6R8794K47105Q7134
16478B89882j82507j93560l2937N7815N270J66872n3551j70906N7416m4272j21757
16467b22235J07853q3112j69072q5418M7732m3953K634j08374J62036J11121O9186
16456b11602j19807J83702l0046o2958m3237J66701j32314L1469J7321m2018n936
16445b48725J6324R2136L90138J40993j13057k72672k74071j46206J20712K34560
16435e9868J00006n5068j22177R7092Q1557r0114o4188R520K19591q6444n2092
$$ plain form
16424 -22185 87445 222792 248982 138379 -95155 -93289 -78335 -214659 -387626 -338921 -337102
16413 -337102 -440355 -334338 61419 22495 -200959 -143365 -181565 -154342 -103130 -304659
16403 -304659 -232205 -228008 -299593 -175758 -137207 -135070 -25144 78400 -55270 -49731 116391
16392 116391 144022 24600 47548 -20725 -109931 -303761 -337901 -304231 -126274 151462 154038
16381 154038 316752 140328 16903 -111631 -73548 -110000 -58416 43623 53387 -54108
16371 -54108 -249125 -166023 -251097 -207566 -129431 -211812 -203146 -322468 -402215 -277284 -221007
16360 -221007 -237579 -345611 -400667 -372100 -141038 -163827 -237187 -347533 -283287 -110505 75442
16349 75442 285118 308100 143714 -143399 -113742 42986 72827 -63151 -286830 -319751
$$ packed form
16424b2185J09630J35347K6190j10603k33534J866J4954j36324j72967M8705J819
16413c37102j03253J06017L95757l8924k23454N7594l8200K7223N1212k01529
16403c04659P2454M197p1585J23835L8551K137J09926J03544j33670N539J66122
16392A16391K7631j19422K2948o8273q9206j93830l4140L3670J77957K77736K576
16381A54038J62714j76424j23425j28534L8083l6452N1584J02039R764j07495
16371e4108j95017Q3102q5074M3531P8135q2381Q666j19322p9747J24931N6277
16360b21007j6572j08032n5056K8567K31062k2789p3360j10346O4246J72782J85947
16349G5442K09676K2982j64386k87113K9657J56728K9841j35978k23679l2921
$$ plain form
16339 -319751 -459719 -396484 -234732 -170814 55830 163952 226370 204426 -43786 -366223
16329 -366223 -323273 -188614 -269574 -323375 -274572 -125309 -94401 -147453 23863 75569 100861
16318 100861 3896 -160229 -282202 -486096 -419856 -335421 -495084 -453395 -364052 -354518 -305493
16307 -305493 -153353 -195151 -176431 -60020 58547 173292 174814 33852 -193808 -186099 -39017
16296 -39017 67568 2625 142378 118104 33723 -161715 -66600 48257 -32566 -159687 -320337
16285 -320337 -295372 -428072 -494907 -507867 -339059 -249151 -358150 -349505 -439460 -337805 -62221
16274 -62221 12913 76813 20726 -176670 -117375 -10983 -69357 -70041 -266508 -329579 -319130
16263 -319130 -511044 -709013 -912751 -983173 -932668 -595303 -301476 -199369 -334740 -411598
$$ packed form
16339c19751j39968O3235J61752O3918K26644J08122O2418k1944k48212l22437
16329c66223M2950J34659q0960n3801M8803J49263L0908n3052J71316N1706K5292
16318A00861r6965j64125j21973k03894O6240Q4435j59663M1689Q9343R534M9025
16307c05493J52140m1798J8720J16411J18567J14745J522j40962k27660P709J47082
16296c9017J06585o4943J39753k4274q4381j95438R5115J14857q0823j27121j60650
16285c20337K4965j32700o6835j2960J68808Q9908j08999Q645q9955J01655K75584
16274f2221P5134O3900n6087j97396N9295J06392n8374o84j96467o3071J0449
16263c19130j91914j97969k03738p0422N0505L37365K93827J02107j35371p6858
$$ plain form
16253 -411598 -346030 -418699 -353100 -230259 -48868 146275 302213 170412 -192273 -339671
16243 -339671 -371281 -227984 -87503 -280825 -382226 -517356 -387177 -232260 -226626 -270938
16233 -270938 -154397 -230280 -289474 -225423 -195669 -63762 -159576 -333572 -538585 -403765
16223 -403765 -221091 -139810 -52478 -151302 -75509 -62469 73003 -65079 -212931 -360637
16213 -360637 -189684 -17097 -176792 -276231 -291638 -395377 -337778 -332430 -309677 -347124 -343496
16202 -343496 -266154 140135 224689 35648 -54249 -159702 -126020 -123367 -60404 -39180 -58829
16191 -58829 7582 159892 73861 -51252 -416895 -439187 -325882 -128127 35514 74690
16181 74690 -40717 -164244 -306284 -346483 -390911 -428856 -330763 -352021 -133863 -174033 -172680
$$ packed form
16253d11598O5568p2669O5599J22841J81391J95143J55938j31801l62685j47398
16243c39671l1610J43297J40481j93322j01401j35130J30179J54917N634m4312
16233b70938J16541p5883n9194O4051K9754J31907r5814j73996k05013J34820
16223d03765J82674Q1281Q7332r8824P5793J3040J35472j38082j47852j47706
16213c60637J70953J72587j59695r9439j5407j03739N7599N348K2753l7447L628
16202c43496P7342M06289Q4554j89041q9897j05453L3682K653O2963K1224j9649
16191e8829O6411J52310q6031j25113l65643k2292J13305J97755J63641L9176
16181G4690j15407j23527j42040m0199m4428l7945R8093k1258K18158m0170J353
$$ plain form
16170 -172680 -167307 -284915 -419255 -278229 -158568 -173512 -360599 -238750 -69011 -96507
16160 -96507 -21347 -49676 19774 -109020 -362436 -427173 -475832 -427020 -318230 -373210 -428474
16149 -428474 -482404 -485716 -218446 -287533 -364320 -381829 -314713 -316535 -309744 -313406 -263180 -51329
16137 -51329 31121 -127621 -174415 -111471 -280412 -287513 -208404 64004 212792 208110 256973
16126 256973 285165 196027 198054 125591 101664 -35861 -191550 -262924 -299778 -216530 -178589
16115 -178589 -107920 -215357 -208017 -295995 -587089 -591944 -337188 -253919 -210422 -42573 111391
16104 111391 256961 221437 263841 177723 -104132 -116986 108780 24233 -189270 -166821 -194542
16093 -194542 -154116 -221485 -341187 -330247 -174353 -69338 33667 752 15580 17625 -92276
$$ packed form
16170a72680N373j17608j34340J41026J19661j4944j87087J21849J69739k7496
16160i6507P5160k8329O9450j28794k53416o4737m8659M8812J08790n4980n5264
16149d28474n3930l312K67270o9087p6787j7509O7116j822O791l662N0226K11851
16137e1329Q2450j58742m6794O2944j68941p101P9109K72408J48788m682M8863
16126B56973K8192q9138K027p2463k3927j37525j55689p1374l6854Q3248L7941
16115a78589P0669j07437P340q7978k91094m855K54756Q3269M3497J67849J53964
16104A11391J45570l5524M2404q6118k81855j2854K25766q4547k13503K2449k7721
16093a94542M0426o7369j19702J0940J55894J05015J03005l2915J4828K045j09901
$$ plain form
16082 -92276 -205775 -173240 92874 191268 203128 166954 46791 -119275 -303934 -175740
16072 -175740 -2294 -198383 -477293 -318196 -294459 -175866 -184034 -190739 -212213 -403371 -394921
16061 -394921 -438971 -280265 -187916 -137353 -22095 3258 139359 248297 231710 199165 126184
16050 126184 36988 145113 -42131 45730 95127 -121425 -113948 111542 128146 60623 21011
16039 21011 154675 164088 74080 -42002 -92006 -113719 -199061 -191629 -194101 -12895 27169 6607
16027 6607 -13533 -201962 -244948 -255018 -163147 -121144 35294 -107785 -82572 74829 5747
16016 5747 -10166 12757 -128101 -256796 -257968 -302700 -151095 -108367 -213705 -196497 -187591
16005 -187591 -221045 -412811 -389187 -250066 -288375 -166711 -13876 120405 114874 67426 -44426
$$ packed form
16082i2276j13499L2535K66114R8394J1860l6174j20163j66066j84659J28194
16072a75740J73446j96089k78910J59097K3737J18593q168o705k1474j91158Q450
16061c94921m4050J58706R2349N0563J15258K5353J36101J08938j6587l2545p2981
16050A26184q9196J08125j87244Q7861M9397k16552P477K25490J6604o7523l9612
16039B1011J33664R413r0008j16082n0004k1713q5342P432k472J81206M0064k0562
16027F607k0140j88429m2986j0070R1871M2003J56438j43079K5213J57401o9082
16016E747j5913K2923j40858j28695j172m4732J51605M2728j05338J7208Q906
16005a87591l3454j91766K3624J39121l8309J21664J52835J34281n531m7448j11852
$$ plain form
15994 -44426 -83070 -78320 -136576 -125991 -143255 119025 103357 27042 289542 237280 116845
15983 116845 68201 61721 112211 -101710 -198260 -116313 -151667 -114225 -138015 -137413 125739 187582
15971 187582 -75636 -114270 -61254 -16144 -49716 -203133 -108611 -22104 -24902 -176401 -431267
15960 -431267 -288303 -37898 -162325 -379971 -429443 -153558 -135005 -120407 11602 -87810
15950 -87810 -238375 -187576 53397 46095 119176 82408 -139070 -386928 -481696 -371579 -329473
15939 -329473 -257383 -233841 -331850 -232981 -143077 -169258 -110407 -305138 -351069 -324660 -126761
15928 -126761 -175430 -159178 -106053 -331618 -497602 -564934 -418376 -233583 -150423 -63552 -2384
15917 -2384 46081 -151833 -234034 -127210 -117761 -54934 -134570 -103400 173364 46423 -96361
$$ packed form
15994d4426l8644M750n8256J0585j7264K62280j5668p6315K62500n2262j20435
15983A16845m8644o480N0490k13921r6550Q1947l5354L7442k3790O02K63152O1843
15971A87582k63218l8634N3016M5110l3572j53417R4522Q6507k798j51499k54866
15960d31267J42964K50405j24427k17646m9472K75885J8553J4598J32009r9412
15950h7810j50565N0799K40973p302P3081l6768k21478k47858r4768J10117M2106
15939c29473P2090K3542r8009R8869Q9904k6181N8851j94731m5931K6409J97899
15928a26761m8669J6252N3125k25565j65984o7332J46558J84793Q3160Q6871O1168
15917b384M8465j97914q2201J06824R449O2827p9636L1170K76764j26941j42784
$$ plain form
15906 -96361 -196535 -213365 -75901 164063 -46976 -338385 -538240 -395167 -270047 -296115
15896 -296115 -306809 -117039 56155 -28217 -310991 -362635 -424036 -297344 -233900 -391714
15886 -391714 -260575 -104709 -138558 -55185 -157963 -301656 -405341 -539958 -380400 -261848
15876 -261848 -205605 -256643 -27647 295505 464352 349218 186079 179186 248819 280305 157565
15865 157565 124027 275314 210495 115127 -60932 -6041 -55328 68868 116894 22121 10122
15854 10122 305716 217667 80933 -106184 -210832 -190508 -323670 -412601 -196179 114310
15844 114310 354675 290073 141559 -66210 11419 135759 299949 156220 -172236 -199007
15834 -199007 -203599 -17706 -42727 123033 183256 43752 25512 -144409 -185778 -193528 -90610
$$ packed form
15906i6361j00174j6830J37464K39964k11039k91409j99855J43073J25120k6068
15896b96115j0694J89770J73194q4372k82774n1644o1401J26692O3444j57814
15886c91714J31139J55866l3849Q3373j02778j43693j03685j34617J59558J18552
15876b61848N6243n1038K28996L23152J68847j15134j63139o893O9633L1486j22740
15865A57565l3538J51287o4819r5368j76059N4891m9287J24196M8026r4773j1999
15854A0122K95594q8049j36734j87117j04648K0324j33162q8931K16422L10489
15844A14310K40365o4602j48514k07769P7629J24340J64190j43729l28456k6771
15834a99007m592J85893k5021J65760O0223j39504j8240j69921m1369p750J02918
$$ plain form
15823 -90610 -23557 -114605 119052 118264 88348 82438 17912 14812 -33722 -45702 -104359 -121070
15811 -121070 66387 118653 -173842 -193448 -122425 -147496 -283888 -139957 25343 80959
15801 80959 79986 6583 -73593 -143508 -67126 -120654 -186954 -233228 -276924 -429115 -469214 -226124
15789 -226124 -253230 -320913 -236725 -230362 -317881 -334085 -227608 -257262 -193177 -129697 -31837
15778 -31837 -221209 -363019 -202721 48429 174004 96319 75405 145495 148966 201218 304570
15767 304570 284131 197610 142588 122115 -12919 -155373 -173812 -172862 -172333 -274507 -60280
15756 -60280 163933 54511 -247603 -308507 -313261 -223950 -49058 109082 96416 153031 295583
15745 295583 396296 451451 429161 347035 341573 164265 87324 129080 106769 -71182 -51737
$$ packed form
15823i0610O7053r1048K33657p88k9916n910o4526l100m8534j1980n8657j6711
15811a21070J87457N2266k92495j9606P1023k5071j36392J43931J65300N5616
15801H0959r73p3403q0176o9915P6382n3528o6300m6274m3696j52191m0099K43090
15789b26124k7106o7683Q4188O363q7519j6204J06477k9654O4085O3480R7860
15778c1837j89372j41810J60298K51150J25575p7685k0914P0090L471N2252J03352
15767C04570k0439q6521n5022k0473j35034j42454j8439R50N29j02174K14227
15756f0280K24213j09422l02114o0904m754Q9311J74892J58140j2666N6615J42552
15745B95583J00713N5155k2290q2126n462j77308p6941M1756k2311j77951J9445
$$ plain form
15734 -51737 -117550 -221702 -292122 -170724 16273 194515 395463 467254 203449 189204
15724 189204 138658 157515 39690 129032 118732 199022 21876 -287866 -426696 -322867
15714 -322867 -336664 -416024 -584180 -507733 -366851 -247942 -229336 -216548 -141394 -167913 -264609
15703 -264609 -300917 -263635 -547906 -394128 -235403 -57167 -82648 -82009 -152409 -14977 49027
15692 49027 -14625 -57426 -11534 55830 155825 148413 80324 -231890 -213348 -39134 107195
15681 107195 -22814 -101572 -272308 -286282 -152475 -318201 -502259 -447763 -507255 -291635
15671 -291635 -73021 -279915 -255322 -56150 32471 135327 196127 226630 -46352 25718
15661 25718 -42418 -152435 -176114 -126477 -149643 -15520 -135466 -78535 20287 242695 267086
$$ packed form
15734e1737o5813j04152p0420J21398J86997J78242K00948P1791k63805j4245
15724A89204n0546J8857j17825Q9342j0300Q0290j77146l09742j38830J03829
15714c22867j3797p9360j68156P6447J40882J18909J8606J2788P5154k6519r6696
15703b64609l6308L7282k84271J53778J58725J78236k5481O39p0400J37432O4004
15692D9027o3652m2801M5892O7364R9995p412o8089l12214J8542J74214J46329
15681A07195j30009p8758j70736j3974J33807j65726j84058N4496n9492K15620
15671b91635K18614k06894K4593J99172Q8621J02856O0800L0503k72982P2070
15661B5718o8136j10017k3679M9637k3166J34123j19946N6931R8822K22408K4391
$$ plain form
15650 267086 -46515 -176247 -177814 -10755 120021 71653 -111684 -22578 -107006 -69194 154716
15639 154716 230596 254300 202905 263042 301985 259308 207297 169186 -104689 -249898 -217092
15628 -217092 -213100 -262923 -241100 -167407 -122641 -215172 -31191 222838 302672 220810 221867
15617 221867 116815 -1397 79668 45628 47169 -68448 -244336 -320517 -291534 -374486 -330979
15606 -330979 -125128 -11912 -260220 -295166 -248065 -250207 -76178 -74552 -97718 17379 80690
15595 80690 -54909 -95592 -237988 -303293 -253693 -94733 15715 -103008 -292079 -269510
15585 -269510 -65066 124820 94809 -43200 -67526 55929 -9939 -201306 -32986 44527
15575 44527 -24926 -22078 18730 61470 163903 92361 -81536 -157545 -125547 -309030 -266875
$$ packed form
15650B67086l13601j29732j567J67059J30776m8368j83337Q9106q4428L7812K23910
15639A54716P5880K3704n1395O0137L8943m2677n2011l8111k73875j45209L2806
15628b17092L992m9823K1823P3693M4766r2531J83981K54029P9834q1862J057
15617B21867j05052j18212Q1065l4040J541j15617j75888p6181K8983q2952M3507
15606c30979K05851J13216k48308l4946M7101k142J74029J626k3166J15097O3311
15595H0690j35599m0683j42396o5305M9600J58960J10448j18723j89071K2569
15585b69510K04444J89886l0011j38009k4326J23455o5868j91367J68320P7513
15575D4527o9453K848M0808M2740J02433p1542j73897p6009L1998j83483M2155
$$ plain form
15564 -266875 -190590 -344341 -106348 -100592 -63333 -28513 -131935 -102938 -60477 -135026 -83138
15553 -83138 95865 32958 -27075 -66933 5092 -197513 -99917 -78561 -82539 -118739 -301427
15542 -301427 -317270 -324125 -388020 -537701 -196348 101694 373227 321969 234472 128138 127317
15531 127317 219334 61782 -70890 -54812 -103755 52876 22460 -25546 -102769 -151835 38439
15520 38439 51598 115568 104661 200560 349135 282979 134974 3411 -225492 -184381 -56799
15509 -56799 -70016 -327105 -406988 -149922 -35484 -3161 52941 73601 -15985 -109436 -276050
15498 -276050 -436394 -471184 -134179 -29825 -69838 -6545 -12830 -28691 70979 -40695 -20132
15487 -20132 -74307 -18919 186770 305410 291134 240706 169999 83665 -44747 -120531 478
$$ packed form
15564b66875P6285j53751K37993N756L7259L4820j03422K8997M2461p4549N1888
15553h3138J79003o2907o0033l9858P2025k02605R7596K1356l978l6200j82688
15542c01427j5843o855o3895j49681L41353K98042K71533n1258q7497j06334q21
15531A27317R2017j57552j32672J6078m8943J56631l0416m8006p7223m9066J90274
15520C8439J3159O3970j0907R5899J48575o6156j48005j31563k28903M1111J27582
15509e6799j3217k57089p9883K57066J14438L2323N6102K0660q9586r3451j66614
15498b76050j60344l4790L37005J04354m0013O3293o285j5861R9670j11674K0563
15487b0132n4175N5388K05689J18640j4276n0428p0707q6334j28412p5784J21009
$$ plain form
15476 478 23587 49981 -5391 -175371 -393351 -332837 -94026 21390 -85793 -259825 -4488
15465 -4488 197471 5843 -12928 -31106 54894 796 120351 95478 -39000 -99324 -100903
15454 -100903 -195887 -190183 -142896 -159392 -138593 -280524 -358951 -183582 -31434 53045 121637
15443 121637 140195 137551 112216 84475 -39433 -196307 -147178 8496 -102449 -338822 -122021
15432 -122021 366 -156710 -118106 89982 145081 291496 140613 63509 47585 67234
15422 67234 239951 198733 161910 150723 102683 67695 -60357 -133825 -49724 63995 217556
15411 217556 314143 337525 231775 262189 281093 226637 285180 112480 184942 142654 258776
15400 258776 319673 164018 128541 -92362 -87533 44366 9310 -7098 22713 95666 50201
$$ packed form
15476D78K3109K6394n5372j69980k17980O0514K38811J15416j07183j74032K55337
15465d488K01959j91628j8771j8178Q6000n4098J19555k4873j34478o0324j579
15454a00903r4984N704M7287j6496K0799j41931p8427J75369J52148Q4479O8592
15443A21637J8558k644k5335k7741j23908j56874M9129J55674j10945k36373K16801
15432a22021J22387j57076L8604K08088N5099J46415j50883p7104j5924J9649
15422F7234J72717m1218l6823j1187m8040l4988j28052p3468Q4101J13719J53561
15411B17556R6587K3382j05750L0414J8904n4456N8543j72700P2462m2288J16122
15400B58776O0897j55655l5477k20903M829J31899l5056j6408K9811P2953m5465
$$ plain form
15389 50201 -30189 -106308 -148327 -191893 -130609 -9170 46762 50932 187983 37698 -14879
15378 -14879 178397 17687 -139083 -253913 -481134 -552457 -279251 -252348 -264987 -269591 -191387
15367 -191387 -127944 -326317 -255628 -198003 -202446 -107587 43502 154950 18254 48257 182236
15356 182236 199365 285475 511736 665222 490060 254692 219426 268789 140553 117383
15346 117383 103160 173351 412283 538956 420614 219577 96039 229426 232692 391754
15336 391754 330719 54347 -75738 -158488 -141329 59928 2138 77069 164963 262002 337894
15325 337894 400289 297362 67957 69576 134836 255137 132854 160871 41738 157145
15315 157145 57898 -95864 -133582 -113508 -6839 -12143 67503 88244 530 -37591 40387
$$ packed form
15389E0201q0390p6119m2019m3566O1284J21439N5932M170J37051j50285n2577
15378a4879J93276j60710j56770j14830k27221p1323K73206K6903j2639m604P8204
15367a91387O3443j98373P0689N7625m443R4859J51089J11448j36696L0003J33979
15356A82236J7129Q6110K26261J53486j75162k35368l5266M9363j28236k3170
15346A17383j4223P0191K38932J26673j18342k01037j23538J33387L266J59062
15336C91754o1035k76372j30085q2750J7159K01257n7790P4931Q7894R7039P5892
15325C37894O2395j02927k29405J619O5260J20301j22283K8017j19133J15407
15315A57145r9247j53762l7718K0074J06669n304P9646K0741q7714l8121P7978
$$ plain form
15304 40387 184173 32842 87671 185904 105239 -33603 -36084 -254183 -138503 -28245 105876
15293 105876 59956 60082 231029 287437 187377 -96167 -278508 -196102 -158428 -50887 -56066
15282 -56066 -172343 -112014 -213660 -174745 66570 206226 271566 147743 99038 -240985
15272 -240985 -382361 -309998 16262 243086 79988 100928 202415 86389 13014 95107
15262 95107 97076 148480 232729 187505 -76514 -150391 -21323 46043 252305 290775 237987
15251 237987 -81402 59587 184480 344156 191878 34130 193399 261670 193860 35550
15241 35550 -180866 -53120 18791 187521 129523 -59231 -125204 -128044 70956 123791 275210
15230 275210 163911 -8603 -244612 -334525 -129981 -5726 203017 264922 309086 263104
$$ packed form
15304D0387J43786j51331N4829R8233q0665j38842k481k18099J15680J10258J34121
15293A05876m5920J26J70947N6408j00060k83544j82341Q2406L7674J07541n179
15282e6066j16277O0329j01646L8915K41315J39656O5340j23823m8705l40023
15272b40985j41376P2363L26260K26824j63098K0940J01487j16026p3375Q2093
15262I5107J969N1404Q4249m5224k64019p3877J29068O7366K06262L8470n2788
15251B37987l19389J40989J24893J59676j52278j57748J59269O8271o7810j58310
15241C5550k16416J27746P1911J68730n7998j88754o5973k840J99000N2835J51419
15230B75210j11299j72514k36009q9913K04544J24255K08743O1905M4164m5982
$$ plain form
15220 263104 386539 216933 218870 309621 291252 134033 -32108 -199250 -280071 -184749 53972
15209 53972 105796 75409 122454 98922 49263 38535 28431 -77649 -66382 -63680 -69968 96120
15197 96120 190147 223078 255912 197615 39744 112495 260695 376779 281070 142036 206478
15186 206478 322074 175215 186072 96254 131817 172314 132416 115454 65053 -20698 -26392
15175 -26392 -135134 -39341 -35027 -213629 -94982 5344 105687 -72625 -148983 -167135 -163847
15164 -163847 -104056 -145844 -224804 -110345 -75094 178975 313279 365635 413647 249019 44589
15153 44589 280372 291554 182172 215273 359584 236402 124826 216209 269264 188822 91136
15142 91136 260725 509674 412673 165492 268009 386672 395744 380879 389055 250527 312326
$$ packed form
15220B63104J23435j69606J937R0751j8369j57219j66141j67142q0821R5322K38721
15209E3972N1824l0387M7045k3532m9659j0728j0104j06080J1267K702o288J66088
15197I6120R4027L2931L2834n8297j57871P2751J48200J16084r5709j39034O4442
15186B06478J15596j46859J0857q9818L5563M0497l9898j6962n0401q5751n694
15175b6392j08742R5793M314j78602J18647J00326J00343j78312p6358j8152L288
15164a63847N9791m1788p8960J14459L5251K54069J34304N2356M8012j64628k04430
15153D4589K35783J1182j09382L3101J44311j23182j11576R1383N3055q0442r7686
15142I1136J69589K48949r7001k47181J02517J18663R072j4865Q176j38528O1799
$$ plain form
15131 312326 236655 155572 197327 293960 374440 192193 -46243 -229156 -217386 -285941 -320378
15120 -320378 -372578 -308813 -264884 -94702 50881 11023 3959 148137 208162 129690 -238777
15109 -238777 -174387 37875 -56529 -111548 -105056 -11073 -196961 -401681 -487094 -392273 -362664
15098 -362664 -263615 -121167 -90051 -15691 142691 72335 4816 30846 -189657 -261256 -43535
15087 -43535 25216 -14625 -116159 -317142 -342320 -182510 -168628 6919 228778 309740 368975
15076 368975 260162 146967 249187 425995 590692 672716 589235 463311 449436 271740
15066 271740 139623 134720 64778 47880 189067 374453 163121 -40 32020 270180
15056 270180 207086 179755 51643 -9783 7381 163789 95186 95046 257003 229664 255397
$$ packed form
15131C12326p5671q1083M1755R6633Q0480j82247k38436j82913J1770o8555l4437
15120c20378n2200O3765M3929J70182J45583l9858p064J44178O0025p8472l68467
15109b38777O4390K12262r4404n5019O492R3983j85888k04720q5413R4821K9609
15098c62664R9049J42448L1116P4360J58382p0356o7519K6030k20503p1599K17721
15087d3535O8751l9841j01534k00983k5178J59810J3882J75547K21859Q0962N9235
15076C68975j08813j13195J02220J76808J64697Q2024q3481j25924j3875j77696
15066B71740j32117m903o9942j6898J41187J85386k11332j63161L2060K38160
15056B70180o3094k7331j28112o1426J7164J56408o8603j40J61957k7339K5733
$$ plain form
15045 255397 101813 43058 -64616 92527 230906 101378 -80930 -50768 -187029 -163544
15035 -163544 45310 216220 166598 71799 -22158 26268 148291 49266 89300 96020 100982
15024 100982 4804 136455 140481 96692 -685 57685 298014 121570 -95907 -243980 -118509
15013 -118509 56747 61571 5390 -19073 -62131 -38896 161180 132185 205372 256758 153100
15002 153100 194982 219576 198621 246693 292834 439537 592093 566766 280549 -13569 116513
14991 116513 361092 351446 391422 413088 609356 490875 301760 162619 186707 201591 232594
14980 232594 25335 29029 -108809 -152068 -81195 71896 186573 71118 37120 -158928
14970 -158928 -276110 -132435 114099 36849 14073 -134119 -122748 15029 5150 144948
$$ packed form
15045B55397j53584n8755j07674J57143J38379j29528j82308L0162j36261K3485
15035a63544K08854J70910m9622r4799r3957M8426J22023r9025M0034O720M962
15024A00982r6178J31651M026m3789r7377N8370K40329j76444k17477j48073J25471
15013a18509J75256M824n6181k4463m3058K3235K00076k8995P3187N1386j03658
15002A53100M1882K4594k0955M8072M6141J46703J52556k5327k86217k94118J30082
14991A16513K44579r646L9976K1666J96268j18481j89115j39141K4088J4884L1003
14980B32594k07259L694j37838m3259P0873J53091J14677j15455l3998j96048
14970a58928j17182J43675K46534p7250k2776j48192J1371J37777r879J39798
$$ plain form
14960 144948 209095 317361 419065 523166 433091 229279 224491 163628 46123 -183461
14950 -183461 -12827 280425 245671 194438 383897 453801 304167 223508 399993 414477
14940 414477 210445 -287941 -210486 -126478 -208893 -168048 -213173 -133909 -109044 -62071 -40365
14929 -40365 39486 69219 18625 54681 266112 407274 347287 269072 424850 408846 346288
14918 346288 320174 152022 36655 148257 355457 356669 264394 199856 57406 -147472
14908 -147472 -217039 -147405 -5561 -63322 -48487 -98743 -150271 -8257 -13788 29936 131931
14897 131931 125816 72362 71951 92317 269983 284797 227601 108604 80281 58876 168439
14886 168439 269005 364470 183870 364432 407313 180775 71671 28261 -31267 67954
$$ packed form
14960A44948O4147J08266J01704J04101r0075k03812m788o0863j17505k29584
14950a83461J70634K93252l4754n1233J89459O9904j49634q0659J76485J4484
14940D14477k04032m98386P7455Q4008q2415M0845m5125P9264K4865M6973K1706
14929d0365P9851K9733n0594L6056K11431J41162n9987p8215J55778j6004o2558
14918C46288k6114j68152j15367J11602K07200J212r2275o4538j42450k04878
14908a47472o9567O9634J41844n7761J4835n0256n1528J42014n531M3724J01995
14897A31931o115n3454m11K0366J77666J4814n7196j18997k8323k1405J09563
14886A68439J00566R5465j80600J80562M2881k26538j09104m3410n9528R9221
$$ plain form
14876 67954 333650 537210 624779 553595 438668 246971 332100 472806 674803 752645
14866 752645 769851 634481 603735 369166 87642 22184 -187025 -170699 -7819 181530
14856 181530 295693 561402 513664 400698 411775 410212 280408 223453 299054 270335 172929
14845 172929 455860 661765 717749 588036 516475 342968 69660 213892 350166 259500
14835 259500 197338 208159 233346 279943 421640 522373 422429 414003 410014 385649 391097 414025
14823 414025 488849 382215 338037 562925 455423 248186 449046 472929 203608 258995
14813 258995 309391 331099 373747 310924 164790 26045 -131386 -140422 -339892 -124516 227706
14802 227706 376076 254721 63915 -36954 -79174 273080 436664 548521 608462 372121
$$ packed form
14876F7954K65696K03560Q7569p1184j14927j91697Q5129J40706K01997P7842
14866G52645J7206j35370l0746k34569k81524o5458k09209J6326J62880J89349
14856A81530J14163K65709m7738j12966J1077j563j29804n6955P5601k8719r7406
14845A72929K82931K05905N5984j29713p1561j73507k73308J44232J36274r0666
14835B59500o2162J0821K5187M6597J41697J00733r9944q426l989k4365N448K2928
14823D14025P4824j06634m4178K24888j07502k07237K00860K3883k69321N5387
14813B58995N0396K1708M2648o2823j46134j38745j57431r036j99470K15376L52222
14802B27706J48370j21355j90806j00869m2220L52254J63584J11857N9941k36341
$$ plain form
14792 372121 313217 170269 39873 -66202 -87242 -209268 56748 7025 2699 143069
14782 143069 165156 265412 286719 507769 466568 156900 341260 478561 287155 250665
14772 250665 108648 46318 201334 308057 206132 211092 1398 34242 74165 175459
14762 175459 297218 72665 2017 96979 117743 131988 207821 240818 135237 92965 117609
14751 117609 77178 164192 275735 364648 523321 442508 419013 502099 446716 371758 -8053
14740 -8053 -70072 104542 248137 317310 331303 165958 -19165 148654 121207 374405 623681
14729 623681 510823 355232 190961 241350 253665 77751 36640 101702 -107655 -42879
14719 -42879 -26914 191958 583895 604904 541314 468897 458808 532692 510932 489765 363987
$$ packed form
14792C72121n8904j42948j30396j06075k1040j22026K66016m9723m326J40370
14782A43069K2087J00256K1307K21050m1201l09668J84360J37301j91406l6490
14772B50665j42017o2330J55016J06723j01925M960k09694L2844L9923J01294
14762A75459J21759k24553p0648R4962K0764J4245P5833L2997j05581m2272K4644
14751A17609m0431Q7014J11543Q8913J58673q0813k3495Q3086n5383p4958l79811
14740h053o2019J74614J43595O9173J3993j65345j85123J67819k7447K53198K49276
14729F23681j12858j55591j64271N0389J2315j75914m1111O5062k09357O4776
14719d2879J5965K18872L91937K1009o3590p2417j0089P3884k1760k1167j25778
$$ plain form
14708 363987 360663 427752 534045 432591 458007 355825 181532 154550 146266 139363 341377
14697 341377 421194 352693 431539 171094 -24898 106504 174800 259681 163151 269577 277358
14686 277358 18681 60094 -44682 -35613 172935 356102 69938 81620 160072 249267 92086
14675 92086 -35014 8114 117478 -18851 -130269 -22670 50064 -45729 -174525 -91859
14665 -91859 84004 201697 196393 74398 -55597 34331 46949 158245 228031 319531 280008
14654 280008 485550 510693 375941 537351 573247 545601 482483 480031 609465 555002 445218
14643 445218 265565 297923 308843 338518 303390 358306 514902 746357 691930 385150 122755
14632 122755 95837 152461 356499 374249 377716 95145 42683 95612 74764 85193 191220
$$ packed form
14708C63987l324O7089J06293j01454K5416j02182j74293k6982q284o903K02014
14697C41377P9817o8501P8846k60445j95992J31402O8296Q4881r6530J06426P781
14686B77358k58677M1413j04776R069K08548J83167k86164J1682P8452Q9195j57181
14675I2086j27100M3128J09364j36329j11418J07599P2734r5793j28796Q2666
14665i1859J75863J17693n304j21995j29995Q9928J2618J11296O9786R1500l9523
14654B80008K05542K5143j34752J61410L5896k7646o3118k452J29434n4463j09784
14643D45218j79653L2358J0920K9675l5128N4916J56596K31455n4427l06780k62395
14632A22755k6918N6624K04038J7750L467k82571n2462N2929k0848J0429J06027
$$ plain form
14621 191220 101718 138022 107440 -12494 -78733 115689 240797 363385 374005 495575
14611 495575 377821 342493 460919 362504 422531 495583 532625 353054 485808 396688 328924
14600 328924 477372 461364 454783 510639 419998 286005 245349 191877 -53786 -77409 -79244
14589 -79244 148201 67232 103693 130067 314062 448855 421718 484389 559265 473938 300022
$$ packed form
14621A91220q9502L6304l0582j19934o6239J94422J25108J22588J0620J21570
14611D95575j17754l5328J18426r8415O0027P3052L7042j79571J32754q9120o7764
14600C28924J48448j6008o581N5856r0641j33993m0656n3472k45663k3623j835
14589g9244K27445q0969L6461K6374J83995J34793k7137O2671P4876q5327j73916
$$ [...]
##END NTUPLES=NMR SPECTRUM
##END=
