##TITLE=Analysis number 318320
Compound Code cc 25508
Project Code adrs
Chemist Name melford
##JCAMPDX= 6.0         $$ Bruker NMR JCAMP-DX V2.0
##DATA TYPE= NMR SPECTRUM
##DATA CLASS= NTUPLES
##ORIGIN= Bruker BioSpin GmbH
##OWNER= nmr
$$ XWIN-NMR		Version 3.5
$$ Thu Mar 23 10:46:23 2006 GMT Standard Time (UT+0h)  MAYBRIDGE\nmr@NMR_250MHZ
##.OBSERVE FREQUENCY= 250.131544655141
##.OBSERVE NUCLEUS= ^1H
##.ACQUISITION MODE= SIMULTANEOUS (DQD)
##.ACQUISITION SCHEME= undefined
##.AVERAGES= 16
##.DIGITISER RES= 18
##SPECTROMETER/DATA SYSTEM= dpx250
##.PULSE SEQUENCE= zg30
##.SOLVENT NAME= CDCl3
##.SHIFT REFERENCE= (INTERNAL, CDCl3, 0, 16.4462)
##AUDIT TRAIL= $$ (NUMBER, WHEN, WHO, WHERE, WHAT)
$$ ##TITLE= Audit trail, XWIN-NMR		Version 3.5
$$ ##JCAMPDX= 5.01
$$ ##ORIGIN= Bruker BioSpin GmbH
$$ ##OWNER= nmr
$$ C:\u/data/dgb/nmr/ADRS/1340/pdata/1/auditp.txt
$$ ##AUDIT TRAIL=  $$ (NUMBER, WHEN, WHO, WHERE, WHAT)
(   1,<2006-03-23 10:45:29.38 +000>,<MAYBRIDGE\nmr>,<NMR_250MHZ>,
      <created by zg, POWCHK disabled, PULCHK disabled
       configuration hash MD5:
       84 BC 41 DB A1 6E 1D 46 DA 25 12 A5 C1 ED C5 3A
       data hash MD5: 64K
       08 7F F0 3B 89 9C 19 66 01 8C 25 D8 F9 6D 2E 25>)
(   2,<2006-03-23 10:45:50.17 +000>,<MAYBRIDGE\nmr>,<NMR_250MHZ>,
      <Start of raw data processing
       ef LB = 0.3 FT_mod = 6 PKNL = 1 SI = 32K 
       data hash MD5: 32K
       9A 4D 47 55 96 C7 BC 30 52 1A 45 4A 2E 68 CB 8F>)
(   3,<2006-03-23 10:45:58.97 +000>,<MAYBRIDGE\nmr>,<NMR_250MHZ>,
      <apk 
       data hash MD5: 32K
       19 F2 FB 38 E4 FD 9E BC 4A 63 8A 9D E7 BD 63 EF>)
(   4,<2006-03-23 10:46:02.66 +000>,<MAYBRIDGE\nmr>,<NMR_250MHZ>,
      <abs ABSG = 5 
       data hash MD5: 32K
       32 71 48 C0 C4 FA AE FD 7C 6C 2D C4 62 59 84 B3>)
$$ ##END=
$$ 
$$ hash MD5
$$ 86 D5 27 07 6C 2E 43 12 67 FC 58 21 EB 66 C1 A7
##$RELAX= 
##$RELAX= 
##$RELAX= 
##$RELAX= 
##$RELAX= 
##$RELAX= 
##$RELAX= 
$$ Bruker specific parameters
$$ --------------------------
##$DU= <C:\u>
##$EXPNO= 1340
##$NAME= <ADRS>
##$PROCNO= 1
##$TYPE= <nmr>
##$USER= <dgb>
##$AMP= (0..31)
100 100 100 100 100 100 100 100 100 100 100 100 100 100 100 100 100 100 
100 100 100 100 100 100 100 100 100 100 100 100 100 100 
##$AQSEQ= 0
##$AQ_mod= 3
##$AUNM= <au_zg>
##$AUTOPOS= <15 >
##$BF1= 250.13
##$BF2= 250.13
##$BF3= 250.13
##$BF4= 250.13
##$BF5= 500.13
##$BF6= 500.13
##$BF7= 500.13
##$BF8= 500.13
##$BYTORDA= 1
##$CFDGTYP= 0
##$CFRGTYP= 5
##$CHEMSTR= <none>
##$CNST= (0..31)
1 1 145 1 1 1 1 1 1 1 1 1 1 1 1 1 1 1 1 1 1 1 1 1 1 1 1 1 1 1 1 1 
##$CPDPRG= <>
##$CPDPRG1= <>
##$CPDPRG2= <>
##$CPDPRG3= <>
##$CPDPRG4= <mlev>
##$CPDPRG5= <mlev>
##$CPDPRG6= <mlev>
##$CPDPRG7= <mlev>
##$CPDPRG8= <mlev>
##$CPDPRGB= <>
##$CPDPRGT= <>
##$D= (0..31)
0 1 0 0 0 0 0 0 0 0.06 0 0 0 0 0 0 0.0002 0 0 0 0 0 0 0 0 0 0 0 0 0 0 
0 
##$DATE= 1143110726
##$DBL= (0..7)
120 120 120 120 120 120 120 120 
##$DBP= (0..7)
150 150 150 150 150 150 150 150 
##$DBP07= 0
##$DBPNAM0= <>
##$DBPNAM1= <>
##$DBPNAM2= <>
$$ [...]
##$SUBNAM7= <"">
##$SUBNAM8= <"">
##$SUBNAM9= <"">
##$SW= 20.6930455092707
##$SWIBOX= (0..15)
0 0 3 0 0 0 0 0 0 0 0 0 0 0 0 0 
##$SW_h= 5175.983436853
##$TD= 65536
##$TD0= 1
##$TE= 293.16
##$TE2= 300
##$TE3= 300
##$TEG= 300
##$TL= (0..7)
0 120 120 120 120 120 120 120 
##$TP= (0..7)
150 150 150 150 150 150 150 150 
##$TP07= 0
##$TPNAME0= <>
##$TPNAME1= <>
##$TPNAME2= <>
##$TPNAME3= <>
##$TPNAME4= <>
##$TPNAME5= <>
##$TPNAME6= <>
##$TPNAME7= <>
##$TPOAL= (0..7)
0.5 0.5 0.5 0.5 0.5 0.5 0.5 0.5 
##$TPOFFS= (0..7)
0 0 0 0 0 0 0 0 
##$TUNHIN= 0
##$TUNHOUT= 0
##$TUNXOUT= 0
##$USERA1= <user>
##$USERA2= <user>
##$USERA3= <user>
##$USERA4= <user>
##$USERA5= <user>
##$V9= 5
##$VALIST= <valist>
##$VCLIST= <CCCCCCCCCCCCCCC>
##$VD= 0
##$VDLIST= <DDDDDDDDDDDDDDD>
##$VPLIST= <PPPPPPPPPPPPPPP>
##$VTLIST= <TTTTTTTTTTTTTTT>
##$WBST= 1024
##$WBSW= 4
##$XGAIN= (0..3)
0 0 0 0 
##$XL= 0
##$YL= 0
##$YMAX_a= 252256
##$YMIN_a= -340295
##$ZGOPTNS= <>
##$ZL1= 120
##$ZL2= 120
##$ZL3= 120
##$ZL4= 120
##$ABSF1= 16.44618
##$ABSF2= -4.246992
##$ABSG= 5
##$ABSL= 3
##$ALPHA= 0
##$AQORDER= 0
##$ASSFAC= 0
##$ASSFACI= 0
##$ASSFACX= 0
##$ASSWID= 0
##$AUNMP= <proc_1d>
##$AZFE= 0.1
##$AZFW= 0.1
##$BCFW= 0
##$BC_mod= 0
##$BYTORDP= 0
##$COROFFS= 0
##$CY= 12.5
##$DATMOD= 1
##$DC= 0
##$DFILT= <>
##$DTYPP= 0
##$F1P= 14.0000005364418
##$F2P= -0.99999901652339
##$FCOR= 0.5
##$FTSIZE= 32768
##$FT_mod= 6
##$GAMMA= 0
##$GB= 0
##$INTBC= 1
##$INTSCL= 1
##$ISEN= 128
##$LB= 0.3
##$LEV0= 0
##$LPBIN= 0
##$MAXI= 10000
##$MC2= 0
##$MEAN= 0
##$ME_mod= 0
##$MI= 0
##$NCOEF= 0
##$NC_proc= -4
##$NLEV= 6
##$NOISF1= 0
##$NOISF2= 0
##$NSP= 0
##$NTH_PI= 0
##$NZP= 0
##$OFFSET= 16.44618
##$PC= 1
##$PHC0= 175.6634
##$PHC1= 9.472404
##$PH_mod= 1
##$PKNL= yes
##$PPARMOD= 0
##$PSCAL= 4
##$PSIGN= 0
##$REVERSE= no
##$SF= 250.130018962771
##$SI= 32768
##$SIGF1= 0
##$SIGF2= 0
##$SINO= 400
##$SIOLD= 32768
##$SREGLST= <1H.CDCl3>
##$SSB= 0
##$STSI= 32768
##$STSR= 0
##$SW_p= 5175.98343685301
##$SYMM= 0
##$S_DEV= 0
##$TDeff= 65536
##$TDoff= 0
##$TI= <Analysis number 999999
Compound Code 99
Book Reference 9
Project Code 9>
##$TILT= no
##$TM1= 0
##$TM2= 0
##$TOPLEV= 0
##$USERP1= <user>
##$USERP2= <user>
##$USERP3= <user>
##$USERP4= <user>
##$USERP5= <user>
##$WDW= 1
##$XDIM= 32768
##$YMAX_p= 296909254
##$YMIN_p= -365078
$$ End of Bruker specific parameters
$$ ---------------------------------
##NTUPLES= NMR SPECTRUM
##VAR_NAME=  FREQUENCY,     SPECTRUM/REAL,   SPECTRUM/IMAG
##SYMBOL=    X,             R,               I
##VAR_TYPE=  INDEPENDENT,   DEPENDENT,       DEPENDENT
##VAR_FORM=  AFFN,          ASDF,            ASDF
##VAR_DIM=   32768,         32768,           32768
##UNITS=     HZ,            ARBITRARY UNITS, ARBITRARY UNITS
##FACTOR=    0.157963299565203, 1,           1
##FIRST=     4113.68340121681, 0,            0
##LAST=      -1062.3000356362, 0,            0
##MIN=       -1062.3000356362, -365078,      0
##MAX=       4113.68340121681, 296909254,    0
$$ Real data points
##PAGE= N=1
##DATA TABLE= (X++(R..R)), XYDATA
$$ [...]
19072A73018l9075K1923M4047j8385j5267R678j9563M8078j8049n5461J3920R1410
$$ 173018 133943 155866 199913 181528 166261 175939 156376 204454 186405 130944 144864 236274
19060B36274O4942N363o3482L2674m1639N3648J5331J3580Q939p5998L1216J0079
$$ 236274 301216 306579 243097 275771 234132 287780 303111 316691 325630 249632 280848 290927
19048B90927j7551p110j57N532l952Q342L8299L5660Q641P227N0990j07166r6429
$$ 290927 273376 266266 266109 271641 267689 276031 314330 349990 358631 365858 416848 309682 213253
19035B13253n0418K4475N2222O203j3334p6031n7098J8074J5335R774O2236M7899
$$ 213253 162835 187310 239532 245735 232401 156370 99272 117346 132681 142455 204691 252590
19023B52590M6537j6744n3821k4828j8275q5293L383p143k5081Q8556p0212l3430
$$ 252590 299127 282383 228562 203734 185459 100166 103549 96406 71325 159881 89669 56239
19011E6239J24013J7249n4053j6122N1888O7704L5965L3322j7866q8609O5279
$$ 56239 180252 197501 143448 127326 179214 246918 282883 316205 298339 209730 275009
19000B75009N5586L43m7411j6116j5400K303j1168l9702J7044j0972P9843M6662
$$ 275009 330595 330938 283527 267411 252011 254314 243146 203444 220488 209516 289359 336021
18988C36021r381o1693l4617j8192K2038L4612M139j4640R801P6661k3307q7024
$$ 336021 326640 264947 230330 212138 234176 268788 272927 258287 268088 344749 321442 234418
18976B34418J4165p41M9232j03431p5903O0567J67261L028r1015n290O688Q736
$$ 234418 248583 247842 297074 193643 117740 178307 345568 348596 257581 252291 258979 267715
18964B67715k1520k6348l6478O8919N2981l4670M6168Q7187Q1798L6768j3672
$$ 267715 246195 219847 183369 252288 305269 270599 316767 403954 485752 522520 508848
18953E08848l5071l4348K4937R9444K9317J4164p470j12055n7063r745M8907K9026
$$ 508848 473777 439429 464366 563810 593127 607291 599821 487766 430703 420958 469865 498891
18941D98891r2269q9213P3824L4428N4029M9916P637N8840N7735q6306l756K496
$$ 498891 406622 317409 391233 425661 479690 529606 537243 596083 653818 567512 563756 566252
18929E66252M1330R0561n1424j30694r2045K5776l0016j9643M6305n4389K0995
$$ 566252 607582 698143 646719 516025 423980 449756 419740 400097 446402 392013 413008
18918D13008m9711p0690P6312L7686J6637n1875Q53K0851k7866K5142O0781N5415
$$ 413008 363297 292607 368919 406605 423242 371367 372220 393071 365205 390347 451128 506543
18906E06543J6815L2503J9306r7670m2066M2928O6893m8691K4694P815m5905O2895
$$ 506543 523358 555861 575167 477497 435431 478359 545252 496561 521255 529070 483165 546060
18894E46060R0835L5251J7827M2655J9156j0861n0408M119L0144J12o6908j21453
$$ 546060 636895 672146 689973 732628 751784 740923 690515 694634 724778 724890 657982 536529
18882E36529Q309Q1132L9763J3705j0988J6917m5327m3739j9753P865l0052j03368
$$ 536529 544838 625970 665733 679438 668450 685367 640040 596301 576548 584413 554361 450993
18870D50993k1452k2492j9065Q4467M6173Q1101o383m0714j4890l481m1246n594
$$ 450993 429541 407049 387984 472451 518624 599725 593342 552628 537738 534257 493011 487417
18858D87417j4259L1478k0626K5403q3131o0815m5440j722L8400K8730q902Q7448
$$ 487417 473158 504636 484010 509413 426282 365467 320027 318305 356705 385435 376533 463981
18846D63981K9358l155P272k7544l7995m9360l7523k247L6534P8200O3731o814
$$ 463981 493339 490184 497456 469912 431917 382557 345034 342787 379321 457521 521252 514438
18834E14438p9573R4782R5731o8760j2924q6981j00056K4577J42355N1136j1632
$$ 514438 434865 529647 625378 556618 543694 456713 356657 381234 523589 574725 563093
18823E63093o7415N197K0417O6426k8266L6855J4693p1763j910M8641J0313N3417
$$ 563093 495678 500875 521292 587718 559452 596307 611000 539237 537327 585968 596281 649698
18811F49698Q1930R008n1415q4658N225J1586q6021n8776m5159j58m6267J15482
$$ 649698 731628 740636 689221 604563 609788 621374 535353 476577 431418 431260 384993 500475
18799E00475R0456J2148n7387m1322K1347J6495O7125L641j14589r8398K1554
$$ 500475 590931 603079 545692 504370 525717 542212 609337 612978 498389 399991 421545
18788D21545q501o9572L6680M3510P4431k2222l5798j914K680J38704Q9851P6023
$$ 421545 413044 343472 380152 423662 498093 475871 440073 438159 440839 579543 669394 745417
18776G45417K5334L2142o5062r2897k7905L9115J31953R2329M3062N6778J30155
$$ 745417 770751 802893 737831 644934 617029 656144 788097 880426 923488 980266 1110421
18765A110421M5711l6207R5066P2037r7993k31432k00171k7067Q3397o7465l4816
$$ 1110421 1156132 1119925 1214991 1287028 1189035 957603 757432 730365 813762 746297 711481
18754G11481N4415K3478M5161L0466q401Q056j12900n6699M0542n523j74380n8504
$$ 711481 765896 789374 834535 865001 856600 864656 751756 695057 735599 730076 555696 497192
18742D97192j13193J2630M6618N0938M0373J2762M1690j9147j6992K1857r4616
$$ 497192 383999 396629 443247 494185 534558 547320 589010 569863 552871 574728 480112
18731D80112m9101L5314J04020L3178k5000p3349K927M4668j8232j3677J0685
$$ 480112 431011 466325 570345 603523 578523 505174 508101 552769 534537 520860 531545
18720E31545L131o343N0260k2054r5015P5847M6239J18435R966n9944l8501n393
$$ 531545 534676 528333 578593 556539 461524 537371 583610 702045 712011 652067 613566 608173
18708F08173n4463m7563M4027l2159l5361n0138j5948O7790Q4327m360R817M3879
$$ 608173 553710 506147 550174 518015 482654 432516 416568 484358 568685 564325 574142 618021
18696F18021M3195m984o2085M4266O3452j7814q6468l5852n2684K7565P425L4254
$$ 618021 661216 656232 594147 638413 701865 684051 597583 561731 509047 536612 544037 578291
18684E78291M3060O4602k6362n4654L44p3200p5606Q7605K0855J328J5383N140
$$ 578291 621351 685953 659591 604937 605281 532081 456475 544080 564935 566263 581646 586786
18672E86786l8007K8347R2232O3059j673q5882k3664j5619j5952l8541o0782O2799
$$ 586786 548779 577126 669358 732417 730744 644862 621198 605579 589627 551086 490304 553103
18660E53103j6798L1007R201K6252P7139J9629j46617p2055M4795P2182L2205
$$ 553103 536305 567312 576513 602765 679904 699533 552916 480861 525656 597838 630043
18649F30043k8955j5812j7357n2127l140J16503O5067O749J572j948L5913m9878
$$ 630043 601088 585276 567919 515792 512652 629155 694222 700971 702543 700595 736508 686630
18637F86630p6631R3586P7029n866n3605m3656L9737Q831o8137P8461O3046L3491
$$ 686630 609999 703585 780614 774748 721143 677487 717224 726055 657918 736379 799425 832916
18625H32916j17061r641P0817L297L9607N081k4019j40625j40950K1904L9801
$$ 832916 715855 706214 777031 780328 819935 825016 800997 660372 519422 541326 581127
18614E81127N1257L348J4484L1012o263p3352k7761K4101O0868q03j09064l1725
$$ 581127 632384 635732 650216 681228 674965 601613 573852 597953 658821 658018 548954 517229
18602E17229M90N2279K3670o157N3612k8288n911Q6053K867p2157K0637p872k9663
$$ 517229 517719 569998 593668 587511 641123 612835 606924 692977 695844 623687 644324 636452 606789
18589F06789L2305L0127J8697O8462m1366j43250L4589P9954J04262J7698M5732
$$ 606789 639094 669221 687918 756380 715014 571764 606353 686307 790569 808267 853999
18578H53999j04834q4761j0963K2292J60926N4267K9006o1637R825J05097k8727
$$ 853999 749165 664404 653441 675733 836659 890926 919932 858295 868120 973217 944490
18567I44490p6541m7393m9693M3422Q6009K9099j8013l1695Q1268k065k263k9183
$$ 944490 867949 820556 770863 814285 900294 929393 911380 879685 960953 958888 956625 927442
18555I27442J06781O5679l4758J5144M234J0845M8715l7478q2546l0561K0679
$$ 927442 1034223 1099902 1065144 1080288 1084522 1095367 1144082 1106604 1024058 993497 1014176
18544A014176l026M2128k7377p5277l4722n1079O1946O4078j5920J33533K0407
$$ 1014176 1011150 1053278 1025901 950624 915902 864823 926769 990847 974927 1108460 1128867
18533A128867p6003O3443N3818k2921p6814k0891P6059M6832p4861l9698O9719
$$ 1128867 1052864 1116307 1170125 1147204 1070390 1049499 1125558 1172390 1097529 1057831 1127550
18522A127550o7313o949L4578M0935P5844Q906K4497K619j0011L6485L1421N7965
$$ 1127550 1060237 1053288 1087866 1128801 1204645 1213551 1238048 1240667 1230656 1267141 1298562 1356527
18510A356527m63k4771o669J5432O4513Q7030l3103K5636j17023o341J36405l829
$$ 1356527 1356064 1331293 1324624 1340056 1404569 1491599 1458496 1484132 1367109 1360768 1497173 1493344
18498A493344n3772o836K7636Q55K327M6019Q0430K11800J30531j6065J3308K2900
$$ 1493344 1439572 1432736 1460372 1461227 1463554 1509573 1590003 1801803 1932334 1916269 1929577 1952477
18486A952477l1920q6130Q6851P8069M2228K3569J7862J09429J3213Q3100Q3549
$$ 1952477 1920557 1834427 1921278 1999347 2041575 2065144 2083006 2192435 2205648 2288748 2372297
18475B372297N5781J48946J53677K11248J62486J72747J60891J66849K27642K32053
$$ 2372297 2428078 2577024 2730701 2941949 3104435 3277182 3438073 3604922 3832564 4064617
18465D064617L41326M48453M78165P72378R87073J152715J088146Q98812M99894
$$ 4064617 4405943 4854396 5332561 6104939 7092012 8244727 9332873 10231685 10731579
18456A0731579K75852Q6694K10831N67079J081366J792695K684328M045228N652051
$$ 10731579 11007431 11094125 11304956 11872035 12953401 14746096 17430424 21475652 27127703
18447B7127703P587520R185705R594547P761756N171456Q17829l248322m711861
$$ 27127703 34715223 43900928 53495475 61257231 66428687 67246516 63998194 59286333
18439E9286333o188287o527480o076519n205402l766791k083785l02237J105535
$$ 59286333 53098046 46570566 40494047 35288645 31521854 29438069 29135832 30241367
18431C0241367J599826J093656J23749j428410l002076l344706l268873k803937
$$ 30241367 31841193 32934849 33058598 31630188 28628112 25283406 22014533 19210596
18423A9210596j901346j267242q75783n20043k42977j06135j05129l6608J4510
$$ 19210596 17309250 16042008 15166225 14646182 14403205 14297070 14191941 14155333 14169843
18414A4169843N9205J36304J61869N07867J063272J638881K349635L261523M257811
$$ 14169843 14229048 14365352 14527221 15035088 16098360 17737241 20086876 23348399 27606210
18405B7606210N002296N020489M021544K353967L61556j370882j520844n19503
$$ 27606210 32608506 37628995 41650539 44004506 44366062 42995180 41474336 40954833
18397D0954833J479409M151185P120152J0440722J3976189J7238892J9262471
$$ 40954833 42434242 46585427 53705579 64146301 78122490 95361382 114623853
18390A14623853J9058209J4807503P349083k060168j1822698j8871011k1594446
$$ 114623853 133682062 148489565 155838648 153778480 141955782 123084771 101490325
18383A01490325j9551265j5859300j1517634p438567m523432k302191q47101O3019
$$ 101490325 81939060 66079760 54562126 47123559 42600127 40297936 39450835 39513854
18375C9513854J40132m86241j519747k888286l539469l471607k903062k049468
$$ 39513854 39653986 39167745 37647998 34759712 31220243 27748636 24845574 22796106
18367B2796106j366060j132856r98497r77035q77637q42005q83649q44030q57266
$$ 22796106 21430046 20297190 19298693 18321658 17444021 16602016 15718367 14874337 14017071
18358A4017071o65169m82495m98104m25970l91093k76312l78006n27814l28151
$$ 14017071 13351902 12869407 12371303 11945333 11554240 11277928 10899922 10372108 10043957
18349A0043957j95675j89858k37839K7182K50861M37783P95234Q91857Q38955
$$ 10043957 9848282 9658424 9420585 9447767 9698628 10136411 10931645 11823502 12662457
18340A2662457O96250M18517j23777p04512j059929j166409j071963o74718m09306
$$ 12662457 13358707 13777224 13653447 12948935 11889006 10722597 9650634 8975916 8566610
18331H566610k74661l2336R9165K28591L35668N04190N24554N06207O08334P46074
$$ 8566610 8291949 8259613 8358778 8587369 8923037 9427227 9951781 10457988 11066322 11812396
18321A1812396R87782J494691K252735K924375L663974L979728L199315J506074
$$ 11812396 12800178 14294869 16547604 19471979 23135953 27115681 30314996 31821070
18313C1821070j88241o78369L03288K163229M250640O690081R864169J3997782
$$ 31821070 31632829 30954460 31257748 33420977 37671617 44361698 54225867 68223649
18305F8223649J8836755K2882654K3875160J9577721R227731l878951j5279522
$$ 68223649 87060404 109943058 133818218 153395939 162623670 158744719 143465197
18298A43465197k1504511k2215797j9288549j4732440j0089374o453766l810552
$$ 143465197 121960686 99744889 80456340 65723900 55634526 49180760 45370208
18291D5370208j563123M52700J946956K597756J766330p89883l776248n626918
$$ 45370208 43807085 44259785 46206741 48804497 50570827 49780944 46004696 40377778
18283D0377778n747198m632215l336509k271224j746331j491517j377996j239823
$$ 40377778 34630580 29998365 26661856 24390632 22644301 21152784 19774788 18534965
18275A8534965j182093q88121p31328n36673m46114l26995j612K87624N47095
$$ 18534965 17352872 16464751 15733423 15196750 14750636 14423641 14422029 14709653 15256748
18266A5256748R16600J393587K065111K839530L520535L649181K650814Q29842
$$ 15256748 16173348 17566935 19632046 22471576 25992111 29641292 32292106 33121948
18258C3121948j247439k244904j777152k84942J644675L543014N278292O576813
$$ 33121948 31874509 29629605 27852453 27567511 29212186 32755200 38033492 44610305
18250D4610305P102905O804403N968631M689554K254864k075296p654305j1210258
$$ 44610305 51713210 58517613 64486244 69175798 71430662 69355366 61701061 50490803
18242E0490803j0947717q510401n527652l421735k231364j471176j094378o76978
$$ 50490803 39543086 31032685 25505033 22083298 19851934 18380758 17286380 16609402
18234A6609402k81060j05143P4799j36384m32773o19847o30361k25157L01825
$$ 16609402 16328342 16223199 16297998 16161614 15728841 15108994 14478633 14253476 14555301
18225A4555301M96057N34591K70497k07568q76557j082979j200673j065884m90653
$$ 14555301 15051358 15585949 15856446 15648878 14772321 13689342 12488669 11422785 10932132
18216A0932132j37512J54671M58519Q63463J377076K078687L199460M599284O004372
$$ 10932132 10794620 10949291 11407810 12271273 13648349 15727036 18926496 23525780 29530152
18207B9530152O276023M136174q61696o507281p740063n751060l891945k672821
$$ 29530152 35806175 39942349 39080653 32573372 24833309 19082249 15190304 12517483
18199A2517483j903723j383703j054122p84087n92886m52008l70884k49212l03777
$$ 12517483 10613760 9230057 8175935 7391848 6798962 6346954 5976070 5726858 5423081
18190E423081k88032j08910j07586j33874j8862K1759O7699j0265j10362j29591
$$ 5423081 5135049 5026139 4918553 4784679 4765817 4787576 4855275 4845010 4734648 4605057
18180D605057j37348k48225j90569n8966l3298N2941J10312J50337L00298K60987
$$ 4605057 4467709 4219484 4028915 3969949 3936651 3989592 4099904 4250241 4550539 4811526
18170D811526J80157J60256J20940o7139l58996n15393n50429n04062m08710k88979
$$ 4811526 4991683 5151939 5272879 5205740 4846744 4331351 3780922 3276860 2868150 2579171
18160B579171j58973q8302j05340K3600O268N4908O2633N4907L3101O9934J02091
$$ 2579171 2420198 2331896 2226556 2250156 2256424 2311332 2373965 2428872 2461973 2531907 2633998
18149B633998N7302k3182O1907k1943k47394k11909j20270n9767j55889j69709
$$ 2633998 2691300 2668118 2730025 2708082 2460688 2248779 2128509 2068742 1912853 1743144
18139A743144J1546M2578p4868o4493J6910Q6904J23396M2794R2706J11204J00108
$$ 1743144 1754690 1797268 1722400 1657907 1674817 1761721 1885117 1927911 2020617 2131821 2231929
18128B231929P000J00069L9620L8104J06896J67486J72934K54720M67036M40325
$$ 2231929 2238929 2338998 2378618 2416722 2523618 2691104 2864038 3118758 3585794 4026119
18118D026119N04463O82843Q72599J172588J433858J972069K554381L602483N010164
$$ 4026119 4530582 5213425 6086024 7258612 8692470 10664539 13218920 16821403 21831567
18109B1831567O944994J0381484J6209728K1762237K0536674J0660613j4307801
$$ 21831567 28776561 39158045 55367773 77130010 97666684 108327297 94019496
18102I4019496l0539206k1453308j1851492o884393m132432k869721k140426j622550
$$ 94019496 63480290 42026982 30175490 23291097 19158665 16288944 14148518 12525968
18094A2525968j342847j036085o78707n90476n43882m51745l20360l10489k18055
$$ 12525968 11183121 10147036 9468329 8877853 8333971 7882226 7561866 7251377 7033322
18085G033322j02441N3540k44196m59041m33656l42407l75896l66076l06605l43891
$$ 7033322 6930881 6984421 6740225 6281184 5847528 5505121 5129225 4763149 4456544 4112653
18075D112653l72947l50402k05723q7828j08213j30098j74918p4421j29742p7961
$$ 4112653 3739706 3389304 3183581 3095753 2987540 2857442 2682524 2608103 2478361 2400400
18065B400400q3963j15298k25364j85694q1475m4687j62346j47228n3238p5549
$$ 2400400 2316437 2201139 1975775 1790081 1708606 1663919 1501573 1354345 1301107 1225558
18055A225558l3417r9810o5322L247Q3331J59000M049j16314m0933K6982n8801
$$ 1225558 1192141 1092331 1027009 1030256 1113587 1272587 1276636 1160322 1119389 1146371 1087570
18044A087570k3102Q1574m922p3568k8317k9915k4831K7098J31347P0895O3213
$$ 1087570 1064468 1146042 1141120 1067552 1039235 1009320 984489 1011587 1142934 1213829 1277042
18033A277042r5515j38344o2954j51881j51918o4326O572L4936L6575j01895l8290
$$ 1277042 1181527 1043183 980229 828348 676430 612104 618676 653612 690187 588292 550002
18022E50002P2860N2576M0764l3532J3573N1389j3730K8020q200M534k4863J6342
$$ 550002 622862 675438 716202 682670 696243 747632 733902 761922 753722 758256 733393 749735
18010G49735J323o499r1665R8884N4413k9180k1435m3436k45R0843M8223P8876
$$ 749735 751058 744559 652894 751778 806191 777011 755576 712140 711895 802738 850961 929837
17998I29837m0420j02254m7563N1190l607M5663O1737j7373N0089L9762K3882
$$ 929837 889417 787163 739600 790790 787183 832846 894583 877210 927299 967061 990943
17987I90943J32484J14719L5729m9309k0076o4956r9228q9964r3478n0300J0891
$$ 990943 1123427 1238146 1273875 1224566 1204490 1139534 1040306 950342 856864 806564 817455
17976H17455j14990O3206J07265J45605N4155M5821L3025o8967n0015J10722J26267
$$ 817455 702465 765671 872936 1018541 1072696 1118517 1151542 1082575 1032560 1143282 1269549
17965A269549K0316m5149m9984M177l6020m3354j51214l7734j2020o1789o03L2669
$$ 1269549 1289865 1244716 1194732 1198909 1162889 1119535 968321 930587 918567 856778 856175 888844
17953H88844K1369P4884J17972K2715J2293K5917L4392M4237N3721m3658J5821
$$ 888844 910213 985097 1103069 1125784 1138077 1163994 1198386 1242623 1296344 1252686 1268507
17942A268507K9438l7498m980l0019J6455J02459J10612J46756K5085Q0859M7508
$$ 1268507 1297945 1260447 1255467 1225448 1241903 1344362 1454974 1601730 1626815 1707674 1755182
17931A755182L8605K4754j30073n1250p7176q778M4215K4672N1758J17176J13153
$$ 1755182 1793787 1818541 1688468 1637218 1560042 1551264 1595479 1620151 1671909 1789085 1902238
17920A902238M2815N980Q02J0535k1982k3509p6713m5228o8705M9906J5257Q415
$$ 1902238 1945053 1951033 1951835 1962370 1940388 1916879 1840166 1794938 1726233 1776139 1791396 1799811
17908A799811K2333j06848k3970J6731o3331L8673M1946J00173M8420M9112J88779
$$ 1799811 1822144 1715296 1691326 1708057 1644726 1683399 1725345 1825518 1873938 1923050 2111829
17897B111829j4552m3587j5391O4663J56847J02180M4216L7941l5379L6478J00921
$$ 2111829 2097277 2053690 2038299 2102962 2259809 2361989 2406205 2444146 2408767 2445245 2546166
17886B546166J28547R0201J12039J79819L19531L15375L47297M65971M37358M35228
$$ 2546166 2674713 2764914 2876953 3056772 3376303 3691678 4038975 4504946 4942304 5377532
17876E377532J89222M7177p167K3179R1870L19754M84983O71046P90105J174594
$$ 5377532 5566754 5613931 5606764 5629943 5721813 6041567 6526550 7197596 7987701 9162295
17866I162295J300480J473488J576296J655082J943239K370084L308100M642900
$$ 9162295 10462775 11936263 13512559 15167641 17110880 19480964 22789064 27431964
17858B7431964O560752R330693J3119668J6584302J6602430J0409161k651686
$$ 27431964 33992716 43323409 56443077 73027379 89629809 100038970 97387284
17851I7387284j4170272j3572766q010383l974045j169177J782004N692174J0196653
$$ 97387284 83217012 69644246 61633863 57659818 56490641 58272645 63964819 74161472
17843G4161472J5401933K0569914K2874588J8868416P220638p722383j9125995
$$ 74161472 89563405 110133319 133007907 151876323 159096961 151374578 132248583
17836A32248583k2982179k0614335j4131799p768087l041838M88126L520393O479069
$$ 132248583 109266404 88652069 74520270 66752183 63710345 64198471 67718864 74197933
17828G4197933R555292J2352634J2093421N991274p341644j9740023j9094732
$$ 74197933 83753225 96105859 108199280 114190554 106848910 87108887 68014155
17821F8014155j2927849q164803n695173m506397l438465k638064k250624j889134
$$ 68014155 55086306 46921503 41226330 36719933 33281468 30643404 28392780 26503646
17813B6503646j662591j438418j147563p13147k82731K5094R1829j01476n91933
$$ 26503646 24841055 23402637 22255074 21541927 21259196 21284290 21376119 21274643 20682710
17804B0682710r81930j215103j248053j120676j083487j004513r94269q43124
$$ 20682710 19700780 18485677 17237624 16116948 15033461 14028948 13034679 12191555
17796A2191555n26178k11339K6294m446l28198p97158r42957q76455o19650m88236
$$ 12191555 11665377 11454038 11480332 11475886 11147688 10350530 9407573 8531118 7911468 7423232
17786G423232m59075o32413o25778m20971l40983k40408k67675k58362j26149
$$ 7423232 6964157 6331744 5705966 5284995 4944012 4703604 4435929 4177567 4051418
17777D051418j24710o0998Q2002J86084L0918L3880K6276n5007l8102j11520r2445
$$ 4051418 3926708 3865710 3947712 4133796 4164714 4198594 4224870 4169863 4131761 4020241 3927796
17766C927796r1362j0871L6495m0386L923M2337K3668J2710P6639j1759o8378
$$ 3927796 3836434 3825563 3862058 3821672 3825595 3867932 3891600 3904310 3980949 3969190 3900812
17755C900812p8177L5407k0155j1986M758L3901R0286j2872n6587j83647j34643
$$ 3900812 3822635 3858042 3837887 3825901 3830659 3864560 3954846 3941974 3885387 3701740 3567097
17744C567097j22322r1698m496j09010p8471q4485q1076n2899j08295j86108k15666
$$ 3567097 3444775 3353077 3348581 3239571 3161100 3076615 2995539 2942640 2834345 2648237 2432571
17733B432571j68706j12927j28391j09936k899r6740j08440j48567m1510p1034
$$ 2432571 2263865 2150938 2022547 1912611 1909712 1812972 1704532 1555965 1514455 1443421
17723A443421o0089m4418j63868j28255k884m8329q6983l8946Q900p4263r0968
$$ 1443421 1383332 1338914 1175046 1046791 1043907 995578 908595 869649 878549 804286 713318
17712G13318n464l7965Q471j5144o6581j03819l9264J05513Q4136N171l2767J7573
$$ 713318 707854 669889 678360 663216 596635 492816 453552 559065 643201 648372 615605 633178
17700F33178k1756o2932p5696n9456o888Q2778j7447J5105P908k5467q3047R348
$$ 633178 611422 548490 472794 413338 406450 489228 471781 486886 494794 469327 386280 395628
17688C95628k1077k4401r403j12553j3595L288K140L3022o7833o6728N3574j3141
$$ 395628 374551 350150 340747 228194 214599 217887 220027 253049 185216 118488 172062 158921
17676A58921k6664J9015J8359L6625O2921m85j32888m5510J07336Q3247P8517
$$ 158921 132257 151272 169631 206256 269177 268692 135804 90294 197630 280877 359394
17665C59394l6362p3573k9328K0652J3220n6297q0939l9068j2207K2323O8291
$$ 359394 323032 249459 220131 240783 254003 197706 116767 77699 65492 87815 156106
17654A56106k7020J9231j5867j940r3944o7660m050J1331M1308Q1357L1603J1350
$$ 156106 129086 148317 132450 130510 36566 -31094 -35144 -23813 17495 98852 130455 141805
17642A41805L0665p6696r0598p489l2770N8036n6923n1805J8999m0625O8972P8407
$$ 141805 172470 95774 5176 -2313 -35083 22953 -33970 -85775 -66776 -107401 -38429 39978
17630C9978m2340p2176l2790o881O1060M9895M1817l2030O581q1684k0531L6057
$$ 39978 -2362 -74538 -107328 -114209 -53149 -3254 38563 6533 13114 -68570 -89101 -53044
17618e3044l5034o7809p0809Q1688P5894N2573j33063l0099L4727q791R1541P9559
$$ -53044 -88078 -155887 -226696 -145008 -69114 -16541 -149604 -179703 -144976 -153767 -62226 17333
17606A7333R650Q553q3399n8556J984N8305l9305K3122k7915m6899j2572J00045
$$ 17333 26983 35536 -47863 -106419 -104435 -46130 -85435 -62313 -90228 -137127 -149699 -49654
17594d9654n7720J6085P354l5378K1178O1884L9379l0732r9710m7325O7805m7671
$$ -49654 -107374 -91289 -83935 -119313 -98135 -36251 3128 -27604 -127314 -174639 -106834 -154505
17582a54505M657p261l1709l6682K3542J24018M0854J9973J4304P5P762j181N7506
$$ -154505 -149848 -157109 -188818 -225500 -201958 -77940 -37086 -17113 -2809 -2734 5028 3847 61353
17569F1353p7318m9989k1817Q5833R37l2508K8240M9637m4945j4861Q5437N0751
$$ 61353 -15965 -65954 -87771 -1938 -1001 -33509 -5269 44368 -577 -15438 69999 120750
17557A20750l3764r152p8819L4176O347M3541q5758j04606K9285J23917J68744
$$ 120750 86986 77834 -985 33191 39538 83079 -2679 -107285 -78000 45917 214661
17546B14661o2475o8939M6221P3336m4534j9367l5471n5350q5125P4235J06629
$$ 214661 152186 83247 129468 202804 158270 138903 103432 48082 -37043 37192 143821
17535A43821m2716m2536j15202q024K4612O9339O8511m0449J1294J9502k3510
$$ 143821 101105 58569 -56633 -64657 -40045 29294 97805 57356 68650 88152 64642
17524F4642p0508K826P4446J2107M1597n2794k1536P4055J2256j9133L2411l801
$$ 64642 -5866 -3040 71406 83513 125110 72316 50780 124835 137091 117958 150369 146568
17512A46568P4557L1484n1087N743Q4129K8953M6583k8152L4k4396K0838P7104
$$ 146568 221125 252609 201522 207265 291394 320347 366930 338778 338812 314416 335254 412358
17500D12358j3584R657J41118O8664j590k450N0768J02339O4746P3312J2205P7009
$$ 412358 398774 408431 549549 618213 616623 614173 664941 767280 832026 905338 917543 994552
17488I94552R1680R1329N3377J04843J05415J35434M7293l6633k5426K5655k832
$$ 994552 1086232 1177561 1230938 1335781 1441196 1576630 1623923 1587290 1561864 1587519 1584687
17477A584687J12119J34897R660J2108M8090j569M7792M2044N4910k234r2109
$$ 1584687 1696806 1831703 1841363 1853471 1901561 1899992 1947784 1989828 2044738 2042504 1950395
17466A950395q7499n9044n886N6211J5421r9258o8595q1850o5153Q483o9518j7973
$$ 1950395 1862896 1803852 1797966 1854177 1869598 1770340 1701745 1619895 1554742 1563225 1493707 1475734
17454A475734K7549j30287n4665o7655p6082p2684m6545j00679r4836P924r4537
$$ 1475734 1503283 1372996 1318331 1250676 1174594 1101910 1055365 954686 859850 867774 773237
17443G73237q938l027R2156J30868O4404O378j2286j02942j74277j04357M950
$$ 773237 764299 761272 853428 984296 1048700 1055078 1042792 939850 765573 661216 666166
17432F66166j34764q9084M9629L8989j16562L1504j2148r8053n7828m179l1274
$$ 666166 531402 442318 491947 530936 414374 445878 433730 335677 277849 273670 242396
17421B42396j9966K9794O0888P756n9514j7324J0573q0667l162N4950P5502j2273
$$ 242396 222430 252224 313112 320868 261354 244030 254603 173936 170774 225724 301226 288953
17409B88953j17648J9683R3975n3754j24488R975O5652L2954J21k8130n0908L4954
$$ 288953 171305 190988 284963 231209 106721 116696 182348 215302 215423 187293 136385 171339
17397A71339k8408o9658J01430R7373k7124q7188l2226L2940L8795O9459j1266
$$ 171339 142931 73273 174703 272076 244952 157764 125538 158478 197273 266732 255466
17386B55466k9927L256j90467l8918J01756O6604L3508O9863m2598k0454p3302
$$ 255466 225539 228795 38328 -590 101166 167770 201278 271141 228543 208089 134787
17375A34787l8171l4191N2673m1837j4258K4348j3924J14444q5710k7762l2720
$$ 134787 96616 62425 115098 73261 59003 83351 69427 183871 98161 70399 37679
17364C7679k0230J12508J06820l108m700m107L1830Q2592r0590j30921l3152K708
$$ 37679 17449 129957 236777 233669 228969 224862 256692 339284 248694 117773 84621 87329
17352H7329L125J9574o2609Q3033P2018k6394O572P7810O5394K4397l498k3991
$$ 87329 90454 110028 47419 130452 202470 176076 182648 260458 325852 350249 346751 322760
17340C22760P1783J9775m4157j04029k0583m0909l9925l1631J3216L2234k3781
$$ 322760 394543 414318 370161 266132 245549 204640 164715 133084 146300 178534 154753
17329A54753j8674j7992P57k0771J9701q493K85K0441J0931K3014P0247n929m9845
$$ 154753 136079 118087 118844 98073 117774 109281 109566 130007 140938 163952 234199 228270 178425
17316A78425j40354k4495O9313r880j4540q596k4051l1816q736k4479L5345M785
$$ 178425 38071 13576 82889 73009 58469 49873 25822 -5994 -14730 -39209 -3864 921
17304I21l1475J07M4487M9137R2731j1977j05921j14907J1218Q3011L1971m4295
$$ 921 -30554 -30447 14040 63177 155908 143931 38010 -76897 -65679 17332 49303 5008
17292E008J0162R832k4099J4981J06104O9124n6081M7551n0370K766p5500o4779
$$ 5008 15170 25002 903 15884 121988 191112 135031 182582 132212 134978 59478 -5301
17280e301R876L736R433k817K0336J04355J2473M1991K4470M824O8323o78P775
$$ -5301 4575 8311 17744 14927 35263 139618 152091 194082 218552 223376 291699 291021 298796
17267B98796k5119m8590o3436j2853P8232J9820J3444K5902J23823K27756Q0575
$$ 298796 273677 225087 161651 148798 227030 246850 260294 286196 410019 637775 718350
17256G18350K5992q9623n7227q0937j22946q0838n0283J7328O748J18191J96625
$$ 718350 744342 654719 597492 516555 393609 312771 262488 279816 286564 404755 601380
17245F01380J08715j2618J46646J40155L742j70510j27475r1774p6175m3483n8393
$$ 601380 710095 697477 844123 984278 988020 817510 690035 598261 522086 478603 420210
17234D20210m0018O0156Q5356O2254L0262M376k900J3556p432q3432l1023L7231
$$ 420210 380192 440348 525704 587958 618220 622596 619696 633252 625820 542388 511365 548596
17222E48596j472q232P4104L4765p0684j21672n5888O6056j1771j0354n799J8351
$$ 548596 547124 538892 612996 647761 577077 455405 399517 465573 453802 443448 437649 456000
17210D56000k8715J6758N8119Q8409l308J025P948l5920j83848j42022p5470j5788
$$ 456000 427285 444043 502162 590571 587263 588288 596236 560316 376468 234446 158976 143188
17198A43188N9503K5893Q5639O5629O3334K0749n0246m8569m4732r9722r8150
$$ 143188 202691 228584 314223 379852 443186 463935 413689 365120 320388 220666 122516
17187A22516j05433j9395N3127K5621j0711l2636L631L9723j9447N3M3169L2955
$$ 122516 17083 -2312 50815 76436 65725 33089 36720 76443 56996 57049 100218 133173
17175A33173o3030O9874j9728o5737K1797n5759k6292J7452j2191n7382l1315
$$ 133173 70143 140017 120289 54552 76349 20590 -5702 11750 -441 -57823 -89138
17164h9138L4486M73J7979l0190j039N4494r189J2587J03329q449l8728m481L0728
$$ -89138 -54652 -54179 -36200 -66390 -67429 -12935 -22124 -9537 93792 85343 46615 42134 72862
17151G2862k5311m9696l8616J1786K1408j609M9539K2540K5256K6970m8651j32301
$$ 72862 47551 -2145 -40761 -28975 -7567 -9176 40363 62903 88159 115129 66478 -65823
17139f5823K0875k9143K5152M5676m9569N8099Q5981m4696m6314j7988m5810k7411
$$ -65823 -44948 -74091 -48939 -3263 -52832 5267 91248 46552 238 -17750 -63560 -90971
17127i0971L4029k5625M0948K6085L5225K3626J1667K2935m2986p1587k9929n2838
$$ -90971 -56942 -82567 -41619 -15534 19691 43317 54984 77919 34933 -36654 -66583 -119421
17115a19421N6338Q659J4510N5471O9270N4941r1914l7122P9277j139Q271o2655
$$ -119421 -63083 -54424 -39914 15557 84827 139768 47854 10732 90009 88870 97141 34486
17103C4486j4580M8692M853K1806L2724j2154r3605k7038K3095J00927P0626j6421
$$ 34486 19906 68598 73451 95257 127981 115827 22222 -4816 18279 119206 189832 173411
17091A73411M6570q469m4144o704m5332m7899j3991L8593J0504J2557Q022k0993
$$ 173411 219981 211512 167368 160664 115332 67433 53442 92035 102539 115096 123118 102125
17079A02125m7337l8705J9276K9902P7477K1573p4q6547q6097l6029J7375L3520
$$ 102125 54788 16083 35359 65261 142738 164311 164237 77690 -8407 -44436 -27061 6459
17067F459K3063J6186m7650O4821P7236O2233L8643n4882j31807l227K5568K9202
$$ 6459 29522 45708 -1942 62879 140115 202348 240991 186109 54302 51075 76643 105845
17055A05845o4527J8434J62825m4648o9793N8484o5916j1697J0656M282r7231
$$ 105845 41318 59752 222577 177929 108136 166620 100704 89007 99663 103945 6714
17044F714J0052O2910L3601L843M7727N8310N9298r8328n6973p9182n0070J19924
$$ 6714 16766 79676 113277 117120 164847 223157 282455 184127 127154 47972 -2098 117826
17032A17826P7740o803p3909j11601K2377p3236N95l8512r108L2304K9365j7122
$$ 117826 195566 188763 114854 3253 25630 -47606 -47011 -85523 -94631 -62327 -32962 -50084
17020e0084O0610l2870q9933l4767L2073M8910N3047O455k8051m7318J7035K2385
$$ -50084 10526 -22344 -112277 -147044 -114971 -66061 -13014 -6559 -34610 -81928 -64893 -42508
17008d2508Q0294O9050j1951k4716j0874R6191N4061K1774l3379k9122j12422
$$ -42508 37786 106836 94885 70169 59295 155486 209547 231321 197942 168820 56398
16997E6398j6902N974l9954m8182n7293k6540O2473J6535K2803O2065k9375l3424
$$ 56398 39496 45470 5516 -42666 -99959 -126499 -64026 -47491 -24688 37377 8002 -25422
16985b5422N3018m9286N312N1654Q975m4651k5537K7142J7310K5391m752J09822
$$ -25422 27596 -21690 -16378 35276 44251 -400 -25937 1205 18515 43906 39154 148976
16973A48976n0630m9224N6616r809L2590M2679k4174o5246j5739n2216K9865K2481
$$ 148976 98346 49122 105738 95929 128519 171198 147024 81778 66039 13823 43688 66169
16961F6169M6162O2781N7289L988O85p7400K5237j1629J897M8095R64k9641k5596
$$ 66169 112331 175112 232401 236389 237074 159674 184911 173282 175179 223274 224238 194597 169001
16948A69001J07637k7662r0170k7626P2239P2401J02972o3558m3551r170l2451
$$ 169001 276638 248976 158806 131180 203419 275820 378792 315234 271683 262513 230062
16937B30062m5661n6383P3668M3970j19013J546J02456O4031L9903Q572j7094
$$ 230062 184401 128018 201686 245656 126643 128189 230645 294676 334579 343151 326057
16926C26057K6388k6528m8077p1375m2803l2414k5250Q0972P7943l3147L5631
$$ 326057 352445 325917 277840 206465 163662 131248 105998 186970 264913 231766 267397
16915B67397R0869J3008p9988O124j32999j05802q464J21819R578j03243l1119
$$ 267397 358266 371274 291286 297410 164411 58609 50145 171964 181542 78299 47180
16904D7180N3733K0735j27866n6782J3869L3182J04930J1820k1119k6066K9978
$$ 47180 100913 121648 -6218 -63000 -49131 -15949 88981 100801 79682 53616 83594
16893H3594O5410L3770l0661r3737M653M7579N2757M1689J8230k9107P6817R313
$$ 83594 149004 182774 152113 58376 63029 110608 163365 205054 223284 194177 270994 280307
16881B80307l5351m2151K9462j4555k9658O3435J03548p296q3955m7070L6020
$$ 280307 244956 202805 232267 217712 188054 251489 355037 347741 263786 216716 252736
16870B52736P1599N2361J885M2877q1611k5428N5220M6610K4608K2949r7340q6436
$$ 252736 324335 376696 378581 421458 339847 314419 369639 416249 440857 463806 366466 280030
16858B80030n5094j011L6588M0214P544L1554N6517j03352r7209K0983J6209m7009
$$ 280030 224936 223925 260513 300727 308271 339825 396342 292990 195781 216764 232973 185964
16846A85964N5395q434M373Q9300J6413L6479J6792p5093Q339K2822K5989q0475
$$ 185964 241359 232925 237298 326598 343011 379490 396282 321189 329528 352350 378339 297864
16834B97864q9271J9352O5128O8460O4846k4381p1670l0589n2886M4960J47435
$$ 297864 208593 227945 293073 361533 426379 401998 330328 299739 246853 291813 439248
16823D39248N2309J0275J6982k3100j41333K5358J6234j8886J314N2459Q044J5691
$$ 439248 491557 501832 518814 495714 354381 379739 395973 377087 378401 430860 438904 454595
16811D54595p180M670m2760L3278J38218M6766L2053N5129Q3668q3552j47216
$$ 454595 447415 452085 409325 442603 580821 627587 659640 714769 798437 714885 567669
16800E67669l4240L9913o6586j33793M6084K0423J7350k7471P8683M1681n6411
$$ 567669 533429 573342 506756 372963 419047 439470 456820 429349 508032 549713 493302
16789D93302M2033k1444M8662o5618q2840K1551k4217J7568O0625P0809J32301
$$ 493302 535335 513891 562553 496935 414095 435646 411429 428997 489622 560431 692732
16778F92732N9479K2678N1113o2210q8058p2951L414n879N7090O5398N5673P2011
$$ 692732 752211 774889 826002 763792 675734 602783 606197 600318 657408 722806 778479 850490
16766H50490j3978R8880M7742m4709j8182o1976j7584l1939M3767O3670O9473
$$ 850490 836512 935392 983134 938425 920243 858267 840683 808744 852511 916181 985654
16755I85654L032N037P1946P5807M8596J2078Q6780L7813o1283k2608K967j387
$$ 985654 988686 993723 1065669 1141476 1190072 1202150 1288930 1326743 1265460 1242852 1245819 1244432
16743A244432M7677O6749M9452N1495L3132K8664L3138K850j8879O7373J23549
$$ 1244432 1292109 1358858 1408310 1459805 1492937 1521601 1554739 1557589 1538710 1606083 1729632
16732A729632J83722m640o938J09784L9037N4120J59840J93749P2835l2576J77665
$$ 1729632 1913354 1908714 1901776 2011560 2050597 2104717 2264557 2458306 2531141 2498565 2676230
16721B676230L27581L74373K52825K71732M27878L30196J61915Q5776J10500K18587
$$ 2676230 3003811 3378184 3631009 3902741 4330619 4660815 4822730 4908506 5019006 5237593
16711E237593K85905M01940M32159N14672Q01394J019060J225727J426312J614657
$$ 5237593 5523498 5925438 6357597 6872269 7673663 8692723 9918450 11344762 12959419
16702A2959419J915697K384183L095063M134982N595232P818656J0847164J4518100
$$ 12959419 14875116 17259299 20354362 24489344 30084576 37903232 48750396 63268496
16694F3268496J6699344J4429312O061011o338120j3248872j1360116o870533
$$ 63268496 79967840 94397152 100458163 94120043 80871171 69511055 62640522
16687F2640522l404250k67630L278585P218374J1688264J6310265J9706979J9486237
$$ 62640522 59236272 58968642 62247227 69465601 81153865 97464130 117171109 136657346
16679A36657346J3481832K225994r997681j8999619k1508899j7539832j1415601
$$ 136657346 150139178 152365172 142367491 123367872 101858973 84319141 72903540
16672G2903540o131834k143612J114729L912398O738878R481232J0819796Q140780
$$ 72903540 66771706 64628094 65742823 69655221 76394099 85875331 96695127 104835907
16664A04835907r7760j2072689j8083724j5340405j0297812o535698m219049l049184
$$ 104835907 104738147 92665458 74581734 59241329 48943517 42407819 38188770 35139586
16656C5139586k546504k478208k340839k064633j672711j471812j312168r29666
$$ 35139586 32593082 30114874 27774035 25709402 24036691 22564879 21252711 20323045
16648B0323045n89641l13002Q2725M03845K27404k11245o64271j177537j479573
$$ 20323045 19733404 19420402 19503127 19906972 20134376 19923131 19258860 18081323 16601750
16639A6601750j387973j211500j077875q92567o20136m00321k36088k49697j32494
$$ 16601750 15213777 14002277 12924402 12031835 11411699 11011378 10775290 10525593 10393099
16630A0393099m3151k83629p30598r81372r01061p26443n99564n04751m58526
$$ 10393099 10349948 10066319 9335721 8354349 7453288 6726845 6127281 5622530 5164004
16621E164004k95874k48314k86431l52690l36707k68770k89996k50796l12178
$$ 5164004 4868130 4619816 4333385 3980695 3643988 3375218 3085222 2834426 2522248
16612B522248j77963J3591m4926j47421j55362o6384j04363j63056j32700p5077
$$ 2522248 2344285 2357876 2312950 2165529 2010167 1943783 1839420 1676364 1543664 1468587
16602A468587j69081j34864p2553j46423p8148J1676q708J3267o8194o7449p252
$$ 1468587 1299506 1164642 1092089 945666 867518 879194 870486 883753 815559 748110 740858
16591G40858L4558n6533j67259j11405l0433o3509q7795k1207o3731M6501L2982
$$ 740858 775416 718883 551624 440219 409786 346277 258482 237275 173544 220045 253027
16580B53027J7560k930j9792O9747j4107o6604m5129r0684l7972j21598j5052
$$ 253027 270587 267657 247865 317612 303505 236901 191772 101088 63116 -58482 -73534
16569g3534L0094J2348P7155N7809m4010p9543m9753k145M3117L204k9194j225
$$ -73534 -43440 -31092 46063 103872 59862 -19681 -69434 -71579 -28462 -25258 -54452 -55677
16557e5677L3708K609q0K9605l8250M3076P0611o7686m4231L860m055j2872L1527
$$ -55677 -21969 -19360 -19440 10165 -28085 14991 85602 17916 -26315 -22455 -26510 -39382 -7855
16544g855N1806K0197K0163K3901k9639N874n4174r7854k637j5188k7677j5156
$$ -7855 43951 64148 84311 108212 78573 84447 30273 -67581 -70218 -85406 -113083 -128239
16532a28239L133j100M736L7542J29635J21164o1426m9759M5865J8272m0080l5287
$$ -128239 -125106 -126206 -121470 -83928 45707 166871 105445 55686 101551 119823 79743 44456
16520D4456o5363P654J29806j2907K1704L8893n22L1202o8177k4506j139M6747
$$ 44456 -20907 -13253 116553 103646 125350 164243 163721 194923 126746 102240 101101 147848
16508A47848M5501p2533K2965j3211L461K3439o332N6049o302k6671J6522K0727
$$ 147848 193349 120816 143781 130570 134031 157470 151138 207187 200885 174214 190736 211463
16496B11463O8611J6846o5400j0582K959k3897n2372J1812M2981P5634m9250M9042
$$ 211463 280074 296920 231520 220938 223897 200000 147628 159440 202421 278055 228805 277847
16484B77847k7597J2476p0900j6386K7883L757n2841L6653J2048j7554K340Q0451
$$ 277847 250250 262726 191826 175440 203323 207080 154239 190892 202940 185386 187726 268177
16472B68177M9191j6693N8648m9366k3702M4240k5508o7749j6920K9601p7436
$$ 268177 317368 300675 359323 309957 286255 330495 304987 237238 220318 249919 172483
16461A72483m9037Q8329J51371M9221K0828o892N143N7341Q2187Q1678J63253
$$ 172483 123446 211775 363146 412367 433195 426303 431446 488787 570974 652652 815905
16450H15905J16308J26129J00793J86081J96805J69401K16747Q7327Q9644J15919
$$ 815905 932213 1058342 1159135 1345216 1542021 1711422 1928169 2015496 2105140 2221059
16440B221059J09645L6013o0804p4951j06246n4155j35857j56527j33337N5090
$$ 2221059 2330704 2366717 2305913 2230962 2124716 2070561 1934704 1778177 1644840 1699930
16430A699930J19986O4788Q1598J08541J25933J01867k4717J4337J13247Q627
$$ 1699930 1819916 1884704 1966302 2074843 2200776 2302643 2277926 2292263 2405510 2414137
16420B414137j04777n7822j80997j20454j93395j07705k09280j49206j55261k18097
$$ 2414137 2309360 2251538 2070541 1950087 1756692 1648987 1439707 1290501 1135240 917143
16410I17143j48934K7425N1753j13575n021j9276o8661O0400o2571n7005J5005
$$ 917143 768209 795634 847387 733812 728791 709515 640854 701254 638683 581678 596683
16399E96683q0973p391j7455J3313r8358j46824k0114M2110K0786K4771o173j21573
$$ 596683 515710 508319 490864 504177 405819 258995 238881 280991 301777 326548 320375 198802
16387A98802k1094R6870L4868r578m2872J258n568n2783J3648q620J0358n682
$$ 198802 177708 274578 309446 299868 256996 258254 252686 199903 213551 204931 215289 209607
16375B09607r3258J7590J8872J1946j1200l9040n2087p2829j8922M8503L4781
$$ 209607 116349 133939 152811 164757 153557 114517 62430 -10399 -29321 19182 53963
16364E3963P6986L9015Q852L3892m0137m9652q1372p9753j7932O2726J0809n4925
$$ 53963 130949 169964 178816 212708 172571 122919 41547 -38206 -56138 6588 17397 -37528
16352c7528O3280M4000M9924L5733L3053r9410j40975j7578L941j7267J4810M1640
$$ -37528 25752 69752 119676 155409 188462 89052 -51923 -69501 -65560 -82827 -68017 -26377
16340b6377M1955L6663o137q2828p2818L6605l4273j08860J1002K327K8340N7439
$$ -26377 15578 52241 46104 -36724 -109542 -72937 -107210 -216070 -205068 -202741 -174401 -116962
16328a16962J17876P8304j4281j7444J232l3404N3350o1248j7047m3370p6793
$$ -116962 914 79218 64937 47493 48725 15321 68671 7423 -9624 -52994 -129787
16317a29787K6726P5707J4966j55287l9990R3250L7021p6849J59M3210N5267M3089
$$ -129787 -103061 -27354 -12388 -167675 -207665 -114415 -77394 -154243 -154084 -110874 -55607 -12518
16305a2518k5253m7689N2664O6741q0965j6495l6479k0963J25500o768p2869R8555
$$ -12518 -37771 -85460 -32796 33945 -47020 -63515 -99994 -120957 4543 -2225 -75094 23461
16293B3461N8690j10756j51225m2709k5417N3811O8958Q5976M4960o3368p5989
$$ 23461 82151 -28605 -179830 -222539 -247956 -194145 -125187 -39211 5749 -57619 -133608
16282a33608J9686K0191o410K8397r2630L3308L5338M9128J0233o0505k3015R1696
$$ -133608 -113922 -93731 -100141 -71744 -164374 -131066 -95728 -46600 -36367 -96872 -119887 -28191
16270b8191J862p5020l1558M0675M7960l1529j4662K6229q049j00294Q4730K9213
$$ -28191 -26329 -101349 -132907 -92232 -44272 -75801 -90463 -64234 -72283 -172577 -87847 -58634
16258e8634p4043l4449L1347l2334O5735N5702j1237q5402l2868M535J4686O9197
$$ -58634 -132677 -167126 -135779 -168113 -102378 -46676 -57913 -143315 -176183 -171648 -156962 -87765
16246h7765N6968n7730n0740N5178J9319p64k9146Q358n0179p0967m2480M283
$$ -87765 -30797 -88527 -139267 -84089 -64770 -65534 -94680 -86322 -136501 -207468 -249948 -245665
16234b45665N9248K6114m1144O3626P5216L1095L2734j8990L5250J8097n3792
$$ -245665 -186417 -160303 -201447 -137821 -62605 -31510 1224 -17766 17484 35581 -18211
16223a8211j4403O2325j2991K8558P0931k8319l595J0265l7738J0430o4275j03767
$$ -18211 -32614 29711 16720 45278 116209 87890 84295 94560 56822 67252 2977 -100790
16211a00790m2988J0299L3031N9775K1754K1714K7444k837j2318P490m2229j0962
$$ -100790 -143778 -133479 -100448 -40673 -18919 2795 30239 27402 15084 22574 -19655 -30617
16199c0617K046J5189J1434J39990N5935o4984o6867k8837l0048Q8282J06808
$$ -30617 -28571 -13382 -1948 138042 193977 128993 62126 33289 3241 91523 198331
16188A98331l6187p7576n4305j0030j3597K1792O984k8398j8971o7868N2499J18970
$$ 198331 162144 84568 30263 20233 6636 28428 35412 7014 -11957 -79825 -27326 91644
16176I1644o014J7052p3498J0687n634J6426r06l4397J0171R9576M8361M1884
$$ 91644 85630 102682 29184 39871 34237 50663 49757 15360 25531 125107 173468 215352
16164B15352j8296n8153l1891j729R3976J31994K9492j5149L8335L6411j00140
$$ 215352 197056 138903 107012 105283 199259 331253 360745 345596 383931 420342 320202
16153C20202q6103r6584J6421L6116J947l0918q996J03987J30254Q8841J16796
$$ 320202 234099 137515 153936 190052 191999 161081 152085 256072 386326 475167 591963
16142E91963l5047m4922q4238n4055n2914M8119J42189l3850K7134r9571k5449
$$ 591963 556916 511994 427756 373701 320787 368906 511095 477245 504379 404808 379359
16131C79359L9648O1693o671n3855k096n7967j37540O9705J61387L2819o3603
$$ 379359 419007 480700 474029 420174 418078 360111 222571 292276 453663 486482 422879
16120D22879n250Q975o9245p8813j6589j6074l332p8266n7232M3817P1542N1730
$$ 422879 417629 426604 357359 278546 261957 245883 242551 164285 107053 150870 222412 274142
16108B74142j6009N0171m2891j1291j7859q3139n1701J7452n9939k3050M2268
$$ 274142 258133 308304 265413 254122 236263 153124 101423 118875 58936 35886 78154
16097G8154o0495q6881K7132m2180R4284R5939q4487l3785m3290q2655j3446J6402
$$ 78154 17659 -69222 -42090 -84270 10014 105953 21466 -12319 -55609 -138264 -151710 -135308
16085a35308J3104M4748p219k5589N0362o018j620j5411n556N141l1436m462M5972
$$ -135308 -122204 -77456 -84675 -110264 -59902 -65920 -67540 -82951 -88507 -83366 -114802 -119264 -73292
16072g3292J41043o1683p5661M1011O3048N6541k8283k6451J6944l3507m2611
$$ -73292 67751 6068 -69593 -28582 34466 91007 62724 36273 53217 19710 -22901
16061b2901J7614k7145l690L2773K2050m5423J645J0343L5378l2133p1905l4286
$$ -22901 -5287 -32432 -36122 -3349 18701 -26722 -25077 -14734 20644 -11489 -83394 -117680
16049a17680k6449O3528M9151l7222J282M7208L04n7461j2726K966l3370M3975
$$ -117680 -144129 -80601 -31450 -68672 -67390 -20182 -19878 -77339 -90065 -87099 -120469 -76494
16037g6494O1353K6946J1840n2535l9440P366K5870N1687n2935m7472Q1K4821
$$ -76494 -15141 11805 23645 -28890 -68330 -60964 -35094 16593 -36342 -83814 -83733 -58912
16025e8912M7342N3775M685N8411j2569q8695j2171l9716j00547j1402l8704P377
$$ -58912 -11570 42205 46890 105301 92732 4037 -8134 -47850 -148397 -159799 -198503 -191126
16013a91126P9794Q3300J6290k2299j1550L720j7059J1179l6359j9340m88j3696
$$ -191126 -111332 -28032 -11742 -34041 -45591 -41871 -58930 -47751 -84110 -103450 -103938 -117634
16001a17634n8093k8942O1884J32332O3907j21786p7796o6426L7770J46534J5459
$$ -117634 -175727 -204669 -142785 -10453 53454 -68332 -146128 -212554 -174784 -28250 -12791
15990a2791n2703j8204L8344N599L2720j0300l6501j190q1174q2712j583J0960
$$ -12791 -65494 -83698 -45354 -39755 -7035 -17335 -53836 -55026 -136200 -218912 -220495 -209535
15978b09535J2017K143M6401K1394K2497M6739K0483o3965J9521m1813p132K210
$$ -209535 -197518 -195375 -148974 -127580 -105083 -58344 -37861 -101826 -82305 -124118 -131250 -129040
15966a29040j3662Q2801J2951n5809j17134N4589R3327K517J9731L3630j1855
$$ -129040 -142702 -59901 -46950 -102759 -219893 -165304 -71977 -69460 -49729 -16099 -27954
15955b7954K5156l9360k4417R951K7128M3100k2613l3611m7219l1533o503M6090
$$ -27954 -2798 -42158 -66575 -56624 -29496 13604 -9009 -42620 -89839 -121372 -127875 -81785
15943h1785n2400J6800m608J7774J20967O6215K7192K4895q1368m5781J5464p7204
$$ -81785 -134185 -117385 -121993 -104219 16748 82963 110155 135050 53682 7901 23365 -53839
15931e3839o3985p731L694M5159L4256R4749j7209p7919l7880l6615k5605q9824
$$ -53839 -117824 -125555 -121861 -76702 -42446 52303 35094 -42825 -80705 -117320 -142925 -232749
15919b32749J9857R0855K7110j6537O1119k3452n6281l7486j9855L1276J5445
$$ -232749 -212892 -122037 -94927 -111464 -50345 -73797 -130078 -167564 -187419 -156143 -140698
15908a40698N7362J10420M4841o1788j21549k5198j10517K1483O3853P633l7980
$$ -140698 -83336 27084 71925 10137 -111412 -136610 -247127 -225644 -161791 -154158 -192138
15897a92138K9800J0057L7617Q1589p7898k7139N272n6594m0910L5172m7192R380
$$ -192138 -162338 -152281 -114664 -33075 -110973 -138112 -132840 -189434 -230344 -195172 -242364 -232984
15885b32984J9146j7361M5863L7553J12507K2755q4783J9708k2329K3410K3005
$$ -232984 -213838 -231199 -185336 -147783 -35276 -12521 -97304 -77596 -99925 -76515 -53510
15874e3510k6167o699M1531p827l3759P994N9647n9409l0377Q7352L1799O2043
$$ -53510 -79677 -86376 -44845 -52672 -86431 -78437 -18790 -78199 -108576 -21224 10575 72618
15862G2618J4450N3464J5275j22928j77248n4418O1950j550n871J8045K9428J01914
$$ 72618 87068 140532 155807 32879 -144369 -198787 -136837 -138387 -144258 -126213 -96785 5129
15850E129L3671p4835J8386l4281M4025O5183l782n6345m0232l6969m3326Q607
$$ 5129 38800 -36035 -17649 -51930 -7905 57278 53496 -2849 -43081 -80050 -123376 -114769
15838a14769N4483M6992M2336p7220l0785k8774p360L8538N1387J3530j18725
$$ -114769 -60286 -13294 29042 -48178 -78963 -107737 -115097 -76559 -25172 -11642 -130367
15827a30367n2572N0445Q2079m131l0048N5863j4368p123m4933l5268N4251Q7890
$$ -130367 -182939 -132494 -50415 -54546 -84594 -28731 -43099 -50222 -95155 -130423 -76172 11718
15815A1718k1433m791O2769j02655J8146q42o6225J0682M7349l2798K8041P1073
$$ 11718 -9715 -14506 48263 -54392 -36246 -37088 -103313 -92631 -45282 -78080 -50039 21034
15803B1034j2412O2417j4787o4982r2741l9900r61N0356P0519m9164q0474N8198
$$ 21034 8622 71039 56252 -8730 -101471 -141371 -142332 -91976 -21457 -70621 -151095 -92897
15791i2897Q0314R3961n4911K312k5009j3771l3144n4258K5309J5296p5283p9937
$$ -92897 -12583 81378 26467 28779 3770 -10001 -43145 -97403 -72094 -56798 -132081 -212018
15779b12018p2075M0343K4974l8088K6475N3286J01446N618L1131J04608q3954
$$ -212018 -284093 -243750 -218776 -256864 -230389 -177103 -75657 -70039 -38908 65700 -18254
15768a8254J4793J14539k5265q1612l605J4351q9311n9909j7489J0979Q8190l6687
$$ -18254 -3461 111078 85813 4201 596 14947 -74364 -134273 -151762 -140783 -52593 -89280
15756h9280P7824K5802m4140M0054k046l9949K2662j9877J32087M6094k3221l2370
$$ -89280 -11456 14346 -29794 10260 8214 -31735 -9073 -28950 103137 149231 126010 93640
15744I3640j64570j38464K4339J13862J8209o9150q7791n0859J4454L3618j7073
$$ 93640 -70930 -209394 -185055 -71193 -52984 -122134 -209925 -260784 -246330 -212712 -229785
15733b29785J9152J08864N4111J7305O2984n2158o4721P5620j8539l8769L6213
$$ -229785 -210633 -101769 -47658 -30353 32631 -19527 -84248 -8628 -27167 -65936 -29723
15722b9723O1740q1357J4501m8444k7222n316K0730J5661k1103r533M5953M4688
$$ -29723 32017 -49340 -34839 -83283 -110505 -115821 -95091 -79430 -100533 -110066 -64113 -19425
15710a9425j04115l3341Q0098J0306n6929p0332O1990R07N710j10998R8565Q2097
$$ -19425 -123540 -156881 -76783 -66477 -123406 -193738 -131748 -130841 -125131 -236129 -137564 -55467
15698e5467M9061r5606j5373M4624O5101N0077m4871o6047l8143K5364J8855J7458
$$ -55467 -6406 -102012 -117385 -72761 -7660 42417 -2454 -68501 -106644 -81280 -62425 -44967
15686d4967n2512j03592K7399R4655N7257l9086j24324j1332M0049P231K5625
$$ -44967 -97479 -201071 -173672 -79017 -21760 -60846 -185170 -196502 -156453 -149222 -123597
15675a23597Q6548K7175k3034p3626N5193p477k1368q3251Q9789P7491l7627p6816
$$ -123597 -37049 -9874 -32908 -106534 -51341 -58818 -80186 -163437 -73648 3843 -33784 -110600
15663a10600j0071N1583J7947j7600k1737j8939K8371N0519j4133n339R643k9441
$$ -110600 -120671 -69088 -51141 -68741 -90478 -109417 -81046 -30527 -44660 -49999 -40356 -69797
15651f9797N437N246P9688j02688r6891n0335J13332J9922O5934M2753J4032n5116
$$ -69797 -64360 -59114 20574 -82114 -179005 -229340 -116008 -96086 -30152 12601 26633 -28483
15639b8483m9447l9423p1177J591O5683N6089j054K8374P1787n0670q4918m0765
$$ -28483 -77930 -117353 -188530 -186939 -121256 -65167 -66221 -37847 33940 -16730 -101648 -142413
15627a42413q8452rM8580N2833k4206n5379P0251P2394J4666n0865m2824O427
$$ -142413 -230865 -230874 -182294 -129461 -153667 -209046 -138795 -66401 -51735 -102600 -145424 -138997
15615a38997N6595M6349j8039L1509l1774k1447K3865m8293L5938j7016O8975
$$ -138997 -82402 -36053 -54092 -22583 -54357 -75804 -51939 -100232 -64294 -81310 -12335
15604a2335P643K9285k0620J9351n6553n4960Q048n2097K1332N5143K6914o2761
$$ -12335 -4692 24593 3973 23324 -33229 -88189 -80141 -132238 -110906 -55763 -28849 -91610
15592i1610j4643K015J05249J8852j26711o8446n9987R4780J03748L695j20287
$$ -91610 -106253 -104238 1011 19863 -106848 -175294 -235281 -140501 -36753 -33058 -153345
15581a53345O313R5600k5082j8566L5082J0100p1024m5205o0573Q7006J06816
$$ -153345 -147032 -51432 -76514 -95080 -59998 -49898 -120922 -166127 -226700 -139694 -32878
15570c2878m5790k0946m1802n0715N5301P1304p1220p5194J3881R7196k5299q3862
$$ -32878 -78668 -99614 -141416 -192131 -136830 -65526 -136746 -211940 -198059 -100863 -126162 -210024
15558b10024J37905M7453l6089J1564n0286l2599Q9023l001m6409m632l3848n9648
$$ -210024 -72119 -24666 -60755 -49191 -99477 -132076 -43053 -46054 -92463 -97095 -130943 -190591
15546a90591L3880N9413P8485J9347J6281j9117q5494r541J08241P5472Q511m3687
$$ -190591 -156711 -97298 -18813 534 16815 -2302 -87796 -97337 10904 86376 94887 51200
15534E1200k6144n0856q5566M2965M002M5880M255n5412n4731J6638N5388N90
$$ 51200 25056 -25800 -111366 -68401 -64399 -18519 -14264 -69676 -124407 -107769 -52381 -51791
15522e1791O0592n5546m8164n83q773M3574n2950p294O6488n2657n100j3611o391
$$ -51791 8801 -46745 -94909 -95492 -104265 -60691 -113641 -120935 -54447 -107104 -112204 -125815 -132206
15509a32206j6580j11694M5685N3204K4n204P1671O3833J07403l2178r0516L4456
$$ -132206 -148786 -260480 -214795 -161591 -161567 -166771 -95100 -31267 76136 43958 -46558 -12102
15497a2102M2840o0106m3468K7905J1697n7475k4360m0420l8506O1410M501P0572
$$ -12102 30738 -29368 -72836 -44931 -33234 -90709 -115069 -155489 -193995 -132585 -128084 -57512
15485e7512L7402l7970q1474L2772J2133K9968n1056J7017q7195J9354J07350
$$ -57512 -20110 -58080 -139554 -106782 -94649 -64681 -115737 -98720 -185915 -166561 -59211
15474e9211L784K3064K1834k6146j7976j469L6923o4586O1460Q413r4715j4723
$$ -59211 -55427 -32363 -10529 -36675 -54651 -56120 -19197 -83783 -22323 -13910 -108625 -123348
15462a23348K4866m1277L326L6746K9970j39414K7297K2576L1850j9791K5516
$$ -123348 -98482 -139759 -136433 -99687 -69717 -209131 -181834 -159258 -127408 -147199 -121683
15451a21683m9111J4011O2357N8266o8870o0675q878l4946j5145K1818L1355K1380
$$ -121683 -170794 -156783 -94426 -36160 -105030 -165705 -174583 -209529 -224674 -202856 -171501 -150121
15439a50121N6585L4981N2614L6960m7080j37566K4138N5269J8910k611L3987
$$ -150121 -93536 -58555 -5941 31019 -16061 -153627 -129489 -74220 -55310 -57921 -23934
15428b3934J2666l2795K5706l1166l412J3705Q0075O450m8640n9418R156O0959
$$ -23934 -11268 -44063 -18357 -49523 -52935 -39230 40845 47295 -1345 -60763 -51607 9352
15416I352M0752n386N234m5987j17219j4499L4369M4546O545K4429l4140L4795
$$ 9352 50104 44718 49952 3965 -113254 -127753 -93384 -48838 -42293 -17864 -52004 -17209
15404a7209J745m147n3263Q996J3357J8755k0501j1670p4591n3176K3005Q0174
$$ -17209 -15464 -19611 -72874 -63878 -50521 -31766 -52267 -63937 -138528 -191704 -168699 -88525
15392h8525K9530j5905M4931j7859O455K8969J2146Q9168M1395k2628q6640n5994
$$ -88525 -58995 -74900 -29969 -47828 -41373 -12404 -258 88910 130305 107677 21037 -34957
15380c4957P9873N9305l0907K9444J9455j38213J2161K1574l5396J0460j1822
$$ -34957 44916 104221 73314 102758 122213 -16000 -3839 17735 -17661 -7201 -19023
15369a9023L9863J3378n7945q077l0319l5416n37m0809P133m408J02013P7740
$$ -19023 20840 34218 -23727 -31804 -62123 -97539 -98076 -138885 -131752 -136160 -34147 43593
15357D3593n1350O4768j0917q9371k1566k9860m8822J906N4411j784k9935n7686
$$ 43593 -7757 57011 46094 -43277 -64843 -94703 -143525 -141619 -87208 -88992 -118927 -176613
15345a76613k1481M9431K1896J0818O7563L5111j9418m6882K6676P2262j5781
$$ -176613 -198094 -148663 -126767 -115949 -48386 -13275 -32693 -79575 -52899 19363 3582
15334C582o2681l1468J4240K0436J1676k6039k2921j0433J8106M1459k6571l2037
$$ 3582 -59099 -90567 -76327 -55891 -44215 -70254 -93175 -103608 -85502 -44043 -70614 -102651
15322a02651K8137O2024K0385q4981m8705Q7405J5443N0933j3096o9224L3004
$$ -102651 -74514 -12490 7895 -77086 -125791 -38386 -22943 27990 14894 -54330 -21326
15311b1326J7758J5438N0856k6701n9810K9147l9312K3912n1748l5217J22937
$$ -21326 -3568 11870 62726 36025 -23785 5362 -33950 -10038 -61786 -97003 25934
15300B5934P514j08175k1570l9235K5728K6000r072M6045M671l6522J1413l5116
$$ 25934 33448 -74727 -96297 -135532 -109804 -83804 -92876 -46831 -42160 -78682 -67269 -102385
15288a02385k5177M3464M2400J964k8630J6717J8637K2966l056M0820M2973m4851
$$ -102385 -127562 -84098 -41698 -39734 -68364 -51647 -33010 -10044 -13100 27720 70693 25842
15276B5842j626l0321k4020M8327k5455l5532L2636o629O1700l5831l9427l767
$$ 25842 24216 -6105 -30125 18202 -7253 -42785 -10149 -16778 44922 9091 -30336 -34103
15264c4103J804j5074l9162J2913o0083L2156J7701r823P454n8821K83m9310o1091
$$ -34103 -32299 -47373 -86535 -73622 -133705 -101549 -83848 -93671 -86217 -145038 -144755 -194065 -255156
15251b55156j612M6452m140J0417K0535o02L2232N6965J51136Q89p7763J4937
$$ -255156 -256768 -210316 -214456 -204039 -183504 -184106 -151874 -94909 56227 57116 -20647 -5710
15239e710O5291l1123K4130k3371J3527J1175n164k8848o6593k9953l2787J1344
$$ -5710 59581 28458 52588 29217 42744 53919 48755 19907 -46686 -76639 -109426 -98082
15227i8082l9811k1636r840J0158P4798R7117k3384j03407J4333N4542l581l6717
$$ -98082 -137893 -159529 -169369 -159211 -84413 12704 -10680 -114087 -99754 -45212 -48793 -85510
15215h5510j5819K4091K3029n9203l9459K4039n0806l3003j7559j16470p191Q2558
$$ -85510 -101329 -77238 -54209 -113412 -152871 -128832 -179638 -212641 -230200 -346670 -353861 -271303
15203b71303J33374J22108j8911q7235L6838j8349j8253p374K5426O7307r952
$$ -271303 -137929 -15821 -34732 -121967 -85129 -103478 -121731 -129105 -103679 -36372 -46324
15192d6324L61O2542l0592m7131m4586j7526j577L5925j7604O8458P804o2203
$$ -46324 -45963 16579 -14013 -61144 -105730 -123256 -124833 -88908 -106512 -38054 -30250 -92453
15180i2453k0399k2791Q2387Q0715K2244j7744p9993J8319N612o0530k0288J08197
$$ -92453 -112852 -135643 -53256 27459 49703 31959 -48034 -29715 -24103 -84633 -104921 3276
15168C276k9177n3069R177j8386N0569Q300p3113m408L2616l6819N1051P7372
$$ 3276 -25901 -78970 -69793 -88179 -37610 -29310 -102423 -106831 -74215 -111034 -59983 17389
15156A7389J9474n977r7385m8555K2229j5118q15L5542Q4716J5792m1022J6171
$$ 17389 36863 30886 -66499 -115054 -92825 -107943 -108758 -73216 11500 27292 -13730 2441
15144B441k9215l7738L8195M882q4691k8599J7005k464l5869J05423J08411q97
$$ 2441 -26774 -64512 -26317 -21435 -106126 -134725 -117720 -120184 -156053 -50630 57781 56884
15132E6884r5848n665J15190K006j39091m6526M0241K5025m9386m6010q1205K898
$$ 56884 -38964 -44629 70561 72567 -66524 -113050 -72809 -47784 -97170 -143180 -224385 -221487
15120b21487R3010J32659k2489r3308o8132l2558J09197O1170j0006K331l365
$$ -221487 -128477 4182 -18307 -111615 -179747 -212305 -103108 -41938 -51944 -49613 -52978
15109e2978m3033N089L5711L6243l0496q7334k1182P6028L8838k1797M0925J670
$$ -52978 -96011 -90922 -55211 -18968 -49464 -136798 -157980 -81952 -43114 -64911 -23986 -22316
15097b2316Q355N3721l7455q1731K761k9774l8311P312R042l3971P909L7201N9764
$$ -22316 -13961 39760 2305 -79426 -76665 -106439 -144750 -137438 -128396 -162367 -154458 -117257 -57493
15084e7493L1067m3299k02O8851n7166p1878m20J07316Q6456O7593M4158j02623
$$ -57493 -26426 -69725 -69927 -1076 -58242 -130120 -130540 -23224 63232 130825 174983 72360
15072G2360n8252m2699K129k3991j667o7624N103j1041O1981M6328Q0073j140
$$ 72360 14108 -28591 -26462 -50453 -52120 -119744 -114641 -125682 -63701 -17373 62700 61560
15060F1560n953J10314O0695r1875n8618l6165p9477m7455p5664M9138R0322J17404
$$ 61560 55607 165921 226616 134741 76123 39958 -39519 -86974 -162638 -113500 -23178 94226
15048I4226K6664N5m7588q1643l0386J2122M1132K0828L4871j5281j15134N050
$$ 94226 120890 120945 73357 -8286 -38672 -26550 14582 35410 70281 55000 -60134 -55084
15036e5084J03534o3432j0525L3035l4003p5309L4408j673L8660l1408j8815K4002
$$ -55084 48450 -14982 -25507 7528 -26475 -101784 -67376 -69049 -30389 -61797 -80612 -56610
15024e6610O7503l1118j4880R4599P3273k1919n9548j33859M2458P9450m1202
$$ -56610 10893 -20225 -35105 59494 132767 110848 51300 -82559 -40101 39349 -1853
15013a853l1347p80k5111k1607K2619m7315p8684k4900J16172Q5805N7257O22
$$ -1853 -33200 -33980 -59091 -80698 -58079 -105394 -184078 -208978 -92806 -7001 50256 50878
15001E0878m1398O1613N9006j8083r9896o1084j8442J18145l2416q251Q297k2179
$$ 50878 9480 71093 130099 112016 12120 -48964 -67406 50739 18323 10072 18369 -3810
14989c810J5922r478j4666j447o9658q3316K303N0051n1579k0353J47029N0856
$$ -3810 12112 2634 -12032 -13479 -83137 -166453 -164150 -114099 -165678 -186031 -39002 11854
14977A1854q8835m0157K6155N2580O051o2212n1508r639L5185R0232Q32p8375
$$ 11854 -76981 -117138 -90983 -38403 -32352 -94564 -146072 -155711 -120526 -30294 -29462 -107837
14965a07837q8503L0492q57r263L5892M7681J997R948K2291J6101J2559j6009
$$ -107837 -196340 -165848 -166705 -175968 -140076 -92395 -90398 -80450 -58159 -42058 -29499 -45508
14953d5508P6659M2726o9680j00824j3364j070N0170M5220O6105J8236r627N238
$$ -45508 31151 73877 4197 -96627 -109991 -111061 -60891 -15671 50434 68670 59043 64281
14941F4281R918m2775Q078o028L5467M0531r5379J4898K2081l7498m3943O7966
$$ 64281 74199 31424 39502 33474 68941 109472 14093 28991 51072 13574 -30369 37597
14929C7597K6513m4306J1588K9548L753J2427q880j0100n4079O1324l8945j794
$$ 37597 64110 19804 31392 60940 64693 77120 68240 58140 4061 65385 26440 24646
14917B4646M1100m4097q3566l8961N2206K7110n1074P7787Q8309j5920o5441l0431
$$ 24646 65746 21649 -61917 -100878 -48672 -21562 -72636 5151 93460 77540 12099 -18332
14905a8332L8732p428K6578K0521j4999M1932N8274j6241k7175M4537L7254p2345
$$ -18332 20400 12972 39550 60071 45072 87004 145278 129037 101862 146399 183653 111308
14893A11308o0111L551q4702n6966j5670Q2003M6860k9387m6565N9446N5963o331
$$ 111308 51197 54748 -29954 -86920 -102590 -20587 26273 -3114 -49679 9767 65730 59399
14881E9399l1062k3757P0722M4518k393j8843j13625p7899q0843l2518Q4843J22261
$$ 59399 28337 4580 75302 119820 117427 98584 -15041 -92940 -173783 -206301 -121458 803
14869H03R80l0092k432P199k2559K7466M2716l3417p9435J2405K8551P1789J5931
$$ 803 1783 -28309 -30741 -23542 -46101 -18635 24081 -9336 -88771 -76366 -47815 23974 39905
14856C9905k9650l5284Q0140m5186M326k3930N3074l7994r3725O8120N8128J8919
$$ 39905 10255 -25029 55111 9925 14251 -9679 43395 5401 -88324 -20204 37924 56843
14844E6843k1995n2568j10685M5635K7301Q329K9397J2324l3996k7288k4871O3805
$$ 56843 34848 -17720 -128405 -82770 -55469 -47140 -17743 -5419 -39415 -66703 -91574 -27769
14832b7769N2546O5533k5307o8028M3616M801m7518q4435N2888N2728j4831m2719
$$ -27769 24777 90310 65003 -3025 40591 45392 -2126 -86561 -33673 19055 4224 -38495
14820c8495J0517n3639M7627K6169K7974N7134K7027J4066K3432j4349l3004q090
$$ -38495 -27978 -81617 -33990 -7821 20153 77287 104314 118380 141812 127463 94459 86369
14808H6369p2059p6477k5373M1850J03013M0324m0417P2201p8323n7399j6289
$$ 86369 14310 -62167 -87540 -45690 57323 97647 57230 129431 51108 -6291 -22580
14797b2580P5227j6612r4504o6814N2329J27343l5681K1816O9709N356O3425l730
$$ -22580 52647 36035 -58469 -125283 -72954 54389 18708 40524 110233 115589 179014 175284
14785A75284L462J9365q6837n0191m113r6896j0040J5825R2972K4991l9477o9609
$$ 175284 178746 198111 111274 61083 56970 -39926 -49966 -34141 58831 83822 44345 -25264
14773b5264M2855n5404l4698k5014J5252o0342L517Q7127O5746N4893k3743k1171
$$ -25264 17591 -37813 -72511 -97525 -82273 -142615 -139098 -51971 13775 68668 44925 23754
14761B3754O7457J1936J5900j5774L0629q0723P487l0686r5458p9465k5859N7273
$$ 23754 91211 103147 119047 103273 133902 53179 60666 29980 -65478 -144943 -170802 -113529
14749a13529P4928N4354r718J6940M5713n330L2431p43l7144j9958l8553m7837
$$ -113529 -38601 15753 6035 22975 68688 63358 95789 95046 57902 37944 -609 -48446
14737d8446K3037K9584J6369k611K196m3077q63L5305M131N2440k50N6939m3197
$$ -48446 -25409 4175 20544 17933 20129 -22948 -23811 11494 15625 68065 67815 124754 81557
14724H1557K5404L419P964m7790L2167L2125l2489l6519k087M8832J5857j64839
$$ 81557 106961 110380 118344 70554 102721 134846 102357 65838 63751 112583 128440 -36399
14712c6399l2344J0845j9148N5097O9884N1484K6594p1075J3098l6130q9904m2352
$$ -36399 -68743 -57898 -77046 -21949 47935 99419 126013 54938 68036 31906 -57998 -100350
14700a00350Q3762M4284J6887k3053O2207K9633l5480n1263n120J667J917O804
$$ -100350 -16588 27696 44583 21530 83737 113370 77890 26627 21507 23174 25091 31895
14688C1895M6221m3948o1206J1537M1543k3835K664L0947J7809j3059l3923K8077
$$ 31895 78116 34168 -27038 -15501 26042 2207 4871 35818 53627 40568 6645 34722
14676C4722M4452J3030l6261K1546p0397k3070P9740N4060n4047n0508j08208
$$ 34722 79174 92204 55943 77489 7092 -15978 63762 117822 63775 13267 -94941
14665i4941P2153O0540j268J4188Q1754N9055J6947j03426q3291J6179k6248n5767
$$ -94941 -22788 37752 36484 50672 132426 191481 208428 105002 21711 37890 11642 -44125
14653d4125k8464m791j60466j3089R9359J00522K7880N5926K1189l128m4902m1515
$$ -44125 -72589 -77380 -237846 -250935 -151576 -51054 -23174 32752 53941 50813 5911 -35604
14641c5604j3347M3446J8202j1109L556R3590J4410k3918o2827j5656j4430M1404
$$ -35604 -48951 -5505 12697 1588 5144 98734 113144 89226 26399 10743 -3687 37717
14629C7717O5911k1896j22831l5138J5317m5609P0981L5895p8851q0511l6232
$$ 37717 103628 81732 -41099 -76237 -60920 -106529 -35548 347 -78504 -159015 -195247
14618a95247M7874K3470J02318P5577j4606P6727k9435m9809J1421O889q5353
$$ -195247 -147373 -123903 -21585 53992 39386 116113 86678 36869 48290 55179 -30174
14607c0174p6962r4099J06905P4065l3640m1573O5681L0173p005k7961j05268
$$ -30174 -107136 -201235 -94330 -20265 -53905 -95478 -29797 376 -6629 -34590 -139858
14596a39858K0589J14735P3215k6898P216L0230J04867O241k2527p019q2283j21005
$$ -139858 -119269 -4534 68681 41783 48999 79229 184096 190337 167810 160791 78508 -42497
14584d2497l2612O1277M1001L5103K3436J1854l3410L203q359L1709l1242m7407
$$ -42497 -75109 -13832 27169 62272 85708 97562 64152 67355 58996 90705 59463 12056
14572A2056j31464o6388n608P6514J07945N1270p2528n9676o008K3942Q0042J0099
$$ 12056 -119408 -185796 -191404 -114890 -6945 44325 -28203 -87879 -93887 -69945 10097 20196
14560B0196o450J2941k0771k9961J6821O2052K5758L8873J16597m3015p0551L3848
$$ 20196 13746 26687 5916 -24045 -7224 54828 80586 119459 236056 193041 122490 156338
14548A56338k4488l3623n9788j5715J3700O6069J7707j25732k9591Q3570K1062
$$ 156338 131850 98227 38439 22724 36424 102493 120200 -5532 -35123 48447 69509
14537F9509o6527l2807M418k5059m7615o072J58196J22741N757q0333j7360k2243
$$ 69509 2982 -29825 -25407 -50466 -98081 -104153 54043 176784 182541 102208 84848 62605
14525F2605m90K0853L3844K3322M5205n0973j09147J0066P0856K53o6777L7352
$$ 62605 62115 82968 116812 140134 185339 134366 25219 35285 106141 106394 39617 76969
14513G6969o9254m8961L0915o180q7299k5133L1433O6820o7583l8793R4757Q3306
$$ 76969 7715 -41246 -10331 -16511 -103810 -128943 -97510 -30690 -98273 -137066 -42309 40997
14501D0997j3155L5717m7380l3820q830q3512N3638M9422K4082m4053q694o221
$$ 40997 27842 63559 16179 -17641 -26471 -109983 -56345 -6923 17159 -26894 -35588 -41809
14489d1809M9193J12456l8402p617L3652m0089j0652m4053j022N483J3358L3010
$$ -41809 7384 119840 81438 73821 107473 67384 56732 12679 11657 17140 30498 63508
14477F3508R1528M2877o8943o0661p9583j9546J16123P1228q0250o2082J5202
$$ 63508 155036 197913 128970 68309 -11274 -30820 85303 156531 76281 14199 29401
14466B9401k8490q813L9360M5M248n0518N1006q1515n6353K8843k0470j7035P3145
$$ 29401 911 -7902 31458 31503 35751 -14767 36239 -45276 -101629 -72786 -93256 -110291 -37146
14453c7146N1633L0462p454N6528J5911k7926n1015k3090N0588N3629j082o7975
$$ -37146 14487 44949 37495 94023 109934 82008 30993 7903 58491 112120 111038 43063
14441D3063l3101n070q547J7985p9176k7760J00512M0002n8679j3N8338N9130
$$ 43063 9962 4892 -3655 14330 -64846 -92606 7906 47908 -10771 -10784 47554 106684
14429A06684K5980o2192r6863K6494Q8139M3332K1615l6639o5042K9055j0742
$$ 106684 132664 70472 -26391 103 88242 131574 153189 116550 51508 80563 69821
14418F9821q1194n5474K7610J6425M0181J8475N8790K0885j9862p5224n6236j6769
$$ 69821 -11373 -66847 -39237 -22812 17369 35844 94634 115519 95657 20433 -35803 -52572
14406e2572l2315J8764M8879o483N8362P9599k3168j31797p4638P7947J39240
$$ -52572 -84887 -66123 -17244 -23727 34635 114234 91066 -40731 -115369 -37422 101818
14395A01818M8209n6798k1110M9433j759m4558j8356k7898K092k6231L2144L1022
$$ 101818 150027 93229 72119 121552 119793 75235 56879 28981 31073 4842 36986 68008
14383F8008j5839o4428j1883K7792m2804r5581L7010N8934L9027l6805j6221M2168
$$ 68008 52169 -12259 -24142 3650 -39154 -134735 -97725 -38791 236 -36569 -52790 -10622
14371a0622O6918N4341L3570n6310k8436O9849K9744n2737q2012j15463J5416
$$ -10622 56296 110637 144207 87897 59461 129310 159054 106317 24305 -91158 -75742
14360g5742O1313L2018k1080L429K234k619l3088M4528M2624j0305L4132K8750
$$ -75742 -14429 17589 -3491 -62 2172 -447 -33535 10993 53617 43312 77444 106194
14348A06194O4748o6490O209J9049m3782J0421L4854M0434K7109p7285m4429N6487
$$ 106194 170942 104452 110661 129710 85928 96349 131203 171637 198746 121461 77032 133519
14336A33519R898j7652K5640L2101n2905O735J4284r5982k0442M010n5234L5944
$$ 133519 143417 125765 151405 183506 130601 137336 151620 55638 35196 39206 -16028 19916
14324A9916J9063K5444J3271J3573M889J2885K61J0428m5477o7591Q6160J4445
$$ 19916 38979 64423 77694 91267 96156 109041 109302 119730 74253 6662 92822 107267
14312A07267j4312k7241n3831k1734l2910L1502M9406N8115J30089m1759k8103
$$ 107267 92955 65714 11883 -9851 -42761 -11259 38147 96262 226351 184592 156489
14301A56489k3229m8081l4275N85N814L1022M4192J9153K9976K0705m4491L8473
$$ 156489 133260 85179 50904 51489 57303 88325 132517 151670 181646 202351 157860 196333
14289A96333J01492K8160n960l0238j14480m0555Q0625m7306l7502K6764l0440
$$ 196333 297825 325985 320025 289787 175307 134752 215377 168071 130569 157333 126893
14278A26893K2179K2031J0991J4020n7322N7239M9013M8375Q6049J27252J43806
$$ 126893 149072 171103 182094 196114 138792 196031 245044 293419 379468 506720 650526
14267F50526J21707J58458J82988J88081J41148J10116J3456j33735j87774k19507
$$ 650526 772233 930691 1113679 1301760 1442908 1553024 1566480 1432745 1244971 1025464
14257A025464j98733j57549j36627j09035m4746r0018q2596J00305M4393J9524
$$ 1025464 826731 669182 532555 423520 378774 288756 206160 306465 350858 370382
14247C70382L6501k9243q1972l0893p188r016O3641O94j35090j45675j8414O7933
$$ 370382 406883 377640 295668 264775 257587 248571 312212 312906 177816 32141 13727 81660
14235H1660m1793k6017Q7193Q0737K8395k4381M1843K4460j9529m8008N7784r0364
$$ 81660 39867 13850 101043 181780 210175 185794 227637 252097 232568 184560 242344 151980
14223A51980j27808J5086K1280L3135k3079P7058n7379r704R526m916j8838n7370
$$ 151980 24172 39258 60538 93673 70594 147652 90273 80569 90095 85179 66341 8971
14211H971m241O8817J5079L3611r202M8723J9750J5793P541M3289o1383j0746
$$ 8971 4730 73547 88626 122237 113035 161758 181508 197301 204842 248131 186748 176002
14199A76002N0832l3232J9870J6853p125j08823j45557j4930R8883j0174o0790
$$ 176002 226834 193602 213472 230325 223200 114377 -31180 -46110 52773 42599 -18191
14188a8191J6215p1068k8724J13503L6012J4155r139j4146J7819K6503L0209q727
$$ -18191 -1976 -73044 -101768 11735 47747 61902 52763 38617 56436 82939 113148 104421
14176A04421K8309k5807m1193P0015J56688Q595p4832p5591n3963O4343M1352
$$ 104421 132730 106923 65730 135745 292433 301028 226196 150605 96642 160985 202337
14165B02337l1880O1881k1649r842k2417L2757o6074q0282r9639J1115P9005R4512
$$ 202337 170457 232338 210689 200847 178430 211187 145113 64831 -34808 -23693 55312 149824
14153A49824O3511l2886m801Q1977m1365r5047k2544N685o9434N8697O8345k7426
$$ 149824 213335 180449 175648 257625 216260 121213 98669 104354 34920 93617 161962 134536
14141A34536n1642L6570j8412K8755l7878Q508k6820P9334O3829L1281o8097o4119
$$ 134536 82894 119464 101052 129807 91929 100437 73617 152951 216780 248061 179964 115845
14129A15845M820N738P021J7311j4312j719K8545p995K5222M0065r1468p4584
$$ 115845 120665 126403 133424 150735 136423 134704 163249 155254 180476 220541 129073 54489
14117E4489J6253j8851m281J6278Q731k4617o5959K0131Q3210j0440n0743p64
$$ 54489 70742 51891 47610 63888 72619 48002 -17957 2174 85384 74944 24201 23437
14105B3437r895R0288Q4765j4698r518M0791p6803p3767K9828N8751M4926K8873
$$ 23437 13542 103830 188595 173897 164379 205170 128367 54600 84428 143179 188105 216978
14093B16978L6947p8245k6231k2747l7269q8620M8582P7032k7454k9423P585N6924
$$ 216978 253925 175680 149449 126702 89433 813 49395 126427 98973 69550 77135 134059
14081A34059P3871o5450n5195K5K1408j9449Q1456N5040q222L4587l5826j5155
$$ 134059 207930 142480 87285 87310 108718 89269 170725 225765 217543 252130 216304 201149
14069B01149n5760j5468j81J4002N9192M6907o333l3157m4771n4433J7851J0743
$$ 201149 145389 129921 129740 143742 202934 249841 243508 210351 165580 111147 128998 139741
14057A39741j6122J0680k915m3126O8959L7763J0739j8365O258Q0840Q0446L8101
$$ 139741 123619 134299 131384 88258 157217 194980 205719 187354 193612 274452 354898 392999
14045C92999j5703j031l2711J47898N1533p8840m151j7404j04207P259O6709k9363
$$ 392999 377296 376265 343554 491452 542985 464145 459994 442590 338383 345642 412351 382988
14033C82988q5877k3348M1980R3934K9614J551m3436n8897k8534Q022j3116J2192
$$ 382988 297111 273763 315743 409677 439291 440842 397406 338509 309975 317997 304881 317073
14021C17073L0720o8730o6429k5282J543K8299O1197K4435R349m6284p9047j1138
$$ 317073 347793 279063 212634 187352 188895 217194 278391 302826 312175 265891 186844 175706
14009A75706j6341M9959J7243k7937L1500n8911J8928O4214P8062k1283m2735
$$ 175706 159365 209324 226567 198630 230130 171219 190147 254361 332423 311140 268405
13998B68405M6398j166o5417m9400j9388M4103n7036n5362M5070L3678M603q2772
$$ 268405 314803 313637 248220 198820 179432 223535 166499 111137 156207 189885 194488 111716
13986A11716k2811L9912J03668O4252M9734P122k9776r519K9789N523M5747l280
$$ 111716 88905 128817 232485 296737 346471 353593 323817 314298 344087 349610 395357 392077
13974C92077q0692O791j1313J5751N9902j14756p4762J31008L0504j4987j5202
$$ 392077 311385 318176 306863 322614 382516 267760 192998 324006 354510 339523 324321
13963C24321L353J1593J1958q454j4225J8736q2827n1899N3060K1345o679M5265
$$ 324321 327674 339267 351225 342771 328546 347282 264455 212556 265616 286961 280282 325547
13951C25547P9513m9718j22539J51P8513O026L2897l8146R4480P0310p1877q7017
$$ 325547 405060 355342 232803 232954 311467 317493 350390 312244 406724 477034 405157 318140
13939C18140R888J07432j9409J6602o5740n5777p0812l2487K8014Q2003J5754
$$ 318140 328028 435460 416051 432653 366913 311136 240324 207837 235851 317854 333608
13928C33608k3435J00288P1484l5698O6627O5310l2684n0324q070q6815k0870
$$ 333608 310173 410461 481945 446247 512874 578184 545500 495176 487106 400291 379421
13917C79421P9648J0863K7562J06137J02946P0641l6499q1886r6059n2548J5919
$$ 379421 459069 469932 497494 603631 706577 777218 740719 658833 562774 510226 526145
13906E26145J17283k8596j0889L6580j5374m3084m0262k8349J21906P1707L2360
$$ 526145 643428 614832 603943 640523 625149 582065 541803 513454 635360 707067 739427
13895G39427N4403J38892J33340J16710J12723J94402J66073K58093L17676K11674
$$ 739427 793830 932722 1066062 1182772 1295495 1489897 1655970 1914063 2231739 2443413
13885B443413J43845N6072o8970j27839k25468k01371j74857j94204j63709q3818
$$ 2443413 2587258 2643330 2574360 2446521 2221053 2019682 1844825 1650621 1486912 1403094
13875A403094l8398j54090j02521k9261p7621r3634J4786O7046k539O2969Q1965
$$ 1403094 1364696 1210606 1108085 1078824 1001203 907569 922355 989401 986862 1049831 1131796
13864A131796M6978K6365K9034M1931r8136k4076R9732M4146N2309M716K9422
$$ 1131796 1178774 1205139 1234173 1276104 1177968 1153892 1253624 1297770 1350079 1354795 1384217
13853A384217M1367k7128q6750k4275K7849q7500K1029M5761K8848j7590j3837
$$ 1384217 1425584 1398456 1311706 1287431 1315280 1227780 1248809 1294570 1323418 1305828 1291991
13842A291991m7044M9645P1563L3853m983Q4633Q9152L6412N5400j939j680K2049
$$ 1291991 1244947 1294592 1366155 1400008 1395025 1479658 1568810 1605222 1660622 1658683 1657003 1679052
13830A679052K5798P7340O1222J08239Q8451M5657K1723j6194O2026M2064O671
$$ 1679052 1704850 1782190 1843412 1951651 2040102 2085759 2107482 2091288 2153314 2195378 2202049
13819B202049J68355P7041Q8084J61845J00172R8068J80896K03137K13689K15143
$$ 2202049 2370404 2447445 2535529 2697374 2797546 2895614 3076510 3279647 3493336 3708479
13809C708479K92470L22292L50866M47244O42627O94708P70723J025911J310196
$$ 3708479 4000949 4323241 4674107 5121351 5763978 6458686 7229409 8255320 9565516
13800I565516J454005J511981J634600J852354J996299K334369K919524L847595
$$ 9565516 11019521 12531502 14166102 16018456 18014755 20349124 23268648 27116243
13792B7116243N056195O623002Q913681J2326422J7210058K4016569L2302868
$$ 27116243 32172438 38795440 47709121 60035543 77245601 101262170 133565038
13785A33565038M0413686M4284840M1076600K8764633Q804457j3387972l2244558
$$ 133565038 173978724 218263564 259340164 288104797 296909254 283521282 251276724
13778B51276724m2490493m4165492l8037171k8721409j9613113j3075933q859013
$$ 251276724 208786231 164620739 126583568 97862159 78249046 65173113 56314100
13771E6314100o106242m445333l385736k573521j786239j106441n69080k5302
$$ 56314100 50207858 45762525 42376789 39803268 38017029 36910588 36341508 36316206
13763C6316206L87676O28361P52345N41195k30121j140143k321666l130168l358601
$$ 36316206 36703882 37332243 38084588 38625783 38395662 37255519 34933853 31803685 28445084
13754B8445084l367771l045594k447112k045857j708974j385251j052289q70219
$$ 28445084 25077313 22031719 19584607 17538750 15829776 14444525 13392236 12522017
13746A2522017q54111o82515o01800o26728o45028o88405n57743m31510m13671
$$ 12522017 11667906 10985391 10383591 9756863 9111835 8423430 7865687 7434177 7020506
13737G020506m83591m84222m22774m37766m21347k79326l38705l18468j91714
$$ 7020506 6536915 6052693 5629919 5192153 4770806 4491480 4152775 3834307 3642593
13728C642593k62643k34034j62273k25017j83981j71757r8931j62925j90960r5878
$$ 3642593 3379950 3145916 2983643 2758626 2574645 2402888 2303957 2141032 1950072 1854194
13718A854194p2508j69929q0747L0756o1901k46186j62912l1742j434p177o9254
$$ 1854194 1781686 1611757 1531010 1561766 1499865 1253679 1090767 1059025 1057591 1050414 981160
13707I81160q5381K0199n1934O3953k047j67368j60961O1280K0339K7270N3655
$$ 981160 895779 915978 864044 927997 925950 758582 597621 658901 679240 706510 760165
13696G60165j7325r5447o5809o5783p6735j00748l9541l8483l4286N2014J8877
$$ 760165 742840 647393 581584 515801 439066 338318 298777 260294 226008 278022 296899
13685B96899j989M5392m3222L49J1474n6780k9275l0290P1568q3801j18984l7290
$$ 296899 294910 340302 297080 297429 308903 252123 222848 192558 264126 180325 61341 24051
13673B4051l0807m9794l5146O59R9088N5189m5608K0293L6423R2230L3234O1578
$$ 24051 -6756 -56550 -91696 -91037 8051 63240 17632 37925 74348 166578 199812 261390
13661B61390L8219j3476n9316K6116O805m4913l8976p0673N3542l1217k3211m3785
$$ 261390 299609 286133 226817 252933 259738 214825 175849 105176 158718 127501 104290 60505
13649F0505k4655k2319N0661N4033O1144J5597p7712l8940m190J2301k8865o2803
$$ 60505 35850 13531 64192 118225 179369 194966 117254 78314 74124 86425 57560 -5243
13637e243K2212Q842K5144L6173M0538k1856J14304L5221n6124m8062o9384o7303
$$ -5243 16969 25811 50955 87128 127666 105810 220114 255335 199211 151149 81765 14462
13625A4462P9479M0777p4249r1681l662m2728n960M5111Q6517Q9560Q8323p392
$$ 14462 93941 134718 60469 -31212 -34874 -77602 -83562 -38451 48066 137626 225949 218557
13613B18557j18082R527M5461k4926l2445l0563L129q425J1381Q835P938j08109
$$ 218557 100475 110002 155463 130537 98092 67529 70658 62233 73614 82449 90387 -17722
13601a7722m6605R0146l5322K8152J1430Q6377m1693l9989k739k5838J1428N832
$$ -17722 -64327 25819 -9503 18649 30079 116456 74763 34774 32035 6197 17625 23457
13589B3457L394l7823N8813J28303k7433P1565k4071n7442n0499q9792q89n2897
$$ 23457 26851 -10972 47841 176144 148711 220276 196205 138763 88264 -1528 -2417 -55314
13577e5314J3486N9100L3552q539j00399k8386k8807J1022K9718k7645q4440L9261
$$ -55314 -41828 17272 50824 42285 -58114 -86500 -115307 -104285 -74567 -102212 -186652 -147391
13565a47391K8699j5595P9104j0467o2125n24N7749K9961R5107j2145o8842J546
$$ -147391 -118692 -134287 -55183 -65650 -127775 -128299 -70550 -40589 54518 42373 -26469 -24923
13553b4923J5384n5944o201o7110m2316J5535L2166P979m4237j0470P6779J2858
$$ -24923 -9539 -65483 -71684 -138794 -181110 -165575 -133409 -125430 -169667 -180137 -103358 -90500
13541i0500k3368o761k0295l1928j7680L5919l6000j70236m229O2240P5334Q1666
$$ -90500 -113868 -120629 -140924 -172852 -190532 -154613 -190613 -360849 -365078 -302838 -227504 -145838
13529a45838M0606L2349K2510K9618j70N4877Q7692l6033n0871q7133k0597N6874
$$ -145838 -105232 -72883 -50373 -20755 -20925 33952 121644 85611 34740 -52393 -72990 -16116
13517a6116l8488m120o7054K2281M0567k8111n5238r6732M3475N2440R917l9691
$$ -16116 -54604 -58724 -125778 -103497 -62930 -91041 -146279 -243011 -199536 -147096 -137179 -176870
13505a76870J7270K6205L2909l5856n6177O3015j2765j4349M9230n9528j487O5951
$$ -176870 -159600 -133395 -100486 -136342 -192519 -129504 -142269 -156618 -107388 -166916 -168403 -102452
13493a02452J6480R858K3209l8561j1736k5457m428Q1636J05867m1649m5005k8346
$$ -102452 -85972 -76114 -52905 -91466 -103202 -128659 -133087 -51451 54416 12767 -32238 -60584
13481f0584J2798m3091k1283K1730j5775K0876o0878k7307R0418J8535q9501N6215
$$ -60584 -47786 -90877 -112160 -90430 -106205 -85329 -146207 -173514 -83096 -64561 -154062 -97847
13469i7847Q8091p1811q8180L5535j2954O546q2835M5069J89836K3794p0116j02056
$$ -97847 -9756 -81567 -169747 -134212 -147166 -140620 -223455 -178386 11450 35244 -34872 -136928
13457a36928l2338P1680N4221J6189k3481o0681o511n500J11341K0307J529o5255
$$ -136928 -169266 -97586 -43365 -27176 -50657 -111338 -117849 -123349 -12008 8299 9828 -55427
13445e5427J0180O4337P0008l1741m0693J242J9314O7o0639n241J959R959j5887
$$ -55427 -45247 19090 89098 57357 16664 17906 37220 37287 -23352 -28593 -26634 -16675 -32562
13432c2562r0m1776k9755L0399m2232m375R0736M2804k6789n7846p271N8462R674
$$ -32562 -32652 -74428 -104183 -73784 -116016 -120391 -29655 13149 -13640 -71486 -78757 -20295 -10621
13419a0621k2926M3143r0162j05499K7315J17902J9563N2235l5272j2637M5377
$$ -10621 -33547 9596 -80566 -186065 -158750 -40848 -21285 30950 -4322 -16959 28418
13408B8418k9866R384m82q730R7430j5399o0077p6387J3006N7361Q8755P791j14654
$$ 28418 -1448 7936 7454 -1276 96154 80755 20678 -55709 -42703 14658 103413 111204 -3450
13395c450j38578p2149p289K1977Q9455L2980J7932O2448N1119n4696j45420o2588
$$ -3450 -142028 -214177 -221466 -199489 -110034 -77054 -59122 3326 54445 -251 -145671 -208259
13383b08259J3393J27729J41846m5366j9010K7613l7676J1795n455O000m4755
$$ -208259 -194866 -67137 74709 29343 10333 37946 270 12065 6610 12610 -32145
13372c2145J8018l2414P1356L7310k7950o1047q5508k4404K3840K8661j7967K330
$$ -32145 -14127 -46541 24815 62125 34175 -26872 -112380 -136784 -112944 -84283 -102250 -99920
13360i9920o9919m3943N9347M0356r867N4150J28796j2085j05417Q951Q5088O8286
$$ -99920 -169839 -213782 -154435 -114079 -123946 -69796 59000 46915 -58502 -49551 35537 103823
13348A03823J076k4249j00534n3882J6035M7561k1759o3428k7913k504j9365l6267
$$ 103823 104899 80650 -19884 -73766 -57731 -10170 -31929 -95357 -123270 -125774 -145139 -181406
13336a81406J02439N6108j6802r0731k1229K0038Q2410N4753L8834m4221j16561
$$ -181406 -78967 -22859 -39661 -130392 -151621 -131583 -49173 5580 44414 193 -116368
13325a16368p3756M5457N5940j8380K7087l0995j5940M6472J5183O7729n3831
$$ -116368 -190124 -144667 -88727 -107107 -80020 -111015 -126955 -80483 -65300 2429 -51402
13314e1402m5252L7168M1821M9868o384q2582l80K2040L8365q6974L4185L3592
$$ -51402 -96654 -59486 -17665 32203 25819 -56763 -57143 -35103 3262 -83712 -49527 -15935
13302a5935J23655J60933O8356Q1937J85519J54873K43267K19830J54404J37942
$$ -15935 107720 268653 337009 418946 604465 759338 1002605 1222435 1376839 1514781
13292A514781k5534k69719l03681k29833j62603k14241j49765k4607M6538q3038
$$ 1514781 1489247 1219528 915847 686014 523411 309170 159405 134798 181336 98298
13282I8298o7067Q9942o0629p7916K6672K6850J8505L987J4618J4654J0938m0310
$$ 98298 31231 121173 60544 -17372 9300 36150 54655 58642 73260 87914 98852 58542
13270E8542n4653j9069R5868L3195o4722k4503p401q9855j6178k3459q3265M272
$$ 58542 3889 -15180 80688 113883 49161 24658 17257 -72598 -88776 -112235 -195500 -191228
13258a91228R3814j4899K9881R9846J5796r5441j20595k2372P9354M4474K6503
$$ -191228 -97414 -112313 -82432 17414 33210 -62231 -182826 -205198 -125844 -81370 -54867
13247e4867K8741L3141n2314l6050L0995P8789j2265o1469L148j3353m2523P6755
$$ -54867 -26126 7015 -45299 -81349 -50354 28435 16170 -45299 -42151 -55504 -98027 -21272
13235b1272J17329N0855N2571j10947o9804L2708K2921K6920J8994j9031K294
$$ -21272 96057 146912 199483 88536 18732 51440 74361 101281 120275 101244 103538
13224A03538p8911q3890l7937k5492L7765N5045R7558r810l6086o526k3979n1705
$$ 103538 24627 -59263 -97200 -122692 -84927 -29882 67676 57866 21780 15254 -8725 -60430
13212f0430j11639r952O0256L3169J15950K7563k5115J1139l5321r1190r7376
$$ -60430 -172069 -182021 -121765 -88596 27354 54917 29802 40941 5620 -85570 -182946
13201a82946j2572P9529N8343j6251p3508j7655J7730N6443M7679J1107m8715
$$ -182946 -195518 -115989 -57646 -73897 -147405 -165060 -147330 -90887 -43208 -32101 -80816
13190h0816L741m6480k9966l4372Q2632O6660K4727Q4892M5168r8197q8857R385
$$ -80816 -77075 -123555 -153521 -187893 -105261 -38601 -13874 71018 116186 17989 -70868 -61483
13178f1483K3326l9830M3110J19328k8259n516l4026J2145J6265m2817p164k1796
$$ -61483 -38157 -77987 -34877 84451 56192 50676 16650 28795 45060 2243 -4921 -26717
13166b6717m07o942K2081k8436p2049R863l456o732r3576N865N4878N7415J1933
$$ -26717 -27124 -34066 -11985 -40421 -112470 -102607 -106063 -112795 -206371 -200506 -145628 -88213 -76280
13153g6280o1236L6818L699m6150J166M1619N1786k5642k1833M1615J0912K2468
$$ -76280 -137516 -100698 -96999 -143149 -141983 -100364 -48578 -74220 -96053 -54438 -43526 -21058
13141b1058j9463O264k5721p1301j07493J07048J5727M2139N1710M7136R700R585
$$ -21058 -40521 -34257 -59978 -131279 -238772 -131724 -115997 -73858 -22148 24988 34688 44273
13129D4273k8941p1253J378p426j6377j9479M4024Q7750R9310j0564l7807j02562
$$ 44273 15332 -55921 -54543 -61969 -78346 -97825 -53801 33949 133259 122695 84888 -17674
13117a7674q6452J25502P5022N504M1384K0632p7144p0959k8401j3766o7117l7882
$$ -17674 -104126 21376 96398 101902 143286 163918 86774 15815 -12586 -26352 -93469 -131351
13105a31351M5597L2164n9324O4263J0463k5582J7905N9890l8454K5658k9915
$$ -131351 -85754 -53590 -112914 -48651 -38188 -63770 -45865 14025 -24429 1229 -28686
13094b8686R848N6364n555l9044L1047K6858k9546l7676j4229L2268o24O0874
$$ -28686 -18838 37526 31971 -7073 23974 50832 21286 -16390 -30619 1649 1025 61899
13082F1899q240j14359p1181j5067P1456O6281M9263j9260n2661m0491r6750M401
$$ 61899 53659 -60700 -131881 -146948 -75492 -9211 40052 20792 -31869 -72360 -169110 -164709
13070a64709M2556P911O5424r359o4509Q0167N1269k0122k929j7161j4254M2749
$$ -164709 -122153 -114242 -48818 -58177 -122686 -42519 8750 -11372 -14301 -31462 -45716 -2967
13058b967o6063j1056J8102m6246k8558L4042P249M0924j4145k4225o7129n478
$$ -2967 -69030 -80086 -61984 -108230 -136788 -102746 -95497 -54573 -68718 -92943 -160072 -165550
13046a65550P0774J18142J22190j1861j17758q124M9916N2295k8593o6395M6007
$$ -165550 -94776 23366 145556 133695 15937 7813 57729 110024 81431 15036 61043
13035F1043L346l0387o387j6794M8168N47j5682r855O4545O1977m0320o5127m5179
$$ 61043 64389 34002 27615 10821 58989 59536 43854 33999 98544 160521 120201 55074 9895
13022I895q2731n2743L1683K2086J3864p1472R0368L6929j1681R750m1459K9458
$$ 9895 -72836 -125579 -93896 -71810 -57946 -129418 -39050 -2121 -13802 -4052 -45511 -16053
13010a6053O0294l0172l3514N0016p8049r701k3622K3135l0924m9109M4313J2338
$$ -16053 44241 14069 -19445 30571 -47478 -57179 -80801 -57666 -88590 -137699 -93386 -81048
12998h1048j0411o2412M2210L2793L9474k827J7825J021j5024K1391k0108N1075
$$ -81048 -91459 -153871 -111661 -78868 -39394 -42221 -24396 -23375 -38399 -17008 -37116 13959
12986A3959K0233J451j910N061l7787l1817m0227j1431M9631M2731N532J3483
$$ 13959 34192 35643 33733 38794 1007 -30810 -71037 -82468 -32837 9894 15426 28909
12974B8909j2992O506p3686q302J4311n3353o9023L8587Q338L6302K1013M0259
$$ 28909 15917 22423 -51263 -59565 -45254 -98607 -167630 -129043 -120705 -84403 -63390 -23131
12962b3131M2662J528l3000j27738k1493K6979j5188j184J5236J06473J10295
$$ -23131 19531 21059 -11941 -139679 -161172 -134193 -149381 -150565 -135329 -28856 81439
12951H1439k6447j37761m9605k2431l5742L0074P6489N4843q7211l8462O0673
$$ 81439 54992 -82769 -132374 -154805 -190547 -160473 -83984 -29141 -116352 -154814 -94141
12940i4141m6902r340N3487J14984J0564Q958m0948l4215m6181L9969Q7548Q8785
$$ -94141 -141043 -150383 -96896 18088 28652 37610 -3338 -37553 -83734 -43765 43783 132568
12928A32568n1177j8986r9240O916O9407k9580q7261l7279L6320J9590L6170K3010
$$ 132568 81391 62405 -36835 -29919 39488 9908 -77353 -114632 -78312 -58722 -22552 458
12916D58r5969j527M3928J514n7196p8110r519M5827L7098J960J4700M858Q094
$$ 458 -95511 -97038 -53110 -51596 -108792 -186902 -196421 -150594 -113496 -111536 -96836 -91978 -83884
12903h3884R103J4597J300p9840L7627J02648L6002j2583r802K8471K2624J9633
$$ -83884 -74781 -60184 -58884 -138724 -101097 1551 37553 24970 15168 43639 66263 85896
12891H5896K6123J1832r9796P683k757l8874J6321R9419Q0384P03J03578n6358
$$ 85896 112019 123851 24055 31738 28981 -9893 6428 105847 186231 186934 290512 234154
12879B34154o2338K2025j8418j00732K2342K2863n1284n0481K2673M3972M4556
$$ 234154 171816 193841 175423 74691 97033 119896 68612 18131 40804 84776 129332
12868A29332L2338P289O1715K8747j4502J5481r2093P832o5995N1409M417M1738
$$ 129332 161670 168959 230674 259421 244919 260400 168307 176139 110144 161553 165970 207708
12856B07708K26L3760p4745j34235j5982K394n9900M0707J57572J00646N0261
$$ 207708 207934 241694 166949 32714 16732 19126 -40774 -67 157505 258151 308412
12845C08412o7825r7486j04470L4079j5882K0439Q5911N434j31133j4072J56798
$$ 308412 240587 143101 38631 72710 56828 77267 163178 168612 37479 23407 180205
12834A80205M6817q3895m0320o1519p9398o6499O9712K14279L5701k3437J8616
$$ 180205 227022 143127 102807 41288 -38110 -104609 -34897 179382 215083 191646 210262
12823B10262M4049Q7494Q8107K0550L7343N5960L2363k7634R4313J48635O9533
$$ 210262 254311 341805 429912 450462 487805 543765 576128 548494 642807 791442 860975
12812H60975L8081J2262N5344J26042J07637J7153J6744m1909j7136m3619j716
$$ 860975 899056 911318 966662 1092704 1200341 1217494 1234238 1192329 1175193 1131574 1129858
12801A129858L9907K5151l4172n2846J02443J36713P0008M2814J41375J73373
$$ 1129858 1169765 1194916 1160744 1107898 1210341 1347054 1417062 1459876 1601251 1774624
12791A774624Q3502J76069K22495K34630K40258K94154K82707L64372O63359Q29891
$$ 1774624 1858126 2034195 2256690 2491320 2731578 3025732 3308439 3672811 4336170 5166061
12781E166061Q09230R86546J166667J136394R34320P43051L82499n4700n26967
$$ 5166061 5975291 6961837 8128504 9264898 10199218 10942269 11324768 11270068 10743101
12772A0743101r33222j100360j119171j071758r55965q07030o67818m47397l65686
$$ 10743101 9809879 8709519 7590348 6518590 5562625 4755595 4087777 3640380 3274694
12763C274694k76129k39769j13862j45225j59794j23367j27626l8403l8343l0079
$$ 3274694 2998565 2758796 2644934 2499709 2339915 2216548 2088922 2050519 2012176 1982097
12753A982097r853r0642o3114K1514n6340q3272j21485o9190O6561q2635j77597
$$ 1982097 1972244 1881602 1818488 1840002 1783662 1700390 1578905 1509715 1576276 1493641 1316044
12742A316044k25722j10277o1123n9054j7520k4249j34593o4821m1073Q1563j4938
$$ 1316044 1090322 980045 918922 859868 842348 818099 683506 618685 577612 659175 644237
12731F44237n069j06359j17815m5335O8595L3273m9505j9510N9533k4889j5548
$$ 644237 639168 532809 414994 369659 438254 471527 422022 402512 462045 437156 421608
12720D21608l5297J9014l8127j36643O5453J7915m0912n5888N2773Q225L8790
$$ 421608 386311 405325 367198 230555 296008 313923 273011 217123 269896 278121 316911
12709C16911k3064j0910K2568k6696j5282k3808k8963Q4157R7164k4982j33552
$$ 316911 293847 282937 305505 278809 263527 239719 210756 294913 392077 367095 233543
12698B33543p0906o3329M0802L6791J3959n1715L0443l3972r8328K3311J09321
$$ 233543 162637 99308 140110 176901 190860 139145 169588 135616 37288 60599 169920
12687A69920R6513j2746l2116n5646q0804m6678J5050M6300j4139n7683K3997
$$ 169920 266433 253687 221571 165925 85121 38443 53493 99793 85654 27971 51968
12676E1968j9609K0832q882N568j9193L4540M2235J6716l1822l9772L177l9519
$$ 51968 32359 53191 44309 49877 30684 65224 107459 124175 92353 52581 55758 16239
12664A6239j5468J7018R5622n701o2156o637j9242M8024O1937n7859K6415l6544
$$ 16239 771 17789 113411 107710 45554 38917 19675 67699 129636 71777 98192 61648
12652F1648l6142K3296P1470J3383o1971j2122j5415L8129m1726o7252M8861P4465
$$ 61648 25506 48802 120272 133655 71684 59562 44147 82276 40550 -26702 22159 96624
12640I6624K5543K2657p1804r3888L668l3757o9788j2629L9955n3106P9641M0843
$$ 96624 122167 144824 73020 -20868 -17200 -50957 -120745 -133374 -93419 -146525 -66884 -26041
12628b6041O487r7732M7909j7202n291J33877j5470l6584O0401O3770N1764j6256
$$ -26041 -19554 -117286 -69377 -86579 -91870 42007 26537 -10047 50354 114124 165888 149632
12616A49632r6082j11038l9825K4041m403M0166M2315M5700M9612K635J4685j19546
$$ 149632 53550 -57488 -97313 -73272 -77675 -37509 4806 50506 100118 102753 117438 -2108
12604b108o9497j2084m115q5835K3702M8256l9145K7643R1482l8245l5066K1887
$$ -2108 -71605 -83689 -87804 -173639 -149937 -101681 -140826 -113183 -21701 -59946 -95012 -73125
12592g3125O4772J2570M4379L428L6467l6821m8658J1361o788L5637O3156O8115
$$ -73125 -8353 4217 48596 52024 88491 51670 3012 14373 7585 43222 106378 174493
12580A74493N7636o7677n74K9811N958P3571l3359p4814K8424o046R439J05747
$$ 174493 232129 164452 163878 193689 199647 273218 239859 165045 193469 187423 196862 302609
12568C02609K4258J8138M281O9953K6118l5377j2283R104P8392N1793p707J4002
$$ 302609 326867 345005 349286 419239 445357 409980 397697 406801 485193 536986 529279 543281
12556E43281q5271q1094n8762J6280M4693n1557p1687j16390r6905j8031j4133
$$ 543281 458010 376916 318154 334434 379127 327570 255883 139493 42588 24557 10424
12545A0424n2649Q5609J28551K3068o4898l8301L0322M2565K0411n4587K9547
$$ 10424 -42225 43384 171935 195003 130105 91804 122126 164691 185102 130515 160062
12534A60062o816M8630Q1129O0070m1919p541N9424o0311p5859o2953R495L9160
$$ 160062 153246 201876 283005 343075 301156 293615 353039 292728 216869 153916 163411 202571
12522B02571K7138r1395j43554l9794k756r5225J12821R1130p232q2580P7K3941
$$ 202571 229709 138314 -5240 -45034 -47790 -143015 -30194 60936 53704 -28876 -28799 -4858
12510d858P1475o3243q9691K4409K0658P099o7688k7919O0841J8370N1191k2302
$$ -4858 66617 3374 -86317 -61908 -41250 -34151 -101839 -129758 -68917 -50547 644 -21658
12498b1658n3155K3447N2375O5296N71p1906o9017O345M4492M5972o97M3626l4754
$$ -21658 -74813 -51366 1009 66305 66876 -5030 -74047 -67702 -23210 22762 22065 65691 30937
12485C0937J4230J16405K6701p9056m665j06420k5368N7767l8193q134q6396j5158
$$ 30937 45167 161572 188273 109217 104552 -1868 -27236 30531 -7662 -15796 -102192 -117350
12473a17350L4662O100L9588P4782p763L2806r366q5757l7055n2780k1021P0666
$$ -117350 -82688 -76588 -37000 37782 30019 62825 53459 -32298 -69353 -122133 -143154 -72488
12461g2488J2380m9600M901L6159P6403o5692m1750j6767O3438J4901N3955L8140
$$ -72488 -60108 -109708 -104807 -68648 7755 -57937 -99687 -116454 -53016 -38115 15840 53980
12449E3980P438j8265l3110N0558K0102l4917o872o9820j579K2401k399n4333
$$ 53980 61418 43153 10043 60601 80703 45786 38914 -30906 -32485 -10084 -12483 -66816
12437f6816q8939J0212K05787R9101l9037m8307n8688m2498k7511J4876K5430
$$ -66816 -155755 -145543 60244 159345 120308 72001 13313 -29185 -56696 -41820 -16390
12426a6390L6496q7542o3977p7318j8192R3644J8620N1506P1374O6311K058n1689
$$ -16390 20106 -67436 -131413 -208731 -226923 -133279 -114659 -63153 8221 74532 76590 24901
12414B4901j3440j2750j0161K1260p058k0186L8200O765p4101l5019L8610N8571
$$ 24901 11461 -1289 -11450 9810 2752 -17434 20766 27531 -46570 -81589 -42979 15592
12402A5592n8776j6100J321q9422K1638M5767k8866R2947N5441J5407L5862J185
$$ 15592 -43184 -59284 -57963 -147385 -125747 -79980 -108846 -15899 39542 54949 90811 91996
12390I1996K2674l4693m3002M1150L84p298O682n9624p7947m1934J6702M9934
$$ 91996 114670 79977 36975 78125 78509 71211 77893 18269 -59678 -101612 -84910 -34976
12378c4976P7608m10K8943N4919m0010j8781j8654K1449J1369K0420n8772L1974
$$ -34976 42632 42222 71165 126084 86074 67293 48639 70088 81457 101877 43105 75079
12366G5079P0755p8465l1684j4885j09631p020O4574k7033M3187M2755O7735J0391
$$ 75079 145834 67369 35685 20800 -88831 -95851 -31277 -58310 -15123 27632 95367 105758
12354A05758o5604P47l2305p8433K4918L3854n1166j3587j7897R261J12887J00805
$$ 105758 40154 40901 8596 -69837 -44919 -11065 -62231 -75818 -93715 -84454 28433 129238
12342A29238j3803j12246j11630m5258k7624m5815l4688L7254L4217l7237M809
$$ 129238 115435 3189 -108441 -153699 -181323 -227138 -261826 -224572 -190355 -227592 -222783
12331b22783P4185O5650L9340K4588L3460M7503m146n0567r3719O4849R8869k2767
$$ -222783 -148598 -82948 -43608 -19020 14440 61943 57797 7230 -86489 -21640 77229 54462
12319E4462m640Q6142p5532q1548n8412k4048N2678K7372P0751J03957j7325l3268
$$ 54462 49822 135964 60432 -21116 -79528 -103576 -50898 -23526 47225 151182 133857 100589
12307A00589m289k9613r6823l3191J9555K77L4025N0534j163n1168M4259J13585
$$ 100589 96300 66687 -30136 -63327 -43772 -43495 -9470 41064 39901 -11267 32992 146577
12295A46577r4755n3580j6679m6395J3349l6747o1425L232L0019J6484J6381p0819
$$ 146577 51822 -1758 -18437 -64832 -51483 -88230 -149655 -146423 -116404 -99920 -83539 -154358
12283a54358p8370m5799N7870J72083M4233j0583P3868p0801q1664m1075k3800
$$ -154358 -232728 -278527 -220657 -48574 -4341 -14924 58944 -11857 -93521 -134596 -158396
12272a58396j4179n350R6801L8386o9892m5819K2294n7947P656M9125M4246m7016
$$ -158396 -172575 -177925 -81124 -42738 -112630 -158449 -136155 -194102 -186446 -137321 -93075 -140091
12260a40091L9804K5913L031M1064N4347j7019n8670m678N145K6265j0925P6754
$$ -140091 -100287 -74374 -71343 -30279 24068 7049 -51621 -56299 -51154 -24889 -35814 40940
12248D0940K5422j06690n4656M1894L7038m9444n7352M5668q074k3180m9847M0212
$$ 40940 66362 -40328 -94984 -53090 -16052 -65496 -122848 -77180 -85254 -108434 -158281 -118069
12236a18069N1004P8304Q7998M2711j8394r5218q8825O906k7974M6212m5141k948
$$ -118069 -67065 11239 99237 141948 123554 28336 -60489 -53583 -81557 -35345 -80486 -83434
12224h3434J0587l0532K9362J2301j8052K314p6605p508K8630k3742J6671R5953
$$ -83434 -72847 -103379 -74017 -61716 -79768 -77454 -154059 -161567 -132937 -156679 -140008 -44055
12212d4055L2426K0156M3888L7359N6794j2620r9262j5728k3N660J7316L1879
$$ -44055 -11629 8527 52415 89774 146568 133948 34686 18958 18935 24595 41911 73790
12200G3790M2780J1958n6774o4813J0258J35938O9497K9510P9978J06947L0401
$$ 73790 116570 128528 71754 6941 17199 153137 222634 252144 332122 439069 469470
12189D69470j24118j08730k8422m3256p735p316n2383r4171m1185J7290j9374
$$ 469470 345352 236622 208200 164944 157209 149893 97510 3339 -37846 -20556 -39930
12178c9930K2160L3579P6093N1533q2047j23376p7169L3804P7392n079r812N3906
$$ -39930 -17770 15809 91902 143435 61388 -61988 -139157 -105353 -27961 -33040 -42852 11054
12166A1054M7121J4704n6142q5678L8399q964R7474J7901p450K7081J04462J11651
$$ 11054 58175 72879 16737 -68941 -30542 -39506 57968 75869 68419 95500 199962 311613
12154C11613N2534M2142N1983Q1687J97124K04945L04547K84671J45547j13738
$$ 311613 364147 406289 458272 539959 737083 942028 1246575 1531246 1676793 1563055
12144A563055m17300l15271j92459j40054j83364r7144k5696J1512m3474j6316
$$ 1563055 1145755 830484 638025 497971 314607 217463 191767 203279 159805 143489
12134A43489L5563p8986n5597l7167l9853P0147J01368o1606j388M9450K8628
$$ 143489 179052 100066 44469 7302 -32551 37596 138964 77358 75970 125420 154048
12123A54048J0249o792Q0226L888o536j3931n5596q8494M954k5182q173M1137
$$ 154048 164297 157505 237731 241619 235083 221152 165556 77062 82016 56834 48661 89798
12111H9798M6844P4604O6173O5882Q3869K31812K96583L54448K34833K34544k9515
$$ 89798 136642 211246 277419 343301 427170 658982 955565 1310013 1544846 1779390 1749875
12100A749875l93435m55628j89610q8522q2332o6701j25085m9359J9764P539r1986
$$ 1749875 1356440 900812 711202 622680 540348 473647 348562 299203 318967 326506 234520
12089B34520m6975l5807l6217p3305p0092M6830P3159L200n2665J7403K2825j4968
$$ 234520 187545 151738 115521 42216 -27876 18954 92113 95313 42648 60051 82876 67908
12077F7908j6755K580M991j9296O9416J9266O336n1950N6569l4194m242j61j4708
$$ 67908 51153 53733 58724 39428 108844 128110 134446 82496 139065 104871 100629 100468 85760
12064H5760O2931M3816o402K2268P1414P2035N2228J28193n2083j40249j20242
$$ 85760 148691 192507 186105 208373 279787 351822 404050 532243 480160 339911 219669
12053B19669o3554o7381k6791Q415l0330K4028J35117K4669p8301n3155M2059
$$ 219669 156115 88734 61943 70358 40028 64056 199173 223842 145541 92386 134445
12042A34445n9548m3004k162J19061K4790N4981m4073j79189p3638Q1241j5981
$$ 134445 74897 31893 29731 148792 173582 228563 184490 5301 -68337 12904 -3077
12031c077k0585k6053P0269R0234j445l2299n7960O993o5461m4278P3589P4427
$$ -3077 -23662 -49715 20554 110788 109343 77044 19084 26077 -39384 -83662 -10073 64354
12019F4354K1268j6712p07P156j6576j8062l3076j7333K2018L3456j5827l763
$$ 64354 85622 68910 68203 75359 58783 40721 7645 -9688 12330 45786 29959 26196
12007B6196K3729m807k1444l8930p8845K4377N7820r1314o1868j6331k8244J15368
$$ 26196 49925 45118 23674 -15256 -94101 -69724 -11904 -103218 -165086 -181417 -209661 -94293
11995i4293K8813M6022k2968l1847m3758N255N3422p282N778L6617L3491K4419
$$ -94293 -65480 -19458 -42426 -74273 -118031 -112776 -59354 -66636 -60858 -24241 9250 33669
11983C3669O7334k5609j05767j11471p4575K4814M7930O894J8281O3202K9602
$$ 33669 101003 75394 -30373 -141844 -216419 -191605 -143675 -136781 -118500 -55298 -25696
11972b5696j75O1624J2427m4364K7881K780J8574n1998n8864m877k9480o6732
$$ -25696 -25871 35753 48180 3816 31697 34477 53051 1053 -57811 -62688 -92168 -158900
11960a58900M6403P6347P1480O1766m160M3635q4294m1673j25832m9033L0573
$$ -158900 -112497 -36150 35330 97096 92936 136571 52277 10604 -115228 -164261 -133688
11949a33688K7308O4720L8732M0830Q920o816M3866m0339k3615R4609M0426p4778
$$ -133688 -106380 -41660 -2928 37902 46822 40006 83872 43533 19918 114527 154953 80175
11937H0175p8342k9624q067N68j2722q194q0317K3142L8548J02262N7653J5254
$$ 80175 1833 -27791 -35858 -35290 -48012 -56206 -136523 -113381 -74833 27429 85082 100336
11925A00336k9673R21o9731j7137L0308L3039N5585n6268N044j8177J4716l1731
$$ 100336 70663 71584 1853 -15284 15024 48063 103648 47380 52424 34247 48963 17232
11913A7232j0281N421K7676k6401Q943k8847k3052j9423J1655o4028k6170l3546
$$ 17232 6951 12372 40048 13647 22590 -6257 -29309 -48732 -37077 -101105 -127275 -160821
11901a60821m445p229J6232N4384K8174M7613Q0267k336J7661l1108p2590k0325
$$ -160821 -165266 -172495 -156263 -101879 -73705 -26092 54175 51839 69500 38392 -34198 -54523
11889e4523k5180J13324j006L2106o969q6277P030j7959J3269o911m2450k3480
$$ -54523 -79703 33621 32615 64721 57752 -28525 -21495 -39454 -26185 -33096 -75546 -99026
11877i9026q3794p3321P8567N8483M415K8818P3071J3541k0206Q57R1894k2502
$$ -99026 -182820 -256141 -177574 -119091 -114676 -85858 -12787 754 -19452 -18595 73299 50797
11865E0797j2786j9775K3026j8291m8963L1374k0235m3040J13293j8779o9360
$$ 50797 38011 18236 41262 22971 -25992 5382 -14853 -57893 55400 36621 -32739
11854c2739k996k9332o9100K1193J21552J02036J3609m3504j59375p0123N5026
$$ -32739 -35735 -65067 -134167 -112974 8578 110614 124223 80719 -78656 -148779 -93753
11843i3753M5060J1582N845k0700O7841N2766M6652K3334L5298K3850o3946j45972
$$ -93753 -48693 -37111 -31266 -51966 15875 68641 115293 138627 173925 197775 133829 -12143
11831a2143J1954j4145j04557j7674J0910R8494O1552j07438J811J0421K7917
$$ -12143 -189 -14334 -118891 -136565 -125655 -27161 34391 -73047 -71236 -60815 -32898
11820c2898k5721j2668n2061R666O6488N807K36j605o144j2707k0325j9072P0889
$$ -32898 -58619 -71287 -123348 -113682 -47194 -41387 -41151 -42756 -48900 -61607 -81932 -101004 -30115
11807c0115K3858J1574n967m7634k5278k8282N5854L6396j2392k4615m154J3867
$$ -30115 -6257 5317 -650 -48284 -73562 -101844 -45990 -9594 -21986 -46601 -50755 -36888
11795c6888k3780L4745N5481J2787k0373Q8275j1326j7548k9959K780p6754l2779
$$ -36888 -60668 -25923 29558 42345 21972 110247 98921 81373 51414 54194 -22560 -55339
11783e5339M8097N5347L1603J4743o8147K0612N8227j0311l9974k493o3588p3736
$$ -55339 -7242 48105 79708 94451 26304 46916 105143 94832 54858 52365 -11223 -84959
11771h4959j9508O9493L3894P8785R6086n5689n006M5660k3835n4854m9872p020
$$ -84959 -104467 -34974 -1080 77705 173791 118102 113096 158756 134921 80067 30195 23175
11759B3175r932j3712l3941M3836j1124k962j5176J7147L5130K6016k2437P987
$$ 23175 13243 -469 -34410 9426 -1698 -4660 -19836 -2689 32441 58457 36020 44007
11747D4007N3568r396j41557K4534M1594k3207R7938J759J7821K3330r2889j46526
$$ 44007 97575 88179 -53378 -28844 12750 -10457 87481 89240 107061 130391 37502 -109024
11735a09024n6782J11236P2248o0094j4337n1349k7809N9463o347K6394Q4344
$$ -109024 -165806 -54570 17678 -42416 -56753 -108102 -135911 -76448 -82795 -56401 27943
11724B7943k6802P8627K9051j08318j42306j1995J01008O9360J3460o3920k1400
$$ 27943 1141 79768 108819 501 -141805 -153800 -52792 16568 30028 -33892 -55292
11713e5292o650R199p4320M3030K8865m6766l2110n6314L4707M1014O8140J18064
$$ -55292 -61942 -52743 -127063 -84033 -55168 -101934 -134044 -190358 -155651 -114637 -46497 71567
11701G1567N8717o661J0901m4905q502j8982j0771n6460k2034m6345N4850Q382
$$ 71567 130284 123623 134524 89619 81117 62135 51364 -5096 -27130 -73475 -18625 -10243
11689a0243k7086j959J6970J3463p3658m4735l3291m9530J04842R8974J8929p8526
$$ -10243 -37329 -39288 -22318 -8855 -82513 -127248 -160539 -210069 -105227 -6253 12676 -65850
11677f5850K427N1899P2569O1495o5913j00164L677k2680r692j9533P9826L1842
$$ -65850 -63423 -11524 61045 122540 56627 -43537 -39860 -62540 -72232 -91765 -11939 19903
11665A9903M06J9572j9418k5829j576l4655Q0305R4223N2464j1651j16060j52984
$$ 19903 20309 39881 20463 -5366 -6942 -41597 38708 132931 185395 173744 57684 -95300
11653i5300J4293P5794m3796J052o0164N0842M3151j5605M9131j29300K1185J5848
$$ -95300 -81007 -5213 -49009 -47957 -108121 -57279 -14128 -29733 19398 -109902 -88717 -72869
11641g2869N4060L4595J3625r4783l2750Q1407O9306N1347n1752q835p3833k8074
$$ -72869 -18809 15786 29411 -65372 -98122 -16715 52591 103938 52186 43351 -30482 -58556
11629e8556N7692O0628J07781j5849o8895j28017o3401r0170j8569J32205Q5440
$$ -58556 -864 59764 167545 151696 82801 -45216 -108617 -198787 -217356 -85151 289
11618B89N1546j0523o4701l9861K5395L385O730q9120r357K2627P2549J6641M5372
$$ 289 51835 41312 -23389 -63250 -37855 -34470 -27740 -116860 -126217 -103590 -31041 -14400 30972
11605C0972M2216o1587j20419J9386O4950K2706J576n829J3580J6435l7151n7422
$$ 30972 73188 11601 -108818 -89432 -24482 -1776 -200 -6029 7551 23986 -13165 -70587
11593g0587m4223J1518O0773q7694j4015J10086N2548m3453J4218P706j1787M1955
$$ -70587 -114810 -103292 -42519 -130213 -144228 -34142 18406 -25047 -10829 -3123 -14910 27045
11581B7045l1268p9754L6239M064j5314K5288J3585r8939m6778M6804Q619N461
$$ 27045 -4223 -83977 -47738 -43674 -58988 -33700 -20115 -119054 -165832 -119028 -110409 -104948
11569a04948L9707K4619J6348k7517N5471L2453j2790m6033J3887n8714K5078
$$ -104948 -65241 -40622 -24274 -51791 3680 36133 23343 -22690 -8803 -67517 -42439
11558d2439P8763P7160k4925l5730r782j3180p955K9034j3307J5684n0407m9150
$$ -42439 36324 113484 88559 52829 43047 29867 21912 50946 37639 53323 2916 -46234
11546d6234O9082K1198j351q1469N977J15860L215n5591p7490m4668K2742N2983
$$ -46234 22848 44046 42695 -38774 -32797 83063 86278 30687 -46803 -91471 -68729 -15746
11534a5746R0478o697r6846k1826N9016L4706M8231R855m9085j00326l1739N123
$$ -15746 74732 68035 -28811 -50637 8379 43085 91316 101171 52086 -48240 -79979 -74856
11522g4856m449m2089K9946M5492j0222o3056K4571O1057R0722J09860k4023p0163
$$ -74856 -79305 -121394 -91448 -45956 -56178 -119234 -94663 -33606 57116 166976 142953 72790
11510G2790P63K0200Q8558o7505q5313j8636O396j8082N1298O1996o647o7440
$$ 72790 73553 93753 182311 114806 29493 10857 17253 -829 50469 112465 105818 38378
11498C8378j86316k2250P23R5828K0906K4716m8190m3333L4838N1261l6670q7236
$$ 38378 -147938 -170188 -169465 -73637 -52731 -28015 -76205 -119538 -84700 -33439 -70109 -157345
11486a57345P455J6413o502O4000L3581J9860P783L8247k4630r8474o1508J7522
$$ -157345 -149890 -133477 -139979 -75979 -42398 -22538 -14755 23492 -1138 -99612 -161120 -143598
11474a43598R7990M2788J2085O117m223L5355n730p3746M6832m0779m4884j4586
$$ -143598 -45608 -2820 9265 15382 11159 46514 40784 -32962 13870 -26909 -71793 -86379
11462h6379m5626n8330J2438P5677J46082P9406j5044r8032m297n368o7255j9220
$$ -86379 -132005 -190335 -177897 -102220 43862 123268 108224 10192 5895 527 -66728 -85948
11450h5948P2084o199p565M4553j4366j1929j9581k1584k7112R0329L0374N789
$$ -85948 -13864 -20063 -27628 16925 2559 -9370 -28951 -50535 -77647 12682 43056 48845
11438D8845O515J1074J2911m6703K0276o8501j08641J5176P1404L8105j20114
$$ 48845 55360 66434 79345 32642 52918 -15583 -124224 -109048 -37644 461 -119653
11427a19653J877J25889r780L3942J08747l181j05518n605P475n2344k5058M7115
$$ -119653 -117776 8113 -1667 32275 141022 137841 32323 26718 34193 -18151 -43209 3906
11415C906r267M6494k2319j28453n6398O889k5508Q8828O6053L3062p6631n8344
$$ 3906 -5361 41133 18814 -109639 -166037 -159148 -184656 -95828 -29775 3287 -73344 -131688
11403a31688K4364J03421N8075J3550o2761n3790m145O4488L2298q8945J0506
$$ -131688 -107324 -3903 54172 67722 4961 -48829 -52974 11514 43812 -45133 -34627
11392c4627k4693q6177m2200J8862N9078P4726n4125m6000N7604N1647J8730O3849
$$ -34627 -59320 -145497 -187697 -168835 -109757 -35031 -89156 -135156 -77552 -25905 -7175 56674
11380E6674O8119n3557q2664J1288N0912L4718n9013o504K4399L1422L0984J4696
$$ 56674 124793 71236 -11428 -140 50772 85490 26477 19973 44372 75794 106778 121474
11368A21474o5468Q3011m7146q820n3255Q814n775q2714K881M2855M1154J7292
$$ 121474 56006 139017 91871 83051 29796 38610 32835 -49879 -46998 -4143 37011 54303
11356E4303M6383k1999r0188l5408l6864j3146o5641J06667J23213K7978m5877
$$ 54303 100686 78687 -11501 -46909 -83773 -96919 -162560 -55893 67320 95298 49421
11345D9421j00440r0107O8361L4842P2458l4746p2547j8524L7251O1192P5369
$$ 49421 -51019 -141126 -72765 -37923 34535 -211 -72758 -91282 -54031 7161 82530
11334H2530o1967n5481k8465k9921J569R5662L4411j8578k2210M7323N7214J9274
$$ 82530 20563 -34918 -63383 -93304 -91735 3927 38338 19760 -2450 44873 102087 121361
11322A21361p8902j20464O3603K0316k9097O7699L4136Q0804N5721l2240j24858
$$ 121361 42459 -78005 -14402 5914 -23183 44516 78652 159456 215177 182937 58079
11311E8079j75244k3303Q6407M0488p7155j2662j8267J7044J0531Q449j8498p4537
$$ 58079 -117165 -140468 -54061 -13573 -90728 -103390 -121657 -104613 -94082 -85633 -104131 -178668
11299a78668K2245L1546m0533K0200N2336l5873q817L6037L6097l8286p4006L7872
$$ -178668 -156423 -124877 -165410 -145210 -92874 -128747 -137564 -101527 -65430 -103716 -177722 -139850
11287a39850N8530K0436J183M8548l781k6792k5460l1364J02523P2933K8653O3978
$$ -139850 -81320 -60884 -59701 -11153 -14934 -41726 -67186 -98550 3973 76906 105559 169537
11275A69537j11236o4802J07548M8198j8294k0569m6676k2825r213j05755p4461
$$ 169537 58301 -6501 101047 149245 130951 110382 63706 40881 31668 -74087 -148548
11264a48548Q4593P8186R843k1089j732j3700K4776R3900n3060r6466l830m1497
$$ -148548 -63955 14231 24074 2985 1253 -12447 12329 106229 53169 -43297 -47127 -88624
11252h8624j01461j6173J09716O0218K6652m8250j21911k2831M707j4229J06175
$$ -88624 -190085 -206258 -96542 -36324 -9672 -57922 -179833 -202664 -197957 -212186 -106011
11241a06011K0775J8018P7628q853j9265o9029J04788O1716m2481j38476k6348
$$ -106011 -85236 -67218 10410 1557 -17708 -86737 18051 79767 37286 -101190 -127538
11230a27538L2479j7259j11757j0221J7616L7639J1357K3358K4301N3203L5246
$$ -127538 -95059 -112318 -224075 -234296 -216680 -179041 -167684 -144326 -120025 -66822 -31576
11219c1576l8617L2878P265j4978J4378R8290J8711j5332j06090j05902M1949
$$ -31576 -70193 -37315 -30050 -45028 -30650 67640 86351 71019 -35071 -140973 -99024
11208i9024N6156j2039j38253k8047R639R2567J05589Q6820M0379J3200j0665
$$ -99024 -42868 -54907 -193160 -221207 -211568 -119001 -13412 73408 113787 126987 116322
11197A16322l7899q5057l2133O3765L3872r6105j34677k505O1228Q9388p5518
$$ 116322 78423 -6634 -38767 24998 58870 -37235 -171912 -174417 -113189 -23801 -99319
11186i9319L1112L3810k812N4278k2156l774n934l1068j6142k1890m6330N004
$$ -99319 -68207 -34397 -37209 17069 -5087 -8861 -14795 -45863 -62005 -83895 -130225 -125221
11174a25221J38804J26282k3264k2300j23351M881K2158L771l8538l3264n9618
$$ -125221 13583 139865 116601 94301 -29050 -24169 -2011 1760 -36778 -70042 -129660
11163a29660O2916K4167N7990k2992n7139o1441m8606N8642L7190k2898N3907
$$ -129660 -66744 -42577 15413 -7579 -64718 -126159 -174765 -116123 -78933 -101831 -47924
11152d7924J30842J2618k665j6318N546L192j9097l6557k2948J7375n5698J1415
$$ -47924 82918 95536 92871 76553 82099 85291 66194 29637 6689 24064 -31634 -20219
11140b0219J4476O7519l233k4055o7672n676L2812O7378q932l4808l2756L4305
$$ -20219 -5743 61776 58543 34488 -33184 -38860 -6048 61330 52398 17590 -15166 19139
11128A9139R5407o7070r9583K148K7876L9516L9639l2714J8122l9338l7566K8484
$$ 19139 114546 47476 -52107 -49959 -22083 17433 57072 24358 42480 3142 -34424 -5940
11116e940M2992K8738n5760j21112k909J37321M6068K7327l0140q1409n0151o4122
$$ -5940 37052 65790 10030 -111082 -113991 23330 69398 96725 66585 -14824 -64975 -129097
11104a29097l5894M5490L7507M6869L9300n8617q1487o304k529J29643K4646j6745
$$ -129097 -164991 -119501 -81994 -35125 4175 -54442 -135929 -142233 -144762 -15119 9527 -7218
11092g218l4508k386K9958M5300o1804p9351j2817q012L9693J5458L5627K869
$$ -7218 -41726 -44112 -14154 31146 -30658 -110009 -122826 -130838 -91145 -75687 -40060 -37191
11080c7191L5815o488k6980k2984J5755j5048J6473M7239J863l9711k4305q1891
$$ -37191 -1376 -7864 -34844 -57828 -42073 -57121 -40648 6591 8454 -31257 -55562 -137453
11068a37453J7566p9682K6925J60760o222q6709l384L1469J12964j5637n1949
$$ -137453 -119887 -199569 -172644 -11884 -18106 -104815 -108199 -76730 36234 20597 -31352
11057c1352M0215L4466j0617j1229L1182J8915P7700m1162n4831K1838k9733r4751
$$ -31352 8863 43329 32712 21483 52665 71580 149280 108118 53287 75125 45392 -49359
11045d9359k7427K8300M8636k4277M7716M9215q522l3885l1535k1829K9598K7524
$$ -49359 -76786 -48486 150 -24127 23589 72804 64282 30397 -1138 -22967 6631 34155
11033C4155M0957Q306r1960j7036j5309n429N755k9068L0948j8577Q71k107n578
$$ 34155 75112 83418 -8542 -25578 -40887 -46316 -40561 -69629 -38681 -57258 -56387 -58494 -64072
11020f4072L1584O3267o5416j4350o320N0000m272k7786n1081j264j673M1285
$$ -64072 -32488 30779 -34637 -48987 -55307 -5307 -9579 -37365 -88446 -89710 -91383 -50098
11008e0098k4925J2283N9148k9430q173k008l5382J0121j2642J6297L2314N9464
$$ -50098 -75023 -62740 -3592 -33022 -41195 -43203 -78585 -68464 -81106 -64809 -32495 26969
10996B6969R2225Q0549r0839j5229k5824J1930o673l3397p6742m0113p1079M1507
$$ 26969 119194 199743 108904 93675 67851 79781 73108 39711 -37031 -77144 -148223 -106716
10984a06716O141j0779J0159M4570R0757j2103j7386j2635L888k6747r3054p54
$$ -106716 -100575 -111354 -101195 -56625 34132 22029 4643 -7992 -4104 -30851 -123905 -124659
10972a24659J19049N0532o7846k0677m300l7706J0429N4885K3473M2328k5889
$$ -124659 -5610 44922 -22924 -43601 -47901 -85607 -75178 -20293 3180 45508 19619
10961A9619n621R1536n4947r7142p9781m3767J02636O0938Q1485L0949n9404k943
$$ 19619 13998 105534 50587 -46555 -126336 -170103 -67467 -6529 74956 105905 46501 43558
10949D3558J9206m8164l2902o6938n3168J17683M6651j6543N1310j7282O950M6232
$$ 43558 62764 14600 -18302 -85240 -138408 -20725 25926 9383 60693 43411 50361 96593
10937I6593j14171j16092L0335j4782l1549K0594L2802P6811l1138n5185R9884
$$ 96593 -17578 -133670 -103335 -118117 -149666 -129072 -96270 -19459 -50597 -105782 -5898
10926e898J4921l6033J2632l280K1458n8946K876O0275O881p5477j09742Q381
$$ -5898 9023 -27010 -14378 -17658 3800 -55146 -52270 8005 14886 -60591 -170333 -161952
10914a61952Q9833J08569l230j15087l5249n32o2219n2860K0172R1435M1311N9744
$$ -161952 -72119 36450 33220 -81867 -117116 -117648 -179867 -232727 -212555 -121120 -79809 -20065
10902b0065k9148m8635n559m1130K2901O4480R7401n552n9626m3664n6896q3034
$$ -20065 -49213 -97848 -103407 -144537 -121636 -57156 40245 34693 -24933 -68597 -125493 -208527
10890b08527K5006L4245O4685R6903K0785q2566K4397J9878J6820l6186j29171
$$ -208527 -183521 -149276 -84591 12312 33097 -49469 -25072 -5194 11626 -24560 -153731
10879a53731J255R007N2232K7607M0280q624p5425k0816O3505J463N9858j1464
$$ -153731 -152476 -143469 -91237 -63630 -23350 -31974 -107399 -128215 -64710 -63247 -3389 -14853
10867a4853o2952m3488K640M1800O7834L0861J13588N4780l6347m5224p0799k9630
$$ -14853 -77805 -121293 -118653 -76853 -9019 21842 135430 190210 153863 108639 37840 8210
10855H210N4574k0343r9842j8375J2863p1317n7866L6342k596l83J50231O5791
$$ 8210 62784 42441 -57401 -75776 -62913 -134230 -192096 -155754 -158350 -158733 -8502 57289
10843E7289o41k8008J542l0694k5558o1391j4999N8338K5498L7090k4973L5469
$$ 57289 56648 28640 30182 -512 -26070 -87461 -102460 -44122 -18624 18466 -6507 28962
10831B8962n1128l5207j0053N7925j0343K9143K6390N1078M0125m0705j308K5260
$$ 28962 -22166 -57373 -67426 -9501 -19844 9299 35689 86767 126892 86187 84879 110139
10819A10139n1983Q164J704l7630r4855p3843j1165N6539P878J1292R2606O0355
$$ 110139 58156 66320 68024 30394 -64461 -138304 -149469 -92930 -85052 -73760 18846 79201
10807G9201k8455K6318m2714l6088l9688L3899L5246M8578m0014r7320r1999P2946
$$ 79201 50746 77064 34350 -1738 -41426 -7527 27719 76297 36283 -61037 -153036 -80090
10795h0090j6715J2448j9214J9523K9218l6048L212K3317L9953P8380L1465k349
$$ -80090 -96805 -84357 -103571 -84048 -54830 -90878 -87666 -64349 -24396 53984 85449 83100
10783H3100j064m6179q9505K7339M012j7589j8577L1031J10936O3315K6594P7735
$$ 83100 82036 35857 -53648 -26309 -22297 -39886 -58463 -27432 83504 146819 173413 251148
10771B51148p836j12819p7317n0499n0063r076j8117j0039Q4228K7282M1650j866
$$ 251148 243312 130493 53176 2677 -47386 -56462 -74579 -84618 -390 26892 68542 66676
10759F6676j90o4459J4715P1756K8061m3906p3557m5967o5281Q2562L8984j412
$$ 66676 66486 2027 16742 88498 116559 72653 -904 -46871 -112152 -29590 9394 7982
10747G982O118k9667L346k5950l1926K4490m0623K00J1227M9220J14990K5012
$$ 7982 14100 -15567 -12221 -38171 -70097 -45607 -86230 -86030 -74803 -25583 89407 114419
10735A14419r1456r2948K3133p069J8332j645j1543M5740J3099L4519q872j14787
$$ 114419 22963 -69985 -46852 -53921 -35589 -37234 -48777 -3037 10062 44581 35709 -79078
10723g9078q638K5507o481j1803j9826n2245j4272P1259m412M5349N2711M2203
$$ -79078 -87716 -62209 -68690 -80493 -100319 -152564 -166836 -95577 -99989 -54640 -1929 40274
10711D0274L2917L9906J2907o1726j18948k7025k2796N5375M1544J9580j0451
$$ 40274 73191 113097 126004 64278 -54670 -81695 -104491 -49116 -7572 12008 1557
10700A557r242J14293N4209j06127l6477n7227k0505Q0095P0791n998p0461n7598
$$ 1557 -7685 106608 160817 54690 18213 -39014 -59519 20576 91367 85369 14908 -42690
10688d2690Q835M8438O6860J1521k3366q9694j9433m0864k8211l2496Q3135J4204
$$ -42690 -33855 14583 81443 92964 69598 -20096 -39529 -80393 -108604 -141100 -57965 -43761
10676d3761Q2654n369n8136r3536m2128L2018K4742N1157L4873l1879M1485M7045
$$ -43761 38893 33524 -24612 -118148 -160276 -128258 -103516 -52359 -17486 -49365 -7880 39165
10664C9165O5704M4218k5423o5204n7565r2034r583P2982M1140L8456m6704m6980
$$ 39165 104869 149087 123664 58460 895 -91139 -100722 -27740 13400 51856 5152 -41828
10652d1828j15208J5105P9669J43519o1486q7257O1406m586p3570M1978R7752
$$ -41828 -157036 -141931 -62262 81257 19771 -67486 -6080 -10666 -84236 -42258 55494
10641E5494J3600k7022j4118K1931J675M508n6229n2090K0151k6971j3531N565
$$ 55494 69094 42072 27954 49885 51560 56068 -161 -52251 -32100 -59071 -72602 -67037
10629f7037l110N1994K7526m8274O973m2524m2553j8239J9832L046l7736o726
$$ -67037 -70147 -18153 9373 -38901 -31928 -74452 -117005 -135244 -115412 -112366 -150102 -156828
10617a56828n3469L2376J2871j7787P4938M2261L9898K4504k3038Jj3825j8837
$$ -156828 -210297 -177921 -165050 -182837 -107899 -65638 -25740 -1236 -24274 -24273 -38098 -56935
10605e6935M3118J4993m9344K2967P3879K2340j7879j3234n6013J6380p880m0115
$$ -56935 -13817 1176 -48168 -25201 48678 71018 53139 39905 -16108 272 -7608 -47723
10593d7723l6851L5891N723P609M0124J7128R7673k5743l0963m3909l9446P1001
$$ -47723 -84574 -48683 -42960 -35351 4773 21901 119574 93831 62868 18959 -20487 50514
10581E0514N0759k2032J0124l2943n8292k7531j4837O2222J0501j5748L2173M5910
$$ 50514 101273 79241 89365 56422 -1870 -29401 -44238 17984 28485 12737 44910 90820
10569I0820m2024m5570k8051j11396m8556l0469r8443K3582J28170J32694k8361
$$ 90820 48796 3226 -24825 -136221 -184777 -215246 -313689 -290107 -161937 -29243 -57604
10558e7604n3091K6012N9365N5732j1194j6236J1451k8489q0945k7443K7540J1748
$$ -57604 -110695 -84683 -25318 30414 19220 2984 14435 -14054 -94999 -122442 -94902 -83154
10546h3154j5627P048J8469M3873J58393L6488j9854n6285q53m3007K9995n7243
$$ -83154 -98781 -91733 -73264 -29391 129002 165490 145636 89351 88498 45491 75486 18243
10534A8243k0393J5342l4434K409J3088M0023L4710m5596o7820N9019j1381K1779
$$ 18243 -2150 13192 -21242 -18833 -5745 34278 68988 23392 -44428 14591 3210 24989
10522B4989j834n9458n8602k8038k196p4370N225Q8948R8215l5386n4998L2705
$$ 24989 23155 -36303 -94905 -122943 -125139 -199509 -194284 -105336 -7121 -42507 -97505 -64800
10510f4800P7603J1059l6762P0156J4828j4323K3195L704j29794l4357J4081k3278
$$ -64800 12803 23862 -12900 57256 72084 57761 80956 84660 -45134 -79491 -65410 -88688
10498h8688l1582J6831L9347Q2838J6934l4719L373o5857l9029k8989j1769M5151
$$ -88688 -120270 -103439 -64092 18746 35680 961 4334 -61523 -100552 -129541 -141310 -96159
10486i6159l4039l6236J05532O6010L5230M124n7574k4090N7003j6783l6923J1935
$$ -96159 -130198 -166434 -60902 5108 40338 44462 -13112 -37202 19801 3018 -33905 -21970
10474b1970M1589m0367l0139L4747J5687L2086O644j8127K9327r3367j13167M4021
$$ -21970 19619 -20748 -50887 -16140 -453 31633 38277 20150 49477 -43890 -157057 -113036
10462a13036O3475L0621J03730J825K5698r4630q1992l9910M4548R3503J5639
$$ -113036 -49561 -18940 84790 86615 112313 17683 -64309 -104219 -59671 33832 49471
10451D9471l0518L6960K5643o7075l6467K8289j0871o0884o674N3931Q4394J1945
$$ 49471 18953 55913 81556 14481 -21986 6303 -4568 -65452 -72126 -18195 66199 78144
10439G8144L3164l784n9581j13188j28394m10L5170O9894P5392P033P9600j5171
$$ 78144 111308 107524 47943 -65245 -193639 -194049 -158879 -88985 -13593 -6560 73040 57869
10427E7869l9151N8349l0101l7852M3227L0440M5166k0271q3317n2040j8327o0267
$$ 57869 18718 77067 46966 9114 52341 82781 127947 107676 24359 -27681 -46008 -106275
10415a06275l3527J51687P1312q846n0776p4816L1178O1734k7944l1940l9060
$$ -106275 -139802 11885 83197 74351 23575 -51241 -20063 41671 13727 -18213 -57273
10404e7273K58J6055L4825l3595N188m505j38770J2215N6260J16160L2734q8726
$$ -57273 -57015 -40960 -6135 -39730 -34542 -39047 -177817 -165602 -109342 6818 39552 -49174
10392d9174q857M9010r861l7302N7242J20401n6976j27016p4576O6511M2544q75
$$ -49174 -58031 -9021 -18882 -56184 1058 121459 64483 -62533 -137109 -70598 -28054 -28929
10380b8929j2636j0208n4348J7539Q365J06805J5571k4260n399J6378p4254q7337
$$ -28929 -41565 -51773 -106121 -88582 -80217 26588 42159 17899 12500 28878 -45376 -132713
10368a32713K4386l7976R78J66946O1377l2496m7462J2205L540n6009o8892j18172
$$ -132713 -108327 -146303 -145325 21621 82998 50502 3040 15245 18785 -37224 -106116 -224288
10356b24288n2666J59534k854K4746K6252k2282J5541N4335J2691K3469n2173
$$ -224288 -276954 -117420 -120274 -95528 -69276 -91558 -76017 -21682 -8991 14478 -37695
10345c7695n1216n578K1157Q1398N4142k0532L006l9067p278N2043k6337O4632
$$ -37695 -88911 -94489 -73332 8066 62208 41676 44682 5615 -1663 50380 24043 88675
10333H8675O6613k1445r1823J2889J8727m8162j15695K2960j1486k3840O8826
$$ 88675 155288 133843 42020 54909 73636 25474 -90221 -67261 -78747 -102587 -33761
10322c3761J22098k394r5708m1802l9263j8486M0821M5201K1042j6767j7732K7972
$$ -33761 88337 85943 -9765 -51567 -90830 -109316 -68495 -23294 -2252 -19019 -36751 -8779
10310h779j4612K0615J23754Q508o3837o0076J2670P2278J4898M553m7730n2196
$$ -8779 -23391 -2776 120978 129486 65649 5573 18243 90521 105419 109972 62242 10046
10298A0046l9242L3446P652J6333m7409L6984j1370r5n2412m7397L2022q780k2765
$$ 10046 -29196 4250 11902 28235 -19174 17810 6440 6345 -46067 -93464 -61442 -70222 -92987
10285i2987q195J12532M1082o8785n276M9742j1620m4455N984L0008M0975K8007
$$ -92987 -101182 11350 52432 -16353 -21629 28113 16493 -27962 -21978 8030 49005 77012
10273G7012k2530K4439n2868p8471n6239K1802L6408Q3176N8503n7097n5734r1950
$$ 77012 54482 78921 26053 -52418 -108657 -86855 -50447 32729 91232 34135 -21599 -113549
10261a13549k7598K8977N4291j0757l2033K8596N3070J6042J9109M2655K080J4941
$$ -113549 -141147 -112170 -57879 -68636 -100669 -72073 -19003 -2961 16148 58803 60883 75824
10249G5824M5541m2682p6448J266O158p4549j15661l7029J59447J04498j7280
$$ 75824 121365 78683 2235 3501 9659 -64890 -180551 -217580 -58133 46365 29085
10238B9085M5822k5999r2064l1560M2217Q938L02L9373L8460q2951j6001j4572
$$ 29085 74907 48908 -43156 -74716 -32499 -23561 -23259 16114 54574 -28377 -44378 -58950
10226e8950M0355K0515k3169M2619n2833n9122K5105J34091R1422P9993l8220
$$ -58950 -18595 1920 -21249 21370 -31463 -90585 -65480 68611 160033 240026 201806
10215B01806j30403n9297p620K1540k7706j23124k6902J01930J43963m3962j05820
$$ 201806 71403 12106 4486 26026 -1680 -124804 -151706 -49776 94187 50225 -55595
10204e5595j1842N826M5321j8057q583K7891o635O203R1057Q6563k2200j6573
$$ -55595 -67437 -61611 -16290 -34347 -42930 -15039 -21674 -15471 75586 162149 139949 123376
10192A23376l7642P515j29218j704m3957q6619Q460j8655m575J9479M6467N2036
$$ 123376 85734 93249 -35969 -37673 -81630 -168249 -159789 -178444 -183019 -163540 -117073 -65037
10180f5037Q7654l061n698K430L9375J9314k6038M7190P705L4550n1567p7388
$$ -65037 22617 19556 13858 16288 55663 74977 48939 96129 103834 138384 86817 9429
10168I429p35n5115j05104M6790L0577j6568O4037R2598J7095o8345q2182l6647
$$ 9429 8694 -46421 -151525 -104735 -74158 -90726 -26689 65909 83004 14659 -67523 -104170
10156a04170K7702k9987p9419k4198M7356K722L6389L1562k0387q468N1828O9248
$$ -104170 -76468 -106455 -185874 -210072 -162716 -159994 -123605 -92043 -112430 -120898 -69070 178
10144A78j7447q3703p864M7109k1127N073K78M0296l6097L2235N768o0521L1799
$$ 178 -17269 -100972 -108836 -61727 -82854 -77781 -77503 -37207 -73304 -41069 -35301 -95822 -64023
10131f4023M5716K4978M4558j3501j9777n5472o1812o1461M9126N2433j7213o392
$$ -64023 -18307 6671 51229 37728 17951 -37521 -99333 -160794 -111668 -59235 -76448 -82840
10119h2840R575K8371K7282J283j6983p403q6091k4764O3451M2412M729j4396
$$ -82840 -73265 -44894 -17612 -16329 -33312 -40715 -126806 -151570 -88119 -45707 -40978 -55374
10107e5374L5236J8847K7180l1814P2131k7885m2749m4307L8322J135K8871O7987
$$ -55374 -20138 -1291 25889 -5925 66206 38321 -4428 -48735 -10413 -9278 19593 87580
10095H7580j264l0936N401j35253L8614J06208R025O837j7632K1912O7852k11
$$ 87580 86316 55380 60781 -74472 -35858 70350 79375 86212 68580 90492 158344 158133
10083A58133j07465r5661n6320L3048M9829p609J2025P361K0168M259O0097n2880
$$ 158133 50668 -44993 -101313 -68265 -18436 -26045 -14020 -6659 13509 17768 77865 24985
10071B4985l3242R7372K199J4136m9661M3400L5207o9622K7242K2854p0564J4133
$$ 24985 -8257 89115 91314 105450 55789 99189 134396 64774 92016 114870 44306 58439
10059E8439o815j2789k0163j3432N275r947K2544n2872o0174J7241P4881N6165
$$ 58439 51624 38835 18672 5240 10515 568 23112 -29760 -89934 -72693 2188 58353
10047E8353n6304j5899o0358l3239p2664k2989K9675O5684j2727J0072R079J282
$$ 58353 2049 -13850 -74208 -107447 -180111 -203100 -173425 -107741 -120468 -110396 -101317 -100035
10035a00035M080L3263O2498K0701M9385N4295q4416j16028K3346K1355J6683
$$ -100035 -95955 -62692 -194 20507 69892 124187 39771 -76257 -52911 -31556 -14873
10024a4873M566j6499j3000M3883K1572L6041l3739N65j5192p8570P4263R347
$$ -14873 -10307 -26806 -39806 4077 25649 61690 27951 28516 13324 -65246 9017 18364
10012A8364k5764L3164m7902l2046k5640P4015L999j7280J050J2848p1536Q528
$$ 18364 -7400 25764 -22138 -54184 -79824 -5809 -1810 -19090 -18040 -5192 -76728 -68200
10000f8200P5113M7200q737n8609k5966L6367q0002r439l5899N9931K7109k5887
$$ -68200 6913 54113 45376 -13233 -39199 -2832 -82834 -92273 -128172 -68241 -41132 -67019
9988f7019L6795P9045O571P767M657l543j01385p0952N789Q2515J3273m3078k1288
$$ -67019 -30224 48821 55392 63159 67816 64273 -37112 -108064 -102275 -19760 -6487 -49565 -70853
9975g0853O0539Q6743j06021k9610l6269M7487N2108l2456j9334P2578j7689J0013
$$ -70853 -10314 76429 -29592 -59202 -95471 -47984 4124 -28332 -47666 24912 7223 17236
9963A7236K4826M2946K8230M0044l4353j29477o2045L860O6223N2002L1044L239
$$ 17236 42062 85008 113238 153282 118929 -10548 -72593 -68733 -2510 49492 80536 83775
9951H3775o1075o0538L7241L1988M2248l8825j2288M2773L1605o6493k2165M6161
$$ 83775 22700 -37838 -597 31391 73639 34814 22526 65299 96904 30411 8246 54407
9939E4407K9175q76M321o2046n4675J8600P7443n776o6390J3468L9302K1600Q1809
$$ 54407 83582 82706 87027 24981 -29694 -11094 66349 60573 -5817 7651 46953 68553 150362
9926A50362M1654m5870K4889J095n7097k6629J3856o5729m7057j0541m2613M7080
$$ 150362 192016 146146 171035 172130 115033 88404 102260 36531 -10526 -21067 -63680 -16600
9914a6600O1272M0967j0497J3845n6955j43095N923M7569k5858q055R104P886
$$ -16600 44672 85639 75142 88987 32032 -111063 -105140 -57571 -83429 -91484 -82380 -74494
9902g4494N374J7345L1251N2005L1083k0218j8255J6301J2089K3540M647m5917
$$ -74494 -69120 -51775 -20524 31481 62564 42346 24091 40392 52481 76021 80668 34751
9890C4751o6160m3779j2729J03703Q1024K1191l6364r8043n286Q6318j8199K3144
$$ 34751 -31409 -75188 -87917 15786 96810 118001 81637 -16406 -21692 64626 46427 69571
9878F9571l0184k2896P9919K9358p0904o6345o0482O2968O1954l0356l5165n5356
$$ 69571 39387 16491 96410 125768 54864 -11481 -71963 -8995 52959 22603 -12562 -67918
9866f7918J2797P2774N5990L3906R56k3230j62765p2672P3258J03377m4764n2835
$$ -67918 -55121 17653 73643 107549 108505 85275 -77490 -150162 -76904 26473 -18291 -71126
9854g1126p3858Q9300J3132k6520l8576l4345m8703L4039R2343l5918K2215P1705
$$ -71126 -144984 -55684 -42552 -69072 -107648 -141993 -190696 -156657 -64314 -100232 -78017 -6312
9842f312M5410j1168j00297N8928L3302m4369r262k3856k0286m0054m5647K3902
$$ -6312 39098 27930 -72367 -13439 19863 -24506 -33768 -57624 -77910 -117964 -163611 -139709
9830a39709Q9505L6948l6160l4008L0831L4317R8883m7266p9681p097O4594M9541
$$ -139709 -50204 -13256 -49416 -83424 -52593 -18276 80607 33341 -46340 -53437 11157 60698
9818F0698N6448K7547L8384N8568J1771j23143l3590k2497q1692k9037j4181M0030
$$ 60698 117146 144693 183077 241645 253416 130273 96683 74186 -7506 -36543 -50724 -10694
9806a0694Q2841k2533m6645M6306r574j21783n5997j7882L5699P1581J3303l9253
$$ -10694 72147 49614 2969 49275 39701 -82082 -138079 -155961 -120262 -48681 -35378 -74631
9794g4631O9358K6972J1470N3565N5986M3472o2238p4729k2193l8959l3229o2480
$$ -74631 -5273 21699 33169 86734 142720 186192 123954 49225 27032 -11927 -45156 -107636
9782a07636N5426K1572M9699P3747o1967k3872k3088R5896l8292p2324k1034p7805
$$ -107636 -52210 -30638 19061 92808 30841 6969 -16119 79777 41485 -30839 -51873 -129678
9770a29678l6535O3263l752N4847K2752K1686n8964p1216O7699O2722M3618Q1149
$$ -129678 -166213 -102950 -106702 -51855 -29103 -7417 -66381 -137597 -69898 -7176 36442 117591
9758A17591N0446r0514m2452J4902q5576o5392M7614O4828O0956m0345j2107q883
$$ 117591 168037 77523 35071 49973 -35603 -100995 -53381 11447 72403 32058 19951 11068
9746A1068R3217O7657l8253k8988R4377j2377j29617m654j8027l2047L4468o41
$$ 11068 104285 171942 133689 104701 199078 186701 57084 52430 34403 2356 36824 36183
9734C6183N938K788q9549m8041n8327l4574J09062O8003n3653k8068K2199L7451
$$ 36183 42121 44909 -44640 -92681 -151008 -185582 -76520 -8517 -62170 -90238 -68039 -30588
9722c0588R3517K8156L7187j12690k9057m0280M635L8090P8994l9489p6430o637
$$ -30588 62929 91085 128272 15582 -13475 -53755 -49120 -11030 67964 28475 -47955 -54592
9710e4592Q5366L68Q670l4144o1430K4757l2883o6804j5081R013l7977m363N4087
$$ -54592 30774 31142 39812 5668 -55762 -31005 -63888 -130692 -145773 -136760 -174737 -179100 -125013
9697a25013Q2459P0447L4972k1377l2464P380M691k2523L5559K6121l6039k8743
$$ -125013 -42554 27893 62865 41488 9024 16404 21095 -1428 34131 60252 24213 -4530
9685d530n2753p8321k6805L164O7730R5284J0973l1114J4175L569M840J172m0752
$$ -4530 -57283 -135604 -162409 -159245 -91515 3769 14742 -16372 -2197 1372 6212 7384 -33368
9672c3368L5977N1152J4763j0787N0633m6134p1223r3015p1394j2601L0259Q6504
$$ -33368 2609 53761 68524 57737 108370 62236 -8987 -102002 -173396 -185997 -155738 -69234
9660f9234J3082L2487j5711j0033l7058k3675L6955J29783n28j2036M5827k5420
$$ -69234 -56152 -23665 -39376 -49409 -86467 -110142 -73187 56596 56068 44032 89859 64439
9648F4439k3200n5524l1148K1659L2623l0223p6176M378P6808K7692p4907m398
$$ 64439 41239 -14285 -45433 -23774 8849 -21374 -97550 -93172 -16364 11328 -63579 -67977
9636f7977N1476K721k0785P2845L4755l061o5881P079j7918n8588L1730O2736
$$ -67977 -16501 -13780 -34565 38280 73035 69974 4093 11172 -6746 -65334 -33604 29132
9624B9132k776J6908L3170K8731p892j06668l7029O4959J6096n2647J5134K2960
$$ 29132 26356 43264 76434 105165 97273 -9395 -46424 18535 34631 -18016 -2882 20078
9612B0078M3829M9513M4610J1962n1351r5216n8149L6351n930J0271j0240J2106
$$ 20078 63907 113420 158030 169992 118641 23425 -34724 1627 -4303 5968 -4272 7834
9600G834J3294R032l2062o9554J1398O9119M7545n0398o5513l1298L2031k1957
$$ 7834 21128 30160 -1902 -71456 -60058 9061 56606 6208 -59305 -90603 -58572 -80529
9588h0529Q3407N7786j4965j1268J21350J7164j59690n3469j7097o0604j3675
$$ -80529 2878 60664 45699 34431 155781 172945 13255 -40214 -57311 -117915 -131590
9577a31590J2140N4051o860M0995K6488J1651R0030l2155p0274j30428k0112M5836
$$ -131590 -119450 -65399 -72259 -31264 -4776 6875 96905 64750 -5524 -135952 -156064 -110228
9565a10228J11286O154q7490k4226N8188K8875L7800l0142o1537O6649J7894M4053
$$ -110228 1058 7212 -80278 -104504 -46316 -17441 20359 -9783 -71320 -4671 13223 57276
9553E7276j4903M7688J0932L718K3098Q4041k2776q2790N191j03678j07390J9921
$$ 57276 42373 90061 100993 104711 127809 211850 189074 106284 111475 7797 -99593 -79672
9541g9672J3638K4393n1080j07781m5653R0200J23914j3021L6477L2196j0147
$$ -79672 -66034 -41641 -92721 -200502 -246155 -155955 -32041 -45062 -8585 23611 13464
9530A3464J05r779j6309l7406K258J03092j921J2253l7488J7076L8847q4331k4765
$$ 13464 13569 3790 -12519 -49925 -47667 55425 53504 65757 28269 45345 84192 -139 -24904
9517b4904l4970q4240R0387J25543m6621l6629J6349j7211N6657N2543j7244n301
$$ -24904 -59874 -144114 -53727 71816 25195 -11434 4915 -12296 44361 96904 79660 74359
9505G4359K4252q0276k9975K2018J5448l797o4271O266O4966J12908p895q1950
$$ 74359 98611 18335 -11640 10378 25826 22029 -42242 -35976 28990 141898 134003 52053
9493E2053r4663j7273j8163N0764L1041o3238n2869k3654J27248L9042M7138j2812
$$ 52053 -42610 -59883 -78046 -27282 3759 -59479 -112348 -136002 -8754 30288 77426 64614
9481F4614o8499M3210R873p2162k1432j4203j1029L4290J4474o108k8718L6874
$$ 64614 -3885 39325 49198 -22964 -44396 -58599 -69628 -35338 -20864 -26972 -55690 -18816
9469a8816m8088J5179P969l2621n3016N333Q7870N2427K3064j4016q419L738N669
$$ -18816 -66904 -51725 -43756 -76377 -129393 -124060 -36190 16237 39301 25285 16866 20604 26273
9456B6273p4507j6545O4045o7821J6690N9534k1796k3440l0028P34k32m9525k0127
$$ 26273 -48234 -64779 -734 -68555 -51865 7669 -14127 -37567 -67595 -66861 -67093 -116618 -136745
9443a36745M417K6775M3387L7364K1911K8924o1641l9973K4692J23185Q0756N6097
$$ -136745 -132328 -105553 -62166 -24802 -2891 26033 -35608 -75581 -50889 72296 153052 209149
9431B09149p5258j36994p766o551j7480o5664l7216N6374J7239l8924k4871J25840
$$ 209149 133891 -3103 -10869 -17420 -34900 -100564 -137780 -81406 -64167 -103091 -127962 -2122
9419b122Q8780J5953L5581l2100L5867K6834j07341j17193K4588M1626O2781n9603
$$ -2122 86658 102611 138192 106092 141959 168793 61452 -55741 -31153 10473 73254 13651
9407A3651j9560m1490J2267Q3514j6343n7644o8325M0274M5340j6906l688o2779
$$ 13651 -5909 -47399 -35132 48382 32039 -25605 -93930 -53656 -8316 -25222 -28910 -91689
9395i1689o28P1515m0470L2560L4486n1712N4661P4757K3770j8726K2588l8657
$$ -91689 -92317 -20802 -61272 -28712 5774 -45938 8723 83480 107250 88524 111112 72455
9383G2455j31239m6064J29396J9746j8564K3614k0319j29422m9304j0916Q720
$$ 72455 -58784 -104848 24548 44294 25730 49344 29025 -100397 -149701 -160617 -151897
9372a51897L8101N2453J4108K6646M9651r980n5243m9522j8228k5452P365Q9294
$$ -151897 -113796 -61343 -47235 -20589 29062 19082 -36161 -85683 -103911 -129363 -121998 -32704
9360c2704M2616O5315k3713k0371j434m8553j7291N8331O1707P1749p1918p5115
$$ -32704 9912 75227 51514 31143 29709 -18844 -36135 22196 83903 155652 83734 8619
9348H619n2856n902M7648M5715J6659n5268o9317P1770P1241o0190Q322n3417
$$ 8619 -44237 -50139 -2491 43224 59883 4615 -64702 7068 78309 18119 26441 -26976
9336b6976j9260p2950n1636R8902R9752k0009m9245K2071k7732J1806M8320P8697
$$ -26976 -46236 -119186 -170822 -71920 27832 7823 -41422 -19351 -47083 -35277 13043 91740
9324I1740j8592r5554K4221L2606L2540M5497O573n5003j00689j31827L0167J29626
$$ 91740 73148 -22406 1815 34421 66961 112458 119031 64028 -36661 -168488 -138321 -8695
9312h695L9159k2739l4487k3505N3539J09069Q6383n1883q0868K8461O824n9445
$$ -8695 30464 7725 -26762 -50267 3272 112341 198724 146841 65973 94434 101258 41813
9300D1813m252M6198k8541q4431K7640K7204L8904K4774m6784p6631J1810j7460
$$ 41813 37561 83759 55218 -29213 -1573 25631 64535 89309 42525 -34106 -22296 -39756
9288c9756n5766M8250O2952J1397O7867J4685j3811o828J293j38154m0512M602
$$ -39756 -95522 -47272 15680 27077 94944 109629 95818 88990 90283 -47871 -88383 -83781
9276h3781K2291J5291J09025J9096j02715L5907L4935O9480n295k6236n0421k6091
$$ -83781 -61490 -46199 62826 81922 -20793 15114 50049 119529 114234 87998 37577 11486
9264A1486P6589R5186M5227q4012r9713J3716M7370J10460k0805J3993J7169J2625
$$ 11486 88075 183261 228488 144476 44763 58479 105849 216309 195504 209497 226666 239291
9252B39291q0598m9729K8349Q861l7608o8295o4498K2878R5094J390o445K8364
$$ 239291 158693 108964 137313 146174 108566 40271 -24227 -1349 93745 95135 88690 117054
9240A17054N7106q1223l7031O7549k904j912o959n6189J5912M0839R5188Q3864
$$ 117054 174160 92937 55906 123455 120551 118639 111680 55491 71403 112242 207430 291294
9228B91294k1161L964p327J3125O884r0038m2806p2913O4957K5464m9340K2800
$$ 291294 270133 274097 266770 279895 286779 196741 153935 81022 145979 171443 122103 144903
9216A44903l9876k925J78984O6877r1626j56999k4228q715J6510l9884P668O4636
$$ 144903 105027 102102 281086 347963 256337 99338 75110 66395 82905 43021 50689 115325
9204A15325l1269p033q024k923M1587L3916R112M6914K0348m8563N909K3232o0291
$$ 115325 84056 77023 68999 66076 107663 141579 150691 197605 217953 169390 175299 198531 138240
9191A38240K951J4620o3895J2557K1361J9013m2321n7421k5122Q874Q322k23j9078
$$ 138240 141191 155811 91916 104473 125834 144847 102526 45105 19983 28857 37179 36956 17878
9178A7878j1967n8316N6871R9458P5145j08464o092n1484k0126Q0633J2573j7166
$$ 17878 5911 -52405 4466 103924 179069 70605 64513 13029 -7097 73536 86109 68943
9166F8943M4807j599J9408l0780o2453m199N1147j1768M5824P1399m4362k0004
$$ 68943 113750 112151 131559 100779 38326 34127 85274 73506 119330 190729 146367 126363
9154A26363k8952J9946J9015m1749N5494L3115m8781j13838j3377J42134J1627
$$ 126363 97411 117357 136372 94623 150117 183232 134451 20613 7236 149370 160997
9143A60997K1111L4813P5631J7143j4969k3096j5817o0579L7732L1153K1709M861
$$ 160997 182108 216921 292552 309695 294726 271630 255813 195234 232966 264119 285828 290689
9131B90689j2046P1966q1790r2399Q217O8133M7313j11570Q450N0311m431K0504
$$ 290689 278643 350609 268819 176420 184637 252770 300083 188513 196963 247274 242843 263347
9119B63347N3861k2258q014L3767M5633o101J5214N5110M1720M3523l1409k3129
$$ 263347 317208 294950 286936 320703 366336 360235 375449 430559 472279 515802 484393 461264
9107D61264n0527J7014P2107j6766m1250L7375K9402Q9206P8744N2744K2219L3374
$$ 461264 410737 427751 499858 483092 441842 479217 508619 597825 676569 729313 751532 784906
9095G84906L0110K6894K4146j9920l299J18144J18493l9769N8024J48005J07680
$$ 784906 815016 841910 866056 846136 842837 960981 1079474 1039705 1097729 1245734 1353414
9084A353414P0600J6489Q1177Q9624O7858J80078K65910J75593K37418K34620
$$ 1353414 1424014 1440503 1521680 1611304 1679162 1859240 2125150 2300743 2538161 2772781
9074B772781K17336K64540J80898K46525K31895L24511L13413L20532L56843K82819
$$ 2772781 2990117 3254657 3435555 3682080 3913975 4238486 4551899 4872431 5229274 5512093
9064E512093J75739L7920m4480m0970o993j31370k93681j30971r8647j63106k31682
$$ 5512093 5687832 5725752 5681272 5640302 5633309 5501939 5208258 5077287 4978640 4815534 4583852
9053D583852k17266l11825l12842k61878k80682k06980j73851j76410k14599j85976
$$ 4583852 4366586 4054761 3741919 3480041 3199359 2992379 2818528 2642118 2427519 2241543
9043B241543j16235Q499o7385j95911j29756p5964j11281j27308k6990J2952l7392
$$ 2241543 2125308 2133807 2066422 1870511 1740755 1664791 1553510 1426202 1399212 1412164 1374772
9032A374772j54617j16831p6016K2230m417p4195k8871l8141j4568j6778l7748
$$ 1374772 1220155 1103324 1027308 1049538 1045121 970926 942055 903914 889346 872568 834820
9021H34820p8795n7189q4498r1324O5209m409o7825o2840K7400P0958p0279j01394
$$ 834820 756025 698836 614338 523014 588223 583814 515989 453149 480549 551507 481228 379834
9009C79834L549M6383J3772N6594O9923j6176k9213j14269n7905l0615K8670n593
$$ 379834 383383 429766 443538 500132 570055 553879 524666 410397 352492 321877 350547 344954
8997C44954L2679M2736q5140r088k2771m8778N3840N373n96j47253l6188j4918
$$ 344954 377633 420369 335229 326141 303370 254592 308432 313805 313209 165956 129768 114850
8985A14850p4167o599J34528Q7128O1061L9851m8475l3531n6801q3079j5455L2650
$$ 114850 40683 34084 168612 255740 316801 356652 308177 274646 217845 134766 119311 151961
8973A51961k547q4695o9455O5442R2578M1011n6188k3698m9646K6980J5332k9176
$$ 151961 149414 64719 -4736 60706 153284 194295 138107 114409 64763 91743 107075 77899
8961G7899P304K9821k3277l5403K6246R311J2318J6494L980m356o1165j03188
$$ 77899 85203 115024 91747 56344 82590 91901 104219 120713 124693 120337 59172 -44016
8949d4016l004L1576K8470K6764J1811p1668l0164J00616J05923k547l4419K2153
$$ -44016 -47020 -15444 13026 39790 51601 -20067 -50231 50385 156308 153761 119342 141495
8937A41495N7831q7475r4409l5971l7140m9818O6662Q3616j1229M9848N2581l0569
$$ 141495 199326 111851 17442 -18529 -55669 -105487 -38825 44791 33562 83410 135991 105422
8925A05422k818j15114n7239O6029N2772P9089K2323K2423q860q7602j9848L5463
$$ 105422 102604 -12510 -69749 -3720 49052 128141 150464 172887 164027 76425 56577 92040
8913I2040P57l0468p2801n3489K0475n8533M6303N3354o990M0862O2298J8849
$$ 92040 92797 62329 -10472 -63961 -43486 -102019 -55716 -2362 -9352 31510 93808 112657
8901A12657o2005o9788k2538k533N9711K9034m1617m5297l7713P5389J3857J3654
$$ 112657 50652 -19136 -41674 -44207 15504 44538 2921 -42376 -80089 -4700 9157 22811
8889B2811L9498j5569O137k1724p133R6272K7507N4347J0793m5442n9480k5369
$$ 22811 62309 46740 52877 31153 24020 120292 147799 202146 212939 167497 108017 82648
8877H2648p9382N415M0494J5062j02114p7950J2392P5203K4122o5501l8796J4420
$$ 82648 3266 8681 49175 64237 -37877 -115827 -103435 -28232 -4110 -69611 -108407 -93987
8865i3987L1686J4825j3487O0883M0327N6727k8132k7459N3629o484L1221l1522
$$ -93987 -62301 -47476 -60963 -80 40247 96974 68842 41383 95012 88528 119749 88227
8853H8227j6517J4317J5181o5962J1043J090m9360p789l7010L8393J52634K8420
$$ 88227 71710 86027 101208 35246 46289 47379 -1981 -9770 -46780 -8387 144247 172667
8841A72667r7743r5651n1074J5176p8843l4137O7700R101k674K8129L9837K2022
$$ 172667 74924 -20727 -71801 -56625 -135468 -169605 -101905 -92804 -95478 -67349 -27512 -5490
8829e490O0033Q9735l3869K401K9937j2636P6200l1617n1297m4777k7457r797
$$ -5490 54543 144278 110409 112810 142747 130111 206311 174694 123397 78620 51163 41366
8817D1366j3238l7391M8532K6885r2441o19R8287q784l0996N4963O990k9292q6231
$$ 41366 28128 -9263 39269 66154 -26287 -26906 71381 62597 31601 86564 93554 64262 -21969
8804b1969K2625M9087L0798K2113o77l8491n6186O1313P895j7951K7273O2523
$$ -21969 656 49743 80541 102654 101977 63486 7300 68613 76508 58557 85830 148353
8792A48353l366o3763r5720l0649k7172k6197M7797N0345O1136O3986K4562l0659
$$ 148353 144987 81224 -14496 -45145 -72317 -98514 -50717 -372 60764 124750 149312 118653
8780A18653J0999m2492n8171m1624q5913p586J073L2076Q2504K6236n680j615
$$ 118653 129652 87160 28989 -12635 -98548 -106134 -105061 -72985 9519 35755 30075 28460
8768B8460N1857j0329l0546n9696L4043M1160j0957k2920Q8858k9717o5776l8706
$$ 28460 80317 69988 39442 -20254 13789 54949 43992 21072 109930 80213 14437 -24269
8756b4269Q7454L1578O4377o5400l1546J5268Q1030j7753j3090l7790Q4665k9714
$$ -24269 63185 94763 159140 93740 62194 77462 158492 140739 127649 89859 174524 144810
8744A44810o5292P240N359M6734O97J7160J5399k7183m6288l1823L07J551J777
$$ 144810 79518 86758 92117 138851 139548 156708 172107 144924 98636 66813 67120 68671 70448
8731G0448J3338K2340M8169j9700j76374l4775n1131m2438L8508R2277Q9697k1561
$$ 70448 83786 106126 154295 134595 -41779 -76554 -127685 -170123 -131615 -39338 50359 28798
8719B8798Q635j4313k6600o4764K2280O9495J1269m726j6184L0271J6357n8179
$$ 28798 37433 23120 -3480 -68244 -45964 23531 34800 30074 13890 44161 60518 2339
8707B339m8251j0409J30634Q4555K44J5552o8056K9232N8559K4931P496j169p1479
$$ 2339 -45912 -56321 74313 158868 159112 174664 106608 135840 194399 219330 226826 225657 154178
8694A54178n0352m6647j6826L3503J04071L7792o49j090n8672p5133L2973O6786
$$ 154178 103826 57179 40353 73856 177927 215719 215070 213980 155308 80175 113148 179934
8682A79934Q0827L1503r4326p4307M7819R9842q4764l6904j411j0949m4512o9051
$$ 179934 260761 292264 197938 123631 171450 271292 186528 149624 148213 137264 92752 23701
8670B3701M4098j6726L1636p7717o3875l415J6693K5958J13877N5495P2234l7766
$$ 23701 67799 51073 82709 4992 -58883 -62298 -45605 -19647 94230 149725 221959 184193
8658A84193l1747j28372o525M4363K1996N038L9294O5475J8244m512j0489o2755
$$ 184193 152446 24074 17549 61912 83908 88946 128240 193715 211959 207447 196958 134203
8646A34203K0873M8053J05242N53p1270k2567M4813k0286l7501r0479J8534Q8560
$$ 134203 155076 203129 308371 308924 237654 215087 259900 239614 202113 111634 130168 218728
8634B18728j8918j2605M6209O6623n8432m8286L1967K5809o9888k5790J06438
$$ 218728 199810 187205 233414 300037 241605 193319 225286 251095 181207 155417 261855
8623B61855Q0998l0905k3933N5078L1068j549N9999k939k355k1668j31710o7857
$$ 261855 342853 311948 288015 343093 374161 372612 432611 429672 427317 405649 273939 206082
8611B06082O7753O0347K2771J09036k3115K047L5880O5m7585L3425L4349k6676
$$ 206082 273835 334182 356953 465989 442874 444921 480801 480866 433281 466706 501055 474379
8599D74379q5827r0171J06455N5470n1237n6580n5214o8225P8809J2327J4846
$$ 474379 388552 298381 404836 460306 409069 352489 297275 229050 307859 320186 335032
8588C35032O5153j1487n7478j05813P6892J00626M3696Q1462Q4682K14878J73252
$$ 335032 400185 388698 331220 225407 302299 402925 446621 528083 612765 827643 1000895
8577A000895K41053L43758K38654j22765l77694l38209k66486j79892n3939l5055
$$ 1000895 1241948 1585706 1824360 1701595 1323901 985692 719206 539314 485375 450320
8567D50320j31528p8930n1782K2446M7140K740k5668K2949P468m6876j3130J9704
$$ 450320 318792 239862 188080 210526 257666 260406 234738 257687 265155 218279 205149 224853
8555B24853l1381K317J2193o3258j5696L9648k2958Q1668J38462O5083o9540o615
$$ 224853 193472 195789 207982 144724 129028 168676 145718 227386 365848 430931 361391 354776
8543C54776l0513M5359m52m9512j40J51987J07476J90228K96885L60051N44441
$$ 354776 324263 369622 369170 319658 319518 471505 578981 769209 1066094 1426145 1970586
8532A970586O45616O34260P2998o20082p82005p13108l53332n6907m0126j89463
$$ 1970586 2616202 3250462 3323460 2703378 1921373 1208265 854933 798026 757900 568437
8522E68437j51254j1337M0330p3397n5640O1747K5360n401q694J2068J0078j1252
$$ 568437 417183 405846 446176 372779 317139 378886 404246 398845 390151 402219 412297 401045
8510D01045r6350j46020p7924N3264k6413n1714M3485M376K0631J11930k6475
$$ 401045 304695 158675 80751 134015 107602 55888 99373 103749 124380 236310 209835
8499B09835o850J2298O5516k952J1677R7242O0567L0917J13134J48399K52806
$$ 209835 202985 215283 280799 277847 289524 386766 447333 478250 591384 739783 992589
8488I92589L27989K59252Q7733j05650k84264l85348k82591j09757p5192l2572
$$ 992589 1320578 1579830 1667563 1561913 1277649 892301 609710 499953 424761 392189
8478C92189O124n4125n2962r5917j8304o078j06336n1349J37449J16730m8975
$$ 392189 398313 344188 291226 195309 177005 170927 64591 13242 150691 267421 218446
8467B18446m9905R5466J6708m8569n9003r9889K1270J0135m7055j6508N7815J836
$$ 218446 168541 264007 280715 232146 173143 73254 94524 104659 57604 41096 98911 100747
8455A00747q6333j00822K0797R4698K646m9227O9519L933J2857o7889O279K0348
$$ 100747 14414 -86408 -65611 29087 31733 -17494 52025 55958 68815 926 7205 27553
8443B7553L2993J03779L3502j22340p5237l619M4488P1493m8982l7928M2796k2639
$$ 27553 60546 164325 197827 75487 250 -3369 41119 112612 63630 25702 68498 45859
8431D5859n2391l7345J9148P820K7243J5170M7585K1472j5062r0682o9912J14000
$$ 45859 -6532 -43877 -24729 -16909 10334 25504 73089 94561 79499 -11183 -81095 32905
8419C2905J46536K251o6756K9030O845j07135J9825J600J43191N507j20767O0031
$$ 32905 179441 181692 114936 143966 150811 43676 63501 65101 208292 213799 93032 153063
8407A53063M1581J1636r0200p9393p5827O9486L4975J5144k8651n2777L398Q2514
$$ 153063 194644 206280 116080 36687 -39140 30346 65321 80465 51814 -963 2435 84949
8395H4949K4598j17009j10583q5478r419J2309J16472M0952J09827m9769O089
$$ 84949 109547 -7462 -118045 -203523 -212942 -200633 -84161 -43209 66618 16849 22938
8384B2938M5118L000j01500n2349P035p3172p758J08928M4145O8395m4084j1141
$$ 22938 68056 71056 -30444 -82793 -75758 -148930 -156688 -47760 -3615 64780 20696 9555
8372I555o5805N0523j0891l0205M3452j3805k6517o6229n804J41083Q6758l5036
$$ 9555 -56250 -5727 -16618 -46823 -3371 -17176 -43693 -109922 -115726 25357 112115 77079
8360G7079j33379K8004M9797q462j2014R900J4988o5171q7624R099R1509k4795
$$ 77079 -56300 -28296 21501 13039 1025 10925 25913 -39258 -126882 -117783 -26274 -51069
8348e1069m7694K348M1545L7521j0496P4113Q7184Q481r5060m569q2306o0737
$$ -51069 -98763 -96415 -54870 -17349 -27845 46268 133452 141933 46873 42304 -40002 -100739
8336a00739R2424J07471J1166k8164j07564l2482N0866N3300p9943r946J0638
$$ -100739 -8315 99156 110322 82158 -25406 -57888 -7022 46278 -33665 -43611 -32973
8325c2973K2731r042K5956J3461p0547l2265Q4033k5859k9636q986n602P8071
$$ -32973 -10242 -19284 6672 20133 -50414 -82679 1354 -24505 -54141 -63127 -68729 9342
8313I342L6546j9604L4011K6047r4588n5640k1048l4044P8187l0610K1787K7418
$$ 9342 45888 26284 60295 86342 -8246 -63886 -84934 -118978 -40791 -71401 -49614 -22196
8301b2196L5195J8846n9359J7403J1250O1437R4514L4414j05516q1804L8786k2110
$$ -22196 12999 31845 -27514 -10111 1139 62576 157090 191504 85988 4184 42970 20860
8289B0860M9365n3395k2900J27613q735r5275j1517O9075k7312o827J279o3049
$$ 20860 70225 16830 -6070 121543 112808 17533 6016 75091 47779 40952 42231 -20818
8277b0818j8753J2508M1133N1632K7875K0815o4536m5669l5565P7599M4670j4639
$$ -20818 -39571 -27063 14070 65702 93577 114392 49856 4187 -31378 46221 90891 76252
8265G6252n857M7061K79k7164l3052m9337o1669p432J16061q970L1494m500P229
$$ 76252 70395 117456 117735 90571 57519 8182 -53487 -60919 55142 46172 77666 73166 80395
8252H0395j1057j7860l9089J2428j3802j1662L9217n7701p0980O5613J04170K3156
$$ 80395 69338 51478 12389 24817 11015 -647 38570 -19131 -90111 -24498 79672 102828
8240A02828m7558P5462K7937m0770j32n7123N316j3n1755m6473O1338N5095m6865
$$ 102828 55270 130732 158669 117899 117767 60644 65960 65947 14192 -32281 29057 84152 37287
8227C7287m3495K2260L5864L6422j00735p7618O23J62198p307r15r655p3991o176
$$ 37287 -6208 16052 51916 88338 -12397 -90015 -89392 72806 65499 64584 54929 -19062 -25238
8214b5238M7886J8331K7914j3469l4941r27K5271P529L0305k0937J6915j4095
$$ -25238 22648 40979 68893 55424 20483 19556 44827 52356 82661 61724 78639 64544
8202F4544J2025p5229m4451k8338l7531J2762K9514M2367P5898M775K8268N2670
$$ 64544 76569 1340 -43111 -71449 -108980 -96218 -66704 -24337 51561 56336 84604 137274
8190A37274K7104n6030n0031Q699K033Q751N3751r046k5484K8294m3076j6425
$$ 137274 164378 108348 58317 67016 69049 77800 131551 122505 97021 125315 82239 65814
$$ [...]
##END NTUPLES=NMR SPECTRUM
##END=
