##TITLE=Analysis number 319840
Compound Code cc 26311
Project Code adrs
Chemist Name scafell
##JCAMPDX= 6.0         $$ Bruker NMR JCAMP-DX V2.0
##DATA TYPE= NMR SPECTRUM
##DATA CLASS= NTUPLES
##ORIGIN= Bruker BioSpin GmbH
##OWNER= nmr
$$ XWIN-NMR		Version 3.5
$$ Wed May 31 14:45:52 2006 GMT Daylight Time (UT+1h)  MAYBRIDGE\nmr@NMR_250MHZ
##.OBSERVE FREQUENCY= 250.131544655141
##.OBSERVE NUCLEUS= ^1H
##.ACQUISITION MODE= SIMULTANEOUS (DQD)
##.ACQUISITION SCHEME= undefined
##.AVERAGES= 16
##.DIGITISER RES= 18
##SPECTROMETER/DATA SYSTEM= dpx250
##.PULSE SEQUENCE= zg30
##.SOLVENT NAME= CDCl3
##.SHIFT REFERENCE= (INTERNAL, CDCl3, 0, 16.522)
##AUDIT TRAIL= $$ (NUMBER, WHEN, WHO, WHERE, WHAT)
$$ ##TITLE= Audit trail, XWIN-NMR		Version 3.5
$$ ##JCAMPDX= 5.01
$$ ##ORIGIN= Bruker BioSpin GmbH
$$ ##OWNER= nmr
$$ C:\u/data/dgb/nmr/ADRS/5470/pdata/1/auditp.txt
$$ ##AUDIT TRAIL=  $$ (NUMBER, WHEN, WHO, WHERE, WHAT)
(   1,<2006-05-31 14:45:14.36 +100>,<MAYBRIDGE\nmr>,<NMR_250MHZ>,
      <created by zg, POWCHK disabled, PULCHK disabled
       configuration hash MD5:
       E2 DF 36 D8 04 B2 41 60 5A D7 A3 38 5A 4B D0 FE
       data hash MD5: 64K
       4A 4E 7D 13 7B 1F A4 CA A0 28 18 1B 5B F9 F5 AC>)
(   2,<2006-05-31 14:45:32.72 +100>,<MAYBRIDGE\nmr>,<NMR_250MHZ>,
      <Start of raw data processing
       ef LB = 0.3 FT_mod = 6 PKNL = 1 SI = 32K 
       data hash MD5: 32K
       6B 0B 89 D7 28 03 65 C1 A5 8F 2A E4 C5 6E 6F BB>)
(   3,<2006-05-31 14:45:36.77 +100>,<MAYBRIDGE\nmr>,<NMR_250MHZ>,
      <apk 
       data hash MD5: 32K
       D0 98 00 7E 0C 56 36 14 09 AD F5 58 88 DA 85 36>)
(   4,<2006-05-31 14:45:38.32 +100>,<MAYBRIDGE\nmr>,<NMR_250MHZ>,
      <abs ABSG = 5 
       data hash MD5: 32K
       6A E6 9E F7 AC 9E DB 0B 3E 63 81 8D 08 8C 73 58>)
$$ ##END=
$$ 
$$ hash MD5
$$ 87 96 4A 4C B4 0D 15 07 46 43 44 B5 CF E4 E4 8E
##$RELAX= 
##$RELAX= 
##$RELAX= 
##$RELAX= 
##$RELAX= 
##$RELAX= 
##$RELAX= 
$$ Bruker specific parameters
$$ --------------------------
##$DU= <C:\u>
##$EXPNO= 5470
##$NAME= <ADRS>
##$PROCNO= 1
##$TYPE= <nmr>
##$USER= <dgb>
##$AMP= (0..31)
100 100 100 100 100 100 100 100 100 100 100 100 100 100 100 100 100 100 
100 100 100 100 100 100 100 100 100 100 100 100 100 100 
##$AQSEQ= 0
##$AQ_mod= 3
##$AUNM= <au_zg>
##$AUTOPOS= <34 >
##$BF1= 250.13
##$BF2= 250.13
##$BF3= 250.13
##$BF4= 250.13
##$BF5= 500.13
##$BF6= 500.13
##$BF7= 500.13
##$BF8= 500.13
##$BYTORDA= 1
##$CFDGTYP= 0
##$CFRGTYP= 5
##$CHEMSTR= <none>
##$CNST= (0..31)
1 1 145 1 1 1 1 1 1 1 1 1 1 1 1 1 1 1 1 1 1 1 1 1 1 1 1 1 1 1 1 1 
##$CPDPRG= <>
##$CPDPRG1= <>
##$CPDPRG2= <>
##$CPDPRG3= <>
##$CPDPRG4= <mlev>
##$CPDPRG5= <mlev>
##$CPDPRG6= <mlev>
##$CPDPRG7= <mlev>
##$CPDPRG8= <mlev>
##$CPDPRGB= <>
##$CPDPRGT= <>
##$D= (0..31)
0 1 0 0 0 0 0 0 0 0.06 0 0 0 0 0 0 0.0002 0 0 0 0 0 0 0 0 0 0 0 0 0 0 
0 
##$DATE= 1149083112
##$DBL= (0..7)
120 120 120 120 120 120 120 120 
##$DBP= (0..7)
150 150 150 150 150 150 150 150 
##$DBP07= 0
##$DBPNAM0= <>
##$DBPNAM1= <>
##$DBPNAM2= <>
$$ [...]
##$SUBNAM7= <"">
##$SUBNAM8= <"">
##$SUBNAM9= <"">
##$SW= 20.6930455092707
##$SWIBOX= (0..15)
0 0 3 0 0 0 0 0 0 0 0 0 0 0 0 0 
##$SW_h= 5175.983436853
##$TD= 65536
##$TD0= 1
##$TE= 295.16
##$TE2= 300
##$TE3= 300
##$TEG= 300
##$TL= (0..7)
0 120 120 120 120 120 120 120 
##$TP= (0..7)
150 150 150 150 150 150 150 150 
##$TP07= 0
##$TPNAME0= <>
##$TPNAME1= <>
##$TPNAME2= <>
##$TPNAME3= <>
##$TPNAME4= <>
##$TPNAME5= <>
##$TPNAME6= <>
##$TPNAME7= <>
##$TPOAL= (0..7)
0.5 0.5 0.5 0.5 0.5 0.5 0.5 0.5 
##$TPOFFS= (0..7)
0 0 0 0 0 0 0 0 
##$TUNHIN= 0
##$TUNHOUT= 0
##$TUNXOUT= 0
##$USERA1= <user>
##$USERA2= <user>
##$USERA3= <user>
##$USERA4= <user>
##$USERA5= <user>
##$V9= 5
##$VALIST= <valist>
##$VCLIST= <CCCCCCCCCCCCCCC>
##$VD= 0
##$VDLIST= <DDDDDDDDDDDDDDD>
##$VPLIST= <PPPPPPPPPPPPPPP>
##$VTLIST= <TTTTTTTTTTTTTTT>
##$WBST= 1024
##$WBSW= 4
##$XGAIN= (0..3)
0 0 0 0 
##$XL= 0
##$YL= 0
##$YMAX_a= 493168
##$YMIN_a= -491873
##$ZGOPTNS= <>
##$ZL1= 120
##$ZL2= 120
##$ZL3= 120
##$ZL4= 120
##$ABSF1= 16.522
##$ABSF2= -4.171173
##$ABSG= 5
##$ABSL= 3
##$ALPHA= 0
##$AQORDER= 0
##$ASSFAC= 0
##$ASSFACI= 0
##$ASSFACX= 0
##$ASSWID= 0
##$AUNMP= <proc_1d>
##$AZFE= 0.1
##$AZFW= 0.1
##$BCFW= 0
##$BC_mod= 0
##$BYTORDP= 0
##$COROFFS= 0
##$CY= 12.5
##$DATMOD= 1
##$DC= 0
##$DFILT= <>
##$DTYPP= 0
##$F1P= 14.0000005364418
##$F2P= -0.99999901652339
##$FCOR= 0.5
##$FTSIZE= 32768
##$FT_mod= 6
##$GAMMA= 0
##$GB= 0
##$INTBC= 1
##$INTSCL= 1
##$ISEN= 128
##$LB= 0.3
##$LEV0= 0
##$LPBIN= 0
##$MAXI= 10000
##$MC2= 0
##$MEAN= 0
##$ME_mod= 0
##$MI= 0
##$NCOEF= 0
##$NC_proc= -2
##$NLEV= 6
##$NOISF1= 0
##$NOISF2= 0
##$NSP= 0
##$NTH_PI= 0
##$NZP= 0
##$OFFSET= 16.522
##$PC= 1
##$PHC0= 171.2358
##$PHC1= 6.006036
##$PH_mod= 1
##$PKNL= yes
##$PPARMOD= 0
##$PSCAL= 4
##$PSIGN= 0
##$REVERSE= no
##$SF= 250.13
##$SI= 32768
##$SIGF1= 0
##$SIGF2= 0
##$SINO= 400
##$SIOLD= 32768
##$SREGLST= <1H.CDCl3>
##$SSB= 0
##$STSI= 32768
##$STSR= 0
##$SW_p= 5175.98343685301
##$SYMM= 0
##$S_DEV= 0
##$TDeff= 65536
##$TDoff= 0
##$TI= <Analysis number 999999
Compound Code 99
Book Reference 9
Project Code 9>
##$TILT= no
##$TM1= 0
##$TM2= 0
##$TOPLEV= 0
##$USERP1= <user>
##$USERP2= <user>
##$USERP3= <user>
##$USERP4= <user>
##$USERP5= <user>
##$WDW= 1
##$XDIM= 32768
##$YMAX_p= 379496241
##$YMIN_p= -68268
$$ End of Bruker specific parameters
$$ ---------------------------------
##NTUPLES= NMR SPECTRUM
##VAR_NAME=  FREQUENCY,     SPECTRUM/REAL,   SPECTRUM/IMAG
##SYMBOL=    X,             R,               I
##VAR_TYPE=  INDEPENDENT,   DEPENDENT,       DEPENDENT
##VAR_FORM=  AFFN,          ASDF,            ASDF
##VAR_DIM=   32768,         32768,           32768
##UNITS=     HZ,            ARBITRARY UNITS, ARBITRARY UNITS
##FACTOR=    0.157963299565203, 1,           1
##FIRST=     4132.6476996994, 0,             0
##LAST=      -1043.33573715361, 0,           0
##MIN=       -1043.33573715361, -68268,      0
##MAX=       4132.6476996994, 379496241,     0
$$ Real data points
##PAGE= N=1
##DATA TABLE= (X++(R..R)), XYDATA
$$ [...]
16838a6620j0082R112L5055O42r205K0984R933k3594k0866j3249l602m074K2954
$$ -16620 -26702 -17590 17465 18107 8902 29886 39819 16225 -4641 -17890 -21492 -25566 -2612
16825b612K5706j494j3676q123j3994N47J2721P41m350K2223L767j0127L812J0664
$$ -2612 23094 21600 7924 -199 -14193 -13646 -925 -184 -4534 17689 21456 11329 15141 25805
16811B5805j3894k3512O847O999O551r738n305j3561J4525R438r528k487q22J5734
$$ 25805 11911 -11601 -4754 2245 8796 -942 -6247 -19808 -5283 4155 -5373 -7860 -8682 7052
16797G052j1961j1631P111n501m725O631K488k13j0442j7678j4754M031J6793
$$ 7052 -4909 -16540 -9429 -14930 -19655 -13024 -10536 -10749 -21191 -38869 -53623 -49592 -32799
16784c2799J9911P030l821L688p072O55M120j3691q565J6307J3984N394j0560
$$ -32799 -12888 -5858 -9679 -5991 -13063 -12408 -8288 -21979 -30544 -14237 -253 5141 -5419
16771e419j7459N908m535L894M876j0999O094J6937j3127k0313J1470J8249j2509
$$ -5419 -22878 -16970 -21505 -17611 -12735 -23734 -17640 -703 -13830 -34143 -22673 -4424 -16933
16758a6933j14P237j847j6478j836K4589O867j8547J2473O465j0704q076j1343
$$ -16933 -17047 -9810 -11657 -28135 -29971 -5382 1485 -17062 -4589 1876 -8828 -16904 -28247
16745b8247J5546L4526J1011j6764j7165j6423N965O148L918K503j797J0282J1770
$$ -28247 -12701 21825 32836 16072 -1093 -17516 -11551 -5403 -1485 1018 -779 9503 21273
16732B1273r200k0462j2254J0247J8612J4839L424K333K657n321j9388j8530j0439
$$ 21273 12073 -8389 -20643 -10396 8216 23055 26479 28812 31469 26148 6760 -11770 -22209
16719b2209k873P790J2114j389N640o714j1241N174o499n238N164K2853R429O638
$$ -22209 -25082 -17292 -5178 -6567 -927 -7641 -18882 -13708 -20207 -25445 -20281 2572 12001 18639
16705A8639M833j0810j4424p513J3785J8475N664j3394o209k6492j6479j3720
$$ 18639 23472 12662 -1762 -9275 4510 22985 28649 15255 9046 -17446 -33925 -47645
16693d7645N950J8683K4423M438r370O36O640O203j9046p073J65K1183l665j4586
$$ -47645 -41695 -23012 1411 5849 -3521 -2885 3755 9958 -9088 -16161 -15996 5187 1522 -13064
16679a3064K982K0024j2931k0362j6570J4569K5126O063J0249J1055j4259j2762
$$ -13064 -10082 9942 -2989 -23351 -39921 -25352 -226 5837 16086 27141 12882 120
16667A20K375l753k919k0355j6455K4643K4093j0573k9462j269J8573J0314J0143
$$ 120 2495 -1258 -4177 -24532 -40987 -16344 7749 -2824 -32286 -33555 -14982 -4668 5475
16654E475o450r724J1753l87q513n379j5056J8080N244j4847J4622N529r542p297
$$ 5475 -975 -10699 1054 667 -7846 -13225 -28281 -10201 -4957 -19804 -5182 347 -9195 -16492
16640a6492q426J0032J1178m076L197N49k179O364R083l086j6597Q45k998P561
$$ -16492 -24918 -14886 -3708 -7784 -4587 -4038 -6217 147 9230 6144 -10453 -9608 -12606 -5045
16626e045Q917K064j4402j6308L010J3692K2886J2266k067l674j7912k4273r408
$$ -5045 3872 5936 -8466 -24774 -21764 -8072 14814 27080 25013 21339 3427 -20846 -30254
16613c0254l177J609n913j2450l500J3397K2224R588o25l457J2857q763j6541
$$ -30254 -33431 -31822 -37735 -50185 -53685 -40288 -18064 -8476 -9101 -12558 299 -8464 -25005
16600b5005k928o455J164Q169O702J4130L933k811p343k2742J5668K1123N993
$$ -25005 -27933 -34388 -33224 -25055 -18353 -4223 -290 -3101 -10444 -33186 -17518 3605 9598
16587I598R190k855j584j7310j1518l48K671Q758R277j0612o781n575K232J996
$$ 9598 18788 15933 14349 -2961 -14479 -14827 -12156 -3398 5879 -4733 -11514 -17089 -14857 -12861
16573a2861R685l421m513j2639K4264O690r329M477J8088Q61j5894k2881j851
$$ -12861 -3176 -6597 -11110 -23749 515 7205 -2124 2353 20441 21302 5408 -17473 -19324
16560a9324l413p783M477L092N372n901J8095J1924K558K7430L971M29j2013K082
$$ -19324 -22737 -30520 -26043 -22951 -17579 -23480 -5385 6539 9097 36527 40498 40927 28914 30996
16546C0996N78j8865l401m266m05O24R41l801J3598k133j1001P45l658R225p62
$$ 30996 31574 12709 9308 5042 4637 5261 6202 2401 15999 13866 2865 3610 -48 9177 8415
16531H415p034j0394j8280K794J5780j247k6423j0031L164K1111L0772o02j4095
$$ 8415 1381 -9013 -27293 -24499 -8719 -9966 -36389 -46420 -43256 -22145 8627 8025 -6070
16518f070m006j713o086J6116K209k898q303j3086r069q859J246J0619J3177l048
$$ -6070 -10076 -11789 -17875 -1759 450 -2448 -10751 -23837 -32906 -41765 -40519 -29900 -16723 -19771
16504a9771k5808J5544L2588J9492J2023o842q431J834p272j799O575J6190l868
$$ -19771 -45579 -30035 2553 22045 34068 27226 18795 20629 13357 11558 18133 34323 30455
16491C0455j4738j6211j4970L164k80Q298J930O219R038q044k643r394j1960N255
$$ 30455 15717 -494 -15464 -12300 -12580 -4282 -2352 3867 12905 4861 2218 -7176 -19136 -13881
16477a3881m241J2592K8009Q902j5457j5718j1808J228Q801O036q210M217r613
$$ -13881 -18122 -5530 22479 31381 15924 206 -11602 -10374 -1573 4463 -3747 470 -9143
16464i143n711j1650l829Q382J0820P997j0322n551R269L0133J6514k5903p518
$$ -9143 -14854 -26504 -30333 -21951 -11131 -3134 -13456 -19007 -9738 20395 36909 11006 3488
16451C488l356Q51L355R428p881l0297j9091P660J3440J8692J987K90p148M495
$$ 3488 132 983 4338 13766 5885 -24412 -43503 -35843 -22403 -3711 -1724 -1434 -8582 -4087
16437d087q929p697J056K1353J072j2016R88O19K329l489M809o79O461J5949l080
$$ -4087 -13016 -20713 -19657 1696 2768 -9248 -8260 -7641 -5312 -8801 -3992 -4671 1790 17739 14659
16422A4659p429k5120M14P14j2814M93j455o421N822J3039K111J0611k652K738
$$ 14659 7230 -17890 -17476 -16762 -29576 -29083 -30538 -36959 -31137 -18098 -15987 -5376 -8028 -5290
16408e290j0495O295m329n068L994K4685O33r964o708Q231l10p979q139R36n415
$$ -5290 -15785 -9490 -13819 -18887 -14893 9792 10425 461 -6247 1984 1674 -6305 -14444 -13508 -18923
16393a8923J3874J1779m41p166j753N413n423J3259J1026j2832m891o957k944
$$ -18923 -5049 6730 6289 -877 -2630 2783 -2640 10619 21645 8813 3922 -3035 -5979
16380e979q406o689J9371K4931j8096j3186L832J330j6620n12r058o788J0294
$$ -5979 -14385 -21074 -1703 23228 5132 -8054 -4222 -2892 -19512 -20024 -29082 -35870 -25576
16367b5576k020K81L381J8944J4484o605j2136O577J0179j206J5419L688k286
$$ -25576 -27596 -27315 -23934 -4990 9494 2889 -9247 -2670 7509 6303 21722 25410 23124
16354B3124q550p867j7469n89j218n355J335J4528L946q188q588q05r08J621L093
$$ 23124 14574 6707 -10762 -11351 -12569 -17924 -16589 -2061 1885 -6303 -14891 -15696 -16604 -14983 -11890
16339a1890j2799q257J2584J8172n240j0480J1527J1967M954L158P17r635p664
$$ -11890 -24689 -32946 -20362 -2190 -7430 -17910 -6383 5584 10538 13696 14413 4778 -2886
16326b886J1618j1145l434j2942l644J698J3727J8362l67j8082n372J2013n062
$$ -2886 8732 -2413 -5847 -18789 -22433 -20735 -7008 11354 10987 -7095 -12467 -454 -5516
16313e516K307J09k1325j6202J2893R646M792Q480P353K650Q14M834J751Q59M370
$$ -5516 -3209 -3100 -24425 -40627 -27734 -18088 -13296 -4816 2537 5187 6001 10835 12586 13445 17815
16298A7815k204j0934M049J577j7278J0982N652L700n070k0369j4108J1142P329
$$ 17815 15611 4677 8726 10303 -6975 4007 9659 13359 8289 -12080 -26188 -15046 -7717
16285g717L331Q091m777k2087R948J4731P52j2379J1122K319j0029O90R306n014
$$ -7717 -4386 3705 -1072 -23159 -13211 1520 2272 -10107 1015 3334 -6695 -6005 3301 -1713
16271a713o159j412k007j625j1768J3573K5309K131j0038o147j7037L805J443
$$ -1713 -7872 -9284 -11291 -12916 -24684 -11111 14198 16329 6291 144 -16893 -13088 -11645
16258a1645N894j5254l267J7618J6363j4825M198J5363P297J1874o819O42K310
$$ -11645 -5751 -21005 -24272 -6654 9709 -5116 -918 14445 21742 33616 26797 27439 29749
16245B9749k6803q021M647N965L649l701m071j3945j7854j2290n532o289k328
$$ 29749 2946 -5075 -428 5537 9186 5485 1414 -12531 -30385 -42675 -48207 -54496 -56824
16232e6824O652K225J0534N480J0379J137n249K721J0653J0114j519p724k847
$$ -56824 -50172 -47947 -37413 -31933 -21554 -20417 -25666 -22945 -12292 -2178 -3697 -11421 -14268
16219a4268j1930l498K349k099J3177O931K070j1725j71Q88M68J1137l72L598
$$ -14268 -26198 -29696 -27347 -29446 -16269 -9338 -7268 -18993 -19164 -18276 -17808 -6671 -7043 -3445
16205c445k703Q12p756j2190M03O199Q594m370j4363j0635J6867K2210q214r002
$$ -3445 -6148 -5336 -13092 -25282 -24879 -18680 -10086 -14456 -28819 -39454 -22587 -377 -8591 -17593
16191a7593N356J0516L029o964j3132l54P254K212K385J4673K561k3930p91J0233
$$ -17593 -12237 -1721 1308 -5656 -18788 -19142 -11888 -9676 -7291 7382 9943 -13987 -14778 -4545
16177d545Q108K331N146k3918l716P262n905r447j579K507K477Q330m60j8829
$$ -4545 3563 5894 11040 -12878 -16594 -9332 -15237 -24684 -26263 -23756 -21279 -12949 -13409 -32238
16163c2238J951J2785J763N793P281N89N619j5721l743R341O795j6718k899K4736
$$ -32238 -30287 -17502 -15739 -9946 -2665 -2076 3543 -12178 -15921 -6580 215 -16503 -19402 5334
16149E334j999j9449m684j1141K978Q122J4450M973J994l578L101o148k854N870
$$ 5334 3335 -16114 -20798 -31939 -28961 -20839 -6389 -1416 578 -3000 101 -6047 -8901 -3031
16135c031R341Q161j4135m665j2507p075J6531J9508j097q864J6148p73j9111
$$ -3031 6310 14471 336 -4329 -16836 -23911 -7380 12128 11031 2167 18315 17542 -1569
16122a569P380J0326j0517O818j0256l190J969l05l300J6579M908M71l605m324
$$ -1569 5811 16137 5620 12438 2182 -1008 961 656 -2644 13935 18843 19314 15709 11385
16108A1385n476L50p910o98O836j6406j0363K6341R667l869N255n848P764k313
$$ 11385 5909 6259 -1651 -2349 4487 -11919 -22282 4059 13726 9857 15112 9264 17028 14715
16094A4715j2175j4623p531k2168n406J897R843J4375Q807J4718n891J0692J0820
$$ 14715 2540 -12083 -19614 -41782 -47188 -45291 -35448 -21073 -12266 2452 -3439 7253 18073
16081A8073k4084K291P462J2265k118j7659J5774n384p508j9430p401R139J8935
$$ 18073 -6011 -3720 3742 16007 13889 -3770 12004 6620 -888 -20318 -27719 -18580 355
16068C55L185J0566P629J933j7912k352P568q280O407M975q598q884p381N943
$$ 355 3540 14106 21735 23668 5756 3404 10972 2692 9099 14074 5476 -3408 -10789 -4846
16054d846P552L93o062j3634j587R571j1705o145j3983R311J3060k0325J4170
$$ -4846 2706 3099 -2963 -16597 -18184 -8613 -20318 -26463 -40446 -31135 -18075 -38400 -24230
16041b4230J3183p567J816L138L309Q864j44J1448j790l2607j6048Q804K833K1554
$$ -24230 -11047 -18614 -16798 -13660 -10351 -1487 -1631 9817 8027 -24580 -40628 -31824 -28991 -7437
16027g437Q781p877m058P329R751j522o682j398j2395r614k03p705N959J6245
$$ -7437 1344 -6533 -10591 -3262 6489 4967 -1715 -3113 -15508 -25122 -25325 -33030 -27071 -10826
16013a0826K2480l247K363k1385m507L567J1229J8855J1276n264r024r31j2961
$$ -10826 11654 8407 10770 -10615 -15122 -11555 -326 18529 29805 24541 15517 14586 1625
16000A625N942j2210j2893k937K071O111J6144R685j661l280n08M275j729j343
$$ 1625 7567 -4643 -17536 -20473 -18402 -12291 3853 13538 11877 8597 8089 12364 10635 9292
15986I292K065J2289K362p663o169j4615m406k328J576J5135R426j8908n436j0907
$$ 9292 11357 23646 26008 18345 12176 -2439 -6845 -9173 -7597 7538 16964 -1944 -7380 -18287
15972a8287k42p356N084J720N565J6321N481j1447J895O27J4790N641k424j4582
$$ -18287 -18529 -25885 -20801 -19081 -13516 2805 8286 -3161 -1266 -639 14151 19792 17368 2786
15958B786j2624j1463j1366K1422K6220Q887k2910m275n080j6475j0012j0482
$$ 2786 -9838 -21301 -32667 -11245 14975 23862 952 -3323 -8403 -24878 -34890 -45372
15946d5372m256J3212J2340j963Q862j153m826P30o470j155J6449R130R877j0930
$$ -45372 -49628 -36416 -24076 -26039 -17177 -18330 -23156 -22426 -28896 -30051 -13602 -4472 5405 -5525
15932e525q657P836N981k486K572O455q555L409o867k8796j0707K4464K1584m642
$$ -5525 -14182 -6346 -365 -2851 -279 6176 -2379 1030 -5837 -34633 -45340 -20876 708 -3934
15918c934l153Q763N939o679j391M664j573p956j8317m358J831o00J997P173m010
$$ -3934 -7087 1676 7615 936 -455 4209 2636 -5320 -23637 -27995 -26164 -26764 -24767 -17594 -21604
15903b1604k095L740O468o197L163m157q579n116L819J831Q177K628L112q584
$$ -21604 -23699 -19959 -13491 -19688 -16525 -20682 -29261 -34377 -30558 -28727 -20550 -17922 -14810 -23394
15889b3394m812m242Q993J3036J5506m261j9712j3151J7254L0170J735j2827j0748
$$ -23394 -28206 -32448 -23455 -10419 5087 826 -18886 -32037 -14783 15387 17122 4295 -6453
15876f453j6580K0593Q258j3671N488Q606j0122j1483N426Q679j909M973O644
$$ -6453 -23033 -2440 5818 -7853 -2365 6241 -3881 -15364 -9938 -1259 -3168 1805 8449
15863H449L292l95J2534L800l129j565l501k7636P603K2302m302j3283M158p405
$$ 8449 11741 11346 23880 27680 24551 22986 19485 -8151 -548 21754 17452 4169 8327 922
15849I22j2466J2325O208K980p680o264N55J521J6118J5887K78q418j6000J656
$$ 922 -11544 781 6989 9969 2289 -3975 -3420 -1899 14219 30106 30384 21966 5966 7622
15835G622Q527J520k1638k6208M512J2560j0369j8482l345J3810L540q673j335
$$ 7622 16149 17669 -3969 -30177 -25665 -13105 -23474 -41956 -45301 -31491 -27951 -36624 -37959
15822c7959N921L338K7182J3225n202n751N601J8528K213J0592j1591j2490p481
$$ -37959 -32038 -28700 -1518 11707 6505 754 6355 24883 27096 37688 26097 13607 6126
15809F126k5660k076k19o043k652j518J3701K965N9J1373N517J1519J3926m958
$$ 6126 -19534 -21610 -21829 -27872 -30524 -32042 -18341 -15376 -15317 -3944 1573 13092 27018 22060
15795B2060q375j5480k6780K916J65J1674J2287J8647O903j1112j3211Q161j3875
$$ 22060 13685 -1795 -28575 -25659 -25494 -13820 -1533 17114 24017 12905 -306 7855 -6020
15782f020j6335O891R624r139K0130J0832O082l294p596P590j1602k2930j4539
$$ -6020 -22355 -15464 -5840 -14979 5151 15983 22065 18771 11175 18765 7163 -15767 -30306
15769c0306J2516q054M617K2337K1849Q60l1625j7836l200N542J1063K1937M597
$$ -30306 -17790 -25844 -21227 1110 22959 23819 -7806 -25642 -28842 -23300 -12237 9700 14297
15756A4297J2613O798k1426P417J3294p048k3731m356k439J747o596l344K1237
$$ 14297 26910 33708 12282 19699 32993 25945 2214 -2142 -4581 -2834 -9430 -12774 8463
15743H463L395n484q370O516J9045Q526j6481m230j0277n159J488p315j6358k0076
$$ 8463 11858 6374 -1996 4520 23565 32091 15610 11380 1103 -4056 -2568 -9883 -26241 -46317
15729d6317o973N314M581K409K2372Q782m477N36O712k663l0420j5772N756Q025
$$ -46317 -53290 -47976 -43395 -40986 -18614 -9832 -14309 -13773 -7061 -9724 -40144 -55916 -50160 -42135
15715d2135j154K2591K2858o9J226j6557P073l331j6200o540K4109J1112j1628
$$ -42135 -43289 -20698 2160 2091 3317 -13240 -6167 -9498 -25698 -32238 -8129 2983 -8645
15702h645k519M971J1982K596K420o35L073m454Q403l147M490p992L27L309k0431
$$ -8645 -11164 -6193 5789 8385 10805 10170 13243 8789 17192 14045 18535 10543 10870 14179 -6252
15687f252j4484k172O040M204J4985J1469r355k1276R419j498l62R538k7501R976
$$ -6252 -20736 -22908 -16868 -12664 2321 13790 4435 -16841 -7422 -8920 -9282 256 -27245 -17269
15673a7269R528k207J0313K480Q693j497j6244m823J1111L912k235k942j5521
$$ -17269 -7741 -9948 365 2845 11538 10041 -6203 -11026 85 3997 1762 -1180 -16701
15660a6701J392n764J3111K199O639R989j2392j6418L623J21O726K744k915P16
$$ -16701 -15309 -21073 -7962 -5763 876 10865 -1527 -17945 -14322 -14201 -7475 -4731 -7646 -6930
15646f930R268M560L784J520j916l678n919J3054j3756k57J3977Q261K377n927
$$ -6930 2338 6898 10682 12202 10286 6608 689 13743 -13 -270 13707 21968 24345 18418
15632A8418j1149m770p829M241N06j7435P136J7519J8350N197o341j148j1587
$$ 18418 7269 2499 -5330 -1089 -583 -18018 -10882 6637 24987 30184 23843 22695 11108
15619A1108p069N829o70k729P551N587l656J3635J1239N496m509k3003l1796P73
$$ 11108 4039 9868 9198 6469 14020 19607 15951 29586 40825 46321 41812 18809 -12987 -12214
15605a2214J580k318L245P694m189K3324J2329j3916j5847o388M959M709J2406
$$ -12214 -10634 -12952 -9707 -2013 -6202 17122 29451 15535 -312 -6700 -1741 2968 15374
15592A5374l632o390j6772j0259k940R863J1257l98k4479Q25K572p434M992Q218
$$ 15374 11742 5352 -11420 -21679 -24619 -14756 -3499 -3897 -28376 -27551 -24979 -32413 -27421 -19203
15578a9203R58P452J2255j206n367j267l246k923r421p31q896L942L294j732J8260
$$ -19203 -18245 -10793 1462 256 -5111 -6378 -9624 -12547 -21968 -22699 -31595 -27653 -24359 -26091 -7831
15563g831R770J8834l612r435P317Q949K728p204k1779k7012J0276K3560l832
$$ -7831 1939 20773 17161 7726 15043 23992 26720 19516 -2263 -29275 -18999 4561 729
15550G29M476j5636l749P589N325n632j2973O1n351k3296L075P916L4836K2252
$$ 729 5205 -10431 -14180 -6591 -1266 -6898 -19871 -19810 -25161 -48457 -45382 -37466 -2630 19622
15536A9622K794j1588q301K758k104K352J1708Q141O682k1408j3599k169o169
$$ 19622 22416 10828 2527 5285 3181 5533 17241 25382 32064 10656 -2943 -5112 -11281
15523a1281Q065o403K8211K5751o662k0144K420m860j6779k9707r91K4296J7877
$$ -11281 -3216 -9619 18592 44343 37681 17537 19957 15097 -1682 -31389 -32380 -8084 9793
15510I793Q173J678O881j953j6377k582L675l836P578J0349J1582j5690L78m240
$$ 9793 17966 19644 26525 24572 8195 5613 9288 5452 13030 23379 34961 19271 19649 15409
15496A5409j8517q852M274P039q533l844J1652j8535m003R963N983R78L043m890
$$ 15409 -3108 -11960 -7686 -647 -9180 -13024 -1372 -19907 -23910 -13947 -7964 -6986 -3943 -8833
15482h833Q63J1480n392K229Q937j0243l1838O275L4086J7710k134q767n242j6450
$$ -8833 -7970 3510 -1882 347 9284 -959 -32797 -26522 7564 25274 23140 14373 9131 -7319
15468g319j2104N445L244o263M586l942Q557R900k6551p07J4770J2408Q935J2197
$$ -7319 -19423 -13978 -10734 -16997 -12411 -16353 -7796 2104 -24447 -25154 -10384 2024 10959 23156
15454B3156J1130k4331k7900L883K1983j1671R048k836L029J0016J8084p941j4777
$$ 23156 34286 9955 -17945 -14062 7921 -3750 5298 2462 5491 15507 33591 25650 10873
15441A0873J403n180n44m169j2846j0498J4475L41P907J2774o291l933j2431P60
$$ 10873 12276 7096 6552 2383 -10463 -20961 -6486 -6145 1762 14536 8245 4312 -8119 -7359
15427g359R862J016O140J8582N639R08n201L965Q358j1075N217k5077M315Q212
$$ -7359 2503 3519 9659 28241 33880 34788 29587 33552 41910 30835 36052 10975 15290 23502
15413B3502r245k790j604O060o458P483J1539p836j5322k673L003q621J2555L281
$$ 23502 14257 11467 9863 15923 9465 16948 28487 20651 5329 2656 5659 -2962 9593 12874
15399A2874j3438j3513P452J0443j1665j0534j2414K5191K9694k913j0013k3979
$$ 12874 -564 -14077 -6625 3818 -7847 -18381 -30795 -5604 24090 21177 11164 -12815
15387a2815l048N571J2061L232J34j5843R170J3530M644K566k972m388j868Q003
$$ -12815 -15863 -10292 1769 5001 5135 -10708 -1538 11992 16636 19202 16230 11842 9974 17977
15373A7977j3068p223J486O07j110j6503J1451L577r716J244j093P227J9974M162
$$ 17977 4909 -2314 -828 -221 -1331 -17834 -6383 -2806 -12522 -11278 -12371 -5144 14830 18992
15359A8992J1543j159j3891k3319j6794k139N459j0743m145K0694K1582L135j0858
$$ 18992 30535 29376 15485 -7834 -24628 -26767 -21308 -32051 -36196 -15502 6080 9215 -1643
15346a643m178j0346P256O086j462Q404O67L793J3513L323j6539p803n412L119
$$ -1643 -5821 -16167 -8911 -2825 -4287 4117 4784 8577 22090 25413 8874 1071 -4341 -1222
15332a222K1089M430m551m980r055r189k772O435J9420J0046j043j7165M551R198
$$ -1222 19867 24297 19746 14766 5711 -3478 -6250 185 19605 29651 28608 11443 15994 25192
15318B5192m463j7915M02J728r321J4395o617j3502j6558O107N133j0088r148
$$ 25192 20729 2814 3216 4944 -4377 10018 3401 -10101 -26659 -20552 -15419 -25507 -34655
15305c4655K0182Q694n813J789j198O014l683j1950j587J9570J0948P131j1559
$$ -34655 -14473 -5779 -11592 -9803 -11001 -4987 -8670 -20620 -22207 -2637 8311 15442 3883
15292C883q961m793Q011J6607n225n758m97P151l927Q063r842p821O011j2221
$$ 3883 -5078 -9871 -1860 14747 9522 3764 3267 10418 6491 14554 4712 -3109 2902 -9319
15278i319p62j145J9047J4104J252n307p100K3125M862j0123j3470R49J3049q151
$$ -9319 -10081 -11226 7821 21925 23177 17870 10770 33895 38757 28634 15164 16113 29162 21011
15264B1011j6026n290J1743P457j372j9203q982o580P033J9081N081m100M58j1394
$$ 21011 4985 -305 11438 18895 17523 -1680 -10662 -17242 -10209 8872 13953 9853 10311 -1083
15250a083j242P051K0975N106J035k2393K428l018j4482n16M145M474J8488O987
$$ -1083 -2325 4726 25701 30807 31842 9449 11877 8859 -5623 -6139 -1994 2480 20968 27955
15236B7955r001j1604R113K260p155p584q573q997p400M117L402L751J0419Q210
$$ 27955 18954 7350 16463 18723 11568 3984 -4589 -13586 -20986 -16869 -13467 -9716 703 8913
15222H913n952p761j4227J2723M508o432q355o863p597P837n300k692O252K4106
$$ 8913 2961 -4800 -19027 -6304 -1796 -8228 -16583 -23446 -31043 -23206 -28506 -31198 -24946 -840
15208h40k422j6709j981n08p013K3458K1435M993j9716j9923j7247O430J2426
$$ -840 -3262 -19971 -21952 -22460 -29473 -6015 15420 20413 697 -19226 -36473 -30043 -17617
15195a7617J2671N762m938j5244O644J0768p020j2344o60O529J9843l212k0307
$$ -17617 -4946 816 -4122 -19366 -12722 -1954 -8974 -21318 -21978 -15449 4394 1182 -19125
15182a9125j1523j101K267j0366r07M004R966J2596O138j670Q091J0542j289j3206
$$ -19125 -30648 -31749 -29482 -39848 -40755 -36751 -26785 -14189 -8051 -9721 -1630 8912 7623 -5583
15168e583k15K841p808l308J5302k626j3150l325N28M07m966K533R765J398l321
$$ -5583 -5798 -2957 -10765 -14073 1229 -1397 -14547 -17872 -17344 -16937 -21903 -19370 -9605 -8207 -11528
15153a1528K284n619J1782L860J016k8660j1681O291J6876P089L257R037N852
$$ -11528 -9244 -14863 -3081 779 1795 -26865 -38546 -32255 -15379 -8290 -5033 4004 9856
15140I856r539j4109r316q395J4275L3108Q928m556k0895j0214P366N221J5202
$$ 9856 317 -13792 -23108 -31503 -17228 15880 24808 20252 -643 -10857 -3491 1730 16932
15127A6932k188j079o873p367p702Q958J2949J2781N361q119Q85n089K967j2013
$$ 16932 14744 13665 6792 -575 -8277 681 13630 26411 31772 23653 24538 19449 22416 10403
15113A0403j9215j6434K269k299O475J1458J2905o161L141K122j7194M093o500
$$ 10403 -8812 -25246 -22977 -25276 -18801 -7343 5562 -599 2542 4664 -12530 -8437 -14937
15100a4937Q751J3585M626L380p271j682j1918J211l413J7819R664n114m2p09
$$ -14937 -6186 7399 12025 15405 8134 6452 -5466 -4255 -7668 10151 19815 14701 14659 13950
15086A3950q53j0509m576Q318L673j6544j241k317k0015Q108q362k1737p771M080
$$ 13950 13097 2588 -1988 6330 10003 -6541 -7782 -10099 -30114 -22006 -30368 -52105 -59876 -55796
15072e5796K7419K6788q264O266j1927k2070J7677J1156J2408k45L787O203N60
$$ -55796 -28377 -1589 -9853 -3587 -15514 -37584 -19907 -8751 3657 3412 7199 13402 13962
15059A3962k873o928q354n882j1653o454r900n349N188n088P4O967m492N381L466
$$ 13962 11089 4161 -4193 -10075 -21728 -28182 -38082 -43431 -38243 -43331 -43257 -36290 -40782 -35401 -31935
15044c1935L2764J0722o953L857j4655p767L407K896l268K2161J0965k274n470
$$ -31935 829 11551 4598 8455 -6200 -13967 -10560 -7664 -10932 11229 22194 19920 14450
15031A4450p3l659N857j0715n816l371n044R475n450r442j289n536q108M426J3089
$$ 14450 14377 10718 16575 5860 44 -3327 -8371 1104 -4346 -13788 -15077 -20613 -28721 -24295 -11206
15016a1206N877Q670m000q145j6769n093K5981P964k983K109K9272J5519o066
$$ -11206 -5329 3341 -659 -8804 -25573 -30666 -4685 3279 296 2405 31677 47196 41130
15003D1130p383j3324J0254J3347L0536L1703J9944Q688L9973J06967N4706j1465
$$ 41130 33747 20423 30677 44024 74560 106263 126207 134895 174868 281835 336541 325076
14991C25076r004k340Q722P664n5098q5589n3484l8144k6110k3374k5757o351
$$ 325076 316072 313732 322454 330118 275020 189431 135947 97803 71693 48319 22562 16211
14979A6211m897J3600P225m940o155P418N229l124j1003j1874N632J4823r572
$$ 16211 11314 24914 32139 27199 21044 28462 33691 30567 19564 7690 13322 28145 18573
14966A8573p377P383q757J783L426M500j5867j1619Q10J1062l893j6082P092m422
$$ 18573 11196 18579 9822 11605 15031 19531 3664 -7955 -7145 3917 24 -16058 -8966 -13388
14952a3388j0705q194L933J5409K2951J2780l933j174J15l726k3273R922n541
$$ -13388 -24093 -32287 -28354 -12945 10006 22786 18853 17679 17794 14068 -9205 717 -4824
14939d824j3097n107K599J415P081J1850k2220j5924O485K6252J0574j2782L876
$$ -4824 -17921 -23028 -20429 -19014 -11933 -83 -22303 -38227 -31742 -5490 5084 -7698 -3822
14926c822L316j1473p746J6487J80N975M890l587n294j0876M945N398Q487K851
$$ -3822 -506 -11979 -19725 -3238 -3058 2917 7807 4220 -1074 -11950 -7005 -1607 6880 9731
14912I731j141m040k771K408K377r180K629q639k0527p491J1751J0042j013M74
$$ 9731 8590 4550 1779 4187 6564 -2616 13 -8626 -29153 -36644 -24893 -14851 -15864 -15390
14898a5390J0613R328J7510M797j8548k1201k2182m007J3016j515M404n010k057
$$ -15390 -4777 4551 22061 26858 8310 -12891 -35073 -39080 -26064 -27579 -23175 -28185 -30242
14885c0242Q486R511N688q325q0J7938l254j6238l863K87M413K926K569K157m420
$$ -30242 -21756 -12245 -6557 -14882 -14962 2976 -278 -16516 -20379 -20092 -15679 -12753 -10184 -8027 -12447
14870a2447k168N840J0059o073M805K373L932R504J1112q960j9167m217J0127
$$ -12447 -14615 -8775 1284 -4789 16 2389 6321 15825 26937 17977 -1190 -5407 4720
14857D720J5144k292K257r803j1363r389j4288N493J1649J2207j4863j5460N029
$$ 4720 19864 17572 19829 10026 -1337 -10726 -25014 -19521 -7872 4335 -10528 -25988 -20959
14844b0959K877J2780J1690Q522K643n093j1978j5453Q850L109l416J5138K914
$$ -20959 -18082 -5302 6388 14910 17553 12460 482 -14971 -6121 -3012 -6428 8710 11624
14831A1624j4276m266M609L210j3525j4432l563K228J1241j1127j170K633J7191
$$ 11624 -2652 -6918 -2309 901 -12624 -27056 -30619 -28391 -17150 -28277 -29447 -26814 -9623
14818i623L814j5375o884J5322K7366O624k4729j2389K214P902K642R051P903
$$ -9623 -5809 -21184 -28068 -12746 14620 21244 -3485 -15874 -13660 -5758 -3116 5935 13838
14805A3838j4867l459l733n162l164n23N392M295j5683J646J7509n026r62J2099
$$ 13838 -1029 -4488 -8221 -13383 -16547 -17070 -11678 -7383 -23066 -21420 -3911 -8937 -9899 2200
14791B200K939j588L539P844j146J4014L325q636j0781r434L184J8730M073j9313
$$ 2200 5139 3551 7090 14934 13788 27802 31127 22491 11710 2276 5460 24190 28263 8950
14777H950l2536n981Q259j792R693o906o352J2399j153K359R381R073k776j2435
$$ 8950 -23586 -29567 -21308 -23100 -13407 -20313 -26665 -14266 -15419 -13060 -3679 5394 2618 -9817
14763i817n957J0515N219J8261L739j3570j266k1L550j181j1304j4826n702k31
$$ -9817 -15774 -5259 -40 18221 21960 8390 7124 7103 10653 9472 -1832 -16658 -22360 -22591
14749b2591L290R979L904k9710l807n32N919J1486M573N284M570j7475J260L005
$$ -22591 -19301 -9322 -5418 -35128 -38935 -39467 -33548 -22062 -17489 -12205 -7635 -25110 -23850 -20845
14735b0845K757m339j980J2157L3033J0066q744K454j0513m373k706O453j2493
$$ -20845 -18088 -22427 -24407 -12250 20783 30849 22105 24559 14046 9673 6967 13420 927
14722I27q859l780K0637j0251j0336R257K85n836Q522J2269j6333j1972N359M638
$$ 927 -7932 -11712 8925 -1326 -11662 -2405 -2120 -7956 566 12835 -3498 -15470 -10111 -5473
14708e473k637k797K0665P682o968l206o074K588J8570r237j6682Q05J0035J590
$$ -5473 -8110 -10907 9758 17440 10472 7266 1192 3780 22350 13113 -3569 -2764 7271 8861
14694H861l127m381P519J5767r592J48k0517j1586K6091K261n182j9836k046K152
$$ 8861 5734 1353 8872 24639 15047 15195 -5322 -16908 9183 11444 6262 -13574 -15620 -13468
14680a3468m265J1498O770K968N91J420O199j7233L408m826j4835K585N00J238
$$ -13468 -17733 -6235 535 3503 4094 5514 11713 -5520 -2112 -6938 -21773 -19188 -18688 -17450
14666a7450j802N41p307J2370m342Q217k62J99R447k046k227q201J4001O481L772
$$ -17450 -19252 -18711 -26018 -13648 -17990 -9773 -10035 -9836 -389 -2435 -4662 -12863 1138 7619 11391
14651A1391m51p663r623j5738r77J7042K1687j591j203K664j1500n248j0210m19
$$ 11391 10940 3277 -6346 -22084 -23061 -6019 15668 14077 12874 15538 4038 -1210 -11420 -11839
14637a1839J5504J3813P704J0206q50m488j2458k7689j6887j4150J4457K0581
$$ -11839 3665 17478 25182 35388 34538 30050 17592 -10097 -26984 -41134 -26677 -6096
14625f096R511j2900J148K0575J3799j0893J1287J435j8084R73j6903j619N617
$$ -6096 3415 -9485 -8337 12238 26037 15144 26431 27866 9782 10755 -6148 -7767 -2150
14612b150n867n679J0954J4228k5961k650K0719N609j0980j7676J21J3887q179
$$ -2150 -8017 -13696 -2742 11486 -14475 -17125 3594 9203 -1777 -19453 -19332 -5445 -13624
14599a3624j2716l035J340l551j6959K5939K7154K402M296p923l971n228Q330
$$ -13624 -26340 -29375 -28035 -31586 -48545 -22606 4548 6950 11246 3323 -648 -5876 2454
14586B454J0085q404M1j3309j8715J1324L569l220J1533J519l58J072j6949l513
$$ 2454 12539 4135 4176 -9133 -27848 -16524 -12955 -16175 -4642 -3123 -3481 -2409 -19358 -22871
14572b2871K1057R028Q591j99l169L537j443o284k44Q703M72r957P231J437j7958
$$ -22871 -1814 7214 15805 15606 12437 15974 14531 8247 8003 16706 17178 7221 14452 15889 -2069
14557b069j1146l787P151r495l635R212J816R802l830n035k060j6448J0998J6329
$$ -2069 -13215 -17002 -9851 -19346 -22981 -13769 -11953 -2151 -5981 -11016 -13076 -29524 -18526 -2197
14543b197l029r162m873l14J2454j6328M447J4352J8394l379N774q690l119K192
$$ -2197 -5226 -14388 -19261 -19575 -7121 -23449 -19002 -4650 13744 10365 16139 7449 4330 6522
14529F522j3564j1396j6995J0167M240P348J9148l623k1711j676J8055L593N057
$$ 6522 -7042 -18438 -35433 -25266 -21026 -13678 5470 1847 -19864 -21540 -3485 108 5165
14516E165k0622o343J0931J000J5183j258o784o69K817j7407J654J6929k259O085
$$ 5165 -15457 -21800 -10869 -9869 5314 4056 -2728 -3397 -580 -17987 -16333 596 -1663 4422
14502D422R926q883j2070J1719O682M440o530o225P065n911r200j470K450m370
$$ 4422 14348 5465 -6605 5114 11796 16236 9706 3481 10546 4635 -4565 -6035 -3585 -7955
14488g955j967R901M472q5O380L012J3934p028K433J6808m272m373o274j301j6285
$$ -7955 -9922 -21 4451 4366 10746 13758 27692 20664 23097 39905 35633 31260 24986 23685 7400
14473G400r044m70j798K199q863k7110j0994J5854J6067J1019K268K498n659J3386
$$ 7400 -1644 -2114 -3912 -1713 -10576 -37686 -48680 -32826 -16759 -5740 -3472 -974 -6633 6753
14459F753J3442L680J119j5634l844j1938o504j1220m872M672J3840L533J5004
$$ 6753 20195 23875 24994 9360 5516 -6422 -12926 -24146 -29018 -24346 -10506 -6973 8031
14446H031J7688J1594q91M19l28j4678j3190l366O291J5436J0803j4327p985j1936
$$ 8031 25719 37313 36422 36841 36513 21835 8645 5279 11570 27006 37809 23482 15497 3561
14432C561R788m373P241J7620j639k1809o457P333J9757n194r289j6501j0960
$$ 3561 13349 8976 16217 33837 32198 10389 3932 11265 31022 25828 16539 38 -10922
14419a0922j2434j4000Q905J5087K9111J6107j3479j6169o474L600o14L433j1322
$$ -10922 -23356 -37356 -28451 -13364 15747 31854 18375 2206 -4268 -668 -1282 2151 -9171
14406i171M80Q197q371k74K2317r012R966J4630R62o843Q121k1169k6819O212
$$ -9171 -8691 -494 -8865 -9139 13178 4166 14132 28762 29724 22881 31002 9833 -16986 -10774
14392a0774J0873J3050j3010n313K706R289M849J0027J1839q154q512Q175r393
$$ -10774 99 13149 139 -5174 -2468 6821 11670 21697 33536 25382 16870 25045 15652
14379A5652j5097l05j4298J0812K4533J0315j2369j5834o323j1721P029J5140
$$ 15652 555 250 -14048 -3236 21297 31612 19243 3409 -2914 -14635 -7606 7534
14367G534L455k2411q624j1851J175Q471N336K0774J3278l197j4876P051K856
$$ 7534 10989 -11422 -20046 -31897 -30722 -22251 -16915 3859 17137 13940 -936 6115 8971
14354H971q237P915J0996o687n926j3429j0800k639L3J846Q628j252N589m924
$$ 8971 734 8649 19645 12958 7032 -6397 -17197 -19836 -19803 -17957 -9329 -10581 -4992 -9916
14340i916M514K637l377m855p23q265j0963p092m666Q391Q092J3352m713o132
$$ -9916 -5402 -2765 -6142 -10997 -11720 -19985 -30948 -38040 -42706 -34315 -26223 -12871 -17584 -23716
14326b3716J2505J7842J2426k368j499p28q821N622k688r85N123j0028J1406O227
$$ -23716 -11211 6631 19057 16689 15190 14462 5641 11263 8575 7590 12713 2685 14091 20318
14312B0318p974l953l03j847M669R971R536n139j9849j5196o639O872K609L569
$$ 20318 12344 8391 8088 6241 10910 20881 30417 25278 5429 -9767 -16406 -9534 -6925 -3356
14298c356Q197J6408j4694k4825j872J985L969O949j8274k5175J0574K0454q102
$$ -3356 4841 21249 6555 -18270 -20142 -18157 -14188 -7239 -25513 -50688 -40114 -19660 -27762
14285b7762l299k721J8460J5937L440j7226j2181L783q026K500J5899M022J3026
$$ -27762 -31061 -33782 -15322 615 4055 -13171 -25352 -21569 -29595 -27095 -11196 -7174 5852
14272E852J144N072P575k0974p294l70L750J0567O716p007j5962m837K665l34
$$ 5852 6996 12068 19643 -1331 -8625 -8995 -5245 5322 12038 5031 -10931 -15768 -13103 -13437
14258a3437J1637j79k841J8843J2342j4813j446j4908j9788m932M346p29k303
$$ -13437 -1800 -1979 -4820 14023 26365 11552 10106 -4802 -24590 -29522 -25176 -25905 -28208
14245b8208J1635J2530J3785j9667j8801M831Q94P124J248Q227m483j4798l308
$$ -28208 -16573 -4043 9742 -9925 -28726 -23895 -23001 -15877 -14629 -6402 -10885 -25683 -28991
14232b8991J5821L177k116N354J2286L594k826j224K946J653N064K869j3317j6201
$$ -28991 -13170 -9993 -12109 -6755 5531 9125 6299 5075 8021 9674 14738 17607 4290 -11911
14218a1911J549k566R708J6068N385j660K075o300l468o961J2642P482j7317j8483
$$ -11911 -10362 -12928 -3220 12848 18233 16573 18648 12348 8880 1919 14561 22043 4726 -13757
14204a3757J68L319o635r200L337l822O962J391L099j6427P917J6539l663K639
$$ -13757 -13589 -10270 -16905 -26105 -22768 -26590 -19628 -18237 -15138 -31565 -23648 -7109 -10772 -8133
14190h133j1250O751m710k373P075J0351N539j4729M985K182P0J3002J665P287
$$ -8133 -19383 -12632 -17342 -19715 -12640 -2289 3250 -11479 -6494 -4312 -4242 8760 10425 17712
14176A7712J380k0290K235M479j2974o534L415n385j1799M779J2535j9955k159
$$ 17712 19092 -1198 1037 5516 -7458 -13992 -10577 -15962 -27761 -22982 -10447 -30402 -32561
14163c2561J1139o004p293J4927P009J1097J2903k379J10l141k0010J190J1850
$$ -32561 -21422 -27426 -34719 -19792 -12783 -1686 11217 8838 8948 5807 -14203 -13013 -1163
14150a163P325N923J2628O121l253Q39k702q453k0385j6059j2074M511M166N945
$$ -1163 6162 12085 24713 30834 27581 28420 25718 17265 -3120 -19179 -31253 -26742 -22576 -16631
14136a6631J1750n586L84L005l084O596j2700J7559K497j2024k440K520l314J0224
$$ -16631 -4881 -10467 -10083 -7078 -10162 -3566 -16266 1293 3790 -8234 -10674 -8154 -11468 -1244
14122a244j1379J771L348O373r478j2573Q296j934k962q694R159m238N891J1509
$$ -1244 -12623 -10852 -7504 -1131 -10609 -23182 -14886 -16820 -19782 -28476 -19317 -23555 -17664 -6155
14108f155n438k127Q320O145J2728O11j3843j9572r667P907l076J250n558k719
$$ -6155 -11593 -13720 -5400 745 13473 14084 241 -19331 -28998 -21091 -24167 -22917 -28475 -31194
14094c1194N294J4019L579J6983j6343J076M656N38M860N890K804o626N476L1326
$$ -31194 -25900 -11881 -8302 8681 -7662 -6586 -1930 -1392 3468 9358 12162 5536 11012 42338
14080D2338k9796j4738p571k0175J5394J6431R308J2848m141j7944j4560p632
$$ 42338 12542 -2196 -9767 -29942 -14548 1883 11191 24039 19898 1954 -12606 -20238
14068b0238J533n951q56o627P517Q355P845Q647J2615q818m883q880k360m848
$$ -20238 -18705 -24656 -25512 -32139 -24622 -16267 -8422 225 12840 4022 -861 -9741 -12101 -16949
14054a6949o699N920l225K898R332J3957p868k3250m39J2386J0597N298l892o571
$$ -16949 -23648 -17728 -20953 -18055 -8723 5234 -2634 -25884 -26323 -13937 -3340 1958 -1934 -8505
14040h505q497J1185J2696J6r463j0250L465J5801N855j6819j8500Q805J114R967
$$ -8505 -17002 -5817 6879 6895 -2568 -12818 -9353 6448 12303 -4516 -23016 -14211 -13097 -3130
14026c130J6623m27j5108l003j0493R978O240j7547r984K722K1844q388p475J1107
$$ -3130 13493 13066 -2042 -5045 -15538 -5560 680 -16867 -26851 -24129 -2285 -10673 -18148 -7041
14012g041P764l85n387r612L528K2485j5854l7055k725j061R077K0916P264l011
$$ -7041 723 338 -5049 -14661 -11133 11352 -4502 -41557 -44282 -45343 -36266 -15350 -8086 -11097
13998a1097q564n108J8598j6367p438J1437K677J1814L138j1470L592o659L264
$$ -11097 -19661 -24769 -6171 -22538 -29976 -18539 -15862 -4048 -910 -12380 -8788 -15447 -12183
13985a2183J1975R048J2917p037j093j2038n665o19J2343q995J0766j4479m691
$$ -12183 -208 8840 21757 14720 13627 1589 -4076 -4695 7648 -1347 9419 -5060 -9751
13972i751O869P458J1521o243M844l642M885k769j485J8579Q300k2041j5827l949
$$ -9751 -2882 4576 16097 9854 14698 11056 15941 13172 11687 30266 38566 16525 698 -3251
13958c251M522J9501J935k860o656n148m030q797j2412o761l951K0274L02J626
$$ -3251 1271 20772 22707 19847 13191 8043 4013 -4784 -17196 -23957 -27908 -7634 -7332 -5706
13944e706J5839N764m452j2697j1648j998N343J9564r276m537m213J7429R576
$$ -5706 10133 15897 11445 -1252 -12900 -14898 -9555 10009 733 -3804 -8017 9412 18988
13931A8988Q199j2088m843N434j719j2321p246r093J8669J9613j7094q538J0846
$$ 18988 27187 15099 10256 15690 13971 1650 -5596 -14689 3980 23593 6499 -2039 8807
13918H807K297j2682r385K445j8805j5163K1404R273J0978J6107J230q847n417
$$ 8807 11104 -1578 -10963 -8518 -27323 -42486 -21082 -11809 -831 15276 16506 7659 2242
13905B242j2106M30J9228m574j8326o071O440Q935J6429O380n251M729j1444o891
$$ 2242 -9864 -9434 9794 5220 -13106 -19177 -12737 -3802 12627 19007 13756 18485 7041 150
13891A50j1765O049L324q176l786R013P840j3453j8556p177O208J902Q343R728
$$ 150 -11615 -5566 -2242 -10418 -14204 -5191 2649 -10804 -29360 -36537 -30329 -28427 -20084 -10356
13877a0356j0690k848M591Q011p484P526J8179J442l141k4012m61N207n24j274
$$ -10356 -21046 -23894 -19303 -11292 -18776 -11250 6929 8371 5230 -18782 -19243 -14036 -14560 -15834
13863a5834j298q47J767J868j835O500J8092p319R934J1903p129J805J2325P421
$$ -15834 -17132 -17979 -16212 -14344 -16179 -9679 8413 1094 11028 22931 15802 17607 29932 37353
13849C7353k0847q382j4473j6302o200R237K2450J6803N546p162p334j6540j3067
$$ 37353 16506 8124 -6349 -22651 -28851 -19614 2836 19639 25185 18023 10689 -5851 -18918
13836a8918R083R02q797j3475r648J8899N684k0147l2R060Q428L2175j575l4873
$$ -18918 -9835 -8933 -17730 -31205 -40853 -21954 -16270 -36417 -36449 -27389 -18961 13214 11639 -23234
13822b3234k7795J0512J2826J5478J46p903j0770l749O10J1126L785J9195J9078
$$ -23234 -51029 -40517 -27691 -12213 -12067 -19970 -30740 -34489 -33879 -22753 -18968 227 19305
13809A9305k5543j4742n205J3527R087l265K03j500n872r252O27J62K166l586
$$ 19305 -6238 -20980 -26185 -12658 -3571 -6836 -6633 -8133 -14005 -23257 -22630 -22468 -20302 -23888
13795b3888l079J4257o800J390J0719n01O594R889J0297m090L691J2094n791r11
$$ -23888 -26967 -12710 -19510 -18120 -7401 -7902 -1308 8581 18878 14788 18479 30573 24782 23871
13781B3871m788r017J783n811M990j5001r560m835P361r65M55n929J8476p008
$$ 23871 19083 10066 11849 6038 11028 -3973 -13533 -18368 -11007 -11972 -11517 -17446 1030 -5978
13767e978j3268M121J9947K749O86O013j9004k9509k610J3919J2040J1458J889
$$ -5978 -19246 -15125 4822 7571 8257 14270 -4734 -34243 -36853 -22934 -10894 564 2453
13754B453j7477j3660J2627J1463P95k393j513j1985J6772J7560K740j1127o613
$$ 2453 -15024 -28684 -16057 -4594 -3799 -6192 -7705 -19690 -2918 14642 17382 6255 -358
13741c58p849K232P85K970r121j4190R89N560P965M422J5864M378K6871o155j3238
$$ -358 -8207 -5975 -5190 -2220 -11341 -25531 -24542 -18982 -11017 -6595 9269 13647 40518 34363 21125
13726B1125j0860Q694N427j1918L584L736k4961m383J6499R171P570m378J5642
$$ 21125 10265 18959 24386 12468 16052 19788 -5173 -9556 6943 16114 23684 19306 34948
13713C4948p497K938O480o633P4j2607N265K803N760M179J81O217k4651j1637
$$ 34948 27451 30389 36869 30236 30310 17703 22968 25771 31531 35710 35891 42108 17457 5820
13699E820j73n221R639j792o506p37O849n691J5513p002j1138j6074M512l814
$$ 5820 5647 426 10065 8273 1767 1030 7879 2188 17701 10699 -439 -16513 -12001 -15815
13685a5815K65J5245p772o071j2077k3226O02l883J2263J7587K211q292K640P915
$$ -15815 -15550 -305 -8077 -14148 -26225 -49451 -48849 -52732 -40469 -22882 -20671 -28963 -26323 -18408
13671a8408N883J8253m806j4711J4028l167n671j4172J775j956K540M683J8027
$$ -18408 -12525 5728 922 -13789 239 -2928 -8599 -22771 -20996 -22952 -20412 -15729 2298
13658B298R632J5724J002J365P048l498j2985k1739J4293N843o968q458J0718
$$ 2298 11930 27654 28656 30021 37069 33571 20586 -1153 13140 18983 12015 3557 14275
13645A4275O899N335n84j1516r321J480r468J4973J9563j9284q800m351J4609
$$ 14275 21174 26509 25925 14409 5088 6568 -2900 12073 31636 12352 3552 -799 13810
13632A3810l692r282J2267R591P490J4242j1039r972n266n30j464l052n858O199
$$ 13810 10118 836 13103 22694 30184 44426 33387 23415 18149 17619 16155 13103 7245 13444
13618A3444J2469j675K998O253r331j4265J9042R792K1625J4197Q859j7655r791
$$ 13444 25913 24238 27236 33489 24158 9893 28935 38727 60352 74549 83408 65753 55962
13605E5962j6501n219r86j2731o712l901j8093K605J8471k3205M560n390J9441
$$ 55962 39461 34242 33256 20525 13813 9912 -8181 -5576 12895 -10310 -5750 -11140 8301
13592H301N213N281O568j4345j0394k980n239J6012J3705k60j0925J579L860J721
$$ 8301 13514 18795 25363 11018 624 -2356 -7595 8417 22122 21862 10937 12516 16376 18097
13578A8097N505q377j3828m138l1p28l310M063l22p863J494K2035P768K898L699
$$ 18097 23602 15225 1397 -2741 -2772 -3500 -6810 -2747 -3069 -10932 -9438 12597 20365 23263 26962
13563B6962j080J416o444j0167J2285p748l1544j3281J1801Q256j0914K291r57
$$ 26962 25882 27298 20854 10687 22972 15224 -16320 -29601 -17800 -9544 -20458 -18167 -19124
13550a9124J888j5104J8251K3999j9270o469J0876J2920J1143k210o266l003q969
$$ -19124 -17236 -32340 -14089 9910 -9360 -15829 -4953 7967 19110 16900 10634 7631 -1338
13537a338o16J0877q31R62o67j6717l610L45n49K536k2027O19J4403J2330J9369
$$ -1338 -1954 8923 8092 9054 8387 -8330 -11940 -11595 -12144 -9608 -31635 -31016 -16613 -4283 15086
13522A5086j3855p079j618l051M868m021O680J4163M736n811n883q93j136j3142
$$ 15086 1231 -5848 -7466 -10517 -5649 -9670 -2990 11173 15909 10098 4215 3322 2186 -10956
13508a0956m160J2409k318O694O059R919O932j978k867K004p55o524k3307p151
$$ -10956 -15116 -2707 -5025 1669 7728 17647 24579 22601 19734 21738 20983 14459 -8848 -15999
13494a5999j333K665N813J5104j2126r794j5459r089L399K2379K7117j0308k4218
$$ -15999 -17332 -14667 -8854 6250 -5876 -15670 -31129 -40218 -36819 -14440 12677 2369 -21849
13481b1849n347M425L956l754N664K1414L280K67k414o830j5268r050o293J084
$$ -21849 -27196 -22771 -18815 -22569 -16905 4509 7789 8056 5642 -1188 -16456 -25506 -31799 -30715
13467c0715n561J3033J9758o857P720K5020j2395m21n835L076J7560R326n116
$$ -30715 -36276 -23243 -3485 -10342 -2622 22398 10003 9582 3747 6823 24383 33709 28593
13454B8593l4693k2755R099L5025J2348M942M309j7005r960J1803o071j3652j1111
$$ 28593 -6100 -28855 -19756 15269 27617 32559 36868 19863 9903 21706 15635 1983 -9128
13441i128K499J3808j1152M832Q264j1822r996o824L683P215J033j4493k757M546
$$ -9128 -6629 7179 -3973 859 9123 -2699 -12695 -19519 -15836 -8621 -7588 -22081 -24838 -20292
13427b0292J2292Q55J7164j67p684J710j4848M867j0165n465K195K939j067J8302
$$ -20292 -8000 -7145 10019 9852 2168 3878 -10970 -6103 -16268 -21733 -19538 -16599 -17666 636
13413F36J9232N532J907o789j4906j0908j0365j459l066k171J7169M811N346O838
$$ 636 19868 25400 27307 20518 5612 -5296 -15661 -17120 -20186 -22357 -5188 -377 4969 11807
13399A1807m93N993r14j5312j9k559m359N960j6866j810P056R536L619J5863J3191
$$ 11807 11314 17307 16393 1081 1062 -1497 -5856 104 -16762 -18572 -11516 -1980 1639 17502 30693
13384C0693k250j942j1516l269q350K5146j30j6402j7468O352J0215j5717q301
$$ 30693 28443 26501 14985 11716 3366 28512 28382 11980 -5488 864 11079 -4638 -12939
13371a2939Q840M858N521k182l921m26k0292p414J2041R279O50J1702O685q045
$$ -12939 -4099 759 6280 4098 177 -249 -20541 -27955 -15914 -6635 -5985 5717 12402 4357
13357D357L973j394p819k113j253k045m28K1181m330j974k3769p63p017j0140
$$ 4357 8330 6936 -883 -2996 -4249 -6294 -6722 14459 10129 8155 -15614 -16377 -23394 -33534
13343c3534k077Q601O66L828J133R598J6791O512p687p375O803q609M940o973
$$ -33534 -35611 -27010 -26344 -22516 -21383 -11785 5006 11518 3831 -3544 3259 -5350 -410 -7383
13329g383K968K508q47O468j0901l46J154J2286k088m829p095Q956L147M780n685
$$ -7383 -4415 -1907 -2754 3714 -7187 -7533 -6379 5907 3819 -1010 -8105 851 3998 8778 3093
13314C093N819M555j0196m76J6964K1787r896j7908p88p803R089j6634j2810J935
$$ 3093 8912 13467 3271 2795 19759 41546 31650 13742 12954 5151 14240 -2394 -15204 -13269
13300a3269O351J3751J0674j3210j0863k271j0273j355P968Q846j373P326K809
$$ -13269 -6918 6833 17507 4297 -6566 -8837 -19110 -20465 -12497 -3651 -5024 2302 5111
13287E111J364m526j2482J6763Q002r649o571q179Q130M245n798M536J34l519
$$ 5111 6475 1949 -10533 6230 14232 4583 -1988 -10167 -2037 2208 -3590 946 1080 -2439
13273b439L881O346O279L731m379K542R581N638j4112j2707n636L3207J6563p087
$$ -2439 1442 7788 14067 17798 13419 15961 25542 31180 17068 4361 -1275 31932 48495 41408
13259D1408j4240j0500N670P137j04j4276O587J0779j1752j3566o312k564L974
$$ 41408 27168 16668 22338 29475 29371 15095 21682 32461 20709 7143 831 -1733 2241
13246B241M838P526L526p133j4893Q596p117L211M332M49n721J553O627r644Q164
$$ 2241 7079 14605 18131 10998 -3895 4701 -2416 795 5127 5576 -145 1408 8035 -1609 6555
13231F555L244n663J2339J3348l796q914j3986m010j2093J1376o126N357N502
$$ 6555 9799 4136 16475 29823 26027 17113 3127 -883 -12976 -1600 -7726 -2369 3133
13218C133J3914L981j4770j2607q575M219P599R680P52R153o96n6o38j3313K471
$$ 3133 17047 21028 6258 -6349 -14924 -10705 -3106 6574 7326 16479 15783 15727 15089 1776 4247
13203D247l272N467j0489j843J0000k961j0341N994k274j237O6Q819M976j2849
$$ 4247 975 6442 -4047 -5890 4110 1149 -9192 -3198 -5472 -6709 -6643 2176 7152 -5697
13189e697q564o133j2916k300Q138J9670o130o338M678J0171j2953k389O836j0036
$$ -5697 -14261 -20394 -33310 -35610 -27472 -7802 -13932 -20270 -15592 -5421 -18374 -20763 -13927 -23963
13175b3963n052J0869K5100R415P56M009j6357q631N597M985N641L533j268j389
$$ -23963 -29015 -18146 6954 16369 17125 21134 4777 -3854 1743 6728 12369 15902 14634 13245
13161A3245l846j236R704J661j393q667l5P799j0921o317R26o26K725N066o211
$$ 13245 9399 8163 17867 19528 18135 9468 9433 17232 6311 -6 920 294 3019 8085 1874
13146A874N759Q88j6697q849Q824K4828L557p79J6378r515K381j3029k1337O32
$$ 1874 7633 8521 -8176 -17025 -8201 16627 20184 19405 35783 26268 28649 15620 -5717 -5085
13132e085Q662o999j42J4730P517k3624q972j3776m609M598K6481J5232J5435
$$ -5085 3577 -3422 -3564 11166 18683 -4941 -13913 -27689 -32298 -27700 -1219 14013 29448
13119B9448k97j6263j4881k941j495P800o740j3958J3010N281J2049j721j0924
$$ 29448 29151 12888 -1993 -4934 -6429 1371 -5369 -19327 -6317 -1036 11013 9292 -1632
13106a632j4845L732n371K877J923N479r159p622k1J1306J0563L922j0286Q714
$$ -1632 -16477 -12745 -18116 -15239 -13316 -7837 -16996 -24618 -24639 -13333 -2770 1152 -9134 -420
13092d20J0797j1453l353R615J846J833J2212n112j9475p536q075J1475J0796
$$ -420 10377 -1076 -4429 5186 7032 8865 21077 15965 -3510 -11046 -19121 -7646 3150
13079C150K299j8082p855J1547K8151n081j2430j7402J0184K1926J3426j211p472
$$ 3150 5449 -12633 -20488 -8941 19210 14129 1699 -15703 -5519 16407 29833 28622 21150
13066B1150n494j6567J0256J0075j9319j4913J3066Q38n131J2279j222o611q720
$$ 21150 15656 -911 9345 19420 101 -14812 -1746 -908 -6039 6240 5018 -1593 -10313
13053a0313M34J5217Q231K091o232M842l86j2280K953j302J0776J1821L324j5958
$$ -10313 -9879 5338 13569 15660 9428 14270 13884 1604 4557 3255 14031 25852 29176 13218
13039A3218k0372j787r696N082J924J5223J2066m067j5758o893Q569r03M994p640
$$ 13218 -7154 -8941 -18637 -13555 -11631 3592 15658 11591 -4167 -11060 -2491 -3394 1600 -6040
13025f040J1293J7262q064k3814j7975Q544R266p081O46J1302j964K383J081J5251
$$ -6040 5253 22515 14451 -9363 -27338 -18794 -9528 -16609 -15963 -4661 -6625 -4242 -3161 12090
13011A2090J5484p876j9693j899j6788j6837K257N420L450L544Q316k710j707
$$ 12090 27574 19698 5 -1894 -18682 -35519 -33262 -27842 -24392 -20848 -12532 -15242 -16949
12998a6949R755L742R341L861j4251L203l453Q338J2957q737j4585j553R698P399
$$ -16949 -7194 -3452 5889 9750 -4501 -1298 -4751 3587 16544 7807 -6778 -8331 1367 8766
12984H766N231J2257m483j1887m388L887Q577P556n554k8083J230K0108K539j7539
$$ 8766 13997 26254 21771 9884 5496 9383 17960 25516 19962 -8121 -6891 13217 15756 -1783
12970a783n051K739J0371Q078J4489j1653j714Q157J427J0342p017k341n808o748
$$ -1783 -6834 -4095 6276 14354 28843 17190 15476 23633 25060 35402 28385 26044 20236 13488
12956A3488j0590o793K802j5242o911J2736Q448O131k0061j9435l570K6750J9778
$$ 13488 2898 -3895 -1093 -16335 -23246 -10510 -2062 4069 -15992 -35427 -38997 -12247 7531
12943G531J957j0507k147M430L266K175L014k403J237O088l788p623j1987K00
$$ 7531 9488 -1019 -3166 1264 4530 6705 9719 7316 8553 14641 10853 3230 -8757 -8557
12929h557N466K081J1377M01k942Q517j3667o575j268j0192P505j3281p373j905
$$ -8557 -3091 -1010 10367 10768 7826 16343 2676 -3899 -5167 -15359 -7854 -21135 -28508 -30413
12915c0413O059J2706l239q714l60P335J2978J547R350q325M862M881O440j1536
$$ -30413 -24354 -11648 -14887 -23601 -23961 -16626 -3648 -2101 7249 -1076 3786 8667 15107 3571
12901C571j1581J672n40j0408L475J4807R503j890j3858p822P071j7566j1822
$$ 3571 -8010 -6338 -6878 -17286 -13811 996 10499 8609 -5249 -13071 -6000 -23566 -35388
12888c5388J1212j323J342J0151N622j2615m313L428K4538R381l0184J592K0553
$$ -35388 -24176 -25499 -24157 -14006 -8384 -20999 -25312 -21884 2654 12035 -18149 -16557 3996
12875C996q302l312j6062R823J3413L785m893m164l090k796R810J837J325J1231
$$ 3996 -4306 -7618 -23680 -13857 -444 3341 -1552 -5716 -8806 -11602 -1792 45 1370 12601
12861A2601L253j3848j1279n698m060J8042J1065k758j9572O332Q594J9005J6695
$$ 12601 15854 2006 -9273 -14971 -19031 -989 10076 7318 -12254 -5922 2672 21677 38372
12848C8372J1175r663j5978j6562K577k914Q387k8239K959K1736J34j1969j0157
$$ 38372 49547 39884 23906 7344 9921 7007 15394 -12845 -9886 11850 11984 15 -10142
12835a0142q803P159R129n044M403J6991l526j4820l117m527k684Q793J2400R997
$$ -10142 -18945 -11786 -2657 -7701 -3298 13693 10167 -4653 -7770 -12297 -14981 -6188 6212 16209
12821A6209n3J1071r920p831R339j078q338n739r816j1496P626l901P217O826
$$ 16209 16156 27227 17307 9476 18815 17737 9399 3660 -6156 -17652 -10026 -13927 -6710 116
12807A16O3K537j598j15k734j6112j1123K2312M856q140Q151j617l717j321r757
$$ 116 179 2716 1118 1003 -1731 -17843 -28966 -6654 -1798 -9938 -1787 -3404 -7121 -8442 -18199
12792a8199N411j291k910N036J5054K4260m436k5235q029n907j675J1704j0299
$$ -18199 -12788 -14079 -16989 -11953 3101 27361 22925 -2310 -10339 -16246 -17921 -6217 -16516
12779a6516n85O28j3536q02J3617J4281j3432P02J4998N056L851P160o651n056
$$ -16516 -17101 -16473 -30009 -30811 -17194 -2913 -16345 -15643 -645 4411 8262 15422 8771 3715
12765C715q979j8203K881N811R699M919M023k068j7251n403J7836J7247J263j1806
$$ 3715 -5264 -23467 -20586 -14775 -5076 -157 3866 1798 -15453 -20856 -3020 14227 15490 3684
12751C684j0679j6551N077K0416J1991j0629j233M367P797j0289j0915o146Q920
$$ 3684 -6995 -23546 -18469 1947 13938 3309 2076 6443 14240 3951 -6964 -13110 -4190
12738d190k96j3052M30K392J1366J6399j329m418l398O612N272L924j0664p01
$$ -4190 -4486 -17538 -17108 -14716 -3350 13049 11720 7302 3904 10516 15788 19712 9048 8347
12724H347k0370M595L6834J8215r246m190j2599k5658j3939K1655k487o579n730
$$ 8347 -12023 -7428 29406 47621 38375 34185 21586 -4072 -18011 3644 1157 -5422 -11152
12711a1152q515j2322J4567K1038k654r91L358L803J5085J2669J216j0575r603
$$ -11152 -19667 -31989 -17422 3616 962 -29 3329 7132 22217 34886 36102 25527 15924
12698A5924k85Q046P738j777l1913j405K2615R104j1989n262N751k304K56j4037
$$ 15924 15639 23685 31423 29646 -2267 -3672 18943 28047 16058 10796 16547 14243 14499 462
12684D62l466J882q75k540P897O499J1413q232r844k82l94J0790Q434o421J5924
$$ 462 -3004 -1122 -1997 -4537 3360 9859 21272 13040 3196 2914 2520 13310 21744 15323 31247
12669C1247m995O056l5994j8647J2579R454o547N650K399J3733K585J8095O190
$$ 31247 26252 32308 -3686 -22333 -9754 -300 -6847 -1197 1202 14935 17520 35615 41805
12656D1805j5590k3784n477J3029K841M365K23k0888l630p189Q38P70n196Rj3
$$ 41805 26215 2431 -3046 9983 12824 17189 17412 -3476 -7106 -14295 -13457 -12687 -17883 -17874 -17887
12641a7887J1611L512r219l721j752J4024J5815R324N460j2102J7955J1610j5456
$$ -17887 -6276 -2764 -11983 -15704 -17456 -3432 12383 21707 27167 15065 33020 44630 29174
12628B9174j4487m255o303l961p783Q714J0874p190J1614P250k521j8216j9286
$$ 29174 14687 10432 4129 168 -7615 1099 11973 4783 16397 23647 21126 2910 -16376
12615a6376L472q564j8942K8438J5393j5465j5203M812J7366K933j6866N863J2470
$$ -16376 -12904 -21468 -40410 -11972 3421 -12044 -27247 -22435 -5069 -2136 -19002 -13139 -669
12602f69n854j7887o483J0716J0585J5331l086p394J5712R009r638n774k82M652
$$ -669 -6523 -24410 -30893 -20177 -9592 5739 2653 -4741 10971 19980 10342 4568 4286 8938
12588H938m256p503p106P910P720J3907j3467k185K343j3503l676J4178J3957
$$ 8938 4682 -2821 -9927 -2017 5703 19610 6143 3958 6301 -7202 -10878 3300 17257
12575A7257J1106m975n606j5845j4293J2308R645p90m346l742P80L971L927K081
$$ 17257 28363 23388 17782 1937 -12356 -48 9597 8807 4461 719 1499 5470 9397 11478
12561A1478L841j839q412J1257n145j4980Q297j2256L22J8780J8557n718M552
$$ 11478 15319 13480 5068 16325 11180 -3800 4497 -7759 -7437 11343 29900 24182 28734
12548B8734j3671l1094k348K2630k428l914R49R869j207j4002M570J3301K760
$$ 28734 15063 -16031 -18379 4251 1823 -2091 -1142 8727 7520 -6482 -1912 11389 14149
12535A4149n689j4481j6529M688K035n009J236l405q86o819N319J2771K5413J0067
$$ 14149 8460 -6021 -22550 -17862 -15827 -20836 -19600 -23005 -23891 -30710 -25391 -12620 12793 22860
12521B2860K19n03j9701j3189R504J0481L466J2179l042q665K094j6016l264q010
$$ 22860 23079 22576 2875 -10314 -810 9671 13137 25316 22274 13609 15703 -313 -3577 -11587
12507a1587J0217j066J398N026J3537J6420J7971J4203r254j0750r051m989j2023
$$ -11587 -1370 -2436 -1038 3988 17525 33945 51916 66119 56865 46115 37064 32075 20052
12494B0052n816J2308K606j5713l992J640L327l344j4151k2765J048Q790j928
$$ 20052 14236 26544 29150 13437 9445 11085 14412 11068 -3083 -25848 -24800 -16010 -17938
12481a7938J5841J0172J5503j0998n516Q226m606n777j1257O899K0335J4064l82
$$ -17938 -2097 8075 23578 12580 7064 15290 10684 4907 -6350 549 20884 34948 34566
12468C4566j1858m381l768J0935J4111J0765k6664q768j1456n952J1182M026L172
$$ 34566 22708 18327 14559 25494 39605 50370 23706 14938 3482 -2470 8712 12738 15910
12455A5910r937l588N470q260k791O425p844J583J4958P536j9496o621j405j786
$$ 15910 5973 2385 7855 -405 -3196 3229 -4615 -3032 11926 19462 -34 -6655 -8060 -9846
12441i846J68j0691p203N731K2047J7496j2438j4734o460J1479K7096K1749q571
$$ -9846 -9678 -20369 -27572 -21841 206 17702 5264 -9470 -15930 -4451 22645 44394 35823
12428C5823q467q000n518K044J960N069o64l736n156k047P740O518j667J777m554
$$ 35823 27356 19356 13838 15882 17842 22911 22247 18511 13355 11308 19048 25566 23899 25676 21122
12413B1122j2667m393j1195j0990j0232m682K684J9997J0172m771j1150J0422
$$ 21122 8455 4062 -7133 -18123 -28355 -33037 -30353 -10356 -184 -4955 -16105 -5683
12401e683J4174J994k5314r26J0953J1485L737j1929J2797J9398j0952k737J72
$$ -5683 8491 10485 -14829 -15755 -4802 6683 10420 -1509 11288 30686 19734 16997 17169
12388A7169q870q287J9836j4939j8269p907Q842N124P305j914J4407j0546j2842
$$ 17169 8299 12 19848 4909 -13360 -21267 -12425 -7301 4 -1910 12497 1951 -10891
12375a0891J5291j499J6001o599j4829P623j880n929N062k201M035M561Q203L308
$$ -10891 4400 2901 18902 12303 -2526 5097 3217 -2712 2350 149 4184 8745 16948 20256
12361B0256J7534O52k0736k5731j5461P97M402Q565n920l994J3541j403M459J0645
$$ 20256 37790 38442 17706 -8025 -23486 -22689 -18287 -9722 -15642 -19636 -6095 -7498 -3039 7606
12347G606J1790O512J1868L77j7713r293j3723j2851M886J2041Q956m78j2531
$$ 7606 19396 25908 37776 38153 20440 11147 -2576 -15427 -10541 1500 10456 9978 -2553
12334b553L883j1845m337J2973J0421O560R507j2359j1077K025J1445J2588K780
$$ -2553 1330 -10515 -14852 -1879 8542 15102 24609 12250 1173 3198 14643 27231 30011
12321C0011j6133n538N314n40Q68q430j0411M021R419R942j8073k3728l345J6906
$$ 30011 13878 8340 13654 13114 13982 5552 -4859 -838 8581 18523 450 -23278 -26623 -9717
12307i717O82O914l94M090N333R168K674j6482j4056r56J0041K2387L7j0307R970
$$ -9717 -9035 -2121 -2515 1575 6908 16076 18750 2268 -11788 -12744 -2703 19684 19721 9414 19384
12292A9384O948j1779j0391J7255L83j6792p310j2205r599J8389J0077J7359l841
$$ 19384 26332 14553 4162 21417 21800 5008 -2302 -14507 -24106 -5717 4360 21719 17878
12279A7878k084r146N375j349J0271K749j6550j1110p042M570J0456J6808Q43
$$ 17878 15794 6648 12023 10674 20945 23694 7144 -3966 -11008 -6438 4018 20826 21669
12266B1669j6995j5m640j585m961M21J2363j876N089J4452q840O915j0833k6401
$$ 21669 4674 4659 19 -1566 -6527 -6106 6257 4381 9470 23922 15082 21997 11164 -15237
12252a5237J2738K085L283N496k184j2863p951o108P230P637J3941Q928M473k261
$$ -15237 -2499 -414 2869 8365 6181 -6682 -14633 -20741 -13511 -5874 8067 16995 21468 19207
12238A9207j8688l083p395M408M620L594J0917N592j2743n434Q834k785j1034
$$ 19207 519 -2564 -9959 -5551 -931 2663 13580 19172 6429 995 9829 7044 -3990
12225c990P436p182o446K516O031L433K859J7042n983j5255M75r101L217j696
$$ -3990 3446 -3736 -10182 -7666 -1635 1798 4657 21699 15716 461 936 -8165 -4948 -6644
12211f644n780o643j130J0514O310R433j56M404k356j4429r829J0771R972J7J729
$$ -6644 -12424 -19067 -20197 -9683 -3373 6060 5904 10308 7952 -6477 -16306 -5535 4437 4454 6183
12196F183Q541J0638k117k0382J1182k026J686M152O171j1209l274N287m000R128
$$ 6183 14724 25362 23245 2863 14045 12019 13705 17857 24028 12819 9545 14832 10832 19960
12182A9960R628j1719j7591p548J9423K2246J2421n039L886J2430O537j4525J6912
$$ 19960 29588 17869 278 -7270 12153 34399 46820 41781 45667 58097 64634 50109 67021
12169F7021J5814Q754R585r328j0807q31l495j8975k903j7967j0181o805j0296
$$ 67021 82835 91589 101174 91846 81039 80208 76713 57738 54835 36868 26687 19882 9586
12156I586J4950m479J338Q292k1541o262r26k350o844l773R361N59J9126k634
$$ 9586 24536 20057 21395 29687 8146 1884 958 -1392 -8236 -12009 -2648 -2089 17037 14403
12142A4403r617m86J4163j6782K067O338J6535n506q679O452l191n48p291L684
$$ 14403 4786 4300 18463 1681 3748 10086 26621 21115 12436 18888 15697 15149 7858 11542
12128A1542j0024R58Q067q914N794K4305j725o135o179j1233q723j0163J0164
$$ 11542 1518 2476 10543 1629 7423 31728 30003 23868 17689 6456 -2267 -12430 -2266
12115b266Q245n553r775J331N369J0861r746j5508J1681m080J8089K1738k0906
$$ -2266 5979 426 -9349 -8018 -2649 8212 -1534 -17042 -5361 -9441 8648 30386 9480
12102I480M92K48P62L966J5425K1142L587k8580k1248m525r47R815l233J3992
$$ 9480 9972 10220 10982 14948 30373 51515 55102 26522 5274 749 -198 9617 6384 20376
12088B0376j514k455k084p849J2028J482j5407j1222k495O816J3410O147q923
$$ 20376 18862 16407 14323 6474 18502 19984 4577 -6645 -9140 -2324 11086 17233 8310
12075H310l277M911K50L70l396J0433j238J157q090P638K573m306Q885j666j688
$$ 8310 5033 9944 10194 10564 7168 17601 16363 17520 9430 17068 19641 15335 24220 22554 20866
12060B0866N050L257J5882n688k3327Q057Q199n787O778r40j858o588j7251k643
$$ 20866 25916 29173 45055 39367 16040 24097 32296 26509 33287 32347 30489 23901 6650 4007
12046D007j8115J4453R447j1820o718R429p74M663j8969j0022R630P975p248j4206
$$ 4007 -14108 345 9792 -2028 -8746 683 -91 4572 -14397 -24419 -14789 -6814 -14062 -28268
12032b8268n192J4133K3520J0442L328J3379Q712j8189j2083j8320n105J1271
$$ -28268 -33460 -19327 4193 14635 17963 31342 40054 21865 9782 -8538 -13643 -2372
12020b372J1741m02L832r085Q79o087j8963P726R83j701j083J2068P340m095M048
$$ -2372 9369 8967 12799 3714 4593 -1494 -20457 -12731 -11748 -13449 -14532 -2464 4876 781 4829
12005D829J2383J5J120N339r245m832o182N910n136p346J616j1618r324J0803
$$ 4829 17212 17227 18347 23686 14441 9609 3427 9337 4201 -3145 -1529 -13147 -22471 -11668
11991a1668J1249o808j391p11l725J8091J0640j1245L035j126Q04j0675k4941
$$ -11668 -419 -7227 -8618 -9329 -13054 5037 15677 4432 7467 6341 7145 -3530 -28471
11978b8471n860K211R989K3517K3068Q674k6569n624J4396q494r723J7296n113
$$ -28471 -34331 -32120 -22131 1386 24454 33128 6559 935 15331 6837 -2886 14410 9297
11965I297q191J1663K4151O381o185j8263J479l921k918n973K9914j271j4380
$$ 9297 1106 12769 36920 43301 37116 18853 20332 16411 13493 7520 37434 36163 21783
11952B1783K784O392j6983j6165JJ776J5574o582o196J0394P450p445K969n07
$$ 21783 24567 30959 13976 -2189 -2188 -412 15162 8580 2384 12778 20228 12783 15752 15245
11938A5245K849P181o459o662j1773R668N737j1459n818J2736J5882j3917j3783
$$ 15245 18094 25275 18816 12154 381 10049 15786 4327 -1491 11245 27127 13210 -573
11925e73n550o531J6506P20p92J1189N037N672M677P041p147k1873N932m6j5282
$$ -573 -6123 -12654 3852 4572 3780 14969 20006 25678 30355 37396 30249 8376 14308 14262 -1020
11910a020P28R95J1048J9304L541L743p390k1373R94j80j0430L822l565j6799
$$ -1020 -292 703 11751 31055 34596 38339 30949 9576 10570 10390 -40 3782 217 -16582
11896a6582n980K1919R022j9864m068J1752O333J3444L792K429k1827n190N906
$$ -16582 -22562 -643 8379 -11485 -15553 -3801 2532 15976 19768 22197 370 -4820 1086
11883A086n031l632J1399K66M191j145P548q668n309n782R595q138n546n537m549
$$ 1086 -3945 -7577 3822 4088 8279 7134 14682 6014 705 -5077 4518 -3620 -9166 -14703 -19252
11868a9252J0058K5249J0113J2508O643j1204m850J9123M078j0747m740j0943
$$ -19252 -9194 16055 26168 38676 45319 34115 29265 48388 52466 41719 36979 26036
11856B6036j4341l186K923o71J193j1933N397k562n781q183o2J2994R962k056
$$ 26036 11695 8509 11432 10761 11954 21 5418 2856 -2925 -11108 -11170 1824 11786 9730
11842I730j4584o892j2927k872K2215J1195J0483J1218j4856j8184L153L773J3185
$$ 9730 -4854 -11746 -24673 -27545 -5330 5865 16348 27566 12710 -5474 -2321 1452 14637
11829A4637p084J715J3032P797k5757q939j0775K4159K1632J5168n338p577k3281
$$ 14637 7553 9268 22300 30097 4340 -4599 -15374 8785 30417 45585 40247 32670 9389
11816I389p261J8726K2659L000k1436o021R374o669l285L091O809r964O046N880
$$ 9389 2128 20854 43513 46513 25077 19056 28430 21761 18476 21567 28376 18412 24458 30338
11802C0338m416K321n360N760q759p834m92n109J0861J284k000j8038Q405J3224
$$ 30338 25922 28243 22883 28643 19884 12050 11558 6449 17310 18594 16594 -1444 6961 20185
11788B0185o262q232O445K0793j4541n490p319L214k714r770L91R064J0834p339
$$ 20185 13923 5691 12136 32929 18388 12898 5579 8793 6079 -3691 -3300 5764 16598 9259
11774I259K690J0300n661p219J2587J1621Q279j3422l954j5113K470o496L347
$$ 9259 11949 22249 16588 9369 21956 33577 41856 28434 24480 9367 11837 5341 8688
11761H688L0209Q780k1040q394p564N022L708q761J1785R354r691J9725L301L584
$$ 8688 38897 47677 26637 18243 10679 15701 19409 10648 22433 31787 22096 41821 45122 48706
11747D8706m137r838j1851k315J1745j260j8460j2041j2232O649K2292M722j6632
$$ 48706 44569 34731 22880 20565 32310 31050 12590 549 -11683 -5034 17258 21980 5348
11734E348J017J9367r270j4385L558N740P409J313n033p137K541n506L309r832
$$ 5348 6365 25732 16462 2077 5635 11375 18784 20097 15064 7927 10468 4962 8271 -1561
11720a561j0185J7816J7152P863j5508j0621J5751K277j1353p493m969R873J6935
$$ -1561 -11746 6070 23222 31085 15577 4956 20707 22984 11631 4138 -831 9042 25977
11707B5977M057k808j7983n443N75j351j2685m25J6480J7065J2204R374k0767
$$ 25977 30034 27226 9243 3800 4375 3024 -9661 -10086 6394 23459 35663 45037 24270
11694B4270j4671j1041p270K460J0499p441p241K649J439N136Q324P556J0457
$$ 24270 9599 -1442 -8712 -6252 4247 -3194 -10435 -7786 -6347 -1211 7113 14669 25126
11681B5126l027M006m781j0309J4460M541j5870j0630Q479K218M454j03J2845
$$ 25126 22099 26105 21324 11015 25475 30016 14146 3516 11995 14213 18667 18564 31409
11668C1409j780j0223j3327J2551J2237j004q60n802j5631q853n00J3482K8352
$$ 31409 29629 19406 6079 18630 30867 29863 29003 23201 7570 -1283 -1783 11699 40051
11655D0051N198q226k0134o903J1519K949j9001j5382J3418J3313P971J307o40
$$ 40051 45249 37023 16889 9986 21505 24454 5453 -9929 3489 16802 24773 26080 25440
11642B5440k1683O739J8447j3410k184M705L30o160R544K279K231J6275m330j5901
$$ 25440 3757 10496 28943 15533 13349 18054 18384 12224 21768 24047 26278 42553 38223 22322
11628B2322j4755m613j997J3350q52N623M14J1876P348j4200j5308j1284l664
$$ 22322 7567 2954 957 14307 13455 19078 19492 31368 38716 24516 9208 -2076 -5740
11615e740m05R950J9689Q054j1466N35R517k494P063J3449l637j690k836p502
$$ -5740 -6145 3805 23494 31548 20082 20617 30134 27640 34703 48152 44515 42825 39989 32487
11601C2487n156N683k262j184Q06j0350j0869k848p089K7411J5728o154j0004
$$ 32487 27331 33014 30752 29568 30374 20024 9155 6307 -782 26629 42357 36203 26199
11588B6199J50j7744r814j339J2996k906p615K011M697j0769p296J7346k785n028
$$ 26199 26349 8605 -1209 -2548 10448 7542 -73 1938 6635 -4134 -11430 5916 3131 -1897
11574a897J5365M471K531o745j2022M256P463L051o452J267J1196J3121J742j0359
$$ -1897 13468 17939 20470 13725 1703 5959 13422 16473 10021 11288 22484 35605 37347 26988
11560B6988j5558o403J0886M084J7302L759k9537k29l611O993K2821m737k3771
$$ 26988 11430 5027 15913 19997 37299 41058 11521 11292 7681 14674 37495 32758 8987
11547H987M969K8496k121q763j3978Q47L637O907P273p907K910o169j8648j0013
$$ 8987 13956 42452 40331 31568 17590 18437 22074 28981 36254 28347 31257 25088 6440 -3573
11533c573J2655J1307J1277j2633q834l875n81K063m442r71J0128J4879L116N254
$$ -3573 9082 20389 31666 19033 10199 6324 5743 7806 3364 2393 12521 27400 30516 35770
11519C5770J871l720p850j4131j09k0296q22L1036J7806l316n583j0133q483k3410
$$ 35770 37641 33921 26071 11940 11831 -8465 -9287 21749 39555 36239 30656 20523 12040 -11370
11505a1370N589M775j875K7404J1020j7939j0775k267p878N425R077L690J4627
$$ -11370 -5781 -1006 -2881 24523 35543 17604 6829 4562 -3316 2109 11186 14876 29503
11492B9503P945k900j316J158j3688n344J288q000J0778J3200k0492j9637J711
$$ 29503 37448 34548 33232 34390 20702 15358 16646 8646 19424 32624 12132 -7505 -5794
11479e794j0988K498J5010Q979q068j0894k28J090J8292R570N367M849j84j5042
$$ -5794 -16782 -14284 726 9705 1637 -9257 -9485 -8395 9897 19467 24834 29683 29499 14457
11465A4457p523J9816M084j140l500j2419M125k059O153K4053J3095n454j8756
$$ 14457 6934 26750 30834 29694 26194 13775 17900 15841 21994 46047 59142 53688 34932
11452C4932q365j7867O048O616n016J1626Q535m583j9429p8J2412J0829J0409
$$ 34932 26567 8700 14748 21364 16348 27974 36509 31926 12497 12419 24831 35660 46069
11439D6069j6376k297K596r278j3732k069P626P976M428n21L992O671r073J4007
$$ 46069 29693 27396 29992 20714 6982 4913 12539 20515 24943 24422 28414 35085 26012 40019
11425D0019L671l874j336L424l339j3339m744M588r511M272N690J39L756O166
$$ 40019 43690 39816 38480 41904 38565 25226 20482 25070 15559 19831 25521 25660 29416 35582
11411C5582o98j5974K8216J4306k6001j4073Q02J1729J5470j1906j5449k3535
$$ 35582 34884 18910 47126 61432 35431 21358 22160 33889 49359 37453 22004 -1531
11399a531q974l038L262J2893J3261o186j2798q484J6131O509K59O039j3298k415
$$ -1531 -10505 -13543 -10281 2612 15873 9687 -3111 -11595 4536 11045 11304 17343 4045 1630
11385A630J5121P452M210m216n543l924K648J4291R349m782J2995p091L181k421
$$ 1630 16751 24203 28413 24197 18654 14730 17378 31669 41018 36236 49231 42140 45321 42900
11371D2900j6674J2209r594j7998r41J3089o708p6J753j77l089O101N544L653
$$ 42900 26226 38435 28841 10843 9902 22991 16283 16207 17960 17783 14694 20795 26339 29992
11357B9992J0954k430m72P515O955K238j4704k0568n42J0175j2406m822P690K233
$$ 29992 40946 38516 38044 45559 52514 54752 40048 19480 18938 29113 16707 11885 19575 21808
11343B1808Q285J0828L583L641j175j0942j3105J6946Q962j7995k332r037k355
$$ 21808 30093 40921 44504 48145 46970 36028 22923 39869 48831 30836 28504 19467 17112
11330A7112K0806q320L840J6250P146L389Q677j84R543p846j4866q104j6135K0668
$$ 17112 37918 29598 33438 49688 56834 60223 68900 68716 78259 70413 55547 47443 31308 51976
11316E1976Q862m479j372j666j765p930m390K231j5199Q941K1306P905o645k2845
$$ 51976 60838 56359 54987 53321 51556 43626 39236 41467 26268 35209 56515 64420 57775 34930
11302C4930j959K5201k876j5654j3180R472K354Q299J3858J5291j8304l1352j1014
$$ 34930 32971 58172 55296 39642 26462 35934 38288 46587 60445 75736 57432 26080 15066
11289A5066J2929Q832k2357l018O917K2866k726k363j5703K868K1298M539q615
$$ 15066 27995 36827 14470 11452 18369 41235 38509 36146 20443 23311 44609 49148 40533
11276D0533O394J338j516j50l12K057K3965K969J463j2054j1771m675n965p51
$$ 40533 46927 48265 46749 46599 46287 48344 72309 75278 76741 64687 52916 48241 42276 41525
11262D1525j391K482K532Q039k546j6072j2145N651K1099K3335K0272J221m137
$$ 41525 40134 42616 45148 53187 50641 34569 22424 28075 49174 72509 92781 94002 89865
11249H9865q930j0690k425Q387J111j2861L158J3224q419k0325O219J097p478
$$ 89865 80935 70245 67820 76207 77318 64457 67615 80839 72420 52095 58314 59411 51933
11236E1933O855J0661O441m501r764j0046p530j9934o431L5159K4640J2464k951
$$ 51933 58788 69449 75890 71389 61625 51579 44049 24115 17684 52843 77483 89947 86996
11223H6996j3425j1124j1597j3400R906R627P666J8891p35j6440q50m616J6424
$$ 86996 73571 62447 50850 37450 47356 56983 64649 83540 82805 66365 65515 60899 77323
11210G7323J2717l246q208j3760l544M227M370J5724K3313N784k0438r053J22
$$ 77323 90040 86794 78586 64826 61282 65509 69879 85603 108916 114700 94262 85209 85331
11197H5331O885j2295K51N327J5108O24j7009Q23j2358k2848o657P997J2677o619
$$ 85331 92216 79921 80172 85499 100607 101231 84222 85045 72687 49839 43182 51179 63856 57237
11183E7237r288J05J3966O555r774J2243j0226j2003m423m840k733l107j4896
$$ 57237 47949 48054 62020 68575 58801 71044 60818 48815 44392 39552 36819 33712 18816
11170A8816R553J7319n736J4402J7936R663J4460j1389r832j1400Q518K112J2789
$$ 18816 28369 45688 39952 54354 72290 81953 96413 85024 75192 63792 72310 74422 87211
11157H7211j3863k397p047r210J5238J3360m657j2506j4152J9987J2490L256q862
$$ 87211 73348 70951 63904 54694 69932 83292 78635 66129 51977 71964 84454 87710 78848
11144G8848k2204l910J175K5300J6113j1350q057K387J2491J984j1434j864k2678
$$ 78848 56644 52734 53909 79209 95322 83972 75915 78302 90793 92777 81343 79479 56801
11131E6801J5200J4918N856k5289l2846R895J2720O842p745K018j0750K3635q377
$$ 56801 72001 86919 92775 67486 34640 44535 57255 64097 56352 58370 47620 71255 62878
11118F2878j2744j614O599M507o834K322Q117J878J1952Q596j6779L756n776n99
$$ 62878 50134 48520 55119 59626 52792 55114 63231 65109 77061 85657 68878 72634 66858 66259
11104F6259J1278N906n925O137j56J625p356r343k099Q085K309N963k580O009
$$ 66259 77537 83443 77518 83655 83499 85124 77768 68425 66326 74411 76720 82683 80103 86112
11090H6112N852p103k4j5245j2243p216K273k879L904J536J0776N356Q530J2837
$$ 86112 91964 84861 84837 69592 57349 50133 52406 49527 53431 54967 65743 71099 79629 92466
11076I2466j3276k4142J3131m183j4795j000L364J5559K379l537q10l071Q627
$$ 92466 79190 55048 68179 63996 49201 48201 51565 67124 69503 65966 65156 62085 70712
11063G0712J1111P519Q372j811M247L643n218J934J2819q872j9803m329p13K2681
$$ 70712 81823 89342 97714 95903 100150 103793 98575 100509 113328 104456 84653 80324 79611 102292
11049A02292j9952l5384M295K6750N554J841K1777N639k576O363Q529J6632K0065
$$ 102292 82340 46956 51251 78001 83555 85396 107173 112812 110236 116599 125128 141760 161825
11036A61825n833j3183N682J2443r370j7873J0550Q900n335j4615l539q456l078
$$ 161825 155992 142809 148491 160934 151564 133691 144241 153141 147806 133191 129652 121196 118118
11023A18118J478K96l68q964J2584K200k514m110j6725j0424J791j3960M06K0576
$$ 118118 119596 119892 119524 110560 123144 125344 122830 118720 101995 91571 93362 79402 79808 100384
11009A00384J7057l226N827L0989J2721K4845K2677K4673J501Q998m099L683O567
$$ 100384 117441 114215 120042 151031 163752 188597 211274 235947 237448 246446 242347 246030 252597
10996B52597k9429l8000k2022j7260j1727l966p484j2270P586J5487N897K246
$$ 252597 223168 185168 163146 145886 134159 130193 122709 110439 118025 133512 139409 141655
10984A41655j0757N746j0723L250M149j0940K443p355k4851K266J4273m352M01
$$ 141655 130898 136644 125921 129171 133320 122380 124823 117468 92617 94883 109156 104804 105205
10971A05205k078j0524O786K4315J6238r821k6087P216J9251K0879N4964K6886
$$ 105205 103127 92603 99389 123704 139942 130121 104034 111250 130501 151380 206344 233230
10959B33230N905K0400L0014L4451K3887J5318R575J5261N812N081O510N780J1411
$$ 233230 239135 259535 289549 324000 347887 363205 372780 388041 393853 398934 405444 411224 422635
10946D22635O3848J06607J28258J88528K80713K70702J47463J16271J74711K18268
$$ 422635 486483 593090 721348 909876 1190589 1461291 1608754 1725025 1899736 2118004
10936B118004J19849l7214k47423k53837j25939p8982k45501k66811j43000o6317
$$ 2118004 2237853 2200639 1953216 1699379 1573440 1494458 1248957 982146 839146 772829
10926G72829n2441o0006m9950l8897r565L145j2663o8077p4110l1259j8906j6105
$$ 772829 720388 660382 610432 571535 561970 565115 552452 484375 410265 379006 360100 343995
10914C43995r948j4939M7R337N224m948k910j2372j6118q785R117l853q613O655
$$ 343995 334047 319108 319155 328492 333716 328768 325858 313486 297368 288583 297700 293847 285234 291889
10900B91889J3183o766k1753j3533j0457j1889L02o720p124o224O080L532q003
$$ 291889 305072 298306 276553 263020 252563 240674 240976 234256 227132 220908 226988 230520 222517
10887B22517r431j6569J5451Q465R581m177k3855L396P650j4920K787r220P802
$$ 222517 213086 196517 211968 220433 230014 225837 201982 205378 213028 198108 200895 191675 199477
10874A99477J269q35L190j3860J3278J0680J0522J3530P543j8256j0417Q667j9289
$$ 199477 200746 199911 203101 189241 202519 213199 223721 237251 244794 226538 216121 224788 205499
10861B05499l358L042N94j577n85o608J621l170j4893l409j3099j4919L098M87
$$ 205499 202141 205183 205777 204200 203615 197007 198628 195458 180565 177156 164057 149138 152236 152723
10847A52723J8748J574j1268o845J0634l783N083J4534K2454K6446n54K341J7646
$$ 152723 171471 173045 161777 154932 165566 161783 166866 181400 203854 230300 229746 232087 249733
10834B49733j0745k1402k7965j5202j2253J8336P191j2705k0745r626N465J2928
$$ 249733 238988 217586 189621 174419 162166 180502 187693 174988 154243 144617 150082 163010
10822A63010K983q845M332k961Q492N614j3194p818J4664L429j8470j9178o474
$$ 163010 165993 157148 161480 158519 167011 172625 159431 151613 166277 169706 151236 132058 125584
10809A25584J1476K1587m252J974K1403O734M556O27j2266P725J4107J0131K40
$$ 125584 137060 158647 154395 156369 177772 184506 189062 189689 177423 185148 199255 209386 209626
10796B09626j2730P683P885J6534J3266J4731M755K178K1277K1905J5944o19O134
$$ 209626 196896 204579 212464 228998 242264 256995 261750 263928 285205 307110 323054 322435 328569
10783C28569M679m103J6831J6608Q306o090J4139q303l7992n96O122l1560l5309
$$ 328569 333248 329145 345976 362584 370890 364800 378939 370636 332644 332048 338170 306610 271301
10770B71301L833J6408N607j1008j1465k4943m121Q488J5895M271q222q367P098
$$ 271301 275134 291542 297149 286141 274676 249733 245612 254100 269995 274266 266044 257677 264775
10757B64775j4330q935K4474R826M407J6852J2918j2098L72j4296o262J8640J8268
$$ 264775 250445 241510 265984 275810 280217 297069 309987 297889 298261 283965 277703 296343 314611
10744C14611J0051m133o562N024p0O581P037K2952K4464q465N936O408O567L899
$$ 314611 324662 320529 313967 318991 318921 325502 332539 355491 379955 371490 377426 383834 390401 394300
10730C94300J5585J8488J7779K241m905q617j7583Q385J0235l3415n4402k2796
$$ 394300 409885 428373 446152 448393 443488 434871 417288 425673 435908 402493 348091 325295
10718C25295j1438j6550Q66O653p084k9072o356J2849L8248K7561o767J1328K9141
$$ 325295 313857 297307 298173 304826 297742 268670 262314 275163 313411 340972 334205 345533 374674
10705C74674P905j513K0605l720l4352k314J0129n383l1523r175J4312R482K9027
$$ 374674 382579 381066 401671 397951 363599 361285 371414 366031 334508 325333 339645 349127 378154
10692C78154M877j1606M801J2158L3663L4648J7685J7465L726R164M649j1539
$$ 378154 383031 371425 376226 388384 422047 456695 474380 491845 495571 504735 509384 497845
10680D97845o882O327K5201K5747J2378N010k252J610r9P567J0060J2958O032
$$ 497845 490963 497290 522491 548238 560616 565626 563374 564984 564885 572452 582512 595470 601502
10667F01502J2810J6690K2267L5787L7710M93k616K7922M7777M6307O6615J06759
$$ 601502 614312 631002 653269 689056 726766 727259 724643 752565 800342 846649 913264 1020023
10655A020023R7458K9257K0635P7098N9807j7331n7308j1530l38m9783l4174j6664
$$ 1020023 1117481 1146738 1167373 1244471 1304278 1286947 1229639 1218109 1217771 1167988 1133814 1117150
10643A117150N871j0963j4745j1129j5699j760J7341J6677Q1n383J3731J6487
$$ 1117150 1123021 1112058 1097313 1086184 1070485 1068725 1086066 1102743 1102824 1097441 1111172 1127659
10631A127659L8818J9931Q394m023M655J8904N43K0303J4136J0793K5488L0899
$$ 1127659 1166477 1186408 1194802 1190779 1195434 1214338 1214881 1235184 1249320 1260113 1285601 1316500
10619A316500J5530J2670K9534J7398K4341K2704O569J604J8484L6102L9178K6400
$$ 1316500 1332030 1344700 1374234 1391632 1415973 1438677 1445246 1446850 1465334 1501436 1540614 1567014
10607A567014K9355K1337J7527K1934J1507J4709K8011J8887p338K7439J1211
$$ 1567014 1596369 1617706 1635233 1657167 1668674 1683383 1711394 1730281 1722943 1750382 1761593
10596A761593J7640K5541L6422K5616M9297M3643L2586L0289O0260P6973N0553
$$ 1761593 1779233 1804774 1841196 1866812 1916109 1959752 1992338 2022627 2082887 2159860 2210413
10585B210413N9789M9212M9584O9762P1988Q2348Q5982J03082R7537R9942J18189
$$ 2210413 2270202 2319414 2368998 2438760 2510748 2593096 2679078 2782160 2879697 2979639 3097828
10574C097828J21839J10269R9937J38898J51858J57595J77720K04422K09065K23867
$$ 3097828 3219667 3329936 3429873 3568771 3720629 3878224 4055944 4260366 4469431 4693298
10564D693298K49600K55805K70241K65626K86511L25521L86417M67733M88655
$$ 4693298 4942898 5198703 5468944 5734570 6021081 6346602 6733019 7200752 7689407
10555G689407N28034O55067Q16017Q31983P78568Q95185J086955J230600J252874
$$ 7689407 8217441 8872508 9688525 10520508 11299076 12194261 13281216 14511816 15764690
10546A5764690J262208J357013J714445K151934K379582K452115L044774L994850
$$ 15764690 17026898 18383911 20098356 22250290 24629872 27081987 30126761 34121611
10538C4121611N225479O702930Q781772J2174154J7880323K7042596M1262568
$$ 34121611 39347090 46050020 54831792 67005946 84886269 111928865 153191433
10531A53191433N4503716M2815891K1382724K5623245L8315598L3898817R764817
$$ 153191433 207695149 250511040 271893764 297517009 335832607 369731424 379496241
10524C79496241k3056498n0987162l6814409j5517592k5971599n4549348m6653806
$$ 379496241 356439743 305452581 268638172 253120580 227148981 172599633 125945827
10517A25945827k8765540j7990932j2137810q620656o366177n021290m318688
$$ 125945827 97180287 79189355 67051545 58430889 52064712 47043422 42724734
10510D2724734l684808k938204k369493k087395j921646j643996j344015j109144
$$ 42724734 39039926 36101722 33732229 31644834 29723188 28079192 26735177 25626033
10502B5626033j061196j107007j223722j171049r56142q12038q67435q64834p04881
$$ 25626033 24564837 23457830 22234108 21063059 20106917 19294879 18427444 17562610 16857729
10493A6857729n24866m16373m12348m17514m12871m14028m39447m64344m72286
$$ 16857729 16332863 15916490 15504142 15086628 14673757 14259729 13820282 13355938 12883652
10484A2883652n13078n44569n23013m98442m79011m65327m19043l68896l64153
$$ 12883652 12370574 11826005 11302992 10804550 10325539 9860212 9441169 9072273 8708120
10475H708120l43535l05258l06990k95527k79431k71655k61695k60211k33576
$$ 8708120 8364585 8059327 7752337 7456810 7177379 6905724 6644029 6383818 6150242
10466F150242k25619k35672k18036k01394j67987j66572j59386j20040j11877
$$ 6150242 5924623 5688951 5470915 5269521 5101534 4934962 4775576 4655536 4543659
10457D543659j05485q9349o6992o3283p4411j02976j39476j66210j78744j64912
$$ 4543659 4438174 4348825 4281833 4218550 4144139 4041163 3901687 3735477 3556733 3391821
10447C391821j65175j92989j90010j82603j72226j85264j43765j45697j56684
$$ 3391821 3226646 3033657 2843647 2661044 2488818 2303554 2159789 2014092 1857408
10438A857408j50501j32953j34323j10961q8207q4815o7375o2787p3409p0224
$$ 1857408 1706907 1573954 1439631 1328670 1240463 1155648 1088273 1025486 952077 881853
10428H81853n5010o4727l3887k2252k8261l6441k3659n91J549l956k717j2816
$$ 881853 826843 762116 728229 705977 677716 641275 617616 617025 618574 614618 611901 599085
10416E99085q983l1299m3058l6303l1769k2158k2618j5205j6791q920j6357k2240
$$ 599085 590102 558803 515745 479442 447673 425515 402897 387692 370901 361981 345624 323384
10404C23384K7859N4679J6322m3725K9452O3970L428j9807n029q783l3459j8608
$$ 323384 351243 405922 422244 378519 407971 471941 475369 455562 450533 441750 408291 389683
10392C89683K262J5023J0374R1J4098k460j2315j0339j0164j7082j8589j2193
$$ 389683 391945 406968 417342 417433 431531 429071 416756 406417 396253 379171 360582 348389
10380C48389N579j3451n96k278P065J5294J3651K057j1125l753K8575M3255k800
$$ 348389 353968 340517 339921 337643 344708 360002 373653 375710 364585 360832 389407 432662 429862
10367D29862j7680j8094R248J84K8280l887K193Q127K5666K6579K061j1452l042
$$ 429862 412182 394088 403336 403520 431800 427913 430106 438233 463899 490478 492539 481087 478045
10354D78045P368k910j4946j8718r604j1446k0639k8714j7203j0234L8252K3235
$$ 478045 485413 482503 467557 448839 439235 427789 407150 378436 361233 350999 389251 412486
10342D12486l924o591J0272J9265J9386J3379J3520K4151j83k2788l4236L722
$$ 412486 408562 401971 412243 431508 450894 464273 477793 501944 501761 478973 444737 448459
10330D48459o111l0481j6569K552k4396o910J2881J2783j0119j7326r505Q138
$$ 448459 442348 411867 395298 397850 373454 366544 379425 392208 382089 364763 355258 363396
10318C63396N606l75j2549K364k6l306K527m100j2473p956L403J285k3220j9114
$$ 363396 369002 368627 356078 358442 358416 355110 357637 353537 341064 333108 336511 337796 314576 295462
10304B95462k0996P0k6549l5830l2187l376J1147R87m603p162j2333J2191l956
$$ 295462 274466 274536 247987 212157 179970 176594 187741 188728 184125 176963 164630 176821 172865
10291A72865j1453P385J8827l950p310j181k134L2543J3376o247j0294J0848J0111
$$ 172865 161412 168797 187624 183674 176364 175183 173049 205592 218968 212721 202427 213275 223386
10278B23386p66Q381K5008K0780K3177M1743N0576M5945Q4667J35457J52696J10608
$$ 223386 222620 231001 256009 276789 299966 341709 392285 438230 522897 658354 811050 921658
10266I21658P2366J01350J20055O8997j999j05418j58708r8844o2439j41530j76696
$$ 921658 994024 1095374 1215429 1284426 1282427 1177009 1018301 919457 857018 715488 538792
10255E38792j12532o5820m6774l1974j260k0006j9188j6029j5533P129P998j2067
$$ 538792 426260 360440 313666 281692 280432 260426 241238 225209 209676 216805 224803 212736
10243B12736k9964j9316q370r34k0588q405J7398j4152j1249j8904P609J9871
$$ 212736 182772 163456 155086 154152 133564 125159 142557 128405 117156 98252 105861 125732
10231A25732q97j1140J1897K399j5306j361j0886M64j2451j5360p265o577k7646
$$ 125732 124835 113695 125592 127991 112685 111324 100438 100902 88451 73091 65826 59249 31603
10218C1603k7118k1308R142P180j5662l091J9654J7590K278K0414K3094q697j1473
$$ 31603 4485 -16823 -7681 -501 -16163 -19254 400 17990 20268 40682 63776 55079 43606
10205D3606j304J0123n417n866Q420K004J8515N944q42r88l1969p879p032J5546
$$ 43606 42302 52425 47008 41142 49562 51566 70081 76025 75183 74195 42226 34347 27315 42861
10191D2861J3126j3842j3958p060j3999J0083J832k1909j543O016J343p659q905
$$ 42861 55987 42145 28187 21127 7128 17211 19043 -2866 -4409 1607 2950 -4709 -13614
10178a3614p798J2098P041J1304K423j114j3754o115Q440l789j15J513J2677O066
$$ -13614 -21412 -9314 -2273 9031 11454 10340 -3414 -9529 -1089 -4878 -4993 -3480 9197 15263
10164A5263K0230K0479J2457M461j3404j9447N487P648m15m507j6778r349J8378
$$ 15263 35493 55972 68429 72890 59486 40039 45526 53174 52759 48252 31474 22125 40503
10151D0503K1914P436k4086k1519k057Q297J5345K5362J6156j0615o364J586o20
$$ 40503 62417 69853 45767 24248 22191 30488 45833 71195 87351 76736 70372 71958 71338
10138G1338N117J6917J2952j2745k3166J3106K347L565l072J3816K2162J1979
$$ 71338 76455 93372 106324 93579 70413 83519 85866 89431 86359 100175 122337 134316
10126A34316j1165J4334J9868J2066K0910L4352O8470O7975N3193J35484J99453
$$ 134316 123151 137485 157353 169419 190329 224681 293151 361126 414319 549803 749256
10115G49256K68220K79998J53368J30312J89259K19689J06850o8652k42709k46587
$$ 749256 1017476 1297474 1450842 1581154 1770413 1990102 2096952 2028300 1785591 1539004
10105A539004j21998j04609k57801k92680k10775j40436r3659l9648l5241j9960
$$ 1539004 1417006 1312397 1054596 761916 551141 410705 317046 277398 242157 222197
10095B22197p438j6931j1829j0287O642j886j7819q667J0620K1836J0407P441
$$ 222197 214759 197828 185999 175712 182354 180468 162649 153982 164602 186438 196845 204286
10083B04286P175j9594j4078q622k585l156j4560J315L582k2339j7728P078K5594
$$ 204286 211461 191867 177789 169167 166582 163426 148866 150181 153763 131424 113696 120774 146368
10070A46368J2011k6611j9515L597J1984Q290N499j57j6832p128L977j4190K509
$$ 146368 158379 131768 112253 115850 127834 136124 141623 141466 124634 117506 121483 107293 109802
10057A09802J3110J3346J884J4473J5852K086J3645L176J1370Q544N292M0737
$$ 109802 122912 136258 138142 152615 168467 170553 184198 187374 198744 207288 212580 253317
10045B53317O8806N2205O7000J04860J94137K54968M24863N65757L06813m5046
$$ 253317 322123 374328 441328 546188 740325 995293 1420156 1985913 2292726 2247680
10035B247680r6956n4457N2525J17551k77637o05734m25584k44624j35224j00829
$$ 2247680 2150724 2096267 2148792 2266343 1988706 1382972 957388 712764 577540 476711
10025D76711p0136o3526m0894k0301j3635k0278j3314j3250j5610j717j1704k7976
$$ 476711 406575 343049 302155 281854 268219 247941 234627 221377 205767 204050 192346 164370
10013A64370j1454j9169j0788l098j7196p179j0202N938q777j6024L425J0559
$$ 164370 152916 133747 122959 119861 102665 95486 85284 91222 82445 66421 69846 80405
10001H0405R097j0718N818Q734k478j3517O92q474o267k102j249N609j339j2829
$$ 80405 89502 78784 84602 93336 90858 77341 78033 69559 63292 61190 59941 65550 64211 51382
9987E1382m703R851n204P172j041J4567l105j1351j2629M303j8973k325J7299
$$ 51382 46679 56530 51326 58498 57457 72024 68919 57568 44939 49242 30269 27944 45243
9974D5243o3j4102j6515O55o920m285P362R147J4039P847j3967k2565j716J8496
$$ 45243 45180 31078 14563 15218 8298 4013 11375 20522 34561 42408 28441 5876 4160 22656
9960B2656n673q139Q94Q900l985o953K1665J9022j5428k6030J775K687R038j949
$$ 22656 16983 8844 9738 18638 14653 7700 29365 48387 32959 6929 8704 11391 20429 18480
9946A8480r860m270J2088J4288q71j3061j2729Q473M975N00l971j694P093j1464
$$ 18480 8620 4350 16438 30726 29855 16794 4065 12538 17513 18013 14042 12348 19441 7977
9932G977j1692J5577R765L248l729k196n558J0444J4225j961M09J0743J2937L671
$$ 7977 -3715 11862 21627 24875 21146 18950 13392 23836 38061 36100 36509 47252 60189 63860
9918F3860j425j997k2138k4089k532L539K172m067M639q024l023J5802Q04j422
$$ 63860 62435 60438 38300 14211 11679 15218 17390 13323 17962 9938 6915 22717 23521 22099
9904B2099J870K270N816L998k337N897K041k2714P651M975o217j2321j0185J1457
$$ 22099 23969 26239 32055 36053 33716 39613 41654 18940 26591 31566 25349 13028 2843 14300
9890A4300K366q724j7546j830J8557N897r871J2292r557j6326M604M478l729k676
$$ 14300 16666 7942 -9604 -11434 7123 13020 3149 15441 5884 -10442 -5838 -1360 -5089 -7765
9876g765N998M015R161l076L78j0438J84Q209J6215q412l381j5578l565P170j4181
$$ -7765 -1767 2248 11409 8333 8711 -1727 -1543 6666 22881 14469 11088 -4490 -8055 -885 -15066
9861a5066K573J1998N488n884L623l79J4353J5401l509n626L496J742j1236P925
$$ -15066 -12493 -495 4993 -891 2732 2353 16706 32107 28598 22972 26468 28210 16974 24899
9847B4899k49P787R067N678j371j6349j3259j8763l29K0668k813j0823j1966k4997
$$ 24899 24650 32437 41504 47182 45811 29462 16203 -2560 -2889 17779 14966 4143 -7823 -32820
9833c2820n775J7126K3202N180J3395J5888M362Q874j5333j4752o954j699q14
$$ -32820 -38595 -21469 1733 6913 20308 36196 40558 49432 34099 19347 12393 10694 9880
9820I880O767J1486R565j6594q180N332M374j8555l311M604K2307j4782k167J1656
$$ 9880 16647 28133 37698 21104 12924 18256 22630 4075 764 5368 27675 12893 10726 22382
9806B2382l877j1611j3137l063j2209J305M912L979k5678J2498L9490l584j6336
$$ 22382 18505 6894 -6243 -9306 -21515 -20210 -15298 -11319 -36997 -24499 14991 11407 -4929
9793d929J0983O652k615k867j7611j897K3692K9844L0002L5916M2812N2682L7317
$$ -4929 6054 12706 10091 7224 -10387 -12284 11408 41252 71254 107170 149982 202664 239981
9780B39981L319j1975p261n051P879l5640n0306o4462m1761k4933O932J2473O860
$$ 239981 243300 231325 224064 219013 226892 191252 140946 76484 34723 9790 16722 29195 36055
9767C6055k810J262J214J1459J0933P506o44j541j4222j2036Q207k4584q163J1430
$$ 36055 33245 34507 35721 47180 58113 65619 64975 63434 49212 37176 45383 20799 12636 24066
9753B4066M851j5698P014m063j4352j7024l479K1055J5254o920k872l865M115
$$ 24066 28917 13219 20233 16170 1818 -15206 -18685 2370 17624 10704 7832 3967 8082
9740H082J796K524M287o865j0730M33n955o619M282L316P272J71J0683l44J0413
$$ 8082 9878 12402 16689 9824 -906 -473 -6428 -13047 -8765 -5449 1823 1994 12677 12333 22746
9725B2746q80k1105k735J0663n285m896n715K826N425M421j9087j0756J4644M092
$$ 22746 21866 761 -1974 8689 3404 -1492 -7207 -4381 1044 5465 -13622 -24378 -9734 -5642
9711e642p051N151j48l584j434k451J4978J9660J504k3699j7536k82P721J586
$$ -5642 -12693 -7542 -7690 -11274 -12708 -15159 -181 19479 20983 -2716 -20252 -20534 -12813 -11227
9697a1227j3693R491J2006L693N72p469N064K004J5621k304R8o409l744n229j5847
$$ -11227 -24920 -15429 -3423 270 842 -6627 -1563 441 16062 13758 13856 7447 3703 -1526 -17373
9682a7373m188N210m108j3571P846J3797L225P755O659m539L88J7248J2845q148
$$ -17373 -21561 -16351 -20459 -34030 -26184 -12387 -9162 -1407 5252 713 1101 18349 31194 23046
9668B3046j6711M67K049l996K51p179l626j2477j1464k433M470J5591J7918n848
$$ 23046 6335 6802 8851 4855 5106 -2073 -5699 -18176 -29640 -32073 -27603 -12012 5906 58
9654E8m265o876k212j1361Q744P313j1244k623o162J4304O824j5861l27M726N713
$$ 58 -4207 -11083 -13295 -24656 -15912 -8599 -19843 -22466 -28628 -14324 -7500 -23361 -23688 -18962 -13249
9639a3249j1397K0037M482l0435n066q682j455J2091K3408K1530J2721j561R01
$$ -13249 -24646 -4609 -127 -30562 -35628 -44310 -45765 -33674 -10266 11264 23985 22424 23325
9626B3325k852j702j5713k1414q679K5950O250r183P573J489P36r24j7753j9588
$$ 23325 20473 18771 3058 -18356 -27035 -1085 5165 -4018 3555 5044 5780 4856 -12897 -32485
9612c2485R250J3776k889N970j059O575L936J910j5591j1649J386m305N521K902
$$ -32485 -23235 -9459 -12348 -6378 -7437 -862 3074 4984 -10607 -22256 -20870 -25175 -19654 -16752
9598a6752P303J3552M056K9l322R659J2774j8624N661J1811q241k6560j0333j3816
$$ -16752 -9449 4103 8159 8188 4866 14525 27299 8675 14336 26147 17906 -8654 -18987 -32803
9584c2803j1626J2991J0251m859M555o666P362K4851J8043o342r07j697L799q75
$$ -32803 -44429 -31438 -21187 -26046 -21491 -28157 -20795 4056 22099 15757 14850 13153 16952 16077
9570A6077k664K699r349j0952k0346k583L475J5325l092Q337J3945R644L988K232
$$ 16077 13413 16112 6763 -4189 -24535 -27118 -23643 -8318 -11410 -3073 10872 20516 24504 26736
9556B6736l128m255j6851p086j3755J6645n643J0751J8943k450k905J1718K448
$$ 26736 23608 19353 2502 -4584 -18339 -1694 -7337 3414 22357 19907 17002 28720 31168
9543C1168q213k759j0344j678J49j1827m149R809j476J547q699o429j5971k1633
$$ 31168 22955 20196 9852 8174 8323 -3504 -7653 2156 680 2227 -6472 -12901 -28872 -50505
9529e0505J3431K8193J3920P623Q875j3973n523J937O976q152J3554P182m332
$$ -50505 -37074 -8881 5039 12662 21537 7564 2041 3978 10954 2802 16356 23538 19206
9516A9206L142m424j817j2961M841J357J2978J5380k8881j8552r900r458Q036
$$ 19206 22348 17924 16107 3146 7987 9344 22322 37702 8821 -9731 -19631 -29089 -21053
9503b1053J3567L284J277J4611k46k172l540M513m884k401n417m159J2593q915
$$ -21053 -7486 -4202 -2925 11686 11440 9268 5728 10241 5357 2956 -2461 -6620 5973 -2942
9489b942j9061J2462J2240j2811j5513J2777J4808J1228O977j364J882k821j0297
$$ -2942 -22003 -9541 2699 -10112 -25625 -12848 1960 13188 20165 18801 20683 17862 7565
9476G565j6630K322p43j0824K1216O621J649j320n698m560m01m025J508Q519o091
$$ 7565 -9065 -6743 -7486 -18310 2906 9527 11176 9856 4158 -402 -803 -4828 -3320 5199 -892
9461h92k114k253J0292J8246k466j5356q722O196J8670j0511q860L2j2208l99
$$ -892 -3006 -5259 5033 23279 20813 5457 -3265 2931 21601 11090 2230 2262 -9946 -10345
9447a0345J4548K896l55l594N262R852L123J8144R782R024k1037k0101k133J5262
$$ -10345 4203 7099 6744 3150 8412 18264 21387 39531 49313 58337 37300 17199 15066 30328
9433C0328m427r256n924j4606J96Q202J5154j0470p427O465N926P590l006M82
$$ 30328 25901 16645 10721 -3885 -3689 4513 19667 9197 1770 8235 14161 21751 18745 19227
9419A9227j5685L947J1260L262O746r465o365J1715P203r932j0510P872J949j3109
$$ 19227 3542 7489 18749 22011 28757 19292 12927 24642 31845 21913 11403 19275 21224 8115
9405H115o083J2300J6338M92R366K600q741J8179J8145j5837j1044o782l581k3722
$$ 8115 2032 14332 30670 31162 40528 43128 34387 52566 70711 54874 43830 37048 33467 9745
9391I745j7282M973J2540P758p054P756J7719Q704n493j1828Q131N915O880M579
$$ 9745 -7537 -2564 9976 17734 10680 18436 36155 44859 39366 27538 35669 41584 48464 53043
9377E3043n995n848j2125m862J422N76L580M120j1802k802n833j3779l37P40J0885
$$ 53043 47048 41200 29075 24213 25635 26211 29791 33911 22109 19307 13474 -305 -642 98 10983
9362A0983O159J869J3581J0045J5347J0364j4691K057p703p452k568p417J4104
$$ 10983 17142 19011 32592 42637 57984 68348 53657 55714 48011 40559 37991 30574 44678
9349D4678K2739M894j0504j9367K517r636J2467R810J6317j762j2538r264j7760
$$ 44678 67417 72311 61807 42440 44957 35321 47788 57598 73915 72153 59615 50351 32591
9336C2591J2284R317k412j0689o214n20K0000K6248o630l4720j7982P87L013J1349
$$ 32591 44875 54192 51780 41091 34877 34357 54357 80605 73975 39255 21273 22060 25073 36422
9322C6422P218J3372j956L013L210P370P124J822r174j2803n800Q739q3n694P153
$$ 36422 43640 57012 55056 58069 61279 68649 75773 77595 68421 55618 49818 58557 58474 52780 59933
9307E9933J1351j1716j7771j550O9L241N889p34p106J427J2474J8901J7028k319
$$ 59933 71284 59568 41797 40247 40316 43557 49446 48712 41606 43033 55507 74408 91436 89117
9293H9117J555o7J0595J3080L642M481k0153j9329J4249K041M735o837L78J4831
$$ 89117 90672 90605 101200 114280 117922 122403 102250 82921 97170 99211 103946 97109 97487 112318
9279A12318m810j664O186k265K289q614j6442Q547K0322j3532J0196O139P254
$$ 112318 107508 105844 112030 109765 112054 103440 86998 95545 115867 102335 112531 118670 125924
9266A25924p44J3963J6787j1309l076p991n376j086J8445K5292N087j0986l828
$$ 125924 125180 139143 155930 144621 141545 133554 128178 127092 145537 170829 175916 164930 161102
9253A61102L959O151n073j4497k88J2782L811k105O586L679m367o940J7607J8259
$$ 161102 165061 171212 166139 151642 151354 164136 167947 165842 172428 176107 171740 164800 182407 200666
9239B00666J1432M646k703p645J9088J3580p490j1290J2836J4676M588j1601P480
$$ 200666 212098 216744 214041 206396 225484 239064 231574 220284 233120 247796 252384 240783 248263
9226B48263J2115r128M049K6976l093j1782K4395K2271J2997P560J9259j0157
$$ 248263 260378 251250 255299 282275 279182 267400 291795 314066 327063 334623 353882 343725
9214C43725j3387O032j0162J9481K7415L3795N207j1334k1697J0554L8153O820
$$ 343725 330338 336370 326208 345689 373104 406899 412106 400772 379075 389629 427782 434602
9202D34602p2M780J91k781k58J5874J0645J0133K447q025J427M812K2846O812
$$ 434602 434530 439310 439501 436720 436462 452336 462981 473114 475561 467536 468963 473775 496621 503433
9188E03433Q537O894o017j6757O488O774o688J0990J0050o800o036j8798J972
$$ 503433 511970 518864 512847 496090 502578 509352 502664 513654 523704 516904 510868 492070 494042
9175D94042j777n747J5424J408o055j3574j9822n026j2524o394j0896n329R156
$$ 494042 492265 486518 501942 503350 497295 483721 463899 458873 446349 439955 429059 423730 432886
9162D32886P109M91j1972o194O737p757o077j1918k0236k9636L508L044q974j5757
$$ 432886 439995 440486 428514 422320 429057 421300 415223 403305 383069 353433 356941 359985 351011 335254
9148C35254n92J6805l132j1911k2095K011n052k4643r354L019l935J2488J4196
$$ 335254 334662 351467 348335 336424 314329 316340 311288 286645 277291 280310 276375 288863 303059
9135C03059j5336j1952q079r480j4470r621q289r064O841K834N325R894j1892
$$ 303059 287723 275771 267692 258212 243742 234121 225832 216768 223609 226443 231768 241662 229770
9122B29770k0800j5178p597J0239N989m100j880j1908Q0R526J916k1505j4373
$$ 229770 208970 193792 186195 196434 202423 198323 196443 184535 184615 194141 196057 174552 160179
9109A60179j449J087R311j0503q942R284r464m117K39m930n601Q06q249l263m900
$$ 160179 158730 159817 169128 158625 149683 158967 149503 145386 145625 140695 135094 135900 127651 124388 119488
9094A19488k2821P109Q340j2923J5232J0642j9436J0341n556Q09o770N281o219
$$ 119488 96667 103776 112116 99193 114425 125067 105631 115972 110416 111225 104455 109736 103517
9081A03517m308o640m712R900L707k1695m971J3848J1987n639k0937r151M007
$$ 103517 99209 92569 87857 97757 101464 79769 74798 88646 100633 94994 74057 64906 68913
9068F8913m604q594L728N015J4264J6911N201m360j0111j4180l232N146j1865
$$ 68913 64309 55715 59443 64458 78722 95633 100834 96474 86363 72183 68951 74097 62232
9055F2232k717j872J3654J1439o12L028j3659j1834R00R012K25n180j7196l528
$$ 62232 59515 57643 71297 82736 82124 85152 71493 59659 60559 69571 69796 64616 47420 43892
9041D3892l02r508Q38M884n276J2004K6039J1197j4347L05r530J077K993p879
$$ 43892 43590 34082 34920 39804 34528 46532 72571 83768 69421 69726 60196 61273 64266 56387
9027E6387q087j2650q459J8014n360k1382J283K0341M875m887k663R330K536j8196
$$ 56387 48300 35650 27191 45205 39845 18463 19746 40087 44962 40075 37412 46742 49278 31082
9013C1082k3004p964J1980R360J8147P216r790k647j611q866R204J7269L478o646
$$ 31082 8078 114 12094 21454 39601 46817 37027 34380 32769 23903 33107 50376 53854 47208
8999D7208l1046l815j192J4932p25n22O494J2024j4060p446j150M370n268l108
$$ 47208 16162 12347 11155 26087 25362 24840 31334 43358 29298 21852 20702 25072 19804 16696
8985A6696J2804J0803m988j4077j101N434j993M484j1788q750k842K6257N51j0127
$$ 16696 29500 40303 35315 21238 20137 25571 23578 28062 16274 7524 4682 30939 31490 21363
8971B1363p066J1485R441o461M741J245o96M22j3978n541j180M988N769j0883
$$ 21363 14297 25782 35223 28762 33503 34748 34052 34474 20496 14955 13775 18763 24532 13649
8957A3649j9918j1664N253J1760J4175L292L36r376J3976K4n006J2215J5010j4363
$$ 13649 -6269 -17933 -12680 -920 13255 16547 16883 7507 21483 21507 16501 28716 43726 29363
8943B9363j4038q379N749K268q79n160Q904R9p816L161O28K258K5185J3036n713
$$ 29363 15325 6946 12695 14963 14084 8924 17828 17927 10111 13272 13900 16158 41343 54379 48666
8928D8666p17j1616l6985l984L059R314R970Q748N399l276M054j1827p301L825
$$ 48666 47949 36333 -652 -4636 -1577 7737 17707 26455 31854 28578 32632 20805 13504 17329
8914A7329j7030J0446M8865J6229m3258l1765j1577k538N500J0863M485m386n648
$$ 17329 299 10745 59610 75839 32581 816 -10761 -13299 -7799 3064 7549 3163 -2485
8901b485l312K044J2429k266J1958q618m497o395l019J8237J0840j8333l587l447
$$ -2485 -5797 -3753 8676 6410 18368 9750 5253 -1142 -4161 14076 24916 6583 2996 -451
8887d51K2903K7971K432k2085j1902L757L119P868m119j6322j5535r377P672J1814
$$ -451 22452 50423 52855 30770 18868 22625 25744 33612 29493 13171 -2364 -11741 -4069 7745
8873G745j085j946Q60J712O460J1220r782J2760Q660j2580k905r029P185J2171
$$ 7745 6660 4714 5574 7286 13746 24966 15184 27944 36604 24024 21119 12090 19275 31446
8859C1446J9305n998j6487j8094n176N566J1809P622j755J3015n769j5668r90
$$ 31446 50751 44753 28266 10172 4996 10562 22371 29993 28238 41253 35484 19816 18826
8846A8826r742l918N806J4329J4581k891O754l405P754R822K708m459j2466O583
$$ 18826 9084 5166 10972 25301 39882 36991 43745 40340 48094 57916 60624 56165 43699 50282
8832E0282j912j4654r727J355p244K802N44L473k542o252p485j1742j260K8380
$$ 50282 48370 33716 23989 25344 18100 20902 21446 24919 22377 16125 8640 -3102 -4362 24018
8818B4018J8064m538n452j4235j324j482q462p99J7264K772J066m366p055L935
$$ 24018 42082 37544 32092 17857 16533 15051 6589 5790 23054 25826 26892 22526 15471 19406
8804A9406k898Q144m768j6379q638J3953M412l435Q384K844o267K2060J2631o521
$$ 19406 16508 24652 19884 3505 -5133 8820 13232 9797 18181 21025 14758 36818 49449 42928
8790D2928J627j1819k5418M425J530j9445m404J5230J2584L891J3659L425L991
$$ 42928 44555 32736 7318 11743 13273 -6172 -10576 4654 17238 21129 34788 38213 42204
8777D2204j5939j8867n706L707k192m271k2718j390J7810L307R909o303P811J928
$$ 42204 26265 7398 1692 5399 3207 -1064 -23782 -25172 -7362 -4055 5854 -449 7362 9290
8763I290j8748N403O386O72j3732r708k610R94R98O100J0385L630L992J2716L280
$$ 9290 -9458 -4055 2331 3003 -10729 -20437 -23047 -22053 -21055 -14955 -4570 -940 3052 15768 19048
8748A9048k573J5163J0597K879K148J3172p916K398N079o662m400q830j286o169
$$ 19048 16475 31638 42235 45114 47262 60434 52518 54916 59995 53333 48933 40103 38817 32648
8734C2648j8741n761M602R069N802k2058j4018J135J662l056J0980O123j3008
$$ 32648 13907 8146 12748 21817 27619 5561 -8457 -7322 -5660 -8716 2264 8387 -4621
8721d621O268j805j834J0832J1270J034L890M438j3440j8104J2539O790j9025
$$ -4621 1647 -158 -1992 8840 20110 21144 25034 29472 16032 -2072 10467 17257 -1768
8708a768o39k671n387j7512K8065Q517q715J88K6185J1568m257j0148J5454k454
$$ -1768 -2407 -5078 -10465 -27977 88 8605 -110 78 26263 37831 33574 23426 38880 36426
8694C6426l856M962j1923J302m761j2609l677Q829J2586l967m516k625J6978K110
$$ 36426 32570 37532 25609 26911 22150 9541 5864 14693 27279 23312 18796 16171 33149 35259
8680C5259q873k469P649k339l507M359j0350j7129N468K3362l553j0968j021K3262
$$ 35259 26386 23917 31566 29227 25720 30079 19729 2600 8068 31430 27877 16909 15888 39150
8666C9150O611J4362j1625j6910l486l132j215o7j2409J3248J4870J1786n612
$$ 39150 45761 60123 48498 31588 28102 24970 23755 23688 11279 24527 39397 51183 45571
8653D5571k0313J1583Q787L28q982r556k2141J829p122j409J2735J5609O270O850
$$ 45571 25258 36841 45628 45956 36974 27418 5277 7106 -16 -1425 11310 26919 33189 40039
8639D0039l133j3319j3011J988L581j4914k1551R612K6927O303j346J1726P85
$$ 40039 36906 23587 10576 12564 16145 1231 -20320 -10708 16219 22522 21176 32902 33687
8626C3687J4517N001q593n000j3337k930O570k4069J5630J1780o608k978M21R68
$$ 33687 48204 53205 44612 39612 26275 23345 29915 5846 21476 33256 26648 23670 24091 25059
8612B5059P888J1433O291j5004p896P579j8798j722R995k0146q745O282K361n944
$$ 25059 32947 44380 50671 35667 27771 35350 16552 14830 24825 4679 -4066 2216 4577 -1367
8598a367J4123K8066J3913m871N620J4483J0620j5627j6032J5414l532j3829k771
$$ -1367 12756 40822 54735 49864 55484 69967 80587 64960 48928 64342 60810 46981 44210
8585D4210J3063L1563J3981J8941P774R066Q593N738q637l774J2462j3798l2264
$$ 44210 57273 88836 102817 121758 129532 138598 147191 152929 144292 140518 152980 139182 106918
8572A06918j3345m521K848j6635j3322P477K145k6132j3880P948J937k009P157
$$ 106918 93573 89052 91900 75265 61943 69420 71565 45433 31553 39501 41438 39429 46586
8559D6586L414J1576P40j72j1592L258J2974o829k2191q525m480m124K979J48
$$ 46586 50000 61576 62316 62144 50552 53810 66784 59955 37764 29239 24759 20635 23614 23762
8545B3762O904k374l179j8517j6932J4224J0529j4761L853J0225M275J5825n336
$$ 23762 30666 28292 25113 6596 -10336 3888 14417 -344 3509 13734 18009 33834 28498
8532B8498j2946j461o964j3450m5J4511M718j0408mj12k444M197J6673J3223n068
$$ 28498 15552 14091 7127 -6323 -6368 8143 12861 2453 2449 2337 -107 4090 20763 33986 28918
8517B8918k89k2426m825P869l225N993K0025P210j236j8614j40J988M86p190j479
$$ 28918 28629 6203 1378 9247 6022 12015 32040 39250 38014 19400 19260 21248 21734 14544 13065
8502A3065J2076J392m345p587M876K932p24J0250n490K169j6155j6693J8754k393
$$ 13065 25141 26533 22188 14601 19477 22409 21685 31935 26445 28614 12459 -4234 14520 12127
8488A2127J956p811r098j1110J7890L001j0004p041p034p595o095K0717L3162
$$ 12127 14083 6272 -2826 -13936 3954 6955 -3049 -10090 -17124 -24719 -30814 -10097 23065
8475B3065R51k1833j2206K056J7288q520k188k584n824q501J2091J19J0781j0965
$$ 23065 24016 2183 -10023 -7967 9321 801 -1387 -3971 -9795 -18296 -6205 -6086 4695 -6270
8461f270j3035J1467n948j4634J444J657k967n109K692J4460L749N98o395K0931
$$ -6270 -19305 -7838 -13786 -28420 -26976 -25319 -28286 -33395 -30703 -16243 -12494 -11896 -18291 2640
8447B640J4743k989p27K525j4649j9903J1086P260K0434M691m644J733j2299o27
$$ 2640 17383 14394 13667 16192 1543 -18360 -7274 -14 20420 25111 20467 22200 9901 9274
8433I274j60j1970k501o308k12J8309m849o145J73l247P258J182K545j3019K681
$$ 9274 9114 -2856 -5357 -11665 -11877 6432 1583 -4562 -4389 -7636 -378 804 3349 -9670 -6989
8418f989j0931J1881J0547o782J116m74r113J739m378J3472L091p876q633m936
$$ -6989 -17920 -6039 4508 -2274 -1158 -1632 -10745 -9006 -13384 88 3179 -4697 -13330 -18266
8404a8266k32k529J8192J1600p445j3511j889J7307J1738l311k0022j4338J1842
$$ -18266 -18498 -21027 -2835 8765 1320 -12191 -14080 3227 14965 11654 -8368 -22706 -10864
8391a0864l765O002J288R719J401j5936j3863n90K1698R87j0852j0904P33J341
$$ -10864 -14629 -8627 -7339 2380 3781 -12155 -26018 -26608 -4910 -3923 -14775 -25679 -24946 -23605
8377b3605K698J8770P553Q951j3669j0861J519M523l390J3053j0736j0384j2664
$$ -23605 -20907 -2137 5416 14367 698 -10163 -8644 -4121 -7511 5542 -5194 -15578 -28242
8364b8242K37J4722J7261Q02Q111q086j8488o269O42J5217M539l159j0013j552
$$ -28242 -28005 -13283 3978 4780 12891 4805 -13683 -19952 -19310 -4093 446 -2713 -12726 -14278
8350a4278L768M090J289k18k630K2792M779r169K792m366p057l020q699j552Q840
$$ -14278 -10510 -6420 -5131 -5349 -7979 14813 19592 10423 13215 8849 1792 -1228 -9927 -11479 -2639
8335b639K392N278N71M386n686M962P812j5206r652Q250r808M561j1970K947p605
$$ -2639 -247 5031 5602 9988 4302 9264 17076 1870 -7782 468 -9340 -4779 -16749 -13802 -21407
8320b1407O342m059q913J3321K0973K717j2918J1432N624j5213j9661k940J510
$$ -21407 -15065 -19124 -28037 -14716 6257 8974 -3944 7488 13112 -2101 -21762 -24702 -23192
8307b3192o453K321J890n17P01n737o674J5285J0681L222R071J3276j4935K660
$$ -23192 -29645 -27324 -25434 -25951 -25250 -30987 -37661 -22376 -11695 -8473 598 13874 -1061 1599
8293A599R057J273K404k1797n278O355K385j184k046N004J7022M949k1588j1093
$$ 1599 10656 11929 14333 -7464 -12742 -6387 -4002 -5186 -7232 -2228 14794 19743 -1845 -12938
8279a2938J604k071k422p180L147J5644J2565O736K183k1167O900K2276J3273
$$ -12938 -11334 -13405 -15827 -23007 -19860 -4216 8349 15085 17268 -3899 3001 25277 38550
8266C8550j7865R446J5714j7212k2682j4294n825l387l023P044K0287J1611n498
$$ 38550 20685 30131 45845 28633 5951 -8343 -14168 -17555 -20578 -13534 6753 18364 12866
8253A2866j3048k0912K282K1863J0589j9715j1798M81J7823J5250J1129j4806
$$ 12866 -182 -21094 -18812 3051 13640 -6075 -17873 -17392 431 15681 26810 12004
8241A2004M705J0388j2422j3293L790J8164j102M920l289j695K542k067J01r946
$$ 12004 16709 27097 14675 1382 5172 23336 22234 27154 23865 22170 24712 22645 22746 12800
8227A2800p779q401L400r723p69j449q063J40J53k614M055Q129Q551q709n531
$$ 12800 5021 -3380 20 -9703 -10472 -11921 -19984 -19844 -19691 -22305 -18250 -10121 -1570 -10279 -15810
8212a5810L305J0021l029j2162M912J408L912j2778J8521K0002L713j5411j4051
$$ -15810 -12505 -2484 -5513 -17675 -12763 -11355 -7443 -20221 -1700 18302 22015 6604 -7447
8199g447l593j0051j751J2758K0695J1353p964P587q737m664k0243j5857K405
$$ -7447 -11040 -21091 -22842 -10084 10611 21964 14000 21587 12850 8186 -12057 -27914 -25509
8186b5509j1036Q757K9044j1959m841R057Q247J2942q840p505J9292J6465J0316
$$ -25509 -36545 -27788 1256 -10703 -15544 -6487 1760 14702 5862 -1643 17649 34114 44430
8173D4430P842j7112l0565j207J7545j4383j6533P536J3097k78k4844P995J6691
$$ 44430 52272 35160 4595 3388 20933 6550 -9983 -2447 10650 10372 -14472 -6477 10214
8160A0214J725J759o084o125J911j411j696J6749o093k810l681J7702O330n39
$$ 10214 11939 13698 7614 1489 3400 1989 293 17042 10949 8139 4458 22160 28490 27951
8146B7951O934j1886l73j3549J744n129J0960K732N464J2741j381p976j2030j4270
$$ 27951 34885 22999 22626 9077 10821 5692 16652 19384 24848 37589 36208 28232 16202 1932
8132A932N792m182k5019P907J6498j0852K613o543p892O525J25p877n94Q797L180
$$ 1932 7724 3542 -21477 -13570 2928 -7924 -5311 -11854 -19746 -13221 -13096 -20973 -21567 -12770 -9590
8117i590P020J976j1079k926J1109m649m556J0528J199K92K841J1660m270j5658
$$ -9590 -2570 -594 -11673 -14599 -3490 -8139 -12695 -2167 -968 -676 2165 13825 9555 -6103
8103f103n640K959K1385n072n550j5291r75m203p442N333P578J3066q893j8528
$$ -6103 -11743 -8784 12601 7529 1979 -13312 -14287 -18490 -25932 -20599 -13021 45 -8848 -27376
8089b7376o806Q895O446K680L422K334N730n65K911k761j3721J5022k1055p290
$$ -27376 -34182 -25287 -18841 -16161 -12739 -10405 -4675 -5240 -2329 -5090 -18811 -3789 -24844 -32134
8075c2134J1936M35o488J2241J6970P839l487J033m860R377j0140j4299j0730
$$ -32134 -20198 -19763 -26251 -14010 2960 10799 7312 8345 3485 12862 2722 -11577 -22307
8062b2307j5777N204K0091l173n376J7223J0336N227j171o987j0550j3175J1643
$$ -22307 -38084 -32880 -12789 -15962 -21338 -4115 6221 11448 10277 3290 -7260 -20435 -8792
8049h792J0928r328r45J7766P48O903j115j5131j9237n071J2525J8885n885R009
$$ -8792 2136 -7192 -8137 9629 10377 17280 16165 1034 -18203 -23274 -10749 8136 2251 11260
8035A1260L602K087n778Q783L66j277l895j954j1059o274R51O185R891O644j8188
$$ 11260 14862 16949 11171 19954 20320 19043 15148 13194 2135 -4139 -3188 2997 12888 19532 1344
8020A344o997R016q89M213j5183N695J7033K669n788l580P217R189R570j2269
$$ 1344 -5653 3363 2474 6687 -8496 -2801 14232 16901 11113 7533 14750 23939 33509 21240
8006B1240J903p404j7068P847P356j0203j7580O182Q275P460N637L338j7722o714
$$ 21240 23143 15739 -1329 6518 13874 3671 -13909 -7727 548 8008 13645 16983 -739 -7453
7992g453R197M806K815Q851j4846r233J5397M140Q113J0945j360K596J0993K545
$$ -7453 1744 6550 9365 18216 3370 -5863 9534 13674 21787 32732 31372 33968 44961 47506
7978D7506j1373J828O62k3689j9990J1036J4048J0598J711j7157q632j2741L796
$$ 47506 36133 37961 38623 14934 -5056 5980 20028 30626 32337 15180 6548 -6193 -2397
7965b397o67N535K280l36j796j393r16K2670J4572K219J8326K215j4736j6170
$$ -2397 -3064 2471 4751 4415 2619 1226 310 22980 37552 39771 58097 60312 45576 29406
7951B9406J1443J6830n619l495k800J9440q639j3575J09j8279l276Q772L341k507
$$ 29406 40849 57679 52060 48565 45765 65205 56566 42991 43100 24821 21545 30317 33658 31151
7937C1151M523j6567j5730Q369J0617J223p940J1058l21j0811j147L161j0986
$$ 31151 35674 19107 3377 11746 22363 23586 15646 26704 26383 15572 14425 17586 6600
7924F600j8320J544p51N065J4186J8894n404J692n998m527j6470O196M477j0347
$$ 6600 -11720 -10176 -10927 -5862 8324 27218 21814 23506 17508 12981 -3489 2707 7184 -3163
7910c163Q337N898n972j4633O265J0728K018jK246j1036k373N954J880N754J0078
$$ -3163 5174 11072 5100 -9533 -3268 7460 9478 9477 11723 687 -1686 4268 6148 11902 21980
7895B1980j745r170L068r382j0843L8n641J4069M884m749K641j5288p298M364
$$ 21980 20235 11065 14133 4751 -6092 -6054 -11695 2374 7258 2509 5150 -10138 -17436 -13072
7881a3072k087J0166j3696j7606K081J3598J1167K8154Q849O481l456j6548p208
$$ -13072 -15159 -4993 -18689 -36295 -34214 -20616 -9449 18705 27554 34035 30579 14031 6823
7868F823k016n937k911N920L205O608n892o350L143J1939j5580L724J3661j4398
$$ 6823 4807 -1130 -4041 1879 5084 11692 5800 -550 2593 14532 -1048 2676 16337 1939
7854A939j6639J920P792k991O137m307j1037J313N814j0464l314L564J9083M145
$$ 1939 -14700 -12780 -4988 -7979 -1842 -6149 -17186 -15873 -10059 -20523 -23837 -20273 -1190 2955
7840B955o898J1535J17O247j5395J059l497J0084Q625l309k815k337P291Q154
$$ 2955 -3943 7592 7709 13956 -1439 -380 -3877 6207 14832 11523 8708 6371 13662 21816
7826B1816m006l039O328j5101j8378J1017J37J198m315j8376j2249J5696J7873
$$ 21816 17810 14771 21099 5998 -12380 -1363 -1226 -28 -4343 -22719 -34968 -19272 -1399
7813a399K1160o018k0574J251K906M626j9r12j0294j8150P852K220P835p324J071
$$ -1399 19761 13743 -6831 -5580 -2674 1952 1933 1021 -9273 -27423 -19571 -17351 -9516 -16840 -15769
7798a5769P649K116j398j5q648J3576J6048J0838N1j2917j7413q444R406K2365
$$ -15769 -8120 -6004 -7402 -7417 -16065 -2489 13559 24397 24448 11531 -5882 -14326 -4920 17445
7784A7445o704J285L394j9960k6542M818L618R942Q235R273M549M365L991k727
$$ 17445 10741 12026 15420 -4540 -31082 -26264 -22646 -12704 -4469 4804 9353 13718 17709 14982
7770A4982n508r117K249O076k489n057M645J469K52J1144l4474J199J7892L392
$$ 14982 9474 357 2606 8682 6193 1136 5781 7250 7502 18646 -15828 -14629 3263 6655
7756F655N420q490j754o573k6405M191O920J6036N656r027l590l562R377j8190
$$ 6655 12075 3585 1831 -4742 -31147 -26956 -20036 -4000 1656 -7371 -10961 -14523 -5146 -23336
7742b3336j3834j665J0677J0087j97n083k470j5598J4799J4266N779l506j51K0300
$$ -23336 -37170 -38835 -28158 -18071 -18268 -23351 -25821 -41419 -26620 -12354 -6575 -10081 -10232 10068
7728A0068o360j6212n034Q591p615L439N64J2806J5612k6493j9034n340K597J2587
$$ 10068 3708 -12504 -17538 -8947 -16562 -13123 -12559 247 15859 -10634 -29668 -35008 -32411 -19824
7714a9824J1548j993j8195m428k059K098O017P833K9366P443q524n577J0459J39
$$ -19824 -8276 -10269 -28464 -32892 -34951 -32853 -26836 -19003 10363 17806 9282 3705 14164 14303
7700A4303k2509p291J0565J0451l219K246R223M222j08j2707j1320p781k210l98
$$ 14303 -8206 -15497 -4932 5519 2300 4546 13769 17991 17883 5176 -6144 -13925 -16135 -16533
7686a6533j73R285P179p883M158j5198o5K240k1776o418J5429J7414J9261J6313
$$ -16533 -16706 -7421 -242 -8125 -3967 -19165 -19230 -16990 -38766 -45184 -29755 -12341 6920 23233
7672B3233J878r315j7577j7315P586N898O787O717M563o548o956K302m167O223
$$ 23233 25111 15796 -1781 -19096 -11510 -5612 1175 7892 12455 5907 -1049 1253 -2914 3309
7658C309J4933p026j8785l2657p396R559L11R367J0334j057J6138J2901K094q029
$$ 3309 18242 11216 -7569 -40226 -47622 -38063 -37752 -28385 -18051 -19108 -2970 9931 12025 3996
7644C996O789L486j847j1859j0644m641k34q830j5065R651K789p409J0557J2556
$$ 3996 10785 14271 12424 565 -10079 -14720 -14954 -23784 -38849 -29198 -26409 -33818 -23261 -10705
7630a0705Q870J1222Q751q382j631j0359m482O940N917L824j3469O379K1973k4385
$$ -10705 -1835 9387 18138 9756 8125 -2234 -6716 224 6141 9965 -3504 2875 24848 463
7616D63k0165Q211M402N150p33O813p246r894r653Q036J6795o875j5745j0321
$$ 463 -19702 -11491 -7089 -1939 -2672 4141 -3105 -12999 -22652 -14616 2179 -4696 -20441 -30762
7602c0762j659P725J5083J1498J0913p623j7830j05J4037k36j019R779r375j9287
$$ -30762 -32421 -24696 -9613 1885 12798 5175 -12655 -12760 1277 1041 22 9801 426 -18861
7588a8861p456P554N219l261M583j021j2038q641k066J1529O204j6485J5382J4024
$$ -18861 -26317 -18763 -13544 -16805 -12222 -13243 -25281 -33922 -35988 -24459 -18255 -34740 -19358 -5334
7574e334r858k0229L895J9577K5983J471p335L781p05j6133P467K576j452j885
$$ -5334 -15192 -35421 -31526 -11949 14034 15505 8170 11951 11246 -4887 2580 5156 3704 1819
7560A819N94m342P547n316l118j1342m469l305M710R687R344J7447N538j9454
$$ 1819 2413 -1929 5618 302 -2816 -14158 -18627 -21932 -17222 -7535 1809 19256 24794 5340
7546E340N29K3503m453n548l580P086j6786p289P495P551j9134L438J6016J5978
$$ 5340 5869 29372 24919 19371 15791 22877 6091 -1198 6297 13848 -5286 -1848 14168 30146
7532C0146j4373k1256J0720j1067j3300P945K3393J3632j2987j6883K17J5044
$$ 30146 15773 -5483 5237 -5830 -19130 -11185 12208 25840 12853 -4030 -3813 11231
7520A1231j7276j0669M549k151K3180m925q383Q049K6028P259l2350j7233p409
$$ 11231 -6045 -16714 -12165 -14316 8864 3939 -4444 3605 29633 36892 4542 -12691 -20100
7507b0100o819k0503J1971K9539K3151l652j1622o314N954J5680R085m568P26
$$ -20100 -26919 -47422 -35451 -5912 17239 13587 1965 -4349 1605 17285 26370 21802 22528
7494B2528j9991O337j6297n132J6096o459j1385J92J4139K079m113P145N4j2178
$$ 22528 2537 8874 -7423 -12555 3541 -2918 -14303 -14111 28 2107 -2006 5139 5193 -6985
7480f985q024j744p143J6928K305o773m995J386J464J9025N505j3271j3690M210
$$ -6985 -15009 -16753 -23896 -6968 -4663 -11436 -16431 -15045 -13581 5444 10949 -2322 -16012 -11802
7466a1802J4835L131M629k1937k2815J056l59J7464J0690J4327K1210r063j0008
$$ -11802 3033 6164 10793 -11144 -33959 -32903 -33262 -15798 -5108 9219 30429 21366 11358
7453A1358M000r830j0777l109m018m341J6291Q906q567M573Q062j8966n121P538
$$ 11358 15358 5528 -5249 -8358 -12376 -16717 -426 8480 -87 4486 12548 -6418 -11539 -4001
7439d001J8542J6509J1427m109j9857p314n677j4772j2758m140O028J2632j420
$$ -4001 14541 31050 42477 38368 18511 11197 5520 -9252 -22010 -26150 -20122 -7490 -8910
7426h910Q342n164O125L516q605l716m303k484J3649Q652j3340r208J3339K14
$$ -8910 -568 -5732 393 3909 -4696 -8412 -12715 -15199 -1550 7102 -6238 -15446 -2107 -1893
7412a893n064J410p429K64M238J1266K347j1239j0156j497N729N603L237J6740
$$ -1893 -6957 -5547 -12976 -12712 -8474 2792 5139 -6100 -16256 -17753 -12024 -6421 -3184 13556
7398A3556o50k192j5724J022J0486Q44O063M548M56k0123k4077j3988J6670O178
$$ 13556 12906 10714 -5010 -3988 6498 7342 13405 17953 18409 -1714 -25791 -39779 -23109 -16931
7384a6931j5505R233J0216L941j759L437j913n904r056l540q149r851J1506J4017
$$ -16931 -32436 -23203 -12987 -9046 -10805 -7368 -9281 -15185 -24241 -27781 -35930 -45781 -34275 -20258
7370b0258L084L01K535J0403Q45o302r53p037M654m278Q400K6289K618M485j9138
$$ -20258 -17174 -16873 -14338 -3935 -3090 -9392 -10345 -17382 -12728 -17006 -8606 17683 20301 24786 5648
7355E648k0506J4472K729o065n646J1886J976j931K336Q531r527N787n934j4948
$$ 5648 -14858 -386 2343 -3722 -9368 2518 4494 2563 4899 13430 3903 9690 3756 -11192
7341a1192m828o02j001n324O973N9l350Q675l758J0675Q956p640j659q691j332
$$ -11192 -16020 -16622 -17623 -22947 -15974 -15915 -19265 -10590 -14348 -3673 5283 -2357 -4016 -12707 -14039
7326a4039R577P698J0726P537o76j2127j668j9608K979J0673p975j4988N278J753
$$ -14039 -4462 3236 13962 21499 20823 8696 7028 -12580 -9601 1072 -6903 -21891 -16613 -14860
7312a4860j8628j0003Q155Q730P156P218J1550P177n948k5705k4303o671J2673
$$ -14860 -33488 -43491 -35336 -26606 -19450 -12232 -682 6495 547 -25158 -49461 -56132 -43459
7299d3459J9919M891J9082j1955j157O180J9473j260j0061J0498q809j3686o507
$$ -43459 -23540 -18649 433 -11522 -12679 -6499 12974 11714 1653 12151 3342 -10344 -16851
7286a6851O882J3455j7477L108J9881j998n218M396n076r529J2366J0076j622
$$ -16851 -9969 3486 -13991 -10883 8998 7000 1782 6178 1102 -8427 3939 14015 12393
7273A2393j736j261O892n591o303J2934j2968j7727j058j2523j029l292M305Q942
$$ 12393 10657 9396 16288 10697 4394 17328 4360 -13367 -14425 -26948 -27977 -31269 -26964 -18022
7259a8022P298l12j016J6176J0185l761j2523q860J6106P082j7608n748O397j1596
$$ -18022 -10724 -11036 -12052 4124 14309 10548 -1975 -10835 5271 12353 -5255 -11003 -4606 -16202
7245a6202j1099n139L8075J1163j239q153J875N795R076j5519j2212Q074r520
$$ -16202 -27301 -32440 5635 16798 15559 7406 9281 15076 24152 8633 -3579 4495 -5025
7232e025o427K543m598r610L186p845j756N612J092o001j6850R463M860N788J5425
$$ -5025 -11452 -8909 -13507 -23117 -19931 -27776 -29532 -23920 -22828 -28829 -45679 -36216 -31356 -25568 -10143
7217a0143J4756K370k0147k4709J0586K7993P498k981M280n999j77n20o463o64
$$ -10143 4613 6983 -13164 -37873 -27287 706 8204 5223 9503 3504 3327 2807 -3656 -4320
7203d320j671n448J8394K1919Q09O222j7215L938L292j7208j2371M56p056O8j0396
$$ -4320 -5991 -11439 6955 28874 29683 35905 18690 22628 25920 8712 -3659 -3203 -10259 -10191 -20587
7188b0587J784l101K930l520l696j1161J6104J8387j5913K113k309k590M022J1945
$$ -20587 -18803 -21904 -18974 -22494 -26190 -37351 -21247 -2860 -18773 -16660 -18969 -21559 -17537 -5592
7174e592Q317q195l122l075n962p147J8378J5006p306N807L916l794p323r36j305
$$ -5592 2725 -5470 -8592 -11667 -17629 -24776 -6398 8608 1302 7109 11025 7231 -92 -1028 -2333
7159b333P661o942q663J1582l155j8695j9488j588R335P485J208R679L641J8789
$$ -2333 5328 -1614 -10277 1305 -1850 -20545 -40033 -41621 -32286 -24801 -23593 -13914 -10273 8516
7145H516K31Q444J2375r257r458j2883J442J869Q349J006j0997k02O569Q525O27
$$ 8516 8747 17191 29566 20309 10851 -2032 -590 1279 9628 10634 -363 -565 6004 14529 15156
7130A5156j6372n31j6889Q239J3309J0906O558K4688j1692k5084j6742o467O031
$$ 15156 -1216 -1747 -18636 -10397 2912 13818 20376 45064 33372 8288 -8454 -14921 -8890
7117h890N840p612k912R611J8955o130l375j2434j0578K593q061M20J0659J6255
$$ -8890 -3050 -10662 -13574 -3963 14992 8862 5487 -6947 -17525 -14932 -22993 -22573 -11914 4341
7103D341J1794K702O160l0647p436J782n399j255M606n954P220k56q927J5243
$$ 4341 16135 18837 24997 -5650 -13086 -11304 -16703 -17958 -13352 -19306 -12086 -12342 -21269 -6026
7089f026J3542o574J266J8574K166k7780J346O177Q555K0297j8747k039M938J653
$$ -6026 7516 942 2208 20782 22948 -4832 -3486 2691 11246 31543 12796 10757 15695 17348
7075A7348k7905J851J3831p324j0643M262R712j5423r401m367M272J0245M663
$$ 17348 -10557 -8706 5125 -2199 -12842 -8580 1132 -14291 -23692 -28059 -23787 -13542 -8879
7062h879J5507J0552k303J771Q154j2472m442p5l587J1366k945j4885J169n611
$$ -8879 6628 17180 14877 16648 24802 12330 7888 7813 4226 15592 12647 -2238 -1069 -6680
7048f680j8329J3555O226M25J5491p008k453L524j063R113P516k893L243O456
$$ -6680 -25009 -11454 -5228 -4803 10688 3680 1227 4751 3688 12801 20317 17424 20667 27123
7034B7123j2471k5732j3059K845R138J6099J5983q164r790K2749q882j2953j9992
$$ 27123 14652 -11080 -24139 -21294 -12156 3943 19926 11762 1972 24721 15839 2886 -17106
7021a7106q832p871m234J3602J5132R949l023j5447p512k692J1710K873o52p081
$$ -17106 -25938 -33809 -38043 -24441 -9309 640 -2383 -17830 -25342 -28034 -16324 -13451 -14103 -21184
7007b1184k6l545M779O055j585k2531p276K8271J9481q590o627j2715J6404J3888
$$ -21184 -21210 -24755 -19976 -13921 -15506 -38037 -45313 -17042 2439 -6151 -12778 -25493 -9089 4799
6993D799j9433N715J2055J0640J6906O029j1821P101n765j1878P951N100j0119
$$ 4799 -14634 -8919 3136 13776 30682 36711 24890 31991 26226 14348 22299 27399 17280
6980A7280k5941O791J1490k0718m34K73L877M01J2825N979m394j916l469m252
$$ 17280 -8661 -1870 9620 -11098 -11532 -11259 -7382 -6981 5844 11823 7429 5513 2044 -2208
6966b208p994l307J6653K901p215P414j2142j8868J0328K0663J5231L90j0452
$$ -2208 -10202 -13509 3144 6045 -1170 6244 -5898 -24766 -14438 6225 21456 21846 11394
6953A1394j0313J3968n643j2811J926p934P482L573k439K1285O889J3015p928
$$ 11394 1081 15049 9406 -3405 -1479 -9413 -1931 1642 -797 20488 27377 40392 32464
6940C2464j2197m000M520j5289m713N85J196n701o252q363K5214J4260k0072j8838
$$ 32464 20267 16267 20787 5498 785 1370 2566 -3135 -9387 -17750 7464 21724 1652 -17186
6926a7186j6720J7680J2580m534O997K927q437m864J6994l198r106O54o644o856
$$ -17186 -33906 -16226 -3646 -8180 -1183 1744 -6693 -11557 5437 2239 -6867 -6213 -12857 -19713
6912a9713m316k4990j3359n890K3411L1553K2382j2523j5070O112K4200J046k1356
$$ -19713 -24029 -49019 -62378 -68268 -44857 -13304 9078 -3445 -18515 -12403 11797 12843 -8513
6899h513j0387q931J928L364O48J8040P550o839j2218j915m55j090j2133J320
$$ -8513 -18900 -27831 -25903 -22539 -21891 -3851 3699 -3140 -15358 -17273 -17728 -18818 -30951 -29631
6885b9631Q124J5101L390q364j1538J5102j0029M888J17Q681K740j3930j3292
$$ -29631 -21507 -6406 -3016 -11380 -22918 -7816 -17845 -12957 -12840 -4159 -1419 -15349 -28641
6872b8641K823Q39N413J7034Q669N169N54j3972q631j0179m468p868n13Q059J8396
$$ -28641 -25818 -24979 -19566 -2532 6137 11306 11860 -2112 -10743 -20922 -25390 -33258 -33771 -25712 -7316
6857g316M275L134r12q216L148m785o362j2004O752J1190R486K537K128p935o891
$$ -7316 -3041 93 -819 -9035 -5887 -10672 -17034 -29038 -22286 -11096 -1610 927 3055 -4880 -11771
6842a1771r7L694J1442q546M415Q159k74m37r938k567o563J216o597J713k54J2109
$$ -11771 -11868 -8174 3268 -5278 -863 7296 7022 6585 -3353 -5920 -12483 -11267 -17864 -16151 -16405 -4296
6826d296J631n357j6701Q07P994q281m609J879L250J3054M564p661L29R301r35
$$ -4296 -2665 -8022 -24723 -23916 -15922 -24203 -28812 -26933 -23683 -10629 -6065 -13726 -13397 -4096 -5031
6811e031j8427J5276J3715R369J6658N75n859n153j1118j0569k0584r053k053
$$ -5031 -23458 -8182 5533 14902 31560 32135 26276 21123 10005 -564 -21148 -30201 -32254
6798c2254k144J4226J466J5473J1994r404N357J0023k157k1977j8839m178l902
$$ -32254 -34398 -20172 -18706 -3233 8761 -643 4714 14737 12580 -9397 -28236 -32414 -36316
6785c6316o915K901m981P853R469O911M548J580j581J3713O465J1052k828j623
$$ -36316 -43231 -40330 -45311 -37458 -27989 -21078 -16530 -14950 -16531 -2818 3647 14699 11871 10248
6771A0248J3474o309r889R445j2074j1071o467j4328j7413J4402J8748N950j1930
$$ 10248 23722 17413 7524 16969 4895 -6176 -12643 -26971 -44384 -29982 -11234 -5284 -17214
6758a7214n443L346K6308J7974o672j3970j5935k0335J0775j4748J763J4191K3474
$$ -17214 -22657 -19311 6997 24971 18299 4329 -11606 -31941 -21166 -35914 -34151 -19960 3514
6745C514P948O744N089J585k2398j01k347J0227J0658k525r944k6632l309J3808
$$ 3514 11462 18206 23295 24880 2482 2381 34 10261 20919 18394 8450 -18182 -21491 -7683
6731g683o420l21K2222L733j1481q616K4296J7545j935j8194J258J880Q847n588
$$ -7683 -14103 -14424 7798 11531 50 -8566 15730 33275 31340 13146 14404 16284 25131 19543
6717A9543j3668l706Q246p674k1959J25M018M165K1327j845R062j4952K046N215
$$ 19543 5875 2169 10415 2741 -19218 -19093 -15075 -10910 10417 8572 17634 2682 4728 9943
6703I943m329M12l991n143K297J7606l908j0282m884K616R723J0519n335j5025
$$ 9943 5614 6026 2035 -3108 -811 16795 12887 2605 -2279 337 10060 20579 15244 219
6689B19O334O557j8016r127O74P932M225M168M065q524M052p629J603M978J196
$$ 219 6553 13110 -4906 -14033 -13359 -5427 -1202 2966 7031 -1493 2559 -5070 -3467 1511 2707
6674B707K1458q103l3807o672n191m282J0213Q148P626J1618J953n504j0955K656
$$ 2707 24165 16062 -17745 -24417 -29608 -33890 -23677 -15529 -7903 3715 5668 164 -10791 -8135
6660h135J0381k798k5031p059J9133J1830R038J9793k232k5569k1082R327O145
$$ -8135 2246 -552 -25583 -32642 -13509 -1679 7359 27152 24920 -649 -21731 -12404 -6259
6647f259Q428J949j1433j908Q870Q436m696m934k2832j0119R319R471P985P522
$$ -6259 2169 4118 -7315 -9223 -353 8083 3387 -1547 -24379 -34498 -25179 -15708 -7723 -201
6633b01J3591l520j0390n257j7320J7j177N351m738p252J1324J6970L65j938m585
$$ -201 13390 9870 -520 -5777 -23097 -23080 -24257 -18906 -23644 -30896 -19572 -2602 -2237 -4175 -8760
6618h760R622M341J3090J4505j6657k7177j3204M422Q720j723N638J1956o119
$$ -8760 862 5203 18293 32798 16141 -11036 -24240 -19818 -11098 -12821 -7183 4773 -1346
6605a346J866L465P19k274P938J3048j1986n956o335M937p745L075m972l107j0103
$$ -1346 520 3985 4704 2430 10368 23416 11430 5474 -861 4076 -3669 -594 -5566 -8673 -18776
6590a8776J2355j0296K920K981J0887r329j4299k519p64Q932O901J3031L399J7290
$$ -18776 -6421 -16717 -13797 -10816 71 -9258 -23557 -26076 -26840 -17908 -11007 2024 5423 22713
6576B2713j7887l273j236J268l161M052J072M273L830n527q543O52p048q978J3479
$$ 22713 4826 1553 317 1585 -1576 2476 3548 7821 11651 6124 -2419 -1767 -8815 -17793 -4314
6561d314l798J0179L8l82L366J3849J0462l264j3606j7852j8905j0649J5696R172
$$ -4314 -8112 2067 2105 1723 5089 18938 29400 26136 12530 -5322 -24227 -34876 -19180 -10008
6547a0008o830p100M206o367O115K152J4585o067o29j0697n741L51r381l256L678
$$ -10008 -16838 -23938 -19732 -26099 -19984 -17832 -3247 -9314 -9943 -20640 -26381 -26030 -35411 -38667 -34989
6532c4989P987J665O118K8984Q477j4802j1301l27Q487o661k766r953L257m034
$$ -34989 -27002 -25337 -19219 9765 18242 3440 -7861 -8188 299 -6362 -9128 -19081 -15824 -19858
6518a9858j3690o90L071k570P854O163j4633j306J6743M320L603k793M171O889
$$ -19858 -33548 -34238 -31167 -33737 -25883 -19720 -34353 -35659 -18916 -14596 -10993 -13786 -9615 -2726
6504b726L515J3231J6308o129j9757R90n072p227n03k0994P464R489r182k532
$$ -2726 789 14020 30328 24199 4442 5432 360 -6867 -7370 -28364 -20900 -11411 -20593 -23125
6490b3125J8653l656l713K812j30P640R792n524K803r659j3192l960K56M58l073
$$ -23125 -4472 -8128 -11841 -9029 -9159 -1519 8273 2749 5552 -4107 -17299 -21259 -21003 -20545 -23618
6475b3618P543K425R924k077k6361j4971j0880K2458K2454J0739j8154o898J1417
$$ -23618 -16075 -13650 -3726 -5803 -32164 -47135 -58015 -35557 -13103 -2364 -20518 -27416 -15999
6462a5999J586P057J4594k4341K559P134j7361n195J199O667q923k258K89O834
$$ -15999 -14413 -7356 7238 -17103 -14544 -7410 -24771 -29966 -28767 -22100 -31023 -33281 -32992 -26158
6448b6158Q874j8309J9356J8307o899m425Q824N855J6660m322k027L452m798j7505
$$ -26158 -17284 -35593 -16237 2070 -4829 -9254 -430 5425 22085 17763 15736 19188 14390 -3115
6434c115j6317L583J0164O079n296r808J313j6022N963J3962n666j0390l06M290
$$ -3115 -19432 -15849 -5685 394 -4902 -14710 -13397 -29419 -23456 -9494 -15160 -25550 -25856 -21566
6420b1566M29J7244P932j2145k1512j0207M40k313R335L441K7920P83j6137J180
$$ -21566 -21137 -3893 4039 -8106 -29618 -39825 -39385 -41698 -32363 -28922 -1002 -219 -16356 -15176
6406a5176j0705l723J4037J649j5884P54J2772j803P957J4007J3364r066k3142
$$ -15176 -25881 -29604 -15567 -13918 -29802 -29048 -16276 -18079 -10122 3885 17249 8183 -14959
6393a4959k0678R045K0863N925m41p8R458Q892P10q717j7871N714n787m075J900
$$ -14959 -35637 -26592 -5729 196 -245 -323 9135 18027 18737 10020 -7851 -2137 -7924 -11999 -10099
6378a0099j5827l504J6054J3474J5556K3520m278O135j5375k0915j186K088j3124
$$ -10099 -25926 -29430 -13376 98 15654 39174 34896 41031 25656 4741 3555 5643 -7481
6365g481n469R558K1283n692p269j879M325R574j5777j0410Q084K6966J8716j0110
$$ -7481 -12950 -3392 17891 12199 4930 3051 7376 16950 1173 -9237 -1153 25813 44529 34419
6351C4419j1532j0983j4819m496K2502O98k1943m963J5449o41q28j2473j3680
$$ 34419 22887 11904 -2915 -7411 15091 15789 -6154 -11117 4332 3691 2863 -9610 -23290
6338b3290Q821J0012J2067K063m376J5916L23M819K203m148k252O0j5105j4172
$$ -23290 -14469 -4457 7610 9673 5297 21213 21536 26355 28558 24410 22158 22218 7113 -7059
6324g059n027l529R756n198m470q540O812N772J7304K080j275j9240j4477Q597
$$ -7059 -12086 -15615 -5859 -11057 -15527 -24067 -17255 -11483 5821 7901 6626 -12614 -27091 -18494
6310a8494M307J3898J0616j3603j597j1487j1251Q118K5110K0523p263k2423K070
$$ -18494 -14187 -289 10327 -3276 -4873 -16360 -27611 -19493 5617 26140 18877 -3546 -1476
6297a476Q070m422L663Q898q441l086o121m749j7233o020M637j898J0358k341
$$ -1476 6594 2172 5835 14733 6292 3206 -2915 -7664 -24897 -30917 -26280 -28178 -17820 -20161
6283b0161J5667J9688n733R89J338K189j4069j3454l10L786j7225m909R454o188
$$ -20161 -4494 15194 9461 10450 11788 13977 -92 -13546 -13856 -10070 -27295 -32204 -22750 -28938
6269b8938k066J8795J0597J4259q907j1081M3R073K3j8633j128K0832j7166k0030
$$ -28938 -31004 -12209 -1612 12647 3740 -7341 -7298 1775 1798 -16835 -17963 2869 -14297 -34327
6255c4327r731J2595K4773J7508L642j2876j3431k486j949J2050J400o700k750
$$ -34327 -44058 -31463 -6690 10818 14460 1584 -11847 -14333 -16282 -4232 -2832 -9532 -12282
6242a2282Q62N142J2203J770m446o069j4807J2102J5440L989j2L814J1295j2319
$$ -12282 -11420 -6278 5925 7695 3249 -2820 -17627 -5525 9915 13904 13892 17706 29001 16682
6228A6682j3059l730Q038J4749o750j0468j5900j72K471J6091j8337K063J6600
$$ 16682 3623 -107 7931 22680 15930 5462 -10438 -10610 -8139 7952 -10385 -8322 8278
6215H278j32K466L405L498q457j0057j558O286L729n461j4020n373Q540R36j510
$$ 8278 8146 10612 14017 17515 9058 -999 -2557 3729 7458 1997 -12023 -17396 -8856 -7920 -9430
6200i430M144n742J1703p80k784j2606K025J082J3771K6224m450p509L401j4870
$$ -9430 -5286 -11028 675 -105 -2889 -15495 -13470 -12388 1383 27607 23157 15648 19049 4179
6186D179N570K137p116J566Q177o897k4898M400k580M608Q035O414J7127j3362
$$ 4179 9749 11886 4770 6336 14513 7616 -17282 -12882 -15462 -10854 -2819 3595 20722 7360
6172G360j3359O752M853K254M930Q70p106j6339J0278J0597p010k1106J318J9078
$$ 7360 -5999 753 5606 7860 12790 13660 6554 -9785 493 11090 4080 -17026 -15708 3370
6158C370L112n410o288k2752P106J1521P4J4810k892j2880P848M335R93J4310
$$ 3370 6482 1072 -5216 -27968 -20862 -9341 -9267 5543 2651 -10229 -2381 1954 2947 17257
6144A7257K404j9504k2677n011J6248P01N901o234j0285P247J0333j371j378M003
$$ 17257 19661 157 -22520 -27531 -11283 -10582 -4681 -10915 -21200 -13953 -3620 -4991 -6369 -2366
6130b366J4737m963M03J773K746j346p111K262J7654j504r915n544q521k2458
$$ -2366 12371 7408 7811 9584 12330 10984 3873 6135 23789 22285 12370 6826 -1695 -24153
6116b4153J3048K7992p034l080n894K0064O255l80J4192J440l1016o93J1825l175
$$ -24153 -11105 16887 9853 6773 879 20943 27198 26818 41010 42450 11434 10741 22566 19391
6102A9391k3778r847o222j1285Q207K0100J1773m89M626J4191P20r758q865j6164
$$ 19391 -4387 -14234 -20456 -31741 -23534 -3434 8339 7850 12476 26667 27387 17629 8764 -7400
6088g400O963n623n567L644J2729K2557J04j8954k5727k2644q006Q403N762L1420
$$ -7400 -437 -6060 -11627 -7983 4746 27303 27407 8453 -17274 -39918 -47924 -39521 -33759 -2339
6074b339L665o932j4595J5093R940R077J0896m608j7451j2177j1549J7558Q187
$$ -2339 1326 -5606 -20201 -5108 4832 13909 24805 20197 2746 -9431 -20980 -3422 4765
6061D765J0763q815o203q648j066j5754J4311Q892K375j6003m551k721J1398J3820
$$ 4765 15528 6713 510 -8138 -9204 -24958 -10647 -1755 620 -15383 -19934 -22655 -11257 2563
6047B563L038j1416m599O448P873K676Q476j3724k9864R0J8510J883l018J1144
$$ 2563 5601 -5815 -10414 -3966 3907 6583 15059 1335 -28529 -28439 -9929 -8046 -11064 80
6033H0j1599j4484J1155L3076J4554j0671j4398k322o266j2368l254m87N403J0415
$$ 80 -11519 -26003 -14848 18228 32782 22111 7713 5391 -875 -13243 -16497 -16984 -11581 -1166
6019a166J1618M352J1637k1440j5655j5534P632J0759j2905j3963P015K605N139
$$ -1166 10452 14804 26441 5001 -10654 -26188 -18556 -7797 -20702 -34665 -27650 -25045 -19906
6006a9906L770R428L876p588p484J369j035J5216J8503p062k3901j4047K579O118
$$ -19906 -16136 -6708 -2832 -10420 -17904 -16535 -17570 -2354 16149 9087 -14814 -28861 -26282 -20164
5992b0164j425K0871K8191P686j9608j0111j1284N210k974q54L320J094M985m937
$$ -20164 -21589 -718 27473 35159 15551 5440 -5844 -634 -3608 -4462 -1142 -48 4937 0
5978@J5879J1159r411j5162K086r85j187j4563J4557K1286o391j0611j5088L773
$$ 0 15879 27038 17627 2465 4551 3566 2379 -12184 2373 23659 17268 6657 -8431 -4658
5964d658K9244J0276r201j0235j2597k079M491J6019j0430k3504L6P4q852P667
$$ -4658 24586 34862 25661 15426 2829 750 5241 21260 10830 -12674 -12638 -12564 -21416 -13749
5950a3749M676L2119L0152r686j7921q784j907m963o012j9278o563P010Q748K832
$$ -13749 -9073 23046 53198 43512 25591 16807 14900 9937 3925 -15353 -21916 -14906 -6158 -3326
5936c326Q105q21j8116k0330j2099J2051J3638j1620N438K6129O508j4048j4219
$$ -3326 4779 3958 -14158 -34488 -46587 -34536 -20898 -32518 -27080 -951 5557 -8491 -22710
5923b2710j888J1425k83q8J644K2447Q102j2989k0553j4608m513P740J2158P097
$$ -22710 -24598 -13173 -13456 -13544 -11900 10547 18649 5660 -14893 -29501 -34014 -26274 -14116 -7019
5909g019r488J8546j129r295m031N061r00K016K53k498l58k557q766o542J1371
$$ -7019 -16507 2039 910 -8385 -12416 -7355 -8255 -6239 -5986 -8484 -8842 -11399 -20165 -26707 -15336
5894a5336J0114P668Q640j2618j0500j5994o634J2231J5469M629K099j0387K529
$$ -15336 -5222 2446 11086 -1532 -12032 -28026 -34660 -22429 -6960 -2331 -232 -10619 -8090
5881h090J8087R982j103q349P157J3938m712k2052j1439l292Q358J0547l070l544
$$ -8090 9997 19979 18876 10527 17684 31622 26910 4858 -6581 -9873 -1515 9032 5962 2418
5867B418k1650j5826P931M84q086j275J2198J3828J0292Q655p34k927j3291J5937
$$ 2418 -19232 -35058 -27127 -26643 -34729 -36004 -23806 -9978 314 8969 8235 5308 -7983 7954
5853G954k102r46L833k1153n953j7508J3880l855J0387J4546J1286P422j2360
$$ 7954 5852 4906 8739 -12414 -18367 -35875 -21995 -25850 -15463 -917 10369 17791 5431
5840E431K0428J2857p865j9347n150j262n731o624k925R637J3430p543j0071O873
$$ 5431 25859 38716 30851 11504 6354 5092 -639 -7263 -10188 -551 12879 5336 -4735 2138
5826B138q476j835k163J824L753J6954J2155m949j5432O410Q427q594j6632J247
$$ 2138 -6338 -8173 -10336 -8512 -4759 12195 24350 19401 3969 10379 18806 10212 -6420 -5173
5812e173j676J2462k96J58Q067N097p288k4642k750K2667O745J2709J552L126
$$ -5173 -6849 5613 5317 5475 13542 18639 11351 -13291 -16041 6626 13371 26080 27632 30758
5798C0758j6294l3428k714J5421K2336K146j1844p559r950j049N156P587k751
$$ 30758 14464 -18964 -21678 -6257 16079 18225 6381 -1178 -11128 -12177 -7021 566 -2185
5785b185m301J3436K098l296J0515q193r961j0260P543k930l4274k881J8229J9286
$$ -2185 -6486 6950 9048 5752 16267 8074 -1887 -12147 -4604 -7534 -41808 -44689 -26460 -7174
5771g174J7171Q80q008j9184L542K2536J4598q593L396o687q020J1570l724q389
$$ -7174 9997 10877 2869 -16315 -12773 9763 24361 15768 19164 12477 4457 16027 12303 3914
5757C914r581j0830k413J8348O915o678k3449n802Q086J4620J3347R091J592r709
$$ 3914 -5667 -16497 -18910 -562 6353 -325 -23774 -29576 -21490 -6870 6477 15568 17160 7451
5743G451K957K825j409n626j1647r959o359J2785J2013j658j4236j0302O277N776
$$ 7451 10408 13233 11824 6198 -5449 -15408 -21767 -8982 3031 1373 -12863 -23165 -16888 -11112
5729a1112Q320r359J1131K2576J6876j5212r670j2258p737J143J281K598m495
$$ -11112 -2792 -12151 -1020 21556 38432 23220 13550 1292 -6445 -5302 -4021 -1423 -5918
5716e918l760j3161l754K763P387Q627N748R300J6648P109N64k1207j1747K684
$$ -5918 -9678 -22839 -26593 -23830 -16443 -7816 -2068 7232 23880 30989 31553 10346 -1401 1283
5702A283j400l765L604M963n558r912l144q968l616j180R115R839N654K433K25
$$ 1283 -117 -3882 -278 4685 -873 -10785 -13929 -22897 -26513 -27693 -18578 -8739 -3085 -652 -427
5687d27O170p398j394l408j2798M357K448o596k598l674o848k0905J0300J5067
$$ -427 5743 -1655 -3049 -6457 -19255 -14898 -12450 -19046 -21644 -25318 -32166 -53071 -42771 -27704
5673b7704Q397Q037R419n864n324L628K037J6925j4075j6656J013J1051M425M899
$$ -27704 -19307 -11270 -1851 -7715 -13039 -9411 -7374 9551 -4524 -21180 -20167 -9116 -4691 208
5659B08j3220j675j7224P229Q917l90O000N536k491O572q971M87M127K0150k3334
$$ 208 -13012 -14687 -31911 -24682 -15765 -16155 -10155 -4619 -7110 -538 -9509 -9022 -4895 15255 -8079
5644h079k5112m689N371O601J4913K5017o642j2346M310j3824k567R297K233j1272
$$ -8079 -33191 -37880 -32509 -25908 -10995 14022 7380 -4966 -656 -14480 -17047 -7750 -5517 -16789
5630a6789L535L015p891o730p128k464J1042L1421R29k921N558k1862j1342K1830
$$ -16789 -13254 -10239 -18130 -24860 -31988 -34452 -23410 8011 8940 6019 11577 -10285 -21627 203
5616B03J6236j0545j0100j080O976R325q839K94n069j2581J5079N292j0504n30
$$ 203 16439 5894 -4206 -5286 1690 11015 2176 2470 -2599 -15180 -101 5191 -5313 -5843
5602e843m055n538Q233J4292Q036o64k6062M923p299p676K3177n40p489K604r83
$$ -5843 -9898 -15436 -7203 7089 15125 14461 -11601 -6678 -13977 -21653 1524 984 -6505 -3901 -4884
5587d884J9132j1491j5952K195p145k113n606K5459q028r757J0435K936j3269
$$ -4884 14248 2757 -13195 -11000 -18145 -20258 -25864 -405 -8433 -18190 -7755 -4819 -18088
5574a8088k501O524J1091p725L480R659j2050j1412K2252Q591j0741j6118j2028
$$ -18088 -20589 -14065 -2974 -10699 -7219 2440 -9610 -21022 1230 9821 -920 -17038 -29066
5561b9066j512J4436K8027J5798j3519r275r247k84j0360m096J0621R793m900
$$ -29066 -30578 -16142 11885 27683 14164 4889 -4358 -4642 -15002 -19098 -8477 1316 -3584
5548c584j9779k4851J1905K9277J343J0034o262n099O6j1371M873O635N049Q45
$$ -3584 -23363 -48214 -36309 -7032 -5689 4345 -1917 -7016 -6950 -18321 -13448 -6813 -1764 -919
5534i19J447m97o839N774n700J314Q010j1606M121m539p959j5218P71q245K1761
$$ -919 528 31 -6808 -1034 -6734 -5420 2590 -9016 -4895 -9434 -17393 -32611 -31840 -40085 -18324
5519a8324K1505K850r462q671J4856J2719o770O815M760r192j050L394j4436p829
$$ -18324 3181 6031 -3431 -12102 2754 15473 8703 15518 20278 11086 10036 13430 -1006 -8835
5505h835n242L093j3350n472o2M216J0687Q337J1133K6643l885J410L770q831
$$ -8835 -14077 -10984 -24334 -29806 -29868 -25652 -14965 -6628 4505 31148 27263 28673 32443 23612
5491B3612j7128l012O033J691j0662R975O38j7877m402R309K1650Q82j7450j2500
$$ 23612 6484 3472 9505 11196 534 10509 11147 -6730 -11132 -1823 19827 20709 3259 -9241
5477i241j1322K3715Q247n875Q923J4197K411j7780p263o14r190l516J8504P653
$$ -9241 -20563 3152 11399 5524 14447 28644 31055 13275 6012 5398 -3792 -7308 11196 18849
5463A8849j3248j1485j5663O16J2106n011L614J9245p312q523J1513J558Q068
$$ 18849 5601 -5884 -21547 -20931 -8825 -13836 -10222 9023 1711 -6812 4701 6259 14327
5450A4327m014p771m101P589N73j3471N116k608P837p353j5562J1177K7880q239
$$ 14327 10313 2542 -1559 6030 6603 -6868 -1752 -4360 3477 -3876 -19438 -8261 19619 11380
5436A1380k2507K199P885l48n811J749k6756j6411K539J4957J7465K3618l017
$$ 11380 -11127 -8928 -1043 -1391 -7202 -5453 -32209 -48620 -46081 -31124 -13659 9959 6942
5423F942j1249j0348j8978m366L823Q6J6288K1518q654r304M68j8177J0519K6544
$$ 6942 -4307 -14655 -33633 -37999 -34176 -34090 -17802 3716 -4938 -14242 -13774 -31951 -21432 5112
5409E112J2494k393p478n715n402m689j094J6810o155l987n35r892k497j5083
$$ 5112 17606 15213 7735 2020 -3382 -8071 -9165 7645 1490 -2497 -3032 -12924 -15421 -30504
5395c0504r136K529l63L2403m369j0566M241J2260J1580L097K1135q649j7444
$$ -30504 -39640 -37111 -37474 -5071 -9440 -20006 -15765 -3505 8075 11172 32307 23658 6214
5382F214p411Q71j1619M748j910j2540j1446L410K507J3208k216K787P770j2225
$$ 6214 -1197 -326 -11945 -7197 -9107 -21647 -33093 -29683 -27176 -13968 -16184 -13397 -5627 -17852
5368a7852p840m564J2607n444M334M990Q781J1006J2748o377k1025q225J1358
$$ -17852 -25692 -30256 -17649 -23093 -18759 -13769 -4988 6018 18766 12389 -8636 -16861 -5503
5355e503n450n196m33M213m074j2320J400K626M925p409J433r933K1049J5512
$$ -5503 -10953 -16149 -16582 -12369 -16443 -28763 -27363 -24737 -19812 -27221 -25788 -35721 -14672 840
5341H40j1477J869M512o823m597O860O029m48p475J2834r409j976Q561O557r922
$$ 840 -10637 -8768 -4256 -11079 -15676 -8816 -2787 -3235 -10710 2124 -7285 -9261 -700 5857 -4065
5326d065r614J4081j590n933l145K119J2542N434p561o759l937P774q85J0235
$$ -4065 -13679 402 -1188 -7121 -10266 -8147 4395 9829 2268 -4491 -8428 -654 -1539 8696
5312H696M835Q335j7128K47L604L302N497j4234j3620K169P842L342N960p097
$$ 8696 13531 21866 4738 4985 8589 11891 17388 3154 -10466 -8297 -455 2887 8847 1750
5298A750J916j1569l470K0280k827j8760o404J6301M142M305j9498r086L388J0984
$$ 1750 3666 -7903 -11373 8907 6080 -12680 -19084 -2783 1359 5664 -13834 -22920 -19532 -8548
5284h548j0712j0208j1876J6785l51r192R211J7793J4363R732k2447o964N304
$$ -8548 -19260 -29468 -41344 -24559 -24910 -34102 -24891 -7098 7265 16997 -5450 -12414 -7110
5271g110N090J220K621j4254j788Q690K953K132O780M860r11m955K0831j1083
$$ -7110 -2020 -800 1821 -12433 -14221 -5531 -2578 -446 6334 11194 10283 5328 26159 15076
5257A5076k1439j3259n472Q222Q115l704M000j6113l698m505J1112P632m497q35
$$ 15076 -6363 -19622 -25094 -16872 -8757 -12461 -8461 -24574 -28272 -32777 -21665 -14033 -18530 -19365
5243a9365K1732J4917q808j3958j8914J398J5826J0565k626r82Q270J2056j3209
$$ -19365 2367 17284 8476 -5482 -24396 -22998 -7172 3393 767 -215 8055 20111 6902
5230F902j5716J1999Q040p329k136m038Q441J591o001R455r581r830j3654K0675
$$ 6902 -8814 3185 11225 3896 1760 -2278 6163 7754 1753 11208 1627 -8203 -21857 -1182
5216a182R489l834J0980J2656K991j0670j5608J2042m941j9427J2400O234p747
$$ -1182 8307 4473 15453 28109 31100 20430 4822 16864 11923 -7504 4896 11130 3383
5203C383K117K540j5658K912J1757M182L666J2966k7951k7777J6784J208J305
$$ 3383 5500 8040 -7618 -4706 7051 11233 14899 27865 -86 -27863 -11079 -9871 -8566
5190h566J6265n30o789l279K0260l642j0645j922r446o876P616K389l999k351
$$ -8566 7699 7169 380 -2899 17361 13719 3074 1152 -8294 -15170 -7554 -5165 -9164 -11515
5176a1515m588R722J8460q61l243j2925K602J1600J7997p606r155r917j0556j723
$$ -11515 -16103 -6381 12079 11218 7975 -4950 -2348 9252 27249 19643 10488 571 -9985 -11708
5162a1708n660J2161J7158j233Oj0538k4095l131R93J1175N556J2412j208K763
$$ -11708 -17368 -5207 11951 10718 10724 186 -23909 -27040 -26047 -14872 -9316 3096 1888 4651
5148D651n301L189o326r579Q220N309J492l31P772j333q4j326M185J5967j3147
$$ 4651 -650 2539 -3787 -13366 -5146 163 1655 1324 9096 7763 7679 6353 10538 26505 13358
5133A3358q057M491j0946L444J134J706J1297j1134L711k003m669M165Q923J1377
$$ 13358 5301 9792 -1154 2290 3424 5130 16427 5293 9004 7001 2332 6497 15420 26797
5119B6797j3236j8145l745J0213J618J9801r437j6555O73P163N008o248J188J1745
$$ 26797 13561 -4584 -8329 1884 3502 23303 13866 -2689 -2016 5147 10155 3907 5095 16840
5105A6840M715n352p590l0162N048J2892O763q070J2900J6857j2082k1404j3310
$$ 16840 21555 16203 8613 -21549 -16501 -3609 3154 -4916 7984 24841 12759 -8645 -21955
5092b1955q569O582J7170J3482k3J089M133q873m727j3892j899Q760j2687p192
$$ -21955 -30524 -23942 -6772 6710 6687 7776 11909 3036 -1691 -15583 -17482 -8722 -21409 -28601
5078b8601J816P773R385J0985n08P720j1857q05J2940n792r007K0268O47k1962
$$ -28601 -26785 -19012 -9627 1358 850 8570 -3287 -4092 8848 3056 -5951 14317 14964 -6998
5064f998j2577n586O547l398L125K3594l536j1130n211J5977J2113O716j0794
$$ -6998 -19575 -25161 -18614 -22012 -18887 4707 1171 -9959 -15170 807 12920 19636 8842
5051H842j4119J3042j2369P252J4469q047R707L190k3769j3173j1394j037J5505
$$ 8842 -5277 7765 -4604 2648 17117 9070 18777 21967 -1802 -14975 -26369 -27406 -11901
5038a1901P911Q338K974Q708J613k038q877j1694o352J0560o924J3115O205k4357
$$ -11901 -3990 4348 7322 16030 17643 15605 6728 -4966 -11318 -758 -7682 5433 11638 -12719
5024a2719O895Q105r794k2393J8259P898k305J1962L012o873Q353l654j1216o830
$$ -12719 -5824 2281 -7513 -29906 -11647 -3749 -6054 5908 8920 2047 10400 6746 -4470 -11300
5010a1300j4049J2660O361l679m580k230p959J8493J3866M710l218o366R644J4134
$$ -11300 -25349 -12689 -6328 -10007 -14587 -16817 -24776 -6283 7583 12293 9075 2709 12353 26487
4996B6487j4891j3152J863J0725l711q319j8009N156L709m279J3920K6916K2413
$$ 26487 11596 -1556 307 11032 7321 -998 -19007 -13851 -10142 -14421 -501 26415 48828
4983D8828m189n559j6847k6867j4572J4954j243j1883n202j7793l625k694P490
$$ 48828 44639 39080 22233 -4634 -19206 -4252 -5495 -17378 -22580 -40373 -43998 -46692 -39202
4970c9202K0292J4524k407N509p80j7770l308N251k484j3073l882J1565K82R902
$$ -39202 -18910 -4386 -6793 -1284 -2064 -19834 -23142 -17891 -20375 -33448 -37330 -25765 -25483 -15581
4956a5581n539N939n850L247J5452J6049O993n73j2413r877o680o545M567J146
$$ -15581 -21120 -15181 -21031 -17784 -2332 13717 20710 20137 7724 -2153 -8833 -15378 -10811 -9665
4942i665Q974J0168P436o899j239J1470P033q437J713J553j5607p732m647k1664
$$ -9665 -691 9477 16913 10014 8775 20245 27278 18841 20554 22107 6500 -1232 -5879 -27543
4928b7543m141M223J582Q397N275J2444K606m754j499Q39N626l0r092o706L031
$$ -27543 -31684 -27461 -25879 -17482 -12207 237 2843 -1911 -3410 -2571 3055 3025 -6067 -12773 -9742
4913i742K7233J1712j6984j8511j1755K0914K4363K339j5222k4930M612L231M23
$$ -9742 17491 29203 12219 -6292 -18047 2867 27230 29569 14347 -10583 -5971 -2740 -2317
4900b317j3186Q659J6735P345K146p356k195M396q441j5320o04J5426J3352O730
$$ -2317 -15503 -6844 9891 17236 19382 12026 9831 14227 5786 -9534 -10138 5288 18640 25370
4886B5370n061r1o200j5457q894n811M780J4850j3222j8064M535o20r537k2544
$$ 25370 20309 20218 14018 -1439 -10333 -16144 -11364 3486 -9736 -27800 -23265 -23885 -33422 -55966
4872e5966J2399J8202Q739M470J1666q803k250j0508j4176Q741J2389r208O716
$$ -55966 -43567 -25365 -16626 -12156 -490 -9293 -11543 -22051 -36227 -27486 -15097 -24305 -17589
4859a7589L590j410j1847O47K104R89J0513M798J941q229j1555M67j949m293L0528
$$ -17589 -13999 -15409 -27256 -26609 -24505 -23516 -13003 -8205 -6264 -14493 -26048 -25581 -27530 -31823 -1295
4844a295J1495k413J3188r462j9174L648P94l458N989J5012J1830k469m546j4215
$$ -1295 10200 7787 20975 11513 -7661 -4013 -3219 -6677 -688 14324 26154 23685 19139 4924
4830D924n734q879j1047R572J4161K232J4990p085q991J4876j1388j0750j114
$$ 4924 -810 -9689 -20736 -11164 2997 5229 20219 13134 4143 19019 7631 -3119 -4233
4817d233K950n771n024m206k635N070K99k892j231m010Q325n983j1384J767n217
$$ -4233 -1283 -7054 -12078 -16284 -18919 -13849 -13550 -16442 -17673 -21683 -13358 -19341 -30725 -28958 -34175
4802c4175M70P686J906P070j443O15O529J4524M758J3754r803j2733R092O534
$$ -34175 -33705 -26019 -24113 -17043 -18486 -17871 -11342 3182 7940 21694 11891 -842 8250 14784
4788A4784N575o941j2570j5059j2147Q251O946j561J5307K1910J3856L702k200
$$ 14784 20359 13418 848 -14211 -26358 -18107 -11161 -12722 2585 24495 38351 42053 39853
4775C9853k415n682r546j3193j3088o53O450J3458L342k0579j5249n540R50R94
$$ 39853 37438 31756 22210 9017 -4071 -4724 1726 15184 18526 -2053 -17302 -22842 -21892 -20898
4761b0898J1212J359k843k439m07J1466K372n984n082l912Q290j3158j1938L602
$$ -20898 -9686 -8327 -11170 -13609 -14016 -2550 -178 -6162 -11244 -15156 -6866 -20024 -31962 -28360
4747b8360j1086k513J3402J6247J1964k878l238J948P986l344L223q217O68J0985
$$ -28360 -39446 -41959 -28557 -12310 -346 -3224 -6462 -4514 3472 128 3351 -4866 -4198 6787
4733F787k652R031M082K480Q485Q668k6247k3686k145N598r943K500j462j0552
$$ 6787 4135 13166 17248 19728 28213 36881 10634 -13052 -15197 -9599 -19542 -17042 -18504 -29056
4719b9056r91J1448K9831L628L449K254R259M412j3464k0236p566J1712j884p564
$$ -29056 -30047 -18599 11232 14860 18309 20563 29822 34234 20770 534 -7032 4680 2796 -4768
4705d768O890K1676J0028L067j3760k3832l788n572n961l227k709l838K331J4168
$$ -4768 2122 23798 33826 36893 23133 -699 -4487 -10059 -16020 -19247 -21956 -25794 -23463 -9295
4691i295J70l731K297N022j581R2o982j877L956q346Q779R344m263p426l739Q225
$$ -9295 -9125 -12856 -10559 -5537 -7118 -7026 -14008 -15885 -11929 -20275 -11496 -2152 -6415 -13841 -17580 -9355
4675i355j0144P90J4218J2019k596k0363J7625J2215J417j5294J6805J3520j1363
$$ -9355 -19499 -18709 -4491 7528 4932 -15431 2194 14409 15826 532 17337 30857 19494
4662A9494N364l339k644L278K347L784j3903m836j6673o929k4018j637Q687K3993
$$ 19494 24858 21519 18875 22153 24500 28284 14381 9545 -7128 -14057 -38075 -39712 -31025 -7032
4648g032K757J6049J4125k3439j0224J0522Q405J2281J767l124j379m268r136
$$ -7032 -4275 11774 25899 2460 -7764 2758 11163 23444 25211 22087 20708 16440 7304
4635G304l928J237J3972k16j1137J4280p122j0641j0384M311j9526j727L077J3334
$$ 7304 3376 4613 18585 18369 7232 21512 14390 3749 -6635 -2324 -21850 -23577 -20500 -7166
4621g166R791O777l926R440o96j8175J300J492j0953q669P093M255L956j4850
$$ -7166 2625 9402 5476 14916 14220 -3955 -2655 -1163 -12116 -20785 -13692 -9437 -5481 -20331
4607b0331k3227O952J9414J0268O718p546j706K85J9951O336k804J421l110L624
$$ -20331 -43558 -36606 -17192 -6924 -206 -7752 -9458 -9173 10778 17114 14310 15731 12621 16245
4593A6245j1567L872q555o320p272j3016k410K1450m54j959J6328P982j2481R57
$$ 16245 4678 8550 -5 -6325 -13597 -26613 -29023 -7573 -8027 -9986 6342 14324 1843 2800
4579B800j2735k886R467k1913l628K8737l401n813m895q65N142j1357J1312k645
$$ 2800 -9935 -12821 -3354 -25267 -28895 -158 -3559 -9372 -14267 -15132 -9990 -21347 -10035 -12680
4565a2680N595j8275K943J0063k2104M137J9970J9403J4655n044r700j6637O787
$$ -12680 -7085 -25360 -22417 -12354 -34458 -30321 -10351 9052 23707 18663 8963 -7674 -887
4552h87N07r307m791j674J9055Q357n708J816O742j7064j5442Q95K6840J8499
$$ -887 -380 -9687 -14478 -16152 2903 11260 5552 7368 14110 -2954 -18396 -17501 9339 27838
4538B7838m113j6914j3511j8610L380K1176J1653J7025l085j1322r442q460l943
$$ 27838 23725 6811 -6700 -25310 -21930 -754 10899 27924 24839 13517 4075 -4385 -8328
4525h328m223P323J618K2088J6603j3725l268j3964j9651j785J9531k30k2352
$$ -8328 -12551 -5228 -3610 18478 35081 21356 18088 4124 -15527 -17312 2219 1989 -20363
4512b0363P184L450M540J6821j893o952J5156p949p78K1822k427j7794k4194m568
$$ -20363 -13179 -9729 -5189 11632 9739 2787 17943 9994 9216 31038 28611 10817 -13377 -17945
4498a7945p847J4916J5027R868j7138r901n322Q992l622m77L335j7934Q11P831
$$ -17945 -25792 -10876 4151 14019 -3119 -13020 -18342 -9350 -12972 -13449 -10114 -28048 -27237 -19406
4484a9406J2566r239n624K216J1145p159L379J2665K530J1602j3459j0894p444
$$ -19406 -6840 -16079 -21703 -19487 -8342 -15501 -12122 543 3073 14675 1216 -9678 -17122
4471a7122k943p484R157K582J1060m478p931j4544L727L807o547J6211J3638m342
$$ -17122 -20065 -27549 -18392 -15810 -4750 -9228 -17159 -31703 -27976 -24169 -30716 -14505 -867 -5209
4457e209k75K764J4909R75j6756O681R913p744J5033L598j458J108K511k627j735
$$ -5209 -5484 -2720 12189 13164 -3592 3089 13002 5258 20291 23889 22431 23539 26050 23423 21688
4442B1688j1495n084j1860N126j7038j3022J5100j003J0384j5302j288Kj1724
$$ 21688 10193 5109 -6751 -1625 -18663 -31685 -16585 -17588 -7204 -22506 -23794 -23792 -35516
4429c5516O763J4482n52j124J4175q879l385n206M961m352O243J0848N845j1619
$$ -35516 -28753 -14271 -14823 -15947 -1772 -10651 -14036 -19242 -14281 -18633 -12390 -1542 4303 -7316
4415g316j1441Q950J564M531M838R831m659p976k242j0541j3096K273q931r998
$$ -7316 -18757 -9807 -8243 -3712 1126 10957 6298 -1678 -3920 -14461 -27557 -25284 -34215 -44213
4401d4213Q922P005J0041p305J6649L672p372J963J265J1901J5236m591M878K515
$$ -44213 -35291 -28286 -18245 -25550 -8901 -5229 -12601 -10638 -9373 2528 17764 13173 18051 20566
4387B0566k3559n640Q34J6630l825l54r453R460J1973k504l087j653j0139j1824
$$ 20566 -2993 -8633 -7799 8831 5006 4652 -4801 4659 16632 14128 11041 9388 -751 -12575
4373a2575M362P97P866J4764Q424j5234l041J615r701j0108J0868O616j1949j8949
$$ -12575 -8213 -7416 450 15214 23638 8404 5363 6978 -2723 -12831 -1963 4653 -7296 -26245
4359b6245K1013K5687R998r522j2178K363n657l168J130J6445M4R092M259N798
$$ -26245 -5232 20455 30453 20931 8753 11116 5459 2291 3421 19866 19910 29002 33261 39059
4345C9059k1943j4073j1395n463p731k5R068m91M704O060m502j8765R206K6431
$$ 39059 17116 3043 -8352 -13815 -21546 -21571 -12503 -12994 -8290 -2230 -6732 -25497 -16291 10140
4331A0140k0498m069P328q138P11J0251o626q920K0236J4245k487J917J3424O341
$$ 10140 -10358 -14427 -7099 -15237 -14526 -4275 -10901 -19821 415 14660 12173 14090 27514 33855
4317C3855j2331k2691l3469j2549l906J1534J1457M951k362L876K4935J6153m639
$$ 33855 21524 -1167 -34636 -47185 -51091 -39557 -28100 -23149 -25511 -21635 3300 19453 14814
4304A4814J1585Q10k5323j5606j208k133q666J0434J1573l374M00K35o830O230
$$ 14814 26399 27209 1886 -13720 -14928 -17061 -25727 -15293 -3720 -7094 -6694 -6459 -13289 -7059
4290g059J4154R138O657q968l00n410N733n831p475M080N234K825j1404l872J7613
$$ -7059 7095 16233 22890 13922 13622 8212 13945 8114 639 4719 9953 12778 1374 -2498 15115
4275A5115m188L538j3911k2396Q99K0225L442K53j517J3408o543j1690J0411N460
$$ 15115 10927 14465 554 -21842 -20943 -718 2724 2977 1460 14868 8325 -3365 7046 12506
4261A2506K454j1991j2738k664k538Q340K905o948l155R3M502J6180J2744n850
$$ 12506 14960 2969 -9769 -12433 -14971 -6631 -3726 -10674 -13829 -13736 -9234 6946 19690 13840
4247A3840l248r99Q634O55j0514j9604m621l68J3305J3727o039k992k1776M004
$$ 13840 10592 9593 18227 18882 8368 -11236 -15857 -16225 -2920 10807 4768 1776 -20000 -15996
4233a5996J2998M255M435n046O54m085n298K56k545M851l485j1585Q990L355j598
$$ -15996 -2998 1257 5692 646 1300 -2785 -8083 -7827 -10372 -5521 -9006 -20591 -11601 -8246 -9844
4218i844J3274k5350k270J6473N063m451o848j0890J6837O919m314J644J0239
$$ -9844 3430 -21920 -24190 -7717 -2654 -7105 -13953 -24843 -8006 -1087 -5401 -3757 6482
4205F482j2780L952r271J2731m541q928m946K946P302k329K877O932p272q214
$$ 6482 -6298 -2346 -11617 1114 -3427 -12355 -17301 -14355 -7053 -9382 -6505 427 -6845 -15059
4191a5059M622J0106k684j540J602J8362J8893k3132k0247O412L319j0935N3J3023
$$ -15059 -10437 -331 -3015 -4555 -2953 15409 34302 11170 -9077 -2665 654 -10281 -10228 2795
4177B795L325j829j202K8168n266k4676r320P521m369j0398k828j950K509L333
$$ 2795 6120 4291 3089 31257 25991 1315 -8005 -484 -4853 -15251 -18079 -20029 -17520 -14187
4163a4187l542P870K3294N297j4276M084M033m553Q03J2934l484j2500N859J6955
$$ -14187 -17729 -9859 13435 18732 4456 8540 12573 8020 8823 21757 18273 5773 11632 28587
4149B8587n62k7811j7062q747k653k502Q502K3798Q588M242P885P389m493j383
$$ 28587 28025 214 -16848 -25595 -28248 -30750 -22248 1550 10138 14380 22265 29654 25161 23778
4135B3778k200j5200M765J439j4447j0464J7727M379j6632k5273J6981N944N124
$$ 23778 21578 6378 11143 12582 -1865 -12329 5398 9777 -6855 -32128 -15147 -9203 -4079
4122d079j1569p863J8182L1080J3150k7084r882M692P034n413M431K626k8867
$$ -4079 -15648 -23511 -5329 25751 38901 11817 1935 6627 13661 8248 12679 15305 -13562
$$ [...]
##END NTUPLES=NMR SPECTRUM
##END=
