##TITLE=Analysis number 316158
Compound Code cc 26701
Book Reference 449/58
Project Code adrs
Chemist Name davee
##JCAMPDX= 6.0         $$ Bruker NMR JCAMP-DX V2.0
##DATA TYPE= NMR SPECTRUM
##DATA CLASS= NTUPLES
##ORIGIN= Bruker BioSpin GmbH
##OWNER= nmr
$$ XWIN-NMR		Version 3.5
$$ Wed Dec 21 10:29:39 2005 GMT Standard Time (UT+0h)  MAYBRIDGE\nmr@NMR_250MHZ
##.OBSERVE FREQUENCY= 250.131544655141
##.OBSERVE NUCLEUS= ^1H
##.ACQUISITION MODE= SIMULTANEOUS (DQD)
##.ACQUISITION SCHEME= undefined
##.AVERAGES= 16
##.DIGITISER RES= 18
##SPECTROMETER/DATA SYSTEM= dpx250
##.PULSE SEQUENCE= zg30
##.SOLVENT NAME= DMSO
##.SHIFT REFERENCE= (INTERNAL, DMSO, 0, 16.522)
##AUDIT TRAIL= $$ (NUMBER, WHEN, WHO, WHERE, WHAT)
$$ ##TITLE= Audit trail, XWIN-NMR		Version 3.5
$$ ##JCAMPDX= 5.01
$$ ##ORIGIN= Bruker BioSpin GmbH
$$ ##OWNER= nmr
$$ C:\u/data/dgb/nmr/ADRS/14060/pdata/1/auditp.txt
$$ ##AUDIT TRAIL=  $$ (NUMBER, WHEN, WHO, WHERE, WHAT)
(   1,<2005-12-21 10:29:19.12 +000>,<MAYBRIDGE\nmr>,<NMR_250MHZ>,
      <created by zg, POWCHK disabled, PULCHK disabled
       configuration hash MD5:
       62 19 C7 07 E1 42 D1 B7 37 6C 3D D0 77 39 F9 E6
       data hash MD5: 64K
       2E 63 A1 B2 D6 3E 75 E1 95 5D DF AE 11 CD AB 11>)
(   2,<2005-12-21 10:29:30.42 +000>,<MAYBRIDGE\nmr>,<NMR_250MHZ>,
      <Start of raw data processing
       ef LB = 0.3 FT_mod = 6 PKNL = 1 SI = 32K 
       data hash MD5: 32K
       11 D0 BB F0 D3 2C EC 27 D3 34 10 4B CA 1D 5F 7A>)
(   3,<2005-12-21 10:29:32.37 +000>,<MAYBRIDGE\nmr>,<NMR_250MHZ>,
      <apk 
       data hash MD5: 32K
       4E E0 7C 6A B3 D5 12 99 9F 4E 25 99 8D E6 5B 6F>)
(   4,<2005-12-21 10:29:33.14 +000>,<MAYBRIDGE\nmr>,<NMR_250MHZ>,
      <abs ABSG = 5 
       data hash MD5: 32K
       7F 8E 93 AF 26 C3 B7 35 07 3A D7 6F BB 65 2C A8>)
$$ ##END=
$$ 
$$ hash MD5
$$ A3 D6 03 9F 27 01 15 C5 43 90 38 CC F0 72 49 2A
##$RELAX= 
##$RELAX= 
##$RELAX= 
##$RELAX= 
##$RELAX= 
##$RELAX= 
##$RELAX= 
$$ Bruker specific parameters
$$ --------------------------
##$DU= <C:\u>
##$EXPNO= 14060
##$NAME= <ADRS>
##$PROCNO= 1
##$TYPE= <nmr>
##$USER= <dgb>
##$AMP= (0..31)
100 100 100 100 100 100 100 100 100 100 100 100 100 100 100 100 100 100 
100 100 100 100 100 100 100 100 100 100 100 100 100 100 
##$AQSEQ= 0
##$AQ_mod= 3
##$AUNM= <au_zg>
##$AUTOPOS= <7 >
##$BF1= 250.13
##$BF2= 250.13
##$BF3= 250.13
##$BF4= 250.13
##$BF5= 500.13
##$BF6= 500.13
##$BF7= 500.13
##$BF8= 500.13
##$BYTORDA= 1
##$CFDGTYP= 0
##$CFRGTYP= 5
##$CHEMSTR= <none>
##$CNST= (0..31)
1 1 145 1 1 1 1 1 1 1 1 1 1 1 1 1 1 1 1 1 1 1 1 1 1 1 1 1 1 1 1 1 
##$CPDPRG= <>
##$CPDPRG1= <>
##$CPDPRG2= <>
##$CPDPRG3= <>
##$CPDPRG4= <mlev>
##$CPDPRG5= <mlev>
##$CPDPRG6= <mlev>
##$CPDPRG7= <mlev>
##$CPDPRG8= <mlev>
##$CPDPRGB= <>
##$CPDPRGT= <>
##$D= (0..31)
0 1 0 0 0 0 0 0 0 0.06 0 0 0 0 0 0 0.0002 0 0 0 0 0 0 0 0 0 0 0 0 0 0 
0 
##$DATE= 1135160958
##$DBL= (0..7)
120 120 120 120 120 120 120 120 
##$DBP= (0..7)
150 150 150 150 150 150 150 150 
##$DBP07= 0
##$DBPNAM0= <>
##$DBPNAM1= <>
$$ [...]
##$SUBNAM7= <"">
##$SUBNAM8= <"">
##$SUBNAM9= <"">
##$SW= 20.6930455092707
##$SWIBOX= (0..15)
0 0 3 0 0 0 0 0 0 0 0 0 0 0 0 0 
##$SW_h= 5175.983436853
##$TD= 65536
##$TD0= 1
##$TE= 294.16
##$TE2= 300
##$TE3= 300
##$TEG= 300
##$TL= (0..7)
0 120 120 120 120 120 120 120 
##$TP= (0..7)
150 150 150 150 150 150 150 150 
##$TP07= 0
##$TPNAME0= <>
##$TPNAME1= <>
##$TPNAME2= <>
##$TPNAME3= <>
##$TPNAME4= <>
##$TPNAME5= <>
##$TPNAME6= <>
##$TPNAME7= <>
##$TPOAL= (0..7)
0.5 0.5 0.5 0.5 0.5 0.5 0.5 0.5 
##$TPOFFS= (0..7)
0 0 0 0 0 0 0 0 
##$TUNHIN= 0
##$TUNHOUT= 0
##$TUNXOUT= 0
##$USERA1= <user>
##$USERA2= <user>
##$USERA3= <user>
##$USERA4= <user>
##$USERA5= <user>
##$V9= 5
##$VALIST= <valist>
##$VCLIST= <CCCCCCCCCCCCCCC>
##$VD= 0
##$VDLIST= <DDDDDDDDDDDDDDD>
##$VPLIST= <PPPPPPPPPPPPPPP>
##$VTLIST= <TTTTTTTTTTTTTTT>
##$WBST= 1024
##$WBSW= 4
##$XGAIN= (0..3)
0 0 0 0 
##$XL= 0
##$YL= 0
##$YMAX_a= 435238
##$YMIN_a= -340082
##$ZGOPTNS= <>
##$ZL1= 120
##$ZL2= 120
##$ZL3= 120
##$ZL4= 120
##$ABSF1= 16.522
##$ABSF2= -4.171173
##$ABSG= 5
##$ABSL= 3
##$ALPHA= 0
##$AQORDER= 0
##$ASSFAC= 0
##$ASSFACI= 0
##$ASSFACX= 0
##$ASSWID= 0
##$AUNMP= <proc_1d>
##$AZFE= 0.1
##$AZFW= 0.1
##$BCFW= 0
##$BC_mod= 0
##$BYTORDP= 0
##$COROFFS= 0
##$CY= 12.5
##$DATMOD= 1
##$DC= 0
##$DFILT= <>
##$DTYPP= 0
##$F1P= 14.0000005364418
##$F2P= -0.99999901652339
##$FCOR= 0.5
##$FTSIZE= 32768
##$FT_mod= 6
##$GAMMA= 0
##$GB= 0
##$INTBC= 1
##$INTSCL= 1
##$ISEN= 128
##$LB= 0.3
##$LEV0= 0
##$LPBIN= 0
##$MAXI= 10000
##$MC2= 0
##$MEAN= 0
##$ME_mod= 0
##$MI= 0
##$NCOEF= 0
##$NC_proc= -3
##$NLEV= 6
##$NOISF1= 0
##$NOISF2= 0
##$NSP= 0
##$NTH_PI= 0
##$NZP= 0
##$OFFSET= 16.522
##$PC= 1
##$PHC0= 75.84204
##$PHC1= 1.533721
##$PH_mod= 1
##$PKNL= yes
##$PPARMOD= 0
##$PSCAL= 4
##$PSIGN= 0
##$REVERSE= no
##$SF= 250.13
##$SI= 32768
##$SIGF1= 0
##$SIGF2= 0
##$SINO= 400
##$SIOLD= 32768
##$SREGLST= <1H.DMSO>
##$SSB= 0
##$STSI= 32768
##$STSR= 0
##$SW_p= 5175.98343685301
##$SYMM= 0
##$S_DEV= 0
##$TDeff= 65536
##$TDoff= 0
##$TI= <Analysis number 999999
Compound Code 99
Book Reference 9
Project Code 9>
##$TILT= no
##$TM1= 0
##$TM2= 0
##$TOPLEV= 0
##$USERP1= <user>
##$USERP2= <user>
##$USERP3= <user>
##$USERP4= <user>
##$USERP5= <user>
##$WDW= 1
##$XDIM= 32768
##$YMAX_p= 445198747
##$YMIN_p= -132671
$$ End of Bruker specific parameters
$$ ---------------------------------
##NTUPLES= NMR SPECTRUM
##VAR_NAME=  FREQUENCY,     SPECTRUM/REAL,   SPECTRUM/IMAG
##SYMBOL=    X,             R,               I
##VAR_TYPE=  INDEPENDENT,   DEPENDENT,       DEPENDENT
##VAR_FORM=  AFFN,          ASDF,            ASDF
##VAR_DIM=   32768,         32768,           32768
##UNITS=     HZ,            ARBITRARY UNITS, ARBITRARY UNITS
##FACTOR=    0.157963299565203, 1,           1
##FIRST=     4132.6476996994, 0,             0
##LAST=      -1043.33573715361, 0,           0
##MIN=       -1043.33573715361, -132671,     0
##MAX=       4132.6476996994, 445198747,     0
$$ Real data points
##PAGE= N=1
##DATA TABLE= (X++(R..R)), XYDATA
$$ [...]
16676a8125l2420P038K037J3483r130r671L1464m555r448K6072K8773l436m1919
16663a9837k6820P203K9984j2355r802K0579l170r339j5045j7653K4765J5113
16651a6377j6406l7222j0167J0601J2572M3409n905k5940J5954Q863m3089K1902
16639d1805K4103n599K3831k9808l341J6490j6600r277K1128j5220J7090J8439
16627e69M3632J8660l9728r173Q942Q032k0271k1848J1265J6073l028k8545j9260
16614c5818K6788J9380l1875k822K1542l5972m465J8759K864L1159O682r15K8971
16601D4278k0972k1022k7020r563N853N358M2122j4602J0526o204k7971j2029
16589c1246p553N959j9233l485M6509K1073k9953J1904n812L1396K6120k3040
$$ plain form
16676 -18125 -50545 -43507 -41470 -27987 -37117 -46788 -15324 -19879 -29327 -3255 25518 22082 -19837
16663 -19837 -46657 -39454 -9470 -21825 -31627 -11048 -14218 -23557 -38602 -56255 -31490 -16377
16651 -16377 -32783 -70005 -80172 -69571 -56999 -13590 -19495 -45435 -29481 -20618 -63707 -41805
16639 -41805 -17702 -23301 530 -29278 -32619 -16129 -32729 -42006 -20878 -36098 -19008 -569
16627 -569 43063 61723 21995 12822 21764 29796 9525 -12323 -1058 15015 11987 -16558 -35818
16614 -35818 -9030 10350 -21525 -24347 -2805 -38777 -43242 -24483 -21619 9540 16222 15307 44278
16601 44278 23306 2284 -24736 -34299 -28446 -23088 19034 4432 14958 8754 -19217 -31246
16589 -31246 -38799 -32840 -52073 -55558 -9049 12024 -17929 -6025 -11837 19559 45679 22639
16577B2639l0270J6986k8717L8476M5668k3863q726k7182j8073K7097L1401n285
16565D0151m8702O211j6618P976L7057l50j3315K2479p225o783L953j2932J0888
16552B2790M241Q431l4111k0714K943K4023k1109p658J9937J605K0388m333l9589
16539b3156m800O973Q76j1312r92J9301k0257O424K3740J4798J6618k379q621
16526A7213k9103l895l600j017n363q492L2135N902K3611K0623J0289k0114j6050
16513B2139k5475q537L5483K7089r340n608O179k5697k3514j9000J9393M4118
16501C7230J139q085J4449k1916k4098r336K1480Q330m940l8365O395K8952J0982
16488B2217j2019r019l6503M833R523N959K4872K7485Q233Q107m5410m8382J172
$$ plain form
16577 22639 -7631 9355 -19362 19114 64782 40919 32193 5011 -13062 14035 45436 40151
16565 40151 -8551 -2340 -18958 -10982 26075 25725 12410 34889 27664 20881 24834 11902 22790
16552 22790 27031 35462 1351 -19363 -16420 7603 -13506 -21164 -1227 378 20766 16433 -23156
16539 -23156 -27956 -20983 -20107 -31419 -32411 -13110 -33367 -26943 -3203 11595 28213 25834 17213
16526 17213 -11890 -15785 -19385 -20402 -25765 -34257 -2122 3780 27391 48014 58303 38189 22139
16513 22139 -3336 -11873 23610 50699 41359 35751 41930 16233 -7281 -26281 -6888 37230
16501 37230 38369 30284 44733 22817 -1281 -10617 10863 19193 14253 -24112 -17717 11235 22217
16488 22217 10198 1179 -35324 -30491 -20968 -15009 9863 37348 45581 53688 8278 -40104 -38932
16475c8932J2513K272j2501J431J8603j7960o018O058M0705J0712k9675j8337
16463c1129J5249J2107J6742K009k0527J2444j7833l3222J2480L1278k5605k127
16451b8134q071L8966k772K4925K2242k8598O050p17j8385k1646N39O291k1472
16438c0782Q009l1072j3901K0823k562J80N978J8484O964k4442k0346o4971J7003
16425a10635P3950K8617J7966M093k4005j1721K0779K1653j7794j3407j7956J8491
16413i969K0358n273J10K2930N928M758l904o0519j9731P642J621k7548m687j2243
16399h0527j1701J6125J2941K9791j209l556J9292L1876M9065J3845k2939J7640
16387G0643m3857l1677K4029k1306k1409L6720L7411k087k0995m4698L524J4048
$$ plain form
16475 -38932 -26419 -24147 -36648 -35217 -16614 -34574 -40592 -34534 6171 16883 -12792 -31129
16463 -31129 -15880 -3773 12969 14978 -5549 6895 -10938 -44160 -31680 -402 -26007 -28134
16451 -28134 -36205 2761 -11 24914 47156 18558 24608 23891 5506 -16140 -15601 -9310 -30782
16438 -30782 -22773 -53845 -67746 -46923 -49485 -49305 -43327 -24843 -17879 -42321 -62667 -127638 -110635
16425 -110635 -36685 -8068 9898 13991 -10014 -21735 -956 20697 2903 -10504 -28460 -9969
16413 -9969 10389 5116 5226 28156 34084 38842 34938 -25581 -45312 -37670 -36049 -63597 -68284 -80527
16399 -80527 -92228 -76103 -63162 -33371 -34580 -38136 -18844 13032 62097 75942 53003 70643
16387 70643 26786 -4891 19138 -2168 -23577 13143 50554 48467 27472 -17226 -13702 346
16375C46l808n204j3346J681j7178M777o370J7877K7938j3608j7463O6042p607
16362C4077k3245k2519J4645K5001J2674k5945K809N408k9039J250J4905M62j089
16349I394L1042j924K0813j237k4906j1057N612j4591o425J5440j5235j7444m527
16336a5045M0727J6874k5442j9641J7520P258n899L879r146j2181J2444j8711
16324g363R857j4924k730K2163j4415k405L4195n235o446O831L405k1087k3883
16311b2037K3868L1018J089j2976r40q960k479K2044J0442k1204j4272q185m1398
16298d3990o347Q049K2203Q713k2997j4439K3879M2299O293o2918q614M8321K5671
16285B6123j73m3206k6353P833j711L6182K0935O727R728o217k7501j1419Q845
$$ plain form
16375 346 -3462 -8666 -22012 -20331 -37509 -32732 -39102 -21225 6713 -6895 -24358 41684 34077
16362 34077 10832 -11687 2958 27959 40633 14688 17497 22905 -6134 -4884 10021 10483 9394
16349 9394 40436 38512 59325 58088 33182 22125 27737 13146 6721 22161 6926 -10518 -15045
16336 -15045 25682 42556 17114 -2527 14993 22251 16352 20231 11085 -1096 11348 -7363
16324 -7363 2494 -12430 -15160 7003 -7412 -9817 24378 19143 12697 19528 22933 1846 -22037
16311 -22037 1831 32849 33938 20962 20022 11062 8583 30627 41069 19865 5593 -2592 -43990
16298 -43990 -50337 -42288 -20085 -11372 -34369 -48808 -24929 17370 23663 -39255 -47869 452 26123
16285 26123 25950 -17256 -43609 -35776 -37487 -1305 19630 26357 36085 29868 2367 -9052 -207
16272b07r508M941K5155M934o666m299N245M226j886r605l0072K289J3880l0768
16258c2341Q194J7019K046j2411J7937l6697m1786p036K1663J5683L4745j9349
16246c2333J134L336K7208J7301o377m1944R013j1470J0279J8686L600K245J3513
16233A4191o911k49P026J0373j3061l6751k3809J2113M1092J7318j6950j1834
16221g452l0924j3731k3510K4582K0626j7166J6834J9434K3900J928k0565L2956
16209B6912L157J5786k3486k4116j0894R10J9055l34L811l551Q73j7916k3525
16196c3318j2181J6672k0253j7282L9590L7663n856o035j4073J8568L0638p2874
16184c8741j8864N0786L8002k7516r279J5506r737k6618N549q022K574q462j3896
$$ plain form
16272 -207 -9715 -4774 20381 25315 18649 14350 19595 23821 21935 12330 -17742 -15453 -1573 -32341
16258 -32341 -24147 -7128 -5082 -17493 444 -36253 -78039 -85075 -63412 -47729 -12984 -32333
16246 -32333 -31199 -27863 -655 16646 10269 -31675 -22662 -34132 -23853 -5167 -1567 678 14191
16233 14191 7280 7031 14057 24430 11369 -25382 -49191 -37078 4014 21332 4382 -7452
16221 -7452 -38376 -52107 -75617 -51035 -30409 -47575 -30741 -11307 12593 14521 -6044 26912
16209 26912 30069 45855 22369 -1747 -12641 -11731 7324 6990 10801 7250 8123 -9793 -33318
16196 -33318 -45499 -28827 -49080 -66362 -26772 10891 5035 -1000 -15073 3495 34133 -38741
16184 -38741 -57605 -6819 31183 3667 -5612 9894 157 -26461 -20912 -28934 -26360 -34822 -48718
16171d8718J0752N1495K6634k0644K7239J4025k9221m3657k6710Q082k094P901
16159b4916j1006m331K8895L3953N14j0898K7333n689j1925J0926J3483M772q385
16146D2726k8059j6631k3533k1978K0774K8963k2802O076K1496j5313J2274n698
16134a705n619M2990j382j2472k9501J3308l3259J0167K4887o765J2802J8933
16122C2384J3457m005J1183j4065j1028l837k4819j2935J8876j1803M5722L6003
16110G5133P087k6311j2609j5036l7571J3983J2892K6063q853j436J0078n970
16098C7450k8608j1295j4978J3706L2699J053j897R053k523o171J2845l3305q628
16085e99L3234Q853K360M1874p820o8161P674j5219l4924j6805N4111M8464r741
$$ plain form
16171 -48718 -37966 13529 40163 19519 46758 60783 31562 -12095 -38805 -30723 -32817 -24916
16159 -24916 -35922 -40253 -11358 22595 23109 12211 39544 33855 21930 32856 46339 51111 42726
16146 42726 14667 -1964 -25497 -47475 -26701 2262 -20540 -14464 7032 -8281 3993 -1705
16134 -1705 -7324 35666 34284 21812 -7689 5619 -27640 -17473 7414 649 13451 32384
16122 32384 45841 41836 53019 38954 27926 24089 -730 -13665 5211 -6592 39130 75133
16110 75133 82220 55909 43300 28264 -9307 4676 17568 43631 34778 33342 43420 37450
16098 37450 8842 -2453 -17431 -3725 28974 30027 28130 37183 34660 28489 41334 8029 -599
16085 -599 32635 41488 43848 85722 77902 9741 17415 2196 -32728 -49533 4578 53042 43301
16072D3301n0274k0461l7332K0450J7024J6369J5389k227L883M381j5298j8874
16060b3669J346K2962J1407j8148K8630m374J901J0312q799j5610m892K1409j5029
16047G446p45N37j7514M592R867l8813K824K5561K6025j0541n749N642k3254j0644
16033b4766k7722M2063o516J6801J1030j1302P686L6311J7752K674l1617Q653
16021D1047k5178k8990l1531M0284K5553J7008P589l766L4722L746l8244n7299
16009a5059l518L2088R495k2860k0499K3428J5960K3267J7593k8885k5024o026
15997d0q34k3543K5914L1546k4336m0408m377J5047J1051J582J7188q526m0624
15984d0360j0197N0006L6772l3640K286J1773l2598j0049J2299N3717K7095J1993
$$ plain form
16072 43301 -6973 -27434 -64766 -44316 -27292 -10923 4466 2239 6122 10503 -4795 -23669
16060 -23669 -22323 639 12046 -6102 22528 18154 20055 30367 21568 5958 1066 22475 7446
16047 7446 6701 7238 -10276 -5684 4183 -34630 -31806 -6245 19780 9239 3490 9132 -14122 -24766
16033 -24766 -52488 -10425 -16941 -140 10890 -412 7274 43585 61337 64011 32394 41047
16021 41047 15869 -13121 -44652 -4368 21185 38193 45782 42016 76738 80484 42240 -15059
16009 -15059 -18577 13511 23006 146 -20353 3075 19035 42302 59895 31010 5986 -40
15997 -40 -874 -24417 1497 33043 8707 -31701 -36078 -21031 -9980 -8398 8790 264 -40360
15984 -40360 -50557 -551 36221 2581 4867 16640 -15958 -26007 -13708 40009 67104 79097
15972G9097l1943j3679J0581k542J9736k3372j5570L785k2857r409j1603K0762
15960B986K5615r32n5769q515K2641J3980J1599o586j1769j2139Q384j1332M257
15947a7580k9393K893L0231J6762k5894l5863M1611J4744J0294l897M085K7892
15935C5885J4455m3877j6182J2908K3074j278j1586l5050k951J9609m179O980
15923b192K9083p258k1561Q593p207j9110j5084K2925P631j5331J4958K41j0560
15910a4872j9123J7189k3972J6012J0768o4438K9365N0758K5216j9239j4158P6
15898f418P625r383j8673N744J2710n609K050k4152l7310J8377K0730J1676J4635
15885g998j7949m6583O065K7977j9348j129K3004K6926J8132k1757J2366L9974
$$ plain form
15972 79097 47154 33475 44056 41514 61250 37878 22308 26093 3236 -6173 -17776 2986
15960 2986 28601 27669 -28100 -36615 -13974 6 11605 5019 -6750 -18889 -10505 -21837 -17580
15947 -17580 -46973 -44080 -13849 2913 -22981 -58844 -17233 -2489 7805 3908 7993 35885
15935 35885 50340 6463 -9719 3189 26263 24985 13399 -21651 -24602 -4993 -9172 -2192
15923 -2192 26891 19633 -1928 6665 -542 -19652 -34736 -11811 -4180 -19511 -4553 -4312 -14872
15910 -14872 -33995 -16806 -40778 -24766 -13998 -78436 -49071 1687 26903 7664 -6494 -6418
15898 -6418 1207 -8176 -26849 -21105 -8395 -14004 -11954 -36106 -73416 -55039 -34309 -22633 -7998
15885 -7998 -25947 -72530 -66465 -38488 -57836 -58965 -35961 -9035 9097 -12660 -294 39680
15873C9680j3872k6677N0188J3002j5539j0603l5232J4487J2737n712j5097J808
15861I170J0640L800K3975l2837k5940P717J2077L930l590K359j4685j9542N02
15848b2424q090n540j153l733L390L0345M8022j5849l8950J5457j2176m342R076
15835e967J4270j5216j4999j5928P346L643k267k300k904L2418J9927K614M925
15822B5562m229j5863k3652o847K5502Q257r957j5033O659k9245l1924L3562L8384
15809A176m536k4190m019k4204O343K9440J7655R173l108k609j1566K007j7844
15796b6282j2722J5192L3442J6653r304l0243r794R558L1576N226j0649r2K076
15783A4637J085K2005J0386J2943k1969k9311k2483K446k1736n791L8126Q061
$$ plain form
15873 39680 25808 -869 49319 62321 46782 36179 947 15434 28171 22459 7362 9170
15861 9170 19810 23610 47585 14748 -11192 -3475 8602 12532 8942 11301 -3384 -22926 -22424
15848 -22424 -30514 -36054 -37207 -40940 -37550 -7205 40817 24968 -13982 1475 -10701 -15043 -5967
15835 -5967 8303 -6913 -21912 -37840 -30494 -26851 -29118 -31418 -34322 -1904 18023 20637 25562
15822 25562 21333 5470 -18182 -25029 473 8730 -1227 -16260 -9601 -38846 -70770 -37208 1176
15809 1176 -3360 -27550 -31569 -55773 -49430 -19990 -2335 6838 3730 1121 -10445 -8438 -26282
15796 -26282 -39004 -23812 9630 26283 16979 -13264 -23058 -13500 18076 23302 12653 12561 14637
15783 14637 15722 37727 48113 61056 39087 9776 -12707 -10261 -31997 -37788 338 8399
15771H399L407Q857n835J0314R715L187k3462j278K5339R821k1318m0941j6699
15758c0494J3493J7075j9786j239J530l596P33K5588M4130j8956l285K340O841
15745C4374m308m7629l501J1772k905L3416j0504j0209j7137N289K4015J6751
15733B9424L491O238k9991k616K5090P780j04l692k461l741J8871Q586o173j2351
15719C8351k8428l5756k6817K9176K4141J1673J288J5717k041l424J819m3147
15707a7448j8374J5895K7433K8162M0789j4383l6379k2274O778J2831P68j4300
15695I498O809K4123J600j1711l8451l271L1270l25J9264J8234o984r748j9082
15682B1226J416K5716K7597j9825k4139O490J9830P467M926o787k4981J2241N072
$$ plain form
15771 8399 11806 20663 14828 25142 34857 38044 14582 13304 38643 48464 27146 -13795 -30494
15758 -30494 -17001 74 -19712 -20951 -19421 -23017 -22284 3304 47434 28478 25193 27533 34374
15745 34374 30066 -17563 -21064 -9292 -12197 21219 10715 506 -16631 -11342 12673 29424
15733 29424 32915 39153 9162 6546 31636 39416 39312 35620 33159 29418 48289 56875 50702 38351
15719 38351 9923 -25833 -52650 -23474 667 12340 13628 29345 27304 23880 25699 -17448
15707 -17448 -35822 -19927 7506 35668 76457 62074 25695 3421 10199 23030 23798 9498
15695 9498 16307 40430 42030 30319 -8132 -11403 19867 19542 38806 57040 50056 40308 21226
15682 21226 22642 48358 75955 56130 31991 38481 58311 65778 70704 63917 38936 51177 56249
15669E6249j5399J4243L793k593k0172k0706M003l2080l1382M040n068Q60M3049
15656a163J4970j0190j6162j3190j7022j8762R258r815J297k6335J7861P236K2032
15643c9985J869j8877k8196N10j408k4467k0988L1216L5387J2099J2488J8158
15631b2194K351j4003J6596m708K7447J4494k7015P639j3525K7721k7063j7662
15619b9922J7424j418j3373L5136q937m0035K2714L0926l9599J8719j8961j0672
15607c7998M6559M879l14k8134K2773L2227Q621J16J104j6530l5332Q998K2585
15594B9554Q247m1913l9561K2181P856j2703r407L393L0985J2434o601K2534R162
15581C6161P512o881l8641j7361P85k2396j2555J6258L4310J0581J3213n115M945
$$ plain form
15669 56249 40850 55093 58886 56293 36121 15415 19418 -12662 -44044 -40004 -45072 -44212 -1163
15656 -1163 13807 3617 -12545 -25735 -42757 -61519 -52261 -62076 -60779 -87114 -69253 -62017 -39985
15643 -39985 -38116 -56993 -85189 -84679 -86087 -110554 -131542 -100326 -64939 -52840 -40352 -22194
15631 -22194 -19843 -33846 -17250 -21958 5489 19983 -7032 607 -12918 14803 -12260 -29922
15619 -29922 -12498 -13916 -27289 7847 -1090 -41125 -18411 12515 -27084 -8365 -27326 -37998
15607 -37998 8561 13440 13126 -15008 7765 39992 48613 48729 49833 33303 -2029 6969 29554
15594 29554 37801 -4112 -43673 -21492 -13636 -26339 -35746 -32353 -1368 11066 4465 26999 36161
15581 36161 43673 36792 -1849 -19210 -18425 -40821 -53376 -37118 -2808 7773 20986 15871 20816
15568B0816J1587l02j2811K852j742K0331m961l7776k4694L355M4524O847k9325
15555a299m457L2800J3276k8291K9732J7346k5203Q548R672k7000l7633k0249
15543c2758l117N5727Q979M476J0539K462j0360J7672k9613l201j4694j450K4184
15530B8846K0035j0843k1715J7831P708L6583j0565l5906o221J0361l388j8263
15518A4463Q562K0297j4122K84q502n721r175J2872L3586J9261m505k1818l7198
15505H284j4195R786P575L588L4321J321j4242J7162q054p342J0779j7398l9928
15492h343j3078J0624K1096J8118k49j3316k8594k5261j1617l7426K7771K8305
15480c1970J2286J3496J0540J1279P752j23q792j9349l7161M074L7375J1359L5808
$$ plain form
15568 20816 32403 32101 19290 22142 20400 40731 35770 -2006 -26700 -23345 21179 28026 -1299
15555 -1299 -5756 27044 40320 12029 41761 59107 33904 42452 52124 25124 -12509 -32758
15543 -32758 -35875 19852 28831 33307 43846 46308 35948 53620 24007 20806 6112 4662 28846
15530 28846 48881 38038 16323 34154 41862 78445 67880 31974 25753 36114 32726 14463
15518 14463 23025 43322 29200 29484 20982 15261 6086 18958 52544 71805 67300 45482 8284
15505 8284 -5911 3875 11450 15038 49359 50680 36438 53600 45546 38204 48983 31585 -8343
15492 -8343 -21421 -10797 10299 28417 28168 14852 -13742 -39003 -50620 -88046 -60275 -31970
15480 -31970 -19684 -6188 4352 15631 23383 23260 14468 -4881 -42042 -37968 -593 10766 46574
15467D6574K6116j5338l6463j9882M2522K1957J0238l1882n0425J1079L6576P359
15455D8431j5665m187k3058o574J9250J2289j3831l7093j0428K008N108o046J5107
15442a4689K0651n301P879L307K8178J8534M788P007j6834j4470K0852k6209k836
15429C0857q620p426q627K7790R796P780K5283j4719k8733j9640j7315J2162L0243
15416C8831M864m1287K1439J4775n5813k1783J4697K5862L0917l21j8785q891
15404D505J2650k8607l8276J3175M7461j5226k6963l563j5800q081j0339J4101
15392e4963J4726J2124J568k7498K8790L0514j7234P29l023K6873j8511l7906
15380d3811J1694O320N370Q005J5628J3306J2930L844k1154k947m465k1437o072
$$ plain form
15467 46574 72690 57352 20889 1007 43529 65486 75724 43842 -6583 4496 41072 48431
15455 48431 32766 28579 5521 -1053 18197 30486 16655 -20438 -30866 -28858 -23750 -29796 -14689
15442 -14689 5962 661 8540 11847 40025 58559 63347 70354 53520 39050 59902 33693 30857
15429 30857 22237 14811 6184 33974 43770 51550 76833 62114 33381 13741 -3574 8588 38831
15416 38831 43695 2408 23847 38622 -17191 -38974 -24277 1585 32502 32181 13396 4505
15404 4505 17155 -11452 -49728 -36553 10908 -4318 -31281 -34844 -50644 -58725 -69064 -54963
15392 -54963 -40237 -28113 -26545 -54043 -25253 5261 -11973 -11244 -14267 12606 -5905 -43811
15380 -43811 -32117 -25797 -20427 -12422 3206 16512 29442 33286 12132 9185 4720 -16717 -22789
15367b2789ON4591L1686M184m0224k8855J7583J915k4445m7554m530J8874J1688
15354b7870P278O921l0640K107K2439K7630k9243k3809L5802O692k9875j422J4137
15341a9853R445N705J2849j33j2342o887k4006j0881Q632J8849J5391k6976k2936
15328e3143K6438L2704k5604K892p524j7971o252K0419m044J8113j0786j8919
15316d3677L8078L4616m034K824J4762J2716K9007k0092o0097Q283O867M145q711
15303A4687k0562R810L6448K0657j1012k6860k4645j4828J3000K0545M998j9391
15291B847K6692Q233l958J7963K4726j0769l4557Q883k6481K268L1542J6019k521
15278F0887m1241m2029M381J8225l487n704j1187k391J0502K2494J0184k2171
$$ plain form
15367 -22789 -22783 31808 63494 67678 27454 -1401 16182 18097 -6348 -53902 -58432 -39558 -27870
15354 -27870 -20592 -13671 -44311 -42204 -19765 7865 -21378 -45187 -9385 -2693 -32568 -33990 -19853
15341 -19853 -10408 -4703 8146 8013 -4329 -11216 -35222 -46103 -37471 -18622 -3231 -30207 -53143
15328 -53143 -26705 5999 -19605 -16713 -24237 -42208 -48460 -28041 -32085 -13972 -24758 -43677
15316 -43677 -5599 29017 24983 27807 42569 55285 84292 64200 4103 12386 19253 23398 14687
15303 14687 -5875 3935 40383 61040 50028 23168 -1477 -16305 -3305 17240 22238 2847
15291 2847 29539 37772 33814 51777 76503 65734 31177 40060 13579 15847 47389 63408 60887
15278 60887 19646 -22383 -18002 223 -3264 -8968 -20155 -22546 -12044 10450 20634 -1537
15266a537k0711k1633J7615Q961l180J5519J2680P012P634l100L0299l1559k5588
15253g588J0684J9437J2834m403K5183J3539j1831j8408J6583J8934j735k2177
15241E1052l1803k7274K3600N1732p184l4066K7183j3000K055q848k2386l291
15229G770k8729K463J9090K6524K189j5351l7061r847J6854L2083R061l4092J173
15216g873K4064K152j0449j9575J5794Q60j0225r179K1489K8619m363k1327J232
15203A1219J3092P735l081J1011k9583k5116K025L204j2854j9259L7291J420o485
15190i381q376K0563K9081K5068k0947k5936l7374P343p024k8967r466K8137O507
15177c0772K6055K6290k8342m1261L261n861P89P341k894J2039K0345J0866M107
$$ plain form
15266 -1537 -22248 -43881 -26266 -17305 -20485 -4966 7714 14726 22360 19260 49559 18000 -7588
15253 -7588 3096 22533 35367 30964 56147 69686 57855 39447 56030 74964 73229 51052
15241 51052 19249 -8025 15575 67307 60123 26057 53240 40240 42295 33447 11061 7770
15229 7770 -20959 -18496 594 27118 29307 13956 -23105 -32952 -16098 15985 25046 -9046 -7873
15216 -7873 16191 18343 7894 -11681 4113 4973 -5252 -14431 7058 35677 31314 9987 11219
15203 11219 24311 32046 28965 39976 10393 -14723 -12698 -9494 -22348 -41607 -4316 -2896 -9381
15190 -9381 -17757 2806 31887 56955 36008 10072 -27302 -19959 -26983 -55950 -65416 -37279 -30772
15177 -30772 -4717 21573 -6769 -48030 -44769 -50630 -49841 -42500 -45394 -33355 -13010 -2144 1963
15164A963J4563R708N276j7866l3274L246J1157o010J5878n580j0435Q146K9336
15151B6108K1591K590L650K3788j3318k0311j8070n959J0683K7838n399K2483
15139G5674K4682j8198q604r034j0644j277K7671J1754k2630l7389j4354J7798
15127C5449l1718j1501r696L263K8428K0106j096J712J2640j311K6431j0322o346
15114E6039J0300p336l1811k640j7112l0758j0058L6091K0906k3609n094J2613
15102G531J3065J8693K4650q487K2790j3289m3289l9179k7382j0816J9533M3697
15090G517Q816k8272j8959L1223J9495j1778k8935p617M6771J6187k940k874l0893
15077b259k9854O940P621K1746k3076P549n471l0257Q144r131N26K2887K1384
$$ plain form
15164 1963 16526 26234 31510 13644 -19630 -16384 -5227 -11237 4641 -939 -11374 -3228 26108
15151 26108 47699 50289 53939 77727 64409 44098 26028 20069 30752 58590 53191 75674
15139 75674 100356 82158 73554 64520 53876 52599 80270 92024 69394 32005 17651 35449
15127 35449 3731 -7770 -17466 -14203 14225 34331 33235 34947 47587 46276 72707 62385 56039
15114 56039 66339 59003 27192 24552 7440 -23318 -33376 2715 23621 12 -5082 7531
15102 7531 20596 39289 63939 55452 78242 64953 21664 -17515 -44897 -55713 -36180 7517
15090 7517 16333 -11939 -30898 325 19820 8042 -20893 -28510 18261 34448 31508 28634 -2259
15077 -2259 -32113 -25173 -17552 4194 -18882 -11333 -16804 -47061 -38917 -48048 -47522 -24635 -3251
15064c251k874n510J0022J3264j4520j7421K2511L3366J6212k7776p30K5550j4835
15051C4008j534L712n061m82p322O351K2673M287P937N810l5492j0823j6104K957
15037A0917l622J3068k798J5133O414j6308Q677K8195j740j2218k5909j7433J4685
15024A7061J501k359l389O301P956M456k7492Q12Q19L187K252p064M2759j903
15010D4897j8153J9549j0618j6236n218K9428K601J5496K2197P753l9074J0945
14998F3567J7232M358N459j9211j8674m2152K103l45P602K7895k8126k4770L0688
14985B5626J960j3638L884p621K7078L1731q268N306n692j2615k5914m283p776
14972I778J5906j6871P004R207J3966j1614k6767k8528L3283P625J7705K1094
$$ plain form
15064 -3251 -6125 -11635 -1613 11651 -2869 -20290 2221 35587 51799 24023 23293 48843 34008
15051 34008 32474 36186 31125 30643 23321 29672 52345 56632 64569 70379 34887 24064 7960 10917
15037 10917 7295 20363 17565 32698 39112 22804 31481 59676 57936 45718 19809 2376 17061
15024 17061 18562 16203 12814 19115 27071 31527 4035 4847 5666 8853 11105 4041 46800 44897
15010 44897 26744 46293 35675 19439 14221 43649 46250 61746 83943 91696 52622 63567
14998 63567 80799 85157 90616 71405 52731 10579 12682 12337 19939 47834 19708 -5062 25626
14985 25626 27586 13948 17832 10211 37289 69020 60752 66058 60366 47751 21837 17554 9778
14972 9778 25684 8813 15817 25024 38990 27376 609 -27919 5364 12989 30694 51788
14960E1788o735L1822J9565R74l7647j3216N468k1067O684J3228k1723k3429j5911
14947a0199j7980j5503J0256J8877K2829J8784j4924j7187M598J2501P975r986
14935A0041m5365n938j619j8642J3713j6256J6332K9573K9363M4296K7390n016
14923G7872j851l982J2537k4858l2675l7083j3921K3476J83j4952Q719J3659P317
14910A4441O422L1121r4k957K7269j5895n1034l9935J977o165K1199P651n327
14897a1327l269j3437K7875J4187m071K1572p778L363o233j7570o718j4901J7875
14884d32L2711k2700J289J1489k3317l0228Q529J6169K5276r513m0335k688K2972
14871a0778J3030Q443n328L2456K707j4988J1274l2152J1544J2011o963l2841
$$ plain form
14960 51788 45053 76875 96440 97414 59767 46551 52019 30952 37636 50864 29141 5712 -10199
14947 -10199 -28179 -43682 -33426 -14549 8280 27064 12140 -5047 -449 12052 20027 10041
14935 10041 -35324 -41262 -42881 -61523 -47810 -64066 -47734 -18161 11202 55498 82888 77872
14923 77872 76021 72039 84576 59718 27043 -10040 -23961 -485 -302 -15254 -6535 7124 14441
14910 14441 20863 51984 51890 48933 76202 60307 9273 -30662 -28685 -34850 -13651 -6000 -11327
14897 -11327 -14596 -28033 -158 14029 9958 31530 23752 27115 20882 3312 -3406 -18307 -432
14884 -432 32279 9579 10868 22357 -960 -31188 -22659 -6490 18786 9273 -31062 -33750 -10778
14871 -10778 2252 10695 5367 37823 40530 25542 36816 4664 16208 28219 21256 -11585
14859a1585m608K8781J2264J722L780M3083k2075k0394j152P562r765m4724k3338
14846d0449P915K3446M2544J573k5857j2578K7981j7563o7977o434K4909R178
14834c3312j6365J4382J5331R87L176J7885o351j2308k7034L4287J0423o806N542
14821a63R455R063j527M3836P423o078j7948j4112L1707k1529k6730J7556m1406
14808a0453j9729J6742N162K8044l926l2742n74K2446J7678p43K0347K4855l4033
14795C3074J9932l066p044p837K7496j3177q296J8197n605L2244N956j1669r024
14782G1181j8377K9126J5648j4287l8235k5514j5739k734l570m905o354M3008
14770B9248K2926P231L780O710r65R392j3999j1338l0668p236J3597Q10q977k4854
$$ plain form
14859 -11585 -16193 12588 24852 26574 30354 73437 51362 30968 29816 37378 27613 -17111 -40449
14846 -40449 -32534 -9088 33456 35029 9172 -3406 24575 7012 -60965 -67399 -42490 -33312
14834 -33312 -49677 -35295 -19964 -18977 -15801 2084 -4267 -16575 -43609 -9322 1101 -5705 -163
14821 -163 9292 18355 16828 60664 68087 62009 44061 29949 61656 40127 13397 30953 -10453
14808 -10453 -30182 -13440 -8278 19766 15840 -16902 -17476 4970 22648 21905 42252 67107 33074
14795 33074 53006 49940 42896 35059 62555 49378 41082 59279 53674 85918 91874 80205 71181
14782 71181 52804 81930 97578 83291 45056 19542 3803 1069 -2501 -7406 -13760 29248
14770 29248 52174 59405 63185 69895 68930 78322 64323 52985 22317 15081 28678 29488 20511 -4343
14756d343Q916L492R865j5322j6986J3718K1676j6583r723Q626M902J4201J1790
14743C4229j1272k9788k6444l609N674J5093O522k171K4653J7455N688k2452R210
14730B2788L7632K2500j1014k1524J7844J1711k6850k5235J2178k5619k7955J2426
14718a118j4158k2894L2370J8750l0146M874J8349P565k2024j4846Q21J1014M0632
14705B9189k685J2771J388k1412j4871q752j714k5168J6228M4920k56k768k732
14692B4138k8112O773K3342L0044K1346J4644j9282n9837j7919j0834k20J0054
14680e863K4921L9246o71j15J2676O81o7j925L2398j339k7150k1156n593j5879
14666C0164j6525m065l867L3663N664k5488l8361r681K6212L5316L3859J8796
$$ plain form
14756 -4343 4573 8065 17930 2608 -14378 -660 21016 4433 -5290 3336 8238 22439 34229
14743 34229 22957 -6831 -33275 -36884 -31210 -16117 -9595 -11766 12887 30342 36030 13578 22788
14730 22788 60420 82920 71906 50382 68226 79937 53087 27852 40030 14411 -13544 -1118
14718 -1118 -15276 -38170 -5800 12950 -17196 -12322 6027 13592 -8432 -23278 -22457 -11443 29189
14705 29189 26504 39275 40663 19251 4380 -4372 -6086 -31254 -15026 29894 29638 26870 24138
14692 24138 -3974 2799 26141 56185 77531 92175 72893 13056 -4863 -15697 -15917 -5863
14680 -5863 19058 58304 57633 57518 70194 70875 70808 68883 101281 99942 72792 51636 46043 30164
14666 30164 13639 9574 5707 39370 45034 19546 -18815 -28496 -2284 33032 66891 85687
14654H5687m5575k0939K4117J6536k1503R085k1084l3656k2570J3889O358j5197
14642b4852J8360k961l2830j1987l013l471J3208J9517K5383J6702L5384M745
14630E4185q750j7137l2782m0479L4470L2061r522l6627L840P976k0811J9981
14618a3595N9729j886r135J9541M5208l1141m4585J1569O765k604o856k2663k4834
14605a4487j6336K1044K9735M0534n280r993L7397J3991l8972k4920K0191r405
14593D3499j7688k0323l2503R578K8628L3381M998K3577j0507j4797L0541J3946
14581I2330m2169J261J5045k045j9874m0357O71L0038P327L188J2371l1045M386
14568C1127J826j5117j258J0853M5115j1648l1572j7508K4577J2419K3063j1494
$$ plain form
14654 85687 40112 19173 43290 59826 38323 47408 26324 -7332 -29902 -16013 -9655 -24852
14642 -24852 -6492 -9453 -42283 -54270 -57283 -60754 -47546 -28029 -2646 14056 49440 54185
14630 54185 45435 28298 -4484 -44963 -10493 21568 12046 -24581 -20741 -12765 -33576 -13595
14618 -13595 46134 44248 35113 54654 99862 68721 24136 35705 42470 39866 33010 10347 -14487
14605 -14487 -30823 -9779 19956 60490 55210 45217 82614 96605 57633 32713 52904 43499
14593 43499 25811 5488 -27015 -17437 11191 44572 49570 73147 62640 47843 78384 92330
14581 92330 50161 51422 66467 64422 44548 4191 4862 34900 42227 45415 57786 26741 31127
14568 31127 32953 17836 16578 27431 72546 60898 29326 11818 36395 48814 71877 60383
14556F0383m4441l6945O538J6859n391J7867R691L6045P59Q862l228k2578J0062
14543E4483L3136J9701m419r521K1984m5388n241r381r681R78m0488k6689O2438
14530D1912J8841k0248k68K2106q173k8851j1261O206k1148P019j7795K6320K1408
14517C6068k2386O79N725q863k1791L4422L384j9553Q209K2549O370p947j8457
14504A8409k0655K9068M926p25J1783j8175j7729P412l0725K5738J2285J6458
14492C8070N140j8231p407J7578k22K4601L1982M851j459m7243k6978J946M6792
14479F9420m0633m1323J0611K862J7198P114q841J9243p970R560K2018k6460k374
14466C0425r308m0536L8166M0440j8041l7711o471j0064P57J0204L123M925q745
$$ plain form
14556 60383 15942 -21003 -14465 2394 -2997 14870 24561 60606 61365 70227 66999 44421 54483
14543 54483 87619 107320 102901 93380 115364 69976 64735 55354 45673 46651 6163 -20526 41912
14530 41912 60753 40505 40237 62343 54170 25319 14058 20264 -884 6135 -11660 14660 36068
14517 36068 13682 14361 20086 11223 -10568 23854 27238 7685 15894 38443 44813 36866 18409
14504 18409 -2246 26822 31748 31023 42806 24631 6902 14314 -16411 9327 21612 38070
14492 38070 43210 24979 17572 35150 34928 59529 91511 96362 94903 47660 20682 22628 69420
14479 69420 28787 -12536 -1925 937 18135 25249 16408 35651 27681 37241 59259 32799 30425
14466 30425 21117 -19419 18747 59187 41146 3435 -3036 -13100 -12343 -2139 984 5909 -2836
14453b836j6592J3423N3263J0541j1348l534k845K7467k8912j9988Q601J8555
14441D5795r803J0511N110O588k8058j2687R483K0703K550l7155k6886K1166L9111
14428D6428m919l1203l239J6820K468K322L791j383k708N115l94j254k203j1765
14414A7876M10k947K5644K4048l077n523j821K8278K123n656K5108k9234l3497
14401D1732l77k335k6760l0157J429P786m391K1858K1996J8229k9920j2967K8420
14388C4543J6065K1463K986n021N833j7865l4244j5520k2709J0633O2739k88n640
14375E2975j5125j7892N773L449k1445m3836q459m537L0258M5645J0476J6390
14363E3672J8374m4540n9593L9967K9113J5677j0055l1323l7991q676R245R062
$$ plain form
14453 -2836 -19428 -6005 47258 57799 46451 42917 40072 67539 38627 18639 27240 45795
14441 45795 35992 46503 51613 58201 30143 17456 26939 47642 50192 13037 -13849 7317 46428
14428 46428 41509 10306 7067 23887 26355 28677 32468 31085 28377 33492 33098 31844 29641 17876
14414 17876 18286 15339 40983 65031 61954 56431 54610 82888 85011 79355 104463 75229 41732
14401 41732 41355 39020 12260 -17897 -16468 -8682 -13073 8785 30781 49010 19090 6123 34543
14388 34543 50608 72071 75057 70036 75869 58004 23760 8240 -14469 -3836 58903 58615 52975
14375 52975 37850 19958 25731 29180 7735 -36101 -44560 -49097 -18839 26806 37282 53672
14363 53672 72046 27506 -32087 7880 36993 52670 42615 11292 -26699 -35375 -26130 -17068
14351a7068j438L2673K2349q10J8173n014j1707l9319K2532K285l116K1404M632
14338D5576N850J3740L0779j0280k6644P410q429j6626j974j3063l0546K5500
14326B1293M8179J1382k9380l220O4491N192j8778l2923m6292J1037j2777R216
14314B7420m598n000J265J0608J1007J1302J0436K738m2044R520L9453K1577L167
14301I6851m339k2649L588p111P934r441N629l7736j2070K0364k3188j9344P486
14288E974L3129J9449j5568m1296J100Q41R539l101N278l452R010J7608n638m002
14274B8871J8628j1366L104j8962j4479j7832J4534K788J3631P602R114M3052
14262G8685K9369P058j8168k8614l1225m6779K5545J4080l2345L5768N115k7091
$$ plain form
14351 -17068 -18506 14167 36516 35706 53879 48865 37158 -2161 20371 22656 19540 40944 45576
14338 45576 51426 65166 95945 85665 59021 66431 58002 41376 39402 26339 -4207 21293
14326 21293 69472 80854 51474 48254 112745 117937 99159 66236 19944 30981 18204 27420
14314 27420 22822 17822 19087 29695 40702 52004 62440 65178 23134 32654 72107 93684 96851
14301 96851 92512 69863 73451 66340 74274 64833 70462 32726 20656 41020 17832 -1512 5974
14288 5974 39103 58552 42984 1688 2788 3629 13168 10067 15345 11893 20903 38511 32873 28871
14274 28871 47499 36133 39237 20275 5796 -12036 2498 5286 18917 26519 35633 78685
14262 78685 108054 115112 96944 68330 37105 -9674 15871 29951 -2394 33374 38489 11398
14250A1398K5864Q956M595K253j0981L303M46r363q28L980K9252J4552j0735L153
14236G5845J9114l1444L137O802j5536j3317J7718N769J4420j7013k8676K247
14224C9066J5077L5579k1442p302k7157J2382K068j0182j3546j6895J0168K9137
14212D6953P507J5968K7253K2322j3627l4938k2602M454J4458M96j8352O20k5624
14199B4888o009j4938M61K4192j9717k7603L0143K4551J737P023J2470J7494o622
14186F8070L045k742R239L9014j8286j9746l5411k3684J7319k7497r880J1774
14174A1215q186k9259j2370K3581J5528J3428K3186l3571K1511K1831L492J3018
14162F3404M9729O177l4361j7176p779j630q45j053j3743j2954n654j2999J8071
$$ plain form
14250 11398 37262 46218 50813 53066 42085 45388 45834 36471 35643 39623 68875 83427 72692 75845
14236 75845 94959 63515 66652 73454 57918 44601 62319 68088 82508 65495 36819 39066
14224 39066 54143 89722 68280 60978 33821 46203 48271 38089 24543 7648 17816 46953
14212 46953 54460 70428 97681 120003 106376 71438 48836 53290 67748 68244 49892 50512 24888
14199 24888 18879 3941 4402 28594 8877 -18726 11417 35968 37705 44728 57198 74692 68070
14186 68070 71115 68373 77612 116626 98340 78594 43183 19499 36818 9321 -559 11215
14174 11215 3029 -26230 -38600 -15019 509 13937 37123 3552 25063 46894 50386 63404
14162 63404 113133 119310 84949 67773 59994 58364 57519 56466 42723 29769 24115 11116 29187
14149B9187N6816k5499k8383J3137K690J9767k2437j1114J7048J6155j4156q439
14137D4772m8442K2077j597M2697J4154k2973j309j563j0569j8269l466K966j3438
14124E040M0284n813M931J7494j2548o276j7603O168J7690q369k9060Q049l658
14111A6329j2480j5582j5336L4588J8628M1942J4595J9880k429j4464l3940j9882
14099C1849r715L2404Q157j7945k8950M605j441Q172K2854q64r89J3214q906R851
14085F2296J3358j7694j5990R172O271N5662l5889k2609j6092m2362l0614J2921
14073b1570L5609L9318J8836j9013K599J2152J1299j1242k9605j1877K3170L060
14061E2736j3043K5696j2954j744j1116k2361j314R834L323L7259P935k805j2523
$$ plain form
14149 29187 86003 60504 32121 45258 47948 67715 45278 34164 51212 67367 53211 44772
14137 44772 -3670 18407 16810 59507 73661 50688 49379 47816 37247 18978 15512 18478 5040
14124 5040 45324 39511 44442 61936 49388 43112 25509 31677 49367 40998 11938 19987 16329
14111 16329 3849 -11733 -27069 7519 26147 68089 82684 102564 100135 85671 51731 31849
14099 31849 22134 54538 62695 44750 15800 20405 18964 27136 49990 49126 48137 61351 52445 62296
14085 62296 75654 57960 41970 51142 57413 113075 77186 54577 38485 -3877 -34491 -21570
14073 -21570 14039 53357 72193 53180 55779 67931 79230 67988 38383 26506 49676 52736
14061 52736 39693 65389 52435 50691 39575 17214 15900 25734 29057 66316 74251 71446 58923
14048E8923k3318J9775K0908m988j1868P536O316j2357j2508m241j5185o349J7586
14035D0230K2999j623j8942j24J8993m961o730j1922L0821N99k6030K361L560
14022D9231q064k7534K770q556l990J3462L8957L0747n4453k4877L152M0273J0720
14009F1838L699K5645K404k9984r871l3581m646M6934K186l0815M11L758j5119
13996B2859j312n158J7972K1168J3832J7111j984l36J864n822J2749J6700k0538
13983H9105m628m0511j4015L91K0995L152R514l849J911K3938n871j5407K0878
13970H5603K9070J5712l1335j4751l1726N691K5880J0353k5686j2411Q281J1227
13958G5908k3488j9408j886j5428J0675J0628m846J1722M0029k8146k2707k8241
$$ plain form
14048 58923 35605 55380 76288 71300 59432 66968 73284 60927 48419 44178 28993 22644 40230
14035 40230 63229 61606 42664 42540 61533 56572 49842 37920 68741 69340 43310 45671 49231
14022 49231 41167 13633 16403 7847 3857 17319 56276 87023 32570 7693 10845 51118 61838
14009 61838 65537 91182 93586 63602 53731 20150 15504 62438 64624 33809 34220 37978 22859
13996 22859 21547 16389 34361 55529 69361 86472 84488 84152 86016 80194 92943 109643 89105
13983 89105 84477 43966 29951 30342 51337 54489 64003 60154 62065 86003 80132 64725 85603
13970 85603 114673 130385 99050 84299 52573 58264 84144 94497 68811 56400 64681 75908
13958 75908 52420 33012 31126 15698 26373 37001 32155 43877 83906 55760 33053 4812
13946D812m63L2274J6775k621J9142k896L6602m578m4666k8585J2048L4968M0348
13933A13160J0743p644M094J849J0520n770N625j1858L5791m0504j8995R72k9351
13920F8632k1484K642N921K4707j0332o589M1172M2771M861r000j5966m9468k4621
13907E3246r252J0139l859j6979J8505j6562l842J346J3716J8990L707j5817k6726
13894B6612l035j626n58L4042N393j1378P615J988R816R757J9130j8477n941K2683
13880I6021k9203r783k4046j5108O455K0310K7858k0058R725J341l0822P33j3136
13867B0287J0857P266J4205J1303R302j2J6486J90k952J0477j845j9944m6024
13854B9596J3996j819m0386J4013N211K7194J9073Q28J5772l038m951n1229k55
$$ plain form
13946 4812 4349 36623 53398 50777 69919 67023 103625 99047 54381 25796 37844 72812 113160
13933 113160 123903 116259 120353 122202 132722 126952 132577 120719 156510 116006 97011 97983 68632
13920 68632 47148 49790 55711 80418 70086 63497 104669 147440 152301 143301 127335 77867 53246
13907 53246 43994 54133 50274 33295 51800 35238 31396 32742 46458 65448 69155 53338 26612
13894 26612 23577 21951 21393 55435 60828 49450 57065 59053 68869 78626 97756 79279 73338 96021
13880 96021 66818 57035 32989 17881 24336 44646 72504 52446 62171 63512 32690 33423 20287
13867 20287 31144 38410 52615 63918 73220 73208 89694 89884 86932 97409 95564 75620 29596
13854 29596 43592 41773 1387 15400 20611 47805 66878 67706 83478 80440 75489 24260 24005
13841B4005N432k5652m2031r122L1883M4203K3811K5848k9031l1813o482k708
13829H343n210O253R907J0717J3103n595K5508o42J5879J5233o690R496j9005
13816G7297j3719j7895J1975L4114j1594P17O657l465r38m083k2285n783k0246
13803C0752P84l890K5665n542j0399Q880K946L2615j8681j9549J0116R787J6849
13790H0333n265O907q571K27P326M094K2558j3760m4684J9449q424l5278j9172
13777E740J72L1697J8201J031K032R850j2968k3917j3345J5518L3509l2J923K7601
13763I7012k2530k8222j0330p213L3978L3744p197l8073j6145N931K9035L7565
13751A07555q673k1508k6776J0287L9373j2465k6230K770N8782J6355K6227J2445
$$ plain form
13841 24005 29437 3785 -38246 -47368 -15485 28718 52529 78377 49346 17533 11051 8343
13829 8343 3133 9386 19293 30010 43113 37518 63026 62384 78263 93496 86806 96302 77297
13816 77297 63578 45683 57658 91772 80178 80895 87552 84087 83149 79066 56781 50998 30752
13803 30752 31536 27646 53311 47769 37370 46250 49196 81811 63130 43581 53697 63484 80333
13790 80333 75068 81975 73404 73631 80957 85051 107609 93849 49165 68614 60190 24912 5740
13777 5740 5912 37609 55810 56841 58873 68723 55755 31838 18493 34011 67520 67488 69411 97012
13763 97012 74482 46260 35930 28717 62695 96439 89242 51169 35024 40955 69990 107555
13751 107555 98882 77374 50598 60885 100258 87793 61563 64333 123115 139470 165697 178142
13739A78142k1007k0078k3524n726J0672r7j7362j4566j3846J8026n143k0696
13727F4795r427M381q574K7617R643l4062O645j708k5350J2590J106J22K3333
13714G1111j0991l214P431J1749K5958j1117j6073l823m7667k2683L882M5348
13702D9911J319m5894K4991M0157L5802O740j1054o069o2528l8670N6235K7162
13690G8102o824l3898k2080K3351J5179L4426K524Q947P985j3934m6916j0024
13678C6838J15p089J3553M993J793J4740O094j216O463k068j2603O17k2092j5290
13664B4848P6059J1819J39p00m431j0734L056j3166k3365p135K5271j8545m6439
13651A6677p703m037Q693K090L1438N0912m103J3169J6330j9915j351n104k4777
$$ plain form
13739 178142 157135 137057 113533 107807 118479 118382 101020 86454 72608 90634 85491 64795
13727 64795 55368 59749 51175 78792 88435 54373 61018 59310 33960 46550 47656 47778 71111
13714 71111 60120 56906 64337 76086 102044 90927 74854 71031 23364 681 4563 49911
13702 49911 51230 5336 30327 70484 106286 113026 101972 95903 33375 -5295 50940 78102
13690 78102 71278 37380 15300 38651 53830 88256 90780 99727 107712 93778 46862 36838
13678 36838 36953 29864 43417 48410 50203 64943 71037 69821 76284 74216 61613 62230 40138 24848
13664 24848 100907 112726 112865 112165 107734 97000 100056 86890 63525 56390 81661 63116 16677
13651 16677 8974 4937 13630 15720 47158 98070 93967 107136 123466 103551 102200 97096 72319
13638G2319K816L6331l817n896j8339j1989j3075K2318J3099k0692M982J671k1129
13625E8599L787M3268J5434n023l1230j5089j0893k128m590j9215P884K8753J7741
13612H7298L107M914j0198l3045k3745K0029O049J9646L2265j1840m6163o132
13600D2185J1784K5958K6935J154k8732k9003K4529J3517k8409q19J8392j2057
13588F5434k6112J7105K0796k707j615j8952K0129O141R932K7048N199K7930l361
13575A46967n883R24k857k3516m3122k1912p228P117L2783k315k867J7637P664
13562A03392K959l4446m478J5111N133n47m746L349k475J968p519J1975K1829
13549A11505q108j2591j2816M679J6861m900o876K234j1027j7702L8722L4985
$$ plain form
13638 72319 75135 111466 107649 101753 83414 71425 58350 80668 93767 73075 78057 79728 58599
13625 58599 62386 105654 121088 116065 84835 69746 58853 56725 52135 32920 40804 69557 87298
13612 87298 90405 95319 85121 52076 28331 48360 54409 74055 106320 94480 48317 42185
13600 42185 53969 79927 106862 108016 79284 50281 74810 88327 59918 59099 77491 65434
13588 65434 39322 56427 77223 74516 72901 53949 74078 80219 90151 117199 122398 150328 146967
13575 146967 141084 142008 139151 115635 72513 50601 43373 50490 83273 80958 78091 95728 103392
13562 103392 106351 71905 67427 82538 87671 87124 82378 85727 83252 85220 77701 89676 111505
13549 111505 103397 90806 77990 82669 99530 94630 87754 89988 78961 61259 99981 134966
13537A34966N05j9860l2256j913j8982l0269j074M2181K9237j1250J2225O856
13525A10366k4177m4292j0439J1067K0635M1144P6350m3938k3872j9034j7410
13514G6400m325L9823l093j1181j9335m190M4435J5259j4342P631J9263k4092
13502A22253l2360r726K4716K2118Q752j3363M33J8242m147o1781k7074N978J4760
13489F8801Q129k2399L18J5403L0010k7414m6643J4636J1219m194J2161J131k7485
13476C3673J4915L9275L2708J9677j2507P248l6028j6812l326K457p205J7686
13464I1761L1842l1761k4683J1877J6549l707j3518R662j0717J757J6288M810
13452A00160j5217R205J7240n167J4211k7980J134Q445K2682K1377N390j1227
$$ plain form
13537 134966 135471 115611 83355 81442 62460 32191 31117 73298 102535 91285 103510 110366
13525 110366 86189 41897 31458 42525 63160 104304 180654 136716 112844 93810 76400
13514 76400 72075 111898 108805 97624 78289 74099 118534 133793 119451 127082 146345 122253
13502 122253 89893 80167 104883 127001 135753 122390 122823 141065 136918 75137 48063 54041 68801
13489 68801 76930 54531 54849 70252 100262 72848 26205 40841 52060 47866 60027 61158 33673
13476 33673 48588 87863 120571 140248 127741 134989 98961 82149 78823 81280 74075 91761
13464 91761 123603 91842 67159 79036 95585 91878 78360 88022 77305 79062 95350 100160
13452 100160 84943 94148 111388 106221 120432 92452 93586 102031 124713 146090 151480 140253
13440A40253j2736L135o112k4745j9419L486L2748K2924k8950k1322K996M1398
13428A33656o559k1941L120L512R932k1712r0j4519J7785p854j4716K0389J5832
13415A16835k6247Q90M948L0328J4509j7791k99K5488o393m1652k991K6278j1845
13402A12058j3703L765K1880K847j0037j1055J6184J1928R592K1610K734k5307
13390A42496l068J4692p864j8446o399K8708k5957l6385m712J7703j4919l5326
13378E0523k0977L2639K4744K9727k213k0287j7364K2545O662O831K252M175J6964
13365A36221Q025n1525l4963J4372K098K9512l874j7308n38j5134q502J3850N055
13352G7289n231K6927L0816J4851j0244k5810J3200J9015Q227j2413k8290J0146
$$ plain form
13440 140253 127517 130652 124540 99795 80376 83862 116610 139534 110584 89262 92258 133656
13428 133656 127097 105156 108276 111788 121720 100008 99918 85399 103184 95330 80614 101003 116835
13415 116835 90588 91478 96426 126754 141263 123472 123173 148661 142268 100616 97625 123903 112058
13402 112058 98355 102120 124000 126847 116810 105755 121939 133867 143459 165069 167803 142496
13390 142496 139428 154120 146256 127810 121411 150119 124162 87777 83065 100768 85849 50523
13378 50523 29546 62185 86929 116656 114443 94156 76792 99337 105999 112830 115082 119257 136221
13365 136221 144246 92721 57758 72130 74228 103740 99866 82558 82020 66886 58384 72234 77289
13352 77289 72058 98985 129801 144652 134408 108598 121798 140813 149040 136627 108337 118483
13340A18483M2049j9965J479j0393j300N5264J1111m3940m8627j467J7603k887
13328A17410M912J8163j9849k2503J3943m816p280j3596R29K3906J3615K6637
13316A51471j5684j541L705M1695J3179l0154j0102l8895p620L512J6299K9645
13304A55510j6304l0924k7615j2045j6754n389M3608N8357O377k5295o39K6144
13292A55031N32j1006l0103k2532L1299J8388P726j0384k4668J8233K0590k0942
13280A32164j4986J5687K4144J8320o424k9874L806L696p281o441l0905k0331
13268H1575m188K2953N5278K0011j8664k5286k3103m366N74R657n852N256j4484
13255I9361K487J4701J8212o097l128J1164k4932o758K4601j17J6924n283j3264
$$ plain form
13340 118483 160532 140567 142046 131653 130353 185617 196728 152788 104161 102694 120297 117410
13328 117410 122322 140485 120636 98133 112076 107260 99980 86384 87313 111219 124834 151471
13316 151471 135787 134246 137951 179646 192825 162671 152569 113674 106054 109566 125865 155510
13304 155510 139206 108282 80667 68622 51868 46479 90087 148444 154821 129526 128887 155031
13292 155031 155563 144557 114454 91922 123221 141609 149335 138951 114283 132516 153106 132164
13280 132164 117178 132865 157009 175329 168905 139031 142837 146533 139252 132811 101906 81575
13268 81575 77387 100340 155618 175629 156965 131679 108576 104210 104784 114441 108589 113845 99361
13255 99361 101848 116549 134761 128664 125536 136700 111768 105010 129611 129494 146418 141135 127871
13242A27871j2120K4593o085l722R910p603k1562M4032J4390o228o412n630m7896
13229A03538l2327J4134K7623N438j3652P401J2394J4769j1557p52r756l273J7774
13216A31754o758k1647K7896j179J2978j902o475K9539j1368l9289m819K6370
13204A35100J9125p471j7403j7520J6759j604J4618k4112p605K2911L3913J7672
13192A84383k6721o5702l7341J7968K1928j1481K189L0136K2699M115n517j8243
13180A18413K1775l93K718K9074q38K752p602L181M7056J5239m2811m8227R925
13167A50262L836n635L474O57L082J7819PR477K0115m099l536Q591J004j4019
13153A91035k8824l3408M900q995k1360J9837J2097l4721L4072J8503k1103J1403
$$ plain form
13242 127871 115751 140344 134259 130537 140447 132844 111282 155314 169704 163476 157064 151434 103538
13229 103538 71211 85345 112968 118406 104754 112155 124549 139318 127761 127009 117253 113980 131754
13216 131754 124996 103349 131245 130066 143044 141142 134667 164206 152838 113549 108730 135100
13204 135100 154225 146754 129351 111831 128590 126986 141604 117492 109887 132798 166711 184383
13192 184383 157662 91960 54619 72587 94515 83034 85223 115359 138058 142173 136656 118413
13180 118413 140188 139795 142513 171587 170749 173501 165899 169080 216136 231375 188564 140337 150262
13167 150262 154098 148463 151937 152594 155676 173495 173502 182979 203094 198995 195459 204050 205054 191035
13153 191035 162211 128803 133703 124708 103348 123185 135282 100561 134633 153136 132033 143436
13141A43436k5665k5416N907p75L9793J4022k3005k2075L1660M9639l1871j1755
13129A43895K2539n46J5514r857J8722K8843P934Q454k7962k8998J1808J24j2775
13116A77695j5859j7692K9134K1943L663O308l859k3966P782j634l6640j5940
13104A30935L9957K8403j8426k2121j9773R105J9229Q385K3447o120P760r216
13092A91565k9536j7242j453J3273P093J1869O492K3800N2827j1860m1658l0628
13080A74542k4469q336J1447J5908J3436J0453k4394J140K2093J0456r254k9087
13068A63935k920j0633K092Q542j7630k192K4159K3431Q801k0878m681m544l9426
13055A28056j0897L0332k385k7626K2727P603k1097j4419L6714L5303k2579k7348
$$ plain form
13141 143436 117771 92355 98262 97487 137280 151302 128297 106222 137882 187521 155650 143895
13129 143895 166434 165888 181402 171545 190267 219110 227044 235498 207536 178538 190346 190470 177695
13116 177695 161836 144144 173278 195221 198884 205192 201333 177367 185149 183515 146875 130935
13104 130935 170892 199295 180869 158748 138975 148080 167309 175694 199141 193021 200781 191565
13092 191565 162029 144787 143334 156607 163700 175569 182061 205861 258688 246828 205170 174542
13080 174542 150073 141737 153184 169092 182528 192981 168587 169727 191820 202276 193022 163935
13068 163935 161015 150382 152474 161016 143386 141194 165353 188784 197585 176707 172026 167482 128056
13055 128056 117159 147491 145106 117480 140207 147810 126713 112294 149008 184311 161732 134384
13043A34384J7368J7674o179j8631L4403K7327m0744j8996l8232j4872j5530J1337
13031H9309L3544K9217K7808r021k7271m0958N3635N3600j5191l0276j4787k8809
13019A20800J4303K1341J6172k9119n426J4729P774q391M1711Q330L713M280j9450
13006A90767k1612j8471J1889R692K447r006j936L1540J413J881p651l0037p75
12993A60141j0271J9901q725k0096J8426l083L0471l9046j0294o61J5551N8591
12981B10905L4387j2061k3179m775J5848j3153j0955M1856K3024k8185j9092p972
12969B06648p570j5159J3720k5895J337n595K7747J3990m181K4280r733k3168
12957A96421N867r572L2680K6477l6759n06k734r410K5784K1939l7949l7378L7766
$$ plain form
13043 134384 151752 169426 163247 144616 179019 206346 165602 146606 108374 93502 77972 89309
13031 89309 122853 152070 179878 170857 143586 102628 156263 209863 194672 164396 149609 120800
13019 120800 135103 156444 172616 143497 138071 152800 160574 152183 193894 202224 205937 210217 190767
13006 190767 169155 150684 162573 172265 174712 165706 163770 195310 196723 198604 190953 160916 160141
12993 160141 149870 169771 161046 140950 159376 156293 186764 147718 137424 136763 152314 210905
12981 210905 245292 233231 210052 205277 221125 207972 197017 238873 261897 233712 214620 206648
12969 206648 199078 183919 197639 171744 173081 167486 195233 209223 205042 229322 219589 196421
12957 196421 202288 192716 225396 251873 215114 214608 211874 202464 228248 250187 212238 174860 212626
12944B12626K4176k1452k2661L3114j1476m5132k9075K9416L5120N550j8320k176
12932A89710R013o08l338j1820K302J9064L0887O276p82J9253n552l1729o5607
12919A57069m5568M364M7948L2633J3528J0677K2477O661j5345k2947J3575m051
12907B21021l4981J2601J5233j4718K571o668j0341K860l80Q530R128M201K1981
12894B31038k7492j882K6139J9525l4118m0401k029N319M620K5519m728l607M1954
12881B39857K0998k5571j7524j5453J627M552J4948J2250J3377J0450J0085J2379
12869B81975Q068l381J5863p047m9436M694O555j3959r282R364K2788p571k6848
12856B31783k1378K2490l165k5296L500M870n947J0554j2094Q80k677j5377L5367
$$ plain form
12944 212626 236802 215350 192689 225803 214327 169195 140120 169536 204656 210206 191886 189710
12932 189710 198723 198115 194777 182957 185259 204323 235210 241486 240704 259957 254405 222676 157069
12919 157069 111501 115865 163813 196446 209974 220651 243128 249789 234444 211497 225072 221021
12907 221021 186040 198641 213874 199156 201727 195059 184718 187578 187198 195728 204856 209057 231038
12894 231038 203546 201664 227803 247328 213210 172809 170780 176099 180719 206238 201510 197903 239857
12881 239857 260855 235284 217760 202307 203934 208486 223434 235684 249061 259511 269596 281975
12869 281975 290043 286662 302525 295478 246042 250736 257291 243332 234050 243414 266202 258631 231783
12856 231783 210405 232895 229730 204434 207934 212804 206857 217411 205317 206197 203520 188143 223510
12843B23510K5240R623L609k8185k3220J8496J720K070J2948K7607k1435k0764
12831B31219R890O286k2607j0562Q525l762K8868K4660o596j9809K2705j5319
12819B53498l0979J6368K6404L8951r185j1157j1925j4273M814j8857k2235j7079
12807B04345q355J7663L9163n39k8557k8494M2569K5310j8312k023j25J1690n844
12794B48491J2078l0655J9254J5241l1142j7670J8695M6128K8304r161n465j7085
12782B77013l3112k5267M616J47J5418k2527K0790J9675J8518J55l494K8726k594
12769B98064j6262K0494J3702l5432p331R811K2465K6671K6581j4756k1594p022
12757C15391K348O810j7936j9412j1855J3202k3509l0288j988o407j8769o888
$$ plain form
12843 223510 248750 258373 261982 233797 210577 229073 230793 232863 245811 273418 251983 231219
12831 231219 241109 247395 224788 214226 222751 218989 247857 272517 265921 246112 268817 253498
12819 253498 222519 238887 265291 304242 295057 283900 271975 257702 262516 243659 221424 204345
12807 204345 195990 213653 252816 252277 223720 195226 237795 263105 244793 242770 242645 254335 248491
12794 248491 260569 229914 249168 264409 233267 215597 234292 280420 308724 299563 294098 277013
12782 277013 243901 218634 223250 223397 238815 216288 237078 256753 275271 275426 271932 300658 298064
12769 298064 281802 302296 315998 280566 273235 283046 305511 332182 358763 344007 322413 315391
12757 315391 317739 324549 306613 287201 275346 288548 265039 234751 232763 226356 207587 200699
12745B00699L9183R657k2633K3411L0150k8499N87O528N317J1709q427j5274K081
12732B54489K2715L2017J443r553j8090Q501P526J8934j9427o269p403j2122K8497
12719C01258k6533J1856K1851j7289r295k6221k0558K306J6307J9779O6516M0207
12707C80184j7951k6290K430K8949J0687j6762j0811k0267n4816J9068K452k8789
12695B68084j4791J9039L0228J347j152L3864m888j3594J6469J2648n09r042k0062
12682C17641J4132n69q465m982K6231J6257l7938k1225J3182J2957j9045M440
12670C12616j0838K5133M230J3041n03Q430L0816j2292k2273k0691J0206L1450
12658C69325l853j2433l1938J1204K4122K047L0248L7414k097R051M203j5684
$$ plain form
12745 200699 239882 249539 226906 250317 280467 251968 252555 259083 264400 276109 267682 252408 254489
12732 254489 277204 309221 310664 301111 283021 291522 299048 317982 298555 292286 284883 272761 301258
12719 301258 274725 286581 308432 291143 281848 255627 235069 237375 253682 273461 339977 380184
12707 380184 362233 335943 338373 367322 378009 361247 350436 330169 275353 294421 296873 268084
12695 268084 253293 272332 302560 303907 302755 336619 331731 318137 334606 347254 346745 337703 317641
12682 317641 331773 331204 322739 317757 343988 360245 322307 301082 314264 327221 308176 312616
12670 312616 301778 326911 331141 344182 343679 352109 382925 370633 348360 327669 337875 369325
12658 369325 365472 353039 321101 332305 356427 358474 388722 426136 424039 433090 437293 421609
12646D21609m7667k0919j348j5583o197r991M126M3821J4366n035o920k8126j2694
12633C29442L7210p071k0879J5765K1731J7451p127r767O390Q364j7626J9556
12621C93439o16j1901k391k9080J2855K0450m6417L067K778N7971J4101j9713
12609C94543L914P745j2290j9368j3923M331L4692J3618k8050J5109K4156K8946
12597D53423j2507j5146j5198J2032j2792k4804m419j0367J6028J4606Q347p335
12585D01868O945q555k7586k3717J8913L0085l970J1257N512K4971K6976R717
12573D72416k2833J1908r592m006l294L731J2923R688j7735l767j8820L546L0614
12560D64779k9558l4794j283J6595P01J3430J3353K0323l5716J2597O075j3383
$$ plain form
12646 421609 373942 353023 351675 336092 329895 319904 324030 367851 382217 377182 370262 342136 329442
12633 329442 366652 359581 338702 354467 376198 393649 386522 376755 383145 391509 373883 393439
12621 393439 392823 380922 378531 349451 362306 382756 336339 339406 342184 400155 414256 394543
12609 394543 398457 406202 393912 374544 360621 364952 399644 413262 385212 400321 424477 453423
12597 453423 440916 425770 410572 422604 409812 385008 380589 370222 386250 400856 409203 401868
12585 401868 408813 400258 372672 348955 367868 397953 393983 405240 410752 435723 462699 472416
12573 472416 449583 461491 451899 447893 444599 448330 461253 470941 453206 449439 430619 434165 464779
12560 464779 435221 400427 399144 415739 416440 429870 443223 463546 427830 440427 446502 433119
12548D33119J0224J4601j8619j5599N162J3360L5267M285J430K0836k9379n247
12536D69440J9530J10N702r569m4079n913J0774l5267l0923J4429J9298L305L3602
12523D50439L8915K1737r160j1599J4177k8606j0722L0390J548J3703K197J1215
12511E24234m587l1140J63K5618n748n742K1120K4386j404k1627k4448m927J3829
12498E09727n06j319l899r157K5723J6392L762n3491k91J7909J8189K8212J3281
12485E64532l0872J2066K9187N61n405r428K1329O154k3393K7071m928p0m907
12472E81897m437q978k2979J5204L8108j3419k8555O411K535j9947l2722N010
12460E18128M0545J6426Q986K2966k6156L946K0437J4202k7062k5689M3934N2721
$$ plain form
12548 433119 443343 457944 439325 423726 428888 442248 477515 481800 483230 504066 474687 469440
12536 469440 488970 489080 494782 485213 441134 435221 445995 410728 379805 394234 413532 416837 450439
12523 450439 489354 511091 501931 490332 504509 475903 465181 495571 497119 510822 513019 524234
12511 524234 519647 488507 488670 514288 508540 502798 523918 548304 546900 525273 500825 495898 509727
12498 509727 509221 507902 504003 494846 520569 536961 540723 487232 486941 504850 523039 551251 564532
12485 564532 533660 545726 574913 575474 570069 560641 581970 588124 564731 591802 586874 586804 581897
12472 581897 577460 568482 545503 560707 598815 585396 556841 563252 565787 545840 513118 518128
12460 518128 558673 575099 584085 607051 580895 584841 605278 619480 592418 566729 610663 663384
12448F63384k182k6138K2882J505l7880O027j373k9283L1838k516J9929J350l6866
12435F10677p257J0901R844J9112j4042k8532j045M4468J1843k925K777k1445
12423F34376m7726o279K4734K9993j1091R671K0690P974J0828l8556j7312R272
12411F26574J7536K0304M2823K1631m51k4153l1536l0389j485K5933J041L2994
12399G00822q39K2954j3622j8547p8P42J4646J3775n250k907O789K2935p33J6861
12385G57548n692r324l9573L1168K5265k2078o344J2402J2709M984J2863o467
12373G67461l5417J6133L3637L1866L5639o094m4909l2585m839M616L2415K7276
12361H25199j3076K0150p215j425O05L242R876L5140l8071l9501k947J4512m489
$$ plain form
12448 663384 661202 635064 657946 659451 621571 627598 626225 596942 628780 626264 646193 647543 610677
12435 610677 603420 614321 624165 643277 629235 600703 599658 644126 655969 653044 655821 634376
12423 634376 586650 580371 605105 635098 624007 633678 654368 662342 673170 634614 617302 626574
12411 626574 644110 664414 707237 728868 728417 704264 672728 642339 640854 666787 667828 700822
12399 700822 699983 722937 709315 690768 690690 691432 706078 719853 714603 711696 718485 741420 740687 757548
12385 757548 751856 742532 702959 734127 759392 737314 730970 743372 756081 761065 773928 767461
12373 767461 732044 748177 781814 813680 849319 843225 798316 765731 760892 765508 797923 825199
12361 825199 812123 832273 825058 823633 824238 827480 837356 872496 834425 794924 791977 806489 802000
12348H02000j41L0675K4790J588N314l80k0327j6368O087J848J9551L0466K0131
12335I05234j54j7627j9760K2901J8868J9965m338K681l2824K5016R623j1287
12323I18298k3317j3042J4781j2019M058P590L0713K785m1739o5660M14M9313
12311H72175O0423L1493M1121N569j0913j6490k1986o617K3107J4784l087r009
12299I80570J0083J5188r621M25L8580N102Q022j1993r672K260K8649j1658j834
12286A044101K1984P853j0207P883Q384j5585o876k5209j5829N781L691J8808
12274A044779K8744k3967l707L2358N0380K7329j8515m641J3832j90k7024J311
12262A120689k663M174J636K9202L2462k1715n284J5890L334N340k1591J1655
$$ plain form
12348 802000 801859 832534 857324 858912 864226 863846 843519 827151 833238 835086 854637 885103 905234
12335 905234 905080 887453 867693 890594 909462 929427 925089 927770 894946 919962 929585 918298
12323 918298 894981 881939 896720 884701 888759 896349 927062 929847 888108 822448 822862 872175
12311 872175 932598 964091 1005212 1010781 999868 983378 961392 954775 977882 992666 989579 980570
12299 980570 990653 1005841 996220 996645 1035225 1040327 1048349 1036356 1026684 1028944 1057593 1045935 1044101
12286 1044101 1066085 1073938 1063731 1071614 1079998 1064413 1057537 1032328 1016499 1022280 1025971 1044779
12274 1044779 1073523 1049556 1045849 1078207 1128587 1155916 1137401 1132760 1146592 1146402 1119378 1120689
12262 1120689 1118026 1122200 1123836 1153038 1185500 1163785 1158501 1174391 1177725 1183065 1161474 1173129
12250A173129r67l3208L1256J4713J583k200L0799J6019k7256j5772N1491L5943
12238A275530P89J004P421j9404k2451J8843N686J3483Q324J7941q87J4806M4309
12225A365394J0488j2756k2794o210O650k5181R726Q989K3374k493K5018J9477
12213A399682J8051j5054k6568K349K6246K8638M90j9217k8713j8283M755J5578
12201A387954M9895M1701O591k3484Q551L1040l0295k2062K0268O5893L3946p936
12189A562062k3937L351k0916j8226M0500R402J0167J7486q445j6139m408L2509
12177A583406K1627j1518k4195J2786R716n934M148O4808K6935k6986K955l043
12165A654705K3541O107J9792L0824j3388M4K9235L0383Q981j2215L007k9501
$$ plain form
12250 1173129 1172162 1138954 1170210 1184923 1186506 1184306 1215105 1231124 1203868 1188096 1239587 1275530
12238 1275530 1276319 1277323 1284744 1265340 1242889 1261732 1267418 1280901 1289225 1307166 1306279 1321085 1365394
12225 1365394 1375882 1363126 1340332 1334122 1340772 1315591 1325317 1334306 1357680 1355187 1380205 1399682
12213 1399682 1417733 1402679 1376111 1378460 1404706 1433344 1433834 1414617 1385904 1367621 1372376 1387954
12201 1387954 1437849 1479550 1486141 1462657 1471208 1502248 1471953 1449891 1470159 1536052 1569998 1562062
12189 1562062 1538125 1541476 1520560 1502334 1542834 1552236 1562403 1579889 1571444 1555305 1550897 1583406
12177 1583406 1605033 1593515 1569320 1582106 1591822 1585888 1590036 1654844 1681779 1654793 1657748 1654705
12165 1654705 1678246 1684353 1704145 1734969 1721581 1721625 1750860 1781243 1790224 1778009 1781016 1751515
12153A751515n209J8736L1489j953J7423L2367M5175k3977m3853J3057M0591K729
12141A878090m38K3176q227J210k6476R783j5585o663L5615M5330J5935L886r756
12128A945880l433L4672M178M497J6843K110m740O952p951Q349M1493J6952R448
12115B075250k9527K5228J7749J9928K2267j0538n30j0744m600J9555L2009N918
12103B161965p350J9252L0865J3037L671l899M285K5650j0355j9284J3953J6519
12091B248309L181p327Q22K1005M4676k0143J1730K6463L0967L691k0651J1101
12079B353824j7422m007M7031L1878k6998K3537K7886j4782J4122L5907K2412
12068B493388J787M78J2626K799j377j4794j9412k232K608L2943p51k5765P353
$$ plain form
12153 1751515 1746306 1765042 1796531 1794578 1812001 1844368 1889543 1865566 1821713 1834770 1875361 1878090
12141 1878090 1877652 1900828 1892601 1893811 1867335 1877118 1861533 1854870 1890485 1935815 1951750 1955636 1945880
12128 1945880 1942447 1977119 1981297 1985794 2002637 2004747 2000007 2006959 1999008 2007357 2048850 2065802 2075250
12115 2075250 2045723 2070951 2088700 2108628 2130895 2120357 2119827 2109083 2104483 2124038 2156047 2161965
12103 2161965 2154615 2173867 2204732 2217769 2221440 2217541 2221826 2247476 2237121 2217837 2231790 2248309
12091 2248309 2251490 2244163 2244985 2265990 2310666 2290523 2302253 2328716 2359683 2363374 2342723 2353824
12079 2353824 2336402 2332395 2379426 2411304 2384306 2407843 2435729 2420947 2435069 2470976 2493388
12068 2493388 2495175 2495653 2508279 2511078 2509701 2494907 2475495 2473263 2475871 2508814 2508063 2482298 2489651
12055B489651J6725J5201J4260L6498L4396K8375M9545j0754j7037M7R415M889
12043B671211J4750p014q558J7263K1629J0124L804L64l319K6664k850J4822N461
12030B764351J3987N95N303j7854J4030L2281Q314l280L4323M68K7141l5143j2179
12017B832337K0036J9611p695k9805k2341M2168M3066K1310j4669j9269K3007
12006B907756K6124K3155r988j4305m510N081J2998j9851K4574M179Q29K6501
11994B982543M943J0322J7956j7943L1812J4086j8724j6793J6789R178K7026o653
11982C054542l4717K7040J4628Q246k3511J6954L6874L00k9144K2270K2049q026
11970C107505k2002n997J6066L2370n391l7590M3513J8947P833K8661j3659j2544
$$ plain form
12055 2489651 2506376 2521577 2535837 2572335 2606731 2635106 2684651 2673897 2656860 2656907 2666322 2671211
12043 2671211 2685961 2678947 2670389 2687652 2709281 2719405 2723209 2723573 2720254 2746918 2744068 2758890 2764351
12030 2764351 2778338 2778933 2784236 2766382 2780412 2812693 2821007 2817727 2852050 2852518 2879659 2844516 2832337
12017 2832337 2852373 2871984 2864289 2834484 2812143 2854311 2897377 2918687 2904018 2884749 2907756
12006 2907756 2933880 2957035 2947047 2932742 2928232 2933313 2946311 2926460 2951034 2955213 2956042 2982543
11994 2982543 2987486 2997808 3015764 2997821 3029633 3043719 3024995 3008202 3024991 3034169 3061195 3054542
11982 3054542 3019825 3046865 3061493 3069739 3046228 3063182 3100056 3100356 3071212 3093482 3115531 3107505
11970 3107505 3085503 3079506 3095572 3127942 3122551 3084961 3128474 3147421 3155254 3183915 3170256 3157712
11958C157712R792p786j0776k2795M1961M3634J3011L887k2320K7129O952m7975
11946C192426n5788j0183k56K683J7572P215j3049j9926J1290K5479K418l3900
11934C125981J3005k9712k2715L597l8941k8853R356L122K860N3158K9482J3378
11922C133718j3766l2899n490K8158m3174j2864k905k4449M552J8877J8907j5024
11910C053641j4392l3730k0263N4766K5110n672L920j7189J0005k3137n3242j5726
11898B964091M976k11J850J2459J2333n60k9028n708l45l015J5521p769l6988
11885B927606k2404P069o284k061j3236k2791J5320j4901J4881L2378k6816j2055
11873B876706k2850j2876j4647k1914l633K4881J714l4337j1080M597l5986k6250
$$ plain form
11958 3157712 3167504 3159718 3148942 3126147 3168108 3211742 3224753 3228640 3206320 3233449 3240401 3192426
11946 3192426 3136638 3126455 3126199 3128882 3146454 3153669 3140620 3120694 3131984 3157463 3159881 3125981
11934 3125981 3138986 3109274 3086559 3090156 3051215 3022362 3031718 3034840 3037700 3090858 3120340 3133718
11922 3133718 3119952 3087053 3081563 3109721 3066547 3053683 3050778 3026329 3030881 3049758 3068665 3053641
11910 3053641 3039249 3005519 2985256 3040022 3065132 3059460 3063380 3046191 3056196 3033059 2979817 2964091
11898 2964091 2969067 2968856 2970706 2983165 2995498 2994938 2965910 2960202 2959857 2956842 2972363 2964594 2927606
11885 2927606 2905202 2912271 2905987 2903926 2890690 2867899 2883219 2868318 2883199 2915577 2888761 2876706
11873 2876706 2853856 2840980 2826333 2804419 2800786 2825667 2827381 2793044 2781964 2786561 2750575 2724325
11861B724325P431j679q324L3777J6001k4129j6169j7201J4163K7747o5583m2424
11849B647935l0039j1505J9386J4016k2387m7745J5282M4392k1654P602J1934
11838B627217k1390k9796j3038k2497J911l6794l6966k3595N6233J6226k4923
11827B492588K39j4650N464j7813l9906l8105L2183L0954j9710l7898j7395l08
11815B375643K2149j9488j3102k6574J5572K8585j0478n0594l1042l552r688j9846
11803B257585j7786K618M740K996k1645o037L0958M812n3726m5993J0882J2564
11791B181968l750j3887k1513l0369J8947J4197m421K2535p228m0016n372J2342
11779B123433k1158K750k9830n5493J0326k6371R829J8116j64q014k426P222l6132
$$ plain form
11861 2724325 2731756 2730077 2721753 2755530 2771531 2747402 2731233 2714032 2728195 2755942 2690359 2647935
11849 2647935 2617896 2606391 2625777 2639793 2617406 2569661 2584943 2629335 2607681 2615283 2627217
11838 2627217 2605827 2576031 2562993 2540496 2542407 2505613 2468647 2445052 2501285 2517511 2492588
11827 2492588 2492827 2478177 2483641 2465828 2425922 2387817 2420000 2450954 2431244 2393346 2375951 2375643
11815 2375643 2397792 2378304 2365202 2338628 2354200 2382785 2372307 2321713 2290671 2287119 2277431 2257585
11803 2257585 2239799 2242417 2247157 2250153 2228508 2222471 2253429 2258241 2204515 2158522 2169404 2181968
11791 2181968 2178218 2164331 2142818 2112449 2131396 2145593 2141172 2163707 2156479 2116463 2111091 2123433
11779 2123433 2102275 2105025 2075195 2019702 2030028 2003657 2013486 2031602 2031438 2023424 2020998 2028220 1992088
11766A992088k8585j3077k6822q709J679l753l7243M8936P95R901K030l0207o9914
11753A837119j7948K2004L4267j8863l8723o651k1355j9004r955O435Q76k1266
11741A746936l0013l1269P08K7400K5314p31n393m6084l3813n732k0230q210M5641
11728A664524M564K1642j0886l5735j0492N735j8878m572R033n546m2777J967
11716A578579K3120m4192o0385o912J892Q661M6532J8180O604j6119k1202k8224
11704A506534k9830O231k5409J747J4999k510J7718K1482M532k8330l3708K4534
11692A477990k0471k5927K203j3497k4957n954j5816k2935k9678j1655K3266K3403
11680A355972k867J9667q451k7067l4871k7759J1661R20j1890J719J0358Q741
$$ plain form
11766 1992088 1963503 1950426 1923604 1914895 1916574 1912821 1875578 1924514 1925309 1935210 1937240 1907033 1837119
11753 1837119 1819171 1841175 1875442 1856579 1817856 1811205 1789850 1770846 1760891 1767326 1768202 1746936
11741 1746936 1716923 1685654 1686362 1713762 1739076 1738345 1732952 1686868 1653055 1647323 1627093 1618883 1664524
11728 1664524 1669088 1690730 1679844 1644109 1633617 1639352 1620474 1615902 1624935 1619389 1576612 1578579
11716 1578579 1601699 1557507 1497122 1490210 1492102 1500763 1547295 1565475 1572079 1555960 1534758 1506534
11704 1506534 1476704 1482935 1457526 1459273 1474272 1471762 1489480 1510962 1515494 1487164 1453456 1477990
11692 1477990 1457519 1431592 1433795 1420298 1395341 1389387 1373571 1350636 1320958 1309303 1332569 1355972
11680 1355972 1353105 1372772 1364321 1337254 1302383 1274624 1286285 1287205 1275315 1277034 1287392 1296133
11668A296133K3334j5892k0597o162k0238P784J4845L1068k4041l2950o1755m4666
11656A146863N792K6958K5331J7463j5530k1986k1851q749Q959Q344J6154O199
11644A193947K241j8356J8101j0422L6957P4256J10712J90567K45264N5318j32528
11633A766057j43042j00195r3079p0918o2069n5374n2171l6583k1487j1589k0154
11622A099396j0208j1779l1384k4825o506J0501K3265J2878K713m5900R618L0897
11610A058666l2618l6812M7j3114L0439L2665k0106m0840P604J0146K2985K7789
11598A046851J5167k4023n6543J526J918j9790P715R083j8031k9417l0257j8272
11586H85927l7771j3814M3408J3993k548J9964N4027k6970j026o4k8744k0233
$$ plain form
11668 1296133 1319467 1303575 1282978 1276816 1256578 1264362 1279207 1310275 1286234 1253284 1191529 1146863
11656 1146863 1152655 1179613 1204944 1222407 1206877 1184891 1163040 1154291 1163250 1171594 1187748 1193947
11644 1193947 1196188 1177832 1195933 1185511 1222468 1296724 1407436 1598003 1843267 1898585 1766057
11633 1766057 1623015 1522820 1429741 1358823 1296754 1241380 1189209 1152626 1131139 1119550 1099396
11622 1099396 1089188 1077409 1046025 1021200 1014694 1025195 1048460 1061338 1064051 1018151 1027769 1058666
11610 1058666 1026048 989236 989283 976169 1006608 1039273 1019167 978327 985931 996077 1019062 1046851
11598 1046851 1062018 1037995 981452 982978 984896 965106 972821 981904 963873 934456 904199 885927
11586 885927 848156 834342 877750 891743 889195 909159 963186 936216 935190 935126 906382 886149
11574H86149n434M001m999j2833k2535K1987N17m4867j1505Q973j2547J2480J6100
11561H35487j0099l029j5997k0076j4045j8085J5047K0853J3292j6437l6407j3050
11549G37454K2172K0266k7980m6965K8775N1530J2605j1934M923N572J4603k2405
11537G88616j873K3215j5716k9743K2488O088j4463J312m0852n387J6932k6232
11525G24385J2863J5685q786P734k3248l308j1343M121J1467K8390Q863j4148
11513G52675n452l3008m980Q395k273l3548k0543J092J1357J8398n030j943l5407
11500F49733l418J5099j1603n046Q241K8368j3128r719P405j3395m2762p91O010
11487F14994K5347J0562j1600j4404l3865j0271J0021k622J6602J216K2343K8038
$$ plain form
11574 886149 880715 884716 879717 866884 844349 866336 866853 821986 810481 819454 806907 819387 835487
11561 835487 825388 822359 806362 786286 772241 754156 769203 790056 803348 786911 750504 737454
11549 737454 759626 779892 751912 704947 733722 785252 797857 785923 790846 796418 811021 788616
11537 788616 786743 809958 794242 764499 786987 793075 778612 779924 739072 733685 750617 724385
11525 724385 737248 752933 744147 751881 728633 725325 713982 718103 729570 757960 766823 752675
11513 752675 747223 714215 709235 717630 715357 681809 661266 662358 673715 692113 687083 685140 649733
11500 649733 646315 661414 649811 644765 653006 681374 668246 658527 665932 652537 609775 608984 614994
11487 614994 640341 650903 639303 624899 591034 580763 590784 588162 604764 605980 628323 656361
11475F56361j6631o267m634j2389k3873m3116j861K7942J9622J1944O381J0619
11463F24098K0340p310k6879P444p000j1718k579J2153L3284l0304m0859k4870
11451E45800J5074J9875K012q499q477j7111K216P803m961q337j102j6881J7657
11438E45069K370M808k4494l0291R544J9590q671k7503K2261P233q04o232j5911
11425D96969j4847K2058j0922k3433M1587J0494l5541m037M252M522J1413N120
11413E07635j1123n773j4048O770K6358N897q651J0838p28J9919m711o561j7392
11400E08430n885M116o38l1275J1797j2527p644P277j8636j8584k4555l559K7803
11387D36120L0719K0162L4472p495j1593l7980l4361k230P1733J3917k8296J040
$$ plain form
11475 656361 639730 633463 628829 616440 592567 549451 547590 575532 595154 607098 613479 624098
11463 624098 644438 637128 610249 617693 610693 598975 596396 608549 641833 611529 570670 545800
11451 545800 560874 580749 582761 574262 565785 548674 550890 558693 553732 545395 544293 527412 545069
11438 545069 547439 552247 527753 497462 507006 526596 517925 490422 512683 519916 519112 512880 496969
11425 496969 482122 504180 493258 469825 511412 521906 486365 482328 486580 491102 502515 507635
11413 507635 496512 490739 476691 483461 509819 515716 507065 517903 517175 537094 532383 525822 508430
11400 508430 502545 506661 506023 474748 486545 474018 466374 473651 455015 436431 411876 408317 436120
11387 436120 466839 487001 521473 513978 502385 464405 430044 427814 499547 513464 485168 486208
11375D86208l475J2886k4643J8709O577l5328l7932j9434M2379O666j1530J8648
11363D59731L85k1759l412J1217K377n44L4602K4941j0050J2112j3560j9071n435
11350D71534j4869n544O357k662J8846J8747k6594N368j2664J0094J1245j4108
11338D65750P852o382j4901k42K379k8014r571J1002M7253K8658l3212J3731M678
11325D88981j5746o0261k0458L658j4184J6074J707m309k6283J3040J9227N113
11313D06559O908Q164q592j7387J9643J5099j0962j951r181k5442L225K2458J1394
11300D19935j7097L308K515L9185j1863q839k8587j2150J125l2487K649M3429
11288D01123R361o770o358K226K3498O183j3081n106K1648k1350k6914l6450k722
$$ plain form
11375 486208 482733 495619 470976 489685 496262 460934 423002 403568 445947 452613 441083 459731
11363 459731 460116 438357 434945 446162 448539 447995 482597 507538 497488 509600 496040 476969 471534
11350 471534 456665 451121 457478 454816 473662 492409 465815 471183 458519 468613 479858 465750
11338 465750 473602 467220 452319 452077 454456 426442 416871 427873 475126 503784 470572 484303 488981
11325 488981 473235 412974 392516 396174 381990 398064 399771 395462 369179 382219 401446 406559
11313 406559 413467 421631 413039 395652 415295 430394 419432 417481 408300 382858 386083 408541 419935
11300 419935 402838 406146 408661 447846 435983 427144 398557 386407 387532 355045 357694 401123
11288 401123 410484 403714 397356 399582 423080 429263 416182 411076 432724 411374 384460 348010 345288
11275C45288L0641L867k4402K425j1545l3787M5052L1373J240J0131J5111j8445
11263C96949j9308k7356j5296j2334K2838J3168K8317j108k303L3265J8370k3991
11251D11211j2185P937J6101K0252J191M6992K0603K679l8751k0596K8213O0823
11239E44470L6722K6048J9005L2848R2447J30491J62911K09046L33191M44427
11229B031606M14429J03213k07288l06620l15842l31275k48141j65114q9916j11981
11219G73071r0709j9137l2541o1182m2602l1663l9805m9306o032K4817J1150k8493
11207D07568P597o550M961p098j7148k5685m6478k5769J4604J3091j1173j0675
11195B97245q200J7137K3043J6254L161J8965J8177K7170j9630j8397m5469m108
$$ plain form
11275 345288 375929 379796 355394 357819 346274 312487 357539 388912 390152 400283 415394 396949
11263 396949 377641 350285 334989 322655 345493 358661 386978 385870 383567 416832 435202 411211
11251 411211 399026 406963 423064 443316 444507 491499 512102 514781 476030 455434 483647 544470
11239 544470 581192 607240 626245 659093 751540 882031 1044942 1253988 1587179 2031606
11229 2031606 2446035 2549248 2341960 2035340 1719498 1388223 1140082 974968 885052 773071
11219 773071 682362 663225 630684 569502 526900 495237 455432 406126 400094 424911 436061 407568
11207 407568 415165 408615 413576 406478 389330 363645 317167 291398 306002 319093 307920 297245
11195 297245 289045 306182 329225 345479 348640 367605 385782 412952 393322 374925 329456 325348
11183C25348L364M006k2476N191K1561m514l6384K4333O004N510l604K303j1083
11170C19559J8538K3349K3833o339M556L5561J3683r578j8119j6676j0170N147
11158C83344n207j4817l5512j5587N711J6002j1716M351J4805M663j2258M3715
11146C77494J9162q340l0698j7365l1509q337J4656r04j2202j5230k2223J3469
11134B77973m995J2965K2457M257J639j5494j6087Q495j4522n268M537L9749K4689
11121C40395o866j2646J6365P68j5117J0619l305q039j2724L4J9098j9501O502
11108C15583r164n000L803k0647K57K4628K1208j9531l815L1887l08j2043p65
11095C26093n3591J1093K2422P683K4032j209l0059Q705K8373L5766N777L4794
$$ plain form
11183 325348 328712 332718 310242 315433 336994 332480 296096 320429 326433 331943 328339 330642 319559
11170 319559 338097 361446 385279 378940 383496 419057 432740 423162 405043 388367 378197 383344
11158 383344 378137 363320 327808 312221 317932 333934 322218 326569 341374 346037 333779 377494
11146 377494 396656 388316 357618 340253 308744 300407 315063 314159 301957 286727 264504 277973
11134 277973 272978 285943 308400 312657 314296 298802 282715 291210 276688 271420 275957 315706 340395
11121 340395 333529 320883 337248 338016 322899 333518 330213 322174 309450 309484 328582 309081 315583
11108 315583 306419 301419 305222 284575 284832 309460 330668 311137 307322 339209 338901 326858 326093
11095 326093 272502 283595 306017 313700 337732 336523 306464 315169 343542 379308 385085 419879
11083D19879j3379L336M1718J1349J4294l240K4534O8991M0046J3107k498k1500
11071E96637j5141k9932j6677k35m990k9134n0999n6947n2836m6258j0523K9474
11059C12439L921o523M4212j0639j9447K633K8037J775J5381n455P557J1676j2508
11046C73059n650o580L161J5150L2332M1512K6438J6779n1022j8475N62J9387
11034D46653K7674j9334n8519R382K2708P701J8124K6793N0057L8612K4215l810
11022E90256j5586k519k1897m9783j6031M595K5244L1170K5830p962k733K4597
11010E85181K6895M5188q266l8634j8513k7166k6311K938K5809k6655l5502n0938
10998D54026m4886m5741J161k5155j1415K3188J6099J3671J7498K0466K2065J7840
$$ plain form
11083 419879 406500 409836 451554 462903 477197 473957 498491 567482 607528 620635 618137 596637
11071 596637 581496 551564 534887 534652 529662 500528 449529 392582 339746 293488 282965 312439
11059 312439 316360 309837 354049 343410 323963 326596 354633 356408 371789 366334 373891 385567 373059
11046 373059 367409 360829 363990 379140 411472 452984 479422 496201 445179 426704 427266 446653
11034 446653 474327 454993 396474 405856 428564 436265 454389 481182 531239 569851 594066 590256
11022 590256 574670 572151 550254 500471 484440 489035 514279 545449 571279 563317 560584 585181
11010 585181 612076 657264 648998 610364 591851 564685 538374 541312 567121 540466 504964 454026
10998 454026 409140 363399 364560 339405 327990 351178 367277 380948 398446 418912 440977 458817
10986D58817L10K5301k381l2526j3968L4181M961J966j88R558l7451k4055n4188
10973C70337o791M8024M9349J5485k0212J599J9698N137O48Q401M4293p763k677
10960E25528m4391m5673J16J8029J953Q444r537m192J7906L3835R0368N4718P0094
10947G17198O6784N4628R9203J54318P3853r6022j24581p13q745r5575j21620
10936G18728p9439q382l153j2056J1102M3405K6905J2616n6755j8138j9940k4586
10924E90307j1336L3505M6060L5661j930j0415J5580j0994m4087J4959J8484J901
10912F77695J7487R685L5014N1031R881q039K1236j2938j9729K4238M0166M0779
10900H86506K9037o933j3376j2168J1822J8555J3216K4738K0045r821L1528Q435
$$ plain form
10986 458817 459127 484428 482047 449521 435553 469734 474695 476661 476473 486031 448580 424525 370337
10973 370337 363546 411570 460919 476404 456192 457791 477489 482626 483274 491675 535968 528205 525528
10960 525528 481137 435464 435580 453609 455562 464006 454469 450277 468183 502018 592386 647104 717198
10947 717198 783982 838610 937813 1092131 1165984 1069962 945381 944668 935923 840348 718728
10936 718728 639289 630907 627754 615698 626800 670205 697110 709726 652971 634833 614893 590307
10924 590307 578971 612476 658536 694197 692267 681852 697432 686438 642351 657310 675794 677695
10912 677695 695182 704867 739881 790912 800793 792754 813990 801052 781323 805561 845727 886506
10900 886506 915543 908610 895234 883066 894888 913443 926659 951397 971442 961621 993149 1001584
10888A001584L1049L2183J2801J1069J0004O3384N7806J8347L7133L6183m932
10877A306611J2245J9689K6467K9259M2746Q861J4091P8210N3681N7494K6435
10866A675789M1645N5864Q4022J10058J23811J66207J33391J00165J03017J04481
10856B698450R1031J25183Q8880J30065J41845J71136K08102K37181K82556L16059
10846D490488L76421N09936O38226Q11425R96822R65658N47980L17532L60754
10837A0015242M95242O34066P87909J073875J399523J840002K386077L041384
10829B1673320L861102M850262N842732P350666J0256785J5031110K2718769L5338334
10821A26923080N5284323Q3083422J05596160P4311762j8309781o2068131o0494595
$$ plain form
10888 1001584 1032633 1064816 1077617 1088686 1098690 1162074 1219880 1238227 1275360 1311543 1306611
10877 1306611 1318856 1338545 1365012 1394271 1437017 1445878 1459969 1538179 1591860 1649354 1675789
10866 1675789 1717434 1773298 1857320 1967378 2091189 2257396 2390787 2490952 2593969 2698450
10856 2698450 2789481 2914664 3003544 3133609 3275454 3446590 3654692 3891873 4174429 4490488
10846 4490488 4866909 5376845 6015071 6826496 7823318 8788976 9336956 9654488 10015242
10837 10015242 10510484 11144550 11932459 13006334 14405857 16245859 18631936 21673320
10829 21673320 25534422 30384684 36227416 43578082 53834867 68865977 91584746 126923080
10821 126923080 182207403 265290825 370886985 445198747 426888966 364820835 304326240
10814C04326240n8668190n7833148m7641995l4281112k3647155j6263955j1687891
10807E4302794r035350p099434n598952m497066l719109l033128k523006k114451
10799A6682298j719582j371486j054529p87402m63140k38385m75069q73476r34290
10790H764939q32973p64721p50355o19314n18387m10225l63614l88190l46128
10781C771032k95673k86993k29379k03695j66931j84175j40913r6230q1114p1583
10771B014346p6184p8260q9574j08138q9433o5119m4512o8389p4713q4124j01263
10760A134637o6219m4649n4316k5844m9471o032m0278n2742P624j2070l3918l0820
10748G25902o3247k0174M009l0908j6197k0520l6564j7309l5916j6630k5089J0683
$$ plain form
10814 304326240 245658050 187824902 140182907 105901795 82254640 65990685 54302794
10807 54302794 45267444 38168010 32569058 28071992 24352883 21319755 18796749 16682298
10799 16682298 14962716 13591230 12536701 11749299 11286159 11047774 10572705 9699229 8764939
10790 8764939 7931966 7167245 6416890 5797576 5279189 4868964 4505350 4117160 3771032
10781 3771032 3475359 3188366 2958987 2755292 2588361 2404186 2263273 2167043 2085929 2014346
10771 2014346 1938162 1859902 1770328 1662190 1572757 1507638 1463126 1394737 1320024 1235900 1134637
10760 1134637 1068418 1023769 969453 943609 894138 888106 847828 795086 802710 790640 756722 725902
10748 725902 662655 642481 646490 615582 599385 578865 542301 524992 489076 472446 447357 458040
10736D58040j5850k3069M9456K3159m3576m4773o535K299o775j7102N377Q984
10724C89635K1447N42m359p420k4323J74J8173P620l1680J8635N448l383l6769
10711C53740j7904L2894J2949p230R09q149Q226k3786l2392m133L5813J4408L2702
10698C98047J5868l0599m1052n1797j35424j15532M1001J40650J08996K0679o7648
10687B83189n9352o515L5510K8951j3964r46K3966J8768L308k319l1156j3612
10675B65828J4061j7859l2258J2562Q782J7873j1676J7216j4485j2720K8572M8183
10663C24079M2820K4146n2036j4852l4870r53O553k1349k3258K0880J5519J9491
10651C06170J8086J7255L9664K2589J2872L2147M3585K6058Q328J9076P429K7343
$$ plain form
10736 458040 442190 419121 468577 491736 448160 403387 396852 399151 392376 375274 380651 389635
10724 389635 411082 411624 407265 399845 375522 375696 393869 401489 369809 388444 393892 390509 353740
10711 353740 335836 368730 381679 374449 375358 367209 375435 351649 319257 315124 350937 365345 398047
10698 398047 413915 383316 342264 290467 155043 39511 80512 221162 330158 350837 283189
10687 283189 223837 217322 252832 281783 267819 266873 290839 309607 312915 310596 279440 265828
10675 265828 279889 262030 229772 242334 251116 268989 257313 274529 260044 247324 275896 324079
10663 324079 366899 391045 339009 324157 289287 288334 294887 273538 250280 271160 286679 306170
10651 306170 324256 341511 381175 403764 416636 448783 492368 518426 526754 545830 553259 580602
10639E80602J7212L918J5396k5617k2349j7419o643L3738L8841M1197P721J8192
10627F84789N8311Q4408Q6669R8658J15682J20580J06689J33353J30179J64539
10617A783857K07429K50303L47012N48217P81379J070206J414914J899041K275836
10608A0578194K237231J577143O42911m1837l50284l47931o4458N03246J298990
10599A6033205K332532L611037M608902M274557K319053o7232j525522k030020
10591B9556512j916803j319308k43129J167620K895250M676986N782131M916284
10583D5515543J661444j890622l734205m253370m119588l414813k199793p07232
10575B6857364Q19241K169825K843079K093541k00079k470904l518512l658090
$$ plain form
10639 580602 597814 601732 617128 591511 569162 551743 545100 578838 617679 658876 666597 684789
10627 684789 743100 827508 914177 1012835 1128517 1249097 1355786 1489139 1619318 1783857
10617 1783857 1991286 2241589 2588601 3136818 3918197 4988403 6403317 8302358 10578194
10608 10578194 12815425 14392568 15035479 14993642 14643358 14295427 14230969 14734215 16033205
10599 16033205 18365737 21976774 26585676 30860233 33179286 33112054 31586532 29556512
10591 29556512 27639709 26320401 26077272 27244892 30140142 34817128 40599259 45515543
10583 45515543 47176987 45286365 41552160 37298790 33179202 29764389 27564596 26857364
10575 26857364 27676605 29846430 32689509 34783050 34582971 32112067 28593555 24935465
10567B4935465l344787k764048j975161j093179k60233L80650N25376R8672p44671
10558A5758084j536867j900274j957882j849502j644926j339693j046871q03727
10550C678342n85051m61111l61372k86699k54187j95288j89485j60596j28369
10541A056184p5190k0578n8425q8041p4282r8935q0610m1980l7401l7035m4321
10530C99386l4320l8631j0985R453q493j9061k0980k7800k1270j5638L3967K7819
10518B73447j7408k6032l6672m2983j1033N179P609O867l9134j8290L2947K250
10506A36747n4230j858K1417K1345P274N093m1857J2349J8230m3472l0262J5750
10494F6526K3156l4339j3691J4632k2518o893k864K3337K1690J440j0231K5184
$$ plain form
10567 24935465 21590678 18826630 16851469 15758290 15498057 15878707 16404083 16502755 15758084
10558 15758084 14221217 12320943 10363061 8513559 6868633 5528940 4482069 3678342
10550 3678342 3093291 2632180 2270808 1984109 1729922 1534634 1345149 1184553 1056184
10541 1056184 980994 960416 901991 813950 739668 640733 560123 518143 480742 443707 399386
10530 399386 365066 326435 315450 324903 316410 297349 276369 248569 227299 211661 245628 273447
10518 273447 256039 230007 193335 150352 139319 144498 152107 158974 119840 101550 134497 136747
10506 136747 82517 80659 102076 123421 130695 135788 93931 106280 124510 81038 50776 66526
10494 66526 89682 55343 41652 56284 33766 26873 24009 47346 69036 70476 60245 85429
10482H5429J2767m8410O76K0009j763n4781k2881m773o678K2422K5293L4908j2374
10469D9844m8719j2656J442l0222L1529K6578k2994j2643M2694l401m292l23j1404
10456E433K8578K1603P621n979k0915l740K3743k2686j9019k2118k228K4536K9330
10443D4159J6312K9185J6950m5840j5932M410p649J0502r706k6222K1635J8691
10431E6495K0852K0966j6891j6470K840k9619o230j3623n0482O504J8780L8804
10419C1926L5870J2441L2099L3572M6503j7836j8684M2552K5059K5210O7308R2497
10407D08517J24764J73859K08778L47028M21732L71776Q6370j82297k70785k71047
10397A418695l05892k77270j64154j27711j17070r0789m8329m0257k5832k3704
$$ plain form
10482 85429 98196 49786 50462 70471 68708 13927 -8954 -13727 -20405 2017 27310 62218 49844
10469 49844 1125 -11531 -10089 -40311 -8782 17796 -5198 -17841 24853 21452 17160 16837 5433
10456 5433 34011 55614 63235 57256 36341 32601 56344 33658 14639 -7479 -9707 14829 44159
10443 44159 60471 89656 106606 60766 44834 49244 41595 52097 42391 16169 37804 56495
10431 56495 77347 98313 81422 64952 67792 38173 31943 18320 -32162 -25658 -6878 31926
10419 31926 67796 80237 112336 145908 192411 174575 155891 198443 223502 248712 316020 408517
10407 408517 533281 707140 915918 1262946 1684678 2056454 2142824 1960527 1689742 1418695
10397 1418695 1112803 835533 671379 543668 426598 335809 287480 247223 221391 197687
10387A97687o333k238j6815j5051j1088J1067k6316o2115k9419j5302j1845p63
10375A1469J8043J380K8560M137m884L0934l2955m7787j8588k5859R174L1837
10363E461K7456L2624j5368m991M904r023r18K191J7505p542j8325L3256k1490
10350D5740J9230j3042k7716j3797J273j7342k0009K2199J4386J4500J8227M946
10338D8595J2927J3951r569l0194j2023j9499r266j8208m6768M222K2581n446
10326d8697J6916o88J058J460J5058K0446j8843n50Q784L1308m948m542J1959
10313B8721M541L239k2376m6063L5166m35l6199n905q952M450M522q195k5092
10300g2578N10J0286L8145K3347M172j167k6465j4044p607N081P647K7189O089
$$ plain form
10387 197687 191354 189116 172301 157250 146162 157229 130913 68798 39379 24077 12232 11469
10375 11469 29512 30892 59452 63589 58705 89639 56684 8897 -9691 -35550 -26376 5461
10363 5461 32917 65541 50173 45182 50086 41063 40145 42336 59841 52299 33974 67230 45740
10350 45740 64970 51928 24212 10415 11688 -5654 -25663 -3464 10922 25422 43649 48595
10338 48595 61522 75473 65904 35710 23687 4188 -5078 -23286 -70054 -65832 -43251 -48697
10326 -48697 -31781 -32469 -31411 -29951 -14893 5553 -13290 -13840 -5056 26252 21304 16762 28721
10313 28721 33262 36501 14125 -31938 3228 2793 -33406 -39311 -48263 -43813 -39291 -47486 -72578
10300 -72578 -72068 -61782 -23637 -290 3882 2715 -23750 -37794 -45401 -40320 -32673 -5484 605
10287F05K2084l4766j8583j7584k801K682L169K9175L4976L001J2408j366n146
10274B7854O610k5126J6922j459l1196k7574n842J2222J9954K6203J107j325J1288
10261B9638r661j1630n880j2776j1079k1218k6118p012L5340K4326Q511k1355
10249b8914m887L2623K3743J6118k2932m2494m6191o684P838O981J7438O3258
10237A5897K4646J825K0104m350k2253m0460j5862k4541k0409K3286J5433J1003
10225a5681J0507M535K3317J7429l3j4086M9722J8517k9387m0961j1835k4520
10213a2476j0294J2220J2091K0509M393M986j6009l8160j1373J0609K1154L6042
10201C3692L840k9759m554J0435O466j9729J354J5818J8448k550l6291j1313p860
$$ plain form
10287 605 22689 -12077 -30660 -48244 -51045 -48363 -45194 -16019 18957 21958 34366 33000 27854
10274 27854 34464 9338 26260 24801 -6395 -33969 -39811 -27589 -7635 18568 19675 18350 29638
10261 29638 19977 8347 2467 -10309 -21388 -42606 -68724 -75736 -40396 -16070 -7559 -28914
10249 -28914 -33801 -1178 22565 38683 15751 -26743 -72934 -79618 -71780 -64799 -47361 15897
10237 15897 40543 42368 62472 58122 35869 -4591 -20453 -44994 -65403 -42117 -26684 -15681
10225 -15681 -5174 -639 22678 40107 40074 25988 75710 94227 64840 23879 12044 -12476
10213 -12476 -22770 -10550 1541 22050 26443 31429 15420 -22740 -34113 -23504 -2350 33692
10201 33692 37532 7773 3219 13654 20120 391 1745 17563 36011 33461 -2830 -14143 -22003
10188b2003J5070J2723k2877r124J5208J0711J3739l2412k8190J3436j6206R894
10176d0031N022M4172M7190J8812L4428M6867K6297m0443m3049n0721p290Q480
10164D9734j6676O923L0665N0100N6353K2817K1367m8616l9574Q695P533K371
10152A51692J0764J2441K3641L7378L2551K6959K7984j0751m3644m4539j2223
10141B12253l4786n0032n122K0599J2880K1715j9446K542R70n0336m4206j7885
10129D9146j4427q713j5212L4957J6239o176o615R630k1522M022r154j2772Q293
10116B7696J520j6343j1766K959r205p265r20L577J1469m856j5685j8253K8697
10103h375K2590N654l4524o913J4789j7067j8574n079J2923J1137L40j9363j6134
$$ plain form
10188 -22003 -6933 5790 -17087 -26211 -11003 -292 13447 -18965 -47155 -33719 -49925 -40031
10176 -40031 -35009 9163 56353 75165 109593 156460 182757 142314 99265 48544 41254 49734
10164 49734 33058 39981 70646 120746 177099 199916 221283 172667 133093 141788 149321 151692
10152 151692 162456 174897 198538 235916 268467 295426 323410 312659 269015 224476 212253
10141 212253 177467 127435 122313 142912 155792 177507 158061 160603 161573 111237 67031 49146
10129 49146 34719 26006 10794 45751 61990 55814 49199 58829 37307 41329 32175 19403 27696
10116 27696 29216 12873 1107 4066 -5139 -12404 -13324 -9747 1722 -3134 -18819 -37072 -8375
10103 -8375 14215 19869 -14655 -21568 -6779 -23846 -42420 -47499 -34576 -23439 -23099 -42462 -58596
10090e8596N195k320K3956J6678j4525j3902K5300J1251k8646r671J5057J1588
10078a8635o551L2296J1829o262J0934J5152k9894j7793K5339J3408Q500J1414
10066D9737j5996n3759L862K8140N747j2622j871j4434L2904K5374j5457k5371
10054F254L324J7802j0901k9364k0954k5446k4467J430O4551K1399o406M1075
10042C8297J4722k1611k1225k4933j3226m955P707Q559J2239j7525Q633o468L3329
10029A3543K3200j6767m2303j2653K532L481K617q336K5358J0897k3089r923k599
10016c4042J1152L134m600N223k4769N232R275r584j2095j6345l171J5438N2015
10003c137K7658j241j6469k0050M862J5767J8492O137j4974j3063j2724J7738
$$ plain form
10090 -58596 -53401 -55721 -31765 -15087 -29612 -43514 -18214 -6963 -35609 -45280 -30223 -18635
10078 -18635 -25186 7110 18939 12677 23611 38763 8869 -8924 16415 29823 38323 49737
10066 49737 33741 -20018 -16156 11984 17731 5109 3238 -11196 21708 47082 31625 6254
10054 6254 9578 27380 16479 -12885 -33839 -59285 -83752 -82322 -17771 3628 -2778 38297
10042 38297 53019 31408 10183 -14750 -27976 -32931 -25224 -16665 -4426 -21951 -13318 -19786 13543
10029 13543 36743 19976 -22327 -34980 -32448 -28967 -26350 -34686 -9328 1569 -21520 -31443 -34042
10016 -34042 -22890 -19756 -24356 -19133 -43902 -38670 -29395 -38979 -51074 -67419 -70590 -55152 -3137
10003 -3137 24521 23280 6811 -13239 -8377 7390 25882 32019 17045 3982 -8742 8996
9991H996k938L667R695Q37O630K6607p939P558k4769l9563k7263M281K6341M4842
9977C6982r904k6598m0137k6R92r84Q17O093R667J2294L643K1061Q457O900j343
9962B7914j4537m0555j9257l229L349Q486J008K3079J4347k2409k2088R453O655
9949b7784j5847O298k1494o014K9186j975j7770K3840J1549J4290L2879O744l6711
9936b809k8372M586K3717n805L8196r20j6283j983j783j2647j9719q01j3522R529
9922b8616L156K7864J6267n726l7471j966J3203m810j973o867J2207K0053o571
9909a250J1260j2118O389l109l9881k1987n20N4993J6099n925q83k5553K2205
9896b80K4803j5537M514j7696m2706k5809J1710K5237N498L0349j5824m973l7947
$$ plain form
9991 8996 6058 9725 19420 20257 26887 53494 45555 53113 28344 -11219 -38482 -34201 -7860 36982
9977 36982 27078 480 -39657 -39683 -38691 -39675 -38858 -32765 -23098 -10804 -7161 13900 22357 29257 27914
9962 27914 13377 -27178 -46435 -49664 -46315 -37829 -36821 -13742 605 -21804 -43892 -34439 -27784
9949 -27784 -43631 -37333 -58827 -64841 -35655 -37630 -55400 -31560 -20011 -5721 27158 33902 -2809
9936 -2809 -31181 -26595 -2878 -8683 29513 28593 12310 10327 8544 -4103 -23822 -24623 -38145 -28616
9922 -28616 -25460 2404 18671 12945 -24526 -26492 -13289 -18099 -20072 -26939 -14732 5321 -1250
9909 -1250 10010 -2108 4281 1172 -38709 -60696 -61216 -6223 9876 3951 3068 -22485 -280
9896 -280 24523 8986 13500 -4196 -46902 -72711 -61001 -35764 -30266 83 -15741 -20714 -58661
9883e8661n579K0841Q148k0909K6506j6868k7459L5174n295l450M128J6989L5590
9870I155K9490m100M205J9779k5144m0814k2165j5654K3924K3830j9729j0984
9858b8207j4791j9170l58r647K9684K7793K5224j3506l251o252O073j6150J3291
9845i267o784j8219M6333P66l2884L259j7446K507J6802K951M913J3938K143l1280
9831b2268m9498J4931L4553j306K0068L6256o24o7830k1587p94O186q476j9365
9818g9754K4350K5453K9533k1079n394K1602L4668Q045O369j7037k9877p939k6767
9805c7827N078K6077q560m0827j48J5821J6029J0129m468Q752J676K2186k0927
9792g009k0875r720j2082j2997J9089N653j4883p361L9470K4642k0124k1317k691
$$ plain form
9883 -58661 -64240 -43399 -35251 -56160 -29654 -46522 -73981 -38807 -44102 -47552 -43424 -26435 9155
9870 9155 38645 34545 38750 58529 33385 -7429 -29594 -45248 -21324 2506 -17223 -28207
9858 -28207 -42998 -62168 -62526 -72173 -42489 -14696 10528 -2978 -6229 -12481 -6408 -22558 -9267
9845 -9267 -16051 -34270 12063 12829 -20055 -16796 -34242 -31735 -14933 -11982 -7069 6869 9012 -22268
9831 -22268 -71766 -56835 -22282 -23588 -3520 32736 32112 -35718 -57305 -58099 -51913 -60389 -79754
9818 -79754 -55404 -29951 -418 -21497 -26891 -5289 29379 37424 43793 26756 -3121 -11060 -37827
9805 -37827 -32749 -6672 -15232 -56059 -56207 -40386 -24357 -14228 -18696 -9944 -8268 13918 -7009
9792 -7009 -27884 -37604 -49686 -62683 -43594 -37941 -52824 -60185 -20715 3927 -16197 -37514 -40205
9779d0205J5137J4077k5367j3309K4152K0402m706O0471K6581j4961k9468l8311
9767e507M882L1969L7547n430m1441n3386l5625j9449L4964L3538L4759L936P398
9754B8155K8831j2166n8027j0588k1427N940K7121L4086J2307r208j8257L723
9742A0490j0436p422Q209p862l197N447j6967o422J5121j9700q175Q5j04K9318
9728a1615K4133j2064l8411r906M6246L9160J9174m4716j2140J7581k51j6977
9716B14J3507m230q167k391K344j2365l1938J9J2553r575j7296M297J6819M1601
9702E392r09o475q185M252K2345k0414m5380o375Q351l0886k2539k4922M8210
9689g7535N6352J2638J7225L1113K24j5681J3908L2694k8778m4928l7532L2632
$$ plain form
9779 -40205 -25068 -10991 -36358 -49667 -25515 -5113 -9819 50652 77233 62272 32804 -5507
9767 -5507 -625 31344 68891 63461 22020 -31366 -66991 -86440 -51476 -17938 16821 20757 28155
9754 28155 56986 44820 -13207 -23795 -45222 -39282 -12161 21925 34232 25024 6767 10490
9742 10490 54 -7368 841 -7021 -10218 -4771 -21738 -28160 -13039 -32739 -40914 -40829 -40933 -11615
9728 -11615 12518 454 -37957 -47863 -1617 37543 56717 12001 -139 17442 17191 214
9716 214 13721 9491 1324 -1067 1277 -11088 -43026 -43007 -30454 -40029 -57325 -53028 -36209 5392
9702 5392 4483 -1992 -10177 -5925 16420 -3994 -49374 -55749 -47398 -78284 -100823 -125745 -77535
9689 -77535 -21183 -8545 8680 39793 40017 24336 38244 70938 42160 -2768 -40300 -7668
9677g668K7046j2421q793J7729N912j0379j3456l2693M23M4016j5069k0305q191
9664c3849m022j5720N196L3544K4558p192l8924l7477n938K9355M6907J5327K5901
9651C7666j4354k4697k4710k2541J014L0799L2225M1738M3257k4894m1098m228
9639C0177j9149j4805o730O210j7100r818R296J0249k7820k3409N02L5258L9844
9626A2705K3438j1278l6332m528K3506J698Q013l9563k8075N702j3693J1375M6977
9613e5J3638j6409Q039K647j0605j645q112J1634O339O22M2555R23k8907k4605
9599c941j4402k6864K5684K5224L876l45M140M588P837j8884l7907m896J1680
9586b4210R334k1550k3340N854K3134j6772j7031j4524L6259M2933N836K455k6884
$$ plain form
9677 -7668 19378 6957 -1836 15893 21805 11426 -2030 -34723 -34300 9716 -5353 -25658 -33849
9664 -33849 -37871 -53591 -48395 -14851 9707 2515 -36409 -73886 -79824 -50469 -3562 11765 37666
9651 37666 23312 -1385 -26095 -48636 -47622 -16823 15402 57140 100397 75503 34405 30177
9639 30177 11028 -3777 -10507 -4297 -21397 -31215 -21919 -11670 -39490 -62899 -62397 -27139 12705
9626 12705 36143 24865 -11467 -15995 7511 9209 17222 -22341 -50416 -44714 -58407 -47032 -55
9613 -55 13583 -2826 5213 7860 -2745 -4390 -12502 -868 5471 6093 48648 49571 20664 -3941
9599 -3941 -18343 -45207 -19523 5701 9577 9232 13372 17960 25797 6913 -30994 -35890 -24210
9586 -24210 -14876 -36426 -59766 -53912 -30778 -47550 -64581 -79105 -42846 87 5923 8378 -18506
9573a8506j0151k077k5822m438J7651J1489j2116k9692N1392K6376j2112j2122
9561b0128m7027K3734M6399K463J6876j9911m0883j0347L8409K896N177J760m294
9548d876k9277J7402J3473k2928K726J6635K940n792Q871l4150J3657p976l3163
9535f2458P522K1897o292n451K8995J9153j1390L1638L6181j4638l1056l1245
9523a7144k636J2579l8351l359p529j064R527L5656K9365l8931J181J8903j7720
9510a9523l782M3717k2035m0961k4990L042L6690K8420L5265Q455k0879m8033
9498b4614n002q63J308J3384J7433j9164N33j6684K1689J1410K0669K8191k7715
9485B0575j3103K5857j5259P390l7996k6143P937R143J9063l0976M0505p193m677
$$ plain form
9573 -18506 -28657 -30734 -56556 -60994 -43343 -31854 -43970 -73662 -22270 4106 -8006 -20128
9561 -20128 -67155 -43421 2978 5441 22317 2406 -38477 -48824 -10415 -7519 -2342 -582 -4876
9548 -4876 -34153 -16751 -3278 -26206 -23480 -6845 -3905 -9697 -826 -34976 -21319 -29295 -62458
9535 -62458 -54936 -33039 -39331 -44782 -15787 3366 -8024 23614 59795 45157 14101 -17144
9523 -17144 -19780 -7201 -45552 -48911 -56440 -57504 -47977 -12321 17044 -21887 -20706 -1803 -19523
9510 -19523 -23305 20412 -1623 -42584 -67574 -64532 -27842 578 35843 44298 23419 -24614
9498 -24614 -29616 -30479 -29171 -15787 1646 -17518 -16985 -33669 -11980 -570 20099 48290 20575
9485 20575 7472 33329 18070 25460 -12536 -38679 -30742 -21599 -2536 -33512 6993 -200 -4877
9472d877m808O149j9698j4750k4416K6469Q751j8682K3291K4654K449J957q883
9459b394j1080J9999R333m0913Q299K4792J3015J2538P635j2923j6715k5136K5750
9446A2200K4757J1066j7354K279J5193j885L29j6402p144j2373R721o842j3129
9433D16p84j2767j1386L556n026P920r066N896k6987J8680L3542J1309R967K4421
9419D9691j6379l122L9363m789l0979l9056j1688M0466J463j3574k6448j871K3612
9406F689L152l782Q348M672m388k533j8602K035K6002K9077j8528l2427p526J7220
9392I409K2526J3801l2269j1069q645r113j522J2069k4009N000J5394l2905J5017
9379b6316j625k3760K603O281L131J2314L969k7041J7119r320q235J5391l1167
$$ plain form
9472 -4877 -9685 -3536 -23234 -37984 -62400 -35931 -27180 -45862 -22571 2083 4532 6489 -2394
9459 -2394 -13474 6525 15858 -25055 -16756 8036 21051 33589 41224 28301 11586 -13550 12200
9446 12200 36957 48023 30669 32948 48141 46256 46585 30183 23039 10666 20387 13545 416
9433 416 -368 -13135 -24521 -20965 -25991 -18071 -27137 -21241 -48228 -29548 3994 15303 25270 49691
9419 49691 33312 30190 69553 64764 33785 -5271 -16959 23507 24970 11396 -15052 -16923 6689
9406 6689 9841 6059 14407 19079 14691 12158 -6444 -4409 21593 50670 32142 -285 -7811 9409
9392 9409 31935 45736 13467 2398 -6247 -15360 -16882 -4813 -28822 -23822 -8428 -41333 -26316
9379 -26316 -27941 -51701 -49098 -42817 -39686 -27372 -23403 -50444 -33325 -42645 -50880 -35489 -66656
9366f6656l1161K3133L3254J9961J4886n498m117j5227J9584R251r36n9634m789
9353f7949m0116P51M3818K4799R013L611j913J892j1031K5811J7362k5784r364
9340b9100K7570J4944J1684j6251j7745K69R23o546n176j4727n053J7537K0893
9327g78J3782N995k1240L0096M0463l3276l008m3573j8227j3817o092J9235J5374
9314a5066K3061l0306k4834M1304K9504n002M871k542k8757j1800J4381j8140
9302b3326N903P329k151k268j6147M417j9094k103M470m211K3152o740N518L8325
9288A3074k3254j0948j49m802J2810J1064l4609N780N4195m818k8845L355K3006
9275A5859p997q986k1495L6310L841k8975J706j1179L2580J3712l8908n416P476
$$ plain form
9366 -66656 -97817 -74684 -41430 -21469 -6583 -12081 -16198 -31425 -11841 -2590 -3526 -63160 -67949
9353 -67949 -108065 -107314 -63496 -38697 -29684 -26073 -27986 -26094 -37125 -11314 6048 -19736 -29100
9340 -29100 -1530 13414 25098 8847 -8898 -8629 -7706 -14252 -19428 -34155 -39208 -21671 -778
9327 -778 13004 18999 -2241 27855 68318 35042 32034 -11539 -29766 -43583 -49675 -30440 -15066
9314 -15066 7995 -22311 -47145 -5841 23663 18661 23532 20990 -7767 -19567 -5186 -23326
9302 -23326 -17423 -10094 -12245 -14513 -30660 -26243 -45337 -47440 -42970 -47181 -24029 -30769 -25251 13074
9288 13074 -10180 -21128 -21277 -26079 -13269 -2205 -36814 -31034 23161 18343 -10502 -7147 15859
9275 15859 7862 -1124 -22619 13691 17532 -11443 -9737 -20916 11664 25376 -13532 -18948 -11472
9262a1472O230n082j1654k5157O064L146k3975J97K7071L2068K2704J348n279
9249A6209M365P78k8564j2002K1531L3297p128k4145K016l520J1409J6988k5020
9236F214n205j61L0581M1142p123m5583l5246J2949j3233k356k0554M8573L0586
9223D0584M503j6016j994L03n3062l1133m5607J5406M8465J0432n8937K3747L4562
9210b8747l908j4109j959M1821L5819j7611l0056j7095k1639l1120Q648K4655
9198e5301K7604j3411k5544k618N855k526j1513R586j698N835J741l139J3107
9185e2022Q686K816O406K570l5903l0573P251L5751P026J0786K8107m2383k5651
9172g7133p576J8793J3712L3060J7037L918l298r794J0369k0965j8671K7377J6554
$$ plain form
9262 -11472 -5242 -10324 -21978 -47135 -41071 -37925 -61900 -61703 -34632 -2564 20140 21488 16209
9249 16209 20574 21352 -7212 -19214 2317 35614 28486 4341 6357 2837 14246 31234 6214
9236 6214 1009 848 31429 72571 65448 19865 -15381 -2432 -15665 -18021 -38575 9998 40584
9223 40584 45087 29071 27077 27380 -25682 -56815 -102422 -87016 -38551 -28119 -87056 -63309 -28747
9210 -28747 -32655 -46764 -48723 -6902 28917 11306 -18750 -35845 -57484 -88604 -79956 -55301
9198 -55301 -27697 -41108 -66652 -69270 -63415 -65941 -77454 -67868 -69566 -63731 -61990 -65129 -52022
9185 -52022 -43336 -40520 -34114 -31544 -67447 -98020 -90769 -55018 -47992 -37206 -9099 -51482 -77133
9172 -77133 -84709 -65916 -52204 -19144 -2107 1811 -1487 -11281 -912 -21877 -40548 -13171 3383
9159C383m162L741l3683j4163k1452k187J4140L0233j3012m1757K6308N9937J4649
9146B1975L128l5793j9738q963j6118K4483j2376n894J6495Q559l4711k211J4573
9133d6591Q113Q90k1779p715P877M7702p614k3326P534L2754M778k805J4360j6419
9119b241j9171M401M9695J9187j8872l0463k563K0340K2018k8913j2617K1075
9107B1876l4957k489M2502P229q633n984o499l6459m9k823J1917j0931j1873L393
9093c3780J8576Q548J3958K7438J6654m7824j2490J6645J6302L3693j9238l3537
9081D945o769J4907j9891m7595k1474K1224n043n664J6708J328K8361m396k8495
9068e1854r842P337K2856J0797k8999n836K0137m177j0828J2890K5400J6544J1537
$$ plain form
9159 3383 -779 2962 -30721 -44884 -66336 -68523 -54383 -24150 -37162 -78919 -52611 7326 21975
9146 21975 25103 -10690 -30428 -39391 -55509 -31026 -43402 -49296 -32801 -24242 -58953 -61164 -46591
9133 -46591 -38478 -37588 -59367 -67082 -59205 -11503 -19117 -42443 -34909 -2155 2623 -182 14178 -2241
9119 -2241 -21412 -17011 32684 51871 32999 2536 -27 20313 42331 13418 801 21876
9107 21876 -13081 -15570 26932 34161 25528 19544 13045 -23414 -23463 -26286 -14369 -25300 -37173 -33780
9093 -33780 -15204 -6656 7302 34740 51394 3570 -8920 7725 24027 57720 38482 4945
9081 4945 -1824 13083 -6808 -54403 -75877 -54653 -59696 -65360 -48652 -47324 -18963 -23359 -51854
9068 -51854 -61696 -54359 -31503 -20706 -49705 -55541 -35404 -39581 -50409 -37519 -12119 4425 15962
9055A5962Q02j9130k0692q580K42J7019p215p99K4616J2050r670k7899K5808l30
9041B184P434J2661k970l1554k3578K1653O121k2880k6696M932j9275m5909j2122
9028a29999J6503M6817K305J7953O443J148L7739j890k9509R070M0973L3878J1211
9015F2642j0084j0876j1041K202j4652J2972K1765j5458N339J5660m4558j9270
9003e359K7654l6273j9581J698j1374l252M0490R108m1211j4954j8512J1169j60
8990f0557K8846j4082J510O791O757J7385l5702o747j758J7592L7545j4268j3041
8977b9729M8269M908j0361K4268K2527n344m4034O800O8J0449P051j5152l1975
8964a2255q149L1400K6316l8275k2186J224N954p01K0242P65k0872k3727K24L8784
$$ plain form
9055 15962 16764 -2366 -23058 -31638 -31396 -14377 -21592 -22391 2225 14275 4605 -23294 2514 2184
9041 2184 9618 22279 19309 -12245 -35823 -14170 -8049 -30929 -57625 -52693 -71968 -117877 -129999
9028 -129999 -113496 -66679 -64374 -46421 -39978 -38830 -1091 -2981 -32490 -23420 17553 51431 62642
9015 62642 52558 41682 30641 32843 18191 31163 52928 37470 42809 58469 13911 -5359
9003 -5359 22295 -13978 -33559 -31861 -43235 -46487 -5997 3111 -38100 -53054 -71566 -60397 -60557
8990 -60557 -31711 -45793 -44283 -37492 -30735 -13350 -49052 -55799 -57557 -39965 -2420 -16688 -29729
8977 -29729 18540 23448 13087 37355 59882 54538 10504 17304 17372 27821 34872 19720 -12255
8964 -12255 -20404 10996 37312 -963 -23149 -21925 -15971 -16672 3570 4335 -16537 -40264 -40040 -1256
8950a256L5063J3574l5851r423L0614P681l7774o154j4185l291J7101J4920J1936
8937B2955j9527k5562R665j6177K3286L9343O016N697K1044n673k8168j6138j9628
8924b867M430j4771m9637p43K942r04K8988M9974J9319m2588j6685L9149K5562
8911D2169k0104n0817l854K2530L2793M581j6005j8360p877k1068r57k7027M518
8898e9478L9333L65N985J5427J269p437J4971K3304k5543j1441J030k3922K7695
8885A558K8016J7500p748j1587k2868l1927P8Q723j4995j7723N876K0831P837
8872a6429k0070J8651K330j50l790M650K7367K5526R355k0044J4614l576l1425
8859G009n210J14Q518n641o237j9750N065N024K7802M969k9673j0091J9115j8389
$$ plain form
8950 -1256 33807 47381 11530 2107 32721 40402 2628 -3526 -17711 -21002 -3901 11019 22955
8937 22955 3428 -22134 -12469 -28646 -5360 33983 39999 45696 66740 61067 32899 16761 -2867
8924 -2867 1563 -13208 -62845 -63588 -60646 -61550 -32562 17412 36731 -5857 -22542 16607 42169
8911 42169 22065 -28752 -32606 -10076 22717 27298 11293 -7067 -14944 -36012 -36969 -63996 -59478
8898 -59478 -20145 -19780 -13795 1632 2901 -4536 10435 33739 8196 -3245 -2215 -26137 1558
8885 1558 29574 47074 39326 27739 4871 -27056 -26978 -18255 -33250 -50973 -45097 -24266 -16429
8872 -16429 -36499 -17848 -15518 -15668 -19458 -14808 12559 38085 47440 27396 42010 38434 7009
8859 7009 1799 1913 10431 4790 -1447 -21197 -16132 -11108 16694 21663 -8010 -18101 1014 -17375
8845a7375l9747J6744J6064P683r922m977J2087j1841J3092j3494K0235J4073
8833B622L3330J8677l9278j9476k3426m2p263j8225k7716K5137J8102j7234n533
8820f0325r77j1312J0879K18q212L677J3981J4472j5860L1893L0123N143m0869
8807b7169m3141k2849J4531L1282K1560J3667J3938q126O502j0212j7485M917
8795b2585j626j1426j1046J7539J3108N115m244j4112k493M242Q116J6785P615
8782D988J0353O328k4028j9115K658J5425L1204K0739O526j177j056K183k3301
8769C1727k0808J2796K766k5690j5287K192k2921j9400n067j603M9432L2119n605
8756A4651P527Q021m960n447l3917k5905J8578n706J888P944j3934K189j9960
$$ plain form
8845 -17375 -57122 -40378 -24314 -16631 -26553 -31530 -19443 -31284 -18192 -31686 -11451 2622
8833 2622 35952 54629 15351 -4125 -27551 -27593 -34856 -53081 -80797 -55660 -37558 -54792 -60325
8820 -60325 -61302 -72614 -61735 -61517 -69729 -66052 -52071 -37599 -53459 -21566 8557 13700 -27169
8807 -27169 -70310 -93159 -78628 -47346 -25786 -12119 1819 -6307 195 -10017 -27502 -22585
8795 -22585 -24211 -35637 -46683 -29144 -16036 -10921 -15165 -29277 -31770 -27528 -19412 -2627 4988
8782 4988 15341 21669 -2359 -21474 -18816 -3391 27813 48552 55078 53901 52845 55028 31727
8769 31727 10919 23715 26481 791 -14496 -12304 -35225 -54625 -59692 -61295 -11863 20256 14651
8756 14651 22178 30199 25239 19792 -14125 -40030 -21452 -27158 -25270 -17326 -31260 -29071 -49031
8743d9031J5271l622J8292M605L7636O075o547j2150j5734K8802n89k5835k563
8730e390n814r751o60P847O678R966L1577L6158j2846j7485n3481p890j5285J6969
8716a9407K0144k5561M886o131J6571P267J7421k3971J787K6127M691Q322K7432
8703E9578k8222J4832J7552p983n4752k5736N222l459K6894L2158k7228j9449
8691a0593l3510J3458P091K7619L1681N197j8802l2399J1642Q008M511o120l0396
8678b2613k327L378K6482o433p525K2462J286j2342m293j2213o916O695K2866
8665H507M368L1337P848n554k0301j1951o49K1148N4016j4546l2414j2325m0719
8652a1235K1647K1568K1456l0329l153k5395r718O529Q577j9390K6462j3977K562
$$ plain form
8743 -49031 -33760 -37382 -19090 -14485 23151 29226 22679 10529 -5205 23597 23008 -2827 -5390
8730 -5390 -11204 -20955 -21615 -13768 -7090 2876 34453 70611 57765 40280 -13201 -21091 -36376 -19407
8716 -19407 737 -24824 -19938 -26069 -9498 -2231 15190 -8781 -6994 19133 23824 32146 59578
8703 59578 31356 46188 63740 55757 1005 -24731 -19509 -22968 3926 36084 8856 -10593
8691 -10593 -44103 -30645 -23554 4065 35746 40943 22141 -10258 1384 9392 13903 7783 -22613
8678 -22613 -24940 -21562 4920 -1513 -9038 13424 14710 2368 -1925 -14138 -21054 -14359 8507
8665 8507 12875 44212 52060 46506 26205 14254 13605 34753 88769 74223 41809 29484 -11235
8652 -11235 10412 31980 53436 23107 19954 -5441 -15159 -8630 -53 -19443 7019 -6958 -4396
8639d396O634j9607J18o464k0195J8662J4295J4625J1396K9254j9222m0514j3084
8626b8498M535K2857k8032m297M8726J765l0153J6978j150j3136k2932j4777J4221
8613c3893J4319K3565L2893M1121K09j9266j7667j918K786k232M64q251K0594
8600E2724j6008l0244p490j9042K9397K6495q261j3720k7371M395J0226M199k2635
8587a7335k9857P523K0518K9737K1583O894k5381j8215K6215J9242l537Q173j3366
8574C2194J2286P765j4443o813m812q348O432k486L7255J4612l5805Q613l874
8561D2576n277L492n210k138L5326J7722j7626N652J9371R433J6940k0184M137
8548A04214N227k3769k8356PQ823K5113o208j7803j7473m68K6759l4936j3852
$$ plain form
8639 -4396 2238 -17369 -17251 -23715 -43910 -25248 -10953 3672 15068 44322 25100 -15414 -28498
8626 -28498 -23963 -1106 -29138 -33435 15291 17056 -13097 3881 2731 -10405 -33337 -48114 -33893
8613 -33893 -19574 3991 36884 78005 78214 58948 41281 39363 42149 39917 40381 32130 52724
8600 52724 36716 6472 -1018 -20060 9337 35832 27571 13851 -13520 -9125 1101 5300 -17335
8587 -17335 -47192 -39669 -19151 10586 32169 39063 13682 -4533 21682 40924 37387 45560 32194
8574 32194 44480 52245 37802 30989 26177 17829 24261 21775 59030 73642 37837 46450 42576
8561 42576 37299 40791 35581 33443 68769 86491 68865 74517 93888 103321 120261 100077 104214
8548 104214 109441 85672 57316 57323 66146 91259 85051 67248 49775 49307 76066 41130 27278
8535B7278o737J4886n337k0819R48K1122r376j9961l415M492O128o820p325J5500
8521A0564P243k644L1700n10k5675k8002J4521J5427Q311J0228j4096l3612n29
8508g074J1201O08q373n993l577j1408J421j231j5970n416J482K2966L5675o69
8494A3642k338m020r769R640q09o104K3332j6541j3613j4721O958j2752m420J2708
8480a8807L124o198q044L786o581k505K6384J6005J649N514J3321j7031k7336
8467a6719J6461K0842L1048l039l2838k7788K069J9939q781q745O044J3510j3440
8454a437j0206M57L878j6396K1366j2637M5282l053n2310m3366k750O9465K7663
8441B5956P079j6677J2202L0886J4362n660l6500J8506l0779k7338l7617K2691
$$ plain form
8535 27278 20541 35427 30090 9271 10219 31341 21965 2004 -1411 3081 9209 2389 -4936 10564
8521 10564 17807 15163 46863 46353 20678 -7324 7197 22624 30935 41163 27067 -6545 -7074
8508 -7074 4127 4735 -3638 -9631 -13208 -24616 -23195 -24426 -40396 -45812 -44330 -21364 14311 13642
8494 13642 11304 7284 -2485 7155 6346 242 23574 7033 -6580 -21301 -14343 -27095 -31515 -18807
8480 -18807 -15683 -21881 -29925 -26139 -32720 -35225 -8841 7164 8813 14327 27648 10617 -16719
8467 -16719 -258 20584 51632 48593 15755 -12033 -9964 9975 1194 -7551 -1507 12003 -1437
8454 -1437 -11643 -11186 -7308 -23704 -2338 -14975 30307 27254 -25056 -68422 -71172 -1707 25956
8441 25956 33035 16358 28560 59446 73808 68148 31648 50154 19375 -7963 -45580 -22889
8429b2889N0213Q432j2866j9176k032J634K4093k4354j5971L3779L7507k2746
8417C5624m1843J1770K5771L8905r156m1765k2628J1168K912l0987l887l175K0543
8404f748O539M614J1407J1355j1714k118o558l1612L727j1993j9990L477J4432
8391c5182J2107J3098p583j8702L2322j9841j9352L9721L6737l883J6628L370
8379D9440l0237l1517k5661p718q970j538M865P528J6171j0340j2010L8067j4145
8366b6065k0709M3503L0552p779k3925r911m986K0262K5784m775l7415j1404N8598
8353C1730J242L808l5432j8255q539p909J1069r834j1394K0183L5349l9419l0057
8340e7458M5166K4971l3506k1725N9033M0195K2911j8064m0519k8825q95Q402
$$ plain form
8429 -22889 27324 35756 22890 3714 1682 3316 27409 3055 -12916 20863 58370 35624
8417 35624 -6219 5551 31322 70227 61071 19306 -3322 7846 10758 -20229 -24116 -27291 -6748
8404 -6748 -209 4405 15812 27167 15453 13335 6777 -24835 -21108 -33101 -53091 -49614 -35182
8391 -35182 -23075 -9977 -17560 -36262 -3940 -23781 -43133 -3412 33325 29442 46070 49440
8379 49440 19203 -12314 -37975 -45693 -54663 -56201 -51336 -43808 -27637 -37977 -49987 -11920 -26065
8366 -26065 -46774 -3271 27281 19502 -4423 -14334 -19320 942 26726 21951 -15464 -26868 31730
8353 31730 32972 36780 1348 -16907 -25446 -33355 -22286 -32120 -43514 -23331 12018 -27401 -57458
8340 -57458 -12292 12679 -20827 -42552 16481 56676 79587 61523 21004 -7821 -8716 -314
8328c14K0784J0980j7121m3005p493K5282J1053m5358q837L4584J6028j4336k533
8315b0286M598o214K9716m318j4127N897K0485k232J7495j009K8736K5365k9146
8302E4960k6286Q800o621M471j9226j4307j6326K816L654K8188n588l0648O404
8289i709k409L0763L4235P613l6399k3752j4768k7478N960j2663K4889q769q596
8276d1083k527q654m525J4735J2773O175K7192L2303N120l3481J4754K6030L985
8263E2797N911p277P416j7426n4575P241K9763J9641j17J4670j4171k2588l4087
8250a2802j5391K8507L1385Q5k4200Q816m619j63P393n624J151j7145j2600j2610
8236b7817l1998n219J9047l511k1433l777M590L040M2587L9157l1187k0282p299
$$ plain form
8328 -314 20470 31450 14329 -28676 -36169 -10887 166 -45192 -54029 -19445 -3417 -17753 -20286
8315 -20286 -15688 -21902 7814 3496 -10631 -4734 15751 13519 31014 30005 58741 84106 54960
8302 54960 28674 37474 30853 35324 16098 1791 -14535 -11719 -8065 20123 14535 -16113 -9709
8289 -9709 -12118 18645 52880 60493 24094 342 -14426 -41904 -35944 -48607 -23718 -32487 -41083
8276 -41083 -43610 -52264 -56789 -42054 -29281 -23106 4086 36389 41509 8028 22782 48812 52797
8263 52797 58708 51431 58847 41421 -13154 -5913 23850 43491 43374 58044 43873 21285 -12802
8250 -12802 -28193 314 31699 31784 7584 16400 11781 11618 19011 13387 14538 -2607 -15207 -27817
8236 -27817 -59815 -65034 -45987 -49498 -70931 -74708 -70118 -67078 -24491 14666 -16521 -36803 -44102
8223d4102j9241J4016m21k5723O475L3011j3443m49J7262k7213j3539M102K2395
8210d6870J8600l760l3046o9j1267j971O994N4615N176L363j3360p036m449J3587
8196a9493R14P054M77m461K7897L4373m389k9971k0846J5232N561K6386J258p476
8182C2516j0748j1227J239L255k7392k6490j9975O040k1173J9852L7245k9249
8170d6107K2521K1014K8761K7648K369J0056j3775M742O944r16k2640L576m634
8157C9559k250p586j9767l5872j1099K4252J7079M896K1907m209j4982j1849r456
8144i377l293k4458j7951P808J0265J1876L746j2873P223j5210j9445K6493J1701
8131b3495j2647k865J1606J2439M4708P852k5631k265L7421r707k4777K2267M886
$$ plain form
8223 -44102 -63343 -49327 -49748 -75471 -68996 -35985 -49428 -49877 -32615 -59828 -73367 -69265 -46870
8210 -46870 -28270 -32030 -65076 -65145 -76412 -78383 -71389 -16774 -11598 -8235 -21595 -28631 -33080 -19493
8196 -19493 -18579 -11525 -11048 -15509 12388 46761 42372 12401 -8445 6787 12348 38734 39992 32516
8182 32516 21768 10541 11780 15035 -12357 -38847 -58822 -52782 -73955 -54103 -16858 -46107
8170 -46107 -23586 -2572 26189 53837 56206 66262 52487 57229 64173 63257 40617 44193 39559
8157 39559 37309 29723 9956 -25916 -37015 -12763 4316 9212 31119 26910 11928 79 -9377
8144 -9377 -12670 -37128 -55079 -47271 -37006 -25130 -21384 -34257 -27034 -42244 -61689 -35196 -23495
8131 -23495 -36142 -39007 -27401 -14962 29746 37598 11967 9702 47123 37416 12639 34906 39792
8118C9792l2886l1881n512J135o507k7467O996K1865K889n351j4940K2900N904
8105b3063j107M6859J9873m1608k2743l6850j2953J5367Q180K7376k5352J6493
8093b9528K3680J3761n142m7188m9806j0397R395L906P148p812K2970N4889L5494
8080B1370l7494n3798J8698J9190N0046M2804l8552k0181r722J6505k5582k3147
8068c9863Q503j0527k923k02M5843J0453j9473K0699j3166l2184L7852O3983j0573
8055E8422k3010p8345m7020J9213R045O903L0683L434j5235j5268l9136P75J0611
8042g8928J4106K2835K5470k6181R169J7678k4050p912R878N082j8710J3833p545
8029d5275j0951m526J6763N7864J1090j9717k2715j315k0455P445J0011J0102
$$ plain form
8118 39792 6906 -24975 -30487 -29352 -35859 -63326 -56330 -34465 -31576 -36927 -51867 -28967 -23063
8105 -23063 -24170 22689 42562 954 -21789 -58639 -71592 -56225 -48045 -20669 -46021 -29528
8093 -29528 -5848 7913 2771 -44417 -94223 -104620 -95225 -91319 -84171 -91983 -69013 -14124 21370
8080 21370 -16124 -69922 -51224 -32034 18012 60816 22264 2083 -7639 8866 -16716 -39863
8068 -39863 -31360 -41887 -44810 -45012 831 11284 -8189 12510 -656 -32840 5012 68995 58422
8055 58422 35412 -42933 -89953 -70740 -61695 -54792 -24109 -20675 -35910 -51178 -90314 -89539 -78928
8042 -78928 -64822 -41987 -16517 -42698 -33529 -15851 -39901 -47813 -37935 -32853 -51563 -37730 -45275
8029 -45275 -56226 -60752 -43989 13875 24965 5248 -17467 -18782 -39237 -31792 -21781 -11679
8017a1679n683m888j627L9638j360j6564r278n099Q749J9777K9670M313k8577
8004A7392j2530J5436k4769j6981J2064j075P43J6081J3551K8649J5524n1103
7992A2982m9056l0158L720Q650K2871j9125M4314L5527M3610p571l4026K8504
7980F0242p04k6108j6360O737M434q581j2159O165n460p820k2350O70j3561o641
7966d1496J398l551N884K2689K9600N3195P849j4000o329k173j2458j6617k9122
7953e131j5095J5483K5990l254k2636k0721R037J7851Q563j1105M2489J0264q223
7940D3512j4834j6423J7359K5241q359l2743j5107J1183K1627J2901j4514m7238
7928a7395k433N5486j1336j9699k0675J4516K134j852L5376j4532n315R530k2020
$$ plain form
8017 -11679 -17362 -22250 -23877 15761 14401 -2163 -11441 -16540 -7791 11986 41656 45969 17392
8004 17392 4862 20298 -4471 -21452 -9388 -10463 -9720 6361 19912 48561 64085 12982
7992 12982 -36074 -66232 -62512 -53862 -30991 -50116 -5802 29725 73335 65764 31738 60242
7980 60242 59538 33430 17070 23807 28241 19660 7501 13666 8206 386 -21964 -21294 -34855 -41496
7966 -41496 -40098 -43649 -37765 -15076 14524 67719 75568 61568 55239 53066 40608 23991 -5131
7953 -5131 -20226 -4743 21247 17993 -4643 -25364 -16327 1524 10087 -1018 41471 51735 43512
7940 43512 28678 12255 29614 54855 46496 13753 -1354 9829 31456 44357 29843 -17395
7928 -17395 -19828 35658 24322 4623 -16052 -1536 598 -1254 34122 19590 14275 23805 1785
7915A785j2203j1032L9153K9182j244l0568k0577k1983l0371J4719J4847K218
7903b6074J4508L1167j3781J5647k0041j3026j5560J2687L429N925L9056K1505
7891E5442m4181n4006L192K6405K6080J2630M386k0063p893L253l225l777J8203
7878A6446k2001l7011j1438M760L8141M6305o585m2149k2369J8728N3947j798
7866C4976k0256m0425j7778J7393K1678j1842j8346N005j1725k0377J9873R931
7854c1893N718k8339L108J065M2318M6955j801l407k6532l3004l9797L8163J6039
7841a1407R777Q119j5791k4223M302J0971k1320K3301K6150M2267L1030r603l3842
7828C9731k9936j452J87J0367n429j1389J1023J3971O719M469q297m5119j7546
$$ plain form
7915 1785 -10418 -21450 17703 46885 45641 15073 -5504 -27487 -57858 -43139 -28292 -26074
7903 -26074 -11566 19601 5820 21467 1426 -11600 -27160 -14473 -11044 -5119 33937 55442
7891 55442 11261 -42745 -39553 -13148 12932 25562 29948 9885 1992 5245 2020 -1757 16446
7878 16446 -5555 -42566 -54004 -49244 -11103 35202 28617 -13532 -35901 -17173 36774 34976
7866 34976 14720 -25705 -43483 -26090 -4412 -16254 -34600 -29595 -41320 -61697 -41824 -31893
7854 -31893 -26175 -54514 -51406 -50341 -8023 38932 37131 33724 7192 -25812 -65609 -27446 -11407
7841 -11407 -1630 6489 -9302 -33525 -29223 -18252 -39572 -16271 9879 52146 83176 73573 39731
7828 39731 9795 8343 8530 18897 13468 2079 13102 27073 33792 38261 29964 -15155 -32701
7815c2701J4174Q509j9968k007k302j930O797N178J8985K4496L6478j1952r664
7802C4093j3414k5929K1521J3083j0702m547J3805j9550m2332K298J0756M909
7790a6009O151m799J7762J8256k4945p53J2401K8156j136m0644P46J726l0725
7777c3813r38K1941P555k5002k6119L298K2403j6464R819J9427k745Q019L4948
7764B2329J3605n775l6383j6770K3256n3689k0091J6739O8484N2573K5436k2645
7752F7069l5144m0854K863K4423J8421j043o806m192K3958K951P085j7650n377
7739C5704j6962k4617j3586P719j3123l979j5084J8400M1873L1228j2157n8267
7727b2851k6015K0154L0047J9024l4680n9761k2887L1476M4370K877J129J7607
$$ plain form
7815 -32701 -18527 -10018 -29986 -31993 -34295 -36225 -29428 -24250 -5265 19231 55709 43757 34093
7802 34093 20679 -5250 16271 29354 18652 14105 27910 8360 -33972 -31674 -20918 -16009
7790 -16009 -9858 -14657 3105 21361 -3584 -4337 8064 36220 35084 -5560 -4814 -3088 -33813
7777 -33813 -34751 -12810 -5255 -30257 -56376 -53078 -30675 -47139 -37320 -17893 -20638 -12619 22329
7764 22329 35934 30159 -6224 -22994 262 -53427 -73518 -56779 11705 64278 89714 67069
7752 67069 31925 -8929 -6066 18357 36778 35735 28929 24737 48695 51646 58731 41081 35704
7739 35704 18742 -5875 -19461 -11742 -24865 -28844 -43928 -25528 16345 47573 35416 -22851
7727 -22851 -48866 -28712 1335 20359 -14321 -74082 -96969 -65493 -21123 -18246 -17117 490
7715D90l1740j1292R699K2938N346j6636l722M868O503m921o946K8357j0009q672
7701a5737J9224j8081l1813J6673L3748K5723M0710R019k9000m6692j3484K1632
7689A1922K4710k0510p38J8120K152k7774j4476m525L825R341L246k5378K3373
7676C288J8367L053k3617j875K3290j4661K293N812N064Q533m431k535l284j5992
7662C305o421m278P450K422k3038j0328J2737k11J7056N555n465k8764o755N16
7648c6219Q932J7947M4993l576j7140j4173k9213r850J4297J5787k0266l0958
7636e9439L868L300J9172L2329R119k4118l6539K2417J5607K0967j562j5019j6180
7623b6078p371J7683L5255k1439R818L8812P933j729K4886K2610l6581m1895O938
$$ plain form
7715 490 -31250 -42542 -32843 -9905 -4559 -21195 -24917 -20049 -13546 -18467 -25413 2944 -7065 -15737
7701 -15737 3487 -14594 -46407 -29734 4014 29737 70447 79466 50466 3774 -9710 11922
7689 11922 36632 16122 15384 33504 35656 7882 -6594 -11119 -7294 2047 5293 -20085 3288
7676 3288 21655 24708 1091 -784 22506 7845 10138 15950 21014 29547 25116 22581 19297 3305
7662 3305 -3116 -7394 56 2478 -20560 -30888 -18151 -18362 -1306 4249 -1216 -29980 -36735 -36219
7648 -36219 -27287 -9340 35653 32077 14937 764 -28449 -38299 -24002 -8215 -28481 -59439
7636 -59439 -55571 -52271 -33099 -770 8349 -15769 -52308 -29891 -14284 6683 5121 -9898 -26078
7623 -26078 -33449 -15766 19489 -1950 7868 46680 54613 52884 77770 100380 63799 21904 28842
7610B8842K4173k0626n9818O5679R022k4186m8014m116L4026K4582J7963m269
7598D3258l4457J3299O348m3547l15j2761k134j3709l2341K9557L2953m196J555
7585a6490L929l103K1504j3713K018L100j8977L2520k7293k5485n755o510L4863
7572a9392K6861k5012j6270J5403J1675L2423j0069j2372J932K1325J050j1809
7560A5745k3070r82J4378L3628K5845k0289k6719j8025P789m237L364N474r980
7547B921l5449P726o998j1296j1437J8497L0822K9074l704l6979j6725J2294K5089
7534C835K065J1151j5465j7782P956j9756p315O25J3174p287q042j5086P099M2836
7520a992K5552m1260l4243Q470M363J3916J9254L796K0858m104J5328K4077N053
$$ plain form
7610 28842 53015 32389 -27429 38250 47272 23086 -24928 -29044 4982 29564 47527 43258
7598 43258 8801 22100 28448 -15099 -15414 -28175 -30309 -44018 -76359 -46802 -13849 -18045 -16490
7585 -16490 -12561 -15664 5840 -7873 -5855 -2755 -21732 10788 -16505 -41990 -47745 -54255 -19392
7572 -19392 7469 -17543 -33813 -18410 -6735 25688 15619 3247 5179 26504 27554 15745
7560 15745 -7325 -8307 6071 39699 65544 45255 18536 511 8300 4063 7427 12901 2921
7547 2921 -32528 -24802 -31800 -43096 -54533 -36036 -5214 23860 20156 -16823 -33548 -21254 3835
7534 3835 5900 17051 1586 -16196 -8240 -27996 -35311 -34686 -21512 -28799 -36841 -51927 -44828 -1992
7520 -1992 23560 -17700 -51943 -43473 -39110 -25194 -5940 -2144 18714 14610 29938 54015 59068
7507E9068N685l1376n9447j8016K203p344j3847l5297P033L4477L0063K562j1061
7494c5297J9692R879k5772l988K0050K5116J52K3643r14j0633Q223j5883q800
7481E468q151j699j2112R966O440r961M760J794K0695N5983k422j7426j6113J0073
7467D7295L0701j7708j7498L072L4456N94l3975j9400j7379j7018K3682K4464
7455D1286l6373l3541k4598K0585K6283k3181K8284J2625J164J2511k7987j9100
7443b2042r724j9716J1803J3245J9786L2101K4963j4571l0117o916K3623L0454
7431E2889j5419n839q485j7799j1718j6572l8690J3457m654J6248J9195J9198
7419A811J7348p712k6021n776J3114R516Q560j399q617J7366m9617n0061M200
$$ plain form
7507 59068 64753 33377 -26070 -44086 -41883 -49227 -63074 -98371 -91338 -56861 -26798 -24236 -35297
7494 -35297 -15605 -5726 -31498 -35486 -15436 9680 9832 33475 32561 21928 30151 14268 5468
7481 5468 -2683 -4382 -16494 -6528 -88 -10049 -5289 -3495 17200 73183 70761 53335 37222 47295
7467 47295 77996 60288 42790 45862 80318 80912 46937 27537 10158 -6860 16822 41286
7455 41286 4913 -28628 -53226 -32641 -6358 -29539 -1255 11370 12534 25045 -2942 -22042
7443 -22042 -31766 -51482 -39679 -26434 -6648 25453 50416 35845 5728 -1188 22435 52889
7431 52889 37470 31631 23146 5347 -6371 -22943 -61633 -48176 -52830 -36582 -17387 1811
7419 1811 19159 11447 -14574 -20350 -7236 2280 10840 9441 824 18190 -31427 -81488 -77288
7406g7288L3483M003j2309J6681K6657L9203P560k1751L672K4649j1706k904R197
7393C9147q950j5149l5467O158L1941K2247r972j5685R010k562r887k2289l3653
7380d5111J1026K3546L4250p091j8955l5330j9686J1347L1683o304J3848m040
7368a0817M683k267j4402q77J0660J9285q847n463k1695L589j3268k359L7061
7355d717L7858K491j6421l9501J9232K1604L573k7962j9151p149r227K3442k6886
7342d2814j1657K6958M520J7584L707k5940n2690R352M5734L0157L1773L0171
7330F6855N935Q507j3376k3349l6017O606j1783j6674O671m2246k3583M6383M5212
7317A9141m465o558j4964j5985L3920M1027K5012j8605k7275j5659k9746J4210
$$ plain form
7406 -77288 -43805 -39802 -52111 -35430 -8773 30430 37990 16239 19911 44560 32854 29950 39147
7393 39147 30197 15048 -20419 -14261 17680 39927 29955 14270 23280 20718 10831 -11458 -45111
7380 -45111 -34085 -10539 23711 16620 -2335 -37665 -57351 -46004 -14321 -20625 -6777 -10817
7368 -10817 -6134 -8401 -22803 -23680 -13020 6265 -2582 -8045 -29740 -26151 -39419 -41778 -4717
7355 -4717 33141 35632 19211 -20290 -1058 20546 24119 -3843 -22994 -30143 -39370 -15928 -42814
7342 -42814 -54471 -27513 -22993 -5409 -1702 -27642 -80332 -70980 -25246 4911 36684 66855
7330 66855 72790 81297 67921 44572 8555 15161 3378 -13296 -6625 -48871 -72454 -26071 19141
7317 19141 14676 8118 -6846 -22831 11089 52116 77128 58523 31248 15589 -14157 53
7305E3J1433r822K3287j5831j3946Q699j9796O730J0986J0758K650p638j200k0275
7291a3912q809N848j41j7553r304P136J9626q649p748K5291J8507j9400j3555
7278b2663Q775M487l673j7902J1503O697j9251q842K2466J5461J8662j1948k6665
7265b2893j0233N726K0131J5565k3204j5847l206J6174P757J1765J0959P795M640
7252B5129k0449O437k0056k6318M1928J3400k6428M453L6217K958j8772k263o881
7239I355l490K354m813K68J834m036k1294k3341l789M0234J5324l7395k0506j35
7225d9430J2535K711k0993k3297J8922M9277M2742n525m1660k0335p456M4303
7213A794N5496R903q202j2285P585k281j0852N827J5866l4145M954J6472j1455
$$ plain form
7305 53 11486 1664 24951 9120 -4826 3873 -15923 -9193 1793 12551 15201 7563 6363 -13912
7291 -13912 -22721 -16873 -17014 -34567 -43871 -36735 -17109 -25758 -33506 -8215 10292 -9108 -22663
7278 -22663 -13888 -9401 -13074 -30976 -19473 -12776 -32027 -40869 -18403 -2942 15720 3772 -22893
7265 -22893 -33126 -27400 -7269 8296 -14908 -30755 -33961 -17787 -10030 1735 12694 20489 25129
7252 25129 4680 11117 -8939 -35257 6671 20071 -6357 -1904 34313 37271 18499 16236 9355
7239 9355 5865 8219 3406 3674 5508 1472 -19822 -43163 -46952 -6718 8606 -28789 -49295 -49430
7225 -49430 -36895 -34184 -55177 -78474 -59552 -10275 32467 26942 -14718 -35053 -42509 1794
7213 1794 57290 67193 58991 46706 54291 52010 41158 46985 62851 28706 33660 50132 38677
7200C8677j8510K8115j0422Q07j3439j3664R169l3139J3619J8334J1225K143k4020
7187H895P004q730m0446r786J2258K1091m392o828L191j0537O112J6451r973l3098
7173d8788k514J11J4179M698J8203j7819l4853J0299K3480J4767K7125j2736j4541
7160a8389K9812q46k7716Q23q58l832k7736l914P484R694J5018J3670K6065j4892
7146D383P473o794J6977O83m0423J3362n60n880O968J2310q585k5817m1659K932
7132f4630K7654K5755K0017m802k1271k7110m5614P293N0549K0437K4680K3146
7120C6104N276k4222J2N190q551j0705k7440l907l442p545m901L7105j115j0101
7106a8242j1684J493N683j9897K426K1057j4474m092k282j3647m656K7981K2078
$$ plain form
7200 38677 20167 48282 37860 38667 25228 11564 20733 -12406 1213 19547 30772 32915 8895
7187 8895 15899 7169 -33277 -43063 -30805 -9714 -14106 -20934 -17743 -28280 -22168 -5717 -15690 -48788
7173 -48788 -51302 -51191 -37012 -32314 -14111 -31930 -66783 -56484 -33004 -18237 8888 -3848 -18389
7160 -18389 11423 10577 -17139 -16316 -17174 -21006 -48742 -52656 -45172 -35478 -20460 -6790 19275 4383
7146 4383 11856 5062 22039 22722 -17701 -4339 -4899 -10779 -3811 8499 -86 -25903 -67562 -64630
7132 -64630 -36976 -11221 8796 3994 -17277 -44387 -90001 -82708 -32159 -11722 12958 36104
7120 36104 41380 17158 17170 22360 13809 3104 -24336 -28243 -31685 -39230 -44131 -7026 -8141 -18242
7106 -18242 -29926 -28433 -22750 -42647 -40221 -19164 -33638 -37730 -40012 -53659 -58315 -30334 -8256
7093h256j2268k6344J6578J6277K4429J2455k1531K3883j295p15J707n323k3847
7080d250m4183k6227o814l205J4681M3601J3250J0816m446k7261p58M12l7488
7067g1872Q533L1005J4212k686j2093q400k4330K7301L0087R936q654l95k7931
7054c5287n333M770K8668k5783k1986r160q025J508L9203L4024K598k0504j1614
7041b6921j0648J5461L5686K8053J3984l739K0111k3999l5447J8684r520J1987
7029C3692K884n8710n513J5089K1315K9783k1457O04l9573j3161L29j2060j0531
7016e7309J8932J3082L015K6879J9330k7408K809K8397J65J3449P484m9134l2695
7003c3004N84M1194J104O510J0825J4300J2385o1055k5464r962m774R387J3015
$$ plain form
7093 -8256 -20524 -46868 -30290 -14013 10416 22871 1340 25223 23928 23213 24920 19597 -4250
7080 -4250 -48433 -74660 -81474 -84679 -69998 -26397 -13147 -2331 -6777 -34038 -34796 -34384 -71872
7067 -71872 -63339 -32334 -18122 -20808 -32901 -41301 -65631 -38330 -8243 1693 -6961 -7356 -35287
7054 -35287 -40620 -35850 -7182 -32965 -54951 -64111 -72136 -70628 -31425 2599 5197 -15307 -26921
7041 -26921 -37569 -22108 13578 41631 55615 51876 71987 47988 12541 31225 21705 33692
7029 33692 36576 -22134 -27647 -12558 8757 38540 17083 17687 -21886 -35047 -34718 -46778 -57309
7016 -57309 -38377 -25295 -22280 4599 23929 -3479 -670 27727 27892 41341 48825 -309 -33004
7003 -33004 -32420 8774 9878 16388 27213 41513 53898 -7157 -32621 -42583 -47357 -37970 -24955
6990b4955M325j5233J0312J3344J735J4205Q331m1486R380M2128K0355j887j0882
6977B9672m330q313j7977M436K1331j1466k2910L3727J6270j1772p940L2975K1082
6964G4785m8918j3839l6723j9195L340O05J5919Q19K4454o137n41L2254K3257
6951E0080J6601l138q557j2908k2775J1484R168l9040j2031K3952K826O609j1298
6938A0973R294M1672Q226k0804j8266k9454j0041q618J2627J5915r903k3021k860
6925b4260r941J0595K38O280r081J4181M593j1066P846o928O956J5878n871L5681
6911C5101L2057k2606m1891l30N939l961k4354J594K0446N76j7656M815J6401
6898F131J2102m02L9650Q734n2317l1055J0185K1720j3703M937J0051r197j9867
$$ plain form
6990 -24955 -20630 -35863 -25551 -12207 -10472 3733 12064 -29422 -20042 22086 42441 40554 29672
6977 29672 25342 17029 -948 3488 24819 13353 -9557 24170 40440 28668 20728 53703 74785
6964 74785 25867 12028 -24695 -43890 -40550 -39945 -24026 -23207 1247 -4890 -5431 26823 50080
6951 50080 66681 63543 54986 42078 19303 30787 39955 915 -11116 12836 15662 22271 10973
6938 10973 20267 61939 70165 49361 31095 1641 -8400 -17018 -4391 11524 1621 -21400 -24260
6925 -24260 -34201 -23606 -23368 -17088 -26169 -11988 -7395 -18461 -10615 -17543 -10587 5291 -580 35101
6911 35101 67158 44552 2661 2331 8270 4309 -20045 -18451 1995 2571 -15085 -10270 6131
6898 6131 18233 17831 57481 66215 13898 -17157 -6972 14748 1045 5982 16033 6836 -13031
6885a3031J1937J2263j0561j5277O418K4071J3598k6126j6414k4632J9966M2766
6873B4978J6114j1381k4481L8699J8059j3589l3248k3313j5415l4742k0274k720
6861h1313J6533J5752L3622J2047m403j2656J0553J8027J4893R800j4121k9224
6849a0490r415k275k5243k6869K6811j5662n190K9189p008M2033j4810k6462n940
6836e1331k2024m122M6659L6999k9094N26M5372j9569m487K4288j3521k5992l487
6823a9783L02k224k1762M320j2591J6292K098J4468k9735N72J2608J3869R573
6810a1993J7063O210l8541p242L8439J4953K868j5199q9J519J0441p765j9010
6797h346l425m309J1830N597m1836m105L13k2045K3248J5892K8700J9143q079
$$ plain form
6885 -13031 -1094 11169 608 -14669 -8251 15820 29418 3292 -13122 -37754 -17788 24978
6873 24978 41092 29711 5230 43929 61988 48399 15151 -8162 -23577 -58319 -78593 -81313
6861 -81313 -64780 -49028 -15406 -3359 -7762 -20418 -9865 8162 23055 32855 18734 -10490
6849 -10490 -19905 -22180 -47423 -74292 -47481 -63143 -68333 -39144 -46152 -4119 -18929 -45391 -51331
6836 -51331 -73355 -77477 -30818 6181 -22913 -22387 22985 3416 -1071 23217 9696 -16296 -19783
6823 -19783 -19481 -21705 -43467 -39147 -51738 -35446 -33348 -18880 -48615 -48043 -35435 -21566 -11993
6810 -11993 5070 11280 -27261 -34503 3936 18889 21757 6558 6469 7988 18429 10664 -8346
6797 -8346 -11771 -16080 -4250 1347 -40489 -44594 -44281 -66326 -43078 -27186 1514 20657 12578
6784A2578k8964l4698l35K4093l617p281r694l0309K4471K7651J6151K8315j6698
6771A663l0590K970j4j6422K5707j9433k643k1729J4925N1555P703k706o988m773
6757g75j0883k6663J356J7945M092l6899P582L4558J0228J9430K344J3037m3582
6744h230K0828j1900n374j6100r407m691j4975m515O564m64n804N68J8812K9907
6730d781K1431q726j7344M293j9529J3769j5525O157N5253M1575J6348j9008n7908
6717A6005J2620p076l651M974R328O872K2366j8972j6166p107O759J7645k3901
6704A9696k4357l569j5943Q36M3894j8557l4710O133p334j3687l882K8916M735
6691a7829J2205o068l7089j7624k3190l964K2638L1736P966J1232K7679l9714
$$ plain form
6784 12578 -16386 -51084 -51419 -27326 -30943 -38224 -47918 -78227 -53756 -26105 -9954 18361 1663
6771 1663 -28927 -25957 -25971 -42393 -16686 -36119 -38762 -60491 -45566 5989 13692 10986 3998 -775
6757 -775 -11658 -38321 -36965 -19020 -14928 -51827 -44245 -9687 541 19971 22315 35352 -8230
6744 -8230 12598 698 -4676 -20776 -30183 -34874 -49849 -54364 -47800 -48264 -54068 -53500 -34688 -4781
6730 -4781 16650 7924 -9420 -5127 -24656 -10887 -26412 -20255 34998 76573 92921 73913 16005
6717 16005 28625 21549 17898 22872 32200 39072 61438 42466 26300 19193 25952 43597 19696
6704 19696 -4661 -8230 -24173 -23337 20557 2000 -32710 -26577 -33911 -47598 -51480 -22564 -17829
6691 -17829 -5624 -11692 -48781 -66405 -89595 -93559 -70921 -39185 -31219 -19987 7692 -32022
6679c2022R930n973M0479Q125k4380j1623J0417K2517n4029j7338j0704j4688
6667g9289K1401K1832K7851o937L0289P458r802k2252m5m714O156L546o150k5576
6653c6232L4099J3655J7624K191j0762j7479j6435l9809R329O123j4533J8585
6641c3644R195o112K1394r170j9841J5603l7967j3205J61N4510P946k065J2953
6628b42K639L2278o125k8200k6512m846L7383N2837k768k7455k3204j3886K3457
6615A5356J7250K6840k1809l5280j8701L68q836q836N2260O0819R864m8388n3521
6602a2614R036R847n676J2987n768j761k6665P598K8651J241k0963j55j3654l3377
6588e1273N878j5863L4350L1476k5059j8166Q095p577L635O250R626J6105r359
$$ plain form
6679 -32022 -22092 -28065 12414 20539 -3841 -15464 -5047 17470 -36559 -53897 -64601 -79289
6667 -79289 -57888 -36056 -8205 -15142 15147 22605 12803 -9449 -9494 -14208 -8052 -4506 -10656 -36232
6653 -36232 -2133 11522 29146 31337 20575 3096 -13339 -53148 -43819 -37696 -52229 -33644
6641 -33644 -24449 -30561 -9167 -18337 -38178 -22575 -60542 -73747 -73586 -19076 -11130 -13195 -242
6628 -242 2397 34675 28550 350 -26162 -31008 6375 59212 56444 28989 5785 -8101 15356
6615 15356 32606 59446 37637 2357 -16344 -15976 -24812 -33648 18612 79431 89295 40907 -12614
6602 -12614 -3578 6269 593 13580 7812 6051 -20614 -13016 15635 16876 -4087 -4242 -17896 -51273
6588 -51273 -45395 -61258 -26908 4568 -20491 -38657 -30562 -38139 -34504 -28254 -18628 -2523 -11882
6575a1882j3839p526M277L796l87r126J4901L3061N787J1695R746l293J8177q382
6561D7005r875j15J903J1939k439k3339k538R921k5758L8445K0318k3724j092
6548D0651N559k1029J3355P05j1059j8027k8033l2285j7799K375L3469N66m585
6535c6137K744L9667K5273k813j8869j1104Q274M625j3050k1130N369K8652J2953
6522B4454J2611n2256j6624J0176L0412K8075j2706k8931j8316J0562k1165k807
6510c6515J227j2087K9225L053r777q358J478K8248J4042k275M2013L7330l2479
6497E5125r871k1199N755J4784j9532P704K552l1083j1918K6172N869m9115q878
6484c3635L8344J9927M026O12k9162l6439k637J6047K0732K4162j012j5909n713
$$ plain form
6575 -11882 -25721 -33247 -28970 -25174 -25561 -34687 -19786 13275 19062 30757 40503 37210 55387 47005
6561 47005 37130 37015 38918 50857 48418 25079 22541 32462 6704 45149 65467 41743 40651
6548 40651 46210 25181 38536 39241 28182 10155 -17878 -50163 -67962 -65587 -32118 -31552 -36137
6535 -36137 -33393 6274 31547 28734 9865 -1239 7035 11660 -1390 -22520 -17151 11501 24454
6522 24454 37065 -15191 -31815 -21639 8773 36848 24142 -4789 -23105 -12543 -33708 -36515
6510 -36515 -35288 -47375 -18150 -15097 -24874 -33232 -31754 -3506 10536 8261 50274 87604 55125
6497 55125 45254 24055 29810 44594 25062 32766 35318 4235 -7683 18489 24358 -24757 -33635
6484 -33635 4709 24636 28662 29274 112 -36327 -38964 -22917 -2185 21977 20965 5056 -657
6471f57q928K1250K1916j1556j9193J3252j4206J6034L4250K827n527j6472O552
6458C9542j1411l258m375J5986J9008R75l4860l4465K66k0690l1335J2324M475
6445d7818K6439J2737J0325o338j5329k1198L71M3025K9990N211k8550j2753O635
6432B747m4326n683L7354M1309k0444l5340j4614L219j6394k2472K5240L5799
6420a3605O185j2057K1647l762k8699j2577L9262p369m936k4994J7682K2652N283
6407D712J6459J9395J4440m6509j7481M152j0371j5024J711J6413K4855Q166J2956
6394C3874J5269J620k8290k9045K6759j3802j4129L9922J0262k4796l1454j631
6382a5441J943j9215k9619k3148J0899J9465K6627K7086P754J4509J2951k048
$$ plain form
6471 -657 -9585 11665 33581 22025 2832 16084 1878 17912 52162 54989 49462 32990 39542
6458 39542 28131 24873 20498 36484 55492 56467 21607 -12858 -12592 -33282 -64617 -52293 -47818
6445 -47818 -21379 -8642 1683 -4655 -19984 -41182 -40811 2214 32204 37415 8865 -3888 2747
6432 2747 -41579 -47262 -9908 31401 10957 -24383 -38997 -35778 -52172 -74644 -49404 -13605
6420 -13605 -7420 -19477 2170 -1592 -30291 -42868 -3606 -10975 -15911 -40905 -23223 -571 4712
6407 4712 21171 40566 55006 8497 -8984 -4832 -15203 -30227 -28516 -12103 12752 20918 33874
6394 33874 49143 50763 22473 -6572 20187 6385 -7744 32178 42440 17644 -13810 -15441
6382 -15441 -13498 -32713 -62332 -85480 -74581 -55116 -28489 -1403 6351 20860 33811 31763
6370C1763M740L55m0413K771j3255j2527r834J9381L4147q387n6981j8412N2598
6357a4054K6272r638r667k778J365J4115m3950J0534O905l3036j228J8916j1491
6344d7735R526N218k4624Q380K9272J835j7937J8560N905n773J8789l8950k8227
6331f5761K9680j2212m1942o776J2756K5560M2407l368Q381J9076K3344Q883k8910
6318A1118l0647j7638j9736M3572J9976L255Q745K7660j6099l3203o549n923k8380
6305d3849P267K5668k977J0439K8928k1k4053m2474J4855J8687j7861k4231k7085
6292g6707J7033K0036J6607L0066L0140L3026m1942j4263j1032k6684m601P563
6280b0758K0818k1123K0158J5376O222m408n1321j1183M2417L6872N454j3764
$$ plain form
6370 31763 36503 36858 -3555 -784 -14039 -26566 -36400 -17019 17128 8741 -48240 -66652 -14054
6357 -14054 12218 2580 -7087 -9865 -8500 5615 -38335 -27801 -20896 -53932 -55160 -36244 -47735
6344 -47735 -38209 -32991 -57615 -49235 -19963 -18128 -36065 -17505 -11600 -17373 1416 -37534 -65761
6331 -65761 -36081 -48293 -90235 -97011 -84255 -58695 -16288 -19656 -11275 7801 31145 40028 11118
6318 11118 -19529 -37167 -56903 -13331 6645 9900 18645 46305 30206 -2997 -9546 -15469 -43849
6305 -43849 -36582 -10914 -13891 -3452 25476 25455 1402 -41072 -26217 -7530 -25391 -49622 -76707
6292 -76707 -59674 -39638 -23031 7035 37175 70201 28259 13996 2964 -23720 -28321 -20758
6280 -20758 60 -21063 -905 14471 20693 16285 -35036 -46219 -3802 33070 38524 24760
6268B4760J4779R433q774j7245K2796J0726k7536k8997P598l851k0200j943j101
6255a9555K8716j441n925j3473O370J1136j6771j6962O676O20k2085K2079J3197
6242g418p561M7837J5551j3580j3903L69m3091l8234K0153N8977J4036l2596n1448
6229e0908j6431Q077J5356q332j638J1686K0184K0568J9097J9667K5741q858q153
6216D6056p591l0395k7652J0876Q752q440k2821j6166l553J2282M6444m897J1772
6203A4667j7475m4040j4577J1293K3501J5860k5983J9165K5600p238P180K4636
6191C2589j0933l0029M2924J675J0772L0863n1036n4082k046k955K4860K6437
6179A9039J258J2393K005o331j6690k2834J504J012J219o935m281J0083J1900
$$ plain form
6268 24760 39539 48972 40198 22953 45749 56475 28939 -58 7540 3689 -16511 -18454 -19555
6255 -19555 9161 7720 1795 -11678 -5308 5828 -10943 -27905 -21229 -20609 -42694 -20615 -7418
6242 -7418 -14979 32858 48409 34829 20926 21295 -21796 -60030 -39877 19100 33136 540 -50908
6229 -50908 -67339 -59262 -43906 -52238 -53876 -42190 -22006 -1438 17659 37326 63067 54209 46056
6216 46056 38465 8070 -19582 -8706 46 -8394 -31215 -47381 -50934 -38652 7792 2895 14667
6203 14667 -2808 -46848 -61425 -50132 -26631 -10771 -36754 -17589 8011 773 7953 32589
6191 32589 21656 -8373 34551 36226 46998 77861 26825 -27257 -29303 -32258 -7398 19039
6179 19039 20297 32690 34695 28364 11674 -11160 -9656 -8644 -7425 -14360 -18641 -8558 3342
6166C342M584J0077J1328k4505o702J2859K3947J0395l0644o789M7570o092k5368
6153B4002k2766l9004m477K0325k873K3957L732k479Q876k3279O542L2923K010
6140B7489j9496J0533m0628l4161k099k8440K0181K2397K9309J9506L4229l218
6128C5602l24j9750j723l6022o883M5976n416l1200j8829O999J2231M182j3530
6115b8687J2964J6465K2200k0333j5922k9518l0733L3672O0325j3243j7924p049
6103a7783Q968J4703J5200k5030j2352j5992J7087R226K2932K2041q34n420l3479
6090g33m0099j970j7229l117j3283J8370K8435k516J3403J2833k4804j3257J131
6077d2836Q821Q347J4505N617j1640k703o997K15K9230L2383P818j1263N663j1440
$$ plain form
6166 3342 7926 18003 29331 4826 -1876 10983 34930 45325 14681 7892 55462 49370 24002
6153 24002 1236 -37768 -42245 -21920 -24793 -836 2896 417 9293 -13986 -7444 25479 27489
6140 27489 7993 18526 -22102 -56263 -58362 -86802 -66621 -44224 -14915 4591 38820 35602
6128 35602 35278 15528 13805 -22217 -29100 16876 11460 -19740 -38569 -31570 -19339 -15157 -28687
6115 -28687 -15723 742 22942 2609 -13313 -42831 -73564 -39892 20433 7190 -10734 -17783
6103 -17783 -8815 5888 21088 -3942 -16294 -32286 -15199 -5973 16959 39000 38166 32746 -733
6090 -733 -40832 -42802 -60031 -63148 -76431 -58061 -29626 -32142 -18739 -5906 -30710 -43967 -42836
6077 -42836 -34015 -25668 -11163 -5546 -17186 -19889 -26886 -26671 2559 34942 42760 31497 37160 25720
6063B5720L094m793K700J272L0753r818l3703J0293J8543Q037n831k09L575o621
6049D3012K994O221l8200l7924N652M0246J5375n3124m9539q294L5788K0325J1514
6036e954N439k2015Q570k851j8396K3954j00j5873n704J1835j4465J0727p949
6023c2782M909r893l8093M454L6620O304Q192j3898l5637j2440M9978L0613q483
6010a0156k95n787M438R847K606J0813l47n065J55j1525j4464J2453J5583j5243
5996f987K966O008J5520K2809J087n63k5692j3775k4994J1897o609k0956j4282
5983e3571M2369M0268K5010K5130p159O789j5977J2253j9182k3103k1665l0788
5971a9626k2318K4828K9426J0017m111J407J6028k1240m87l0115n644k3114j0429
$$ plain form
6063 25720 28814 24021 26721 27993 58746 48928 15225 25518 44061 52098 46267 46058 49633 43012
6049 43012 46006 52227 14027 -23897 -18245 22001 37376 -15748 -65287 -73581 -37793 -17468 -5954
6036 -5954 -515 -22530 -13960 -16811 -35207 -11253 -11353 -27226 -32930 -21095 -35560 -24833 -32782
6023 -32782 -27873 -37766 -75859 -71405 -34785 -28481 -20289 -34187 -69824 -82264 -32286 -1673 -10156
6010 -10156 -10451 -16238 -11800 -1953 653 11466 11119 6054 6209 -5316 -19780 -7327 8256 -6987
5996 -6987 -4021 1987 17507 40316 41403 40840 15148 1373 -23621 -11724 -18333 -39289 -53571
5983 -53571 -11202 29066 54076 79206 72047 78836 62859 75112 55930 32827 11162 -19626
5971 -19626 -41944 -17116 12310 22327 18216 19623 35651 14411 13924 -16191 -21835 -44949 -55378
5958e5378O0648N3756J286l0106l2367n819J502K3117J7881n689L855j4836j6154
5945A696J4603m430j4863o5022l3309M0992O5354P289l2790J656K9627q901n053
5932c151J389n3578j4648K8209J8048n30J0557J2310o601J3655r539k880k0326
5919b7085J7134K4081R101k334J5451q637m960k1413K480m526k602J3705j7247
5906f852o783n703K6145j3234n620j4090k1836M2675P777j1073r728q43K360k466
5892a9271j5638m110L2393J7504O970r968J6146N4112K275k7977k5230k9787k3872
5879b6453j1482j6764L7935q486k1922M4200K0032J8366O300Q995k3948p684j9589
5866e00o676Q982K800k696l6882n1566k4560R326K2904L6655K3070J2427n737
$$ plain form
5958 -55378 5270 59026 60312 30206 -2161 -7980 -6478 16639 34520 28831 32686 17850 1696
5945 1696 16299 11869 -2994 -68016 -101325 -60333 5021 12310 -20480 -18824 10803 1902 -3151
5932 -3151 -1762 -55340 -69988 -41779 -23731 -24261 -13704 -1394 -7995 5660 -3879 -6759 -27085
5919 -27085 -9951 14130 23231 20897 36348 27711 22751 1338 3818 -708 -3310 10395 -6852
5906 -6852 -13635 -19338 6807 -6427 -12047 -26137 -47973 -5298 2479 -8594 -18322 -19165 -16805 -19271
5892 -19271 -34909 -39019 -6626 10878 17848 7880 24026 78138 80413 52436 27206 -2581 -26453
5879 -26453 -37935 -54699 -16764 -25250 -47172 -2972 17060 35426 41726 50721 26773 19089 -500
5866 -500 -7176 1806 4606 1910 -34972 -86538 -111098 -101772 -78868 -42213 -19143 -6716 -12453
5853a2453j9147j75J3761J5406j3491l5629j7738J7525K7168n159J9161L9925
5841B9154L9831K4135P298l5314j9861m4597j9359k982j8819R736K1654k2383
5829c1507J690k7219l855j5554K1017K7059o71l3961J2598L3921k0247q381M8740
5816C630L2352r903k1991o049M516K3307L0978o341o7568n0961J3979L8166L2944
5803A7059J3326P580q524J1504j6911k8864j6065j9190L316L0679o49j2223k6693
5790d5655N035j6012k4081O637K3630J3584K6531m918j6723k641J399n652K1488
5777a7378j663p693K0529O663l3866J3426J720j1852j3901k1805o099O096J3971
5764e1852K2618K6495J850k2607O152k124L3737n028J1879J2363q621K0663m76
$$ plain form
5853 -12453 -31600 -31775 -18014 -2608 -16099 -51728 -69466 -51941 -24773 -29932 -10771 29154
5841 29154 68985 93120 100418 65104 45243 646 -18713 -21695 -40514 -30778 -9124 -31507
5829 -31507 -29817 -57036 -60891 -76445 -55428 -28369 -29040 -63001 -50403 -16482 -36729 -45110 3630
5816 3630 35982 26079 4088 -1961 2555 25862 56840 50499 -17069 -68030 -54051 -15885 17059
5803 17059 30385 37965 29441 40945 24034 -4830 -20895 -40085 -36769 -6090 -6739 -18962 -45655
5790 -45655 -40620 -56632 -80713 -74076 -50446 -36862 -10331 -15249 -31972 -34613 -33214 -38866 -17378
5777 -17378 -19041 -26734 -6205 458 -33408 -19982 -18262 -30114 -44015 -65820 -71919 -65823 -51852
5764 -51852 -29234 -2739 -889 -23496 -17344 -19468 14269 9241 21120 33483 24862 45525 45049
5751D5049j5011j4470k1633l9295k0857J997K8236J2493l9441L0004J0109p507
5739c0326j9607j9641q970L3476K3937J0138K2305j7827j3646M347q519O911P429
5726i993J6141Q466j9736j1165M841P169l356j4948j7955J3033J6977K040J9626
5713A1140j2036k8881j2143J9469j1737j5236K4457p414M0174R401q813P746K8717
5700D4844J8245L5426l3307k3623k0365m978M575k7669n461j1086J4079j6051
5688b5371j4121O491j7533j9191M5576M0546J1518l9684m8528j126M0920K424
5676a8079j9606l0626J0801j2008Q890J8108L8011J2813r681j1245J9489Q594
5664A5461r252L703k7844n951o114K527J0347J0518J9884J3048k5004j5822j6519
$$ plain form
5751 45049 30038 15568 -6065 -45360 -66217 -64220 -35984 -23491 -62932 -32928 -22819 -30326
5739 -30326 -49933 -69574 -78544 -45068 -21131 -10993 11312 -6515 -20161 -15814 -24333 -17422 -9993
5726 -9993 6148 14614 -5122 -16287 -11446 -4277 -7633 -22581 -40536 -27503 -10526 -8486 11140
5713 11140 -896 -29777 -41920 -22451 -34188 -49424 -24967 -32381 7793 17194 8381 16127 44844
5700 44844 63089 98515 65208 41585 21220 16242 20817 -6852 -12313 -23399 -9320 -25371
5688 -25371 -39492 -33001 -50534 -69725 -24149 16397 27915 -11769 -60297 -61423 -20503 -18079
5676 -18079 -37685 -68311 -57510 -69518 -60628 -42520 -4509 8304 -1377 -12622 6867 15461
5664 15461 6209 9912 -17932 -23883 -29997 -27470 -17123 -6605 13279 26327 1323 -14499 -31018
5651c1018K9668J7977j0502m2641J1489J9012k7081j1084J9544K115K4172N677
5639G328k0111j4622K029k4445l8537J84L6572J1101J8282K3578j884j6167L089
5626a3603J9307j645P30j2503j8125N626j10l121J6999K2590j5241l625j0426
5613a3147j9607K7363J8421m5583J611L7241M87K3117J6977l5694p806Q249M8579
5600F0208P466l8936j4251l1823j9890m687K1503p90j9360j772J0573q584J8800
5587b1543L6349J9125J942L890Q954j8154j178k2977j0061k3951L19J6051K1391
5574A0157J942j882j8044j7905j4939k216k0967Q947J50J3478M3391K6552l0218
5561a554k7402o900K5477M6502O160m376K5340k3574l8622l1946k7197K7426P572
$$ plain form
5651 -31018 -1350 16627 6125 -36516 -25027 -6015 -33096 -44180 -24636 -22521 1651 7328
5639 7328 -12783 -27405 -25376 -49821 -88358 -88174 -51602 -40501 -22219 1359 -525 -16692 -13603
5626 -13603 5704 4059 4789 -7714 -25839 -20213 -20323 -23444 -6445 16145 904 -2721 -13147
5613 -13147 -32754 -5391 13030 -32553 -30942 6299 6786 29903 46880 11186 3380 11629 60208
5600 60208 67674 28738 14487 -17336 -37226 -41913 -20410 -21200 -40560 -42332 -31759 -40343 -21543
5587 -21543 14806 33931 35873 39763 48717 30563 29385 6408 -3653 -27604 -27285 -11234 10157
5574 10157 12099 10217 -7827 -25732 -40671 -42887 -63854 -54907 -54757 -41279 2112 28664 -1554
5561 -1554 -28956 -35856 -10379 36123 42283 37907 63247 39673 1051 -30895 -58092 -30666 -23094
5548b3094N721Q453o638p26M495J0779J5693j1730R352l659K1071J3794k1622
5535B1889j9468P846N775n503l580j0373J6558J672j0235M907J1579q511K6049
5522C8605J5520j9978k896q803n859k3613k1289j9316L102N636K8897L2680J835
5509B4521j7245K753j4214n620j3855l145L4677J0949j8627K1291K7888J0425
5497E9798l9135j406L066M4931L0938p473l2598m2934k7143K7424L4569L56j5027
5484C5366J1459J4216j4413l673j232k6305k6163O126j9520J819M2983j0571k8633
5471a8541l505k2985k0107N573M1236N3671L95m1704k4981P332P405n120K7393
5458F062J6098J2775L60m5910j682K1710O668J4070l5964r592j6882k2580M2511
$$ plain form
5548 -23094 -17373 -8920 -15558 -16284 -11789 -1010 14683 2953 12305 8646 29717 43511 21889
5535 21889 2421 10267 16042 10539 6959 -3414 13144 14816 4581 9488 21067 12556 38605
5522 38605 54125 34147 31251 22448 16589 -7024 -28313 -47629 -44527 -38891 -9994 22686 24521
5509 24521 7276 10029 -4185 -9805 -23660 -26805 7872 18821 194 21485 49373 59798
5497 59798 20663 19257 22323 67254 98192 90719 58121 15187 -11956 15468 50037 50393 35366
5484 35366 46825 61041 46628 42955 41723 15418 -10745 -4619 -24139 -22320 20663 10092 -18541
5471 -18541 -22046 -45031 -65138 -59565 -18329 35342 35737 -5967 -30948 -23616 -16211 -21331 6062
5458 6062 22160 34935 35295 -10615 -12297 9413 16081 30151 -5813 -15405 -32287 -54867 -12356
5445a2356k150J4870M1532r145N644j8845o983j2418J2350J4218K2612l5463O269
5432B0135l1829m5695J7298J5097j4564R362K2406N074k4243l0182j5117K6227
5420d6031K2034L2819j0152m4826l1061P246J953J4214J9501L1187l953j7093
5408b4162J5829K4207o588Q677m346l3991l3263K3269L407M025J5039K8894Q357
5395B9354l1939l2058J0285K4028J5086M2n799q293L580M0637J8106m080k6645
5382C2304k9656r19n331l9941q861K6061L7378L6005L145k6566k1108j6243l39
5369a4071O533l6462l3260N273K8436K2784N606Q800L4090j2838j9545J658L5771
5356C2775l687l6677r069J3579K9677K1546l0361n3391r808K6088L4137J8507
$$ plain form
5445 -12356 -14506 364 41896 32751 38395 19550 12567 149 12499 26717 49329 13866 20135
5432 20135 -11694 -57389 -40091 -24994 -39558 -30196 -7790 -2716 -26959 -57141 -72258 -46031
5420 -46031 -23997 8822 -1330 -46156 -77217 -69971 -68018 -53804 -34303 -3116 -7069 -24162
5408 -24162 -8333 15874 9286 17963 13617 -20374 -53637 -30368 -26961 -22936 -7897 20997 29354
5395 29354 -2585 -34643 -24358 -330 14756 14798 8999 706 4286 44923 63029 58949 32304
5382 32304 2648 1729 -3602 -43543 -52404 -26343 11035 47040 50185 23619 2511 -13732 -14071
5369 -14071 -7538 -44000 -77260 -71987 -43551 -20767 -15161 -6361 27729 14891 -4654 -2996 32775
5356 32775 29088 -7589 -16658 -3079 26598 48144 17783 -35608 -45416 -19328 14809 33316
5344C3316n971j8443o980K8968j632k1572l9511k7716J3718K7292M671O827j1321
5331a8354L3596j1230m1085j635J0458j1825K1807L6388j2694j5810j3693J8141
5319e936K0566k5586k3583k4914j465J1550L9238J778M445J2698j6018J9064J0878
5306B2715p397K1933K3174j0186L713l1720j5578r643K243m311k6150j3178K2270
5293b2115K9365q609R468J2101j6075J0682J3678k5488K2631k635j9784l7627
5281c4408n330J8819N1953L2281O912L554k0441q89J101r534l3958L22K202k5548
5267a2964l003j23k4158J9040m147J3921J6662l683J2254j3066k4750q76j1007
5254c5900j7989M395J2119J021l466K0913L3526L849Q9N601k8793p383j1442k4798
$$ plain form
5344 33316 27345 8902 1922 30890 29258 7686 -31825 -59541 -45823 -18531 -13860 -7033 -18354
5331 -18354 15242 4012 -37073 -38708 -28250 -40075 -18268 18120 5426 -10384 -24077 -5936
5319 -5936 14630 -10956 -34539 -59453 -60918 -49368 -10130 -8352 -3907 8791 -7227 11837 22715
5306 22715 15318 37251 60425 50239 53952 22232 6654 -2989 -746 -5057 -31207 -44385 -22115
5293 -22115 7250 -1359 8109 20210 4135 14817 28495 3007 25638 23003 3219 -34408
5281 -34408 -39738 -20919 31034 63315 70227 73781 53340 52451 53552 44018 10060 10382 12584 -12964
5267 -12964 -15967 -16090 -40248 -21208 -25355 -11434 5228 1545 13799 733 -24017 -24893 -35900
5254 -35900 -53889 -49494 -37375 -36354 -39820 -18907 14619 18468 18557 24158 -4635 -12018 -23460 -48258
5240d8258L8291k381j3892k6024L877K9649N713J395j952J2165J9972L089J8572
5227D0216J9190j4972k8165l6021K0998K9096j9727L773Q406j3612j5864o205
5215a2887m765q020k0772J2224K222O3531L0972j756m1371j58K6095n233L535
5202D3617k5082j9129N183Q411j0422j0951K412O565M0197N901m2907l3069K0627
5189h647L3197j045j7946j9043P571J919j054K688K4774L8982k940k0421j0309
5176B7726P283J2361k4341l2295M908L997p365p526QM831J4676j8905K518P973
5162d151M878m3649o147K1869J5753K0282J1528k2766r459Q97J693J0629J2577
5149A3934Q124J5287l1266l1158J5676L295k8476K4232M2464n97j8013j8334k9462
$$ plain form
5240 -48258 -9967 -12348 -26240 -52264 -48387 -18738 -13025 -11630 -13582 -1417 18555 21644 40216
5227 40216 59406 44434 16269 -19752 1246 30342 10615 14388 22794 9182 -6682 -12887
5215 -12887 -17652 -25672 -46444 -34220 -31998 31533 62505 60749 19378 19220 45315 40082 43617
5202 43617 18535 -594 4589 13000 2578 -8373 -5961 604 40801 46702 3795 -29274 -8647
5189 -8647 24550 23505 5559 -13484 -5913 -3994 -5048 -2360 22414 61396 58456 38035 27726
5176 27726 35009 47370 23029 -9266 -4358 -361 -7726 -15252 -15244 -10413 4263 -14642 -12124 -4151
5162 -4151 727 -42922 -49069 -27200 -11447 8835 20363 -2403 -11862 -10965 -9272 1357 13934
5149 13934 22058 37345 6079 -25079 -9403 -6108 -34584 -10352 32112 31515 13502 -4832 -34294
5136c4294k0812J3049L8364r844k8717m5555O344K9151J8470J9309N180j8893
5124b8248q232K5318J7700l3324j4535M680O4054K6032j6739k1336l2906k6342
5112d3878J4767K0121K8254J1707k4007J662o136j1731j4255j5178M5367J0548
5100A7241l4488q431J5670J1457k4999J4857K826J0219J368k7541m120L8210j3283
5087a014J9370J483k9433j4899L3741J829l0787k031N095k3538R034M427o231
5074c2954r598N376J0876N087J9769N73K4307J2697l6896l2105K79o429m343K0329
5060b3032j7562J9605K5643k0865r573l692L8392m684k5851L050p374J7065J7802
5047H924j5788K160J6607R39l1386j5084L2831L7510J46l010l1163o3523j1487
$$ plain form
5136 -34294 -55106 -42057 -3693 -13537 -42254 -87809 -81465 -52314 -33844 -14535 -9355 -28248
5124 -28248 -36480 -11162 6538 -26786 -41321 -36641 27413 53445 36706 15370 -17536 -43878
5112 -43878 -29111 -8990 19264 30971 6964 8626 2490 -9241 -23496 -38674 6693 17241
5100 17241 -17247 -25678 -10008 1449 -23550 -8693 -5867 4352 5720 -21821 -25941 12269 -1014
5087 -1014 18356 19839 -9594 -24493 9248 11077 -19710 -21741 -16646 -40184 -31150 -26723 -32954
5074 -32954 -42552 -37176 -26300 -21213 -1444 -871 23436 36133 -763 -32868 -32589 -39018 -43361 -23032
5060 -23032 -40594 -20989 4654 -16211 -25784 -29476 8916 4232 -21619 -18569 -25943 -8878 8924
5047 8924 -6864 -4704 11903 12842 -18544 -33628 -797 36713 36859 33849 2686 -60837 -72324
5034g2324o322k295m63K6496L469J549L9999M0414k5965k4425J7808L973j9761
5021a7847p302M2641J0873q166Q744J8517p444M1767j3634j5483j9554k7232j5942
5008a0062J3648r520R672J899j5730m0266k3889J5129K5978L8044J3057J9642
4996C7602J174n827J0020j6517m4303j0100L1615K7407K5266J166l1045m2809
4984a6351l3715J4428O063J8991J7990K1170R679J232l3006l8784L924R475J1599
4971g305k0085J4651J8018J7905o987q908K7840j6643k4077L709K4165m3333j7722
4958c8772j2305l624j684j926j577M2288M1498K824k4832k0398P013n283j0447
4945b7225j056K0411R55Q17o130j2444q247J1892K3743K8639J50j6430k2686n381
$$ plain form
5034 -72324 -78646 -80941 -81404 -54908 -51439 -49890 -9891 30523 4558 -19867 -2059 1914 -17847
5021 -17847 -25149 17492 28365 20199 28943 47460 40016 81783 68149 52666 33112 5880 -10062
5008 -10062 3586 -5934 3738 5637 -10093 -50359 -74248 -59119 -33141 4903 17960 37602
4996 37602 38776 32949 42969 26452 -17851 -27951 3664 31071 56337 57503 26458 -16351
4984 -16351 -50066 -35638 -29575 -10584 7406 28576 38255 39487 6481 -32303 -28379 -18904 -7305
4971 -7305 -27390 -12739 5279 23184 16197 7289 35129 18486 -5591 -1882 22283 -21050 -38772
4958 -38772 -51077 -54701 -56385 -58311 -59888 -17600 23898 26722 1890 -18508 -11495 -16778 -27225
4945 -27225 -28281 -7870 -6915 -6098 -12228 -24672 -32919 -21027 2716 31355 31505 15075 -7611 -12992
4931a2992J0569j0588J704K8620Q365r464j1873l260M424l362K3620l0535l5223
4918c9995r052K2350L2847N292O307q053m1254L603L9178J5783j3779j2568J8142
4905A8801O075j8242k3558j4443K7565J5485m204m3415k3433P580J2125L289O953
4892b9422J259k8563M7059N5684M594k1279j9023L496J9144O637l938m563J7180
4879D8265p586l238J919n302j6503L862p505K3194K4174l5810l9638K370j4671
4866b6469m394p840J8131O532k124J2432K2542l805l7011J3403K3993j4105j2304
4853a1019j1930J0798k5995k2308J5036K4228J5213K599j1775p564L044J3887
4841e786m115J0681K926n420m158j9292k1726j497K0850j5533L035o352M4361
$$ plain form
4931 -12992 -2423 -13011 -11307 17313 25678 16214 4341 1081 5505 2143 25763 -4772 -39995
4918 -39995 -49047 -26697 6150 11442 17749 9696 -31558 -27955 11223 27006 13227 659 18801
4905 18801 24876 6634 -16924 -31367 -3802 11683 7479 -35936 -59369 -51789 -39664 -36375 -29422
4892 -29422 -28163 -56726 -9667 46017 50611 29332 10309 13805 32949 39586 35648 31085 48265
4879 48265 40679 37441 39360 34058 17555 21417 13912 37106 61280 25470 -14168 -11798 -26469
4866 -26469 -30863 -38703 -20572 -14040 -16164 -3732 18810 15005 -22006 -8603 15390 1285 -11019
4853 -11019 -22949 -12151 -38146 -60454 -45418 -21190 -5977 -3378 -15153 -22717 -19673 -5786
4841 -5786 -9901 780 3706 -1714 -5872 -25164 -46890 -48387 -27537 -43070 -40035 -46387 -2026
4828b026J3508m829N998K377R574K0045j7116m2952J3952L3000K1512o872J4134
$$ plain form
4828 -2026 11482 6653 12651 15028 24602 44647 27531 -15421 -1469 31531 53043 46171 60305
$$ [...]
##END NTUPLES=NMR SPECTRUM
##END=
