##TITLE=Analysis number 309007
Compound Code cc 38110
Book Reference 403/150
Project Code adrs
Chemist Name carlr
##JCAMPDX= 6.0         $$ Bruker NMR JCAMP-DX V2.0
##DATA TYPE= NMR SPECTRUM
##DATA CLASS= NTUPLES
##ORIGIN= Bruker BioSpin GmbH
##OWNER= NMR
$$ XWIN-NMR		Version 3.5
$$ Thu May 26 14:30:46 2005 GMT Daylight Time (UT+1h)  MAYBRIDGE\NMR@NMR_250MHZ
##.OBSERVE FREQUENCY= 250.131544655141
##.OBSERVE NUCLEUS= ^1H
##.ACQUISITION MODE= SIMULTANEOUS (DQD)
##.ACQUISITION SCHEME= undefined
##.AVERAGES= 16
##.DIGITISER RES= 18
##SPECTROMETER/DATA SYSTEM= dpx250
##.PULSE SEQUENCE= zg30
##.SOLVENT NAME= CDCl3
##.SHIFT REFERENCE= (INTERNAL, CDCl3, 0, 16.522)
##AUDIT TRAIL= $$ (NUMBER, WHEN, WHO, WHERE, WHAT)
$$ ##TITLE= Audit trail, XWIN-NMR		Version 3.5
$$ ##JCAMPDX= 5.01
$$ ##ORIGIN= Bruker BioSpin GmbH
$$ ##OWNER= NMR
$$ C:\u/data/dgb/nmr/ADRS/3590/pdata/1/auditp.txt
$$ ##AUDIT TRAIL=  $$ (NUMBER, WHEN, WHO, WHERE, WHAT)
(   1,<2005-05-26 14:30:26.43 +100>,<MAYBRIDGE\NMR>,<NMR_250MHZ>,
      <created by zg, POWCHK disabled, PULCHK disabled
       configuration hash MD5:
       62 19 C7 07 E1 42 D1 B7 37 6C 3D D0 77 39 F9 E6
       data hash MD5: 64K
       5F 22 24 97 5E 92 DF 6D 27 AE 5B E4 5E 52 7D CC>)
(   2,<2005-05-26 14:30:38.15 +100>,<MAYBRIDGE\NMR>,<NMR_250MHZ>,
      <Start of raw data processing
       ef LB = 0.3 FT_mod = 6 PKNL = 1 SI = 32K 
       data hash MD5: 32K
       21 3D 1D 02 11 BA FA 59 DB BA CB 70 6E 2E 96 76>)
(   3,<2005-05-26 14:30:39.90 +100>,<MAYBRIDGE\NMR>,<NMR_250MHZ>,
      <apk 
       data hash MD5: 32K
       FC AA 6C 8A CF CF 08 B1 05 B1 6B 2A FA 5A D9 F0>)
(   4,<2005-05-26 14:30:40.62 +100>,<MAYBRIDGE\NMR>,<NMR_250MHZ>,
      <abs ABSG = 5 
       data hash MD5: 32K
       9E AA A5 17 CC 90 43 5A 80 3C 53 1E 22 A7 6E 80>)
$$ ##END=
$$ 
$$ hash MD5
$$ C4 51 D0 4B 17 2D D3 08 09 AD C8 85 3B AC F5 68
##$RELAX= 
##$RELAX= 
##$RELAX= 
##$RELAX= 
##$RELAX= 
##$RELAX= 
##$RELAX= 
$$ Bruker specific parameters
$$ --------------------------
##$DU= <C:\u>
##$EXPNO= 3590
##$NAME= <ADRS>
##$PROCNO= 1
##$TYPE= <nmr>
##$USER= <dgb>
##$AMP= (0..31)
100 100 100 100 100 100 100 100 100 100 100 100 100 100 100 100 100 100 
100 100 100 100 100 100 100 100 100 100 100 100 100 100 
##$AQSEQ= 0
##$AQ_mod= 3
##$AUNM= <au_zg>
##$AUTOPOS= <39 >
##$BF1= 250.13
##$BF2= 250.13
##$BF3= 250.13
##$BF4= 250.13
##$BF5= 500.13
##$BF6= 500.13
##$BF7= 500.13
##$BF8= 500.13
##$BYTORDA= 1
##$CFDGTYP= 0
##$CFRGTYP= 5
##$CHEMSTR= <none>
##$CNST= (0..31)
1 1 145 1 1 1 1 1 1 1 1 1 1 1 1 1 1 1 1 1 1 1 1 1 1 1 1 1 1 1 1 1 
##$CPDPRG= <>
##$CPDPRG1= <>
##$CPDPRG2= <>
##$CPDPRG3= <>
##$CPDPRG4= <mlev>
##$CPDPRG5= <mlev>
##$CPDPRG6= <mlev>
##$CPDPRG7= <mlev>
##$CPDPRG8= <mlev>
##$CPDPRGB= <>
##$CPDPRGT= <>
##$D= (0..31)
0 1 0 0 0 0 0 0 0 0.06 0 0 0 0 0 0 0.0002 0 0 0 0 0 0 0 0 0 0 0 0 0 0 
0 
##$DATE= 1117114225
##$DBL= (0..7)
120 120 120 120 120 120 120 120 
##$DBP= (0..7)
150 150 150 150 150 150 150 150 
##$DBP07= 0
##$DBPNAM0= <>
##$DBPNAM1= <>
$$ [...]
##$SUBNAM7= <"">
##$SUBNAM8= <"">
##$SUBNAM9= <"">
##$SW= 20.6930455092707
##$SWIBOX= (0..15)
0 0 3 0 0 0 0 0 0 0 0 0 0 0 0 0 
##$SW_h= 5175.983436853
##$TD= 65536
##$TD0= 1
##$TE= 294.16
##$TE2= 300
##$TE3= 300
##$TEG= 300
##$TL= (0..7)
0 120 120 120 120 120 120 120 
##$TP= (0..7)
150 150 150 150 150 150 150 150 
##$TP07= 0
##$TPNAME0= <>
##$TPNAME1= <>
##$TPNAME2= <>
##$TPNAME3= <>
##$TPNAME4= <>
##$TPNAME5= <>
##$TPNAME6= <>
##$TPNAME7= <>
##$TPOAL= (0..7)
0.5 0.5 0.5 0.5 0.5 0.5 0.5 0.5 
##$TPOFFS= (0..7)
0 0 0 0 0 0 0 0 
##$TUNHIN= 0
##$TUNHOUT= 0
##$TUNXOUT= 0
##$USERA1= <user>
##$USERA2= <user>
##$USERA3= <user>
##$USERA4= <user>
##$USERA5= <user>
##$V9= 5
##$VALIST= <valist>
##$VCLIST= <CCCCCCCCCCCCCCC>
##$VD= 0
##$VDLIST= <DDDDDDDDDDDDDDD>
##$VPLIST= <PPPPPPPPPPPPPPP>
##$VTLIST= <TTTTTTTTTTTTTTT>
##$WBST= 1024
##$WBSW= 4
##$XGAIN= (0..3)
0 0 0 0 
##$XL= 0
##$YL= 0
##$YMAX_a= 578018
##$YMIN_a= -533508
##$ZGOPTNS= <>
##$ZL1= 120
##$ZL2= 120
##$ZL3= 120
##$ZL4= 120
##$ABSF1= 16.522
##$ABSF2= -4.171173
##$ABSG= 5
##$ABSL= 3
##$ALPHA= 0
##$AQORDER= 0
##$ASSFAC= 0
##$ASSFACI= 0
##$ASSFACX= 0
##$ASSWID= 0
##$AUNMP= <proc_1d>
##$AZFE= 0.1
##$AZFW= 0.1
##$BCFW= 0
##$BC_mod= 0
##$BYTORDP= 0
##$COROFFS= 0
##$CY= 12.5
##$DATMOD= 1
##$DC= 0
##$DFILT= <>
##$DTYPP= 0
##$F1P= 14.0000005364418
##$F2P= -0.99999901652339
##$FCOR= 0.5
##$FTSIZE= 32768
##$FT_mod= 6
##$GAMMA= 0
##$GB= 0
##$INTBC= 1
##$INTSCL= 1
##$ISEN= 128
##$LB= 0.3
##$LEV0= 0
##$LPBIN= 0
##$MAXI= 10000
##$MC2= 0
##$MEAN= 0
##$ME_mod= 0
##$MI= 0
##$NCOEF= 0
##$NC_proc= -4
##$NLEV= 6
##$NOISF1= 0
##$NOISF2= 0
##$NSP= 0
##$NTH_PI= 0
##$NZP= 0
##$OFFSET= 16.522
##$PC= 1
##$PHC0= 132.3466
##$PHC1= 5.580089
##$PH_mod= 1
##$PKNL= yes
##$PPARMOD= 0
##$PSCAL= 4
##$PSIGN= 0
##$REVERSE= no
##$SF= 250.13
##$SI= 32768
##$SIGF1= 0
##$SIGF2= 0
##$SINO= 400
##$SIOLD= 32768
##$SREGLST= <1H.CDCl3>
##$SSB= 0
##$STSI= 32768
##$STSR= 0
##$SW_p= 5175.98343685301
##$SYMM= 0
##$S_DEV= 0
##$TDeff= 65536
##$TDoff= 0
##$TI= <Analysis number 999999
Compound Code 99
Book Reference 9
Project Code 9>
##$TILT= no
##$TM1= 0
##$TM2= 0
##$TOPLEV= 0
##$USERP1= <user>
##$USERP2= <user>
##$USERP3= <user>
##$USERP4= <user>
##$USERP5= <user>
##$WDW= 1
##$XDIM= 32768
##$YMAX_p= 343005262
##$YMIN_p= -40903
$$ End of Bruker specific parameters
$$ ---------------------------------
##NTUPLES= NMR SPECTRUM
##VAR_NAME=  FREQUENCY,     SPECTRUM/REAL,   SPECTRUM/IMAG
##SYMBOL=    X,             R,               I
##VAR_TYPE=  INDEPENDENT,   DEPENDENT,       DEPENDENT
##VAR_FORM=  AFFN,          ASDF,            ASDF
##VAR_DIM=   32768,         32768,           32768
##UNITS=     HZ,            ARBITRARY UNITS, ARBITRARY UNITS
##FACTOR=    0.157963299565203, 1,           1
##FIRST=     4132.6476996994, 0,             0
##LAST=      -1043.33573715361, 0,           0
##MIN=       -1043.33573715361, -40903,      0
##MAX=       4132.6476996994, 343005262,     0
$$ Real data points
##PAGE= N=1
##DATA TABLE= (X++(R..R)), XYDATA
$$ [...]
15375a0613j382j4824K422P83L801j060N748O504J211k44J05N886j2126n83M095
15360a0277k598q354k848Q291J4843O468k348l242m651n940n730k893j1935M022
15346b7192K757L074J417L71M872p092K632J057O061J2413M345p903j1108L117
15332a1179l310k335M760O427P657L198n762j4179k920r368P079L977Q222N460
15318b273n661j065L391j6377l940J1333L522M219K093J979l879p502n518j0321
15304b9999J393J39J824Q20n784j627P216N694R984L430J784K984m892J120p563
15289a3477n128j039L567K875p287k985o238K827N608J1286J7087l506j0355L505
15275c260l10r990K738R32J230Q579k960k681O283j1817j2195R632P791O032o333
$$ plain form
15375 -10613 -11995 -26819 -24397 -23614 -19813 -20873 -15125 -8621 -7410 -7654 -7549 -1663 -13789 -14372 -10277
15360 -10277 -12875 -21229 -24077 -15786 -943 5525 3177 -65 -4716 -10656 -16386 -19279 -31214 -27192
15346 -27192 -24435 -21361 -19944 -19573 -14701 -21793 -19161 -18104 -12043 370 4715 -3188 -14296 -11179
15332 -11179 -14489 -16824 -12064 -5637 2020 5218 -544 -14723 -17643 -27011 -19932 -15955 -7733 -2273
15318 -2273 -7934 -8999 -5608 -21985 -25925 -14592 -11070 -6851 -4758 -2779 -6658 -14160 -19678 -29999
15304 -29999 -28606 -28467 -26643 -25823 -31607 -33234 -26018 -20324 -10340 -6910 -5126 -2142 -7034 -5914 -13477
15289 -13477 -18605 -19644 -16077 -13202 -20489 -23474 -29712 -26885 -21277 -9991 7096 3590 -6765 -3260
15275 -3260 -3570 -13560 -10822 -9890 -8660 -81 -3041 -5722 561 -11256 -23451 -13819 -6028 4 -6329
15260f329l540J981M956p323n483Q86L246l030r344p636K612O111J85o167M571
15245b4304L385J4610P783j0N528q490p387m647m392k339O030M270O43r072n47
15230a8939K82k58m804l193N244J2418j1207j204J601L615l707j149L543L934
15216a3824m973N963R123r69n817Q59l319l269J43J875Q24P126Q311L620n561
15201A12j2893M359L943K222m571M944j1945j1922L547O356Q47Q864N383l697
15187d451j917j884o87r158n025k379Q572L436R37p884M601L171m346L482P88
15172a2744K262K838P599l018p114o248j73N501o305J104k670O895M199J675K957
15157c242J052o150m195J0458Q611p411r557O87L363L312K009m309M370j732K966
$$ plain form
15260 -6329 -9869 -7888 -2932 -10255 -15738 -14852 -11606 -14636 -23980 -31616 -29004 -22893 -22708 -28875 -24304
15245 -24304 -20919 -6309 1474 1464 6992 -1498 -8885 -13532 -17924 -20263 -14233 -9963 -9320 -18392 -18939
15230 -18939 -18657 -18915 -23719 -26912 -21668 -9250 -20457 -21661 -20060 -16445 -20152 -21301 -17758 -13824
15216 -13824 -18797 -12834 -3711 -4680 -10497 -9638 -12957 -16226 -16083 -14208 -13384 -6258 2053 5673 112
15201 112 -12781 -8422 -4479 -2257 -6828 -1884 -13829 -25751 -22204 -15848 -15001 -6137 -754 -4451
15187 -4451 -6368 -8252 -8939 -18097 -23122 -25501 -16929 -13493 -12556 -20440 -15839 -12668 -17014 -13532 -12744
15172 -12744 -10482 -7644 -45 -3063 -10177 -16425 -16598 -11097 -17402 -16298 -18968 -12073 -7874 -6199 -3242
15157 -3242 -2190 -8340 -12535 -2077 6534 -877 -10434 -9747 -6384 -3072 -1063 -5372 -1002 -2734 232
15142B32l337M530m764P09o63q16k994j0696O118O259j799j361L081j683l46j1247
15126a8777j0508J569m26N366J4880n397q72O183m899r172q772J364M782J0369
15112a4310J3049K880j422q58J306j4730o01l731L689k952l817m534m431k111
15098c2573J1677J0819j1104k848J1187P065m505m673m812k69M934J981n412m480
15084b3013O764J285j0383k434O894K060J2800n345j183K124j302O01R18J276
15070h938k996J455K60K553m784O34l40l402O958K438m372k480j900P686p175
15055a4403j198j891q20j453j1037N187K133J028Q982k949r729J509Q295P306
15041i040P195j923j1450n812K248l452o269K619m549R441J8217q294n861j126
$$ plain form
15142 232 -3105 1425 -3339 -2630 -3293 -4109 -7103 -17799 -11681 -5422 -7221 -8582 -5501 -7184 -7530 -18777
15126 -18777 -29285 -27716 -28142 -22776 -7896 -13293 -14165 -7982 -12881 -22053 -30825 -29461 -24679 -14310
15112 -14310 -1261 1619 197 -661 645 -14085 -14686 -18417 -14728 -17680 -21497 -26031 -30462 -32573
15098 -32573 -20896 -10077 -21181 -24029 -12842 -5777 -10282 -14955 -19767 -20036 -15102 -13121 -18533 -23013
15084 -23013 -16249 -14964 -25347 -27781 -20887 -18827 -6027 -11372 -12555 -10431 -11733 -11132 -10214 -8938
15070 -8938 -11934 -10479 -10219 -7666 -12450 -11816 -12156 -15558 -8600 -6162 -10534 -13014 -14914 -7228 -14403
15055 -14403 -15601 -17492 -18312 -19765 -30802 -25615 -23482 -22454 -13472 -16421 -26150 -24641 -16346 -9040
15041 -9040 -1845 -3768 -15218 -21030 -18782 -22234 -28503 -25884 -30433 -20992 -2775 -11069 -16930 -18056
15027a8056Q447J2514n421n958k087o021k572J994P79N334J813o042J923j017
15013a4370m091M689P287P310l37j0319j4696q531O968J262l920j23k190O990
14999b4071N483J3629O857o359J808K907O969j2150p304P66n093o383L806J0567
14985h568M573n676l663j119l581p377J175O965q32J769Q258K368o777j900j1721
14970b6106j048R487l757K93l225n896k660N036M810M551J186N65Q524J0830n727
14955c137l233J871K750O37J1055k765j0898o05J5035r85N863Q371j074k068o538
14940A4279l011K315M02N187k286M963K109r725J776L154r06k579o478n344j2180
14925h324j0490J0937J6503o162j1781J997R965J098q210P125p367l077l449l733
$$ plain form
15027 -18056 -9609 2905 -2516 -8474 -10561 -16582 -19154 -17160 -16381 -11047 -9234 -15276 -13353 -14370
15013 -14370 -18461 -13772 -6485 825 488 -9831 -24527 -33058 -26090 -24828 -28748 -28871 -31061 -24071
14999 -24071 -18588 -4959 1898 -4461 -2653 254 7223 -4927 -12231 -11465 -16558 -22941 -19135 -8568
14985 -8568 -3995 -9671 -13334 -14453 -18034 -25411 -24236 -17271 -18103 -16334 -8076 -5708 -12485 -14385 -26106
14970 -26106 -27154 -17667 -21424 -21131 -24356 -30252 -32912 -27876 -23066 -18515 -17329 -16764 -8240 2590 -3137
14955 -3137 -6370 -4499 -1749 -1112 9943 7178 -3720 -4325 10710 9725 15588 23959 22885 20817 14279
14940 14279 11268 13583 13985 19172 16886 21849 23958 14233 16009 19163 18257 15678 9200 3856 -8324
14925 -8324 -18814 -7877 8626 2464 -9317 -7320 2645 3743 -4467 2658 -4709 -7786 -11235 -14968
14911a4968M202K660n615o58K545l794Q20m109j277P112N416K111P83j2510l737
14896b1019J0150M176l081p372n976n254R034P919n181l662N772M368O607m557
14882h076j972q044l43L738K88q148n560k072l794M578K189N783Q322l714O533
14867a0292n944M82J841k832n662K792m4O970L781l470j834m062P660R025Q641
14852G052j742o580j1294r595K075K638n024q775k647R900O587L171L956R904
14838c74l530L565M588m772m454K211N746k728J408j0983j7502m937J1845P837
14824a2080k573N75q749M357M197k013m599l469j2278k29M560O401J5334M49j0122
14809b0239K459O126L83K37L340n251m598n63J98j952p96M620N052r866N309J105
$$ plain form
14911 -14968 -10766 -8106 -13721 -14379 -11834 -15628 -14808 -18917 -20194 -13082 -7666 -5555 -4772 -17282 -21019
14896 -21019 -10869 -6693 -9774 -17146 -23122 -28376 -19342 -11423 -16604 -20266 -14494 -10126 -3519 -8076
14882 -8076 -10048 -18092 -18435 -14697 -14409 -22557 -28117 -30189 -33983 -29405 -27216 -21433 -13111 -16825 -10292
14867 -10292 -16236 -15754 -13913 -16745 -22407 -19615 -19659 -12689 -8908 -12378 -14212 -18274 -10614 -1589 7052
14852 7052 5310 -1270 -12564 -22159 -20084 -17446 -22470 -31245 -33892 -23992 -17405 -14234 -10278 -374
14838 -374 -3904 -339 4249 -523 -4977 -2766 2980 252 1660 -9323 -26825 -31762 -19917 -12080
14824 -12080 -14653 -14078 -22827 -18470 -14273 -16286 -20885 -24354 -36632 -36861 -32301 -25900 -10566 -10117 -20239
14809 -20239 -17780 -11654 -11271 -11034 -7694 -12945 -17543 -18106 -17908 -19860 -20656 -16036 -10984 -20850 -15541 -14436
14793a4436k550n840O9l747K482k171Q927J3209P162r800N595k613j023q559o41
14778a3936K112n555j0181l019O760j619o371M035q169j436Q774m042j174O047
14764b7774J3834P766L68M023j242l692m486O466O533n168q130M643O42m088L805
14749f500n51J144O89p095l211p04p368P15K768k4J012o160j270o205L001P688
14733b2071Q877k27P440j53j406k900O164l55J0644J880q819j3814m569R801J677
14718g831K605l56m817L24J411J411l631l14o372K726L501k617J469L908l557
14703a2140L270L326o928j0079l928R15N169j30n080K049n04L73P375l28J31j478
14687a7987J405O213n025O78M481n741N313p054l315J6073P996k867j1788r921
$$ plain form
14793 -14436 -16986 -22826 -22757 -26504 -24022 -26193 -17266 -4057 3105 -6695 -1100 -3713 -4736 -13295 -13936
14778 -13936 -11824 -17379 -27560 -30579 -23819 -25438 -31809 -27774 -35943 -37379 -28605 -32647 -33821 -27774
14764 -27774 -13940 -6174 -5806 -1783 -3025 -6717 -11203 -4737 1796 -3372 -11502 -6859 -6217 -10305 -6500
14749 -6500 -7051 -5907 -5218 -12313 -15524 -16228 -23596 -22881 -20113 -20137 -19125 -25285 -26555 -32760 -29759 -22071
14733 -22071 -13194 -13421 -5981 -6134 -7540 -10440 -4276 -4631 6013 7893 -926 -14740 -19309 -9508 -7831
14718 -7831 -5226 -5582 -10399 -10075 -8664 -7253 -10884 -11198 -17570 -14844 -11343 -13960 -12491 -8583 -12140
14703 -12140 -8870 -5544 -12472 -22551 -26479 -25564 -20395 -20525 -25605 -23556 -24060 -23687 -16312 -16640 -16509 -17987
14687 -17987 -16582 -10369 -15394 -14716 -10235 -15976 -10663 -17717 -21032 -4959 3037 170 -11618 -21539
14673b1539p593K782j329k64Q404O034l024j324l214K232R229j70l997r389M492
14658a8670M564r032Q181J3479K106m257j3237q025o26p16r50K01j017j548J0568
14643a8979J480o429J4472O798o83M609Q14j1463k944O588m728j1171j0384N31
14629c1489L197R742L257Q599O234J26j849L63p735p50q521l682M033l208j50
14614b1833R783J5641M499j5661m551m181K945r477P52J258N685K049l813m413
14600b1317L244P414R238o250n209l954o269j559Q502Q463L35r097q950O588K23
14585a8598l560k203R630J0486j494l963o514k911l836q18M047k405P221J3114
14571a804j3806j0323L69K539q9L821K450J6526R229r971j4080n007J36N974Q610
$$ plain form
14673 -21539 -29132 -26350 -27679 -27943 -19539 -13505 -16529 -17853 -21067 -18835 -9606 -9776 -13773 -23162 -18670
14658 -18670 -14106 -23138 -14957 -1478 628 -3629 -16866 -24891 -25517 -26233 -27183 -26982 -27999 -29547 -18979
14643 -18979 -17499 -23928 -9456 -2658 -3341 1268 2082 -9381 -12325 -5737 -10465 -21636 -32020 -31489
14629 -31489 -28292 -18550 -15293 -6694 -460 -334 -2183 -1820 -9555 -10305 -18826 -22508 -18475 -21683 -21833
14614 -21833 -12050 3591 8090 -7571 -12122 -16303 -13358 -22835 -22083 -20825 -15140 -13091 -16904 -21317
14600 -21317 -18073 -10659 -1421 -7671 -12880 -16834 -23103 -24662 -16160 -7697 -7362 -16459 -25409 -18821 -18598
14585 -18598 -22158 -24361 -14731 -4245 -5739 -9702 -16216 -19127 -22963 -23781 -19734 -22139 -14918 -1804
14571 -1804 -15610 -25933 -25564 -23025 -23114 -19293 -16843 -317 8912 -1059 -15139 -20146 -20010 -14036 -5426
14556e426n396r012P276R191M731o505p057o476j609q36n59M218l77l219J878
14541a9178O155O160k877o63k115K94p616n595P15L427j370m860N501P425j307
14526a5904O336j356j1671L691l145j1042M536Q869m091M430J345n206r55L551
14512b0612L608j065O302P910N466P194M522J250n783m75J601m167q877j809K347
14497b588J206N60o416N529m088j0953l176M906J1191j423n500p070J0786J3947
14483F911L889j1940n098j780M269N14l445j932l418P58m67N293l234m375J10
14468a3945L788k240m634j26N757l066j458M252J295q099l671P04O046L597K226
14453i574l42J159l736K466O488m199j4484k166O998j730j446R477N488O150L78
$$ plain form
14556 -5426 -10822 -19834 -12558 -3367 1364 -5141 -12198 -18674 -20283 -21119 -21678 -17460 -17837 -21056 -19178
14541 -19178 -13023 -6863 -9740 -10403 -12518 -12224 -19840 -25435 -24720 -21293 -22663 -27523 -22022 -14597 -15904
14526 -15904 -9568 -10924 -22595 -18904 -22049 -33091 -28555 -19686 -23777 -19347 -18002 -23208 -24163 -20612
14512 -20612 -17004 -18069 -11767 -3857 1609 8803 13325 14575 8792 8317 9918 5751 -3126 -4935 -2588
14497 -2588 -1382 -822 -7238 -1709 -5797 -16750 -19926 -15020 -3829 -5252 -10752 -17822 -7036 6911
14483 6911 10800 -1140 -6238 -8018 -3749 -3235 -6680 -8612 -12030 -11272 -11739 -6446 -9680 -14055 -13945
14468 -13945 -10157 -12397 -17031 -17157 -11400 -14466 -15924 -11672 -10377 -18476 -22147 -21443 -15397 -11800 -9574
14453 -9574 -9916 -8757 -12493 -10027 -3539 -7738 -22222 -24388 -17390 -19120 -20566 -11089 -5601 549 927
14438I27n588r137p478N469N37K937j034o96o084q165J701J1622Q514J626n497
14423a0346K5m16p31r83o316J92J2994N29j927k945k740O306K904P66o655j4863
14407b4206l640Q540J0210O515o484m213Q090L755n248j11k450J31j031q047N005
14392a3184P923J0192l201l877q67o087R720J6134o329j675k113r137k384q44
14378e729k945O64l212O378q132p196l417J628q869k687k423N126N749m57O483
14363a9039K490L798L143M88L654m030n74J989M8j1659o267N55K743j555k072
14348b6288m341N707M069o424p9M466M158K630l78O15k198k627q03N560O304O06
14332i023p552L632n697O57j1916M301M430l375l540J468P835P325K196J501N423
$$ plain form
14438 927 -4661 -13798 -21276 -15807 -15270 -12333 -13367 -14063 -20147 -28312 -26611 -14989 -6475 -4849 -10346
14423 -10346 -10321 -10737 -11468 -12451 -18767 -18575 -5581 -5052 -6979 -9924 -12664 -6358 -3454 -2688 -9343 -24206
14407 -24206 -27846 -19306 -9096 -2581 -9065 -13278 -5188 -1433 -6681 -6792 -9242 -9111 -10142 -18189 -13184
14392 -13184 -5261 4931 1730 -2147 -3014 -9101 619 16753 10424 8749 6636 -2501 -4885 -5729
14378 -5729 -8674 -8010 -11222 -4844 -12976 -20172 -23589 -21961 -30830 -33517 -35940 -30814 -25065 -25522 -19039
14363 -19039 -16549 -12751 -9608 -9120 -5466 -9496 -10070 -8081 -8033 -19692 -25959 -25404 -22661 -24216 -26288
14348 -26288 -30629 -24922 -20853 -27277 -27356 -22890 -18732 -16102 -16480 -15865 -18063 -20690 -21493 -15933 -9629 -9023
14332 -9023 -16575 -12943 -18640 -17983 -29899 -25598 -21168 -24543 -28083 -26615 -18780 -11455 -9259 -7758 -2335
14317b335J212j8158j2535J3660M677k250K055j621Q69L74n745O83N795K400n404
14302a6323K94m768j17P513P745o56j713k645p983L615L055p3N43l413j668n58
14286a7152k463K387J0701K22l980l059q874l42o185O994l717m777Q922j635j387
14271b4345J856n126K475J2570J0929l008j2857q94k224r471k917L369L096j454
14257b8001Q300M540K802l48p551n255j3641j314N244M116N249L657j17K587j328
14242b1060j1247N372Q426K081n92k7J497n148K508J421l30J286P169L93j0426
14227a8677l423j412M94N420O33o866J903P830J6725q89o376j752M62p53p043
14212a3724m915r466p15P531L788r43Q900K480k822m810o466Q450L172K375M769
$$ plain form
14317 -2335 -1123 -19281 -31816 -18156 -13479 -15729 -13674 -15295 -14426 -14052 -19797 -19114 -13319 -10919 -16323
14302 -16323 -16029 -20797 -20914 -13401 -5656 -6312 -8025 -10670 -18653 -15038 -11983 -12056 -11513 -14926 -16594 -17152
14286 -17152 -19615 -17228 -6527 -6305 -10285 -13344 -22218 -22560 -28745 -21751 -25468 -30245 -21323 -22958 -24345
14271 -24345 -22489 -27615 -25140 -12570 -1641 -4649 -17506 -18400 -20624 -30095 -33012 -29643 -26547 -28001
14257 -28001 -19701 -15161 -12359 -12707 -20258 -25513 -39154 -40468 -35224 -31108 -25859 -22202 -22319 -19732 -21060
14242 -21060 -32307 -26935 -18509 -16428 -17020 -17047 -15550 -20698 -18190 -16769 -17099 -15813 -8644 -8251 -18677
14227 -18677 -22100 -23512 -23018 -17598 -16965 -23831 -21928 -14098 2627 1738 -4638 -6390 -5928 -6681 -13724
14212 -13724 -18639 -28105 -28820 -21289 -17501 -18444 -9544 -7064 -9886 -14696 -21162 -12712 -9540 -7165 -2396
14197b396L129N73l947K262O88o67k241r538M181n71j017R51L012J109l717n950
14181a4139k289R644K29o257o257l891K571K388q17j0671K237o82j1268J435Q273
14166b9494J0695R410R816n288q151k787L475M049O025Q899m69l233o082k236
14152e371q68j344L166j584k662K817p034o714r76O584O872J623n709J72L822
14137g206j593j684M659r375l454j829p908l642J002R817K188k343k409O402L774
14122a3601j934m03K730q44J0903Q484q94j733k99j0518j2597J991O391l137q109
14107b3570J497K104O247J022Q321L327p886o632n22m752K739L077o076m495O079
14092a9520O450K493j292p738o134R512L424l580N378K866p822j2998M69R224
$$ plain form
14197 -2396 733 1306 -2641 -379 309 -358 -2599 -12137 -7956 -8527 -9544 -8593 -5581 -4472 -8189 -14139
14181 -14139 -16428 -6784 -6555 -12812 -19069 -22960 -20389 -18001 -18818 -29489 -27252 -27934 -39202 -37767 -29494
14166 -29494 -18799 -9389 427 -4861 -13012 -15799 -12324 -8275 -2250 6649 6180 2947 -3135 -5371
14152 -5371 -6239 -7583 -4417 -6001 -8663 -5846 -12880 -19594 -20570 -13986 -7114 -5491 -11200 -11028 -7206
14137 -7206 -8799 -10483 -5824 -15199 -18653 -20482 -28390 -32032 -31030 -21213 -19025 -21368 -23777 -17375 -13601
14122 -13601 -15535 -15938 -13208 -14052 -3149 5335 4441 2708 2409 -8109 -20706 -18715 -12324 -15461 -23570
14107 -23570 -22073 -19969 -13722 -12700 -4379 -1052 -8938 -15570 -16092 -20844 -18105 -15028 -21104 -25599 -19520
14092 -19520 -13070 -10577 -11869 -19607 -25741 -16229 -12805 -16385 -11007 -8141 -15963 -28961 -28492 -19268
14078a9268J1540N063m45n010J516J72k264k635j743n950j5392J617J9529O664
14064f606N395J120p721o409k561M315l459j663M688q784N158J2251N964O89J258
14049C635L515L315k620j2347l41O87N925L543o262q963o931n173J584N694l274
14034a8013J605M592L641J0142Q439q045j3370n475k065L792M568l290p0Q454
14020e095N543k579m294K087M979o72J133l557L290p646l395N638R212j862q705
14005e923k429k405m466k760o056n439k010j677J313J122L703K434L589p953O14
13990b8343R613N040L616m778R57J353O970j0180k556R960Q274J176o736m303
13976i937k217n11K302k184j1201M486P517J3161L216o893o69k093m805r89m097
$$ plain form
14078 -19268 -7728 -2665 -3110 -8120 -6604 -6432 -8696 -11331 -13074 -19024 -34416 -32799 -13270 -6606
14064 -6606 -1211 -91 -7812 -14221 -16782 -12467 -15926 -17589 -12901 -21685 -16527 -4276 1688 2377 3635
14049 3635 7150 10465 7845 -4502 -4843 -4156 1769 5312 -950 -9913 -16844 -22017 -20433 -14739 -18013
14034 -18013 -16408 -11816 -8175 1967 10406 2361 -11009 -16484 -18549 -14757 -10189 -13479 -13549 -5095
14020 -5095 448 -2131 -6425 -4338 641 -31 1102 -2455 835 -6811 -10206 -4568 4644 2782 -5923
14005 -5923 -8352 -10757 -15223 -17983 -24039 -29478 -31488 -33165 -31852 -30730 -27027 -24593 -21004 -28957 -28343
13990 -28343 -18730 -13690 -10074 -14852 -13895 -12542 -5572 -15752 -18308 -8348 -74 1102 -5634 -9937
13976 -9937 -12154 -12665 -10363 -12547 -23748 -19262 -11745 1416 4632 -2261 -2930 -5023 -9828 -10817 -14914
13961a4914J613l442j0240k666l797R492M493J367R028K784j1359P824M984r633
13947a4466N09K428L524o721O14J661J2144k578j967M810L439L718k674j0687
13933f246m542j0105j2291K893N495K854p883R384J1322m892J770Q41l746o266
13919b1412n85l810j902J4850J1777Q95k213l371L985J482m111P138n78j2697
13905a0552J595n281m414m205o309k3N292q572O899N507N884N304M475J40r160
13890a3420J1121M926q444k234R377l134j0217m47L953Q29o385o712O937P210
13876f640O490P72o259o532k41k824Q131J737p686p106J101J199N419K6J668k731
13860a3476q0P086j534O911o447l156N062j832P808l689j2344j0653r22M089N104
$$ plain form
13961 -14914 -13301 -16743 -26983 -29649 -33446 -23954 -19461 -18094 -9066 -6282 -17641 -9817 -4833 -14466
13947 -14466 -13957 -11529 -8005 -14726 -14112 -12451 -307 -2885 -4852 -42 3397 7115 4441 -6246
13933 -6246 -10788 -20893 -33184 -30291 -24796 -21942 -29825 -20441 -9119 -14011 -12241 -11400 -15146 -21412
13919 -21412 -21997 -25807 -27709 -12859 -1082 -187 -2400 -5771 -1786 -304 -4415 2723 2145 -10552
13905 -10552 -8957 -14238 -18652 -22857 -29166 -29189 -23897 -32469 -25570 -20063 -14179 -8875 -4400 -4260 -13420
13890 -13420 -2299 2627 -5817 -8051 1326 -1808 -12025 -12472 -8519 -7690 -14075 -20787 -13850 -6640
13876 -6640 -150 622 -5637 -12169 -12410 -15234 -7103 -5366 -13052 -20158 -19057 -17858 -12439 -12413 -10745 -13476
13860 -13476 -13556 -6470 -8004 -1093 -7540 -10696 -5634 -7466 342 -3347 -15691 -26344 -27266 -23177 -18073
13845a8073P898j835m133l290l193J686O392L107l528j3294j2400J2465j636N662
13831b4172J313k565J938J681O645P961j395l088O114o200l122k139L098j978
13817a5909j030L181k641k330J457n719M692L427P984l722M691N799r052j1072
13803b0244J201M139P50Q256K237J330j3026r389J4618k828j1424J404O379N626
13789a0971r454k833J081N034J562Q46L947q242R99K810j391N089J671j4056L540
13774b0368R607m403k347o568R695R447l058p937K413O935N163l518L831m224
13760e332L88j619l141P533J1414J30P006l496o213j2134m614L045o034M52O62
13745a1953p469j758j742K856k076J665Q363J3181k000j7104j3898J111J7218
$$ plain form
13845 -18073 -10175 -12010 -16143 -19433 -22626 -20940 -14548 -11441 -14969 -28263 -40663 -28198 -29834 -24172
13831 -24172 -22859 -25424 -23486 -21805 -15160 -7199 -8594 -11682 -5568 -11768 -14890 -17029 -13931 -15909
13817 -15909 -16939 -13758 -16399 -18729 -17272 -22991 -18299 -14872 -6888 -10610 -5919 -120 -9172 -20244
13803 -20244 -19043 -14904 -14154 -5898 -3661 -2331 -15357 -24746 -10128 -12956 -24380 -22976 -16597 -10971
13789 -10971 -20425 -23258 -22177 -17143 -15581 -14735 -10788 -19030 -18031 -15221 -16612 -11523 -9852 -23908 -20368
13774 -20368 -10761 -15164 -17511 -24079 -14384 -4937 -7995 -15932 -13519 -6584 -1421 -4939 -1108 -5332
13760 -5332 -4944 -6563 -9704 -2171 9243 9373 16379 12883 6670 -5464 -10078 -7033 -13067 -12615 -11953
13745 -11953 -19422 -21180 -22922 -20066 -22142 -20477 -12114 1067 -933 -18037 -31935 -30824 -13606
13732a3606M907j11j432m614l230R240K579N392l41J467k675r005J909N531m218
13717h207k387L27R027O834o038p692O109K900k161k131L589L814o04J513o975
13702b082j753k837L916N077p509j148K053j479p24K045R40l237o338o728n882
13687b5686L163J1974M655j800L678l406Q66N556m022o876L131j605Q05k243j898
13672a3708L758k630l187K426Jn012k676J4390Q606J944K225j2014p270L947n50
13657i750j291j519N04l671o821P771O411J6183N161l246k108L27m13L618k554
13642H602p151n927N011j0210j4524o097O639P063L130p72m124o143j03P093J0096
13627g417l019p222m447R172L133L806P669O520l279p091m01p426l221k4J0384
$$ plain form
13732 -13606 -8699 -8810 -10242 -14856 -18086 -8846 -6267 -875 -1216 251 -2424 -11429 -9520 -3989 -8207
13717 -8207 -10594 -10267 -1240 5594 -444 -8136 -2027 873 -1288 -3419 170 3984 3380 4893 -2082
13702 -2082 -3835 -6672 -2756 2321 -5188 -6336 -4283 -5762 -6486 -4441 -3501 -6738 -13076 -19804 -25686
13687 -25686 -22523 -10549 -5894 -7694 -4016 -7422 -6556 -1000 -5022 -11898 -8767 -10372 -9567 -11810 -13708
13672 -13708 -9950 -12580 -15767 -13341 -13340 -18352 -21028 -6638 1968 3912 6137 -5877 -13147 -9200 -9750
13657 -9750 -11041 -12560 -12056 -15727 -22548 -14777 -8366 7817 12978 9732 7624 7951 7538 11156 8602
13642 8602 1451 -4476 535 -9675 -24199 -30296 -23657 -16594 -13464 -14236 -18360 -24503 -24606 -17513 -7417
13627 -7417 -10436 -17658 -22105 -12933 -9800 -5994 1675 8195 4916 -2175 -2576 -10002 -13223 -13247 -2863
13612b863Q93n471m435L083L974J633l948k614N556p73j2694M297j023o864M176
13597a7073l670o069j013P85N2R559M964k290L266J7016r009j4205m853R186P954
13582e400M902Q304o281p231M07k101k011o153K521N276q949K011L052k925n432
13567b0010l503R109R278K685m190J54k966l316p338J174J1598P181q017n794
13553a3955N760R032O164J790k418j0012j477n413n687J886L931L309q720j78
13539a5988N119N540p50j688N663K729q551K028O593p062n462l180N904M888r254
13524a3471m68P647N486Q749M8p584N971n497j426j0229j0116N363m591n244P891
13509a7471J655j695K540M530K347r93N951N44j889M020N578k127K388Q41Q916
$$ plain form
13612 -2863 -1970 -7441 -11876 -8793 -4819 -3186 -7134 -9748 -4192 -4965 -17659 -13362 -14385 -21249 -17073
13597 -17073 -20743 -26812 -27825 -27040 -26988 -17429 -12465 -14755 -11489 5527 -3482 -17687 -22540 -13354 -5400
13582 -5400 -498 7806 1525 -5706 -5299 -7400 -9411 -15564 -13043 -7767 -16716 -14705 -11653 -14578 -20010
13567 -20010 -23513 -14404 -5126 -2441 -6631 -6477 -9443 -12759 -20097 -18923 -7325 -144 -8161 -13955
13553 -13955 -8195 837 7001 8791 6373 -3639 -5116 -10529 -16216 -14330 -10399 -7090 -15810 -15988
13539 -15988 -10869 -5329 -6079 -7767 -2104 625 -7926 -5898 695 -6367 -11829 -15009 -9105 -4217 -13471
13524 -13471 -13939 -6292 -806 7943 7991 407 6378 881 -545 -10774 -20890 -15527 -20118 -25362 -17471
13509 -17471 -15816 -17511 -14971 -10441 -8094 -9087 -3136 -2592 -4481 -461 5117 2990 5378 6219 15135
13494A5135M741j416j0835r524M147N078J321q079j113j5422j5394J9167J8815
13481F621M535K143j4983m553R844N233n100r471J64M987Q06K690N067n45j065
13466F373j33J735k443r314k913O749r978Q14N250n003L52J0183R985m977j97
13451F483o565p242M60L96j1243L03R646j298P066N556N609p037o157K693p606
13436h936O851N827r96j2241p713m567J1455J1050J420p531J251L044k219K667
13422f38N759J795n624m844J823K930O745n018N82l964j534q34k937o468o187
13407a8414o246k308J2303n44j572J1567J974o663Q01p411L758N060P120J0495
13393I920J1439j948k0018n610n939n576j1450P344L991M526m316k364j387o238
$$ plain form
13494 15135 19876 18460 7625 -1899 2248 7326 8647 568 -545 -15967 -31361 -12194 6621
13481 6621 11156 13299 -1684 -6237 3607 8840 3740 -5731 -5567 -580 226 2916 7983 7438 6373
13466 6373 6240 7975 5532 -3782 -6695 54 -9924 -9110 -3860 -8863 -8511 1672 11657 6680 6483
13451 6483 -82 -7324 -6864 -6468 -17711 -17408 -7762 -9060 -1994 3562 9171 2134 -4023 -1330 -8936
13436 -8936 -2085 3742 2746 -9495 -17208 -21775 -10320 730 2150 -5381 -4130 -1086 -3305 -638
13422 -638 5121 6916 1292 -3552 -1729 1201 7946 2928 3510 -454 -1988 -2822 -5759 -12227 -18414
13407 -18414 -24660 -26968 -14665 -15209 -16781 -5214 -3240 -9903 -9102 -16513 -12755 -7695 -575 9920
13393 9920 21359 19411 -607 -6217 -12156 -17732 -29182 -21838 -17847 -13321 -17637 -20001 -21388 -27626
13379b7626P393J1332J748k222N188L138O76L085N740j0946K867J0918k186r313
13365b08o152p600p751N38J3671j587K231Q9P52r551L462J0487k996k037L658
13350b994k284q15k549M00l311M160P949j0798q115j05P219M935J092j099o306
13335a2621j179l206J677k112k473P533m550m131k080J3236J4290J092q281n24
13321c329J894K875j093Q799n455m949k313o9Q057K362j904J818O89k721K225
13306F886Q65M246j2253r101M101o766p550m020M632j799J588M381J424O365R862
13291B861J753l400j583K309M269J0549j759q017p647J593p110p250N227M223
13277c982o256L348J3042j345p866j961K045N494k569K668m922m38j366L696J0290
$$ plain form
13379 -27626 -20233 -8901 -7153 -9375 -4187 -1049 -373 2712 8452 -2494 373 11291 9105 -208
13365 -208 -6360 -13960 -21711 -21173 -7502 -9089 -6858 -6769 -6017 -15568 -12106 -1619 -4615 -6652 -2994
13350 -2994 -5278 -6093 -8642 -8242 -11553 -7393 556 -10242 -18357 -18462 -11243 -6308 -5216 -6315 -12621
13335 -12621 -13800 -17006 -15329 -17441 -19914 -12381 -16931 -21062 -23142 -9906 4384 5476 -2805 -3329
13321 -3329 -1435 1440 347 9146 3691 -1258 -3571 -3640 4417 6779 4875 6693 7382 4661 6886
13306 6886 7751 11997 -256 -9357 -5256 -12022 -19572 -23592 -18960 -20759 -19171 -14790 -13366 -7001 2861
13291 2861 4614 1214 -369 1940 6209 16758 14999 6982 -665 928 -6182 -13432 -8205 -3982
13277 -3982 -10238 -6890 6152 4807 -3059 -5020 -2975 2519 -50 2618 -2304 -2742 -4108 -412 9878
13262I878P551L281q7k798Q91m948m771J918L559m726p23R377k467m918m196m244
13246B577o970L207r551j1222j167J473k118J0117P623K34j030N96J3449k957
13232D261q179k956O744Qj2198n516N232P700L894L122j785K233L4L790j0543
13217d159n714K972R462R020j966l922j637l000p11O201K780L783l35m456o501
13202A817n038O45L899M224k088l169J0253R33j1151j4282l02J2944L021J0653
13188A2359r150j0731p829J183Q708L935K012J4995J518l84o016o341p434L293
13174A18m452k417J651J2234O161l356n463R127N221m709n507N70L013R580l413
13159A8358j3730L435O173m974q840q674J2221M059k457j225M97o00p938j064
$$ plain form
13262 9878 17429 20710 20623 17825 18716 13768 8997 10915 14474 9748 9025 18402 15935 11017 6821 2577
13246 2577 -4393 -1186 -10737 -21959 -23126 -21653 -23771 -13654 -6031 -5797 -6827 -6231 7218 4261
13232 4261 -3918 -6874 -130 -122 -12320 -17836 -12604 -4904 -1010 2112 327 2560 2594 6384 -4159
13217 -4159 -9873 -6901 2561 11581 9615 5693 4056 1056 345 6546 9326 13109 12774 8318 1817
13202 1817 -3221 -2576 1323 5547 3459 290 10543 11476 325 -13957 -14259 -1315 1706 12359
13188 12359 3209 -7522 -15351 -14168 -5460 -1525 487 15482 17000 16616 10600 4259 -3175 118
13174 118 -4334 -6751 -5100 7134 13295 9939 4476 13603 18824 14115 8608 9178 12191 21771 18358
13159 18358 4628 8063 14236 9262 422 -8252 3969 8028 5571 4346 4843 4243 -3695 -4759
13145d759J994O385P037M608k09P092M380j4769j3469J876O230M880J90m775m214
13130B477o095Q76N909Q705Q941k992j1352l755q489J191R605o16o63k001l129
13115a388m398M501m76K819N756N615k597l373R099j345j499L939l218J422M492
13100A9349m176j04P972l56k983q924q215K942J3117J3876k3p199m441n174r630
13085F031J2673O903n935m393p774N634m231j1511J830J1400O940J223k427q25
13071A5538r176j751P2L35j2405L524J3705Q849j142K324o332k171o938q155P152
13056C429K987L204j0n287l035o114q090L517R187j03K672M316j0102j3918O234
13041a1113N465p32M295N947L284K639J208K358R912N249M449J853k303n477K42
$$ plain form
13145 -4759 -2765 3620 10657 15265 15056 22148 26528 11759 -1710 166 6396 11276 11466 6691 2477
13130 2477 -3618 -2742 3167 11872 20813 17821 6469 2714 -5775 -4584 5021 4405 3742 1741 -1388
13115 -1388 -5786 -1285 -1761 1058 6814 12429 9832 6459 15558 14213 12714 16653 13435 14857 19349
13100 19349 15173 15069 23041 22685 19702 10778 2563 5505 18622 32498 32475 25276 20835 15661 6031
13085 6031 18704 25607 19672 15279 7505 13139 8908 -2603 -773 10627 17567 18790 16363 15538
13071 15538 6362 4611 4683 5018 -7387 -3863 9842 18691 17549 19873 13541 11370 4432 -3723 3429
13056 3429 6416 9620 9610 4323 1288 -4826 -12916 -9399 -212 -315 2357 6673 -3429 -17347 -11113
13041 -11113 -5648 -6380 -2085 3862 7146 9785 10993 13351 23263 28512 32961 34814 32511 27034 27276
13026B7276l967l009n383k391J030j002j104n769J333P148m599q359o843J1619
13012E980N665l630N796Q56J565M296K860l649l769p335k335k120m06R520J1072
12997B4366o066j881N048l819J728p032l449l934n719J827P464m363n296K791
12983A665P305l477q393k04o150J160l630L948N304l904P565J7332n28j4672J177
12968D498j420O180K58l060m776l712P727J2925L251L805m751k376L662k285m180
12953A5746K080M178M184n928r064p294O394P6o051K39P312M019L403J1404L502
12938C4200j1443r85L640l200J223K251J504Q343n392r827p928m973p211O844
12924G046l97J1059K643k626j0917l931K810j986J1775R327J0352K793j842j3612
$$ plain form
13026 27276 23309 20300 14917 12526 13556 12554 11450 5681 7014 14162 9563 1204 -5639 5980
13012 5980 11645 8015 13811 14667 16232 20528 23388 19739 15970 8635 6300 4180 3774 13294 24366
12997 24366 18300 16419 21467 17648 19376 12344 8895 4961 -758 1069 8533 4170 -1126 1665
12983 1665 8970 5493 -2900 -3104 -9254 -8094 -11724 -7776 -2472 -6376 1189 18521 17993 3321 4498
12968 4498 3078 9258 9516 6456 1680 -2032 5695 18620 21871 25676 20925 18549 22211 19926 15746
12953 15746 17826 22004 26188 20260 11196 3902 10296 10372 4321 4560 11872 15891 19294 30698 34200
12938 34200 22757 21772 25412 22212 23435 25686 27190 35533 30141 20314 12386 7413 202 7046
12924 7046 6649 17708 20351 17725 6808 2877 5687 3701 15476 24803 35155 37948 36106 22494
12910B2494j4935P764J013r46Q255o790p232k385K504R341j591m070P232N777
12896B6431K730m899R696R967r076n355j0048k646J977k860Q732M35j4382p235
12882C467j1321J278J4788M625P177N191P33M663J471J056k387J2579R189r638
12868D2871r029q795q024m370j76j096n021m601P85L307P110N448Q934m536j2502
12853A0305O7L378O91k958k365L394J40L346K333m26R889L389k150p144j8328
12838C561n48J3392J275J0532M446o779j212K976k872j0218N326K18L517M955
12824B8569P194j0674n727N342Ml583j605O615J7244O085l574m157n434L096P0
12809C9465q174l301m464n700M314O425m608n903j353J042k614N164P447o251
$$ plain form
12910 22494 7559 15323 16336 15390 23645 16855 9623 7238 9742 19083 17492 13422 20654 26431
12896 26431 29161 24262 33958 43925 34849 29494 19446 16800 18777 15917 24649 25084 10702 3467
12882 3467 -7854 -6576 8212 12837 20014 25205 25938 30601 32072 33128 30741 43320 52509 42871
12868 42871 33842 25047 17023 12653 12477 11381 6360 1759 2544 5851 12961 18409 27343 22807 10305
12853 10305 10372 13750 14441 11483 9118 12512 12652 15998 18331 17905 27794 31183 29033 21889 3561
12838 3561 3013 16405 17680 28212 32658 25879 24667 27643 24771 14553 19879 20097 23614 28569
12824 28569 35763 25089 19362 24704 24708 21125 19520 26135 43379 49464 45890 41733 36299 39395 39465
12809 39465 31291 27990 23526 17826 22140 28565 23957 18054 16701 17743 15129 20293 27740 21489
12795B1489r155M198O537J81j242o56J2213J0151M723q098j2683R69j017j3079
12781A4531N13N781m357j615J0017M782M114N69N155L853M74k211R30P744L990
12766E4270O303k816j792o634J0395k370j0491j524l86l198J745N30l565r04l236
12751C6327j95P9N885j087j5766j354M923R80J1719R683j552j781J575l20o975
12736D2141K52M824r87k165Q27L058l112n41M059K509q17m417m541R143J9210
12721F9443R376m442p428j420p015n084P778L041P428k619l744j214o717K936
12707F0319L62l800o61l082R048N256n112r357k921n814L50P306N292N391K470
12692F5047k366o971q477l344L162J2391J2908n03p120o713L34P193J0874R26
$$ plain form
12795 21489 12334 16532 23069 23250 22008 21352 33565 43716 48439 40341 27658 28627 27610 14531
12781 14531 15044 20825 16468 14853 24870 29652 33766 34335 39490 43343 43817 41606 42536 50280 54270
12766 54270 60573 57757 55965 49331 59726 57356 46865 45341 44955 41757 43502 44032 40467 39563 36327
12751 36327 36132 36211 42096 41009 25243 23889 28812 29792 41511 51194 49642 47861 49436 49116 42141
12736 42141 42393 47217 46230 44065 44892 47950 44838 44297 48356 50865 50048 45631 41090 50233 69443
12721 69443 78819 74377 66949 65529 58514 53430 61208 64249 71677 69058 65314 64100 57383 60319
12707 60319 60681 56881 56220 53138 62186 67442 62330 52973 50052 44238 44588 51894 57186 62577 65047
12692 65047 62681 55710 47233 43889 47051 59442 72350 71847 64727 58014 58348 65541 76415 77341
12678G7341n037P017L338p059J249O059P49q440j1548k073J222M961K939M71N28
12663G1717K389O227k781n54N453m523o645o002O891L558O097M963j27J028l321
12648H4370O771M687m945j329m41J449R192m560L57m670n079k642Q22Q405P552
12633I9939R049M804N586J4457J4693R474L496K1963J9096M525P94J2050K3445
12620B43371J9175P553K8782K4367K6839L9587M7378M5337N2678P0904P2923O6785
12608G45679N7846M7236M5152L2013j009k0967l4381k6585k4200l5191l7256j9361
12596G28976k0077l0525j0753M66p09o907n886L451J4107K9331L4656M0256L1764
12583H08150L5240M1051L4044L6685L8542L4510K9472L0993K3660J6989J2745
$$ plain form
12678 77341 72304 79321 82659 75600 76849 82908 83657 75217 63669 61596 62818 67779 70718 71189 71717
12663 71717 74106 80333 77552 76998 82451 77928 71283 65281 72172 75730 81827 86790 86663 87691 84370
12648 84370 91141 95828 90883 89554 89113 90562 99754 95194 95551 90881 85802 83160 83982 92387 99939
12633 99939 108988 113792 119378 133835 148528 158002 161498 183461 202557 207082 207876 219926 243371
12620 243371 262546 270099 298881 323248 350087 389674 437052 482389 535067 605971 678894 745679
12608 745679 803525 850761 895913 927926 926917 905950 871569 844984 820784 785593 748337 728976
12596 728976 708899 678374 667621 668087 667378 660471 654585 658036 672143 701474 736130 776386 808150
12583 808150 843390 884441 918485 955170 993712 1028222 1057694 1088687 1112347 1129336 1142081
12572A142081J7952K6630J0008O585q974j8643j7417k5921m3372l2501j2837p910
12560A035681j5589k6452j9774k5915k5111j8078j2006o394l371j4420j8377n64
12548H49630O497R290O430K094J0247n888j6517k3124k7682k8385l4036l3049
12536G15507m1930n3010n1119n3335m4005m2589l7337k8189l4290k9375j3956
12525B86372j4789k3994l517j55p817r19n25p715j1513j4088j7627r308k389j0084
12511A61932k235M33p68j86j0457p845J883K883o339q703n931o395l149P381J1640
12496A34144J1480l499j3325k487j087l594j793J974K626O425J87n852m575k536
12482A18088k454j194Q159M293J557k546m355q18l592m578n060m655N415K517
$$ plain form
12572 1142081 1160033 1186663 1196671 1203256 1194282 1175639 1158222 1132301 1088929 1056428 1043591 1035681
12560 1035681 1020092 993640 973866 947951 922840 904762 892756 886362 882991 868571 850194 849630
12548 849630 856127 865417 871847 873941 884188 878300 861783 838659 810977 782592 748556 715507
12536 715507 673577 620567 569448 516113 472108 429519 392182 363993 329703 300328 286372
12525 286372 271583 247589 244072 243917 236100 235181 234656 226941 215428 201340 183713 174405 172016 161932
12511 161932 159697 160130 159362 159176 148719 140874 142757 145640 139301 130598 124667 118272 115123 122504 134144
12496 134144 145624 142125 128800 126313 125226 121632 119839 121813 124439 130864 131051 125199 120624 118088
12482 118088 115634 114440 122599 126892 128449 125903 121548 120730 117138 112560 107500 102845 108260 110777
12468A10777n704P625P530J280R161K192J153m810q183j52P177L245r799J74J253
12453A22919M136R321Q526K292l231k327m260q236L41N102J2563K977Q144Q085
12439A66352J2914N442L530M687M336K750J4542J4874M837K861M910m826M763
12426B41972N064M489J759J2318J486o594J176K259q34Q637R582R210N944J5088
12412C11556m690p95R732O378M371l013r451o77J9414J6624o864k830J9743J4055
12398C73553P16j0796M924p73p894L864O899P22n737L163Q966J0611O121P799
12384D02138j505r077k809j0169p463j1550j2206j707K983j888q878j2414m832
12371C20623q838k343r024j0808n880n358R63j636o196J449O178j27K204m178
$$ plain form
12468 110777 105073 112698 120228 121508 130669 132861 134014 129204 121021 120869 128046 131291 121492 121666 122919
12453 122919 127055 136376 144902 147194 143963 141636 137376 129140 129481 134583 147146 150123 158267 166352
12439 166352 179266 184708 188238 192925 197261 200011 214553 229427 234264 237125 242035 237209 241972
12426 241972 247036 251525 253284 265602 267088 260494 261670 263929 263095 271732 281314 290524 296468 311556
12412 311556 306866 306071 315803 322181 326552 323539 314088 313411 332825 349449 342585 339755 359498 373553
12398 373553 374269 363473 368397 367624 359730 363594 370493 371215 365478 368641 377607 388218 394339 402138
12384 402138 400633 391556 388747 378578 371115 359565 347359 345652 348635 346747 337869 325455 320623
12371 320623 311785 309442 300418 289610 283730 278372 279335 277699 271503 272952 279130 279003 281207 277029
12357B77029j375J702P44P043J1172j372P06o647l428J3519M909o130p442L01
12343B90731m481j3038j2600r255l976r755N256O449K023K709J0849J3933J6778
12330B95623J5590K2117K1681Q398K614J9966K0925L807M02Q332J6593K0018J7894
12317D73960J8492J3593Q034P849J3644J7910J4335J4346Q900J4214J0907O552
12305F22736N420L907J0606J2248O319J4283J7874J655P940J8703K3066J9071
12293G63828K7533K8604K9323J9901J3186J4408Q168P555P949K4641J6776J0110
12281I71982L233O091P399J9058K0029J7860O682J5216K0844L1269K6183L6311
12269A182157L3768L7450M1348L7804L0659L9152M0665L6248M6692M1002M4401
$$ plain form
12357 277029 275654 277356 278100 285143 296315 294943 295649 289002 285574 299093 304002 297872 290430 290731
12343 290731 286250 273212 260612 251357 247381 237626 242882 249331 251354 254063 264912 278845 295623
12330 295623 311213 333330 355011 363409 366023 385989 406914 410721 411123 419455 436048 456066 473960
12317 473960 492452 506045 514079 521928 535572 553482 567817 582163 591063 605277 616184 622736
12305 622736 628156 632063 642669 654917 661236 675519 693393 695048 702988 721691 744757 763828
12293 763828 791361 819965 849288 869189 882375 896783 904951 912506 920455 945096 961872 971982
12281 971982 975215 981306 988705 1007763 1027792 1045652 1052334 1067550 1088394 1119663 1145846 1182157
12269 1182157 1215925 1253375 1294723 1332527 1363186 1402338 1443003 1479251 1525943 1566945 1611346
12258A611346L3906L2910M1446K7778L6302M0535M4748M3198M6423N1981M7143
12247B057716M1081L7575N1599M9967O2679N8167N6173N1825O8230O6955P1920
12236B673887Q1252Q3517Q4979R8902J17594J26741J36006J62660J71552J78226
12226C915316J80172J94662K03853K35052K55344K63701K73941K86568K84269
12217F092878K88626K96689K97916L19995L50857L85841M43252M84440N22606
12208I483100N83853O23305O48364P08437P60395Q60439R79605J125872J280361
12199A7053731J441888J607839J785496J915722K054921K200790K379946K560845
12191C3001178K752848K996341L280551L625783M057202M659363N514975O705467
$$ plain form
12258 1611346 1645252 1678162 1719608 1747386 1783688 1824223 1868971 1912169 1958592 2010573 2057716
12247 2057716 2098797 2136372 2187971 2237938 2300617 2358784 2414957 2466782 2535012 2601967 2673887
12236 2673887 2755139 2838656 2923635 3022537 3140131 3266872 3402878 3565538 3737090 3915316
12226 3915316 4095488 4290150 4494003 4729055 4984399 5248100 5522041 5808609 6092878
12217 6092878 6381504 6678193 6976109 7296104 7646961 8032802 8476054 8960494 9483100
12208 9483100 10066953 10690258 11338622 12047059 12807454 13667893 14647498 15773370 17053731
12199 17053731 18495619 20103458 21888954 23804676 25859597 28060387 30440333 33001178
12191 33001178 35754026 38750367 42030918 45656701 49713903 54373266 59888241 66593708
12183F6593708Q199938R774250J1081559J1713822J1455849J0317023Q419709
12176A37555858N955634L092558K52367k042289l475218m162610m309751m019370
12168A28847179l389012k577621j769263j047767l51169L64844J101677J822962
12160A23001830K519259L193694L849625M425256M911958N234074N352741N259005
12152A57747442N010368M740606M497175M326463M290373M440971M749211N057229
12144A94859838N177910M954502M341206L418985K342595J080683n13497k416535
12136B13245687m390778o140276p357295p811778p455534o482060n122870l625075
12128A64860021k321298j444596j126041j282666j762351k295364k766357l107113
$$ plain form
12183 66593708 74793646 84567896 95649455 107363277 118819126 129136149 137555858
12176 137555858 143511492 146604050 146856417 144814128 141338910 137176300 132866549 128847179
12168 128847179 125458167 122880546 121111283 120063516 119712347 120077191 121178868 123001830
12160 123001830 125521089 128714783 132564408 136989664 141901622 147135696 152488437 157747442
12152 157747442 162757810 167498416 171995591 176322054 180612427 185053398 189802609 194859838
12144 194859838 200037748 204992250 209333456 212752441 215095036 216175719 215662222 213245687
12136 213245687 208854909 202714633 195357338 187545560 180090026 173607966 168485096 164860021
12128 164860021 162538723 161094127 159968086 158685420 156923069 154627705 151861348 148754235
12120A48754235l253334l209884l023390k732496k484139k390232k539406l019006
12112A26102348l726261m426866m962903n302491n586089n956918o482369o976530
12104H2681921p164089o988575o619565o096225n421650m642499l888630l247967
12096C8612721k728496k334229k041106j856227j733112j646867j599937j581771
12088B3090976j544793j479072j377074j281690j151994j003992q77085p61031
12080A3614245o61237n93885n42665m98810m70850m60531m64099m51423m16775
12071I053970l88710l30365k80348k16510j82052j59843j45287j62330j80346
12062G008179k08220k25051k43915k40950k17824k27946k20491k20676k11503
$$ plain form
12120 148754235 145500901 142291017 139267627 136535131 134050992 131660760 129121354 126102348
12112 126102348 122376087 117949221 112986318 107683827 102097738 96140820 89658451 82681921
12104 82681921 75517832 68529257 61909692 55813467 50391817 45749318 41860688 38612721
12096 38612721 35884225 33549996 31508890 29652663 27919551 26272684 24672747 23090976
12088 23090976 21546183 20067111 18690037 17408347 16256353 15252361 14375276 13614245
12080 13614245 12953008 12359123 11816458 11317648 10846798 10386267 9922168 9470745 9053970
12071 9053970 8665260 8334895 8054547 7838037 7655985 7496142 7350855 7188525 7008179
12062 7008179 6799959 6574908 6330993 6090043 5872219 5644273 5423782 5203106 4991603
12053D991603k07884k14851k12674k05350j99076j83509j64160j46601j34622
12044C322876j26925j24239j12783j04198q9468r8139r0569p2386p7987p1026
12034B355156o7867n8959p2003q3410o1822m8527m8228m1789m7271m2240k9097
12023A753943l1672l6506k2716k2457k7780l0758k7847k0687k3274k5316l3435
12012A451495k9348m0877l8367l5493k9676k2833k1404l3543l4835k1524k2546
12001A121049k2559k2052j3286k8932j7798j2208m765m240l688j0835r886l323
11989I67477l468j1171k4461p418J535m702j2659j4305j5914j3103j3381j3705
11977H34725k1921j8810j4705j8408p008k0408j9920j4582j1515k955J2436j0128
$$ plain form
12053 4991603 4783719 4568868 4356194 4150844 3951768 3768259 3604099 3457498 3322876
12044 3322876 3195951 3071712 2958929 2854731 2765263 2667124 2576555 2504169 2426182 2355156
12034 2355156 2287289 2228330 2156327 2072917 2011095 1962568 1914340 1872551 1825280 1783040 1753943
12023 1753943 1722271 1685765 1663049 1640592 1612812 1582054 1554207 1533520 1510246 1484930 1451495
12012 1451495 1422147 1381270 1342903 1307410 1277734 1254901 1233497 1199954 1165119 1143595 1121049
12001 1121049 1098490 1076438 1063152 1034220 1016422 1004214 999449 995209 991521 980686 970800 967477
11989 967477 964009 952838 928377 920959 922494 917792 905133 890828 874914 861811 848430 834725
11977 834725 812804 793994 779289 760881 753873 733465 713545 698963 687448 684493 696929 686801
11965F86801j7188q933O353P86O09j057k706n710p325j5041p366n666P43l037
11951F21263q807j3993o258K588k988o960p657j0597q105j0649j1967j6788m021
11938E15061o061p074j4830q435j351K25j3839j9390j5015p659o116q945j0091
11925C96480p946j0542r597Q582k665l240m896m465j0358j4050q106p521j1482
11912C10194j2538l471M512r958k5121q113r024m748j713m460o981k730m723o405
11898B14721K091K805L97K756l939L520M919J62n611k889p403R35J05K815j637
11883B13747p078J378M052Q049p614l490n304k218J642p069L834Q588L207J924
11869B13648n725N429J0543P409k682l386L308q288q793o089j1075m891k345N378
$$ plain form
11965 686801 669613 660680 667033 667819 668428 667371 664665 658955 651630 636589 629223 623557 624300 621263
11951 621263 612456 598463 592205 594793 591805 584845 577188 566591 558486 547837 535870 519082 515061
11938 515061 509000 501926 487096 478661 477310 477535 463696 444306 429291 421632 415516 406571 396480
11925 396480 388534 377992 368395 376977 374312 371072 366176 361711 351353 337303 329197 321676 310194
11912 310194 297656 294185 298697 288739 263618 255505 246481 241733 240020 235560 228579 225849 221126 214721
11898 214721 216812 219617 220014 222770 218831 222351 227270 227432 221821 218932 211529 212464 212569 215384 213747
11883 213747 206669 208047 212099 220148 212534 209044 203740 201522 203164 196095 199929 208517 211724 213648
11869 213648 207923 213352 223895 231304 228622 225236 228544 220256 211463 205374 194299 189408 187063 192441
11855A92441j243j503R510K989l04L014J5715Q671n280N74k27j863m868o078L54
11840B11902o293n006j3236j661l674k246R079n29o164k256K907J2523r65q575
11826A85806O541l001R84P156O364j1280p310J0382L616M684n496L776O987J066
11812B10275M837L419k88M21k168k720J136j1077k583p77j0096j1911O480j847
11798A83101j2789n627j3850q973K988k755K538R708p152j6131o539J1508R569
11785A45596K94r117p707P055J0777K262N697N262l702l366j503m752K769k584
11771A46981O828M810p632J575L069p940l193Q176J6653O322J4030J7655J2062
11758B19396K697P707J4322Q043J231L171K1001L0550J9455K8115L1709K4898
$$ plain form
11855 192441 191198 189695 199205 202194 201890 204904 220619 229290 224010 224584 224357 222494 217626 211548 211902
11840 211902 205609 200603 187367 185706 182032 179786 188865 188336 182172 179916 182823 195346 194381 185806
11826 185806 192347 189346 190330 197486 203850 192570 185260 195642 199258 203942 198446 202222 209209 210275
11812 210275 215112 218531 218243 218664 216496 213776 214912 203835 201252 200475 190379 178468 184948 183101
11798 183101 170312 164685 150835 141862 144850 142095 144633 154341 147189 131058 124519 136027 145596
11785 145596 145890 136773 129066 136121 146898 149160 154857 160119 156417 153051 151548 146796 149565 146981
11771 146981 153809 158619 150987 152562 155631 147691 144498 152674 169327 175649 189679 207334 219396
11758 219396 222093 229800 244122 252165 253396 256567 277568 308118 327573 355688 387397 412295
11746D12295K3318L9980M0317M6327M2614K8042L6655L3826K1801J0150M395K32
11734G39952j1086P73k521L989J2007j201n158J8076K5373L0055K3326K2981K1399
11721H77965R575J4642K1441K0487J9470J9153K2228K7654K1221J8456L1002K4365
11709A127659J2229K0185R651J2849N873P11j774n619j1123J766k5373j9930l2034
11696A095070m4230l4329l4067m1388l4510j9624k0773j5694m883k491j3092j5194
11684H14795o709p843j0243j2569k6156k4992k0065l2581l3044j6911r377k3036
11672E91269k5027l8369m1571k8982k1449l1169l5042k9941l3324j6311j3756
11661B76328q856r375l232j1603j6063j3969k0490j0686N31j2506j7019j2658
$$ plain form
11746 412295 435613 475593 515910 562237 604851 632893 669548 703374 725175 735325 739720 739952
11734 739952 728866 729639 727118 731107 743114 741913 736755 754831 780204 810259 833585 856566 877965
11721 877965 887540 902182 923623 944110 963580 982733 1004961 1032615 1053836 1072292 1103294 1127659
11709 1127659 1139888 1160073 1169724 1182573 1188446 1189157 1187383 1181764 1170641 1172407 1147034 1127104 1095070
11696 1095070 1050840 1016511 982444 941056 906546 886922 866149 850455 845572 843081 829989 814795
11684 814795 808086 800243 790000 777431 751275 726283 706218 673637 640593 623682 614305 591269
11672 591269 566242 527873 486302 457320 435871 404702 369660 339719 306395 290084 276328
11661 276328 267472 258097 254865 243262 227199 213230 192740 182054 182585 170079 153060 140402
11649A40402j2473m557j336M780o442m475j620l120j141j1426j5439n658n301
11636G2194n299K99N205p41n996p37K003J0004J795J63j5542o296K000n007m67
11621E3578j074L518P195O186k089L13k440k377J869l704J699n10o054r177o303
11606D0630N692k814m012k374N60Q760L215Q0q64r841r13M166n765k531j612j818
11590C0559O991Q644K332l535m178o44r955q956j032k500q170j898P433Q077K459
11575B5627M227j839K921M122j4n034L749j6J200P573m583o607m865l171j0378
11560A2912J036q450N355R947O128m655k872L782m376n189P481P73Q78o015p695
11545I040M460N155m919L405J0519L975L181m306O87j737M67J500K71j397p947
$$ plain form
11649 140402 127929 123372 122036 126816 120374 115899 114279 111159 110018 98592 83153 77495 72194
11636 72194 66895 67194 72399 71658 65662 64925 66928 76932 78727 78890 63348 57052 59052 54045 53578
11621 53578 52504 56022 63217 69403 67314 67627 65187 62810 64679 60975 62674 62164 56110 46933 40630
11606 40630 46322 43508 39496 37122 37682 46442 49657 49737 48873 39032 38119 42285 36520 33989 32377 30559
11590 30559 37550 46194 48526 44991 40813 40169 30214 21258 20226 17726 9556 7658 15091 23168 25627
11575 25627 29854 28015 30936 35058 35044 30010 33759 33743 34943 42516 37933 31326 26461 23290 12912
11560 12912 13948 5498 10853 20800 26928 22273 19401 23183 18807 13618 21099 21872 22750 16735 9040
11545 9040 13500 18655 13736 17141 27660 31635 34816 30510 31197 29460 29927 31427 31698 30301 22354
11530B2354o77q27r346K650P198O563N651n115m828l345r710j477K304J580L875
11515A6850n11j776M074P971j29K483J008q666q057q121O150O520j833r427M02
11500F938M594O271P36J0052J222p315N198p50j14j0647j3307k709R362L09p846
11485A994J5087l062o275Q182R480O598m633k2613k071J4287P82j2661J2948J0405
11471B8448o394l377o062k224M37L007l263o596l055l439M36o8m258k227R404
11456G69J2253P169J727l288l419J333J698n019j326P601N208r47j2209K215J1373
11441B5138J0817l259r578j846m169Q09q676p169R411N189j326J2822J4241L462
11427D5866k20J274k104n391k446M500J011p836p476p986j4159K941P684l871
$$ plain form
11530 22354 21677 20850 11504 14154 21352 27915 33566 28451 23623 20278 10568 9091 11395 12975 16850
11515 16850 16339 14563 18637 26608 26479 28962 29970 21304 13247 5126 11276 17796 15963 6536 6938
11500 6938 11532 17803 18539 28591 29813 22498 27696 26946 26832 16185 2878 169 9531 9840 1994
11485 1994 17081 14019 7744 15926 25406 32004 27371 4758 2687 16974 17756 5095 18043 28448
11471 28448 22054 18677 12615 10391 10828 13835 10572 3976 921 -2518 -2082 -2150 -6408 -8635 769
11456 769 13022 20191 21918 18630 15211 16544 18242 13223 11897 19498 24706 23759 11550 13765 25138
11441 25138 35955 32696 23118 21272 17103 17912 9236 2067 11478 16667 15341 28163 42404 45866
11427 45866 45646 46920 44816 39425 36979 41479 42490 34654 27178 19192 5033 7974 15658 11787
11413A1787j0268N426P201K313J3994k621j4466J824K296J513M451n553l52L629
11399B1174k942j2236J323m819m924q961J1189J2031q872j327N310J543j0175
11386a686J962M943M794P995k350m283l619J607k068l744L063P993l24j916r04
11371A1463L943j522M785L106P343K070m57J254j0255p568k992m098k708k572
11357A792N082P691k482K492M071j0449o015n517R74R152L838K975K377J616n260
11342A2337n787l175O126P873M57O550p85N454N67p960j2325r493O906J0674n575
11327A1844q553R561K621k729j354M107m936k58J1717Q279l818j8689N81K937
11313A1310p307J796L712J354j0395k731J252M412Q378n436J154l787J4529N692
$$ plain form
11413 11787 1519 6945 14146 16459 30453 27832 13366 15190 17486 18999 23450 17897 17545 21174
11399 21174 18232 5996 7319 2500 -2424 -11385 -196 11835 2963 1636 6946 8489 -1686
11386 -1686 276 5219 10013 18008 15658 11375 7756 9363 7295 3551 6614 14607 14283 12367 11463
11371 11463 15406 13884 18669 21775 29118 31188 30731 31985 21730 14162 11170 7072 4364 1792
11357 1792 6874 14565 12083 14575 18646 8197 2182 -3335 -2361 6791 10629 13604 15981 17597 12337
11342 12337 6550 3375 9501 17374 17831 24381 23596 29050 29617 21657 9332 -161 6745 17419 11844
11327 11844 3291 12852 15473 12744 11390 15497 10561 10303 22020 30299 26481 7792 8373 11310
11313 11310 4003 5799 9511 10865 470 -2261 -1009 3403 11781 6345 7499 3712 18241 23933
11299B3933J449l426q788l266k432o641M856J2858l13M783n63m386n121J48M288
11284A7379m729o526J495J946N256o992o234N898K0069K174l804k017n683p668
11270A0564R41m92O201K669m161n487L635m701m726j203j677m27m520P491L293
11255G400Q154R030k726m225r407r898N77P414L235o950J486j379l11M70M465
11240G335j21n390j0286J996L925j549p142j13J0359N45J624P827O670k93N101
11225B0488J3057L753n057o65l128p420j031N367n38m835j615P286r27n782M554
11210B3507O082k117o293l541M087J578Q304n812o193M515K784L379r082m830
11196A6368J656l659M121M338L695p15N645n642R380O237P363q87m020k940J0733
$$ plain form
11299 23933 25382 21956 13168 9902 7470 829 5685 18543 18230 23013 22450 18064 12943 13091 17379
11284 17379 12650 6124 7619 9565 14821 7829 1595 7493 27562 29736 25932 23915 18232 10564
11270 10564 11505 11013 17214 19883 15722 10235 13870 9169 4443 3240 1563 1136 -3384 4107 7400
11255 7400 15554 24584 21858 17633 8226 -1672 -1095 6319 9554 2604 4090 2711 2400 2870 7335
11240 7335 7214 1824 -8462 -6466 -2541 -4090 -11232 -11345 -986 -441 1183 9010 15680 15387 20488
11225 20488 33545 37298 32241 31576 28448 21028 19997 25364 24826 19991 18376 25662 24735 18953 23507
11210 23507 29589 27472 21179 17638 21725 23303 31607 25795 19602 24117 26901 30280 21198 16368
11196 16368 18024 14365 18486 22824 26519 25804 31449 25807 35187 41424 48787 47900 43880 40940 51673
11181E1673L229j751M706J0767J2143J0577m759N36Q359K842R888O122m291K982
11167A13023K40J2837K2778J6768J1002L0707J5575J3969J9612J6239J1403J5546
11155B99699J3543J0268J8797L2808L9929L1646M3521M7179M6878L9326M0216
11144F63810M1907L3685M4989M6120M5712M2186L7101L1963K1327J4072J7220
11133A040092R043N186J152m64K122O555K0119K9983K7243J6641L1102L4645M1888
11120A265307M4832K8545L2825M8370M8602L3602J5982Q891J4352r227p045k7295
11108A497741l2746k7801n1838m1907m2340l1675j4764k0236k8798k3667k2055
11097A159914l0199k6537k7713k7838k8071k1516j7331k0890k433p321o992j4600
$$ plain form
11181 51673 54902 53151 57857 68624 80767 91344 86585 87121 95480 98322 108210 114332 110041 113023
11167 113023 113263 126100 148878 165646 176648 207355 222930 236899 256511 272750 284153 299699
11155 299699 313242 323510 342307 375115 415044 446690 490211 537390 584268 623594 663810
11144 663810 705717 739402 784391 830511 876223 918409 955510 987473 1008800 1022872 1040092
11133 1040092 1049135 1054321 1055473 1055009 1057131 1063686 1083805 1113788 1141031 1157672 1188774 1223419 1265307
11120 1265307 1310139 1338684 1371509 1419879 1468481 1502083 1518065 1526956 1541308 1532081 1525036 1497741
11108 1497741 1464995 1437194 1385356 1343449 1301109 1269434 1254670 1234434 1205636 1181969 1159914
11097 1159914 1129715 1103178 1075465 1047627 1019556 998040 980709 959819 957386 950065 943073 928473
11085I28473j9678n493l585J969O086j3026k9973k6402k1835l7181m2888m9074
11073F87393n9809n7372m9349n2535m3328l4461m4391k6725j9438k2013l4768
11062B43204k7848q505q123j9709r890r250o401p404p939n802j5472m168l39o830
11048A05524j7248n958l51o608J95l675q041j2733m833J322j179p685J318J2047
11034E2095M795j0681m808L639M264k752L88P5o926o88L754n127Q81k373j0531
11019B6005r031j249Q327R77n120j587L698n183K536J77n428P34M492o894K450
11004A4904M71J184Q469l86j957R513j140k368M394m58j1854l889M203n802o168
10989I116L411L0j0677j832M806L955J324R058P933r65j344N928M415q563r298
$$ plain form
11085 928473 908795 903302 899717 901686 907772 894746 864773 838371 816536 779355 736467 687393
11073 687393 627584 570212 520863 468328 425000 390539 346148 319423 299985 277972 243204
11062 243204 215356 206851 198728 179019 169129 159879 153478 146074 138135 132333 116861 112693 112354 105524
11048 105524 88276 82318 81967 75359 75554 71879 63838 51105 46272 47594 46415 38730 40048 52095
11034 52095 56890 46209 41401 45040 49304 46552 46940 47015 40089 39401 43155 38028 38909 36536 26005
11019 26005 16974 15725 24052 25029 19909 18322 22020 16837 19373 19550 14122 14856 19348 12454 14904
11004 14904 15375 16559 25028 24642 22685 32198 31058 28690 33084 32626 20772 16883 21086 15284 9116
10989 9116 12527 12557 1880 48 4854 8809 10133 19191 27124 26159 24815 30743 35158 26595 17297
10974A7297L19l192K109M159R515n539j6424o132L095O871J427K082K366O020
10960B3973n010r275L150J634j011P098m288r747l818m434O294Q017L516k735
10946A3364m617l403k338J5478O458k286r153Q79q96j531j109L225R069K37j064
10931B2313L715j183j0620n578M035l07J903r64o026o645k471m082m240R717P872
10916G439R99N408P913L376p708K252K519R89j0972j1099k819J248J144O747q633
10901a197Q852Q837j456l628m855n388r89J1507J0303n46j4876l265P363J5303
10887B5965m292j2092n420r6J687j297L713o44k069o035L684M417l420L512Q310
10872A5923j019n388o293l370j851R011K697N186j840j365K441o555J423N543
$$ plain form
10974 17297 17616 14424 16533 20692 30207 24668 8244 2112 5207 12078 13505 15587 17953 23973
10960 23973 18963 9688 12838 14472 13461 20559 16271 6524 2706 -1728 4566 12583 16099 13364
10946 13364 8747 5344 3006 18484 24942 22656 13503 14382 13486 11955 10846 14071 23140 23377 22313
10931 22313 26028 24845 14225 8647 12682 12375 14278 13314 7288 643 -1828 -5910 -10150 -433 7439
10916 7439 8438 13846 21759 25135 17427 19679 22198 23187 12215 1116 -1703 -455 689 7436 -1197
10901 -1197 7655 16492 15036 11408 6553 1165 176 11683 21986 21440 6564 3299 10662 25965
10887 25965 21673 9581 4161 4065 5752 4455 8168 7524 5455 -580 3104 7521 4101 7613 15923
10872 15923 14904 9516 3223 -147 -1998 7013 9710 14896 13056 11691 14132 7577 9000 14543
10858A4543J542O636k906M908N626l619n601l646j458m970p507Q834L828q021
10844H189O683o081j2885M742J4162J0719M923n044N054k045k745l856Q619k755
10830B7680o478n271l69k898n11L323o816M358N213K542J717L211n515k713r166
10815H307l094M819P02m487p205j909p84O986M698O179L828m849j575O456L280
10800B1352j1184m801O765K418r2l005M770K369k791M575l786q043M02P696N704
10785B2349q658n898K548O020K088N686p81m344m242m622N006M677Q29k139J244
10770A9763L188k14o064n005n512m490o413N11O404L49j603K906o597M07K106
10755b64Q402l76Q272n792k325N214R087p594k340L682L97k916J318P498n96m099
$$ plain form
10858 14543 16085 22721 19815 24723 30349 26730 21129 17483 16025 11055 3548 12382 16210 8189
10844 8189 14872 8791 -4094 648 14810 25529 30452 25408 30462 28417 25672 21816 30435 27680
10830 27680 21202 15931 15562 12664 12153 15476 8660 13018 18231 20773 22490 25701 20186 17473 8307
10815 8307 5213 10032 10734 6247 -958 -2867 -3651 3335 8033 14212 18040 13191 11616 18072 21352
10800 21352 10168 5367 12132 14550 14458 11453 16223 18592 15801 20376 16590 8547 8949 16645 22349
10785 22349 13691 7793 10341 16361 18449 24135 23354 19010 14768 10146 15152 19829 20658 18519 19763
10770 19763 22951 22737 16673 11668 6156 1666 -4747 -4236 2168 2517 914 3820 -2777 -2370 -264
10755 -264 8138 7762 16034 10242 7917 13131 22218 14624 12284 15966 16363 13447 14765 22263 21667 17568
10739A7568n81o37k340K683J0505P446M68N432n10n635N988P670k400q777j158
10724C5722O48n127k086m981j3330j91M183N806j5Q46j4674n019J1066P640J376
10709B1864N163J419q31k436M25o243J650J956o828L174P606o0j0370P667P0j039
10693B3187Q226P624K821j0755l570O512M266n396n415n597P73M659O736p391
10679B6680o883n408O792J0329R78k580O125O277q008j942r131r242J742M111
10665A9840M666l732K703l355L046K54o307j193O34m579o381J449J9617K1173
10651D7835p953k07M190p201j0231K989J2776R244k523k186K271j65o400n925
10637C6514k655m769l521o563M828N421N40m996j162l993K919o67J339M466M043
$$ plain form
10739 17568 16987 16350 14010 16693 27198 34644 35112 40544 40034 34399 40387 48057 45657 36880 35722
10724 35722 36370 31243 29157 24176 10846 10655 14838 20644 20629 21475 6801 1782 12848 20488 21864
10709 21864 27027 28446 27615 25179 25604 19361 21011 22967 16139 19313 26919 26859 16489 24156 24226 23187
10693 23187 31413 39037 41858 31103 27533 34045 38311 32915 27500 21903 22676 27335 34071 26680
10679 26680 19797 14389 21181 31510 32488 29908 36033 42310 34302 32360 23229 13987 15729 19840
10665 19840 24506 20774 23477 20122 23168 23422 17115 15922 16556 11977 5596 7045 26662 47835
10651 47835 39882 39675 43865 36664 26433 29422 42198 51442 48919 46733 49004 48839 42439 36514
10637 36514 33859 29090 25569 19006 23834 29255 29795 24799 23637 19644 22563 21896 23235 27701 31744
10622C1744P10o000M175L320j212o769q801M202j724k576r33J497k465K453R762
10607B7383O768L552Q281Q78k383O26o597k266M366N464P5k967p330l463K607
10592C4994m650p526L754P00l87K138J559K785n55j4357O252J92k681L14K520
10577B5052k520q94p698P045P308J469K959J114k821Q797N950p157n588o409J958
10562B8565N335O061J2986Q499j719j153q408K15L072o515m690K984N535J067
10548E1834j973Q391p070n019k743q101m647J064o336m173K083O757N340N482
10534D0889o72o122k684j518L606j22M477J910o21M734L78p90r578O039M613l99
10518D4140m95J659K58Q19M509L196r56o247M703K944m45l981m620K070N719J1817
$$ plain form
10622 31744 32454 26454 30629 33949 32737 25968 17167 21369 19645 17069 16136 17633 15168 17621 27383
10607 27383 34151 37703 45984 46862 44479 45105 38508 36242 40608 46072 46147 43180 35850 32387 34994
10592 34994 30344 22818 26572 27272 26885 29023 30582 33367 32812 18455 24707 24899 22218 22532 25052
10577 25052 22532 21638 13940 20985 28293 29762 32721 33835 31014 39811 45761 38604 33016 26607 28565
10562 28565 33900 39961 52947 61446 59727 58574 50166 50381 53453 46938 42248 45232 50767 51834
10548 51834 49861 58252 51182 46163 43420 35319 30672 31736 25400 21227 23310 30067 35407 40889
10534 40889 40217 34095 31411 29893 33499 33377 37854 39764 39143 43877 44255 43465 33887 39926 44539 44140
10518 44140 43645 45304 45562 46381 50890 54086 53130 46883 51586 54530 54085 50104 45484 47554 53273 65090
10502F5090l748j1346p873M2M296L846J913R781N1l75P4r323K230P488M514p314
10486E9346N10K885M998k788l268j880M724J1505K736l791P273J0620m174j3113
10472G5583N329K3735N561m632l989J3096l133n536j1587n616N170q169p443l013
10458G5356J392N317K813J2930J1137m147l640j131L082M632P054j221M661M933
10444A23168P972O148Q703l870m235K644q875m671p88J156k968j8L94K349N233
10429A32342n634j245q074m916j4489m773r5p204K520J558Q537k725m761J1265
10415A02306L307j700R826L753j6m007j216M957l856m206j362k386Q294P118J53
10400A20965L9j1530r67L092j305M963k057o836j1322K277q021l174j861n192
$$ plain form
10502 65090 61342 49996 42123 42165 46461 50307 52220 62001 62052 61677 61751 52428 54658 62146 66660 59346
10486 59346 59856 62741 67739 64951 61683 59803 64527 76032 78768 74977 82250 92870 88696 75583
10472 75583 80912 104647 110208 105576 101587 114683 111550 106014 94427 88811 93981 85812 78369 75356
10458 75356 76748 82065 84878 97808 108945 104798 101158 100027 103109 107741 114795 113574 118235 123168
10444 123168 131140 137288 145991 142121 137886 140530 131655 126984 126196 127352 124384 124366 124760 127109 132342
10429 132342 126708 125463 117389 112473 97984 93211 93116 85912 88432 89990 98527 95802 91041 102306
10415 102306 105613 103913 113739 117492 117476 113469 112253 117210 113354 109148 107786 105400 113694 120812 120965
10400 120965 121004 109474 108507 111599 110294 115257 113200 106364 95042 97319 89298 86124 84263 79071
10386G9071n525R97O978p54q858R98J3667J4888j70o52l390k76J3779J4324J0931
10371A36008j0121n96M369l062L964j230j1020j0820m287n636R338O724N762K301
10357A21694m720q165N960M584j888J1665Q827K53N009K400j075L377J6428J0926
10343A75275K644J3659K6322J9297J8420N246J4710L0164L1546M7522N8209Q0016
10331E23030J01940J26634J59184J75474J70538J77837J50429J13878O9970K4890
10321A793804m3742r6088j42499j71910j83362j73559j57222j56642j37794j08016
10311D22970p4330n5784l4171l6438k1500j1206Q22j298r364m831l52p741p623
10298A59154l081j2245K733L534l617K465Q986p05k977j1166q485k0068j327Q697
$$ plain form
10386 79071 73546 74543 81521 80767 71909 72907 86574 101462 101292 100640 97250 96974 110753 125077 136008
10371 136008 125887 125291 129660 126598 130562 129332 118312 107492 103205 97569 106907 113631 119393 121694
10357 121694 116974 108809 114769 119353 117465 129130 137957 138210 143219 145619 144544 147921 164349 175275
10343 175275 177919 191578 217900 237197 255617 260863 275573 305737 337283 384805 443014 523030
10331 523030 624970 751604 910788 1086262 1256800 1434637 1585066 1698944 1768914 1793804
10321 1793804 1750062 1653974 1511475 1339565 1156203 982644 825422 668780 530986 422970
10311 422970 348640 292856 258685 222247 200747 189541 190363 189065 179701 174870 174518 166777 159154
10298 159154 156073 143828 146561 150095 146478 148943 157929 157224 154247 143081 134596 114528 113201 121898
10284A21898Q068K720r802K465m45L428J025j267L764R317L695l066k996p01P076
10269A45179p314o305Q031l063K72K514J0510Q393j1652k832k303J383R854l635
10255A49032n817L214J0482j079l894P794L167j779q026m204J1573K105o395N354
10241A61527P163m005J323Q642J697M999l748J99L993L616p940j687Q464J731
10227A85974O503J104R3N767L892l617M566M928M023P259n641q837p778K719O075
10212B07030L638l45M784J1283P224J443m822m784O715J1784L796K328Q28K283
10198B53185J1621P489r09o194j295K214o281k918q81M168O335l409R03R907O043
10183B79978O810J8268P8r639N168J4217L585P43k38o049r48l274P858J0364J521
$$ plain form
10284 121898 129966 132686 122884 125349 124904 128332 129357 128090 131854 141171 144866 141800 138804 138103 145179
10269 145179 137865 131560 139591 136528 136800 139314 149824 158217 146565 143733 141430 142813 152667 149032
10255 149032 143215 146429 156911 155832 151938 159732 162899 161120 153094 148890 160463 162568 156173 161527
10241 161527 168690 164685 166008 174650 176347 181346 177598 177797 181790 185406 177466 175779 184243 185974
10227 185974 192477 193581 193674 199441 203333 199716 204282 209210 213233 220492 214851 206014 198236 200955 207030
10212 207030 210668 210323 215107 226390 233614 235057 230235 225451 232166 243950 247746 250074 250902 253185
10198 253185 264806 272295 271386 265192 263897 266111 259830 256912 256031 260199 266534 263125 264028 273935 279978
10183 279978 286788 305056 305134 295495 300663 314880 318465 319208 318970 312921 311973 308699 316557 326921 328442
10168C28442M781L7O089K837N434Q101N440R261j0645Q320Q711j0878M385L443
10154C73758L795j102J470L990R18J2007L389k825K498R053M767r28o773J0433
10140D14450P0M040J0404L82J137N650j198j0113l784J86K711Q850J1683k597
10126D41871N515K841J443j762Q842J373O333o23l557J125K228l50Q5N277L71
10111D71012J2632l444j1429O02P88o131L177l59J921P826L45p845r311j2375
10097D47409M334J111o682p798Q924O341m439j4079m357K23K949l551k274L087
10083D31198M67l823J2258k423j0924j4716q937o972r920o297m3k358Q342P344
10069C93196Q908K552p858O41r44j287o136q426L937J418K252L441k740n813j2399
$$ plain form
10168 328442 333223 333260 339349 342186 347620 355721 361161 370422 359777 368097 376808 365930 370315 373758
10154 373758 377553 376451 377921 381911 382829 394836 398225 395400 397898 406951 411718 410790 404017 414450
10140 414450 414520 418560 428964 429346 430483 436133 434935 424822 421038 421224 423935 432785 444468 441871
10126 441871 447386 450227 451670 449908 458750 460123 466456 465833 462276 463401 465629 465279 465364 470641 471012
10111 471012 483644 480200 468771 469373 470161 464030 467207 466848 468769 476595 476940 469095 459784 447409
10097 447409 451743 452854 446172 438374 447298 453639 449200 435121 430764 430987 433936 430385 428111 431198
10083 431198 431665 427842 440100 437677 426753 412037 403100 396128 386208 379911 379868 377510 385852 393196
10069 393196 402104 404656 396798 397439 396495 395208 389072 380646 384583 386001 388253 391694 388954 383141 370742
10054C70742j0267J827O14q019K927K539p256j1781m412j0149o324k767J9459
10041C37133O311m9K832j4151q436J640L860j003P925O300J6384K1383J1593R669
10027D01391l030k6109k8024j1079j9553k6208j1672J448n491O350l360o334r515
10014B58814K037P137N389p201j1738p494M157M114j1241j4126o874J1052N055
10001B39081J445m468n891p484k206P984n895L09m596q597l583R93M511r89j1694
9986A98920j6650j829N525L211K142j515l820J972N486J800l637j1449K280N461
9972A87897J200m210j3570j1997q65K456O563j05r28M792O122J0168j0577k303
9958A74643K130o127m950N80L130Q696p974l801J73o892j013K591k878J073J2224
$$ plain form
10054 370742 360475 362302 362916 354897 357824 360363 353107 341326 336914 326765 320441 317674 337133
10041 337133 343444 343395 346227 332076 323640 325280 329140 328137 336062 342362 358746 380129 391722 401391
10027 401391 398361 372252 344228 333149 313596 287388 275716 277164 271673 278023 274663 268329 258814
10014 258814 260851 267988 273377 266176 254438 246944 251101 255215 243974 229848 222974 234026 239081
10001 239081 240526 236058 230167 222683 220477 228461 222566 222875 218279 209682 206099 207092 211603 210614 198920
9986 198920 182270 180441 185966 189177 191319 189804 185984 187956 193442 195242 191605 180156 182436 187897
9972 187897 189097 184887 171317 159320 158455 160911 167474 167369 166441 171233 177355 187523 176946 174643
9958 174643 176773 170646 165696 166276 169406 178102 170128 166327 166500 159608 158595 161186 158308 159381 171605
9943A71605M416j3310j5171k06j569R84J355r519j1942k432L464O494P072J185
9929A42426n141j0232j326J0218Q176j0433j709M73P982O557J916J784r51M395
9915A54135l834j0863m613J827L090l768P624n845m716M187o348l499l253J926
9901A26050j0843K261j146K305k428l731j825k070L910P029K843J0473N436O56
9887A38920l124l828J5632J2766n321r19K636n549p359j534p349p693Q056K480
9873A37814N216P789K1556J0652p11q679j3034n862j0643p121j2339n06K129q661
9859A17600r607p643M353J5501R449k11m545k571p868o253n530M303Q652m5O395
9844A21980P947L422m504j1041p446n56j631K694l613n753Q932Q901M785n119
$$ plain form
9943 171605 176021 162711 147540 147334 145765 146749 148104 138585 126643 124211 127675 134169 141241 142426
9929 142426 137285 127053 125727 135945 144121 133688 131979 132452 140434 146991 148907 150691 149740 154135
9915 154135 150301 139438 134825 136652 139742 135974 143598 137753 133037 137224 130876 127377 124124 126050
9901 126050 115207 117468 116322 118627 116199 112468 110643 108573 112483 119512 122355 132828 138264 138920
9887 138920 135796 131968 147600 160366 155045 154126 156762 151213 143854 142320 134971 127278 135334 137814
9873 137814 143030 150819 172375 183027 182316 173637 160603 154741 144098 136977 124638 124132 126261 117600
9859 117600 107993 100350 104703 120204 129653 129442 124897 122326 114458 108205 102675 106978 115630 115585 121980
9844 121980 129927 133349 128845 117804 110358 109802 108171 110865 107252 101499 110431 119332 124117 118998
9830A18998j0727q247O21M655M978k068j206j226N812N287n07L68k575k295p107
9815A04761L891L508K174K242P157Q876j1489j8596j0755M332J0578L154j1686
9802I8147N615O593r32o80J390O018J3476R849k853n119J292K772J272l663j0627
9787A22550l650J044P490o909L142N198N274R036M955Q61n302n031J132K400K516
9772A44706r980q843J947p501k107L882P468N320m014j4161N564J1459M667J306
9758A39713M99j4813m37L571l104P069o17m84j5051k020R930J1687J348q233m612
9743A24446n010m077M231M965m458N019J2n150N408l868j0919N693n32P452J183
9728A24395K145J0065J6565K94K589k666r665j0264M10P7L52m702K302j660q327
$$ plain form
9830 118998 108271 100024 100645 105300 110278 108210 107004 105778 111590 116877 116370 116738 114163 111868 104761
9815 104761 108652 112160 114334 116576 123733 132609 121120 102524 91769 96101 106679 109833 98147
9802 98147 103762 110355 109423 108743 110133 116151 129627 139476 136623 131504 132796 135568 136840 133177 122550
9787 122550 118900 119944 127434 120525 123667 128865 134139 143175 148130 148991 143689 138658 139790 142190 144706
9772 144706 134726 125883 127830 120329 118222 122104 129572 134892 130878 116717 122281 133740 138407 139713
9758 139713 140212 125399 124962 128533 125429 132498 131881 131397 116346 114326 124256 135943 137291 129058 124446
9743 124446 119436 115359 119590 124555 120097 125116 125128 119978 125386 121518 110599 116292 115760 123212 124395
9728 124395 126540 136605 153170 153464 156053 153387 143722 133458 133868 133945 134297 129595 131897 130237 121910
9713A21910Q055R629j601n053L406P491N361n237m761K32O385J929L399J195q96
9698A51444j687l659K549p117j4871n637O539J5768J7189j0773l835l327L748
9685A46331M631j313l640P603J090M588L446k256Q21J655J4399J0563r087j3462
9671A65369L754J8695J2910J5222M978L488K268J3323J4496R624k694l909k349
9658B55175M15r035j1862o907N342J0817J508Q943r31L07j2839j2501M786J3675
9644B46893J0756M287J8904J7134N864J5028J3985P795J616K475J084J6991K6479
9631C89291J9303J4422J0580N154O835O608N625O506R743k066N62P454l294j0045
9617D66678j2855l383Q155N563J0516J3094R833J4296J8240J1834j178J1560P847
$$ plain form
9713 121910 129965 139594 137993 132940 136346 143837 149198 143961 139200 139432 145817 147746 151145 152340 151444
9698 151444 149757 146098 148647 141530 126659 121022 127561 143329 160518 149745 145910 142583 146331
9685 146331 150962 149649 146009 153612 154702 159290 162736 160480 161301 162956 177355 187918 178831 165369
9671 165369 169123 187818 200728 215950 220928 224416 226684 240007 254503 264127 261433 257524 255175
9658 255175 255590 246555 234693 227786 233128 243945 245453 254396 253465 253772 240933 228432 233218 246893
9644 246893 257649 261936 280840 297974 303838 318866 332851 340646 342262 344737 345821 362812 389291
9631 389291 408594 423016 433596 438750 445585 452193 457818 464324 474067 472001 472563 480017 476723 466678
9617 466678 453823 450440 458595 464158 474674 487768 497601 511897 530137 541971 540793 552353 560200
9604E60200J0670J9202J9026J3287K3283J9970K2252K7722K6402K5667L7781M0577
9592H46039M0063M6632L4399K7647K0183J0983J3302q296j1826j6700q057k439
9580I91930j4561j2732k0369j4484m76p087k1415j14J0083J1502J3585J4679J9059
9567I69600J7721J0633K6530K4089J8396J6662J7737J8960J7966J3257J8923K1860
9555A192334K6442K8710K4967O419R527j0062j6424j1252k2997k6609k2841j4130
9543A164084j2548q435j0191o900k0358j4407p448j0086p741o119n894j4702k1909
9530A017346j9560k1332q119j7301j2156j1586n07M951N140R520J4390J0367P804
9517I78957m388j0954P70P330K138o709o669j2938k7030k6219l1642l2631l6506
$$ plain form
9604 560200 570870 590072 609098 622385 645668 665638 687890 715612 742014 767681 805462 846039
9592 846039 886102 932734 967133 994780 1014963 1025946 1039248 1030952 1019126 1002426 994369 991930
9580 991930 977369 964637 944268 929784 929308 922221 900806 900692 910775 922277 935862 950541 969600
9567 969600 987321 997954 1024484 1048573 1066969 1083631 1101368 1120328 1138294 1151551 1170474 1192334
9555 1192334 1218776 1247486 1272453 1278872 1288399 1278337 1261913 1250661 1227664 1201055 1178214 1164084
9543 1164084 1151536 1143101 1132910 1126010 1105652 1091245 1083797 1073711 1065970 1059851 1053957 1039255 1017346
9530 1017346 997786 976454 968335 951034 938878 927292 926785 931736 936876 946396 960786 971153 978957
9517 978957 974569 963615 964385 971715 973853 967144 960475 947537 920507 894288 862646 830015 793509
9504G93509k9660l8385l9711l1266k3518k1266j8119j1088q285j2645j6598j4220
9492E28748j0223j7526j9178p853l838j0185o205j2746q449j7127p389j83M65
9479D08311M162j5q552n086K303R30M233J0194j481m736q587j4157r580j1306
9465C66633m893j3356o655J025n023q712J7999M144j0458L441R68M184L469Q539
9451C61305j958P816O105M100k285Q389J6052P354O980k535J3597n7J4363J6426
9437D55652J2753J3868K0325J2637j3L468J702J4444J3176P334J3301J094K286
9424E72027P034N525K299n059k861P539J0924O822N905L226L063J0923P086m429
9410F30024m868o735Q72M486l328j295q459p586M114m651r648r892r158n136n550
$$ plain form
9504 793509 763849 725464 685753 654487 630969 609703 591584 580496 572211 559566 542968 528748
9492 528748 518525 500999 481821 473968 470130 459945 453740 440994 432545 415418 408029 407846 408311
9479 408311 412473 412458 403906 398820 401123 402053 406286 416480 414999 410263 401676 387519 377939 366633
9465 366633 361740 348384 341729 342754 337731 329019 347018 351162 340704 344145 345113 349297 352766 361305
9451 361305 359347 367163 373268 377368 375083 383472 399524 406878 413858 411323 424920 424863 439226 455652
9437 455652 468405 482273 502598 515235 515222 518690 520392 534836 548012 555346 568647 569741 572027
9424 572027 579061 584586 586885 581826 578965 586504 597428 604250 610155 613381 616444 627367 634453 630024
9410 630024 625156 618421 619293 623779 620451 619156 610697 603111 607225 602574 592926 583034 573876 568740 563190
9395E63190m266O237J744r21M442J3154J1442j078o107J2241R199k2678k0302
9382E66297K364K011p543j9240k9763k4498j9052j5249n505r589k1688j2799o133
9369C99613r017q385q334M560K192j3624p770O198Q520K84j3731P48p033K23P231
9354C61675J0252J0079o969l21J0438K892k435L871Q743J3115J6225Q169J6199
9341D51933K4531K6063J9392L0401L2853J8597J8112K6065K2526L1658K2001J1573
9329G35705J0712J9687J3425J9546K5813J3625J2073K0747L4386L9404L8670K9930
9317A013723L7779L8314L3655K9866L1958K5799L8732M2138L4191K6091L4343
9306A386589K6914K9897L6531L4025L4560K9726L4904M2499M5565M9844O9607
$$ plain form
9395 563190 558924 565161 566905 565984 570426 583580 595022 593944 587837 600078 609277 586599 566297
9382 566297 568661 570672 563129 543889 514126 489628 470576 455327 449822 440233 418545 405746 399613
9369 399613 390596 382211 373877 378437 380629 367005 359235 365433 373953 374237 360506 361254 354221 354444 361675
9354 361675 371927 382006 375037 374716 385154 388046 385611 389482 398225 411340 427565 435734 451933
9341 451933 476464 502527 521919 552320 585173 603770 621882 647947 670473 702131 724132 735705
9329 735705 746417 766104 779529 799075 824888 838513 850586 871333 905719 945123 983793 1013723
9317 1013723 1051502 1089816 1123471 1153337 1185295 1211094 1249826 1291964 1326155 1352246 1386589
9306 1386589 1413503 1443400 1479931 1513956 1548516 1578242 1613146 1655645 1701210 1751054 1820661
9295A820661P0190P6063Q6473R9140J02210J02651J11794J18765J11577Q8446
9285B787970O1656M4371K7330K184j662j379n497o839m685J8422N0164P5930R8743
9272C146708J21601J42880J62025J89275J94890K12972K29499K55101K92017L44612
9262E291580L97655M32466M17101L51072K53926J47737P0460L6578K6511L1829
9252G456915P3727J33730J85383J84555J67634J40179Q8785O6509O8109O9418
9242H634944Q7248J22614J98186K67249L36132M06876M85552N35339N86777O25413
9232A2286330O38306O53725O49197O44109O46485O60789O79711P22945P86223
9223A8367820Q66086R34207R96426J060248J141551J233692J290070J312097J314953
$$ plain form
9295 1820661 1890851 1966914 2053387 2152527 2254737 2357388 2469182 2587947 2699524 2787970
9285 2787970 2849626 2893997 2921327 2923511 2921849 2920470 2914973 2908134 2903449 2921871 2972035 3047965 3146708
9272 3146708 3268309 3411189 3573214 3762489 3957379 4170351 4399850 4654951 4946968 5291580
9262 5291580 5689235 6121701 6538802 6889874 7143800 7291537 7361997 7398575 7425086 7456915
9252 7456915 7530642 7664372 7849755 8034310 8201944 8342123 8430908 8497417 8565526 8634944
9242 8634944 8722192 8844806 9042992 9310241 9646373 10053249 10538801 11074140 11660917 12286330
9232 12286330 12924636 13578361 14227558 14871667 15518152 16178941 16858652 17581597 18367820
9223 18367820 19233906 20168113 21164539 22224787 23366338 24600030 25890100 27202197 28517150
9214B8517150J334681J431272J601517J770505J903772J937755J880742J768004
9206D2145398J662402J620814J660128J727426J813305J932583K135222K474906
9198E7172184K996730L583155M217254M829238N384481N941402O597047P496375
9190I8217866Q768657J0486419J2730191J5477001J8579411K1611349K3724417
9183B09595311K4061368K2202152J8430828J4053995J0582458Q003955O000059
9176C12930126N159964N297821N694269N808703M912068K870124L32187k051054
9168C40954208l622217l829114k873471j334459J92865J050076J150982O03226
9160C32292096o45728k268793l973306n450784o421535p007822p432096p965159
$$ plain form
9214 28517150 29851831 31283103 32884620 34655125 36558897 38496652 40377394 42145398
9206 42145398 43807800 45428614 47088742 48816168 50629473 52562056 54697278 57172184
9198 57172184 60168914 63752069 67969323 72798561 78183042 84124444 90721491 98217866
9190 98217866 106986523 117472942 130203133 145680134 164259545 185870894 209595311
9183 209595311 233656679 255858831 274289659 288343654 298926112 306930067 312930126
9176 312930126 318090090 323387911 329082180 334890883 339802951 342673075 343005262 340954208
9168 340954208 337331991 333502877 330629406 329294947 329487812 330537888 331688870 332292096
9160 332292096 331646368 329377575 325404269 319953485 313531950 306524128 299092032 291126873
9152B91126873q573684r219884r967468j0614284j1094260j1395459j1358346
9145B18903488j1112792j0780822j0256360r395856q256662p094962o027371n058695
9137A50919968m071309l065301k113695j293292o80683m89988q76243j712866
9129A36616591k812420l998276n084960n885703o342992o512979o424752o179218
9121I3375291n757944n076567m211405l247660k270618j282578l81497L42298
9113G1489320P88216R48165Q25980M71302j23129q76402j667847k361642k863294
9104F6630669l174894l354785l446607l406386l281304l128979k936599k629843
9096D1271272k267309j942238j645816j349609j088108q97388p74226p46470q01459
$$ plain form
9152 291126873 282553189 273333305 263365837 252751553 241657293 230261834 218903488
9145 218903488 207790696 197009874 186753514 177357658 169100996 162006034 155978663 150919968
9137 150919968 146848659 143783358 141669663 140376371 139695688 139205700 138329457 136616591
9129 136616591 133804171 129805895 124720935 118835232 112492240 105979261 99554509 93375291
9121 93375291 87617347 82540780 78329375 75081715 72811097 71528519 71147022 71489320
9113 71489320 72277536 73225701 74051681 74522983 74399854 73523452 71855605 69493963 66630669
9104 66630669 63455775 60100990 56654383 53247997 49966693 46837714 43901115 41271272
9096 41271272 39003963 37061725 35415909 34066300 32978192 32080804 31306578 30560108 29758649
9087B9758649q90575r89513j030037j045695j005686r05960p71252o19604m82305
9078B2018022l85481l16556k47551j87097j77198k15170l15674m54395o40363
9069A9078537q24332r82826j079295j064789r44824q01195o45779n33842m83757
9060A1717898m50995m40206m61887m57200m27698m00371l62127l42392l37721
9051H037301l29401k99689k64792k52326k36181k05563j97734j88930j66500j59191
9041E736994j62440j66667j87782k19945k50086k48293k41097k35319k14098j98961
9031C612306j89361j86436j86397j66041j47173j39304j16616j03355p8922p5975
9021B222726p8171n6958l9011m1502l9336l5623l5438k8116j9890k0052k1725
$$ plain form
9087 29758649 28868074 27878561 26848524 25802829 24797143 23891183 23119931 22500327 22018022
9078 22018022 21632541 21315985 21068434 20881337 20704139 20488969 20173295 19718900 19078537
9069 19078537 18254205 17271379 16192084 15127295 14182471 13381276 12735497 12201655 11717898
9060 11717898 11266903 10826697 10364810 9907610 9479912 9079541 8717414 8375022 8037301
9051 8037301 7707900 7408211 7143419 6891093 6654912 6449349 6251615 6062685 5896185 5736994
9041 5736994 5574554 5407887 5220105 5000160 4750074 4501781 4260684 4025365 3811267 3612306
9031 3612306 3422945 3236509 3050112 2884071 2736898 2597594 2480978 2377623 2298701 2222726
9021 2222726 2144555 2087597 2048586 2007084 1967748 1932125 1896687 1868571 1848681 1828629 1806904
9010A806904l4131l5676m5941l9252k8096k4412m3110l3456k9077l5901l1759
8999A426093j0910R864p157k1761j2742l278K942J0063j070O960N586K656o401
8986A400845k820l915p259n267j5182j9535k6606k2178j5626j5443j8965k0479
8974A227570j5978k3517j4221r638j0481k0436j5492k2115j5302k0031k3537k6661
8962A010161l1663k4414l8495l8410k8833k7351j6889l216j3329k2125j9899r205
8950G36332j9174k3287j0947j7270r974j2862q844p396K702l493j0921j0318L709
8937F08257q196q113q142j1794p780j0096j0314o316O15o459q256j0056J304Q558
8923E23212K194m17N002N536P683k268j1422q536r660N985P01k0084k7118j1972
$$ plain form
9010 1806904 1772773 1737097 1691156 1651904 1623808 1599396 1556286 1522830 1493753 1457852 1426093
8999 1426093 1415183 1425047 1417890 1396129 1383387 1380109 1383051 1393114 1392044 1399004 1404590 1407246 1400845
8986 1400845 1398025 1394110 1386851 1381584 1366402 1346867 1320261 1298083 1282457 1267014 1248049 1227570
8974 1227570 1211592 1188075 1173854 1164216 1153735 1133299 1117807 1095692 1080390 1060359 1036822 1010161
8962 1010161 978498 954084 915589 877179 848346 820995 804106 800890 787561 765436 745537 736332
8950 736332 717158 693871 682924 665654 655680 642818 633974 626578 629280 625787 614866 604548 608257
8937 608257 600061 591948 583806 572012 564232 554136 543822 537506 538121 531662 523406 513350 514654 523212
8923 523212 525406 524989 529991 535527 543210 540942 529520 520984 511324 517309 518010 497926 470808 458836
8909D58836k504k856n471n805Q749l462o070r268n026j25o522k088M062m499J807
8894D19758k937j8199j3197r44o90m994m36N557N341j863k204j0504j0951M08
8880C64145L579p926r284K90O420k191J456L767P940J6175N224N606m340L332
8866C94193N061L733o931K040J2245J2455R799K971L720J0741J4289R966J6641
8853D90923J5386K1607J8322J8636P357R999O122K096l553k7095k1937k6304k6831
8840D84728k0228l899o955k729q168k233K091O425N907Q050O065J0924J8360J4713
8826E13051N440q028j2868j19j0047j457J5499J3693J7803K5841K1781K9492L3381
8813F43462L5163L8475M0757K7164K4189J3313k309j3409j7131j4470j5698j3393
$$ plain form
8909 458836 456332 453476 448005 442200 450949 447487 441417 432149 427123 426998 420476 418388 422450 417951 419758
8894 419758 416821 398622 385425 384481 383791 378797 378361 383918 389259 387396 385192 374688 363737 364145
8880 364145 367724 359798 350514 350804 357224 355033 356489 360256 368196 384371 389595 395201 390861 394193
8866 394193 399254 402987 396056 398096 410341 422796 432595 435566 439286 450027 464316 474282 490923
8853 490923 506309 527916 546238 564874 572231 582230 588352 590448 586895 559800 537863 511559 484728
8840 484728 464500 460601 453646 450917 442749 440516 442607 449032 454939 462989 469054 479978 498338 513051
8826 513051 518491 510463 497595 497476 487429 485972 501471 515164 532967 558808 580589 610081 643462
8813 643462 678625 717100 757857 785021 809210 822523 820214 806805 789674 775204 759506 746113
8801G46113j9878m80j457j5610q024j0342j4395j0103j0726j0434q697J5379K1532
8788F72878J7020K4962K7887L2925L1946L0974L9126M6690N2162N7614O5540O3157
8776A162881M8366M2459J9953J292j8065k9841l6398l9012k8907k9487k9713k0379
8764A043149j4287n882o418j4266o594j2544j0941k434o168r292O509j112p951
8751I51769p161M816L680N073J6385J4354J7949K0725K1118K8292L4783L9081
8739A150864L3856L1029K1168J0666j315n446p005l0608l4241k8484l5553n1457
8727A053474m2775k7686k9636m3326n1449k6074q617j4477j6708k1432k3780j0491
8715G37023j2568p273L347L938P520R515J3576J6867J9255K8702J8292j3580n544
$$ plain form
8801 746113 726235 725755 724298 708688 700664 690322 675927 665824 655098 644664 635967 651346 672878
8788 672878 689898 714860 742747 775672 807618 838592 877718 924408 976570 1034184 1099724 1162881
8776 1162881 1211247 1253706 1273659 1274951 1256886 1227045 1190647 1151635 1122728 1093241 1063528 1043149
8764 1043149 1028862 1022980 1016562 1002296 995702 983158 972217 969783 963615 954323 960832 959720 951769
8751 951769 944608 949424 953104 958177 974562 988916 1006865 1027590 1048708 1077000 1111783 1150864
8739 1150864 1184720 1215749 1236917 1247583 1246268 1240822 1233817 1203209 1168968 1140484 1104931 1053474
8727 1053474 1010699 983013 953377 910051 858602 832528 823911 809434 792726 771294 747514 737023
8715 737023 724455 717182 720529 724467 731987 741502 755078 771945 791200 819902 838194 824614 819070
8702H19070j0073k6447j6039j8239k2721l1920k8713k5771k0293k0050k9965l4005
8690E34834k2040l0331l0995k9733k6552j9965j0944r377j2007m965j2744n095
8678C20086m925l560k0585k3834N143P122j391J465R614K375J1289P440Q197N030
8664C23466q35n369J179q959j7250j5048k5018k2969l0350j5530j6194j2038k267
8651A52818q952j110N194j317k785k14o183q437n577r229J587k365K80P139k048
8636A18801m239n939L650K797n342L147j5364o459p269l973L639J7785J1327J831
8622A14392n644l541j3967n893J5555Q027r303l325J798o837r774M01P526L643
8608I3058J803J1572p58L603L511K870J976m434j1121r285K457M495Q08o249k977
$$ plain form
8702 819070 808997 782550 766511 748272 725551 693631 664918 639147 618854 598804 568839 534834
8690 534834 512794 482463 451468 421735 395183 375218 364274 354897 342890 337925 325181 320086
8678 320086 315161 311601 291016 267182 272325 279447 278056 279521 289135 291510 302799 310239 318436 323466
8664 323466 322631 317262 318441 309482 292232 277184 252166 229197 198847 183317 167123 155085 152818
8651 152818 143866 142756 147950 146633 143848 143634 137451 129014 123437 114208 115795 113430 113710 120849 118801
8636 118801 114562 108623 112273 115070 109728 112875 97511 91052 83783 79810 83449 101234 112561 114392
8622 114392 108748 105207 91240 85347 100902 108929 99626 96301 98099 91262 81488 81889 89415 93058
8608 93058 94861 106433 105675 109278 112789 115659 117635 113201 102080 92795 95252 99747 100555 94306 91329
8593I1329N250l362J941r8p689K544l54j892n630n116m069N36m59K811J880J897
8577G9519r467r102R268P701J011k60N171K807j247l596o290l365M902K664m612
8562G5104q682r074n684j174j0098M613P734n32m953l424K755m967p913L962J3048
8547E0715N83L077n841k183J273K435L465l572N618O320q584L630M681N551M834
8532G2002J692p944q5J160k729q761n194J792m014Q536K776k752R148N624l231
8517F8020j676L974P052L572M443J1459K0121J7024J0330K71r331j361j4184j2870
8503A06844j9955j2894j2439o120j0805K061P406o677j4905r289J0560Q462L591
8490D5840m91m528p887j215m061j48m827J2346J3458m569k854k547K997J577K974
$$ plain form
8593 91329 96579 93217 95158 95060 87371 89915 89561 87669 82039 76923 72854 73390 72931 75742 77622 79519
8577 79519 70052 60950 70218 77919 78930 78670 83841 86648 85401 81805 75515 72150 77052 79716 75104
8562 75104 66422 57348 51664 50490 40392 45005 52739 52207 47254 43830 46585 41618 33705 37667 50715
8547 50715 51298 54375 48534 46351 47624 50059 53524 49952 55570 61890 53306 56936 61617 67168 72002
8532 72002 73694 65750 65665 66825 64096 55335 50141 51933 47919 56455 59231 56479 65627 71251 68020
8517 68020 66344 70318 77370 80942 85385 96844 116965 133989 144319 144590 135259 133898 119714 106844
8503 106844 86889 73995 61556 55436 44631 46692 54098 47421 32516 23227 33787 42249 45840
8490 45840 45349 40821 32934 31719 27658 27510 22683 35029 48487 43918 41064 38517 41514 43091 46065
8475D6065R643J800J3707J6493J5495K2942R733J870Q415j0304q414j5365j5611
8462I6469j6759p430q921j3301l528P717M370M361p920p075K503n593N002J0796
8448F0691j76k351j779m47j445k450k783R93m699l566J142r711l803M684P886
8433D2186K423j031j466j541j187L561o82m081j789R473l31q105n673M350N392
8418D1499J2717O276l037q368k934N239J0408o41Q61j321r865o665r755m993L784
8403C3205R020O788N57K340j5398k709N369j725l898J814j3852o084J191P403
8389B4021N231O38Q453K892K698k40k929J1403N347j2274j063K780M583J456J4925
8374F7921L663K092n404j1115J336l324o418K388K6n686j114r57N600m3n663J021
$$ plain form
8475 46065 55708 57508 71215 87708 103203 126145 135878 137748 146163 135859 127445 112080 96469
8462 96469 79710 72280 63359 50058 46530 54247 58617 62978 55058 47983 50486 44893 49895 60691
8448 60691 60515 58164 56385 55938 54493 52043 49260 50253 45554 41988 43130 33419 29616 34300 42186
8433 42186 44609 43578 42112 40571 39384 42945 42263 38182 36393 45866 45535 37430 31757 36107 41499
8418 41499 54216 60492 57455 49087 46153 51392 61800 61159 62020 60699 50834 44169 34414 29421 33205
8403 33205 42225 49013 49570 51910 36512 33803 39172 37447 33549 35363 21511 15427 16618 24021
8389 24021 29252 29890 38343 41235 43933 43693 40764 52167 57514 45240 44177 46957 51540 52996 67921
8374 67921 71584 73676 68272 57157 58493 55169 48751 51139 51165 45479 44365 43408 49008 48965 43302 44323
8358D4323J094n011j4379J963M411N479k076k365p674L809O781J1186J877R85
8344E0403L07n201j1343l936J0453M180n8O269P680O058O473L551l53P603J4904
8329I6990l467o647j1190k0050j4619j201p248l037k1l543L108J403q798Q171
8315B9851M975j228J14j476p299p261q52l907P715N453M57j256m148K506r405
8300A4239N213Q040O501r91p251N791o197q377k655J5217M259q213J500o376j7381
8285C319O618J1043j350L294N313j1298k761p543l220k77j428L495j915N682Q317
8270A7289K266k371k945m282J988o12j1569o164K179n158Q95N831R26N961l743
8255D91k829K91N460J5739L187j0760j366P454J434K750l098j412o121R420J329
$$ plain form
8358 44323 45417 40406 26027 27990 32401 37880 35804 33439 25765 29574 36355 47541 49418 50403
8344 50403 50710 45509 34166 30230 40683 44863 44805 51074 58754 64812 71285 74836 74483 82086 96990
8329 96990 93523 86876 75686 55636 41017 39816 32568 29531 29510 25967 29075 30478 21680 29851
8315 29851 34826 33598 33712 32236 24937 17676 16824 12917 20632 26085 26542 25286 21138 23644 14239
8300 14239 19452 27492 33993 33002 25751 31542 25345 16968 14313 29530 33789 25576 27076 20700 3319
8285 3319 9937 20980 19630 22924 28237 16939 14178 6635 3415 3138 1710 5205 3290 8972 17289
8270 17289 19555 17184 14239 9957 11945 11333 -236 -6400 -4221 -9379 -8484 -2653 -1727 4234 491
8255 491 -2338 -2047 3413 19152 22339 11579 10213 17667 19101 21851 18753 17341 11220 20640 21969
8240B1969k998o264O772m518r692O73J967n021L935Q986Q901K049j0754p988m341
8225C676L656J4905L127k463J075p511j0472N950J039k73O13K199J1718L54j120
8210B6473q763l278K609J698p618q911K467l48k353n218O820j171l565O445J1315
8195A6602L815q353j881K119j538R13k486m094P733M583J588n231m68P492N539
8180B6333L613R54l453r260k45o053j550J55k251o501k329J449k557l738p346
8165a2779J843J7511Q816r547o558l106K320j198L273J2864K552n94m548M02o907
8150D344r027L078J4080K935O52O626J999l068l524l192m363l012o306R87J827
8135D036M682o30m488o043O410N711n077M758k079K300N583l955O60J255k386
$$ plain form
8240 21969 18971 12707 19479 14961 5269 5942 7909 2888 6823 15809 24710 26759 16005 8017 3676
8225 3676 7332 22237 25364 22901 23976 16465 5993 11943 12982 12709 13322 15521 27239 27593 26473
8210 26473 17710 14432 17041 18739 11121 2210 4677 4329 1976 -3242 3578 2407 -1158 5287 16602
8195 16602 20417 12064 10183 12302 10764 11677 9191 5097 12830 17413 19001 13770 13302 20794 26333
8180 26333 29946 30900 27447 18187 17942 11889 10339 10494 8243 1742 -587 862 -1695 -5433 -12779
8165 -12779 -10936 6575 15391 5844 -714 -3820 -1500 -2698 575 13439 15991 15397 10849 11251 4344
8150 4344 -4683 -1605 12475 15410 16062 22688 24687 21619 18095 14903 10540 7528 1222 2209 4036
8135 4036 8718 8088 3600 -2443 3967 9678 4601 9359 7280 9580 15163 11208 11868 13123 10737
8120A0737j5190n750L678N849O349J0797M138L791n992K702j335o748o250K687
8106I463N670k134j3822P54Q810P830r389r589R262N469R220R143K642N854k931
8091C6252j4393j143K403N333n463q310j217n87L333J0310m4j398j433L085o425
8076B0303P848J0380k512m693J0440K695n146o673n723j765K117N64K569k017
8062B8387q40q129o052M968q11K522J992O590m463m813K670J1673J234m97n898
8047B8533o383L808j541J526J3732M187j58p539j6356M538R555P451j046K002
8033D2309J2475O308j0183r749J664K930J0750J450K59J170J346k796m013l845
8019E0075m803n885L537J88K165m877P710m60m062k096M195P453p449k919q609
$$ plain form
8120 10737 -4453 -10203 -6525 -676 5673 16470 20608 24399 18407 21109 19774 13026 6776 9463
8106 9463 15133 12999 -823 -69 8741 16571 7182 -2407 6855 12324 21544 30687 33329 39183 36252
8091 36252 21859 20716 23119 28452 22989 14679 13462 12875 16208 26518 26474 25076 23643 26728 20303
8076 20303 28151 38531 36019 31326 41766 44461 39315 32642 26919 25154 27271 27835 30404 28387
8062 28387 27547 19418 13366 18334 17523 20045 22037 28627 24164 19351 22021 33694 34928 34431 28533
8047 28533 22150 25958 24417 25943 39675 43862 43704 36165 19809 24347 33902 41353 40307 42309
8033 42309 54784 61092 50909 41160 42824 45754 56504 57954 58213 59383 60729 57933 53920 50075
8019 50075 45272 39387 42924 43112 45277 40400 48110 47650 43588 41492 45687 53140 45691 42772 34163
8004C4163L865M824O016q246j3501k332j9p288L682N967M528N4J925p467M175
7989C0346J0644P157O559K50r160p735k486q756m959L688J3696L19O72L015m03
7974D2847m154j929R75L872Q554M083k521n123P21L330j581j023K85N088L192
7959E6616J494n873l93q429j156Q888O603r272j0081n988q755m014L870M03m149
7944A9764L114O669o554m349J188l413j820J5646P516j0991p421J0564Q150k446
7930C5617P130M135l474l743q493p970j519j441M814P665q596j799j249M135P136
7915C2348K272L183r11o136M382J4697K902l381j0199o778n624l767K105n884
7901A9209M104o69Q177Q605k915l976j728j821l148p326o88K072m335J650q402
$$ plain form
8004 34163 38028 42852 48868 40622 27121 24789 24770 17482 21164 27131 31659 31713 33638 26171 30346
7989 30346 40990 48147 54706 54956 45796 38061 35575 26819 21860 25548 39244 39563 40235 43250 42847
7974 42847 38693 36764 37739 41611 50165 54248 51727 46604 47325 50655 49074 48051 48336 53424 56616
7959 56616 58110 52237 51844 43415 42259 51147 57750 48478 38397 32409 23654 19640 23510 23913 19764
7944 19764 22878 29547 22993 18644 19832 16419 14599 30245 37761 26770 19349 29913 38063 35617
7930 35617 42747 46882 43408 39665 31172 23202 21683 20242 25056 32721 24125 22326 21077 25212 32348
7915 32348 34620 37803 36892 30756 35138 49835 52737 49356 39157 32379 26755 22988 25093 19209
7901 19209 23313 22644 30821 39426 36511 32535 30807 28986 25838 18512 17824 19896 15561 17211 8809
7886H809q400K270J0209J1111j342o883j1137r593q029L234J1732q99J0560M126
7872A5768o464M814L42q861q408O173L389m330K607J0341K221K496p922j3768
7858a602k036N621m233Q13K660k38N680L572N840R494L007q516j4530k79N484
7843A0737j618O697K187M461p700j0482k332N129J607m180L289m934p574m103
7829h816P637N673m047O922J62k15O46k346m40O094L134j08r018j7721k117l996
7813a8556o66N518k990j444q105L130O582o28m72J241J2708J0994N185r21K177
7798A3753l232j3290K490J824K864P301l10M669m617m885m250k884l789j784P149
7783A009k632n717j126l555O64m090r17m88l675K421K858M455M700L597K557K35
$$ plain form
7886 8809 409 2679 12888 23999 22657 15774 4637 -4956 -12985 -9751 1981 1082 11642 15768
7872 15768 9304 14118 14460 5599 -2809 3364 6753 2423 5030 15371 17592 20088 12166 -1602
7858 -1602 -3638 1983 -2250 -1437 1223 985 6665 10237 16077 25571 28578 20062 5532 5253 10737
7843 10737 9119 15816 18003 22464 14764 4282 1950 7079 8686 4506 7795 2861 -4713 -8816
7829 -8816 -1179 4494 447 7369 7531 7316 7962 5616 5176 11270 14404 14296 5278 -12443 -14560 -18556
7813 -18556 -19222 -13704 -16694 -18138 -26243 -23113 -16531 -17159 -17631 -16390 -3682 7312 12497 11576 13753
7798 13753 10521 -2769 -279 1545 4409 11710 11400 16069 11452 6567 2317 -567 -4356 -6140 1009
7783 1009 -1623 -7340 -8466 -12021 -11357 -15447 -16364 -16852 -20527 -18106 -15248 -10793 -6093 -2496 61 296
7767B96j1502M899L543j3678j1160L097N813L571O323M600m070o783J1148R530
7753E627r321j5063J238P37L076J9823L308n309p350p54L64m18O841P536j907
7738H428n5Q581N71l336o455o882O255J245j0495n057j019O874L694l44q124J87
7722e932k429m136M96j134j0787Q325Q038L523n341r143M829K553P086K070l207
7707e189K707O61K182O208N330j844q668m427o86K241j367J2636L957K099J645
7692A7485p771p807k165o95j414m916J459R168P0L238j234m060n366m68l277k696
7676a0449M6Q396l711o320Q96M028K673O919K544J298q152j0760K246O989M369
7661A012n01j384M855k66r687Q172N02k448m937p778k123N655k076R75K526m905
$$ plain form
7767 296 -11206 -6307 -2764 -16442 -27602 -24505 -18692 -15121 -8798 -4198 -8268 -15051 -3903 5627
7753 5627 -3694 -18757 -17519 -16782 -13706 6117 9425 4116 -3234 -3988 -3624 -4042 2799 10335 8428
7738 8428 8373 16954 17525 14189 7734 852 7107 8352 -2143 -7200 -8219 -1345 2349 2005 -6119 -5932
7722 -5932 -8361 -12497 -12001 -13135 -23922 -15597 -7559 -4036 -9377 -18520 -13691 -11138 -4052 -1982 -5189
7707 -5189 -2482 -1821 361 6569 11899 10055 1387 -3040 -3726 -1485 -2852 9784 13741 15840 17485
7692 17485 9714 1907 -258 -953 -2367 -7283 -5824 3344 3414 6652 5418 1358 -4008 -4476 -7753 -10449
7676 -10449 -10403 -2007 -5718 -12038 -11142 -7114 -4441 2478 5022 6320 -1832 -12592 -10346 -3357 1012
7661 1012 511 -873 3982 3716 -5971 2201 2703 255 -4682 -12460 -14583 -8928 -11004 -10029 -7503 -12408
7645a2408K147N510O950J0305L594j5522l004k680m274N041N297j1857o972N118
7631a2755J915p115J681N542M936j722M230p77M145R10j996K927M607l104K87
7616C711n135Q260O951m73N586j35j0568m340l101Q675L44p397r52L488p794J881
7600i99L307l304J532L084N526p081m587J635L626L288q180R02O06J207N102J369
7584G033j1160P01L213J520l59K065q80J237J073L39l481Q63P20p958k74L309
7568b039J157N342J4104N494k371r966n631n485n639l407J127k52J493O779M165
7553D871L971n715q184R904Q009p094L417j349q809m669k12k036m209K744J557
7538g804P200P537K389l856j0524m32j292N892m129l933K720l085N265L745k467
$$ plain form
7645 -12408 -10261 -4751 2199 12504 16098 576 -2428 -5108 -9382 -4341 956 -10901 -17873 -12755
7631 -12755 -10840 -17955 -16274 -10732 -5796 -7518 -3288 -4065 80 990 -1006 1921 6528 3424 3711
7616 3711 -1424 6836 13787 13314 18900 18765 8197 3857 756 9431 9775 2378 1426 4914 -2880 -999
7600 -999 2308 -996 536 3620 9146 2065 -2522 -887 2739 6027 -2153 -1251 -645 562 5664 7033
7584 7033 -4127 -3426 -213 1307 948 3013 2133 3370 4443 4782 1301 2164 2884 -5074 -5348 -2039
7568 -2039 -882 4460 18564 24058 21687 11721 6090 605 -5034 -8441 -7314 -7566 -6073 706 4871
7553 4871 8842 3127 -5057 4847 12856 5762 9179 7830 -979 -5648 -5860 -7896 -12105 -9361 -7804
7538 -7804 -604 6933 9322 5466 -5058 -5490 -6782 -890 -5019 -8952 -6232 -9317 -4052 -307 -2774
7523b774M557n646R099J1228q978q819k875q21l54P476M673J307N319M93j0867
7508C018l602L98M531J565m50k348L511j32r24M457Q35l752p785m895n200J95
7492a0578N988m423k890P175K997Q28l57J815O645m959p216L60L093k685o895
7477a1102o936J3431Q518P738k209j5103m040n218j009k725Q444K805K150P74
7463d482l689q862m445L562m030m659L972R293J5294O814j0706J444J0925n955
7449D476j3641o342J1968J250j195l062J30L167J794m059k354o397J0543P244
7435C522k981l565n157j1103P08M138L194L290j046J1103Q22R42k311M423m951
7420A028Q211P91q126J322J165L79j544Q510o79k756K208n116m350n057j406l968
$$ plain form
7523 -2774 1783 -3863 5236 16464 7486 -1333 -4208 -5029 -5383 2093 6766 8073 13392 13885 3018
7508 3018 -584 -186 4345 5910 5460 3112 6623 6491 5567 10024 10859 7107 -678 -5573 -10773 -10578
7492 -10578 -4590 -9013 -11903 -4728 -1731 -903 -1260 555 7200 2241 -4975 -4615 -1522 -4207 -11102
7477 -11102 -18038 -4607 3911 11649 9440 -5663 -9703 -14921 -15930 -18655 -10211 -7406 -5256 -4482
7463 -4482 -8171 -17033 -21478 -17916 -21946 -26605 -22633 -13340 1954 8768 -1938 -494 10431 4476
7449 4476 -9165 -15507 -3539 -2289 -3484 -6546 -6416 -3249 -1455 -5514 -7868 -14265 -3722 3522
7435 3522 541 -3024 -8181 -19284 -18576 -14438 -11244 -7954 -9000 2103 2925 3867 1556 5979 1028
7420 1028 9239 10030 1904 3226 4391 4770 3226 11736 11057 8301 10509 5393 1043 -4014 -5420 -9388
7404i388k042q52r98m860P74P575O196k376K986P783l113J096n258q841N493J3350
7388G525K21o507j441o2J909J864J330M74J784Q25k405J771J446j337L887K744
7372A4028o594p812J93P871K973k182r854q06p639R200O447l401k219M183J638
7357F026m718j64R231j495L810n586K952l256j909L191j1485k740O960P305M558
7342A2680O1q869o09L805q028j1250P071K19o740n324j563P444O87N708N09P72
7326c427P690J449J0140k317n866l67n883K217j1688l957L429L356j0746Q46M855
7311a0269N485L71n908l776P978O377K607l05m364l276o462q976L768O265j0152
7296b0637K0J038n35o160k565j594r400j070O629J7498J757K946k029j1641J1703
$$ plain form
7404 -9388 -11430 -12282 -13280 -18140 -17366 -9791 -3595 -5971 -2985 4798 1685 2781 -2477 -11318 -5825 7525
7388 7525 7746 1239 -202 -264 1645 3509 4839 5313 7097 7922 5517 7288 8734 7397 11284 14028
7372 14028 7434 -378 -185 7686 10659 8477 -1377 -2183 -9822 -622 5825 2424 205 4388 6026
7357 6026 1308 1144 10375 8880 12690 7104 10056 6800 4891 8082 -3403 -6143 817 8122 12680
7342 12680 12741 3872 3263 7068 -960 -12210 -5139 -4920 -11660 -16984 -18547 -11103 -10416 -4708 -4199 -3427
7326 -3427 4263 5712 15852 13535 7669 7302 1419 3636 -8052 -12009 -8580 -5224 -15970 -15124 -10269
7311 -10269 -4784 -4413 -10321 -14097 -6119 258 2865 2560 -1804 -5080 -11542 -20518 -16750 -10485 -20637
7296 -20637 -20617 -19579 -20114 -26274 -28839 -30433 -39833 -40903 -34274 -16776 -15019 -12073 -14102 -25743 -14040
7281a4040R359l285k665r833j298j783J424M028Q04L921L749K210P585R087l735
7266E528q425r190p576J213m93M415K113J729m473M737m785Q386K902l550K067
7251e402J0786J193o06q053o077j7073o954P495R515O398M310K987r23J98m024
7236f230O64J0644l076m648n221p368J968J1010P349n03p223q799j945L945j789
7221a1222o964Q983N068o058R96J819O574n847q858m874M646J7175J367j1042
7207h237j173J2184P943q659l987q957p3M454J700Q046M102J1062j824j3169m334
7192i22j48j652K76m012q576Q049j235j0819M884O483K720m644o9J746M585n547
7176h881q02N939K012L457k791m784J999Q30l41J382N503j053k846M670P911r049
$$ plain form
7281 -14040 -4681 -7966 -10631 -20464 -21762 -23545 -22121 -18093 -17289 -13368 -9619 -7409 176 9263 5528
7266 5528 -2897 -12087 -19663 -18450 -18943 -14528 -12415 -10686 -15159 -10422 -15207 -6821 -3919 -7469 -5402
7251 -5402 5384 6577 5971 -2082 -8159 -25232 -32186 -24691 -15176 -8778 -4468 -1481 -2404 -2206 -6230
7236 -6230 -5566 5078 2002 -2646 -7867 -15235 -13267 -2257 5092 4589 -2634 -11433 -13378 -9433 -11222
7221 -11222 -18186 -9203 -4135 -10193 -9197 -7378 -804 -6651 -15509 -20383 -15737 1438 2805 -8237
7207 -8237 -9410 2774 10717 2058 -1929 -10886 -10959 -6505 -4805 3241 7343 18405 16581 3412 -922
7192 -922 -1070 -2722 -2446 -6458 -15034 -6985 -8220 -19039 -14155 -7672 -4952 -9596 -9665 -7919 -3334 -8881
7176 -8881 -9683 -3744 -1732 1725 -1066 -5850 -3851 -3021 -3362 -1980 3523 2470 -376 4294 12205 3156
7160C156q055k987q60Q138N614m914m483k542J987m015j673j875p21K559j560
7145a2231J174J78J608L749n909m758J671M511M38k178j1067K94P689J2422L657
7130A248l452j339o29O80Q55j613J072J2120k276n814L702L395j967p643l348
7115e009M704J1969Q669l815j6200l170K137k896l528k631q696m0N419J4801L158
7100D872K774J232l951q513K913N647M865o123j1899O034J1580k199n34q468L52
7085a418K351M874o325n826n374n278l801N260k312K492P748K446M510q611m811
7070a4075L768O950J09j892J0280R972L133j517m214n854Q65Q593l135j7856k358
7055g231J2625m252r034L655J1885j306r37m647j1764m529Q400N973R169n934
$$ plain form
7160 3156 -4899 -7886 -8746 -608 5006 92 -4391 -6933 -4946 -8961 -10634 -12509 -13230 -10671 -12231
7145 -12231 -11057 -10879 -9271 -5522 -11431 -16189 -14518 -10007 -9569 -11747 -22814 -22520 -14831 -2409 1248
7130 1248 -2204 -3543 -4172 -3492 -2637 -4250 -3178 8942 6666 852 4554 7949 5982 -1661 -5009
7115 -5009 -305 11664 20333 16518 318 -2852 -715 -3611 -7139 -9770 -18466 -18506 -13087 1714 4872
7100 4872 7646 8878 4927 -3586 -673 4974 9839 3716 -8183 -2149 9431 7232 6698 -1770 -1418
7085 -1418 933 5807 -518 -6344 -11718 -16996 -20797 -15537 -17849 -15357 -7609 -5163 -653 -9264 -14075
7070 -14075 -10307 -3357 -3248 -5140 5140 15112 18245 16728 12514 6660 7525 16118 12983 -4873 -7231
7055 -7231 5394 1142 -7892 -4237 7648 6342 5405 758 -11006 -15535 -7135 -1162 8007 2073
7041B073m198J1260m101o000Q735P341K358n970o636K348J534j3737j1495j650
7027a8138M226N946M558n26k353q81J1305Q595q515m6k933J191p390q153l439
7012a6553L192J705J3179L654K791K088k135n280j2629k638K104P440J3924n65
6998A0277r098M297m280o947k087O90J2227o70K136J894o118j22j084N32L742
6983E389o800j2741r48J7821N17j2315J959n173Q438M24p049l113Q482J7513m423
6968G981n507J368K832R548k973o069p762o320L759k778N235K968Q09l099o165
6953f173j620o591O129L174l603K502J849l211P193J435j767K884N134o136m162
6938b963L3j111p77M404K669l12r002p835k064P31K159L886j01k561J0304N524
$$ plain form
7041 2073 -2125 9135 5034 -966 7769 15110 17468 11498 4862 7210 8744 -4993 -16488 -18138
7027 -18138 -13912 -7966 -3408 -3934 -6287 -7168 4137 12732 4217 4171 1238 2429 -4961 -13114 -16553
7012 -16553 -13361 -11656 1523 5177 7968 10056 7921 2641 -9988 -12626 -10522 -3082 10842 10277
6998 10277 1179 5476 1196 -5751 -7838 -7148 5079 4409 6545 8439 2321 2199 1115 1647 5389
6983 5389 -1411 -14152 -15100 2721 3238 -9077 -7118 -12291 -3853 -3429 -10478 -13591 -5109 12404 7981
6968 7981 2474 3842 6674 16222 13249 7180 -582 -6902 -3143 -5921 -686 2282 3091 -8 -6173
6953 -6173 -7793 -14384 -8255 -5081 -8684 -6182 -4333 -7544 -351 1084 -683 2201 7335 1199 -2963
6938 -2963 -2930 -4041 -4818 -414 2255 1943 -7059 -14894 -16958 -16227 -14068 -10182 -10283 -12844 -2540 2984
6922B984p589Q92k510o773M238R741l979m7j122n294j531N192R31m935o894M321
6906a2375M150L151q777p720J1887J0576M6P28n018O469J44q565K761l877m368
6891a0788O846J1867K424p98r138j3028l3P810J3290N680o543m828p34k977k961
6876c911O165p802j0832N497L750k026q6l555M505P154K09k069K51l31j367m256
6860h704n055J408J6356J864P377o533o43m281L798k20O26l448K487q341k971
6845f280M169L47J598J088m533j0457o447k870J0390J0667M806N519r090p534
6831h627N778O064p726K255r01Q523N968J2596N444j4759j3667o030o139J740
6817i481k962q956L211N790M203J492R081j0663r385J909Q658N350P652N588L767
$$ plain form
6922 2984 -4605 -3713 -6223 -12996 -8758 983 -2996 -3043 -4165 -9459 -10990 -5798 -4867 -9802 -16696 -12375
6906 -12375 -8225 -5074 -13851 -21571 -9684 892 938 1666 -3352 3117 3261 -5304 -2543 -6420 -10788
6891 -10788 -3942 7925 10349 9551 413 -12615 -12648 -4838 8452 14132 7589 2761 2027 -950 -3911
6876 -3911 2254 -5548 -16380 -10883 -7133 -9159 -9245 -12800 -8295 -1141 -932 -3001 -2750 -3081 -4448 -8704
6860 -8704 -13759 -12351 4005 5869 13246 6713 6070 1789 5587 5367 5993 2545 5032 -3309 -6280
6845 -6280 -2111 -1764 -166 922 -3611 -14068 -20515 -23385 -12995 -2328 2478 7997 -1093 -8627
6831 -8627 -2849 3215 -4511 -2256 -3157 5366 11334 23930 29374 14615 948 -5082 -11221 -9481
6817 -9481 -12443 -21399 -18188 -12398 -8195 -6703 2378 -8285 -17670 -15761 -7103 -1753 5899 11487 15254
6802A5254Q146K681m854j6535l498P584K077n756o972M764l897p76O302q851n905
6787a0236J3031J962j0604l186m447j81K846M054l277L830J753O459N903p215
6773F92n888j540P651o233K00L059k138o351n225k524J3137j555Q159j271q052
6758g879l86l10P911K609n599j930p633r760N580J1987L078K697k002l563m275
6743i475L367L697j285L761Q637j723o850L614K768l677j1395J155J003j687n057
6728a3147J667J0061L138O667j008p79j7369l429R425Q007N397L192p213k672
6714A937o134k188K60P35J583j208N476Q649Q389p326j2539J22M424m685O25m517
6698f397k894J0725Q605j4055p285j767n622N790N510L470R90o556o22L353N098
$$ plain form
6802 15254 23400 26081 21227 4692 1194 8778 10855 5099 -1873 2891 -1006 -1782 4520 -4331 -10236
6787 -10236 2795 4757 -5847 -9033 -13480 -13661 -10815 -6761 -10038 -6208 -4455 2004 7907 692
6773 692 -5196 -6736 915 -5318 -5118 -2059 -4197 -10548 -15773 -18297 -5160 -6715 1444 173 -7879
6758 -7879 -8265 -8575 -664 1945 -3654 -5584 -13217 -22977 -17397 -5410 -2332 365 -1637 -5200 -9475
6743 -9475 -6108 -2411 -3696 65 8702 6979 129 3743 6511 2834 -8561 -7406 -6403 -8090 -13147
6728 -13147 -11480 -1419 1719 8386 7378 6599 -10770 -14199 -4774 3233 8630 11822 4609 1937
6714 1937 -4197 -6385 -6125 -5390 -3807 -5015 461 9110 17499 10173 -2366 -2244 2180 -2505 -1880 -6397
6698 -6397 -9291 1434 10039 -4016 -11301 -13068 -18690 -12900 -7390 -3920 -2930 -9486 -10108 -6755 -1657
6683a657o686j077P000M25Q54M607m850J248O056o115k195P230J2117N369n62
6668B1764m267j1168l894M314m574R14n438m749j411P91P422J375j374r90l942
6653e227J983L124Q026J523o741r325P548L751r301j821Q81j703r01R497J0709
6638A2023l915o938K907N984J0292n287j3176l89l466n317K457J491o108J947
6624g495O270l223K268J666J055l522K884P981j2001L361L236p827k37l003n507
6609a4094o304J039M926r78K144K746M146J918n812l932L654R816N357k148J94
6594B672q693p629J108Q557Q686K291j4128o178R207N516n928l443m887m856P658
6579a0047L429J700o935j1399J537J854L936k022k381O327k423K850P658J795
$$ plain form
6683 -1657 -8343 -9420 -2420 -1995 -1141 3466 -1384 -136 5920 -195 -2390 4840 16957 22326 21764
6668 21764 17497 6329 2435 6749 2175 3089 -2349 -7098 -8509 -7718 -296 1079 -295 -1285 -5227
6653 -5227 -3244 -120 7906 9429 2688 -6637 911 4662 -4639 -6460 -5579 -7282 -8183 1314 12023
6638 12023 8108 1170 4077 10061 20353 15066 1890 1501 -1965 -7282 -4825 -3334 -9442 -7495
6624 -7495 -1225 -4448 -2180 -514 541 -2981 -97 7884 -4117 -756 2480 -5347 -5584 -8587 -14094
6609 -14094 -20398 -19359 -14433 -15411 -13267 -10521 -6375 -4457 -10269 -14201 -10547 -731 4626 2478 2672
6594 2672 -6021 -13650 -12542 -3985 4701 6992 -7136 -13314 -4107 1409 -4519 -7962 -12849 -17705 -10047
6579 -10047 -6618 -4918 -11853 -23252 -21715 -19861 -15925 -17947 -20328 -14001 -16424 -13574 -5916 -4121
6565d121J326q857N605M253j752j051j734O834r974p417L912Q521j0015k051J5483
6550a038k136n860k169n540J561r124j636L761N435Q364N006M430J070N622R53
6535H699m04L226l713o40o086j5471r857J0399j303M964K647K008L313P70p339
6520h787K379K178R58P664L530Pm346j7734M473M949L481k234N928r62L739l408
6504A815p283o387M45R162K660P644n213J481p732n258O025n800n298j016N350
6489i405L825O306J449m840K433L942m93q960o28o459j42O118P066m285L949J910
6473A786L744j2375l778R212L558j4487r66l587p26O480L92R920N323j6521m164
6458a6189J110m424L068N826N982r01r36J857j190o231o54o148k867P060L045
$$ plain form
6565 -4121 -2795 -11652 -6047 -1794 -3546 -4597 -6331 503 -9471 -16888 -12976 -4455 -14470 -16521 -1038
6550 -1038 -3174 -9034 -11203 -16743 -15182 -24306 -25942 -22181 -16746 -8382 -3376 1054 2124 7746 8699
6535 8699 8295 11521 7808 7168 1082 -14389 -24246 -13847 -15150 -10186 -7539 -5531 -2218 -1448 -8787
6520 -8787 -6408 -4230 -3272 4392 7922 7929 3583 -14151 -9678 -4729 -1248 -3482 2446 1484 5223 1815
6504 1815 -5468 -11855 -11410 -2248 412 8056 2843 4324 -3408 -8666 -2641 -8441 -13739 -14755 -9405
6489 -9405 -5580 726 2175 -2665 -232 3710 3217 -5743 -6371 -12830 -12972 -6854 212 -4073 -124 1786
6473 1786 5530 -6845 -10623 -1411 2147 -12340 -13306 -16893 -17619 -11139 -10747 -827 4496 -12025 -16189
6458 -16189 -15079 -19503 -16435 -10609 -4627 -5528 -6464 -4607 -5797 -12028 -12682 -18830 -21697 -14637 -11592
6443a1592J5103J6652L955p050o51j0851N64m580j745Q117J908q85n162j037K545
6428E291K571m125K234o968m308o32n57j527J501J607J569J985n586m828P630
6413d143m666r715M536J305j586L294N121m284l640J954J1531J0233o470m74j41
6398B855n961j549n098p800m692l379N341P600M41j407J1132N650m182o309l589
6383a0947j1251j667J2388P665n894k906J604N51k471K536M860j0067j705N38
6369a6766J586K527L665N078R781j296o345l383P43N422k717P902l083n414j1095
6354a3395j462Q738J1150L811r01q402j4833r859l014J0888M659O549J313j864
6340f622j031j696j92m704R582N491N095J25o997L860J1089m076n550j3986o35
$$ plain form
6443 -11592 3511 20163 24118 17068 16417 5566 6130 1550 -195 7922 9830 8945 3783 2746 5291
6428 5291 7862 3737 5971 -997 -5305 -5937 -6494 -8021 -6520 -4913 -3344 -1359 -6945 -11773 -4143
6413 -4143 -8809 -18524 -13988 -12683 -14269 -10975 -5854 -10138 -13778 -11824 -293 9940 3470 2996 2855
6398 2855 -3106 -4655 -9753 -17553 -22245 -25624 -20283 -12683 -12242 -13649 -2517 3133 -1049 -7358 -10947
6383 -10947 -22198 -23865 -11477 -3812 -9706 -12612 -11008 -10457 -12928 -10392 -5532 -15599 -17304 -16766
6369 -16766 -15180 -12653 -8988 -3910 5871 4575 -1770 -5153 -4410 1012 -1705 6197 3114 -2300 -13395
6354 -13395 -14857 -6119 5031 8842 7941 -461 -15294 -25153 -28167 -17279 -12620 -6071 -4758 -6622
6340 -6622 -7653 -9349 -9541 -14245 -4663 828 5923 6048 -949 2911 14000 9924 4374 -9612 -10247
6325a0247J1242K206M85K20n361q958N833L805m541J845L382J252K031O351L851
6310A3396o08K020l336R15m346m178p494J091O388p228r204j984J0612J060J876
6295a020J1185Q703q90n106j1804n97n019R861Q79P74j591m297j636L713N838
6280H993m885P62n26o838j0459N756L840l008p627j476j902k848P615r13K635
6265a0881l231L510J934k396j592L52N932r467j013l946r069Q061R19l07J3522
6250g672k74r887j229K904L991J0024J5231q534j0196m597N630K300M180q88n19
6235D64O430n637l239J339q749j0433K925O491Q762Q319j959k291J2671M889o336
6220A3646j4276l838O185j572K246n07m981O269N234j063j170J184r378N678L622
$$ plain form
6325 -10247 995 3201 3686 3906 -1455 -10413 -4580 -775 -5316 -3471 -89 1163 3194 9545 13396
6310 13396 12788 14808 11472 12387 8041 3863 -3631 -2540 3848 -3380 -12584 -14568 -3956 -2896 -1020
6295 -1020 10165 18868 17978 12872 1068 471 -4548 5313 6192 6966 5375 1078 -558 3155 8993
6280 8993 4108 4870 4344 -2494 -12953 -7197 -3357 -6365 -13992 -15468 -17370 -20218 -12603 -13516 -10881
6265 -10881 -14112 -10602 -8668 -11064 -12656 -12304 -6372 -15839 -16852 -20798 -29867 -21806 -20887 -21194 -7672
6250 -7672 -7946 -17833 -19062 -16158 -12167 -2143 13088 4554 -5642 -10239 -4609 -2309 1871 983 464
6235 464 6894 1257 -1982 -643 -9392 -19825 -16900 -10409 -1647 6672 4713 2422 15093 19982 13646
6220 13646 -630 -4468 1717 145 2391 1884 -3097 3172 8406 7343 6173 7357 -2021 3657 7279
6205G279J985l293J707l415J296Q782R993p5k024M772K640m42m889L276k150o950
6189A8492n504k921L214K3N693p553o019M850l940j986k859n363j149r50j034
6174g006J312L554M454J058n908J183j11M996p294Q015J3177p092k885M33n78
6159G308m600l881j1480j2575Q645M340O689J0718O607r985j2514K77K411k775
6145a0815j741K59j772M967l649l948R999J1644k001r737m31j523K177l619j659
6130a1849K38J588O657j93l555J3216l675p288J492l298l384J0979K633o023r907
6115a2369k083K170k929O456j433j763o931P690N908m971Q167O245p493L232M59
6100C55m023M16L883N26j838k436k092J857j431j852q26j67K443k031j445R656
$$ plain form
6205 7279 9264 5971 7678 4263 5559 14341 24334 24259 22235 27007 29647 29205 24316 27592 25442 18492
6189 18492 12988 10067 13281 13304 18997 11444 5425 10275 6335 4349 1490 -3873 -5022 -5972 -7006
6174 -7006 -5694 -2140 2314 3372 -2536 -1353 -1464 3532 -3762 4253 17430 10338 7453 7886 7308
6159 7308 2708 -1173 -12653 -25228 -16583 -12243 -5554 5164 11771 1786 -10728 -10451 -8040 -10815
6145 -10815 -12556 -12297 -14069 -9102 -12751 -16699 -6700 4944 2943 -6794 -7225 -8748 -6571 -10190 -11849
6130 -11849 -11611 -10023 -3366 -3559 -7114 6102 2427 -4861 -3369 -6667 -10051 928 3561 -2462 -12369
6115 -12369 -14452 -12282 -15211 -8755 -10188 -11951 -18882 -11192 -5284 -10255 -2088 4157 -3336 -104 355
6100 355 -3668 -3252 631 1157 -681 -3117 -5209 -3352 -4783 -6635 -7461 -7628 -5185 -7216 -8661 995
6084I95o192O490N253P22j2647k830J0699k616lQ2l33M708r964r169K261J731
6068a0813N055p55l130K827n631k441L886J0470J096j5742p463n86N01Q302J6577
6053B153l599l651p462O880N508n722q275L715P392R254j875P45R06q624J341
6038a314L55L257m175k989j25L573j223p209l127O145L628N695L246j1694k757
6023h714J3487P140j231n141k122m513j968R558j691r232K385M839o313q242L29
6008a1429R52j667L226r487m425J907j744J1152Q594J541P4J667n8l63k823o048
5992h931k593k748R111P170n164m526q69O928J0423J359p472k077L95k328o174
5977g496P47K443m000o09r48J547Q332N556n167M744J0194j480n310j758L349
$$ plain form
6084 995 -5197 1293 6546 7268 -5379 -8209 2490 -126 -129 -47 -380 4328 -5636 -14805 -12544 -10813
6068 -10813 -5758 -6513 -9643 -6816 -12447 -14888 -11002 -532 564 -15178 -22641 -23227 -22726 -14424 2153
6053 2153 -1446 -5097 -12559 -5679 -171 -5893 -14168 -10453 -3061 6193 4318 5063 5969 -2655 -1314
6038 -1314 -959 2298 -1877 -4866 -4991 -1418 -2641 -9850 -12977 -6832 -3204 2491 5737 -5957 -8714
6023 -8714 4773 11913 10682 5541 3419 -1094 -3062 6496 4805 -4427 -2042 2797 -3516 -11758 -11429
6008 -11429 -10477 -12144 -8918 -18405 -22830 -20923 -22667 -11515 -2921 -1380 -1306 361 303 -60 -2883 -8931
5992 -8931 -11524 -14272 -5161 2009 -3155 -7681 -8550 -1622 8801 10160 2688 611 1006 -1322 -7496
5977 -7496 -6749 -4306 -8306 -8915 -9863 -8316 16 5572 405 5149 15343 13863 8553 6795 10144
5962A0144L989j0795n557n945J859J1034o14L755L144j2q448J2615J664n393k345
5947I095k975n183L273Q49l012j224m298j336o051k184L376N036J410p111n676
5932a6011J346J2570P571K58n163J048J3679P339j5711l927K262j0536r335P513
5918g097J304P85o705K241k588R321L280k102j2596q674m10L132p36K416k522
5903b0951L497m3k58M110j977p80P520M679n99m549K725L681r683q83k511l755
5887a9777o70m71P814Q615l648k41P453j4837n040P807L824n877r424O948M001
5872a3523J43O987k332L825j624k892M965R566J1372K045r297m034q782n754o50
5857i985j451j591N344l265m260O439K871r01N635L700j69p910K282j266l195
$$ plain form
5962 10144 14133 3338 -2219 -8164 -6305 4729 4115 7870 11014 11002 2554 15169 16833 11440 9095
5947 9095 6120 937 4210 5059 2047 823 -3475 -4811 -10862 -13046 -9670 -4634 -3224 -10335 -16011
5932 -16011 -14665 -2095 5476 5734 571 1619 15298 22637 6926 2999 5261 -5275 -14610 -7097
5918 -7097 -5793 -5008 -11713 -9472 -12060 -2739 541 -1561 -14157 -22831 -23241 -20109 -20845 -18429 -20951
5903 -20951 -17454 -17497 -17755 -13645 -15622 -16402 -8882 -4203 -4802 -9351 -6626 -2945 -12628 -13511 -16022 -19777
5887 -19777 -20447 -20918 -13104 -4489 -8137 -8378 -925 -15762 -20802 -12995 -9171 -15048 -24472 -17524 -13523
5872 -13523 -13380 -6393 -8725 -4900 -6524 -9416 -4451 5115 16487 18532 9235 5201 -3581 -9335 -9985
5857 -9985 -11436 -13027 -7683 -10948 -15208 -8769 -5898 -6799 -1164 2536 2367 -5543 -3261 -4527 -7722
5842g722O037N162p470N326J978m325j4885J155R248O156m31l200p566l502J73
5827a3866J1854R742n720J353j884j966o631l670k737R10M388L840M843o00O596
5812F452q016j31P571j490j569J2984l611j2492o063L142M245n254l659l079K02
5797a0768N592r09o61J3058Q903p676j0520K88o663q127l977J435R382P406l386
5782f623j1519n109O55j315M259M056J0183J1442L453m064J205P610K36j3515
5768I54m054O825K358j1939o61k342J28J1091n1m357k901Q64p813n073Q363J423
5752g185p097j746o660P095J2584J697r957j709l125p32n300l699J1370N437O656
5737b371Q451L134j1072M071p08j219p044L688p385n853L483O170P688M059n758
$$ plain form
5842 -7722 -1685 3477 -3993 1333 3311 -1014 -15899 -14744 -5496 660 229 -2971 -10537 -14039 -13866
5827 -13866 -2012 7730 2010 3363 1479 -487 -7118 -10788 -13525 -12615 -8227 -4387 456 -144 6452
5812 6452 -1564 -1695 5876 4386 2817 15801 12190 -302 -6365 -3223 1022 -4232 -7891 -10970 -10768
5797 -10768 -5176 -6085 -6746 6312 15215 7539 -2981 -2693 -9356 -17483 -21460 -20025 -10643 -3237 -6623
5782 -6623 -18142 -23251 -22596 -23911 -19652 -15596 -5413 6029 9482 5418 6623 14233 14469 954
5768 954 -3100 3725 6083 -5856 -6517 -8859 -8731 2360 2309 -2048 -4949 -4085 -11898 -16971 -8608 -7185
5752 -7185 -14282 -16028 -22688 -15593 -3009 -1312 -11269 -12978 -16103 -16835 -22135 -25834 -14464 -9027 -2371
5737 -2371 6080 9214 -1858 2213 1505 286 -6758 -3070 -10455 -16308 -12825 -6655 1033 5092 -666
5722f66Q32N074J2727k59k878m343p293j0417p04Q827R193J166n727n259j0746
5707a0473j1819L107P327r77K337P82O986J1039n216j0162o597J0159K151p689
5693i045p255q45O512R066O334Q254P180q312q319p092J232P041M772m426j1412
5678f315m372O612K60P116P261l901k535j1351J591J950k155J35k601Q458J719
5663A872k499r756k142N171n382k531K155R914M508l974j267o840q670k681n903
5648b8025O769N277K404K836p779K435J0481P964N214K370p533j2458k159J722
5634a0482O655m786P479J0454k26k609j0698K053J1041j590p73M303N673m988
5620A1506j5980l796j967l973J3951N069l952q296K725O530J679q587l859P018
$$ plain form
5722 -666 166 5240 17967 17708 14830 10487 3194 -7223 -7927 900 10093 11259 5532 273 -10473
5707 -10473 -22292 -19185 -11858 -12835 -10498 -9716 -2730 8309 3093 -7069 -13666 -3507 -1356 -9045
5693 -9045 -16300 -17145 -10633 -1567 4767 13021 20201 11889 3570 -3522 -2290 4751 9523 5097 -6315
5678 -6315 -10687 -4075 -3815 3301 10562 6661 4126 -7225 -5634 -3684 -5839 -5704 -8305 153 1872
5663 1872 -627 -10383 -12525 -7354 -12736 -15267 -13112 -3198 1310 -2664 -3931 -10771 -19441 -22122 -28025
5648 -28025 -21256 -15979 -13575 -10739 -18518 -16083 -5602 2362 7576 9946 2413 -10045 -12204 -10482
5634 -10482 -3827 -8613 -1134 9320 9094 6485 -4213 -2160 8881 7291 6518 10821 16494 11506
5620 11506 -4474 -8270 -10237 -14210 -259 4810 858 -7438 -4713 1817 3496 -5091 -8950 -1932
5606a932L848j805j3843R03P398K169q454N74N130M716J2784m149q911L916k670
5591c26q50j1M070N978k62r124n060N636o637k297n85m219K818P286M256k563
5575a890l398r257L233N373k02N519l565o796J2185P297q271L846O656R2k678
5560H144r859k214p898p897N024P316O220M791N376p152k144P97K044m644j469
5545c565K47j025O0n434K56k221O999J171o93P456K057j2233n164N043n03J091
5529f458k105p798l290K409P677Q462J837o330p60Q299o447p255O376P840K008
5514D465p954j303L458j205J398j748o210n618O167M637K073J011j380M98O84
5499a027P075k795o759J206O71R369l84l813N352K30r69k918r22q38n641o107
$$ plain form
5606 -1932 1916 111 -13732 -12829 -5431 -3262 -11716 -11142 -6012 -1296 11488 7339 -1572 2344 -326
5591 -326 -1176 -1187 2883 8861 8599 -525 -5585 51 -6586 -8883 -9468 -13687 -10869 -3583 673 -1890
5575 -1890 -5288 -14545 -11312 -5939 -6141 -622 -4187 -10983 1202 8499 228 4074 10730 10822 8144
5560 8144 -1715 -3929 -11827 -19724 -14700 -7384 -1164 3627 9003 1851 -293 504 2548 -2096 -3565
5545 -3565 -3318 -4343 -4283 -9717 -9461 -11682 -4683 -3512 -4205 3251 5308 -6925 -12089 -7046 -7549 -6458
5529 -6458 -8563 -16361 -19651 -17242 -9565 -1103 734 -5596 -6356 1943 -4504 -11759 -5383 2457 4465
5514 4465 -3489 -4792 -1334 -2539 -1141 -2889 -9099 -14717 -8550 -3913 -1840 -829 -2209 -1711 -1027
5499 -1027 6048 3253 -3506 -2300 -1629 7740 7356 3543 8895 9125 8156 5238 4316 3478 -2163 -8270
5483h270j621N346l778L169J2133K783J876K560P142n626r565r540N094Q362p246
5468B819o675Q280j514o510l64J374k656M104L141k130P244J946k3o864q735k68
5452f831J5037M529p344j0928r69O872k957J0992K674l628m265k593m152K195
5438a368j092n406l33L014k607j966n491l896K458Q918J726L427N298q616P174
5423A240k796J77J8m491p93J0156m651j1821j3072J0802M053m113P354P505o85
5408a117O120p571p627M096M800M806o205o300n298R34r05K664n25j33J954L769
5392f538K006P794p461l727M247K351k606L420k12r013J422N792j929O041j640
5377e3o510n75p310M291R052j686L160m125L048p658m709Q737J0307N811Q33n635
$$ plain form
5483 -8270 -9891 -4545 -8323 -5154 6979 9762 11638 14198 21340 15714 6149 -3391 1703 10065 2819
5468 2819 -3856 4424 2910 -3600 -3964 -2590 -5246 -1142 1999 -131 7113 9059 9036 2172 -6563 -6831
5452 -6831 8206 12735 5391 -5537 -6506 366 -2591 8401 11075 7447 3182 589 -3563 -1368
5438 -1368 -2460 -7866 -8199 -5185 -7792 -9758 -15249 -19145 -16687 -7769 -6043 -2616 2682 -5934 1240
5423 1240 -1556 -1379 -1361 -5852 -6645 3511 -1140 -12961 -26033 -15231 -11178 -15291 -7937 -432 -1117
5408 -1117 5003 -2568 -10195 -6099 -1299 3507 -2698 -8998 -14296 -13362 -14267 -11603 -12128 -12261 -10307 -6538
5392 -6538 -4532 3262 -4199 -7926 -3679 -1328 -3934 -514 -726 -9739 -8317 -2525 -4454 1587 -53
5377 -53 -6563 -7138 -14448 -10157 -1105 -2791 369 -3756 -708 -8366 -13075 -4338 5969 11780 12613 6978
5361F978j2763p85j4M321O315N427o497m853k689N994K419L817n107k154l824
5346c415j0638L719J1437L336o772p765Q75n36k151J913K705l507p817k4P750
5331a0890J1349O966O205N20p626n336j2921k47L580L442N507m347k091n002l175
5316a4066J256J537K024O863l581j454P156J105o399J623P083o704m368Q001L516
5301C592m217k66r265L629Q273j792j430O949n335k903k877r92K23p583n242K648
5285a6588O880j0609K037J0574L877M767j260q038n29L095L646K335j173O58L844
5270C516K211K525O220k025m905n492l652O930k995J005j867P790j886k400j0403
5255e428j704j719L430m591k303M959n646O71k284p329p211J99N480O581P22O741
$$ plain form
5361 6978 -5785 -6570 -6584 -2263 4052 9479 2982 -1871 -4560 1434 3853 7670 2563 409 -3415
5346 -3415 -14053 -10334 1103 4439 -2333 -10098 -9223 -9759 -11910 -9997 -7292 -10799 -18616 -18640 -10890
5331 -10890 459 7425 13630 14150 6524 1188 -11733 -11980 -8400 -4958 549 -3798 -5889 -10891 -14066
5316 -14066 -12810 -11273 -9249 -2386 -5967 -7421 -265 840 -5559 -3936 3147 -3557 -7925 76 3592
5301 3592 -625 -891 -10156 -6527 1746 -46 -1476 5473 138 -2765 -5642 -6634 -6411 -13994 -19236 -16588
5285 -16588 -9708 -20317 -18280 -7706 -3829 938 -322 -8360 -8889 -5794 -2148 187 -986 -328 3516
5270 3516 5727 8252 14472 12447 7542 2050 -1602 5328 2333 3338 1471 9261 7375 4975 -5428
5255 -5428 -7132 -8851 -5421 -10012 -12315 -7356 -13002 -12331 -14615 -21944 -29155 -28956 -23476 -16895 -16173 -9432
5239i432j12Q164P479Q214k93l833l178J352j2623m480L589N711M067k560k795
5224g30p41m713l805n141M795K033m994J0040Q476q335k885l10p922J278N102
5209g852K045K189M247P488Q573K73j1387j5334O319N828n437o72J3558r22j539
5194G377M997r383q37N754j158n848k445N748J584M576n270l324o458n275m262
5179a4224k423Q63J059n325k462Q131N926L036k628J1664J077J388L696n135o093
5164a450j0718L853Q91J159O095Q488j5539p219L832N706q81J884K437q63o255
5149h580r552K998J0088P165J916P719k390J029o696l116r886L183L319K424j834
5134b213J455M852O75j2433k602k414J1637o221j7002j918J6519J6002m265j0254
$$ plain form
5239 -9432 -9544 -1380 6099 14313 14020 10187 7009 8361 -4262 -8742 -5153 558 4625 2065 -730
5224 -730 -1471 -6184 -9989 -15130 -10335 -8302 -13296 -3256 5220 -3115 -6000 -6310 -14232 -12954 -7852
5209 -7852 -5807 -3618 629 8117 16690 16963 5576 -9758 -3439 2389 -3048 -3720 9838 8916 7377
5194 7377 12374 2991 2154 7908 6750 902 -1543 4205 5789 10365 5095 1771 -4687 -9962 -14224
5179 -14224 -16647 -15784 -14725 -20050 -22512 -14381 -8455 -5419 -8047 3617 4694 6082 9778 4643 -1450
5164 -1450 -12168 -8315 -7424 -6265 -170 8318 -7221 -14440 -10608 -4902 -5783 -3899 -1462 -2325 -8580
5149 -8580 -18132 -15134 -5046 2119 4035 11754 9364 10393 3697 581 -9305 -6122 -2803 -379 -2213
5134 -2213 -758 4094 4769 -7664 -10266 -12680 -1043 -7264 -24266 -26184 -9665 6337 2072 -8182
5120h182j1190l685J1321K570P357O737m357m847k6L323P172M662j1338m441k879
5105g803l692O340o16n087N13M419r053r304J209J8964L254q180n970M114N996
5090d896M875M641l747K680n02p341j640m253M817L09o047j0449P049K599k738
5075a4643L907L922R820J685J178k932k478k353n044J835j317O891J0893Q398
5061A9762j7196J328j336J122q82p1k569r316l753r97M129P273M767J587m287
5046d39o992j412n187k172k05k786N238N603K152j89k925m008P86J2098J0404
5031I966L385k333p447j410L7n997m231O664O497p04O102p275n828m2l295j986
5015g897m91N308P681L175p978O345N022m360o426n563n441J3903l852j803J179
$$ plain form
5120 -8182 -19372 -23057 -11736 -9166 -1809 4928 571 -4276 -4302 -979 6193 10855 -483 -4924 -7803
5105 -7803 -11495 -5155 -5771 -10858 -10345 -5926 -14979 -24283 -23074 -4110 -856 -9036 -15006 -10892 -4896
5090 -4896 -21 4620 873 3553 3051 -4290 -5930 -10183 -5366 -5057 -11104 -21553 -14504 -11905 -14643
5075 -14643 -10736 -6814 3006 4691 5869 2937 459 -1894 -6938 -5103 -6420 471 11364 19762
5061 19762 2566 3894 2558 3680 2798 2727 158 -9158 -12911 -13908 -9779 -2506 2261 3848 -439
5046 -439 -7431 -8843 -14030 -16202 -16407 -19193 -13955 -8352 -6200 -6389 -9314 -13322 -12536 -438 9966
5031 9966 13351 11018 3571 2161 2198 -3799 -8030 -1366 5131 4427 10529 3254 -2574 -2616 -5911 -7897
5015 -7897 -8388 -3080 4601 7776 -202 6143 11165 6805 379 -5184 -10625 3278 -574 -2377 -1198
5000a198q55n306K24Q964J463n839M683P876J035r471O168R824m439o62p244r806
4984d583l537J1435O485r450k070P386q51m952k332m51o250m936j204J666Q613
4969e031n163j6437j268J8687J0545M672J450m243o5P563L35j1727j759n759j142
4954i342l340J4830M065j622j140r908j2835j554J2737R331P638n85m726l802
4940b53K706j920O133p570p820n763N812k589O620O317l850O654P71N141K557
4925A2946r014k906l010J371O81k100M51K963m437P528L0j555J669k29N333r717
4909Dp965j608J0425J294K356N74j492j5775r276l87J1342N594L613J1874j143
4894I430p331l044o77j2195m447L841P145p765M34k93o97J438M265n413r36j206
$$ plain form
5000 -1198 -2053 -7359 -7135 1829 3292 -2547 2136 10012 11047 1576 7744 17568 13129 12467 5223 -4583
4984 -4583 -8120 3315 9800 350 -1720 5666 4815 -137 -2469 -2920 -9170 -14106 -15310 -13644 -5031
4969 -5031 -10194 -26631 -27899 -9212 1333 6005 7455 3212 3147 10710 11045 -682 -2441 -8200 -9342
4954 -9342 -12682 2148 6213 4591 3451 -6457 -19292 -20846 -8109 1222 8860 8275 3549 -253
4940 -253 2453 533 6666 -904 -8724 -14487 -8675 -11264 -4644 1673 -2177 4477 5248 10389 12946
4925 12946 3932 1026 -1984 -613 68 -2032 -1581 1382 -3055 4473 4503 2948 4617 4388 9721 4
4909 4 -7961 -9569 856 2150 4506 5080 3588 -12187 -21463 -21850 -10508 -4914 -1301 10573 9430
4894 9430 2099 -945 -1622 -13817 -18264 -14423 -7278 -15043 -14609 -14902 -15599 -14161 -9896 -15309 -16245 -17451
4878a7451k953j412Q491J533J991Q765M020l027M136J1665k392o700j111o0r188
4863c693l844M004L897L134p026o471J238N74N297J447j852n220Q537J0897k617
4848H302p349o89j112n144o593r77J8869R234r864p645j0338j4008p86R286k776
4833b1590N423N763M149L097L27n738J607J1463L933n342l985L698k350O93j2883
4818a1735N70K702p460o316o41K736l279M808O460R359O525L384K392j585p949
4803b9l376P268O07k789j1278L660M353M899n71k511Q10K065N746K644P38j2148
4787H8j4316M519q113m31P319O656J1696m552n146o078O251R32n418r101j682
4772a7376J7844M426j2323o942m740O292J0245K066k944p520p774R031J3700P516
$$ plain form
4878 -17451 -20404 -21816 -13325 -11792 -9801 -1036 2984 -43 4093 15758 13366 6666 5555 5495 -3693
4863 -3693 -7537 -3533 364 3498 -3528 -9999 -8761 -8187 -2890 -1443 -3295 -8515 22 10919 8302
4848 8302 953 264 -848 -5992 -12585 -13562 5307 14541 4677 -2968 -13306 -27314 -28100 -18814 -21590
4833 -21590 -16167 -10404 -6255 -3158 -2831 -8569 -6962 4501 8434 3092 -893 2805 455 1148 -11735
4818 -11735 -11165 -8463 -15923 -22239 -22880 -20144 -23423 -18615 -12155 -2796 3729 7113 9505 7920 -29
4803 -29 -3405 3863 4470 1681 -9597 -5937 -1584 3315 2744 233 1043 3108 8854 11498 12236 88
4787 88 -14228 -9709 -17822 -18253 -10934 -4278 7418 2866 -2280 -8358 -2107 -1175 -6593 -15694 -17376
4772 -17376 468 4894 -7429 -14371 -19111 -12819 -2574 -508 -3452 -10972 -18746 -9715 3985 11501
4758A1501j546K446j812o637k755m387m526l90R097J679J017n597k056n591J0948
4743A391J2706m162o436l818Q923K573j623P622o572j4685n225N85O20j663J088
4728h676M605n852J949L591l70n164l412K62j1246j80J2844L468M928J3495m074
4713F168n566L491j548M412n815n287K115n67k47k067J315k43m517K391O835K782
4697C652q522n579K920n426N087N891J827N267M189K278O669q989j3027l30k201
4682f294m121J079J3760N325n053r942J394N198n905O751M197n56k981N244L825
4667A1921K088k982p875j1866K477K658j187J342R31p207p492qP80L560M663k054
4651a0251O626K646L470n434k35m772p430Q561J1437l501k530l425l325J9000
$$ plain form
4758 11501 9955 12401 10589 3952 1197 -3190 -7716 -8106 991 2670 3687 -1910 -3966 -9557 1391
4743 1391 14097 9935 3499 -319 8604 11177 9554 17176 10604 -4081 -9306 -8721 -8101 -9764 -8676
4728 -8676 -4071 -9923 -7974 -4383 -4753 -9917 -13329 -13067 -24313 -24493 -11649 -8181 -3253 10242 6168
4713 6168 602 4093 2545 6957 1142 -4145 -2030 -2597 -2844 -4911 -3596 -3839 -8356 -5965 870 3652
4697 3652 -4870 -10449 -7529 -12955 -7868 -1977 -150 5117 9306 11584 18253 9264 -3763 -4093 -6294
4682 -6294 -10415 -9336 4424 9749 4696 -5246 -3852 1346 -4559 2192 6389 5833 2852 8096 11921
4667 11921 14009 11027 3152 -8714 -6237 -3579 -4766 -3424 -2493 -9700 -17192 -17200 -16420 -12860 -8197 -10251
4651 -10251 -3625 -979 2491 -2943 -3178 -7950 -15380 -6819 4618 1117 -1413 -4838 -8163 10837
4637A0837P488j476o518m459Q037J434q022l269m026k679R153N762M197R362r657
4622A6164K57O302j2194j1849K397m499K144R194l58O52p445N361o166m796P067
4607B231k531m605q040M991J1451J1321M217j0068n547j912n005j554M209q764
4593i606r635O933J4950Q615m040K611m469j518j1932j1170R380Q57j633N355
4579e302J1869Q655m061q811n736p23M622N003j995q146k287P672j25K388L087
4564F110m239O903L314o682p216o256l395o445J271N689N617R884N598j822J60
4549H491J155K227m800J287k182L494J136N122j0173O58R81l005l308k086q669
4534i672R99m710j493l014N489O473K76l711k612m08j563N067L11q638K722K145
$$ plain form
4637 10837 18325 16849 10331 5872 13909 15343 7321 4052 26 -2653 6500 12262 16459 25821 16164
4622 16164 16421 22723 10529 -1320 1077 -3422 -1278 7916 7558 8210 765 6126 -40 -4836 2231
4607 2231 -300 -4905 -12945 -7954 3497 14818 19035 8967 3420 1508 -3497 -5051 -842 -9606
4593 -9606 -19241 -12308 2642 11257 7217 9828 5359 3841 -8091 -19261 -9881 -9024 -10657 -5302
4579 -5302 6567 15222 11161 2350 -3386 -4109 513 5516 3521 -4625 -6912 760 635 3023 6110
4564 6110 1871 8774 12088 5406 -1810 -8066 -11461 -17906 -16635 -10946 -5329 4555 10153 8331 8491
4549 8491 9646 11873 7073 8360 6178 9672 10808 15930 5757 6415 7396 4391 1083 -1003 -9672
4534 -9672 -8673 -13383 -14876 -17890 -12401 -5928 -5652 -9363 -11975 -12383 -13946 -8879 -8568 -17206 -14484 -12339
4518a2339o252N884P228J0463j933m474p662N977R442L899N41k710O446J795j3058
4503C247K175r28j8107j558P176O43j926K145j407L217N607K407n621k162o152
4488a1244j938P21K0j106O986J3503n774l150M061M171P841R654o549r779K418
4473I835k292n520l966Q850K154k455P534l056j6533q514L574N484l140l487j048
4458a2580l486N837m799J3266R414J2018L318k296N210o023o026k73k408l732
4444G440k505N985J358o069n471N831K587k706o332N241m054j0779K938J33l514
4429i917j736k822m083M648J1367N738O304J352m314p735k230O842P481o00n184
4414E111k563J453l505N514o97n704J2635n91k14p546r213k740R658P170l41m597
$$ plain form
4518 -12339 -18591 -12707 -5479 4984 3051 -1423 -9085 -3108 6334 10233 10774 8064 14510 16305 3247
4503 3247 5422 4494 -13613 -15171 -7995 -7352 -9278 -7133 -8540 -5323 284 2691 -2930 -5092 -11244
4488 -11244 -13182 -12461 -12441 -13547 -6561 6942 1168 -1982 2079 6250 14091 23745 17196 7417 9835
4473 9835 7543 2023 -1943 6907 9061 6606 14140 11084 -5449 -13963 -10389 -4905 -8045 -11532 -12580
4458 -12580 -16066 -10229 -15028 -1762 7652 19670 22988 20692 25902 19879 13853 13580 11172 7440
4444 7440 4935 10920 12278 6209 738 6569 9156 6450 118 5359 1305 -9474 -6536 -6403 -9917
4429 -9917 -11653 -14475 -18558 -13910 -2543 3195 9499 10851 6537 -1198 -3428 3414 10895 10295 5111
4414 5111 2548 4001 496 6010 5313 -391 12244 11653 11439 3893 -5320 -8060 1598 8768 8427 3830
4398C830o003o984m226O956M701L471J4453M120r94o652Q092P63j3931m796k042
4383G58J147N279Q635k956J357j234k300k226q094j64j838p62L448r973l201R72
4367a1152Q850L251m099n754r408o29J98J1496J1872J969J099m884n961l831n909
4352a2892R901Q659k877n49J410j0415Q54J0198R451l882j1419J63q44K329r15
4337h28j1413J633J1928N716m931r009o218K500J4946p784m216p627K10l072J0313
4322g852L76j0775J942J8898J2712n101j4128l754O98O629O823J575p30l371q198
4307d256q471J1749J1208N427k907o767j0342k956m930K145R76K458J2993J41
4293F468j4091N6M324J820K49r493j236O222K338M445k45J85k388q46P792P5n384
$$ plain form
4398 3830 -2173 -9157 -13383 -6427 -1726 1745 16198 20318 19324 12672 20764 21527 7596 2800 758
4383 758 1905 7184 15819 12863 14220 12986 10686 8460 366 202 -1636 -2398 1050 -8923 -12124 -11152
4367 -11152 -2302 949 -3150 -8904 -18312 -18941 -18743 -7247 4625 6594 7693 2809 -3152 -6983 -12892
4352 -12892 -2991 5668 2791 2242 3652 -6763 -5909 4289 13740 9858 -1561 -1398 -2242 87 -828
4337 -828 -12241 -10608 1320 7036 2105 -6904 -13122 -10622 4324 -3460 -7676 -15303 -15093 -18165 -7852
4322 -7852 -7476 -18251 -16309 2589 15301 10200 -3928 -7682 -6984 -355 6468 8043 7313 3942 -4256
4307 -4256 -12727 -978 10230 15657 12750 5983 -4359 -7315 -12245 -10100 -9124 -6666 6327 6468
4293 6468 -7623 -7567 -3243 -1423 -1174 -10667 -11903 -5681 -3343 1102 857 1042 -1346 -2192 5600 5675 291
4276B91J818N179L185O02M764O315l401k89k484O451m195r548j6261R74P824P764
4260H989K612k329n162j634n046n60l656o098O901k296K850R639l784p493k254
4245i321N203J4944J1644l249l019k464q884Q60j170L485L559l941K094P89l077
4230G453L946K371Q14r259p944p17n833K736M2K585K632n194j655J0631m885n353
4214g630O164L767j1616n784J535P150J618J4494j472O12r85p129r685L198J1320
4199E557J0516m590o240j804J640J483L3m420m947N420l739l145j637L591P024
4184D742K77M52r275k848N413P542J504r034q535M295R993N407n411K19J597j6072
4168i734n522P546L400N573o614r32R643N176k518n951m484O967J414J0554O178
$$ plain form
4276 291 2109 7288 10473 11075 15839 22154 18753 18464 15980 22431 18236 8688 -7573 -6599 1225 8989
4260 8989 11601 9272 4110 2476 -2570 -3130 -6786 -12884 -5983 -8279 -5429 4210 426 -7067 -9321
4245 -9321 -4118 10826 22470 19221 16202 13738 4854 5714 4544 8029 11588 7647 9741 10530 7453
4230 7453 11399 13770 14584 5325 -2619 -3336 -9169 -6433 -6391 -3806 -1174 -6368 -8023 2608 -2277 -7630
4214 -7630 -1466 2301 -9315 -15099 -13564 -6414 -4796 9698 8226 8838 7853 724 -8961 -5763 5557
4199 5557 16073 11483 5243 3439 5079 6562 6595 2175 -2772 2648 -1091 -4236 -5873 -2282 4742
4184 4742 5019 5471 -3804 -6652 -1239 6303 7807 -1227 -9762 -5467 4526 9933 4522 4741 6338 -9734
4168 -9734 -15256 -7710 -4310 1263 -5351 -6283 3360 8536 6018 67 -4417 2550 3964 14518 20696
4153B0696p088o399j4160n194m228K336K230M042j819J780O568O24l974p990m462
4138a7038K356J4685J1614j459m622N780N630L819n908o35N636q653n897J622
4124F930j587n586M991j02n371r444j665J4232m891M725j2391j8064J871P781
4110a8571J2990m65p924R56L279K333N725l117j211q1m240O569Q866P894j5234
4095b231m499J535P713j345O609k301j2799M97M492n760J229j21K939L378n32
4080a196j401M268K297p61K195J1190j270o028n075J48L926r640j4902q06J2468
4065d587R350K751l241k008k953K274K295L048N355P656N734n649o836m33l708
4050I048n425j491m982J132j255N79m211q9O980K23n338n447j771m526J2L563
$$ plain form
4153 20696 13608 7209 -6951 -12145 -16373 -14037 -11807 -7765 -9584 -7804 -1236 -612 -4586 -12576 -17038
4138 -17038 -14682 3 11617 10158 5536 11316 16946 20765 14857 14222 19858 11205 5308 6930
4124 6930 5343 -243 4748 4646 -725 -10169 -11834 2398 -2493 2232 -10159 -28223 -26352 -18571
4110 -18571 -5581 -6046 -13970 -13014 -9735 -7402 -1677 -4794 -6005 -6086 -10326 -3757 5109 13003 -2231
4095 -2231 -6730 -5195 2518 1173 7782 5481 -7318 -6821 -2329 -8089 -6860 -6981 -4042 -664 -1196
4080 -1196 -2597 1671 3968 3207 5402 16592 15322 9294 4219 4367 8293 -1347 -16249 -17055 -4587
4065 -4587 4763 7514 4273 2265 -688 1586 3881 6929 12284 19940 25674 20025 13189 12756 9048
4050 9048 3623 2132 -2850 -1718 -2973 -2394 -6605 -6694 286 509 -4829 -10276 -12047 -16573 -16561 -12998
4034a2998L799M777o021k056J6384M701j121m765k45O420K519r174n029j009J652
4019b166j554l077j233j145l678O634o411j2676P06R394J4486J0338q26o436j458
4004H98j2072j1903J4656n42O216Q817L550r173k2452L085N987l14J707O33j0248
3989b1155K147Q436J564P212O370q497N364J1028l03n705n87j5035L922R231o196
3974b204q015j0942n256K898N257l75j138L638O591N626o28L034M92o234M785
3959b471j700o270p582l922N004J2808L932J245K176k788j0336M502P677J2884
3945A5159N159n072o495l50R64N181M903M537l869j1144m886n706j918R883M830
3930A1176r410j119l699l967J954J2657N345r368j801R127M856L139j280N35p315
$$ plain form
4034 -12998 -9199 -4422 -10443 -12499 3885 8586 7465 2700 2455 8875 11394 2220 -2809 -3818 -2166
4019 -2166 -3720 -6797 -8030 -9175 -12853 -6219 -12630 -25306 -24600 -15206 -720 9618 8792 2356 898
4004 898 -11174 -23077 -8421 -8963 -2747 6070 9620 447 -22005 -18920 -12933 -13247 -11540 -10907 -21155
3989 -21155 -19008 -10572 -9008 -1796 4574 -3923 1441 12469 12166 6461 5874 -9161 -5239 3992 -2204
3974 -2204 -10219 -21161 -26417 -23519 -18262 -18637 -19775 -16137 -9546 -3920 -4548 -1514 -1022 -7256 -2471
3959 -2471 -4171 -10441 -18023 -21945 -16941 -4133 -201 1044 3220 432 -9904 -5402 2275 15159
3945 15159 20318 15246 8751 8401 9365 14546 19449 23986 20117 8973 4087 -1619 -3537 6346 11176
3930 11176 1766 647 -3052 -7019 -5065 7592 12937 3569 1768 10895 15751 18890 17610 18145 10830
3915A0830m282l031J0J8835P214o146j4728n634k467N39r105N864N712j925m356
3900b670j37N676L676K332j868n534J740K980o634l203j157l30j695R833P439
3885A0448j717Q292M500j067j9023q269J145l466L829J480k2M975n922P690p38
3870B135q807n840K887M180k506N751P930k397p788k320k369k203k997P655J6127
3855I438n703j1696l110L778l37P735L382K525j693m078M752N251n081k141m670
3840a648m683N341n371k794J938J778L731n62J990P543M291j9230o309N807P84
3825g394j1556m748L513Q363M318K2L357N224m11r750l357L064k963q739O526
3810a4531J5735j775r891l877K726J462K405L099M295J441l926l60N492J997R084
$$ plain form
3915 10830 6548 3517 3527 22362 29576 23430 8702 3068 601 1140 -7965 -2101 3611 1686 -2670
3900 -2670 -2807 2869 6545 8877 7009 1475 3215 6195 -439 -3642 -4799 -5129 -6824 3009 10448
3885 10448 8731 17023 21523 20456 1433 -6836 -5691 -9157 -5328 -3848 -3870 1105 -4817 2873 2135
3870 2135 -6672 -12512 -9625 -5445 -7951 -2200 5730 3333 -4455 -6775 -9144 -11347 -14344 -6689 9438
3855 9438 3735 -7961 -11071 -7293 -7630 105 3487 6012 4319 241 4993 10244 5163 3022 -1648
3840 -1648 -6331 -990 -6361 -9155 -7217 -5439 -1708 -2270 -280 7263 11554 -7676 -13985 -8178 -7394
3825 -7394 -18950 -23698 -20185 -11822 -7504 -7482 -4125 1099 688 -9062 -12419 -9355 -12318 -21057 -14531
3810 -14531 1204 -571 -10462 -14339 -11613 -10151 -7746 -4647 -352 1089 -2837 -3197 2295 4292 13376
3795A3376K101o776j132J956l249o487J3706n965j2031K957M449p109M318J0028
3781A0142p585q332N005n181k877O006l834M134P675k703o032j934n627J0730
3767d13p47J8O25N721r48n978J834K330O020N531m740j4152O430K632j74k322
3751A667q270L601J0927K427k875l895l585j463r492L497L121l077J114O25O457
3736G79M062q355m396L584K745m405Q12J701n702J489J60P129L603M350j150L210
3720I616J130k474M245o1l428K690m768j1077M452L815m959p617O730L971J286
3705C551o827J41R3M707J768Q048p590l373R606j248j2354J006L722p557r369
3690a5676N29Q519J4742O735L996L512o52r130j0497o067O36J1559L055K420M985
$$ plain form
3795 13376 15477 8701 7569 9525 6276 -211 13495 7530 -4501 -1544 2905 -4204 114 10142
3781 10142 2557 -5775 -770 -5951 -8828 -2822 -6656 -2522 5153 2450 -3582 -5516 -11143 -413
3767 -413 -1160 -1142 -517 5204 4256 -1722 112 2442 8462 13993 9253 -4899 1531 4163 3989 1667
3751 1667 -6603 -3002 7925 10352 7477 3582 -3 -1466 -10958 -7461 -4340 -7417 -6303 -5678 779
3736 779 4841 -3514 -7910 -4326 -1581 -5986 -5174 -3473 -9175 -7686 -7526 -397 3206 7556 6406 9616
3720 9616 10746 8272 12517 12456 9028 11718 6950 -4127 325 4140 -819 -8436 -1706 2265 3551
3705 3551 -3276 -3135 -3042 1665 3433 11481 3891 518 10124 8876 -3478 -2472 1250 -6307 -15676
3690 -15676 -15147 -6628 8114 14849 18845 22357 21705 12575 2078 -3989 -3353 8206 11261 13681 18666
3675A8666m456k515o494k881K239p467r566j128j299k94O100l174R91L847O857
3660e74L457K827j4209l317N981Q458m114j570n189n434L873O713K478R557N705
3645A4642p28p489j1804K662j0595j40O141J9023J0525p955q577o92r965k609
3631g561k93J3266K713o846N12n302o59J552l534L100L567O317K533m095j121
3616D149m083k445l343J462R790J556J009r688q275J226n733k591K650K39l2J0650
3600c459N412o173J674n384j70l5N914r36n976J2920M592p430j1479m82N68K272
3584h172J254k493l57J5100m986j2015K251M034M401J2396P23k051k884L525J2958
3569B3684j645j0227j8330M41o97R877N299m577L107P294M298k013o550r948r710
$$ plain form
3675 18666 14210 11695 5201 2320 4559 -2908 -12474 -13602 -14901 -15195 -9095 -12269 -11278 -7431 -574
3660 -574 2883 5710 -8499 -11816 -5835 2623 -1491 -3061 -8250 -13684 -9811 -3098 -620 8937 14642
3645 14642 13914 6425 -5379 -2717 -13312 -13452 -7311 11712 22237 14282 5705 5013 -4952 -7561
3631 -7561 -7854 5412 8125 1279 1791 -3511 -4170 -2618 -6152 -3052 515 6832 9365 5270 4149
3616 4149 66 -2379 -5722 -4260 5530 7086 8095 -1593 -9868 -8642 -14375 -16966 -14316 -14077 -14109 -3459
3600 -3459 1953 -4220 -2546 -7930 -8100 -8135 -2221 -3157 -9133 3787 8379 949 -10530 -11012 -10444 -8172
3584 -8172 -6918 -9411 -9768 5332 346 -11669 -9418 -5384 -983 11413 12136 10085 7201 10726 23684
3569 23684 22039 11812 -6518 -6077 -6774 3103 8402 3825 6932 14226 18524 16511 9961 13 -9697
3554i697j489O225K761o29n600J16J18l531l399O805P699M800J900r23k080m383
3538a307m477J30j1L275O954j47o140L42k293r608j816L268j39M194k28J940R203
3521C140M990j3905m116K126q82j789j16N366P280j021q35k240p243M258Q59k160
3505f288J3753L362k525K539p217q294o92m902o718m933j157L061P794O534P624
3490A941l523r97M735n579n783M571J157k676M822Q160o854o904N067L651Q457
3475A0245O591K77o00J615k158o23n777r161O189L984J879k237l479n635N927
3460G037L177j0895j376l698K12Q764N710K178K088O519O31j0303j6067n274R180
3445b117r80J1953k953r670Q698K963j615K468o133q572N330J0239J0639J298
$$ plain form
3554 -9697 -11186 -4961 -2200 -2829 -8429 -8313 -8195 -11726 -15125 -8320 -621 4179 6079 5156 3076 -1307
3538 -1307 -5784 -5654 -5665 -2390 4564 4417 -1723 -1381 -3674 -13282 -15098 -11830 -11969 -7775 -8003 -6063 3140
3521 3140 8130 -5775 -9891 -7765 -8647 -10436 -10552 -5186 2094 1073 238 -2002 -9245 -4987 -4128 -6288
3505 -6288 7465 10827 8302 10841 3624 -4670 -5362 -10264 -16982 -21915 -23072 -20011 -12217 -5683 1941
3490 1941 -1582 -2579 2156 -3423 -9206 -4635 -3478 -6154 -1332 6828 -26 -6930 -1863 1788 10245
3475 10245 16836 17113 16513 18128 15970 15347 9570 409 6598 10582 12461 10224 6745 1110 7037
3460 7037 10214 -681 -2057 -5755 -5543 3221 8931 11109 13197 19716 20347 10044 -6023 -11297 -2117
3445 -2117 -3097 8856 5903 -3767 4931 7894 6279 8747 2614 -5958 -628 9611 20250 21548
3431B1548r71k441p694m350m624l286m892K379J0936L368J099L735p332q907J0082
3416H650n996o667p899P049J1650j569O61l214j2646L443O787l605J651J039k024
3401b690M168O270j910k997L554o481k316j180n973M892N25Q11K938n567q35M925
3385a866K55j2161L156J0079J287p061o166o466L399J5022M939q475k685J1208
3371D465n73o829o870P509k0j1985j906k61L552J0768l881j5439Q583J5276J1475
3356A3864o021q974q784N611L303K444m077j2731J942J1403l588Q067K912K61
3342E632m06n747N747J079K561j7q71P8o129m724K929J423J223L214k233o578
3326b819k758l718j0951n735P233L660M979n462l481K143K575J5035J0081l19
$$ plain form
3431 21548 20577 18136 10442 6092 1468 -1818 -6710 -4331 6605 9973 11072 14807 7475 -1432 8650
3416 8650 2654 -4013 -11912 -4863 6787 5218 5879 2665 -9981 -6538 249 -3356 -1705 -666 -2690
3401 -2690 1478 7748 5838 2841 6395 -86 -2402 -3582 -9555 -4663 -4138 -3327 -389 -5956 -6791 -1866
3385 -1866 -1611 -13772 -10616 -537 750 -6311 -12477 -18943 -15544 -522 4417 -4058 -6743 4465
3371 4465 3892 -2937 -9807 -2298 -2318 -14303 -16209 -16470 -12918 -2150 -6031 -21470 -12887 2389 13864
3356 13864 7843 -1131 -9915 -4304 -1001 1443 -2634 -15365 -13423 -2020 -5608 2459 5371 5632
3342 5632 5226 -521 5226 6305 8866 8849 7978 8056 1927 -2797 132 1555 2778 5992 3759 -2819
3326 -2819 -5577 -9295 -20246 -25981 -18748 -15088 -10109 -15571 -19052 -16909 -14334 701 10782 10463
3312A0463N902L757K275l055p307N838j675k041p37L467o109k925L632j504m177
3297E804k926r81K933l238l7M464n627l878k147J2137L957n917J43l79Q56M481
3281I645Q174r255k89L268K910j3485L305j135j4187l688O878L931N470M117Q69
3266F528q144M553m434k609O947P771O156M540j407n99k099P55K347J403r244
3251A2464r419k119M669m79P233l479p026n24K729J580k492l911m263P208L639
3236E810j023n268l135m832r515l403J1073J5329n885m134m544p795M099M867
3222h356K53q181R865J0170K663o303L313k000l609p731m190O601l806N726N11
3207e074N34M677o627j6164J148J1797N142j671m60R058L078J852J563j1130m794
$$ plain form
3312 10463 16365 20122 22397 19342 12035 17873 16198 14157 13420 16887 10778 7853 11485 9981 5804
3297 5804 2878 1897 4830 1592 1555 6019 392 -3486 -5633 6504 10461 4544 4687 4308 5164 9645
3281 9645 17819 8564 8275 11543 14453 968 4273 3138 -11049 -14737 -7859 -3928 1542 5659 6528
3266 6528 -1616 2937 -1497 -4106 2841 10612 16768 21308 19901 19302 17203 17958 20305 21708 12464
3251 12464 3045 926 5595 5116 12349 8870 1844 1320 4049 5629 3137 -774 -5037 2171 5810
3236 5810 4787 -481 -3616 -8448 -17963 -21366 -10293 5036 -849 -4983 -9527 -17322 -13223 -8356
3222 -8356 -8103 -16284 -6419 3751 6414 111 3424 1424 -2185 -9916 -14106 -7505 -11311 -5585 -5074
3207 -5074 -4540 137 -6490 -22654 -21506 -9709 -4567 -6238 -6698 2360 5438 7290 8853 -2277 -7071
3192g071l563L279N997K516m82j883J979k84m560l969j3699o406M154R317J2703
3177a972N383o80j5426J296J2479o355p027M272N885l825l112J337L600q85K326
3162b704r56k980J0227K590L624L249L91N983r327n69l306j0707o829J0851m904
3147e367m591N449J4894J147n24l208l733m925m364l967l877k786Q182Q257J2923
3132A3510l318l534k552j262R381R713j539r048j797R488R424J107J75p55q471
3117B0522r761m066n143n309m778M601J4358M859n461P403L77q417k546j656P583
3102A2566l056j048j183l502o899q577M73M612K735R13m726p85N585N108J439
3087C655k800r258q975j209J571J3193L090K647R59L752k84m199l164J103J0536
$$ plain form
3192 -7071 -10634 -7355 -1358 1158 676 -1207 772 488 -4072 -8041 -21740 -28146 -23992 -14675 -1972
3177 -1972 3411 2731 -12695 -11399 1080 -5275 -12302 -8030 -2145 -5970 -9082 -7745 -4145 -5030 -2704
3162 -2704 -3660 -6640 3587 6177 9801 13050 13441 19424 10097 9528 6222 -4485 -11314 -463 -5367
3147 -5367 -9958 -4509 10385 11532 11008 7800 4067 -858 -5222 -9189 -13066 -15852 -7670 587 13510
3132 13510 10192 6658 4106 2844 12225 21938 20399 11351 9554 19042 28466 29573 29748 28993 20522
3117 20522 10761 6695 1552 -3757 -8535 -3934 10424 15283 9822 17225 17602 9185 6639 4983 12566
3102 12566 9510 8462 7279 3777 -3122 -11699 -11226 -6614 -3879 -2966 -7692 -8477 -2892 2216 3655
3087 3655 855 -8403 -17378 -18587 -17016 -3823 -733 1914 2873 6625 6341 2142 -1022 81 10617
3072A0617N146j4660q631K701Q135P16q614o156k303J22l08P281N573Q065K471
3057A0155l373J684m794K080J0601q15m718m611p239J466r076j604k862j5413
3043b8519J72J3530K091k699Q682K208j242k010J3253M538l100J23j97j311q431
3028b912l311N433j1336k796k062N109R405M667q992j1971O115J064J1629K741
3014B783O164k394o492j632Q977N436r8N51n35Q018o136q965l403L053J849j654
2998E522M060j441o716n50L459K9Q00N2J819Q66p23j248r573l866P796Q51o597
2981e460j0118M30R920P85l932Q188j893J52L583Q676J4454j962l480n502k689
2966A1152m035L838n543n784n92J332P8J507R205N394J075N72j125m793n504L647
$$ plain form
3072 10617 15763 1103 -7528 -4827 3308 4024 -4590 -10746 -13049 -12927 -13235 -5954 -381 7684 10155
3057 10155 6782 8466 3672 5752 16353 15538 10820 6209 -1030 436 -8640 -10244 -13106 -28519
3043 -28519 -28347 -14817 -12726 -15425 -6743 -4535 -5777 -7787 5466 10004 6904 7027 6830 5519 -2912
3028 -2912 -6223 -790 -12126 -14922 -16984 -11875 -2470 2197 -6795 -18766 -12651 -11587 42 2783
3014 2783 8947 6553 61 -1571 7406 12842 12744 13295 12760 20778 14642 5677 2274 5327 7176 5522
2998 5522 9582 8141 1425 875 4334 4363 5163 5215 7034 7900 7177 5929 -3644 -7510 286 1137 -5460
2981 -5460 -15578 -15148 -5228 -4443 -8375 -187 -2080 -1928 1655 10331 24785 22823 19343 13841 11152
2966 11152 7117 10955 5412 -372 -964 368 446 1953 11158 16552 17627 18199 17074 12281 6777 10424
2950A0424N699J811L387m365l552q077M915l916m988j0754q364L378J6049N038
2936F685L017m685L351N898n174j5712l195M509m726J602n626l724l226R263K289
2921i454j617J099K346L665N302l350k585J0796M190j4527k517L963J468m399
2907e620K151N052K749m140N579M11m842J808M22j0405j4814J0301O631J983L156
2892D22J932l580O90J0946J2590m223j0173J883m34r616J1014O301j665M720K738
2877B3545q904K883J601l104l761p148m410o940M344J0082M844j912J70J430N157
2862A7877l813o030o213N048J161k866p90O413n434q104O170M34j783j1724J379
2847h275J2711P072p269j4086m716M523J21l687K270J0628Q014J1509M952j91
$$ plain form
2950 10424 16123 17934 21321 16956 13404 5327 10242 6326 1338 -9416 -17780 -14402 1647 6685
2936 6685 9702 5017 8368 14266 9092 -6620 -9815 -5306 -10032 -8430 -14056 -17780 -21006 -11743 -9454
2921 -9454 -11071 -9972 -7626 -3961 1341 -2009 -4594 6202 10392 -4135 -6652 -2689 -1221 -5620
2907 -5620 -3469 1583 4332 192 5771 6182 1340 3148 3570 -6835 -21649 -11348 -4717 -2734 422
2892 422 2354 -1226 -536 10410 23000 18777 8604 10487 10053 437 11451 17752 16087 20807 23545
2877 23545 14641 17524 19125 16021 12260 5112 702 -6238 -1894 8188 13032 11120 11290 12720 17877
2862 17877 14064 8034 1821 6869 8030 5164 4374 10787 5353 -2751 3419 3853 2070 -9654 -8275
2847 -8275 4436 11508 4239 -9847 -14563 -10040 -9919 -13606 -11336 -708 7306 18815 23767 23576
2833B3576n222r405m004k959m850L652L223k198L172O39n188j785p497M489O361
2818B004O153L486K687L648J509n895M732m293p549p267k626O578J281N053n128
2803D373p004l401J523R121J916m504o326m407L859R3P428M793o279K181R515
2788A2881j0912M12k41m93q93j973K690m222P264M681p188l133Q075R890m83p187
2772I168r158o120Q627J1826j0288j2615j83M487M762P510O943o511j2445K79
2758c718J675l099j0042l04P527J128k17j874J2474R289q208o415N990j78p633
2743c605M692J773n42r914L488k546j503r404J741N958j842J1826N695k425J502
2728D894O763m19j394N338j317R89j2469L439J0952o33p64j0078j0830l840J3635
$$ plain form
2833 23576 18354 8949 4945 1986 -2864 788 4011 1813 4985 5624 436 -1349 -8846 -4357 2004
2818 2004 8157 11643 14330 17978 19487 13592 18324 14031 6482 -785 -3411 3167 4448 9501 4373
2803 4373 -2631 -6032 -4509 4612 6528 2024 -4302 -8709 -4850 -4757 2671 7464 1185 3366 12881
2788 12881 1969 2381 2140 1647 754 -1219 1471 -2751 4513 9194 2006 -1127 6948 16838 16355 9168
2772 9168 10 -6110 2517 14343 4055 -8560 -8743 -4256 506 8016 14959 8448 -3997 -3718
2758 -3718 -2043 -5142 -15184 -15488 -7961 -6833 -7050 -8924 3550 12839 4631 -1784 4206 4028 -3605
2743 -3605 1087 2860 2318 -7596 -4108 -6654 -8157 -17561 -15820 -9862 -11704 122 5817 3392 4894
2728 4894 11657 11238 9844 15182 13865 14854 2385 5824 16776 16143 15379 5301 -5529 -9369 4266
2713D266R627k597n337p62q754l295M812m572k409R972N30j2832L536M435M809
2698A429N199k196O288j2266q662K783r17k391k505O71K408K633K818J590J621
2683a497m920L39N935K100r243l386J3828J1457k163o717r891j0125R945J0475
2669F137O297K234q367j3701o669J633M769P04m314L504N565M252K686m078l520
2654b868J785N363N529Q920M169l290p810L517o883o929k446k689P99o90M677
2639A154n38L810R177j697J441R259L268k682j0860k742j1860M43P078l806O135
2624G580n16M102P134j4456n973J908p772m147j140l027N311J0781N032P74l824
2609A767M304j481k669N689l14j452R25P717J209L276j833j2231l911N695j542
$$ plain form
2713 4266 13893 11296 5959 5197 -3557 -6852 -2040 -6612 -9021 951 1481 -11351 -7815 -3380 1429
2698 1429 6628 4432 10720 -1546 -10208 -7425 -8342 -10733 -13238 -12567 -10159 -7526 -4708 -3118 -1497
2683 -1497 -6417 -6078 -143 1957 -7286 -10672 3156 14613 12450 5733 -4158 -14283 -4338 6137
2669 6137 12434 14668 6301 -7400 -14069 -12436 -7667 -6963 -11277 -7773 -2208 2044 4730 652 -2868
2654 -2868 -1083 4280 9809 18729 22898 19608 11798 15315 8432 1503 -943 -3632 -2833 -3523 1154
2639 1154 616 4426 13603 11906 13347 22606 25874 23192 12332 9590 -2270 -1827 5251 1445 7580
2624 7580 7064 11166 18300 3844 -2129 -221 -7993 -12140 -13280 -16307 -10996 -215 4817 5591 1767
2609 1767 6071 4590 1921 7610 7296 5844 6769 14486 15695 18971 17138 4907 996 6691 5149
2594E149K409K870n907L166p695j0987O847R894K991k629n170r144p803r37j022
2579a7968L796J1314L977l88M83K046L75j640p55K024o741p335Q539M179o428
2564d522q320R338M481o637m628J959L792K25L700R760m275L623K170q63m971
2549D832m746j525q414k622J6081P24L917K738L876m308J852n511n18Q667j294
2534A3749n777m029o421L888n008L955K979J870p089j200K877k741l028m883L064
2519g794r465K666P01K503Q276J6316K762m076j0989r248k404q170O757R647R688
$$ plain form
2594 5149 7558 10428 4521 7687 -8 -10995 -4148 5746 8737 6108 938 -8206 -16009 -16946 -17968
2579 -17968 -14172 -2858 1119 731 1214 3260 3635 1995 1240 3264 -3477 -10812 -2273 1906 -4522
2564 -4522 -12842 -3504 977 -5660 -10288 -8329 -4537 -4312 -612 9148 4873 8496 10666 9803 4832
2549 4832 86 -1439 -9853 -12475 3606 4330 8247 10985 14861 10553 12405 6894 6376 15043 13749
2534 13749 7972 3943 -2478 1410 -3598 357 3336 5206 -1883 -3083 -206 -2947 -5975 -10858 -7794
2519 -7794 -17259 -14593 -13892 -11389 -3113 13203 15965 11889 900 -8348 -10752 -18922 -12165 -2518 7170
$$ [...]
##END NTUPLES=NMR SPECTRUM
##END=
