##TITLE=Analysis number 311017
Compound Code cc 38310
Book Reference 403/154
Project Code adrs
Chemist Name carlr
##JCAMPDX= 6.0         $$ Bruker NMR JCAMP-DX V2.0
##DATA TYPE= NMR SPECTRUM
##DATA CLASS= NTUPLES
##ORIGIN= Bruker BioSpin GmbH
##OWNER= NMR
$$ XWIN-NMR		Version 3.5
$$ Wed Jun 29 10:03:52 2005 GMT Daylight Time (UT+1h)  MAYBRIDGE\NMR@NMR_250MHZ
##.OBSERVE FREQUENCY= 250.131544655141
##.OBSERVE NUCLEUS= ^1H
##.ACQUISITION MODE= SIMULTANEOUS (DQD)
##.ACQUISITION SCHEME= undefined
##.AVERAGES= 16
##.DIGITISER RES= 18
##SPECTROMETER/DATA SYSTEM= dpx250
##.PULSE SEQUENCE= zg30
##.SOLVENT NAME= CDCl3
##.SHIFT REFERENCE= (INTERNAL, CDCl3, 0, 16.522)
##AUDIT TRAIL= $$ (NUMBER, WHEN, WHO, WHERE, WHAT)
$$ ##TITLE= Audit trail, XWIN-NMR		Version 3.5
$$ ##JCAMPDX= 5.01
$$ ##ORIGIN= Bruker BioSpin GmbH
$$ ##OWNER= NMR
$$ C:\u/data/dgb/nmr/ADRS/4950/pdata/1/auditp.txt
$$ ##AUDIT TRAIL=  $$ (NUMBER, WHEN, WHO, WHERE, WHAT)
(   1,<2005-06-29 10:03:30.08 +100>,<MAYBRIDGE\NMR>,<NMR_250MHZ>,
      <created by zg, POWCHK disabled, PULCHK disabled
       configuration hash MD5:
       62 19 C7 07 E1 42 D1 B7 37 6C 3D D0 77 39 F9 E6
       data hash MD5: 64K
       36 86 04 21 95 F1 9E C3 CD A8 CE DC 14 ED 18 E6>)
(   2,<2005-06-29 10:03:42.52 +100>,<MAYBRIDGE\NMR>,<NMR_250MHZ>,
      <Start of raw data processing
       ef LB = 0.3 FT_mod = 6 PKNL = 1 SI = 32K 
       data hash MD5: 32K
       E7 4E 70 55 7D 41 B8 B8 D3 10 44 F2 BD E4 3B CC>)
(   3,<2005-06-29 10:03:44.74 +100>,<MAYBRIDGE\NMR>,<NMR_250MHZ>,
      <apk 
       data hash MD5: 32K
       FC 3D 5B B2 19 5E EB B1 54 41 7F EB 4A 15 BD 8A>)
(   4,<2005-06-29 10:03:45.46 +100>,<MAYBRIDGE\NMR>,<NMR_250MHZ>,
      <abs ABSG = 5 
       data hash MD5: 32K
       99 56 8E 50 47 14 88 EE 7E DF 87 50 E2 EB BF 05>)
$$ ##END=
$$ 
$$ hash MD5
$$ E6 62 C1 B2 42 4B D6 5E B0 E9 99 00 81 81 D6 27
##$RELAX= 
##$RELAX= 
##$RELAX= 
##$RELAX= 
##$RELAX= 
##$RELAX= 
##$RELAX= 
$$ Bruker specific parameters
$$ --------------------------
##$DU= <C:\u>
##$EXPNO= 4950
##$NAME= <ADRS>
##$PROCNO= 1
##$TYPE= <nmr>
##$USER= <dgb>
##$AMP= (0..31)
100 100 100 100 100 100 100 100 100 100 100 100 100 100 100 100 100 100 
100 100 100 100 100 100 100 100 100 100 100 100 100 100 
##$AQSEQ= 0
##$AQ_mod= 3
##$AUNM= <au_zg>
##$AUTOPOS= <6 >
##$BF1= 250.13
##$BF2= 250.13
##$BF3= 250.13
##$BF4= 250.13
##$BF5= 500.13
##$BF6= 500.13
##$BF7= 500.13
##$BF8= 500.13
##$BYTORDA= 1
##$CFDGTYP= 0
##$CFRGTYP= 5
##$CHEMSTR= <none>
##$CNST= (0..31)
1 1 145 1 1 1 1 1 1 1 1 1 1 1 1 1 1 1 1 1 1 1 1 1 1 1 1 1 1 1 1 1 
##$CPDPRG= <>
##$CPDPRG1= <>
##$CPDPRG2= <>
##$CPDPRG3= <>
##$CPDPRG4= <mlev>
##$CPDPRG5= <mlev>
##$CPDPRG6= <mlev>
##$CPDPRG7= <mlev>
##$CPDPRG8= <mlev>
##$CPDPRGB= <>
##$CPDPRGT= <>
##$D= (0..31)
0 1 0 0 0 0 0 0 0 0.06 0 0 0 0 0 0 0.0002 0 0 0 0 0 0 0 0 0 0 0 0 0 0 
0 
##$DATE= 1120035809
##$DBL= (0..7)
120 120 120 120 120 120 120 120 
##$DBP= (0..7)
150 150 150 150 150 150 150 150 
##$DBP07= 0
##$DBPNAM0= <>
##$DBPNAM1= <>
$$ [...]
##$SUBNAM7= <"">
##$SUBNAM8= <"">
##$SUBNAM9= <"">
##$SW= 20.6930455092707
##$SWIBOX= (0..15)
0 0 3 0 0 0 0 0 0 0 0 0 0 0 0 0 
##$SW_h= 5175.983436853
##$TD= 65536
##$TD0= 1
##$TE= 295.16
##$TE2= 300
##$TE3= 300
##$TEG= 300
##$TL= (0..7)
0 120 120 120 120 120 120 120 
##$TP= (0..7)
150 150 150 150 150 150 150 150 
##$TP07= 0
##$TPNAME0= <>
##$TPNAME1= <>
##$TPNAME2= <>
##$TPNAME3= <>
##$TPNAME4= <>
##$TPNAME5= <>
##$TPNAME6= <>
##$TPNAME7= <>
##$TPOAL= (0..7)
0.5 0.5 0.5 0.5 0.5 0.5 0.5 0.5 
##$TPOFFS= (0..7)
0 0 0 0 0 0 0 0 
##$TUNHIN= 0
##$TUNHOUT= 0
##$TUNXOUT= 0
##$USERA1= <user>
##$USERA2= <user>
##$USERA3= <user>
##$USERA4= <user>
##$USERA5= <user>
##$V9= 5
##$VALIST= <valist>
##$VCLIST= <CCCCCCCCCCCCCCC>
##$VD= 0
##$VDLIST= <DDDDDDDDDDDDDDD>
##$VPLIST= <PPPPPPPPPPPPPPP>
##$VTLIST= <TTTTTTTTTTTTTTT>
##$WBST= 1024
##$WBSW= 4
##$XGAIN= (0..3)
0 0 0 0 
##$XL= 0
##$YL= 0
##$YMAX_a= 476990
##$YMIN_a= -584906
##$ZGOPTNS= <>
##$ZL1= 120
##$ZL2= 120
##$ZL3= 120
##$ZL4= 120
##$ABSF1= 16.522
##$ABSF2= -4.171173
##$ABSG= 5
##$ABSL= 3
##$ALPHA= 0
##$AQORDER= 0
##$ASSFAC= 0
##$ASSFACI= 0
##$ASSFACX= 0
##$ASSWID= 0
##$AUNMP= <proc_1d>
##$AZFE= 0.1
##$AZFW= 0.1
##$BCFW= 0
##$BC_mod= 0
##$BYTORDP= 0
##$COROFFS= 0
##$CY= 12.5
##$DATMOD= 1
##$DC= 0
##$DFILT= <>
##$DTYPP= 0
##$F1P= 14.0000005364418
##$F2P= -0.99999901652339
##$FCOR= 0.5
##$FTSIZE= 32768
##$FT_mod= 6
##$GAMMA= 0
##$GB= 0
##$INTBC= 1
##$INTSCL= 1
##$ISEN= 128
##$LB= 0.3
##$LEV0= 0
##$LPBIN= 0
##$MAXI= 10000
##$MC2= 0
##$MEAN= 0
##$ME_mod= 0
##$MI= 0
##$NCOEF= 0
##$NC_proc= -5
##$NLEV= 6
##$NOISF1= 0
##$NOISF2= 0
##$NSP= 0
##$NTH_PI= 0
##$NZP= 0
##$OFFSET= 16.522
##$PC= 1
##$PHC0= 129.4847
##$PHC1= 6.05045
##$PH_mod= 1
##$PKNL= yes
##$PPARMOD= 0
##$PSCAL= 4
##$PSIGN= 0
##$REVERSE= no
##$SF= 250.13
##$SI= 32768
##$SIGF1= 0
##$SIGF2= 0
##$SINO= 400
##$SIOLD= 32768
##$SREGLST= <1H.CDCl3>
##$SSB= 0
##$STSI= 32768
##$STSR= 0
##$SW_p= 5175.98343685301
##$SYMM= 0
##$S_DEV= 0
##$TDeff= 65536
##$TDoff= 0
##$TI= <Analysis number 999999
Compound Code 99
Book Reference 9
Project Code 9>
##$TILT= no
##$TM1= 0
##$TM2= 0
##$TOPLEV= 0
##$USERP1= <user>
##$USERP2= <user>
##$USERP3= <user>
##$USERP4= <user>
##$USERP5= <user>
##$WDW= 1
##$XDIM= 32768
##$YMAX_p= 540576272
##$YMIN_p= -158337
$$ End of Bruker specific parameters
$$ ---------------------------------
##NTUPLES= NMR SPECTRUM
##VAR_NAME=  FREQUENCY,     SPECTRUM/REAL,   SPECTRUM/IMAG
##SYMBOL=    X,             R,               I
##VAR_TYPE=  INDEPENDENT,   DEPENDENT,       DEPENDENT
##VAR_FORM=  AFFN,          ASDF,            ASDF
##VAR_DIM=   32768,         32768,           32768
##UNITS=     HZ,            ARBITRARY UNITS, ARBITRARY UNITS
##FACTOR=    0.157963299565203, 1,           1
##FIRST=     4132.6476996994, 0,             0
##LAST=      -1043.33573715361, 0,           0
##MIN=       -1043.33573715361, -158337,     0
##MAX=       4132.6476996994, 540576272,     0
$$ Real data points
##PAGE= N=1
##DATA TABLE= (X++(R..R)), XYDATA
$$ [...]
18073A9468237n57325p35245q47649q99416q71957q63377q25401q10153p58461
18064A2299253o79089o53031o18677n68085m84287m71459m81724m48788l75007
18055G519106l89026l59966l06290l18681k76451k80333k96345k34818k64213
18046D792983j78625k03491k48235k03506j23558j10184j64756j77073j16834
18037C266721j27421j62465j07063n8901j14427j24304j38578j68393j51113j08380
18027B005676q1478j07594j30616j42361o7489o5005j06901p1336m8538l6165
18017A148193n0698p3929j9865k8691n1575n6244m126j2326R570J0987m4574m5643
18005G81079k1258l0406p212K5691M7665P084l0862r376J6278K1633l0376k3278
$$ y = [19468237, 18910912, 18175667, 17328018, 16428602, 15556645, 14693268, 13867867, 13057714, 12299253, 11620164, 10967133, 10348456, 9780371, 9296084, 8824625, 8342901, 7894113, 7519106, 7130080, 6770114, 6463824, 6145143, 5868692, 5588359, 5292014, 5057196, 4792983, 4614358, 4410867, 4162632, 3959126, 3835568, 3725384, 3560628, 3383555, 3266721, 3139300, 2976835, 2869772, 2810871, 2696444, 2572140, 2433562, 2265169, 2114056, 2005676, 1924198, 1816604, 1685988, 1543627, 1476138, 1411133, 1304232, 1232896, 1184358, 1148193, 1097495, 1023566, 1003701, 975010, 923435, 867191, 863065, 850739, 860309, 871296, 826722, 781079, 759821, 729415, 722203, 747894, 795559, 802643, 771781, 762405, 778683, 800316, 769940, 746662]
17993G46662j8203K3816J1354k6092K8658P47p918P9466N8037L229l5872k6668
17981H37216o4129j2718k401k8069P834l3038p7132k3661l0486l2228J8934P588
17969E67710k1629k3779m0013P196J886l297k1081J9149M0929L337J0731M027
17957E45166K3568Q553k894K5212k169L3198J0125j2717j2367N30M1583K2916
17945F80704k6993K5272q727m3320q204j8359j2653J1226J9638k8606J9104R784
17933F18866K9964L4873N4361M27m1269l4930J2784k977M662j2102k8893j2536
17921F23230j6618l2968l0056O863J0214j146J9952L6317K8838P559K9932P5542
17909G57659P2899M2377O5782R5608J18011R7514J40003J47795P7615N0653O435
$$ y = [746662, 728459, 752275, 763629, 737537, 766195, 766942, 759024, 838490, 896527, 899756, 863884, 837216, 773087, 760369, 757968, 729899, 737733, 704695, 627563, 603902, 573416, 541188, 560122, 567710, 546081, 522302, 482289, 489485, 491371, 488074, 466993, 486142, 527071, 530408, 541139, 545166, 568734, 577287, 574393, 599605, 597436, 630634, 640759, 628042, 615675, 616205, 657788, 680704, 653711, 678983, 670256, 626936, 618732, 600373, 587720, 598946, 618584, 589978, 609082, 618866, 648830, 683703, 738064, 738491, 697222, 662292, 675076, 672099, 676761, 664659, 635766, 623230, 606612, 573644, 543588, 550451, 560665, 559519, 579471, 615788, 644626, 652185, 682117, 757659, 830558, 872935, 938717, 1034325, 1152336, 1249850, 1389853, 1537648, 1615263, 1665916, 1672351]
17898A672351o3921r2777j54287j43106j24015j11074p8091n0539m0478o4426
17888G49637J429r762n3178n9177k0161P56k20l1649L29l2982m8364R933k8045
17875D78546J278j6850l8476j6995K286L2064O734j9398J4902j0015Q546L2565
17863D75187K2493J6275M9989R4095O9005P0798Q0442J07280P6468L8105J1467
17852A111604r448j1573o0643q9855p7744n0535o0892l9291l6738m7423l2049
17841E95413j6035m0161j1663J499n8635p1541j9968j1191j2404O880p939J3035
17829C67290M439J8418k6579r585M3220K0882j9816J537j061k9656J2901j5147
17817C66843l4281M089J0559J1239l5451j3078k8473l3226J7298J0883o141j9148
$$ y = [1672351, 1608430, 1515653, 1361366, 1218260, 1094245, 983171, 905080, 854541, 814063, 749637, 751066, 741304, 688126, 628949, 608788, 609544, 609324, 577675, 578004, 545022, 496658, 506591, 478546, 479824, 462974, 424498, 407503, 409789, 441853, 448587, 429189, 444091, 434076, 442622, 475187, 497680, 513955, 563944, 658039, 727044, 797842, 878284, 985564, 1062032, 1100137, 1111604, 1102156, 1090583, 1029940, 940085, 862341, 811806, 750914, 711623, 674885, 627462, 595413, 579378, 539217, 527554, 529053, 470418, 398877, 378909, 367718, 355314, 362194, 354255, 367290, 371729, 390147, 363568, 353983, 397203, 418085, 398269, 399806, 398745, 369089, 381990, 366843, 332562, 336651, 347210, 358449, 322998, 309920, 281447, 248221, 265519, 276402, 270261, 251113]
17805B51113p077J1382K1118L105Q047K1430K2578q188K62R710k8801l5311j2130
17792B57238m7760k0241K237l0939Q13Q242k119k9099l286J9576K6331K5094j2573
17779A93514j4615k8723q543J2529J7180L4250J3234J643j9951l5848k2102R683
17767A52251J025n885k2428o022k6601m354K4611K9062q474k3325L5871L5004
17755A80735K570K4655K888k1741n5724j1179M8242L7737r533j3020K487j633
17743A86484n1855k651j1894k0020O894N6824j261l7978K1778J8725J2653O957
17731A84656P147K5025l1577k4850J254j1346j0846K2236K6855K6055J3695j7246
17719B11058L8931m156m1762o586J1139j4687k4268k1832P790p829l9159K8810
$$ y = [251113, 244036, 255418, 276536, 279641, 287688, 309118, 331696, 323508, 323770, 333480, 304679, 269368, 257238, 209478, 189237, 191474, 160535, 161348, 169590, 167471, 138372, 135086, 154662, 180993, 206087, 193514, 178899, 150176, 141633, 154162, 171342, 205592, 218826, 220469, 200518, 164670, 142568, 152251, 153276, 147391, 124963, 118941, 92340, 87986, 112597, 141659, 133185, 109860, 145731, 180735, 183305, 207960, 210848, 189107, 133383, 122204, 170446, 208183, 198650, 185630, 188117, 186484, 134629, 131978, 120084, 100064, 106958, 163782, 162521, 124543, 146321, 165046, 177699, 184656, 191803, 216828, 185251, 160401, 161655, 150309, 139463, 161699, 188554, 214609, 228304, 211058, 249989, 245833, 204071, 197485, 208624, 193937, 169669, 147837, 155627, 147798, 108639, 137449]
17707A37449M6450K9647n542j8310j5288K6573L5306N1544Q1879J16083J22038
17696F07829L7205p4983p3217p1207n8511m2683m0593l1674k5589k9809J6847
17685B13615J1149Q346l308k5860l8836k7196K5013N8102L5485Q617l9659R33
17673B26401Q66k519j4075j8144J6067K2927J0158K9998m737k7255O01Q089M8391
17660B96768L4691l929K2965M0401M3565P2323M9568N2951R5041J14806J05854
17649I25004R1552K539k3279K0916M3264q237o8197r9360j16513q5787o0549l4887
17637E86466J61R160p964k0068k0640q45J6862J2272m2823j337p420k5684j4499
17624D83641n1784r438K1942K8404l7581m4007q167L418J3407o96k6773j0807
$$ y = [137449, 183899, 213546, 208004, 189694, 174406, 200979, 236285, 287829, 369708, 485791, 607829, 645034, 570051, 496834, 425627, 367116, 324433, 283840, 252166, 226577, 196768, 213615, 224764, 233110, 229802, 203942, 165106, 137910, 162923, 221025, 256510, 265127, 225468, 226401, 227267, 224748, 210673, 192529, 208596, 231523, 241681, 271679, 266942, 239687, 240288, 248377, 296768, 331459, 327530, 350495, 390896, 434461, 506784, 556352, 609303, 704344, 819150, 925004, 1016556, 1019095, 995816, 1016732, 1059996, 1051759, 983562, 884202, 767689, 681902, 621353, 586466, 586627, 595787, 587823, 567755, 547115, 546270, 563132, 575404, 532581, 531244, 523824, 498140, 483641, 431857, 422419, 444361, 472765, 435184, 391177, 383010, 386428, 399835, 399139, 372366, 361559]
17612C61559J7769j0307K6799M9016M1168K3729j3495K8887O0184N4169O0608
17601G00086L7683M9949R9714J09408J17705Q713p6981j44936j21220p1709k4661
17590F83751o1730m9412o1684o7211m2937R550K0140L1957K4858k7379l9317l8299
17578C82287J6090L3241p884k2234k1441O970n0697n0434K7875K6441L737q921
17566C35030J955j4865J6319J7143K0574J569K209L8652J5081O242J2942P372
17554D60223j4335K213J4080j4166k3779K3976L0033k1311N04n4890n6906m4473
17542C01169k7789P703J298m8565k1512l6392j4851J3632k8159k5462J7548M4609
17530A83229K9176P121Q84K8557j675j5478j3834q248K598j6539j4871k4207J868
$$ y = [361559, 379328, 369021, 395820, 444836, 486004, 509733, 496238, 525125, 585309, 639478, 700086, 737769, 787718, 887432, 996840, 1114545, 1123258, 1046277, 901341, 780121, 708412, 683751, 622021, 572609, 510925, 443714, 400777, 410327, 430467, 462424, 487282, 459903, 420586, 382287, 398377, 431618, 423734, 401500, 380059, 387029, 336332, 285898, 313773, 340214, 343951, 335030, 336985, 322120, 338439, 355582, 376156, 377725, 379934, 418586, 433667, 439909, 452851, 460223, 445888, 448101, 462181, 448015, 424236, 448212, 478245, 456934, 457438, 402548, 345642, 301169, 273380, 281083, 282381, 233816, 212304, 175912, 161061, 174693, 146534, 121072, 138620, 183229, 212405, 219526, 220410, 248967, 247292, 231814, 217980, 209732, 212330, 195791, 180920, 156713, 158581]
17517A58581K0398j1291r323J7207M8182K7486J0119J5055K3806k0968Q951p677
17505B80526P308L23J3101P4498N9273R380j4881j1336K2663j0091J0638K7404
17493D68806k700J6052K6963L4233K3653J3370l1256r831L3391L7535K0622m1937
17481E88901n4719O352M464J0312j6374j823k2294K1861J8287l2589q29j6942
17469E04607N257m022J7506N2774k2771n532K1317K4660o432m018M5795Q268L3638
17456F71047O5552K7339K950N4630M1127N6935O2616L3551L0770O0044N6027Q2375
17444A244963P4698P1397J14883P3717L0928L3863J2871K511K4390J14405J28845
17433A927471J46245J01761J35445Q6072O4598L2262j1532j2848p7896j07850
$$ y = [158581, 178979, 167688, 158365, 175572, 223754, 251240, 261359, 276414, 300220, 279252, 288203, 280526, 287834, 288157, 301258, 375756, 435029, 444409, 429528, 418192, 440855, 430764, 441402, 468806, 466106, 482158, 509121, 543354, 567007, 580377, 549121, 539290, 572681, 610216, 630838, 588901, 534182, 540534, 544998, 555310, 538936, 537113, 514819, 536680, 554967, 522378, 521549, 504607, 509864, 505842, 523348, 576122, 553351, 547819, 569136, 593796, 587364, 583346, 629141, 637409, 671047, 736599, 763938, 766888, 821518, 862645, 919580, 982196, 1015747, 1046517, 1106561, 1162588, 1244963, 1319661, 1391058, 1505941, 1579658, 1610586, 1644449, 1657320, 1659831, 1684221, 1798626, 1927471, 2073716, 2175477, 2310922, 2396994, 2461592, 2493854, 2482322, 2469474, 2391578, 2283728]
17423B283728r3611p0558o3992l2607j0330J471J3512M0066K060N6976P1779j1958
17411B186536l620K3151L6789M669J7332M6609N4773M7803O1796K1119K9538N2658
17399B579153K6828M5857N8974N0604N0774J03780J15114P5993Q7201J08262J31899
17388C434439J14764J51614J75997J99716J51921K37070K93604L38349L73993
17379E471467M93291N78633N67842N40847M55967M60711N26607N39402P30483
17370A0365250J029550J477022K122943K890279L936896N226198O726127Q654875
17362D2429140J1161026J4377692J8763283K4913582L0711133L0178938K0137393
17355A92672187Q625492K759991m590846j8163855k8341584k8152854k2302174
$$ y = [2283728, 2190117, 2119559, 2055567, 2022960, 2012630, 2014101, 2027613, 2067679, 2069739, 2126715, 2198494, 2186536, 2182916, 2206067, 2242856, 2247525, 2264857, 2311466, 2366239, 2414042, 2475838, 2496957, 2526495, 2579153, 2605981, 2651838, 2710812, 2761416, 2812190, 2915970, 3031084, 3107077, 3194278, 3302540, 3434439, 3549203, 3700817, 3876814, 4076530, 4228451, 4465521, 4759125, 5097474, 5471467, 5964758, 6543391, 7111233, 7652080, 8108047, 8568758, 9095365, 9634767, 10365250, 11394800, 12871822, 14994765, 17885044, 21821940, 27048138, 33774265, 42429140, 53590166, 67967858, 86731141, 111644723, 142355856, 172534794, 192672187, 201297679, 204057670, 199466824, 181302969, 152961385, 124808531, 102506357]
17348A02506357j6180556j1540631q402868o410768n033813l993392l229496k646082
17340D5068751k207656j837389j518317j268446j080199r37547q41964p66161
17332C4611072o36698m64131k71977j50625p8735J47040M00208N10902O16585
17323C4683641P40955J030463J480806K006931K670558L601911M724033O241964
17315E7181262Q176037J0769965J4208585J9129905K5126473K7872678K1521620
17308A83986525R178337J226957l287620j2465935k3143857k6345509k2477406
17301A06671492j6868806j2283719q967874o832023n357904m296291l540923k921467
17293D5602485k492433k122092j828004j595390j478412j360194j197433j137339
$$ y = [102506357, 86325801, 74785170, 66382302, 59971534, 54937721, 50944329, 47714833, 45068751, 42861095, 41023706, 39505389, 38236943, 37156744, 36219197, 35377233, 34611072, 33974374, 33510243, 33238266, 33087641, 33008906, 33155946, 33556154, 34067056, 34683641, 35424596, 36455059, 37935865, 39942796, 42613354, 46215265, 50939298, 57181262, 65357299, 76127264, 90335849, 109465754, 134592227, 162464905, 183986525, 193164862, 194391819, 191104199, 178638264, 155494407, 129148898, 106671492, 89802686, 77518967, 68551093, 61719070, 56361166, 52064875, 48523952, 45602485, 43110052, 40987960, 39159956, 37564566, 36086154, 34725960, 33528527, 32391188]
17285C2391188j089079r98125q52957p15633n87659m48714k91635j72962j93218
17276B7041206k20483k75298l15558l56040n14914o73063p76562q40079q75929
17267B2193280r95164r95149j018087j042764j048332r46399r00897q64293q07013
17258A3575182p54498o71257o21179o21653o23134n43834n32176m87881m77443
17249H242127m41063m06741l23684l15766l22147l10808k96619k44628k72212
17240E308459k84792k89225k10684j96375k24894k28293j88769j98037j36470
17231C350920j14513j36698j28780j33061j27196j18668j73788j73740j36607
17222B107869j20096j19398r8497j02462j11728p4666q6329j27912q0792p2450
$$ y = [32391188, 31302109, 30303984, 29451027, 28735394, 28147735, 27699021, 27407386, 27234424, 27041206, 26820723, 26545425, 26229867, 25873827, 25358913, 24685850, 23909288, 23069209, 22193280, 21198116, 20202967, 19184880, 18142116, 17093784, 16147385, 15246488, 14382195, 13575182, 12820684, 12149427, 11528248, 10906595, 10283461, 9739627, 9207451, 8719570, 8242127, 7801064, 7394323, 7070639, 6754873, 6432726, 6121918, 5825299, 5580671, 5308459, 5023667, 4734442, 4523758, 4327383, 4102489, 3874196, 3685427, 3487390, 3350920, 3236407, 3099709, 2970929, 2837868, 2710672, 2592004, 2418216, 2244476, 2107869, 1987773, 1868375, 1769878, 1667416, 1555688, 1481022, 1394693, 1266781, 1185989, 1113539]
17212A113539m7037m4494k6300n441l6108l5626l7907j6672l9296n8681p783J1664
17200G69858J9557Q393k2179M61M076L0221R217P087N457l4798j5772J1864j8304
17187G75138K4028N5563J6506P88p627k5467l7207j4701j8218j4578j4306l0959
17175G08960l129J6815J3571j3311l5569q462J2867q185L7905j3694n0117k478
17163F55173J8508k2246l4467O675j2845l002K4874K7952K677P028l232l3874
17151F33221l9144L6380M6405L9248J4228J7622K628M1907J6777n371L3318k2501
17139H14718l521J0703r48L6979N4769j3793j5179L0494N9917L8644M9629N3645
17127A116057P6370P8737O1535O8608L5094L4k067m7907j06078j04880n8741M468
$$ y = [1113539, 1066502, 1022008, 995708, 990267, 954159, 918533, 880626, 863954, 824658, 765977, 758194, 769858, 789415, 797808, 775629, 776090, 780166, 810387, 819604, 826691, 832148, 797350, 781578, 793442, 775138, 799166, 854729, 871235, 872023, 864396, 838929, 801722, 787021, 768803, 754225, 739919, 708960, 705831, 722646, 736217, 722906, 687337, 678875, 691742, 683557, 721462, 707768, 657651, 655173, 673681, 651435, 616968, 623643, 610798, 607796, 632670, 660622, 663299, 670327, 667095, 633221, 594077, 630457, 676862, 716110, 730338, 747960, 750588, 792495, 809272, 803901, 837219, 814718, 811197, 821900, 820952, 857931, 912700, 898907, 883728, 914222, 974139, 1012783, 1062412, 1116057, 1192427, 1271164, 1332699, 1401307, 1436401, 1436435, 1434368, 1386461, 1280383, 1175503, 1116762, 1121230]
17115A121230m7155l7361j0956R574L4268J3487k858J2606p6162r1884l9339m1422
17103H44028l5527o9913m4214J3279J3863J7418J7380k7835m653j1252l4943K8833
17091G06464N3439j3209k8754p4276k065K2102j3165l9472L0114L5538M4963L9762
17079G61441M7109M5031M4035N7433m483l6352o446l6908n6257o6039o8475l0167
17067F49922K5652j0059k6110K8430R772n5052m195o966q561N492R317K9357M7682
17054F94681P207J342k5251j870K2738P275J0661J1417J0j3424j8777j316L9152
17041G33845o927M236q483J2988J668j4499J6287l6790n6681m9795J6332J2447
17029F24628q567L1099J6991Q395j1580L8388L2429k3674k7354L7044O6656P615
$$ y = [1121230, 1074075, 1036714, 1025758, 1035332, 1069600, 1083087, 1080229, 1092835, 1016673, 924789, 885450, 844028, 808501, 738588, 694374, 707653, 721516, 738934, 756314, 728479, 723826, 712574, 677631, 706464, 759903, 746694, 717940, 643664, 641599, 663701, 650536, 611064, 641178, 676716, 721679, 761441, 808550, 853581, 897616, 955049, 950566, 914214, 907768, 870860, 814603, 748564, 680089, 649922, 675574, 665515, 639405, 667835, 677607, 622555, 618360, 611394, 602833, 608325, 617642, 646999, 694681, 701888, 703230, 677979, 676109, 698847, 706122, 716783, 728200, 728210, 714786, 696009, 694693, 733845, 726918, 731154, 722671, 735659, 737327, 722828, 739115, 702325, 645644, 595849, 612181, 624628, 616061, 647160, 664151, 672546, 660966, 699354, 731783, 708109, 680755, 717799, 784455, 792070]
17017G92070p400K8442O3767P905J1338K4722M2855K0433K9422K6212n859R431
17005A043338M1505N2815Q6580M6320P6783Q1007O0640O7739L8872O6333K4484
16994A686416K8278o096n2372j5851N628K1856J1081P62K3577M3236K7282K1696
16982A795493j2560J7536N4180n98j1522k948N2880L4039k944j1684J2791O5855
16970A990518R4184O0474O2965M5148K6680K0837K3454L2997O8504M8017K6426
16959B500204K1314O4145Q1706O7655Q1178R8471J64666J73275J31450J27252
16949C511316J70655J50833J63746K35227K19458K33123L27105L46546L61102
16940E719111M01385M00736M28222M11319M56289N75604P35047R64417J243515
$$ y = [792070, 784670, 813112, 876879, 884784, 896122, 920844, 963699, 984132, 1013554, 1039766, 1033907, 1043338, 1084843, 1137658, 1224238, 1270558, 1347341, 1428348, 1488988, 1556727, 1595599, 1661932, 1686416, 1714694, 1708598, 1656226, 1640375, 1646003, 1667859, 1678940, 1679702, 1703279, 1746515, 1773797, 1795493, 1782933, 1800469, 1854649, 1854051, 1842529, 1839581, 1892461, 1926500, 1923556, 1911872, 1924663, 1990518, 2084702, 2145176, 2208141, 2253289, 2279969, 2300806, 2324260, 2357257, 2425761, 2473778, 2500204, 2521518, 2585663, 2667369, 2735024, 2816202, 2914673, 3079339, 3252614, 3384064, 3511316, 3681971, 3832804, 3996550, 4231777, 4451235, 4684358, 5011463, 5358009, 5719111, 6120496, 6521232, 6949454, 7360773, 7817062, 8392666, 9127713, 10092130, 11335645]
16931A1335645J697867K269687L012548M029044N264123O797848Q654247J1054861
16923E4115870J4094389J8084694K3095899K7194256K6613455J9754177J0390138
16916A93342878K971540m151608j3383798k1783682k4604210k1979691j7278303
16909I3133126j2935043r609697p302649n727045m540561l639046k958518k454920
16901D3965647k066624j793105j460469j230886j057683r50012q38765p01814
16893C3866289n52164m82146l71537j89461p045J58680K64219L15396K60133K43509
16883C3505873K46377J91482K20739K87950M44005P85001J300298J931739K778723
16874D1692187L950002N308247P088196R379284J2325812J6193851K0783953K4439189
$$ y = [11335645, 13033512, 15303199, 18315747, 22344791, 27608914, 34406762, 43061009, 54115870, 68210259, 86294953, 109390852, 136585108, 163198563, 182952740, 193342878, 196314418, 192162810, 178779012, 156995330, 132391120, 110411429, 93133126, 80198083, 70588386, 63285737, 57558692, 53018131, 49379085, 46420567, 43965647, 41899023, 40105918, 38645449, 37414563, 36356880, 35406868, 34568103, 33866289, 33314125, 32831979, 32460442, 32270981, 32263936, 32422616, 32686835, 33002231, 33262364, 33505873, 33752250, 33943732, 34164471, 34452421, 34896426, 35681427, 36981725, 38913464, 41692187, 45642189, 50950436, 58038632, 67417916, 79743728, 95937579, 116721532, 141160721]
16866A41160721K3677331J6845133P692262O88575n615050j3765000k0986186
16859A49697786k3132979k0483859j6012900j1934616q960372o847783n414964
16852E6910313m387602l602148k978764k551474k203691j874218j607951j433080
16844C6271385j238695j177791j072289r54096q80296p64885o36630n51233m66887
16835B8528583l02427j90472j78639k37210l03839l23484l91122n60178o76978
16826B5364234p39011q18693q25369q97967r93375j045515j022203j040442j049906
16817A6931753r66772q76689q61511p72385p16891o54647n73587n46867n05390
16808A0457014m03520l51853l40298l28283k94559k93255l41448l84989l66789
$$ y = [141160721, 164838052, 181683185, 189375447, 190064022, 184448972, 170683972, 149697786, 126564807, 106080948, 90068048, 78133432, 69173060, 62325277, 56910313, 52522711, 48920563, 45941799, 43390325, 41186634, 39312416, 37704465, 36271385, 35032690, 33854899, 32782610, 31828514, 30948218, 30183333, 29546703, 28995470, 28528583, 28226156, 28035684, 27857045, 27619835, 27315996, 26992512, 26601390, 26041212, 25364234, 24625223, 23806530, 22981161, 22083194, 21089819, 20044304, 19022101, 17981659, 16931753, 15964981, 15088292, 14226781, 13454396, 12737505, 12082858, 11509271, 10962404, 10457014, 10053494, 9701641, 9361343, 9033060, 8738501, 8445246, 8103798, 7718809, 7352020]
16799G352020m10892m39395l79593l95060l26978k93470k48585j85391k02731
16790D469925j90467j77834k39223k45916k31476j77739j53486j49709j44404
16781B759671j74456j63083j09581j07148j09469j21039q5018q2401m8463n0942
16771A708071r0081j00220j01131l0868m7393k4747P008M466K1350N9306M2328
16760A448089N1043N0245J10669J06486P8831L9316J7246m4131j25584j42507
16750A589703q7051j01094j06015p1821p6458m7072n1324j9811l8187j016N1680
16739A041534J5968M3716L8159J1457m5831m9289o0745n9669o8436n6123m5836
16728G64905m6565m9046k7566k0703m5697j5702l7939j3511K8043M1012Q004o416
$$ y = [7352020, 6941128, 6501733, 6122140, 5727080, 5400102, 5106632, 4858047, 4672656, 4469925, 4279458, 4101624, 3862401, 3616485, 3385009, 3207270, 3053784, 2904075, 2759671, 2585215, 2422132, 2312551, 2205403, 2095934, 1974895, 1889877, 1807476, 1759013, 1708071, 1617990, 1517770, 1416639, 1385771, 1338378, 1313631, 1320639, 1325105, 1346455, 1405761, 1448089, 1499132, 1549377, 1660046, 1766532, 1845363, 1884679, 1901925, 1857794, 1732210, 1589703, 1502652, 1401558, 1295543, 1223722, 1147264, 1100192, 1048868, 1029057, 990870, 989854, 1041534, 1057502, 1101218, 1139377, 1150834, 1105003, 1055714, 994969, 935300, 866864, 810741, 764905, 718340, 669294, 641728, 621025, 575328, 559626, 521687, 508176, 536219, 577231, 585235, 578819]
16716E78819k1913j6616j7428k5517k4684N4933M0953k0521l8582j181O998L4067
16704E49328P933q662L0480M755K243K015K9644L5003L8391k3243l7687r791O347
16691F26756k5833q111L6125K5257J0931K5842N120K8657M428r509j1477k5704
16679F82482O664l4875k2328k5497L76J0759r63l0218k1636l5786r82l4214j9591
16666D74191J2548J4488j1102K0217M940k8735l7871K6716M9514J360k7496q501
16654D90269R959J1163j1972J2698K0424l7399k8731N764M1400m025k4448K13
16642D85315r264n5520p170k6825J1954n8597o1964j962j9L0438k155O344k0620
16629B89955k5341o266k9528J6171r291K916m111l4862Q239q572O841M0442m1172
$$ y = [578819, 556906, 540290, 522862, 497345, 472661, 527594, 568547, 548026, 509444, 508263, 515261, 549328, 557261, 548599, 579079, 583834, 586077, 588092, 617736, 652739, 691130, 667887, 630200, 620409, 626756, 600923, 592812, 628937, 654194, 665125, 690967, 696087, 724744, 729172, 719663, 708186, 682482, 689146, 654271, 631943, 606446, 606822, 617581, 616618, 586400, 564764, 528978, 527996, 493782, 474191, 486739, 501227, 490125, 510342, 515282, 486547, 448676, 475392, 524906, 526266, 498770, 490269, 500228, 511391, 499419, 512117, 532541, 495142, 466411, 472175, 513575, 509550, 485102, 485315, 476051, 420531, 413361, 386536, 398490, 339893, 277929, 275967, 275948, 306386, 304231, 310575, 289955, 264614, 258348, 228820, 244991, 235700, 238616, 234505, 199643, 207882, 199310, 206151, 246593, 205421]
16616B05421l2444k1187k2784N888L2049j2734N475j6961K2684J1721K2865K9529
16604B29522L9492J7103l0549k0781m788M4134j558J7689j1079k2443j850j4964
16592B39928m470K1508k6639k7735k5406l4738P98J0817L1300n760J553K1110
16580B02266K1691j7758k8592J4372N639k3924j8567R989J4847n493J119J0567
16568A86156j4411k4722p728j3254l8017p8K1006N414k8759j5019K8068J2291
16556A10947K4869J7334K359J6947J3451R896J0160k3471j2803K83K386o221p762
16543A58375k0021m413P073l0701o786j2032P078l0211K11L0203K3880J5198m2207
16530I5647k8379K8669j2883r696J987J7122k6132n010K5378rl3851r65J3728
$$ y = [205421, 172977, 151790, 129006, 134894, 166943, 154209, 159684, 142723, 165407, 177128, 199993, 229522, 269014, 286117, 255568, 234787, 229999, 274133, 272575, 290264, 279185, 256742, 254892, 239928, 235458, 256966, 230327, 202592, 177186, 142448, 143246, 154063, 185363, 179603, 181156, 202266, 223957, 206199, 177607, 191979, 197618, 173694, 155127, 165116, 179963, 174470, 175589, 186156, 171745, 147023, 139295, 126041, 88024, 87946, 108952, 114366, 85607, 70588, 98656, 110947, 135816, 153150, 155509, 172456, 185907, 195803, 205963, 182492, 169689, 169972, 172358, 166137, 158375, 138354, 133941, 141014, 110313, 103527, 91495, 98573, 68362, 68573, 98776, 122656, 137854, 95647, 67268, 95937, 83054, 73358, 75345, 92467, 66335, 61325, 86703, 86694, 52843, 51878, 65606]
16517F5606M0417K8637j1028o676K398L964J1733j3076L1270r952l5824j9070
16505H8399J5986K5212k4317k3558r508j1171O716j6109J7620O9025O094n0211
16493I4178o8354J242j2392J8708O4057L2583o678k3954K726J5361J3961k9718
16481A01720j2300k8056j5164J5039L4127L6999k2702k2410k6808K2195J4685
16470I7325k6441k1865K6681o913k2299l3450N936n532q876k0959K4573K1612
16458B9792K1515N361n131j6239j6781j1635k8077l9474K1475M0957L6115j136
16446C6742J0762K0513o0768m794L6648l362j656j1991J5133j7826J5377K361
16434C7139p821K0358N7k3632n378J7655M0250J6243j2556J3658k1326l6537L244
$$ y = [65606, 106023, 134660, 123632, 116956, 119354, 123318, 135051, 121975, 153245, 143293, 107469, 88399, 104385, 129597, 105280, 81722, 72214, 61043, 67759, 51650, 69270, 138295, 144389, 94178, 25824, 27066, 14674, 33382, 97439, 130022, 123344, 99390, 102116, 117477, 131438, 101720, 89420, 61364, 46200, 61239, 95366, 132365, 109663, 87253, 60445, 82640, 97325, 70884, 49019, 75700, 68787, 46488, 13038, 18974, 13442, 4566, -16393, 8180, 29792, 51307, 56668, 51537, 35298, 18517, 6882, -21195, -60669, -39194, 1763, 37878, 36742, 47504, 68017, 7249, 2455, 39103, 35741, 34085, 22094, 37227, 19401, 34778, 37139, 29318, 49676, 49733, 26101, 20723, 38378, 78628, 94871, 82315, 95973, 74647, 38110, 41354]
16421D1354K7627L484K873k1578m270j73Q092P306l978K1804M9524K9813K1904
16408A83782M2247N3847M9986Q6363O0225R3385J07031J46789R1706L5883M7821
16397I99065l528n1958p4102j50953j48423n0588l1619p1268m4188m4709k4690
16386C03039M88K0084j9413J8665p0083l1068m7738k4544J8814k5337p409L3446
16374A68944j890k5553m0178K0694M3362n552n531j6375k7323K6585J0100J6776
16362A64059L3327j4773K5648J2076L1399j7559L3636M4819M0143O8280N2082
16351D73137N9329P3974J36384J16627J02825K7840J5091j7991r7576q6103j10912
16340F92625r5321j03902p1213m416o1037l8857j5123J2606n4385o3053m4927
$$ y = [41354, 68981, 72465, 75338, 53760, 49490, 49317, 57409, 64715, 60737, 82541, 132065, 161878, 183782, 226029, 279876, 329862, 416225, 476450, 569835, 676866, 823655, 915361, 951244, 999065, 995537, 943579, 869477, 718524, 570101, 519513, 487894, 416626, 372438, 327729, 303039, 303527, 323611, 304198, 322863, 252780, 221712, 173974, 149430, 168244, 142907, 135498, 168944, 167054, 141501, 101323, 122017, 165379, 159827, 154296, 137921, 110598, 137183, 147283, 164059, 197386, 182613, 208261, 220337, 251736, 234177, 267813, 312632, 352775, 421055, 473137, 532466, 606440, 742824, 859451, 962276, 990116, 1005207, 987216, 889640, 803537, 692625, 597304, 493402, 422189, 417773, 356736, 317879, 302756, 315362, 260977, 197924, 152997]
16329A52997J2721p714J3187k696n026j153l1352k9514q123J1533O342L1185k3435
16316A18952r689r939o669K671K5308O480j9155p273J6221j9605l7050q998j6970
16303C4284L6726j8721k2314J3266P427K8772Q609k1156k9874j1799l6200m447
16291a5427J4178J8298j4842l3264O046J7139J6256k5288k8512K2868J7806J1329
16279F587p040m8649N956o854L936L0305j5827k4171j3193K4163L4080K2933j538
16266A0688J433j5071J5933j3971J0499J4362J7405j0529n2531k0392J0352O451
16254b5371K0282O03n2538j6105K2240K3048j1203p492j6274M774L4290K9122
16242E376J6227M142l0550j880M2726J2547l0396l8164J358j0814L9835M7732
$$ y = [152997, 165718, 158004, 171191, 168495, 163469, 162316, 130964, 101450, 93327, 104860, 111202, 142387, 118952, 109263, 99324, 92655, 95326, 120634, 127114, 107959, 100686, 116907, 97302, 60252, 51254, 34284, 71010, 52289, 29975, 43241, 50668, 79440, 88049, 66893, 37019, 25220, -10980, -15427, -1249, 17049, 2207, -31057, -25011, -7872, 8384, -16904, -45416, -22548, -4742, 6587, -453, -49102, -43146, -50000, -46064, -15759, -31586, -55757, -68950, -44787, -10707, 12226, 10688, 12121, -2950, 12983, -988, 9511, 23873, 41278, 30749, -21782, -42174, -31822, -25371, -5089, -4486, -57024, -73129, -50889, -27841, -39044, -46536, -62810, -58036, -23746, 5376, 21603, 25745, -4805, -6685, 36041, 48588, 18192, -19972, -18614, -29428, 10407, 58139]
16230E8139K4199j8251n539M682l8835l9076M702J8455J0444J3739k5233o008
16218A418j0413j5627j1885P709J7730J822q648j5001J7766K2400J6107k4600
16206a222J275k6441j0243j2324J7021J5803j9286k0812K9244k0316K146N563
16194c9592M2856J6767n035J1040o707j5794K733q728J4148m244l8129J7813N0261
16181C7389k5257m1089j9493J9257L6284J6989j7644J7434O153k6816l9066k444
16169c8303K3041j5079Q315K931L6586N534l8758n123o679p523J5278L0676L138
16156A4034Q04k2112j3716Q186l583m517P333m1985k1304M9024N9042l9836k1731
16143c0361o127P90j7404J326j7996l0313K4754O0866K9077j5127m8068k2105
$$ y = [58139, 82338, 64087, 58548, 63230, 24395, -14681, -9979, 8476, 18920, 32659, 7426, 1418, -8995, -24622, -36507, -28798, -11068, -9246, -17894, -32895, -15129, 7271, 23378, -1222, 53, -26388, -36631, -48955, -31934, -16131, -35417, -56229, -26985, -47301, -45155, -39592, 3264, 20031, 14996, 26036, 19329, 3535, 6268, -2460, 11688, 7444, -30685, -12872, 37389, 12132, -28957, -48450, -29193, 7091, 24080, 6436, 23870, 30023, 3207, -35859, -38303, -15262, -30341, -22026, -19095, 17491, 23025, -15733, -20856, -27535, -35058, -19780, 10896, 14034, 14838, -7274, -20990, -12804, -16387, -20904, -13571, -55556, -76860, -27836, 31206, -8630, -30361, -36488, -35698, -53102, -51776, -69772, -100085, -75331, -14465, 14612, -515, -48583, -70688]
16131g0688J3075N937K4364L4065j5101j8864J1192O893q572n6516J4506l31N5728
16118d312N800P718k9391l0505J0264M6818l3519K8069J5469m8720k1946J9624
16106c4631n223M1433n208j9664j8669r160j1093K9551K5822k0267j6981l8562
16094h2652k7374q362J0616M9426M25k6517J8228j181K02k71J6370J7774k559
16081c5875J2118K3375n396l7691l1208k362K3365J9955k9984j5683N7882j8829
16069d0333J9966M8734k524k8391M831L2174o059k8380J800M6115J0440j4176
16057D4197m9344P696j7792j872M205N900M132J3705j2757j7680J0260J1305K6268
16044B8223l3727j4492n0902L962L3843J8724L2612L978l0877k4921Q979J1069
$$ y = [-70688, -57613, -51676, -27312, 6753, -8348, -27212, -16020, -9127, -17699, -74215, -59709, -60040, -4312, 1488, 9206, -20185, -50690, -40426, 6392, -27127, 942, 16411, -32309, -54255, -34631, -39854, 1579, -3629, -23293, -41962, -51122, -62215, -32664, -6842, -27109, -44090, -82652, -110026, -118388, -107772, -58346, -57921, -84438, -66210, -67391, -67189, -67460, -51090, -33316, -35875, -23757, -382, -5778, -43469, -74677, -77039, -53674, -33719, -63703, -79386, -21504, -40333, -20367, 28367, 25843, -2548, 2283, 34457, 28398, 18, 1818, 47933, 58373, 44197, -5147, 2549, -15243, -17115, -12910, -7010, -2878, 10827, -1930, -19610, -9350, 1955, 28223, -5504, -19996, -70898, -66936, -33093, -14369, 18243, 22221, -8656, -33577, -24598, -13529]
16032a3529j3241l2228O57K2322n692r749K0631j8567M728Q151j2834J9642r384
16019c9093K8933L2316l2269n0768K0845J3293q333J4886J1452j7610k456j7715
16007d6519l372l0051k0859K5372J8437m383j9361j4085j9951k528M2400L3874
15995d1026J9031l1893K459l872j7648L4421J2455p432k4549l2459j7834n724
15983a14071q543K6196j1738j724K3343J4753r11J4647j4801K41L5919m013j9867
15970f0569r263K9845K408j490j9607k9548k3005J4467K8119K4584O154k4606
15958f2511j6900K2322k659j7179L639L0356j2913k6411J4384M8395j2371j3033
15946d4881n600l3979K5335M1360j9583j4816L0114J0690k0738J5577J4203j1549
$$ y = [-13529, -26770, -58998, -58341, -36019, -41711, -51460, -30829, -49396, -44668, -36517, -49351, -29709, -39093, -10160, 22156, -10113, -60881, -40036, -26743, -35076, -20190, -8738, -26348, -28804, -46519, -49891, -79942, -100801, -75429, -56992, -61375, -80736, -94821, -114772, -117300, -74900, -41026, -21995, -53888, -51429, -55301, -72949, -38528, -26073, -33505, -58054, -90513, -108347, -114071, -122614, -96418, -108156, -109880, -86537, -71784, -72695, -58048, -72849, -72608, -36689, -40702, -60569, -69832, -39987, -37579, -39069, -58676, -88224, -111229, -96762, -68643, -44059, -37905, -62511, -79411, -57089, -59748, -76927, -73288, -42932, -55845, -82256, -67872, -19477, -31848, -44881, -50481, -84460, -59125, -17765, -37348, -52164, -22050, -11360, -32098, -16521, -2318, -13867]
15934a3867j7047q79m2007l9987J6138M8082M2069j5964n7790k3213J9764O2339
15922b2362L0290L705j1935l8372j9451O080Q159j9412n802J0040L1621K4636
15910b803M572K1489j2606o918j4435j7252N061Q742K854m565l0241j4516J7742
15897d2876K6085O772J562P148L2854l8970k3041L0858J1328j1738O062o971k3462
15884b4389Q348j9930j6404K2948J7558K3961j5355j2834j5529k2281J4397k7254
15872f6764J1214j5792j9549M4488R953J4030n3178O203J0293N4280L1587q775
15860A7990l3500j8808L4855L393j0666J1866K5529l2912k2209k5426L3952N281
15848a0655p261l3036k6413L7288L4202m5865M2926J7362k4229k3142k4791P326
$$ y = [-13867, -30914, -31793, -73800, -113787, -97649, -49567, -7498, -23462, -81252, -104465, -84701, -22362, 7928, 11633, -302, -38674, -58125, -52045, -43886, -63298, -69100, -59060, -27439, -2803, 1769, 23258, 10652, 3734, -10701, -27953, -22892, -14150, -11296, -15861, -46102, -60618, -42876, -16791, -10019, -8457, -1309, 31545, -7425, -30466, 392, 11720, -18, 6044, -927, -24389, -16041, -35971, -52375, -29427, -11869, 12092, -3263, -16097, -31626, -53907, -39510, -66764, -55550, -71342, -90891, -46403, -36450, -22420, -75598, -69395, -59102, -4822, 26765, 17990, -15510, -34318, 537, 3930, -6736, 5130, 30659, -2253, -24462, -49888, -15936, -10655, -17916, -50952, -77365, -40077, -5875, -51740, -8814, 8548, -15681, -38823, -63614, -56288]
15836e6288M2863j851J3793N578l0088n7273j4209M1526J3798L14n804r653K1056
15823c6238J8999j0937K8084m3111l6207K790K6186k7680J169K7209J1923j5174
15811e2987J7520L565l4549J2201j8657m0653J0607L1235M8628L565j7441k8272
15799f5238L277j2175J4344J7462J1391P849k340K3507L1291P266l9030k6783
15787b9179q625l7098J9911K1393K023L653K1742n8528k2535L5358J4224J1126
15775b6535J4174j2665L580q57k2115R661L2700R198r425l3126r450K9616k4963
15762d0207m5895j4818N5590p707j2981P965K3488l6454k019j4103j5621J8124
15750h4638L9022j277l1940K7516R129L1227N634l264m2768n1195J8230N0467
$$ y = [-56288, -13425, -15276, -1483, 4095, -25993, -83266, -97475, -55949, -42151, -41837, -47641, -57294, -36238, -17239, -28176, -92, -43203, -79410, -76620, -50434, -78114, -76945, -49736, -37813, -52987, -35467, -31902, -66451, -54250, -72907, -113560, -102953, -71718, -23090, -19525, -36966, -65238, -61961, -74136, -59792, -42330, -30939, -23090, -25430, -1923, 29368, 36634, -2396, -29179, -37804, -74902, -54991, -33598, -31575, -27922, -6180, -64708, -87243, -51885, -37661, -26535, -12361, -25026, -21446, -22303, -44418, -34757, -2057, 7141, -2284, -35410, -44860, -15244, -40207, -86102, -100920, -45330, -53037, -66018, -58053, -34565, -71019, -73038, -87141, -102762, -84638, -45616, -46893, -78833, -51317, -42188, -10961, -5327, -8591, -51359, -102554, -84324, -33857]
15738c3857k709q179O755m704j4506R485L4089r07K4257P717j2405l893l8010
15725c6867K0922J2516j0408P853J2268k4082q681j7380k3422j5853L2887L5713
15713a4534K6445l0865M642k1036k5877J3364o45K1550N861K1343r727J4319O465
15700A1305J7565k1292m2854o2800K5822N4867J5679k8390j3698j6872k1427J2048
15688g0047j2300j04L0964K5186Q002P974J2713P442n749j8430l6105j8681J2973
15675e6162J1961J1333L4763k924M447m1585k7190j2952P469J1258K1718P074
15663c0790K9344L5329Q665k1179k7257r110R209K3355r280l0388j5268Q13K1993
15650a4564R524k1556l2029j845K9535l464j9192o665j870J5698p229N66j274
$$ y = [-33857, -36566, -44745, -37990, -42694, -57200, -47715, -13626, -14533, 9724, 17441, 5036, 1143, -36867, -15945, -3429, -13837, -5984, 6284, -17798, -26479, -43859, -67281, -83134, -50247, -14534, 11911, -18954, -14312, -35348, -61225, -47861, -48506, -26956, -21095, 248, -9479, 4840, 11305, 28870, 7578, -35276, -98076, -72254, -17387, -1708, -30098, -43796, -60668, -82095, -70047, -82347, -82451, -51487, -26301, -18299, -10325, 2388, 9830, 4081, -14349, -50454, -69135, -56162, -44201, -32868, 1895, -1029, 3418, -38167, -65357, -78309, -70840, -59582, -37864, -30790, -1446, 33883, 42548, 21369, -5888, -14998, -5789, 17566, 8286, -22102, -37370, -36557, -14564, -5040, -26596, -58625, -60470, -30935, -34399, -53591, -60256, -62126, -46428, -53657, -53091, -54365]
15637e4365M989K856Q231j7759J5263r473J5420j3312P013J8033p946j891K7548
15624e393m999M072l6689l568K5570L2816o925l1120j8118K4656L349L6462J2681
15611C2794J3037n4545n4117l0827j1565K8541N3482o203l6666j771K1225K8523
15599a8092j1613R265m6983M165L1937M438j6407J8647p52k1462q772m7004j9171
15586a21804P130q947K158J8412L5867j2143Q274J0J2808j4253l0080K8180M0736
15573c3652j9679m6010L0830M1852n000K1446K998l0777j4744M2024J1959l6321
15561c5074k2645J6933J7187l1379l5405K1341K4603J3011l2497q128K6505k634
15549d8182l205K3411J3364m2225k0576J2676M4866L905l1162l1540L4005o381
$$ y = [-54365, -49376, -46520, -38289, -56048, -40785, -50258, -34838, -48150, -41137, -23104, -31050, -32941, -5393, -10392, -6320, -43009, -46577, -21007, 11809, 4884, -26236, -44354, -19698, -16349, 20113, 32794, 45831, -8714, -62831, -93658, -105223, -76682, -23200, -29403, -66069, -67840, -46615, -18092, -29705, -20440, -67423, -63258, -31321, -26883, -43290, -24643, -25395, -46857, -55629, -102633, -121804, -114674, -123621, -121463, -103051, -67184, -79327, -71053, -71043, -58235, -72488, -102568, -74388, -33652, -53331, -99341, -68511, -26659, -31659, -10213, -7215, -37992, -52736, -10712, 1247, -35074, -57719, -40786, -23599, -54978, -90383, -69042, -44439, -31428, -63925, -72053, -45548, -48182, -51387, -27976, -14612, -56837, -77413, -64737, -19871, -15966, -47128, -78668, -44663, -51044]
15537e1044l8613k1961p429o842j679K1098J531j4635K4341J1285j1270K9102
15525f6116K6492k1143O562K8454j7787m466m8900n287J6256J6265K4440j7656
15513f2886p555o065j0277J4077P889K533p782q615J8576o719M3973Q06r731N315
15499b6461j7289m5377j8639K2785N0744k5368r038J178R386J8296J5063j0267
15487c4987j1700J500K585k0579l873J0384J2288k7147j3647K3104K4133L0801
15475g138L0957J9974K857m7523r761j7452m5244k4271Q460K2097P649J1093L5037
15462a3265J5645l9597k2770R470O421P191K0260j0021l1884L9989L029l859K8867
15449I476j4219n0817j6966J3571R135k633L3053m2608j5044M5067o500q746J3752
$$ y = [-51044, -89657, -111618, -119047, -125889, -127568, -106470, -104939, -119574, -95233, -83948, -95218, -66116, -39624, -60767, -54205, -25751, -43538, -48004, -96904, -102191, -85935, -69670, -45230, -62886, -70441, -76506, -86783, -72706, -64817, -62284, -70066, -78681, -60105, -66824, -22851, -22045, -31776, -26461, -43750, -89127, -107766, -84981, -34237, -59605, -68643, -67465, -58079, -39783, -24720, -34987, -46687, -45187, -42602, -63181, -67054, -56670, -44382, -71529, -85176, -62072, -37939, -7138, 23819, 43793, 46650, -873, -10634, -28086, -73330, -97601, -89141, -67044, -59395, -48302, -13265, 2380, -37217, -59987, -50517, -44096, -36905, -16645, -26666, -58550, -18561, -15532, -19391, 9476, -4743, -55560, -72526, -58955, -49820, -52453, -19400, -62008, -77052, -31985, -38485, -47231, -33479]
15436c3479k4818J9027O884l568J1333j2739Q082J4071M9179J7768n3118m6663
15424d8041L0108J9041j2058j4039n4769R471M0662J7567k865l9102m982J9583
15412c9424L8452j314l653K06K4038k0773l6488J1621j9965l8118l657j8225M5626
15399f1674K7403L9233j7254j6902l0326l9775l3683j7203L5614L2921K6925j4027
15387f8748j5545K9543J8510J7227L1899K097k2621l7841n808O804k5620j6903
15375h7006K9052K3979j2970o118j0609l138K5226M199m12P642J6707J2884P645
15362G081k5930l5590N027J3848j0267m1632l2998K099J3443j1922o734J3587
15350a09988K9742J230K9088L5650j4956K8915Q849j1892j0810k6984l4151k5652
$$ y = [-33479, -58297, -39270, -32386, -35954, -24621, -37360, -29278, -15207, 33972, 51740, -1378, -48041, -17933, 1108, -10950, -24989, -79758, -70287, -29625, -12058, -14923, -54025, -59007, -39424, -972, -2286, -5939, -5733, 18305, -2468, -38956, -27335, -47300, -85418, -89075, -107300, -61674, -34271, 4962, -12292, -29194, -59520, -99295, -132978, -150181, -114567, -81646, -54721, -68748, -84293, -54750, -36240, -19013, 12886, 14983, -7638, -45479, -51287, -44483, -70103, -87006, -57954, -33975, -46945, -53063, -63672, -66810, -41584, -37385, -37797, -30155, -13448, -564, 7081, -18849, -54439, -49412, -35564, -45831, -87463, -120461, -118362, -104919, -116841, -123575, -109988, -80246, -79016, -49928, -14278, -29234, -319, 8530, -3362, -14172, -41156, -75307, -100959]
15338a00959M2492N3258K3222k451j5636k0265o3861j4755N1767p883k7885p53
15326h3709j0530q093M8856M8976K559n403q073k1081J0140r803Q272N462m5332
15313f7759m596j7244m705O8949K8728n589N888l3593r49K0316q694l5076o288
15300f0612M9164J5928j627j3193Q030k2993j4151L1822J8584l4656j0092M5808
15288A2012M2321k2686j3000k3753k5855J4597l8509l698K9288L2935j2442l0815
15276c9605j4815Q128k0656j7376q050K4303K0365L2804J8576m047K4746k2188
15264B185J1916j1730P568k3358K4288j9391l5907l1567J6310J2367j4064K043
15252e9340L0119J0612j2273J2707n963P951J0430k7809m5398k595M815L511O9262
$$ y = [-100959, -58467, -5209, 18013, 15562, -74, -20339, -84200, -98955, -47188, -55071, -82956, -83709, -94239, -102332, -53476, -4500, -1941, -7344, -15417, -36498, -26358, -36161, -27889, -22427, -67759, -72355, -89599, -94304, -25355, 3373, -2216, 3672, -29921, -30870, -10554, -19248, -54324, -60612, -11448, 4480, 2853, -10340, -2310, -25303, -39454, -7632, 10952, -23704, -33796, 12012, 54333, 31647, 18647, -5106, -30961, -16364, -54873, -58571, -29283, 3652, -8790, -39605, -54420, -46292, -66948, -84324, -92374, -68071, -47706, -14902, 3674, -373, 24373, 2185, 14101, 2371, 9939, -13419, 10869, -8522, -44429, -75996, -59686, -47319, -61383, -59340, -29221, -18609, -30882, -18175, -24138, -16187, -5757, -33566, -78964, -81559, -76744, -73233, -3971]
15239c971L4884J12p402l3989k5822q754K9831J7517j1661j1428k070n174J0544
15226a7383J2043p2129l0992K1865O4142L7546j3813p911m554j4727k1619L8263
15214i269j3689K467N136k7591m244L2512N446l5909K7228mK8017R285K0019K3110
15200F2514j8448m5212r358p991j2791Q6703L2313l2600l7971R559k1628m0362
15188c5272J0530K5911K9307L601l6633M673J6703j819j2004k2998j2131n910
15176c6042j7068P290K3898k6144l2189l0724j170M0663K5897l1628M7691k2326
15164e1852l0638j1470M0988N1944K8541K385l4826j4228L6115k24k2800k0201
15152b6266O927q725k4242k6568L153L7645L8235J4611j0796m0632J0983K6570
$$ y = [-3971, 30913, 31025, 23623, -10366, -36188, -44942, -15111, 2406, -9255, -20683, -22753, -27927, -17383, -5340, -77469, -108461, -86596, -22454, 15092, 1279, -6632, -11186, -25913, -47532, -9269, -22958, -20491, -15355, -42946, -47190, -14678, -9232, -45141, -17913, -17917, 10100, 19385, 39404, 62514, 44066, -1146, -10504, -18495, -31286, 55417, 87730, 55130, 17159, 26718, 5090, -35272, -24742, 1169, 30476, 34077, -2556, 2117, 18820, 17001, 4997, -18001, -30132, -36042, -53110, -45820, -21922, -48066, -80255, -110979, -112149, -71486, -45589, -77217, -29526, -51852, -82490, -93960, -52972, -1028, 27513, 29898, -4928, -19156, 16959, 16735, -6065, -26266, -19339, -28064, -52306, -78874, -75721, -38076, 159, 14770, 3974, -36658, -25675, 895]
15140H95M8401q683m2959m3505l8035k5313M1251J1887j6135j249j8984J4897
15128g7532j5841M7729K4078k6849l016l505L1013J4933K9242p35j5343m1531
15116c7357o415J7283j2889R626N999R655k1107k0292N668L4165k0548l8878j0592
15103h5682J9585K4790M0565k088n2470K7908O204J2953q389K2801N772n3319
15091d1370l1681k127J0988K554j6901J4242L7583J5614J6350O182K4661k747
15079C3348j5457m0383j7716L7657N825n357k5620k3286J2946L677K1548M548
15067h270p665K039j2813J8491L8545k233l9593j4277L017p562J0117M1762J3178
15054C4736k1244j9024l9259j1570O735k364K3842M9699J2090j5921k7046k6891
$$ y = [895, 49296, 40613, -2346, -45851, -83886, -109199, -67948, -56061, -72196, -73445, -92429, -77532, -93373, -45644, -21566, -48415, -51431, -54936, -23923, -8990, 20252, 19517, 4174, -37357, -43772, -26489, -39378, -29752, -23753, -14098, -35205, -55497, -49829, -15664, -36212, -75090, -85682, -66097, -41307, -742, -2830, -55300, -27392, -21188, -8235, -16624, 6177, 11949, -41370, -73051, -75178, -64190, -61636, -78537, -64295, -26712, -11098, 5252, 11434, 36095, 33348, 17891, -22492, -40208, -2551, 3274, -2083, -27703, -50989, -38043, -34366, -12818, -8270, -15935, -13896, -26709, -8218, 30327, 28094, -11499, -25776, -22759, -30321, -20204, 21558, 34736, 13492, -5532, -44791, -56361, -49626, -51990, -28148, 21551, 33641, 17720, -9326, -36217]
15042c6217J9662O417p590j0029l1333p717K4212R116j1316J6784P484L310L402
15029a3815k1216l2091j834J0126r207J4587J5661J7903M8345J9973l4118j6012
15017a698J176j9378p847L159J0864q993r259n034J2795K6804l752k8667j1108
15004d0938K538q523L952J7093K9250j1481K1907j2144N220j2172K2806K4004
14992D1512l6437k862M3138M1371J0649K0503L3139L1892o3980n9502R482O72
14980F9577l1418j5298N482j4197l6684k3455k1914L182L0674J6590P92K632Q406
14967e631l9933l073k562k6001o582K0556M1322K1041L6027j6400J7903m236k1666
14954A0765L266N1786L3956l554n3441k8408Q741R541n1909k1632L1751L3642
$$ y = [-36217, -16555, -10138, -17728, -27757, -59090, -66807, -42595, -33479, -44795, -28011, -20527, -17217, -13815, -35031, -67122, -68956, -58830, -68037, -53450, -37789, -19886, 28459, 48432, 14314, -1698, -522, -19900, -27747, -24588, -13724, -22717, -31976, -37010, -24215, 2589, -1163, -29830, -40938, -38400, -46923, -42971, -25878, 3372, -8109, 13798, 1654, 6874, -5298, 17508, 41512, 5075, 2213, 45351, 86722, 97371, 117874, 151013, 182905, 118925, 59423, 68905, 69577, 38159, 22861, 28343, 14146, -22538, -45993, -67907, -64725, -34051, -17461, -16669, -14037, -5631, -45564, -48637, -51199, -77200, -83782, -63226, -21904, -863, 35164, 18764, 36667, 32431, 10765, 14031, 65817, 99773, 96219, 42778, 14370, 23111, 32652, -19257, -40889, -9138, 24504]
14942B4504k2495n055m089j2222p319l5780k4698K4473J9021j5739M0109M5140
14930B5850q070m74k5363L4344K8021k2600J0992l725j6290m974J3491M281K51
14917C5734l9185p262L254j3346j6563L058j8658l4984J1690L3799o961K7248
14905b2176J4935K4558J3426n198j9532J193J7127j7962n0539l1032L1243M2277
14893a680M6608M898o8967P817Q206N817O887r967L097j4564r028K3433M932o217
14879A272k222j4813j7237j3128O843L5757k3967J0514j841M307J839j3942m3939
14866g0557J8876K4707K0140l303P547j1821j1128K6265j515j5940M741M725l3868
14853d1131k8809l8234k0293J7170N9528M4353K1745J0300j6071k419n63j5101
$$ y = [24504, 2009, -3046, -7135, -19357, -26676, -62456, -87154, -62681, -43660, -59399, -19290, 25850, 17780, 17306, -8057, 26287, 54308, 31708, 42700, 38975, 22685, 17711, 31202, 35483, 35734, -3451, -10713, -7459, -20805, -37368, -34310, -52968, -87952, -76262, -42463, -49424, -22176, -7241, 17317, 30743, 25545, 6013, 7206, 24333, 6371, -44168, -75200, -43957, -1680, 44928, 49826, -19141, -11324, -3118, 2699, 9586, -381, 2716, -11848, -20876, 2557, 7489, 1272, -950, -15763, -33000, -46128, -39285, -3528, -27495, -16981, -18822, -14515, -12676, -26618, -70557, -51681, -26974, -6834, -10137, -2590, -14411, -25539, 726, -789, -16729, -11988, -7263, -41131, -69940, -108174, -128467, -111297, -51769, -7416, 14329, 24629, 8558, 6139, 5576, -9525]
14841i525j5496Q69l541M0954K6062l5413m9615K3119K8605j1546J456j9935n6743
14828h0749J553J3151m248J7210Q089k1562j7767j0898K8413M788j8814N122q880
14815h4592L329J1755K731p455J124O2937m428o5754j5122M718J4274Q641M0265
14802b7577j0361j6385n5311K5490M0764O4815O266O681k5228l9537o353m580
14790d1316j2419L9637J4458J0607o628m798N730m197P952j9462L6772L338j4879
14777A4795j0567n376k2533p038J109J361K149l75k7087O444K2104J2633K6127
14764A3746N368P100J2433j7659j4500k5035K2846M0706j229j8400j8918k5243
14752a8785o687J1381j6704l294j0100m4040L4431L8874l4588n90L760K6751o710
$$ y = [-9525, -25021, -24152, -27693, 13261, 39323, 3910, -45705, -22586, 6019, -5527, -4071, -24006, -80749, -79196, -66045, -70293, -53083, -44994, -66556, -84323, -95221, -66808, -62020, -80834, -75712, -84592, -81263, -69508, -66777, -74232, -73108, -10171, -14599, -80353, -95475, -90757, -76483, -67842, -27577, -37938, -54323, -109634, -84144, -43380, 21435, 27701, 34382, 9154, -30383, -36736, -41316, -53735, -14098, 360, 10967, 4339, -459, 5271, 1074, 9026, -10436, 26336, 29674, 14795, 4228, -1148, -23681, -30719, -29610, -28249, -26100, -26475, -53562, -47118, -25014, -12381, 13746, 19114, 26214, 38647, 20988, 6488, -18547, 4299, 45005, 43776, 25376, 6458, -18785, -25472, -14091, -30795, -34089, -44189, -88229, -53798, -14924, -49512, -50102, -46342, -19591, -26301]
14739b6301l9730J4241l23J6688Q287J633K1096j6696R089J6979o476j3099j8138
14726c2750K359r671j1910l2880K0897N1138J8308J0290j9025k5738K352j9534
14714d6164L6164L2741m1638L7995K1432n523J589j7212O085j5932n584R097k5620
14701a2570L571J7631m932o929K852J2494j3083k6713K7647N5174j5668K9024
14689F8498n22J5576M730n970j6085l3885P171K364k6355k3925N749M3188R210
14676D9744q571k4910l2114J6858L9249k5545l7703K586K751k433J8143m35K4838
14663B2458M915k8534j0960M1344L3865q973m1033J5356j518K909k4526K358J7815
14650B5476K0219l0252q824j7002k0212l690K5289K4826l0728k6795J1050J4977
$$ y = [-26301, -66031, -51790, -52113, -35425, -27138, -25505, -4409, -21105, -12016, 4963, -1513, -14612, -32750, -30391, -40062, -51972, -84852, -63955, -12817, 5491, 15781, -3244, -28982, -26630, -46164, -10000, 22741, -18897, 19098, 40530, 35007, 36596, 19384, 25469, 9537, 3953, 13050, -12570, -8999, 8632, 3700, -3229, -377, 12117, -966, -27679, -32, 55142, 39474, 68498, 67976, 83552, 88282, 82312, 66227, 32342, 39513, 41877, 15522, -8403, -2654, 40534, 49744, 41173, 16263, -15851, 1007, 40256, 14711, -22992, -20406, -17655, -20088, -1945, -2380, 22458, 27373, -1161, -12121, 29223, 63088, 54115, 13082, 28438, 26920, 29829, 5303, 7661, 25476, 45695, 15443, 6619, -10383, -30595, -34285, -8996, 15830, -14898, -41693, -30643, -15666]
14638a5666j9906K1420N531l597l004m7754N664j5566P589J4667k3980M5982K1623
14625f997k7540l440J2673j4104R666k208n8197k2850N1541K4017K3543k4541
14613c8437j9803N0136j4897k1150l677l824J6005l3125j1961L5060l3547L0860
14601d8360K9189q318j6009k7618J7003L0279O388m1208K9093j4731Q879L6119
14589G06k4041O774j1594j2933j5841J5337M6514O625J1472J5635n748k3267P846
14576A7485j9299k584Q717m7198n74J5736l669J995J2539j5877P317j2907m3532
14563h1851K2464K5254L0170m7832r633j1693p073L7024J1583Q22K0505L1973
14551B1713m1947l3110k8433K7047J200J4173J7509J7587J1646j2396k1987l6551
$$ y = [-15666, -35572, -14152, -8621, -12218, -15222, -62976, -57312, -72878, -65289, -50622, -74602, -28620, -6997, -34537, -37977, -25304, -39408, -29742, -31950, -90147, -112997, -61456, -37439, -13896, -38437, -58240, -8104, -23001, -44151, -47828, -51652, -35647, -68772, -80733, -45673, -79220, -48360, -19171, -27489, -43498, -71116, -54113, -23834, -17446, -58654, -29561, -44292, -35413, 706, -23335, -16561, -28155, -41088, -56929, -41592, 4922, 11547, 23019, 38654, 32906, 9639, 17485, -1814, -4398, 4319, -42879, -43453, -27717, -31386, -29391, -16852, -32729, -25412, -38319, -81851, -59387, -34133, -3963, -51795, -61428, -73121, -80194, -43170, -31587, -30765, -10260, 21713, -20234, -53344, -81777, -54730, -53530, -39357, -21848, -4261, 7385, -5011, -26998, -63549]
14539f3549n0312K0565N5172j618K8516N930K4403j3756N654j9762J930J598m1851
14526d7080l869L5137n684j4795L7756J92j0736J3556K5725k9701j2438l2710
14514d4647J9405P374L9164m2451k5227L9121K3486K620p864k3600J5977j163
14502B195j1331k6109N6266j5796k1483Q703P055k24K9400J2867j4709j4531p341
14489D962j1881Q649j6598k0557K472J2015L0248o05k7083p48k4963m6686M2204
14476d8571L5971l6974l2516J200L1100L7626j123k1725m1316o928M0007M714
14464c8535j7917J5642L650J5468M2389l0J0513p42k6615k5972k053K4400J0699
14451A0897m9910j5107J5676K0754j6569R47L2343K6994p160k760k1627N900j6653
$$ y = [-63549, -113861, -93296, -38124, -39742, -11226, -5296, 19107, 5351, 11005, -8757, -6827, -5229, -47080, -50949, -15812, -21496, -36291, 1465, 1657, -9079, 4477, 30202, 501, -11937, -44647, -25242, -17868, 21296, -21155, -46382, -7261, 16225, 18845, 10981, -12619, 3358, 2195, -9136, -35245, 21021, 5225, -16258, -7555, -500, -724, 28676, 41543, 26834, 12303, 4962, -6919, 1730, -14868, -35425, -32953, -20938, 9310, 8705, -18378, -19126, -44089, -90775, -48571, -12600, -49574, -82090, -80890, -49790, -12164, -13287, -35012, -76328, -83256, -43249, -38535, -56452, -40810, -37160, -21692, 20697, 20667, 31180, 30438, 3823, -22149, -24202, 198, 10897, -39013, -54120, -38444, -17690, -34259, -33312, -969, 26025, 18865, 16105, -5522, 378, -16275]
14438a6275j1200n558j5415k5964m1803K2792M6684J7637l1972J8631M5301n948
14426c090o424l3930J9291K2970j1444q603Q87k7367j3936L115K6791M1387L145
14413A2792J1561m1395n6447R418j1226J0690K8290j39K9970J991k3447J0157
14401a7785L2856L6062J9790j4688r327l827k537k883p915m478l300k462j295
14388A8211R041k9221k4218R450J1182q57o375j164J002N760k2381P740q602R598
14374b0834L6373Q980n697N271P94r818p690j2992M9J8856j7710k5907l688K2679
14360a1334k568L529j3552J667L1941R345J1520j663l3009K6888k7193j9425L157
14347b0697J3116K0459J916j1015K9254k053r348J5980j3565k0061N615p892J1059
$$ y = [-16275, -27475, -33033, -48448, -74412, -116215, -93423, -46739, -29102, -61074, -42443, 2858, -3090, -9514, -43444, -24153, -1183, -12627, -21230, -20343, -47710, -61646, -58531, -31740, 9647, 12792, 24353, -17042, -73489, -64071, -75297, -64607, -36317, -36456, -6486, -4495, -27942, -17785, 15071, 51133, 70923, 56235, 46908, 43081, 40544, 37661, 29746, 25268, 21968, 19506, 18211, 27252, -1969, -26187, -16737, -5555, -6412, -12787, -13951, -12949, -7189, -29570, -21830, -30432, -20834, 15539, 24519, 18822, 24093, 24887, 15069, 7379, -5613, -5564, 13292, -4418, -30325, -34013, -11334, -13902, -10373, -23925, -22258, 9683, 19028, 30548, 28885, -4124, 22764, -4429, -23854, -20697, -7581, 12878, 14794, 3779, 33033, 30980, 21632, 37612, 24047, 3986, 9601, 1709, 12768]
14334A2768P13K5904j3234O656j3682M659l708J3216k7219j2120q617j8693n856
14321c9213J6110J4796J3888j4728J544k8679J2333J7461J9528l24o4089K2999
14309b8374L1529q315l0628J944N7463J0572o526m6637j7462J9649K7348j4930
14297d367l3837K872J1165k9920M5139L0506O774N159j7673l8751R236L8633J8782
14284D3718Q603m182Q038l8037o967n518k3887o901o020Q900M2036L866J1760
14271C5409m690J334m8603K6095N0098j734m51L6174L0258l6832p2732K149k1991
14258e516l4601k7210M59L7082K9048J2632q838k3828L0757J6622m661j7426k2837
14245a8317j0131K1120j3731L1312K4946m2536J758K4191K9500M875l7075o198
$$ y = [12768, 13481, 39385, 26151, 32807, 19125, 23784, 20076, 33292, 6073, -6047, -14664, -33357, -39213, -23103, -8307, 5581, -9147, -7603, -36282, -23949, -6488, 13040, 12716, -51373, -28374, 3155, -5160, -35788, -33844, 23619, 34191, 27665, -18972, -36434, -16785, 10563, -4367, -38204, -35332, -24167, -54087, -8948, 21558, 28332, 33491, 15818, -22933, -13697, 24936, 43718, 52321, 48139, 56177, 18140, 11173, 5655, -18232, -25133, -31153, -22253, 19783, 23649, 35409, 30719, 32053, -16550, 9545, 59643, 57909, 57458, 93632, 123890, 87058, 14326, 16475, -5516, -40117, -67327, -66868, -29786, -738, 11894, 3056, -20772, 9985, 26607, 21946, 4520, -18317, -28448, -7328, -21059, 10253, 35199, -7337, -5579, 18612, 48112, 52987, 15912, 9714]
14233I714L8136J7928m1835l0886P78j7763L2592N5189j8245j9346J3798j4008
14221B6052Q82K0420j3932j4079k0533k9645j6882L1869J0679P227Q153M797l2095
14208a7087M1480K4098O144l7082N431l8327k047L3782J5725k2323O072j3212
14196B654L94K9957Q797k2386l0094J0081J3210J0235K866j5758Q531K7829k5540
14183B0776q499J7056n612J1964N0732k3975n5479m8661R222m559J8917K7932
14171I814o860k9849m068K2045J0613M1771K7902o185j4282j6661M086j0924k9770
14158b368N349L560o1227k1796Q555J9173N4763J7339K9384n58j626k4800k4015
14145A733K3760O4824Q690m0003r011j1106j8252m1693j2001Q534M8468J2049
$$ y = [9714, 47850, 65778, 23943, -6943, -6165, -23928, 8664, 63853, 45608, 26262, 40060, 26052, 26934, 47354, 33422, 19343, -1190, -30835, -47717, -15848, -5169, 2058, 10211, 15008, -17087, 24393, 48491, 54635, 17553, 22984, -15343, -17390, 16392, 32117, 9794, 15866, 2654, 3048, 33005, 41802, 19416, -10678, -597, 12613, 22848, 25714, 9956, 18487, 46316, 20776, 12277, 29333, 23721, 35685, 86417, 62442, 6963, -41698, -32476, -37035, -18118, 9814, 2954, -26895, -30963, -8918, 1695, 43466, 71368, 65183, 50901, 34240, 38326, 27402, -2368, 2981, 6541, -54686, -76482, -67927, -48754, 6009, 23348, 52732, 52174, 50548, 25748, 1733, 25493, 90317, 99007, 59004, 49993, 38887, 20635, -21058, -33059, -24525, 23943, 35992]
14133C5992m7974J2220J924n40Q309R64Q116m521L915J6874j7920O407j0088J6273
14119B9951j6441N909J5792K4609j5319l7726k4124R067L7909K1648l0424o0386
14107c9535m2961K6962N0286n701K1569q070l8685J6659J8364M630k1091j5456
14095c3029L197J5567M2040L4886r499l7126l187k7524K0251K0626K9009k0472
14083C4739k6122K5360J4276L060j1166J3924O141m2282k5154k2603K6573M5308
14071D2054N0790k1575k0950j9125j8784K3542K1187j7133m2237j086J9614K7722
14059D4019M0525l4655m921m09J1075j3718j9350J1678M9302p991k8036j2823
14047C4696J4780J9510o907k6139L149j6450M6638K4446p1219n0117O9733Q567
$$ y = [35992, -11982, 238, 2162, 1622, 9931, 10895, 19011, 14490, 18405, 35279, 17359, 23766, 13678, 29951, 13510, 19419, 35211, 59820, 44501, 6775, -17349, -8282, 29627, 51275, 20851, -39535, -82496, -55534, -5248, -10949, 10620, 2550, -36135, -19476, -1112, 3518, -17573, -33029, -29832, -14265, 27775, 62661, 53162, 16036, 12849, -14675, 5576, 26202, 55211, 34739, 8617, 33977, 48253, 51313, 40147, 54071, 60212, 17930, -7224, -29827, -3254, 42054, 92844, 71269, 50319, 31194, 12410, 35952, 57139, 40006, -2231, -3317, 16297, 44019, 84544, 49889, 44968, 44559, 55634, 41916, 22566, 34244, 83546, 75555, 47519, 34696, 49476, 68986, 62079, 35940, 39089, 22639, 69277, 93723, 22504, -27613, 42120, 50687]
14035E0687j4420J0456m1099j6854m285k3657L3931J8784n658K149K030K685K0733
14022C5482O557J1733O398K60P217J4296J9688k9310o699j1625K7965K0727j1685
14009I1004j0155J2176l2360O246K5878n806j9753j4183m4159j7418k4746L319
13997b9957J2651J0054J0467J9094k12k156J9732m373k8628l0687L0898J6851
13985B3734J0226j7109o311J464o121j6741K6132J4037N104O616K404P226K9294
13972G9955k2019j3055k6931M829J7591k5110l3728j0023N3173K3626J6412k608
13960F2112k2821m3476q27j1394N556M6437J5434M475k0898l0131k95p289J7380
13947A4263k662N069j7107j2870L0043J0227k1996K9666K8476k6709l6231l5273
$$ y = [50687, 36267, 46723, 5624, -11230, -15515, -39172, -5241, 13543, 7885, 10034, 12064, 14749, 35482, 42039, 53772, 60170, 60430, 67647, 81943, 101631, 72321, 65622, 53997, 81962, 102689, 91004, 80849, 93025, 60665, 66911, 92789, 86983, 67230, 53047, 8888, -8530, -33276, -29957, -17306, -7252, 3215, 22309, 22097, 19941, 39673, 35300, 6672, -24015, 6883, 23734, 33960, 16851, 10540, 12004, 5883, -10858, 15274, 29311, 34415, 41031, 43435, 50661, 79955, 57936, 44881, 17950, 22779, 40370, 15260, -18468, -28491, 24682, 48308, 64720, 62112, 39291, -4185, -5012, -16406, -10850, 35587, 51021, 55496, 34598, 4467, 4172, -3117, 14263, 11601, 16670, -437, -13307, 16736, 26963, 4967, 34633, 63109, 36400, 169, -35104]
13935c5104k9891m636J4027L707M7718L0440l9871j0851l4113K520J6585K7701
13923a1768q548K2328M4378k3197l3928J3221M5020M59j5969j6025J8589K4170
13911E8730r145J5464K8638k6174k6363L117P765k5192j7426l670j3308J7212
13899I648K3372J3992r170k9016L444j8674J6390K4665O013l0254k8252m010j5089
13886c6941q299K94J1191l247k120N4874K8404M463J5836J2049r735n408J4282
13873G5643L2195j2172n300L3626j4114j9002n7026k7675J1676O326J9356L2425
13861G5958j3874j1947K8886N773j6111l1304k3637j9468M262L5956q184j2995
13849A3315j5211R205K6615K9092j8670k3272k5920J1539q297j841L6508L0010
$$ y = [-35104, -64995, -69631, -55604, -51897, -4179, 26261, -13610, -24461, -58574, -56054, -39469, -11768, -20316, 2012, 46390, 23193, -10735, 2486, 47506, 47965, 31996, 15971, 34560, 58730, 49585, 65049, 93687, 67513, 41150, 44267, 52032, 26840, 9414, 5744, -7564, 9648, 33020, 47012, 37842, 8826, 12270, -6404, 9986, 34651, 40664, 10410, -17842, -21852, -36941, -45240, -44946, -33755, -37002, -39122, 15752, 44156, 48619, 64455, 76504, 66769, 61361, 75643, 107838, 95666, 90366, 123992, 109878, 90876, 33850, 6175, 17851, 24177, 43533, 75958, 62084, 50137, 79023, 84796, 68685, 37381, 13744, -5724, -1462, 34494, 26310, 13315, -1896, 7309, 33924, 63016, 44346, 21074, -4846, 6693, -1604, -3445, 33063, 63073]
13837F3073j274l9247k6721j4389J1756N8172K5021l9222L962k536l1383J501
13825H713L1879k1565k6300K826K5008j3418J3916L1930n769m6197J1364L2074
13813D4461O877K505k8579P611N701J1130L1221J2209K5517p060k7826K1025O537
13800A11329j1752l2103m2223m987J4046r26L2904L8653r387k397K4907m2715
13788G5349k7555q471l2285M717k4626r097J4392K7909J9077j56k689L1894K1631
13775I0090J9495p032j6033j0443J4946k5791r658j3118l4752l2332K6326J6802
13763A8500O733j1639M2656L4054j1333m7270j1541K5860J6600j8051j4164n6049
13751b5644K4252P3117J8852L0136j3622l970l6552j8101K6849L0506j3038l5943
$$ y = [63073, 61799, 22552, -4169, -18558, -6802, 51370, 76391, 37169, 41131, 38595, 7212, 8713, 40592, 19027, -7273, -4447, 20561, 7143, 21059, 52989, 47220, 1023, 12387, 44461, 51338, 53843, 25264, 32875, 38576, 49706, 80927, 93136, 118653, 111593, 83767, 104792, 111329, 99577, 67474, 25251, 20264, 34310, 33384, 66288, 104941, 95554, 93157, 118064, 75349, 47794, 39323, 7038, 11755, -12871, -21968, -7576, 20333, 39410, 39254, 36565, 68459, 90090, 109585, 102553, 86520, 76077, 91023, 65232, 55574, 42456, 7704, -24628, 1698, 18500, 25233, 13594, 56250, 90304, 78971, 31701, 20160, 46020, 62620, 44569, 30405, -25644, -1392, 71725, 90577, 120713, 107091, 103121, 66569, 48468, 75317, 105823, 92785, 56842]
13739E6842j9022q459k53K1854j2940m1245j1627m752M2580L624j6240J784q847
13726C299K2380L6874L5507k1994O62m132l9411k9361m68o668O2004L0578j921
13713H7349J1101j7407k6895o686j6243L5098k010J8123J4144m422N429k0884
13701G6697k4158l3382j5014K2259R450k7872q562j0300K7767K9795K3293p081
13689F2892J3619j448o868j1337k3644j427J67l613K6189Q070n932J5797R718
13676H2183l086J0335P706J6827j4979R604j8848j6942j2148o435O301P849J3548
13663H1915j8745l163J7618J2062l0702j9115j5551J3108L1395K4225L0248l7127
13651H6168m455j59k0807r464Q085K4241k8094j8109j0777k418j7798k8205O928
$$ y = [56842, 37820, 29361, 29108, 50962, 38022, -3223, -14850, -19602, 22978, 26602, 10362, 12146, 3299, 25679, 62553, 98060, 76066, 76728, 72596, 33185, 3824, 3356, -3312, 58692, 89270, 87349, 98450, 81043, 54148, 47462, 31219, 66317, 64307, 82430, 96574, 92152, 97581, 76697, 52539, 19157, 4143, 26402, 35852, 7980, -582, -10882, 16885, 46680, 69973, 62892, 76511, 75063, 68195, 56858, 33214, 31787, 31954, 28341, 54530, 62600, 56668, 72465, 82183, 79097, 89432, 97138, 113965, 98986, 108590, 89742, 72800, 60652, 54217, 60518, 68367, 81915, 63170, 60007, 77625, 89687, 58985, 39870, 24319, 37427, 68822, 93047, 123295, 86168, 81713, 81554, 60747, 51283, 59368, 83609, 55515, 37406, 26629, 24211, 6413, -21792, -14864]
13638a4864Q017J5210O6260O961m5401R190p953K6283L3756K5194o651l51p781
13625A07870k5889j7973l0639l3977p190L8124L0557L3032K9158n95k3404l1739
13613F7335J0266J3792j2908j5439j4119j2252K9846M2905J1584k1955k5063q444
13601F5548K3783p306l2798k1726q46J8681O431l3720K3085N4176K6730o109m9032
13588F6897k2240L5291L5722J9299l269n8817n5237K0308L1599j9899J6246m514
13576F1386m0287m92o055J2137Q955P070K7937J7176j9693k7477m149L6513R098
13563H2119J0600K7538l131l2515J2323k110n177L7807Q383j0832l4148R093o931
13550I3019k2738M2677J453j1532n34Q943k8377k3217m7394L2107L3710n419K194
$$ y = [-14864, -6847, 8363, 74623, 81584, 36183, 45373, 37420, 63703, 97459, 122653, 116002, 115651, 107870, 81981, 64008, 33369, -608, -7798, 30326, 60883, 93915, 123073, 122478, 99074, 67335, 77601, 91393, 78485, 63046, 48927, 36675, 66521, 109426, 121010, 99055, 73992, 65548, 89331, 82025, 49227, 27501, 26655, 45336, 51767, 18047, 41132, 95308, 122038, 115929, 66897, 44657, 79948, 115670, 134969, 131700, 72883, 17646, 37954, 69553, 49654, 65900, 61386, 21099, 20607, 14552, 26689, 35644, 42714, 70651, 87827, 68134, 40657, 36508, 73021, 82119, 92719, 120257, 117126, 84611, 96934, 94824, 89647, 127454, 135837, 125005, 90857, 99950, 93019, 70281, 112958, 114411, 102879, 102345, 111288, 82911, 59694, 12300, 44407, 78117, 72698, 74892]
13537G4892J1159k0224j1663k2461l6138j1703J7660Q512Q0576K1212k2875J4035
13525A02982J3262k371m2900j0476j7461K293L2914M2875k468k9679j7076p352
13513F4543Q856k7199P394j040p097j8401l495N151J9852J9619J5570j4404j309
13500F8040k4582k0320K8189N5871K6999l0094l0356K9938k0952k8491L7683L1085
13488A23010J0920j6220l3447j5899J5568O147J520j2469j2575j1691q933M66
13476D6397J9010J395n0485K7259N2458K9458q410K1016O846M436j5617j2745
13464A21018O876K9788k6262m6526M502J8464j2849J9451J6546k788q470M0590
13452A60340R495m8163j3411j4225l85J8091p00j0800k9890m4398J8976M4945
$$ y = [74892, 86051, 65827, 54164, 31703, -4435, -16138, 1522, 10034, 90610, 111822, 88947, 102982, 116244, 113873, 70973, 60497, 43036, 45329, 78243, 121118, 118650, 88971, 71895, 64543, 73399, 46200, 53594, 52554, 45457, 27056, 23561, 28712, 48564, 68183, 83753, 69349, 68040, 43458, 23138, 51327, 107198, 134197, 104103, 73747, 103685, 82733, 54242, 91925, 123010, 133930, 117710, 84263, 68364, 83932, 90079, 91599, 79130, 66555, 54864, 45931, 46397, 65407, 66802, 16317, 43576, 96034, 125492, 117082, 138098, 144944, 149380, 133763, 121018, 127894, 157682, 131420, 84894, 89396, 107860, 95011, 114462, 131008, 128220, 119750, 160340, 169835, 121672, 108261, 94036, 93651, 111742, 111042, 100242, 70352, 25954, 44930, 89875]
13440H9875L0767k4181l2615J561M6556R304J2294l0943J855R611N90L094m9725
13427F8043R610J4694J5492R681q455n359j3466j0236K4985J0006l27j6679J1085
13414A09074M713J4530K1299j6012l6618J456M778J1161j9617n237L7175L3232
13402A59934K8248j739p1007l3087k2111P401k743m7334M5752K0932R618L2218
13390A26082k719j9264L8968J3217j4307k4756j7507l9684k4056K3651L7727K6257
13378A23609k333J1722O256j0166l0969k3057J2435J2231L997j8192L761Q238
13366I7532K1131J6809P688p392K4319r398m0478r848J3951J7497j6591r418k2768
13353H3034j295K5835K0699k6648r015R051K6198N138k042n0128L2557R239n2995
$$ y = [89875, 120642, 96461, 63846, 65407, 111963, 121267, 133561, 102618, 104473, 114084, 114674, 117768, 68043, 77653, 92347, 107839, 117520, 109065, 103706, 90240, 80004, 104989, 114995, 114668, 97989, 109074, 113787, 128317, 149616, 133604, 96986, 98442, 103220, 114381, 94764, 89527, 126702, 159934, 188182, 186443, 115436, 82349, 60238, 67639, 64896, 17562, 63314, 84246, 93864, 126082, 123363, 104099, 143067, 156284, 141977, 117221, 99714, 60030, 35974, 59625, 97352, 123609, 121276, 132998, 139254, 129088, 98119, 75062, 87497, 99728, 103725, 85533, 89294, 97532, 118663, 135472, 143160, 135768, 160087, 150689, 110211, 100363, 114314, 131811, 115220, 105802, 83034, 81739, 107574, 128273, 101625, 92610, 101661, 127859, 132997, 130955, 80827, 113384, 122623, 69628]
13340F9628j9353j4082p606N1374M7967L1410o265o7476j2244j1833Q869J8383
13328H8772L328O132R736m642m369K1686P306l4607J2807M2950j3678m2290R575
13315A02706M5842K9827k4446k8440l3117L511o938k6773k5268K830N6866M700
13303A01300j7971J6691J2541k4596o498R920K4650K4396R29j1866j1704K7405
13291A45197k4251J647K262n291P351m437j1185j0576j1536k822Q49K5083J7726
13278A30017J9697m956J6005j7122j153q865j0372J9895K1545l9364j88J7706
13266A42845j8682J6108K3417k3273J4695r938q893o092n460k466j2522M2814
13254A52553M843j6927K9756j436o903j3399j983p942j9692k1768O45J9386M3109
$$ y = [69628, 50275, 36193, 28587, 79961, 127928, 159338, 153073, 85597, 73353, 61520, 70389, 88772, 92100, 98232, 107968, 103326, 98957, 120643, 127949, 93342, 106149, 149099, 135421, 93131, 102706, 148548, 178375, 153929, 125489, 92372, 95883, 88945, 62172, 36904, 39734, 96600, 101300, 83329, 100020, 112561, 87965, 81467, 91387, 116037, 140433, 141362, 129496, 117792, 145197, 120946, 122593, 124855, 119564, 126915, 122478, 111293, 100717, 89181, 86359, 87208, 112291, 130017, 149714, 144758, 160763, 143641, 142488, 133623, 123251, 143146, 164691, 125327, 125139, 142845, 124163, 140271, 163688, 140415, 155110, 145172, 136279, 130187, 124727, 122261, 109739, 152553, 157396, 140469, 170225, 168789, 161886, 148487, 146504, 138562, 118870, 97102, 97747, 117133, 160242]
13241A60242n417k5696M5952k313J9170R178j0412M566K5047M564M013q559j3458
13228B06877K5848J6513k9746k7973j964J3532m568l2715P573K2020n2603p937
13216A34857O959M7968L5514K3556M045K248J1329K7530j3073m0024k0200J9607
13204B40316N5418J1831L0779N5365L9968q469j6728l1773m5564k1551m699Q106
13192C12999N747L498j1232k3031n3519k3996k7013M1679J5130O769R083q072
13180B48042N85K0545j4933k2930j393K619L5325L670o73J8036J6072R125L4932
13167C49022K341P415N844m3868K0983O976J7685k8966j4166l8247k9429j008
13155B54582O389L7028K6510l3049l0071J2443R672M6570L0785l759k7974J9164
$$ y = [160242, 154825, 129129, 175081, 172768, 191938, 201116, 190704, 195270, 220317, 224881, 228894, 220335, 206877, 232725, 249238, 219492, 191519, 189555, 203087, 198519, 165804, 173377, 195397, 142794, 134857, 141816, 189784, 225298, 248854, 252899, 255147, 266476, 294006, 280933, 240909, 220709, 240316, 295734, 307565, 338344, 393709, 433677, 425208, 408480, 376707, 331143, 309592, 304893, 312999, 318746, 322244, 311012, 287981, 234462, 210466, 183453, 225132, 240262, 247031, 256114, 248042, 248627, 269172, 254239, 231309, 229916, 232535, 267860, 271530, 270857, 288893, 304965, 314090, 349022, 351363, 358778, 364622, 320754, 341737, 348713, 366398, 337432, 323266, 285019, 255590, 254582, 260971, 297999, 324509, 291460, 261389, 273832, 283504, 330074, 360859, 357100, 329126, 348290]
13143C48290r630k1555K1415K1636K429j8903M445j5981K012K2039k1555O81M256
13130C39579J1631j0358K5918k261k5741q938r430k4077j0904R047L5686J8578
13118C48730J4413q514l6894k9759j5699j1549M2427L8889o600j024k004n553
13106C26863K4798Q28M10J0980K6197J2080K6578J0608j1939O647P442n648J5380
13093D51224K9799q279k7737j5014L1978K2701K1639N8581O9303M4827Q0806R3827
13081H53655J50018J94771K39946K70559K05773J67407P0306k4222j11469j70870
13071A845874j37960j02422r1596q7470p8945o3628o7735n406L0515K7155M2490
13060A310872M0195L6840O9794N5130K4664O3496J25957J39852J81918J36221
$$ y = [348290, 338660, 317105, 338520, 360156, 362585, 343682, 348127, 332146, 334158, 356197, 334642, 335323, 339579, 351210, 340852, 366770, 364509, 338768, 329830, 320400, 296323, 285419, 294466, 330152, 348730, 363143, 354629, 317735, 287976, 272277, 260728, 303155, 342044, 335444, 334420, 332416, 326863, 351661, 352489, 352899, 363879, 390076, 402156, 428734, 439342, 427403, 434050, 441492, 435844, 451224, 481023, 472744, 445007, 429993, 461971, 484672, 506311, 564892, 634195, 679022, 759828, 853655, 1003673, 1198444, 1438390, 1708949, 1914722, 2082129, 2152435, 2128213, 2016744, 1845874, 1707914, 1605492, 1513896, 1426426, 1347481, 1283853, 1216118, 1210712, 1241227, 1268382, 1310872, 1351067, 1387907, 1457701, 1512831, 1537495, 1600991, 1726948, 1866800, 2048718, 2184939]
13050B184939J05235J30912J83438J68242J58560J26982Q275r0172j50739j59506
13040B666166j20603p8573l4954l3623q6256j05667q5784j02459j00776m9271
13030A868200n6172n1989l2018k0911j6074m0002P88L1714M0216J4081P8701J09555
13018A926089J16758J49541K21369K59072K25946R4945j8431j94651k51650k18583
13008B310405j83896j79242j68955q1651o0501q2315o3177k6389m5640n1920r8418
12997A268301j10984q3280o5899L3223j5586l7155j7586l5685j4423r987j5343
12986H95596m5314l8424J100K2612L011k9644j9267K6546k2420l9153q001J0773
12974G57415q132n6291N649J2853j3024l6468k0863J0919m133L0310M0082J6728
$$ y = [2184939, 2290174, 2421086, 2604524, 2772766, 2931326, 3058308, 3066583, 2976411, 2825672, 2666166, 2545563, 2466990, 2432036, 2398413, 2312157, 2206490, 2120706, 2018247, 1917471, 1868200, 1812028, 1760039, 1728021, 1707110, 1691036, 1651034, 1651822, 1683536, 1723752, 1737833, 1816534, 1926089, 2042847, 2192388, 2413757, 2672829, 2898775, 2993720, 2975289, 2780638, 2528988, 2310405, 2126509, 1947267, 1778312, 1696661, 1636160, 1553845, 1490668, 1464279, 1418639, 1366719, 1268301, 1157317, 1074037, 1008138, 1041361, 1025775, 988620, 971034, 935349, 920926, 910939, 895596, 850282, 811858, 812958, 835570, 838581, 808937, 789670, 816216, 793796, 754643, 746642, 757415, 749283, 692992, 698641, 711494, 698470, 662002, 641139, 652058, 647925, 678235, 718317, 735045]
12962G35045J352J6134L2426N3713L0428Q029l5576o6499n7597l3581m2753l9115
12950F02006j1653r366p963k2281n0432o4654Q59l744k0946J28r282N332r621
12937C98383m5636J8076K8202J4715P0780L7122N530k3733k1816m974J8913k6006
12925D69556j7966K1654k9386K992P550j1521P872N2421J2325L7986L3459k6989
12913E59953n890K8746l7365l3608k5241K0192J4630j5512R713N5231N5546K5835
12901F52230M7388J5008L1706K2213N0196K9836k1456l7750J5065n997J7949J4433
12889H30821J1214l2080m6146j6962j635N6454O2477N882j5061K6651n456o522
12877H69637L2807L7603O2623J07660R1661N2351J8820K8969L141L5949l391k9911
$$ y = [735045, 736397, 752531, 784957, 838670, 869098, 877127, 841551, 775052, 717455, 683874, 641121, 602006, 590353, 580987, 573024, 550743, 500311, 435657, 436516, 432772, 411826, 411954, 402672, 408004, 398383, 352747, 370823, 399025, 413740, 484520, 521642, 527172, 503439, 481623, 476649, 495562, 469556, 451590, 473244, 443858, 446850, 454400, 442879, 450751, 503172, 515497, 553483, 586942, 559953, 554063, 582809, 545444, 511836, 486595, 506787, 521417, 505905, 515618, 570849, 626395, 652230, 699618, 714626, 746332, 768545, 818741, 848577, 827121, 789371, 804436, 798439, 816388, 830821, 842035, 809955, 763809, 746847, 745212, 801666, 864143, 870025, 854964, 881615, 876159, 869637, 902444, 940047, 1002670, 1110330, 1201991, 1254342, 1273162, 1302131, 1305272, 1341221, 1337830, 1307919]
12865A307919R955L4842J0287k8182k8905o5774n1632l9718j7937k5719n4851
12854A050285m6679J5616M4395J7383j402J353K081O5377N9532O0657L1140O1211
12842A360949L6173K7565q57K2451J109O490Q81P185k0576l9669k747K4856l606
12829A420204m5411j3830k6769m7960l8699n3527l8656m9031J2819j1859J7596
12818A124877J6248N2929K1375r682J0927L956k8734k7814O930L0365j7349n1826
12806A132202j3460L5693J4658K8695J2142M3933M7176J4269n452J7304k0693
12795A306467l5793o339m3797l1105n632J4679P94P465m4141J1987r633o6309
12783A098643o3967Q102j4361J3839j8535j2379j3395K1859K179R640K0209K9275
$$ y = [1307919, 1317874, 1352716, 1363003, 1334821, 1305916, 1240142, 1188510, 1148792, 1130855, 1105136, 1050285, 1003606, 1019222, 1063617, 1081000, 1079598, 1080951, 1083032, 1148409, 1207941, 1268598, 1299738, 1360949, 1397122, 1424687, 1423830, 1446281, 1447390, 1453880, 1454761, 1461946, 1441370, 1401701, 1398954, 1423810, 1420204, 1374793, 1360963, 1334194, 1286234, 1247535, 1194008, 1155352, 1106321, 1119140, 1107281, 1124877, 1141125, 1194054, 1215429, 1205747, 1216674, 1220630, 1191896, 1164082, 1171012, 1201377, 1184028, 1132202, 1118742, 1154435, 1169093, 1197788, 1209930, 1253863, 1301039, 1315308, 1309856, 1327160, 1306467, 1270674, 1264335, 1220538, 1189433, 1183801, 1198480, 1199274, 1206739, 1162598, 1174585, 1164952, 1098643, 1034676, 1042778, 1028417, 1042256, 1023721, 1011342, 997947, 1019806, 1021985, 1031625, 1051834, 1081109]
12771A081109Q0073O6762L2660M0092P8885R855J9944M3023M3122O3248O2393
12760A621166Q8966J20568Q7583P1964N3202M8318M8076N2324O932L4447O5522
12749B299068j5171m9599l9373k8134j3522p1806q3084k7934P094L6342P6266
12738B090147P3819O0983R0330O8382L1548p710N3887J34771J30812J13106J00451
12727B940526J11889M0856J2922J7964Q4349N2592L4212J7516O8648M1015K3581
12716C446070P2557J00582N7199L3351P7917N6584Q8945N9094P8287R0931Q4505
12705D246022J00127J39725J13152J32746J60274J07422J44156J87849J40605
12696E472078J20310J58013J98254J65529P9246Q7751J10397J14439J34856J70701
$$ y = [1081109, 1161182, 1227944, 1260604, 1300696, 1379581, 1389436, 1409380, 1452403, 1495525, 1558773, 1621166, 1710132, 1830700, 1918283, 1990247, 2043449, 2091767, 2139843, 2192167, 2199099, 2233546, 2299068, 2283897, 2234298, 2194925, 2166791, 2153269, 2081463, 1998379, 1970445, 1977539, 2013881, 2090147, 2163966, 2224949, 2315279, 2383661, 2415209, 2407499, 2461386, 2596157, 2726969, 2840075, 2940526, 3052415, 3093271, 3106193, 3124157, 3208506, 3261098, 3295310, 3312826, 3381474, 3422489, 3446070, 3518627, 3619209, 3676408, 3709759, 3787676, 3844260, 3933205, 3992299, 4070586, 4161517, 4246022, 4346149, 4485874, 4599026, 4731772, 4892046, 4999468, 5143624, 5331473, 5472078, 5592388, 5750401, 5948655, 6114184, 6193430, 6281181, 6391578, 6506017, 6640873, 6811574]
12686F811574J17784J26888R6257O4743J05390Q8460J06274Q9277R9640J62303
12676G868590J59095J53608J55715J45440K03476J83454J85667J90368J84326
12667I429739K23344K54850K45352K27742K48641K97640L68670L43044L30017
12658A1969039L68471L81097M26694M60853M65466M80425N23405O10256P04282
12649A6389988P47411Q10558R51790J097185J285248J490246J755697K081231
12641B6609354K439527K898943L525866M356241N591806P182536R181023J1670203
12633G3455499J4526143J7954142K2055048K6875363L2498075L8276851M2043273
12626B67684394L9462880K6700309N394705j6213218k9808657l3610629l0768136
$$ y = [6811574, 6929358, 7056246, 7152503, 7217246, 7322636, 7411096, 7517370, 7606647, 7706287, 7868590, 8027685, 8181293, 8337008, 8482448, 8685924, 8869378, 9055045, 9245413, 9429739, 9653083, 9907933, 10153285, 10381027, 10629668, 10927308, 11295978, 11639022, 11969039, 12337510, 12718607, 13145301, 13606154, 14071620, 14552045, 15075450, 15685706, 16389988, 17137399, 17947957, 18899747, 19996932, 21282180, 22772426, 24528123, 26609354, 29048881, 31947824, 35473690, 39829931, 45421737, 52604273, 61785296, 73455499, 87981642, 105935784, 127990832, 154866195, 187364270, 225641121, 267684394, 307147274, 333847583, 339242288, 323029070, 293220413, 259609784, 228841648]
12619B28841648k5051982j8875346j3337042q604404m652679j260129J706459
12612A58766525M340099O732177Q511336R188235Q810569Q460999R783898J3521553
12604B28115391J9102298K4999771K9588466L1828285L1694855L0713292L0689183
12597D26731541L1752953L0861636K2785194M969890j6157545k9917903l2429334
12590D38596432k7551216k0287563j3761098r189414o921655o849160q918083
12583C45118243j2223776j4986493j5315660j2687369q439046m645281k650090
12576B74170528k679603l465918l100416o98816K881275P030119J1935975J7769955
12568C03843099K4616782L2447533M0521599M6426531M5944241L4894429J1882058
$$ y = [228841648, 203789666, 184914320, 171577278, 162972874, 158320195, 157060066, 158766525, 163106624, 169838801, 178350137, 187538372, 196348941, 204809940, 214593838, 228115391, 247217689, 272217460, 301805926, 333634211, 365329066, 396042358, 426731541, 458484494, 489346130, 512131324, 517101214, 500943669, 471025766, 438596432, 411045216, 390757653, 376996555, 367807141, 360885486, 354036326, 345118243, 332894467, 317907974, 302592314, 289904945, 281465899, 276820618, 274170528, 271490925, 268025007, 264924591, 264225775, 267107050, 274137169, 286073144, 303843099, 328459881, 360907414, 401429013, 447855544, 493799785, 528694214, 540576272]
12561E40576272j7698739m2158450n2408049n0471368m3405743l5631913k8630133
12554B70171877k2953170j8598384j5365330j3051582j1374695j0049659q860485
12547A69918572p933034p247104o712533o330364n995912n611351n161941m691872
12539A20234461m308527l907114l579996l236220k863422k593160k401600k129115
12531I5215307j981672k002218k162812k401399k612366k725876k777164k886207
12523G5665593l011753l122460l192635l172088l104468l024850k919459k809520
12515E1308360k653743k498648k339321k189251k112140k008601j890880j808684
12507C3807092j724219j630658j529184j443213j344547j252367j183880j111956
$$ y = [540576272, 522877533, 480719083, 428311034, 377839666, 334433923, 298802010, 270171877, 247218707, 228620323, 213254993, 200203411, 188828716, 178779057, 169918572, 161985538, 154738434, 148025901, 141695537, 135699625, 130088274, 124926333, 120234461, 115925934, 112018820, 108438824, 105202604, 102339182, 99746022, 97344422, 95215307, 93233635, 91231417, 89068605, 86667206, 84054840, 81328964, 78551800, 75665593, 72653840, 69531380, 66338745, 63166657, 60062189, 57037339, 54117880, 51308360, 48654617, 46155969, 43816648, 41627397, 39515257, 37506656, 35615776, 33807092, 32082873, 30452215, 28923031, 27479818, 26135271, 24882904, 23699024, 22587068]
12499B2587068j070922j001516r51440r34109r05063q66787q41145p74156o96701
12490A4545229p17098o52424n81991n39253n32621n00428m76405m52531m30768
12481I661710l86744l73722l93361l56686l60055l36552l20066l11746k39448
12472F583330k78452l07822k50555k40675k40806k12979j89799j95102j72019
12463D495121j69083j25784j07834j29816p4353q9944j16275j07780r6041q7138
12453C391073n4577m5522L0652o945k2038J09606J24703J08018J03471J72848
12443C911289K19032K34212K50724J70476R0239n2314j44564k03177k19596k09591
12433D046730k04794j76896j47853j03356n2924k6908K981k840k3239R301l7681
$$ y = [22587068, 21516146, 20514630, 19563190, 18629081, 17724018, 16857231, 16016086, 15241930, 14545229, 13828131, 13175707, 12593716, 12054463, 11521842, 11021414, 10545009, 10092478, 9661710, 9274966, 8901244, 8507883, 8151197, 7791142, 7454590, 7134524, 6822778, 6583330, 6304878, 5997056, 5746501, 5505826, 5265020, 5052041, 4862242, 4667140, 4495121, 4326038, 4200254, 4092420, 3962604, 3888251, 3798307, 3682032, 3574252, 3478211, 3391073, 3336496, 3290974, 3321626, 3314681, 3292643, 3402249, 3526952, 3634970, 3738441, 3911289, 4130321, 4364533, 4615257, 4785733, 4875972, 4823658, 4679094, 4475917, 4256321, 4046730, 3841936, 3665040, 3517187, 3413831, 3360907, 3333999, 3336980, 3334140, 3310901, 3320202, 3282521]
12422C282521J4087J4708K8003J6567k7227M5630O1384N1308J00252M2965K0004
12411C650202N5562K2007J6565K2873J6579J4343K9725O1203R4534M3238N8939
12400D085770K8441M7523J4617l46J4199J2413k1988r721n80k6227k8463p6209
12388D039429n4139m8468j3044R521K0160m4432l0358J2200J9119n42k3260p8630
12376C807556l6958j7242l0536k7718k6553l4391k9541o264j7935j2085r907k5835
12364C532591k9356m6579j202k1051l9364n0554p3199p3112q3083m8687k2176
12353C044228m0798m6640l2321j9696n8968l5801n2923k5386m5360J8066l509
12342B700892j3203q4722m5147n1497j10465l0054p3809n1282j6852J5520k1668
$$ y = [3282521, 3296608, 3311316, 3339319, 3355886, 3328659, 3374289, 3435673, 3486981, 3587233, 3630198, 3650202, 3705764, 3727771, 3744336, 3767209, 3783788, 3798131, 3827856, 3889059, 3983593, 4026831, 4085770, 4114211, 4161734, 4176351, 4176005, 4190204, 4202617, 4180629, 4170908, 4170328, 4144101, 4115638, 4039429, 3985290, 3936822, 3923778, 3933299, 3953459, 3909027, 3878669, 3890869, 3909988, 3909446, 3886186, 3807556, 3770598, 3753356, 3722820, 3695102, 3668549, 3634158, 3604617, 3598353, 3580418, 3568333, 3558426, 3532591, 3503235, 3456656, 3455454, 3434403, 3395039, 3344485, 3271286, 3198174, 3115091, 3066404, 3044228, 3003430, 2956790, 2924469, 2904773, 2845805, 2810004, 2757081, 2731695, 2686335, 2704401, 2700892, 2687689, 2602967, 2557820, 2506323, 2395858, 2365804, 2291995, 2240713, 2223861, 2239381, 2217713]
12331B217713K1436j468L700l1233m5699r395k6744q1870o1504l3873K5762L3919
12319B010744l4646n4844m0959m5816m1334L1353M7034R836n6286k1073J0822
12308A814831j1820k8736k6109m5581j8337K7769K4123N5758M6277l312O3938
12297A898801N3045L0375P0898P1309L2316L2048Q5172J17087J07883P6859Q5733
12286B661526J17752J29994J52597J54163K05368K00337K54006K17089J27995
12277D220827P2598k4407r6291j10648j70695j89378j27907j11443m611k1519
12267C436526n2744k8273k3600K0917K3852M0347O0300K6086O6247P9222J15641
12256C764521J03970O4866J13297Q3102P8445Q5265J06468N0213M3794N8300M7144
$$ y = [2217713, 2239149, 2237681, 2241381, 2210148, 2164449, 2155054, 2128310, 2046440, 1984936, 1951063, 1976825, 2010744, 1976098, 1921254, 1880295, 1834479, 1793145, 1824498, 1871532, 1881368, 1825082, 1804009, 1814831, 1803011, 1774275, 1748166, 1702585, 1684248, 1712017, 1736140, 1791898, 1838175, 1834863, 1898801, 1951846, 1982221, 2053119, 2124428, 2156744, 2188792, 2273964, 2391051, 2498934, 2575793, 2661526, 2779278, 2909272, 3061869, 3216032, 3421400, 3621737, 3875743, 4092832, 4220827, 4293425, 4269018, 4172727, 4062079, 3891384, 3702006, 3574099, 3462656, 3458045, 3436526, 3383782, 3355509, 3331909, 3352826, 3376678, 3417025, 3477325, 3503411, 3569658, 3648880, 3764521, 3868491, 3933357, 4046654, 4129756, 4208201, 4293466, 4399934, 4450147, 4493941, 4552241, 4599385]
12245D599385O8545N3374M9589R6872N2459N5321N8264M8741Q0900Q6944Q4378
12234E334772Q7907P5949Q9928J13151J06706J12191J29909J23621J06776J62782
12224F443692J72407J07226P8196J50691J81702J43385Q5065J12063J55849J72464
12214G802740J65849J45696R0209P5404O0641Q4879J11157J20195J17892R0854
12204H865516J64629K09957J99407J50002J70905J36333J82295K13552K27508
12195A0520104K46737K64912K60335K26632L25119L97836L92207L88402L68675
12186A3390959M21011M48440M79916N39155O27235O80847P19839P67116Q70157
12177A8944675R54954J128424J329308J499943J790900K144863K621623L232343
$$ y = [4599385, 4667930, 4721304, 4770893, 4867765, 4920224, 4975545, 5033809, 5082550, 5163450, 5250394, 5334772, 5422679, 5498628, 5588556, 5701707, 5808413, 5920604, 6050513, 6174134, 6280910, 6443692, 6616099, 6723325, 6801521, 6952212, 7133914, 7277299, 7362364, 7474427, 7630276, 7802740, 7968589, 8114285, 8204494, 8279898, 8340539, 8425418, 8536575, 8656770, 8774662, 8865516, 9030145, 9240102, 9439509, 9589511, 9760416, 9896749, 10079044, 10292596, 10520104, 10766841, 11031753, 11292088, 11518720, 11843839, 12241675, 12633882, 13022284, 13390959, 13811970, 14260410, 14740326, 15279481, 15906716, 16587563, 17307402, 18074518, 18944675, 19899629, 21028053, 22357361, 23857304, 25648204, 27793067, 30414690, 33647033]
12169C3647033M051962N071131O377241Q058739J0150164J2565045J5648734J9412559
12161A14982608K3983040K9579944L6322601M3869244N0561119N2894263M6058483
12154C98251302K7899046K307417k2124422l7613743m2144362l8443854l0778230
12147B57353154k2494719j5029010q679058l510814O21776L433195M454525L851284
12139B20000333K963092L455224O006044J0101616J4730512J8637355K0195187
12132B96089363J8576225J4673044J0151606P490167Q843419J4652195K2927785
12125C93403804L0567519L4833589L3216733K4523806J0407073m362746j5168387
12118E07421391k1059821k4120089k6291634k7978875k8504204k7147680k3815177
$$ y = [33647033, 37698995, 42770126, 49147367, 57206106, 67356270, 79921315, 95570049, 114982608, 138965648, 168545592, 204868193, 248737437, 299298556, 352192819, 398251302, 426150348, 428457765, 406333343, 368719600, 326575238, 288131384, 257353154, 234858435, 219829425, 211150367, 207639553, 208261329, 211694524, 216149049, 220000333, 222963425, 226418649, 232424693, 242526309, 257256821, 275894176, 296089363, 314665588, 329338632, 339490238, 346980405, 355823824, 370476019, 393403804, 423971323, 458804912, 492021645, 516545451, 526952524, 522589778, 507421391, 486361570, 462241481, 435949847, 407970972, 379466768, 352319088, 328503911]
12111C28503911j9306937j4729843j0787560q181586p260886p810934q575915
12104B51850250q206068o119540k745993J195003N177712R222123J3614594J8442766
12096B82430847K3572333K8530185L2090745L1748502K3986867P395002j3407346
12089D16347135l0068744l7512714l6889399l2231451k6713769k1743651j7727489
12082B13459918j4725768j2621609j1110004j0032648r093302q280877p543803
12075A40051907o833698o189251n721284n286047m897880m558944m156831l861025
12067I8546947l563009l233919k959434k710317k452723k243139k071008j909504
12059G7403894j904898j989069k123327k271018k361470k343718k401398k499437
$$ y = [328503911, 309196974, 294467131, 283679571, 275497985, 268237099, 260426165, 251850250, 243644182, 237524642, 234778649, 235973652, 241151364, 250373487, 263988081, 282430847, 306003180, 334533365, 366624110, 398372612, 422359479, 429754481, 416347135, 386278391, 348765677, 311876278, 279644827, 252931058, 231187407, 213459918, 198734150, 186112541, 175002537, 164969889, 155876587, 147595710, 140051907, 133218209, 127028958, 121307674, 116021627, 111123747, 106564803, 102407972, 98546947, 94983938, 91750019, 88790585, 86080268, 83627545, 81384406, 79313398, 77403894, 75498996, 73509927, 71386600, 69115582, 66754112, 64410394, 62008996, 59509559]
12051E9509559k535951k561108k521823k506862k501289k405142k246757k098893
12043D0131734j982397j938495j850644j717423j636932j583367j491182j367046
12035B6564248j317406j243120j190713j087059j028947r59345r02796r05298
12027A7929564q52802p94121p82486p59873p34565p29409o99899n89314n25467
12018A1461628m94982m71165m75330m36365m17803l93623l94050l75514l22089
12009G680707l06143k68084k89516k55093k19734k53613k80354k76478k25822
12000E305870k21492k00479j62833j61274j91812j49441j34778j26123j36577
11991C821061j47969j21149j26073q0484j04559j37183j08124o0361o0576p7136
$$ y = [59509559, 56973608, 54412500, 51890677, 49383815, 46882526, 44477384, 42230627, 40131734, 38149337, 36210842, 34360198, 32642775, 31005843, 29422476, 27931294, 26564248, 25246842, 24003722, 22813009, 21725950, 20697003, 19737658, 18834862, 17929564, 17076762, 16282641, 15500155, 14740282, 14005717, 13276308, 12576409, 11987095, 11461628, 10966646, 10495481, 10020151, 9583786, 9165983, 8772360, 8378310, 8002796, 7680707, 7374564, 7106480, 6816964, 6561871, 6342137, 6088524, 5808170, 5531692, 5305870, 5084378, 4883899, 4721066, 4559792, 4367980, 4218539, 4083761, 3957638, 3821061, 3673092, 3551943, 3425870, 3345386, 3240827, 3103644, 2995520, 2935159, 2874583, 2797447]
11981B797447n2062M834K1132M9605M3219J1470O6879L0914K1815j6850r461J9685
11969B988627Q4215Q0200L5251m955m2676r3276r6200r2091j01141r7880m6395
11958B613679O402r010j2010M1222J4747N7110K8175n599j845K4821L6085J6928
11946B810705K5161Q5318N9895J5297K9180L6200M9085j0243N817L3000n293k5582
11934C108540j9690k06J4881J0063k3903m1233l6562l4031k7346J5884j1252k7639
11922B927506J1867l094m5670n856R815J9452J572l2280j8590K2256M1211l445
11910B924744J6909K1910n4919n1688m3065k2092r5996p1477k4323n4458l9062
11899B506483k9075j4290l3240l5338l0522m0166j7359k8176j5191p830o360K3147
$$ y = [2797447, 2745385, 2750219, 2771351, 2820956, 2864175, 2875645, 2942524, 2973438, 2995253, 2978403, 2968942, 2988627, 3072842, 3153042, 3188293, 3183338, 3140662, 3047386, 2951186, 2859095, 2757954, 2660074, 2613679, 2620081, 2611071, 2599061, 2640283, 2655030, 2712140, 2740315, 2734716, 2732871, 2757692, 2793777, 2810705, 2835866, 2921184, 2981079, 2996376, 3025556, 3061756, 3110841, 3100598, 3106415, 3139415, 3134122, 3108540, 3088850, 3088644, 3103525, 3113588, 3089685, 3048452, 3011890, 2977859, 2950513, 2966397, 2955145, 2927506, 2939373, 2936279, 2890609, 2884753, 2894568, 2914020, 2915592, 2883312, 2864722, 2886978, 2928189, 2924744, 2941653, 2963563, 2908644, 2856956, 2813891, 2791799, 2695803, 2624326, 2600003, 2545545, 2506483, 2477408, 2463118, 2429878, 2394540, 2364018, 2323852, 2306493, 2278317, 2263126, 2255296, 2248936, 2272083]
11887B272083n5791n8652q1518l6503l1672o4471m2025J0229k7693o7601n4446
11876A761940o0546l6231k4238j3160m0523N850Q855j2039j6642l7254k5636l2801
11864A477575m0717m0921o3042k2473l0707m9208m545l2995r024Q515m865l2498
11852A155095p6668k5448k458j9149j7846k2824j6050J1931J8494k183m930n7225
11840I40739m7496K2554J3175k0660L783R815K3214m6163n7428k4352j648J0398
11828H25931J8866O928K1570j8229j6562l0067l6704j1927m377k8768l7491k7100
11816F62070J9841k388J3822L0544L8276N6253R760N157K4789j6725k2397N190
11804H24192K9754L9558J6020m6153l1772k431J5558m0947Q092M0991l6765m1655
$$ y = [2272083, 2216292, 2157640, 2076122, 2039619, 2007947, 1943476, 1901451, 1911680, 1883987, 1816386, 1761940, 1701394, 1665163, 1640925, 1627765, 1587242, 1593092, 1601947, 1589908, 1573266, 1536012, 1510376, 1477575, 1436858, 1395937, 1332895, 1310422, 1279715, 1230507, 1225962, 1192967, 1183943, 1192458, 1187593, 1155095, 1078427, 1052979, 1050521, 1031372, 1013526, 990702, 974652, 986583, 1005077, 1002894, 997964, 940739, 893243, 915797, 928972, 908312, 912095, 921910, 945124, 898961, 841533, 817181, 815533, 825931, 844797, 851725, 873295, 855066, 838504, 808437, 771733, 759806, 755429, 726661, 689170, 662070, 681911, 679523, 693345, 723889, 762165, 818418, 828178, 833335, 858124, 841399, 819002, 824192, 853946, 893504, 909524, 863371, 831599, 829168, 844726, 803779, 811871, 852862, 816097, 774442]
11792G74442j0436L5780L5784m1963l4015l1918M4165N8141R261o86L0312L8877
11780I07744l5719j0733J6377k5817j7093p836K847K9250j9660K3350P79l0754
11768H32735N830M134k3429n4024j8539J3968K6248p759P207j5113l3462l3586
11756G04210r449J0908L4367P061j9140p0424k6776q07L8674M4947k6001p359
11744F80211R751m6373l116J7557K0705n4032m7756k9345n180K9521K7252R980
11732F09175Q946K8744l473N1830R0427R9813Q9128O8404N6824P4649J33558K00208
11720A508233J92560J97231K03665J82846R0505k2372p8990j54918j92215j80813
11710A745732j20129j04605q8964n6201m5484J1883M5187J6669K420P128j7021
$$ y = [774442, 764006, 799786, 835570, 793607, 759592, 727674, 771839, 829980, 839241, 838555, 868867, 907744, 872025, 861292, 877669, 851852, 834759, 826923, 829770, 859020, 839360, 862710, 863489, 832735, 838565, 842699, 819270, 765246, 746707, 760675, 786923, 779164, 786371, 771258, 737796, 704210, 694761, 705669, 740036, 747097, 727957, 657533, 630757, 629950, 668624, 713571, 687570, 680211, 689962, 643589, 640473, 658030, 678735, 624703, 576947, 547602, 542422, 571943, 599195, 609175, 618121, 646865, 643392, 695222, 785649, 885462, 974590, 1042994, 1099818, 1174467, 1308025, 1508233, 1700793, 1898024, 2101689, 2284535, 2375040, 2352668, 2273678, 2118760, 1926545, 1745732, 1625603, 1520998, 1432034, 1375833, 1330349, 1342232, 1387419, 1404088, 1406508, 1413636, 1396615]
11699A396615N3399P4487N7983Q0048J37581J10357R3923J14177Q9394P5990J02951
11688B386905J55431J88051J26254P7023M3301L0233j9728r9597j54615j38522
11678B594736j02331j18574q7486j25982r5715j19365j04565k7529n9172n6113
11668A697904l6392m3007j599j2147L845r759M1240J07093R9982R8576J35656
11657B081392J41749J66646J97205J15720j137j24019k14193k13512j74338j43129
11647A832384j24850r5674j05336j08071j00097o8104n3912l9199n4021p0882
11637A012238m5563k719k2810l9010k4834o0419k4847j3986k6181j5321m2729
11626F93819q912m711l6465K1153k61j3476o355k4249k1198k7744m4532K5266
$$ y = [1396615, 1450014, 1524501, 1582484, 1662532, 1800113, 1910470, 2004393, 2118570, 2207964, 2283954, 2386905, 2542336, 2730387, 2856641, 2933664, 2976965, 3007198, 2987470, 2887873, 2733258, 2594736, 2492405, 2373831, 2286345, 2160363, 2064648, 1945283, 1840718, 1813189, 1754017, 1697904, 1661512, 1618505, 1616906, 1604759, 1608604, 1598845, 1640085, 1747178, 1847160, 1945736, 2081392, 2223141, 2389787, 2586992, 2702712, 2701575, 2577556, 2363363, 2149851, 1975513, 1832384, 1707534, 1611860, 1506524, 1398453, 1298356, 1230252, 1176340, 1137141, 1083120, 1012238, 966675, 963956, 941146, 902136, 877302, 816883, 792036, 778050, 751869, 736548, 693819, 684907, 680196, 643731, 664884, 664623, 651147, 644792, 620543, 599345, 571601, 527069, 552335]
11614E52335N885l3872k3117j0833l6636k9427k547k3076j7572k2961J161r873
11602C49467k3680o065j5505k3769J4036K2292M1228l0038Q205j4746j4104n677
11590C01644j4782l2017p689m498l8876j3986K78L302J5381k7069j5915n4541
11578A11232j307J1689m554o156L408K0618l9233j7653N0186K5381L3838J8772
11566B06221l1421l6815m6482k4915P694L0772O4747R6l1993k8131J3971q873
11554A14871k6450j5912J2044Q254r013J9376l8882j9892M208J8388j2185k5173
11542B9634N1726L9383m1346Q21K473K9966M5329o001k8246q216J5156j1373n0217
11529F9089j8698M205J5520m1167j9659M6275L9185M379J6073k3745Q833p599
$$ y = [552335, 558220, 524348, 501231, 490398, 453762, 424335, 421788, 398712, 381140, 358179, 359340, 349467, 325787, 319722, 304217, 280448, 294484, 316776, 358004, 327966, 336171, 321425, 307321, 301644, 286862, 254845, 247156, 242658, 203782, 189796, 190074, 193376, 208757, 181688, 165773, 111232, 109925, 121614, 117060, 110904, 114312, 134930, 95697, 78044, 128230, 153611, 187449, 206221, 174800, 137985, 91503, 66588, 74282, 105054, 169801, 169897, 137904, 109773, 123744, 114871, 88421, 72509, 84553, 92807, 83794, 103170, 64288, 44396, 48604, 66992, 54807, 29634, 81360, 120743, 79397, 80218, 82691, 112657, 157986, 151985, 123739, 115523, 130679, 119306, 69089, 50391, 54596, 70116, 28949, 9290, 55565, 94750, 99129, 115202, 91457, 100290, 92691]
11517I2691J3402N647n109P349k158j0238k4136J1594L8932j6228j3808K4263
11505A22201k643l3762j3551k3697J4637L4603J9037k0988l072k4419j7186L3030
11493H4190L4995n67j1327j0809j9850k725O058K8120N2289k3933k2310j7903
11481I6228K515Q134l9842J6443L6248L396L5138j1523l7388m6347J0509N8786
11469A32297j6109j8905P503j5899l8498k3719M9162K5397m291k4449j5178j9745
11457C7566k583K954J4843j2439K0201Q2891M0828j0193j9751j5135j5599k4992
11445I8591K9775K3266L1115n6248m3046k6762k2782j2952L3204M1789J830m783
11433I2997m3646k9281n222M5114p881l0647p996J5058L044j0811K6970l0963
$$ y = [92691, 106093, 111740, 106631, 113980, 111822, 101584, 77448, 89042, 127974, 111746, 97938, 122201, 119558, 85796, 72245, 48548, 63185, 97788, 116825, 95837, 92765, 68346, 51160, 84190, 119185, 118618, 107291, 96482, 76632, 73907, 79965, 108085, 160374, 136441, 114131, 96228, 98743, 106877, 67035, 83478, 119726, 123122, 158260, 146737, 109349, 63002, 73511, 132297, 116188, 97283, 104786, 88887, 50389, 26670, 75832, 101229, 96938, 72489, 57311, 37566, 34983, 37937, 52780, 40341, 60542, 143433, 184261, 174068, 154317, 139182, 123583, 98591, 128366, 151632, 182747, 126499, 83453, 56691, 33909, 20957, 54161, 95950, 97780, 92997, 49351, 20070, 14848, 59962, 52081, 21434, 13438, 28496, 31540, 20729, 47699, 16736]
11421A6736k2325K2220M1963K0278J4518J271l0230l8555j6285k2831R098J8721
11409A4579J325N654L8898J9837l4979m593O653L3208k1742k3502L8267n7393
11397A6212J0165M7714J0775J2927j5143J5064j0751j8601J2097M1014l2079l9739
11385D9655j072p457l870L5505Q829j0401m1181j1617J0681p490j1021j1186M0352
11372C9727J3003j202J2457K4947j0117l2728Pn614j191P803k4205o841l1525
11359a5479O077K4388k848k463L2036P243J4176L800k1694k7274K0505K4441l641
11346E9267j2183L415j5571O789L3733N089j0295k2669k0370r236J2915k108k0779
11333G997k2172K5126R237j269M500L1965J1443N484J0592k5164j9462j9695r394
$$ y = [16736, -5589, 16631, 58594, 78872, 93390, 94661, 64431, 25876, 9591, -13240, -4142, 14579, 15904, 21558, 60456, 80293, 45314, 40721, 47374, 80582, 58840, 35338, 73605, 16212, 26377, 74091, 84866, 97793, 82650, 97714, 86963, 68362, 80459, 121473, 89394, 49655, 48583, 41126, 37256, 72761, 81590, 71189, 30008, 18391, 29072, 21582, 10561, -625, 39727, 52730, 51528, 63985, 88932, 78815, 46087, 46094, 40480, 39289, 47092, 22887, 16046, -15479, -9402, 14986, 12138, 9675, 41711, 48954, 63130, 66930, 45236, 17962, 38467, 62908, 59267, 47084, 50499, 34928, 41717, 75450, 80539, 70244, 47575, 27205, 17969, 30884, 28776, 7997, -14175, 10951, 20188, 18919, 23419, 55384, 66827, 72311, 82903, 57739, 38277, 18582, 9188]
11320I188L334L103o545J7445j073k584K793K2994r294n5002J6682L103K221J0159
11306A6524J9953l880J8240j0861r252n085M982q480j2615J8418k4265l091j8389
11293a7801l3069r413K6485R01p795M2845j476J3761j563j6481Q255j0354J0439
11280D734l150k624j2331R210J2748k8232Q979L7361j70m0532N853k9505Q284
11267b9375O7273M126k0019k1793K5824K5144l7316l2629M0115M7886k2466m1478
11255E292j2371L1858m88j5040Q142o042K6002m440n571o680o3424k3494L1454
11242c4802K6879o937j8331K7462K2368K8470j5312r432M08n615p25J9133j1249
11229B2317O459p43j9720k2411K0740J8506J4224K3385q424j4868j0963n134k7076
$$ y = [9188, 12522, 15625, 9080, 26525, 25452, 22868, 25661, 48655, 39361, -15641, 1041, 4144, 6365, 16524, 36477, 32597, 50837, 39976, 30724, 25639, 30621, 22141, 9526, 27944, 3679, 588, -17801, -50870, -60283, -33798, -32897, -40692, 2153, 677, 14438, 12875, -3606, 4649, -5705, 4734, 1584, -1040, -13371, -4161, 8587, -19645, -10666, 26695, 26525, -14007, -8154, -37659, -29375, 37898, 42024, 22005, 212, 26036, 51180, 13864, -18765, 21350, 69236, 46770, 5292, -7079, 24779, 24291, 9251, 17393, 11351, 37353, 32913, 27342, 20662, -42762, -66256, -34802, -7923, -14860, -33191, -5729, 16639, 45109, 29797, 20365, 20773, 15158, 14433, 33566, 22317, 28776, 28033, 8313, -14098, 6642, 25148, 39372, 62757, 54333, 39465, 28502, 23368, -3708]
11216c708m829J447r321R098k7964j0134M3990k4658m7443j0603p864N1520L1593
11203h876j6354k3473J1081J9921k3801k5297K4807j0387M4633J3792l765k4399
11191b2118K6626r198j9794n596k0486J0372l0318k7088P179R279J8461j574J9097
11178d5158j1407j4233n036J2660J477q881L0118J1852M2316l367N671k7804O186
11165e606J3824n305l3256j0075J4645j3714n5254l5243K1179K8982P013L021
11153f9789M9602r828m6860n583K7364j803j6982K957J0822J3450N302j7103M336
11140e4115L9341j2733k3499J1692N706K6155N89l9679o370M6993p426j0666k2208
11127d6220K6160j5728K0969L6871J348J2973k657J2355l3612k5676K7746j0490
$$ y = [-3708, -8537, -7090, -16411, -7313, -35277, -45411, -1421, -26079, -73522, -84125, -91989, -40469, -8876, -25230, -48703, -37622, -17701, -41502, -66799, -41992, -52379, -7746, 6046, 2281, -22118, 4508, -4690, -24484, -30080, -50566, -40194, -70512, -97600, -90421, -81142, -62681, -64255, -45158, -56565, -70798, -75834, -63174, -61697, -70578, -40460, -28608, 13708, 10341, 16012, -11792, -5606, 8218, 2913, -30343, -40418, -25773, -39487, -94741, -129984, -108805, -79823, -72810, -69789, -20187, -30015, -76875, -82458, -55094, -56897, -73879, -70922, -60100, -46650, -41348, -58451, -54115, -14774, -27507, -51006, -39314, -33608, -7453, -6864, -46543, -52913, -5920, -13346, -24012, -46220, -20060, -35788, -14819, 22052, 23400, 36373, 33716, 46071, 12459, -13217, 14529, 4039]
11115D039j9253r87L4630K259k7621P386J475r6P565l759j3105j3987j5156j8574
11101e5184K1016P1947K2871k1326k2872K7324J6285K2883k7256m6831m3578J4461
11089b0260L1325Q077j8738k4267J3617J8229J798j0690N587K5335j6490j7895
11077d372k3671j0921J771l0699m4145P695M7556J7980n750q106n3204L2133L7704
11064c6029L3678l4592k7929o65L4013L5101M413l9510j5341K5691j4057q402
11052d3629M743n394j1818O778M8979R277j1326n75r62l8954N995Q718J7382k946
11038a3732j9648q649J0747K5315p02l4108j8974J0768J4769o859J7390J3130
11026a0553M325j3744k2707J2544j5187k7887j0455J4779J7000N136R206K712
$$ y = [4039, -15214, -16201, 18429, 20688, -6933, 453, 1928, 1832, 9397, 5638, -7467, -21454, -36610, -55184, -34168, 37779, 60650, 39324, 16452, 43776, 60061, 82944, 55688, 8857, -34721, -20260, 11065, 19142, 404, -23863, -10246, 7983, 9781, -909, 4678, 30013, 13523, -4372, -28043, -38964, -37193, -67892, -112037, -104342, -56786, -38806, -44556, -52662, -105866, -73733, -36029, -2351, -36943, -64872, -65537, -31524, 3577, 7990, -31520, -46861, -21170, -35227, -43629, -38886, -44280, -56098, -49320, -341, 8936, -2390, -2965, -3927, -42881, -36886, -28168, -10786, -13732, -33380, -42029, -31282, -5967, -6669, -40777, -59751, -48983, -34214, -41073, -23683, -10553, -6228, -19972, -42679, -30135, -45322, -73209, -83664, -68885, -51885, -46749, -37543, -34831]
11014c4831n790k0721K2855K7215L0651k5919J1669k7263o957J0894j6156p808
11002d2161j3349R871L3752J7511J0943j1213M468J0279k9143j4863j2634j2168
10990d8707m0686P059K8071L3857M086k3346l5683K2614L2576J787j5489N714
10978b8147J5534J2527m044J9043p049n373j3058k2879j3129J3518k643J5233
10966b0467J6678k4873j055m488N127j2033k6200n76k1500J2845O2716K2282k8383
10953a9927k5737K3423K8623j8339j2625l208r278l1192m121J4920L0003L5102
10941G644k512N945J634l7942k1009K3332J4902L767m6964o721j4392r180K1162
10928f0334Q375L8143J0048J5915o040j4415o21r909k4330K352l742j6066J341
$$ y = [-34831, -40621, -61342, -38487, -11272, 19379, -6540, 5129, -22134, -29091, -18197, -34353, -42161, -55510, -45639, -11887, 5624, 16567, 5354, 9822, 20101, -9042, -23905, -36539, -48707, -89393, -82334, -54263, -20406, -16320, -39666, -75349, -52735, -20159, -18372, -33861, -28147, -12613, -86, -4130, 14913, 7864, 2491, -10567, -33446, -46575, -33057, -35700, -20467, -3789, -28662, -29717, -34205, -29078, -41111, -67311, -67887, -89387, -76542, -13826, 8456, -19927, -45664, -22241, 6382, -11957, -24582, -27790, -37068, -68260, -72381, -57461, -27458, 7644, 5132, 11077, 12711, -25231, -46240, -22908, -8006, -4239, -51203, -57924, -72316, -81496, -60334, -51959, -13816, -3768, 12147, 6107, -8308, -8929, -18838, -43168, -40816, -44558, -60624, -59283]
10915e9283M1705j6956j2406K1162K6663K574r43k4186J6540q856j6210N4608
10903B4412L8439m654l4104k9852J4971k6525n518p921l026k08L0110j9115r634
10890c2625Q586J3601Q091L304K2076J6370j6455j8604o029k4209J1644N2697
10878C8447J8509j5354k5901k1531R835k5655n4506m069N0592j302m4452J4062
10866f1325n76J5749r752q550j0701j5639L0013K6397L1675K0858K2914J7681
10854E8744J9276k5768p0183m1375M2098L0325o004n2511K7146M249k4808k9268
10842f8079m291r878J9689L0701P74n2k7867K4740R719m5124k1394N5361L6089
10829C88j1482m31L2898O442o660k2127j3085k3873L0338O2288j7908k7999k7814
$$ y = [-59283, -17578, -34534, -46940, -25778, 885, 3459, 2516, -21670, -5130, -13986, -30196, 24412, 62851, 58197, 24093, -5759, 9212, -17313, -22831, -30752, -33778, -33986, -3876, -22991, -32625, -24039, -10438, -2347, 957, 23033, 39403, 22948, 4344, -1685, -25894, -14250, 38447, 56956, 41602, 15701, -5830, 4005, -21650, -76156, -80225, -29633, -30935, -75387, -61325, -61901, -46152, -55904, -64454, -75155, -90794, -60781, -34384, -2709, 18149, 41063, 58744, 78020, 52252, -17931, -59306, -17208, 13117, 7113, -45398, -18252, -14003, -38811, -68079, -72370, -82248, -62559, -31858, -31084, -31136, -59003, -34263, -24544, -69668, -91062, -35701, 388, -11094, -11525, 21373, 27815, 21155, -972, -14057, -37930, -7592, 54696, 36788, 8789, -19025]
10816a9025j8199J7210J3857M814J6802m2326l9218O367j070J0995p631j6294
10804g3718K6788J173P047L4149O642J6050o7456l1152P1006r855j1558j3449
10792d4333Q947O246J7540J5855j1229p582K4472K0820k4924r477k3347j2861
10780c9873M020p528K9527N3105L857n6526l5979j6422J4581K1548k005M710K7870
10767H85k8067m0546K7581n036L38N3764O1950j8491j9301K1051j2474J6873j3335
10754D5192n508r045k9934j4307L646j5080J1413N8970J1124j1093j6760j3226
10742A5392J6594k249j4970K7144J4735j9080k2816J9433J1091m349k1008j15
10730A9802O775K9196j963L4216N5330k1542l8790J846K9215k040j804m3681j1234
$$ y = [-19025, -37224, -20014, -6157, -1343, 15459, -26867, -66085, -59718, -60788, -49793, -57424, -73718, -46930, -45757, -38710, -4561, 2081, 18131, -49325, -80477, -9471, -19326, -30884, -44333, -35386, -29140, -11600, 4255, -6974, -14556, 9916, 30736, 5812, -3665, -27012, -39873, -35853, -43381, -13854, 39251, 43108, -13418, -49397, -65819, -51238, -29690, -31695, -26985, 885, -27182, -67728, -40147, -45183, -44845, 8919, 70869, 52378, 33077, 54128, 41654, 58527, 45192, 39684, 30639, 705, -13602, -9956, -25036, -13623, 45347, 56471, 45378, 28618, 15392, 31986, 29737, 14767, 41911, 56646, 37566, 14750, 34183, 45274, 40925, 19917, 19802, 26577, 55773, 53810, 88026, 143356, 121814, 83024, 84870, 114085, 112045, 110241, 66560, 55326]
10717E5326j9112k7495o200k416O991L5572K4000n2522j7158R3K8180N5310m52
10704H0117l2671Q940l4684J5360J9105m8476J123Q323L3610P269o9724j9683
10692c1391q325l473K6144K9101M160M743k664k8764N687j0966K2258K1297p123
10679B0684J2549j170j0154L8793k8598k4955k0610j0228K9195J5037K2022j6100
10667B6465m4611m0693L583M0594j5435k4846K9222P889o960J2351O913L742J7171
10654A5385J3438j4964k9832j9749M41J8719M6966L9310k8691k3645q188P481
10642A6671M052l4513l5752m3797N0824K4376k5082r666J0453M9853k0399j5373
10630b8353J4294l6510m1978k4214L5194M3449Q005n307K7202M0906j2260n8951
$$ y = [55326, 36214, 8719, 2519, 103, 7094, 42666, 66666, 14144, -3014, -2921, 25259, 80569, 80117, 47446, 56386, 21702, 37062, 56167, 7691, 8814, 17137, 50747, 58016, -11708, -31391, -39716, -43189, -17045, 12056, 16216, 20959, 18295, -10469, -4782, -15748, 6510, 27807, 20684, 33233, 32063, 21909, 60702, 32104, 7149, -13461, -23689, 5506, 20543, 42565, 26465, -18146, -58839, -55256, -14662, -30097, -54943, -25721, -17832, -24792, -12441, -5528, -1786, 15385, 28823, 13859, -15973, -35722, -35281, -16562, 30404, 69714, 41023, 17378, 9190, 16671, 20723, -13790, -49542, -93339, -42515, -18139, -43221, -52887, -42434, 7419, -12980, -28353, -14059, -50569, -92547, -116761, -81567, -38118, -30113, -35420, -8218, 32688, 20428, -38523]
10618c8523o728J1125K864k4012J0428M6300J0642o359N538k3444j8333L208j0978
10605c8272k4230k2126N55J9551k9265q510J6108J8278M5980k564j4613K645K0030
10592a6433k0110k4740K9107r323r207K0341M047M7517J6011j5004j2993m1896
10580c2683o6352j5282m261N411k8143j7027M4634P4275j5164l1916m451R558
10568h1401M7325M1153J7783k7706n3931m08J6853M2630N4845k8587m4195L1457
10556A5818K1528k0947j694k8331l92M3483m442l4070l8777R659O2359L7084o328
10543E4950j9497J0840n152j7663j5380m4671l1295M1925j2895m0274J9880L182
10531e6050K0269K6253J4782k8663k1036K8340K3259R816o821k8749j5837k6590
$$ y = [-38523, -45251, -34126, -31262, -55274, -44846, 1454, 12096, 5737, 11275, -12169, -30502, -27294, -38272, -62502, -84628, -84073, -64522, -93787, -102297, -86189, -67911, -21931, -24495, -39108, -36463, -16433, -36543, -61283, -32176, -41499, -50706, -30365, -26318, 21199, 37210, 22206, 9213, -32683, -99035, -114317, -118578, -113167, -141310, -158337, -113703, -39428, -54592, -86508, -90959, -81401, -34076, 7077, 24860, -2846, -56777, -57185, -40332, 2298, 57143, 28556, -15639, 15818, 37346, 16399, 14705, -13626, -14018, 29465, 25023, -9047, -47824, -38165, 24194, 61278, 54950, 35453, 46293, 41141, 23478, 8098, -36573, -67868, -25943, -38838, -79112, -59232, -56050, -35781, -9528, 5254, -23409, -44445, -16105, 7154, 16970, 10149, -18600, -34437, -61027]
10519f1027Q633n006J6204K5853k2813k7464m923L2655j3271Q678Q18j4625o642
10506f2930L0124o249J8110q597j7121j5010J7717L466J5563l3747m05L277l441
10493e9243l1124J3584M5954M0360j4232o529J7172J0828k539m5190k66p716r307
10480d8248k4727j7749N837K8734Q691j8174Q008j5648R906O583K1847j8852m2449
10467i6241J1896J4343K3306j0472k2104j230K2848K4759J3041k7161q789j6304
10455g2108K092P765k6934K1543o294L0937p187M768P741l7037j2731K4108K2092
10442d1245J0424R735P740O616p60j6380j0170J0822j661l19m897K038k1180j8061
10428f7298P072K7188j5483j9813K5789N8950N3837l1410m2104j1158l301K288
$$ y = [-61027, -52394, -57400, -41196, -15343, -38156, -65620, -70543, -37888, -51159, -42481, -41663, -56288, -62930, -32806, -39055, -20945, -29542, -46663, -61673, -43956, -40490, -24927, -58674, -59079, -55802, -59243, -90367, -76783, -30829, 9531, -4701, -11230, 5942, 16770, 14231, -30959, -31225, -38941, -48248, -72975, -90724, -84887, -56153, -47462, -65636, -57628, -73276, -63370, -56787, -34940, -53792, -96241, -84345, -70002, -46696, -57168, -79272, -80502, -57654, -32895, -19854, -47015, -55804, -72108, -70016, -62251, -89185, -67642, -73936, -42999, -50186, -45418, -37677, -74714, -87445, -63337, -41245, -30821, -21086, -13346, -6730, -7490, -23870, -34040, -23218, -24879, -25198, -30095, -28057, -49237, -67298, -60226, -33038, -48521, -68334, -42545, 16405, 70242, 38832, -3272, -14430, -17731, -15443]
10416a5443o003K474J3060K3625k8194k5263M067l776R7j593L949R028m314l1174
10402e9460o066j5839r378j8871k974J6787M8663j7831L2020L8193k8643l192
10390b6591j1175j9899L1110J4501q653j6141l2532l6574J0770M8053M0830M45
10378e856J9321k847j35j402n530J3201J8608k397o393R048J6694J4459k3039
10365D3732l6096r689P89m4745J5543K2754P575K6358L4766m739m8041k656Q494
10352A4045m027l1924J7669j6169j9972K3828J6773k2553m8355o107L8821j4260
10340e2231j5714J9295n579R464J0012j3713K6557r986j8555L0797J8412J6510
10328A5269O153j5767k1676O1815P1830k3451j7180q561j2717N3450J9996o27
$$ y = [-15443, -21446, -18972, -5912, 17713, -10481, -35744, -31677, -35453, -35356, -36949, -33000, -23972, -28286, -59460, -65526, -81365, -90743, -109614, -112588, -95801, -47138, -64969, -32949, 5244, -23399, -26591, -37766, -57665, -26555, -12054, -20707, -36848, -69380, -105954, -95184, -47131, -6301, -5856, 13465, 10618, 10483, 9081, 3551, 16752, 35360, 32963, 26570, 35618, 52312, 66771, 43732, 7636, -2053, -1264, -46009, -30466, -7712, -137, 26221, 60987, 56248, 8207, 5551, 14045, 10018, -21906, -4237, -20406, -40378, -16550, 223, -22330, -70685, -76792, -37971, -52231, -67945, -48650, -54229, -44765, -34753, -48466, -21909, -31895, -50450, -19653, -1241, 15269, 21422, 5655, -16021, 45794, 117624, 94173, 76993, 68432, 55715, 109165, 129161, 128534]
10316A28534l6268j07P4453K9401k3282p181m1176l4837J3911l000k2948n840
10304G1660O564j432J578m0011k4642l4960J8681N503p993J601J5407P625k2038
10291b457n401J7315J530J9906J4035J0241L786j8479q091o260L067k8666N411
10278E937K5173J5031k104N84p213q27l1612L533l716l006K0105k356k3667K1948
10264A7810M9000K7907J2607j6417J3702J7305O638j951j724k9607n910j9670
10252F9690L353J1342k4574m8300j4850K632m121N0J4329K4677N475j3014K8834
10239E5523M1753K210n1741q0273j4686K0100L8230J3022K9344j0706O997O67
10227E0440j0478m061L0721k370k6525J7604J4461k2374j7020k0053j5036M6614
$$ y = [128534, 92266, 92159, 166612, 196013, 172731, 165550, 124374, 89537, 103448, 100448, 77500, 71660, 78224, 76792, 78370, 38359, 13717, -21243, -2562, 2941, -5052, -3451, 11956, 19581, -2457, -7858, 9457, 10987, 30893, 44928, 55169, 58955, 40476, 32385, 26125, 29192, 526, 5937, 31110, 46141, 44037, 44621, 37408, 36581, 4969, 8502, 4786, 1780, 21885, 19529, -4138, 17810, 66810, 94717, 107324, 90907, 104609, 121914, 128552, 126601, 124877, 95270, 89360, 69690, 73043, 84385, 59811, 11511, -3339, -707, -4828, -4778, 9551, 34228, 39703, 26689, 55523, 97276, 99486, 47745, -32528, -47214, -27114, 11116, 24138, 53482, 42776, 49773, 50440, 39962, 35901, 66622, 64252, 37727, 55331, 69792, 47418, 30398, 10345, -4691, 41923]
10215D1923J7385J6770j7715k5990l392j899J6669M076l722J6437L5737J8456
10203A14735K5265P911l1924m4934p91j0098R769Q302k6053m1060m0744j8232
10191d7854n221O3479K6801j4419k5392J8640J8835j8113k4072p146K9047m1099
10179b6514J5360K5201J144J0216j611J985L8860j6763J457o92j3575p390j7731
10166I947Q94o038L569J8609o645l635j1405j2213k8683j4511j516L9674K4539
10153A2586J6605L0312p121k2113P307J3179r852O24l2648j8865J956n3722k7518
10140h9270P163L1560L3019k6212L1189O8806j6547m3842M785k0930k701K2087
10128h93L4299J0161M505m0944j1483J2072M725q703n1890o482L2016L7113K2140
$$ y = [41923, 59308, 76078, 58363, 32373, 28981, 27082, 43751, 47827, 44105, 60542, 96279, 114735, 140000, 147911, 115987, 71053, 70262, 60164, 69933, 78235, 52182, 11122, -29622, -47854, -53075, 10404, 37205, 22786, -2606, 16034, 34869, 16756, -7316, -14462, 14585, -26514, -11154, 14047, 15191, 25407, 23796, 25781, 64641, 47878, 49335, 48643, 35068, 27678, 9947, 10841, 4803, 8372, 26981, 20336, 16701, 5296, -6917, -35600, -50111, -51627, -11953, 12586, 29191, 59503, 52382, 30269, 37576, 50755, 40903, 41527, 8879, -9986, -8030, -61752, -89270, -82107, -50547, -17528, -43740, -12551, 56255, 39708, -4134, 651, -20279, -22980, -893, 33406, 43567, 48072, 7128, -4355, 7717, 12442, 3739, -48151, -54633, -22617, 14496, 36636]
10115C6636J6010k4984J0217M347j4111N463J0553K2342L929l4398k1732J003
10103A5275J2066p087J7999N081M6870m072M068J7076j823j9737j7670N045K5852
10090I8943O438Q693j668J0225l41k0638p009l6317j6820k4810l3106J2862L3943
10077C0395L2402J7287k5842j9850J4906j7696o6445m2944L9547p597K8302M482
10065a3053m8658Q862P875K2622r15j2241m0776J0763N3249K6338J7077L5103
10053F6246r399j9458p84j6039l2651j2869j526J4402j1818k6027L8190L2151
10041B0418q897l786q131J0986l380J1842J9651r092k6273j9959N436j2548K9201
10028E468L9002L3295r551j3814j1656n415K4844j2817p1194O203q475j0837r687
$$ y = [36636, 52646, 27662, 37879, 42226, 28115, 33578, 44131, 66473, 70402, 36004, 14272, 15275, 27341, 20254, 38253, 43334, 90204, 86132, 90200, 107276, 105453, 85716, 68046, 73091, 98943, 105381, 114074, 112406, 122631, 122290, 101652, 94643, 58326, 41506, 16696, -16410, -3548, 30395, 62797, 80084, 54242, 34392, 49298, 31602, -34843, -77787, -38240, -45837, -17535, -13053, -61711, -52849, -44974, -22352, -23267, -35508, -76284, -65521, -12272, 14066, 31143, 66246, 56847, 37389, 36605, 20566, -12085, -24954, -26480, -12078, -23896, -49923, -11733, 20418, 11521, 7735, -396, 10590, 7210, 19052, 38703, 29611, 3338, -16621, -11185, -23733, 5468, 44470, 77765, 68214, 54400, 42744, 37329, 62173, 49356, -21838, -15635, -24110, -34947, -44634]
10015d4634M8727L949m586O891J0418m495k8192j9973J8893M4537K1845l1180
10003B2200m0428k2713K2104M755k945J7813m7032k9398m410L1899N9717K0510
9991C2072J277j2804L748J3770r647l5121k406M39m2898m804L7464K1422J303
9978C815k6136l5730l1476K2422J8147M1636J1059p951k0445k4772p947J9193
9966c8185L0209K7012L8271n225j0238m1058j0659J287j938L122M0155k968k7893
9953A892Q009Q09j459K37N0263l118k5023j2160k6674m229p488J6578l4650l681
9939d0694R632K8217L6857l4382l7943J7319L8215l6181l109J5309K4107M951
9927B2298j3329j8751l9842J5837K968J4726R795N206R916P317K7187l1012o2574
$$ y = [-44634, 4093, 8042, 3456, 10347, 20765, 16270, -11922, -31895, -13002, 31535, 53380, 22200, -18228, -40941, -18837, -14082, -17027, 786, -46246, -75644, -80054, -48155, 11562, 32072, 33349, 20545, 24293, 38063, 28416, -6705, -9111, -8672, -51570, -56374, -18910, 2512, 3815, -22321, -58051, -89527, -67105, -48958, -7322, 3737, -4214, -24659, -49431, -57378, -38185, -7976, 19036, 57307, 52082, 41844, 786, -9873, -8586, -10524, -7402, 32753, 29785, 1892, 9901, 10710, 9251, 9488, 59751, 56633, 31610, 19450, -7224, -11453, -18941, -2363, -37013, -40694, -31062, -2845, 34012, -370, -38313, -20994, 17221, -18960, -22069, -6760, 17347, 22298, 8969, -9782, -49624, -33787, -30819, -16093, -6298, -1092, 8824, 16141, 43328, 12316, -50258]
9914e0258J5602K5250Q600J0121l1381j274L1093N758n4830n383N8026J6934o511
9901B1747J1475m4762n320N291Q481l7858j3643K653K6238J0488K4577m740l166
9888A461m4832m25L644J6407M465J2982J0176K0932J3938k2812q928k6334K3309
9875C983J2589K0173k595l431l912J2898j8310k1701J1661K0223L8244J5049K0970
9862A05841R240j8780m6250L0473J9116j4776M1908j2865j9779o8972k8979O0057
9850E6234P5078N6025K4198P765N6273J10621Q7555J68574J96367J14407K1123
9839I74220j07535j99312j28099j00060o9087k3076J0780m2592l5684J6428M282
9828C00265j1972l7656n5703n5279L6680L453j3217k3243p255K702l4690k4857
$$ y = [-50258, -34656, -9406, -806, 9315, -22066, -23340, 7753, 13511, -41319, -46702, 11324, 28258, 21747, 33222, -11540, -16860, -11569, -3088, -40946, -54589, -51936, -25698, -15210, 9367, 4627, 1461, -43371, -43796, -40152, -23745, -19280, -6298, 3878, 24810, 38748, 15936, 7008, -19326, 3983, 16572, 36745, 34150, 30719, 26807, 39705, 21395, -306, 11355, 31578, 69822, 84871, 105841, 115081, 96301, 50051, 80524, 99640, 84864, 126772, 113907, 94128, 25156, -3823, 56234, 131312, 187337, 211535, 219300, 275573, 386194, 473749, 642323, 838690, 953097, 974220, 866685, 667373, 539274, 439214, 370127, 347051, 357831, 315239, 279555, 295983, 300265, 288293, 250637, 194934, 139655, 176335, 179788, 166571, 143328, 136073, 138775, 104085, 79228]
9816G9228K9609M2196j2434j8726l9229J2190L4277j7344n2493k6348j2675M4776
9804F3027L073l7109J4516J0546o37J7886J5890N083k648j2707k9200j851R48
9791D6817j9060K144k3145j252J3392j158J5260k5074j9726l1712K2049J7764
9779c701k7946o653Q1180k406J322j1271M455k8893k9395l8319L8952L0238l0396
9766b2833j4647M0566J1711j4364O328l3178K906M4538K5556j7595j7933K4176
9754C5231j6731l6259J3195J5054n375L782j6435k286l5944l8063j3757M1738
9742e5850K9102k247p237o12l721k073K6808j9184R786m289p347J4046K8841J3814
9728A9837k1922l1506q659p423k7591J1391K1250j5254K7954K3754l541Q938L3662
$$ y = [79228, 108837, 151033, 138599, 119873, 80644, 92834, 127111, 109767, 57274, 30926, 18251, 63027, 66100, 28991, 43507, 54053, 53416, 71302, 87192, 92275, 89627, 76920, 47720, 45869, 46817, 27757, 29901, 6756, 5504, 18896, 17738, 32998, 7924, -11802, -43514, -21465, -3701, -31647, -38300, 42880, 40474, 41796, 30525, 34980, 6087, -23308, -61627, -22675, 7563, -22833, -37480, 3086, 14797, 433, 6761, -26417, -23511, 21027, 46583, 28988, 11055, 35231, 18500, -17759, -4564, 10490, 5115, 8897, -7538, -9824, -45768, -83831, -97588, -55850, -26748, -28995, -36232, -36844, -40565, -42638, -15830, -35014, -25228, -29517, -36864, -22818, 6023, 19837, -2085, -33591, -42250, -49673, -77264, -65873, -44623, -59877, -31923, -8169, -11710, -2772, 30890]
9715C0890j0705l2620j9519L7855M3056q923l4385n471j8395J1872K256r483J782
9702a1790k4767j7607R138K9134N860J7797j2294l6616j1419K9518J0682k254
9690a4618O8108K7511o2170m5958K6200l2399o767o891J3937k043Q489j2145J0853
9677b7893L7460k7521j3056j2831j7041r001K0769l614k6893P464M0909J2396
9665a8852j8443J6507M7178J9309j0261R556j6280k4575k2037P900P793l0877
9653c3082l396P983L6049k5929J472K5564K5217K6629n195O404j3569j9702k2944
9640E501k1551q788L7292j5482l2543m642J6921L6894J3086P965l0043l098L0955
9627C2467m544O605K3665J2782l6029n4558Q80n522K169K7430K4015J318j1589
$$ y = [30890, 20185, -12435, -31954, 5901, 48957, 40034, 5649, 178, -18217, -6345, -4089, -13572, -11790, -36557, -54164, -45026, -15892, -10032, 7765, -4529, -41145, -52564, -23046, -12364, -14618, 53490, 81001, 18831, -27127, -927, -33326, -40093, -46984, -33047, -35090, -26601, -38746, -27893, 9567, -17954, -31010, -43841, -60882, -69883, -49114, -52728, -79621, -72157, -31248, -18852, -37295, -20788, 26390, 45699, 35438, 44994, 28714, 4139, -17898, -9998, -2205, -33082, -36478, -28495, 7554, -18375, -16903, 8661, 33878, 60507, 55312, 61716, 48147, 28445, 5501, -16050, -24838, 12454, -3028, -35571, -40213, -23292, 13602, 26688, 34653, 4610, 1512, 32467, 27923, 34528, 58193, 70975, 34946, -19612, -18732, -24254, -22085, 5345, 29360, 30678, 19089]
9614A9089m1647K7407J2540j0034p805j4314L5613J7413j2227J7813q278M593
9602D0163k2678m1637q143k9907R592K1689p814N063J7687M566k0999J9867K74
9589a2277p469J2254k5034R596k0111j0634K2004K1145k781k0525j5324N91k6842
9576g5407J1857L8685J7384J2563J0690m3025l9764j2501O49L9332K0868J4217
9564d452p471N748P881K3396n0969l092L3326j219J3588P06o1373j9731N6544
9551g118J2274o5681m3033K6784j320m3496n781K8993q816J4043J652L8204j8135
9538g1430l4316K9708L2575N1266J5434l1935j0610k9314k8498K7579L8221J5782
9526D462j4811R022P97j8375o011k3450K6248Q268k130j2989k198n968J2868K6972
$$ y = [19089, -22558, 4849, 17389, 7355, -450, -14764, 20849, 38262, 26035, 43848, 35570, 40163, 17485, -24152, -32295, -62202, -52610, -30921, -38735, -33672, -15985, -11419, -32418, -12551, -12277, -19746, -7492, -32526, -22930, -43041, -53675, -31671, -10526, -13307, -33832, -49156, -48565, -75407, -63550, -24865, -7481, 5082, 15772, -27253, -67017, -79518, -78869, -39537, -18669, -4452, -11923, -6175, 1706, 25102, -25867, -28959, 4367, 3148, 16736, 17442, -43931, -63662, -7118, 5156, -60525, -103558, -76774, -78094, -121590, -127371, -98378, -107194, -93151, -91499, -53295, -71430, -105746, -76038, -43463, 7803, 23237, -8698, -19308, -48622, -77120, -49541, -11320, 4462, -10349, -1327, -530, -18905, -24916, -48366, -22118, -13850, -15980, -28969, -31167, -37135, -24267, 2705]
9512B705p145k139Q153m3403j2278M2535J6783k3860o1195R90M3143M0888L8947
9499D4124R257k5628P776j4762L260L1550L0204k9297j9927j3764j9418j3062
9487i687j7597L5866J4689j3576N213Q78n7328j8085j3224r783J7501K4299J7839
9474b2995j935o82j6895K0475K4266L1429L7140J3187l1248m0132l7098j2535
9462c7023J1532L110K2061J5770L059K3652L943k1048K108J4716L7780L1115r261
9449A01514k0900j6522j4276j5023r261l8287k4876M1420R118j20j9634N117J2310
9436A0580J8052J9347k542L281O185k6403m5679R833r353Q291o858n428J1024
9423i670J902L0503J6032M1396K167p523k3743j8958j7932j2439O1616J3785P709
$$ y = [2705, -4440, -6579, 1574, -41829, -54107, -11572, 5211, -18649, -79844, -78854, -35711, 5177, 44124, 53381, 27753, 35529, 20767, 24027, 55577, 85781, 56484, 36557, 22793, 3375, -9687, -27284, 8582, 23271, 9695, 14908, 15786, -41542, -59627, -72851, -82634, -65133, -40834, -22995, -24930, -25612, -42507, -22032, 2234, 33663, 70803, 83990, 52742, 12610, -24488, -37023, -25491, -22381, -320, 15450, 18509, 42161, 46104, 25056, 27164, 41880, 79660, 110775, 101514, 80614, 64092, 49816, 34793, 25532, -12755, -37631, 3789, 12907, 12787, -6847, -1730, 10580, 28632, 47979, 45437, 48718, 54903, 28500, -17179, -7346, -16699, -8408, -15266, -20694, -9670, -7768, 22735, 38767, 80163, 82330, 74807, 51064, 32106, 14174, 1735, 63351, 77136, 84845]
9410H4845J4175n522K5972J0058j1185k8916M17L1036M5165p428j3072k7422k6056
9397I2067J8725L9780M6248k0340m3919L2664r56P096m18k5079j5964Q771J2979
9384A51654N44k3116k2656J420L6859J3753o428j9270m1821K1324N9263L2526
9372B04052J9918j3734J703M3581J5633l1617k8933J0880R616J956k3896P216
9360B16375K4920K4412l1252l7103K2202N1342J236j4103K0521N1477L8460J0367
9348C78854O879K6422M5908O0388N3956K1594M3738O7604P8619K3394N4143M5907
9336I07406J11796J45744J78970K25948L47295M81296N62315P50760R74038J243408
9326E928976J522569J946012K559033L498669M728687M801848J649401k941728
$$ y = [84845, 99020, 93498, 119470, 129528, 118343, 89427, 89844, 120880, 166045, 158617, 145545, 118123, 92067, 110792, 150572, 196820, 176480, 132561, 165225, 164269, 171365, 170947, 145868, 129904, 138675, 151654, 152198, 129082, 106426, 107846, 144705, 158458, 152030, 132760, 90939, 112263, 171526, 204052, 223970, 210236, 211939, 255520, 271153, 239536, 210603, 221483, 231099, 233055, 209159, 216375, 241295, 265707, 234455, 197352, 219554, 270896, 272132, 258029, 278550, 330027, 368487, 378854, 385733, 412155, 458063, 518451, 572407, 594001, 637739, 705343, 783962, 807356, 861499, 907406, 1019202, 1164946, 1343916, 1569864, 1917159, 2398455, 2960770, 3711530, 4685568, 5928976, 7451545, 9397557, 11956590, 15455259, 20183946, 24985794, 26635195, 23693467]
9318B3693467m635947l927275k831261k081328j501517j075758p84168n98185
9310F258028m98622m45614l67690l04912k67213k62134j61882j33855j38839j59600
9300C517667j28052r6022q2110p8940n2284n5597m1912l1838m8243l0801q477
9289B863391N0248L2778O484o7069q1665o6679q5339q9639j02705j10427r3823
9278B255555j26306q8256r1916p9100j01823q5745q0780r1915o6240q3422o1708
9267A298344p1308q6470l7174m3808m6735n9416q5991o7548k1237l6148k1274
9256G21235N123l0964j9097k3451j8469m6105m5410j7165l2783R668J0645o576
9244E06651r955l9066l2794m3206m1674o287k1511l4838M413L2021K4796K2577
$$ y = [23693467, 19057520, 15130245, 12298984, 10217656, 8716139, 7640381, 6856213, 6258028, 5759406, 5313792, 4946102, 4641190, 4373977, 4111843, 3949961, 3816106, 3677267, 3517667, 3389615, 3293593, 3211483, 3132543, 3080259, 3024662, 2982750, 2950912, 2902669, 2871868, 2863391, 2913639, 2946417, 2952901, 2885832, 2804167, 2737488, 2652149, 2562510, 2459805, 2349378, 2255555, 2129249, 2040993, 1949077, 1869977, 1768154, 1682409, 1601629, 1509714, 1443474, 1360052, 1298344, 1227036, 1140566, 1103392, 1059584, 1012849, 953433, 867442, 799894, 778657, 742509, 721235, 726358, 695394, 676297, 652846, 634377, 588272, 542862, 525697, 492914, 502582, 513227, 506651, 496696, 457630, 424836, 381630, 339956, 333669, 312158, 277320, 281733, 313754, 338550, 361127]
9232C61127J5116k1824k1944j1194J5765L5355j0611m1889k710J5793k103n8292
9220B72589l6243j9242n7709m656J245p395l190J9900J7618j8103k1429J3376
9208A56761j4438r171j6274m1042J8043M3654L1601r682l9900j1135J30J7041
9196A25588K4356M740k3435j8789K6487L3628k1538M010j0130j5615J219L6505
9184A67026L9466M9390K3840l949k447O409J1891m9642l2522R874K2228J3880
9172B55444P833J3343n0260m8240l2023L3587n393L711o554J8299q68k2612k139
9159A64128n354M053L3298J8847J879m5740M198j5563j4577j7280j0296K8082
9147A45675K0053r648J3649K0409K6228J9265O777K5000j8115K6810k2515l3829
$$ y = [361127, 376243, 354419, 332475, 321281, 337046, 372401, 361790, 319901, 317191, 332984, 330881, 272589, 236346, 217104, 159395, 154739, 155984, 148589, 145399, 165299, 182917, 164814, 143385, 156761, 142323, 133152, 116878, 75836, 93879, 137533, 169134, 159452, 119552, 108417, 108547, 125588, 149944, 154684, 131249, 112460, 138947, 172575, 151037, 155047, 144917, 129302, 130521, 167026, 206492, 255882, 279722, 275773, 273326, 279735, 291626, 241984, 209462, 219336, 241564, 255444, 263277, 276620, 226360, 178120, 146097, 179684, 174291, 178002, 171448, 189747, 188879, 166267, 164128, 158774, 162827, 196125, 214972, 216851, 171111, 175309, 159746, 145169, 127889, 117593, 145675, 165728, 156080, 169729, 190138, 216366, 235631, 242408, 267408, 249293, 276103, 253588, 219759]
9135B19759M2352L2790o763j826M530l4498n7655l9549K0687l5384J7207J8229
9123A79879P132J9073K475n910P954J8367J4377K1833j3969j59J5786J9426J4401
9110C00665k2217m8154m4310r774j7716k1133n270J5624J8155J8154Q38k3471
9098A61391j4304J6848K7172R803j5161j4851m899j5384K8995m046K9101L937
9086B08602N188p485n2588J6032K3946J5335K76L6244o235j6913j5307j6848r710
9073A80537j2508o759k4118j3302K429Q724K1700m3236J1529L5865L2904j5005
9061A78760j3957K9415q368L993r000k9436j2830l546j4433J9551K3126l9982
9049A23293m4320j0820j2336L7578l1255R072L4573L3522P506k7913j6219j932
$$ y = [219759, 262111, 294901, 288138, 286312, 290842, 256344, 198689, 159140, 179827, 144443, 161650, 179879, 187011, 206084, 208559, 202649, 210603, 228970, 243347, 265180, 251211, 251052, 266838, 286264, 300665, 278448, 230294, 185984, 176210, 158494, 137361, 132091, 147715, 165870, 184024, 184862, 161391, 147087, 163935, 191107, 200910, 185749, 170898, 165999, 150615, 179610, 175564, 204665, 208602, 213790, 206305, 153717, 169749, 193695, 209030, 209306, 245550, 239315, 222402, 207095, 190247, 180537, 168029, 161270, 137152, 123850, 126279, 135003, 156703, 113467, 124996, 160861, 193765, 178760, 164803, 194218, 185850, 189843, 180843, 151407, 138577, 135031, 120598, 140149, 163275, 123293, 78973, 68153, 55817, 93395, 62140, 71212, 105785, 139307, 146813, 118900, 102681, 100749]
9037A00749J8721P56K4261K0300l893j4020j7975j4246j5277r078Q065M200q586
9024I3977J6469R4391n637j3722L002o0301m1820j8668R030M7176J503P019k3033
9011A09386K6515J2535o199j3327j9886j5296n788j5673J2471K6893J9286j715
8999A29202P12L892l7629n508Q074R208L0948L0090l1171l4085l3654L8686M3528
8986A52293n801K6627k7556p075k2949l6654R325K6968Q377J8584J6721Q793k689
8973A64964j9918P552k0432k0609M0071j775k5610q764l9349P661j2982J6406
8961H7215J9274k9502k1726p179k1295m034m526J1041J4068K444r147n259K1147
8948E2521n402L7574J5363l6101k3163r188j9318O806Q654K6413K0523J5629q803
$$ y = [100749, 119470, 120226, 144487, 164787, 160894, 146874, 128899, 114653, 99376, 90298, 98363, 102563, 93977, 110446, 204837, 199200, 185478, 188480, 128179, 86359, 67691, 76721, 123897, 125400, 132419, 109386, 135901, 148436, 142237, 128910, 109024, 93728, 87940, 72267, 84738, 111631, 130917, 129202, 129914, 133806, 96177, 90669, 98743, 107951, 138899, 168989, 137818, 103733, 70079, 108765, 152293, 146492, 173119, 145563, 138488, 115539, 78885, 88210, 115178, 123555, 142139, 158860, 167653, 164964, 145046, 152598, 132166, 111557, 151628, 149853, 124243, 115479, 76130, 83791, 70809, 87215, 106489, 76987, 55261, 48082, 26787, 22753, 18227, 29268, 43336, 45780, 36633, 31374, 52521, 47119, 84693, 100056, 63955, 40792, 31604, 12286, 19092, 27746, 54159, 74682, 90311, 81508]
8935H1508J2119j5411j8030J7853m950l6231L6706O623j6196N06J6423r82l4171
8922D5767k977p123J4807J6884r975j090l5619K0752J7578K5763n306j3537P036
8909G2960k5464r531r8R783K4484j5394j7985K43m55j2554J8827J0913O027P976
8895F9732R317j2143J7211k550J141J700j2195l1467p383M2012N771m387J9615
8882I6374k0202l0395j9482k7122J6015K4015P137j7714l567K1877L715Q104n634
8869E3121q750L01K1690Q8j0384K1613j2810j9500J0474L6875M4930j5295m1878
8856H0475j4077J7094Q525r289K5717N3246J0383j1353m0407N4L3955P787J4395
8843A76505J8379j5573l4477l6476J2088J9290L8587J6249m0329m5783R305J149
$$ y = [81508, 93627, 78216, 60186, 78039, 73089, 36858, 73564, 80187, 63991, 64497, 80920, 79938, 45767, 42790, 35667, 50474, 67358, 57383, 56293, 20674, 41426, 59004, 84767, 79461, 65924, 72960, 47496, 37965, 37867, 47650, 72134, 56740, 38755, 38998, 38543, 25989, 44816, 55729, 61756, 69732, 79049, 66906, 84117, 81567, 82708, 84408, 72213, 40746, 33363, 75375, 81146, 76759, 96374, 76172, 45777, 26295, -827, 15188, 39203, 46340, 28626, 25059, 46936, 50651, 58755, 53121, 44371, 44672, 66362, 66450, 56066, 77679, 64869, 45369, 55843, 92718, 137648, 122353, 80475, 66398, 83492, 92017, 82728, 108445, 161691, 172074, 160721, 120314, 120368, 154323, 162110, 176505, 194884, 179311, 144834, 108358, 120446, 139736, 178323, 194572, 154243, 108460, 117765, 118914]
8831A18914n2105k7575J5490N6638J3682o0524l4087K1647J3771k0005P648J3724
8819F7218N1483k2442r835P585L676J1298k7898m877P713K7403R466r00n3924
8806F5966l3409L2655K1910P716J4602J9713j1099l067n9675l3171k7602K7909
8794B2448J7880N307J6362j9944K106K758N221J0942N7403J0332J777j7612l2919
8781H2061J4144J2377L5928J9209n3547n1858k0771j8138M4843O7823O1259j386
8769A91944k0683K8451M622j9262r012R289k3480k4200j0560Q322L0208j0575
8757A55064j7166j6106j4698O978k1212R128l0108J2811L2475j6526J0271K8112
8745A39023O3j5301j7839P551K521k2823m19j1556L497K1533j3903l0932L5642
$$ y = [118914, 66809, 39234, 54724, 111362, 125044, 64520, 30433, 52080, 65851, 45846, 53494, 67218, 118701, 96259, 86424, 94009, 97685, 108983, 81085, 76208, 83921, 111324, 120790, 119890, 65966, 32557, 65212, 87122, 94838, 109440, 129153, 118054, 114987, 55312, 22141, -5461, 22448, 40328, 45635, 61997, 42053, 44159, 46917, 52138, 63080, 120483, 130815, 132592, 114980, 82061, 96205, 108582, 144510, 163719, 110172, 58314, 37543, 19405, 64248, 132071, 193330, 191944, 171261, 199712, 204334, 185072, 176060, 185349, 161869, 137669, 127109, 135431, 165639, 155064, 137898, 121792, 107094, 114072, 92860, 101988, 71880, 84691, 117166, 100640, 110911, 139023, 139086, 123785, 105946, 113497, 116018, 93195, 92776, 81220, 84717, 106250, 92347, 61415, 97057]
8732I7057L4320O1711l8750k3167p254Q905K0396J5802J6743l3203m7672K7959
8720A32847J0813K0129K3921M4881L6396k3748J2892J5266K7684k0839J1794k793
8708B89243J3641O410j7025o830l3383m4788j312N0924j1620m4150K171K5009
8696B28290K8232j8173K1320j5403j1356L5149O739J0895Q792J0686J1494q961
8684C07704m3825l1850o087L4202K8111L5193P344k8574K598J699l0736k1397
8672B54382N391m011J5392k2858l693k3519K9569N2842K6323K7367M620l1863
8660C29942l1002j7392M4376J4952L0097K2111K2234M2464M2777j7355q547M0453
8648E15110k1923k9314o589J019L7831K1204j2589n091M2716K7131K2284j1821
$$ y = [97057, 131377, 193088, 154338, 131171, 123917, 132822, 153218, 169020, 185763, 152560, 104888, 132847, 143660, 163789, 187710, 232591, 268987, 245239, 258131, 273397, 301081, 280242, 292036, 289243, 302884, 309294, 292269, 285439, 252056, 207268, 205956, 256880, 245260, 201110, 203281, 228290, 256522, 238349, 259669, 244266, 232910, 268059, 274798, 285693, 294485, 305171, 316665, 307704, 263879, 232029, 225942, 260144, 288255, 323448, 330792, 302218, 304816, 306515, 275779, 254382, 259773, 255762, 271154, 248296, 244603, 221084, 250653, 303495, 329818, 357185, 361805, 329942, 298940, 281548, 325924, 340876, 370973, 393084, 415318, 457782, 500559, 483204, 474657, 515110, 493187, 463873, 457284, 458303, 496134, 517338, 504749, 499658, 542374, 569505, 591789, 579968]
8636E79968j8055K6907R694L086J6474M0160L1312O3459N7049L1435L5737J2162
8624H89388k8777l4966j0003O66k8236j9879m497j4960N5325J7240M987l639J442
8611H24091Q83K6894N6003N177l3022O15M0231L5668L851l798K7193P7172N5485
8598A116443L3839M9138O0343P9534J14281M7063Q8840J18646P2585J14332J52847
8587B047891J70686J89001K06741K54778K00663K02800J93825K04734J91501J25447
8577C988067L8119j9224l6719j42140k26518k45133k43707k05997j84048j84469
8567B538231j43079j35546j08768j03182r6471q4035j10980q8694n7346m6192
8557A563938p0949n0324m3261o20l0007k7936k9447j1210n4591j1739l2962m690
$$ y = [579968, 561913, 588820, 598514, 601600, 618074, 658234, 689546, 753005, 810054, 841489, 877226, 889388, 860611, 825645, 815642, 816308, 788072, 768193, 763696, 748736, 804061, 821301, 826288, 822649, 824091, 824974, 851868, 907871, 913048, 880026, 880641, 920872, 956540, 960391, 956593, 983786, 1060958, 1116443, 1150282, 1199420, 1259763, 1339297, 1453578, 1500641, 1589481, 1708127, 1780712, 1895044, 2047891, 2218577, 2407578, 2614319, 2869097, 3069760, 3272560, 3466385, 3671119, 3862620, 3988067, 4026186, 4006962, 3970243, 3828103, 3601585, 3356452, 3112745, 2906748, 2722700, 2538231, 2395152, 2259606, 2150838, 2047656, 1951185, 1867150, 1756170, 1667476, 1610130, 1563938, 1492989, 1442665, 1399404, 1398784, 1368777, 1340841, 1311394, 1300184, 1245593, 1233854, 1200892, 1196202]
8545A196202n950l3385r211J4796m3104k6065k7410l638l2848n8349m4464n2096
8533H74478m9952j5228k3263m8164r621j128K2374R939J6232k3629n1913k3637
8521F76488l4322k5160k7615m7616j5722j1244j6438P327J4585l2653k1378K0074
8509D86326k8491l4942r321l884K5993L2900n0221J0076m008k3929J4679j421
8497D13757q1066p505L3684j3593m6286j6981m2352L239J3691l376r58N8545L5363
8484C46162k8705p590N63n177k0440Q57J1286n2664m4661J3532m343K4019K4031
8471B56870J0892Q874J780k7250l4017k8092L567K1776L0353j8351m9397J6419
8459A93424j5280j2693l8494k1512L5339K0497L2950l2806j9716Q370K4201j127
$$ y = [1196202, 1190252, 1156867, 1147656, 1162452, 1119348, 1093283, 1065873, 1062235, 1029387, 971038, 926574, 874478, 824526, 809298, 786035, 737871, 728250, 727122, 749496, 759435, 775667, 752038, 700125, 676488, 642166, 617006, 589391, 541775, 526053, 514809, 498371, 505698, 520283, 487630, 466252, 486326, 457835, 422893, 413572, 409688, 435681, 468581, 418360, 428436, 424428, 400499, 415178, 413757, 332691, 325186, 358870, 345277, 298991, 282010, 239658, 242897, 256588, 253212, 252254, 310799, 346162, 317457, 309867, 310430, 305253, 284813, 285670, 296956, 244292, 199631, 213163, 208820, 232839, 256870, 267762, 276636, 278416, 251166, 217149, 189057, 192624, 214400, 244753, 226402, 177005, 193424, 178144, 165451, 126957, 105445, 140784, 161281, 194231, 161425, 141709, 150079, 174280, 173153]
8447A73153p087n394J704k4375N569L5698J6685j7978k3711K155L140J054J6008
8434A76621N306n335j125K0484o897m6451J5503L8247K6255J379p0357j4740N823
8421A44713J4526j0454K795J7472j3659J938L1688L3550j6584k5042m3210k9190
8409A08543L275R156M9879Q62k3613j032R993J8299J3783r902l3634l4455o008
8396A05146K8453M0821K46k6856m4058O685m192J7332j1935J0721p473l0445L4709
8383A19154J9673j5693j0837P379j4825K227K0293L6696J8018l2847l3107j6630
8371I9501J4789j3188k2656k141L2246J8797J0054J5967K3006O608j8058j709
8359A63216O993l2120M012K7917j5675m8770j9872j7703J6829M4908M299k6848
$$ y = [173153, 166066, 160672, 162376, 138001, 143570, 179268, 195953, 177975, 154264, 156419, 159559, 160613, 176621, 181927, 176592, 175467, 195951, 189054, 142603, 158106, 196353, 222608, 223987, 153630, 138890, 144713, 159239, 148785, 151580, 169052, 155393, 157331, 189019, 222569, 205985, 180943, 137733, 108543, 111818, 120974, 170853, 171715, 148102, 147070, 157063, 175362, 189145, 179243, 145609, 111154, 105146, 133599, 174420, 174666, 147810, 103752, 110437, 106245, 123577, 111642, 122363, 114890, 84445, 119154, 138827, 123134, 112297, 119676, 104851, 107078, 127371, 164067, 182085, 149238, 116131, 99501, 114290, 101102, 78446, 76305, 108551, 127348, 137402, 153369, 176375, 182983, 164925, 163216, 170209, 138089, 142101, 170018, 154343, 105573, 85701, 67998, 84827, 129735, 134034, 107186]
8347A07186J7371J9975k7452k2812K0103K8997q185k8210j3590j0213J88Q945
8335I2303p287J6479L659k993m380k8014j4140n5601p410J7819K4028J059J0764
8322D6286M7314n714l8845k86L8311O2839M4386m3837n6339k1917M316J9606M339
8309A00459L7818q566j9948j0504J0010K0429K5149R935m8042l7413j6270k2881
8297D0176L7512L1495k8113K2517K5886J4626k2862o061j8825n133j5413j8053
8285E7752L3352l796n473M0416P443j6064Q23l4062j7222j4513q452L4796m180
8272G0820J6334l10o802j3400l071j6599L650j3003k5464j389O5944n919q884
8259F1907k188J7541L0204J0187R827r948K6535j1750m5483J469J7603K2851m250
$$ y = [107186, 124557, 144532, 117080, 94268, 114371, 143368, 135183, 106973, 93383, 83170, 83358, 92303, 85016, 101495, 105154, 102161, 97781, 69767, 55627, 26, -7384, 10435, 34463, 35522, 46286, 93600, 87886, 49041, 48755, 87066, 149905, 194291, 150454, 94115, 72198, 76514, 96120, 100459, 138277, 129711, 109763, 99259, 109269, 129698, 154847, 164782, 116740, 79327, 63057, 40176, 77688, 109183, 81070, 103587, 129473, 144099, 121237, 115176, 96351, 91218, 75805, 57752, 91104, 87308, 81835, 122251, 129694, 113630, 114453, 80391, 63169, 48656, 40204, 75000, 70820, 87154, 86844, 80042, 66642, 63571, 46972, 50622, 37619, 12155, 10766, 76710, 70791, 61907, 59719, 77260, 107464, 117651, 127478, 117530, 144065, 132315, 86832, 88301, 105904, 128755, 124505]
8246A24505j3137J9817j933l158J0937j0936j1133j2421n765n667q422j6860N383
8233G1210J4248J0108J2792K6412o832j3534M01q828J0990j487o842J0030J9379
8220A38047K7636K9847k6805m9447k79J5364J1205J5430M129k7212p5043J9902
8208H2774P1270J7037j4893N271J9052r661j8909o42j5904J4181k7375k5337K5169
8195A22033L609j0260j9707k7663J0988J9639N1575j7008n2176k6349K7459L1631
8183A13771j6673j8055K7366L6485N636j8450n407l0195m1579m8058L1090K3806
8171E9737K6169k944n327J6942M0218o400k0935n7645K202K7443j6105L5871p4
8158I9152l5146O4075M7447j9757r095k792l024J8019l4470j7829j2715K8821
$$ y = [124505, 111368, 131185, 129252, 126094, 137031, 126095, 114962, 102541, 96776, 91109, 82687, 65827, 71210, 85458, 95566, 108358, 134770, 127938, 114404, 114805, 105977, 116967, 115480, 108638, 118668, 138047, 165683, 195530, 168725, 119278, 118999, 134363, 145568, 160998, 165127, 137915, 62872, 82774, 154044, 171081, 156188, 161459, 180511, 170850, 151941, 151299, 135395, 149576, 122201, 96864, 122033, 125642, 115382, 95675, 68012, 79000, 98639, 150214, 133206, 81030, 54681, 82140, 113771, 97098, 79043, 106409, 142894, 148530, 130080, 124673, 94478, 52899, 4841, 35931, 59737, 85906, 82962, 77635, 94577, 134795, 128395, 107460, 49815, 52017, 79460, 63355, 99226, 99152, 64006, 128081, 175528, 155771, 146676, 143884, 140860, 158879, 124409, 106580, 93865, 122686]
8146A22686L187j2101Q193k2343J2340j842j0037k0374L0198K4401k3671J8253
8134A28890K6065O3551N9085R075J8867L3195l1649p2258l8310q272m7293j4720
8122A26226K7457k5221m9762K2647k7642k3254J3438K7565L8545m183Q501M206
8110A38523m8877J6391J2149j7280K4318M5070J6783j5655J4542J7173P223K6559
8098B36919m15l3172k1277j983k6408J373m0147J0058K6223L9590M9845M7516
8086B88122M0774L5687J14294Q2270M886l1052l5098o2993p6936m9625m178k5030
8074B81121J5084J9413J3615j8251m9219l7297K6577M1223O199j738o2711l9223
8062A94793k5368N195J7796M14Q219J0536j0481K4480r626J085j655j5418K1515
$$ y = [122686, 125873, 113772, 121965, 99622, 111962, 110120, 100083, 79709, 109907, 134308, 110637, 128890, 154955, 218506, 277591, 286666, 305533, 338728, 307079, 234821, 196511, 188239, 140946, 126226, 153683, 128462, 78700, 101347, 73705, 50451, 63889, 91454, 129999, 125816, 134317, 138523, 89646, 106037, 118186, 100906, 125224, 170294, 187077, 171422, 185964, 203137, 210360, 236919, 236504, 203332, 182055, 180072, 153664, 155037, 114890, 124948, 151171, 190761, 240606, 288122, 328896, 364583, 478877, 561147, 566033, 534981, 499883, 436890, 359954, 310329, 306151, 281121, 296205, 315618, 329233, 310982, 261763, 224466, 251043, 292266, 298465, 296727, 234016, 194793, 169425, 174620, 192416, 192830, 201049, 211585, 201104, 225584, 215958, 217043, 215388, 199970, 221485]
8049B21485M053K1874k7920j2587P396L1016O117L6304M1071J5560j1118M4254
8037C77505O8682M3424k1122P16m8142J7344J4546j0477l4549K9536K3469O1480
8025E22412K9491L2955O934p5808m9183k665K1309m3863l7288j156M4837R741
8013D57716l6060R591N391n345k338j0811L611q819J547r145j864K2130J8423
8000D44027K5567L9181m104k1375L882j6319J9402J7920M6122J7061M5400P7960
7988F94724L0157K8223J02170Q4366K1572L182q454n3163o7102n4161k1956l573
7976G55985m016p5761m311m22M592j0134l5242j2097J8921j6600k532J6219K6510
7963F61112N836l7622q013P5469J6328Q465J2313N7106N4521N3156M538K4792
$$ y = [221485, 225538, 247412, 219492, 206905, 214301, 245317, 251434, 287738, 328809, 344369, 333251, 377505, 446187, 489611, 468489, 469205, 421063, 438407, 452953, 442476, 407927, 437463, 460932, 522412, 551903, 584858, 591792, 515984, 466801, 464136, 485445, 441582, 404294, 403138, 447975, 457716, 421656, 431247, 436638, 431293, 428955, 418144, 421755, 412936, 414483, 405338, 403474, 425604, 444027, 469594, 508775, 504671, 483296, 487178, 470859, 490261, 508181, 554303, 571364, 616764, 694724, 724881, 753104, 855274, 939640, 961212, 964394, 955940, 902777, 835675, 781514, 759558, 755985, 751969, 676208, 671897, 671475, 676067, 665933, 630691, 618594, 637515, 620915, 618383, 634602, 661112, 666948, 629326, 621313, 696782, 713110, 721575, 733888, 790994, 845515, 898671, 903209, 928001]
7951I28001K4839q419Q742J3267N0147K6643J0131P350L3079K2074R291m3248
7939A081897J2220q723j8160k0997j8721j5149p111j5470M1026j4975q4937l6258
7927H94642j0506j4455M3274p144l3294l1189r466k0875l531K7034M6395O042
7915H86927K9319J5940O537l950J8307J8440j4631K0861J1412m3825J4773K1287
7903I81397r827j522l1768l275M6997J6916j0231k5823l9444k0519l2486j4927
7891H55488K6081k6633n1076j8255J1112j316j9866J8261K5365n2287l0958m3401
7879F92515k546J8748n010l3798l7249l434N460P283m0941m0125L395K3673J6026
7866F03997k0635k7357l0043l2844J2613K0164l3003m399j0845K7106K5499o397
$$ y = [928001, 952840, 944421, 953163, 966430, 1016577, 1043220, 1053351, 1060701, 1093780, 1115854, 1125145, 1081897, 1094117, 1085394, 1067234, 1046237, 1027516, 1012367, 1005256, 989786, 1030812, 1015837, 930900, 894642, 884136, 869681, 912955, 905811, 872517, 841328, 831862, 810987, 807456, 834490, 880885, 886927, 916246, 932186, 938723, 934773, 953080, 971520, 956889, 977750, 989162, 945337, 960110, 981397, 971570, 970048, 938280, 935005, 982002, 998918, 988687, 962864, 923420, 902901, 870415, 855488, 881569, 854936, 803860, 785605, 796717, 795401, 775535, 793796, 819161, 766874, 735916, 692515, 689969, 708717, 703707, 669909, 632660, 629226, 634686, 641969, 601028, 560903, 564298, 587971, 603997, 583362, 556005, 525962, 493118, 505731, 525895, 492892, 488493, 477648, 504754, 530253, 523856]
7854E23856K869p317j2265l3245j366k6701j9786k8541j4299j8508j8603k3915
7842C22179K5858J1354J966l0344k1523k8072K3585K2666K2590p890l0633k0535
7830B91201l2922J9330R434k5149m1497k7813j6340J5249P075j3870j8133j435
7818A65130p154J8429r394l243n5327k7820l642j9221P226j6722K5495p015K5260
7805I2002P504J7249J0778m428q023L1573j734m9955k8304R756l5370j6928P470
7792C1590J4998P175Pj5846j9194J1935Q844J4834j5422l6976L0805J3126r078
7779C6798k4705J7249M3817K1218K5341N70j2605L0802l3789m6957j930K2350
7767G8159n3319J0787L9763n211j1018Q601O54l0386j866O029Q24k0054j1674
$$ y = [523856, 526725, 519408, 507143, 473898, 472532, 445831, 426045, 397504, 383205, 364697, 346094, 322179, 348037, 359391, 361357, 331013, 309490, 281418, 305003, 327669, 350259, 342369, 311736, 291201, 258279, 277609, 287043, 261894, 220397, 192584, 176244, 191493, 198568, 184698, 166565, 165130, 157976, 176405, 167011, 163768, 108441, 80621, 76979, 57758, 64984, 48262, 73757, 66742, 92002, 99506, 116755, 127533, 123105, 115082, 146655, 144921, 94966, 66662, 76418, 41048, 24120, 31590, 46588, 53763, 53770, 37924, 18730, 30665, 39509, 54343, 38921, 1945, 32750, 45876, 36798, 12093, 29342, 73159, 94377, 119718, 120288, 107683, 138485, 104696, 57739, 55809, 78159, 24840, 35627, 75390, 70179, 59161, 67762, 68416, 38030, 36164, 42193, 43017, 22963, 11289]
7754A1289R92p401r164j7050L7606M4445p028j4621j1242k4763j0186P439J1841
7741A2157P342j5855Q678M0679J4151k9924r69j028M3497j7373m1549J9536M655
7728D3997m9872j4708k2172R974L2472R936m239N49o460l1160J665L4067n2553
7715d8504J883K6179J3516J3001K051o412K1774M0605m421j2227n24k2800J0922
7702C5043j2437k2093o595K7794K3204l2556l0700K3097j4636j0837j1474K1289
7690a0901Q1485m7450j3206L9538J5925j7734j04P159J8079k1096k3858k3613
7678D224m495j7993k57J2061j286q288K6622k6581l311K4695j106j0143J6389
7665A0531L3814N31k8104l2407j0169L6248J4433M2615j3582k6477p772k9857
$$ y = [11289, 12281, 4880, -4284, -21334, 16272, 60717, 53689, 39068, 27826, 3063, -7123, 316, 12157, 19499, 3644, 12322, 53001, 67152, 37228, 36259, 35231, 78728, 61355, 19806, 39342, 43997, -5875, -20583, -42755, -32781, -309, 9627, 5388, 5937, -523, -31683, -30018, 4049, -48504, -46621, -20442, -6926, 6075, 8126, 1714, 23488, 64093, 59672, 47445, 46921, 24121, 35043, 22606, 513, -6082, 21712, 44916, 12360, -18340, 4757, -9879, -20716, -32190, -10901, 70584, 23134, 9928, 49466, 65391, 47657, 47553, 54712, 72791, 51695, 27837, 4224, -271, -18264, -18521, -6460, -7746, -16034, 10588, -15993, -19304, 5391, 4285, -5858, 10531, 44345, 44876, 16772, -15635, -25804, 10444, 24877, 67492, 53910, 27433, 19661, -10196]
7653a0196n27k1092p560Q284P997J7519l2601l9718J1992K3461J7985k2677k6131
7640g3264K1211L2412L4972K226P942l1665Q140k4043k6292q083K6458J930m2585
7627g0641K7107j2792M939M9020J0204J385j6244l9663k5337K579K7397P331j4922
7614d9637K8828K1795M0585k0067k2889j0154J3768O688j6893j7751j3978K1328
7602a8377J4834j0120J3483j6958l4802j5161L6758L1559K9293k1446k339j4040
7590g316j1612l445k1032l87k74k2237J2056p883l904L5789K7134l967q783l1405
7576d7266j0800L1480M4238j0842K1673J3694j2265l7385k1311K5925L3400R617
7564D0158j5945j700j3171P325J998j3402K6206J3761m6487j2895K6750l0542
$$ y = [-10196, -10723, -31815, -39375, -31091, -23094, -5575, -38176, -77894, -65902, -42441, -24456, -47133, -73264, -52053, -19641, 15331, 17557, 25499, -6166, 1974, -22069, -48361, -56444, -29986, -28056, -70641, -43534, -56326, -51387, -2367, 7837, 9222, -7022, -46685, -72022, -69443, -42046, -34715, -49637, -20809, 986, 41571, 21504, -1385, -11539, 2229, 8917, -7976, -25727, -39705, -18377, -3543, -13663, -180, -17138, -51940, -67101, -30343, 1216, 30509, 9063, 6724, -7316, -18928, -22373, -43405, -43792, -44066, -66303, -54247, -62130, -66034, -30245, -3111, -7078, -15861, -47266, -58066, -26586, 17652, 6810, 28483, 42177, 29912, -7473, -28784, -2859, 30541, 40158, 24213, 22513, 9342, 16667, 18665, 5263, 31469, 45230, -1257, -14152, 12598, -17944]
7552a7944j9707J7864J9997l155k0860q172L7226M805n499p209r811M3758j1123
7539B0170k6978o085k1164k2447J104J8788K5490L842j0403K4810k899J9095l0741
7526g418p654J5261m983K666J2452j178K97k91J2179q665k9083L3254Q614j2194
7512A3257J4522j245k1708N639l6082l526K6805K3446O034R325k4357j6440L3680
7499B9350m3658j8363p481L7082N5242m668j6314k9843M626M87j6149J6860K0184
7486B7355J5917K8479j5796j3185j4110k3283m6266J6930K1815k9222k0164L3794
7474a7736K3796L683M5234K9785l1401l9097m5768j5776Q572P750l4287j350M691
7461f1904j6042q020j5236k3293M3322M5894L6208j2166R341k5076Q308o118k5532
$$ y = [-17944, -37651, -19787, 210, -2945, -23805, -31977, 5249, 10054, 4555, -2654, -12465, 31293, 20170, -6808, -12893, -34057, -56504, -55400, -36612, -11122, -7280, -17683, 7127, 4228, 23323, -7418, -15072, 189, -4794, -2128, 10324, 9146, 9443, 9152, 21331, 12666, -16417, 16837, 25451, 13257, 27779, 26534, 4826, 10465, -25617, -29143, -2338, 21108, 27142, 36467, 12110, -4330, 29350, -14308, -32671, -40152, -3070, 52172, 47504, 31190, 1347, 5973, 6460, -9689, 7171, 27355, 43272, 71751, 55955, 42770, 28660, 5377, -40889, -23959, -2144, -31366, -51530, -17736, 6060, 9743, 54977, 84762, 53361, 14264, -31504, -47280, -38708, -30958, -65245, -66595, -61904, -77946, -85966, -101202, -124495, -81173, -35279, 929, -11237, -1896, -26972, -18664, -24782, -50314]
7448e0314M4209K1097K8208r220j6372k596j0651o484m2672j3896K5159N553j5634
7435d3613m24p34K868L3915K8682K5846l0872m1306j3302J8053O5410j4807k2037
7422G679R20j5932j6320j154J8367P549m955o314P399o321j4440K2785N3129J4928
7408F7320n012j8012M442o603j9385l0717k6207j4964L5586J1459l8032k339J2733
7395b9731J8519k6214Q615O8871K625m4216k8537j1522L9083j5090o091M7081
7383B3393n136J6530k5007l3765k0562R39K5374J3886L1059J8521j2326n095j9015
7370H796J6935j0019j2670O687J9580O7857k0665j4745j9624p481n406m675n003
7357A9567k6611j9108j7538k4588k8751K3953K2291L023K4K113j774K0107K1114
$$ y = [-50314, -6105, 14992, 43200, 33980, 17608, 15012, 4361, -2123, -44795, -58691, -33532, -27979, -43613, -44037, -44771, -41903, -7988, 20694, 46540, 15668, -25638, -38940, -20887, 44523, 29716, 7679, 8599, -7333, -23653, -24807, -6440, 1109, -3846, -10160, -2761, -9082, -23522, -737, 52392, 67320, 62308, 44296, 48738, 42135, 22750, -7967, -34174, -49138, -13552, -2093, -40125, -42464, -29731, -11212, -37426, -28811, 40060, 42685, -1531, -30068, -41590, -2507, -17597, -23688, 23393, 18257, 34787, 9780, -23985, -44547, -43608, -18234, -4348, 26711, 45232, 32906, 27811, 8796, 25731, 15712, 3042, 9729, 29309, 97166, 76501, 61756, 42132, 34651, 29245, 24570, 19567, -7044, -26152, -43690, -68278, -97029, -73076, -50785, -47762, -47738, -45625, -47399, -27292, -6178]
7344f178L680Q170K3446k92m9022j8584L4875L2172r140j3498k3965m840j3948
7331c7124L7334K5627j2006K841k0471j4616r45k70J5451j8262P747l74j7609
7318c2677J5130J1363p945J4648j9470k3581o0203j9131P451K8018M2338K494
7306d1565k849J7603j8916j6019O204k1249k3555L9791M8138l586j9505j1201
7294d6709l7575Q943J4083L1755N7387l5950m5434K1875Q1784r349p3270p5026
7282a07486J2318M1059K9078N0085L7955l7609r820k6999m853J5320j9167o898
7270b7017J5336K5015j8661l394o418j3414k1258P199J3763j9546k7015M4174
7258c1236M415m7196k2202J4953K3389o72K2718M298n613L4520j3634k5496l3577
$$ y = [-6178, -2498, 5672, 29118, 28826, -20196, -38780, -3905, 28267, 19127, 5629, -18336, -23176, -37124, 210, 25837, 13831, 16672, -3799, -18415, -19360, -19630, -4179, -22441, -14694, -15068, -32677, -17547, -6184, -14129, 519, -18951, -42532, -102735, -121866, -114415, -86397, -44059, -41565, -44414, -26811, -45727, -61746, -55542, -76791, -100346, -60555, -12417, -16003, -35508, -46709, -84284, -75341, -61258, -29503, 27884, -8066, -53500, -31625, 50159, 40810, -32460, -107486, -95168, -54109, -25031, 25054, 63009, 25400, 15580, -11419, -16272, -952, -20119, -27017, -11681, 13334, -5327, -8721, -15139, -28553, -49811, -42612, -28849, -48395, -75410, -31236, -26821, -74017, -96219, -81266, -57877, -58549, -35831, -31533, -37146, -2626, -16260, -41756, -75333]
7245g5333J366q426J2836J5700J6588J3189M324M3K3702j2143J6012n986j1784
7232i912K088M4020J6218j1352n9894j3699k2961L0074p938l6205o770K1784n270
7219e9817l5862o900J7701L3445L7654J0893k5610L176o287J552L56r031L3041
7206e689J8577r807L092j911k5378k2627j233J3728J1049K756J7451r661N89K0471
7192A1407k7318l9802J3367J4855j0420j5263M830J4782j9987j2007J1273J9854
7180c4429j7633j2677J2785J7785K7848L9316l6493k1801K6419L0738J8717M4086
7168I4661Q046l0253k1862l4596j3238n7485N23K3551L766K21o109P123k0996
7155d6648j053J2867K9112O89J7964M166K8241k1993m587j5798P413R901j4166
$$ y = [-75333, -73967, -82393, -69557, -53857, -37269, -24080, -19756, -19713, 3989, -8154, 7858, 1872, -9912, -7824, 36196, 52414, 41062, -18832, -32531, -55492, -25418, -33356, -69561, -76331, -54547, -59817, -95679, -102579, -84878, -51433, -13779, -2886, -28496, -25320, -31607, -30055, -29699, -38730, -5689, 12888, 3081, 6173, 4262, -21116, -43743, -44976, -31248, -20199, -17443, 8, -9653, -9064, 11407, -15911, -55713, -42346, -27491, -37911, -53174, -48344, -33562, -53549, -65556, -54283, -34429, -52062, -64739, -51954, -34169, -6321, 32995, -3498, -25299, 1120, 31858, 50575, 94661, 102707, 72454, 50592, 15996, 2758, -54727, -54204, -30653, -26887, -26666, -32775, -25652, -46648, -47701, -34834, -5722, -5033, 12931, 17097, 45338, 23345, 18758, 2960, 10373, 20274, 6108]
7142F108m0731K461K2225j0032J8596L4638J2646p212j3427j0785j7220j5085
7130a7818l7749r397O118L804k3912n233K5320K1525K9769M7548j3510n985P357
7117B7837l4523n3415j215J5214k6384K189J5294M127Q333J6746j1037p510k3744
7104f8088K3814K4519q248P291p348l1303R454K161J5182K465O519O92k0362o155
7090d9407J1727K0452j0268j2859Q650J1834K7294K5837l9510k6651j0976J1370
7078c2507N690L519m0729p195M8066o395j9313k5950R765M8268k116l9691k5255
7065h3843M578L4527K6417k7261N619J9653o657P569J8139j7200j2417J5897K1641
7052F662P849k7495j8990l4034l5297k6091J8980L7412k133J2675k7849R127j4965
$$ y = [6108, -34623, -32162, -9937, -19969, -1373, 33265, 45911, 38699, 25272, 14487, -2733, -17818, -55567, -64964, -58846, -55042, -78954, -84187, -58867, -37342, -7573, 39975, 26465, 20480, 27837, -6686, -60101, -61316, -46102, -72486, -70297, -55003, -50876, -42543, -25797, -36834, -44344, -68088, -44274, -19755, -28003, -20712, -28060, -59363, -49909, -47748, -32566, -30101, -23582, -22890, -43252, -49407, -37680, -17228, -27496, -40355, -31705, -19871, 7423, 33260, -6250, -32901, -43877, -32507, -26817, -23298, -64027, -71222, -23156, -29551, -48864, -74814, -65049, -16781, -18897, -58588, -83843, -79265, -44738, -18321, -45582, -39963, -20310, -26967, -19398, -1259, -18459, -30876, -14979, 6662, 14511, -12984, -31974, -66008, -101305, -127396, -108416, -71004, -73137, -60462, -88311, -79184, -94149]
7039i4149l443K5207j460m8380L8666K0880L9832M8070j830k0915k2812P585k7058
7026c9807k3406K5427J3403j8391J8651l7726q938M082j6340j6374K3248l836
7014h0007O579N1247K1091L44k524j7074k2855K2209k948K6832j236j6527k9017
7001d3886k9051J5295J6581j1573k992M3007Q451j6731J2082P691l8881Q503J2717
6988a8787l600N348K3067o070k594j3406j331J4697M6514j3414Q632k4765k5915
6975a1624k0074m1919q733l6093N917N9381N0724p789l7333p811L5499K6238j6230
6962i847k0763j9018J454l7213J9021J160k7305M4171L2671Q716j164K0585K3622
6949C6090j4670m6148j7260l0307k1230J2585L6682M747K3830k9048k2577J3180
$$ y = [-94149, -97592, -72385, -73845, -122225, -83559, -62679, -22847, 25223, 23393, 2478, -20334, -12749, -39807, -63213, -37786, -24383, -42774, -24123, -61849, -70787, -66705, -83045, -99419, -76171, -80007, -73428, -22181, -1090, -746, -3270, -20344, -43199, -20990, -23938, 2894, 1658, -14869, -43886, -72937, -57642, -41061, -52634, -55626, -12619, -4168, -20899, -8817, -1126, -40007, -31504, -18787, -22387, -17039, 6028, -42, -2636, -16042, -17373, -2676, 43838, 30424, 39056, 14291, -11624, -31698, -73617, -82350, -118443, -112526, -53145, -2421, -10210, -47543, -55354, -19855, 6383, -9847, -30610, -49628, -48174, -85387, -66366, -65206, -92511, -48340, -15669, -6953, -8117, 12468, 36090, 21420, -24728, -41988, -72295, -93525, -80940, -44258, -39511, -15681, -44729, -67306, -54126]
6937e4126J2786Q941j2461K7439m381q809L1539K244J2053N708k9137K4243j3571
$$ y = [-54126, -41340, -32399, -44860, -17421, -21802, -30611, 928, 3172, 15225, 20933, -8204, 16039, 2468]
$$ [...]
##END NTUPLES=NMR SPECTRUM
##END=
