##TITLE=Analysis number 312203
Compound Code cc 38504
Book Reference 335/190
Project Code adrs
Chemist Name davee
##JCAMPDX= 6.0         $$ Bruker NMR JCAMP-DX V2.0
##DATA TYPE= NMR SPECTRUM
##DATA CLASS= NTUPLES
##ORIGIN= Bruker BioSpin GmbH
##OWNER= NMR
$$ XWIN-NMR		Version 3.5
$$ Thu Jul 28 11:05:22 2005 GMT Daylight Time (UT+1h)  MAYBRIDGE\NMR@NMR_250MHZ
##.OBSERVE FREQUENCY= 250.131544655141
##.OBSERVE NUCLEUS= ^1H
##.ACQUISITION MODE= SIMULTANEOUS (DQD)
##.ACQUISITION SCHEME= undefined
##.AVERAGES= 16
##.DIGITISER RES= 18
##SPECTROMETER/DATA SYSTEM= dpx250
##.PULSE SEQUENCE= zg30
##.SOLVENT NAME= CDCl3
##.SHIFT REFERENCE= (INTERNAL, CDCl3, 0, 16.4432)
##AUDIT TRAIL= $$ (NUMBER, WHEN, WHO, WHERE, WHAT)
$$ ##TITLE= Audit trail, XWIN-NMR		Version 3.5
$$ ##JCAMPDX= 5.01
$$ ##ORIGIN= Bruker BioSpin GmbH
$$ ##OWNER= NMR
$$ C:\u/data/dgb/nmr/ADRS/6740/pdata/1/auditp.txt
$$ ##AUDIT TRAIL=  $$ (NUMBER, WHEN, WHO, WHERE, WHAT)
(   1,<2005-07-28 11:05:02.07 +100>,<MAYBRIDGE\NMR>,<NMR_250MHZ>,
      <created by zg, POWCHK disabled, PULCHK disabled
       configuration hash MD5:
       62 19 C7 07 E1 42 D1 B7 37 6C 3D D0 77 39 F9 E6
       data hash MD5: 64K
       5B 74 91 7C 86 B9 C6 7A B8 C3 2E 9B 98 B0 08 48>)
(   2,<2005-07-28 11:05:14.25 +100>,<MAYBRIDGE\NMR>,<NMR_250MHZ>,
      <Start of raw data processing
       ef LB = 0.3 FT_mod = 6 PKNL = 1 SI = 32K 
       data hash MD5: 32K
       69 3D 59 50 B1 B1 ED 83 4E E1 15 43 B6 D0 58 E3>)
(   3,<2005-07-28 11:05:16.06 +100>,<MAYBRIDGE\NMR>,<NMR_250MHZ>,
      <apk 
       data hash MD5: 32K
       57 F9 58 1A C2 0B 39 35 3F D3 F3 2E DD 79 C6 71>)
(   4,<2005-07-28 11:05:16.75 +100>,<MAYBRIDGE\NMR>,<NMR_250MHZ>,
      <abs ABSG = 5 
       data hash MD5: 32K
       46 DC 22 EE AC 18 9F 26 6C 14 30 61 A9 F3 3A FD>)
$$ ##END=
$$ 
$$ hash MD5
$$ E1 02 F5 FD 51 A5 08 BA AE F4 DA 15 7B E9 C1 F4
##$RELAX= 
##$RELAX= 
##$RELAX= 
##$RELAX= 
##$RELAX= 
##$RELAX= 
##$RELAX= 
$$ Bruker specific parameters
$$ --------------------------
##$DU= <C:\u>
##$EXPNO= 6740
##$NAME= <ADRS>
##$PROCNO= 1
##$TYPE= <nmr>
##$USER= <dgb>
##$AMP= (0..31)
100 100 100 100 100 100 100 100 100 100 100 100 100 100 100 100 100 100 
100 100 100 100 100 100 100 100 100 100 100 100 100 100 
##$AQSEQ= 0
##$AQ_mod= 3
##$AUNM= <au_zg>
##$AUTOPOS= <40 >
##$BF1= 250.13
##$BF2= 250.13
##$BF3= 250.13
##$BF4= 250.13
##$BF5= 500.13
##$BF6= 500.13
##$BF7= 500.13
##$BF8= 500.13
##$BYTORDA= 1
##$CFDGTYP= 0
##$CFRGTYP= 5
##$CHEMSTR= <none>
##$CNST= (0..31)
1 1 145 1 1 1 1 1 1 1 1 1 1 1 1 1 1 1 1 1 1 1 1 1 1 1 1 1 1 1 1 1 
##$CPDPRG= <>
##$CPDPRG1= <>
##$CPDPRG2= <>
##$CPDPRG3= <>
##$CPDPRG4= <mlev>
##$CPDPRG5= <mlev>
##$CPDPRG6= <mlev>
##$CPDPRG7= <mlev>
##$CPDPRG8= <mlev>
##$CPDPRGB= <>
##$CPDPRGT= <>
##$D= (0..31)
0 1 0 0 0 0 0 0 0 0.06 0 0 0 0 0 0 0.0002 0 0 0 0 0 0 0 0 0 0 0 0 0 0 
0 
##$DATE= 1122545101
##$DBL= (0..7)
120 120 120 120 120 120 120 120 
##$DBP= (0..7)
150 150 150 150 150 150 150 150 
##$DBP07= 0
##$DBPNAM0= <>
##$DBPNAM1= <>
$$ [...]
##$SUBNAM7= <"">
##$SUBNAM8= <"">
##$SUBNAM9= <"">
##$SW= 20.6930455092707
##$SWIBOX= (0..15)
0 0 3 0 0 0 0 0 0 0 0 0 0 0 0 0 
##$SW_h= 5175.983436853
##$TD= 65536
##$TD0= 1
##$TE= 296.16
##$TE2= 300
##$TE3= 300
##$TEG= 300
##$TL= (0..7)
0 120 120 120 120 120 120 120 
##$TP= (0..7)
150 150 150 150 150 150 150 150 
##$TP07= 0
##$TPNAME0= <>
##$TPNAME1= <>
##$TPNAME2= <>
##$TPNAME3= <>
##$TPNAME4= <>
##$TPNAME5= <>
##$TPNAME6= <>
##$TPNAME7= <>
##$TPOAL= (0..7)
0.5 0.5 0.5 0.5 0.5 0.5 0.5 0.5 
##$TPOFFS= (0..7)
0 0 0 0 0 0 0 0 
##$TUNHIN= 0
##$TUNHOUT= 0
##$TUNXOUT= 0
##$USERA1= <user>
##$USERA2= <user>
##$USERA3= <user>
##$USERA4= <user>
##$USERA5= <user>
##$V9= 5
##$VALIST= <valist>
##$VCLIST= <CCCCCCCCCCCCCCC>
##$VD= 0
##$VDLIST= <DDDDDDDDDDDDDDD>
##$VPLIST= <PPPPPPPPPPPPPPP>
##$VTLIST= <TTTTTTTTTTTTTTT>
##$WBST= 1024
##$WBSW= 4
##$XGAIN= (0..3)
0 0 0 0 
##$XL= 0
##$YL= 0
##$YMAX_a= 289043
##$YMIN_a= -398505
##$ZGOPTNS= <>
##$ZL1= 120
##$ZL2= 120
##$ZL3= 120
##$ZL4= 120
##$ABSF1= 16.44318
##$ABSF2= -4.249992
##$ABSG= 5
##$ABSL= 3
##$ALPHA= 0
##$AQORDER= 0
##$ASSFAC= 0
##$ASSFACI= 0
##$ASSFACX= 0
##$ASSWID= 0
##$AUNMP= <proc_1d>
##$AZFE= 0.1
##$AZFW= 0.1
##$BCFW= 0
##$BC_mod= 0
##$BYTORDP= 0
##$COROFFS= 0
##$CY= 12.5
##$DATMOD= 1
##$DC= 0
##$DFILT= <>
##$DTYPP= 0
##$F1P= 14.0000005364418
##$F2P= -0.99999901652339
##$FCOR= 0.5
##$FTSIZE= 32768
##$FT_mod= 6
##$GAMMA= 0
##$GB= 0
##$INTBC= 1
##$INTSCL= 1
##$ISEN= 128
##$LB= 0.3
##$LEV0= 0
##$LPBIN= 0
##$MAXI= 10000
##$MC2= 0
##$MEAN= 0
##$ME_mod= 0
##$MI= 0
##$NCOEF= 0
##$NC_proc= -5
##$NLEV= 6
##$NOISF1= 0
##$NOISF2= 0
##$NSP= 0
##$NTH_PI= 0
##$NZP= 0
##$OFFSET= 16.44318
##$PC= 1
##$PHC0= -83.55596
##$PHC1= 4.896153
##$PH_mod= 1
##$PKNL= yes
##$PPARMOD= 0
##$PSCAL= 4
##$PSIGN= 0
##$REVERSE= no
##$SF= 250.130019714925
##$SI= 32768
##$SIGF1= 0
##$SIGF2= 0
##$SINO= 400
##$SIOLD= 32768
##$SREGLST= <1H.CDCl3>
##$SSB= 0
##$STSI= 32768
##$STSR= 0
##$SW_p= 5175.98343685301
##$SYMM= 0
##$S_DEV= 0
##$TDeff= 65536
##$TDoff= 0
##$TI= <Analysis number 999999
Compound Code 99
Book Reference 9
Project Code 9>
##$TILT= no
##$TM1= 0
##$TM2= 0
##$TOPLEV= 0
##$USERP1= <user>
##$USERP2= <user>
##$USERP3= <user>
##$USERP4= <user>
##$USERP5= <user>
##$WDW= 1
##$XDIM= 32768
##$YMAX_p= 508505784
##$YMIN_p= -236782
$$ End of Bruker specific parameters
$$ ---------------------------------
##NTUPLES= NMR SPECTRUM
##VAR_NAME=  FREQUENCY,     SPECTRUM/REAL,   SPECTRUM/IMAG
##SYMBOL=    X,             R,               I
##VAR_TYPE=  INDEPENDENT,   DEPENDENT,       DEPENDENT
##VAR_FORM=  AFFN,          ASDF,            ASDF
##VAR_DIM=   32768,         32768,           32768
##UNITS=     HZ,            ARBITRARY UNITS, ARBITRARY UNITS
##FACTOR=    0.157963299565203, 1,           1
##FIRST=     4112.93295864414, 0,            0
##LAST=      -1063.05047820887, 0,           0
##MIN=       -1063.05047820887, -236782,     0
##MAX=       4112.93295864414, 508505784,    0
$$ Real data points
##PAGE= N=1
##DATA TABLE= (X++(R..R)), XYDATA
$$ [...]
19417 148 54674 96494 9255 -7241 -18889 9650 -6050 -31958 -13798 -39531 -28733 -74978
19405 -74978 -26811 33141 60777 71409 71327 56265 44765 42882 31210 -35851 -68122 -25776
19393 -25776 21941 31351 -19858 -10624 10150 46905 64551 11113 23469 57161 86934 71228
19381 71228 43624 46649 59309 47411 55134 22116 -16366 28559 44619 42428 29908 -21240
19369 -21240 -7209 -828 -11023 31148 95239 79951 50192 -12410 11260 -14391 -11962 34281
19357 34281 70803 57264 73253 35198 -659 -4753 9009 38757 30962 67008 76312 22941
19345 22941 -35604 -11427 57382 96839 82826 14401 9678 -5477 -15507 -23656 -9097 25920
19333 25920 47173 18479 52169 17406 -26183 4112 26475 27706 22183 -29338 -38450 -64537
19321 -64537 -84240 -69023 -81462 -78208 -54129 -45994 -79291 -96347 -80636 -32742 -83781 -140016
19309 -140016 -105195 -25594 27187 22205 -20823 -8266 10341 -14109 -32246 -45889 -64423 -7211
19297 -7211 45728 51723 59293 72714 61927 56364 -6466 -15662 23057 7299 -27436 -62292 -105149
19284 -105149 -72675 -61713 -73853 -69393 -7079 40666 16958 -19578 1489 31550 23427 -10210
19272 -10210 -15909 12994 30979 -17789 -5868 -24728 -27678 -1028 18914 -3812 -35383 -39521
19260 -39521 -15841 -21104 -64354 -57334 -46661 -27690 -40512 -66941 -79218 -52518 -37206 -31076
19248 -31076 -801 7009 6190 18722 30733 29386 31546 34071 59800 8936 -59671 -56410 -39497
19235 -39497 -32231 -40620 -43266 -51564 -53150 -25431 -38115 7210 -25972 -69483 -53902 495 26349
19222 26349 -19946 -37971 27041 61661 -7594 -46283 -43599 -18399 -3321 -742 -5180 -50049
19210 -50049 -70211 -73378 -38792 -20257 -25152 -42177 -24318 15401 14991 28183 22580 4146 -44711
19197 -44711 -36505 5534 -11502 -36000 -99032 -123316 -78766 -32338 1707 15693 16038 21209
19185 21209 8617 38802 38913 -7876 -13889 -21215 -52321 -28996 -60193 -81639 -55446 13190
19173 13190 -7219 -63226 -48976 -14012 7145 -23539 -65222 -31867 -11535 -31170 -58822 -82397
19161 -82397 -38874 -4970 -37310 -43712 -80853 -51380 -25640 2942 13494 -53060 -101311 -48442
19149 -48442 -14732 -46184 -77725 -76407 -48235 -43020 -77201 -68891 -66655 -38783 -28083 -33414 -25871
19136 -25871 -37365 -19988 -15342 -9004 -46590 -46497 -84403 -110322 -140923 -98278 -65715 -56672 -59290
19123 -59290 -25574 -17189 -33266 -14121 39408 47319 64616 72622 43354 -5570 -15228 -22471 -68712
19110 -68712 -37456 -60182 -51659 303 42955 22368 -47105 -51717 -74929 -47204 -8388 4577
19098 4577 56240 47875 42717 65978 37878 14358 38289 61322 14478 -82807 -121454 -67130
19086 -67130 -6399 -47532 -95732 -99478 -116642 -92000 -47981 -38237 21775 43779 44650 68625
19074 68625 96093 63388 -24963 -46215 -30017 1085 -35926 -15827 50724 112917 105794 72677
19062 72677 51881 26079 -11055 -21866 7554 46904 64183 -3570 -13305 -12585 13342 44521
19050 44521 45265 12272 -18296 -75440 -76162 -69843 -63261 -57942 -4993 27544 12212 -49346 -102154
19037 -102154 -71081 -27789 -48349 -126320 -147731 -86627 -98983 -130320 -45399 57996 -28853
19026 -28853 -73675 -67457 -55196 -30914 -4482 54345 63032 47028 24990 -13871 -64342 -86479
19014 -86479 -37292 -43276 -52919 -17684 4477 -7480 11741 -31141 -27341 5214 89 -56601
19002 -56601 -60439 6104 31317 39775 54300 18630 -4182 -6605 24270 29266 15564 42945
18990 42945 19965 10701 23026 23508 8961 2147 -9559 12183 21191 8762 -13312 -59590 -60862
18977 -60862 -41879 -4712 -57821 -17840 -24377 -61677 -49463 5956 -23962 -19782 45385 29271
18965 29271 42482 61043 63303 53011 42233 33874 35637 24842 30168 41525 93483 65581
18953 65581 108423 102513 4541 -22345 -748 -16190 -18020 -8274 -917 36200 33471 -74735
18941 -74735 -100972 -35446 37801 44445 21344 -66435 -83040 -53971 -34661 -41367 3123 4326
18929 4326 -1640 35711 62182 9779 -16762 6463 -12751 -27524 -41722 -81972 -111045 -83151
18917 -83151 -70621 -91937 -100747 -75317 -59778 -33201 -46380 42484 60607 16128 4607 -35823
18905 -35823 -50483 -34367 -26003 -26586 -59554 -67156 -86410 -57405 -31350 -3474 30204 -13113
18893 -13113 -921 16192 3753 18896 13562 1782 31696 38907 27784 -10455 -50394 -60028
18881 -60028 -50465 -71606 -85952 -74412 -96410 -88530 -14146 -10813 -29723 -23136 -20203 30540 -27124
18868 -27124 -96857 -81906 -52918 -6569 26141 -21061 -15615 18438 25069 10101 41049 15151
18856 15151 49530 32464 -974 39381 40949 12298 15679 39711 40914 38493 48342 17314 -8318
18843 -8318 -5172 8651 -30937 -3832 79790 125682 106741 56955 -6244 -7727 -15389 -65590
18831 -65590 -53634 20805 50462 121585 178875 223682 251814 325732 416230 474593 475996 496429
18819 496429 455857 388777 345284 274389 210266 144276 127600 110302 97093 36485 19160
18808 19160 64986 83039 78649 29030 56452 32218 11966 -1362 10368 15723 1642 38676
18796 38676 37040 8898 30342 81109 117166 81079 105870 115384 126513 124656 125123 147568 125303
18783 125303 63013 99986 97872 106412 201646 307812 407849 485738 586017 688293 730816
18772 730816 778246 772874 771980 788376 853141 951632 1023687 981141 897305 687735 496512 339797
18760 339797 262774 235620 127990 72240 74972 45017 10086 68713 36294 36615 71656 66188
18748 66188 64583 41534 74131 85208 159956 215787 140107 111285 93143 73688 -12949 14264
18736 14264 41364 43815 36342 48457 102559 72841 88773 123037 119869 189079 312756 354281
18724 354281 412674 515891 593098 605828 563623 487740 363869 228579 198758 143904 89139
18713 89139 84955 106818 49347 16912 7196 -59521 -58946 8168 60966 66607 24673 -35937 -25693
18700 -25693 -50481 -91130 -67565 -30481 -9946 -35860 -35304 -14786 31928 24827 63131 52961
18688 52961 51712 103690 96337 84777 123034 141492 131610 93294 44718 34962 7945 -15842
18676 -15842 -16030 -17322 -63402 -93839 -49150 -30817 -27818 -58725 -112609 -149856 -101450 -83583
18664 -83583 -41723 20895 13465 54103 80891 73907 22445 -37393 -40367 2165 -1824 -3413 -5964
18651 -5964 35562 125064 92637 46975 28689 13335 -25082 45658 94282 46424 19274 42332
18639 42332 29418 47702 84725 88222 71650 94323 123638 100769 94421 109374 137872 145871
18627 145871 172988 172999 171788 180580 168666 201855 199537 197851 177566 150460 138881 172647 140017
18614 140017 127952 157304 125804 127321 185051 201927 199219 151935 132119 166837 192622 149579
18602 149579 98047 94129 103695 177196 270167 343408 326475 289636 285277 245735 185961 127299
18590 127299 129844 205966 253980 258493 219459 242118 265746 358358 444522 410915 399900 438253
18578 438253 394803 369472 380487 380072 372227 366978 318264 252471 221853 250958 196772 154022
18566 154022 147987 123967 155983 166980 150397 192952 235736 214449 174268 113152 76769 66572
18554 66572 101315 149725 151605 172858 207248 210271 173453 175470 178664 163413 178310 231190
18542 231190 213762 187063 265111 265303 225190 159822 176509 210949 250908 267739 246707 234383
18530 234383 248859 260231 276666 255717 228633 220408 251626 250073 215779 206355 190568 160416
18518 160416 225467 223340 194347 123029 146646 116069 65667 39970 54882 55352 94255 107626
18506 107626 64509 80111 75385 63412 41450 46893 59777 23827 15845 33572 69812 86359
18494 86359 105914 112619 96015 104392 108020 80614 55508 43440 65200 10954 -3209 24536
18482 24536 14992 19499 57035 94604 85401 80567 73863 57632 25859 22733 44589 50575 39707
18469 39707 21370 -7324 5438 49450 126728 170071 216329 300091 354835 394544 374438 344421
18457 344421 347610 384232 390029 350627 363781 438605 463280 442804 458771 519519 555290 541722
18445 541722 525280 476107 488684 401434 306043 259249 237744 202537 212913 229526 221390 227993
18433 227993 181612 142346 180548 162143 139277 111867 98608 141151 192348 208657 185921
18422 185921 222460 226853 206609 254180 289574 304917 395883 481443 563163 582188 610555 657305
18410 657305 660422 649261 728179 799459 854196 887320 918766 1004028 1064625 1168292 1212267
18399 1212267 1231525 1265317 1251964 1165049 1031204 918783 818566 692903 558844 432120
18389 432120 318190 304408 365176 380415 429264 525427 536539 472231 428492 422312 369333
18378 369333 339499 342434 352703 348477 305369 295520 352390 344705 339665 356949 375962 383650 431137
18365 431137 441758 428128 394657 421457 431868 485618 553566 603628 633451 655205 681633
18354 681633 733154 829023 987392 1248917 1545528 1808035 2026550 2192966 2310546 2287664
18344 2287664 2168373 1972151 1820280 1801929 1802849 1839982 2020344 2201992 2360579 2603737
18334 2603737 2976084 3417122 4058167 4894956 5997174 7522546 9692252 12950907 18059323
18325 18059323 26079321 37587732 51203364 64789741 75530717 79752025 77218985
18318 77218985 68439936 55587684 42508724 31158747 22554036 16610947 12591980 9831777
18310 9831777 7888564 6514189 5492060 4766333 4250465 3939465 3794667 3705809 3750013
18301 3750013 3916826 4157173 4432560 4698750 4972314 5192684 5305134 5433757 5484363 5502672
18291 5502672 5461710 5411205 5505273 5771379 6275697 6975868 7881172 9176170 10946614 13462741
18281 13462741 17055949 22344634 30396530 42754141 59913334 79966329 100681798
18274 100681798 118904399 131642503 139731307 142330093 140417025 135206666 125030722
18267 125030722 111075024 93548836 74152703 56362276 41613999 30584300 22952531
18260 22952531 17738861 14061278 11346478 9440550 8089677 7060786 6346668 5893433
18252 5893433 5673346 5699558 5853069 6054297 6177926 6260803 6218609 6120080 5919881 5661556
18242 5661556 5433897 5284110 5224758 5209650 5300257 5547830 5936469 6510127 7280811 8313606
18232 8313606 9562025 11215142 13628997 17216456 22634012 31059059 44115540 61956653
18224 61956653 81951466 100978782 114143494 117164787 110666354 95549313 76114718
18217 76114718 57370068 41667876 30092959 22205953 16799291 13133667 10566616 8687371
18209 8687371 7201074 6009850 5071393 4366925 3833285 3425910 3072708 2787997 2652655
18200 2652655 2598041 2684204 2799614 2872242 2818068 2689341 2495650 2237704 2017394 1808895
18190 1808895 1565180 1418842 1379901 1335572 1264025 1211621 1176332 1112083 1078476 1037310 993174
18179 993174 1021878 1043587 1046443 1044840 1064788 1109802 1219630 1370829 1427344 1467468 1541876
18168 1541876 1494800 1423809 1320149 1170971 1063695 995287 881481 782098 754802 743371
18158 743371 734132 676118 711914 836091 885216 918359 993456 1026377 1117633 1211725 1398875
18147 1398875 1593013 1841616 2142442 2400931 2454153 2348660 2115269 1878352 1679391 1461398
18137 1461398 1300495 1154441 1038339 956084 1058715 1138540 1230033 1325159 1429870 1482926
18127 1482926 1535329 1699919 1911784 2047297 2235015 2408533 2666158 3004946 3386128 3934929
18117 3934929 4667000 5664469 7024694 8822844 11433338 15622577 22936565 36370612
18109 36370612 59920414 89582996 103788553 97487356 80146133 56557288 36999072
18102 36999072 24572351 17182694 12734557 9965949 8301192 7434160 7091766 6959704
18094 6959704 6853599 6642950 6263145 5568311 4750438 3862475 3146389 2631660 2291113
18085 2291113 2072858 1918531 1856646 1794192 1656338 1581882 1510320 1437277 1348498 1280886 1328650
18074 1328650 1396443 1468931 1441269 1446009 1484002 1485568 1505831 1436689 1414005 1409608 1419053 1350207
18062 1350207 1323856 1348170 1333391 1297518 1337091 1377917 1474954 1639591 1751107 1857965 1899835
18051 1899835 1872046 1808950 1813756 1924729 2012559 2168042 2515009 2991170 3448249 3739763
18041 3739763 3829427 3775031 3683951 3586673 3525867 3504841 3437426 3289028 3141688 2981495 2736401
18030 2736401 2548755 2375363 2270626 2252122 2285160 2306403 2259553 2140730 2087835 1997799
18020 1997799 1973467 1937787 1895811 1880989 1869497 1822672 1675523 1549948 1517681 1451974 1369499
18009 1369499 1364957 1387436 1388021 1434286 1468129 1533840 1572096 1594014 1579265 1590272 1578804 1679587
17997 1679587 1741031 1817785 1926485 2113039 2382593 2760452 3210721 3680294 4100180 4478865
17987 4478865 4843349 5111361 5243227 5265213 5230799 5112777 5059566 4934387 4724594 4474706
17977 4474706 4215856 3958393 3729733 3556091 3391077 3174419 3018597 2954062 2939342 2950138
17967 2950138 3016360 3178225 3342496 3567511 3815572 4075968 4385645 4721011 5023126 5396314
17957 5396314 5882806 6472379 7194453 8070219 9141067 10516489 12339508 15023203 19247052
17948 19247052 25659857 34725686 46026437 57488235 66570324 71978646 74624523 77135964
17940 77135964 82005886 90147245 100078099 109127159 114873501 115980588 112062068 104597603
17932 104597603 96489549 90556192 88075484 87666800 86047892 80431046 70434620 57897266
17924 57897266 45283738 34574824 26488937 20809496 16956521 14304164 12465151 11215744
17916 11215744 10320053 9649559 9234404 9001938 8881911 8801383 8737680 8795551 8995070 9378071
17906 9378071 9990424 10967109 12324572 14432897 17851064 23071822 30379962 39289868
17898 39289868 48097230 54687745 58118701 59332095 60493517 63620094 69451839 76833182
17890 76833182 83732530 88376382 89424790 86393602 80404535 73788490 68865062 66829793
17882 66829793 66359439 64881779 60471412 52861685 43451852 34167206 26343558 20438254
17874 20438254 16343697 13449567 11379237 9886662 8744326 7827831 7157179 6608033
17866 6608033 6137130 5770018 5466437 5220250 4869109 4445974 4048654 3675542 3314641
17857 3314641 3096941 2906568 2750369 2711942 2668528 2629245 2606142 2559460 2539463 2539163 2493985
17846 2493985 2479991 2467554 2417174 2315607 2156782 2045360 2050962 2107850 2165450 2190265 2217167
17835 2217167 2229198 2218377 2186875 2138463 2112206 2078116 2029923 2032523 1991496 1943241 1965264
17824 1965264 2052053 2153283 2161465 2129957 2060224 1945599 1721294 1494344 1308185 1163598
17814 1163598 1141911 1168639 1177286 1180334 1258894 1317874 1362793 1350895 1313152 1251154 1135196
17803 1135196 1050334 961095 870433 822683 805897 819094 836501 842328 821250 789310 755259
17792 755259 753036 762032 788440 825012 889391 942834 989746 1040174 1022728 1060135 1106614 1141578
17780 1141578 1157170 1129792 1130961 1158063 1093434 1056091 1054669 1096926 1143950 1271948 1334408
17769 1334408 1419302 1566446 1720725 1914950 2045995 2157270 2326879 2573111 2833051 3138897
17759 3138897 3462507 3857872 4270244 4773263 5360427 5844320 6226118 6590860 6939214
17750 6939214 7459444 8148848 8971809 10192682 11813013 13860657 16638718 20476602 26129909
17741 26129909 34384615 45812460 59915610 75115444 89068537 99219408 103780990
17734 103780990 102399995 96895478 90232663 85779916 85800290 90489692 98111217 106187532
17726 106187532 112542240 116041469 117426294 118613591 121041643 124923549 128750065 130383129
17718 130383129 127976880 121076739 111298416 101623295 95151789 93753784 97062028 102616704
17710 102616704 107006620 107400123 102321215 91891604 77944132 62961857 49245627
17703 49245627 37971163 29556719 23636685 19616862 16829754 14843858 13322935 12006134
17695 12006134 10820740 9709539 8695218 7743656 6905048 6129973 5398545 4768996 4229364
17686 4229364 3757121 3406579 3124975 2871388 2655818 2489179 2390376 2274407 2101014 1960839
17676 1960839 1858646 1798607 1739196 1709590 1686286 1663482 1610066 1538076 1470155 1475282 1458661
17665 1458661 1403511 1337976 1291859 1218269 1163272 1195073 1150244 1097150 1049707 1024248 1008559
17654 1008559 987760 1010729 1027617 956808 882321 800891 762972 788009 787029 712869 686050 652570
17642 652570 694127 710981 729430 792431 780117 726893 768065 767916 767933 797439 847631 882547
17630 882547 951289 1039727 1112933 1114304 1166729 1266393 1303250 1307022 1330057 1385224 1433386 1468084
17618 1468084 1463056 1443033 1473205 1492977 1542759 1599102 1566936 1515246 1460252 1430556 1432500 1421870
17606 1421870 1318391 1269409 1240466 1177259 1129303 1084656 1028090 994680 981811 924311 833527
17595 833527 770114 731117 696869 641020 607401 575608 546661 556714 551682 503817 472030 457450
17583 457450 455146 444717 431178 444617 413738 356160 328981 347309 359464 426073 403113 367616
17571 367616 353566 396506 357166 353147 333380 332411 319636 328819 355420 375566 371043 405422
17559 405422 455587 477575 486427 515205 594728 658414 625721 615146 633044 631789 663110 711121
17547 711121 747075 720254 698917 688946 735207 703499 687585 685130 657082 629356 630744 609444
17535 609444 628527 608806 579863 552598 529579 544553 548686 614985 644314 668457 618743 579250
17523 579250 504469 496865 563689 642779 717811 840956 937072 1049207 1151236 1164460 1171896
17512 1171896 1189032 1207898 1226322 1247521 1230599 1219368 1182551 1124542 1153245 1191208 1194110
17501 1194110 1160718 1140780 1061898 1026387 979216 913523 844797 828245 821527 821030 775402 727430
17489 727430 724906 709671 630197 634169 667667 751997 791262 788294 762837 709208 702322 694435
17477 694435 739484 743490 723075 767614 880454 945925 944264 975621 1097808 1165031 1176458
17466 1176458 1256626 1282529 1313050 1325053 1325520 1384730 1411597 1426509 1490409 1506472 1539295 1614578
17454 1614578 1637163 1682220 1712450 1788942 1824463 1903275 2000850 2082434 2187223 2315666 2530143
17443 2530143 2870169 3212225 3551096 3810154 3981617 4118910 4413777 4831284 5441127
17434 5441127 6309802 7550431 9249799 11649901 15242140 20603780 28243113 38228853
17426 38228853 49399140 59731707 67025700 70500726 71207673 71303519 72282211 73813786
17418 73813786 74151220 71550035 65673582 57667812 49642959 43690830 41116045 42524786
17410 42524786 47462059 54431716 61131197 65514832 66932905 66354317 65461638 65448861 65809961
17401 65809961 64945987 61266828 54472391 45583400 36213758 27864338 21323310 16559100
17393 16559100 13379517 11229807 9748186 8727667 8018598 7511797 7225885 7226599 7348760
17384 7348760 7669755 8218366 8915694 9881209 11231194 13382555 16674953 21512410 28416163
17375 28416163 37368482 47320535 56402497 62637101 65420558 65845966 65692422 66285350
17367 66285350 67440774 67672602 65375476 60106164 53065527 46019144 40806846 38670346
17359 38670346 40106134 44667344 51061028 57136166 61011834 62060170 61150922 59996542
17351 59996542 59645256 59747644 58875988 55422794 49207587 41090050 32690819 25273578
17343 25273578 19448468 15221243 12281064 10295287 8891325 7831078 7059761 6496413
17335 6496413 5993556 5661422 5465425 5304341 5180299 5074440 4976463 4904997 4851469 4802675
17325 4802675 4702521 4553375 4444401 4307556 4181629 4076535 3878462 3677749 3456306
17316 3456306 3232428 2936336 2705155 2502607 2321802 2182327 2008161 1890090 1784549
17307 1784549 1593774 1486313 1438442 1384335 1279857 1208444 1171026 1158744 1113896 1036749 982052
17296 982052 975541 957949 928425 895044 871777 865183 864253 830377 793438 761723 711574 653719
17284 653719 669402 699996 687980 668729 666511 713025 782283 813286 864819 886237 905164 930005
17272 930005 911434 866601 810287 826794 886815 911762 889010 844890 771912 728131 616348
17261 616348 509550 540118 538605 465991 449509 458530 495789 523186 473311 426853 422781 448310
17249 448310 470089 483857 591568 779358 868474 897833 988612 984050 988127 999380 1032313
17238 1032313 1071191 1126415 1152769 1154708 1191373 1241166 1270266 1346265 1409894 1469572 1470750 1452205
17226 1452205 1422185 1431889 1498117 1537723 1611878 1707545 1690225 1630196 1549917 1386599 1317021
17215 1317021 1253688 1130081 1089100 1070661 992152 950676 953324 897607 898196 874209 934511 983750
17203 983750 960577 940180 886583 807532 766267 728451 758029 795778 792832 774053 835192 853103
17191 853103 888224 909407 920257 922169 927439 910451 902286 826250 793929 776747 722485 687514
17179 687514 705714 786314 843646 892755 889714 916187 949474 955372 974914 994430 1044291 1038438
17167 1038438 994078 931595 933501 956358 1012759 1044508 1062614 1074986 1069692 1130122 1215542 1276664
17155 1276664 1346906 1260056 1219379 1224656 1242335 1301774 1393785 1471162 1543974 1704402 1871293
17144 1871293 2061932 2219159 2260398 2247717 2181405 2145882 2125901 2150061 2147025 2058004 1968677
17133 1968677 1919551 1865581 1945461 2130953 2330981 2566091 2786021 2942833 3016778 3112988
17123 3112988 3219183 3366506 3475759 3485284 3469914 3424262 3305246 3098183 2868287 2693934
17113 2693934 2567972 2448688 2350759 2266949 2098013 1981782 1899060 1764846 1665100 1604321
17103 1604321 1496676 1459319 1434437 1375868 1348010 1342051 1274277 1302089 1469095 1579383 1687285
17092 1687285 1814694 1861998 1907047 1943657 1892430 1850407 1862988 1915780 2015033 2082969 2190278
17081 2190278 2327221 2436163 2486835 2576028 2707301 2841565 2897184 2842206 2763553 2735040
17071 2735040 2756445 2807850 2796597 2745313 2675281 2526612 2346021 2110450 1801864 1568736
17061 1568736 1368097 1192928 1033364 840761 704784 651115 564721 550250 538856 516808
17051 516808 412275 426822 402603 367013 427178 440686 364451 321709 402018 472283 454738
17040 454738 387847 359179 395728 386567 413101 419715 445596 451273 442409 446398 477420 549973
17028 549973 618369 638600 663631 713108 783285 847599 889074 921441 951850 943495 923325 913390
17016 913390 932081 975725 973185 1003121 1036199 1090329 1133498 1178553 1201227 1242990 1261734 1190382
17004 1190382 1174556 1206478 1171948 1151198 1239952 1275437 1378498 1507780 1627214 1730785
16994 1730785 1810828 1926573 1980269 1951722 1932165 1927518 1892170 1910755 1816417 1778326 1865009
16983 1865009 1967590 2049792 2149141 2253760 2310446 2401608 2469988 2462811 2420198 2361833 2268393
16972 2268393 2166911 2087356 2014116 1912810 1863219 1860237 1886133 1822243 1718677 1596491 1476941
16961 1476941 1301091 1115394 968907 832043 680389 581080 490913 457806 452225 415920
16951 415920 393199 321358 272276 287503 312342 313136 332867 319638 275193 237485 247237 239516
16939 239516 236334 273368 293113 292100 323966 313827 333672 319387 329831 311858 328018 354308
16927 354308 350396 337059 369447 430971 515850 594531 653523 644563 621244 629303 618415 604359
16915 604359 577366 625711 587633 539608 571524 575928 650974 724112 765632 750608 711285 763544
16903 763544 812214 801709 766370 777010 826675 817790 785349 750653 745781 781468 850873 997950
16891 997950 1209252 1387745 1497890 1691990 1904416 2048497 2071857 2127907 2181463 2211118
16881 2211118 2135468 2075914 1984300 1883319 1805438 1774445 1722006 1688346 1759678 1903191 2029582
16870 2029582 2100249 2068476 2077636 2058782 2010884 1991950 1964805 1793684 1607354 1422319 1269001
16859 1269001 1120049 1031205 1037251 1016641 979061 990099 978589 993096 1041785 965948 929118
16848 929118 991726 1030995 1004130 921878 881669 898092 935028 991541 1082141 1220230 1381819
16837 1381819 1526545 1694552 1817080 1933521 2100102 2223945 2198920 2109525 2026059 2013792
16827 2013792 2011869 1951252 1952489 1957457 1994558 2081244 2194898 2260938 2341711 2443639 2489864
16816 2489864 2561197 2643134 2670767 2701066 2689785 2624201 2561444 2479320 2380804 2254646 2185389
16805 2185389 2163891 2086773 1966095 1893092 1877871 1822307 1744590 1669665 1598007 1588319 1538668
16794 1538668 1432158 1381462 1415257 1401085 1351952 1283490 1240097 1120206 1016675 939646 864490
16783 864490 759190 658938 576313 576322 585894 582951 593155 602068 602902 613606 722644 819448 867486
16770 867486 887263 932280 975821 1035587 1025005 1047403 1113412 1151107 1204905 1297359 1357172
16759 1357172 1402878 1474109 1531118 1547637 1574658 1624602 1593388 1547869 1558202 1541268 1480065
16748 1480065 1508143 1529832 1487247 1441517 1349731 1323112 1264277 1190823 1132975 1068113 1074173
16737 1074173 1044958 933393 856938 780138 659225 542538 480947 437679 381486 307737 253397
16726 253397 254142 273328 278267 260867 213224 200012 182419 139933 140604 104431 64133 123842
16714 123842 165912 121728 81831 103123 151728 148354 132950 158777 110373 29421 71294 94030
16702 94030 109246 98560 104914 76030 57082 99230 87981 92978 110325 116014 42953 32148
16690 32148 21203 3111 34179 53465 77765 120216 108532 86097 -20531 -90651 -55920
16679 -55920 -65341 -63739 -38410 -19178 -14785 5356 64823 25352 19171 13831 49280 95571 69023
16666 69023 64925 58431 51089 -17975 -11013 41 -23270 -32668 -4940 -11843 -11101 7401 -5299
16653 -5299 12216 59509 70196 38370 17615 24355 8124 35969 3019 -7969 -34156 -19432
16641 -19432 -25101 -404 2363 52761 72633 73622 97937 76425 86851 71002 57071 57783 -8699
16628 -8699 -67988 -32655 -12801 -18495 -2025 -9070 -47669 10950 29985 -19915 14414 75689
16616 75689 62935 54010 69758 54012 27636 46839 15458 -34645 -44375 -19939 27521 16443
16604 16443 5792 6361 29998 57127 44733 19049 -13659 -30597 14618 40241 42844 2566
16592 2566 -12907 -42323 -26942 -25908 4014 -27312 -47479 -19497 -7246 -86424 -120330 -114296
16580 -114296 -60772 -11412 -2562 -28877 -46445 -64083 -44698 -19307 -31946 -1220 -10174 -22143
16568 -22143 -15742 -25019 4102 30930 55858 89128 -16469 -42330 -53508 -67214 -63083 -48020
16556 -48020 -18285 28502 3095 -30884 -17277 -21891 -45179 -7516 -22891 -63101 -75940 -71778
16544 -71778 -76223 -51633 -38592 21556 51140 21727 -48939 -82028 -43919 -60143 -22462 49712
16532 49712 56277 -21469 -40393 -9271 -18514 -20340 -21255 6641 -25166 -38867 -3203 17705 28840
16519 28840 62072 74510 39089 2420 -2186 33731 40247 29228 63787 59267 47748 26314
16507 26314 18919 -19173 -24724 -27388 -66152 -66023 -37421 -19794 26978 14789 22415 62529 86087
16494 86087 75473 16801 55872 112354 70823 12901 -8534 -37586 -32386 -46920 -29639 -28164
16482 -28164 -73177 -73322 -82224 -23079 95618 74742 62429 65470 38347 -6880 -29430 -58843
16470 -58843 -17143 -37870 -52426 25656 57199 -29095 -57960 -61903 -217 71723 72225 77463
16458 77463 106193 93633 58740 14142 -8695 -815 50511 83635 60070 37722 -8012 -25031
16446 -25031 -34877 -37178 -39701 -72421 -116344 -83223 -53425 -94428 -97649 -34230 -6533 -18847
16434 -18847 -32356 -1068 12401 29306 10264 -35916 -49119 -56224 -21861 10819 11238 -57007
16422 -57007 -64500 -26917 -7350 16228 -21150 -47606 -33870 -2116 -1061 -10195 23687 12703
16410 12703 462 -27183 -24689 6507 -1860 -39894 -83133 -82784 -35728 -5710 -323 26624 27184
16397 27184 7636 8960 -10973 -2277 -1326 21174 48797 59039 54452 92508 91054 76316 11592
16384 11592 -10934 -35217 -37907 -25774 -58731 -31279 26901 53538 21250 -3705 82140 117001
16372 117001 101808 88331 93601 78410 60300 90618 80079 89521 117494 109458 94427 137769
16360 137769 114353 50210 6375 34346 40722 1432 -17138 -57684 -63880 -36038 -11183 -335
16348 -335 4204 25602 13668 67310 85699 50513 54128 33032 39867 34586 15738 26501 18641
16335 18641 -21994 -53630 -23668 -25440 -13485 -59914 -81095 -49997 39919 150422 154215 118521
16323 118521 16838 -41216 -22476 -10452 -1463 9331 35018 33720 0 21186 82296 62763
16311 62763 53529 50669 47478 56954 41065 16158 -21774 17470 32666 45069 39210 41956 37447
16298 37447 56331 95984 84843 50002 94883 73063 27629 -25377 -39684 -27048 -20577 11146
16286 11146 9804 -21408 -12403 5303 4831 -20577 -29248 -7818 -10696 -44927 -42949 -21401 -14123
16273 -14123 -14930 -18413 3740 74368 54187 25409 -17128 -46217 -81406 -55069 -25481 -32749
16261 -32749 -22526 -31718 -17650 -53608 -35884 -3037 -36621 -48763 26471 52057 50727 93284
16249 93284 87142 31768 -37314 -58537 -89774 -76940 -78113 -51208 -8708 -21912 2422 -9938
16237 -9938 40444 61391 35899 7389 -32714 -48156 -5723 -44152 -98294 -77135 -21694 63063
16225 63063 75691 70882 10270 -9034 -61583 5506 91577 30535 -9099 -52127 3484 48585
16213 48585 45105 62005 79501 50001 3663 50194 90316 137572 162975 84252 27360 24428
16201 24428 26689 40950 31437 -28158 -100104 -114619 -104241 -81586 -87005 -83204 -52850 -13988
16189 -13988 -8343 33 -20946 -17892 -32661 -60020 -47232 -67702 -50005 -63795 -59723 -74486
16177 -74486 -62741 -16615 -36243 -7700 35319 61074 57263 50815 81106 23285 -33981 -8818
16165 -8818 -4386 -21669 -19931 -33613 -69666 -22366 33165 22725 22419 67143 84617 24724 -39481
16152 -39481 -102373 -76432 -44139 -32959 -39199 -54112 -25546 -29329 -3170 18368 14141 5029
16140 5029 49516 -2713 -74375 -74742 45013 87690 -11972 -74254 -55241 8098 -17394 -23783
16128 -23783 -30600 5244 1106 27443 20989 7759 -7243 31908 7257 18473 17176 -11244
16116 -11244 -12503 22672 38651 -1772 -14989 -47086 -46487 1797 -13771 51836 47660 5380
16104 5380 -46111 -25827 -53954 -64868 -27697 -35954 -57722 -62864 -64056 -62242 -37698 -6892 22295
16091 22295 36645 63923 76046 31960 5044 28636 43613 64941 26673 -12446 -34775 -9616
16079 -9616 -40612 -21632 -12774 9781 9541 -34915 -43626 -908 20267 41306 4503 -34787 -5128
16066 -5128 -9184 -246 -32846 -78928 -39784 -36014 -60056 10121 26447 56003 27942 -16093
16054 -16093 45815 70232 29496 -5334 -23554 -3380 31545 -2502 14795 47754 33202 5186
16042 5186 -43647 -52994 6093 15071 -40680 -40595 -36434 -11958 5257 3806 42924 76571 49466
16029 49466 47621 16943 4345 31505 43722 -1424 -29210 -10824 15625 19575 19986 -42584
16017 -42584 -51734 -57581 -44444 -104006 -95921 -37487 -9482 -19393 -71197 -66469 -53872 -57974 -47680
16004 -47680 -29330 -138 -24528 -26362 -10350 26698 36465 26617 35713 56389 44349 -70
15992 -70 -25729 -13486 -33729 -28306 -17630 -71237 -105551 -114191 -121168 -140387 -71312 -3616 11929
15979 11929 -15828 -30231 -10711 -24833 -100237 -115482 -85011 -22422 -39833 -63651 -63837 -111814
15967 -111814 -139447 -151148 -146873 -104480 -71402 -60697 -28903 -15843 -20041 -14212 -11217 -8367
15955 -8367 -4082 7923 7192 -30198 -6439 -14281 15337 30670 18030 -12681 -20622 3597 -39506
15942 -39506 -79369 -72207 -75321 -57330 -30332 36125 88574 98680 116767 140271 192818 251027
15930 251027 296929 306539 305233 344586 407935 399526 369388 438191 485545 481048 518074 468483
15918 468483 405717 349197 322357 325107 355467 373876 348449 293189 278518 238629 208240 128152
15906 128152 94911 82492 60831 36994 -16511 -42902 -58277 -29260 -17342 -33421 213
15895 213 492 -33915 -55075 -54134 -50652 -24985 -34426 -58807 -77549 -7567 -20053 -69010 -60741
15882 -60741 17363 16066 -18499 16438 244 11510 20906 -5808 5553 -15563 -11103 22900
15870 22900 19263 -4973 22067 39449 28627 3954 44381 69195 51408 25905 24417 -14974
15858 -14974 -39291 -19014 -2153 -52721 -68435 -76034 -70633 -59092 -42949 -48691 -61197 -81918
15846 -81918 -127370 -119977 -128681 -119625 -73964 -93008 -76509 -14867 -10614 33450 29863 -16542 -40381
15833 -40381 -83848 -47256 17376 32361 5560 -29553 -60962 -64707 -36123 -23223 -15160 -18652
15821 -18652 -2884 32094 52458 28424 36108 -32017 -84736 -62695 -74496 -83602 -18343 47052
15809 47052 37486 73270 39233 992 44942 41844 33449 11964 -6771 -8289 -24148 -53482
15797 -53482 -41790 -37283 19615 22672 33401 51008 23072 -38102 -75888 -22268 35254 34076
15785 34076 4438 -34946 -22796 -38284 -33516 -55084 -32739 -35374 -58736 -68744 -66338 -54518
15773 -54518 -31637 -27510 -46697 -65122 -46616 11951 2012 3961 -11302 -65729 -83878 -79156
15761 -79156 -82941 -44911 20743 -7592 -16802 -30379 -14559 -30941 -25653 -29667 -80866 -110865
15749 -110865 -131385 -88494 -118349 -128770 -83589 -45241 -18703 260 -12204 -77499 -87048 -53910
15737 -53910 8055 10647 14984 50019 44758 -18153 -50453 -53997 -33219 -60290 -72622 -100642
15725 -100642 -103584 -6467 -8508 -66114 -52583 -121164 -135722 -127013 -66690 -56568 -65665 -103056
15713 -103056 -92748 -35393 -29554 -15715 34938 50616 36608 7124 -3129 -41737 -15223 43843
15701 43843 -3208 -53146 -13746 -8584 -44903 -25618 -62731 -68251 -34461 -20460 -20592 -68951
15689 -68951 -89757 -34999 9418 29343 41618 47345 37355 21625 -2742 14766 32361 250
15677 250 -17929 -30743 -67132 -25747 3100 35440 71443 66456 71833 28233 2511 15982
15665 15982 -8885 -7499 -20433 -26501 -21468 -635 -46128 -62463 -65265 -43689 -41024 -40934 -22364
15652 -22364 -23129 -22094 -20508 -6006 27305 -4104 -11000 -3111 8030 -41622 -113417 -83514 -81092
15639 -81092 -73569 -62616 -40991 -30237 -28929 -8100 1744 -18684 -30278 -68889 -42104 -38379
15627 -38379 4287 30832 27269 -15554 3684 1560 44542 54462 -17819 -4272 17902 54934
15615 54934 91828 111330 111513 75954 74861 26532 -21957 -52348 -90991 -100416 -7534 73590
15603 73590 30377 6270 -16990 41615 45750 28419 13914 33085 40306 39274 -43151 -42834 -45469
15590 -45469 -60721 13136 9027 1884 -18659 -7917 -41825 -54169 -49028 888 31237 38577
15578 38577 24436 -13810 -33779 -14387 -15034 -12128 24697 11485 -61050 -101032 -80707 -35104
15566 -35104 -56250 -57445 -27815 -10487 -29178 -27166 -36731 -32589 -29532 -6525 26805 -2539 -30011
15553 -30011 -48271 25158 31333 -19304 -42323 -7717 7803 24672 55419 40807 72478 32120
15541 32120 4886 37398 8109 21967 16193 13348 24052 40042 72095 87185 66966 2951
15529 2951 -7243 647 8167 -32822 -60510 -42522 -52982 -33147 -1040 -33297 -53267 -58297
15517 -58297 -37711 -3787 36685 4797 -54181 -38926 -8663 -74387 -67024 -54851 -108883 -141418
15505 -141418 -131504 -53087 793 -31523 -47868 -62442 -14779 54928 72474 33369 -28672 -46062
15493 -46062 -14661 33439 66383 79995 134385 166657 110232 17631 -7552 -27695 -26426 31226
15481 31226 79502 101804 88095 33958 -21820 14525 24392 21868 34229 25060 80976 83759
15469 83759 23231 10112 15235 -7874 -52031 -33211 -30293 -5345 30038 3587 8382 42217
15457 42217 64481 72761 43977 54447 100050 74959 17495 -22554 28866 14328 -54682 -58003
15445 -58003 -63253 -37702 -39008 -63329 -68581 -50109 -19795 18579 16793 47969 64876 50872
15433 50872 39436 79224 56751 76168 54864 60493 81937 99162 59165 63111 37060 -22611
15421 -22611 -24344 29191 108138 89359 35121 -18031 22032 -16650 -36954 14706 17333 31464
15409 31464 27704 47138 4349 -44115 -43375 -9200 -49607 -103808 -43980 22942 48813 35140
15397 35140 -6589 -18819 5030 14403 30754 -5263 2839 54151 61359 50017 -12619 -76638
15385 -76638 -52817 -22952 47317 2366 -36665 -78187 -111390 -80440 -67630 -42521 15454 28732
15373 28732 23978 65131 2270 -30288 -3969 -38482 -49516 -28364 -16484 -7670 -19568 -10005
15361 -10005 -42540 -62257 -15926 8682 24543 41050 56453 79788 6243 -34723 -12137 -6446
15349 -6446 26153 19045 11602 26178 3776 -53375 -122858 -122494 -47431 -30812 -18130 45464 45562
15336 45562 68766 18942 9122 76032 70205 76524 115541 64346 3525 11524 40115 54485
15324 54485 114398 127889 152110 125166 97906 105721 117573 112059 73372 56477 48371 82950
15312 82950 112907 110708 108239 64082 62723 45669 28244 -36639 -4616 32533 47424 32694
15300 32694 24813 19706 35331 33485 21830 14361 11941 46898 99810 93561 60276 46526 46706
15287 46706 82179 109394 96317 35066 15621 39292 43629 37952 -3561 17350 62248 28673
15275 28673 50583 49671 12141 -14393 -40098 -27259 -39605 -591 -5607 -18089 7045 43808
15263 43808 38299 24511 6160 -6220 -6756 55396 82122 62142 45266 45860 -12220 -55013 -53617
15250 -53617 18328 64469 46102 75613 73713 77605 19248 38969 48611 4143 -30080 -75248
15238 -75248 -57061 -67722 -73737 -108686 -208674 -178495 -126252 -119846 -109773 -41018 -24389 -71740
15226 -71740 -101673 -70955 -38057 -23244 -5551 20001 38123 39123 44663 1669 -55794 -54336
15214 -54336 -51246 -67196 -109045 -94478 -25131 10317 -10172 15590 10048 5900 5845 22288 22759
15201 22759 39106 -26367 -56633 -39319 -7869 10336 -19840 -77049 -103144 -70826 -21830 9440
15189 9440 39906 27370 5071 -13502 -13698 -5095 -19898 -19249 25646 69486 5635 2503 47440
15176 47440 -623 -29978 -29586 -99276 -152885 -90951 -14909 -40329 -43977 33812 70683 57972
15164 57972 49068 69682 29761 1298 30096 22954 28760 62315 133804 150242 78905 62407
15152 62407 24545 20687 -16812 -17557 -47929 -38625 -31061 -21967 -47796 -23112 -24652 8486 41715
15139 41715 -8129 -63016 -106955 -74379 -104672 -100922 -132993 -98546 -90448 -96492 -60242 1860
15127 1860 626 -7065 12453 78394 75873 76536 57900 -17957 -34845 11373 -14087 -3947 28906
15114 28906 19156 -31798 -30321 -19958 -65539 -72811 -73393 -83787 -33826 -14975 -70143 -129632 -113271
15101 -113271 -111923 -121587 -119543 -98304 -42812 -67919 -47083 -24761 -45739 -55693 -60119 -77211
15089 -77211 -60076 -56691 -47094 -77150 -35770 -5512 -29547 -21041 11230 31378 28886 -5058
15077 -5058 -53935 -47873 -12481 -25692 -1493 -20130 -71001 -48087 -13350 3027 6330 -5424
15065 -5424 1143 10665 671 -17307 17578 89330 130402 55171 -41994 -52558 -25394 8248
15053 8248 -26544 -88338 -61512 -21827 -8686 -24846 -9399 58500 47463 -35451 -2006 72102
15041 72102 79262 37598 23478 31857 7470 -50319 -94626 -101090 -63544 -26357 541 14384
15029 14384 -13525 -28610 -3366 -16021 20889 53419 33085 23413 52051 38917 26166 15705
15017 15705 46957 59820 59578 21778 -16237 24757 32512 -6784 16078 41228 8566 11354
15005 11354 39118 35403 25305 -22014 -30928 712 -7218 1312 32765 25212 -14805 -48413 -91127
14992 -91127 -113379 -102661 -80008 -72810 -56155 -81903 -80128 -57633 -42643 -38406 -67503 -25810
14980 -25810 31244 50073 18235 38214 22963 19491 75305 32326 29136 53955 36410 53890
14968 53890 37878 3266 4359 -4074 -41076 -14990 45876 48501 19634 28287 70599 133885
14956 133885 132081 109853 16802 -42383 3628 9508 -12538 1595 14381 37345 -6059 6534
14944 6534 -7617 -36911 -74673 -86889 -35766 7580 16303 30068 66334 81243 100229 74502
14932 74502 44785 32857 -9836 -14926 -41428 -75387 -65948 -64933 -52894 -35289 -50937 -67975
14920 -67975 -52449 -38651 -50769 -60567 -25394 -6307 8462 4246 -1560 -24157 -31972 -24791 -50411
14907 -50411 -28609 -69476 -64671 -63909 -36635 -6368 7705 26437 64796 38167 12231 2578
14895 2578 32147 -28528 -69892 -109667 -136068 -141582 -107874 -63475 -39026 -39710 -19573 -37322
14883 -37322 -49717 -77888 -57441 14600 40570 7650 -35579 -46175 -24801 14154 28138 63795
14871 63795 61349 83731 76839 8777 -75772 -99130 -70140 -60015 -85372 -106260 -103691 -38682
14859 -38682 40406 65267 36443 32484 47516 -25937 -76988 -73525 -59186 -12118 129 -46813
14847 -46813 -47429 -37950 5292 -13956 -1197 -4827 -17908 -62217 -70477 -66771 -82031 -114381 -110475
14834 -110475 -59077 -17122 -34670 -57028 -51062 -11438 6646 -11771 -45373 -77550 -106245 -81442
14822 -81442 4796 48658 12909 -11797 -39575 -53770 -17025 -35737 -72174 -39539 30527 64004
14810 64004 17563 -18283 -40450 -36239 19646 71633 22893 -39046 -33154 22769 80251 36945
14798 36945 756 24991 74464 37065 25890 32395 -31094 -27690 -33751 -64430 -65995 -35092
14786 -35092 5004 31195 6373 -45765 -61223 -67396 -64260 -23191 -13688 -36372 3689 21589
14774 21589 -8205 -41816 -39808 -20951 -23448 -11352 40550 17131 -43157 -59369 -100371 -29246
14762 -29246 31258 54601 919 -19902 -54783 -39724 -7743 -31493 -27187 -399 -7254 -35158
14750 -35158 -73185 -134589 -130029 -143688 -126431 -78013 -10250 26364 14824 -71689 -99263 -112662
14738 -112662 -143271 -163266 -111369 -29828 -5197 -34974 131 4946 22792 80792 56428 43709
14726 43709 51592 2257 -20173 -34157 -59197 -60822 -19192 18070 -7866 -55114 -56872 -62079
14714 -62079 -40087 -6904 45525 46708 50190 46889 34413 44527 35795 46918 48578 56385 18933
14701 18933 -18063 -19440 -39261 -17753 -12008 -55802 -53713 7309 33755 72780 59611 67243
14689 67243 78881 44413 69412 85949 16141 -7458 8530 85152 152876 119206 115482 126978
14677 126978 161385 261940 370439 487064 538548 693954 814465 935250 1059442 1221041
14667 1221041 1347572 1507724 1665194 1695786 1695256 1648860 1646308 1626822 1572541 1451155 1344389
14656 1344389 1176569 1075368 923549 761437 625787 524877 369528 262038 243196 173958
14646 173958 167625 163348 122269 104557 104959 115604 80182 39314 32503 35570 54718 70650 105760
14633 105760 133975 75131 61139 57341 44764 10989 -9339 -32110 -33507 14616 51696 79435
14621 79435 96150 57633 69421 67538 51912 17273 8308 30941 3112 -56687 -51025 20557
14609 20557 44000 25153 42692 64081 47632 -27182 -58589 -64732 -23576 30974 51982 89505
14597 89505 67542 33194 -20743 -30572 -3461 31750 25560 4909 -21159 -25224 -39517 22954
14585 22954 74537 91371 49759 18026 48557 50867 494 18603 8237 7989 19919 63430
14573 63430 122618 49364 -49980 -93191 -13716 36075 59248 100146 122384 125561 84460 69070
14561 69070 23739 15947 32098 9861 -1674 13782 -44168 -49182 2988 51121 14215 14576
14549 14576 31751 65230 62335 33677 2983 -34695 -37550 -33529 -7761 3125 -27073 -3434
14537 -3434 -38203 -84726 -94016 -90791 -70099 -39020 -4834 -26343 -29090 -41377 -102104 -114668
14525 -114668 -86099 -47146 -2224 -25349 -76141 -71379 -75094 -62159 -66227 -29569 -48254 -53721
14513 -53721 -15674 -34463 -37823 -19820 46728 96709 73931 61330 23852 21418 -12493 -7181
14501 -7181 25041 12464 -3906 -9986 -20370 -29003 -886 4099 2499 -10226 -48083 -80031 -88162
14488 -88162 -150710 -129506 -73672 -76928 -60037 154 -8069 -14917 -12414 -12932 -55642 -83038 -58437
14475 -58437 -27988 -1573 6060 77976 102597 90701 40957 -27448 -345 57354 37404 -6429
14463 -6429 4066 -5800 -27475 -20296 -1590 -3543 -25182 -12619 57490 31858 -2479 -75331
14451 -75331 -101076 -85138 -87239 -46378 -20504 729 2140 -40539 -44333 1587 55588 39271
14439 39271 -20316 -40333 -62267 -83193 -48690 -30311 -41734 -37888 -83889 -148528 -104369 -21737
14427 -21737 -10957 -32059 -18295 -30093 -16078 -17428 -15085 -56852 -79518 -39635 1989 66060
14415 66060 33013 -9640 9733 25117 50762 -5350 -25865 -39757 -31072 30437 36129 44699
14403 44699 3900 -23432 -29653 -33399 24774 -12533 -78709 -43787 5038 55102 53602 84151
14391 84151 73118 41133 39186 28501 41824 29720 1568 -28293 -63332 -81198 -87463 -52636
14379 -52636 -50873 -12869 15655 10956 11964 7084 19962 -31002 -69408 -49469 12297 -20612
14367 -20612 -85546 -146329 -174168 -153505 -94452 -89381 -103435 -111573 -62937 -37649 -10513 -34280
14355 -34280 -66904 -21491 -12169 -13337 8744 897 38827 23580 -27631 -64470 -71793 -76602 -110537
14342 -110537 -92210 -30483 -34068 -75367 -78151 -107510 -114973 -64653 -65446 -62959 -89204 -151223 -163802
14329 -163802 -114665 -53029 21348 -1238 -53524 -22520 -59983 -74986 -32515 -18615 -34418
14318 -34418 -55274 -56428 -61394 -70000 -62055 -41102 -28070 -27580 -31060 -24164 -1376 18770 -54045
14305 -54045 -92189 -84223 -66329 -3299 20518 -22373 -13513 21090 9131 -20892 -5074 21338
14293 21338 31828 -4409 -2410 -34380 -71258 -109055 -93199 -10574 21441 -18284 -67915 -78432
14281 -78432 -50183 -12834 -47016 -85810 -61366 -43793 -53940 -75746 -16798 -37369 -56974 -35334
14269 -35334 -19096 -29066 23442 46758 13365 4557 -8686 -14883 6241 -18982 -10729 27666
14257 27666 13471 18261 -13279 -40420 -853 2393 41026 55584 22848 -35904 -17551 46315
14245 46315 12959 12360 55984 83127 77713 80558 88896 92209 73406 42737 78205 24484 -14382
14232 -14382 36918 7084 40845 56644 25899 2543 -25622 11353 74046 75688 30233 -17022
14220 -17022 -22055 2443 90548 137079 123229 85050 122623 189248 165599 137791 107494 129657
14208 129657 158372 126373 129339 111452 146661 156917 118156 116821 116028 144152 141361 188780
14196 188780 220752 269401 312748 384095 417525 475914 537448 612839 779069 970007 1150359
14185 1150359 1377369 1692826 2098220 2561033 3120637 3675312 4275079 4824046 5263400
14176 5263400 5616419 5886793 6059687 6167638 6225150 6232362 6252988 6189201 6031205 5810566
14166 5810566 5469276 5068048 4524252 3964545 3378277 2816282 2295383 1829961 1441596
14157 1441596 1140622 950492 796208 657124 587022 513671 481252 443091 382107 391843 364431
14146 364431 297824 274711 247356 225319 156619 141179 124821 100634 69235 89846 97674 97065
14134 97065 123553 130058 91546 104495 92277 108267 86006 95875 136290 125441 77778 58070
14122 58070 29475 -4877 -39190 16922 79707 110442 101818 50047 -11503 4287 26376 -21990
14110 -21990 -73208 -37828 8005 35570 111003 181736 212660 183767 182014 194012 224098 199996
14098 199996 147959 148443 172341 171380 119705 96987 86108 54691 57892 109702 116402 98322 124520
14085 124520 111053 86347 77753 30354 -3038 2316 23282 79590 61945 36015 16866 50791
14073 50791 45177 46186 79097 107915 99591 115907 103478 81931 18124 -9328 32789 38393
14061 38393 23511 -38074 -27536 33400 20972 23522 1181 -19960 32421 46989 9968 -20206
14049 -20206 -21197 -24137 3120 -33934 -30275 6656 30069 19303 33932 37193 31499 19207 -12296
14036 -12296 -45667 -28070 25043 40371 17786 -15547 -2351 -58593 -90750 -109192 -33027 46805
14024 46805 10523 -71447 -107759 -55437 8080 -41259 -94500 -78245 -79892 -48452 23071 23661
14012 23661 -12177 -24219 1507 51347 23708 -1893 -7602 -48598 4180 29329 18620 54457
14000 54457 19710 1183 15099 16622 19102 29750 64807 100436 73646 44535 62391 26203
13988 26203 23848 67774 65203 48094 27277 39588 23911 90398 141551 162127 169312 146579
13976 146579 141309 146386 192518 247394 260921 304118 378053 350646 335266 353461 351511 259206
13964 259206 281383 307673 288620 246101 193638 229755 235851 199671 155912 151045 145802 142685
13952 142685 118937 116348 106661 78446 69704 91938 112299 121890 77736 64335 22147 17331
13940 17331 49842 43841 55753 71316 48514 49200 86193 85642 13286 6809 17464 13244 31139
13927 31139 484 -8103 18928 60010 61126 32015 17824 20823 54201 38117 5768 -64815
13915 -64815 -75386 -75968 7341 105473 118326 128765 181551 238817 259699 271141 279261 279355 293344
13902 293344 294377 274159 233453 228512 219603 264977 352016 390817 348522 303976 237288 182804
13890 182804 148638 94535 45165 -25623 -17697 21933 -1473 -50512 -67551 -42399 -35160 -39404
13878 -39404 -65322 -55254 -41077 -60428 -34008 -37248 -12829 -14825 11362 86485 83715 -5862
13866 -5862 -77502 -113632 -118949 -79284 -70676 -68280 -93429 -127615 -132329 -102657 -62752 -98234 -59947
13853 -59947 4725 27909 37427 46739 126299 163351 126662 87998 59553 28185 71452 116848
13841 116848 152787 108117 40427 24531 72798 26557 -63386 -49465 -57614 -86882 -90035 -46448
13829 -46448 -16769 -21109 -25425 -29910 -64997 -34062 29048 16225 7765 26350 -13633 -42774
13817 -42774 -86291 -73624 -58418 -54374 -63348 -43553 -3169 -21085 -65720 -18187 -18444 -11800 -35644
13804 -35644 -21354 45075 11653 -16086 -15829 -20645 -16562 8867 55727 98176 68365 60780 4169
13791 4169 19738 41831 4268 56044 38671 -6342 -28524 -25615 -38952 -14719 -41798 -33545
13779 -33545 -44935 -27387 -37509 -81201 -82702 -62764 -35370 -40593 -59897 -41720 -77206 -56030
13767 -56030 -31620 -8643 8312 4508 11383 10179 63058 17650 -47973 -65020 -49105 -91579
13755 -91579 -78430 -105009 -160493 -155808 -92104 -33404 -14286 32586 44559 62847 73755 18471
13743 18471 -15712 -22629 3736 30490 32803 22690 -17719 -51226 -54086 -31361 -13922 61245
13731 61245 1005 -32722 16167 18899 59400 87091 53961 22149 44461 41982 2109 -26716
13719 -26716 -51068 -125208 -126045 -115405 -65628 -13801 25657 21395 31951 2186 12301 -13727
13707 -13727 35071 14962 -14904 -1504 -10360 -14766 -15110 -49315 -91798 -53069 -28820 -37561 -61391
13694 -61391 -115584 -107855 -19126 15710 -16872 -31497 -21032 -20476 -2278 45477 61008 86794
13682 86794 122737 78440 82744 31716 -23640 111 31859 -28947 -48037 -46392 -30415 -32262
13670 -32262 -32657 -31047 -41843 -47643 -43005 -44436 -76318 -36188 -20552 -16972 -32030 -21850 -78543
13657 -78543 -79064 -55255 -29202 23444 79569 97417 46012 28737 15806 -33502 -37027 -82880
13645 -82880 -66901 -36119 -28677 -23640 -23275 -30024 -40544 -53069 -18759 -36654 -44973 -64042 -60978
13632 -60978 -61991 -57426 -26581 -65180 -62696 -40472 -10556 31921 40904 21945 28813 47810 25447
13619 25447 -1453 -27416 -66170 -42039 -34342 -58637 -60654 -86862 -153279 -106412 -56012 -10884
13607 -10884 23364 -13953 11729 24282 3701 -63341 -61123 -4758 19401 17 -4671 8638
13595 8638 26367 -6292 -15486 -17376 6359 43408 68533 46806 32381 18524 20064 10795 44885
13582 44885 60284 79904 58898 87809 19826 -39934 -60167 -119677 -134312 -97183 -49073 -15872
13570 -15872 8983 -5719 -38931 -61279 -69528 -45942 -35837 -23113 -18773 -59350 -57818 -53596
13558 -53596 -133045 -146099 -59619 -19186 -8208 -34779 -68404 -37434 -49562 -53431 -52533 -80780
13546 -80780 -62950 1797 -3066 8920 -21666 -34909 -39949 -57542 -52412 -38674 -9014 28189
13534 28189 -742 -33005 -57586 -36384 -54108 -34594 -43546 -6621 26221 -3951 -58277 -49204
13522 -49204 -44348 -30093 -18187 -39288 -62386 -43349 -45798 -51118 -37345 -35655 -42087 -9271 -30783
13509 -30783 -10296 -10129 -20183 -21357 -24899 -39981 -18464 -31753 -2245 8824 33704 11471
13497 11471 -8828 23629 16055 -50386 -60959 -35606 17221 65772 43090 43832 31748 9063
13485 9063 89541 126725 63694 -21901 -92128 -88423 -60551 -62228 -31876 -74069 -88895 -41161
13473 -41161 -62673 -100914 -8062 53430 51645 53953 47162 43757 6062 3598 17820 1783 3627
13460 3627 -19078 -3959 -2274 30544 -19812 -27907 7697 -31790 -39787 -23055 -5502 26277
13448 26277 -12094 -76583 -97564 -56678 -42996 -56105 -110848 -131667 -54859 -53460 -13053 9299
13436 9299 15821 15265 -9956 -3108 -42552 -19110 -8094 -32317 175 1756 -17699 -45410 13451
13423 13451 11340 15751 18859 -2115 -13627 -40601 -54024 -36501 -32966 -31479 2437 45881 77729
13410 77729 59341 72486 71610 60091 -3835 -46166 -39527 -29340 -40365 -40668 20447 -6303 -46397
13397 -46397 -78310 -84066 -75287 -71099 -78806 -66370 -66212 -39061 -30593 -43399 -10338 40924 68114
13384 68114 101600 108712 49456 26144 3652 2189 20663 -26489 -57998 -46912 -1870 -21191
13372 -21191 -39770 -80485 -89192 -88193 -86706 -62099 -20557 -37199 -105587 -185750 -169630 -127379
13360 -127379 -147286 -141940 -111711 -55876 703 -4730 -19377 -58499 -61432 -18950 -64711 -63228
13348 -63228 -58788 -42579 -15757 -28827 3643 35244 2853 24966 50664 62774 34687 76854
13336 76854 87903 78013 46423 -9423 -39823 -69980 -49980 -41310 -33568 -15902 6284 -5785
13324 -5785 2818 -3838 457 15969 46776 53117 73371 38385 8343 -40418 -22767 64431 108577
13311 108577 77616 63719 55100 27088 10303 7018 3378 2414 27418 82354 90040 57130 74188
13298 74188 49672 21923 -7870 42959 53910 35528 43380 -15020 -55407 -39621 -46395 -17569
13286 -17569 1973 36580 80262 82851 62740 57323 47680 6118 -14828 -24588 -62124 -55839 -37624
13273 -37624 -6408 -2756 21021 -12126 -18739 -34050 -25309 -28924 -54275 -40602 -59931 -35086
13261 -35086 -32007 -30338 -25587 -23596 4792 48595 72804 67610 46161 37432 3138 8885 82962
13248 82962 83456 12967 -62238 -73158 -24805 9064 4306 -39621 -39075 -74094 -79022 -63915 -74444
13235 -74444 -64763 -70710 980 7961 14881 67086 56114 57355 64597 53959 34512 16286 7178
13222 7178 18149 56354 116670 73948 24643 30203 -10120 -32094 -19890 45173 73761 19857
13210 19857 28842 72594 75958 57335 2508 7860 19953 3062 -1077 -16324 -65815 -47563
13198 -47563 -7034 -263 72027 97621 103294 70220 24546 -7086 -26570 -8387 -40976 -20578
13186 -20578 -15803 -17248 -17693 1146 -27727 -44195 5684 10784 -24205 -25706 -20094 -11148 254
13173 254 42042 34990 83999 112761 74492 41164 40829 53410 68561 52167 30937 8233 9577
13160 9577 3535 -7137 -6787 43674 71928 52388 69961 93388 92654 147574 153773 117447 47434
13147 47434 57852 105916 166821 179640 241877 252578 221545 196280 245284 286409 272294 287140
13135 287140 316632 317933 302354 346298 438318 561548 662610 768542 838635 904231 1001400
13124 1001400 1091350 1125228 1211262 1237323 1224186 1234490 1224278 1212708 1181664 1114556 985679
13113 985679 962301 910662 856868 786623 624640 539850 443110 359945 348164 415209 461372
13102 461372 470762 401183 283998 189589 196437 223135 188752 158588 134180 149096 113181 126921
13090 126921 107963 84098 56341 21231 59360 149291 207774 201376 114812 109944 81871 124253
13078 124253 144021 121143 103952 97739 74791 41265 -4809 30536 32422 48922 98210 28912
13066 28912 22051 62583 90074 33088 21366 67060 97105 102133 80772 113150 132176 182513
13054 182513 148563 163999 146850 111648 128088 238630 343879 380537 399211 419949 414458
13043 414458 377733 453656 546909 639521 724699 876709 1007529 1121910 1206629 1274655 1335766
13032 1335766 1347762 1451052 1538116 1569404 1527724 1470709 1427895 1405972 1312243 1219353 1093162
13021 1093162 1013222 912528 835722 763363 621038 543548 446846 380835 334498 274396 252258
13010 252258 235592 242168 222914 209520 170070 147822 96213 88664 146569 143610 171992 153242
12998 153242 123292 117443 90202 75424 21936 -496 -48713 -32107 26297 62235 113544 84652
12986 84652 70999 17318 -2512 14778 61735 39886 56186 84953 132474 78470 61812 37545
12974 37545 3655 -38504 4349 17638 -32218 12654 54387 73091 34784 5130 15804 -19432
12962 -19432 -8485 -12249 -23223 14509 41716 22900 26344 80708 76191 24835 3637 -15877
12950 -15877 10791 8233 -4996 33152 54243 92219 132534 73584 -25932 -90007 -65238 9431
12938 9431 43785 44166 84327 135887 142004 133741 68555 64303 5376 -27660 -2443 -6232 -5372
12925 -5372 -8591 35121 68011 63507 79764 59256 -4316 -15648 -1490 18372 27196 55069
12913 55069 57128 56834 43341 52352 42154 23640 5019 41897 50620 29487 13313 17418 25837
12900 25837 13005 6165 28619 55666 48245 -2935 -75956 -66212 16299 58404 72830 60702
12888 60702 47461 40566 47785 -16744 -40199 -27767 -5299 18071 -121 15025 27671 13532
12876 13532 37357 49004 13456 -4897 47399 64550 37948 56454 87023 70725 60747 53219
12864 53219 79648 65351 108994 104621 67829 101382 69208 62387 55645 92958 60186 21809
12852 21809 15932 37373 56952 23753 24216 21120 64723 45144 -1559 -12842 -7208 29297 70993
12839 70993 141892 108189 65712 44773 -4797 -50681 -47414 -40550 -38971 -11289 -5118 8007
12827 8007 55139 64689 29830 65716 87389 28171 39142 75390 103504 96252 83805 95049
12815 95049 91830 75389 26897 33164 33313 34542 42682 39566 -14220 17896 7206 -64209 -109041
12802 -109041 -143737 -116309 -47731 -24257 -26672 -18003 78049 100974 91298 85232 94222 92180 115135
12789 115135 126505 143485 100790 37299 -13362 54550 57350 -10397 46328 76406 53193 63162
12777 63162 161112 217608 182812 160220 159537 110853 76858 140132 150708 154473 138273 99874
12765 99874 14387 -29857 52333 50406 30867 22836 12427 63239 39675 -14622 -52537 -56025
12753 -56025 -33803 -421 21111 -3493 -4147 15496 37455 21220 37113 51431 65217 49477
12741 49477 67184 100571 116196 148390 165728 139982 77890 102773 96597 46445 24802 44681
12729 44681 44806 22297 -11825 17429 82381 54843 14857 41286 46683 62103 77560 145977
12717 145977 147425 117537 50652 64475 61899 17477 -9270 8771 -549 14150 58833 92970
12705 92970 102856 96424 56030 31911 -3579 5059 105536 116531 96956 117601 110207 99902
12693 99902 120030 94176 45730 39478 22796 47333 94820 100558 104352 112474 89539 27149
12681 27149 47337 52808 32275 13110 -31349 -27697 -4153 56079 93326 129083 119878 43207
12669 43207 38962 89921 100151 44903 14740 62670 108230 115202 95331 54599 27651 56274
12657 56274 74140 80296 55144 65986 89627 69279 75220 51284 43881 63888 61856 120392
12645 120392 108211 129592 157756 134517 89638 69019 59198 90530 100166 127494 78537 42063
12633 42063 31297 83875 122490 173316 190030 156324 171820 188114 238618 273606 253454 313221
12621 313221 343584 359274 395373 410444 448836 480170 530017 648461 810061 967808 1150716
12610 1150716 1469653 1826060 2226475 2674557 3091532 3443066 3707768 3823736 3786315 3577871
12600 3577871 3211457 2761396 2310044 1865261 1522563 1239645 984656 746156 601035
12591 601035 527043 493154 464237 402177 388242 366876 300104 216511 162743 160429 160072 169617
12579 169617 199605 159873 117425 101608 134708 152692 126571 127146 88680 72173 71435 85625
12567 85625 144457 165370 164003 185019 182242 148947 90006 9085 50000 22138 -1215 58148
12555 58148 129136 121587 101071 141533 178397 216655 210792 242815 221760 143451 146755 179922
12543 179922 141978 105346 139077 150166 99783 108990 130235 129264 144224 164125 162535 158561
12531 158561 130201 152738 141567 142021 208770 174957 141299 137665 181379 233500 213319 148765
12519 148765 177474 187042 173355 178112 223227 244042 300171 365339 462838 583850 713774
12508 713774 837768 884599 856083 800034 654204 475081 372597 332988 253144 229139 168172
12497 168172 149377 140622 110353 136892 143017 89713 84685 104635 123810 115342 106436 77272
12485 77272 88460 144827 171172 124187 108423 80280 63955 37296 26803 56335 78462 102108
12473 102108 108077 65114 51469 21034 33924 48733 123005 161310 161121 166872 105900 78483
12461 78483 26035 59724 115980 79426 32797 45147 72743 89319 97958 90534 170839 220172
12449 220172 194303 145749 104463 63574 42992 35385 79886 93359 142602 152054 191892 210014
12437 210014 188406 192401 179100 141858 145477 150553 130541 161631 144616 165571 147315 141942
12425 141942 158087 228918 269977 255070 149455 100825 82698 88456 99585 69661 81983
12414 81983 143155 136451 119200 124454 143584 145135 122975 142104 114232 87361 60118 53714
12402 53714 84567 169307 192331 144842 148978 164709 128128 111627 118335 151307 159988 163448
12390 163448 166470 221653 301639 238584 200043 211844 228061 205946 180948 221894 237685 299242
12378 299242 251859 249632 242610 241689 307003 328165 359986 380002 455832 570997 738331 847952
12366 847952 932091 1052868 1080876 1030275 959911 885033 833001 740329 678601 660893 701712
12355 701712 731929 695052 668393 734996 744565 753124 741611 677217 648869 681682 681406 693255
12343 693255 677137 680945 666698 628841 636500 661511 683768 706929 735895 738390 736599 766573
12331 766573 777107 843135 925827 1129827 1386634 1695109 2076994 2417374 2748699 2853400
12321 2853400 2729148 2513591 2255205 1964635 1681012 1485097 1325445 1231340 1201821 1142452
12311 1142452 1065018 1077797 1065960 1065738 1121187 1122901 1032218 1022548 1011298 942954 892529 873481
12299 873481 802679 748281 728743 726797 716974 688841 663368 686744 687045 679396 708472 733652
12287 733652 771734 838528 875691 962677 1050587 1155954 1256659 1308761 1238568 1141792 1068853
12276 1068853 988215 883728 779687 761748 705262 662714 659187 633564 645456 639774 592118
12265 592118 503894 498882 480935 504518 535651 502968 424827 358462 347818 373854 347063 395974
12253 395974 392971 319858 284016 316275 294651 263366 301239 310358 283319 329389 316040 325894
12241 325894 335268 333523 322328 328274 307511 324372 328278 299692 264378 302273 384135 418538
12229 418538 361395 306410 287847 308725 307342 307594 339903 303709 341424 334807 359438 382263
12217 382263 390965 345745 318289 351061 385221 380175 343596 383010 425592 424508 466302 511412
12205 511412 525353 474889 489800 468752 468648 477465 521681 570840 613761 718309 767108 820387
12193 820387 906022 1032018 1157195 1225680 1404077 1646440 1826485 1999221 2111278 2193533
12183 2193533 2199611 2142903 2003203 1846994 1690705 1490152 1356913 1204792 1085685 1006784
12173 1006784 982658 874076 832270 790109 720807 696784 616748 632497 579613 537750 537186
12162 537186 567244 543832 517660 498452 459475 428701 442477 460171 463773 484039 471893 400705
12150 400705 364277 373801 397665 396358 419431 466325 468666 513425 495667 449861 454137 505973
12138 505973 630580 670443 670234 628692 578431 527644 497543 450929 416806 441133 419743 451825
12126 451825 459613 414050 421256 478887 463888 452461 434832 444444 475326 488741 515539 552847
12114 552847 629385 667810 601290 540950 527219 520389 507391 529279 580011 659621 805040
12103 805040 888003 991574 1141873 1231039 1305025 1452498 1648348 1816523 1960331 2057910
12093 2057910 2043291 2042580 1952847 1784899 1581584 1413549 1253967 1151009 1052433 967363 825047
12082 825047 687989 645568 535465 475043 402150 365935 390656 415719 455625 536595 614329
12071 614329 608735 580368 573909 497046 479480 426762 383505 391306 389552 358175 350922 381526
12059 381526 453538 611443 760485 853941 935943 1018077 1081813 1140106 1135637 1091142 989904
12048 989904 913454 885230 904712 936445 890776 870065 839810 838601 893474 952830 1038189 1060021
12036 1060021 1038889 1059580 1113847 1144309 1164217 1235780 1279333 1308048 1327031 1381689 1427982
12025 1427982 1496090 1517777 1535140 1517092 1532676 1594709 1701927 1795661 1869404 1962000 2082065
12014 2082065 2247716 2544889 2882733 3127282 3250013 3258767 3212403 3210187 3208627 3284264 3509869
12003 3509869 3790433 4130440 4408974 4622547 4818353 4941448 5013369 4997779 4977573 4924692
11993 4924692 4836569 4742258 4657820 4558148 4503053 4463924 4532903 4705372 4962216 5193550 5327165
11982 5327165 5419864 5418415 5359406 5290070 5196826 5103867 5013626 4941391 4889846 4864817 4919196
11971 4919196 5050162 5250751 5437811 5607827 5763101 5951252 6237235 6663854 7251112
11962 7251112 7997717 8780812 9519832 10261762 11009827 11689544 12386242 13105305 13963732
11953 13963732 15015676 16196869 17428666 18711092 19882632 20808661 21543019 22049274
11945 22049274 22357099 22496646 22580257 22753882 23124506 23835668 25010197 26694552 28960671
11936 28960671 32069582 36401962 42710678 51860616 64799183 82394187 104820056 130372098
11928 130372098 155171001 173617587 180844871 175472626 160257755 140299396 120789980
11921 120789980 105133245 94396981 87918268 84590093 83634951 84700938 87629343 92198558
11913 92198558 97775042 103326486 107807187 110623039 111768308 112016003 112383442 113573994
11905 113573994 116179733 120473147 126296420 132827314 138754524 142636520 143738996 142273631
11897 142273631 139439201 136871738 135997641 137806745 142929313 151959058 166355075 188752399
11889 188752399 222781758 271057076 331817918 395926317 448000762 472893671 463827390
11882 463827390 425146855 369341918 310524096 258811894 218553812 189497078 169706990
11875 169706990 157141506 150330556 148034221 149071803 151658045 153709429 153445335 150074517
11867 150074517 144248637 137338796 130783824 125698413 122602068 121512849 122043467 123386310
11859 123386310 124314020 123602179 120650222 115742109 109881729 104258944 99881991 97390015
11851 97390015 96733485 98032127 101714882 108853039 121093669 139224112 161948492 184820376
11843 184820376 201359692 206032925 197092293 176962883 150595702 123468790 99387853
11836 99387853 80184142 66060189 56226720 49671841 45301112 42472617 40621256 39356520
11828 39356520 38493408 37898187 37380225 36916564 36474310 35981927 35359441 34656436 33936259
11819 33936259 33087766 32161117 31239204 30261361 29083512 27719868 26299281 24814415 23441463
11810 23441463 22182747 21010674 20136131 19480556 19148194 19118055 19316579 19645009 19775007
11801 19775007 19530190 18881003 17904053 16896832 15963099 15184046 14659405 14256194 14079580
11792 14079580 14030416 14050166 14108341 14194137 14283450 14316206 14167903 13789847 13311564 12698570
11782 12698570 12091680 11617009 11261915 11057732 10910893 10776533 10668120 10576802 10515555 10404736
11772 10404736 10219565 10008718 9760188 9455153 9074034 8660882 8323310 8023256 7808214
11763 7808214 7698480 7647627 7554528 7472688 7355864 7082387 6683801 6267191 5793521 5380153
11753 5380153 5012821 4744745 4534195 4321790 4092645 3888255 3669773 3600819 3500613 3254653
11743 3254653 3041273 2889507 2730448 2523083 2339446 2244908 2145934 2066515 2028758 2011807
11733 2011807 1976212 1919073 1891206 1891360 1846531 1751438 1649641 1561247 1475204 1356333 1298965
11722 1298965 1290750 1252895 1199128 1209482 1192923 1137021 1134183 1170960 1127370 1179732 1171782 1098377
11710 1098377 1039870 1008255 1018511 1027602 1023196 1000836 983697 1001394 963043 920101 831823 738152
11698 738152 654588 618876 583688 593787 661444 748636 818631 878498 911416 921606 898855
11687 898855 914700 944689 883043 789577 787820 791320 730678 675250 648761 652552 645074 596136
11675 596136 622562 648004 638020 666783 616145 589310 573740 544047 574715 623476 601000 582391
11663 582391 540231 519664 505516 502930 501916 455124 417974 412946 395499 390404 412700 393600
11651 393600 411487 422801 482029 539895 568370 502782 457913 445654 455777 407946 370365
11640 370365 410377 465427 518730 456510 430428 429774 401853 418459 472155 453908 420722 458472
11628 458472 413662 389370 381116 363539 360830 370175 320543 304913 324210 357545 346440 318158
11616 318158 290524 258488 253536 269320 306406 275243 236812 205395 266262 295144 297476 331576
11604 331576 358216 361067 357794 354159 344368 328583 332572 324533 313766 273923 288660 294263 230436
11591 230436 201726 224454 273746 294919 249503 231463 272103 283756 276711 215914 192165 141544
11579 141544 93068 115642 187547 235049 206522 165255 133353 108769 94951 103761 95616 125937
11567 125937 163393 204417 223768 153575 112229 99334 95160 124242 164311 136755 111747 108593
11555 108593 143347 139364 133893 175141 212131 187158 145806 108279 119614 127868 173338 146385
11543 146385 127878 118002 39537 26704 86708 109112 127553 164741 186592 160319 120560 132147
11531 132147 105457 99252 103341 98094 96959 67102 20529 65671 154689 116226 59505 61414
11519 61414 44209 26582 78333 131853 123818 133078 147031 161587 166156 130044 83012 71769
11507 71769 92337 117858 147469 207254 200914 143860 98909 98904 151375 187266 158106 118285 214101
11494 214101 294061 327634 311529 359249 385709 351325 335108 369852 468155 556060 704937
11483 704937 814586 855439 972254 990874 969314 854013 727033 627324 576664 529824 493240
11472 493240 464148 478390 507099 566227 591057 522439 482272 448314 387736 483792 606249
11461 606249 619868 618199 670272 739592 810240 817367 817525 842369 837491 842722 848932 853134 842422
11448 842422 850218 864324 914280 1027214 1207759 1414716 1770411 2129561 2374185 2511520
11438 2511520 2491218 2364380 2156107 1866685 1607248 1354978 1152038 955725 793089 720610
11428 720610 697834 664264 666076 585644 512732 573232 589391 537266 477463 441881 486334 522643
11416 522643 548249 560163 589263 574330 628357 633403 635583 622381 641405 694992 690906 671371
11404 671371 693974 732821 760636 791583 800745 846007 905978 959122 964169 941675 848488 747641
11392 747641 626056 500489 465570 457439 470961 544751 583711 555891 493366 476351 486735
11381 486735 412445 321376 321479 295723 219945 126564 66295 58800 76570 105052 79695 70365
11369 70365 82042 140822 110579 85179 120068 145669 156621 116972 113222 126931 147268 142426
11357 142426 137140 99672 85782 103758 80848 56718 13985 11710 115719 118913 77231 86381
11345 86381 107055 54016 24302 20773 20404 38248 60233 46068 -1410 -302 47863 97963
11333 97963 136855 112876 61974 8827 -4155 -20248 -1199 -9600 -6026 41941 84215 145740
11321 145740 152330 157110 140957 106609 22691 -10920 -28049 -4446 46952 -6463 8607 72746
11309 72746 110230 45244 -21777 -58026 -58726 -1381 -13113 -38145 -18234 46604 89272 60874
11297 60874 27840 49260 27291 48932 34201 65482 116314 126319 162376 127148 64769 85140
11285 85140 161219 167288 121331 74059 65820 64567 87389 80771 52116 63141 59729 96302 78650
11272 78650 10777 39772 35637 67943 96119 109536 143646 166433 154142 138473 120594 65941
11260 65941 63817 15085 -47290 -54778 -29947 -30764 -2157 52654 28213 -4797 6417 72470
11248 72470 72361 19931 -4738 -15351 21129 -3911 6125 14486 -12043 -29129 -20833 -38634
11236 -38634 -74502 -37052 14192 26358 3941 -31331 -24495 17567 26766 39015 45885 29300
11224 29300 24338 38142 26462 -37774 -20384 -28334 -41699 -56132 -13568 26363 -17454 -85042
11212 -85042 -59861 9478 22624 38540 6196 -1311 11130 -5893 -16784 -94242 -113128 -56074
11200 -56074 -208 27399 41935 32283 41167 51238 32112 69811 59378 -14009 -18871 25090
11188 25090 24370 19798 -19082 -28529 -33052 -36141 -34183 -3542 -31621 -72149 -63328 -25143 18737
11175 18737 4036 56688 116573 111582 91433 135494 108274 16731 9929 10556 1068 11071 24937
11162 24937 67304 49313 837 -6316 32970 41171 70534 33886 -17070 -3009 -10651 5416
11150 5416 23602 -7617 -33782 -66322 -79261 -78209 -68214 -42047 -37558 -43574 -14408 3719 -1317
11137 -1317 -35637 -25314 -20073 1852 -18614 -48776 -38366 -72013 -116438 -94183 -50847 -6549
11125 -6549 60510 50005 -15083 -26590 2343 48983 34280 -22533 33197 33966 17959 -6239
11113 -6239 26329 39749 38278 5453 -7650 -27762 -33021 19392 76414 81487 38534 28006
11101 28006 -11040 -69733 -86461 13637 59192 -32928 -60958 -42819 1104 863 -7204 40084
11089 40084 46849 24235 2531 35909 23057 38769 19608 -30545 -62541 -64025 -75281 -63150
11077 -63150 -50385 -11310 36328 45434 38438 30336 -2728 85690 103078 64906 35718 -58190
11065 -58190 -83350 -27514 -20647 -54624 -105504 -131357 -156455 -145407 -91636 -54114 -20894 -9639
11053 -9639 -21729 -31948 -33186 -35296 -19769 9629 4378 -23477 -43590 -46841 -35565 -24712 -62965
11040 -62965 -114982 -80790 -69988 -65791 -61531 -54385 -36923 -26971 -33246 -47890 2584 -19758 -98951
11027 -98951 -100976 -29299 6051 43691 14443 1499 10607 -10833 8986 13177 -7921 12383
11015 12383 8368 9425 5421 -9843 -37131 7746 20176 -27270 -54297 -43423 -39733 -11569
11003 -11569 -17629 -22675 -44289 15709 -1966 -38635 -65314 -57860 -34065 -15584 -23293 -74095
10991 -74095 -79803 -12443 -22502 -12252 10292 -10749 11717 35432 66084 99025 92996 56492
10979 56492 31819 -28350 -61976 -19661 21873 3614 -34727 -68626 -60760 -28672 12881 30690
10967 30690 12042 -28892 -57087 -50463 -10590 -10256 -10626 23855 33830 19602 21871 -19188 7725
10954 7725 28030 -646 -7048 -21329 -50203 -89046 -43539 -30097 -18581 -48967 -48738 -45777 -80004
10941 -80004 -85094 -100612 -79898 -68616 -61678 7459 28818 -8356 6498 33992 31247 24386
10929 24386 24417 15101 33322 40274 19948 -2032 39046 66105 104385 52286 -6582 -41961 -23135
10916 -23135 34132 55076 85997 85478 87797 29489 18413 19562 31744 43181 36950 -18148 -34189
10903 -34189 -41858 -55511 -71052 -37762 37165 75220 -1241 -47009 -58895 23044 34477 24329
10891 24329 -38979 -38738 -31557 -25034 -18968 -3105 -9877 -32294 -71597 -75968 -15942 19861 45994
10878 45994 55625 34069 29306 78547 56645 3998 -19170 -88218 -49932 -953 -31948 33955
10866 33955 98490 118445 85206 82870 103439 115272 72807 38590 4248 -48080 -67045 -14303
10854 -14303 -23441 -46703 -36278 15438 46138 15955 -35564 -23804 8754 39705 -6370 353
10842 353 56464 111040 79824 32160 35063 43085 10983 -13872 -22912 -1111 14536 29624 -22018
10829 -22018 -56199 8854 59982 69421 87816 113619 45068 27432 -47147 -132419 -116321 -43701
10817 -43701 7605 18876 15251 8570 -33735 -34414 -16414 -22127 -23545 -37043 13169 95689 83678
10804 83678 38557 -9969 -16458 13790 21094 41637 17695 33988 40157 15931 5149 -61
10792 -61 46129 -5246 -38903 -60469 -66392 -32924 -18729 -70781 -55613 -59444 -31580 -16739 -5520
10779 -5520 31601 47684 16955 24843 9446 -6562 -359 48624 40183 45794 57936 71367 103275
10766 103275 106340 58651 -24917 -41006 -34194 -35613 -53975 -20053 -3156 23345 30694 30758 42759
10753 42759 49985 31981 -29323 -10453 26486 17668 91559 101005 105993 76343 66397 59496 73711
10740 73711 61052 93695 75061 42156 21244 20020 39824 1243 -23187 23725 37711 16096
10728 16096 690 14400 29192 23105 30062 22314 -710 47694 102221 53650 14490 93267
10716 93267 82250 33274 53784 3017 2975 30299 42986 38850 -8899 -42760 14479 49521
10704 49521 65513 79482 80555 69356 32893 -42043 -45000 8578 70327 15554 -46218 -75531
10692 -75531 -76081 -64505 -43142 -14834 11860 49490 60092 28993 5558 67804 140694 125951
10680 125951 65131 -5399 45905 73470 58324 46745 -20354 -71678 -64616 -54348 -56279 -31744
10668 -31744 -17688 -70535 -23288 10256 44724 77761 99221 116259 51572 25122 -14371 -21841
10656 -21841 -18759 23097 32350 28875 6017 31232 31622 -30768 -85691 -116814 -66930 -30847 -11210
10643 -11210 20677 49951 63919 63104 19000 5418 37804 97026 75493 27032 32020 90767
10631 90767 64630 72098 106563 124403 126744 96090 66603 65981 119977 121749 189407 153276 103791
10618 103791 79627 107857 140509 176011 170266 124113 142967 166033 170747 151322 93048 122081
10606 122081 104758 98646 115613 117569 95903 85267 63393 79430 68189 78877 91357 103884
10594 103884 78919 100239 134607 130905 98600 93729 125205 151462 116661 123890 128393 146266
10582 146266 143565 162591 190590 185659 170876 215843 233966 248008 167217 128637 133722 108402
10570 108402 131298 128523 55439 7953 -9515 -2101 101775 139112 95523 89657 103016 91275
10558 91275 88849 104665 119618 136745 120388 99305 96221 75341 103068 115003 131240 105035
10546 105035 32828 -12824 62012 67063 69341 83204 136273 207117 156070 100157 81069 96372
10534 96372 90529 104529 84230 84829 141000 134614 93620 63365 121489 133411 120285 105663
10522 105663 96075 135494 136820 120730 88196 100319 142589 62637 14149 50835 72952 120590
10510 120590 151734 133763 90562 38298 36159 37619 36329 -3005 -20623 -28557 28434 34611
10498 34611 15941 13491 47308 82372 136418 135525 111630 109066 66852 75826 66124 73618 26156
10485 26156 2709 -4494 7275 67950 81251 98682 116383 119810 88045 85076 77690 92551
10473 92551 116653 157078 120928 96333 111243 89164 55063 85673 138187 133924 181597 198538
10461 198538 174795 117527 115016 136121 110566 105255 112476 139760 137492 141091 152122 112830
10449 112830 91114 53752 29804 17035 39994 44050 21549 47600 24410 -8391 -19988 11427
10437 11427 15 -5008 10436 62725 86945 109141 116527 81048 43733 38340 65664 19717
10425 19717 -23406 -38588 -36963 13210 60306 63148 115417 212997 203995 159881 143035 173389
10413 173389 160595 91999 85614 113380 134385 139599 177023 160930 103343 81619 127270 128799
10401 128799 127056 115745 149861 140470 93078 114778 105240 118831 126686 51181 -6598 -44013
10389 -44013 -55662 -21037 52202 56312 67272 75365 104530 146504 158700 123991 118437 73325
10377 73325 22118 45111 41506 29550 44537 12135 -3983 16163 36711 51177 96702 88051
10365 88051 59869 115048 105902 79242 71327 104675 151435 146425 97119 109969 135260 135384 101815
10352 101815 124723 145153 150499 120847 110611 146088 174896 150521 133247 162216 193307 239455
10340 239455 318906 373595 467560 507493 480171 454185 478643 450405 380244 322483 267745
10329 267745 243978 247176 269471 256972 239584 257996 276220 228399 207497 219369 245148 270541
10317 270541 242301 209869 212517 184639 176004 165130 175676 216953 224903 242171 234596 236341
10305 236341 300330 343151 359217 413035 452153 507842 603080 765504 885906 1000878 1123104
10294 1123104 1232451 1322760 1432797 1455668 1428748 1386092 1229330 1023081 874059 702489
10284 702489 538933 460393 441031 348862 307107 330317 380754 412991 396366 427164 410257
10273 410257 346477 297512 266608 232050 224732 219839 185167 192118 236267 259090 288276 353492
10261 353492 446108 502753 488850 490110 640681 795919 987729 1206184 1429149 1641432
10251 1641432 1881612 2044301 2237335 2333223 2329936 2228439 2060062 1820753 1504767 1197515
10241 1197515 947337 780310 640894 579642 500578 420152 371043 401822 441477 400859 326558
10230 326558 323067 384894 394715 363524 362289 376453 373847 405745 428975 403844 345785 354982
10218 354982 427063 484018 542003 567564 598773 699978 785079 846869 941734 1121450 1312247
10207 1312247 1521888 1784739 2006917 2027423 1865935 1651502 1449804 1161298 917532 793401
10197 793401 685494 551871 503353 498413 447718 376548 375228 385753 399131 376518 418007
10186 418007 433302 390562 382336 395533 397843 392548 343218 302035 297409 327990 382822 420988
10174 420988 435315 367781 388570 421200 429534 433271 452421 514397 602210 667623 699338 734854
10162 734854 748476 814636 820060 715991 657306 604259 573835 505142 466660 466268 471160 409736
10150 409736 371384 350464 332583 325651 330403 389349 410973 363625 321633 301748 338241 314449
10138 314449 289208 275948 319622 381304 378617 399731 368787 383320 415730 439849 493147 486174
10126 486174 519091 483650 451851 437111 389074 361368 338156 324908 373462 418825 420837 402628
10114 402628 401780 415261 415694 485501 540415 512684 549644 679420 859523 1025027 1186402
10103 1186402 1283145 1289503 1230424 1042916 871782 729431 682926 639489 595270 570849 526068
10092 526068 505564 509284 520837 580555 628786 721915 813040 919590 998981 1109121 1225256
10081 1225256 1296644 1303163 1332350 1289551 1130613 969517 818764 716505 655094 619189 547747
10070 547747 483288 473411 443935 507406 544073 497253 482774 521663 597487 631545 583473 589515
10058 589515 574583 552422 552768 613706 731320 896175 1292621 1979891 2984474 3826099
10048 3826099 3887458 3442148 2720461 1990416 1495147 1172216 921678 816159 745410 650904
10038 650904 588164 548006 521477 485949 431936 391753 396717 341131 248880 224371 189941 174477
10026 174477 218001 244215 277986 340741 444010 498435 521106 549000 527735 482268 388061
10015 388061 282920 247570 271692 325865 354486 356011 354890 339572 321286 356441 505787
10004 505787 677781 818938 956242 1061481 1081391 1075353 964665 824911 773711 721443
9994 721443 637571 582288 580940 611476 585400 603333 666528 707127 721364 804320 897166 997941
9982 997941 1036918 1061553 1124741 1220317 1243513 1194310 1186637 1177569 1157274 1236062 1293534 1290737
9970 1290737 1261645 1305511 1266615 1251672 1238370 1259095 1397153 1638712 2001637 2431916 2814910
9959 2814910 3087229 3185559 3140518 2994123 2831679 2793161 2855811 3100056 3407392 3645395
9949 3645395 3769449 3938207 4102254 4409862 4813270 5185269 5505782 5890802 6286153 6580506
9939 6580506 6736654 6690736 6432086 6223383 6031172 5802790 5568674 5269145 5018419 4791171
9929 4791171 4585389 4581350 4696446 4966592 5228791 5500881 5976702 6585260 7462788 8785223
9919 8785223 10594175 12685376 14543035 15598906 15951653 15961597 15849834 15661183 15191457
9910 15191457 14399372 13312380 12062531 10859261 9979335 9491473 9078896 8762609 8495549
9901 8495549 8331933 8280386 8292443 8447812 8835774 9438699 10206141 11039319 11913696 12735233
9891 12735233 13689516 14874445 16260105 17939714 19984223 22473299 25612890 29811545
9883 29811545 35430755 43081326 53573576 67977726 87398546 112729244 143254435
9876 143254435 174580157 197371730 203206617 191766060 168098736 139711592 113439699
9869 113439699 92633063 77759328 68073014 62762944 61165378 62855739 67931173 76699454
9861 76699454 89118393 104156502 120259582 136214472 150800275 162576355 170434043
9854 170434043 174076625 174024503 171406007 167177599 161817281 155906024 149728205 143458003
9846 143458003 137380394 131804008 126878209 123158851 121742135 124054483 132112717 148729965
9838 148729965 177464589 221921074 284325509 361771551 440472458 496103145 508505784
9831 508505784 476553989 412933941 336631176 265703708 209263274 169022648 142687645
9824 142687645 127191976 119787671 118311490 120640227 124694898 129112545 133962478 139899096
9816 139899096 147100346 155119106 163242051 170254364 175331666 178199499 178183658 174049674
9808 174049674 165180773 151545507 134202766 115728744 98790772 85028828 74997143
9801 74997143 68441986 64844524 63958268 65975950 71318114 80806906 95685786 116876428
9793 116876428 143545655 171172452 191001987 195603810 184268600 161641550 134429363
9786 134429363 108482981 86887616 70311216 58065561 49053635 42342997 37338097
9779 37338097 33606161 30874108 28989272 27853195 27282231 27263010 27630991 27986721 28016315
9770 28016315 27513201 26464419 25151833 23980264 23208536 23006492 23372048 24206211 25231615
9761 25231615 26110095 26644916 26803661 26778472 26670450 26742418 27000452 27234031 27234371 27163687
9751 27163687 27124749 26997551 26407535 25244912 23678183 22115542 20973104 20461516 20544463
9742 20544463 20914958 21115451 20823959 20014013 18806365 17480330 16242007 15307128 14722702
9733 14722702 14508000 14549555 14802764 15137258 15415121 15511057 15455116 15238915 14969718 14693444
9723 14693444 14457735 14362446 14398835 14462900 14471247 14379225 14113403 13742065 13152510 12267590
9713 12267590 11335259 10411965 9454626 8546521 7757106 7189376 6802437 6466493 6230742
9704 6230742 6057057 5958220 6057373 6266855 6524361 6663195 6608703 6386483 6041776 5660868
9694 5660868 5260287 4855784 4482739 4121007 3844818 3635386 3454034 3274339 3122563 3005145
9684 3005145 2928897 2884688 2819837 2822833 2833916 2855902 2901702 2963688 2968454 2931686 2899722 2883468
9672 2883468 2795319 2686391 2554189 2395945 2252869 2124951 2025942 1968147 1901852 1882906
9662 1882906 1803831 1719755 1624238 1581828 1562326 1508539 1480062 1491756 1449663 1387822 1337079
9651 1337079 1288867 1158094 1049871 964793 916593 868131 833941 822781 876941 905982 946507
9640 946507 983941 1045255 1118901 1089967 1070161 1082205 1066526 1032223 994713 883996 799219
9629 799219 739642 698186 666793 606542 539318 554086 550252 575970 605448 665848 680014 655218
9617 655218 639835 607882 612219 562644 537071 532352 536213 476221 455442 423376 430975 455256
9605 455256 444178 473734 465543 441834 452752 490181 485716 514805 530968 592647 545684 499512
9593 499512 471693 421005 379690 328662 327149 345231 335028 300484 272564 281158 273508 307030
9581 307030 353159 311103 250087 284385 337565 331230 330060 314263 319563 266874 274574 266484 289260
9568 289260 291175 274838 279715 268660 303868 337579 279971 214960 211261 210605 278188 254539 197021
9555 197021 181370 156528 183237 201694 158369 152571 136880 113220 166341 111542 103657 130086
9543 130086 100346 70703 41304 81565 87513 89916 181338 215290 234753 262767 270818 285806
9531 285806 277340 222691 163986 141385 134997 180928 186144 136084 84759 100341 122336 88029
9519 88029 69832 130972 133318 125986 77194 79156 137101 172566 135023 131127 146900 178507 170219
9506 170219 228110 250065 202747 217671 290075 362753 470209 508563 484047 471197 500201
9495 500201 530035 526431 467229 418934 380776 346083 308664 242194 221495 229570 180137 125467
9483 125467 125553 155622 129032 136269 159196 170509 190278 166741 161501 196352 213652 253248 287091
9470 287091 306066 289461 278589 296667 328189 307580 346879 412410 453690 578788 715802
9459 715802 870523 1092806 1352893 1671001 1908882 2013816 2029363 1918403 1710885 1465229
9449 1465229 1216493 999302 836329 712587 664579 596778 517242 468082 465123 401368 373890
9438 373890 388574 371587 382795 374424 357832 360447 397415 419428 400770 380449 346196 331836
9426 331836 396471 459460 446100 457073 481135 521180 653457 729472 815296 955133 1161256
9415 1161256 1411448 1698456 2003412 2266918 2402159 2450447 2377687 2175990 1996015 1729474
9405 1729474 1525489 1304611 1113046 943136 818008 728154 651257 544511 449983 416932
9395 416932 427923 383941 352285 354232 372608 347528 356697 343079 364916 373062 379125 442537
9383 442537 442665 390557 391686 419213 468958 471174 462472 485426 571901 670972 714552 818653
9371 818653 1008018 1179074 1306378 1367828 1396568 1370530 1288572 1237794 1119138 1048969 936230
9360 936230 843215 748055 614028 520861 443760 402555 385670 381444 369122 398553 403647 339241
9348 339241 352109 395859 395316 417754 432400 398366 351770 338824 367864 387242 415258 422005
9336 422005 403830 433266 428593 384950 370650 450318 460998 438921 470457 546559 605793 618909
9324 618909 575341 538262 597619 675269 661409 627456 586637 501755 506978 514779 463337 425265
9312 425265 437704 389189 362198 348764 348711 351118 384303 424776 507159 535420 514835 545582
9300 545582 609418 594230 533592 472934 427125 443376 425120 498244 571086 568005 552734 631466
9288 631466 636946 608444 608554 597857 625189 642381 666308 682150 731727 759791 802364 767260
9276 767260 729727 779337 802373 804771 807679 809015 867000 889832 867705 894080 969763 1037786
9264 1037786 1080718 1057271 1062501 1067030 1091868 1153330 1231897 1298674 1309802 1394964 1467236 1491174
9252 1491174 1512267 1547072 1567672 1611884 1689551 1719766 1747973 1804975 1883878 1950854 2087498
9241 2087498 2190302 2275992 2341347 2388550 2470857 2645308 2750728 2875158 3000709 3185222
9231 3185222 3429744 3563321 3733244 3924716 4040124 4218110 4400580 4569721 4798876 5003911
9221 5003911 5235228 5479766 5667091 5864931 6113785 6309315 6489562 6679691 6823144 6966386
9211 6966386 7080856 7177902 7270839 7345606 7347390 7301157 7199383 7141997 7103654 7033044 6886990
9200 6886990 6679817 6455243 6273793 6093587 5919572 5731265 5439628 5192534 4970905 4738303
9190 4738303 4541043 4367788 4245628 4093373 3896844 3724426 3557178 3421541 3272561 3052923
9180 3052923 2914470 2827265 2686924 2608777 2554385 2440373 2277737 2136427 1980289 1942392
9170 1942392 1871627 1787644 1790349 1795062 1717186 1654518 1619253 1559335 1472775 1404596 1295144 1222326
9158 1222326 1205419 1141461 1163333 1174627 1135081 1098075 1030577 1032065 1034792 948665 911642 868127
9146 868127 838460 843281 857458 833558 799912 722812 656533 659055 686791 644946 625294 625383 591079
9133 591079 563976 563250 565766 622283 695026 739362 683690 692614 671490 590454 542668 449554
9121 449554 396686 399225 391526 376694 386785 406003 424016 398193 359185 362557 394314 423551
9109 423551 417286 444193 406453 392341 317210 282738 244200 261720 265163 225035 206176 235210
9097 235210 281136 316330 291774 274806 291921 328047 304612 274990 254530 250022 254416 265698
9085 265698 281573 275218 294526 260019 247344 240363 214770 228879 227410 198830 189669 182785 204539
9072 204539 178022 163046 125565 128860 101301 105239 146972 207071 173210 190172 185741 170801
9060 170801 162090 171768 181861 189496 177297 132054 85603 122753 155488 187364 164879 142123
9048 142123 162641 217598 197573 159830 156279 188189 192260 164751 125588 128988 136268 115087
9036 115087 79308 101742 104183 140837 171578 157864 88935 72295 84823 107497 97023 61887
9024 61887 65563 21767 -3245 28613 91366 104325 87535 40325 27607 87542 101925 79287
9012 79287 101248 143136 154948 150996 113460 65386 59488 101934 84251 57147 61678 78814
9000 78814 50880 19574 46450 27077 31737 106884 109832 103727 80845 65797 39402 44669 71363
8987 71363 122587 78052 40658 25837 23590 3309 39307 33555 22846 85982 155751 151757
8975 151757 111337 101602 130743 148258 120021 67260 138045 153104 126625 115166 98440 103182
8963 103182 1024 6931 103918 48333 16640 -8236 -61294 -65361 -49219 -48837 -30388 9025
8951 9025 63088 48316 54277 -3791 -14633 9977 82162 81755 47778 20319 -26284 17900 54582
8938 54582 39814 63284 81242 64931 41937 -9975 13216 96287 93903 64224 46611 30719
8926 30719 31019 61515 36215 30336 26892 50584 144298 137786 99382 47102 -15926 -23411 3828
8913 3828 34968 42445 66073 82890 92090 106871 132234 112852 128013 118140 29347 298 -5029
8900 -5029 25783 34 26292 55855 89779 136091 107843 91400 66724 18473 -2668 -29720
8888 -29720 -39340 -11620 -49768 -37675 46478 128978 163836 173704 206784 236879 200202 139980
8876 139980 77064 70598 68483 52885 45448 55151 78955 92660 99777 90663 82943 30531 9832
8863 9832 32199 34695 17631 -9481 -4950 9633 34264 62107 87562 95543 26657 3461 -21658
8850 -21658 -41806 -40843 3542 63044 116233 158773 125269 69155 30027 4963 38828 47745
8838 47745 -14572 -36941 -27853 -73809 6522 20896 45870 99123 120464 100708 44209 28763
8826 28763 45233 -5912 -3484 7832 -13124 -44152 26003 9693 -34021 -49983 -42720 -14565
8814 -14565 -27409 22871 47597 8953 -31159 -29536 49912 112728 60738 26289 10217 9708
8802 9708 -27143 33825 96210 106724 84533 57718 59219 43301 13520 -455 -6842 -17311
8790 -17311 -33217 28703 53691 24719 9650 -11851 -39649 -9702 11346 6532 31245 14830
8778 14830 73602 103309 130289 153494 85548 112345 97059 44465 40131 50890 59170 68438
8766 68438 76445 47365 23821 41305 15700 11000 16449 -10776 -29176 -19988 45666 82694 76923
8753 76923 64719 49289 10866 25126 55669 -3553 -28547 574 -26062 -7728 19031 -14773
8741 -14773 10209 42196 52399 39063 -5510 25 -10972 62982 71179 65330 70790 132694 194874
8728 194874 145482 132149 121671 82070 77704 74524 83603 126830 151628 110521 91809 112011
8716 112011 87088 86086 98072 136646 111172 79164 64170 31407 18427 52820 85419 85545
8704 85545 25435 42546 81047 115743 158130 223830 236825 194251 149666 106713 133339 125878
8692 125878 116111 115071 68911 91103 123983 149222 114846 37739 36072 40606 37477 50882 80216
8679 80216 58039 51448 60369 95172 125589 135210 125057 68215 121168 134363 124601 111881 125004
8666 125004 77266 77104 134146 108521 77818 66961 87934 118855 195207 185740 134437 106758
8654 106758 109141 152636 152278 172926 213862 172683 120826 126033 109978 165979 173618 157691 202557
8641 202557 239282 227957 195922 144899 166797 187033 169135 207607 176974 140405 161920 147246
8629 147246 130292 115476 150388 173379 148289 165882 215030 209863 236700 228094 200878 258877
8617 258877 283075 304493 359592 420567 473269 513639 535016 554731 533568 579670 698838
8606 698838 768693 759885 813549 896523 945475 938909 900501 915755 872896 787170 715158 676892
8594 676892 594378 597065 531578 430120 351888 313619 293637 293626 251223 232642 236763 180610
8582 180610 156406 250379 279546 217113 199736 166970 89504 84243 142716 130023 137332 186927
8570 186927 210024 206229 169179 136504 133118 130491 155739 175745 180101 159145 70031 38789
8558 38789 73116 87448 87679 121640 87704 48086 109246 146766 105120 73366 105478 152237
8546 152237 145171 113765 88077 40356 20971 66205 97193 48070 83322 105668 112186 100655
8534 100655 68917 46845 34372 25464 34137 64457 73637 79953 68554 96348 29240 1173
8522 1173 33601 83162 100814 115785 78478 42366 49194 112192 113523 45084 36392 91805 123198
8509 123198 109747 97251 119677 130838 100150 21801 -14 18452 43919 50720 96360 52643
8497 52643 -18023 -13548 45507 67324 82517 31057 37015 120277 150074 89671 87386 74198
8485 74198 71259 78599 47711 3618 -11632 -15893 43362 86344 38282 12698 -9283 -5239 26831
8472 26831 19911 71545 54281 34916 35935 65814 98087 114297 153784 174059 140662 119105
8460 119105 81007 75749 94517 79348 24819 31928 58609 35307 61537 57682 15933 -32619
8448 -32619 -26664 4128 1473 10941 45035 30687 -15341 17613 32082 24360 56265 67088 77794
8435 77794 82251 16594 -16146 -10541 -61877 -128257 -65392 -30466 -26291 12762 23159 35378
8423 35378 67639 76648 56387 9556 27141 74669 64573 15097 2115 55278 76476 83328
8411 83328 49134 1929 -23011 -11652 -12843 -35971 -29604 -20484 -28647 -53502 -74009 -71378 -75189
8398 -75189 -24867 10223 -3520 -8617 15813 41150 56766 12358 2905 55110 106766 92912
8386 92912 64657 50686 86388 124016 129336 107562 63100 57494 103151 52400 17841 831
8374 831 -2590 12677 38005 15392 63587 96319 83374 124284 151414 111029 67436 39137
8362 39137 23263 21283 71959 75804 76151 99556 52149 8234 25039 42721 38022 58352 70980
8349 70980 65193 28796 -4819 -2990 -8625 -17422 10427 52209 74051 41338 38439 69298 40325
8336 40325 26642 59935 37391 13061 57306 51834 18436 -15171 -14574 -30026 -24457 25225 82012
8323 82012 50991 10794 -44894 -791 -10326 8789 80874 83449 33122 -5916 -19947 -33334
8311 -33334 -54280 -22113 -45546 -60879 -27592 29016 46482 20636 19801 40312 58881 62120
8299 62120 110649 107707 73317 61386 84776 19407 -77916 -80284 -22747 -9334 -42875 -59400
8287 -59400 -39241 23111 49121 39376 16469 3883 12565 59733 53761 4776 34051 55971
8275 55971 32083 -7228 -53331 -45437 5428 41319 61971 49907 74907 38440 -56824 -44482
8263 -44482 -11472 25264 35441 42112 40052 82266 101005 98764 92573 121756 67521 50376 57473
8250 57473 81357 48435 4523 28945 11084 30336 31550 64825 50110 18361 141 49688
8238 49688 110538 97414 76575 77003 58078 20786 3298 65977 77054 74510 60900 14193
8226 14193 12903 37523 16953 -570 5598 -3036 25423 34278 5755 -15452 -2961 20460 35605
8213 35605 26234 -35485 -30799 20306 5293 30229 -14642 -4909 71801 91260 98316 51937 -36819
8200 -36819 19872 87978 61868 58170 -8885 -24270 4027 13123 80398 45341 -12543 38508
8188 38508 37260 59589 44148 50769 58596 111881 126396 59736 48971 17896 45749 48879 -19003
8175 -19003 -39467 -62666 -28296 23939 -3132 -46208 -22596 -16988 28533 109395 171426 132512
8163 132512 92841 120393 69591 40901 64673 284 13112 25930 46615 57728 58913 89150
8151 89150 110903 114266 53478 59949 80979 102507 49789 -18702 -50055 -37361 -1942 51328
8139 51328 62651 39300 45252 79866 84373 12502 56282 135567 142526 118885 95983 59894
8127 59894 35822 2918 2942 50534 83814 73039 52364 70001 94188 113176 61517 1607
8115 1607 32579 50532 61413 87813 111608 69079 82934 116340 91922 25585 -1696 6084
8103 6084 16437 45815 82602 103338 151603 200017 206204 212778 213536 222452 214884 206082 151390
8090 151390 128501 89962 82616 83248 107452 126577 131121 105745 101553 99667 119746 151174 164373
8077 164373 189384 225726 198073 158088 157303 143560 110141 143969 175944 171591 166698 127015
8065 127015 160552 161007 113300 13733 30328 63488 73765 100503 146753 181361 225711 216883
8053 216883 203919 209195 224692 228288 208665 157430 138856 158025 155098 148140 145254 246910
8041 246910 274359 229733 231908 225531 175623 180225 198503 152527 160044 180176 172963 206843 273078
8028 273078 258479 229055 241966 265398 266694 242285 251675 251881 292641 254717 224156 245351
8016 245351 213106 200131 259675 277465 262525 232621 199382 230343 296385 324283 283985 221796
8004 221796 166080 130664 169944 211329 195669 208686 222060 126343 58590 76389 168771 230373
7992 230373 211072 194875 164014 130973 120626 156217 161667 146385 172666 172348 124047 130589
7980 130589 168834 174366 183281 229572 227554 220309 234436 232936 238602 260341 272988 269216 182416
7967 182416 187466 238185 304151 340970 324191 289571 269013 261889 249531 230821 176203 162662
7955 162662 153588 169752 195734 176594 163363 136749 113268 117890 119835 138069 193347 225730
7943 225730 190207 147235 186374 216182 224007 248395 245904 156156 141960 181331 155021 162373
7931 162373 179267 139586 85640 103215 126974 128694 134437 101669 103558 104004 75568 105453 109557
7918 109557 118273 99126 126819 153003 128599 99345 126785 149595 157803 153902 105562 48325
7906 48325 78012 90509 111120 135035 113703 76095 16991 29646 65287 129118 196246 142125
7894 142125 149060 155778 120638 35504 1663 21018 51168 43613 46435 41050 50977 15461 54225
7881 54225 53658 29972 56872 36075 26660 31199 63426 22581 41611 57090 62837 48786 19635
7868 19635 4617 20274 6615 -24962 -40788 -38233 -41954 -39205 -18012 14662 41834 62285
7856 62285 39585 36020 34447 13741 13883 24946 7542 75974 88413 82732 93741 69478 94766
7843 94766 65112 46400 7408 1539 8822 6225 31963 113301 138988 104873 82863 72067
7831 72067 70964 39921 5077 4237 56253 19104 -826 24835 54215 69160 71664 46290 18744
7818 18744 -20520 -19420 -27758 -10821 -16245 17832 46297 56782 51442 33126 36154 16328 3884
7805 3884 2236 1699 28356 27452 16774 28042 59953 -20538 -46517 -19875 20794 -1314 101
7792 101 -20623 39487 50463 30853 22227 -1458 -5262 -24865 14307 45601 55124 44493 84090
7779 84090 126094 59000 43683 72366 25473 -18601 -17290 8161 26810 9132 11167 -37914
7767 -37914 -35540 37066 92771 87841 58635 56239 52039 59848 146956 138408 43946 5863 13261
7754 13261 -20343 45250 83393 53790 13679 -3188 15935 -33520 -67749 -14454 -13639 -24376
7742 -24376 -7801 -2639 10321 -4520 -34694 -53962 -105153 -110867 -59261 -48602 -70537 -61646
7730 -61646 -54685 -104482 -134756 -95975 -52700 -57510 -43120 -70117 -98688 -14975 48078 40858
7718 40858 6890 -64005 -74144 -72456 -84736 -98160 -56007 -34595 -35903 -46045 -96906 -97155 -74659
7705 -74659 -60463 -90848 -103919 -101876 -120530 -177861 -196686 -196957 -143922 -103138 -67086 -10333
7693 -10333 -47092 -83940 -49748 -5488 36842 18871 -26542 -32660 -37110 -25370 -20556 -26682 -58285
7680 -58285 -44736 -44547 13747 43275 -5000 -44184 -51161 -15829 -43758 -89445 -71533 -75302 -112540
7667 -112540 -143961 -131977 -110749 -103682 -101246 -68398 -52774 -75223 -102655 -67249 -91480 -82258
7655 -82258 -84305 -57017 -23462 17509 25521 62210 72194 6318 -1710 -4283 -45694 -65542 -57366
7642 -57366 5303 62063 17826 -56236 -116258 -127240 -97159 -25245 40584 40962 23677 512
7630 512 18088 -35472 -52364 -82898 -118649 -116748 -110538 -103222 -55584 -12043 -57282 -67829 -63416
7617 -63416 -32218 -22436 -33317 -23439 -63802 -142273 -106322 -66988 -99024 -58303 -51493 -49202 -6865
7604 -6865 -20850 -35131 2275 -22061 -35351 -56064 -18932 -21903 -18080 -31462 5619 -7189
7592 -7189 -46742 -26218 -37244 -65233 -73833 -51087 -42968 -95538 -134012 -107661 -30921 -276
7580 -276 -55230 -60068 -37583 -129437 -161106 -128931 -67903 -17767 -11701 1020 20376 26170 62853
7567 62853 90761 66067 43565 30729 8724 19005 -34439 -41970 -4958 7356 45110 82529
7555 82529 35194 -22789 -67860 -95199 -121394 -121279 -81110 -39582 -38087 -35974 3066 1509 -8033
7542 -8033 -9975 -11495 30092 29470 23602 15536 23736 -27559 -4363 34303 36425 61413 37849 -23286
7528 -23286 -64047 -117116 -36188 31541 92339 62174 23748 16293 2227 -39452 -19576 7162
7516 7162 -10644 -45600 -110689 -99381 -52298 -17605 -39350 -56996 -78786 -53525 -1986 -4910
7504 -4910 -4479 -2687 -19296 28593 -12781 -77775 -57059 -34319 10369 2436 -57060 -43678 -18785
7491 -18785 -43907 -99248 -96674 -26389 22319 53667 77202 25451 -21590 -8625 -19021 -31172
7479 -31172 -45330 -24248 8304 -48199 -3772 41717 52503 91572 92934 84678 49154 -12443
7467 -12443 -33702 -57508 -52157 -31052 -32138 -42974 -39880 -30512 -56220 -116096 -92401 -103803 -101953
7454 -101953 -13789 46231 72298 37967 10480 39769 27812 28050 -24670 -17207 7199 9301
7442 9301 -5599 13464 -147 -23737 -59151 -81910 -64885 -31091 -75510 -108988 -65765 -97894
7430 -97894 -95113 -75071 -55503 -4866 -14317 -55021 -49609 -77471 -34253 20725 17047 11287 -5432
7417 -5432 -22751 -8633 -3107 -28824 -69361 -111013 -103439 -126812 -140967 -146770 -149936 -106396 -47602
7404 -47602 1364 71257 121007 101029 20299 -38651 -38470 43797 36614 6334 12923 -6631 -14318
7391 -14318 14428 1542 6585 6822 9719 22846 -26038 -41385 -72669 -60467 -72864 -36694 -51752
7378 -51752 -54411 -111726 -103040 -71200 -42003 6596 16470 -1231 -2699 31252 50309 48602 66554
7365 66554 14447 23335 45442 62775 39655 37773 -16127 -59758 27367 77484 87701 58005
7353 58005 9465 -11626 30001 1246 -70578 -91993 -71715 -82118 -72772 -31396 -52226 -21898
7341 -21898 727 -70294 -57850 -12659 -43978 -6905 34477 24851 -27233 -23839 -18979 -45673
7329 -45673 -56324 -72061 -34546 -15044 27811 29459 -23341 28074 79332 118871 154633 75496
7317 75496 33004 4669 26305 30100 4075 -65657 -67386 16928 77534 44456 56180 11550
7305 11550 -89715 -91479 -86553 -104241 -55893 -98996 -122233 -63342 -26709 -21376 -55640 -79385
7293 -79385 -56380 -21364 -42969 -45378 -42070 -103538 -93734 -72327 -27192 29583 32987 1337 -19875
7280 -19875 -44692 -82251 -80261 -123983 -110202 -53014 -54458 -51446 -44348 -35214 -38089 -7294 22987
7267 22987 12728 -3542 10883 8095 37799 57733 53215 76574 87640 138463 79112 47544
7255 47544 7888 35103 26972 -15797 -24579 18735 23899 -25220 -31854 -25177 -3185 -9279 7169
7242 7169 -16188 -46020 -58163 -56460 10919 -4152 -10562 10187 22451 56670 66110 60209 20219
7229 20219 -27646 6538 -6438 -26817 -10931 -15846 -17617 -9798 -16856 5315 -27636 -61424 -24108
7216 -24108 -9909 -36411 -14469 13086 38712 47422 46110 1885 -6680 -22589 -23328 -17785 -26924
7203 -26924 -44224 -37306 -27239 -34782 -19808 -24301 -53959 -56509 -38518 -61914 -40122 -64202 -33065
7190 -33065 -33645 -74010 -81070 -63080 -108693 -143512 -138535 -86941 -35917 -63111 -35842 -13145 -12998
7177 -12998 -9859 34334 41746 31734 33266 39828 9634 -2338 -30734 -24202 775 -13394 -22792
7164 -22792 -82101 -59157 58789 107888 116760 64595 -27573 -102562 -98359 -69325 -86130 -55642
7152 -55642 -29727 9250 56105 21418 3179 -15818 -11222 -17027 -41308 -21700 29936 26822
7140 26822 46221 20012 19316 -40564 -55826 -69710 -129854 -105981 -40535 -18534 27267 25972
7128 25972 22042 -1968 17585 -16137 21201 83468 41561 -25593 -25994 3937 -42857 -96005
7116 -96005 -43814 -3963 9701 -27410 -65490 -100221 -94754 -76303 -28129 -3323 46177 101350
7104 101350 95240 94279 89637 55340 47293 32154 33695 16414 4579 32958 24097 -13273 33682
7091 33682 27401 -7181 -48514 -68820 -23566 -3414 3306 20056 4542 -15572 25171 18598
7079 18598 -19923 -54533 -60719 -24022 -12334 -9766 11346 18726 43321 2669 -34010 -31697 -35369
7066 -35369 -40675 -62942 -51172 -71590 -55634 -5254 -23204 15213 4797 -66687 -58590 -29954
7054 -29954 -45252 -37437 -1376 -15338 -61415 -91220 -69007 -39506 -73776 -110608 -69758 -42191
7042 -42191 -46615 28457 36433 14529 9030 9717 -1628 -37768 -43433 -59319 -77720 -69753 -77622
7029 -77622 -74794 -71479 -52832 -69914 -54500 -20591 -22472 -65143 -82390 -70219 -38801 -34524 -62068
7016 -62068 -35162 -23471 -45134 -86340 -50202 -25316 -39705 -26130 -38427 -23396 4380 20371
7004 20371 -2522 -36866 -22906 12365 -75763 -124646 -113816 -76806 -80446 -68107 -89358 -78800
6992 -78800 -81623 -46335 -22877 -14755 -18964 -15582 -43154 -91568 -169510 -192536 -122380 -71110 -10150
6979 -10150 -44887 -78297 -108237 -15266 40840 22359 3609 -30975 -3127 2102 -62307 -102735
6967 -102735 -107211 -99621 -37998 50417 53147 -15465 10723 10252 -42236 -28296 -20351 -10135 -14327
6954 -14327 -33897 -8730 34705 59465 49492 -17247 -25888 -57289 -55168 -46231 -55801 -83032 -94026
6941 -94026 -54243 -58347 -86172 -165042 -177951 -179273 -150006 -64585 -50647 -70470 -73320 -56533
6929 -56533 -42530 -42776 -23586 -55369 -68284 -94595 -95386 -74680 -49044 -45138 -40788 -30663 -12398
6916 -12398 -17793 -24047 -29710 9794 39426 12987 -8503 11902 -20927 -79153 -99743 -91604 -153864
6903 -153864 -98110 -29512 -12077 54177 43472 18419 -29053 -59997 -67241 -58194 -73743 -64640
6891 -64640 -86389 -87420 -31574 -32998 -41228 -9743 -9640 -31406 -41266 -53467 -25307 -47078 -86676
6878 -86676 -56699 -68296 -42567 -22804 -6710 -12368 -21934 51336 107527 80313 -12519 -55543
6866 -55543 -36460 -27660 -28264 -60298 -36048 -30437 1824 23787 39000 38864 30110 53884 82604
6853 82604 29856 -33428 -17835 -8035 -14484 -12414 -45382 -98347 -91138 -5443 11318 -14322 -57753
6840 -57753 -99055 -112383 -54758 -49233 -43555 -9912 6023 46365 63018 11744 25556 17121
6828 17121 -21528 -23256 -6679 -9998 -42448 -20915 66069 74253 35632 8625 -5835 24326
6816 24326 30051 -28727 -43442 -46892 -53113 -49704 -45536 -32112 -13754 30167 40077 10564 20515
6803 20515 23389 35266 67319 39224 45839 71705 96368 114999 120120 96178 51142 17057
6791 17057 31508 37919 32449 33189 33973 28638 -3310 -19026 10643 -6709 24142 42670 17107
6778 17107 -5126 18366 59341 110495 94113 102330 120287 71401 88194 125117 84734 72951
6766 72951 88766 82757 68284 45814 72455 90787 139958 287625 367067 501480 646548
6755 646548 793803 870892 911506 864126 775579 650358 533674 470936 496803 571356 635404
6744 635404 675205 728334 890119 1076308 1330471 1713785 2173865 2796399 3693614 5050901
6734 5050901 7095251 10247014 14642815 19029939 20809393 19387026 16075948 11970699
6726 11970699 8359201 5806483 4157055 3012465 2270046 1757918 1331462 1086305 898443
6717 898443 762880 704085 656963 574553 501955 433139 394536 424601 439121 531840 673894
6706 673894 674513 596483 485878 416667 354513 266454 173832 134807 129286 159912 125818 133883
6694 133883 144663 130871 195666 247676 276866 226582 170996 127091 104987 115281 125452 120511
6682 120511 95365 69189 76933 83678 55201 33288 6736 -37703 -21812 20097 59068 119229
6670 119229 80331 19180 8636 3999 44794 15501 55704 46303 1108 6864 27264 29386
6658 29386 -8366 24047 39830 25537 -928 -389 -43569 -50760 10969 104910 60226 -46098
6646 -46098 -106962 -112691 -36691 2776 -28535 -44354 -50859 -118240 -118938 -48582 -25594 -31656 -34903
6633 -34903 -52549 -92904 -91391 -110031 -74486 -59533 -119594 -115858 -50702 -40085 -18310 11077
6621 11077 23020 46988 22602 -1398 -33660 -43763 -20206 -7257 -30256 -42890 -15494 -19068
6609 -19068 -27087 -59616 -63335 -34286 -4145 -38845 -35337 -38136 6008 19041 26038 101531 47883
6596 47883 -14597 123 26971 15573 -59987 -99720 -57638 -47602 -34516 -31781 -51423 -59784
6584 -59784 -13040 13601 -5557 -19903 -44736 -50035 -36430 -15340 4257 45899 -1182 -1865
6572 -1865 -4346 -45581 -62575 -69513 -66449 -88825 -72465 -65862 -21858 -28543 -101248 -92694 -86877
6559 -86877 -100632 -126733 -109571 -52415 28335 67023 38359 15456 -2763 -20143 -57206 -65608
6547 -65608 -76565 -42011 -12961 -11271 -32113 -54520 -20009 13154 -849 -19866 16592 58968
6535 58968 13576 3152 -39994 -49221 -21081 40420 35528 5134 -4947 6579 4346 16446
6523 16446 9063 -1971 -42003 -84742 -36441 8928 1456 24262 56380 47039 10797 20216 5554
6510 5554 -34597 -57191 -74708 -48992 -71236 -59792 -15450 40517 23580 65722 51124 28162
6498 28162 64151 87041 76246 90070 77352 63345 39202 35353 26686 14400 -691 -864 -15665
6485 -15665 -41409 -105333 -139216 -133435 -56500 -4052 -920 46720 25224 -43812 -64614 -20411
6473 -20411 -11584 -15068 -42608 -49999 -67980 -109263 -64643 -45088 -18947 20907 50411 30238
6461 30238 24514 -1324 -32252 -21718 -318 9657 11623 -5817 -81053 -130312 -121608 -127500 -83594
6448 -83594 -31119 -20286 2539 11515 24441 28494 25753 4311 -26833 -46062 -103497 -106222 -57981
6435 -57981 -72542 -75894 -64529 -87988 -50176 -3619 47663 32167 76851 103993 46822 -14164
6423 -14164 -50650 -76687 7336 107440 59458 5429 -72457 -131551 -88030 -88023 -66582 -34775
6411 -34775 -62212 -42596 -8718 -4357 -6920 31063 36391 20994 -11386 -57660 -91996 -45972
6399 -45972 -35749 -30276 10463 25821 995 -5134 31189 -27060 -79131 -81733 -27068 -1755
6387 -1755 13547 25698 -19843 -29244 -10908 -61499 -62583 -43327 -44823 -54973 -32458 -69006 -118812
6374 -118812 -106780 -53128 15253 11900 -20189 14804 48313 38335 22584 18326 1060 -39468
6362 -39468 -52082 -25544 18903 25393 59361 94161 88702 120161 144884 123480 91354 68513
6350 68513 71258 15175 -43561 -94018 -46185 -34580 -42482 -50588 -38332 -40370 -31834 -61109 -52131
6337 -52131 2052 79463 39353 -9473 -64654 -92563 -76478 -100367 -34890 -36014 -93704 -110211
6325 -110211 -128613 -103500 -93866 -51042 -44551 -59501 -66782 -53943 -8112 9132 25272 40209
6313 40209 33572 20148 -20028 -12876 -6341 -48644 -37468 -20276 28390 57832 62498 19395 -49969
6300 -49969 -63932 -15988 874 1137 -20883 -44400 -43188 -9876 42182 31043 168 -33190
6288 -33190 -8073 43345 12304 -15461 -43532 -69931 -105276 -85962 -29675 -28685 -63935 -43075
6276 -43075 -12856 20262 62732 95879 69267 28581 -15835 27838 66555 57649 2001 -24865
6264 -24865 31565 9815 17912 9681 -21138 -4618 -6747 -15717 15266 40854 -37205 -40879 -39113
6251 -39113 -57041 -43954 -5185 -14072 -51503 -20040 -18459 -38211 -65383 -65676 -31978 18645 48858
6238 48858 -4430 5029 -26747 -25761 -29202 -46164 4427 32343 -46413 -54927 -14078 -4181 -7618
6225 -7618 33973 3625 -10044 20773 -10537 8931 23471 29117 12915 4910 -2819 -42562 -24100
6212 -24100 -5938 -26079 -84969 -61394 -39114 -56629 -74891 -104622 -69676 -38330 -46121 -39817
6200 -39817 -53157 -10742 37267 17796 -16936 -29874 -6395 27856 -3538 -8941 -2368 -9176
6188 -9176 44802 42261 21454 14688 48961 -3693 -5038 -14556 -17107 -5864 5835 25860 -3897
6175 -3897 -49753 -67840 -8681 25576 -3192 -43736 -53598 -53497 -72133 -51417 -81546 -68961 -58286
6162 -58286 -52390 -1790 -24583 -74024 -103995 -141312 -127966 -45493 -41448 -26333 -11443 -52436
6150 -52436 -32498 8677 8137 -45528 -40735 -41710 -61096 -40695 -55469 -74581 -88510 -56287 -30218
6137 -30218 -44737 -34147 -483 24049 36165 42686 13520 -32014 -37911 -44556 -36035 -36847 -31542
6124 -31542 -30999 -61723 -70609 -38552 -33732 2638 50842 70051 42919 -36761 -77203 -62521 -52867
6111 -52867 -1557 35384 16959 7331 -634 -35666 -848 15717 6558 -32425 -26466 -15093 -1221
6098 -1221 -6771 -45462 -50907 -78186 -48985 -26048 -59605 -106593 -96953 -68468 -40456 -39799 -9012
6085 -9012 42663 47104 -2507 -5978 -26113 3960 -11530 -37965 -52801 -72130 -45625 6617
6073 6617 18134 -23915 -62036 -39428 -25264 -12203 42481 30403 -21130 9502 -17813 -46568
6061 -46568 -41235 -815 2841 39499 87286 68787 16515 -29370 666 -19431 -24399 -42926
6049 -42926 -51889 -48890 -8634 18618 11163 -22430 -49971 -35172 -121 105893 190000 156870
6037 156870 95777 23283 -24303 -23555 -20792 18089 -8095 15166 17755 5156 -40788 -75521
6025 -75521 -97584 -93604 -102396 -74387 -41304 -26950 -63190 -39310 -8030 -36812 -41764 -76014
6013 -76014 -45375 -33699 -28724 -19972 26383 64291 28708 -14227 12220 48231 43403 3850
6001 3850 14822 4208 7031 -55819 -56846 -5263 58218 69127 39042 25828 -41475 -41052 -33349
5988 -33349 -45542 -36590 -25442 7177 -12202 -14540 -52341 -52966 -17048 -15552 -22576 -29940 -20668
5975 -20668 27565 35673 73837 27297 28302 25984 10474 -759 6534 22586 36972 22190 7269
5962 7269 -1257 -38330 -32539 -11203 -49376 -53877 -28679 -26033 -22735 -25412 19852 39025 15950
5949 15950 12328 15039 -11916 -29766 -35341 -25488 4893 -38581 -37554 -9638 24018 62501 67841
5936 67841 53773 45502 14205 -13379 -36792 -12393 22860 7432 -525 -33639 -51674 -83569
5924 -83569 -116967 -145847 -134055 -130036 -130666 -159204 -141396 -99482 -109895 -70326 -42479 -44821 -47879
5911 -47879 -67989 -51295 -30026 -39285 -50857 -26482 4228 26117 77955 86424 88201 91125 65692
5898 65692 5211 -61164 -109809 -108809 -74953 -60214 -66648 -51312 -48027 -19236 -7804 2078 -14171
5885 -14171 -54035 -63593 -67366 -4726 52950 66780 58677 -3461 -36484 -31059 40640 47703 6745
5872 6745 -73389 -71812 -39855 -35802 -53954 -96170 -97252 -95444 -107289 -79994 -37717 -80941 -51978
5859 -51978 15280 33600 55635 76065 61598 2447 -6882 -6788 -27885 -99266 -92916 -57864 -51727
5846 -51727 -55889 -38446 4891 48291 71771 32804 -18555 -18564 -10144 -54464 -78245 -44218 -49621
5833 -49621 -13472 -11748 4750 -8543 21674 12084 85005 66389 22035 -8605 -5109 -10187 -22923
5820 -22923 1449 7187 4447 10669 43302 24942 -6298 -67445 -79401 -23574 -10276 -30456
5808 -30456 -41882 10051 -18601 -49580 -85445 -122473 -150580 -56294 -4193 18682 64187 51402
5796 51402 53018 47016 49211 19917 -19062 -51534 -81935 -105206 -125632 -129503 -88986 -3649 -1016
5783 -1016 -6272 5569 -31044 15156 20612 369 -30523 -87263 -125835 -149126 -62909 -1321
5771 -1321 15703 62256 94784 77745 16960 5799 -2632 -2384 28600 23439 49261 71273 38437
5758 38437 -13770 -57754 -14034 17440 2476 -32083 -43428 -10771 16464 9304 -49041 -79971
5746 -79971 -68804 -6964 9213 31471 29289 3724 -7495 4448 -36730 -109524 -97149 -54521
5734 -54521 -48766 -27354 -31603 -49884 -14454 -17010 -15574 -54485 -58264 -45717 -56136 -93353 -67843
5721 -67843 -42999 -19071 8743 0 -17987 -15069 -54603 -88132 -107912 -85540 -66701 -64199
5709 -64199 -63903 -16482 -9276 3983 -1930 5868 9217 -3218 -41855 -65714 -71228 -70444 -24195 51093
5695 51093 90999 65141 49294 55414 75230 84370 37249 -29256 -111836 -132146 -126324 -65425
5683 -65425 -23585 -19977 -29062 -5417 -19468 -37935 -18258 -63571 -40023 -62324 -60257 -83989
5671 -83989 -62842 -36980 -68353 -76457 -36406 -32243 14849 37133 21515 20235 56970 54041 5517
5658 5517 -19351 13831 34884 50260 28947 50253 92365 103855 31869 -9867 -95222 -104130
5646 -104130 -79907 -59087 -29360 -59159 -52479 -52626 -10024 3469 -108 -9922 16422 72586 31671
5633 31671 -27631 -49415 -36031 -20931 -55276 -49243 4284 17229 60253 73553 90519 89991
5621 89991 46706 16485 66098 95098 103373 61795 46461 13188 -5638 -8653 -17627 17916
5609 17916 -51875 -27084 -4492 -255 -33643 -24433 -15333 -14161 -9238 -2225 -16591 -276 -13793
5596 -13793 -9918 -18941 -33888 -42090 7227 18580 -42975 -19849 6272 -19755 -6731 11746
5584 11746 13094 49819 37056 -596 7411 43829 72296 55978 29503 -14961 -78676 -103521
5572 -103521 -45870 272 32039 63628 86984 82436 10281 3922 17635 -38817 -82572 -29093
5560 -29093 5620 29959 -44559 -139970 -127298 -91171 -65626 -62454 11689 94603 49480 -81
5548 -81 37545 49174 39751 8135 9110 -2582 21755 53493 37320 41176 25186 -6638 54532
5535 54532 77511 51663 -8389 -17806 2320 -28950 -25761 -16873 35619 49705 -8975 748 -36597
5522 -36597 -11693 5082 38423 10582 4530 17351 17702 -6024 -48533 -88507 -76509 -61890
5510 -61890 -45942 -5008 -65475 -92782 -79844 -127246 -113476 -80651 -34695 -50135 -26543 -9765
5498 -9765 12022 13165 -34517 -91784 -98079 -76303 -20763 21496 77010 87063 93658 54347 29989
5485 29989 25096 7205 25216 62317 37605 -14327 -11404 -14495 -36004 17339 65914 44466
5473 44466 45299 14929 11200 -5131 -11948 4017 -742 2617 -3044 -31339 -58658 10819 53891
5460 53891 56493 17387 -5759 27214 -2225 -11051 -20761 9088 -12067 -38273 6036 31560
5448 31560 -4057 -26718 -10403 54104 55961 28140 -352 -43993 -57910 -33698 -17327 -28371
5436 -28371 -19474 -28414 -42031 -38148 -56949 -93842 -79748 -47711 -73088 -112140 -78091 -24043
5424 -24043 -31543 -34853 -17592 -10688 -36565 -22054 -18282 24937 12363 16309 12737 82877 63971
5411 63971 78027 79012 31875 -4133 -44402 -15094 15321 550 -22919 7431 -6661 21316
5399 21316 60490 59450 57384 50833 29217 15000 8718 -8168 -12647 42352 56144 -35824 -89073
5386 -89073 -100564 -49805 -36484 -43842 -103205 -145371 -122198 -70315 -38362 -55457 -78354 -51221
5374 -51221 35869 33496 -27119 -41189 -35669 9794 -15386 -89233 -111495 -87958 -61501 -45887
5362 -45887 -36116 19477 44870 44309 16430 -2000 -21178 -63831 -88442 -53320 -40472 -71579
5350 -71579 -80250 -48268 -57592 -64950 -64943 -81698 -59624 -99411 -107533 -107327 -39416 -27825 -21290 -3093
5336 -3093 -12177 11620 19573 45011 52255 65764 70285 59731 62594 63540 77521 96450 90815 -8442
5322 -8442 -74367 -52522 -13518 15149 -6496 -24967 4699 4901 30722 -10140 -25931 -78467
5310 -78467 -101417 -91489 -50837 -24366 -10120 -8312 -10635 45664 23886 -31091 -14475 53161
5298 53161 65252 -16200 -44884 -32182 -3342 24967 35942 -34969 -32443 -31558 -108177 -111397 -58291
5285 -58291 -53338 -33847 -77087 -84323 -38609 5093 -39513 -43070 -30613 -27570 -80491 -89496 -50499
5272 -50499 -58771 -62099 -57477 -62763 -38305 -34511 -1555 30303 12742 21672 35048 -19368 -60525
5259 -60525 -80744 -123102 -98708 -95647 -35561 14139 -7657 12385 -37752 -84252 -99028 -68952
5247 -68952 -48551 -36257 -84112 -33892 -6224 -19336 -25218 -57503 -54886 -70421 -12211 21947
5235 21947 -16755 -35676 -43506 -34984 -28682 -82619 -103907 -72415 -57288 -79548 -39947 -19139
5223 -19139 -13813 5812 -25835 -81508 -98786 -80455 -84233 -79013 -51285 -70719 -115384 -119912 -74278
5210 -74278 -44623 -23794 -25438 -66557 -55527 -64539 -75476 -84334 -116265 -75501 -25814 -70617
5198 -70617 -138716 -110109 -17125 -6021 -69673 -71032 -83295 -99516 -42575 8184 22772 42354
5186 42354 1424 22325 -15903 -62082 19798 56758 32159 19835 32397 -1442 17804 16138
5174 16138 -19980 -51055 -17138 -6074 -33988 5319 4560 19104 26252 50649 51535 38374 14592
5161 14592 -34780 -26350 9878 34395 42934 53552 25818 -23192 -57369 -67482 -17714 22360
5149 22360 18806 -24675 -35781 -32429 23497 52108 18428 -27890 -80765 -130636 -110333 -82740
5137 -82740 -44192 -38677 -53046 -12388 28335 14773 2191 2522 9039 -49710 -55715 -85550 -73223
5124 -73223 -12940 -11362 -4052 5565 -5823 -3142 23709 49682 61487 3913 8608 -13580 -19932
5111 -19932 5864 58524 64914 30678 79525 78081 40669 -9956 -22783 14601 -8888 23097
5099 23097 24061 -47690 -69950 -44821 -28610 -28785 -42425 -51410 -21234 4385 50916 77144 49596
5086 49596 -62745 -80162 -60075 -26022 -21307 162 -8006 224 -26637 -57368 -58797 -68535 -51785
5073 -51785 -20690 -57383 -91057 -81097 -37104 52117 25963 -7828 26572 39755 17347 -19234
5061 -19234 -57399 -60515 -69574 10313 49000 12558 55670 43861 53038 64062 60986 698 -52669
5048 -52669 -78565 -44885 16050 4854 -4229 -74335 -50933 -36845 22135 81320 87002 17526
5036 17526 -52759 -86774 -111780 -77655 -61332 -28486 -24126 -31726 -10728 -44081 -82940 -58756
5024 -58756 -78654 -113990 -73426 -67977 -83663 -88760 -69200 -43944 -65846 -98372 -100752 -24067
5012 -24067 5658 21688 -26196 11134 65466 22240 -40971 -744 6981 -18588 20123 48963
5000 48963 46362 13153 -31527 -36775 -62964 -74323 -94081 -83791 -17460 17096 25652 1816
4988 1816 15976 43554 46004 50086 14224 -48268 -68849 -40533 24447 42135 37065 16304 -24012
4975 -24012 -46200 9636 18940 14431 2914 -20285 -31912 -28454 29425 39397 -955 -48187 -53142
4962 -53142 -37789 -43371 -69548 -34137 -46686 -15298 -30210 17626 34623 19750 -37020 -66954
4950 -66954 -11020 -7702 -30009 -46376 -24280 -67417 -99193 -57386 -31076 -11796 5566 -11866
4938 -11866 2605 55380 37684 -36489 -105624 -107411 -31691 32580 31582 32730 30027 43392 21683
4925 21683 -55971 -77513 -69871 -54320 -16679 -15800 -19465 15108 -41594 -68564 -33511 -49064 -80099
4912 -80099 -112904 -96918 -51239 -70967 -85571 -78539 -106115 -90980 -74566 -76474 -52105 -12514
4900 -12514 -45266 -50936 -31842 -27693 -50264 -65720 -46745 -1089 3550 -21727 9007 31948
4888 31948 33776 -5588 -88492 -101553 -41549 -29670 -22273 3599 30901 29451 49262 -11606
4876 -11606 -44007 -9823 -20645 -56252 -37106 -30446 -29316 -18574 -26761 -60162 -5980 19813
4864 19813 1913 -28513 -46806 -42382 7022 34887 10474 54300 101481 87761 119124 123989
4852 123989 46112 28227 11523 44194 101918 117094 76560 62052 58665 49572 14902 -11701
4840 -11701 -15946 -14923 -26516 14932 67119 79577 82118 22894 27244 47513 3291 -5047 -21754
4827 -21754 -38808 -17182 28015 69218 71460 61761 53377 -2598 -33811 -9519 -48049 -57967 -23741
4814 -23741 48731 12568 9463 46329 73776 77581 65593 72186 72273 11688 3709 -2350 -61674
4801 -61674 -70669 -96438 -117641 -120330 -120983 -90149 -54657 -21944 34915 -5279 -26625 1605 -38978
4788 -38978 -14598 21735 -15684 -20922 -2520 41161 70829 26789 -20402 -28882 -20049 9151
4776 9151 -38845 -18248 14715 13633 25399 70348 65377 23120 -29462 -42132 -72765 -94431
4764 -94431 -88251 -21109 44655 52605 86122 101405 83309 41909 13006 -4539 -53761 -104984
4752 -104984 -101665 -81320 -39851 12248 -6370 -54856 20201 78495 108752 66925 55473 75467
4740 75467 39899 77183 123183 43566 34037 54517 34485 20893 42992 33340 42468 80809
4728 80809 25872 -50199 6628 27884 7895 17827 -37478 -91351 -82520 -15947 -39665 -946
4716 -946 10047 -27509 -6630 -41064 -108480 -60353 -16136 -10919 -22558 -33108 -43108 -43504 -33232
4703 -33232 -28300 -34716 -65222 -130103 -100629 -63443 -62454 -11234 -18786 -12110 -40808 -53952 -1923
4690 -1923 21203 -18035 -42353 -19693 -38943 -35535 -90338 -82673 -32578 -64822 -74039 -18662 3057
4677 3057 -18599 -21011 -22579 9616 2372 8365 -1411 24982 2647 -2395 18820 39603 14120
4664 14120 -13014 -42391 -52371 -12068 57616 58448 15195 -38042 -81665 -66995 -32134 -8014
4652 -8014 -34476 -1018 9788 9260 14785 4682 35982 45404 -5506 -18559 -79918 -87541 -61171
4639 -61171 13084 8799 -45741 -46187 -1998 31271 18899 2897 -31062 -6661 14214 8701 -11047
4626 -11047 -31277 -6647 1516 -29382 -35484 -2047 -51479 -38592 5346 -151 41786 46795 74190
4613 74190 57481 19409 -30891 -55431 -53902 -41267 3131 -23292 -58446 -51710 5574 -24505
4601 -24505 -74944 -102791 -132572 -113425 -59661 -22826 -4474 33889 4090 -3269 -26524 -68364
4589 -68364 -61904 -58022 -93067 -89914 -59461 -64105 -64275 -4108 30394 24777 48048 64348 91104
4576 91104 59138 65394 1483 -63896 -73808 -66115 9871 26919 67740 43927 -26903 -11431
4564 -11431 36030 -7556 -19686 57442 66003 51527 19484 15749 87501 73943 -24183 -13216
4552 -13216 13165 7940 9187 26246 50506 11186 19677 8464 28409 -2634 -31509 -25908 12510
4539 12510 49394 65421 23443 -21502 -7034 41708 41431 -1509 -35355 -24237 -17360 -16135 10244
4526 10244 14137 -19010 -25926 -54803 -75854 -41758 -7562 14546 38691 34958 -8842 -47831
4514 -47831 -31404 -35242 16760 6295 -13015 -33196 -20587 19006 11628 508 -30520 8426
4502 8426 78984 36204 -80575 -123068 -135440 -141952 -113275 -31263 -17737 -26842 -70556 -94670
4490 -94670 -70004 -64712 -44314 -31340 17954 43665 34823 12598 -61890 -92113 -95362 -74215
4478 -74215 -27446 -31713 -43301 -126900 -168862 -114809 -79703 -69023 -14118 17995 4127 2358
4466 2358 19831 39949 568 -5234 22324 63773 85761 47050 6107 -8058 -9553 -20804
4454 -20804 -50057 -58593 -31535 -12639 -44043 -87419 -50484 -61285 -62445 -22642 14926 25879
4442 25879 -18756 -45482 11367 24015 13776 3331 -11077 -2445 36832 46830 20076 1486
4430 1486 22169 21771 8664 33733 74062 77481 77056 56862 11883 -47631 -15693 -33462 12419
4417 12419 43589 -6203 -46298 -111937 -149367 -115315 -43861 24190 19656 -2623 4532 47604
4405 47604 69042 56511 29703 -12066 -57101 -40213 23600 45167 29967 48616 33621 2198
4393 2198 21722 43950 9859 -47411 -28681 -25800 -17479 -21134 -20814 -13389 -33424 -27812 17287
4380 17287 3843 6621 -15270 -30851 -55023 -82216 -21151 75353 103569 83637 15276 30954
4368 30954 41249 15576 1715 3541 -5849 5149 51888 28139 -56833 -115254 -122480 -80753
4356 -80753 -21207 -19477 -61207 -22178 -798 48721 38817 41194 -24027 -47934 -40421 14160 8865
4343 8865 -29562 -28700 -29000 -9755 -2094 26584 26923 -4553 -31969 -28236 -46626 -46097 -89724 -102847
4329 -102847 -97139 -110084 -103499 -48868 -23097 -10023 1850 54296 41224 58715 64651 103814
4317 103814 70385 -9305 -34506 -22604 -27123 20690 63443 105850 82643 46719 16078 5639
4305 5639 9530 -42895 -52994 19009 36653 -3902 14712 8988 -60998 -38151 -9086 -1320 -56798
4292 -56798 -78870 -50227 -34744 -46979 -82606 -74686 -20668 -10559 -35916 1938 -10070 -47965
4280 -47965 -77429 -35468 -14103 -30972 -34093 -60208 -50416 -16978 -10546 -30107 -13837 37397
4268 37397 81509 43589 48921 88822 58031 29675 32686 -6562 -57 42883 46229 12048 25078
4255 25078 40147 63456 26449 -25880 -22588 -3787 -4173 -18907 -67420 -125092 -97836 -45863
4243 -45863 -81648 -94855 -76282 -51624 -17741 -13015 -31307 -38320 -30405 -17308 -7961 -63934 -39436
4230 -39436 -3705 3723 13256 408 -42677 -20921 -31881 -91906 -98174 -37685 -5024 -12336 -36910
4217 -36910 -28017 -19716 1936 8741 -9102 -27266 -47390 -62544 -24967 22100 30257 -3837 2757
4204 2757 -34634 -64336 -53465 -50429 -66112 -33888 -32346 -38320 -847 -1441 -9766 -14465 -29361
4191 -29361 -34291 -12079 4164 41791 23617 3043 -4843 -6074 18839 66099 42567 20081
4179 20081 48238 40053 75255 80829 53067 -27319 -102199 -42433 -9826 34853 42731 27123
4167 27123 13332 13740 5250 -64603 -82864 -67412 -79291 -82695 -91264 -72430 -58042 -36837 -3264
4154 -3264 20323 19420 6948 12893 13761 33283 26208 53037 -702 -54249 -59928 -62771 -10893 6418
4140 6418 -23623 -39655 -12814 -34270 -66201 -99574 -107940 -77255 -27177 -15719 19336 -2094
4128 -2094 -73767 -110526 -94877 -123107 -85251 -9902 3489 -3448 22169 28011 26219 -10869 16654
4115 16654 20385 13019 -31914 -34152 6647 20524 -14569 -50455 -32835 -22175 -31359 -82730 -103975
4102 -103975 -103267 -74123 -72779 -69291 -22722 -44496 -83504 -137442 -115652 -83947 -95352 -130085
4090 -130085 -162118 -118279 -68507 -23114 23028 85647 64424 32986 -51093 -61903 -42521 -509
4078 -509 6143 3330 25941 71282 28009 12417 59624 88235 31245 -37192 -12368 -10136 15191
4065 15191 59707 65996 299 -26162 15010 16622 35711 36756 7387 78 5730 1379 -1325
4052 -1325 -21079 -52861 -25150 -32267 -21286 -32947 17610 34148 10187 -14036 -70757 -23767
4040 -23767 9558 38288 86975 56832 24215 678 -6024 5265 43030 39681 -11340 -20890
4028 -20890 -34895 -56031 -117268 -120986 -67746 26896 60445 -2222 -25662 1661 -2734 16713
4016 16713 -42213 -36821 -9114 -32060 -24763 2433 23195 39121 60968 40142 41212 -11518
4004 -11518 -87314 -62288 -5838 25872 10097 15878 60590 70714 82096 39879 9145 -219
3992 -219 16007 41682 54135 91616 128047 101019 79086 64048 36951 -10375 52360 82299
3980 82299 62932 99098 133188 109203 78390 71915 69642 22570 28546 39877 -13581 -18985 -48587
3967 -48587 4278 20510 46851 20040 15460 13133 14517 48293 4905 -60451 -64527 -58093 -17232
3954 -17232 -85 29665 74216 106389 118489 75887 61306 59358 70100 44709 7796 4703
3942 4703 32603 51716 -1046 -14506 7939 -2294 -12235 -15999 -2165 6742 -17867 -28921 -25754
3929 -25754 -34529 -36369 -55211 -38520 10656 21267 35080 15364 25954 37762 37968 -9144 -24230
3916 -24230 4966 -3616 -6469 16857 11216 9200 -37338 -15986 3825 -15019 -5460 33029 -23164
3903 -23164 -18417 -35444 -42735 -28107 3898 18754 -4938 2963 -13504 38392 45306 3859 -13367
3890 -13367 21359 43200 15927 14337 8273 -38311 -19881 28788 40298 -1565 32977 29574
3878 29574 -9400 -11193 -27162 -17425 -23514 -10388 -15622 -2739 28309 -21121 -84269 -100335 -91978
3865 -91978 -30229 -9157 -8549 27948 45741 10862 45967 79008 55600 36882 77916 47201
3853 47201 -11822 -50494 2028 -8142 28512 38951 50920 27033 -2108 -36940 20787 83934
3841 83934 45007 42184 98684 164263 165979 123632 110529 86919 71564 40515 787 -23812
3829 -23812 9685 36953 73260 56643 52622 49035 51325 41756 28041 4576 9120 7756 13034
3816 13034 39244 3456 -373 -17428 -45604 -30173 18525 31342 17908 -25010 -42916 25146
3804 25146 15024 -3749 -14884 16436 61095 52121 -10330 -3433 -23800 -36506 -85565 -59293
3792 -59293 -21265 -39782 -32692 -30763 -78316 -66916 -37187 -35252 -29824 -1993 -2838 21681 84105
3779 84105 123461 104437 60220 50938 26965 -29639 -65380 -71098 -37382 -33064 -15034 -30792
3767 -30792 -27648 -45932 -44722 -42029 -60316 -52505 -54187 -38138 -1827 -11463 -12275 -32039 3585
3754 3585 27224 57304 79288 116042 142642 113071 127290 138219 87860 99856 110409 24946
3742 24946 -13523 -18778 -42072 -41309 17751 19980 40023 29071 28883 67747 55906 1118 -22824
3729 -22824 -5989 -25258 -29112 -45903 -7383 1602 -7632 -16245 6948 18262 201 -41085 -90609
3716 -90609 -17476 20104 17405 27416 28052 28530 17220 -13156 1623 11324 16470 8767 25124
3703 25124 17599 -8233 -16783 35527 42691 63639 63470 -33108 -64072 -91386 -106322 -124071 -112030
3690 -112030 -44322 20944 28250 -36955 -72684 -76862 -30792 -29184 -75142 -57393 -18569 -83361
3678 -83361 -101192 -78646 -34479 -54933 -25857 -1961 14971 40797 79452 87321 15498 -50436
3666 -50436 -45855 -8346 824 -36216 -106857 -125002 -4859 39619 34475 -9926 -11014 -65362
3654 -65362 -61240 -16863 7702 -12992 -39292 -32126 -38335 -60069 -26557 -26687 -30021 11495 8481
3641 8481 -4530 -20874 -53874 -15919 -14367 -65752 -112760 -110778 -74737 -8092 -14409 -25020 -64183
3628 -64183 -20106 -1880 187 21192 78212 77593 51944 -3458 -5598 -25490 61978 86511 52716
3615 52716 28363 45876 70730 71469 39228 -3498 20751 32974 45950 80273 51354 -6910
3603 -6910 -50093 -55114 -44206 -70519 -68436 -19757 52146 55873 36138 12469 60226 35032 794
3590 794 -27159 -44409 -98876 -70949 -34898 -40684 -36279 -5905 9105 1137 -23234 -49642 -8963
3577 -8963 47779 58189 9631 -1669 36047 20583 53053 31104 9536 34728 50736 29171
3565 29171 15225 -12797 -3968 18594 38354 58408 62454 20312 59652 75742 82759 6
3553 6 -63640 -59494 -44770 -71587 -62326 -36837 -41681 -58815 -49333 -26999 -52513 -77610 -49231
3540 -49231 -14278 13467 -33255 -57423 -35633 -13522 -7432 -55154 -36994 -739 -6346 -16279
3528 -16279 -17602 6957 -46212 -40994 -680 51147 38558 31593 36476 -7069 -57500 -12735 10930
3515 10930 20280 23364 19235 16775 27350 55905 94251 27314 19878 18580 24092 2392 -13693
3502 -13693 -49412 -59947 -11620 53052 101027 75968 55069 47265 13510 18343 26318 47691
3490 47691 75539 43120 35008 47167 32676 -14723 -7984 23055 -19198 -41729 -37357 -18622
3478 -18622 17215 8335 2102 -10260 25504 58464 -7933 -63525 -32169 69364 79272 15319
3466 15319 -7420 -39030 -35664 -17825 -9969 -3020 -11629 -17521 -31145 -34114 -7154 18139 55530
3453 55530 98911 79724 27107 59680 79755 41870 19823 16529 -21832 1847 39323 25617
3441 25617 39879 69560 69436 26399 18047 97786 111378 54109 -24531 -41614 -35626 -99409 -76299
3428 -76299 -19742 -4951 -12154 2272 16572 36014 73724 47115 16624 14517 37548 33617
3416 33617 -21083 -37790 -16301 -18140 -74435 -29783 19761 36314 -6248 -869 -32402 -44769
3404 -44769 -7074 1865 -36862 -8599 6276 36858 20103 33372 2320 -25956 -8065 -42440
3392 -42440 -70400 -39044 10364 -14043 -22114 6423 10011 17515 -29615 -48110 -72233 -66591 -27415
3379 -27415 -28754 -23730 -3204 34725 5803 8227 35916 -7781 -24084 -4714 -35077 -21071
3367 -21071 -8209 -5526 12302 -34245 -29039 -3575 -3807 24607 31575 60742 17429 -33535 -23341
3354 -23341 -4604 -729 3387 -7901 -38554 -30252 -17380 -34263 -47776 -57887 -28492 4377
3342 4377 29018 -22154 -52858 -72576 -28967 27602 48383 37377 32461 45653 70841 55739
3330 55739 74642 14740 -41545 -93539 -28387 -38429 -16161 -14620 -58505 -69114 -56031 -60593
3318 -60593 -34684 8249 12799 47991 53892 996 -34039 -63043 -98227 -71626 -29300 -76805
3306 -76805 -96667 -82529 -45905 17252 20228 2302 -14081 -23873 -74258 -63562 -42448 -48993
3294 -48993 -23896 -9659 -11195 20743 13009 5952 16592 51167 54217 5860 -36980 -32262 48602
3281 48602 42712 -17397 -23797 -10431 -6066 22267 -14881 -56080 -48413 -59145 -35537 -34892 -61793
3268 -61793 -106766 -66232 -18882 -30618 -71361 -113285 -116333 -67509 -26225 16389 71704 60765
3256 60765 87139 91557 71236 28627 19340 1647 -8417 -4791 11995 -11091 -30408 -4825
3244 -4825 -17075 27680 18821 16654 39269 28870 40586 70848 86715 131345 113534 71512
3232 71512 60687 76722 63581 76785 79755 106238 94508 13540 -24846 -28314 -50501 -90815
3220 -90815 -50548 -12124 -6224 17082 12704 60009 74444 42630 -12574 46070 70240 30484
3208 30484 -22638 7347 42827 12826 -3263 33040 78689 52715 38300 52851 36145 37515
3196 37515 6847 -41846 -21885 26447 -7408 -8883 10787 5070 55168 46059 -11425 50261
3184 50261 6052 -30406 -4646 46230 62616 75350 104045 116462 99144 29420 -37266 -53968
3172 -53968 -28089 -44426 -77630 -47932 42777 99473 125835 138521 118424 88386 7565 3141
3160 3141 -12155 -13500 28130 22718 -39586 -91897 -87515 11820 70548 27816 -41535 -60020 -56532
3147 -56532 -63301 -44056 -26317 -13628 -21020 -73370 -94309 -86167 -59090 -52171 -36260 -23691 -11138
3134 -11138 29280 65059 44663 35432 57429 -13913 -8361 15 602 -34415 -44022 -56850 -68349
3121 -68349 -32972 -44900 -29964 -1056 -6969 14834 33009 -2128 -54512 -105245 -131842 -91922
3109 -91922 -68425 -59739 -64297 -8202 67357 68986 65467 2445 -34553 -25660 -20767 -4438 34689
3096 34689 78573 44636 10434 -15683 -28816 9697 88155 53983 1548 10708 49706 48449
3084 48449 -10244 27604 -3274 34815 34869 -6239 -15738 -1820 30377 99338 136996 100281 27800
3071 27800 -12398 5639 6381 -46732 -5286 4442 -9151 -25949 6444 27024 44512 33567
3059 33567 -18360 -38349 -57062 -26640 -7916 32185 37084 24367 33979 50236 46803 21341
3047 21341 16202 36275 14118 -9901 -10418 -317 -23481 -40983 -68351 -106920 -81584 -80570 -101937
3034 -101937 -68230 -29284 -42028 -58120 -56946 -45079 -66531 -77111 -110430 -77604 -23520 -37967
3022 -37967 -30715 -48525 -61453 -50726 15354 -18385 -46727 -84904 -64289 -21057 -6522 23957
3010 23957 -37131 -92664 -68611 -6333 -58731 -43758 -4443 -27339 -15791 -24402 -35587 -22116
2998 -22116 -19398 1086 -23530 -26978 -10043 9674 11888 38595 61321 29708 26548 -12392 -10146
2985 -10146 34948 38082 -18084 -51700 -10062 -3427 10719 26674 -1776 -27314 -2641 5353
2973 5353 -3934 -27758 -16318 -224 -34588 -59544 -22548 -2200 -2753 -3680 -38413 -39342 170
2960 170 60455 69374 73162 26871 -6498 16101 7374 55956 74814 79604 78821 27288 -30085
2947 -30085 -135984 -120052 -113347 -97173 -31927 -15597 -14224 -50694 -57052 -34353 37739 38345 31615
2934 31615 29270 27129 10938 4039 22708 18797 26858 13417 -7354 27563 49561 -6158 15436
2921 15436 67307 119010 153110 130458 100270 59872 -9680 -13164 32596 -13287 -19900 -9538
2909 -9538 -47595 -81266 -61323 11295 60816 30747 19524 67217 124369 163746 136842 108506
2897 108506 107942 73821 4664 12090 11879 -5027 39722 35054 15407 8602 71007 89050 62766
2884 62766 38412 30807 2782 -29231 -22985 -59148 -38594 -23265 33177 18093 -12781 9673
2872 9673 88646 133842 161683 120005 85555 38691 48193 43245 52494 49777 5348 -32523 -31050
2859 -31050 -3062 54098 36338 27203 32690 -16466 -40696 -34598 -47186 4008 72678 92281
2847 92281 86946 71091 9731 -7692 -46437 -43318 -28748 17199 -3292 -24049 24157 18666
2835 18666 10156 22784 31754 25384 -6839 -4759 26202 -3456 -9469 -27081 -10049 32119 50974
2822 50974 101544 127620 108838 94866 66933 57565 57597 5409 43032 43979 20150 42541 67282
2809 67282 29529 -4400 21403 -38285 -74138 -70408 -34137 -50514 -93883 -20681 29602 35920
2797 35920 36491 26009 9494 19215 41975 30343 -34616 -58179 -16110 28643 -34411 -57198
2785 -57198 -53749 -63776 -46400 3529 -5142 -6295 -25818 -54892 -47486 -24959 -26650 9715 1725
2772 1725 -31987 -32614 -4045 13237 2024 -25676 -20338 44176 59968 32282 -16965 11329 26424
2759 26424 32354 13499 -11167 10389 10361 13100 30305 60013 81288 84600 48887 -7565 19556
2746 19556 7233 -8236 -13638 28524 72564 54997 27098 6965 -12069 -15108 -16009 -8267 5593
2733 5593 5282 28927 55771 5626 -48833 -65559 -24141 -3070 43835 32734 49726 52186 41404
2720 41404 62846 45824 42524 -7088 -17866 -14723 15305 39510 55988 78236 75098 25726
2708 25726 19393 60687 58180 55594 77811 79071 22344 -10729 -45827 -79177 -72360 -85769 -67331
2695 -67331 -23863 2373 4153 -12270 -83061 -110110 996 59813 7413 10314 7130 -19237
2683 -19237 -57664 -37904 593 5056 7962 9430 -2909 20049 46993 25961 -29054 -46433
2671 -46433 -23928 -14943 -58841 -64738 -59534 -33120 -42739 -57844 -48368 -47169 -90366 -163248 -127364
2658 -127364 -81085 -69851 -58659 -22593 -26797 -4294 11019 34576 72485 82139 42284 -10326
2646 -10326 -80062 -65052 1782 90435 103528 69972 -9623 -17307 22908 4194 -15852 -7936
2634 -7936 -10221 -19428 -1613 16225 -39224 -26535 -6520 20693 57031 63867 129143 117889 98566
2621 98566 80978 65799 42160 19528 8567 -26279 -21911 -53835 -72435 -105321 -25461 57239
2609 57239 59815 16612 -28573 -53689 -33169 -52461 -58080 -49310 -53690 -41162 -43844 -32246 -5110
2596 -5110 -38044 -100754 -100115 -69165 -65700 -25103 40036 34280 451 -40898 1581 44131 7916
2583 7916 -14397 -18748 -64248 -119709 -110165 -39906 -28015 -6420 -31168 -29830 -46601 -61955 -40356
2570 -40356 -20748 4046 36409 38241 23397 17506 -6007 -38218 -25087 9692 -30157 -50592
2558 -50592 -68407 -68947 -8387 21943 -1089 19516 68716 86744 76250 90547 99342 78980
2546 78980 70961 25614 -14981 -17178 -20870 -19820 -23869 -14359 -34066 -11127 -4689 -9661 21432
2533 21432 61231 14706 -60434 -111457 -65876 -72757 -54265 -21104 -19452 -14121 4113 -74978
2521 -74978 -118229 -59001 -10541 48721 40861 50602 26345 18877 -25028 -32797 20568 -13829 -41135
2508 -41135 -14224 -8259 33861 77090 27222 32975 61857 90271 27671 -25702 -32376 -5424
2496 -5424 -12163 -3275 27146 32944 1579 -33698 -16822 -38686 -12900 -4504 34745 26073 64736
2483 64736 62990 24258 41652 19573 -15931 -54433 -58039 -76030 -78021 -40472 -2403 -7740 -9401
2470 -9401 17270 20102 69000 83730 25342 -51449 -30993 -1711 -17204 -19519 -3167 82253
2458 82253 107393 77633 44442 40569 29184 33235 32260 41367 1689 36124 18724 47087 48069
2445 48069 38852 49874 59832 67996 21512 32397 31788 -19312 -46874 -14516 24693 25124 7356
2432 7356 33857 26446 41380 54411 -34231 -61030 -17779 -31986 -7579 -7105 -27509 -49979 -65431
2419 -65431 -36049 2346 -16400 6473 8869 -13751 -48001 4882 -21858 -69127 -90105 -86654
2407 -86654 -69760 -9198 43002 -11405 -49373 -87682 -30853 37049 80140 49405 -14559 -43850
2395 -43850 -8577 9147 27281 49142 42454 58950 75713 10912 -32148 -24388 -13460 10075
2383 10075 -15768 -62688 -49737 1544 -27053 -11802 69583 60691 -5715 -6639 31945 56451
2371 56451 80755 112779 101056 79856 81522 92705 98506 27740 -9372 -20184 -35065 -15021
2359 -15021 -7383 -24530 -9967 52397 61564 34790 23849 14736 8245 8164 9137 48721 62224 68003
2345 68003 75992 65821 72438 85750 71725 69770 57712 -7297 35818 9477 -15244 -36127
2333 -36127 -23061 15987 10479 -4861 4556 4684 -41690 -76442 -52606 -20140 -22915 376 -20106
2320 -20106 -32812 -29798 840 8578 -32299 -35231 -15854 -42263 -27918 11736 15372 -46836 -24238
2307 -24238 63035 69769 63519 29450 -18958 3667 11140 11161 -59338 -46306 2039 23076 102449
2294 102449 61565 14605 25215 39674 -14307 -53282 680 37166 59246 39822 20390 -27567
2282 -27567 -66771 -57537 -17694 -588 -12896 -6916 13717 36592 33724 47181 -24160 -40071
2270 -40071 -26814 15083 25457 19292 -47968 -79366 -65324 11722 50267 43672 -28512 7643
2258 7643 30218 42165 25213 18044 26787 -19257 -5337 -4455 -54195 -89916 -78289 -25002 13667
2245 13667 1117 -29958 -44689 -14326 10119 19635 28967 56413 1524 -33618 -17008 -17477 6104
2232 6104 28965 68147 54097 56784 27888 -388 -32457 -1649 6292 -1709 7632 8342 -8209
2219 -8209 -22068 -5247 36735 28087 -68059 -84554 -11917 -16850 -35120 -32402 -95251 -80714 -80918
2206 -80918 -63991 -56903 -72478 -73663 -55666 -55835 -5935 -3823 -44910 -42636 -64140 -51572 -69428
2193 -69428 -38987 -30744 -17225 16407 28087 35139 -20652 -6873 -7064 -37057 -67403 -52585 -20991
2180 -20991 1096 -74964 -129505 -56247 -66968 -75665 -62539 -92512 -87236 -17951 30396 52024
2168 52024 -725 -23720 -23881 -34588 8250 83037 105528 31420 -41755 -67463 -89938 -101438
2156 -101438 -80663 10640 37831 41300 5752 10237 15373 29336 34278 51488 73255 26028
2144 26028 52769 82776 98051 59165 99349 130364 160142 170340 155092 86615 45603 24865
2132 24865 -10823 -47115 -29425 -34741 26706 58066 32138 14097 8709 10764 -28830 -67078
2120 -67078 -53157 -44849 -14770 -15561 -57885 -106978 -93040 -5974 32409 44083 22503 -45778
2108 -45778 -28491 -34630 -66941 -48565 -73327 -103583 -130493 -103009 -28501 14287 -21393 24563
2096 24563 28979 30863 -28879 27241 89258 95608 81691 94744 100573 69304 57655 33533 19933
2083 19933 35367 107031 85056 49931 74566 88271 101576 94030 106215 40990 21398 49494
2071 49494 38416 -239 4706 67472 19086 32156 48164 76156 34916 -8820 14778 -15138
2059 -15138 -37957 -49277 -17171 61896 71551 16391 3844 -1534 -27485 -94555 -90599 -47004
2047 -47004 -37263 -49230 -25820 -68326 -65054 -25619 7496 632 29177 29389 41940 89462 92130
2034 92130 53783 30594 20333 20744 36761 70307 64240 38499 15907 -1381 -3422 -2828 47972
2021 47972 25874 -35421 -58165 -63093 -73658 -53888 -30908 -122 -73423 -32336 45631 23657
2009 23657 -13695 -27062 -37045 -47924 -47879 -51517 -53867 -98582 -89524 -65950 -70236 -60030 -38435
1996 -38435 -32484 -53792 -70072 -62048 -41795 -10614 22948 37609 12463 14562 -25557 -8394
1984 -8394 2108 40615 60031 38378 41270 -46125 -72404 -86721 -21163 26874 61950 47214
1972 47214 9125 11151 57082 26259 10223 22853 50962 39118 -5657 -42447 1564 61584
1960 61584 49696 59832 72960 59839 58624 68340 54035 51660 47443 21590 23386 28790 19356
1947 19356 34643 40780 -257 -15097 -13508 3601 7841 -41871 -79105 -58140 -47840 -27140
1935 -27140 -22188 -7135 -16901 15549 17281 -22264 -1249 52558 63253 7391 -59149 -28087
1923 -28087 25521 80817 133885 120309 31893 -52079 -38090 -32137 -9249 32091 11120 4442
1911 4442 11981 -1187 32502 30806 8239 13432 57629 64489 39128 31061 15895 19043 -11561
1898 -11561 -7757 8429 5481 -15012 10927 18544 -12782 -53648 -31010 -49991 -74155 -49614
1886 -49614 991 15042 19021 11686 626 4087 22143 29033 53954 20928 5309 -48101 -63405
1873 -63405 37323 48373 -20480 -16554 -53227 -66253 -41045 11920 18169 3932 28100 46605
1861 46605 38507 42734 86758 160912 123126 67990 59617 22102 -12806 -46117 -63506 -37984
1849 -37984 -29824 -3561 -602 -62092 -40583 -8503 -27786 -46093 -24373 -9181 27698 70373
1837 70373 117316 146692 90735 11028 -9026 -3289 8101 82808 119598 74288 46915 93992
1825 93992 74897 18164 36270 44131 -11111 -46417 -75807 -39517 -16171 -23432 -68550 -68175 -25436
1812 -25436 -64108 -50838 -3069 33906 35913 15544 -3503 14456 47185 13818 85885 138937
1800 138937 92333 15631 -96398 -89547 -30410 19209 42396 -1197 21893 59550 22664 -13781
1788 -13781 30942 38673 6474 4276 20238 51340 106385 92348 46186 49768 45985 18884 -7538
1775 -7538 -4009 -23578 -77058 -44510 -37023 -13341 -6183 3718 36338 83061 62485 25020 41983
1762 41983 9439 -18288 -35851 6833 39088 55860 36025 2281 -4708 -4509 -59832 -9056
1750 -9056 65666 69032 13215 -11920 -33280 -37291 14957 26198 2196 1160 9503 16829 26421
1737 26421 79340 107445 71687 18595 35518 66190 6286 -20196 14717 52386 30365 31567
1725 31567 29553 9745 6380 -11223 -91772 -73418 -46606 -39729 -43731 -25302 -35708 -55633 -73207
1712 -73207 -41332 -19270 3435 -16547 -68655 -74007 -42796 -52481 -26959 -10590 -40329 -13845
1700 -13845 -20289 25310 78043 74982 28539 17841 -2363 62943 78471 48056 59630 26660
1688 26660 -45355 9375 16346 12779 38953 22912 13439 9176 63353 58063 83082 105206 109437
1675 109437 61213 23298 21567 39580 52302 23562 28382 34875 60153 71839 60118 61394
1663 61394 85612 64828 18815 -7016 -42462 -10724 27814 83207 25328 -14475 -48527 -49068
1651 -49068 -73549 -52278 -48499 -41286 -56711 -42335 -6766 -9967 -36741 -52458 -63115 -84919
1639 -84919 -51982 -69514 -75373 -86700 -79675 -62494 -36037 -72066 -126978 -97975 -12300 38127
1627 38127 -16419 -14606 -14933 -29113 -13242 5037 15994 -29451 -19635 9901 -11926 -17609 -9498
1614 -9498 31018 34935 23061 17433 24384 39877 63123 45796 36588 10472 -29490 -71068 -43018
1601 -43018 18981 45057 82963 105103 28707 -11250 4218 21070 -18027 -11819 15797 -1992
1589 -1992 -97751 -111395 -75557 -4853 11525 -14475 -7582 52123 35622 10423 1940 15487
1577 15487 25933 55502 109799 117915 82875 64918 -2067 6738 18756 6119 10479 40966
1565 40966 76213 47599 73416 110052 146325 149283 148529 148772 81009 20065 34286 -6651 -22461
1552 -22461 38977 13860 21472 23111 3922 12866 23735 -3188 -16077 -28533 -39512 -12720
1540 -12720 44593 62977 66933 28397 74599 64649 84982 116754 73543 36870 -18333 -33476
1528 -33476 16591 44306 21708 -31056 -21911 -78 1471 10360 -17666 -36020 2074 48239
1516 48239 21314 11928 21284 28607 2272 -9500 -15732 -10638 45735 25607 -991 -21335 10965
1503 10965 6927 -41815 -29898 36262 27543 14419 42490 59128 103138 101770 71249 92938
1491 92938 82278 77332 53693 64157 91388 76948 47772 7392 -41532 -32868 40637 55732
1479 55732 104679 117555 56470 22277 48815 -12020 -72790 -76651 -23918 7485 -26002 -49823
1467 -49823 -29248 -8383 -5780 -5422 -19136 10142 25906 62375 79735 67156 48284 22088
1455 22088 53708 84308 101698 71331 71997 72855 87387 131205 191419 209528 159990 91783 90880
1442 90880 45089 -23978 -42962 -39279 11409 20249 -6887 46887 108085 113996 57593 17531
1430 17531 35828 24625 19718 74649 56812 3522 -52854 -81654 5553 82901 89702 61208
1418 61208 -8173 -55680 14907 -3145 -45647 -26709 -7729 2387 22636 37870 40080 31952
1406 31952 24269 -13841 -16820 -20830 24549 22426 32050 -10760 -14450 14428 -37465 -41764 -16952
1393 -16952 -19297 -40032 -19647 -22685 -10797 -6111 -39989 -15453 -51625 -19942 -19855 14717 26464
1380 26464 -54692 -46235 -53304 -34742 -24493 -5107 -11925 22513 101780 117185 72330 -3727
1368 -3727 -29703 -34645 -12479 17353 35283 3139 -51884 -44598 -10313 16256 7519 32836 25034
1355 25034 60146 62435 119800 124505 60771 19803 -15171 -16578 -7156 -37740 -26858 -37491 -31890
1342 -31890 -13974 -36341 5515 27957 38431 59242 35301 -7653 -4589 -15664 -22897 -47005
1330 -47005 -63969 -63832 -37025 1828 28415 4789 9267 74415 90925 35442 26209 23269 28634
1317 28634 35259 45109 123757 168603 87805 12544 650 50695 54338 72776 7948 -27892
1305 -27892 1106 36412 39487 27056 -523 65805 60007 45211 91238 87464 63777 89179
1293 89179 102294 91767 16976 30294 22500 67994 51385 -25925 -45843 -53988 -43216 -50660
1281 -50660 -51396 -92415 -110769 -87734 -22217 -27750 -90812 -56828 21725 30728 29825 12835 -12664
1268 -12664 2097 -20017 -75146 -50014 -16110 -49931 -17804 21717 4006 55248 100525 43377
1256 43377 -8047 45525 26069 -20777 -43352 -51189 -70507 -66130 -20368 -3451 -53896 -48915
1244 -48915 4890 -48906 -1165 76462 68946 33021 -44498 -41828 -9439 16143 24162 40790
1232 40790 18048 -38911 -40872 -40936 -37738 -37753 -28363 17871 -6121 12388 35975 18123 -9994 -29787
1218 -29787 -29570 -42799 -51319 -26292 -17466 19701 6832 -49562 -26017 -41037 -13525 -31590 15764
1205 15764 45943 22128 -24147 -19429 12512 -550 -54413 -21713 -2901 -21269 -31637 -13715
1193 -13715 7539 -33075 2442 51779 19417 -31707 -26729 2831 36151 65155 46744 12504
1181 12504 -17930 -2033 -27104 -22676 -23693 -38468 -66908 -35052 -22276 29115 31877 56010
1169 56010 94868 44658 5452 21350 28646 448 -25916 -3099 54308 93520 49149 55524
1157 55524 57367 88600 83902 83572 86746 65901 71256 65240 47129 -2127 -32633 -13452 6859
1144 6859 29074 18022 24654 6545 29421 -3711 -5684 -3067 -37858 -44439 -41730 1932 -1837
1131 -1837 21706 39449 105017 140080 138645 119344 53520 18957 77256 110633 65156 -1745
1119 -1745 5670 58094 79233 40517 66699 71847 40389 -35817 -48971 -33932 175 10454
1107 10454 17845 -15565 4155 -628 8913 47286 96186 76880 -13004 -53123 -58402 -44229 -678
1094 -678 58492 34741 43471 82531 26921 -11101 -16037 -11404 28859 63500 68664 111666 83560
1081 83560 6673 14200 -34131 -51319 -12854 -1800 -15957 -20917 -22112 4251 52226 96758
1069 96758 71656 -16953 -20805 -34319 -17031 -18524 -12203 -9865 -24074 -51809 -63801 -63344 -62898
1056 -62898 -57163 -21903 -37760 -22262 11205 85364 59420 -26791 -44811 -33741 -13129 -1557
1044 -1557 19491 72016 64892 30194 -2273 -4030 -20709 -51796 -63930 -80537 -79521 -77714 -42755
1031 -42755 -5368 12663 -13207 -31646 -5090 25557 59324 17964 -51952 -59029 -33872 8468
1019 8468 5716 -465 40912 37658 10192 -22115 -24635 -31197 -24014 37945 40725 54308 61610 96088
1005 96088 93624 92413 21718 28378 34779 50545 60789 42729 -9414 -29039 -8645 4103 33912
992 33912 52865 50740 117101 130289 72581 45640 41355 6040 -47918 -16082 52841 41586
980 41586 49144 45547 31118 21063 -4119 -10469 32712 47086 93820 110560 65973 -23514 -37864
967 -37864 12425 54630 48426 -1070 -199 -32891 -3090 24636 31808 54863 13129 -26026 -27670
954 -27670 -4320 4762 10948 11817 -16474 -29960 39626 60762 37782 5946 31176 63676 29580
941 29580 21311 34711 34609 27904 45482 92987 49245 10977 -1206 -42313 -85782 -53572 -44251
928 -44251 -10984 36943 52483 109 -11197 8384 16372 31107 35995 6698 2479 -15298 20019
915 20019 39746 7144 16921 38652 7995 13993 45782 64693 40177 12885 10087 44506 89384
902 89384 76655 61604 53453 29808 27106 -40211 -58575 -20813 -18052 -29529 -9447 32976 9702
889 9702 -49736 -29698 19410 82301 41356 19614 37725 62607 37247 -3361 -42750 -44483
877 -44483 -29225 -27529 -17932 19404 22265 -8382 -53081 -92894 -94936 -74224 -47358 -43181 -37208
864 -37208 -32276 -44240 -31804 -25549 4979 -11643 -29365 12722 19131 -46931 -34033 -4778 39625
851 39625 -3845 -7584 58087 47815 -47515 -81093 -28034 25953 37724 -25208 -28244 -46611
839 -46611 -79275 -108957 -109854 -60621 -18437 8776 25718 40457 49959 45644 21950 -26220 -32103
826 -32103 -11945 20949 38673 64616 53554 80496 86718 67605 22171 39620 26180 19304
814 19304 54936 69475 112355 113650 84945 100336 70915 19443 -9684 -7101 -7070 -28825 -27296
801 -27296 2269 19540 -10901 -62427 -91690 -57412 19197 49834 36013 70333 126193 158783
789 158783 168952 152686 119911 87448 97699 60157 41577 63742 53040 94351 115786 158010
777 158010 206188 224913 152259 68657 77055 98609 76033 46448 48241 69419 116748 145082
765 145082 133171 104589 72231 132923 174842 120943 83626 64049 -13638 23842 52126 41870
753 41870 66881 86583 19074 -15335 43873 59513 53210 51264 57025 93959 118958 138501 113584
740 113584 86239 12024 -5411 35221 25928 -757 -29564 5546 5646 6077 54842 54582 8303
727 8303 13364 23901 1034 75530 115805 139227 104679 89860 95332 70212 132274 162523 132512
714 132512 120669 118684 124186 119164 96054 -20102 -7207 28025 32496 37623 1142 -13601 22756
701 22756 99145 137002 109146 96761 104815 109671 35346 16614 22330 21386 27283 53156 81507
688 81507 85596 27300 18633 25698 67324 43724 786 -13087 17039 22958 -4805 36525 95348
675 95348 110876 82085 86026 78265 80686 83495 57638 70365 73330 46696 12821 35684 52880
662 52880 100476 86206 25219 17229 104198 120934 83698 60383 39554 28890 16592 38599
650 38599 55811 58851 62222 49654 69461 120864 71566 25469 108530 127736 125333 100757 122536
637 122536 119902 132302 115614 102945 95426 104283 83198 48195 8658 -11561 -3397 28835 31818
624 31818 24890 49290 84825 104771 95735 65028 87517 78879 42335 48304 19796 10578 -312
611 -312 834 25286 38722 43755 5083 21714 61344 52670 53611 58778 101786 147210 105216 50377
597 50377 46406 37327 41497 10056 47172 79789 19945 -55250 -24841 60566 74928 20362 63424
584 63424 45523 57925 142487 126140 7777 -40406 7921 54749 83120 96924 68149 49751
572 49751 31250 19485 39444 74988 102057 59771 63670 82749 28322 34717 56381 80054
560 80054 111174 113471 46961 -1574 54424 49237 55016 23268 7751 -37653 -8915 3528 -7600
547 -7600 -18064 2963 37059 10070 41544 45841 72075 71722 77468 69458 46444 67038 30733
534 30733 27353 26629 41723 41857 36616 95684 86751 37759 66761 128824 133021 75051 85340 83375
520 83375 39104 33275 54160 59358 64520 46255 61002 49597 32643 32312 30201 43571 66703
507 66703 99869 171193 170280 153250 116495 80264 74319 51820 38775 51518 98473 125877 88682
494 88682 52201 14088 100933 165684 101300 61587 10805 30199 33768 -10570 37745 78423
482 78423 57389 31512 19138 42229 58830 40747 77998 154797 200203 157959 98401 99865
470 99865 93616 72299 92250 79652 26971 28474 18834 27962 56116 68402 118473 112686 129930
457 129930 151950 148362 135542 111791 114878 93394 56257 87948 64991 -12893 9482 32544
445 32544 27188 34016 34921 53838 53130 83927 128122 123461 123413 83398 79598 84691 81177 115514 157070
430 157070 158923 97929 80758 66696 63884 70496 67921 83998 117618 105934 114353 105217 59247
417 59247 59567 57817 57055 74365 31789 11481 42504 60494 48704 24702 18960 58809 70171
404 70171 60192 50819 49619 70250 71519 32581 -40561 -28984 39410 69731 89900 138281 89293
391 89293 3301 -4642 43317 90554 89376 105336 59240 55794 57974 62240 65369 100227 137846
378 137846 118376 50124 -16281 -37227 -32730 2123 -4621 8005 74078 87396 67203 67223 52321
365 52321 24817 -67177 -45142 17600 8658 37473 58328 47606 58278 61833 45730 72261
353 72261 97620 60554 25772 15000 46348 93934 98462 110715 93888 86252 44978 16961
341 16961 17575 69416 71514 34789 53243 54817 88178 129964 118419 95376 44080 6860 17385
328 17385 28053 26565 36319 63987 40262 25521 37567 66135 66279 73273 64878 91526 68359
315 68359 35418 20422 19233 -4892 19144 68478 97139 95672 82291 78463 69049 46093 50167
302 50167 23210 -12430 -30619 16805 74899 105818 67770 47100 33939 -10203 -14926 -11357
290 -11357 3350 40387 96197 55457 3231 61553 107950 92272 87585 47180 11159 -1390
278 -1390 -22536 -8458 25605 38981 26806 1741 -23897 -12446 70601 108971 93227 54534
266 54534 71475 127358 160209 132505 135606 144193 124405 112612 73631 82221 103783 113927 122220
253 122220 142719 141557 93047 96456 127129 111654 133088 144656 107395 61533 39685 23802
241 23802 3007 14925 53654 48520 39223 28376 37942 80907 106479 113533 139493 115326 79172
228 79172 104805 98856 97292 63947 65759 23888 3314 20559 -27218 -14867 2911 45716 64067
215 64067 74968 75241 40335 100013 114267 107899 127102 80342 21336 32611 28573 46369 74202
202 74202 31289 19093 41 4611 11202 31512 44078 46931 43642 -1451 -27338 15097 49326
189 49326 74842 53402 58334 73910 57727 71907 87304 64086 29462 43573 68087 65830
177 65830 38471 36304 25368 39670 110823 101819 49115 67626 41453 54371 49533 38070 49399
164 49399 75398 45187 54406 75093 74039 43956 36265 63772 95136 107584 109103 94276 56699
151 56699 59591 48912 84527 119774 107734 105510 93190 102950 41701 33240 46338 84454 123848
138 123848 77689 72896 100676 70867 88149 125075 117540 98415 69689 56280 55726 74478 88423
125 88423 100462 86568 74767 61683 18995 32109 22401 31284 66694 48355 34809 58386
113 58386 38759 23770 32890 60608 85265 103117 100363 86581 92117 71165 73716 69116 63427
100 63427 72814 76587 78107 86372 67619 17750 35500 39036 14575 12374 597 -19836 11260
87 11260 16051 42077 95449 92590 87146 90135 66526 35509 31563 32759 23018 33174 18093 18624
73 18624 35521 73482 65444 99178 88666 64535 76326 55428 14178 49650 65576 30394
61 30394 26630 76464 77892 51532 18880 7696 38272 55659 60206 84279 61514 34873 64972
48 64972 109898 73526 37414 32945 55545 16994 16212 36974 69476 66516 68849 91807 103024
35 103024 80615 68360 50217 75770 100357 92083 108805 74999 29833 23629 67490 90389
23 90389 118367 110541 43008 24836 -3119 5938 -10088 -6357 3783 29073 72840 63364 66315
10 66315 74645 69435 91188 86255 74500 76592 64013 79491 113962 121999
0 121999
$$ Imaginary data points
##PAGE= N=2
##DATA TABLE= (X++(I..I)), XYDATA
32767 200928 218118 244060 268785 261327 271500 282658 291847 278679 294459 329389 380661 378440
32755 378440 360241 339080 343365 355995 348721 310191 282530 294390 360300 391988 386571 381054
32743 381054 365064 369017 370616 328590 336073 351161 331896 313738 331180 332052 334236 328694 341021
32730 341021 339625 337831 335346 327953 341630 354205 373571 392064 424171 439291 450358 429715
32718 429715 450731 465920 411039 370710 398504 371233 385558 414367 420784 452800 462671 445308
32706 445308 425455 429160 458378 478855 440581 432303 464554 481683 494438 486255 470549 465430
32694 465430 447142 463265 499694 461198 468487 506736 494559 486531 514886 535321 543901 515901
32682 515901 497521 475877 469923 437838 418439 440668 475724 473439 506415 513606 487147 480922
32670 480922 537928 542026 518225 528652 548332 563399 580168 579638 571781 556994 557219 570380 546617
32657 546617 547066 538753 546749 539465 592453 634516 649325 627682 624079 609352 629514 644623 663092
32644 663092 657507 651899 620212 615472 639631 628997 614649 657847 643687 608408 642371 674029
32632 674029 687448 700239 691040 659077 630412 622802 648175 651516 658788 699398 681587 653645
32620 653645 684207 704656 737857 763611 738664 721318 707510 688071 676489 695600 695059 681474
32608 681474 678652 708055 719207 744717 747392 704173 667276 661957 655557 700836 719299 731849
32596 731849 712025 690788 655118 657282 702283 744295 745751 772064 756593 762060 753926 743408
32584 743408 713195 724199 714343 697890 711395 699255 701527 722912 725912 743173 774689 814626
32572 814626 806976 787342 753616 747575 765338 845788 863381 809079 813463 840116 793319 724061
32560 724061 713930 722767 788664 835110 826126 837486 854360 883649 898601 880359 863753 855699
32548 855699 851764 806104 763958 748964 779320 798495 792366 774238 807683 802438 814297 860252
32536 860252 829822 806372 816115 804501 816514 809862 773358 766309 803030 851015 862831 887415
32524 887415 937906 935493 911442 904246 926257 948252 940745 907456 873062 892260 844481 863880
32512 863880 883002 900535 907037 931360 935878 956645 966540 934315 906170 925039 916894 884677
32500 884677 930861 925621 947060 954369 952922 974067 971912 973298 954020 922475 925516 946409 982010
32487 982010 995955 971059 948683 952529 953955 951710 959966 928412 939567 944908 925379 948080
32475 948080 949164 950494 951261 930520 871170 836995 845112 950163 1022068 1041542 1046080 1053898 1053009
32462 1053009 1029734 1015876 984022 980783 984666 1037978 1013459 994656 976488 967067 970221 983644
32450 983644 1011886 1000495 997139 1045826 1078731 1096362 1031312 1012796 1059597 1002446 1025002 1073265
32438 1073265 1126453 1116577 1059565 1018420 959890 958647 1038232 1063512 1034016 1020389 1001198 967206
32426 967206 951932 948976 951786 950948 988495 1107302 1083498 1052909 1067165 1060424 1043057 1055958
32414 1055958 1068190 1074418 1113885 1114336 1069636 1032697 1036640 1070948 1100121 1113447 1111348 1124469
32402 1124469 1096868 1079217 1074204 1076643 1082458 1065998 1086430 1107296 1094846 1052605 1054865 1094300
32390 1094300 1129474 1123255 1122056 1090597 1100743 1119509 1093755 1048413 1079449 1102066 1130604 1121198
32378 1121198 1066979 1070094 1073968 1031117 1025998 1019264 990853 991708 1031182 1073528 1072339 1092702 1055883
32365 1055883 1059397 1104487 1104070 1112606 1137992 1107682 1109811 1102152 1085093 1095905 1079752 1082433 1107910
$$ [...]
##END NTUPLES=NMR SPECTRUM
##END=
