##TITLE=Analysis number 310263
Compound Code cc 38516
Book Reference 335/170
Project Code adrs
Chemist Name davee
##JCAMPDX= 6.0         $$ Bruker NMR JCAMP-DX V2.0
##DATA TYPE= NMR SPECTRUM
##DATA CLASS= NTUPLES
##ORIGIN= Bruker BioSpin GmbH
##OWNER= NMR
$$ XWIN-NMR		Version 3.5
$$ Wed Jun 15 12:00:05 2005 GMT Daylight Time (UT+1h)  MAYBRIDGE\NMR@NMR_250MHZ
##.OBSERVE FREQUENCY= 250.131544655141
##.OBSERVE NUCLEUS= ^1H
##.ACQUISITION MODE= SIMULTANEOUS (DQD)
##.ACQUISITION SCHEME= undefined
##.AVERAGES= 16
##.DIGITISER RES= 18
##SPECTROMETER/DATA SYSTEM= dpx250
##.PULSE SEQUENCE= zg30
##.SOLVENT NAME= CDCl3
##.SHIFT REFERENCE= (INTERNAL, CDCl3, 0, 16.4498)
##AUDIT TRAIL= $$ (NUMBER, WHEN, WHO, WHERE, WHAT)
$$ ##TITLE= Audit trail, XWIN-NMR		Version 3.5
$$ ##JCAMPDX= 5.01
$$ ##ORIGIN= Bruker BioSpin GmbH
$$ ##OWNER= NMR
$$ C:\u/data/dgb/nmr/ADRS/4070/pdata/1/auditp.txt
$$ ##AUDIT TRAIL=  $$ (NUMBER, WHEN, WHO, WHERE, WHAT)
(   1,<2005-06-15 11:59:44.58 +100>,<MAYBRIDGE\NMR>,<NMR_250MHZ>,
      <created by zg, POWCHK disabled, PULCHK disabled
       configuration hash MD5:
       62 19 C7 07 E1 42 D1 B7 37 6C 3D D0 77 39 F9 E6
       data hash MD5: 64K
       B7 35 65 62 6C 4A FD 74 7A AD A6 9C 33 67 6E 0F>)
(   2,<2005-06-15 11:59:55.66 +100>,<MAYBRIDGE\NMR>,<NMR_250MHZ>,
      <Start of raw data processing
       ef LB = 0.3 FT_mod = 6 PKNL = 1 SI = 32K 
       data hash MD5: 32K
       EB EA 44 97 E9 47 11 87 CA 7C 06 B2 9B B9 45 5D>)
(   3,<2005-06-15 11:59:57.27 +100>,<MAYBRIDGE\NMR>,<NMR_250MHZ>,
      <apk 
       data hash MD5: 32K
       42 A9 04 B0 E4 7C 24 45 C6 37 BC F9 BD 0F 38 5D>)
(   4,<2005-06-15 11:59:57.96 +100>,<MAYBRIDGE\NMR>,<NMR_250MHZ>,
      <abs ABSG = 5 
       data hash MD5: 32K
       15 DC F7 CC F6 87 E7 06 5B CD 58 E1 7B 26 58 C3>)
$$ ##END=
$$ 
$$ hash MD5
$$ F6 66 06 5D 65 60 4C 76 EE 73 1D 3E 58 5A A9 1A
##$RELAX= 
##$RELAX= 
##$RELAX= 
##$RELAX= 
##$RELAX= 
##$RELAX= 
##$RELAX= 
$$ Bruker specific parameters
$$ --------------------------
##$DU= <C:\u>
##$EXPNO= 4070
##$NAME= <ADRS>
##$PROCNO= 1
##$TYPE= <nmr>
##$USER= <dgb>
##$AMP= (0..31)
100 100 100 100 100 100 100 100 100 100 100 100 100 100 100 100 100 100 
100 100 100 100 100 100 100 100 100 100 100 100 100 100 
##$AQSEQ= 0
##$AQ_mod= 3
##$AUNM= <au_zg>
##$AUTOPOS= <10 >
##$BF1= 250.13
##$BF2= 250.13
##$BF3= 250.13
##$BF4= 250.13
##$BF5= 500.13
##$BF6= 500.13
##$BF7= 500.13
##$BF8= 500.13
##$BYTORDA= 1
##$CFDGTYP= 0
##$CFRGTYP= 5
##$CHEMSTR= <none>
##$CNST= (0..31)
1 1 145 1 1 1 1 1 1 1 1 1 1 1 1 1 1 1 1 1 1 1 1 1 1 1 1 1 1 1 1 1 
##$CPDPRG= <>
##$CPDPRG1= <>
##$CPDPRG2= <>
##$CPDPRG3= <>
##$CPDPRG4= <mlev>
##$CPDPRG5= <mlev>
##$CPDPRG6= <mlev>
##$CPDPRG7= <mlev>
##$CPDPRG8= <mlev>
##$CPDPRGB= <>
##$CPDPRGT= <>
##$D= (0..31)
0 1 0 0 0 0 0 0 0 0.06 0 0 0 0 0 0 0.0002 0 0 0 0 0 0 0 0 0 0 0 0 0 0 
0 
##$DATE= 1118833183
##$DBL= (0..7)
120 120 120 120 120 120 120 120 
##$DBP= (0..7)
150 150 150 150 150 150 150 150 
##$DBP07= 0
##$DBPNAM0= <>
##$DBPNAM1= <>
$$ [...]
##$SUBNAM7= <"">
##$SUBNAM8= <"">
##$SUBNAM9= <"">
##$SW= 20.6930455092707
##$SWIBOX= (0..15)
0 0 3 0 0 0 0 0 0 0 0 0 0 0 0 0 
##$SW_h= 5175.983436853
##$TD= 65536
##$TD0= 1
##$TE= 295.16
##$TE2= 300
##$TE3= 300
##$TEG= 300
##$TL= (0..7)
0 120 120 120 120 120 120 120 
##$TP= (0..7)
150 150 150 150 150 150 150 150 
##$TP07= 0
##$TPNAME0= <>
##$TPNAME1= <>
##$TPNAME2= <>
##$TPNAME3= <>
##$TPNAME4= <>
##$TPNAME5= <>
##$TPNAME6= <>
##$TPNAME7= <>
##$TPOAL= (0..7)
0.5 0.5 0.5 0.5 0.5 0.5 0.5 0.5 
##$TPOFFS= (0..7)
0 0 0 0 0 0 0 0 
##$TUNHIN= 0
##$TUNHOUT= 0
##$TUNXOUT= 0
##$USERA1= <user>
##$USERA2= <user>
##$USERA3= <user>
##$USERA4= <user>
##$USERA5= <user>
##$V9= 5
##$VALIST= <valist>
##$VCLIST= <CCCCCCCCCCCCCCC>
##$VD= 0
##$VDLIST= <DDDDDDDDDDDDDDD>
##$VPLIST= <PPPPPPPPPPPPPPP>
##$VTLIST= <TTTTTTTTTTTTTTT>
##$WBST= 1024
##$WBSW= 4
##$XGAIN= (0..3)
0 0 0 0 
##$XL= 0
##$YL= 0
##$YMAX_a= 343459
##$YMIN_a= -430917
##$ZGOPTNS= <>
##$ZL1= 120
##$ZL2= 120
##$ZL3= 120
##$ZL4= 120
##$ABSF1= 16.44983
##$ABSF2= -4.243343
##$ABSG= 5
##$ABSL= 3
##$ALPHA= 0
##$AQORDER= 0
##$ASSFAC= 0
##$ASSFACI= 0
##$ASSFACX= 0
##$ASSWID= 0
##$AUNMP= <proc_1d>
##$AZFE= 0.1
##$AZFW= 0.1
##$BCFW= 0
##$BC_mod= 0
##$BYTORDP= 0
##$COROFFS= 0
##$CY= 12.5
##$DATMOD= 1
##$DC= 0
##$DFILT= <>
##$DTYPP= 0
##$F1P= 14.0000005364418
##$F2P= -0.99999901652339
##$FCOR= 0.5
##$FTSIZE= 32768
##$FT_mod= 6
##$GAMMA= 0
##$GB= 0
##$INTBC= 1
##$INTSCL= 1
##$ISEN= 128
##$LB= 0.3
##$LEV0= 0
##$LPBIN= 0
##$MAXI= 10000
##$MC2= 0
##$MEAN= 0
##$ME_mod= 0
##$MI= 0
##$NCOEF= 0
##$NC_proc= -5
##$NLEV= 6
##$NOISF1= 0
##$NOISF2= 0
##$NSP= 0
##$NTH_PI= 0
##$NZP= 0
##$OFFSET= 16.44983
##$PC= 1
##$PHC0= -77.96714
##$PHC1= 17.44142
##$PH_mod= 1
##$PKNL= yes
##$PPARMOD= 0
##$PSCAL= 4
##$PSIGN= 0
##$REVERSE= no
##$SF= 250.130018049574
##$SI= 32768
##$SIGF1= 0
##$SIGF2= 0
##$SINO= 400
##$SIOLD= 32768
##$SREGLST= <1H.CDCl3>
##$SSB= 0
##$STSI= 32768
##$STSR= 0
##$SW_p= 5175.98343685301
##$SYMM= 0
##$S_DEV= 0
##$TDeff= 65536
##$TDoff= 0
##$TI= <Analysis number 999999
Compound Code 99
Book Reference 9
Project Code 9>
##$TILT= no
##$TM1= 0
##$TM2= 0
##$TOPLEV= 0
##$USERP1= <user>
##$USERP2= <user>
##$USERP3= <user>
##$USERP4= <user>
##$USERP5= <user>
##$WDW= 1
##$XDIM= 32768
##$YMAX_p= 460510603
##$YMIN_p= -669082
$$ End of Bruker specific parameters
$$ ---------------------------------
##NTUPLES= NMR SPECTRUM
##VAR_NAME=  FREQUENCY,     SPECTRUM/REAL,   SPECTRUM/IMAG
##SYMBOL=    X,             R,               I
##VAR_TYPE=  INDEPENDENT,   DEPENDENT,       DEPENDENT
##VAR_FORM=  AFFN,          ASDF,            ASDF
##VAR_DIM=   32768,         32768,           32768
##UNITS=     HZ,            ARBITRARY UNITS, ARBITRARY UNITS
##FACTOR=    0.157963299565203, 1,           1
##FIRST=     4114.59605008624, 0,            0
##LAST=      -1061.38738676677, 0,           0
##MIN=       -1061.38738676677, -669082,     0
##MAX=       4114.59605008624, 460510603,    0
$$ Real data points
##PAGE= N=1
##DATA TABLE= (X++(R..R)), XYDATA
$$ [...]
14990b38662P482J56882K0027j3375k5207O2481j04469j49086M2646K23552k6767
14979d4496l8220J59414l7249q890q5474l3470L722m5026L0342k4971N8645J75476
14967A09803m0991J34519p7861q0146Q8223l9420j70793q7539L1713j0218k2744
14956a65454O5404k050J8234J51163M1349l0647r0540l8692Q9585J34071j69731
14945B692j37701J14940J5628m7560L6991p3229R8962o79R2471O8696j2652q5900
14933G2659j40050J04427M2698j20809l5726N9007N3902k6797J11124K488J2441
14922A35364k26688j60360j10915J52245J35861O4499m2480R1445J3850J10182
14912A63003j5510r7904M6740m3495p5640m6290j94067N1487J42323M4711Q8544
$$ y = [-238662, -231180, -74298, -54271, -67646, -92853, -30372, -134841, -283927, -241281, -17729, -44496, -82716, 76698, 39449, 30559, -54915, -88385, -84663, -129689, -99347, -124318, -65673, 109803, 68812, 203331, 125470, 45324, 133547, 94127, -76666, -164205, -132492, -142710, -165454, -100050, -102100, -83866, 67297, 108646, 77999, -12541, -51233, 38352, 172423, 2692, -135009, -20069, -4441, -52001, -15010, -88239, 10723, 10044, 102515, 171211, 158559, 72659, -67391, 37036, 79734, -41075, -76801, -17794, 36108, 9311, 120435, 122923, 135364, -91324, -251684, -362599, -210354, -74493, -9994, -52474, 38971, 52821, 163003, 147493, 49589, 96329, 52834, -22806, -69096, -263163, -211676, -69353, -24642, 63902]
14901F3902o2076k27200J51601J43573Q5808j02713n2240M7384n4459j6903j19196
14890a42519K9841O2178K2126M7932j58662N7930J2812j15512o2064J6175N8130
14879a71633J21626o031J71499J45323j40621k5018k902j37176k71536P010J0885
14868b98574J9232J01196J26742p8897k4911K4557j9369Q1012r2623O9209J2952
14857g9474J35790j13480q9075j00493j02007K18450O4632P2968Q2060m5049k6737
14846A7585j5829j02799p1203L6438L8087j64167q3296l8195K6366J52632j15713
14835c20094n0362J4774Q5224N7217J32789k6244J7988J83013M6726O1719k3433
14824A79317p8522j88577O0290L9849R6438K2194l7195m8184R4351K1580M7301
$$ y = [63902, 1826, -225374, -73773, 69800, 155608, 52895, 655, 48039, -6420, -23323, -142519, -112678, -50500, -28374, 19558, -139104, -81174, -68362, -183874, -245938, -229763, -171633, -50007, -56038, 115461, 260784, 120163, 95145, 92243, -44933, -316469, -309459, -298574, -279342, -178146, -51404, -130301, -155212, -130655, -150024, -69012, -161635, -92426, -79474, 56316, -57164, -146239, -246732, -348739, -130289, -65657, 7311, 89371, 44322, 17585, 1756, -101043, -172246, -135808, -97721, -261888, -345184, -383379, -357013, -204381, -320094, -370456, -355682, -270458, -213241, -80452, -106696, -88708, 94305, 141031, 202750, 179317, 100795, -87782, -27492, 12357, 108795, 130989, 93794, 45610, 139961, 161541, 208842]
14813B08842r8480J377Q597o5570j22254k07861M4446J73105J28961l1632q8310
14802d8779n6318k1000j40906j68960j02775J99631K1103J35557K08575l9787
14792a3659j8726j94631N7384n2635r9205J97767M3083L2504P0931n4622L5837
14781D028m0245j6191J09453n8539K5430M3075K0382k58938M4587k1203J73926
14770B5765K05940J3866j287j60068j11499r6964k2859M048K0803J74695p0096
14759a7656j54335o0780J0513r0239J29078p2882k9358J01870P5390O2183j2388
14748e8604N9437M9829R9830l434L4574j73581j31080j16344J22484n5701l0864
14737b03454N0898k2085M1763n7912j7292l2907Q2848J36950P6751q9330q1353
$$ y = [208842, 110362, 111739, 120336, 54766, -67488, -275349, -230903, -57798, 71163, 39531, -48779, -105097, -126097, -267003, -435963, -538738, -339107, -318004, -182447, 26128, -13659, -32385, -227016, -169632, -222267, -321472, -123705, -80622, -48118, 22813, -31809, 4028, -36217, -52408, 57045, -1494, 23936, 67011, 87393, -171545, -126958, -148161, 25765, 231705, 245571, 244284, 84216, -27283, -124247, -147106, -143058, -122255, 52440, -17656, -171991, -232771, -222258, -312497, -183419, -256301, -285659, -183789, -108399, -46216, -58604, 833, 50662, 150492, 147058, 181632, 8051, -123029, -239373, -116889, -172590, -203454, -152556, -174641, -132878, -190790, -208082, -240989, -158141, -21191, 55560, -33770, -115123]
14726a15123m5399M0323R4615j91927p7608J5425O1724J09699J50487n3193j10381
14715a21358k585N4331k5265r3131J0561R6312L7404M3812j1247j15106m2061
14704a68333L6207J13939L4175p8905J90060O7680l40908N2337K95854j1210r4681
14693I6215J6111l8945K9419l539K4147j50131N2410J11698r1427j32560n449
14682i2051J38392M7170j41715j16513m8882M0633l468K7357O3434R0227M71n682
14670f27Q097j31179N567l1805K1397n7546m1893o8054J42243o291L7916j2209
14658a34384r1907o7073J22755J29127k8472l7347o1982P2748P9419K1460n3187
14647d8843j7746J7499m7278J6180K06961j3669o4550r5195m4294Q2319k1688
$$ y = [-115123, -160522, -120199, -25584, -217511, -295119, -279694, -217970, -108271, 42216, -10977, -121358, -123943, -69612, -94877, -188008, -177447, -81135, -43731, 81, -11166, -126272, -168333, -132126, -18187, 15988, -62917, 127143, 194823, -146085, -93748, 202106, 190896, 96215, 112326, 73381, 102800, 99261, 123408, -26723, 25687, 137385, 45958, -86602, -92051, 46341, 93511, -48204, -164717, -213599, -172966, -176434, -149077, -85643, 4584, 5055, -627, 7470, -123709, -118142, -149947, -128550, -186096, -227989, -296043, -153800, -160091, -122175, -134384, -226291, -293364, -170609, -41482, -69954, -107301, -169283, -96535, -17116, 4344, -48843, -66589, -49090, -96368, -80188, 126773, 113104, 48554, -46641, -90935, -8616, -30304]
14636c0304j44680r3111J46860K73262J30323j48551j72173k7161L3118J19063
14626H6646o785k8497R8143q6446k80116n7589K8757n854N2710N8901r603J00282
14614d9451j14044q1996j01094L6475p549p8248K8691J68238R3324J18386Q2598
14603I5330N9698K4811o6517j09514k05409p1936L2292p4684m0519k4595P2130
14592c08913L194J47177J64179m1581j43961J33223R3506k426j32629P6129P4482
14581F2380Q7129M4821k65670j28590K2349J84549m80m0762j1972n2743Q890K493
14569h7606Q2496p424K1949P2064p3068o8516J31300J8070k12533J386L8690K5134
14557e8058j1520m8972k8619q713J2939j07576j5032J81658J10304K9814j11379
$$ y = [-30304, -174984, -268095, -121235, 152027, 282350, 133799, -38374, -65535, -32417, 86646, 79861, 51364, 149507, 63061, -217055, -274644, -245887, -251741, -199031, -140130, -149733, -49451, -163495, -245491, -346585, -310110, -317659, -395907, -367216, -198978, -105654, 12732, 95330, 155028, 179839, 113322, 3808, -201601, -273537, -241245, -315929, -356448, -381043, -308913, -305719, -158542, 5637, -35944, -179905, -46682, 46824, 44398, -88231, -12102, 62380, 149509, 194330, -71340, -199930, -177581, 6968, 6488, -34274, -46246, -98989, -90099, -87606, -5110, -12534, 9415, 81479, 8411, -60105, 71195, 89265, -123268, -121882, -83192, -58058, -69578, -118550, -147169, -155882, -142943, -250519, -265551, -83893, 26411, 56225, -55154]
14546e5154l2475l114r3390L7055J02530j10803k7236M2772J68745J47109K7850
14535B03889r2409m6647r827q1079n4505k4428J63452M4462r7617O356J20765
14524A32412J04169j9980j21495o9345O7905Q6517K9721j27024j11411j19418
14514a47949p4255P6349M5660O42m6374N2773R0858j00541J12336l8206j09512
14503a38219N5392P2489Q6660m8071j16864j19613M1678P1039R4057L6511j00716
14492f5657r6373N3086l3241m7998M5272J06411P1017R0435J6956J7820K0020
14481A77748K4285k4513o7922q7791J0262M4204j03614j16183Q2401L987J17185
14470F0049J07343j92136j47753j8866J66609O8642n5471L445N5753P0387j13860
$$ y = [-55154, -87629, -90743, -184133, -147078, -44548, -155351, -182587, -139815, 28930, 176039, 203889, 111480, 64833, 55006, -26073, -80578, -105006, 58446, 102908, 5291, 11647, 132412, 236581, 216601, 95106, 25761, 93666, 180183, 209904, 82880, -28531, -147949, -222204, -145855, -100195, -99553, -145927, -93154, -2296, -102837, 9499, -28707, -138219, -82827, -10338, 76322, 28251, -88613, -208226, -166548, -95509, -1452, 35059, -65657, -162030, -108944, -142185, -190183, -144911, -38500, 32517, 122952, 139908, 157728, 177748, 202033, 177520, 109598, 21807, 32069, 76273, -27341, -143524, -61123, -57136, 60049, 167392, -24744, -172497, -191363, -24754, 43888, -11583, -8138, 47615, 118002, 4142]
14459D142k5619j63410J38146N7648M5952J06331p4030j00335M3951O3902K9304
14448A25982k9275l469p0278J85948N8618j19048p7862P5758O360j4908K4701
14437A62527k1746P5364q2224j76380j41934P047L4243p0816L9453m2999N2142
14426a65323M6531J3882J67894J43159L7801j60734j45910l9215p5719o0603L8202
14415b00035j39836J8438K97380J43300r8871p0011o2337o3544j1277q8115L2612
14404b42296n4775J25419J37070M4945q5082N5914Q0312K6583R2951j06620p2333
14393B088P4432M4894j15730j14375r073N2239k01515M7125P2187q1234J10880
14382a18082J09117J98399J36532m8609o8658m673k8601j53849j05786m799Q4773
$$ y = [4142, -21477, -184887, -46741, 10907, 56859, 163190, 89160, -11175, 32776, 96678, 125982, 96707, 93238, 22960, 208908, 267526, 148478, 70616, 146374, 152734, 137826, 162527, 140781, 216145, 133921, -42459, -184393, -177346, -143103, -213919, -174466, -217465, -165323, -118792, -104910, 62984, 206143, 243944, 83210, -62700, -101915, -177634, -238237, -200035, -339871, -321433, -24053, 119247, 20376, -49635, -111972, -175516, -186793, -274908, -242296, -297071, -171652, -34582, 10363, -74719, -18805, 61507, 88090, 181041, 74421, 2088, 76520, 121414, 5684, -108691, -117764, -65525, -267040, -219915, -147728, -228962, -118082, -8965, 189434, 325966, 277357, 208699, 204026, 175425, 21576, -84210, -89009, -4236]
14371d236Q7622K9258P0571L2806N7782r9631r4501L5695O1441m0983r4513r9748
14359e8437m9428m1754N202k5060J39620J26271o7757J1356k2183j23974j04130
14348b10274j24404m6107N5608R7446R2736J04879K0617m2696Q0361M4674q5156
14337a2316j56730K2080M3575K5280P1701j04463j45186j52343r1995o1088R1531
14326d69954K71628K23588q8043k2480R9254k15431j69752k3216K10690P6104
14316a07612j36390r1603J32676O8043k7294l14764j73175J54579M01265M3091
14306e1184j10509J21646J3849p6360R380J06058N1591j05806n0246p8988O62
14295a69907Q2162L9040n335J08042J64827m7900p5191j7294k22610j33100J84050
$$ y = [-4236, 83386, 112644, 183215, 216021, 273803, 174172, 79671, 115366, 176807, 135824, 41311, -58437, -107865, -149619, -144417, -169477, -29857, 96414, 28657, 40013, 17830, -106144, -210274, -334678, -380785, -325177, -227731, -134995, -30116, -9499, -52195, 28166, 72840, -12316, -169046, -146966, -103391, -78111, -6410, -110873, -256059, -408402, -500397, -561485, -469954, -198326, 25262, -62781, -85261, 13993, -201438, -371190, -394406, -183716, -107612, -244002, -335605, -202929, -134886, -162180, -476944, -650119, -495540, -94275, -51184, -161693, -40047, -26198, -102558, -93178, 12880, 64471, -41335, -91581, -170569, -169907, -87745, -48705, -54040, 54002, 218829, 170929, 95738, 78444, -144166, -277266, -93216]
14284i3216m7352Q1172R9297J87283q9551j74803r5378M1058N061r7857K3136
14273a61150l0304J3100J15060m6404j71563k3154J53540L3013m5024M3166L1108
14262h8612L4629n3144R0526J41270j92341q3141L9519J64269J5104j4109N5169
14251A09139k4835N1672j13048o5775j7672N3491j60890o9755J07126N4614N7285
14240a8648K9229j54018m6528K3619O4530o394j5862M0951j26429o5822l8686
14229c14058j14955J67248J259q8634K6325R3877R641J7906j6660J78502J47558
14218A08009J41459P7562j86064k2597l2238q9979p1910O3073M1250p3379R3949
14207D9135R6307l2600q1241o2954q3109q2671j72735o1785k5820Q5213J35159
$$ y = [-93216, -140568, -59396, 39901, 227184, 137633, -37170, -132548, -91490, -86429, -184286, -161150, -191454, -178354, -63294, -109698, -281261, -304415, -150875, -117862, -162886, -119720, -88612, -53983, -107127, -16601, 124669, -67672, -150813, -111294, 52975, 68079, 53970, 109139, 84304, 135976, 22928, -42847, -60519, -7028, -167918, -237673, -130547, -75933, -18648, 10581, -143437, -189965, -166346, -101816, -108210, -124072, -83121, -209550, -275372, -314058, -429013, -261765, -260506, -349140, -322815, -228938, -219297, -201391, -218051, -39549, 108009, 249468, 327030, 140966, 118369, 86131, -3848, -75758, -12685, 28565, -44814, 49135, 145442, 112842, 31601, -31353, -114462, -197133, -369868, -431653, -457473, -372260, -237101]
14196b37101J59438J29973O5512m5384M9437K1166j9441K06781K008k17299j87367
14185g2277r5360Q403j11027J77427K5331j02270q0484P1425P9783N2333Q3919
14174C7203K958J1682m3939m6813K8176j13335k3459J27517R0538j20288q4330
14163a34090j29789n7439j6209J59196K1924m0415O3010J23229l9633m2183j45280
14152b37679p0401J90540L4967j72840J46730K08462R0776r3155j16413l7886
14142e6899O5858p7834o1158P5822q6914n6488L5107n2717N3506J66905J09758
14131A14946p5174k72854j14708J34065M2471m5721J11966J10841L5356q0170
14121c8982r9400l3443N8591n3330j00425K1421J61094R5114R1914N7894j64411
$$ y = [-237101, -77663, 52310, 117822, 72438, 121875, 143041, 123600, 330381, 332389, 115090, -72277, -167637, -159234, -270261, -92834, -67503, -169773, -250257, -178832, -99049, -46716, 37203, 40161, 51843, 7904, -38909, -10733, -124068, -147527, -20010, 70528, -49760, -134090, -263879, -321318, -337527, -178331, -156407, -196822, -133812, -10583, -50216, -92399, -237679, -308080, -117540, -82573, -255413, -108683, 99779, 190555, 97400, -19013, -56899, 8959, -68875, -130033, -54211, -141125, -197613, -162506, -215223, -161717, 5188, 114946, 39772, -233082, -347790, -213725, -171254, -216975, -105009, 5832, 41188, -38982, -138382, -171825, -113234, -166564, -266989, -245568, -84474, 10640, 102554, 160448, -3963]
14110c963j07093o6533K8977K3940P1784r9373j3668J49157k25835L5531n5812
14099b62888J3178J04176L9220K19644M2362j83276k36133p0607J17256J37880
14089g9188L7765L0350k07484R4338M9937j23414J53996O733m9034O9390r1989
14078a08600k32690J08583m6693J136j5018N9863J12490M0542j51975K501l4576
14067b64437K1062J1697m4077J09824P3106k1968K64795J561j28570R8321j12197
14056I117p9326p5232L5755J44671P88K6530n9052j27544J37698O1271k8035j6534
14044C0107o8808J42231m4724k74865p2030J83087J48043K8459J10195Q0149r5374
14033A66470r8804j49737r5018j01143J31000k4816j34307j0545N9843K42529
$$ y = [-3963, -111056, -177589, -148612, -124672, -52888, -152261, -165929, -16772, -242607, -207076, -262888, -249710, -145534, -106314, 113330, 155692, -27584, -263717, -334324, -217068, -79188, -41423, -11073, -218557, -124219, -74282, -197696, -43700, -36967, -86001, -16611, -108600, -341290, -232707, -279400, -278264, -293282, -233419, -120929, -80387, -232362, -229861, -264437, -243375, -231678, -275755, -165931, -92825, -114793, 150002, 151563, 22993, 121314, 9117, -70209, -145441, -109686, 34985, 35773, 62303, 3251, -124293, 13405, 74676, 46641, 30107, -38701, 103530, 58806, -216059, -288089, -105002, 43041, 71500, 181695, 261844, 166470, 67666, -82071, -177089, -278232, -147232, -172048, -306355, -316900, -257057, -14528]
14023a4528J89544n9890o6896n5249K23504K8140q6855k29645j01211M0911J9725
14012a12450J2958M0759l5762k1164l8944R1413L8538R2743q0153j62074J75677
14001A541L0970j13754O8753k2101m5559M3863l8537O2645j10390N9972J69955
13990A07358J2781r1933n6438Q3040Q8795m128M9749n1728m0718J68861P1127
13979C36766r5486k37249j02140P5027N5158L4977O9820p7522j19816Q7040J23645
13968A50220N8100r9133j07289n2376J1897L1474r0267j03520J5181L3703Q5531
13957f6479k7590m581k1082J31756k1480j62405q8716K04909N3681k7671j22218
13946a51876l4661Q3126M079J85949J9974m2864q1537m2995N6228l0570O8227
$$ y = [-14528, 175016, 115126, 48230, -7019, 216485, 244625, 157770, -71875, -173086, -132175, -112450, -99492, -58733, -94495, -115659, -154603, -63190, -24652, 68091, -12062, -174136, 1541, 32511, -81243, -12490, -34591, -80150, -36287, -74824, -12179, -122569, -62597, 107358, 120139, 28206, -28232, 54808, 143603, 139475, 189224, 137496, 96778, 265639, 336766, 241280, 4031, -98109, -23082, 32076, 67053, 136873, 59351, -60465, 26575, 150220, 208320, 109187, 1898, -50478, -38581, -7107, -97374, -200894, -185713, -152010, -66479, -94069, -98650, -119732, 12024, -9456, -171861, -260577, -55668, -1987, -29658, -151876, -186537, -103411, -99332, 86617, 106591, 63727, -17810, -60805, -4577, -35147, 33080]
13935C3080r3208o7909J57576J32483k4078o6489m6443m9440J27749j9987j50716
13924f7382p4101J00299m2312j77313J8416J02096P9732N6426o9686N0225O4577
13913D0977j07601N884J0272J71918L6322l7621j451q3365q8700r9839Q3442R5370
13901B5608o6079j6284j16424j1385R4095M3931o3187J19245J96396J33452K3718
13890C63086n4062J00321l6987k07043j51860r2521k3752J34205k7535r4846q4184
13879a75178p3712l1019K18073J72598n4170m8619r5856J11951L3457n6952p7137
13868g6564J17808N7389q0275O765K1077J5201j6150q7959M118J34986P7024j19048
13856E4372q2361j2767q4019l0772j9082L8008L1365r706O1637N5668J40665P6490
$$ y = [33080, -60128, -128037, 29539, 162022, 137944, 71455, 25012, -24428, 103321, 83334, -67382, -141483, -41184, -83496, -260809, -242393, -140297, -60565, -4139, -73825, -23600, 40977, -66624, -60740, -50468, 121450, 157772, 120151, 118700, 35335, -53365, -153204, -69762, 25608, -40471, -56755, -173179, -184564, -90469, -46538, -109725, 9520, 205916, 339368, 363086, 309024, 409345, 372358, 165315, 13455, -79066, -102818, 31387, 3852, -90994, -175178, -248890, -279909, -61836, 110762, 56592, 7973, -87883, 24068, 57525, 573, -76564, 41244, 98633, 18358, 25123, 46200, 61401, 45251, -42708, -38590, 96396, 173420, 54372, -27989, -40756, -124775, -155547, -174629, -136621, -105256, -114962, -53325, 2343, 143008, 219498]
13844B19498l7367j12420K8302p268l3799o5230j36233q433o4793J22562K3544
13833g1637M4063m3802p5873l2787k8550M1020K10393P6502j7967j06558j00141
13822a05337p3455n3573k3078P3242J67713J33491j54997k41302J50559J1061
13812a15676O5941o2448o9783j04419m8856J42268q1455j1830J22273Q1176N7541
13801b5268J51694J36091j92838j81705k3597k7438J45437O7004q62r4808k19572
13790b65862K8494j1926K6077N2500m0683r5699j00402J19293J01595J80717J3521
13779G625J19277K403k5518n6394j44922m2628j14003m6843K5636J24880J68615
13768A8128O3548K2603l14837m9586K09466N5759K1494j46710J7859N6333N1845
$$ y = [219498, 182131, 69711, 98013, 90745, 56946, -8284, -144517, -152950, -217743, -95181, -71637, -27574, -71376, -147249, -180036, -208586, -167566, 42827, 119329, 101362, -5196, -105337, -178792, -232365, -255443, -182201, -14488, 119003, -35994, -277296, -126737, -115676, -49735, -112183, -181966, -286385, -335241, -192973, -274428, -286258, -163985, -82809, -25268, 126426, 262517, 69679, -112026, -135623, -163061, -17624, 49380, 48518, -46290, -265862, -237368, -249294, -223217, -170717, -211400, -307099, -407501, -288208, -186613, -5896, 7625, 126902, 129305, 103787, 47393, -97529, -140157, -254160, -301003, -275367, -150487, 18128, 81676, 104279, -210558, -260144, -50678, 5081, 26575, -120135, -102276, -45943, 5902]
13757E902J38448J54903k26999r5568L5529N2460j6763r8134l7798P6460M0114
13746B8554m8371L710J05973Q7805p4261p3214l8006k365J52685j2786m8791m2445
13734C8488k2902j10518k3107n0315M1618J69683J51756k2867K2004q5085j00829
13723G926j27851K0484P6621L7548p3990n9305j19922J21820J43184q7086K5102
13712c5469o8525J36154K10198j4579K2568j64485j60535n6731J9439j92322L6400
13701b67887J42936K06582J9168l8540k85520l6675L979O7903J50053J03794J28388
13690A94181q9984j98023j94685R2275J01204Q481n7925k6140J24293Q1795k2634
13679A2838l8768j51318J8128l21r842J5145j8690M8297J94015j7119j13945P655
$$ y = [5902, 144350, 299253, 72254, -23314, 12215, 64675, 47912, -50222, -88020, -11560, 28554, -19817, -16107, 89866, 177671, 103410, 30196, -7810, -10175, 142510, 129724, 80933, 38488, 15586, -94932, -118039, -168354, -126736, 42947, 194703, 171836, 193840, 108755, 7926, -119925, -99441, -22820, 14728, -59262, -118567, -238489, -116669, 26515, -60571, -35469, -103994, 32160, 242358, 227779, 250347, 85862, -74673, -131404, -111965, -304287, -267887, -124951, 81631, 100799, 62259, -223261, -259936, -255957, -188054, -38001, 65793, 194181, 104197, -93826, -288511, -196236, -95032, -86551, -144476, -170616, -46323, 35472, 12838, -25930, -177248, -159120, -159441, -169283, -154138, -172828, -124531, 69484, 52365, -61580, -53925]
13667e3925m0443q2730o5064J73501J28911l848J5373j12783K1037K0719l3368
13656c2620K1431j22319j47129J51623j1241j14646K94887P7102k71286l9423
13646a93621N5629n0920n0827L7561Q962k22339k00279K42600K78089J01053l9290
13635c3382M2543R7185J2285K6408j53923k9283J69930j15465j8394M6278O0991
13624A05173O841r1618j2722L6450J8019j33781q2707L9238O4570J21975P0683
13613A42121m7116n653j60268j46105o5687J67093p0638l7666P3388k1494m0714
13602b12739Q3312Q3814j33897j62R8107J19501P6297m0164j6939j1680p1561
13591b6111K1304N9823n6957J41690L0046j40924j88371o163K637K0308O8115
$$ y = [-53925, -94368, -177098, -242162, -68661, 60250, 56402, 71775, -41008, -19971, 748, -32620, -11189, -133508, -280637, -129014, -140255, -254901, 39986, 117088, -154198, -193621, -137992, -188912, -239739, -202178, -193216, -415555, -615834, -373234, -95145, 5908, -33382, 9161, 106346, 118631, 145039, -8884, -38167, 131763, 16298, -2096, 44182, 105173, 112014, 20396, 7674, 44124, 62143, -71638, -154345, -115107, -50537, 71438, 142121, 95005, 89352, -70916, -217021, -282708, -115615, -186253, -223919, -150531, -172025, -212739, -129427, -45613, -179510, -179672, -81565, 37936, 114233, 74069, 57130, 45450, -26111, -4807, 55016, -1941, 139749, 169795, 28871, -159500, -165663, -163026, -142718, -74603]
13580g4603P0346L9611j3166m6995O8603r789k8771j41912K0265N6041N2101r9551
13568a07820M3063j74551N4735J84427R3533o0524j40086J07445k0317j72400
13558a92495P4821J98114j56808j65524L2597J38152j99443J176o2567J80441
13548a51536o3051O5577J55960k2531n4982l972n138J48967J2563l9572J7722
13537F0007O8242j26739j27740J7062J4043J43180q0103O1487l8945J12959p1317
13526C2136j76915K1905L4707J9422L9246M9418J19816j25056o692k5480k4347
13515d1840Q4076M4426Q3401O1185R0478j40481r3449j26639j7912k9044M2992
13504d2807J19158R6132n8163J3326l1308q494j45867O2791R507j5046l2297l3819
$$ y = [-74603, -4257, 35354, 22188, -24807, 43796, 34007, 5236, -136676, -116411, -60370, -8269, -107820, -64757, -239308, -184573, -146, 93387, 32863, -107223, 222, -20095, -192495, -117674, 80440, -76368, -241892, -209295, -71143, -270586, -269410, -331977, -151536, -214587, -149010, 6950, -15581, -70563, -74535, -79673, 69294, 81857, 42285, 60007, 128249, 1510, -126230, -109168, -95125, 48055, -32048, 29439, -9506, 103453, 32136, -144779, -122874, -88167, -68745, -29499, 19919, 139735, 14679, 7987, -17493, -41840, 42236, 86662, 170063, 231248, 321726, 181245, 87796, -38843, -56755, -85799, -42807, 76351, 172483, 114320, 127646, 96338, 87844, -58023, 4768, 14275, -771, -33068, -66887]
13492f6887j89420L9195J01209O1974p85Q3350Q0662q8992l3007M7535j2345j45078
13480a22589j12479Q067J7302Q9042P2759J1423p9947j69629k0179J12572M3087
13469a50571L1677N3341m3716R2331l5150j03326k9239M1950m9470n7778j41569
13458c91520O0389J59836K3332J81961o8334j32900j16000K37113K40730n571
13448A89036j80291j17390P3245R5673j45267j55062N1148K18216P2604l5376
13438F6536k2657Q8655J5003j17465k02582j03405L6311J92340J25896L7666K971
13427A19269j34080p378l1360j4360K6427M6245O6546p2215n1151K30701R1138
13416B69782q3045j43755j00429o2747k620P5360n7023J367R3818J57441k6242
$$ y = [-66887, -256307, -217112, -115903, -53929, -54714, 28636, 109298, 20306, -12701, 34834, 22489, -122589, -235068, -227001, -209699, -120657, -47898, -36475, -116422, -286051, -306230, -193658, -150571, -118894, -65553, -109269, -16938, -52088, -155414, -184653, -142703, -192173, -249951, -391520, -331131, -171295, -147963, 33998, -34336, -167236, -283236, -46123, 194607, 189036, 8745, -108645, -35400, 60273, -84994, -240056, -188908, 29308, 101912, 66536, 43879, 132534, 147537, 30072, -172510, -275915, -239604, -47264, 78632, 116298, 119269, -14811, -22189, -53549, -67909, -41482, 4763, 71309, -906, -52057, 178644, 269782, 186737, 42982, -57447, -120194, -122814, -47454, -104477, -103110, -9292, 148149, 121907]
13405A21907o2761j79485K5807j30622J47057J14810J0697L7479m068q3423k81853
13394b84455r9084Q2642M8016J5488J12198N7951R7112r5859Q5566J17526k95182
13383a58081q499P9894K6731J02810Q8901J08028p4410o2681l6295r9519J08548
13372G5427O2077L5751J0083n7750r4124j26748P4045P7839o9906p3714k1006
13361a08026J27902P935p9997J44092J58987P884k1697j94937K7181K3150r7268
13350d794l1788j7880j30251r9192m084J53722K61602J01139l7263L0335m4740
13339A76806j2005J04812p9802k8041l2195m3139j5939m4866J27756O8155K5972
13328B47514j31846q7702J5609P8691n1088r1343J81319J65603p9875j15649K63707
$$ y = [121907, 59146, -120339, -94532, -225154, -78097, 36713, 47410, 84889, 80821, -2602, -284455, -383539, -300897, -252881, -237393, -125195, -67244, 29868, -65991, 19575, 137101, -158081, -166580, -86686, -59955, 42855, 131756, 239784, 165374, 102693, 66398, -33121, 75427, 137504, 173255, 183338, 125588, 31464, -95284, -21239, 56600, -13306, -87020, -108026, 19876, 27811, -52186, 91906, 250893, 258777, 237080, 42143, 69324, 92474, -4794, -36582, -54462, -184713, -283905, -287989, -134267, 127335, 228474, 191211, 221546, 176806, 164801, 269613, 189811, 161770, 129575, 86436, 70497, 25631, 153387, 221542, 247514, 115668, 27966, 43575, 122266, 71178, -20165, 161154, 326757, 246882, 131233, 394940]
13317C94940J01669j65716k9188N08n3531Q747q6144o4983J78925J200m8065n3884
13305A84478n8638q3464r147j14208J6758O2351P4678m6754j97069k09327p4309
13294d54651R7867K18781J45893q6090k4259N6618K18703P1040K6375P0946P0966
13283D12189q8249j90170m629q2017j12387J4627q2713p8659l053O8512J12808
13272c3741m9922L6183j10229M6008J76453m9981N4689j50304l5312k1127M533
13261a32750J09177M996k07302p0616J44146K6318J9878j26703Q3056J84369J51012
13250A85581j23974j96986L9760J40058J03859n7900j56773j05926j12204P6202
13240b08303k0858J12916k3546j27948o7672J8260M8916O5833J66365K21475J20367
$$ y = [394940, 496609, 330893, 301705, 302213, 248682, 257429, 171285, 106302, 285227, 286427, 238362, 184478, 125840, 42376, 33229, -80979, -64221, -1870, 72808, 26054, -171015, -380342, -454651, -356784, -138003, 7890, -78200, -102459, -45841, 172862, 243902, 270277, 341223, 412189, 323940, 133770, 129141, 47124, -65263, -50636, -133349, -212008, -215061, -146549, -33741, -83663, -47480, -157709, -111701, 64752, 14771, 69460, -80844, -116156, -137283, -132750, -23573, -18577, -225879, -296495, -152349, -126031, -106153, -232856, -149800, 34569, 185581, 61607, -135379, -95619, 44439, 148298, 90398, -66375, -172301, -284505, -208303, -229161, -116245, -139791, -267739, -335411, -317151, -268235, -202402, -36037, 185438, 305805]
13229C05805j30882m3033p356m6782j45934j61308q9636k5165L3487J37207l88
13218a73985K0450q9664O4345n2887K1431P8426n2958j61324r4312J05942J07153
13207b27383J1172J30124Q1335r1047k0575k4594J38903K3820R9364j06787q5022
13196g0690R1268j40493n5895J4219o8732j59295J53928J29255o1219O7004J21238
13185B0588N278o2813Q6781P5991j98725j25123K7297J06359K06669k7340j62234
13174d7272j45363j15675Q3187J07109j07411P5707J2985O1736M1207k01656j78009
13163d13455N9359K3408l1218L6083J51542M9599P4768L3940N7916l6467j23445
13152a17970J76835L9501j8433L6155j50505P2248K6510j95862K6906j3553j45704
$$ y = [305805, 174923, 131890, 124534, 77752, -68182, -229490, -319126, -344291, -310804, -173597, -173985, -153535, -243199, -178854, -231741, -210310, -131884, -184842, -346166, -440478, -334536, -227383, -216211, -86087, -4752, -95799, -116374, -140968, -2065, 21755, 121119, 14332, -70690, 20578, -119915, -175810, -161591, -230323, -389618, -235690, -106435, -167654, -100650, 20588, 25866, -36947, 49834, 125825, -72900, -198023, -170726, -64367, 142302, 114962, -47272, -192635, -308310, -225123, -118014, -225425, -149718, -136733, -74997, -33790, -235446, -413455, -354096, -330688, -361906, -325823, -174281, -124682, -49914, -15974, 41942, 5475, -117970, 58865, 98366, 79933, 116088, -34417, 37831, 64341, -131521, -104615, -118168, -263872]
13141b63872m2612J15568O6401n6394Q7910J16078r7426j711j30743r7112q5771
13130c89684K04603K02228j37333l6976J12113J12806j20143q727N9538R0839
13120H9264J06193q8996o8687J77774J17391J9555l3851p9263j73815l6628L0280
13109E9217j52023j23329j5230N1737O2654J18597O884M2473L2544p7694K0081
13098B5911N5645o6109J65341M7741j58942j06364N8320J45328k48573r7244J23854
13087e5092O5390J4847j08408j33443N092Q0702M1031J21444K67955r782M0015
13076C29751l5569J24618n4953m1875k95677j47221j8258J05985j66377L4334
13066a65242j2416j1087Q4569K15918O3570L6026j29795k7311n0188j55019j50829
$$ y = [-263872, -306484, -190916, -124515, -180909, -92999, 23079, -74347, -76058, -206801, -303913, -389684, -185081, 17147, -120186, -157162, -45049, 67757, -52386, -61113, -1575, 89264, 195457, 106461, 37774, 215548, 332939, 352494, 318643, 239380, 65565, 28937, 59217, -92806, -216135, -231365, -179628, -116974, 1623, 8507, 50980, 83524, 5830, 25911, 81556, 15447, 180788, 228529, 69587, -36777, 21543, 166871, -81702, -178946, -55092, 10298, 25145, -83263, -216706, -211614, -130912, -89881, 31563, 299518, 289736, 329751, 294182, 418800, 363847, 321972, 26295, -120926, -139184, -33199, -199576, -165242, -177658, -188745, -104176, 111742, 175312, 211338, 81543, 54232, 4044, -150975, -301804]
13055c01804m2363J50589q8656q5285J8875J11781J66926L2340l7621j043J44425
13044F8164J0934k01591r9194J04280R1385n7388j54170O8845R6691P7690K16944
13033B22590J62431j20349j07790j47133n6739j21155J08774M6677J100p0168
13023h1762l3995j790l5584q7886J5583M8645m0122k5388N1671M8951k2303q0065
13011b44045M1593l2310J66302m0960j50806m1366N6359J95376J11280J11475
13001A72898L028k37536n2944L0086L0157n7866J83190J01316j54713K731l5889
12990a5542J62857J09343p9830k02795k20202j21210M8326J15412O9296N8368
12980g5977m2022P4793J3306o6688M5044K79258K04254j82872k19782j73362L7031
$$ y = [-301804, -344167, -193578, -282234, -367519, -348644, -236863, -69937, -37597, -75218, -76261, 68164, 79098, -122493, -221687, -117407, -26022, -83410, -237580, -168735, -72044, 5646, 222590, 385021, 264672, 156882, 9749, -46990, -168145, -59371, -12694, -11594, -81762, -115757, -117547, -153131, -241017, -225434, -176789, -216911, -242299, -190628, -141677, -163980, -244045, -202452, -234762, -68460, -109420, -260226, -301592, -245233, -49857, 61423, 172898, 175926, -61610, -114554, -84468, -54311, -112177, 71013, 172329, 17616, 20347, -15542, 147315, 256658, 176828, -25967, -246169, -367379, -319053, -203641, -134345, -75977, -117999, -43206, -29900, -96588, -51544, 227714, 431968, 249096, 29314, -144048, -107017]
12969a07017l7966m050J70970J26787J69169P8950k05270l31140k4352Q5872l32
12958g8379L0374J27809J09669J7487m5004r8683j34095m742J54206J2238q8213
12947B667O7354Q3909O2361Q079J26072r0565k64355q6998m9883l0047l1503J2546
12935a90363J52029J6637j9137n8827p2260p5891L270R4638K09336M3078j34458
12924c1948l8134l0040R4806J11318j01370k70215n4138K18052J03327r8040j47448
12913b43830o813N2828j0276J79573n3987j03184p5838K08831n6050k2252m6420
12902a77418M1927Q2609r3186j05966l567p2448J3260L4159O5966M3904K32300
12891F1540m9007j38268m5804J7106K9584K3279M1909R978J0818j7172j2992j36616
$$ y = [-107017, -144983, -149033, 21937, 148724, 317893, 396843, 191573, -139567, -163919, -78047, -78379, -48005, 79804, 189473, 206960, 161956, 63273, -70822, -75564, 78642, 90880, 2667, 70021, 153930, 216291, 224370, 350442, 259877, -4478, -91476, -141359, -171406, -202909, -190363, -38334, -21697, -40834, -99661, -171921, -247812, -244542, -149904, 59432, 102510, -31948, -70082, -100122, -5316, 106002, 4632, -265583, -319721, -101669, 1658, -96382, -243830, -250643, -197815, -208091, -28518, -82505, -185689, -261527, -52696, -108746, -130998, -177418, -135491, -52882, -146068, -252034, -255601, -328049, -314789, -280630, -214664, -170760, 61540, 12533, -125735, -171539, -154433, -124849, -101570, -59661, -49683, -38865, -56037, -69029, -205645]
12879b05645O6771Q2845O878J23132J4030j05201r2381P0364N3010M0482M1591
12868I5876N2408j19899r1222N4314j35479j40013j9862J65884J21167l541Q8507
12857F8140k7308r1327L7095m5365m5708j85824L0880N239K87691O5634j10196
12846a1049j39681j23049K89046R3949K9369j48800j76830p5155J27304K29320
12836I4424r6320K5340M8031r6542J5865Q64m908q3676j87764l2229K47676K10229
12824A40990j2228q745N9988k1867m5199j60945r2658J08132J04868K21089o7385
12813B26040k37954o1497K7900J45014P5220j34036j44406j48081o4724J55550
12803a60974J2891l6735j4596o9714J05939K56313K6136j20039k0999r6291k7942
$$ y = [-205645, -138874, -56029, -49151, 73981, 88011, -17190, -109571, -39207, 13803, 54285, 95876, 148284, 28385, -62837, -8523, -144002, -284015, -303877, -137993, -16826, -20367, 68140, 40832, -50495, -13400, -58765, -104473, -290297, -259417, -254178, 33513, 99147, -11049, -150730, -273779, 15267, 109216, 138585, -10215, -187045, -262200, -134896, 94424, -1896, 23444, 71475, -25067, -9202, -8338, -13246, -96922, -284686, -316915, -69239, 140990, 128762, 120017, 180005, 158138, 112939, -48006, -140664, -32532, 72336, 293425, 226040, -11914, -73411, -45511, 99503, 174723, 40687, -103719, -251800, -316524, -160974, -148083, -184818, -199414, -269128, -163189, 93124, 119260, -779, -21778, -118069, -146011]
12792a46011l6745J10622P4115Q792O6861j109j4399j64442J02386o563m708j00576
12780a11777J24087L3840N0178p2858k3955j41715j15264r9176J43042J28520
12770h5078P559J8242q4706Q0607J07963j1052J22200O9398j46184J05223p4054
12759A10118j48810J1749P2163P0486N9326k3092Q1406O5618m7594M3912j78400
12748A16882K903N4257k0179j59708n2464j59331J37192J43641J00538R9005O0163
12737C22899l4929l9043k7157n981n1471j13665j61427J34762N8534P8260R921
12726A70703M1359o3698N65K3787j6343k10984j34795J13372k8931m7473J01916
12715e0522J20039k3226q2586j59512n1217L371J38785o403J45705K2118j48532
$$ y = [-146011, -182756, -72134, 1981, 10773, 77634, 76525, 62126, -102316, 70, -6493, -11201, -111777, 12310, 46150, 96328, 23470, -485, -142200, -257464, -356640, -213598, -85078, -77519, -59277, -143983, -63376, 44587, 33535, 155735, 225133, 78949, 184172, 110118, -38692, -26943, 45220, 115706, 175032, 151940, 233346, 298964, 251370, 295282, 116882, 119785, 174042, 153863, -5845, -58309, -217640, -80448, 63193, 163731, 262736, 322899, 287970, 248927, 221770, 215789, 164318, 50653, -110774, 23988, 82522, 160782, 170703, 212062, 148364, 148929, 172716, 156373, -54611, -189406, -76034, -104965, -152438, -50522, 69517, 46291, -36295, -195807, -247024, -243653, -104868, -111271, 34434, 56552, -91980]
12704i1980j52375o0475J22637L2191Q8135J10674k7962r5423j44894p001n4725
12693b81198p3044J05573J63236R6924p5670j40154P477J5957Q5479J37654q8442
12682d6208Q0795N9704O8483P9906q8328n4120o5648n1427j17419k37637J08662
12671b63237Q5439J4474J52317P6149l9429r0719Q8619m506J0322J10964J23601
12660B63994p0431j12621q1674J9219q5976q5073Q5266n5726r9338O9314K60345
12649A07299K66436n8586j69696p4487j56732j6958m5646M2446J14597J06102
12639A14775N6816p7281o0284K8478R6901J5783j89571j99508L2576j25399Q3244
12628b23470j71284K5441k8987J52583K64366r3595j9008N4398K0314O053M1186
$$ y = [-91980, -244355, -304830, -182193, -150002, -61867, 48807, 20845, -74578, -219472, -226473, -281198, -354242, -248669, -85433, 11491, -64179, -204333, -196856, -180899, -95420, 42234, -46208, 34587, 94291, 162774, 242680, 154352, 100232, 34584, -16843, -134262, -371899, -263237, -177798, -163324, -11007, 65142, 25713, -65006, 23613, 19107, 29429, 140393, 263994, 193563, 80942, -732, 18487, -67489, -152562, -67296, -123022, -222360, -153046, 107299, 373735, 315149, 145453, 70966, -85766, -102724, -148370, -105924, 8673, 114775, 171591, 94310, 34026, 62504, 159405, 175188, -14383, -213891, -181315, -306714, -223470, -394754, -369313, -398300, -245717, 18649, -74946, -93954, -39556, -19242, -13189, 27997]
12617B7997J46023J35240l1421j89867j54551p1541J07046K23862p3196O5998
12607A85590J04007l037N9102j28441q6614o3897n6150J86338o9317p7685N1004
12596A00900M5806J05469J05512j80632k56278L6230K1082K7807Q2229o7438j33549
12585a12862j62174k8400P2400L645j1288M3841J89200O9750r1005j37714K086
12574a62521P2396R1929P7108J92555m394o1080P855P4659K0879k81670j37181
12563a09465J0078k8238o1001o0943r7746k951o699R6459J40023O9215L4130q4836
12551a01974J8797J00787n5148m3826k976p8083Q8321K391K0010l9653j74827
12540b66181j47612j06588m8286R0578J25713P8870n930k338M5538O1085R6084
$$ y = [27997, 174020, 309260, 277839, 87972, -66579, -138120, -31074, 192788, 119592, 185590, 289597, 286560, 345662, 217221, 130607, 66710, 10560, 196898, 127581, 49896, 100900, 146706, 252175, 357687, 177055, -79223, -42993, -21911, 5896, 88125, 20687, -112862, -275036, -303436, -231036, -227391, -238679, -194838, -5638, 64112, -26893, -164607, -162521, -90125, 1804, 78912, 271467, 267073, 205993, 213848, 288507, 309386, 27716, -109465, -99387, -127625, -188626, -249569, -347315, -350266, -356965, -260506, -120483, -51268, -17138, -101974, -83177, 17610, -37538, -81364, -84340, -162423, -74102, -71711, -51701, -91354, -266181, -413793, -520381, -568667, -478089, -352376, -273506, -279436, -281774, -236236, -175151, -79067]
12529g9067P7959L9234L4301O601N9034N1652K7508j37826M0245j49408n7097
12518h6864J55290O8453J25782r0040Q412r8251p0706J77039m9017r2501Q9318
12507A36915R9168j26842j03623q1738L8968N5544l1624p3567k25052P2272J70457
12496f9122L2575J35338O9202p4275k28782j65705J4162O85Q5299J39239k235
12485f3619k064P4979J49673K9720p0685q4519l9145n5009M1799j10157L5785
12474i3242J34352O6846j76433k02700K03136M25665j35489N3905n4921l8098
12464A83021O6182l9146o1508n8006k1950R5617L8556j96276L4515Q818j7018
12453C2805K37028R9375j39648o072k5066K7050m245l08247o6323L0872J1969
$$ y = [-79067, -1108, 38126, 72427, 79028, 138062, 189714, 217222, 79396, 119641, -29767, -86864, 68426, 136879, 262661, 172621, 181033, 82782, 12076, 189115, 140098, 47597, 136915, 236083, 109241, 5618, -76120, -37152, 18392, -13232, -86799, -311851, -239579, -69122, -36547, 98791, 167993, 93718, -135064, -300769, -286607, -285922, -200623, -61384, -63619, -65683, 9296, 158969, 188689, 118004, 33485, -5660, -60669, -18870, -129027, -93242, 41110, 107956, -68477, -271177, -68041, 357624, 222135, 276040, 221119, 183021, 249203, 210057, 148549, 90543, 68593, 164210, 202766, 6490, 41005, 49823, 32805, 269833, 369208, 229560, 223488, 198422, 225472, 221227, -87020, -153343, -122471, -110502]
12442a10502Q5316J33527P4345J80606n9135n0080r4360j20217j41968M5505M6056
12431a0907P3499J0799j20576k0419K39219J48045o1113m9922m6329n9237J8430
12420A21489N9615N396K4763o1498l6230O2567L2498L9101j3661N9569j2368q4734
12408A96507p1509o5473j31576K9836J76940q9867m4582J29132N1608k9097r9665
12397E2254J9734J82446K9446j76311j00103n3365k996n8179l7670q90O4204J9059
12385f2371O5799M4485O4474m3420n8824N3269J53565J4821o9334m6850K6400
12374A42014k1070m4839P9737J23231K8167n3269l3788J55241k1154k51845j07775
12363e350N0536Q2905L6169r5648Q4975Q014J5533p5557K939J59870J28191K3247
$$ y = [-110502, -25186, 108341, 182686, 363292, 304157, 254077, 159717, 39500, -102468, -56963, -10907, 62592, 73391, -47185, -67604, 171615, 319660, 258547, 208625, 162296, 103059, 121489, 181104, 186500, 211263, 149765, 113535, 176102, 208600, 247701, 234040, 293609, 281241, 196507, 124998, 59525, -72051, -42215, 134725, 44858, 276, 129408, 181016, 151919, 52254, 71988, 254434, 283880, 107569, 7466, -45899, -48895, -107074, -144744, -145634, -81430, -62371, 3428, 47913, 112387, 68967, 10143, 63412, 216977, 231798, 162464, 115614, 142014, 120944, 76105, 155842, 279073, 307240, 253971, 220183, 375424, 354270, 102425, -5350, 45186, 128091, 164260, 68612, 153587, 161601, 177134, 101577, 104516, 264386, 392577, 415824]
12351D15824j35258K8954M1088O8253j56569r7395N4741k1211O6823j10826k9931
12340A24493J1697K3281k2308P746N7771q3609P4128O7263M0860j63262m9022
12329H9038n6219J03446R890j91675k0194M4808L7249q6264j57636P0218R3322
12318f4017K45629J64327r2799j12441q0056j01243R2729O8124J2975p7881K2684
12307G8031m0841N0115P3441P5992k07345J7636P6770J15354K06086k5840o647
12296D12752q977m3811j14921q0927j70007N2432K1387K36584J61999O017q0758
12285C91770p9263p583p6631m0865J08151J49329J80810O4484M7855J12508J28754
12274I79319j6161j79403k9656K0519N0130O3640p6644j48256j92079O6023K29614
$$ y = [415824, 280566, 309520, 350608, 418861, 262292, 164897, 219638, 198427, 265250, 154424, 124493, 136190, 159471, 137163, 144909, 202680, 119071, 193199, 260462, 301322, 138060, 89038, 32819, 136265, 146155, -45520, -65714, -20906, 16343, -69921, -227557, -157339, -64017, 181612, 345939, 253140, 140699, 60643, -40600, 52129, 120253, 133228, 55347, 78031, 37190, 87305, 160746, 236738, 29393, 47029, 123799, 239153, 445239, 419399, 412752, 403775, 359964, 245043, 164116, -5891, 46541, 67928, 304512, 466511, 472528, 391770, 312507, 304924, 228293, 187428, 295579, 444908, 625718, 690202, 738057, 850565, 979319, 963158, 783755, 754099, 774618, 824748, 888388, 811744, 663488, 471409, 537432, 767046]
12263G67046j50315k827l3890N502O4314K2251p5880p9879O9829J65513K16214
12252I67878l4981n0495l3871n1573K5779j05997M149L4399Q946P6727L2221J36678
12240A009860J29340K91292L11685N7118O5808K53868K32714n177r9079l1998
12230B215431j40341l03422k67557l6659r8140j02187j41716R8307j00000j78638
12220I45078N8363n2004K1518O5278l3599j9017j895J8318J7019k3485N8360m6845
12208A007089q6050Q1255O4793Q6742q933k3737j19810p0864j22058L4372M6570
12197H89369Q0839O7252P682M0821j3396J44003J68038l1422p9529k83808j88737
12186H01112M2015l5831o905N4804l7940k01430j29457p6085M1046J61217o4731
$$ y = [767046, 616731, 613904, 580014, 585516, 649830, 672081, 596201, 516322, 586151, 751664, 967878, 932897, 882402, 848531, 796958, 822737, 716740, 720889, 755288, 764234, 840961, 873182, 1009860, 1139200, 1430492, 1742177, 1799295, 1865103, 2118971, 2351685, 2346508, 2247429, 2215431, 2075090, 1771668, 1504111, 1467452, 1369312, 1267125, 1125409, 1223716, 1123716, 945078, 1003441, 951437, 972955, 1038233, 1004634, 985617, 983722, 1002040, 1019059, 995574, 1053934, 1007089, 921039, 1002294, 1067087, 1153829, 1144896, 1121159, 1001349, 930485, 808427, 842799, 889369, 970208, 1037460, 1045142, 1085963, 1072567, 1216570, 1384608, 1353186, 1273657, 989849, 801112, 843127, 807296, 800391, 855195, 817255, 615825, 486368, 410283, 451329, 612546, 547815]
12175E47815j84570j36261n3296o5308K8688K59201J02178l5747P3432m0735L2791
12164E28188J09371r8454l3577L143j01348L736q6494p1008N97K7976K73609J46301
12152G02040j80712k00015N3408J9838m3727K1203J32244J01367o1360N8504L8749
12141F41539L289r1045j03112k02772L6170q3404O1370J36018O1903k7500L6205
12130D68661p8602q5311q0066L9571n1193j31676r4616K2803N6721P8001J06495
12119B50788R2470o7715j2768n8609r6016N560J07520J16675O3876J3124l8249
12108C76656j44683k5456P8589P8457j61476N8726J29606j08337r3334J1446J17854
12097C18048n9215N4480J75299J30449K3643k7092k25047j54987k0774k4612O8810
$$ y = [547815, 363245, 226984, 173688, 108380, 137068, 396269, 498447, 462700, 536132, 495397, 528188, 637559, 539105, 505528, 508671, 407323, 411059, 324565, 253557, 254154, 282130, 555739, 702040, 521328, 321313, 374721, 394559, 350832, 372035, 504279, 605646, 544286, 602790, 641539, 644828, 553783, 450671, 247899, 284069, 200665, 262035, 398053, 459956, 432456, 468661, 390059, 304748, 224682, 264253, 213060, 81384, -13232, 9571, 66292, 144293, 250788, 343258, 275543, 262775, 204166, 108150, 113710, 221230, 337905, 401781, 414905, 376656, 231973, 206517, 285106, 363563, 202087, 260813, 390419, 282082, 188748, 200194, 318048, 258833, 313313, 488612, 619061, 642704, 615612, 390565, 235578, 214804, 190192, 259002]
12086B59002J09286J33789J54088L0658r1365n6758N8967j13201k47699Q320J10033
12075C55120p4678M6218N4129r2092J38954J48257l2972M6171J1643M947J54099
12064G59796j0443p3951j02324k15692L9832l0337p1723r9288M0469J79809K16241
12053F32389J58089j96653r2835R2241Q6196j14467O8245O4215m4832Q0062P598
12042G40248J70970P6380n0535l4517r8091r5671p4792R774P0055j0642O5776
12031G68955k4348o6629m0607R2998P4386O0425R2485m8525p3570k706Q4285k9254
12019H87895k19904k78944L7626p9083K174J35474l5416J5154P5492K04051K17295
12008I61814L2285j09343j18419k25462J30983K06127q3543k01885J2036L152
$$ y = [259002, 368288, 502077, 656165, 686823, 595458, 538700, 597667, 484466, 236767, 245087, 355120, 280442, 326660, 380789, 288697, 427651, 575908, 542936, 589107, 600750, 605697, 759796, 749353, 675402, 573078, 357386, 397218, 366881, 295158, 195870, 236339, 416148, 632389, 790478, 593825, 500990, 593231, 679427, 564960, 633205, 697420, 652588, 732650, 740248, 911218, 987598, 937063, 902546, 804455, 708784, 633992, 643766, 713821, 703179, 768955, 744607, 677978, 637371, 730369, 804755, 865180, 957665, 909140, 835570, 832864, 917149, 887895, 667991, 389047, 426673, 347590, 349764, 485238, 449822, 464976, 540468, 744519, 961814, 994099, 884756, 766337, 540875, 671858, 877985, 794442, 592557, 604593, 607745]
11998F07745j55132p253J09610K09478J80051l6337j19937j01054m0704m7214
11988E99253M1419J14428J65321J8115k1993p7374M7949j26402j25834J71566
11978H06448L16244k7344k28501j52569n2232L9443J56681K1988N4027K189M1751
11967I78125O0726L2930J09456P8241M6971L5520j41869j93705j69651J85872
11957A022616J14556M0375n7842K38844J17038k48085k3009M0787J43969J47458
11947A536707j14753j02023J2142Q224M4681L30392M8868L970R704Q55K3880K5001
11935A827648J04069J62032O5646P5681J06039R609M8586o269J29183J00110K02445
11924B824779O1836J10271o2176p7808L719K17548K05973L77155M20300K05021
$$ y = [607745, 452613, 445360, 554970, 764448, 944499, 908162, 788225, 687171, 646467, 599253, 640672, 755100, 920421, 938536, 916543, 839169, 887118, 760716, 634882, 806448, 1122692, 1095348, 866847, 714278, 662046, 701489, 858170, 880158, 934185, 936374, 978125, 1038851, 1071781, 1181237, 1259478, 1306449, 1341969, 1200100, 1006395, 836744, 1022616, 1137172, 1177547, 1119705, 1358549, 1475587, 1227502, 1204493, 1245280, 1389249, 1536707, 1421954, 1319931, 1332073, 1340297, 1384978, 1715370, 1764238, 1768208, 1777912, 1778767, 1802647, 1827648, 1931717, 2093749, 2159395, 2235076, 2341115, 2350724, 2399310, 2393041, 2522224, 2622334, 2824779, 2886615, 2996886, 2934710, 2856902, 2860621, 3078169, 3284142, 3661297, 4081597, 4286618]
11914D286618K39891M2424N9087J48170J83624N5913J87303J17953Q8191j52066
11904E257108p2939r697J1153j0587o1285J09292N0299K10626K43128J95490J32297
11893F054885J11664L1703K09357J95972R4320j38119r770r7172P645K1629Q2182
11882F564296J43464K78305J26208K04855M46857L87849K80882M37473N81247
11873I451436P49962O00600N65511N04312N27899Q25176P96279P96371P00023
11864A5517569P91771P69250J134736J180719J241107J320911J194660J152289
11856B4303012Q71747O77232N80928P50701R99262R52366J414366J758672K342212
11847C4650498L405807M218638N339503P179433R801705J2590014J5638206J8320912
$$ y = [4286618, 4526509, 4568933, 4628020, 4776190, 4959814, 5015727, 5203030, 5320983, 5409174, 5257108, 5184169, 5174472, 5185625, 5175038, 5113753, 5223045, 5273344, 5483970, 5727098, 5922588, 6054885, 6166549, 6198252, 6407609, 6603581, 6697901, 6559782, 6550012, 6452840, 6460485, 6482114, 6564296, 6707760, 6986065, 7112273, 7317128, 7763985, 8151834, 8432716, 8870189, 9451436, 10201398, 10801998, 11367509, 11871821, 12399720, 13224896, 14021175, 14817546, 15517569, 16309340, 17078590, 18213326, 19394045, 20635152, 21956063, 23150723, 24303012, 25174759, 25851991, 26432919, 27183620, 28182882, 29135248, 30549614, 32308286, 34650498, 38056305, 42274943, 47614446, 54793879, 64595584, 77185598, 92823804, 111144716]
11839A11144716J9429618J7583115J1865808L261007n449628j1858475j4495197
11832A31480964j3350135j0055365o487206l673283j587231J25105J720474L244560
11824A01417883M003740M458567M253877L561494K167597J356546R94398J583027
11816A23797129K307461L213698M191369M905797N093160M466123L252668J591631
11808A52819036k4740l86254O05603K467191N193812Q574183J2450456J7516977
11800A99216264K3699139L1727742M0372128M6577224M5660731L3804761J2032939
11793D33090928j3301078l3843831m4045479m3986236l7679899k9153858k1168518
11786B09912029j4553601r477795n683350k438065m11747M18514k47151k033582
$$ y = [111144716, 130574334, 148157449, 160023257, 163284264, 157834636, 145976161, 131480964, 118130829, 108075464, 101588258, 97914975, 96327744, 96452849, 98173323, 101417883, 105421623, 109880190, 114134067, 117695561, 119863158, 121219704, 122214102, 123797129, 126104590, 129318288, 133509657, 138415454, 143508614, 147974737, 151227405, 152819036, 152794296, 152408042, 153013645, 155480836, 160674648, 169248831, 181699287, 199216264, 222915403, 254643145, 295015273, 341592497, 387253228, 421057989, 433090928, 419789850, 385946019, 341900540, 297914304, 260234405, 231080547, 209912029, 195358428, 185880633, 180197283, 177759218, 177347471, 177765985, 177518834, 175485252]
11778A75485252l996321n469668o002662n474374m516899k996629j658672q19563
11770A44550464o81263j253095k187314l446067m110806m038676l208000j876108
11762A23749135m78228J022978K608613M781608P293260J0207012J3409089J5356998
11754A77950465J4040811Q448085m46398j0213914j7471520k1016797k1219896
11747A30070836j8664629j5121163j1667787q689300o313644m597116l813026
11740F1204171k992581k547983k241793j686614j269998j360740j302692j359000
11732D6442770j540270j532142j568827j779863j872908j686503j539947j502144
11724C3420166j161767j138667j077243j197109j160204j066692j010068j102615
$$ y = [175485252, 171488931, 166019263, 160016601, 154542227, 150025328, 147028699, 145370027, 144550464, 143869201, 142616106, 140428792, 136982725, 132871919, 128833243, 125625243, 123749135, 123270907, 124293885, 126902498, 131684106, 138977366, 149184378, 162593467, 177950465, 191991276, 200439361, 199992963, 189779049, 172307529, 151290732, 130070836, 111406207, 96285044, 84617257, 75927957, 69614313, 65017197, 61204171, 58211590, 55663607, 53421814, 51735200, 50465202, 49104462, 47801770, 46442770, 44902500, 43370358, 41801531, 40021668, 38148760, 36462257, 34922310, 33420166, 32258399, 31119732, 30042489, 28845380, 27685176, 26618484, 25608416, 24505801]
11716B4505801j060708r66402j026454j018564j064268p50759o59035q07260r71984
11707A6180367o28064l77879l55824l75862m76729l73939k83405q2453k66995
11698A2959217l05166m18154m38363l47207l48272l36108l95535l49875l28015
11689I692522l2697L8586j91875k99326j56738k13606j77027r2274l2685J0948
11679H545828k04071l43264l33936m32923m03665k78019k14510l63614k69766
11670E702060k58159k00391k02046k67817j47924j93774j14054j85194j59627
11661C973074n2332j37041K9036L1525j62926k36857p2084j88154k99024j20642
11651B764575K3533J0098j20451o4333j63186J35562J55873r8516j04636Q4331
$$ y = [24505801, 23445093, 22478691, 21452237, 20433673, 19369405, 18618646, 17959611, 17152351, 16180367, 15552303, 15174424, 14818600, 14442738, 13966009, 13592070, 13308665, 13226212, 12959217, 12654051, 12235897, 11797534, 11450327, 11102055, 10765947, 10370412, 10020537, 9692522, 9659825, 9698411, 9506536, 9207210, 9050472, 8836866, 8659839, 8567565, 8534880, 8545828, 8341757, 7998493, 7664557, 7231634, 6827969, 6549950, 6335440, 5971826, 5702060, 5443901, 5243510, 5041464, 4773647, 4625723, 4431949, 4317895, 4132701, 3973074, 3920742, 3783701, 3812737, 3844262, 3681336, 3444479, 3372395, 3184241, 2885217, 2764575, 2788108, 2798206, 2677755, 2613422, 2450236, 2585798, 2741671, 2643155, 2538519, 2622850]
11641B622850N7793j02958l6678k74652l0815N5586j51923j34786l5069j53251
11631A816097p0281K51368P5114M8576k89451l2869J61107k1229Q6413M8048P0157
11620B143050n0832j70693J46136N6043j50967j08975l3700J22185J658j35878
11610A818027j18361J45098l9413o7512p8919N7856J4361P928O69j19069k4047
11599A596618K88R3627J72786L5189j18688n1462p5990m5296l9817r8407J5229
11588A484077J7712M5086J4212l2761j20017r5666r0498M0948M5985P4328L4906
11577A418312p1961r2850m8954j9478P7363q469K4082n0022m6801M1862q0954
11566A142130k3457P8048J23787R2552K75j65521j36480r8456l9599J03582k9069
$$ y = [2622850, 2680643, 2577685, 2541007, 2266355, 2235540, 2291126, 2139203, 2004417, 1969348, 1816097, 1745816, 1997184, 2072298, 2120874, 1831423, 1798554, 1959661, 1938432, 2024845, 2072893, 2143050, 2092218, 1921525, 2067661, 2123704, 1972737, 1863762, 1830062, 1952247, 1953905, 1818027, 1699666, 1844764, 1805351, 1737839, 1658920, 1716776, 1731137, 1739065, 1739734, 1620665, 1596618, 1596906, 1690533, 1863319, 1898508, 1779820, 1728358, 1652368, 1607072, 1567255, 1468848, 1484077, 1501789, 1546875, 1561087, 1528326, 1408309, 1312643, 1222145, 1263093, 1309078, 1383406, 1418312, 1346351, 1253501, 1204547, 1185069, 1262432, 1253963, 1278045, 1228023, 1181222, 1223084, 1142130, 1118673, 1196721, 1320508, 1413060, 1413335, 1247814, 1111334, 1012878, 973279, 1076861, 1047792]
11555A047792j1350q7320j26581J04893J47035J1303j12839L7563m6989R2713
11545A056220J7319j19601j9362P7591P666j22589j74752L603k5844j9830j14229
11534E66192m9504J19617J28272q2791p6172J1874L7425J37769m3075o2642J2040
11523F99005N2526J18654p2445j09699q7911K0944k7909j69089R7597n8358J4138
11512D77453J40138q5041O5483K60491K6709k72484j8180R0430o0125m0626n9953
11501E24295L1447k7700k2286j39289j03456R1725K70748R1793j83748k8620P2441
11490E77350L0031j15672j19911J33161J3541L7925K27637J2901j88160j58595
11480D50208j77335L7401P3042L1421P5718k9020J69458O4947k5098P8307P8227
$$ y = [1047792, 1036442, 949122, 822541, 927434, 1074469, 1085772, 972933, 1010496, 963507, 1056220, 1073539, 953938, 934576, 1012167, 1019833, 897244, 722492, 726095, 700251, 680421, 566192, 516688, 636305, 764577, 681786, 605614, 617488, 654913, 792682, 749607, 686965, 699005, 751531, 870185, 797740, 688041, 600130, 621074, 593165, 424076, 521673, 463315, 477453, 617591, 532550, 598033, 858524, 885233, 612749, 594569, 684999, 624874, 584248, 524295, 555742, 528042, 505756, 366467, 263011, 354736, 625484, 717277, 533529, 504909, 577350, 607381, 491709, 371798, 504959, 518500, 556425, 784062, 796963, 608803, 450208, 272873, 310274, 383316, 414737, 490455, 461435, 630893, 695840, 670742, 749049, 827276]
11469H27276m1192k10164p7983L7065l0554j65084M8995K50465N5436n2491p1689
11458E70080J20661j72993r5415J29542J8143N8890J3720J0647j3834j29544j48267
11447C61630L8369r361M4330k8667j3607n8233Q0682P7248J1027l5716l5935M6535
11435D78302L0989n0440n4660q9645k0427Q365P0955N3751l8950j90439o4821
11424A32980O8107J12462J284M8996P604p3528P233J97040k5008k25335l3060
11413B18775J2312q638P7425l442J65356j50851J0164k9893p5408M6855K23190
11402D85845O5860K7870O6551j8484p6288K0405K35408l6865m3142P683j0403
11391G24440J37080J32548q056j1497o5002N5906n0178r1562r4572J7600J4193
$$ y = [827276, 786084, 575920, 497937, 535002, 504448, 339364, 388359, 638824, 694260, 641769, 570080, 690741, 517748, 422333, 551875, 570018, 628908, 642628, 653275, 639441, 509897, 361630, 399999, 390638, 434968, 406301, 392694, 334461, 415143, 492391, 503418, 467702, 431767, 478302, 509291, 458851, 404191, 314546, 294119, 302484, 373439, 427190, 388240, 197801, 132980, 201087, 313549, 314833, 363829, 371433, 297905, 305138, 502178, 477170, 251835, 218775, 231087, 222449, 299874, 296432, 461788, 310937, 321101, 291208, 215800, 262655, 485845, 551705, 579575, 646126, 627642, 551354, 571759, 807167, 770302, 727160, 734843, 724440, 861520, 994068, 986012, 974515, 909513, 965419, 915241, 823679, 729107, 746707, 760900]
11380G60900j24867m8005M437j21764K2511N5234j9760o5932J59037M454m044
11369F22201Q1411L09176J05681L8444M9313j9n5187J9813j53621o9898O657O2193
11357A016164Q4609J21020K04371K44523K07336K41008K97860K83630k2265N6589
11347B734845M0199j80418k88212l01746k19704j43065j53208j42613j40322j72322
11337A033434J2130J27138J35561K0801l2272k782J24286Q9933o5982n7502j20042
11326A264703K0551j30678j30660M8538J52698j13289r4892j39970M9q2821j24063
11315F70166M6299K79025R9938J7627J31319m4027K3676j922k14367j3080m0753
11304I53901L7977n9914l19969j33059j74169L3072k6504Q6141J63192J65245
$$ y = [760900, 636033, 588028, 592465, 470701, 493212, 548446, 528686, 462754, 621791, 626245, 622201, 703612, 1012788, 1118469, 1156913, 1206226, 1206207, 1151020, 1170833, 1017212, 947314, 953971, 1016164, 1100773, 1221793, 1426164, 1670687, 1878023, 2119031, 2416891, 2700521, 2678256, 2734845, 2775044, 2594626, 2306414, 2004668, 1784964, 1641899, 1488691, 1346078, 1205756, 1033434, 1045564, 1172702, 1308263, 1329064, 1296792, 1294010, 1418296, 1508229, 1442247, 1384745, 1264703, 1285254, 1154576, 1023916, 1072454, 1225152, 1111863, 1016971, 877001, 877050, 794229, 670166, 716465, 995490, 1095428, 1113055, 1244374, 1200347, 1224023, 1222101, 1007734, 994654, 953901, 991878, 931964, 611995, 478936, 304767, 337839, 311335, 397476, 560668, 725913]
11294G25913O8775j58914j65011l7895o766o3501m1339R7853j8579p988j44701
11283B47847M0572m4946q959N8499q6332m6450P4742Q1819M5652l9826n193j06166
11271B11259p8047j9093j9532K8689j93728J22593K8953J00661R0927j36032J5985
11260A52635j9885K1158o9732O1133L017K73941P2563k2169j92898O0241K6425
11249C66429l3745n1538L9507R6179K4320j94514k24762j13863J03161R7016L2740
11238A40930j44134j01436j08532K09673R2866p08J73657J03301j87962j36007
11228D1648o3913M6947O1995m4170k227r3388P4358O7977K00131p839j81064K4499
11216A24954J08348k3671m7325q591j7710n0683n1101L4111m716q41K1633P821
$$ y = [725913, 794688, 635774, 470763, 432868, 426102, 362601, 321262, 419115, 400536, 392548, 247847, 288419, 243473, 234514, 293013, 206681, 160231, 234973, 316792, 362444, 322618, 317425, 211259, 133212, 114119, 94587, 123276, -70452, 52141, 81094, 181755, 272682, 136650, 152635, 132750, 153908, 84176, 145309, 148326, 422267, 494830, 472661, 279763, 340004, 366429, 332684, 281146, 320653, 416832, 441152, 246638, 21876, -91987, 11174, 108190, 140930, -3204, -104640, -213172, -3499, 89367, 88659, 262316, 365617, 177655, 41648, -22265, 24682, 86677, 42507, 40280, -53108, 21250, 89227, 289358, 281519, 100455, 124954, 233302, 209631, 162306, 153715, 136005, 85322, 34221, 68332, 63616, 62775, 84408, 92229]
11204I2229p9044J34444J06363q7483j14150K05152Q2365j85797j08765J74275
11194B19589J63315n1155o645m9815q9842J50301P8206r4332l6910K5086L7105
11183C44903M2125k6446j28528j76140j62229P6565l5277m7035j22985M8391L4622
11172a52034J35803J07273m3139L8427P3567k9965j20248o6694J17196j26387
11162f6201k24261J66987N8159r6986L6571O0877J41932J00958M3332p7366O4282
11151B08284K9637j62783j49890J4475J40733L310l7245q4698J8827J26036J2481
11140A19167q2866o5362j21617j16128J3729Q9507J16129Q9472J06867M821j05064
11129D8655P0515p6820j13002p5220l6662j3576m9091k791P9999j29716L2086
$$ y = [92229, 13185, 147629, 253992, 166509, 52359, 257511, 339876, 154079, 45314, 219589, 382904, 331749, 325104, 275289, 185447, 335748, 413954, 319622, 282712, 307798, 344903, 387028, 360582, 232054, 55914, -106315, -29750, -65027, -112062, -235047, -186656, -152034, -16231, 91042, 47903, 86330, 159897, 129932, 9684, -57010, 60186, -66201, -290462, -123475, -65316, -162302, -125731, -64854, 77078, 178036, 221368, 144002, 208284, 237921, 75138, -74752, -60277, 80456, 83766, 46521, -38177, -19350, 106686, 119167, 36301, -29061, -150678, -266806, -253077, -163570, -47441, 42031, 148898, 153719, 48655, 119170, 42350, -70652, -145872, -182534, -196110, -245201, -247992, -167993, -297709, -265623]
11118b65623J93024J65052M3643K1510n3431q4567j11254J64344R3548n7071r0044
11107A9131J01735N9585K1978K5146o6837q7014j28766o576K1367K8787j46560
11096a58024j6061J41510J62301Q2249j15169l4067j09351l0480J337M1431l6244
11085g0568K3387L6457O3234M8777j62406r0145L0151l0530P9560J90781L639
11074A22337K2992j22952j2379R9197k1750Q4785M932k83080j8798J44683l2325
11063a2358q2624K5749M0375R2992m3016j48601m1717L6412M6152m1991J81466
11052E2839J98008q2196L767p9376k3716j0121L0088n7687j9207J04785j06943
11041A0241m6405k0483j69286p8834J84680K23920L8115Q563j10985j82214N5754
$$ y = [-265623, -72599, 92453, 136096, 157606, 104175, 19608, -91646, 72698, 166246, 109175, 19131, 120866, 180451, 202429, 227575, 160738, 73724, -55042, -61618, -40251, -11464, -158024, -174085, -32575, 129726, 211975, 96806, 62739, -46612, -77092, -75755, -34324, -70568, -47181, -10724, 52510, 101287, -61119, -151264, -121113, -151643, -72083, 118698, 122337, 145329, 22377, 9998, 109195, 87445, 172230, 177162, -105918, -124716, 19967, -12358, -94982, -69233, -28858, 64134, 21118, -127483, -169200, -132788, -86636, -128627, 52839, 250847, 168651, 172418, 93042, 69326, 59205, 89293, 31606, 12399, 117184, 10241, -36164, -56647, -225933, -304767, -120087, 103833, 141948, 150511, 39526, -142688, -86934]
11030h6934J40206L8796J3446j33079n4917n3309K21374L9096m6810M277J29094
11019B11240J21985j2295j00563M9208j43666r3987O3017P9046p3146l8248j35252
11008g2661J77282P0192N0445k04677N4250l6305j83741J7618M2046r818m1171
10997a36540J97737j91617k20626j49638O7624K76887K25496Q540k57415J07989
10987g1563Q687j00284j102j50843l7451K18419K49113J09591j0300o0247k6951
10976A27069m5691k0881r052o493J15507N4291j69822M3663O3907r269o3056k2923
10964E7250J05595r075R141o8632J8162k9616p6084J9510k12125j6939j9155j42401
10952c64369L3320J55175K08031J05870j48827m0617j9825M350J59263N6924n2541
$$ y = [-86934, 53272, 92068, 105514, -27565, -82482, -135791, 85583, 124679, 77869, 82146, 211240, 333225, 320930, 220367, 269575, 125909, 31922, 94939, 173985, 100839, 62591, -72661, 104621, 174813, 225258, 20581, 74831, 38526, -145215, -127597, -85551, -95369, -136540, 61197, -130420, -351046, -500684, -433060, -156173, 69323, 77863, -179552, -71563, -62876, -163160, -164262, -315105, -352556, -134137, 114976, 224567, 214267, 154020, 127069, 81378, 60497, 51445, 44952, 160459, 214750, 44928, 88591, 152498, 143229, 80173, 57250, 162845, 153770, 162911, 94279, 112441, 82825, 6741, 26251, -185874, -202813, -221968, -364369, -331049, -175874, 32157, 138027, -10800, -51417, -71242, -66892, 92371, 149295, 96754]
10941I6754M4754k25849j35410p888J36613K08946J93323L9172j0999p2529r0661
10930A76226Q5697P2459r3914j57536Q4531J36847j60009l6665J19229o361k6075
10919A94429j51556l9195N331o0601q2396M6423o5426J32060K18721j0974k44878
10908e8062m9665J01533k8492J05293O590j79201p3342N4093K23511o465J1595
10897A07388J8865q5680m4944m5461j09416L3611J13610r3997j60745N5061K29182
10886A7474J46776N9374j21824Q5459k8963j31855O0495q7825M4926K55155M5849
10875C45041k00239l8193N3963J22055J39440k21518k71705j7601N0252n801P0383
10864B6077l7880p879M6920P3132J4647o6610M5762J27831k241j11812j16628
$$ y = [96754, 141508, -84341, -219751, -227639, -91026, 117920, 311243, 350415, 339416, 266887, 176226, 261923, 334382, 240468, 82932, 167463, 304310, 144301, 107636, 226865, 220504, 194429, 42873, 3678, 9009, -51592, -133988, -87565, -152991, -20931, 197790, 186816, -58062, -107727, -6194, -34686, 70607, 77197, -102004, -175346, -121253, 102258, 95793, 107388, 126253, 40573, -4371, -49832, -159248, -125637, -12027, -106024, -266769, -211708, 17474, 164250, 223624, 101800, 187259, 158296, 26441, 86936, -889, 44037, 299192, 345041, 144802, 106609, 160572, 282627, 422067, 200549, -71156, -88757, -38505, -44306, 26077, -11803, -19682, 27238, 100370, 115017, 48407, 94169, 222000, 219759, 107947, -8681]
10853h681n4957Q1321R2898j30464P8029J93245j9729j32194j07777k07436K9971
10842a85774J26254J65473k7703r5190j15512r7366R7651N6657Q1454J39349j4121
10831A31172l4942q8847Q5350J621J01611n5923n7399j04028k05740L1114K1122
10820a74889P3055J62477J96006K063j59579k6976N6755p1726l6306p026O1327
10809G5181l4564j30449m6182N6144J23040O4360L8882n9162q9946k42054J0046
10798b34704Q3192J18012j3079m884j44278Q0512J20213M1732L5716J98185P3507
10787C54124r8661k22019n8331N6816N649j21759J28013J11488k9479N0159k5680
10776A50320m3518k0161L8646J22565K21628J7571j04083J14916J23513O4052
$$ y = [-8681, -63638, 17683, 110581, -19883, 58146, 251391, 231662, 99468, -8309, -215745, -185774, -59520, 105953, 78250, -16940, -132452, -229818, -132167, -75510, 5944, 145293, 131172, 96230, 7383, 92733, 94354, 195965, 140042, 82643, -21385, -227125, -196011, -174889, -101834, 60643, 256649, 258712, 99133, 72157, 128912, 57186, 20880, 13854, 75181, 40617, -89832, -136014, -79870, 43170, 107530, 146412, 87250, -2696, -244750, -234704, -151512, -33500, -46579, -51463, -195741, -115229, 4984, 46716, 82432, 280617, 354124, 255463, 33444, -24887, 31929, 37578, -84181, 43832, 155320, 125841, 176000, 150320, 106802, 86641, 125287, 247852, 469480, 487051, 382968, 497884, 621397, 685449]
10766F85449j20571j26873J97562L75560J87729J47040K42665N22677N96327J140567
10756C848132J244591J896321J826009l0493j525710j779960j524416j051210
10748B903264q99100o30669j29358n6582j93016j41049j34367j05780n1424k3996
10738E37923o1439l0283M0215K9262k51238O719M7999J050m2434m8224J9290K7759
10726B76599R3084P2282N390r3567o5124Q7665R9462J06794J0648n8623n2229
10715D82381m6172j33352q4525N9535r124j21984J65525J0881j62593m671n6651
10704I9250K3468J57923O9405m44k62955j13014q1594j26422J84990N428j31040
10693a75005K4552Q440j27486l269O9639P3201P1283j9683m1911q737J8074N0852
$$ y = [685449, 564878, 438005, 635567, 1011127, 1198856, 1345896, 1588561, 2111238, 2707565, 3848132, 5092723, 6989044, 8815053, 8784560, 7258850, 5478890, 3954474, 2903264, 2004164, 1373495, 1244137, 1187555, 994539, 853490, 719123, 613343, 561919, 537923, 476484, 446201, 486416, 515678, 264440, 271159, 319158, 320208, 277774, 229550, 248840, 276599, 369683, 441965, 447355, 353788, 288664, 376329, 475791, 582585, 593233, 534610, 482381, 436209, 302857, 218332, 277867, 268743, 146759, 312284, 323165, 160572, 155901, 99250, 122718, 280641, 350046, 349602, 86647, -26367, -107961, -234383, -49393, -43965, -175005, -150453, -142013, -269499, -272768, -203129, -129928, -58645, -78328, -120239, -128976, -110902, -60050]
10681f0050J7221J1204r8503n4663J1409K42344n4437M741P3943p030j91246q8453
10669a93520j2773J32299o1035n0549J69413O2967j03883N8927Q1390J11301J91161
10658C85698N8385k64071k16691o2872l3001N4719o3458o837J42203J04999R943
10647A09017J19815N2426j36971j03887q079q9885P5945J00313N9433j7441j32093
10636B8593j41599R899M2870J5961j16912j98549j70405N0834R6121N0892J147
10625c31148o1360J07500J29612R0182j28118R6018J55199J2203o8401l678K2481
10614B0490j4715J30767J53475p1996N8663k5976j32799o156j21031j19580q3087
10603b11945M0324J34717L0552j6201P1375j54961J46220J49625m466j59622j41400
$$ y = [-60050, -42829, -31625, -130128, -184791, -173382, 68962, 14525, 19266, 93209, 86179, -105067, -193520, -206293, -73994, -135029, -185578, -16165, 46802, -57081, 1846, 83236, 194537, 385698, 444083, 180012, -36679, -99551, -132552, -77833, -141291, -148128, -5925, 99074, 109017, 228832, 281258, 144287, 40400, 32321, -57564, 18381, 118694, 178127, 160686, 28593, -113006, -103107, -60237, -44276, -161188, -359737, -530142, -479308, -383187, -332295, -331148, -392508, -285008, -155396, -65214, -193332, -97314, 57885, 70088, 1687, -1991, 20490, 5775, 136542, 290017, 218021, 276684, 250708, 117909, 111753, -9278, -128858, -211945, -171621, -36904, -6352, -22553, 48822, -106139, 40081, 189706, 185240, 25618, -115782]
10592a15782K8908J4562J00384p5181R4682L7711N5050j5160o5983N9053N8977
10581A77221j11008j58151N8848q8342q0702j15275L2358L4285j088J2038R4845
10570a44971j8438J15198R5909L2916J2078M1310m432l0357j70345j03045k8703
10559b02880J6230J69087N0551l8880q7018j5470o5517p6688O2568l3929l8557
10548b60503J14497Q0332l3221k2140O3190J5020J68849j7829k64123l6545J06045
10537h6428j41477K0553J61945m5163j79969R4734j3594K3645n1174m0914J19655
10526a38187J64251q2448k42913N7457K1656m0816J5041N0070J13758J19009k9862
10515G016o0838k3183p7918n2180P5444K20931K7869J20880L012k41197k36900
$$ y = [-115782, -86874, -72312, 28072, -47109, 47573, 85284, 140334, 125174, 59191, 118244, 177221, 66213, -91938, -33090, -121432, -202134, -317409, -285051, -250766, -251854, -239816, -144971, -163409, -48211, 47698, 80614, 92692, 134002, 129570, 99213, -71132, -174177, -202880, -186650, -17563, 32988, -5892, -92910, -108380, -173897, -250585, -188017, -221946, -260503, -146006, -65674, -98895, -121035, -57845, -42825, 126024, 108195, -155928, -192473, -86428, -227905, -207352, -45407, -90570, -270539, -175805, -189399, -165754, -216928, -257842, -138187, 26064, -56384, -299297, -241840, -220184, -261000, -245959, -195889, -82131, 36878, 7016, -53822, -77005, -154923, -207103, -131659, 89272, 117141, 238021, 241033, -164, -237064]
10504b37064l2430R3992K3884Q8562n7788r6007o3047K5836o56J40048J8868J01605
10492E803j02013J7183N3242L4137o0482m9677N1285R2482J1243r8229m0014q8017
10480a73057R520K878l235j7805l9947K22122J12573m0832J09945J41736L901
10469C27799n7568p2210p7128P314p3786j34307j4058p6849J44262J24679L7484
10458A35632R0951l5923r8640P1188K27359K1990l1262j28957q3755J6755O5320
10447B50658N1935m2117j04749l738l7255j39548P2732M1634j1097k4270o6752
10436a2567K837q6330L1669K6577J9605O4096J31057l1175j58462q4462K7247
10425f9908M1074N8116K9514L2053m5369R5909O5315J5424k11200K5378O9051
$$ y = [-237064, -269494, -175502, -151618, -63056, -120844, -216851, -279898, -254062, -254718, -114670, -95802, 5803, -96210, -79027, -25785, 8352, -52130, -101807, -50522, 41960, 53203, -45026, -85040, -173057, -163537, -160659, -163894, -181699, -221646, 476, 113049, 72217, 182162, 323898, 327799, 270231, 198021, 120893, 128207, 54421, -79886, -93944, -170793, -26531, 98148, 135632, 226583, 190660, 92020, 163208, 390567, 412557, 381295, 252338, 168583, 185338, 250658, 302593, 260476, 155727, 151989, 114734, -24814, 47918, 89552, 78455, 54185, -12567, -9730, -96060, -64391, -37814, -18209, 45887, 176944, 145769, -12693, -97155, -69908, -28834, 29282, 58796, 90849, 45480, 141389, 206704, 222128, 10928, 36306, 105357]
10414A05357j47309j2870M498O8051l3566J27160j28424r4401r22j4657J48790
10403B1707L3872l9400j4604N869J15452R2738L4044Q674j09618q6729p5908J26925
10391A13022J67726l9091j02028j6671j74437m4576p35p2900J14084R8317j09093
10380f6382M596P1308q2416o9227L906R6828K37770r808j46906p5464J27123Q725
10368A00053q4000j07655M7061O5093o2302j9137n1470K5669J48469j1441l9745
10357A0595J2376R0667j2002j22118l8610K39643J0334j03148k6138J74037j0115
10346B25521j22598J98542l2239j88918J13594J25001j6710P9370k3469m9805
10336C08289q92J39180P7403k4071j77780l3437J4269k08038j79980j63986K26002
$$ y = [105357, -41952, -54822, -50324, 17727, -15839, 111321, -17103, -111504, -112426, -127083, 21707, 55579, 16179, 1575, 7444, 122896, 215634, 249678, 258352, 148734, 62005, -13903, 113022, 280748, 241657, 139629, 122958, -51479, -96055, -96790, -169690, -55606, 42711, -66382, -61786, 9522, -72894, -142121, -138215, -41387, 196383, 186575, 39669, -35795, 91328, 100053, 16053, -91602, -44541, 20552, -41750, -60887, -112357, -86688, 61781, 50340, 10595, 22971, 113638, 101636, -20482, -59092, 180551, 190885, 87737, 61599, 235636, 225521, 102923, 301465, 269226, 80308, 193902, 318903, 302193, 381563, 358094, 308289, 307397, 446577, 523980, 499909, 322129, 288692, 302961, 94923, -85057, -249043, -23041]
10325b3041J02346k7542L9815O5728j86840m9520l7470l1784l9803K0618Q0606
10314h6887j0931j28804J51075Q1310O3940j12022r0997p894l1673J54945Q583
10303i355J6915Q569K12886K36865L15054Q5489j1303K060M9553J48730K32645
10292A288108R4364K6144p2315J07189L7296l15005k92556k50233j98961J274
10282D25305J77281j22580j25226M6693K4414j51407q0238n6697O6147O6959p6238
10271A94413k45583O7856O1110o333J78057L8562K7325J21902K2879n6952Q3326
10260D86562J27257K6124J15660m6845j66349J49833K06975K06099r5904J71244
10250A180656K11548K27685K14053J17971Q1702q8723j18880l43035k96650q1853
$$ y = [-23041, 79305, 51763, 91578, 157306, -29534, -79054, -116524, -148308, -188111, -167493, -86887, -97818, -226622, -75547, 5763, 69703, -42319, -133316, -141210, -172883, -17938, -9355, 7560, 16129, 229015, 465880, 780934, 866423, 855120, 857180, 906733, 1055463, 1288108, 1382472, 1408616, 1336301, 1443490, 1480786, 1165781, 873225, 622992, 424031, 425305, 602586, 480006, 354780, 401473, 425887, 274480, 194242, 137545, 203692, 270651, 194413, -51170, 16686, 77796, 71463, 249520, 288082, 315407, 437309, 460188, 403236, 486562, 613819, 639943, 755603, 708758, 542409, 692242, 899217, 1105316, 1009412, 1180656, 1392204, 1619889, 1833942, 1951913, 2033615, 1944892, 1826012, 1482977, 1186327, 1104474]
10240A104474j75181j02901k03165j12871J2936p3057j09440j8787L5732R0942
10230D48682j55516j47802r0655m0266J47647j9413J18637L227R3043J77063J45354
10219F80001o9863j88313M2266J61688M4006m0220Q4374J83332j22272J10402
10209H85401K17691O4117N5379K27632J77726n4742M9004m5484l05710j35992
10199A135022j01854l24003n6808L7546j3442q126j68223j87857k4498j5312k3909
10188B48536j20754N5919j4956j29891K3090k8526J40128n8382n4502j49624j11796
10177b00758K9409J58647K50336K1087k45466K5217J51889k5877q8674M8709K114
10166A26633R3879o1936m0039J50308j1087L4407J06428K9976r808k554j56428
$$ y = [1104474, 929293, 826392, 623227, 510356, 523292, 450235, 340795, 322008, 357740, 448682, 293166, 145364, 54709, 14443, 162090, 142677, 261314, 264541, 357584, 534647, 680001, 610138, 421825, 464091, 625779, 669785, 629565, 713939, 897271, 774999, 885401, 1103092, 1167209, 1222588, 1450220, 1627946, 1573204, 1622208, 1576724, 1271014, 1135022, 1033168, 709165, 652357, 689903, 676461, 668335, 500112, 312255, 287757, 272445, 248536, 127782, 183701, 168745, 38854, 61944, 33418, 173546, 115164, 60662, -88962, -200758, -171349, -12702, 237634, 258721, 13255, 38472, 190361, 164484, 75810, 124519, 126633, 220512, 158576, 118537, 268845, 257758, 292165, 398593, 428569, 418761, 416207, 259779]
10155B59779q6392N9126o3614P6544L2449p9902j06943k2958j627P2667r2872
10144D6257j9555N1958K1267N1778o517K2038K5016n5611k65737r143J40130n1205
10132d9324j7697J02667M095O0681L742j2536J71452J15081Q9509K8333K2348
10121E18351k29277k05863N5822J55889j29305j05175M3922K4277j9225O6153
10111A75569p5458q4892j2611o1227J33087K79049N6381j95543j11518p0904J30881
10100A62814p1641K6403j0052m90J09345k2071K1564L2647M4974q2569J3915L1138
10088B55977J57688M3197K0788L5450J06508K57789j35682j55599k7681j06653
10078D51782r0709j57529N2340J18490n8063l9683K4819j2838l2966M4180l0998
$$ y = [259779, 173387, 232513, 168899, 245443, 277892, 197990, 91047, 68089, 66462, 139129, 46257, 26702, 78660, 99927, 151705, 145188, 167226, 192242, 136631, -129106, -138249, 1881, -49324, -67021, 35646, 39741, 100422, 104164, 91628, 263080, 378161, 467670, 496003, 518351, 289074, 83211, 139033, 294922, 165617, 60442, 104364, 128641, 109416, 175569, 100111, 15219, 2608, -58619, 74468, 353517, 409898, 214355, 102837, 31933, 162814, 91173, 117576, 107524, 107034, 216379, 194308, 215872, 248519, 293493, 210924, 224839, 255977, 413665, 456862, 477650, 513100, 619608, 877397, 741715, 586116, 558435, 451782, 361073, 203544, 255884, 374374, 316311, 276628, 301447, 288609, 255643, 299823, 268825]
10067B68825j9945L0537j07222K6592L2059p0906j6925L2506K15143p2725n4990
10056B62949r4814j50327j2498P8839k4469R9041L21318Q282p669j98613j26828
10045A55211J25580Q4154p0651k03329P4599R7192p1860R1034L5934j75801J05310
10034B47373K35462P5187m0973j24280q1879p7148m5601M391J31509q231p0561
10023B45249j08352J3968J37185J75788Q00j1112j18153M5892J39726R3082j87946
10012D26127j25901R1575Q506j48356Q2127J69662J80191p5377j01620j4731M8749
10001E40952J38478R4637K175j08116M8219J01870P9914j1128j10010j12382J54620
9990H19229k4552j2154j25414j26077j5801J67677P4779q3938j8149p4581P9599
$$ y = [268825, 248880, 279417, 172195, 198787, 230846, 159940, 143015, 175521, 390664, 317939, 262949, 168135, 17808, 5310, 84149, 59680, 158721, 480039, 488321, 480652, 282039, 155211, 280791, 364945, 294294, 90965, 165564, 262756, 190896, 281930, 317864, 142063, 247373, 482835, 558022, 517049, 392769, 310890, 233742, 188141, 192532, 324041, 315810, 245249, 136897, 150865, 288050, 463838, 464638, 453526, 335373, 381265, 520991, 614073, 426127, 300226, 391801, 400307, 251951, 334078, 503740, 683931, 608554, 506934, 492203, 540952, 679430, 774067, 776242, 668126, 716345, 818215, 898129, 887001, 776991, 664609, 819229, 794677, 782523, 657109, 531032, 515231, 682908, 757687, 673749, 655600, 581019, 660618]
9979F60618L2544J65860j4791Q1968J36600P0908K1895K2928M7079l3228m6277
9968A146104Q2240J76940J83948K70439P1945j10178j43120K52177K86615J71219
9958B388329P1884L5226o9683P031J16627K61347L67747J43474K79736K96525
9948C898243J59367Q4984J13531J72213J23893M77627N19308M08747M63363K72954
9938F694230P2787m9992L0625j03759l03319o8987j33872j19406j11521L084P1456
9927E981326J3364J19558M24471M40585K45009L65320Q09708J036669R17256J136853
9917A1490119J501030J637037J227081L94064j27273p1437L29706J48070m53279
9908A6075118p54026q28971p56317n62517m68805m32147k16411J5290L7191J91606
$$ y = [660618, 693162, 859022, 844231, 926199, 1062799, 1133707, 1155602, 1178530, 1225609, 1192381, 1146104, 1228344, 1405284, 1589232, 1859671, 1931616, 1821438, 1678318, 1930495, 2217110, 2388329, 2460213, 2495439, 2425756, 2432787, 2549414, 2810761, 3178508, 3321982, 3601718, 3898243, 4057610, 4142594, 4256125, 4428338, 4552231, 5029858, 5549166, 5957913, 6421276, 6694230, 6767017, 6717025, 6747650, 6643891, 6340572, 6271585, 6137713, 6018307, 5906786, 5909870, 5981326, 5994690, 6114248, 6538719, 6979304, 7224313, 7589633, 8399341, 9436010, 10353266, 11490119, 12991149, 14628186, 15855267, 16249331, 16122058, 16050621, 16380327, 16528397, 16075118, 15321092, 14492121, 13735804, 13173287, 12704482, 12272335, 12055924, 12071214, 12108405, 12300011]
9898A2300011L66900L32887N29474O44503N51804P16917R14365J149584J117982
9889A8624427J204504J490058J916494K280646K702741L186770M251072N873799
9881D1530511P394439R542957J2449754J5720601J9193988K1916380K3056904
9874A50805534J9760421R610216m465278j5569321k0328083j9808585j6280357
9867A03724547j1891274q045178m597077j253143J513822M170978O949781R512326
9859A00084782J1985234J3216810J3114612J2099874J0357970P990724M675049
9852A73525055J377892j095756k435300l402875l735886l968493l913593l731897
9844A52619147l629678k602460j107866R79450M482939R370911J5840767K3948734
$$ y = [12300011, 12666911, 12999798, 13529272, 14173775, 14725579, 15442496, 16356861, 17506445, 18624427, 19828931, 21318989, 23235483, 25516129, 28218870, 31405640, 35656712, 41530511, 48924950, 58467907, 70917661, 86638262, 105832250, 127748630, 150805534, 170565955, 180176171, 175710893, 160141572, 139813489, 120004904, 103724547, 91833273, 83788095, 79191018, 77937875, 79451697, 83622675, 90572456, 100084782, 112070016, 125286826, 138401438, 150501312, 160859282, 168850006, 173525055, 174902947, 173807191, 171371891, 167969016, 164233130, 160264637, 156351044, 152619147, 148989469, 146387009, 145279143, 146258593, 150741532, 160112443, 175953210, 199901944]
9836A99901944L4129260M5065457N4500053N7726362M7802294K1385233j4212196
9829D46298407m3115173n6515918n5811810m6515303l4872657k4073883j5118908
9822A70274755q427215l461331O9231K175109K799237K873574L346030M276964
9814A73926354N098389N476893N002405L648507J853729p3321k978049o681405
9806A85273502j0178839j3183305j4922582j4751168j2453125r145504o026557
9799A04612422l289623j076493J699082M203279O986599J0331105J3829504J7232397
9791A54528272J8305053J5437764O902353n673755j6286194k1705319k1943370
9784A29564804j9079828j5720154j2154315r315677p089158n558735m340312l609560
$$ y = [199901944, 234031204, 279096661, 333596714, 391323076, 439125370, 460510603, 446298407, 403183234, 346667316, 290855506, 244340203, 209467546, 185393663, 170274755, 161847540, 158386209, 158455440, 160630549, 163429786, 166303360, 169649390, 173926354, 179024743, 184501636, 189504041, 193152548, 195006277, 194932956, 191954907, 185273502, 175094663, 161911358, 146988776, 132237608, 119784483, 110638979, 104612422, 101322799, 100246306, 101945388, 106148667, 113135266, 123466371, 137295875, 154528272, 172833325, 188271089, 195173442, 189499687, 173213493, 151508174, 129564804, 110484976, 94764822, 82610507, 73294830, 66205672, 60646937, 56306625, 52697065]
9776E2697065k948446k446569k285074k162580k003464j854104j574510j524304
9768C5898014j312165j344439j189831j092485r30494q91901n70874n01167m08590
9759B7656068l12810l23001j08682K52268O31479M49918M83591J18398k46765
9750B8600464l92183m52059q24735j288323j808456j795158j784852j671091j315945
9741A7267662r38670q22649p37946p38736m34632m04509m83221k72622l58783
9732A2075894l25667r7649n7394j508j70132L955j77434j82269j14779j03802
9722A0849215l49308l14314l81220k19172j81849l40018m70055l68438o37405
9713G587436l48430K180j20659m29439l44954k42191j62414q8844l08831l06811
$$ y = [52697065, 49748619, 47302050, 45016976, 42854396, 40850932, 38996828, 37422318, 35898014, 34585849, 33241410, 32051579, 30959094, 30028600, 29136699, 28565825, 28064658, 27656068, 27343258, 27020257, 26911575, 27163843, 27795322, 28245240, 28728831, 28847229, 28600464, 28208281, 27756222, 26931487, 25643164, 23834708, 22039550, 20254698, 18583607, 17267662, 16328992, 15506343, 14768397, 14029661, 13595029, 13190520, 12707299, 12434677, 12075894, 11750227, 11652578, 11595184, 11593676, 11423544, 11427499, 11250065, 11067796, 10953017, 10849215, 10499907, 10185593, 9804373, 9585201, 9403352, 9063334, 8593279, 8224841, 7587436, 7239006, 7241186, 7120527, 6691088, 6346134, 6103943, 5941529, 5852685, 5543854, 5237043]
9703E237043k09893k00242j49438j12577J4278p5045m0286l073j00476k03924
9693D156367j50818j14400j41901j48602j91353k3488Q2541k8541l4256M2571
9683C448120j68322p2425j1381Q867k08477j8250O2419j07165k64684j89163J4484
9672B494023Q8034J17318q219J43685m7496p5204J50157Q4875k08020q9127K0447
9661B670473R1381L971r5743r3464r1062j0640K63167J65618j60693r6752r6101
9650B550155K714m8167P6522K1021K3854J48070J76205k950k5489n6289k7363
9639B838283j87887J7497M8441R1838o1163r9463l11444k29004j01821k2417J00611
9628B083471J00500k172k1216O2076K3913j02520K626k6177J1103M7890N022J10071
$$ y = [5237043, 5027150, 4826908, 4677470, 4564893, 4579171, 4504126, 4463840, 4460767, 4360291, 4156367, 4005549, 3891149, 3749248, 3600646, 3409293, 3385805, 3468346, 3439805, 3405549, 3448120, 3279798, 3207373, 3195992, 3204859, 2996382, 2978132, 3040551, 2933386, 2668702, 2479539, 2494023, 2582057, 2699375, 2691156, 2834841, 2787345, 2712141, 2862298, 2947173, 2739153, 2650026, 2670473, 2761854, 2765825, 2670082, 2576618, 2485556, 2474916, 2738083, 2903701, 2743008, 2646256, 2550155, 2552869, 2504702, 2581224, 2602245, 2626099, 2774169, 2950374, 2947424, 2921935, 2865646, 2838283, 2650396, 2667893, 2716334, 2808172, 2747009, 2647546, 2336102, 2107098, 2005277, 1982860, 2083471, 2183971, 2181799, 2160583, 2222659, 2246572, 2144052, 2146678, 2120501, 2131604, 2179494, 2184516, 2294587]
9616B294587o5506J7160j47829p4064k5043k4332j00809j09055O2304l4333P4288
9605A867368K13248J12590R614j6362M2554j7557j78203o2798q0520J1346L148
9594A904428l078L7070K5352m0172p0885j67045j07008K9992R7328J53404j08491
9583A750895n9462O9970l0314J56384j24506l7239n0755j92513O1233K6145p758
9572A562080j46631k0285O546J12519P3159n1586K9687l636J457Q316P1299O8331
9560A711256r4984j86042Q4355r6480k1902j02507q8725m5904J52919r673l2554
9549A269759R8885n448o2176l3598k24441k23277K8758N9409J09558K28971J29721
9538A376121p6629p2021j18795r0105L00128P7870m6292J6702N0165j7518L6877
$$ y = [2294587, 2229081, 2246241, 2098412, 2024348, 1999305, 1974973, 1874164, 1765109, 1827413, 1793080, 1867368, 2080616, 2193206, 2202820, 2186458, 2229012, 2211455, 2033252, 1970454, 1889934, 1901280, 1904428, 1901350, 1938420, 1963772, 1923600, 1852715, 1685670, 1578662, 1608654, 1705982, 1859386, 1750895, 1691433, 1761403, 1731089, 1887473, 1762967, 1725728, 1674973, 1482460, 1543693, 1569838, 1562080, 1415449, 1395164, 1401710, 1514229, 1587388, 1535802, 1565489, 1561853, 1563310, 1571626, 1642925, 1711256, 1616272, 1430230, 1514585, 1418105, 1396203, 1293696, 1204971, 1159067, 1311986, 1302313, 1269759, 1368644, 1363196, 1301020, 1267422, 1042981, 819704, 848462, 907871, 1017429, 1246400, 1376121, 1299492, 1227471, 1108676, 1018571, 1318699, 1396569, 1350277, 1366979, 1417144, 1399626, 1436503]
9527A436503k3353q7620m1483k31196K7588L7253K0130j5761l9470p0924r0446
9516I21221j1305j0138p6329M6204N9000m2995J18942O8004n5543L7114M9458
9505A103633J811Q4484K4885m0841M9599r315P7300o0071q0484L8011L20077J33166
9493A642255J02070r6070k45720p7748P5946j92572k11671M5724l2174j39693
9483H70347m3821P9256P2975O7816P4526l6570j24436O1499O9542m4901J0395
9472A056628J47839O9471J3396k68441j30849P0639J4794K6315p0775K2360R528
9461I60905r4360J44928K47884J14187K18779J35875J09635J33468J42267J35364
9451B248932R6317l7353r7125k07776l8097j18862o22l92483l58126k4444J93894
$$ y = [1436503, 1413150, 1325530, 1284047, 1052851, 1080439, 1117692, 1137822, 1122061, 1082591, 1011667, 921221, 909916, 899778, 823449, 869653, 928653, 885658, 1004600, 1072604, 1017061, 1054175, 1103633, 1105444, 1189928, 1214813, 1173972, 1223571, 1214256, 1291556, 1231485, 1151001, 1189012, 1509089, 1642255, 1744325, 1648255, 1402535, 1324787, 1400733, 1208161, 996490, 1042214, 1010040, 870347, 826526, 905782, 978757, 1046573, 1121099, 1084529, 960093, 1021592, 1091134, 1046233, 1056628, 1204467, 1273938, 1287334, 1018893, 888044, 958683, 973477, 999792, 929017, 951377, 960905, 866545, 1011473, 1259357, 1373544, 1592323, 1728198, 1837833, 1971301, 2113568, 2248932, 2345249, 2307896, 2210771, 2002995, 1964898, 1846036, 1845414, 1452931, 1094805, 1070361, 1264255]
9440A264255j13503l9264l1234j2173J43865J23977N900j41027n2342n5451o9495
9429A023508m0314m439J34045P077p9466n3783j44713m6640O5023r038R9976J82939
9417A134175J85738l8858R3147K33700K57143L13253L72982O7595j12096r1937
9407B414842j35782o0792q791l46147j93794P0356j06110j72381r2839o5239k38599
9396A064724j79512J200J61112m6059j11408p5612q117l027L1937q5507l1416
9385G18315J95411P9883J2832m7147j5446K7778N581Q6057J75834j4181J3051
9374A237968J60555k6917o2006o8744N1916K25306K78912J13369m2914M776j29981
9363A742240j12296l7239Q3028k0601k69646j93261k7337j72407r1630j00590
$$ y = [1264255, 1150752, 1111488, 1080254, 1068081, 1211946, 1335923, 1341823, 1200796, 1148454, 1093003, 1023508, 983194, 978755, 1112800, 1119877, 1040411, 986628, 841915, 795275, 860298, 851260, 951236, 1134175, 1319913, 1281055, 1374202, 1607902, 1865045, 2178298, 2551280, 2618875, 2506779, 2414842, 2279060, 2218268, 2209477, 1863330, 1669536, 1739892, 1633782, 1461401, 1368562, 1303323, 1064724, 885212, 886412, 1047524, 1001465, 890057, 814445, 806328, 803301, 835238, 749731, 718315, 913726, 993609, 1006441, 959294, 943848, 971626, 977207, 1063264, 1239098, 1224917, 1237968, 1398523, 1371606, 1309600, 1240856, 1292772, 1518078, 1796990, 1910359, 1867445, 1872221, 1742240, 1629944, 1592705, 1675733, 1655132, 1385486, 1192225, 1164888, 992481, 900851, 800261]
9353H00261o0817p5443K0514K37577J13068j04114j79471k07753M6399j6786k7887
9342E45548J10539M4916J20259q505K0565r8296j24845P1289q7661Q265p513K04455
9330G99016r2421P7325J25395j39011q0540n3485o002O3059o561K34967l5584
9319H86158J03304N4175j31300J6481J75149J9q1357k02338j56719O3225J3682
9308G40479m3671q4240r575l9927l7306J1279k3138l8993J54459J09965K3568
9297G62900k05854K3878J22493K2558O7563j8427O0024J94128K3340p3890j26794
9286H51919k02953r7263K11105k6317l6706J6129k6333j52014M0508J27721N7162
9275G62958O6558j43078l3851L1460j79924P143R3998J2220M0278N2634m6667
$$ y = [800261, 739444, 664001, 684515, 922092, 1035160, 931046, 751575, 543822, 590221, 573435, 545548, 656087, 701003, 821262, 812757, 833322, 735026, 610181, 681470, 593809, 602074, 594561, 799016, 706595, 783920, 909315, 770304, 689764, 636279, 630277, 693336, 686775, 921742, 886158, 989462, 1043637, 912337, 928818, 1103967, 1103986, 1022629, 820291, 663572, 726797, 740479, 696808, 612568, 602993, 563066, 525760, 537039, 513901, 474908, 629367, 739332, 762900, 557046, 580924, 703417, 725975, 793538, 775111, 835135, 1029263, 1052603, 978713, 851919, 648966, 551703, 762808, 736491, 699785, 715914, 689581, 537567, 578075, 705796, 762958, 829516, 686438, 652587, 684047, 504123, 511266, 605264, 617484, 657762, 710396, 663729]
9264F63729M9718j51127p1276L35249J3054j55394o5781O1403O1697Q7415r595
9253H19092j02046j24717J66979R5798J14525n377N4603o4071j14740n8562o7508
9242G13976J6725P1215P1456N0519n251K4228p2645j31515m9025l8812j46675
9231E04196P9908L6797R4486j32386P7219Q5631N0576J08765J36655j20893l8829
9220H82125j06014L6504K61473J30710k45529k94124j5115P6611J05656r2230
9210G40067L2456J21037Q52J37528O5902l3276q6644j10683o1521L0865J36032
9199I72615L8116Q0977J6348j73619p7605j28824Q2115J15926M3196J6317J88214
9188A173776L06711M5293m9924r583k5111J9724O3787J9355L6140J8463N3319
$$ y = [663729, 713447, 562320, 491044, 826293, 839347, 683953, 618172, 679575, 741272, 828687, 819092, 717046, 592329, 759308, 855106, 969631, 964254, 1018857, 954786, 840046, 781484, 713976, 730701, 801916, 873372, 923891, 918640, 942868, 870223, 738708, 689683, 650871, 504196, 584104, 620901, 715387, 583001, 660220, 745851, 796427, 905192, 1041847, 920954, 882125, 776111, 812615, 1074088, 1204798, 959269, 665145, 650030, 726641, 832297, 740067, 772523, 893560, 894412, 1031940, 1097842, 1064566, 977922, 867239, 805718, 836583, 972615, 1010731, 1091708, 1108056, 934437, 856832, 728008, 810123, 926049, 969245, 985562, 1173776, 1480487, 1525780, 1475856, 1466273, 1441162, 1460886, 1524673, 1544028, 1580168, 1598631, 1651950]
9177A651950j27153K9157o9998O5122K58494p248q2086j20953j04724J04818J60098
9166A757477M2322P2464l2628R2735J32290Q6207L5621Q3082J8115J65139R4008
9155B546832J28771Q5280O3663o4275J6759O3457M9613K06051K96169J15823Q0982
9144C589125K9046O6337M781o1943j842L56494L19743J93096J20434K01681K10666
9133E027618L13794L50912J51297K28877M29784K69570L65416K78932L81796K81759
9123H079755M01873M85723M66670N06066N23537N66756N78636M73578N85976O40651
9113A3309221N92795O62493Q70635Q19607P61471Q24053O82641O51048P01019
9104A9874983N33425L53641M68087M19319L07735J20493m4848j99488j43592k10266
$$ y = [1651950, 1524797, 1553954, 1483956, 1549078, 1807572, 1800324, 1718238, 1597285, 1492561, 1597379, 1757477, 1799799, 1872263, 1839635, 1932370, 2064660, 2150867, 2186488, 2269570, 2287685, 2452824, 2546832, 2675603, 2760883, 2824546, 2760271, 2777030, 2840487, 2890100, 3096151, 3392320, 3508143, 3589125, 3618171, 3684508, 3689289, 3627346, 3625504, 3981998, 4301741, 4494837, 4615271, 4816952, 5027618, 5341412, 5692324, 5843621, 6072498, 6502282, 6771852, 7137268, 7416200, 7797996, 8079755, 8481628, 8967351, 9434021, 9940087, 10463624, 11030380, 11609016, 12082594, 12668570, 13309221, 13902016, 14564509, 15435144, 16254751, 17016222, 17840275, 18522916, 19173964, 19874983, 20408408, 20762049, 21230136, 21649455, 21957190, 22077683, 22032835, 21833347, 21689755, 21479489]
9094B1479489m37037p22613p51991p06115n36725n60030o67001p65163m46669
9085A5886145m44545n20654o88231n87411o05506m55611m59976n23110n03155
9076A1097946l60955m04538m72277l70042k09925j77735l10827l86563j46427
9067H258657k92391l16341l65466l58311k80520k69522j63928K8899j96130j06065
9057E938882j51483k31979j47576k89124j55548j86722k48050o7233j65144j31967
9047D164056J9392O3364r9289j62649j41201r9909q079k0590j01998k85057j48498
9036C179542M3707r228R768k55136j25711j38853q6935j13107j25241J4269j25206
9025B267869j95237K0943m3711j24160j9665j37663r027L7318J54697m4315p7233
$$ y = [21479489, 21042452, 20319839, 19567848, 18861733, 18325008, 17764978, 17097977, 16332814, 15886145, 15441600, 14920946, 14232715, 13645304, 13039798, 12584187, 12124211, 11601101, 11097946, 10736991, 10332453, 9860176, 9490134, 9280209, 9102474, 8791647, 8405084, 8258657, 7966266, 7649925, 7284459, 6926148, 6645628, 6376106, 6212178, 6241077, 6044947, 5938882, 5787399, 5555420, 5407844, 5118720, 4963172, 4776450, 4528400, 4461167, 4296023, 4164056, 4183448, 4246812, 4147523, 3984874, 3843673, 3743764, 3735685, 3715095, 3613097, 3328040, 3179542, 3223249, 3214021, 3223789, 2968653, 2842942, 2704089, 2617154, 2504047, 2378806, 2393075, 2267869, 2072632, 2093575, 2049864, 1925704, 1906039, 1768376, 1759349, 1796667, 1951364, 1907049, 1829816]
9014A829816n2288k24260j90105Q0660J62064j43655K3437P9807O5318l9520j40230
9003A451044R3646M9041p4762r4266q2990p3600Q6217q0952J85456K13516K3592
8992A695942k09449j74012j26819M0036j5664j76566k53958P8189K40864J68386
8982A266949j91834r0067p4472R6077J0064n7983j64016n6670k8636K6757L01792
8971A037961N4754j5090l6250l8119k08540j35253n7222N2504L7180j25696K03396
8960G69625J49843o2548n1665l6533j82430j97244m4981M0948K58950K51179J53381
8949A048525j68275o0142r5993p9872N4904L6161j27098R9561J2765m9419k3405
8938F47712O4945J3687o6580R8980o0663r6190Q0977k66865j18772J28032K8967
$$ y = [1829816, 1777528, 1553268, 1363163, 1443823, 1605887, 1462232, 1485669, 1565476, 1630794, 1591274, 1451044, 1544690, 1593731, 1518969, 1424703, 1341713, 1268113, 1354330, 1273378, 1458834, 1672350, 1695942, 1486493, 1312481, 1185662, 1225698, 1210034, 1033468, 779510, 857699, 1098563, 1266949, 1075115, 985048, 910576, 1006653, 1016717, 958734, 794718, 738048, 709412, 736169, 1037961, 1092715, 1077625, 1041375, 1003256, 794716, 659463, 602241, 654745, 691925, 566229, 769625, 919468, 856920, 805255, 768722, 586292, 389048, 344067, 385015, 643965, 895144, 1048525, 880250, 820108, 724115, 644243, 699147, 735308, 608210, 707771, 720536, 671117, 647712, 712657, 726344, 659764, 758744, 698081, 601891, 682868, 416003, 297231, 425263, 454230]
8927D54230P9095j0563j120J81856q471p6595o1857l8207j24430J98607K32418
8916H24963m830j34857J083J22356j31837k2097n9885M4333o5573R411K6129k06408
8904D02788r8958l3742J10583J43881m3652M3669J56025N2352r3525k02918r1650
8893C44853k7088Q8500J28835P4173J68177J44885l9161j35744j00537J7509j48041
8882E16361O8835J65025J81381J76814Q4022m0540J45502O7376K87530L15965
8872A968271M91555N79301J014294J290090J327000J195051L69235o60011j169961
8863F404825j253206j080865q62753n24051m12152m50990m14137k54534p0046
8854A082091K4933k8281j43951p2088p3353J85401R2694k2281n5831N6516j56749
$$ y = [454230, 533325, 522762, 521642, 703498, 695027, 618432, 556575, 518368, 393938, 592545, 824963, 820133, 685276, 686359, 808715, 676878, 654781, 594896, 639229, 573656, 583067, 609196, 402788, 303830, 270088, 380671, 524552, 480900, 524569, 680594, 732946, 639421, 436503, 344853, 317765, 406265, 535100, 609273, 777450, 922335, 883174, 747430, 646893, 664402, 516361, 585196, 750221, 931602, 1108416, 1192438, 1151898, 1297400, 1364776, 1652306, 1968271, 2459826, 3039127, 4053421, 5343511, 6670511, 7865562, 8234797, 7574786, 6404825, 5151619, 4070754, 3208001, 2683950, 2271798, 1820808, 1406671, 1152137, 1082091, 1107024, 1078743, 934792, 862704, 789351, 974752, 1067446, 1045165, 989334, 1045850, 889101]
8843H89101J3329O6717n585j10872P0583j07459J2397n2136R3638K3967q8668
8832H05012o5400r57l9282o5379j53086j56968k0989L00984J49758j24449j48275
8821D80969m2871L1745j13402Q2759J70634j04571j66727r4753l9880J13567O2111
8810C79581r1293j40461L1888J19299J42792k030o4416j53898q1947J4362J77127
8799C31004J11517m8983o2696j09600j0323J29849M221R634J94134L7090L8789
8788F24636k9825k50512q3941P5084J0992n852k7422M5133J81000l2329j44755
8777C62209k2501R1783N4520k05551j07210N285k348J00705M6527l4834p5699
8766B12886J8851k8506J49745N3893k7672m933J4829J3946J46696m1322j55797
$$ y = [889101, 902430, 969147, 963562, 852690, 923273, 815814, 828211, 776075, 869713, 893680, 805012, 739612, 738655, 699373, 633994, 480908, 323940, 302951, 603935, 753693, 629244, 480969, 438098, 469843, 356441, 439200, 609834, 505263, 338536, 243783, 203903, 317470, 379581, 288288, 147827, 179715, 299014, 441806, 439776, 375360, 221462, 139515, 153877, 331004, 442521, 393538, 330842, 221242, 210919, 340768, 344989, 354623, 548757, 585847, 624636, 594811, 344299, 260358, 335442, 346434, 340582, 313160, 358293, 539293, 506964, 362209, 339708, 431491, 486011, 280460, 173250, 178535, 176187, 276892, 323419, 288585, 212886, 231737, 203231, 352976, 406869, 379197, 374264, 389093, 403039, 549735, 508413, 352616]
8755C52616q2224j16291K0815O0692K1358j18377j01783j26074P0830M3760P3108
8744I8430J00164J43083J94392q6681l540j57732l9310L4968K1726r523r2425
8733B03552J4443J6569N2170l0322r0087o2195K2162L4041L4168J53066m3516
8722C04051j29211o8702o388R3723O9176j0564j51356Q7624P2107N1610K2479
8711C34549o8466p2983P2232R5732l372m3572r8157J3132M0825J5502n5300j17922
8699A12200j30650j34586P4816J16868J00756J07201K07440J4440n9568P1524
8689D80441j59894n1273L1451j9425k13712o0031J01067R1784J81062L1986l6078
8678C77378m4789P0949N4504p8864j34520l9147n3155J07451K46702R9453j90936
$$ y = [352616, 270392, 154101, 174916, 235608, 256966, 138589, 36806, -89268, -18438, 25322, 98430, 198594, 341677, 536069, 449388, 445848, 288116, 248806, 283774, 305500, 295977, 203552, 217995, 234564, 286734, 256412, 166325, 104130, 126292, 160333, 194501, 347567, 304051, 174840, 106138, 99750, 193473, 262649, 252085, 100729, 188353, 260460, 312070, 334549, 266083, 193100, 265332, 361064, 357692, 314120, 215963, 229095, 269920, 285422, 230122, 112200, -18450, -153036, -78220, 38648, 139404, 246605, 454045, 468485, 408917, 480441, 320547, 269274, 300725, 281300, 67588, 7557, 108624, 200408, 381470, 413456, 377378, 332589, 403538, 458042, 379178, 244658, 205511, 152356, 259807, 506509, 605962, 415026]
8667D15026k09455q6939n0865L03402J19029J628k05660j59520j3488j68689K5676
8656b9855K09483K3946q684p3979M5920J12447J03878L1832j85022L9252Q1115
8645C50333L4959j61361j13822K1245J34032L6898Q832L6029R0154J30500O698
8634E74497K526j41910k69442j43382n6776K5624K37282J46960O6249O443k06185
8623B41886p4990P1910o4692k9907k3852K5216j8165J27940J28992r6654m8626
8612B39058R6020K1398j02088p8146p1431J6004O1945m1001P7047K72805O7195
8601E58806j5670j09663r5333o9830n7047q1876K0210R4944j4655q4022l8897
8590A06967P4839l6267P0730P2172Q0723Q092J06260j14613p9974j1774J79419
$$ y = [415026, 205571, 118632, 67767, 371169, 490198, 491826, 286166, 126646, 113158, -55531, -29855, 179628, 203574, 194890, 120911, 166831, 279278, 383156, 414988, 229966, 269218, 350333, 385292, 223931, 110109, 131354, 265386, 302284, 311116, 347145, 437299, 567799, 574497, 577023, 435113, 165671, 22289, -34487, -8863, 228419, 375379, 441628, 448071, 241886, 166896, 238806, 174114, 144207, 120355, 145571, 127406, 255346, 384338, 287684, 239058, 335078, 356476, 254388, 176242, 104811, 120815, 182760, 141759, 218806, 491611, 558806, 543136, 433473, 338140, 268310, 211263, 129387, 149597, 244541, 229886, 145864, 106967, 181806, 145539, 216269, 288441, 369164, 377256, 483516, 368903, 288929, 277155, 456574]
8579D56574P0137k52023k06035J45774K12473j397k49689m7585j68778J54187
8569A13638N5217j72710k5934K3944K29072q7931q2657P8156N7905J68135K35213
8558E92048o5801m0361J39444k4146k67900j39203n8972r654m5339K04734O2462
8547C47312j90765j34700L3906r43k1853P2712L7191o4305r9535Q0152J45068
8536B04240o6741k609J879p5703k52798o8853J65448M9701j7217K176k26591O7286
8524b19782Q7158J61197K00915L6623r7002o8605j37196m273J84926n1592j16712
8513b4343j4810R4044J69522R3357j67896j17959R2286J28422p1239j54579j21576
8502i4771k3389L7275K2391J33442K85089Q9413j37981R1023k13774j71740j05267
$$ y = [456574, 526711, 274688, 68653, 214427, 426900, 425503, 175814, 128229, -40549, 113638, 168855, -3855, -29789, -5845, 223227, 135296, 52639, 130795, 188700, 356835, 592048, 526247, 485886, 625330, 601184, 333284, 194081, 135109, 125455, 80116, 284850, 347312, 156547, 21847, 55753, 54810, 32957, 105669, 142860, 78555, -20980, 59172, 204240, 137499, 134890, 136769, 61066, -191732, -260585, -95137, -45436, -62653, -60477, -287068, -219782, -132624, 28573, 229488, 266111, 169109, 100504, -36692, -40965, 143961, 92369, -24343, -39153, 54891, 224413, 317770, 149874, 31915, 124201, 252623, 181384, 26805, -94771, -118160, -80885, -58494, 74948, 360037, 449450, 311469, 402492, 188718, 16978, -88289]
8491h8289K08997K3124k7283M4328R354r5639k35409J41892P4074j42325j10973
8480a98149J1011J31595K2121n6532N2331J52968m962j24039r4257R7583M0083
8469B9753M5070K6583N6000l0637P1821O0338r5100j13185r9573P2739J42279
8458A66088l5654n196J8906k529j16493O7790L3354J22412Q1557O6028j76600
8447B19663K58n0570o0079N1391L0118j74544j16988J10339j34140K3658K81853
8436A80959n077k35579J8141J69173J08133k7335k4767l2780p611J81467o7778
8425B56946j40813J7804p504J76868O7638n4521j57474m5560Q99j65911N0757
8414h71J71721Q425o9154o6190m078J9537n5356m1630l5257J58262J35827J04213
$$ y = [-88289, 120708, 143832, 116549, 160877, 170231, 74592, -160817, -18925, 55149, -87176, -198149, -187138, -55543, -33422, -89954, -37623, 115345, 110383, -13656, -107913, -10330, 29753, 74823, 101406, 157406, 126769, 198590, 258928, 163828, 50643, -48930, 23809, 166088, 130434, 125238, 144144, 141615, 25122, 92912, 126266, 248678, 330235, 396263, 219663, 219921, 169351, 109272, 160663, 190781, 16237, -100751, 9588, -124552, -100894, 180959, 175882, -59697, -41556, 127617, 235750, 208415, 183648, 150868, 143257, 324724, 256946, 116133, 133937, 126433, 303301, 370939, 316418, 158944, 113384, 114283, -51628, -871, 170850, 179275, 110121, 43931, 39853, 59390, 4034, -37596, -72853, 85409, 221236, 325449]
8402C25449j826k4696p3838p3277j2571j66617K30645J74998j61356j91635q7353
8391f2077J28728J01905K1583j5092J6933p6549j03259L8323k96853K5974J71836
8380d8548k7119L8604J32925k25016o8907Q8850k0714k7384J69813P6886q7832
8369A558L3725O2036J5094l148j12267K6857N0662J6558P4101p1198l0174Q5140
8357A48944J0565o4171n5866M5810j62741O2896J13119j17614r2937j53514L5677
8346b29832O3229P7732M5275O4564J7184J49779Q8582J8105p2698j23596o5707
8335C2617k9699R1071j57271q8035L5709O5411R3946L5293M8121J34014m8921
8324B12256k42895j25762J30149J09221K1237N652m6603j03343j0213P5983J42629
$$ y = [325449, 323623, 298927, 225089, 151812, 139241, -27376, 203269, 378267, 216911, 25276, -62077, 66651, 168556, 190139, 175047, 191980, 115431, 12172, 50495, -246358, -220384, -48548, -75667, -37063, 95862, -129154, -198061, -109211, -129925, -157309, 12504, 89390, 1558, 35283, 97319, 112413, 109265, -3002, 23855, 74517, 91075, 165176, 93978, 63804, 148944, 159509, 95338, 39472, 85282, -77459, -14563, 98556, -19058, -111995, -265509, -229832, -166603, -88871, -43596, 20968, 38152, 187931, 276513, 294618, 221920, 98324, 32617, 2918, 93989, -63282, -151317, -115608, -50197, 43749, 79042, 127163, 261177, 212256, -30639, -156401, -26252, 82969, 104206, 109858, 63255, -40088, -50301, 25682, 168311]
8313A68311j42277k15025Q5619J27815l7023n0474O1349R7774p1611J40118L9233
8302B03809j70713k00068O0883R0799o5053r6568O8749O4391J05746J66312R63
8291B29250L946k32378P9440J62548l0584O0880N6777j49528N948N4177j01475
8280A39001n596K3388j9825j73698J7756j09726j2657O0563R1276m2806l3504
8269f5828Q9084N7691J9549K1309p0159j22288J26386k9483J29732K57947K5256
8258D39196n2055r7782p1601j898j45421O2547Q7699o5881m0478k09631N662k8486
8246a18129J67101p4851q7374N3102J46245J14347j69510j03524m6036j05418
8236b24047L9961K38375M7870o2825r2620m2504L4663J27078m2075M0804p1364
$$ y = [168311, 26034, -188991, -103372, 24443, -12580, -63054, -1705, 96069, 24458, 164576, 203809, 33096, -166972, -106089, -15290, -80343, -176911, -108162, -43771, 61975, 228287, 229250, 233196, 818, 80258, 242806, 212222, 273102, 329879, 180351, 186299, 240476, 139001, 133405, 156793, 136968, -36730, -18974, -128700, -141357, -80794, 10482, -32324, -65828, 23256, 80947, 100496, 121805, 51646, -70642, 55744, 26261, 155993, 413940, 439196, 387141, 289359, 217758, 215860, 70439, 132986, 220685, 154804, 114326, -95305, -89643, -118129, 48972, -25879, -113253, -60151, 86094, 200441, 30931, -72593, -118629, -224047, -184086, 54289, 102159, 39334, -53286, -95790, -61127, 65951, 23876, 64680, -6684]
8225f684n0849q4574N5241Q7098L9152p2908k6855L4035q813J27447O9210P231
8213A68731m4167r4174k6435n0478J44721K5088N5445o2343k3400q0197p6352
8202f3561J28193J30409r9569j53873N1797L7864r4737m6235j10859j38797R7986
8191b61382J54645J21877R3583J60175N1205j06888l6899O7837m7430M069J53709
8180C54501n8948j03371j33455k51387M1445J57949Q6020N5569j10j37660J12220
8169A22773p6541r9910J99645O2585K7845M7189K5721n3500k2501j24175j096
8158A08035N7181j6441j19079P5931J6272q2773k856L2365q0451J06875q381l5878
8146E0800o0430J83072J46291P0028l14936r4345J56959n589r9018k7643L6653
$$ y = [-6684, -57533, -142107, -86866, 232, 39384, -33524, -60379, -26344, -35157, 92290, 161500, 168731, 124564, 30390, 3955, -46523, 98198, 123286, 178731, 116388, 92988, 12791, -63561, 64632, 195041, 95472, -58401, -6604, 31260, -63477, -109712, -220571, -359368, -261382, -106737, 15140, 108723, 268898, 320103, 213215, 176316, 244153, 196723, 200792, 354501, 295553, 192182, 58727, -192660, -151215, 6734, 92754, 148323, 148213, 10553, 122773, 46232, -53678, 145967, 208552, 236397, 283586, 309307, 255807, 233306, 109131, 108035, 165216, 148775, 29696, 105627, 121899, 39126, 36270, 68635, -11816, 95059, 86678, 50800, -9630, 173442, 319733, 389761, 74825, -19520, 137439, 131850, 32832, 5189, 41842]
8135D1842K2694L251k32729j79911Q8565Q9383K59405n0586K5617K5009n3694
8124C8846P3433o4352j26187n9924K40920l688r3575Q0394J6528j78014j05498
8113a81117j5380n596m400J25587J6621j98754Q9794J85010j28423p7587P4647
8102a19598Q9153M4127k8307r7139J0928N2494P2299N8223O8989o5549P3857k2131
8090A37346P5330M4806R66o7144q3743j18100J4688L5623m4922J43936O0235j64432
8078C4589j1137J24762L335O8717l5917j79699j85975J16753K6256J37813L6437
8067A35934p8863l5419J61791n769j20743l4843L5679l534j2642J59344k7147
8056A73788k88966J8505j4401p0658L5271m8327J34403J83618M4585L6402O4791
$$ y = [41842, 64536, 67787, -164942, -344853, -256288, -166905, 92500, 41914, 67531, 92540, 38846, 112279, 47927, -78260, -138184, 102736, 99048, 5473, 85867, 102395, -75619, -181117, -196497, -202093, -206493, -80906, -64285, -263039, -173245, 11765, -116658, -194245, -119598, -30445, 13682, -14625, -111764, -100836, -48342, 23957, 82180, 151169, 85620, 159477, 137346, 212676, 257482, 258448, 191304, 107561, -10539, 4149, 39772, -5150, 138786, 199021, 34589, 23452, 148214, 151549, 220266, 184349, 4650, -181325, -64572, -38316, 99497, 135934, 57071, 21652, 183443, 177674, 56931, 22088, 57767, 54233, 41591, 200935, 173788, -115178, -96673, -111074, -181732, -146461, -194788, -60385, 123233, 167818, 204220, 269011]
8045B69011O0526q4501j70542Q6180j5458k7324m084n3817n3191M8037l1590J02526
8033A25773R8373O4163p2075j27412j89294N9390J76699M7166j32453j63735P5984
8022c7421p3385m1616N5889M3814j71520n3688L6513R1081J54777J04397K01100
8011C09941l2553j4601M0358k34270j29624J08506J6858n4467K0812J13784J76769
8000C21513j35717j1680l7751l8550J12901J74665L8446p3252l0174m8589j08282
7989A63530M2392l0855R543J79273J50954k04269l23562p7849J71198J52458j3507
7978B19306p1499k32168j69881J38216J01262p631J65474K53968N6063q841k1571
7967D22698j16808L4758l6554j81685j00432j55243P7028K17741J75254n986j29126
$$ y = [269011, 329537, 245036, 74494, 160674, 145216, 117892, 113808, 59991, 6800, 54837, 23247, 125773, 224146, 288309, 216234, 88822, -100472, -41082, 135617, 182783, 50330, -113405, -37421, -110806, -152422, -96533, -52719, -224239, -277927, -241414, -150333, 4444, 108841, 309941, 277388, 262787, 303145, 68875, -60749, 47757, 64615, 10148, 30960, 144744, 321513, 185796, 174116, 136365, 97815, 210716, 385381, 423827, 350575, 320401, 271812, 163530, 205922, 175067, 184610, 363883, 514837, 310568, -12994, -90843, 80355, 232813, 219306, 147807, -84361, -254242, -116026, -14764, -22395, 143079, 397047, 453110, 444269, 422698, 305890, 340648, 304094, 122409, 21977, -133266, -56238, 161503, 336757, 330771, 201645]
7956B01645P8194O217m0189J17281j65555j98359J59359N5257j59905N1549L8723
7945A44217n3799J459L2137J54642J45111o6220p1561J48197K0439k29320q6812
7934A38490l6677N6528M7521j65J28579J6676q2129j54560J22423K39860O8965
7923E45511j38061n0823j27296k46231m1906k354K1469J63734Q8288j19431J21024
7912B13924J03607j61196p1500K9067m1528j4555k4298M9391K2728r864J6996
7901A12772J3275P0475R5431R4228o440j10346r0085J0276r9391O1919O1872j28545
7889H5441Q9666J68572n3420r439P1005k7686r0225j79108m0303R3503M0630q976
7877A39660p6113J49250M6495L0121j27617J37488P3309q4124p4565L5871j4918
$$ y = [201645, 279839, 286056, 245867, 363148, 197593, -766, 158593, 213850, 53945, 105494, 144217, 90418, 91877, 124014, 278656, 423767, 357547, 285986, 434183, 454622, 225302, 138490, 101813, 158341, 205862, 205697, 334276, 350952, 268823, 114263, 236686, 476546, 545511, 407450, 356627, 229331, -16900, -58806, -61160, -39691, 124043, 212331, 92900, 213924, 317531, 156335, 84835, 113902, 72374, 57819, 33521, 82912, 105640, 95776, 112772, 126047, 196522, 291953, 386181, 379741, 269395, 179310, 189586, 90195, 152114, 213986, 85441, 175107, 343679, 290259, 280820, 351825, 324139, 233914, 54806, 14503, 108006, 148636, 139660, 63547, 212797, 259292, 289413, 161796, 299284, 372593, 288469, 213904, 249775, 234857]
7866B34857N2420P7659O5213m3566k25698p6125q5561q6154M3965J75506J40894
7855B73410J16849r756j89083m2434J25623n027R1948M6718k6752l6534L7595
7844C82557o3381j39405o6131l7708j1932J19911R3590j19078n9925O1177O3847
7833B23522n9620k06098n9543J11173J33984O6689m9089l0496k5505N0022r4899
7822F0140j43764l0399R5589O7536L9430k4372L4102p8490m8505J9464L8520j34270
7810a05019o9767n0190J75744Q8033K6475O1952J63928M8382j92269j44289j38306
7799a35326O7385J17124j8873K12141J88240j18475j33390n101L0164j20684j31085
7788d7880m8239J64530Q8435o0497r8078L792k8469o1896J05177r538j15443J15787
$$ y = [234857, 287277, 364936, 430149, 386583, 160885, 84760, -801, -86955, -42990, 132516, 273410, 390259, 380503, 191420, 148986, 274609, 269582, 361530, 408248, 381496, 344962, 382557, 319176, 179771, 113640, 75932, 64000, 183911, 277501, 158423, 98498, 159675, 223522, 163902, -42196, -101739, 9434, 143418, 210107, 161018, 130522, 105017, 155039, 60140, -83624, -114023, -18434, 49102, 88532, 64160, 98262, 19772, -28733, -9269, 29251, -105019, -174786, -224976, -49232, 38801, 65276, 127228, 291156, 339538, 147269, 2980, -135326, -67941, 49183, 30310, 242451, 430691, 312216, 178826, 173725, 203889, 83205, -47880, -96119, 68411, 156846, 96349, -1729, 2063, -26406, -88302, 16875, 7337, -108106, 7681]
7776G681O158J785q1573k3423j49650l6789K07211J35017q1083l8251J75581J20102
7764B42766O2375l5893j09016J74858P0996j94399l0806l8154j43055N0835K23796
7753B74303n8290m7519J37844m6253j66154o3397J15786P789k41565j22462J32830
7742g7088J67904L6507q3350L3494l1931K7416R885J73959l0639j75782n1594
7731a219k03064m3716J37146K29825J01303j52752j49727p8785L5688n0254M4077
7720a31478J1099P8329j4820O4991k2526P0831j355J07748r2956l1770n0157j41809
7708a53873j06224k783N5309J82818O113J41863q097r1282j65837o4836J15823
7697i1006m309L36086Q4233R497j5830j59790O8258J05556j68600l3700n8172
$$ y = [7681, 13839, 15624, -65949, -89372, -239022, -275811, -68600, 66417, -14666, -52917, 122664, 242766, 305141, 269248, 160232, 335090, 406086, 211687, 180881, 142727, -328, 50507, 274303, 216013, 168494, 306338, 260085, 93931, 30534, 146320, 154109, -87456, -209918, -77088, 90816, 127323, 43973, 77467, 45536, 72952, 82837, 256796, 226157, 50375, -1219, -204283, -247999, -110853, 118972, 220275, 67523, -82204, -160989, -125301, -175555, -131478, -120379, -42050, -56870, 8121, -14405, 56426, 55071, 162819, 69863, 38093, -12064, -153873, -260097, -262880, -207571, -24753, -18640, 123223, 115126, 23844, -141993, -206829, -91006, -95315, 240771, 325004, 334501, 318671, 158881, 227139, 332695, 164095, 130395, 72223]
7686G2223r9202J13944L252k0006q5299l7098J19602M5061R1958J49512n7372
7675B96575l6341j19481J08423Q978o9970j6323O4481M7312n7729j76336j42028
7664i2439k5677J58077N4996Q3768M4286l254M2587J06035o1346j59950j63633
7653a6550O8313o092r0665L6722k0385n7659q51K36692K06918p2551j62086j66033
7641d4227j9272O4678R940Q3466m8165l6527L4587K6819P0415R5566j4564O2058
7629B84774k4797n4704l4929n2569N2071M8543j8590k01350K7273J04513n1181
7618G9054k82824p3884K96910J99016o2532j91740O8939m4784k3901J68896k839
7607A30311r7166j4113p680j51366J26606K12486j554k1918o3809j30755j01511
$$ y = [72223, -26979, 86965, 90217, 70211, -15088, -52186, 67416, 112477, 204435, 353947, 296575, 260234, 140753, 249176, 258154, 188184, 171861, 236342, 283654, 225925, 49589, -92439, -118116, 39961, 94957, 178725, 223011, 219757, 262344, 368379, 307033, 147083, -16550, 51763, 45671, -44994, -8272, -28657, -86316, -87167, 149525, 356443, 283892, 121806, -44227, -63499, 1179, 11119, 94585, 46420, 9893, 44480, 71299, 141714, 237280, 222716, 284774, 259977, 205273, 170344, 117775, 169846, 218389, 199799, -1551, 25722, 130235, 79054, -203770, -277654, 19256, 218272, 155740, -36000, 32939, -11845, -35746, 133150, 130311, 33145, 19032, 11352, -140014, -13408, 199078, 197524, 175606, 111797, -18958, -120469]
7596a20469j6225m4998J59025J31512J25875j30037m4118j18217j06013K0393
7586a43272K6194k1540j295O0966N2417n3444J87777m3243M3537J14373j13045
7575A09425j11783N7510n1425j03766K24468O2545K8388P8905M4633n4079M2290
7564C27111j25722j97610j0566J19818J48384K9822j5415j47r9637j37044j29995
7553i1001J29495N135N6104P7558j46001r2778O6724j25108j05116J08338R9083
7542a7567J118K4812J21778l558p1078m2047o7809n7986J4680n8784K1769J9146
7530a15526j2810P3510n9749j3402J61906R3635p9675j6974j55535r592J08235
7519b5977N1786J37737R4112j06863P087p7349k30184o9612P9182j9927P2350
$$ y = [-120469, -136694, -181692, -22667, 108845, 234720, 104683, 60565, -57652, -163665, -143272, -117078, -138618, -139913, -78947, -26530, -79974, 107803, 64560, 108097, 222470, 109425, -2358, 55152, 3727, -100039, 124429, 186974, 215362, 294267, 338900, 284821, 327111, 201389, 3779, -6787, 113031, 261415, 291237, 275822, 275675, 176038, 38994, -91001, 38494, 43629, 99733, 177291, 31290, -61488, 5236, -119872, -224988, -116650, -17567, -16449, 8363, 130141, 126583, 55505, 13458, -54351, -112337, -97657, -156441, -134672, -115526, -128336, -54826, -114575, -127977, 33929, 127564, 47889, 30915, -124620, -134212, -25977, 25809, 163546, 257658, 150795, 157882, 80533, -149651, -219263, -140081, -160008, -87658]
7508h7658N6433J394L2451O5269J776o7431k3355j40530q0503J56870J63271l9800
7496C8187M3409K37037l6564r3378L8060n8713j0662j92739j06341l0859n0600
7485b23163J7389R006K6313n5838N6938o8287O5318Q0417N222K5029M2215P0285
7473E0844M472j16447k85266k5013P1779J21775Q6433O9042m3100N6207p7151
7462h6425L0793n1769j5346K4048M7893L2587l0222J07647J11572M149q9841n2211
7450C2875j28008j1184J4031j39152L3106J9162J27385J35721k4921O5555L3809
7439A58379j77195N910M8348m4883P9884N8258j7267j5334k6550m8164o5506m8876
7427i2996L8716l2967r7442n1291K81922Q5390r4869p516l5582L0625L8592J1290
$$ y = [-87658, -31225, -29831, 2620, 67889, 69665, 2234, -21121, -161651, -242154, -85284, 77987, 38187, 81596, 318633, 282069, 188691, 226751, 168038, 157376, -35363, -141704, -172563, -223163, -205774, -196768, -170455, -226293, -169355, -237642, -172324, -91907, -86685, -61656, -19441, 50844, 55316, -61131, -346397, -371410, -299631, -177856, -91423, -22381, -65481, -9274, -86425, -55632, -107401, -122747, -98699, -50806, -18219, -48441, 59206, 170778, 174927, 85086, 32875, -95133, -106317, -92286, -231438, -198332, -179170, -51785, 83936, 59015, 124570, 158379, -18816, -12906, 35442, -9441, 70443, 128701, 111434, 96100, 69550, 21386, -44120, -92996, -54280, -87247, -184689, -235980, 45942, 131332, 36463, 28947, -6635, 23990, 62582, 73872]
7415G3872p9103j25650M5943N5441M8393l8606J29285J6162R6763j09781l2451
7404H0268m9921r0186k65023l9847r7749O0375J40685J06525M6384J13528l3566
7393b8527j04475N5705L0430J02921K6658M5307j51045l2205J03323N5828j46073
7382d2153M3149j1514M9309m3145k8360l5632Q8607R6256J3161j74145o240J486
7370d9221K989p1241O3994J78463M6029P850P8556j05733p9616m613j6268J4083
7358F5272m972N7737o2125P4270j24838l7903K594n2715K31506k2286q4470n1984
7346i914k9077K9423P5942N9706P8680n6760j02215j27393j7959j03445n3997
7335b57009M7894P0785L2665p953j03192M4154J58217Q7022k9631n6101R9112
$$ y = [73872, -5231, -130881, -84938, -29497, 18896, -19710, 109575, 125737, 222500, 112719, 80268, 30347, -59839, -324862, -364709, -462458, -402083, -261398, -154873, -108489, 5039, -28527, -133002, -77297, -46867, 56054, 82712, 128019, -23026, -55231, 48092, 103920, -42153, 996, -10518, 38791, -4354, -32714, -68346, 20261, 116517, 129678, -44467, -50707, -49221, -46232, -117473, -53479, 124984, 171013, 178863, 257419, 151686, 72070, 67457, 51189, 65272, 60300, 118037, 55912, 130182, 5344, -32559, -29965, -82680, 148826, 126540, 42070, -9914, -38991, -9568, 66374, 126080, 204760, 148000, 45785, -81608, -99567, -203012, -257009, -209115, -138330, -105665, -113618, -216810, -172656, -14439, 72583, 42952, -13149, 85963]
7324H5963p292o4762k46957j26710k6017J59958J97698M7645k0615J75412L0884
7313B05207j1188j67215K552j08473m8628j21570J4669J51063K54312J14135M8712
7302C33576j16798l2396J0275j82247j96365k5205K49868j94250m2619O7524J67449
7291C8812K4181K2261m3619j57432J68343P8828K5151J3294j08516O9237N5926
7280A86466p302l2256j5695r9344J900l9514j36236R0795J94951p2747j24242
7269e3224j8106j16066N3458P2841m0729P1237O725L3940J7826j11442K2868K5847
7257c4825o1734L1055j00072M2690p8889K4072J1167o0389O668j2260J15331r5176
7245b12362J48586J4705q952n3544m3558J75377p2770m4388J14037J40701m246
$$ y = [85963, 78671, 13909, -233048, -359758, -385775, -225817, -28119, 19526, -1089, 174323, 205207, 194019, 26804, 29356, -79117, -127745, -249315, -234646, -83583, 170729, 284864, 333576, 216778, 184382, 194657, 12410, -183955, -209160, 40708, -153542, -196161, -128637, 38812, 62993, 85254, 41635, -115797, 52546, 131374, 156525, 169819, 61303, 130540, 186466, 179164, 146908, 131213, 31869, 33769, -5745, -141981, -51186, 143765, 71018, -53224, -71330, -187396, -133938, -61097, -101826, -30589, -23864, 10076, 27902, -83540, -60672, -34825, -96559, -65504, -165576, -122886, -201775, -177703, -166536, -226925, -220257, -232517, -117186, -212362, -63776, -49071, -58023, -111567, -155125, 20252, -52518, -96906, 17131, 157832, 153586]
7234A53586o1862j23594j25963K99497N6183j64640P2873M0647j00168k1320K1167
7223D6406q274o2548J9613j5312p7272j5991K2805Q7952J30930m4767j78158r9811
7211a94427K14352K3588k8802J28072l4484l2433K7728O1599O5932m5316j96788
7200a0979q4544O2591J61216n4062N6077K9493J16368j36294j76208n1322p0633
7189a58297O2173j57594J16573K84134L5308j45525o2219J0200p8346K1482J11728
7178C9617K9051l8575N1442q3948k01244q4200j8320J13092J13413J50802J03602
7167A74732K9790l1857N344j77496J0925n8317k9770K34998J4515j75101k3415
7156b5652j56972M5503K97754P6777j6373n6348N8780j33667k2881L7706p7249
$$ y = [153586, 91724, -31870, -157833, 141664, 197847, 33207, 106080, 146727, 46559, 25239, 46406, 38132, -24416, -4803, -20115, -97387, -113378, -90573, -2621, 128309, 83542, -94616, -194427, 19925, 43513, 14711, 142783, 108299, 75866, 103594, 165193, 231125, 185809, -10979, -95523, -32932, 128284, 74222, 130299, 159792, 276160, 139866, -36342, -87664, -158297, -96124, -253718, -137145, 146989, 182297, 36772, -25447, -15247, -93593, -72111, 39617, 68668, 30093, 81535, -2413, -203657, -287857, -306177, -193085, -79672, 71130, 174732, 204522, 172665, 178009, 513, 11438, -46879, -76649, 158349, 172864, -2237, -25652, -182624, -137121, 160633, 237410, 221037, 164689, 223469, 89802, 66921, 104627, 27378]
7145B7378K2849N0970l3619P8511L4532j43347l9549l8321J56002N9203K7870
7134B02479r865O6740R6027q0105r2047j12633p9390k5986q3462O7926j7855m9970
7122a18141O6129J19597n8155N8536J05257k159k22257K3595K9346k501j21721
7111a22474K12176J46068j0327N2259J5338j39951j18275K0829k0968j13143l2593
7100a11061O6235j0143L1646p8136j656o7491l1866j20448J46643R8614j51763
7089b29426o9311O643l9500J78290J05559J73263K06836p6446j85438o0522M9941
7078E9889M5182n9159m2801j1256p6904j64087r759J91425J32928j01069j211
7067c6822o3891r4608q0167O8432J17995N414j8296J01220J65185O475J7089l4352
$$ y = [27378, 50227, 101197, 67578, 146089, 180621, 37274, -2275, -40596, 115406, 174609, 202479, 192614, 259354, 355381, 275276, 183229, 70596, -8794, -34780, -118242, -50316, -68171, -118141, -52012, 67585, 9430, 67966, 173223, 171064, -51193, -27598, 1748, -753, -122474, 89702, 235770, 225443, 277702, 293040, 153089, 34814, 55643, 34675, -78468, -111061, -44826, -54969, -23323, -101459, -103115, -170606, -202472, -322920, -176277, -77663, -229426, -298737, -292094, -331594, -153304, -47745, 125518, 332354, 255908, 70470, 9948, 59889, 105071, 45912, 3111, -8145, -85049, -249136, -258895, -67470, 65458, -35611, -36822, -100713, -195321, -275488, -207056, -89061, -83647, -101943, -723, 164462, 170937, 188026, 153674]
7055A53674m6670n6318k20181N2302N6281J74423Q8030j72688J097q5770K8436
7044b7384O1510M0907L362K20030Q0729j65899j52882j01209j33009q9824J12595
7033a51074j1694m9108P1734J15500J50182P7991j00673J03529j04957l01535
7023b00105l10J45218K03755p1047M5026L0358j547o197R3463J8456J0862j26529
7011A41403j44839l6061K9054N1566M3733J10328j78164q9853P6480n3648j06493
7000a56494L7950L5008j34769J20684J75949r3533k55506p5396J19077J20033
6990a06997q5504j05253m0866r5487J75245L84051M2156N6825P0979q2347K0526
6979B33328Q7154k02668k78059l6666J06776Q0847j01246J78900m1127L7204M8323
$$ y = [153674, 107004, 50686, -169495, -117193, -60912, 113511, 201541, 28853, 29950, -55820, -27384, 34126, 75033, 78395, 298425, 379154, 213255, 60373, -40836, -173845, -263669, -151074, -162768, -211876, -140142, -24642, 125540, 203531, 102858, 206387, 101430, -200105, -200415, -55197, 148558, 77511, 122537, 152895, 151348, 145151, 238614, 257070, 267932, 141403, -3436, -39497, -10443, 41123, 84856, 195184, 17020, -72833, 3647, -50001, -156494, -118544, -83536, -218305, -97621, 78328, -15205, -270711, -346107, -227030, -106997, -192501, -297754, -338620, -434107, -258862, 125189, 167345, 224170, 295149, 212802, 233328, 320482, 117814, -160245, -196911, -90135, -9288, -110534, 68366, 27239, 64443, 112766]
6968A12766j65866k3592K4614k9720r485l8588n0832m3191p959J87727J73498
6957A29372R35m9454j02351k88557J7492n891j94113Q8025J38129R2916J24929
6946d8568M6232j04747o8014Q5041P4234O7723j09369q6290k7595m8486r0636
6935c10475J68787L24222P2115J5783p3561j71900q2253P4618K7478j04142k3262
6924h2590o5567m0462l432Q7202j8849l3042j28391l097J59029J56661P9725k8476
6912G8711J24759n9937l5364N2293j02569l3775q287j7923k292k7104L9329j22434
6900a14593o0116J84358O6155j5932n4165j40595m9852Q4070k5694J07505K69880
6889B51021Q5417j04216j46079o8447j03272r0779o4540P9688O9177r697p3701
$$ y = [112766, -53100, -76692, -52078, -81798, -91283, -129871, -180703, -223894, -231853, -44126, 129372, 130307, 80853, -21498, -310055, -292563, -298454, -492567, -404542, -266413, -173497, -48568, -2336, -107083, -175097, -90056, -15822, 51901, -57468, -143758, -171353, -219839, -310475, -141688, 182534, 254649, 270432, 196871, 24971, -57282, 17336, 44814, -59328, -82590, -148157, -188619, -192051, -104849, -123698, -156740, -285131, -288228, -129199, 27462, 107187, 78711, 203470, 143533, 108169, 160462, 57893, 24118, 15831, -2092, -4384, -31488, 7841, -114593, -174709, 9649, 75804, 59872, 5707, -134888, -184740, -100670, -126364, -18859, 251021, 336438, 232222, 86143, 17696, -85576, -176355, -240895, -161207, -92030, -101727, -175428]
6878a75428R8233J76743o3908l19227R777K87898N4374p6246j29770n9273J4461
6867a82366O8211K2671M0642M6577O7732L827r3334l3276L1216j59853K0605O2441
6855a04907J1054K2561R6734q882K8992J5446o7545l0247O505K8753J29697J29791
6843B57952P8923p0895j17650p8100O6172P0554q5434m4369N3397j30408K1963
6832B2105Q5870q3465k67503j54661Q0884J38588L0377J11607P6383r0398n4030
6821a04243J53038O1412J8863j33569j8605J4585q735j64800R4352R9679r6251
6810h4274j83033j15966K05351L67352M9792m8010m7918l3767j54334q4388k2732
6799a51927N9808K28512P292j8153k9372j38179o0638p4615J18120j10944k4178
$$ y = [-175428, -77195, 99548, 35640, -283587, -273810, 14088, 68462, -7784, -137554, -196827, -182366, -114155, -91484, -50842, -4265, 63467, 67294, -26040, -59316, -28100, -187953, -167348, -104907, -93853, -71292, 25442, 16560, 45552, 60998, -6547, -36794, -30289, -1536, 128161, 257952, 336875, 265980, 148330, 70230, 136402, 206956, 121522, 77153, 130550, 142, 22105, 107975, 24510, -242993, -397654, -316770, -178182, -147805, -36198, 40185, -50213, -104243, 48795, 110207, 129070, -4499, -23104, -8519, -17254, -182054, -87702, 11977, -84274, -267307, -383273, -177922, 189430, 239222, 191212, 143294, 109527, -44807, -129195, -151927, -92119, 136393, 143685, 125532, 96160, -42019, -102657, -177272, -59152, -170096, -194274]
6788a94274J02594L4256j0078j3517l5161J44476K7186r3480o3030J23979l7811
6777a4860L8493k0140k5262m5344J18436n1096N0031n7342l6466J7699P5908Q6788
6765A36845j25772P0947K09621o3240k33689N3657M4411K5002o4068l9473l8091
6754b3850r332O1002J04532O893M7946j18306P8087L5400o5718J22574J01574
6743C40802N7816o3291q9025M0410K8911L4810j38116n3609J16848K57359P7262
6732F10177P3704j0027P5036J0379n1455J09363L82305L69522N85502O49841P11999
6721C516346Q90226O78305Q7933p89962j067439p37236m58874m72188j69656j72744
6711A304711j70305k07369k13937J05228M6525j39806j22216q5537L3964l2027
$$ y = [-194274, -91680, -57424, -67502, -81019, -116180, 28296, 55482, -37998, -101028, 22951, -14860, 23633, 3493, -21769, -67113, 51323, 227, 50258, -7084, -43550, -25851, 50057, 136845, 11073, 82020, 291641, 228401, -5288, 48369, 92780, 117782, 53714, 14241, -23850, -33182, 27820, 132352, 139245, 187191, 68885, 146972, 182372, 116654, 239228, 340802, 398618, 335327, 246302, 286712, 315623, 350433, 212317, 158708, 275556, 532915, 610177, 683881, 673854, 748890, 759269, 707814, 817177, 1199482, 1569004, 2154506, 2804347, 3516346, 4406572, 5084877, 5172810, 4382848, 3315409, 2578173, 2119299, 1647111, 1477455, 1304711, 1134406, 927037, 713100, 818328, 864853, 725047, 602831, 517294, 551258, 519231]
6701E19231J0937m1462J3788p8672r0492K1231M546R3086j6969q3535p7810J08006
6689C81885M1938o6935n5137R8101j3265k1465L5960L0012p4577p7508R494k2600
6677B65903l3127m2023l9292R5311l2979j22577L0391P6690l2731m2431n7203
6666F5932n5752P1713J3353n0691m8660j21446J06788J57973L568o6149K3583
6655A00212p324L5280o5699o6390J8942N481r9482n5700Q5111n8830O0232o2311
6643a10478N5818l1667j8688J55279O2704m7479k35249j79716K07786J89614J3809
6632F1733K5223n8388Q3011J21311j13073k49127j87199m4469J46238n99Q0320
6621a35019O5023l8107N597J490j01960j98376q8503M0021J64628J63852k5561
$$ y = [519231, 530168, 488706, 502494, 423822, 333330, 354561, 359107, 452193, 435224, 351689, 273879, 381885, 423823, 356888, 301751, 399852, 386587, 365122, 401082, 431094, 356517, 279009, 288503, 265903, 232776, 190753, 151461, 246772, 213793, 91216, 121607, 198297, 165566, 123135, 65932, 10180, 81893, 95246, 44555, -4105, -125551, -18763, 139210, 142778, 76629, 100212, 92888, 128168, 62469, -3921, 15021, 20502, -78980, -134680, -49569, -108399, -48167, -110478, -54660, -86327, -105015, 50264, 112968, 65489, -169760, -349476, -141690, 47924, 61733, 86956, 28568, 111579, 232890, 119817, -129310, -316509, -360978, -214740, -215339, -135019, -69996, -108103, -102506, -101016, -202976, -401352, -489855, -449834, -285206, -121354, -146915]
6610a46915N6200J91112N7238K6737q485J22531j58026j52984J30449J62258r136
6599B70979m8175n8967j28170l8547j0039J07822J79302K868j97591k1164P4008
6588A32326J8897K2357k71698p0935J41877j71648o0189Q0459J10647p1390r8737
6577b38034M6633K19046J49433J28416N7863j88115j48401M0023J37232J7126
6567B21222o7197m146j5707k0563l7532j43575j3184L8927P7930M6125N2386M0239
6555A74925R1023L0402j10015j89564l0562K2554p9041j2767K42196L8312k43064
6544f5601k66535K01758K05614J05181L3467j31251r0588k7841r9589J7962j29935
6533b47358l3260J42561P1054K864N4525J53881j38426r2452m7097j3381R7506
$$ y = [-146915, -90715, 100397, 157635, 184372, 175887, 298418, 140392, -12592, 117857, 280115, 270979, 222804, 163837, 35667, -2880, -12919, 94903, 274205, 277073, 79482, 58318, 132326, 151223, 173580, -98118, -169053, -27176, -198824, -259013, -178554, -67907, -139297, -238034, -191401, 27645, 177078, 305494, 363357, 175242, 26841, 66864, 204096, 221222, 154025, 149879, 134172, 113609, 76077, -67498, -80682, -41755, 36175, 82300, 134686, 174925, 265948, 296350, 186335, -3229, -33791, -11237, -90278, -103045, 139151, 177463, -65601, -332136, -130378, 75236, 180417, 213884, 82633, -7955, -35796, -135385, -117423, -247358, -280618, -138057, -67003, -64139, -9614, 144267, 5841, -86611, -133708, -147089, -49583]
6522d9583n2247l3417R4505J24232L3409j38287l2051J16529N8681j6367k46020
6511a40616j36175k2339O2497J47720J3055r0628j43275J1956K04065M8227J19058
6500G3545J9770R3399o5346j03939j36668n3372p9116j63489J86070K38533R3047
6489A02434o9172R2542M6293j24320K33759J16479P9853j46626m14223j58141
6479b41122K00437j37548o0884r8846O3279J39510M0159k07732J81958L71149
6469B50360M8865j7850J1826m4899l8345j05681j31115n6980K6626J0375K29640
6458A82822j2671j50410k43264j8433K06092L9591J3659J0957J12173N1473j09566
6447H2423o9180q7541P925q6482J67994J84253k2297o9220j89883n3990m1169
$$ y = [-49583, -101830, -135247, -40742, 83490, 116899, -21388, -53439, 63090, 121771, 105404, -140616, -276791, -299130, -236633, -88913, -75858, -166486, -309761, -297805, -93740, -45513, 73545, 93315, 186714, 121368, 17429, -119239, -172611, -251727, -415216, -229146, 9387, 102434, 33262, 125804, 172097, 47777, 281536, 398015, 477868, 331242, -82981, -241122, -40685, -178233, -239117, -337963, -274684, -135174, -95015, -302747, -120789, 250360, 299225, 281375, 293201, 248302, 209957, 104276, -26839, -83819, -57193, -46818, 182822, 170151, 19741, -223523, -241956, -35864, 3727, 17386, 28343, 140516, 191989, 82423, 13243, -74298, -66373, -152855, 15139, 199392, 177095, 107875, -82008, -135998, -177167]
6436a77167J23772J04482J8009n1254j50794r564J48878M3226r9917o3311J4262
6425i9378N0853J11814O5980N3689j70905r4373o5394N9771J2464Q623Q0189L3539
6413D6872j76344N5890J23833L0869J23616j8739o1768j07760L0211J643J34914
6402A83237J93460q4197j50454j21173k0595k2432J0053K3122r4111j26370o3342
6391b72802r3634P0591J35166Q9344n9276L5522P8076P8523k42k7047J48426J13142
6379B95789j9336q8945r8031j9910r7099o2729M343r2660J6001J14446K3848j26122
6367a50405J64907m2569p2242L635N1261K7350j4148j03378O0598J63179J53190
6356B41378L4781j22304l5570k91404L9990M271P7522n9872j57620l5744J66408
$$ y = [-177167, -53395, 51087, 69096, 17842, -132952, -142516, 6362, 49588, -50329, -113640, -99378, -48525, 63289, 129269, 182958, 12053, -82320, -147714, -87943, -75479, -66856, 13333, 46872, -129472, -73582, 50251, 81120, 204736, 185997, 124229, 16469, 46680, 48323, 183237, 376697, 292500, 142046, 20873, 278, -22154, -12101, 11021, -83090, -209460, -272802, -366436, -295845, -160679, -71335, -130611, -95089, -17013, 61510, 61268, 34221, 182647, 295789, 276453, 187508, 89477, 69567, -27532, -90261, -85918, -178578, -162577, -48131, -24283, -150405, 14502, -28067, -100309, -96674, -45413, -18063, -32211, -135589, -74991, 88188, 241378, 276159, 153855, 118285, -173119, -133129, -128858, -51336, -111208, -268828, -304572, -138164]
6345a38164J83559O7258r7547k9607K5533n2656K6224q707r0465J40846N0765
6334G7039l7672q9379j23315J95913L5478n9258R1171k5386j56000k4183j09571
6323b25163n5661N2061k9797J6057J60380Q6139J377J02657J3872j5838l5803
6312G0281j57229l3225P7237M4930J24904r3944q5185l5275j00771J55255R0469
6301E7447l8830r8310j26469m0567J4941j85488j4363J80794J80207M3008k53325
6290b80955n3240N7971J0660J03364J23217O6898r2355L0689p9638O673J9025
6279h7691L5703Q093P7442j26019q7627J68048M1005p9619n7460J3516J77483
6268H2874J36641j28737N098p5844p0292J9667j24677J26771O3026K9838J2135
$$ y = [-138164, 45395, 112653, 15106, -14501, 11032, -41624, -15400, -24107, -114572, 26274, 77039, 39367, -50012, -173327, 22586, 58064, -1194, 89977, 64591, -91409, -115592, -225163, -280824, -228763, -258560, -242503, -82123, 4016, 5393, 108050, 121922, 106084, 70281, -86948, -120173, -42936, 1994, 126898, 32954, -52231, -87506, -188277, -33022, 57447, 18617, -79693, -206162, -246729, -231788, -417276, -431639, -250845, -70638, -27630, -280955, -334195, -276224, -265564, -162200, -38983, 27915, -64440, -33751, -113389, -106716, -87691, -51988, -43895, 33547, -92472, -180099, -12051, 28954, -50665, -108125, -94609, 82874, 219515, 90778, 95876, 20032, -50260, -30593, -155270, -28499, 34527, 64365, 76500]
6257G6500K974K6160o8903k16408k18262J18439n7473J48606K22355j12343O9206
6246i149L4978K3414J0871j49257j2402n0467m1475M6126m6823j65426n1544J99577
6234b11577J53392J58139K1984l3251r2830L1303O486J8922J8598L589J44763
6223B19518J8015m2906r6961k00056O0616Q313j48211l5322R2923O8819P4743
6212A9491j4604M68j24572j17732m7262R5979J55896M3823j05625O8121J7074
6201h943n0650j43770k4460K0424O252K13848K01001m4114q9340j16762K5532
6190a0982J9984n779l0463k9306L2384j10737M8493L3337Q7855M5872k16909m7900
6178a84151R4442J34998j1361j39902o0942J5843J9095R7066J9207q4945J40368
$$ y = [76500, 79474, 105634, 36731, -179677, -397939, -279500, -336973, -188367, 33988, -78355, -9149, 25829, 49243, 60114, -89143, -101545, -152012, -193487, -147361, -194184, -359610, -411154, -211577, -58185, 99954, 121938, 88687, -4143, 27160, 33646, 52568, 71166, 74755, 219518, 237533, 194627, 97666, -102390, -41774, -33461, -181672, -216994, -124071, -55252, 19491, 4887, 5355, -119217, -236949, -284211, -188232, -32336, 11487, -94138, -26017, -8943, -59593, -203363, -227823, -207399, -201147, 12701, 213702, 169588, 80248, -36514, -10982, 9002, 3223, -27240, -56546, -24162, -134899, -86406, -53069, 34786, 80658, -136251, -184151, -89709, 45289, 33928, -105974, -166916, -151073, -131978, -34912, -15705, -100650, 39718]
6167C9718n9543k7447J32941k2218p4185L9976j12665L1987J04138Q2266q5962
6156D9006j51020j95891M8560J36772j52187K5927J75650J07009R2311j07746
6146B8391k04223l0060L5750J86003R4498N4441O1571j49197j47768M1422J17298
6135H8126K198K0665j71566j25737L045P9899q7485l8700J42105j8110K11371
6124A05811J80976m2489k05612j76337o1529J84432N8594j55744o3861J30184
6114d5575l6707j60095P6381L5199p5498K0324J05066m7754o1222M4353J13636
6103c1892k3302N0620k07826K02007J08503R0800p1940o498j50846l1164J52769
6092H1231m0468q7040J38535K0693m2304J1043n0126M3851n4546r7605O9189O9336
$$ y = [39718, -19825, -47272, 85669, 63451, -10734, 29242, -83423, -51436, 52702, 134968, 49006, -102014, -297905, -249345, -112573, -264760, -238833, -63183, 43826, 136137, 28391, -175832, -205892, -170142, 15861, 110359, 164800, 226371, 77174, -70594, -29172, 88126, 90324, 110989, -60577, -186314, -183269, -103370, -190855, -229555, -87450, -105560, 105811, 286787, 244298, 38686, -137651, -199180, -14748, 43846, -111898, -175759, -45575, -82282, -242377, -165996, -130797, -206295, -185971, -80905, -128659, -189881, -145528, -31892, -55194, -4574, -212400, -10393, 98110, 188910, 116970, 110472, -40374, -71538, 81231, 40763, -46277, 92258, 112951, 70647, 81690, 31564, 75415, 20869, -76736, -7547, 61789]
6080F1789p5288k1491J77204j03013k26440o5352M0137J04359k1594j3732l8968
6069a82389K4564k4326j7502r6645k6410m8470M7162J33025J08970L9841r3186
6058a35366r9900j20866J38416R2739N6707M5637K0951O6552p3700j8777J66056
6047A38449K2526J06594P4965M444n1372k5924j01722o0204J5626q3704r8637
6036e8959R3527m2911L1930n6604m615q562K2578j37986l5812J65549l7316P1662
6024B481r0245q6038N6747J37683L0057j01664M7353j3058p1287O713j29992Q9493
6012a21757J00234o8907Q66K9437j9455l5053j06047K0058J67956Q1698J44856
6001A93886m6120P0137j3856j18724q1433K0713L0486j47461k08418K09822L0614
$$ y = [61789, -13499, -34990, 142214, 39201, -187239, -252591, -212454, -108095, -129689, -143421, -182389, -157825, -182151, -199653, -296298, -322708, -371178, -324016, -190991, -82021, -42180, -135366, -235266, -356132, -217716, -124977, -68270, -22633, -1682, 64870, -8830, -27607, 138449, 160975, 267569, 342534, 346978, 295606, 269682, 167960, 107756, 123382, 39678, -58959, 34568, -8343, 23587, -33017, -37632, -46194, -23616, -161602, -197414, -31865, -69181, 2481, -87764, -173802, -117055, 20628, 50685, -50979, -3626, -16684, -87971, -81258, -211250, -121757, -21523, -90430, -89564, -60127, -79582, -114635, -220682, -200624, -32668, 49030, 193886, 147766, 217903, 204047, 85323, 3890, 24603, 55089, -92372, -300790, -90968, -60354]
5990f0354k1960j1017m051J75174J84219j3305j31913j54811N0902K0055M4829
5979G7768l4938J2783p961k02410J8404J72977n8641k5523r5748l5573M6563N6332
5967g5967o692O692K6479J91986K9242j00256k9626j29948j35894n9906L9723
5956b44167J63600Q4992Q4685k9215p7170k61385l232K15738P5641j07960M4280
5945e4193o2216j05412L0881J30869J34531J88657J98414j50187p7715j71585
5935F2044m8671j519q9824M0560J10795J12847p5719j46317o4303M8881K9881
5924b1345J13310M9428m1045j01601J01882K7838j79731J26251L2573j43702n4513
5913i0655J09450j300Q8829Q7767m6522O333j4547O1971j35205O491P665l0322
$$ y = [-60354, -82314, -93331, -97382, 77792, 262011, 248706, 116793, -38018, 12884, 32939, 77768, 42830, 55613, 47652, -154758, -136354, 36623, -22018, -47541, -143289, -178862, -132299, -75967, -82659, -75967, -49488, 142498, 171740, 71484, 41858, -88090, -223984, -283890, -244167, -80567, 4425, 89110, 59895, -17275, -278660, -281892, -66154, 9487, -98473, -54193, -116409, -221821, -190940, -60071, 74460, 263117, 461531, 311344, 233629, 62044, 13373, 11854, -77970, -37410, 73385, 186232, 110513, -35804, -100107, -51226, -21345, 91965, 141393, 100348, -1253, 100629, 128467, -51264, 74987, 107560, -36142, -90655, 18795, 17495, 106324, 194091, 147569, 153902, 139355, 201326, 66121, 72612, 80277, 49955]
5901D9955L8348k6464j48650J5785O4786L5618J8357N7893j59074j69K9956L7545
5889A3886j5895j04662p9499P7143L8083j24708j67660J02088J51837J99364K48614
5878C38591j50741p8844k436k0900j01565P2147J12161j17539L1534J15614K4545
5867B22567K3034j37372r5185Q5884N894L4011r1103j56929j3396j2518j04886
5856b39999o8144K10406M407m9206J04993k8456k85038J07221j5379J38975L227
5845a16993N377m6845q7443j561J73451O7194R8843Q0733O5764r6055j41999j82591
5833a82125J27479K08852J18584n4622r1018P1321r1937j56381q8904N1000M3248
5822d4503r475r0483O7607l9948J3982K28307J26899L7688k21200j65846J72245
$$ y = [49955, 88303, 61839, -86811, -71026, -6240, 29378, 47735, 105628, -53446, -53615, -23659, 13886, -2009, -106671, -186170, -109027, -70944, -195652, -363312, -261224, -109387, 89977, 338591, 187850, 109006, 106570, 85670, -15895, 56252, 168413, 50874, 82408, 198022, 222567, 245601, 108229, 13044, 98928, 104822, 138833, 47730, -109199, -122595, -135113, -239999, -308143, -97737, -93330, -142536, -37543, -65999, -351037, -243816, -259195, -120220, -116993, -111616, -158461, -245904, -247465, -74014, -6820, 92023, 172756, 238520, 142465, 466, -182125, -54646, 154206, 272790, 218168, 127150, 198471, 106534, -49847, -138751, -87751, -44503, -53978, -144461, -76854, -116802, -102820, 125487, 252386, 290074, 68874, -96972, 75273]
5811G5273J4306j81707j6986J22126J0351o3227q6959N771N0932J27011J00625
5800A57516N155n9917J78598J20500P067j81943k10928K9261m1143k22038j72743
5789c90615j01529j8616K5401L8784K32916O1389j12133o7278J42025K22798Q4089
5778A17231m3014Q4193j7456k2880O712N8914j03899j94108O3992l2662j45148
5767b28125j5317j09302L9491J07713R694J64306J25903O1269O381j25053n563
5756C1397Q435m1328j73203j70277K22839Q1787p4494o6542L7156m0037P1262
5745a13005J28354J05299j10252m1615j1211n0450M0560L454o480K0640m7353
5734h2059k4683J8967n743J1331J7664P1135Q383N7805L0274J6063k4462j84022
$$ y = [75273, 89579, -92128, -109114, 13012, 23363, -39864, -126823, -121052, -70120, 56891, 157516, 162671, 102754, 281352, 401852, 408919, 226976, 16048, 45309, 4166, -217872, -390615, -492144, -510760, -485359, -446575, -213659, -152270, -264403, -331681, -189656, 33142, 117231, 74217, 158410, 140954, 118074, 124786, 183700, 79801, -114307, -50315, -82977, -228125, -243442, -352744, -313253, -205540, -195846, -31540, 94363, 155632, 162013, 36960, 31397, 39832, -1496, -174699, -344976, -122137, -40350, -114844, -181386, -144230, -184267, -113005, 15349, 120648, 10396, -31219, -42430, -92880, -52320, -48866, -55346, -34706, -82059, -106742, -87775, -93518, -82187, -64523, 6612, 14995, 72800, 103074, 119137, 94675, -89347]
5722h9347K0133j9464Q6311M3501P6474O3936p353r1185k2150m3703Q8441m1542
5710F4052l2109L3697j80390j1818J51334K4232K5544R0153M576O482M1439K9
5698B17221j53993l5202J22554P2811N1726r4943j30119K84971j8491k65353j59356
5687a08174r86m5923P9238Q604J63402p8234o4687M8165O2661j05863J68532K4233
5675A50968K470N0930m0835m3901R9489j17337j78745j06687Q7220J18794m5478
5664b3112q9999O4224N891m7797O9798q2397J780J84697q195r0176J7249K4984
5652B6947o0703Q5795R6693q2304j60168K2868J42484L7732m0720q4749Q4523
5641F8398J13455r7354Q3388J18032J281n6873m0424j51558n8627o0321m7993
$$ y = [-89347, -69214, -88678, -2367, 41134, 117608, 181544, 174191, 83006, 60856, 17153, 105594, 64052, 31943, 65640, -114750, -126568, 24766, 48998, 74542, 164695, 169271, 175753, 217192, 217221, 63228, 28026, 150580, 223391, 275117, 180174, 50055, 335026, 316535, 51182, -108174, -109160, -155083, -75845, -67241, 96161, 17927, -46760, 1405, 64066, -41797, 126735, 150968, 153438, 204368, 163533, 119632, 219121, 101784, -76961, -183648, -96428, 22366, -23112, -113111, -48887, -42996, -90793, -20995, -103392, -101612, 83085, 74890, -15286, 1963, 26947, -33756, 52039, 148732, 66428, -93740, -70872, 71612, 109344, 68624, -16125, 68398, 181853, 84499, 167887, 285919, 287200, 230327, 189903, 38345, -20282, -80603, -128596]
5630a28596K8566n228J49347k2122j99369k33434j24351O3642K28209J63157J58745
5619G8566n5766L5551l8970q166j01971k1191J5131n0722j6916K40540J97447
5608B73533j31873k28198o9493K5046l1285p8487J2704M158N8651N4526l0925
5597a41643J46036O4119r9734p3350K8724m4045J3358P3161m9198P5044K0890
5586A3362q184m6897L6800K0773m3594p3400J65672P8284j58752j67809r7790
5575b81535J40155J76928K95218k7619j76441P225N2050j4395n4154r6149j27228
5564a05945J3521O0192L9886K849k8074j81327q704J46420J42451J47757Q2921
5553C11947j18107l80346k03463J05137K51350L6079K6160l4540Q0623R26Q9906
$$ y = [-128596, -100030, -105258, 44089, 21967, -177402, -410836, -535187, -471545, -243336, -80179, 78566, 22800, 58351, 19381, 11215, -90756, -111947, -96816, -147538, -164454, 76086, 273533, 141660, -86538, -156031, -130985, -162270, -240757, -228053, -223895, -165244, -110718, -141643, 4393, 68512, -31222, -104572, -75848, -119893, -106535, -33374, -82572, -7528, 13362, 5178, -41719, -4919, 15854, -27740, -101140, 64532, 142816, -15936, -183745, -281535, -141380, 35548, 330766, 303147, 126706, 133931, 185981, 171586, 117432, 21283, -105945, -92424, -32232, 7654, 10503, -17571, -198898, -207602, -61182, 81269, 229026, 311947, 193840, -186506, -389969, -284832, -33482, 2597, 28757, -5783, 74840, 75766, 165672]
5542A65672J26817q3816j23424k21243k2206P1755L8193J70136l0731N581j46225
5531d9491j87783P4850J57756J6997k1252l3038J713n3435o5826L7617R1020J18584
5519H7712m638p9034j6052o6610j17936K223K9878K26188k9822N3660r4993p1184
5507h0608j0366J08698l6761j45577J34863n2880r4P7673J86154m5515n1155j4464
5495F9968j47282R3244J69018r8135o9146J45061l4713j08826o5797p3137O6105
5484e3640R7785j03051j73803J7205J23403P3503k917p1699j20683m7618Q7723
5473a73792J12929M0294k880k5061m3793k2594k139M8564r6657K02948R746k35429
5461a87864l3720R7590J03154O452O3166N9227j44761j24077n3252K33411R3672
$$ y = [165672, 292489, 208673, 85249, -135994, -158200, -86445, -48252, 121884, 91153, 96734, -49491, -237274, -162424, -4668, 12329, -8923, -41961, -40248, -93683, -159509, -121892, -30872, 87712, 83074, 4040, -12012, -78622, -196558, -194335, -164457, 61731, 31909, 85569, -9424, -80608, -90974, 17724, -19037, -164614, -29751, -82631, -82725, -5052, 181102, 135587, 84432, 69968, -77314, 15930, 184948, 86813, 17667, 162728, 128015, 19189, -46608, -119745, -53640, 44145, -58906, -232709, -215504, -92101, -18598, -21515, -93214, -213897, -261515, -173792, -60863, -20569, -23449, -48510, -92303, -114897, -117036, -68472, -165129, 37819, 47565, -187864, -221584, -123994, -20840, -14388, 48778, 108005, -36756, -160833, -214085, 19326, 112998]
5450A12998r7368j21936Q2144J0035O1045m7201r8545J25489j0297j03659n6479
5439a43774J15936M3588k2160J47144R8152Q3042j68609j37579J58915o1461j84933
5428g1739R3604N7103L6331q6045j0836k384N8072J39543l0727J8704l3765j3209
5416A54652m6628J6828n9288l7830l1425L2491j23972K528J31192M3960j43830
5405f1322q4497P8465J61904q0425n6331P3976O4347o6916j79593J22716N9702
5394C2026O7844J7058M1155J14690K3719l2641L1364j82898k0334l4745J6493
5383G3731o8592p303R1469l7583j34590L1207J34976N2766J8766J66077J63744
5372D84668J04040j28402j47862r2783o7510q266q353P6198j94868L0209L7167
$$ y = [112998, 15630, -106306, -24162, -14127, 46918, -283, -98828, 26661, 16364, -87295, -143774, -27838, 15750, -6410, 140734, 238886, 321928, 153319, 15740, 174655, 113194, -71739, 21865, 78968, 115299, 29254, 18418, 16034, 74106, 213649, 182922, 201626, 167861, 154652, 108024, 124852, 65564, 27734, -3691, 28800, -95172, -92644, 38548, 82508, -61322, -145819, -67354, 94550, 14125, -42206, 31770, 96117, 29201, -150392, -27676, 32026, 99870, 116928, 158083, 272773, 296492, 263851, 295215, 112317, 91983, 57238, 73731, 5139, -2164, 89305, 51722, -82868, -51661, 83315, 136081, 154847, 320924, 484668, 588708, 460306, 312444, 219661, 152151, 143885, 135532, 211730, 16862, 47071, 84238]
5361H4238j07251r3884J58849J65010j892k06495j58844M252J98762Q8298R8380
5350B29423m4742k10838M2775J243n9299J0792j4974J1640m0758K7678k5659J40061
5338F7342M7755q2928p5104L3608L5964M4340M8310L9225l6280q6726o1510n2761
5326g8765m0257P197n2103p9051N8753N6756J8453M0575o6769l6131j20472N3964
5314b37850K12642J05939L7417J424j12715J44466J02979m2166j95152r5607J27725
5303D9102j71293m386O6400O0663j37895j21128l8126o5741Q9053J13681R7816
5292f1854J07659j95834j90558R1708J00831O9242M8750J64283l7636p9720J17613
5281A34484O5873L6821m7961p0049j21521j40079j04797K7226k9032P8508J2234
$$ y = [84238, -23013, -116897, 41952, 206962, 205070, -1425, -160269, -156017, 42745, 131043, 229423, 184681, -26157, 16618, 17861, -41438, -30646, -45620, -33980, -74738, -47060, -72719, 67342, 115097, 32169, -42935, -9327, 26637, 70977, 119287, 158512, 122232, 35506, -26004, -78765, -119022, -111825, -163928, -242979, -184226, -127470, -109017, -68442, -135211, -171342, -291814, -237850, -25208, 80731, 118148, 119572, 6857, 151323, 254302, 212136, 16984, -78623, 49102, -122191, -126577, -60177, 486, -137409, -258537, -296663, -362404, -273351, -159670, -61854, 45805, -150029, -340587, -248879, -148048, -78806, -30056, 134227, 96591, 16871, 134484, 200357, 237178, 189217, 119168, -2353, -142432, -247229, -220003, -249035, -170527, -158293]
5270a58293q4185k04964J64746J51809J43526J81926k8355j83556j16227P5327
5260e8246J89437P8831L6219j42576o9021j46853l8253L7836M5775P7502N2908
5249F3559J94276p7365j19212m5067p075N1597q868p1821N8714N970k0872O5505
5237H9341K5264k2559q7853o0091J3634K3644K101q2939l0226M7081J08738r9643
5225g3508k3863j27559K8461J64038P0350j37106j28199j35443N7218J71781l9204
5214a73034M8050J38986j28872N4846m23o856K545P5639m4162j9869O7797J34794
5202A49441J26661k0085k55966r7040J56527M0388j10511K8667m7447R1649p5310
5191a3026o4438L3482O2502L6220j20527j48562L1517L1695m6193J20259P699
$$ y = [-158293, -242478, -447442, -282696, -130887, 12639, 194565, 166210, -17346, -133573, -58246, 131191, 210022, 246241, 103665, 34644, -112209, -150462, -112626, -66851, 10651, 63559, 257835, 180470, 61258, 16191, 9116, 60713, 51845, -19976, 38738, 44708, 23836, 89341, 114605, 92046, 4193, -55898, -42264, -18620, -16519, -99458, -129684, -82603, 26135, -73508, -97371, -224930, -196469, -32431, 37919, -99187, -227386, -362829, -305611, -133830, -173034, -124984, 14002, -114870, -60024, -60447, -67303, -64758, 10881, -33281, -53150, 14647, 149441, 276102, 256017, 51, -96989, 59538, 99926, -10585, 18082, -29365, 62284, -13026, -77464, -43982, 18520, 54740, -65787, -214349, -182832, -151137, -197330, -77071, -69372]
5180f9372J24926P9799q7819r4535Q8386Q0720J4167J41773m8824l278n2278j32414
5168D1251M3054r4018J63823N8439j38524p9501l9091n804q2763j52855P6243
5157b09746J15239O2985M0377L3757n9632J42219J98335l333k04297j17816P3231
5146G1319L3150k35441j52741p1359R5672K5870N5346J13277k0677J7007R695
5135e8882j25781m5548N0306P2093J05799p7030q9782J2587K2936N5025K5457
5124e2820P1090J19124l5265L2752N3804o6492r3708j48831p4023L6563n1868
5113b09674o6478m342J73146J15693J0294o1454j13185m0718J49730Q0200p65
5102C2447r316j44860q9627J97480K24761J3890J23409k2128j23666j07298J6490
$$ y = [-69372, 55554, 135353, 47534, -47001, 41385, 122105, 136272, 278045, 229221, 225943, 173665, 41251, 84305, -9713, 154110, 212549, 74025, -5476, -44567, -50371, -133134, -285989, -209746, -94507, -31522, 8855, 42612, -17020, 125199, 323534, 320201, 115904, -1912, 71319, 104469, -130972, -283713, -355072, -259400, -233530, -178184, -64907, -85584, -68577, -58882, -184663, -230211, -179905, -107812, -2013, -79043, -168825, -156238, -133302, -78277, -52820, 18270, 137394, 102129, 134881, 188685, 122193, 28485, -120346, -194369, -157806, -209674, -276152, -280494, -107348, 8345, 18639, -42815, -156000, -196718, -46988, 33212, 32447, 23131, -121729, -211356, -13876, 210885, 224775, 348184, 326056, 202390, 95092, 111582]
5091A11582r9668k9618O2640j3229M093n7415J29832N226q0794L8041K7301J564
5079I9555k0093j03546j73355o6493J68449J27274P0622j660p7121q7551j1840
5068g5759j6885j73907k1789K1454N2039q631Q3716J21850j1943N289j16986l3608
5056a75160N3971M9607J68376O4066j04181j23187R0435k6919J1433J83362J04491
5045B96294j71581j09697J03833J67644P8471r7189l0949P3747o290m4481k35859
5034B3943n0722m479K7703Q6373K355j38187M7875J75934L7295j15724l171p5284
5022A3911K596K0774j4548o2948J6977O4397q2034N1555K9759j60729r3337J43288
5010g0339O1688Q6881o2963m1607m1848K5602L6816j347n5305n2774R4921P870
$$ y = [111582, 11914, -17704, 44936, 31707, 35800, -21615, 108217, 113443, 32649, 70690, 97991, 99555, 79462, -24084, -197439, -263932, -95483, 31791, 102413, 100753, 23632, -63919, -75759, -92644, -266551, -288340, -266886, -214847, -223478, -139762, -17912, -29855, -24566, -141552, -175160, -121189, -71582, 96794, 160860, 56679, -66508, 23927, -2992, 8441, 191803, 296294, 124713, 15016, 118849, 286493, 364964, 267775, 236826, 310573, 304283, 259802, 23943, -26779, -31258, -3555, 82818, 85173, -53014, -5139, 170795, 208090, 92366, 89195, 13911, 16507, 37281, 22733, -40215, -23238, 41159, -40875, 10680, 40439, -120290, -213627, -70339, -8651, 78230, 15267, -26340, -68188, -42586, -5770, -7117, -62422, -115196, -20275, -12405]
4998a2405k54224r2228O0590p652K85120J97301j3342O9758n4095l4603M2615
4987A86835k5436m8123L3118J2309o3495p6846M2098K45446m4438j74973m4668
4976D1827p9338q3389O7599J04509N3007j10265K9565l8232O5639Q4480J83356
4965C18758j15241k46484j46929P2280J16572j7619l314o2394q7713r8138j32785
4954d03007k8319J69336J08459K90684J01956r7241n4617j19742N7739Q6568J842
4943A13658j63321l8136N2621j20210M2562J23376J79449O7409j22013j5549Q0760
4932B00606n6780j06167j4532r5914P6500Q6272J6828j85747j28026J28424J00920
4921B2384k1246k7953k3570J62214J38527K5653j45459j77267l526Q4904j8312
$$ y = [-12405, -266629, -358857, -298267, -305919, -20799, 176502, 163160, 232918, 178823, 144220, 186835, 161399, 113276, 146394, 158703, 95208, 18362, 60460, 305906, 261468, 86495, 41827, -37511, -120900, -53301, 51208, 104215, -6050, 23515, -14717, 50922, 135402, 318758, 203517, -42967, -189896, -117616, -1044, -18663, -21977, -84371, -172084, -270222, -403007, -431326, -261990, -153531, 137153, 239109, 141868, 87251, -32491, 25248, 111816, 113658, -49663, -87799, -35178, -155388, -112826, 10550, 189999, 257408, 135395, 119846, 200606, 143826, 37659, 23127, -72787, 3713, 89985, 106813, -78934, -206960, -78536, 22384, 1138, -26815, -50385, 111829, 250356, 276009, 130550, -46717, -50243, 34661, 16349]
4910A6349j49017M4546n0059R1141O8494J315M361p3276n2538M7042P1466r4877
4898g5053k1192J3941K38868R2957j41200j76758R2436n74r3779j75226K2428
4887b23152P5306j12724j58102R8239K85377K15431j45619k68427n121M2484J00106
4876i6202K9952J24120J40958k5493l2045j90510j28065p187n0552J28707K25192
4865A18875M2724k0715j33306p3672p872K8844j7004j44127M3687j7120l9711
4854b19397J79724J52348p6150j00664j44511Q2560K50393P7036m5766P5194L4221
4843B64988M4355r2377J7438r6370k7811M3965J5826N5861j52353r4969m5619
4832f7066J13095o142j62644m391J18718J8858K7327p7650J14673O4748r7825
$$ y = [16349, -132668, -88122, -138181, -47040, 21454, 22769, 27130, -46146, -98684, -51642, 19824, -75053, -96245, -82304, 156564, 249521, 108321, -68437, 23999, 23425, -70354, -245580, -223152, -147846, -260570, -418672, -320433, -35056, 180375, 34756, -233671, -238792, -196308, -96202, -66250, 57870, 198828, 173335, 141290, -49220, -177285, -184472, -235024, -106317, 118875, 161599, 140884, 7578, -66094, -73966, -45122, -62126, -206253, -162566, -179686, -219397, -39673, 112675, 36525, -64139, -208650, -126090, 124303, 201339, 155573, 230767, 264988, 309343, 216966, 234404, 138034, 110223, 154188, 170014, 225875, 73522, -21447, -67066, 46029, 39887, -122757, -127148, -8430, 10428, 37755, -39895, 74778, 139526, 41701]
4821D1701K9627J36113j89696j66978K11404N4383l4256J3996q096n4978J17620
4810A50840n6356r7117O2986r3612j6382K4394K31401K23629q4430j43449j17132
4799H4772Q3487j04900J1935M0845Q9578n6883j62553k53589J01190k6574j08961
4788c01653j7876N7818R1406J20045J05574n5951j65446M9535J06134r4520m1054
4777a45988K390J25243l494n4099n8652J16050K87100J41084n4813k54117l09100
4766b08396k13K66862N2688q1666j84516r909P5241j647J11424J76049J10255
4755C06172l8864j37620q4495k300o6249n1085J65288P1339o0551j78232N032
4744g1565Q6055o1455o3266j962m0330m7741j12755K10828J56046j14993p8291
$$ y = [41701, 71328, 207441, 17745, -149233, 62171, 116554, 82298, 96294, 88198, 33220, 150840, 94484, -2633, 60353, -33259, -49641, -25247, 206154, 429783, 345353, 201904, 84772, 168259, 63359, 75294, 116139, 205717, 148834, -13719, -267308, -166118, -192692, -301653, -319529, -261711, -170305, -50260, 55314, -637, -166083, -116548, -10414, -104934, -145988, -143598, -18355, -21849, -75948, -134600, -18550, 268550, 409634, 354821, 100704, -208396, -208609, 58253, 110941, 29275, -155241, -165150, -89909, -91556, 19868, 195917, 306172, 267308, 129688, 45193, 42893, -23356, -74441, 90847, 162186, 101635, -76597, -71565, 14490, -46965, -110231, -112193, -152523, -200264, -313019, -102191, 53855, -61138, -139429]
4733a39429j41744o4785K92531P2046N7595l3217j47225M0870j52831R8455J81023
4722F3289j80557o6842L0371p6022J65784J11319j73012q0608L5228N5924J30703
4711A5577J26652p0144L3968N4475o689j36100m3456q1610O3987j07480r4585
4700b45405P2144J89331J3152o7534r9219O7432J1201j56257r1035J3125J05471
4689a87594Q7225J71829L3349k6394m4747j47676Q2654R9179l7143p8633J54767
4678A06816K5137q804Q0087n7516j0266L6157j02999p5162p9553n7458O7847l127
4666g8841p7964l5660P2926j12449K8432J35860M5347L5003k5205o614J77690
4655A58525N8619k06099j05886n2933K919N5020J58527l3703r6974n4405j41240
$$ y = [-139429, -281173, -345958, -53427, 18619, 76214, 42997, -104228, -63358, -216189, -117734, 63289, -117268, -184110, -153739, -229761, -63977, 47342, -125670, -206278, -171050, -115126, 15577, 142229, 72085, 106053, 160528, 153839, 17739, -25717, -107327, -43340, -150820, -245405, -173261, 16070, 29222, -38312, -137531, -70099, -58898, -215155, -306190, -293065, -187594, -100369, 71460, 104809, 78415, 33668, -114008, -31354, 67825, 30682, -47951, 106816, 131953, 123149, 203236, 145720, 135454, 171611, 68612, -6550, -86103, -143561, -75714, -78841, -156805, -192465, -119539, -231988, -203556, -67696, -22349, 12654, -12551, -19165, 158525, 217144, 11045, -94841, -147774, -144855, -89835, 68692, 34989, -61985, -116390, -257630]
4644b57630J47555K33039J2614N3328j43652j10570j56578Q4238M649n0372Q6283
4633i7096N2766j84844k80855Q6968K13612k5813M5034o7390J1494J94437j16092
4622a67779M8133L8436j35598j0139R6950N6539n1175j04823Q309q2413l6005
4611c39565l0430J11078Q4247P2479J06705J14822J04378p6224j45403k8951k6130
4600e2994p7091L9422M8290K7178j45684R964j7425j090J4640p8805K00867J82071
4588A49343q531m0019n2584k10399O7395l503N2267O5669P9330j00676j12372
4577a14080N8392J15309L0258r2859Q5675J32987j37630j27496r5665j19691N0691
4566b14109K19333J1708K8916r5220j0691K2733r2674R013J12769M6854m127P4806
$$ y = [-257630, -110075, 122964, 135578, 188906, 45254, -65316, -221894, -137656, -133007, -183379, -97096, -44330, -229174, -510029, -423061, -209449, -235262, -190228, -257618, -246124, -51687, -167779, -119646, -81210, -216808, -226947, -129997, -73458, -124633, -229456, -221147, -303560, -339565, -369995, -258917, -174670, -102191, 4514, 119336, 223714, 147490, 2087, -26864, -52994, -130085, -90663, -42373, -15195, -160879, -150915, -168340, -169430, -154790, -233595, -32728, 149343, 140812, 100793, 48209, -162190, -94795, -98298, -46031, 19638, 98968, -1708, -114080, -55688, 59621, 89879, -2980, 82695, 215682, 78052, -49444, -145109, -264800, -214109, 5224, 16932, 45848, -49372, -60063, -37330, -130004, -120991, -8222, 38632, 34505, 109311]
4554A09311P7083j10637o5582j44598j4018J21454K6301q6129r2774j9433K76051
4543G7029K43856P0703j46494j64543K225j7720l8792P4664Q5273J47227L2040
4532C65468k84175j02215o2654k9823L2870l6405P0905N9590j2887R2455o0010
$$ y = [109311, 186394, 75757, 10175, -134423, -148441, -26987, -686, -86815, -179589, -199022, 77029, 320885, 391588, 245094, 80551, 82776, 65056, 26264, 100928, 186201, 333428, 365468, 81293, -20922, -83576, -113399, -80529, -116934, -46029, 13561, 674, 93129, 33119]
$$ [...]
##END NTUPLES=NMR SPECTRUM
##END=
