##TITLE=Analysis number 307431
Compound Code cc 39104
Book Reference 399/149
Project Code adrs
Chemist Name evam
##JCAMPDX= 6.0         $$ Bruker NMR JCAMP-DX V2.0
##DATA TYPE= NMR SPECTRUM
##DATA CLASS= NTUPLES
##ORIGIN= Bruker BioSpin GmbH
##OWNER= NMR
$$ XWIN-NMR		Version 3.5
$$ Tue May  3 10:39:16 2005 GMT Daylight Time (UT+1h)  MAYBRIDGE\NMR@NMR_250MHZ
##.OBSERVE FREQUENCY= 250.131544655141
##.OBSERVE NUCLEUS= ^1H
##.ACQUISITION MODE= SIMULTANEOUS (DQD)
##.ACQUISITION SCHEME= undefined
##.AVERAGES= 16
##.DIGITISER RES= 18
##SPECTROMETER/DATA SYSTEM= dpx250
##.PULSE SEQUENCE= zg30
##.SOLVENT NAME= CDCl3
##.SHIFT REFERENCE= (INTERNAL, CDCl3, 0, 16.4528)
##AUDIT TRAIL= $$ (NUMBER, WHEN, WHO, WHERE, WHAT)
$$ ##TITLE= Audit trail, XWIN-NMR		Version 3.5
$$ ##JCAMPDX= 5.01
$$ ##ORIGIN= Bruker BioSpin GmbH
$$ ##OWNER= NMR
$$ C:\u/data/dgb/nmr/ADRS/2620/pdata/1/auditp.txt
$$ ##AUDIT TRAIL=  $$ (NUMBER, WHEN, WHO, WHERE, WHAT)
(   1,<2005-05-03 10:38:27.62 +100>,<MAYBRIDGE\NMR>,<NMR_250MHZ>,
      <created by zg, POWCHK disabled, PULCHK disabled
       configuration hash MD5:
       62 19 C7 07 E1 42 D1 B7 37 6C 3D D0 77 39 F9 E6
       data hash MD5: 64K
       98 97 20 15 0B 90 D1 F7 3B BB 04 73 23 B5 F0 83>)
(   2,<2005-05-03 10:38:42.79 +100>,<MAYBRIDGE\NMR>,<NMR_250MHZ>,
      <Start of raw data processing
       ef LB = 0.3 FT_mod = 6 PKNL = 1 SI = 32K 
       data hash MD5: 32K
       40 BF A6 BC 25 C1 8F 5F 25 8C 24 88 39 AB 56 3E>)
(   3,<2005-05-03 10:38:46.18 +100>,<MAYBRIDGE\NMR>,<NMR_250MHZ>,
      <apk 
       data hash MD5: 32K
       CB E2 34 BA 45 4B 10 6A E7 2C D8 ED 45 FA 9F B9>)
(   4,<2005-05-03 10:38:47.10 +100>,<MAYBRIDGE\NMR>,<NMR_250MHZ>,
      <abs ABSG = 5 
       data hash MD5: 32K
       C6 55 89 6F 8C 00 CF A1 A9 87 E3 93 80 E5 5B 6F>)
$$ ##END=
$$ 
$$ hash MD5
$$ AD 10 5C B2 E8 70 16 98 3D 74 57 DD 4C B4 0A 0A
##$RELAX= 
##$RELAX= 
##$RELAX= 
##$RELAX= 
##$RELAX= 
##$RELAX= 
##$RELAX= 
$$ Bruker specific parameters
$$ --------------------------
##$DU= <C:\u>
##$EXPNO= 2620
##$NAME= <ADRS>
##$PROCNO= 1
##$TYPE= <nmr>
##$USER= <dgb>
##$AMP= (0..31)
100 100 100 100 100 100 100 100 100 100 100 100 100 100 100 100 100 100 
100 100 100 100 100 100 100 100 100 100 100 100 100 100 
##$AQSEQ= 0
##$AQ_mod= 3
##$AUNM= <au_zg>
##$AUTOPOS= <9 >
##$BF1= 250.13
##$BF2= 250.13
##$BF3= 250.13
##$BF4= 250.13
##$BF5= 500.13
##$BF6= 500.13
##$BF7= 500.13
##$BF8= 500.13
##$BYTORDA= 1
##$CFDGTYP= 0
##$CFRGTYP= 5
##$CHEMSTR= <none>
##$CNST= (0..31)
1 1 145 1 1 1 1 1 1 1 1 1 1 1 1 1 1 1 1 1 1 1 1 1 1 1 1 1 1 1 1 1 
##$CPDPRG= <>
##$CPDPRG1= <>
##$CPDPRG2= <>
##$CPDPRG3= <>
##$CPDPRG4= <mlev>
##$CPDPRG5= <mlev>
##$CPDPRG6= <mlev>
##$CPDPRG7= <mlev>
##$CPDPRG8= <mlev>
##$CPDPRGB= <>
##$CPDPRGT= <>
##$D= (0..31)
0 1 0 0 0 0 0 0 0 0.06 0 0 0 0 0 0 0.0002 0 0 0 0 0 0 0 0 0 0 0 0 0 0 
0 
##$DATE= 1115113106
##$DBL= (0..7)
120 120 120 120 120 120 120 120 
##$DBP= (0..7)
150 150 150 150 150 150 150 150 
##$DBP07= 0
##$DBPNAM0= <>
##$DBPNAM1= <>
$$ [...]
##$SUBNAM7= <"">
##$SUBNAM8= <"">
##$SUBNAM9= <"">
##$SW= 20.6930455092707
##$SWIBOX= (0..15)
0 0 3 0 0 0 0 0 0 0 0 0 0 0 0 0 
##$SW_h= 5175.983436853
##$TD= 65536
##$TD0= 1
##$TE= 295.16
##$TE2= 300
##$TE3= 300
##$TEG= 300
##$TL= (0..7)
0 120 120 120 120 120 120 120 
##$TP= (0..7)
150 150 150 150 150 150 150 150 
##$TP07= 0
##$TPNAME0= <>
##$TPNAME1= <>
##$TPNAME2= <>
##$TPNAME3= <>
##$TPNAME4= <>
##$TPNAME5= <>
##$TPNAME6= <>
##$TPNAME7= <>
##$TPOAL= (0..7)
0.5 0.5 0.5 0.5 0.5 0.5 0.5 0.5 
##$TPOFFS= (0..7)
0 0 0 0 0 0 0 0 
##$TUNHIN= 0
##$TUNHOUT= 0
##$TUNXOUT= 0
##$USERA1= <user>
##$USERA2= <user>
##$USERA3= <user>
##$USERA4= <user>
##$USERA5= <user>
##$V9= 5
##$VALIST= <valist>
##$VCLIST= <CCCCCCCCCCCCCCC>
##$VD= 0
##$VDLIST= <DDDDDDDDDDDDDDD>
##$VPLIST= <PPPPPPPPPPPPPPP>
##$VTLIST= <TTTTTTTTTTTTTTT>
##$WBST= 1024
##$WBSW= 4
##$XGAIN= (0..3)
0 0 0 0 
##$XL= 0
##$YL= 0
##$YMAX_a= 301092
##$YMIN_a= -250090
##$ZGOPTNS= <>
##$ZL1= 120
##$ZL2= 120
##$ZL3= 120
##$ZL4= 120
##$ABSF1= 16.45284
##$ABSF2= -4.240332
##$ABSG= 5
##$ABSL= 3
##$ALPHA= 0
##$AQORDER= 0
##$ASSFAC= 0
##$ASSFACI= 0
##$ASSFACX= 0
##$ASSWID= 0
##$AUNMP= <proc_1d>
##$AZFE= 0.1
##$AZFW= 0.1
##$BCFW= 0
##$BC_mod= 0
##$BYTORDP= 0
##$COROFFS= 0
##$CY= 12.5
##$DATMOD= 1
##$DC= 0
##$DFILT= <>
##$DTYPP= 0
##$F1P= 14.0000005364418
##$F2P= -0.99999901652339
##$FCOR= 0.5
##$FTSIZE= 32768
##$FT_mod= 6
##$GAMMA= 0
##$GB= 0
##$INTBC= 1
##$INTSCL= 1
##$ISEN= 128
##$LB= 0.3
##$LEV0= 0
##$LPBIN= 0
##$MAXI= 10000
##$MC2= 0
##$MEAN= 0
##$ME_mod= 0
##$MI= 0
##$NCOEF= 0
##$NC_proc= -3
##$NLEV= 6
##$NOISF1= 0
##$NOISF2= 0
##$NSP= 0
##$NTH_PI= 0
##$NZP= 0
##$OFFSET= 16.45284
##$PC= 1
##$PHC0= -68.31254
##$PHC1= 5.008097
##$PH_mod= 1
##$PKNL= yes
##$PPARMOD= 0
##$PSCAL= 4
##$PSIGN= 0
##$REVERSE= no
##$SF= 250.130017296494
##$SI= 32768
##$SIGF1= 0
##$SIGF2= 0
##$SINO= 400
##$SIOLD= 32768
##$SREGLST= <1H.CDCl3>
##$SSB= 0
##$STSI= 32768
##$STSR= 0
##$SW_p= 5175.98343685301
##$SYMM= 0
##$S_DEV= 0
##$TDeff= 65536
##$TDoff= 0
##$TI= <Analysis number 999999
Compound Code 99
Book Reference 9
Project Code 9>
##$TILT= no
##$TM1= 0
##$TM2= 0
##$TOPLEV= 0
##$USERP1= <user>
##$USERP2= <user>
##$USERP3= <user>
##$USERP4= <user>
##$USERP5= <user>
##$WDW= 1
##$XDIM= 32768
##$YMAX_p= 363899565
##$YMIN_p= -160155
$$ End of Bruker specific parameters
$$ ---------------------------------
##NTUPLES= NMR SPECTRUM
##VAR_NAME=  FREQUENCY,     SPECTRUM/REAL,   SPECTRUM/IMAG
##SYMBOL=    X,             R,               I
##VAR_TYPE=  INDEPENDENT,   DEPENDENT,       DEPENDENT
##VAR_FORM=  AFFN,          ASDF,            ASDF
##VAR_DIM=   32768,         32768,           32768
##UNITS=     HZ,            ARBITRARY UNITS, ARBITRARY UNITS
##FACTOR=    0.157963299565203, 1,           1
##FIRST=     4115.34935514455, 0,            0
##LAST=      -1060.63408170846, 0,           0
##MIN=       -1060.63408170846, -160155,     0
##MAX=       4115.34935514455, 363899565,    0
$$ Real data points
##PAGE= N=1
##DATA TABLE= (X++(R..R)), XYDATA
$$ [...]
16792c0046L9674k2027k8459L3239N1435K5746k8337n9695K5489N8213m411j52
16780F0669l8012m5376j3113M6899k3459k4448k036L5316K7764j2903n2781j3404
16768e4884K3737M447q567K9035J6327J2180k4034j7146j011j3999J1436L0978
16756H499k255k6402J1894j3970j946p671L0880j237n434J5784j3601l726k8232
16743c7417o414j0534j9327k8627J3010M1550K8895j0137k256K3385K5852k8499
16731a0519l6003l3944O813L0342L0554K2258m6749k0315J5945O578Q767r120
16719c5393j8323p215n673J5207j5870m1058L1804Q156k7018l561M9203k551k5418
16706g7710k9466m3115M2249Q8636K9420k5074m169q957K7912J0428l3308m686
$$ plain form
16792 -30046 9628 -12399 -40858 -7619 43816 69562 41225 -18470 7019 65232 60821 60669
16780 60669 22657 -22719 -35832 11067 -12392 -36840 -38876 -3560 24204 11301 -41480 -54884
16768 -54884 -31147 -26700 -35267 -6232 10095 22275 -1759 -18905 -19916 -33915 -22479 8499
16756 8499 6244 -20158 -8264 -22234 -24180 -31851 -971 -2208 -7642 8142 -5459 -9185 -37417
16743 -37417 -43831 -54365 -73692 -102319 -89309 -47759 -18864 -29001 -31257 -7872 17980 -10519
16731 -10519 -46522 -80466 -73653 -43311 -12757 9501 -37248 -57563 -41618 -35040 -26273 -35393
16719 -35393 -53716 -60931 -66604 -51397 -67267 -108325 -76521 -68365 -95383 -98944 -49741 -52292 -77710
16706 -77710 -107176 -150291 -108042 -19406 10014 -15060 -19229 -28186 -274 10154 -23154 -27840
16694b7840L3492J7450j9129K1696R529j6615m3838j1300j8063k8459J9216L7528
16682b6333j1133j0417K5888O830J3455k0288J2101L8582Q284k7687L755j8885
16670e848j2037j2974r474Q954l842K3058N0401L8063l5291j2640l8228k7369
16658c7227J0528j3056L216M1345r71j683j1527m864K5232J0117J5760k5579k129
16645I162K787l4532k0722J1866k0165K7665L484N98j1966j6560J4322K6108j3628
16632b1581j6962J2897L8809k9861n5386K1394L2186K6312J312J0468j2698J8019
16620B4909j7213j683O449K3759n567j5287k2798j8290n400j6103L3171K1120
16608G067j2400j3044q132J5364O3523j1663k4501p424m5629J7083m3440k3847
$$ plain form
16694 -27840 5652 23102 3973 25669 35198 18583 -25255 -36555 -54618 -83077 -63861 -26333
16682 -26333 -37466 -47883 -21995 -15165 -1710 -21998 -9897 28685 36969 9282 13037 -5848
16670 -5848 -17885 -30859 -40333 -31379 -35221 -12163 38238 76301 41010 28370 -9858 -37227
16658 -37227 -26699 -39755 -36539 4806 3835 2152 -9375 -14239 10993 21110 36870 11291 9162
16645 9162 11949 -22583 -43305 -31439 -51604 -23939 -20455 -19857 -31823 -48383 -34061 -7953 -21581
16632 -21581 -38543 -25646 13163 -16698 -72084 -50690 -18504 7808 9120 19588 6890 24909
16620 24909 7696 6013 12462 36221 30654 15367 -7431 -25721 -31121 -47224 -14053 7067
16608 7067 -5333 -18377 -26509 -11145 52378 40715 16214 8790 -36839 -19756 -63196 -87043
16596h7043J5615K7064M5041k373l1934k7539o522O309L0927K3946J2746o092
16584A45p409K2605K1767k5917L2817k5806l6712j824j8841p64j8806J3620P9464
16571C4339J9290k8964m6524O393k0277J2180J2065L9241J6502k9526n6185Q926
16559c2540J3974L4410o417J2104J7435j7950j718J1323J9268J197O426N359k0192
16546D2679m6650K409K4174J2154O55M020K5365k4004j1244Q358j4p7488l5564
16533g5150j1473j3261L6827M8925j8160K861K1221K354l0492J5669m565m553
16521b9797K952k809n3594m0409J4985J8550M9603M3036n596K5567q845J4711
16509B8354k7929j5502k612j004o879O264k3680K7085j6119N346l2142K6697k0420
$$ plain form
16596 -87043 -71428 -44364 677 -1696 -33630 -61169 -67691 -61382 -30455 -6509 6237 145
16584 145 -7264 15341 37108 11191 44008 18202 -18510 -20334 -39175 -39939 -58745 -45125 34339
16571 34339 53629 24665 -21859 -15466 -35743 -23563 -11498 27743 44245 14719 -41466 -32540
16559 -32540 -18566 15844 9427 21531 38966 21016 19298 30621 49889 51086 57512 62871 42679
16546 42679 -3971 -1562 22612 34766 35421 39441 64806 40802 29558 37916 37902 -39586 -75150
16533 -75150 -86623 -99884 -63057 -14132 -32292 -29431 -8210 -5856 -36348 -20679 -25244 -29797
16521 -29797 -26845 -29654 -83248 -123657 -108672 -90122 -40519 2517 -3079 22488 13643 28354
16509 28354 425 -15077 -17689 -18693 -25572 -19308 -42988 -15903 -32022 -26676 -58818 -32121 -52541
16496e2541J362M2452L5650P710l5788n772P723m807N8924J0569l4069m4739j1524
16483b4850k7363m9537k4174L9082J2708K1373L1205J0011j0962j3580K2752K6057
16471A2722j1062j4978k978k4516J8073L0670k4747m9646J1699j6246J6648K2880
16459c1481K2025J3002k680J4683k75N161m728l2800m0524j8735K0441M3171j6889
16446b9629l1421L246Q1789Q067k0259j2009L2611l1889l7645j0402p346l984
16434e8871J3852J579K0039L7490K1524k1285m2944K4459K292k7254J3046q851
16422b4924J4149K2651j4710j4903j3864o736J3016K5411j0592k7604k9207K0184
16410d7129k5259J5384J7663K207Q621m9059j3772K6407K264K9957O920j2590
$$ plain form
16496 -52541 -51179 -8727 26923 34633 -1155 -6927 796 -4011 54913 65482 31413 -13326 -24850
16483 -24850 -52213 -101750 -125924 -86842 -74134 -52761 -21556 -11545 -22507 -36087 -13335 12722
16471 12722 1660 -13318 -16296 -40812 -22739 7931 -16816 -66462 -54763 -71009 -54361 -31481
16459 -31481 -9456 3546 866 15549 15274 20435 15707 -17093 -57617 -76352 -55911 -12740 -29629
16446 -29629 -61050 -57804 23985 32052 11793 -216 32395 506 -37139 -47541 -54887 -58871
16434 -58871 -45019 -43440 -23401 14089 35613 14328 -28616 -4157 -1865 -29119 -16073 -24924
16422 -24924 -10775 11876 -2834 -17737 -31601 -38337 -25321 90 -10502 -38106 -67313 -47129
16410 -47129 -72388 -57004 -39341 -37134 -28513 -77572 -91344 -64937 -62673 -32716 -25796 -38386
16398c8386K0211P065j4551k7472L0602l34n2717L3136l261N772K7506J4134r560
16385g855l1486j5360J0440J3584J4247J9978o548L2495J8624K2170k759m8970
16373A8560j8163k2521k1147j0476K7804j2917K2610J4128L1164o404J1140j4981
16361A8797j4668j204L832j0581k3130M524j3932J5611J232k3207L9461K2447
16349A9182K6362n210L1820l5157j8847k2622K1138o133j3418j6622K1601L0926
16337C3020k5726k0889l4469K6170P321N421K7060J9348k8449k3628l3129o666
16325e4616K5292n21L38k5582M813K3941M7840l210j9320k7069j5978L1001k4804
16312c7875j3395j2078m023J9852J8007o865l6828r764K1080M0369r277j1167
$$ plain form
16398 -38386 -18175 -11110 -25661 -53133 -22531 -22865 -75582 -42446 -45707 -39935 -12429 1705 -7855
16385 -7855 -39341 -54701 -44261 -30677 -16430 3548 -3000 29495 48119 70289 67530 18560
16373 18560 397 -22124 -43271 -53747 -25943 -38860 -16250 -2122 29042 22638 33778 18797
16361 18797 4129 2925 6757 -3824 -26954 -22430 -36362 -20751 -19519 -42726 -3265 19182
16349 19182 45544 40334 72154 36997 18150 -4472 16666 10533 -2885 -19507 2094 33020
16337 33020 7294 -13595 -48064 -21894 -14573 -9152 17908 37256 8807 -14821 -47950 -54616
16325 -54616 -29324 -29845 -29507 -55089 -50276 -26335 21505 18295 -1025 -28094 -44072 -13071 -37875
16312 -37875 -51270 -63348 -67371 -47519 -29512 -36377 -73205 -82969 -61889 -21520 -30797 -41964
16300d1964k7689l484K7652k1576o958L482J9626K8897J3204j7556k9413K2919
16288c2860L8046m7183l9788k5341L3135k105K8290M2380J3877j4909o457j1431
16276b4346J8776K8903N364k7786n242J309L2324M4537J858m2975J8577K4462
16264G5761l3024n1915m224Q832J3945j5607m8903o527J0843K434K009K3668k1356
16251d4064J3057Q873o554R533K4046J0019l0387l7896K9910K2915j7624l29J9984
16238A483J4245k9194j8416Q515k2711J8366M5370M336j6498j2203j3823l3567
16226e4097j9079M8881L5767K011J7775K315o148K8376r277k7433n0220R582K7835
16213F288K2820k5332K0159l5199p3453L5962J67p346N1762N5592l9891n496M8527
$$ plain form
16300 -41964 -69653 -73137 -45485 -67061 -74019 -70537 -50911 -22014 -8810 -26366 -55779 -32860
16288 -32860 5186 -41997 -81785 -107126 -73991 -76096 -47806 -5426 8451 -6458 -12915 -24346
16276 -24346 -5570 23333 28697 911 -4331 -3022 29302 73839 75697 32722 51299 75761
16264 75761 42737 -9178 -13402 -4570 9375 -6232 -55135 -61662 -50819 -48385 -46376 -22708 -44064
16251 -44064 -31007 -22134 -28688 -19155 4891 14910 -15477 -53373 -23463 -548 -18172 -18501 1483
16238 1483 15728 -13466 -31882 -23367 -46078 -27712 17658 21994 5496 -6707 -20530 -54097
16226 -54097 -73176 -24295 11472 13483 31258 33573 27425 55801 46524 19091 -31129 -21547 6288
16213 6288 29108 3776 23935 -11264 -84717 -48755 -48588 -55934 -4172 51420 11529 6033 54560
16200E4560l883o3745l789M9633J987j4350K0590O900k95k292m805Q617k5437
16187B3691l7596j2705J0010L9005k8815j2741N496J0440J2456J0002O898m352
16175B1789Q225M347j802l5722k4395l858L3277J5972k2638n7172o767J7806k1601
16162g2539o390L7799J4343j2057N2232L249M957l2486j4460P292M743P103K1404
16149A5190J2278k4732k4806O071l682J3240K9062k6377k3061L9353j010l0584
16137a9058j2634m888K1220j2601q078J9236K9679j4837n317J5624J8220L2900
16125E9466q252l3953k3035J3446m422J2941K433j2697J6178k479l1410k3375
16113c5159l7542j8439K5481K2418L188L242P868M5972k350j591J4438j1857j5296
$$ plain form
16200 54560 50677 -13068 -16857 32776 34763 20413 41003 47903 47608 45316 40511 49128 23691
16187 23691 -13905 -26610 -16600 22405 -6410 -19151 -13655 -3215 9241 19243 26141 21789
16175 21789 30014 34361 32559 -3163 -27558 -31416 1861 17833 -4805 -61977 -68744 -50938 -72539
16162 -72539 -78929 -41130 -26787 -38844 13388 16637 21594 -10892 -25352 -18060 -13317 -6214 15190
16149 15190 27468 2736 -22070 -15999 -19681 -6441 22621 -3756 -26817 12536 11526 -19058
16137 -19058 -31692 -36580 -15360 -27961 -36039 -16803 12876 -1961 -7278 8346 26566 59466
16125 59466 51214 17261 -5774 7672 3250 16191 18624 5927 22105 19626 -11784 -35159
16113 -35159 -72701 -91140 -65659 -43241 -40053 -36811 -28943 17029 14679 13088 27526 15669 373
16100C73m7453j2577N61J1184L5894K32N487J6884Q808M08l7915q27J0472k0159
16086b8628m6378M4405M6449J7919K7936J8942k2839n4171l9067n665j0464R870
16074d1691m236J5140J8928J3613P979L5025L3851k6174o6487m222J14J6566L275
16061A681J3236l104J4112l8594l0805M791M1585N4605k3770m897k7378l4347
16049c2885j9325K7003L9227q78l556K1420k1266l2826j2012p783J1520L6174
16037D813J1085k1197k693L0112J1043K7806k4184l5312j9046J4039J1964O175
16025A4605N770q014k7710J6962k3114m2936o73N0221m408K299j0117J5180O2347
16012E0412l7662p201L712k9800n941K7840M807j237j6384k5808N41K7544J1272
$$ plain form
16100 373 -47080 -59657 -59096 -47912 -12018 -11786 -6299 10585 19393 19801 -18114 -18941 -8469 -28628
16086 -28628 -75006 -30601 15848 33767 61703 80645 57806 3635 -35432 -41097 -51561 -41691
16074 -41691 -45927 -30787 -11859 1754 9733 44758 78609 52435 -14052 -18274 -18160 -1594 1681
16061 1681 14917 11813 25925 -12669 -43474 -38683 2902 57507 33737 28840 1462 -32885
16049 -32885 -52210 -25207 14020 13142 9586 31006 9740 -23086 -35098 -42881 -31361 4813
16037 4813 15898 -5299 -7992 22120 33163 60969 36785 1473 -17573 -3534 8430 14605
16025 14605 20375 12361 -15349 1613 -21501 -64437 -65110 -14889 -19297 -16998 -27115 -11935 50412
16012 50412 12750 5549 9261 -20539 -26480 1360 6167 4930 -11454 -37262 -36721 -9177 2095
15999B095L402r074j3543n23Q804j7535l0564K3593N2495j7882l2878K0610k1274
15986c2274J7038L0534j4851n283j4070j361N3501L9057k2590m7005m9993r564
15974e6861J6938J9643N1248r503k0944J511R993M4939P053j5129j1411j366N69
15961C6680n886j3041j4831M6504k1399j9184k5367K8469K0399J7291k9722n0214
15949c0301J5072K7433J4836o2919j6782O0339l254J784o54M7271M680n688n3838
15936b021p107o116K7030j2930k806K1581n308N096M2961q716r719l5255j6544
15923i854l5364j6667L4364K8660K0499K0491m171o4207M746p136K5328J5902
15911A2591m2595J2486J9013j9292l226m638m3345k3892N1829L3944m577n642
$$ plain form
15999 2095 5497 -3577 -17120 -17643 -8839 -26374 -56938 -33345 19150 1268 -31610 -11000 -32274
15986 -32274 -15236 15298 447 -4836 -18906 -20267 33234 72291 49701 2696 -47297 -56861
15974 -56861 -39923 -20280 30968 21465 521 2032 12025 56964 64017 48888 37477 36111 36680
15961 36680 30794 17753 2922 49426 28027 8843 -16524 11945 32344 49635 19913 -30301
15949 -30301 -15229 12204 27040 -35879 -52661 7678 4424 6208 5554 52825 57505 51817 -2021
15936 -2021 -9128 -15244 11786 -1144 -3950 17631 12323 17419 60380 51664 41945 6690 -9854
15923 -9854 -45218 -61885 -27521 1139 21638 42129 37958 -26249 -21503 -28639 -3311 12591
15911 12591 -30004 -17518 1495 -17797 -21023 -25661 -69006 -92898 -41069 -7125 -11702 -17344
15899a7344m3603j4821J6548J9801j7775K6744K9610l8645J896O2461M3160q117
15887E9915l6346k6814J8332M992J8626j7976l6549n5003l54L0232L6652L8002
15875C3709J2224J1168j2131j3185j1523l9378o171J2849K2011j3632j1853R537
15863f375J04N1871M109m3245L400n890j1514n2610L5054N305j2975J0530K8957
15850F721j3841l9773K3135L0546J2642j6149J0043J9081j0790K16j6108m2160
15838c6437K4936P925M573r763p023K8087j176n825j6032m348n97k7913Q242K6178
15824i173J376k0053L5208K2252q182j9806n093q344q050R887j2844J04L414L070
15810a6234K325j0441l7873M373J7235q03J4579M2507Q149j1083n1484k5406N221
$$ plain form
15899 -17344 -60947 -75768 -59220 -39419 -57194 -30450 -840 -39485 -37589 24872 68032 59915
15887 59915 23569 -3245 15087 20079 38705 20729 -15820 -70823 -71177 -40945 -4293 33709
15875 33709 45933 57101 44970 31785 20262 -19116 -25287 -12438 9573 -4059 -15912 -6375
15863 -6375 -6271 45600 49709 6464 9864 3974 -7540 -60150 -25096 -19791 -32766 -22236 6721
15850 6721 -7120 -46893 -23758 6788 19430 3281 13324 32405 21615 21831 5723 -36437
15838 -36437 -11501 -3576 997 -8766 -15789 12298 11122 5297 -10735 -15083 -15680 -43593 -35351 -9173
15824 -9173 -7797 -27850 7358 29610 21428 1622 -3471 -11815 -19865 -9978 -22822 -22718 -19304 -16234
15810 -16234 -13909 -24350 -62223 -57850 -40615 -41418 -26839 15668 23817 12734 -38750 -64156 -58935
15797e8935P599J8722L5719k2811l184j117J6358q046o601n433p210K506j117
15784c3550j8495m1642k0555Q5339O2327P00l3611k5855l6142J9667k963p11J9315
15771b6176m122K615O980J7763J7804L79m6117J1944K4326q004n1586j4769L1123
15758c7840L8240j0806K2354R493K3447o849J0584J5080n9094k0648K3209l999
15746C171l3358J8954K5264K3217J4579n7689l6814j1304M6014m051K530k1026
15734c0513j1381L2697J4150K1853j4637k5594k177K7839r513p579K8650J9376
15722D3171j8903j5738k9840j3889j1182J6190M0443q931j8724J2597k3502k2265
15710e0573J4131j5139J9997M5490j8910n763J5338L9170J5604n4618k2970j821
$$ plain form
15797 -58935 -51336 -32614 3105 -19706 -22890 -24007 -7649 -15695 -22296 -27729 -34939 -32433 -33550
15784 -33550 -52045 -93687 -114242 -28903 33424 34124 513 -25342 -61484 -41817 -44780 -45491 -26176
15771 -26176 -30298 -27683 -20703 -2940 14864 15243 -30874 -18930 5396 -2608 -54194 -68963 -37840
15758 -37840 400 -10406 11948 21441 44888 38039 48623 63703 4609 -16039 7170 3171
15746 3171 -30187 -11233 14031 37248 51827 -5862 -42676 -53980 -7966 -12017 -9487 -30513
15734 -30513 -41894 -9197 4953 26806 12169 -13425 -15602 12237 2724 -4855 23795 43171
15722 43171 24268 8530 -21310 -35199 -46381 -30191 10252 1321 -17403 -4806 -28308 -50573
15710 -50573 -36442 -51581 -31584 13906 -5004 -10767 4571 43741 59345 4727 -18243 -20064
15698b0064K8949j4422O022J5517k8301m9775J9584J7459O727p798L2288J2360
15686A8546l4378j2132l6780K3014K1286j3716J7150K2763L7902j4936o008K555
15674B5266N247K3016k2730n7721m1307j5528N1846N9888j5446k3304r640o118
15662b6531r001j4819M1685K6341K3045k4034n248M982P965k8716k982k598K5011
15649A5100j2971j6346J7277j2604k2002j1155K5819L4658N6292M401l8376k3165
15637A6928n1905K8947N5730N519P63j3615k9657j8983M263k6595R663L4427N759
15624B1244j2848m669k3078l2022l7270j604J5153l4493J0626K7026M506K4134
15612d3295M3724J0567L3203K8471K459j2044k3158n4934J1532L1648J1410j8383
$$ plain form
15698 -20064 8885 -5537 485 16002 -12299 -62074 -42490 -25031 -18304 -26102 6186 18546
15686 18546 -15832 -27964 -64744 -41730 -20444 -34160 -17010 5753 43655 28719 22711 25266
15674 25266 30513 53529 30799 -26922 -68229 -83757 -31911 27977 12531 -10773 -20413 -26531
15662 -26531 -35532 -50351 -8666 17675 40720 16686 11438 16420 24385 -4331 -7313 -9911 15100
15649 15100 2129 -14217 3060 -9544 -31546 -42701 -16882 17776 74068 78469 40093 16928
15637 16928 -34977 -6030 49700 55219 55982 42367 12710 -6273 -2010 -28605 -18942 15485 21244
15624 21244 8396 3727 -19351 -51373 -88643 -90247 -75094 -109587 -98961 -71935 -67429 -43295
15612 -43295 429 10996 44199 72670 75129 63085 39927 -15007 -3475 28173 39583 21200
15600B1200J483n494J6654k9626n0079j0807o157L2135q410K4362K3524N3551
15588F2336J6173k3432n2850j9381j8865J3702L8376J5716j3079N932J0641q590
15576B6679k7326k3390M884M4649J5064j3218k0559j4193k0640j4807m398n1584
15564i8839K7002N2476L651m560m051J4144L4163K2692q094M6J33l724L3037R230
15550G7306j9624J781j3702R548M1074J6668k6883j0247l7716p1201M284N3006
15538B4294m4092o7502K0196N3270M0464J2910M619Q223P800k6411J9964n343
15526D8392m3315l6115M415L1474M4000j2234l4593m6078j3418J0332L4391L1606
15514A8857p995k9482J9526N335K159J3056l8850k588M7982K6242m9758m6317
$$ plain form
15600 21200 22683 17189 33843 4217 -45862 -56669 -62826 -30691 -39101 -14739 8785 62336
15588 62336 78509 55077 2227 -17154 -36019 -22317 16059 31775 18696 24628 35269 26679
15576 26679 -647 -24037 -19153 25496 40560 27342 6783 -7410 -28050 -42857 -47255 -98839
15564 -98839 -71837 -19361 -15710 -20270 -24321 -10177 23986 46678 38584 38630 38763 35039 68076 77306
15550 77306 57682 59463 45761 55309 96383 113051 86168 75921 38205 -32996 -28712 24294
15538 24294 -19798 -87300 -67104 -13834 26630 39540 44159 52382 60182 33771 53735 48392
15526 48392 5077 -31038 -26623 4851 48851 36617 2024 -44054 -57472 -47140 -12749 18857
15514 18857 10862 -18620 906 6241 8400 21456 -17394 -19982 28000 54242 4484 -41833
15502d1833L846K0810j1157k1746L6390J2654k9881k9877N26Q197L7444k1334
15490c5961K3482M4845j252k9035K1559O7535k9025l5761M4513J175L782m4025
15478C1832k7802k6790J0949M1111R350k0362r68J4711j6083J5020o9059p879
15466d5970L4036k9467j1287L5677O8421K7699p4969l3566M867M6224J5397m6519
15454i457O083J9745k4630j58j830l937J2546K0964j3385j4424r318l7068j3367
15441f8236L2558j8921j7735K2997k8037J2420J4365J1877L1466M0283j2798L819
15429B4058k3571j8772K915j7508L7806q614q590K5231j4088r160l054j545L6649
15416B1757j7661k0719m5933k6160N4246M1674m3679k2809J8809k9177N33L4737
$$ plain form
15502 -41833 -37987 -17177 -28334 -50080 -13690 -1036 -30917 -60794 -60268 -52071 -14627 -35961
15490 -35961 -12479 32366 31114 2079 23638 91173 62148 26387 70900 72075 75857 31832
15478 31832 4030 -22760 -11811 29300 38650 18288 17320 32031 15948 30968 -38091 -45970
15466 -45970 -11934 -41401 -52688 -17011 51410 79109 4140 -29426 -24559 21665 37062 -9457
15454 -9457 -3374 16371 -8259 -8417 -10247 -14184 -1638 19326 5941 -8483 -17801 -54869 -68236
15441 -68236 -35678 -54599 -72334 -49337 -77374 -64954 -50589 -38712 -7246 33037 20239 24058
15429 24058 487 -18285 -15370 -32878 4928 -3686 -12276 12955 -1133 -10293 -13347 -14892 21757
15416 21757 4096 -16623 -62556 -88716 -34470 7204 -36475 -59284 -40475 -69652 -69119 -34382
15404c4382N7897J4270j4877k3012L90M7032j3458l7058j6297j5994o031K3130
15392a8390L552J8433j691J8965m146R843J6217p04l4443K6871n386J2078L0348
15379G1547r697q283P188j2422j3653n8734j3081k7887K55L1304L1425K315M550
15366D827j6673l6872M625J3503J9058P234K134k4260k6962O743L2058M4118k3293
15353F240l1831k0350k3117L3047r77m3724j2075K0921M7593N0800j0242j8353
15341b068j6605K8527K2373k597J7153Q522m3221k7003j7124k5874k877M5650
15329a5144L4516m035J3775K850l0426m3242j4201K3081j606K6272K1817l3128
15317a9471m8284j2606J3705M4440q265l8075K388M2087J8662n917p611l4980
$$ plain form
15404 -34382 23515 37785 22908 -104 286 47318 33860 -3198 -19495 -35489 -41520 -18390
15392 -18390 -14838 3595 1904 20869 16723 26566 42783 42079 7636 34507 29121 41199 71547
15379 71547 61850 53567 60755 48333 34680 -24054 -37135 -65022 -64767 -33463 -2038 277 4827
15366 4827 -11846 -48718 -44093 -30590 -11532 -4298 -2164 -26424 -53386 -46643 -14585 29533 6240
15353 6240 -25591 -45941 -69058 -36011 -36988 -80712 -92787 -71866 -24273 26527 16285 -2068
15341 -2068 -18673 9854 32227 29630 46783 55305 12084 -14919 -32043 -57917 -60794 -15144
15329 -15144 19372 15337 29112 31962 1536 -41706 -55907 -32826 -34432 -8160 13657 -19471
15317 -19471 -67755 -80361 -66656 -22216 -30481 -68556 -66168 -24081 -5419 -11336 -18947 -53927
15305e3927j887l7919J5817L2357K3877N4849Q102j055k2345k9466n3989M7995
15293a7591L5064k1380k436J7245J684K3465J2653n2867l8488P079K5710L1040
15281B1178r242J6467j312N111k3730n3705P595K2244L1053l086j7353j3746j0283
15268b8809P360k6237r241K2280k3655m0460K5238O5350K4202p18M8877M3381
15256A07568k8196k8134K4689m7502R04J5453J3717k300k3675n233K8506k4263
15244C1534L650J9828J1367l161n8266m2254K5699L4457p437n2147K9758J1685
15232D713j4638q697l9514j3173R051L3965K3889K7138l59k706k5258n859K2220
15219A0772R204k9725m3282L8516M0350J785k7838P435J5145K6391m552l8164
$$ plain form
15305 -53927 -55814 -93733 -77916 -45559 -21682 33167 41269 40214 17869 -11597 -65586 -17591
15293 -17591 17473 -3907 -6343 10902 12586 36051 48704 -4163 -42651 -35572 -9862 21178
15281 21178 11936 28403 27091 32202 8472 -45233 -37638 -15394 15659 12573 -4780 -18526 -28809
15268 -28809 -21449 -47686 -56927 -34647 -58302 -98762 -73524 -8174 16028 15310 64187 107568
15256 107568 79372 51238 75927 28425 29329 44782 58499 56199 32524 27291 55797 31534
15244 31534 35184 55012 66379 63218 4952 -37302 -11603 22854 15417 -36730 -6972 4713
15232 4713 -9925 -18622 -58136 -71309 -62258 -28293 -4404 22734 22375 19669 -5589 -11448 10772
15219 10772 19976 -9749 -53031 -14515 25835 27620 -218 7217 22362 48753 44201 6037
15207F037k2477J1684J5525r083k1342j8287L1560L2128j3125m0281m089L330
15195b8420j5638j4209K5938M116l2976J8390K3566L6226L1324J6805l5427n0839
15183b1144k3575K0049K0482L507k9990k7328j536m812o420J6548O1173M2310
15171D9264O162j9762j7632j4321j0679m1179k61J0460M5833L817O716J1727j8077
15158A2068k5296k3750O54q049p459K2552L8919J2552P756M131k5965m644J5533
15145A9002k0099J3976J1021N148l9269j3177n639P656L1033J3329O0113K4298
15133A07392J474l8847l3532m4107L7011J7029k0640k3449m435m950N557J4795
15121A3298j7833p946L1689j9197q275L0731L92l4359l129L3610N1767P50l1170
$$ plain form
15207 6037 -16440 -4756 10769 1686 -19656 -37943 -6383 25745 12620 -27661 -31750 -28420
15195 -28420 -44058 -58267 -32329 -28213 -61189 -42799 -19233 16993 48317 65122 29695 -21144
15183 -21144 -44719 -24670 -4188 -681 -30671 -57999 -59535 -64347 -70767 -54219 6954 49264
15171 49264 55426 35664 18032 3711 -6968 -48147 -48408 -37948 7885 11702 18418 30145 12068
15158 12068 -13228 -36978 -36324 -44373 -51832 -29280 9639 22191 29947 34078 8113 3469 19002
15145 19002 -1097 12879 23900 29048 -10221 -23398 -29037 -21381 9652 22981 83094 107392
15133 107392 108866 70019 36487 -7620 29391 46420 25780 2331 -2104 -7054 -1497 13298
15121 13298 -4535 -12481 19208 11 -8264 22467 22859 -11500 -14629 18981 70748 71498 40328
15108D0328J8161m3181J4399n4848o0790J5308K769o783M5092K912L0596k865
15096A098n1081J7140L0212k9066K4421k564J5966J2873k375j8186O192J0873
15084A5503R535J9716l2731R156N454j8109J3774j8637J4058j7674o220L4794
15072B8619j7056k1683N5095j2607k0785N944p604k3376m249K6850K1760L2183
15060F3091J248k7345j1140l2720L506j5340l0345l647j5424J6306N8062P635
15048A3887j0066J9296l4261L5790O861q035k2217j6370j5174J4989l2204J5443
15036c2061M4923J2924J5577j4763Q034o8089o0913L6396O8221P736j1716J8447
15024B4716J0741j1153l6918J1932N569m9420P098L5058j8363j8423K0345Q023
$$ plain form
15108 40328 58489 15308 29707 -25141 -85931 -70623 -67854 -74637 -29545 -26633 3963 1098
15096 1098 -49983 -32843 -2631 -31697 -7276 -9840 6126 18999 16624 -1562 4630 15503
15084 15503 25038 44754 12023 21179 26633 8524 22298 3661 17719 45 -6175 28619
15072 28619 11563 -10120 44975 32368 11583 17527 9923 -13453 -17702 9148 30908 63091
15060 63091 64339 36994 25854 -6866 -3360 -18700 -49045 -52692 -68116 -51810 6252 13887
15048 13887 3821 23117 -11144 24646 31507 23472 1255 -15115 -30289 -15300 -47504 -32061
15036 -32061 12862 25786 41363 26600 34634 -33455 -94368 -57972 10249 17985 6269 24716
15024 24716 35457 24304 -12614 -682 4887 -44533 -37435 -2377 -20740 -39163 -18818 -10795
15012a0795l7356K6454L4989J96Q986k0503k0006o535M9978M8272J4652k9918
15000E8414r813k5500j4419j9165m607J6516K5322p029j288K5741K1230n5418
14988I984k3190J5096j1774k2483k577r792l9250j8520M1912N1998K3164k2583
14976h015J9826O097q896L8424J9026l5612m9556k646J3544q599p502q375j1767
14963d4051N2415j5914l8822l6732J9251j6263j816O0792J9365j794m0837k3549
14951f7955J5382J5473K4744j4877J8576j5561Q126m43k8088R582L4669N0562
14939E0190m1R727K341k2085k7703P536j6407l8950j9733J520R763M8964j3283
14926h161L144j5846J572J0319J5842K1257j2969m5339k1882L5231L6073j2172
$$ plain form
15012 -10795 -48151 -21697 13292 13488 22474 1971 -18035 -24570 25408 73680 88332 58414
15000 58414 48601 23101 8682 -10483 -15090 1426 26748 19719 18431 44172 65402 9984
14988 9984 -13206 1890 -9884 -32367 -34944 -44736 -83986 -102506 -60594 -8596 14568 -8015
14976 -8015 11811 17908 9012 47436 66462 30850 -18706 -21352 -7808 -16407 -23909 -32284 -44051
14963 -44051 8364 -7550 -46372 -83104 -63853 -80116 -81932 -21140 -1775 -3569 -44406 -67955
14951 -67955 -52573 -37100 -12356 -27233 -8657 -24218 -16092 -16535 -44623 -35041 -372 50190
14939 50190 50149 59876 62217 40132 12429 19965 3558 -35392 -55125 -53605 -43842 5122 -8161
14926 -8161 -5017 -20863 -19291 -8972 6870 28127 15158 -30181 -52063 -16832 19241 7069
14914G069l69j5073M4626L1272k7674k9022K207J259q100J1641K8896N124l4599
14901A7257j1587J8614k8783k8708Q643L9629L0151j2559k5022l5503K5364k2102
14889b4606k5560l975K4254K4032j4795p893J6733J8631K0411j6573n2220k6659
14877f8220j138K3673M3938j5010m6205M069K6598J9487o614j1222p295r635j400
14864d8974K9304J1815n7164k1221K6958K6039P706J9296n0535o738m2141k2784
14852a28439L4267L8674P1681N3484k8283l497M8824k9853m1909k6512N395O228
14840F0k0496j0173P490J2164L0047p123K6603j435j2582j1052j7252j3339k3523
14827d0611P1L2465J4045M102k14j577l9935J3850R265o848l197J9757J1632n022
$$ plain form
14914 7069 6700 -8373 36253 67525 39851 10829 13036 14295 6195 17836 46732 51856 17257
14901 17257 5670 24284 -4499 -33207 -24564 15065 45216 32657 7635 -27868 -2504 -24606
14889 -24606 -50166 -54141 -29887 -5855 -20650 -28543 -11810 6821 27232 10659 -41561 -68220
14877 -68220 -69358 -45685 -1747 -16757 -62962 -58893 -32295 -12808 -19422 -30644 -37939 -47574 -48974
14864 -48974 -19670 -7855 -65019 -86240 -59282 -33243 -25537 -6241 -56776 -63514 -105655 -128439
14852 -128439 -94172 -55498 16183 69667 41384 37887 86711 56858 14949 -11563 -6168 60
14840 60 -20436 -30609 -23119 -10955 19092 11969 38572 37137 24555 13503 -3749 -17088 -40611
14827 -40611 -40540 -8075 5970 10072 9858 8281 -31654 -17804 -8539 -15387 -18584 1173 12805 7783
14813G783K5613q492l3546J4421J249q894k9212k312L2595K431m4718o704K6098
14800b3688J7622p422J9689j3226k8175J9737M3590J6280J142k581N66N481K3429
14787G2444J1851O0607M4608N9052P6979K3825L5640J7535l9689n3734j0086M079
14775C03111j1056n5025o6876o0881l2900K2256J1330K9042j626k6395m6787l0173
14763C4020J8555N71k3038J2573L083m8654K095M6868j4553j7994L1059j1592
14751C2993k7703j7879r976Q973k974K5555K7449k4976j9720L4701J1061j9294
14739A8210m580k6531j5209m388j9961k40K6000n479J6680j3780L004q95K316
14726b4853M739K4484J6079K1146k4501j633j4703j408m0999k7147K0807J1682
$$ plain form
14813 7783 33396 24904 -8642 5779 7028 -1866 -31078 -33390 -795 1636 -43082 -49786 -23688
14800 -23688 -6066 -13488 6201 -7025 -35200 -15463 28127 44407 45549 42968 43534 49015 72444
14787 72444 84295 144902 189510 248562 325541 349366 385006 402541 362852 309118 299032 303111
14775 303111 292055 237030 170154 109273 76373 98629 109959 139001 137375 110980 64193 34020
14763 34020 52575 53146 30108 42681 45764 -2890 -795 46073 31520 13526 44585 32993
14751 32993 5290 -12589 -22565 -13592 -16566 8989 36438 11462 -8258 26443 37504 18210
14739 18210 13630 -12901 -28110 -32498 -52459 -52699 -26699 -32178 -15498 -29278 -26274 -27169 -24853
14726 -24853 -20114 4370 20449 41595 17094 15461 758 -650 -41649 -68796 -47989 -36307
14714c6307K816J0867K0428j9524k1679l4142j9893Q462N310M7556l0179k6935
14702i3220L3647L9144k5022O102L7758j0955J4932L0146m8507N176M6649J7228
14690E3078j0470O777M0158k9069l3322P049o026J0965q056L2911m87k8318j8681
14677A6509j0879j9684O092K3223P777o027l1239K58Q786j2039J349j1016r056
14664c5946K6424L2014j4244O62k6525K152J1691M090k1178p932L2593K8639j9120
14651A3320k5397l5447M1672J3146O383L0512j8281m773k5641l3280P140L2540
14639A894N8988L7315L6157J0216k0745l8900l5105k9479k8647K0309P431m469
14627A4965q188K0530j3229j2166K0901J2899m4123q250K1808n03l565j4981j4013
$$ plain form
14714 -36307 -33491 -22624 -2196 -21720 -43399 -77541 -97434 -88972 -83662 -36106 -66285 -93220
14702 -93220 -59573 -20429 -45451 -39349 -1591 -12546 2386 32532 -15975 -10799 35850 53078
14690 53078 42608 49385 89543 60474 27152 34201 28175 39140 31084 63995 63508 35190 16509
14677 16509 5630 -14054 -7962 15261 23038 17011 -14228 -13970 -5184 -17223 -15874 -26890 -35946
14664 -35946 -9522 22492 8248 8910 -17615 -15463 -3772 318 -20860 -28792 3801 32440 13320
14651 13320 -12077 -47524 -5852 7294 13677 44189 25908 21135 -4506 -37786 -30646 1894
14639 1894 60882 98197 134354 144570 123825 84925 49820 20341 -8306 12003 19434 14965
14627 14965 6777 27307 14078 1912 22813 35712 -8411 -16661 5147 4644 1079 -13902 -27915
14614b7915L5493O0122P921j0878J3323J8475j7909n0090r893J6158r6l745K4815
14601E5781L9629k1250m8654j7273J5325l064m3834O459J6225l241J3007L2249
14589D1359L3107j9988j3966K109j558m1956l3350Q416K807J0956K3940q456j0015
14576f595p481l5838j6681J2598M0992j5359P716K5855j1922L1881j3558l0673
14564a9065q797L4880P780n456J508P828o1312Q738M978J1070m9235q742J2899
14551f2926J7162m842k05K1575K6569K5340N5423J4569j9662J2855m918l1646
14539D9294m5810k637j4350N621R78J4729o138o374j7150j2490K1959J2183o0074
14526f0259j4072J5243J7571K413k6134k000L0927J7581L6221j325K554m0756
$$ plain form
14614 -27915 7578 67700 75621 64743 78066 96541 78632 28542 18649 34807 34711 30966 55781
14601 55781 95410 74160 25506 8233 23558 20494 -23340 -16881 -656 -3897 9110 41359
14589 41359 74466 54478 40512 42621 41063 -893 -34243 -25827 -23020 -12064 11876 3420 -6595
14576 -6595 -14076 -49914 -66595 -53997 -13005 -28364 -20648 5207 -6715 25166 11608 -19065
14564 -19065 -27862 7018 14798 9342 10850 18678 -42634 -33896 -28918 -17848 -67083 -75825 -62926
14551 -62926 -45764 -50606 -50811 -29236 -2667 22673 78096 92665 73003 85858 80940 49294
14539 49294 3484 847 -13503 -7882 -6904 7825 1687 -4687 -21837 -34327 -12368 -185 -60259
14526 -60259 -74331 -59088 -41517 -39104 -65238 -67238 -36311 -18730 17491 16166 18720 -22036
14514b2036M041n899L004m6891k7724K6769K4501L3714l1049L3132J4919l3384
14502b6903j6991L102N832j7003L376p147j9873K7109K4697j2935l1177l783K2034
14489d9662J1519M4787K7094q949l8298k9824J1169N010J8844M7904k735q4519
14477d7660j4200r540L0074L0043j980p038o623J2680J0916j5061k678J1050K1172
14464A1155K2552j8409K68k8193k1838k385q612r384J0019P860K8562L283l8897
14451d4019K1394k759K60J727L6563p88l3115k731J7035l8214q016J9734J2473
14438b0456M854n161P640J6624K7192M8993l474m3798J575O959l7909K7829q574
14425B2294J2858K91R30J7066P811J2807l0931k3205J9090l3867j8235K7543K1225
$$ plain form
14514 -22036 -17995 -23894 -20890 -67781 -95505 -68736 -44235 -10521 -41570 -8438 6481 -26903
14502 -26903 -43894 -40792 -34960 -51963 -48587 -55734 -75607 -48498 -23801 -36736 -67913 -71696 -49662
14489 -49662 -38143 6644 33738 24789 -13509 -43333 -32164 -27154 -8310 39594 36859 -47660
14477 -47660 -61860 -71400 -41326 -11283 -13263 -20301 -26924 -14244 -3328 -18389 -21067 -10017 11155
14464 11155 33707 15298 15566 -12627 -34465 -36850 -45462 -54846 -44827 -36967 -8405 -5122 -44019
14451 -44019 -22625 -25384 -25124 -23397 13166 12378 -20737 -23468 -6433 -44647 -52663 -32929 -20456
14438 -20456 -15602 -20763 -13123 3501 30693 79686 76212 32414 33989 40948 3039 30868 22294
14425 22294 35152 35443 36373 53439 61250 74057 43126 19921 39011 5144 -13091 14452 35677
14412C5677j0728j2694J740j8764j3229l2396o816J1911J9858N7453L443j9470
14400A5985m9182j7736J5341o952j7789K4067p427j6666K5901O0456k307J5975
14388C9666K0280p513k8799r15L5756q257l8045k7290P71K063j4136J3241J5927
14375B749q257M829k691k4464m570k2466l23M3922L9212J3554j5473K4716l2192
14362A8546j2689j5928j4177L2185J6987N0141k0703k7774J2411J6646k0k1875
14350C3750j0864K3721O506n3917j7282r236M4372M1227N521n443j9740l566L200
14337C8249k4881m7283j2326J2557p765O214L7647O5853J0197o974l246m8320
14325A9922k1462Q791k7886j6853K1821r033M435J488O282J5508l4890N624K5301
$$ plain form
14412 35677 24949 12255 13995 -4769 -17998 -50394 -57210 -45299 -25441 32012 35455 15985
14400 15985 -33197 -50933 -35592 -42544 -60333 -36266 -43693 -60359 -34458 25998 23691 39666
14388 39666 59946 52433 23634 22719 58475 50218 12173 -15117 -14346 -12283 -26419 -13178 2749
14375 2749 -5508 -679 -3370 -27834 -32404 -54870 -55193 -11271 27941 41495 26022 50738 18546
14362 18546 5857 -10071 -24248 7937 24924 75065 54362 26588 38999 55645 55625 33750
14350 33750 22886 46607 53113 -804 -18086 -27322 17050 58277 63798 58355 38615 35049 38249
14337 38249 13368 -33915 -46241 -33684 -41449 -35235 2412 68265 78462 71488 68242 19922
14325 19922 -1540 7251 -20635 -37488 -15667 -24700 -20265 -18777 -12495 3013 -31877 -26253 -952
14312i52j5313l4034K1211j1114J988R010j3779k8237k7078Q24M577N250K6157
14299f1490L1407J855j8707K2107k0468L0480K900J4769J16J5366K376r447l0889
14286a9625j5853R929r003k1031J2317L101L3507K4464M0726k57r725K1307k9165
14273D0692m511P824K9933j5743r648j2920J3863L9673k9341r8856J1777L4934
14261G677p703K9969j2969k6387k3644P35M7199J7068N444J5465n6731l0487p78
14248c5142l2560K2403L9834L5785m603o9029o56O1071J0255k2747l1754L4756
14236G613j0923l997L5219q197k9715M357j5112o513j7041m1689k2379M3246K8479
14223c6652R621l7446K0563p337M425m624J2551L754k7868J1123K3140L5513J9614
$$ plain form
14312 -952 -16265 -50299 -29088 -40202 -38214 -29204 -42983 -71220 -98298 -97474 -92897 -87647 -61490
14299 -61490 -30083 -28228 -46935 -24828 -45296 -14816 -11916 2853 2969 18335 20711 11264 -19625
14286 -19625 -35478 -25549 -34552 -55583 -43266 -40165 -6658 17806 58532 58275 48550 69857 40692
14273 40692 36181 44005 73938 58195 48547 35627 49490 89163 59822 -39034 -27257 7677
14261 7677 -26 29943 16974 -9413 -33057 -32322 14877 31945 37389 52854 -3877 -34364 -35142
14248 -35142 -67702 -45299 -5465 30320 25717 -43312 -43968 17103 27358 4611 -27143 7613
14236 7613 -3310 -7307 27912 19715 -10000 -5643 -20755 -27268 -44309 -85998 -108377 -65131 -36652
14223 -36652 -27031 -64477 -43914 -51251 -46826 -51450 -38899 -35145 -63013 -51890 -28750 6763 26377
14210B6377L5275j0687j0604j2964m276j5708J840J884J8301P932p892J6512n130
14197D0860m2571L5981M0986R169k4026K6965Q083r699L5549N476l7335j389j6825
14184G1224j3146J887J5502N6422m250q963K0569K7303j4458J7346k0793l7552
14172A11091k4718L3728K9736K190o5613j4650J4937M0541l7592l0774J875K1373
14160H2124j8876n8303o77J765Q704l534J348M8685L4916n2068k8843O4039J0888
14147I0168M83k6493k1961l4614J4469N4881L0950r725k7883M703J7198N627J2874
14134A10677k0441Q397m601J072J9350k6543n3435k5377l3347L9275L3811J8936
14122F7774J5483r014l2087j8299M234N7177N628m7179L3224k6156n3586l7156
$$ plain form
14210 26377 61652 50965 40361 27397 23121 7413 9253 11137 29438 37370 29478 45990 40860
14197 40860 -1711 34270 75256 84425 60399 87364 95447 85748 121297 126773 89438 88049 71224
14184 71224 58078 59965 75467 131889 127639 118676 139245 166548 152090 169436 148643 111091
14172 111091 86373 120101 149837 152027 86414 71764 86701 127242 89650 58876 60751 82124
14160 82124 63248 4945 4268 6033 14737 11203 12551 61236 96152 44084 15241 79280 90168
14147 90168 90651 64158 42197 7583 22052 76933 107883 98158 70275 74978 92176 97803 110677
14134 110677 90236 98633 94032 95104 114454 87911 34476 9099 -24248 15027 48838 67774
14122 67774 83257 74243 42156 23857 28091 85268 90896 43717 76941 50785 -2801 -39957
14110c9957J0684K7884l7422j5376K7115M2260P391P231M4836k2224k7652J3535
14098C8305J2939K8181k4814l6384o333K739q997n539J500j1889L0831L4257j1074
14085D3722O898K350k4453n8144k7439J1397J7208j0522J666J0932N1644j5014
14073A0245k9468K3932J6804o993k0348J4192m8733N362J1264k3178j7204n170
14061f9295L3282L1023L140k0788K108R447o383k7593J4059k2022o111M9494r613
14048a9252K725J6498J6098M4355P940o1000o689j3956N29l168l9405k3440K8385
14035e0380J4060K6990L849o521K4363O034k3338j3727l8262j040k187M177K0651
14022c5331M3401J7545l5534m8744j6279J837N0011P460j0731J6754N0280k8074
$$ plain form
14110 -39957 -29273 -1389 -38811 -54187 -27072 15188 22579 29810 74646 52422 24770 38305
14098 38305 51244 79425 54611 18227 11894 14633 5636 97 1597 -10292 20539 54796 43722
14085 43722 50620 52970 28517 -29627 -57066 -45669 -28461 -38983 -37317 -26385 25259 10245
14073 10245 -19223 4709 21513 14520 -5828 8364 -40369 -35007 -23743 -46921 -64125 -69295
14061 -69295 -36013 -4990 -1850 -22638 -20530 -11083 -17466 -45059 -31000 -53022 -59133 -9639 -19252
14048 -19252 -16527 -29 16069 60424 68364 7364 675 -13281 -12752 -15920 -55325 -78765 -50380
14035 -50380 -36320 -9330 -5481 -12002 12361 18395 -4943 -18670 -56932 -57972 -60159 -55982 -35331
14022 -35331 8070 25615 -9919 -58663 -74942 -73105 -23094 -15634 -26365 -9611 40669 12595
14010A2595K277J1585j3854k0976l6185R788K3092l1296j3612P917L8337P9540
13998F9208l5779k7630j5904J9322o579j9748L4902j5480k7139o093j4298N7466
13986A2248l1810j6243K6385L4779M4063j7340q4909p1692M405P4190L2284J3202
13974A9562J2801o72l5763k5719k0848K7242M6825P075m6649J4503J5770j2001
13962B126l8269K7617J9144J0R94P906o5275l5128J1925K8416k2152n857L7773
13949c0770J4254k3984o1221J5443J6522l174K656P7700K7139j9474k078l576
13937I437j8943J8579L4539j989m4900k7412M0692k4119K9551J0971j3243J1625
13925B4788K656K2680l1936o393k8499J3011j9789m8571M0879L6483k798J9080
$$ plain form
14010 12595 14872 26457 12603 -8373 -44558 -34770 -11678 -42974 -56586 -48669 -10332 69208
13998 69208 33429 5799 -10105 9217 2638 -17110 17792 2312 -24827 -30920 -45218 12248
13986 12248 -19562 -35805 -9420 25359 69422 52082 -32827 -104519 -100114 -25924 6360 19562
13974 19562 32363 31691 -4072 -29791 -50639 -23397 23428 30503 -16146 -1643 14127 2126
13962 2126 -36143 -8526 10618 10628 11622 19528 -45747 -80875 -68950 -40534 -62686 -68543 -30770
13949 -30770 -16516 -40500 -101721 -86278 -69756 -72930 -70274 7426 34565 15091 13013 9437
13937 9437 -9506 9073 43612 41623 -3277 -30689 10003 -14116 15435 26406 13163 24788
13925 24788 27444 50124 18188 11795 -16704 -3693 -23482 -72053 -31174 5309 2511 21591
13913B1591Q65K1373J6517k7067j5781l524K420j9974Q329J8664m820o098j5771
13900c276l2926l304J3783j3589K2954J6974L1785P479k7091j2750qj6604l5705
13887e2278n4408l763J0401N6664K2474K1743O856k1906j3489j7953k5812K3212
13875d8259L1408m3318r321K7681K8470K9944j0744J9148j6071K7464l8490m055
13863f143L6245j1072k3878m847J5545J9897j2005J5916M6433m6566m7506l6508
13851e4489L7261J9365p87j1278J6048R630k3934j2855N783L76p161L8590L5517
13838E2066K0583k7364L7249K3733J6903m1686n5578o6290K7507j7916J2400j0945
13826b9338j220J8386q784q916J2260L3658K0432j9446k3624j0973K218K9552
$$ plain form
13913 21591 22456 43829 60346 33279 17498 13974 16394 -3580 4749 23413 18593 12495 -3276
13900 -3276 -36202 -39506 -25723 -39312 -16358 616 32401 39880 12789 39 31 -16573 -52278
13887 -52278 -106686 -110449 -100048 -43384 -20910 833 7689 -14217 -27706 -45659 -71471 -48259
13875 -48259 -16851 -60169 -69490 -41809 -13339 16605 5861 25009 8938 36402 -2088 -6143
13863 -6143 30102 19030 -4848 -9695 5850 25747 13742 29658 76091 29525 -17981 -54489
13851 -54489 -17228 2137 1350 -9928 6120 15750 -8184 -21039 -15256 -14880 -22041 16549 52066
13838 52066 72649 45285 82534 106267 123170 81484 25906 -40384 -12877 -30793 -18393 -29338
13826 -29338 -30558 -12172 -20956 -29872 -17612 16046 36478 17032 -6592 -17565 -15347 14205
13814A4205j8845l8230L5360M938R683Q380n4330k5757K3633L6507J5548j168
13802I924q611j1594m7635l3705J8117P2767J2670l8088J1989m944j5431N30j4506
13789d8517K1610q557l0799j5025K3800J5213m3232j6041M4912L4080J7432J1928
13777F804J1265J1213k6p097J3334m1586n8227q566K6827M9535K2784O316j7058
13764A5518k8904J2792l068k0636j3827n368p931J0386J7495J94j35J5459J5413
13751G388j9137L2627K3607L2794q760k1530k1661J1535J0930l4658Q32J8567
13739C2534k5062L070j6186L092K2348P970k9531l679P949J2608J9873p391j5843
13726A1752K6361O369j1549k4678R436j300p618k9241k2696J7143K8552J2302
$$ plain form
13814 14205 -4640 -42870 -7510 -2572 7111 15491 -38839 -64596 -40963 -4456 11092 9924
13802 9924 1313 -10281 -57916 -91621 -73504 -737 11933 -26155 -14166 -19110 -34541 -34011 -48517
13789 -48517 -26907 -35464 -66263 -81288 -57488 -42275 -85507 -101548 -56636 -22556 -5124 6804
13777 6804 18069 29282 29256 22159 35493 -6093 -64320 -72886 -46059 3476 26260 32576 15518
13764 15518 -13386 -594 -3662 -24298 -38125 -43493 -51424 -41038 -23543 -23349 -23484 -8025 7388
13751 7388 -11749 20878 44485 77279 68519 46989 25328 36863 47793 13135 13967 32534
13739 32534 7472 10542 -5644 -2552 19796 27766 -1765 -5444 2505 15113 34986 27595 11752
13726 11752 38113 44482 32933 8255 17691 16391 8773 -20468 -43164 -26021 2531 14833
13714A4833K1905k3140k6473k3614K7856K4174K9785k3289l6340m133j4095J3388
13702a9143J2169K1839j6758n3685L398M3705K1639m830j0751J1218J8386J5693
13690D2880j1829L3293m2553k6308L6428J0098j1647J9454k9609j7818Q864l2108
13678b0855p55K8163k1312K772J9649m2714N186J9932q437j1787P681N683K2909
13665F115l367l0610J8267m698j9838J9800J4761K429J583k2310L2965M5529p631
13652E2995j558j880n8169l2456K1245J3166K2058M0827p097K1876m0966M985
13640C5026q630n465J0828m5182J1130l0911K0883l3256j6895J9146k6254k4641
13628i4221O3810P944j8005L4021K1127J2485O473M944J439j5522l6340j8952
$$ plain form
13714 14833 36738 13598 -12875 -36489 -8633 15541 45326 22037 -14303 -18436 -32531 -19143
13702 -19143 -6974 14865 -1893 -55578 -52180 -8475 13164 8334 -2417 8801 27187 42880
13690 42880 31051 64344 21791 -4517 31911 42009 30362 49816 20207 2389 11253 -20855
13678 -20855 -21610 6553 -14759 -11987 7662 -35052 -29866 -9934 -18371 -30158 -22477 -16794 6115
13665 6115 2748 -27862 -9595 -14293 -34131 -14331 430 2859 4442 -17868 15097 60626 52995
13652 52995 51437 49557 -8612 -41068 -19823 -6657 15401 56228 49131 71007 30041 35026
13640 35026 26396 20931 31759 -13423 -2293 -33204 -12321 -45577 -62472 -43326 -69580 -94221
13628 -94221 -30411 -22467 -40472 -6451 14676 27161 33634 38578 40017 24495 -11845 -30797
13616c0797N514r938L7243N264K135O5107L6847p685m0156k7245l0348k1987k9663
13603d5709N797L696P873n613M2229r26J6806K8617k1002K66j59j7951J94J4307
13589B8425r49j2408Q127m756j3800M044L4685m0830K1757N2069K0279p4286m5143
13576b2786l609J5853N2836J7419l4508n2161J6046Q902L1485P05p938K0499J1955
13563E4698n060j8468n1277K1641L5754J7565j2661J1490k1271l478K0370j8603
13551C0700l6384j278K5187K4558K2156m6173o2849R171K8175J5381j8970L822
13539f504l5230j2588M2564O4945K9485l6077m9262M581l133j044J4414m1733
13527b9582J2184q330j3335J6093N513l0492J7913k0M6289J9960O792k35k7588
$$ plain form
13616 -30797 -25283 -35221 2022 7286 9421 74528 111375 103690 63534 36289 5941 -16046 -45709
13603 -45709 -39912 -36216 -28343 -33956 8273 7347 24153 52770 31768 32034 31875 13924 14118 28425
13589 28425 27476 15068 23195 18439 4639 8683 43368 2538 24295 76364 96643 22357 -22786
13576 -22786 -26395 -10542 42294 59713 25205 -26956 -10910 -2008 29477 30182 22244 42743 54698
13563 54698 49638 31170 -20107 1534 37288 54853 42192 53682 32411 28933 49303 30700
13551 30700 -5684 -6962 18225 42783 64939 18766 -44083 -34912 -6737 8644 -10326 -6504
13539 -6504 -41734 -54322 -11758 53187 82672 46595 -2667 1914 -1219 -2263 12151 -29582
13527 -29582 -17398 -25728 -39063 -22970 -17457 -47949 -30036 -30056 16233 36193 42985 42750 15162
13514A5162M727k489j8392k3403p483m1921K9677j172j3803L307j9657L6068M3160
13501C781m3699j265M3697K8272O368j832j6889k5068R287N3196j2992J4491j9996
13488C7351n1189j8010o494L7491K1069m2315k2678K3399l9156J401J8424j064
13476d1771j8803J3957k9077l0429L6294P5771r33M881Q648J0431j3634n3234
13464c7899m3747K3610K1339l421k4228L6451J2796j2372J7560l0905J1183K4054
13452e579L3786K9922J031l4203p228M2493k3201J1569O642n0746l3467K5739
13440c242L252l3856q701L8716L1851O988j1957j5908M35J0500L1692j9602l6562
13427f394j6650J5278j4490J849N3728J6172k8990l403m3744k2019K9388J8805
$$ plain form
13514 15162 19889 17400 -992 -24395 -31878 -73799 -44122 -45294 -59097 -55790 -75447 -39379 3781
13501 3781 -39918 -41183 2514 30786 37154 35322 18433 -6635 2652 55848 42856 57347 37351
13488 37351 -13838 -31848 -38342 -851 20218 -22097 -44775 -21376 -60532 -59131 -40707 -41771
13476 -41771 -60574 -46617 -75694 -106123 -69829 5942 5009 9890 18538 28969 15335 -37899
13464 -37899 -81646 -58036 -36697 -40118 -64346 -27895 -15099 -27471 -9911 -40816 -29633 -5579
13452 -5579 28207 58129 59160 24957 17729 60222 37021 48590 55232 4486 -28981 -3242
13440 -3242 10 -33846 -42547 -3831 28020 35008 23051 7143 7578 18078 49770 30168 -6394
13427 -6394 -23044 -7766 -22256 -20407 33321 49493 20503 17100 -26644 -48663 -19275 -470
13415d70J5535j3078p119K486k5883R703k2764k0884J4828o171Q771L4572J8673
13402H199J5203o658j3399L126O891k856j0869L1598J0808p837M213J4701r605
13389D3515m3921m6114m703R960J9313O364j4079P534j104k5838P893M4687L2155
13376C5662M307k0697j6353L0135J5441n8631l3996K9281K3383L383m6799M6357
13364A1473J492k703K0176r534J3103p778N192k2176k5802L018J9786M721Q387
13351A9355k4037r317K5557J6599j2127R786l8869j970K0283j0169j7500j1749
13339c4158j6946K8583o594p091N042M656O544l307k9357j1386j3677Q614L4469
13326c4608K8600l0926J3571L6199M2472k3009L4380P825l6747j8182k163J9921
$$ plain form
13415 -470 15065 1987 -5132 -2646 -28529 -18826 -41590 -62474 -47646 -53817 -45046 -10474 8199
13402 8199 23402 16744 3345 6471 13362 10506 -363 31235 42043 34206 38419 53120 43515
13389 43515 -406 -46520 -51223 -41263 -21950 -15586 -29665 -22131 -23235 -49073 -41180 3507 35662
13376 35662 39969 19272 2919 33054 48495 -10136 -44132 -14851 8532 11915 -34884 11473
13364 11473 12965 10262 30438 20904 34007 26229 31421 9245 -16557 -13539 6247 10968 19355
13351 19355 -4682 -13999 11558 28157 16030 25816 -13053 -15023 5260 -4909 -22409 -34158
13339 -34158 -51104 -22521 -29115 -36206 -31164 -26508 -19964 -23271 -52628 -64014 -77691 -69077 -34608
13326 -34608 -6008 -36934 -23363 12836 55308 32299 66679 74504 37757 19575 17412 37333
13314C7333n4612j3989L0732J4681j0834p352J0445M6409L6283o1584l15K5833
13302E3030J5738l4498p254m3746m8181K741K4336l4686R05j6387J4780K4261
13290d8961k0575n198j181L5725K7144P914k4664m391K1435r231k6914J5135n046
13277c8808J793o290j3938Q098K1015L5689K0668L522J7260l3674m6928j3748
13265d5341l1094J7358M5423P439m6143k2356J7803J3665L19L6673L2136J8949
13253D4831P160J0307k3858k3244j8112L5908L7051O644O153k8841j5866K742
13241D0875L33K1587J0532n545n1368j9579J3209L7618j4142j9785j0827J2533
13229A5441j3711j5563k7332M726L747K7749L4132q0o55o607k1944N034j3694
$$ plain form
13314 37333 -17279 -31268 -536 14145 3311 -4041 6404 52813 89096 27512 27197 53030
13302 53030 68768 34270 27016 -16730 -64911 -62170 -37834 -72520 -71615 -88002 -73222 -48961
13290 -48961 -69536 -74734 -75915 -40190 -13046 -5132 -29796 -34187 -12752 -21983 -48897 -33762 -38808
13277 -38808 -37015 -43305 -57243 -49145 -28130 7559 28227 31749 49009 15335 -31593 -45341
13265 -45341 -76435 -59077 -13654 -6215 -52358 -74714 -56911 -43246 -42927 -6254 25882 44831
13253 44831 51991 62298 38440 15196 -2916 32992 70043 76687 82840 53999 38133 40875
13241 40875 41208 62795 73327 67782 16414 -3165 10044 47662 33520 13735 2908 15441
13229 15441 1730 -13833 -41165 -36439 -32692 -4943 29189 29109 28454 21847 -97 4937 -8757
13216h757J5889K3294M1450j1708m0473n9914l4842J5397K3459k217R084M2666
13204A3328M6770q301k9925j2036N1648k680j95k5803J5186K4065p246j3994k1379
13191B9438J9685M611j5139k3233k3190J1165m702k4046L0715R397j3398l1460
13179c0157j6954L1117N2812O677J4115k6403n5975j7272K2886R646k1716j2282
13167d3506k844Q80K3708L2110J7747k8156j6235K7058M8420M4659Q554l7230
13155G5165P425K2564K5648m726o339n437j4403l1975q065J3634J4510k1551n7765
13142H685K2162o054M4352K4521L695j4638O80k5114k2388k5291n518K4223Q592
13129C7907k6136k82K230m8060J3201N6121J4867m673l6226k7250j2005k9079
$$ plain form
13216 -8757 7132 30426 71876 60168 19695 -40219 -75061 -59664 -36205 -38422 -29338 13328
13204 13328 60098 51797 21872 9836 61484 58804 58609 32806 47992 72057 64811 50817 29438
13191 29438 49123 53734 38595 15362 -7828 3337 -1365 -25411 5304 14701 1303 -30157
13179 -30157 -47111 -15994 36818 43495 57610 31207 -24768 -42040 -19154 -9508 -31224 -43506
13167 -43506 -46350 -45470 -21762 10348 28095 -61 -16296 10762 59182 103841 112395 75165
13155 75165 82590 105154 130802 126076 119737 114300 99897 67922 59857 73491 88001 66450 8685
13142 8685 30847 24793 69145 93666 97361 82723 83403 58289 35901 10610 5092 29315 37907
13129 37907 11771 11489 13719 -34341 -21140 34981 49848 45175 8949 -18301 -30306 -59385
13117e9385M0316J648J3230L3918j0310l0269M4400M0191K9692L2708N3149n363
13105A83925j3105k7866m8914k1637j2807L787K5491M229L474m6829o1268p111
13093a8631O289K0595K8282k8266P522P53k1637J2977L2492K8090l5244k1947
13081A1275J6878R746Q997K2800j995l7336j1862L426L6706l180p150K9953l083
13068G5175j3791n0653l2561K6993L2254L0579J8397j3264k6871J2285L4181l6846
13056E5878m9505m4438K020M9760L3425M159j788M381j3017k1435k7969M3245
13044C4716j096j6999n798K0688n433j3087k2870j4102P502j069j2476k0417k3620
13031g4061P272O9027K1911J5303J4784j8453p46l0136J325j811k6492P227M5919
$$ plain form
13117 -59385 -19069 -17421 -4191 29727 19417 -10852 33548 73739 103431 136139 189288 183925
13105 183925 170820 142954 94040 72403 59596 63383 88874 93103 96577 49748 -11520 -18631
13093 -18631 -12342 8253 36535 8269 15791 16544 -5093 7884 40376 68466 33222 11275
13081 11275 28153 37899 46896 69696 67701 30365 18503 21929 58635 55455 48305 78258 75175
13068 75175 61384 10731 -21830 5163 37417 67996 86393 73129 46258 58543 92724 55878
13056 55878 6373 -38065 -36045 13715 47140 51299 49511 53892 40875 19440 -8529 34716
13044 34716 33620 16621 10823 31511 26078 12991 -9879 -23981 -16479 -17548 -30024 -50441 -74061
13031 -74061 -66789 2238 24149 39452 54236 35783 35037 4901 6226 4415 -22077 -14850 31069
13018C1069q920n6887o6503j1959N4355J3287j6530R053L40L975j8264o287J8628
13005e4643j143M8947O148K0197k1553J0631m49q305Q448J9805J861K2368L0808
12992H3120m1794j9768k0160k5067L4612l0542J7508L5107j1714l51k3245n6810
12980e9104l3808j0803K995M0428M5592K7148l348j8215J5957r716L093N20L1995
12967C2734N088J5774k0112j5763l3714k0243J8250K5496j2161k4470O553j5363
12955c7931K2156K6609L5139M083m6046l6325J6017J6012L9655j4027k7052k2786
12943b4496M4671O350k1904K244k1509J2267J4689J6480m041J7814j3582j644
12931B7339l2827k7750o345J7156N82j4691l2122j3988L5770L0578M8820k0174
$$ plain form
13018 31069 22149 -34738 -101241 -113200 -58845 -45558 -62088 -53035 -52695 -48720 -66984 -73271 -54643
13005 -54643 -55786 -6839 -691 19506 -2047 8584 8135 -170 8278 28083 29944 52312 83120
12992 83120 41326 21558 1398 -23669 10943 -19599 -2091 33016 21302 20951 -2294 -59104
12980 -59104 -92912 -103715 -100720 -60292 -14700 12448 9100 -9115 6842 -2874 219 739 32734
12967 32734 37822 53596 33484 17721 -15993 -36236 -17986 7510 -4651 -29121 -22568 -37931
12955 -37931 -15775 10834 45973 50056 4010 -32315 -16298 -286 39369 25342 -1710 -24496
12943 -24496 20175 26525 4621 6865 -14644 -2377 12312 28792 24751 42565 28983 27339
12931 27339 -5488 -33238 -39583 -22427 -21845 -36536 -68658 -82646 -46876 -16298 32522 12348
12919A2348k4482J4098K38j5705K2467M8289j9811m6154k8323J4936Q566J4477
12907I44o444k9563K559J390l1343q513K6543L1468K8753L5112n682j2592o055
12894B6577P695Q325n2640R127j3829p558k6213J8875L8180O922j4000R828k1171
12881i882J0983L7120j3890J757j9066k0403J8262l3642J4570J7709O681p257
12869B942Q916j5376j1904K6795L4124J138n9314J5672L9352J0776J5615l9558
12857B9178j4474J42j3192k6057r58j6450j9191N849J5494M5946L8009q738m8832
12844a3274j3894j9252j6258K7525M161K9421P615J3801M4200J6895l8502l1697
12832A0741K2092Q379j6400M6215o062P298j3770r19m610l3694K5014m078k1584
$$ plain form
12919 12348 -12134 1964 2202 -13503 8964 57253 37442 -8712 -37035 -22099 -13533 944
12907 944 -5500 -35063 -32504 -31114 -62457 -70970 -44427 -12959 15794 50906 45224 32632 26577
12894 26577 34272 42597 -10043 -916 -14745 -22303 -48516 -29641 8539 15461 1461 11289 -9882
12881 -9882 1101 38221 24331 26088 7022 -13381 4881 -28761 -14191 3518 10199 2942
12869 2942 11858 -3518 -15422 11373 45497 46635 -12679 2993 42345 53121 68736 29178
12857 29178 14704 14846 1654 -24403 -25361 -41811 -61002 -55153 -39659 6287 44296 35558 -13274
12844 -13274 -27168 -46420 -62678 -35153 -30992 -1571 6044 19845 64045 80940 42438 10741
12832 10741 32833 41212 24812 71027 64965 72263 58493 57574 52964 19270 44284 40206 18622
12819A8622j1317K7395j0267P182M273L5968L1180k2509l0691J6969j6374k3929
12807B6502q365K6671q355k0960o009j1037J458K0710J7945j0642K1667j2330
12795C7255l6755m7772N714K5259J5455K367L1081j9312l6871p927K8196P120
12783C810l6089j0550N1542m012n0423l5710J8131K6193M3867p940l0165k0715
12771e2061k0051M1058J3959J574J9548k1998j6532j2592O43L4527N3273j5098
12759B6250k3575l9925k1230j0283K0171J1301l9775M075K0582n516N1252k182
12747h855n2119J3769M518M6851L174m8772O153m416J0216P450p055k60j9285
12734d8631j3083K480L0080K6191j7972j1860J1639J6890k1347l0864J7837J4542
$$ plain form
12819 18622 7305 34700 24433 31615 35888 71856 103036 80527 49836 66805 50431 26502
12807 26502 18137 44808 36453 15493 9484 -1553 -95 20615 38560 27918 49585 37255
12795 37255 500 -47272 -41558 -16299 -844 1523 32604 13292 -23579 -31506 -3310 3810
12783 3810 -32279 -42829 8713 4701 -45722 -81432 -63301 -37108 6759 -1181 -31346 -52061
12771 -52061 -72112 -31054 -17095 -15521 4027 -17971 -34503 -47095 -46452 -11925 41348 26250
12759 26250 2675 -37250 -58480 -68763 -48592 -37291 -77066 -72991 -52409 -57925 -6673 -8855
12747 -8855 -60974 -47205 -42687 4164 7338 -41434 -35281 -39697 -29481 -22031 -29086 -29346 -48631
12734 -48631 -61714 -59234 -29154 -2963 -20935 -32795 -21156 -4266 -25613 -56477 -38640 -24098
12722b4098J1445q534J3382K3289r05J9101K6795J7125n21m0447m2289k4163L685
12709b6135J1689K3287l7348L16q09n15K2873P818j5990m095K3209L6108L7553
12696G7961o141m5118l6747K540J9461J2799K028q325k6176j8637J3785Q602J2818
12683H850J3037R616J8002N106j7398l2363k4031J8290J8121J3258r829m0284
12671a9625Q87n908J6657M1286r573P929k9136n33J3209j5215m1241l1579K4652
12658d8190L6031q178j1814J2778L2825k183j404r116r683M420j3137j573j360
12645b0584N512M134o401m264J9419L2707J696j6992j0485k9314L2783L6884J7856
12632F2951l3452j0081k5907J9078M3897j8465J2057O018k7100k8239k1748K7296
$$ plain form
12722 -24098 -12653 -21187 -7805 15484 14579 33680 60475 77600 77079 36632 -5657 -29820 -26135
12709 -26135 -14446 8841 -28507 -28191 -29000 -29515 -6642 1176 -14814 -18909 4300 40408 77961
12696 77961 71820 26702 -10045 -7505 11956 24755 26783 18458 -7718 -26355 -12570 -3968 8850
12683 8850 21887 31503 49505 54611 37213 4850 -19181 -891 17230 30488 20659 -19625
12671 -19625 -18738 -24646 -7989 33297 23724 31653 2517 1984 15193 -22 -41263 -72842 -48190
12658 -48190 -12159 -20337 -32151 -19373 13452 11269 9865 749 -8934 -4514 -17651 -19224 -20584
12645 -20584 -15072 -10938 -17339 -21603 -2184 30523 32219 15227 4742 -24572 8211 45095 62951
12632 62951 29499 19418 -6489 12589 56486 38021 50078 56096 28996 757 -20991 6305
12620F305L1294K578K391j1110l7103m0748j9805L8294N588R572J5814M909j3126
12607e147K311L8546K741J4050k0153K2545j4085l3424K6669m447l2586j5887
12595a8867K9867k1882p1719k440J8924j2187r388L2027N1076M5457Q937p1040
12583b1235J2140K0637O977J7465o6130l2080K4798J6930j1854Q765K791j8767
12571c9563J0048o921n724j957P079p445Q42r286M6225j021k441J0719J1918J7079
12557B9552P164j6621k8634L5928J4801j566j3915J7707k3414p853j7415j4872
12545a9138l9028o349L3791J0121m929j0702j3375N688L0313L197k1047J1706
12533a9752N00L6147l03j7219L3865p784k4312o404k5168J1629k6592p632k7710
$$ plain form
12620 6305 37599 40177 42568 31458 -5645 -46393 -66198 -27904 -22316 -12744 3070 7979 -5147
12607 -5147 -2836 35710 38451 52501 32348 54893 40808 7384 34053 29606 -2980 -18867
12595 -18867 11000 -10882 -82601 -85041 -66117 -78304 -87692 -55665 -4589 40868 49805 -21235
12583 -21235 -9095 11542 18519 35984 -30146 -62226 -37428 -20498 -32352 -23587 -20796 -39563
12571 -39563 -29515 -36436 -42160 -44117 -37038 -44483 -43641 -52927 -6702 -7723 -10164 555 12473 29552
12557 29552 36716 20095 -8539 27389 42190 40624 26709 44416 21002 13149 -4266 -19138
12545 -19138 -58166 -64515 -30724 -20603 -25532 -36234 -49609 -43921 -13608 -10411 -31458 -19752
12533 -19752 -19252 16895 16592 -627 33238 25454 1142 -5262 -30430 -18801 -45393 -53025 -80735
12520h0735m1631P0062L3353J0533L75L3368j3904J0157m7005k969M2093J1556
12508B5253m0257m5829k1057K7915J6486J8741K7861J8444R369k0136k4256R964
12496B498L0418L4001K2289m8128J2052P5M021n449j6217k2390j9608j1889J1543
12483f784k9526l2582j1986P771K3766L237K9357L9659J3283m7708l7532k7663
12471g6708l0J7572N8517L9541L3570K0523k1020k6533l1122j4606q823Q016J1045
12458I942L1696M9482J3276n6322n0143l9148J6411N482R602J2795L2025j2722
12446B2376n1112k927q152K4945J6958j7667q912l3270l596o061L733P021J1325
12433d5339L6768r187K9609j731N844l1178o3554k1308M8052K5898M477o457O358
$$ plain form
12520 -80735 -122366 -52304 -18951 -8418 -8043 25325 11421 21578 -25427 -28396 13697 25253
12508 25253 -15004 -60833 -81890 -53975 -37489 -18748 9113 27557 36926 16790 -7466 2498
12496 2498 32916 66917 89206 41078 53130 53205 57226 51777 35560 13170 -6438 -18327 -6784
12483 -6784 -36310 -68892 -80878 -73107 -49341 -46104 -16747 22912 36195 -11513 -49045 -76708
12471 -76708 -76738 -59166 -649 38892 72462 92985 71965 45432 14310 -296 -9119 -1103 9942
12458 9942 41638 91120 104396 48074 -2069 -41217 -24806 -19324 -9722 3073 35098 22376
12446 22376 -28736 -31663 -39815 -14870 2088 -15579 -24491 -57761 -61357 -67418 -63685 -56664 -45339
12433 -45339 -8571 -17758 11851 10120 15964 -15214 -78768 -100076 -52024 -26126 -21649 -28106 -21748
12420b1748n105K7087L9581m569n8409m0427K2803L2533J1955p678j8431k7819
12408e0227K8799j54k456K0863K5808p392K0580K0630j6188j5584n4534k0895
12396e0750p290M6043N4148l4653k8825l5344q358K9730P3453L0696J9051j7779
12384G0122j2425m0930j5303J4249N1436K0433l8781n789J0831l3214l6087m1787
12372e7245K6218L3726Q828J9422n1202k5812p700n71R905K2278K4453J9389n355
12359A6334l1553J7819P0299m032j8700j4412p581n2732l9359K0239J9414K289
12347b1975r99l055J0486L9081J4550K2957l2447p1516J6287P4559q637o0755
12335b1464k1278J653J264K4315K1109O926l8495J0888N180l2171P181J8993K4603
$$ plain form
12420 -21748 -26853 234 39815 35246 -23163 -63590 -40787 -8254 3701 -3977 -22408 -50227
12408 -50227 -21428 -21582 -24038 -3175 22633 15241 35821 56451 40263 24679 -29855 -50750
12396 -50750 -58040 -11997 42151 7498 -21327 -56671 -65029 -35299 38154 68850 87901 70122
12384 70122 57697 16767 1464 15713 67149 87582 48801 43012 53843 20629 -15458 -57245
12372 -57245 -31027 2699 11527 30949 -20253 -46065 -53765 -54336 -44431 -22153 2300 21689 16334
12359 16334 -15219 2600 72899 68867 50167 35755 28174 -24558 -63917 -43678 -24264 -21975
12347 -21975 -22974 -26029 -15543 23538 38088 61045 28598 -42918 -26631 47928 39291 -21464
12335 -21464 -42742 -41089 -39825 -15510 5599 12525 -25970 -15082 -9902 -42073 -34892 -15899 8704
12322H704M3578L2712o3648n0793l3255j3628k986K6200J0369j5519J7185k514
12310d3595k0900k4046L4546P7189J5370L621m5799p729r173l161M7089L8061
12298F1473j0303o170Q079N146K0324j2026l7443J6339J0599l85j9778n267K9696
12285F0284k775j1911L178k1294l0066k6376J0057K969M5340L8960J9078n2098
12273C5346m6507k9088j2205L533L8000L5199J8560j3407k8312o6337l2354P936
12261h9636N7210N2553M7363K0916k0873o2028l4154q63k770n9487Q044K5540
12249e8185J5801L8266M6204q531j8225J461K303l0040k4618k8288k3612P231
12237h0233K9634N3009N0684J3316o145k9196n045k5657J5812l95k9270k0519
$$ plain form
12322 8704 52282 84994 21346 -29447 -62702 -76330 -79316 -53116 -42747 -58266 -41081 -43595
12310 -43595 -64495 -88541 -53995 23194 38564 42185 -3614 -11343 -20516 -23677 23412 61473
12298 61473 51170 45000 53079 58225 78549 66523 29080 45419 56018 55633 35855 30588 60284
12285 60284 57509 45598 48776 27482 -2584 -28960 -18903 -15934 29406 68366 87444 35346
12273 35346 -11161 -40249 -52454 -48921 -10921 24278 42838 29431 1119 -65218 -97572 -89636
12261 -89636 -32426 20127 67490 88406 67533 5505 -28649 -29512 -32282 -91769 -83725 -58185
12249 -58185 -42384 -4118 42086 33555 15330 16791 19094 -10946 -35564 -63852 -87464 -80233
12237 -80233 -50599 2410 53094 66410 60265 31069 26024 367 16179 15784 -13486 -34005
12225c4005J5362k0865P746M9100p605l5643p384K5202K8608R792R823K8102k6543
12212D1690k3962N747j2062j7836k608K2332K4553j1919j929K2128m9702k6291
12200b9859M2959p858J9337J0595k6429J641J0749N037L2521r245j9149k7134
12188C165J620K6864q558P117O549P000j7309J9704L812j8596l9916L714Q209
12175C375m847m4035K186K2019l066J9676J7097q138J2039l45k7583K115K3888
12162A4381N109k1211L080K5418K0607o316k2594J9849L0078j2766J9046J6796
12150I1477j7228j0347m125k560J1528l9665o4666K021K6425J2081L4915L944
12138D3800j366k4937m3523L7926K748k2048Q185j8838K3280J7765K962M811l4942
$$ plain form
12225 -34005 -18643 -39508 -31762 17338 9733 -25910 -33294 -8092 20516 30308 40131 68233 41690
12212 41690 17728 23475 11413 -6423 -9031 13301 37854 25935 24006 46134 -3568 -29859
12200 -29859 13100 5242 24579 35174 8745 10386 21135 26172 58693 49448 30299 3165
12188 3165 4785 31649 23091 30208 36757 43757 26448 46152 49964 31368 -8548 -4834 3375
12175 3375 -1472 -45507 -43321 -21302 -24368 -4692 12405 4267 16306 15961 -11622 -9507 14381
12162 14381 19490 -1721 1359 26777 47384 41068 18474 38323 68401 55635 74681 91477
12150 91477 74249 63902 59777 57217 68745 29080 -35586 -33565 -7140 4941 39856 43800
12138 43800 42434 17497 -26026 11900 14648 -7400 785 -18053 5227 22992 25954 30765 -4177
12125d177J991K5293P120k0948J2445k9101K4147L7790m6141l2270J3694m633
12113a4790j1729L9546J9827m2456j5421J8446K5435p78N3086j6163l3300m7233
12101b5530Q773K2102M641J9934P149L7328Q516m0840N655J2714k3852m1752o429
12088a1591l3265l662J1994K2166N7281J8618j9067m6428M205k678j0444m690
12076a7561J1914K5849K088J4753M804m4153K4087p736J5057N413j9597j3097
12064A821j8527N812k5860j5286j0769L5489J9181k6424R308K4031k019R585k7405
12051b1063l5342K5026M4821K304m0911m4634m0695l986j1256K1416L4676M492
12039f5152M3356J0404j098L2600k9308r647J6470k1046k2184K5698J9027R798
$$ plain form
12125 -4177 -2186 23107 30227 9279 21724 -7377 16770 54560 8419 -23851 -10157 -14790
12113 -14790 -26519 13027 32854 -9602 -25023 -6577 18858 18080 71166 55003 21703 -25530
12101 -25530 -16757 5345 9986 29920 37069 74397 82913 42073 47728 60442 36590 -5162 -11591
12088 -11591 -44856 -48518 -36524 -14358 42923 61541 42474 -3954 251 -2427 -12871 -17561
12076 -17561 -5647 20202 22290 37043 41847 -2306 21781 14045 29102 34515 14918 1821
12064 1821 -16706 -10894 -36754 -52040 -62809 -27320 -8139 -34563 -25255 -1224 -3243 6342 -21063
12051 -21063 -56405 -31379 13442 15746 -25165 -69799 -110494 -114480 -125736 -104320 -69644 -65152
12039 -65152 -21796 -11392 -12490 20110 -9198 -18845 -2375 -23421 -45605 -19907 -880 8918
12027H918j0639m7931K4374M3531L754k4496K7190r255k1229j5251K9207K3691
12015C1864L7429l924k3316N219j8231j2048j0158J8457r17J280j7577k4334n6774
12002g3030j823L9022J8442J373K3329L5276k779k6963j714p5096J2367J4802
11990c6794K3842p642K6198J4391K9545Q692j8509n178r638K3397j6589k8489
11978C226k4352K7511P681L4749L6412J5561k5977k6531k4203j5691m2611n266
11966c9491J783K7218M3181K9962l3956k1160m6638Q36L8074L4359J3827k0578
11954B7417l1847j1661j4080j3579L8553M8761j6153j3592K6178j2260j2541j3272
11942A924o5649J0166K9985L692n358L736L3794L4671R477r262o978k5040l0572
$$ plain form
12027 8918 -1721 -49652 -25278 18253 22007 -2489 24701 15446 -5783 -21034 8173 31864
12015 31864 69293 65369 42053 47272 29041 16993 6835 25292 24375 25655 8078 -16256 -73030
12002 -73030 -74853 -35831 -17389 -16016 7313 42589 39810 12847 11133 -63963 -51596 -36794
11990 -36794 -12952 -20594 5604 19995 49540 58232 39723 34545 24907 48304 31715 3226
11978 3226 -21126 6385 14066 48815 85227 100788 74811 48280 24077 8386 -34225 -39491
11966 -39491 -37708 -10490 32691 62653 28697 7537 -39101 -38265 -191 34168 47995 27417
11954 27417 -4430 -16091 -30171 -43750 -5197 43564 27411 13819 39997 27737 15196 1924
11942 1924 -63725 -53559 -23574 -19882 -25240 -21504 12290 46961 56438 47176 40198 15158 -15414
11929a5414n6130k5600K4731L381K3507L8694K4042n95k6478o3300p894K9231
11917e1825N3766j0015o648M2913K14J0004J0635N73l2929q1500P480L3656j4441
11904c8117l1660Q691r382K9361N9228M7489K6878m1058o0521j950K1384L5828
11892D6171L0938n6545n1123K5945K1622K6064m0171p429L8423K4874m0940m6301
11880b8472j4413L5522L6514j6506p254m7502k0188N896L3840J4350j5133M8479
11868B5133j98j9876Q296K019K3322K4753m6042k1099n549k7245J3105k7210m350
11855e4941M9980M3401m885n6180L83J1584J3456J7458l5255O840k9427j7621
11843e5207K4172L4022J2107J0467K4719l044m1063Q23L6112o0351J7709m218
$$ plain form
11929 -15414 -71544 -97144 -72413 -69032 -45525 -6831 17211 16616 -9862 -73162 -81056 -51825
11917 -51825 1941 -8074 -14722 28191 28405 38409 49044 49617 16688 -64812 -57332 -23676 -38117
11904 -38117 -69777 -61086 -70468 -41107 18121 65610 92488 51430 -9091 -11041 10343 46171
11892 46171 77109 20564 -30559 -4614 17008 43072 2901 -4528 33895 58769 17829 -28472
11880 -28472 -42885 -7363 29151 12645 5391 -42111 -62299 -56403 -22563 -8213 -23346 25133
11868 25133 24935 5059 13355 15374 38696 63449 17407 -3692 -9241 -36486 -23381 -50591 -54941
11855 -54941 -4961 38440 33555 -22625 -22242 -10658 2798 20256 -14999 -8159 -37586 -55207
11843 -55207 -31035 2987 15094 25561 50280 47236 6173 6996 43108 -17243 466 -3752
11831c752J0232L6958J1500k5704l5464n687J9552K1604J749O089M167J9048o458
11818E3834o5879L895Q293m220j8911L4016K4440m186J019j6879k5510r98Q75
11805a0211O594K638j5769K5749K9097l6542k6763K9312M3504J3598O009R343
11793G6559Q17l8802k5602J1286o441J8319q349J5797m0639m1485K0875M9452
11781C1787J0787K0791n036N031j2759k4754P681n613l1083k716m596j2805j4955
11768c8240n744L4226J6500j8114m812L2757l0736J7225K7973k3568k0325J1221
11756a637q465N255J3007L7149M4175k0187n5834q701L7087j1707L069r712m7524
11743b4025M1419k2485j5949L6500L2564J2807l1892q815L3205k4634o5454q171
$$ plain form
11831 -3752 6480 43438 54938 29234 -6230 -11917 7635 29239 30988 37077 41244 60292 53834
11818 53834 -12045 -8150 143 -4077 -22988 11028 35468 31282 32301 15422 -10088 -11086 -10211
11805 -10211 -3617 -979 -16748 9001 38098 1556 -25207 4105 47609 61207 67216 76559
11793 76559 77376 38574 12972 24258 17817 36136 27787 43584 2945 -38540 -17665 31787
11781 31787 42574 63365 58329 63360 50601 25847 33528 27915 -3168 -5884 -10480 -23285 -38240
11768 -38240 -43984 -9758 6742 -11372 -16184 16573 -14163 3062 31035 7467 -12858 -1637
11756 -1637 -10102 -4847 8160 45309 89484 69297 13463 4762 41849 30142 33211 23499 -24025
11743 -24025 17394 -5091 -21040 15460 48024 60831 28939 20124 53329 28695 -36759 -44930
11731d4930n797k8173L8695K8714o048j7186P034J5633l916J6942q428o42k9934
11718c8036j7084J5492N6807j0948j6246K5792j577m35j3163r31j5099m2153J5593
11705d1988O559q609P264K3091J9942J6300j6610j4913J1543J1570J571l92k0957
11692e629j7982M3434j0813l1870q479K0358Q907R396R314j4261j5533j3404J7433
11679i129J5588j1916K6751J5064j4816l3513J5043L816j4844j1004M260k1609
11667c6309j2803R769J480k5908K7613K5190j003j5951k9412n653M7030M0654
11655B4697K9227o057p0844p863K671j7955m958R815K5463R124j6347o148N391
11642b3784l3107P3658M8683k680j2653l9194K5100J6128k6298k4801k438j6510
$$ plain form
11731 -44930 -50727 -78900 -40205 -11491 -17539 -34725 -27691 -12058 -15974 968 -7460 -8102 -38036
11718 -38036 -55120 -39628 17179 6231 -10015 15777 14200 13765 602 -329 -15428 -57581 -41988
11705 -41988 -35429 -44038 -36774 -13683 6259 22559 5949 -8964 2579 14149 15720 15328 -5629
11692 -5629 -23611 19823 9010 -22860 -31339 -10981 -2074 7322 16636 2375 -13158 -26562 -9129
11679 -9129 6459 -5457 21294 36358 21542 -11971 3072 6888 -7956 -18960 -14700 -36309
11667 -36309 -49112 -39343 -37863 -63771 -36158 -10968 -11971 -27922 -57334 -62987 -15957 24697
11655 24697 53924 47867 -22977 -30840 -28169 -46124 -51082 -41267 -15804 -6680 -23027 -29175 -23784
11642 -23784 -56891 16767 65450 62770 50117 10923 36023 52151 25853 1052 -1386 -17896
11630a7896k1839K9825M3278K6961j0869o2401k3837M305L2212K1778J0510K2423
11618E4450N231j1359l750l950k9457l0644P555L3097j9758o1911O367M0426J7594
11605C891q03J793j5024K3667P100n6577j2455K3246K5516J6301l6952k3474L959
11592c9812q007k7987J6574M1604j8852p82K6418k2113k1075K3503j2153r475
11580e2157m171M0798L9344J9997k8309K967n459k7177m3443Q527J2924L3334
11568b825K2058J4130j6367k7474J0234J0392j3457j2153M2870k8995m1114k635
11556d5336L2773J1688k4769P949k2581k2628L747K5742K6701K3575J9849Q599
11544D5309l8409M432J5943j7073l5016j7685L192P671M398J8480J790p482J5192
$$ plain form
11630 -17896 -39735 -9910 33368 60329 49460 -12941 -36778 -32473 -261 21517 32027 54450
11618 54450 59681 48322 44572 40622 11165 -19479 -11924 21173 1415 -60496 -54129 -13703 3891
11605 3891 3088 4881 -10143 13524 20624 -35953 -48408 -25162 354 16655 -20297 -43771 -39812
11592 -39812 -47819 -75806 -59232 -17628 -36480 -37262 -10844 -32957 -54032 -30529 -42682 -52157
11580 -52157 -56328 -15530 23814 43811 15502 18469 13010 -14167 -57610 -49083 -36159 -2825
11568 -2825 19233 33363 16996 -10478 -244 10148 -3309 -15462 27408 -1587 -42701 -45336
11556 -45336 -12563 -875 -25644 -17695 -40276 -62904 -59157 -33415 -6714 16861 36710 45309
11544 45309 6900 11332 27275 10202 -24814 -42499 -39307 -31636 -27238 -8758 -6968 -14450 742
11531G42K9395L1131l9517l2689M291l8674r971K3267l20K9766L0405M931j4834
11518A7923K5768j1563J2041j2541m8712k3186K233K3470J88R025J0804m0210
11506c4760l3305L7810L4171J0124k5376J3431K3093l3877O951K3930R221N513
11494C6926P807l8904r424Q848j9578j3168J6012N2411j3959j5858k488l5066
11482b6441j3212K6829J0990J0157J6333k2151j4050Q663L8105j8609l7638m0119
11470f1143Q492J3581K226J4603K301j4062J9702L3159L2756J1992q500o6468
11458a1361j7365N0202J612j0809j6022j6888N451R878j0008j8644n831k5099
11446f4884p646j0422K5975K4534q91L267N6419Q391l2876l7502R727K7944o913
$$ plain form
11531 742 30137 61268 21751 -10938 -6647 -45321 -55292 -32025 -32345 -2579 27826 32757 17923
11518 17923 43691 32128 44169 31628 -17084 -40270 -38037 -14567 -14379 -5354 5450 -34760
11506 -34760 -68065 -30255 3916 14040 -11336 2095 25188 -8689 -1738 22192 31413 36926
11494 36926 44733 5829 -3595 5253 -14325 -27493 -11481 40930 26971 11113 8625 -26441
11482 -26441 -39653 -12824 -1834 8323 24656 2505 -11545 -2882 35223 16614 -21024 -61143
11470 -61143 -52651 -39070 -36844 -22241 -19940 -34002 -14300 18859 51615 63607 55107 -11361
11458 -11361 -28726 21476 23088 12279 -3743 -20631 -15180 -5302 -15310 -33954 -39785 -64884
11446 -64884 -72530 -82952 -56977 -32443 -33334 -30067 26352 34743 1867 -35635 -25908 2036 -4877
11433d877K1213K5327l052q978k5494j3044J4905K6266K6558j1129j2797m3388
11421h490m818J3308J7632M894j2811K9163P607k0426l2615k7040L1478o765L7180
11408B8297K3376k2108J1813k1432l1583K665j5705MJ8286l5269Q476M0092J4489
11395B1401j0070j1087j7697l4809K5601K0123O53k0141j5145M117n296m968J2510
11382c4808l431J9914Q113q396J1578N2029Q251k8112l4020k5092L0073J7134
11370A3233k15m093k086K6131M6945k6197m5883j5708N739N969j5679J4978K1998
11357B5132J254j7285J1237J7083l4850l6366n401J3893p222K4974j209J7520
11345H760R372n377N5878p134k8385J2814j1788m4252r6M7310J7245p194k1311
$$ plain form
11433 -4877 16336 41663 38611 29633 4139 -8905 6000 32266 58824 47695 34898 -8490
11421 -8490 -13308 0 17632 22526 9715 38878 46485 26059 -6556 -33596 -2118 -8883 28297
11408 28297 51673 29565 41378 19946 -11637 -8972 -24677 -24673 -6387 -41656 -33180 6912 21401
11395 21401 11331 244 -17453 -52262 -26661 -6538 -5885 -26026 -41171 -37054 -42350 -47318 -34808
11382 -34808 -38239 -18325 -10212 -18608 -7030 44999 53250 25138 -8882 -33974 -3901 13233
11370 13233 13018 8925 6839 32970 79915 53718 7835 -7873 -2134 3835 -11844 3134 25132
11357 25132 26386 9101 20338 37421 2571 -33795 -39196 -25303 -32525 -7551 -8760 8760
11345 8760 18132 12755 68633 61499 33114 45928 34140 -10112 -10208 37102 54347 47153 25842
11332B5842j6537K4130N279J9032r613k7393j8132K5103M1617K9835l2523m5759
11320B0881j2576M0776L6749K0981j706l9482j8401J5407l2073K6291K2604k334
11308G7117j5668j0521j008Q132p575K2515O1489K8447l524K3987j0331j6475
11296A56585m5768K9898J0758P083K7043J1491l9068j8702k3185O0162J03513
11285B79810O4494J70979K07810K34253L27464L92137J95238M3616m3844j72035
11275A699922l42114m01796k70520j45441r5601m6797l2257n488J5513j5411o0061
11264B99949m8672o208L1857K973o67o3167r2787m0557K2151J5770K2855L9994
11252A83491M715j98j6243j9330j1872j5996j9999o1938L9261K1139L093p044
$$ plain form
11332 25842 9305 33435 38714 57746 48133 20740 2608 27711 69328 99163 66640 20881
11320 20881 8305 49081 85830 106811 105105 65623 47222 62629 30556 56847 79451 77117
11308 77117 61449 50928 49920 58052 50477 72992 134481 162928 159404 183391 173060 156585
11296 156585 110817 140715 151473 158556 185599 197090 158022 139320 116135 176297 279810
11285 279810 344304 515283 723093 957346 1284810 1676947 1872185 1915801 1871957 1699922
11275 1699922 1357808 956012 685492 540051 444450 397653 365396 359908 375421 360010 299949
11264 299949 251277 245069 276926 279899 279232 216065 123278 82721 104872 120642 143497 183491
11252 183491 188206 188008 171765 152435 140563 124567 104568 42630 81891 103030 106123 99079
11240I9079k5049j7399m344L6413r045l4527j205N9359J7327l3904q92R55k0941
11227F5827J3942j9364N638L0477J866l0226P715l4772J9011N295L014l2181j7603
11214A8639r190j9026J6724K8333l3338l3714O1203Q3530k988n0791m2189L6498
11202E3691K9693J7376m8577o5953l015k0464n319J7110m452j2182J7964K6174
11190B046J5837M894j9705Q519j1294J2937l129r416M1281L331M312P7006k7393
11177I9226l9456J1596m827q524q613l896k0317j6232K5003J3831l0627l5667
11165a8503J4380N3172J90k5412l913j5085q861J029K4137n503J5274M4175n1149
11152B3931m7413K3173K3435R646j5367k011l5153q51K5200k0612l662J1783k982
$$ plain form
11240 99079 74030 56631 52287 88700 79655 45128 43923 103282 120609 86705 85813 86768 65827
11227 65827 79769 60405 66043 96520 98386 68160 75875 41103 60114 65409 68423 36242 18639
11214 18639 9449 -9577 7147 35480 2142 -31572 29631 113161 110173 59382 17193 53691
11202 53691 83384 100760 52183 -13770 -16785 -37249 -42568 -25458 -29910 -42092 -24128 2046
11190 2046 17883 22777 3072 11591 297 13234 10105 689 41970 45301 49613 126619 99226
11177 99226 59770 71366 66539 58015 49402 45506 25189 8957 33960 47791 17164 -18503
11165 -18503 -4123 49049 49239 23827 19914 4829 -4032 -3003 21134 15631 30905 75080 23931
11152 23931 -23482 -309 23126 32772 17405 15394 -19759 -20610 4590 -16022 -19684 -7901 -10883
11139a0883L2221o105J7010M3772p67j066L398K0677J1028Q444J0173l877R760
11126A33785M2683P188K0793K1149K4811J671K4514L3905J1618r407l1225k6379
11114B55106n0872l3222k2176k5420l2129K4352O9076k305n2920j6822j368O459
11102A17759M5741L835K051k5951m3363l2203M1876R497k0855m8526J1257K8548
11090H9666M3719N945J5217O3240K4388j4839p6766o2527j0160j8918j0737k1477
11078B6751m5520J3964L0838l5928p953N6760M6236j0802j950o8857n4720K6685
11066b4496j2937j8825j7664Q685J636n1006J547n355O504L1225N0482P0059J5119
11053E4974j3743N2970M3757j2668l8460K2853Q952m210k2981K6391L1090K786
$$ plain form
11139 -10883 21338 15233 32243 76015 75248 74182 77580 98257 109285 117729 127902 124025 133785
11126 133785 176468 183656 204449 225598 250409 252080 276594 310499 322117 312710 281485 255106
11114 255106 204234 171012 148836 123416 91287 115639 184715 182410 129490 112668 111300 117759
11102 117759 163500 167335 169386 143435 100072 67869 109745 119242 98387 49861 61118 89666
11090 89666 133385 139330 154547 217787 242175 227336 150570 88043 77883 58965 48228 26751
11078 26751 -18769 -4805 26033 -9895 -17848 38912 85148 74346 72396 3539 -51181 -24496
11066 -24496 -37433 -56258 -73922 -65237 -63601 -114607 -113060 -118415 -111911 -80686 -30204 39855 54974
11053 54974 41231 94201 137958 125290 86830 109683 118635 114425 91444 117835 148925 151711
11041A51711J8196j8794m0921m3016N4218M6175j3912Q825k0227j9950p139J9928
11029A35094k1237l1875j6087K3988P1005O0072K0677j0544L23j3803q713j6079
11017A92821m0546n1949J5108o612n000J0555M2927N5484o306j8958K4720K3401
11005B35645o145l912k1122N1381Q133j0838q016n390M7112L0185J7736k555K7755
10992C59969l2535J6664K42j2735l9997m3809L994j959L1225J4505K0944j6436
10980C00072M786o288K0088M335K6378j351q866N25L7246J7062J7949K9519N9059
10967E00514L4870P91j5220k10L010K2199j1887j9557l1001k0048J302L0946M4594
10954E40303l5821n2977k2003L8697M6797K9753l2317l2839J256K3202K2914O380
$$ plain form
11041 151711 169907 151113 110192 67176 121394 167569 153657 162482 142255 122305 115166 135094
11029 135094 113857 81982 65895 89883 160888 220960 241637 231093 231416 217613 208900 192821
11017 192821 152275 100326 115434 108822 103822 114377 157304 212788 206482 187524 212244 235645
11005 235645 229500 225588 204466 255847 263980 253142 245126 239736 286848 317033 334769 332214 359969
10992 359969 327434 344098 344340 331605 291608 247799 251793 249834 281059 295564 316508 300072
10980 300072 304858 298570 318658 322993 349371 348020 339154 339679 376925 393987 411936 441455 500514
10967 500514 535384 536175 520955 520745 523755 545954 534067 514510 483509 463461 464763 495709 540303
10954 540303 504482 451505 429502 468199 514996 544749 512432 479593 480849 504051 526965 533345
10942E33345l996p660J8416J6495L0991M700M3597L0587K0162j3971L2893J7599
10930G23158M523K8304O75K5123P7679J5573k5578j1580r002M0471L2335L1007
10918I32688L5583J7156Q1033M0601J1259N3250P2303O9798O7105N6912M9936
10907A487624Q8291Q4827R5485R7509J26947R5939J18415J35105J44603J80455
10897B655200J82863K02434J98923K69166L25058M06704N91168O89510P01206
10888F222232M83267L67167L93971L44334K86675M29211O59039R51294J261124
10879A1398314J581964J935323K514483L373629M584740O530882R408687J3545979
10871E4874001J9817315K8941962M1849085N9261427P4531916O3372092K1251767
$$ plain form
10942 533345 529349 521689 540105 556600 587591 592291 635888 666475 686637 672666 705559 723158
10930 723158 727681 755985 756660 781783 859462 875035 849457 837877 828875 869346 901681 932688
10918 932688 968271 985427 1066460 1107061 1118320 1171570 1243873 1313671 1380776 1437688 1487624
10907 1487624 1575915 1660742 1756227 1853736 1980683 2076622 2195037 2330142 2474745 2655200
10897 2655200 2838063 3040497 3239420 3508586 3833644 4240348 4831516 5521026 6222232
10888 6222232 6705499 7072666 7466637 7810971 8097646 8526857 9185896 10137190 11398314
10879 11398314 12980278 14915601 17430084 20803713 25388453 31919335 41328022 54874001
10871 54874001 74691316 103633278 145482363 204743790 279275706 342647798 363899565
10864C63899565o541617j8394204l7707196o5121650o6683117m5505697k7302369
10857I6643715j6458799j0257878o603503m248838k599146j721005k532800l996603
10849D8225143m483079m340702l853735l393807k960410k527096k105932j733402
10841B2826980j566452j588757j549598j514472j547335j655402j546822j373589
10833A0484553j158319r52368p12093n98269o14378o43799n39489m89634m73767
10824D302437m53089l90082k98980k27728k62218k64571k00096j34193j38242
10815A933238j31691r8660q6580n8933m4907n8322l3629m9408r4965o4780r4795
10804A116568q5444l0204j6004n6938K427j3951l9470m2654k2146J7333m3427
$$ plain form
10864 363899565 357357948 338963744 301256548 236134898 169451781 123946084 96643715
10857 96643715 80184916 69927038 63323535 59074697 56475551 54754546 52221746 48225143
10849 48225143 43742064 39401362 35547627 32153820 29193410 26666314 24560382 22826980
10841 22826980 21260528 19671771 18122173 16607701 15060366 13404964 11858142 10484553
10833 10484553 9326234 8373866 7661773 7063504 6449126 5805327 5265838 4776204 4302437
10824 4302437 3849348 3459266 3160286 2932558 2670340 2405769 2205673 2071480 1933238
10815 1933238 1801547 1702887 1616307 1557374 1512467 1454145 1420516 1371108 1276143 1211363 1116568
10804 1116568 1031124 1000920 984916 927978 930405 916454 876984 834330 812184 829517 786090
10793G86090p7738J305J9807n8014n0971k0956J693l3501p7927l4321j7414l9447
10781C98606o4900L687J4155k2179J2886K0517P406J815P95k9018k2499J2051
10769C33322j4078K4301M5016j0956r844n7944m1863J5211j7187r026O1830K9447
10757C48229M136J6161K6658k4470l4402k2659J71m287j202J2028J7900j1039
10745C27224j2463L3675L9594O5076J0696l2848L4607k084j8545n5014n9489n903
10733C24526m8325n1403o7179n209K7368J7418n717l2473J5834J7059K7651J610
10721B21160j4397l551J5480L343o445M347j9213p07j9095J3290K0817P67j8835
10708A96961m4135m076L9813J9616n639M7884L1446j1715m882j8329p4624n3193
$$ plain form
10793 786090 708352 709657 729464 671450 620479 599523 601216 567715 489788 455467 438053 398606
10781 398606 333706 337393 351548 329369 342255 362772 370178 371993 372788 343770 321271 333322
10769 333322 319244 343545 388561 377605 367761 309817 267954 283165 265978 256952 318782 348229
10757 348229 352365 368526 395184 370714 336312 313653 313824 309537 308335 320363 338263 327224
10745 327224 314761 348436 388030 453106 463802 430954 465561 463477 444932 389918 330429 324526
10733 324526 276201 224798 157619 152410 179778 197196 191479 159006 174840 191899 219550 221160
10721 221160 206763 203212 218692 222035 215590 219937 200724 200017 180922 194212 215029 215796 196961
10708 196961 152826 148750 188563 208179 202540 250424 281870 270155 265273 246944 172320 119127
10696A19127J877J7982J4022n4959L244L3674n250j9976k4725m2253m1540J5793
10684A7016k5223q365J4240K3438j7295K4620J7072L8138l157j4159L0795J6754
10672A13874J5363M4566K5641J1950j5787p7061j2235J4844J4029J4039k1000
10661A28223k7842J3507K2957k6679n759L2691K1196j9024J765j3602q482j7386
10649A01565j4912k1147j8298j859k8127k9487q564M1581j4219k5912p115M0263
10637A3769L7590J050P526O329p902k3284q382k7208j0692M4841M6498K4170M2844
10624A47149K5109k8270n7890k9267M5619l31K629J8156j0786k5731j5819j8524
10612E2044j3452q659P878j1520N702J3435k6885L1547J1930j2626k142K7182
$$ plain form
10696 119127 121004 138986 153008 98049 101293 134967 129717 109741 85016 42763 1223 17016
10684 17016 -8207 -16572 -2332 21106 3811 28431 45503 83641 80484 66325 97120 113874
10672 113874 129237 173803 199444 211394 195607 118546 106311 121155 135184 149223 128223
10661 128223 100381 113888 136845 110166 104407 137098 158294 139270 141035 127433 118951 101565
10649 101565 86653 65506 47208 45349 17222 -12265 -20829 20752 6533 -19379 -26494 13769
10637 13769 51359 52409 59935 66264 58362 35078 26696 -512 -11204 33637 80135 104305 147149
10624 147149 172258 143988 86098 56831 102450 102119 104748 122904 112118 86387 70568 52044
10612 52044 38592 29933 37811 26291 31993 45428 18543 50090 62020 49394 47252 74434
10600G4434J531j2766q264j2756J3788o683L4518q146o775k073P628j1500m8233
10587A4703q40K4520j446j6200N7369N2897k8187k9334J6692J3183n373M490k7601
10574G4873j6316L9511k4015K124J6642q303m9649K0121j9028m3437N1558O044
10562E0125l4104k6045o158K5836K9463R879r250k6131j1964P668J4341P711m0335
10549h964m0344L0743r777m3314O359O8922L1362k1687R212K3973j1951L1581
10537F6115M1946l371K1253j335j5317K6008q112m7702m7019j264M497l2296j5803
10524a2400k7892M2253O0359m5960m0247J3327L71k7184L209L3989q469j782P376
10511c050k3808P155p074L5221J060k4400j8748M554J5212K3015J4106J0324Q590
$$ plain form
10600 74434 75965 63199 54935 42179 55967 49284 83802 75656 68881 66808 74436 62936 14703
10587 14703 13863 38383 36937 20737 78106 131003 102816 73482 90174 103357 97984 102474 74873
10574 74873 58557 98068 74053 76177 92819 84516 34867 54988 35960 -7477 44081 50125
10562 50125 16021 -10024 -16182 9654 39117 48996 39746 13615 1651 9319 23660 31371 -8964
10549 -8964 -49308 -18565 -28342 -71656 -65297 3625 34987 13300 22512 46485 34534 66115
10537 66115 108061 104690 125943 124608 109291 135299 127187 79485 32466 31202 35699 3403 -12400
10524 -12400 -40292 1961 62320 16360 -23887 -10560 -10189 -37373 -34164 -175 -8644 -10426 -3050
10511 -3050 -26858 -19703 -26777 8444 9504 -14896 -33644 -29090 -13878 9137 23243 33567 42157
10498D2157j4358j0552R593q254j1793K3543N793J2727N161n5388L112M0986m67
10485D2260j4059k6925p135m644J7178J3244M4974L8460J5889m2308j1733k1043
10473D4158l0131K3346k1009N043M8407J980j3342Q624j768l3347J8294P059O416
10460F3730N442L2782L9235L1419K1559N959L8248M4905N4980J70768K51066K92545
10448A052638M09825L62572J29796j4812p6546k03154l56584l42050k87074j89930
10438D84681p8291P029j0936q1652l1566J8510m784m398p344l1063j4573j4108
10426B31505l6343j0789n2930l6080k1632J4901P51P200l627M399j9336M060j930
10413H0149m0600q446l9961p094K4275L9499J6895j6106J0797L4295Q581o1567
$$ plain form
10498 42157 27799 17247 26840 18586 6793 30336 36129 48856 54017 -1371 1741 42727 42260
10485 42260 28201 1276 -5859 -10503 6675 19919 64893 103353 119242 76934 65201 44158
10473 44158 14027 37373 16364 21407 69814 71794 58452 67076 65308 31961 50255 57314 63730
10460 63730 69172 101954 141189 172608 194167 200126 238374 283279 338259 509027 760093 1052638
10448 1052638 1462463 1825035 1954831 1940019 1863473 1660319 1303735 961685 674611 484681
10438 484681 406390 413419 402483 320831 289265 307775 302991 298593 291249 260186 245613 231505
10426 231505 195162 184373 131443 95363 73731 88632 89383 96583 92956 97355 78019 82079 80149
10413 80149 39549 31103 -8858 -15952 8323 47822 64717 48611 59408 93703 102284 40717
10401D0717j779M220k2499m3921M55K8953N2228J0980k9205j958J7611L7123k4527
10388F8398k7227R804n799n067l5696m3685m29L2854L9454k3213o540k2455p158
10375b6759M358N214o441J5936p434L845M6312J8474j8938q6J7644l3104J362
10362B0383l663O622N32P219j8188J5977J3959L4597K2769M426n4153k7860K6309
10349D8929l9102k7342N691Q808q756K1754J7943L377K2451J1374j9463l0491
10337A5173j444J3938j3405k0869n2913l2781j5536K2120r60Q599K6983j0125
10325f1220k1457J5358J7659N1636K0963l218k2003m3836l7512J9037K0950O4372
10313B0729O165J0085j6421r419J15p850J2894R917K7172j3210l1364k8798k0934
$$ plain form
10401 40717 38938 43158 20659 -23262 -22807 6146 58374 69354 40149 38191 55802 92925 68398
10388 68398 41171 50975 45176 40109 4413 -39272 -39701 -6847 32607 9394 2854 -19601 -26759
10375 -26759 -22401 -17187 -23628 -7692 -15126 -11281 35031 53505 34567 34481 52125 19021 20383
10362 20383 16720 23342 23874 31093 12905 28882 42841 77438 100207 104633 50480 22620 48929
10349 48929 9827 -17515 -11824 -3016 -11772 9982 27925 31302 53753 65127 45664 15173
10337 15173 13729 27667 14262 -6607 -59520 -92301 -107837 -85717 -86677 -78078 -51095 -61220
10325 -61220 -82677 -67319 -49660 1976 22939 19721 -2282 -46118 -83630 -64593 -43643 20729
10313 20729 26894 36979 20558 11139 11254 3404 16298 26215 53387 40177 8813 -19985 -40919
10300d0919m192L1751K7067l605m2886k6551J2153M0785L2352O7723R589J8744
10288A22011k7091J1116k5028m9897l1823k4435k5972p514P363l878J2088J4152
10276b8908K3544j003r039N297m3723J2661K7552K9213k0082K333L37K5955k3741
10263C96l2305m228K6309Q119K150J6638n3498l4089M0699O2677J4933k1566j8320
10250G915m4330O621J574L7820j2719m2854k2285J9706K0551L4392M7901q670
10238D5622K878k1471j5310N318J4011M946L3774L937k2700j2222l550l982N599
10225C6850L4490R207n3533m8271l7853J1827J4285O978J4339K2484P015j1483
10213F335j5940k3171K621m685M19J7143m5867m687K6024R426r700J9301L1785
$$ plain form
10300 -40919 -45111 -13360 13707 10102 -32784 -59335 -47182 -6397 25955 93678 103267 122011
10288 122011 94920 106036 81008 31111 -712 -25147 -51119 -58633 -51270 -55148 -43060 -28908
10276 -28908 -5364 -6367 -15406 -10109 -53832 -41171 -13619 15594 -4488 -2155 -1818 24137 396
10263 396 -31909 -36137 -9828 -1709 441 17079 -36419 -70508 -29809 32868 47801 26235 7915
10250 7915 -36415 -29794 -28220 9600 -3119 -45973 -68258 -48552 -28001 6391 54292 45622
10238 45622 48500 27029 11719 17037 31048 35994 69768 73705 51005 38783 35233 31251 36850
10225 36850 71340 80547 27014 -21257 -59110 -47283 -32998 -26020 -11681 10803 17818 6335
10213 6335 -9605 -32776 -30155 -34840 -34421 -17278 -63145 -67832 -41808 -32382 -42082 -22781 9004
10200I004L012l461J1186r809j6820L416k0635m3324o491L2758J8233j3152J061
10187c5022j2962J2327k0013j8356j5168K4884M9836K5908J4006k5220j5309K6418
10175A1329n775j6513l638J7547r830j6375R809l8530j7713L2571K2515k0205
10163c4808k4830N444K7868J9319K6434Q252J0833J8131N699n7192o2404k0638
10151g7892J3711K5332L580K1370K8399K4185k4463o495L084Q352o979K178j4279
10138H3J8844M366L39p0709j4177J5723J7293J5936j5274J3645k7495l8569J220
10125g8775Q276L0508J1258l0534l7264J6104M5860j3579n532J4471K0840K625
10113a5742q970k1925l2152n659N1847P3170J6536m7506p979k4764l942P261j9852
$$ plain form
10200 9004 12016 8555 19741 9932 -6888 -3472 -24107 -67431 -73922 -41164 -22931 -36083 -35022
10187 -35022 -47984 -35657 -55670 -74026 -89194 -64310 -14474 11434 25440 220 -15089 11329
10175 11329 5554 -10959 -14597 2950 -6880 -23255 -13446 -51976 -69689 -37118 -14603 -34808
10163 -34808 -59638 -54194 -26326 -7007 19427 27679 38512 56643 62342 5150 -57254 -77892
10151 -77892 -64181 -38849 -35269 -13899 14500 38685 14222 7727 10811 19163 12184 14362 83
10138 83 18927 23293 23632 -47077 -61254 -45531 -28238 -12302 -27576 -13931 -41426 -79995 -78775
10125 -78775 -70499 -39991 -28733 -59267 -96531 -80427 -34567 -48146 -53678 -39207 -18367 -15742
10113 -15742 -24712 -46637 -78789 -84448 -32601 40569 57105 9599 1620 -23144 -27086 -19825 -39677
10100c9677j6210L1265N337O934O240n037J0250K9837K9014P387k9344k4708L6567
10087D7855L5642l7813m3790l9192R674K2457j5886q199J6179j5348k2738k4356
10075g5515k1160M6123J2722j4428k496l7147j0868K1162M2465L1798j2314p681
10063b7339J4689M048j5311L1896M1795J2364K1653j0740m5082n5358j2654M326
10051c5713L3227L097N826r074L3511K456J4843j2020J1619L6097l4237k5216
10039B4416m0467J8477o471l871R560j4292k0595L091m649K1862l8581P196J8263
10026b6061k4891R73J1992j6199m6575M7026N2706k5581n792L9426J5105o459
10014A5670l4702l2138J9001K1354J0355J2043o483j6840q585k493N701R326J1876
$$ plain form
10100 -39677 -55887 -24622 -19285 -12351 -6111 -11148 -898 28939 57953 65340 35996 11288 47855
10087 47855 83497 45684 1894 -37298 -27624 -5167 -21053 -29252 -13073 -28421 -51159 -75515
10075 -75515 -96675 -50552 -37830 -52258 -54754 -91901 -102769 -81607 -39142 -7344 -19658 -27339
10063 -27339 -12650 -8602 -23913 7983 49778 62142 83795 73055 27973 -27385 -40039 -35713
10051 -35713 -2486 611 6437 -2637 30874 33330 48173 36153 47772 83869 49632 24416
10039 24416 -16051 2426 -4045 -7916 1644 -12648 -33243 -30152 -34801 -12939 -51520 -44324 -26061
10026 -26061 -50952 -49979 -37987 -54186 -100761 -53735 -1029 -26610 -32402 7024 22129 15670
10014 15670 -19032 -51170 -32169 -10815 -460 11583 5100 -11740 -20325 -22818 -17117 -7791 4085
10001D085j5813Q186R931K2601j7457L040L1296J7888m1709n1541K659j751k3942
9988e2527R532N7208J8238n161l1331M3865O9153N0571O1674R7152J25174J49774
9976E93322J27979Q2138J3688K9563q6352j25568j45659j53108r1847n5481k8046
9965A60629M341j0792m7161k1438M0687J2758o2784m1779K27J5253J6031M9170
9953A15142J1830m6306k3348j7623J3331k4757l4099K5299M6586l4318j1167M4383
9941F4953L3073j1721P448m7302j3016K384k0745j8695J3796K0299k253l5624
9929g403J3826M2919r223l2045R47M0791N660l382Q318J7538j9805K83p5058m4897
9915f1531J3238O4257J1822n3266k4610K0654K6953J2603K19P934M6766L2844
$$ plain form
10001 4085 -11728 -3542 6389 28990 11533 14573 45869 63757 22048 -29493 -26834 -28585 -52527
9988 -52527 -42995 14213 32451 27290 -4041 39824 108977 159548 221222 318374 443548 593322
9976 593322 721301 803439 817127 846690 760338 634770 489111 336003 244156 188675 160629
9965 160629 164970 154178 107017 85579 126266 139024 76240 34461 34688 49941 65972 115142
9953 115142 126972 80666 57318 39695 53026 28269 -5830 19469 66055 31737 20570 64953
9941 64953 98026 86305 93753 46451 33435 35819 15074 -3621 10175 30474 28221 -7403
9929 -7403 6423 49342 40119 8074 9021 49812 55472 52090 60408 77946 58141 58424 -16634 -61531
9915 -61531 -48293 15964 27786 -25480 -50090 -29436 -2483 10120 10339 18273 65039 97883
9903I7883l2982M878O2k7154n5949q082L3838L4812J2450l8466l7735K6371J8657
9890B8583J9773p612K9569O357o1761J65j2238j1005j2086l6961l631L8318J8513
9877d016L548l5338J3257K62n951J5332L9196j2335J0230J8042K131j9223j0338
9864A4797k940q103j1976j7322L1643J5888J0028N0523K5948J580j8087r080P276
9851I0175N611L0029j3517L1445O0828J14042J80855J46779P7290R943k0391p9653
9839F33436q9507j51013j09894o0215m3766K31k039l6961O709k102k7902K0161
9827A37138q532l4975J0134n202k7494j2523J9226N378l1679m0103K496Q385J6744
9814C8993O367m6923k4675J2043n996K1917J6208K4531m0117l3981K075k5623
$$ plain form
9903 97883 64901 69779 69841 42687 -13262 -21344 12494 47306 59756 21290 -16445 9926 28583
9890 28583 48356 40744 70313 76670 14909 15074 2836 -8169 -20255 -57216 -60847 -22529 -4016
9877 -4016 -468 -35806 -22549 -22287 -28238 -12906 26290 13955 24185 42227 44358 25135 14797
9864 14797 11857 3754 -8222 -25544 6099 21987 32015 82538 108486 110066 91979 82899 90175
9851 90175 95786 125815 112298 143743 204571 318613 499468 646247 723537 733480 713089 633436
9839 633436 543929 392916 283022 222807 179041 179272 177233 140272 146981 144879 116977 137138
9827 137138 128606 93631 103765 98563 71069 58546 77772 83150 51471 11368 13864 22249 38993
9814 38993 45360 -1563 -26238 -14195 -20191 1726 17934 42465 2348 -31633 -29558 -55181
9802e5181K0242M002M0798j0727J5166K5140K3979J1055k9202m195o172R424k8646
9789A5683k5328J1255J7098J5662N578K2746j8496k5486o651l3331k310N450L2741
9776A4611P968P936P090O330q577m3570j6257q938J3450J8610M1142r123k1137
9763I535j3204o0615L847L5839l75L6831O2912M245k0509K1282m6128n3085p290
9750b6715q575J0622N9722m143p4420l4546J6056K4444L1681k083N0137J2390
9738E4570p916j6660k7380n4057M5047O722k0513o962m807J2246R885MQ107J0282
9724H568K3067R249n2714J1570r847K2955J4516j7491k3962k7164j4944L9818
9712a6379M5825m778M659J3527k4669l3152M7882K8992P513J4719k9809l4245
$$ plain form
9802 -55181 -34939 -30937 9861 -866 14300 39440 63419 74474 45272 41077 34905 44329 15683
9789 15683 -9645 1610 18708 34370 39948 62694 44198 18712 12061 -21270 -23580 -18130 14611
9776 14611 22579 30515 37605 43935 35358 -8212 -24469 -33407 -19957 -1347 39795 30672 9535
9763 9535 -3669 -64284 -60437 -24598 -24973 11858 74770 79015 58506 79788 33660 -19425 -26715
9750 -26715 -35290 -24668 35054 30911 -43509 -78055 -61999 -37555 -5874 -7957 42180 54570
9738 54570 46654 29994 2614 -51443 -6396 326 -20187 -27149 -31956 -19710 -9825 -9821 -1714 8568
9724 8568 31635 40884 -11830 -260 -10107 12848 27364 9873 -14089 -41253 -56197 -16379
9712 -16379 29446 24668 29327 42854 18185 -14967 32915 61907 69420 84139 54330 20085
9700B0085q544k7045m109j0296j8954L2704J7910Q403q319l2618N064K3735j6094
9687a8078K4060q080k0085k726k2335l435J6046m691L3242K5081P655O111k3853
9674H912J3093K8561J0229k7537k1472J9650j4504k4639L3903k5610j2159j2140
9662b3713N332n494k1494R861k1216k4831N096L6303m583j1780L49l1253K2490
9649f4933J6591m1407k8501L8693N5152K6837J3353l254k3022P412m314l3699
9637d1092j3734J1876K6206O359L4682j0136m3916k3649M1449K6563L2956L4906
9625H2470j9243k8587k0732l1404n731l2461O298M4848Q964k5310N40m196J1705
9612a2839R568J2646M7446n152J0709p137l8945R874l6458j4203J3301r821J7211
$$ plain form
9700 20085 11541 -15504 -19613 -29909 -48863 -16159 1751 10154 1835 -30783 -25719 -1984 -18078
9687 -18078 5982 -2098 -22183 -24909 -47244 -50679 -34633 -39324 -6082 18999 26654 32765 8912
9674 8912 22005 50566 60795 33258 11786 31436 16932 -7707 26196 586 -11573 -23713
9662 -23713 -18381 -23875 -45369 -35508 -56724 -81555 -76459 -40156 -44739 -56519 -56170 -87423 -64933
9649 -64933 -48342 -89749 -118250 -79557 -24405 2432 15785 12531 -10491 -3079 -7393 -41092
9637 -41092 -54826 -42950 -16744 -10385 24297 14161 -29755 -53404 -11955 14608 47564 82470
9625 82470 63227 34640 13908 -17496 -23227 -55688 -49390 -4542 4422 -20888 -20348 -24544 -12839
9612 -12839 -3271 9375 56821 51669 62378 55241 16296 26170 -10288 -24491 -11190 -21011 -3800
9599c800M8879L542l5567K8109J4692O818j8848j1354J0254J0055q434J4102m0922
9586A7526K4472K3476l0849L726K1159k0284m1069J2468K3986r692l2960K5336
9574A7295k1893l484N824k6988j7096L5085j2906L647j7346L3932M5616k999j2001
9561B6686k8393N708L3004P861o038q595K077j159O149q496j1729K9379n386j6883
9547B4185j2400K3093J9437n623k0253m8742l5475r483K7811l8400K3900M4873
9535g077k1228k332J3792M6474k6j2050k4457R883l897M0793K5738j3554l5955
9522A6104m4804j446j0366l2546L4997r943K238K6876l47M023m029O927k9375
9509d1691K2723k1223K207K0358J2466N761m0022J9750k346k3586j8390M927L5943
$$ plain form
9599 -3800 45079 48621 13054 41163 55855 62673 43825 32471 42725 52780 44346 58448 17526
9586 17526 41998 65474 34625 38351 59510 39226 -1843 10625 34611 24919 -8041 17295
9574 17295 -4598 -8082 -2258 -29246 -46342 -11257 -24163 -20516 -37862 -3930 41686 38687 26686
9561 26686 -1707 4001 37005 44866 38828 30233 32310 31151 37300 28804 17075 46454 41068 24185
9547 24185 11785 34878 54315 48692 28439 -20303 -55778 -65261 -37450 -75850 -51950 -7077
9535 -7077 -28305 -30637 -16845 29629 29603 17553 -6904 2979 -918 39875 65613 52059 16104
9522 16104 -28700 -30146 -40512 -73058 -38061 -48004 -45766 -18890 -19237 -15214 -19243 -12316 -41691
9509 -41691 -18968 -40191 -37984 -17626 -5160 601 -39421 -19671 -22017 -45603 -63993 -59066 -23123
9496b3123K5231J9312J1623k8859J1802n950p077K3879Q266P084l830O238j2831
9483C1765m1961j1074K789K3118Q131K076j0417K6901L3209k565j9672k5921N1082
9470F7461O1037j3083m0821l7697j8667k0902j1232J8665K1256P326k5188l0499
9458b2344K3023k3345m442K6266K8454K2102n958K0883K5650n7946o8557L75N2808
9445A6969j0921o145r175Q34m440k327K5810J8768q440k3022R779J9620J6728
9432D4038J4124K534J5280k2509j5013K744j5847l4254J6852R906j2044j6024
9420a0213j7355k2314J7072K255J3701J8731L7919J657k894o146l8214l8712P8447
9407C3934k0723L054R421j1597k5132O486J729n7027J8293N8408J1767N483l446
$$ plain form
9496 -23123 2108 21420 33043 4184 15986 10036 2959 26838 35104 42188 38358 44596 31765
9483 31765 -10196 -21270 -18481 4637 12768 14844 4427 31328 64537 61972 42300 16379 67461
9470 67461 128498 115415 74594 36897 18230 -2672 -13904 4761 26017 33343 8155 -22344
9458 -22344 679 -22666 -27108 -842 27612 49714 43756 64639 90289 32343 -36214 -35839 16969
9445 16969 6048 -97 -9272 -8438 -12878 -15205 10605 29373 20933 -2089 7690 27310 44038
9432 44038 58162 60696 75976 53467 38454 41198 25351 -8903 7949 17855 5811 -10213
9420 -10213 -27568 -49882 -32810 -30555 -16854 1877 39796 41453 38559 32413 -5801 -44513 33934
9407 33934 13211 16265 25686 14089 -11043 -4557 -2828 -59855 -41562 16846 28613 34096 30650
9394C0650q32J7000j8874l9658j7531Q156L656o799M1832R589j4775l8343k3396
9381d9325r441J2448M6273K8859K4835n4663l0458J5914R843M400N879L4748j2672
9368B6640J4376J858k7653K5514L7581J2936m626l7398j5343o216r149J5025j8435
9355A5110J4302m427j7941j8864M170O476j2640N688J279k2239r764J225j5640
9342e3265M5838N6282k5935n8840Q123M2903M6579k0042k9311j5672M0525J715
9330C8900j2095J5222J4999j5755m4426l9196K3184L1423j63J7981M83j3946M9626
9317F6237J3088Q905K846k974j9447l6302J8603j2751l2459k145R12M3889k33
9304D8169p424O11m7237j5242L0226o028p647m4389q644p91M5414m969R047L3089
$$ plain form
9394 30650 29818 46818 27944 -11714 -29245 -21089 -17433 -24232 17600 27189 12414 -25929 -49325
9381 -49325 -58766 -46318 -45 28814 53649 -1014 -31472 -15558 -5715 -1315 4564 39312 26640
9368 26640 41016 42874 15221 40735 78316 91252 86626 49228 33885 27669 18520 33545 15110
9355 15110 29412 24985 7044 -11820 -7650 -1174 -13814 -8126 -6847 -29086 -38850 -37625 -53265
9342 -53265 -7427 48855 22920 -35920 -27797 15106 61685 41643 12332 -3340 37185 38900
9330 38900 26805 42027 57026 41271 -3155 -42351 -19167 12256 12093 30074 30557 16611 66237
9317 66237 79325 88230 91076 88102 68655 32353 50956 38205 5746 3601 4513 48402 48169
9304 48169 40745 41356 -5881 -21123 9103 3075 -4572 -48961 -57605 -58396 -12982 -17951 -8904 24185
9290B4185k2355l7636P360L079j4671l600P4101O9121K0029n392m5380p8476l5492
9277d5127q244K2696L5409J0920J6285L4210K7443k492l0458l1662m380k3511
9265A089l153J5643J8815j7354m9165k1115K7296M8645K0329J0552K4458J5685
9253I1725M759j4368j1459l7205j9506K9415l990k8201p415M4803L3927n1007
9241C1478m8231K9386K4893K283K653L168o289J1065m899m4352J1367N2519M513
9228F9554n8476O6697p415n449N8525L0690k8737J3705k878k645r684j1343J2610
9215A25154m1799K6318P2738k5051m2244k1044r448k324L0393j9574J8847j4049
9203I7917k742K1758j6082q819J1620N2478R409J4713L5681J9215J3819j1801
$$ plain form
9290 24185 1830 -35806 -28446 -25367 -40038 -43638 30463 99584 119613 114221 68841 -9635 -45127
9277 -45127 -53371 -30675 4734 15654 31939 66149 93592 91100 60642 28980 24600 1089
9265 1089 -2064 13579 32394 15040 -34125 -55240 -27944 20701 41030 51582 76040 91725
9253 91725 96484 82116 70657 33452 13946 43361 39371 11170 3755 48558 82485 31478
9241 31478 -16753 12633 37526 39809 42462 45630 39341 50406 45507 1155 12522 65041 69554
9228 69554 11078 77775 70360 64911 123436 154126 125389 139094 136216 133571 123887 112544 125154
9215 125154 83355 109673 182411 157360 115116 94072 84624 82300 112693 93119 111966 97917
9203 97917 95175 116933 100851 92032 103652 156130 165539 180252 215933 235148 248967 237166
9191B37166m869R947J0495o068N697M7827J0208j5860J31R03J4217L4068P202
9178C51064K4883Q1665J6876l4730L5656M6345L8788N0872O6329O6079P4945M6327
9166H65099J3222N6759J46323J34513J21148J72492J70296J87855K17331K82531
9156B367569L24910L41737M92900N36347O23747O51230O86587O20971N52865M35317
9146G634180K85547R9890j03552k48370m56489n79693n99651n62681n06956n04986
9136D457239m57326l35747k66445k81990k58664k45412j65206j73220j80606j34532
9126A958091j31231j68535j47686j12504r3917r2330n2037o2047r9280r8591p3261
9115H26672m0855n2086m6311n6646l6700N519m5330n1076k6652o3685p1164J2470
$$ plain form
9191 237166 232297 242244 252739 246671 252368 300195 310403 294543 294674 295577 309794 343862 351064
9178 351064 375947 457612 474488 439758 475414 521759 560547 611419 677748 743827 818772 865099
9166 865099 878321 935080 1081403 1215916 1337064 1509556 1679852 1867707 2085038 2367569
9156 2367569 2692479 3034216 3527116 4063463 4687210 5338440 6025027 6645998 7198863 7634180
9146 7634180 7919727 8019617 7916065 7667695 7211206 6631513 6031862 5469181 4962225 4457239
9136 4457239 3999913 3664166 3397721 3115731 2857067 2611655 2446449 2273229 2092623 1958091
9126 1958091 1826860 1658325 1510639 1398135 1304218 1211888 1159851 1097804 998524 899933 826672
9115 826672 785817 733731 687420 630774 594074 599593 554263 503187 476535 412850 341686 354156
9103C54156J5234o5169l1014K6636J1785m5628m5954L439J6417k5192j6282J6877
9091B15305m1948j0593k0492K0129J4648J903j9987j6444k0971j9404k7809n490
9079F8847K3801J986K199M221j2536j5259r330J0297J5257k5108J7414M7414j971
9066A27232m1980K552j2667p138M1867K5098m0742L4234L7763J4338l8374m7490
9054I4693N97J5275q500k5528m3815K692K3106K130k0619l2778J0850o635j7233
9041e765l2463M5423O2405Q86O509l7118l9609r481J0472K3332o089q775q45q209
9027F73r047J4379L523R586k8848j6265K4862J5863j2571j5853j5094n380J2557
9014b1615N1848K3235k6130O219J9135Q589m4881p568N5729O770l1851m3044K017
$$ plain form
9103 354156 369390 304221 273207 299843 311628 266000 220046 223485 239902 214710 198428 215305
9091 215305 173357 162764 142272 162401 177049 178952 158965 142521 121550 102146 74337 68847
9079 68847 92648 94634 96833 101054 88518 73259 63929 74226 89483 64375 81789 129203 127232
9066 127232 85252 87804 75137 67999 109866 134964 94222 128456 166219 180557 142183 94693
9054 94693 95290 110565 102065 76537 32722 35414 58520 60650 40031 7253 18103 11468 -5765
9041 -5765 -38228 7195 69600 70486 76995 39877 268 -9213 1259 24591 18502 9727 8882 673
9027 673 -8374 6005 9528 19114 -9734 -25999 -1137 14726 2155 -13698 -28792 -34172 -21615
9014 -21615 30233 53468 27338 33557 52692 61281 16400 8832 64561 71331 39480 -3564 -1547
9001a547K018M2210J5232l2061q355L014k5822J2193J3346p647k2416K9564l3787
8988a4058j0516J6656k4542j2884M6433O532J3448j5333K3808M1678K2617J548
8976I5387o197m326K0246j8446k2618K3949n7810n5985J5530L4027J5000p280
8964C1477m8099j4965L2442J9425L9420j9495n2233k0830N475k707j941j741N369
8951b8403K0940K0035N78n502J6802n255J4616K5783J7185j2112m0802k4832k9628
8938c0595o469J6679L5736m115J1188K9681j7116k3167m2725J7029J2501k9692
8926c1065k2628J1685L5557M5197J4671J3321P877j1526j2233J6721j6539l6491
8914A4547k9159K4341J7284Q812L0513p718l9548k6598L6090K4283j1741k1330
$$ plain form
9001 -1547 471 42681 57913 25852 17497 20511 -5311 6882 20228 12581 -9835 19729 -14058
8988 -14058 -24574 -7918 -32460 -45344 1089 7621 21069 5736 29544 71222 93839 95387
8976 95387 89190 84864 105110 86664 64046 87995 30185 -25800 -10270 23757 38757 31477
8964 31477 -16622 -31587 855 20280 59700 40205 -12028 -32858 -27383 -30090 -32031 -33772 -28403
8951 -28403 -7463 12572 13150 7648 24450 19195 33811 59594 76779 64667 23865 -967 -30595
8938 -30595 -37064 -20385 15351 11236 22424 52105 34989 11822 -30903 -13874 -1373 -31065
8926 -31065 -53693 -42008 -6451 38746 53417 66738 74615 63089 50856 67577 51038 14547
8914 14547 -14612 9729 27013 35825 66338 58620 19072 -7526 28564 52847 41106 19776
8902A9776n2340l7325J4065K2211q20M8881o087o68n980m8894j8436j7665K910
8889h0372j057L2630L5910R034m275j9932L4929K050M72l0884J4412K1038j407
8876A2548j7774j1527K531N424j6761K4519j9527j2558L7510J7767r422k3254
8864a0524m997K2332q868k7544P534j6836J999L5389M1299j582L4762n14k0803
8851E1647P34n653k3859j7615m942J0492K8311j5063R855K3492j7424l5840m528
8838c93K5967o487m441k793J0590k157o974M679J7043j418L000j7341K347l6092
8824a4470o531K5639k1298k7456j0931K5596J8448k1270j518K07R131k5580K1532
8811b8501L4427J9089j920K26j4791L866J2734m125J4112L7540Q908m9545k1489
$$ plain form
8902 19776 -32564 -69889 -55824 -33613 -34433 14448 8361 7693 1713 -47181 -65617 -83282 -80372
8889 -80372 -81429 -48799 -12889 -3855 -8130 -28062 6867 8917 9389 -21495 -7083 13955 12548
8876 12548 -5226 -16753 -14222 -8798 -25559 -1040 -20567 -33125 4385 22152 12730 -10524
8864 -10524 -15521 6811 -2057 -29601 -22067 -38903 -36904 -1515 39784 38202 72964 72450 51647
8851 51647 52381 46728 22869 5254 312 10804 39115 24052 33907 57399 39975 4135 -393
8838 -393 25574 19087 14646 11853 22443 20286 13312 17991 35034 33616 36616 19275 21622 -14470
8824 -14470 -21001 4638 -16660 -44116 -55047 -29451 -11003 -32273 -33791 -33584 -24453 -50033 -28501
8811 -28501 5926 25015 23095 23321 8530 12396 25130 21005 35117 72657 81565 32020 10531
8798A0531o588j4581J2751K1411Q828j5090l6875k7382J5470L4529N9327L6018
8786I8349p495m5343r1798n4996Q083J0804M5081M942p647K0032K6867J0217l886
8773A3210L6013K6216l3534l7047j4847J4213J9390l2145l3218j4370Q68m912
8761f0163M9894j5729j401K4491j6038m233K542J6379K8087M0534m4125n3965
8749c3727k370J345J3458M3569J2606n5393k599k237k4530L2933J8245K0753k7898
8736e845l5161K2493J9580J4193K1570J7866j5867k3961k8735L1867J0090n524
8724B2566K2733R769m4643m1680Q631J255J6774p958M603m671k1757j6494J2103
8711c8769L1941l0895o288j0828J747L9905K8669q590J5781J2257l7220J3487
$$ plain form
8798 10531 3943 -10638 2113 23524 32352 17262 -19613 -46995 -31525 3004 62331 98349
8786 98349 90854 45511 -46287 -101283 -93200 -82396 -37315 -32373 -40020 -19988 6879 17096 13210
8773 13210 49223 75439 41905 4858 -9989 4224 23614 -8531 -41749 -56119 -55251 -60163
8761 -60163 -10269 -25998 -27399 -2908 -18946 -23179 -20637 -4258 23829 64363 20238 -33727
8749 -33727 -36097 -34752 -21294 22275 34881 -20512 -23111 -25348 -49878 -16945 1300 22053 -5845
8736 -5845 -41006 -18513 1067 15260 36830 54696 38829 14868 -13867 18000 28090 22566
8724 22566 45299 55068 10425 -31255 -22624 -21369 -4595 -12553 -7950 -12621 -34378 -50872 -38769
8711 -38769 -6828 -37723 -44011 -54839 -53092 -13187 15482 6892 22673 34930 -2290 11197
8699A1197O595J0700P608K6178K114j6010J5751j5632l462L1287J662m8430l1884
8686b326L8569j240m0719j935K7151L800R964K4819q075n2999k1314J0575K8144
8673A4414j4575J6453j0999l6982M6723M7978J8053Q083j4003l5698m762J5222
8661D9907l557k792o445j2312k6434J8206K4877J6277k1768k4369J5901M3012
8649G0503m0778K0851K1250j7651J2062M7076N2420K1690l4998L0081L8042j6322
8637B04226l4814o2368m1938j5881j8485L3279N9764p841p4892o0712J1282M4838
8625C6458J3212l2386k7734k0718K1884J0871P1J3727J5726M967l933k0066l4855
8612b2776R568K8428k3009r586J0476J7174M4688L1638k5081j8564K5780R432
$$ plain form
8699 11197 17792 28492 36100 62278 64392 48382 64133 48501 45039 76326 77988 29558 -2326
8686 -2326 36243 35003 -5716 -7651 19500 23300 33264 58083 50008 -2991 -24305 -13730 14414
8673 14414 -161 16292 5293 -31689 15034 63012 81065 89148 75145 39447 34685 49907
8661 49907 46350 43558 37113 24801 -1633 16573 41450 57727 35959 11590 27491 70503
8649 70503 29725 50576 71826 54175 66237 113313 165733 187423 152425 182506 220548 204226
8637 204226 169412 107044 65106 49225 30740 64019 123783 115942 41050 -19662 -8380 36458
8625 36458 49670 17284 -10450 -31168 -9284 1587 1658 15385 31111 36078 32145 12079 -22776
8612 -22776 -13208 15220 -7789 -17375 -6899 10275 54963 86601 61520 42956 68736 78168
8600G8168M1824P4538O9420P6596Q7074l363k2028l2051o4133m8810l2890n7168
8588A67177k9410l7144P175K1970K3992k5454k2312O471j5234j4885j1199K2140
8576I3287K0526J2075j4012m0266m4332J264J5128N1487L0489m8024l9011j2459
8564B6152n3443j6727L9113l793j6213K3972L0560N7780M533J4181J5334K8253
8552A49702J0952J6949j8761K3491j6840n8786l9485l4647p103l3555o1202l250
8540g2535K7112J7894M7492K3488l014J0110j6789l2654j277O467L073l2757Q398
8527a4992j173L410L4414J5010l5242P468L104P058L1102r071k0272J595Q036
8514C0447r26J5620M332j4840j6746k0345j6352J7903K0736n33K0564M093O873
$$ plain form
8600 78168 119992 194530 263950 340546 427620 424257 402229 370178 306045 257235 224345 167177
8588 167177 137767 100623 107798 129768 153760 128306 105994 112465 97231 82346 71147 93287
8576 93287 113813 125888 111876 71610 27278 28542 43670 95157 125646 77622 38611 26152
8564 26152 -27291 -44018 -4905 -8698 -24911 -939 29621 87401 91934 106115 121449 149702
8552 149702 160654 177603 158842 182333 165493 106707 67222 32575 25472 -8083 -69285 -72535
8540 -72535 -45423 -27529 19963 43451 40437 50547 33758 1104 -173 6294 9367 -23390 -14992
8527 -14992 -16165 -12755 21659 36669 1427 8895 11999 19057 50159 41088 20816 22411 30447
8514 30447 29521 45141 49473 34633 17887 -2458 -18810 -907 19829 19296 39860 43953 50826
8501E0826N925K0595j938j8512o233j007q173k6470j8539j1663p639j241N216
8488a8853K1303j0967K5732K0507k5237j0280N611K1637j5155r801J381J2172
8476A8050J3217m0963m7363N916k787J6395K9382M2591j3019k3531n46l196J6970
8463A1116J9755k2582N589j3839k1453K9090R706n8585J2403J9766k679p252n088
8450b4053L4713j3217n2210J3813K9121J2887K9377l9258k8956J0805j5800q913
8438e1691j0885o553N6220M1522o593K0382p158k7215j7070J703K5766M8n7650
8425c9174k021J0205k8467n629L5695Q98N503K4694J3150L9647o9789k4810L5965
8412d133O451m770l263L5763M718l3324l9111j8009L2255m0168K642R564K7689
$$ plain form
8501 50826 56751 77346 75408 56896 50663 49656 41483 15013 -3526 -15189 -22828 -24069 -18853
8488 -18853 2450 -8517 17215 37722 12485 2205 7816 29453 14298 4497 5878 18050
8476 18050 31267 -9696 -57059 -51143 -53930 -37535 -8153 34438 21419 -2112 -2658 -5854 11116
8463 11116 30871 8289 13878 39 -21414 7676 17382 -41203 -28800 -9034 -11713 -18965 -24053
8450 -24053 10660 -2557 -54767 -40954 -11833 1054 30431 -8827 -37783 -26978 -42778 -51691
8438 -51691 -62576 -69129 -12909 28613 22020 42402 35244 8029 -9041 -7338 18428 18476 -39174
8425 -39174 -41195 -30990 -59457 -65086 -29391 -28493 -22990 1704 14854 54501 -15288 -40098 -4133
8412 -4133 2318 -2452 -5715 30048 34766 1442 -37669 -55678 -23423 -63591 -60949 -51385 -23696
8399b3696M381M490k0704J1467K5219J0893l453K1469K9182K2666m1322m3600
8387c008j797j7566L218R898J1213K6138J9298k9088n0428l704J3520M0914j0409
8374H199l6018n765m9739J8122M2271j5552K4420k511o9356k3338L5144L2322
8362d1801L6262J9712m0310J2367p907j6618J5091J288l703j3512q566k2294M3129
8349b6862L5708L6020l2591O361J2748r425m7203K6105k5076k3778J8412J699
8337b7882k7505j2096J0735J6984L6546j2128j6135J2905j2424q938l3732j8122
8325i1792J2480N8790K8565m023l3658J3492r92j9683j5584O581K6351n558R613
8312a5418L0789J7795l1607J1592K6396m2424k4739Q349q438K2094L2616k4349
$$ plain form
8399 -23696 -19315 -14825 -35529 -24062 1157 12050 8597 30066 59248 81914 40592 -3008
8387 -3008 -4805 -22371 -19153 -9255 1958 28096 47394 18306 -32122 -35826 -22306 18608 8199
8374 8199 -27819 -33584 -83323 -65201 -22930 -38482 -14062 -16573 -85929 -109267 -74123 -41801
8362 -41801 -5539 14173 -26137 -13770 -21677 -38295 -23204 -21916 -25619 -39131 -47697 -69991 -26862
8349 -26862 8846 44866 12275 18636 31384 21959 -25244 861 -24215 -47993 -29581 -27882
8337 -27882 -55387 -67483 -56748 -39764 -3218 -15346 -31481 -18576 -31000 -39938 -73670 -91792
8325 -91792 -79312 -20522 8043 4020 -29638 -16146 -17138 -36821 -52405 -45824 -19473 -25031 -15418
8312 -15418 15371 33166 1559 13151 39547 -2877 -27616 -19267 -27705 -5611 27005 2656
8300B656j2593k3384L5921J1090j090L426j8375j0483J4724L6311j496j0225j9485
8287F997l3148j7396k031J440N7567L828j8942k9545J6740L2729r328q599j6009
8274a5697L1617J8378L5408j6225k830Mj1921m7974l0348J9412K3451K414l7637
8261c1948m8903k8989J2624Q2979N2379J155j9578k6056L3694J2299N3889J3362
8249A06907J3465k5055m5870j5087l6277J1753M0664j6684n9876j7756j060K497
8237d2379K9367P045j8324j4149N250o450r902K2804L8605l240J611j4872j7449
8224b2083P451n697j7271N15m252j781Q662K9211r204l2497K8912K8882P418n738
8210A2528L4962o04l1567J4622N120l5555l673j916j5560J3653j3018M5758K1054
$$ plain form
8300 2656 -9937 -33321 2600 13690 12600 16026 -2349 -12832 1892 38203 36707 26482 6997
8287 6997 -26151 -43547 -45578 -44138 13429 17257 -1685 -31230 -14490 18239 8911 312 -15697
8274 -15697 15920 34298 69706 53481 50651 50655 38734 -9240 -39588 -20176 3275 5689 -31948
8261 -31948 -80851 -109840 -97216 -14237 38142 39297 19719 -6337 27357 39656 93545 106907
8249 106907 120372 95317 49447 34360 -1917 9836 50500 33816 -26060 -43816 -44876 -42379
8237 -42379 -13012 -5967 -24291 -38440 -33190 -39640 -49542 -26738 11867 8627 10238 -4634 -22083
8224 -22083 -14632 -20329 -37600 -37085 -41337 -43118 -34456 -5245 -14449 -46946 -18034 10848 18266 12528
8210 12528 47490 46886 15319 29941 35061 -494 -4167 -6083 -21643 -7990 -21008 24750 45804
8197D5804J0170l6191l4755j2908L388K0153M717k0845J6734M6426o339L3034
8185F9388k1122k5932l3033j2878O0278j6549m3998m849K3754M9778J2056m089
8173E2804k9214k0615k575J7899k9846l4348L9Q581P022J2935k0368m6860n0936
8160a35482O8482O2475J6972N098J4486m424l2407K212n223j2952J6907l528j0534
8147a7918j3903j9526j8057L0419L9645P131k4677J1517R756l7131J0217J3380
8135i147l7180K0804M6230p748q333j5062L3802J723K430N143o441k3817J0712
8122A3116j3037m6794O819L2005L3634L6748K6872k8725l7414J1006K236O460
8110D2926l543L3469m140l4215N142j3728o031J3584j9087J856R056m991k650
$$ plain form
8197 45804 55974 19783 -14972 -27880 -24492 -4339 378 -20467 -3733 42693 36354 69388
8185 69388 48266 22334 -10699 -23577 36701 20152 -23846 -28695 -4941 44837 56893 52804
8173 52804 23590 2975 400 18299 -11547 -45895 -45856 -37275 -30253 -17318 -37686 -84546 -135482
8160 -135482 -67000 -4525 12447 17545 32031 27607 -4800 -2588 -7811 -20763 -3856 -7384 -17918
8147 -17918 -31821 -51347 -69404 -38985 660 7791 -16886 -5369 4387 -32744 -22527 -9147
8135 -9147 -46327 -25523 20707 12959 4626 -10436 23366 25089 27519 32662 26221 2404 13116
8122 13116 79 -46715 -39896 -7891 25743 62491 89363 60638 23224 34230 36466 42926
8110 42926 39383 72852 68712 34497 39639 25911 19880 33464 14377 16233 25289 20298 17648
8097A7648k4456j8932k0536j2693j4573K9237J3630O389J9329N6182M4463r907
8085H5781l0652n3778p590m051J2403K3592J4615j8532j0581j6596q38M0773N1378
8072H5924r229m9717q942M6967J3484l0500k7185k2085M1395K417n0879J3944
8060E594L0157l4087r549K8022J5066k889J7813k2893n574l0090K9429L0295J5244
8047F6538K1254j4891m4833K0690k3259O374K8497k0569o7448n7010J573L0675
8035e2409N2247J4038m800J5445n072M888m727j119l9848l4467j9798J3942J4415
8022d7265K8907M8623n632J1222p475l2384j0262O3386N512j3186l7621J7948
8010B1773K81n920J8410J6268q011j0243q160j595j3246J347L1158L3600J8293
$$ plain form
8097 17648 -6808 -25740 -46276 -58969 -73542 -44305 -30675 -24286 -4957 51225 95688 85781
8085 85781 55129 1351 -6239 -10290 2113 25705 40320 21788 11207 -5389 -6227 34546 85924
8072 85924 76695 26978 18036 65003 78487 47987 20802 -1283 40112 42529 -8350 5594
8060 5594 35751 1664 -7885 20137 35203 32314 50127 27234 21660 -8430 20999 51294 66538
8047 66538 87792 72901 28068 48758 25499 31873 60370 39801 -27647 -84657 -83084 -52409
8035 -52409 -162 13876 9076 24521 19449 24337 19610 18491 -21357 -55824 -75622 -61680 -47265
8022 -47265 -18358 30265 24633 35855 28380 -4004 -14266 49120 54632 41446 3825 21773
8010 21773 22054 16134 34544 50812 42801 32558 24398 22803 9557 10904 42062 75662 93955
7997I3955k9609l0011r913p057j6288k5513r978J531M656l092R334K7384J0227
7984A5626k0261l353J7195J0707J800J6041L2768k1048l6708j7518n730K7910
7972A7429q620l9551k6015j0686K1183P976J7324J9104Q700j2098J389L7585K10
7959C3930j7304m527L2564N588k3071n2940j0117R073r240O213l0140r142J5244
7946e3869K8919M1812O6775J1425m1504l3370j1122k1782K577Q20k0537J415K1726
7933f715P322j3704p921m6580k9907L159M5580K7644J1023j6342j3442j0794J2989
7920c7688N915N2143K7004l7409k0090k4699l7814M5433R074K7411L4965r275
7908C4970j8136Q274J2754K8987k0778n7185k8116K6145J6797l00j5878M051k3435
$$ plain form
7997 93955 64346 34335 24422 17365 1077 -24436 -34414 -32883 -28227 -31319 -21985 5399 15626
7984 15626 -4635 -7988 9207 19914 21714 37755 70523 49475 12767 -4751 -10481 17429
7972 17429 8809 -30742 -56757 -67443 -46260 -38284 -20960 -1856 6844 -5254 -3865 33720 33930
7959 33930 16626 12099 44663 50251 27180 -25760 -35877 -26804 -36044 -29831 -59971 -69113 -53869
7946 -53869 -24950 16862 83637 95062 53558 20188 9066 -12716 -10139 -9319 -29856 -28441 -6715
7933 -6715 607 -13097 -21018 -67598 -97505 -94346 -48766 -21122 -10099 -26441 -39883 -50677 -37688
7920 -37688 -31773 20370 47374 9965 -10125 -34824 -72638 -27205 -18131 9280 44245 34970
7908 34970 16834 25108 37862 66849 46071 -11114 -39230 -13085 3712 3412 -12466 -8415 -31850
7895c1850K8755N351J3539J7295N46P404k2891k6718n1707j4910K0010J2055J6168
7882b6953K9450Q303L2364L3227p8062q1273J9602K6981r230J6691J3020J1382
7870d498J9917J0216m1779j6955K7345N563k4872K2031K8532n113P406r932q228
7857I633J1776K6446k4641q200J667k6158m8367K2405k412m0435Q494L6212J9014
7844a4566K0205J0927m867l261j6184j0470K972p302J1446k285l9780K0749N8261
7831B5845K5623L177q503p153O74k1586k1157L4642J6754j9839K540J2542L557
7818D7116m598l9449m5948j6203k2126R57K1065M7154J5890R60K5809j7703l4104
7805b1180O305j0823k3333j7205J0972J7572J7346j4642K3273K873J9018L5677
$$ plain form
7895 -31850 -3095 2256 15795 33090 33636 41040 18149 -8569 -60276 -75186 -55176 -43121 -26953
7882 -26953 2497 10800 43164 76391 -1671 -82944 -63342 -36361 -45591 -28900 -15880 -4498
7870 -4498 15419 25635 -16144 -33099 -5754 -191 -25063 -3032 25500 20387 27793 17861 9633
7857 9633 21409 47855 23214 15014 16681 -9477 -57844 -35439 -37851 -78286 -69792 -33580 -14566
7844 -14566 5639 16566 11699 8438 -7746 -18216 -15244 -22546 -11100 -13385 -53165 -32416 25845
7831 25845 51468 54645 46142 38989 39663 18077 -3080 31562 48316 28477 31017 43559 47116
7818 47116 42518 3069 -42879 -59082 -81208 -80251 -59186 -12032 3858 4818 30627 12924 -21180
7805 -21180 -14875 -25698 -49031 -66236 -55264 -37692 -20346 -34988 -11715 -8842 10176 45853
7793D5853n086k8080l0604O985p32k7903k0989M0018n798m43j0463r703l5525
7780h2470K3983M0631L0904l3121l0099L1131L7011K5838J3862l7715m6018m210
7768c0273P007L0830j0183j4279j6591k290o734k5018j2484J7225L7231j5421
7756d0980j0589L7454J3681l4562K6036R16R628L1730m1178k7993K2979K9043
7744A6165j147j5112j0297L081n939m1038j3178L7418K5040q446j1758K3206j0041
7731a2046K0591L2533k741n3094j5254q734K8532M0613K4290j517q077k6634m802
7718A3660j0472K438j6584K370L9592K0986l967k4802K2177j625m1512j1382k2199
7705c1320k3833k8531L2104M4077K1025l7569k3737Q907l011L3674J4006k8664
$$ plain form
7793 45853 40767 12687 -17917 -10932 -11664 -39567 -60556 -20538 -26336 -26779 -37242 -46945 -82470
7780 -82470 -58487 -17856 13048 -20073 -50172 -19041 17970 43808 57670 19955 -26063 -30273
7768 -30273 -23266 7564 -2619 -16898 -33489 -35779 -42513 -67531 -80015 -62790 -25559 -40980
7756 -40980 -51569 -14115 -434 -34996 -8960 -8044 1584 33314 -7864 -35857 -12878 16165
7744 16165 15018 -94 -10391 -7310 -13249 -54287 -67465 -30047 -5007 -13453 -25211 -2005 -12046
7731 -12046 8545 41078 38337 -14757 -30011 -38745 -10213 30400 54690 53173 45096 18462 13660
7718 13660 3188 5626 -10958 -8588 31004 51990 48023 23221 45398 43773 2261 -9121 -31320
7705 -31320 -55153 -83684 -51580 -7503 13522 -24047 -47784 -38877 -41888 -8214 5792 -22872
7693b2872K024j3575J1118R7994M3536J8164n6151o0799R319M1296K1210J1627
7681A02891j2300n9568k1917J3678L3363O953k1099j6215l087M599K223P52K123
7668C2396m1463n123j7174p54j601l512K5831R586L7811J0816l9939j687J4447
7655A9634j0153K6535N419l65k235k7852m8881j3979M374k685Q551J9213p8k5025
7641d7527m2419L656N1096k238J523l0661j6459N7675L1559n1m4534k4910J169
7628f2121M7983J9351k9108n130K122k8990P165R057q963k439J7683n742P320
7615c1812k075R101K9604o603k0712k596N0745o509k3965J4921O704N051l5734
7602a3880l7539K8257M4219K4372l8827j2071j2361l1261r034K4769r327Q450
$$ plain form
7693 -22872 -20848 -34423 -23305 74689 118225 136389 80238 19439 28758 70054 91264 102891
7681 102891 90591 31023 9106 22784 56147 63100 42001 25786 22699 27298 29521 30273 32396
7668 32396 -9067 -14190 -31364 -32118 -33719 -37231 -11400 -1814 35997 46813 6874 5187 19634
7655 19634 9481 36016 41435 41070 38835 10983 -37898 -51877 -47503 -50188 -41637 -22424 -22502 -47527
7641 -47527 -89946 -86290 -35194 -37432 -35909 -66570 -83029 -25354 6205 6154 -38380 -63290 -62121
7628 -62121 -14138 5213 -23895 -29025 -26903 -55893 -48728 -39671 -48634 -51073 -33390 -39132 -31812
7615 -31812 -33887 -24786 4818 -1785 -22497 -25093 25652 19143 -4822 10099 16803 21854 -13880
7602 -13880 -51419 -23162 21057 45429 6602 -5469 -17830 -49091 -58125 -33356 -42683 -34233
7590c4233M833k8934j9859M294O492j6883m120J3109O2390K0298l1928k1865K3097
7577b3309J0962l1180l9183R71n811l4943j2003K4572P9141n063q181J5786R343
7564a8898q479L278J8140L7247k80m3083M2589N8586j0678l0003m7037q015L0070
7551B3437r495q410n672n399m7358l0071L3068M8004l952j4459l6339L0470K8590
7538B414Q098L2927j7676l8656m8650P593J6071M5370n965O149K980n503l5163
7525c0011K1862L2581K3638q372l6573N070M1198q355k1106k1061l0604j5032
7513d6765K2912K3731l96p978L5143K0022l5508n250j9871k9280M0926J5447J6743
7500B9876j1766o4902J359M2073J4648R903M187q480m8311J67K3477J9582R488
$$ plain form
7590 -34233 -29400 -58334 -78193 -73899 -67407 -84290 -88410 -75301 -12911 7387 -24541 -46406 -23309
7577 -23309 -12347 -43527 -82710 -81739 -87550 -122493 -134496 -109924 -30783 -35846 -44027 -28241 -18898
7564 -18898 -27377 -24099 -5959 31288 31008 -12075 30514 89100 78422 48419 1382 -6633 23437
7551 23437 13942 5532 -140 -5539 -52897 -82968 -49900 -1896 -5848 -20307 -56646 -26176 2414
7538 2414 10512 43439 25763 -12893 -61543 -53950 -37879 7491 1526 7675 10655 5152 -30011
7525 -30011 -8149 24432 48070 39698 3125 8195 49393 41038 19932 -1129 -31733 -46765
7513 -46765 -23853 -122 -518 -8496 26647 46669 11161 5911 -13960 -43240 -2314 13133 29876
7500 29876 18110 -46792 -45433 -3360 11288 21191 25378 16898 -31413 -31246 -7769 11813 21301
7487B1301K7498O2756P053l3717n823K291o1810m7848j7500P968L0056K9967j3253
7474H939j8688Q069k435l7981J9983P254q045j5698M916m1097P255n442K0078
7461e2892M5637L7871j8351k0741j9420j2437k2058J3907L6832J6095j9397Q35
7449a4119J9163p716k8493k4149J1410L134k2490K369K6570N5214J9568n3451
7437a2990J8680J2864m8417m425j4472k0150R089L7575J5221l4792J4868K8698
7425A749r073J669l8401k3625L4732J8489J2216R981k6754q448Q206O4966J8489
7412F4196k9659j9800q854p454j6831J7430N4203M5734k4813k7099m6248r5L831
7399D541K8368l932l012m188o314k856J5827N2099k0907L8053l8009m8816k2587
$$ plain form
7487 21301 48799 111555 118608 84891 79068 81359 19549 -28299 -45799 -37831 -7775 22192 8939
7474 8939 -9749 -1680 -4115 -42096 -22113 -14859 -22904 -38602 -33686 -74783 -67528 -72970 -52892
7461 -52892 -7255 30616 12265 -8476 -27896 -40333 -62391 -48484 -11652 4443 -14954 -14119
7449 -14119 5044 -2672 -31165 -55314 -43904 -40770 -63260 -60891 -34321 20893 40461 -12990
7437 -12990 5690 18554 -29863 -34288 -48760 -68910 -59821 -22246 -7025 -41817 -26949 1749
7425 1749 -7324 -5655 -44056 -67681 -32949 -14460 -2244 7737 -19017 -27465 -19259 45707 64196
7412 64196 34537 14737 5883 -1571 -18402 -972 53231 98965 74152 47053 805 710 4541
7399 4541 32909 28977 25965 21777 15463 12607 28434 80533 59626 97679 59670 10854 -11733
7386a1733K375l2438k3965J9624M207o068l3130K4228J7884K5771M761k1600K993
7373b7091J6277j1698m291m142K9979q313Q117k8114l557r962k5970L2200L4272
7360b293j9403k6038j9514j8915P3047P8243j746l2597l6158k3645r589J9142
7348a9466O735j8404r764K478L6625j7357j0509M367N493J2958N0355j3392n9179
7335b9060k2097m733L3804k997J5365O26R501Q045Q660O004j4358p28K419m373
7321F078k508l1905K3306N9443K6006L1922n5130l3496l962j0288m066m075j7272
7308a5947j273k747j1698K792o781J9400K8985K7542K9606j069n2082n1288J4824
7295a9736K0329q887r99j3217j2693j4009J1112J0090k1084K1697O6707q412j0070
$$ plain form
7386 -11733 -9358 -41796 -65761 -46137 -41930 -47998 -81128 -56900 -39016 -13245 -8484 -30084 -27091
7373 -27091 -10814 -22512 -26803 -30945 -966 -9279 -1162 -29276 -32833 -42795 -68765 -36565 -2293
7360 -2293 -21696 -47734 -67248 -86163 -13116 65127 63381 30784 -5374 -29019 -38608 -19466
7348 -19466 -12731 -31135 -40899 -38421 -1796 -19153 -29662 -25295 -19802 -6844 43511 30119 -29060
7335 -29060 -51157 -55890 -22086 -25083 -9718 -9092 409 8454 17114 23118 8760 8032 10451 6078
7321 6078 3570 -28335 -5029 54414 80420 112342 57212 23716 19754 9466 5400 1325 -15947
7308 -15947 -17220 -19967 -31665 -28873 -35654 -16254 12731 40273 69879 68810 16728 -34560 -19736
7295 -19736 593 -8294 -9293 -22510 -35203 -49212 -38100 -28010 -49094 -27397 39310 30898 20828
7282B0828l262J4697o878k8355O816M0641L226l8287m6204j4399P010j1248M084
7269e1331L6873L3218o523j5892j8283j983M7425p214j4595J315K7077N922j631
7256C4378n8863J7850K531L454J1199j3760l4784J8624O8143J7239L892k9895
7244D0008P873L7354j9545l2744o0962J2627J3657j8196k9424J5447K5909r222
7232a7218M959K5618K7623j7383j3504K618M87j3687K2154L2557J4561k7487o8392
7219b7094J1569J5735J6276J1780k9543j813k3132p729p747K5875R9425k0454
7207F3148m0557k9519j1458r49k6973K1790P393N751K79l5565j8503J004J7787
7194d6372M0647N1738l2894m1664j2757m0674q704J919M0084O225M487J7829L8918
$$ plain form
7282 20828 17566 32263 25385 -2970 3846 44487 47713 9426 -36778 -51177 -44167 -55415 -51331
7269 -51331 -14458 18760 12237 -3655 -21938 -23921 23504 16290 1695 3010 30087 36009 34378
7256 34378 -24485 -6635 -4104 -650 10549 -3211 -37995 -19371 48772 66011 69903 40008
7244 40008 47881 85235 65690 32946 -28016 -15389 -1732 -19928 -49352 -33905 -7996 -17218
7232 -17218 -12259 13359 40982 23599 10095 12713 13200 -487 21667 54224 68785 41298 -27094
7219 -27094 -15525 210 16486 28266 -1277 -3090 -26222 -33951 -41698 -15823 83602 63148
7207 63148 22591 -6928 -18386 -19335 -46308 -24518 -17125 -11374 -11095 -46660 -65163 -64159 -46372
7194 -46372 -5725 46013 13119 -28545 -41302 -81976 -90680 -88761 -48677 -42452 -37965 -20136 18782
7181A8782J7052j5790j3638O17j1519M8614j040l1984k4656K3621J9904m3276
7169a3313j9698J3144P3068L2691k9818p4897o3468J2540o984P442M4142K6843
7157A692J4580J6176J9638J0718m4898l0759P901J2482l6541l8485K7891N2012
7145A2407K8858K6846J8728j1942o0989O56k634J2678L78P396l534m4479l8815
7132e4446M262K5646J8114j1295P75L2453K2237n009J9298k9581m0723k6620M2797
7119b092k738o8084j1341L5602J5829J6274J1230N68K3707m577m3731Q255J903
7106a9195K3267J2441j3855m625k5159k218M0554L1609n1303j6159o7Q173P299
7093i238j5348K1700k5204j6479j4110j4008l4202J5521O3324J0172l8975j2042
$$ plain form
7181 18782 35834 20044 6406 7023 -4496 44118 43078 11094 -13562 10059 29963 -13313
7169 -13313 -33011 -19867 53201 85892 56074 -18823 -82291 -69751 -76735 -69293 -25151 1692
7157 1692 16272 32448 52086 62804 17906 -12853 -4952 7530 -29011 -67496 -39605 12407
7145 12407 41265 68111 86839 74897 13908 14564 11930 24608 24986 32382 28848 -15631 -54446
7132 -54446 -50184 -24538 -6424 -17719 -16944 15509 37746 32737 52035 22454 -18269 -44889 -2092
7119 -2092 -4830 -72914 -84255 -48653 -32824 -16550 -5320 -4752 18955 14378 -29353 -21098 -19195
7106 -19195 4072 16513 2658 -1967 -27126 -29344 11210 42819 -8484 -24643 -24710 -16537 -9238
7093 -9238 -24586 -2886 -28090 -44569 -58679 -72687 -106889 -91368 -28044 -17872 -56847 -68889
7081f8889J5738J5557l931l656j5423K3541N4142K4829K3196j4405o6830o3040
7069g9171J4522L620R653M596l800N1383L3468K3482k2905m1744J0184l271m5408
7056d5391M1564J0382J1964m382N892n0585M475N229R86N0442j46m627m831j6820
7042D152k0134q814P326K6019j7386p891k3980K4829P6882j2953l2588j6077j7792
7029a8407m4256J8851P56J5762J3861J960K3848Q361j8835R351k9244K28m5044
7016f2808J6478M6261M2138J5211l375q5416k7608L1655k8449L8789O4814k6127
7004B1563j108J1398n3644n1456m462L5533l150O0110o617k1111N8853L29j5895
6991C0343j2638r937K3722q152r569J6170k4145j8466j1746l2948K198L0576K9224
$$ plain form
7081 -68889 -53151 -37594 -41525 -45181 -60604 -37063 17079 41908 65104 50699 -16131 -79171
7069 -79171 -64649 -61029 -51376 -46780 -50580 803 34271 57753 34848 -6896 3288 17 -45391
7056 -45391 -3827 6555 18519 14137 20029 -30556 -26081 -20852 -19866 30576 30430 25803 20972 4152
7042 4152 -15982 -24796 -17470 8549 -8837 -16728 -40708 -15879 61003 48050 15462 -615 -18407
7029 -18407 -62663 -43812 -43056 -27294 -13433 -11473 12375 20736 1901 11252 -17992 -17764 -62808
7016 -62808 -46330 -69 42069 57280 53905 -31511 -59119 -27464 -55913 -17124 47690 21563
7004 21563 20455 31853 -21791 -73247 -77709 -42176 -45326 14784 8167 -12944 45909 46238 30343
6991 30343 17705 7768 31490 23338 13769 29939 5794 -12672 -24418 -57366 -55168 -24592 4632
6978D632k6651l9526O533K9323j0064J4555k6557j8541K8388N3517J7703j8264
6966A5048L9141Q999j719j1000J538l5517k6253l3863j9794k2437k832K7727K9741
6953c1221L6869k0703j6430m3502k3105J1935L2238J0582R228J0212N220q44N1616
6940C2095K8550l0271L121J3953l5661l9749j4983k3240k577K2495L1024K3326
6928H083j7036k4776K2933L1952j7031m6208l2279J6568r812j9750p011J4187
6916h0180k0938J5691J4462J5329O2269Q493K2673K9204J6923j5890p790k4831
6904C5415k2523J0009J1795N624m1224N589J2022K0821n025k8399J887J3779J7420
6891C7190m8103o059j0946R247L578j7615n156M976j0806L058J9864j5080k6663
$$ plain form
6978 4632 -22019 -61545 -55012 -25689 -35753 -21198 -47755 -66296 -37908 15609 33312 15048
6966 15048 54189 63188 61469 50469 52007 16490 -9763 -43626 -63420 -85857 -88689 -60962 -31221
6953 -31221 5648 -15055 -31485 -74987 -98092 -86157 -53919 -43337 -34109 -23897 -18677 -19521 32095
6940 32095 60645 30374 33495 47448 11787 -27962 -42945 -66185 -68762 -46267 -15243 8083
6928 8083 -8953 -33729 -10796 21156 4125 -42083 -74362 -57794 -67606 -87356 -94367 -80180
6916 -80180 -101118 -85427 -70965 -55636 6633 15126 37799 67003 83926 68036 60246 35415
6904 35415 12892 22901 34696 40320 -904 4685 16707 37528 32503 4104 5991 19770 37190
6891 37190 -10913 -16972 -27918 -18671 -15093 -32708 -37864 -32888 -43694 -40636 -20772 -35852 -62515
6878f2515L3437l1505p055L1634M9371j006j3108k0674j7144J0220P484O5561
6866D4700J8725k8172p548j4190L1991J490j6648m294m0999j6613K5640L712K1684
6853A9478p515n4646j6402p196K0709k860K9513K920l0411j2331L4602N6546K1711
6840E4118J5640j7529k6956o32j2662n2726k0850K1400P56k0282r145N3513N2624
6827C7269k5186m4227M57K5515O078k3571N37k8507l0329q576L1147O1526j2294
6814a0161k6495m945j084K2865Q702l4815J2770O704J3160K1646m6199j6181L1088
6801b2945P787r954k7745J2489P5774K6073k6731k1794J8615O041k5491j9835
6789g716J8954l6762k4478k4579J2815K25J0976L2307J7031J1959N6200j4470
$$ plain form
6878 -62515 -29078 -60583 -67638 -36004 13367 12361 -747 -21421 -38565 -28345 -20861 44700
6866 44700 63425 35253 27705 13515 45506 46996 30348 26054 -14945 -31558 -5918 -2206 19478
6853 19478 11963 -42683 -59085 -66281 -45572 -48432 -18919 -15999 -46410 -58741 -24139 32407 54118
6840 54118 69758 52229 25273 24641 11979 -40747 -61597 -40197 -39441 -59723 -68868 -15355 37269
6827 37269 12083 -32144 -31687 -6172 -94 -23665 -23128 -51635 -81964 -90540 -59393 2133 -10161
6814 -10161 -36656 -41601 -42685 -19820 -11118 -45933 -33163 -26459 -13299 8347 -37852 -54033 -22945
6801 -22945 -15158 -25112 -52857 -40368 35406 61479 34748 12954 31569 37610 12119 -7716
6789 -7716 11238 -25524 -50002 -74581 -61766 -61541 -50565 -18258 -1227 10732 66932 52462
6777E2462l0795l865k7886k1837L4217O0995O11m3046j1246k3498M6482Q831m6093
6764d668j0118j7856k6226j043K0317N032N8207M3801k7736k037j0256j7232K5547
6751C5732k5837o5354K3329M5910Q483k8846q917L9622M0018K6081r007O148J858
6738H9220k5547J4459L928n3351K865J4016l0545K4417Q53M846L6145N421k6133
6725F0594K1679M2142N6517N7135Q1082J55215K01909K48482K69511K28811J22691
6714A545768j8636p7515j37649j79564k36670k06852j82052q1769n6387o7077
6704C01597k9575k7564k4104n679k0977q905P337l6799l6172j8658k7518L799
6692G6782N5476K2639k4062n8143r378J507r683K8914j9530l6307J0461j1080
$$ plain form
6777 52462 21667 17802 -10084 -31921 2296 63291 63902 20856 9610 -13888 32594 41425 -4668
6764 -4668 -14786 -32642 -58868 -59911 -39594 -34562 23645 67446 39710 37673 27417 10185 35732
6751 35732 9895 -55459 -32130 13780 22263 -6583 -15500 24122 64140 90221 81214 87362 89220
6738 89220 63673 78132 82060 28709 31574 45590 15045 39462 40315 45161 81306 86727 60594
6725 60594 82273 124415 180932 238067 319149 474364 676273 924755 1194266 1423077 1545768
6714 1545768 1527132 1449617 1311968 1132404 895734 688882 506830 425061 368674 301597
6704 301597 272022 244458 220354 214675 193698 184793 192130 155331 119159 100501 72983 76782
6692 76782 132258 154897 130835 72692 63314 64821 55138 84052 64522 28215 38676 27596
6680B7596q837M6336r691J1328L2099k7352l7700p487N925J1691p258K312l6934
6667B028p217k4185o165r150j5438K4082r470K1737r186q805L1126M2897k1064
6654A1190j2605J6345m1900j1220j4331p266K7373J0817l3185R101K5862J3128
6642f691M9675k7640m8362N390k3111k176O3777L1621l8218n2762k3726N3150
6630a9073N3821M743l425K5423J2869J4883k4643J3846j787o991J2235j9731j6561
6617D5609n320L1375l4560k2825j4071o361j5927k4259K9710M8366j1434j1925
6605H378k0533l1755M526L6229k0693r819R932l1971L925K387L5419L7569O802
6592C0396M010k5100P884j8327o7309n754q10J2014J6124P463J4804j4178N005
$$ plain form
6680 27596 18759 65095 55404 66732 98831 71479 33779 26292 32217 43908 36650 38962 2028
6667 2028 -5189 -29374 -35539 -44689 -60127 -36045 -45515 -23778 -32964 -41769 -10643 32254 11190
6654 11190 -1415 14930 -26970 -38190 -52521 -59787 -32414 -21597 -54782 -45681 -19819 -6691
6642 -6691 42984 15344 -33018 -27628 -50739 -52915 10862 42483 4265 -48497 -72223 -19073
6630 -19073 34748 39491 36066 61489 74358 89241 64598 78444 76657 69666 81901 62170 45609
6617 45609 40289 71664 37104 14279 208 -6153 -22080 -46339 -16629 31737 20303 8378
6605 8378 -12155 -43910 -39384 -3155 -23848 -33667 -23735 -55706 -51781 -49394 -13975 23594 30396
6592 30396 34406 9306 17190 -1137 -68446 -74200 -75010 -62996 -46872 -39409 -24605 -38783 -33778
6579c3778M120P3570M4107n2329o920N665o255L218L9709j7595o0882q983J2138
6566d215j1148R284J336K4988L8410M2943j6329Q198n0002o2768k0353N052r143
6553d3747k2758O241N0706L4048J9299L428r591n834k0112m5259K4093l323N192
6540g617O506J8894L8424P23j3753r947p314K1567J0647M638j2500k9650j7351
6527C267J1337L357M318j2475Q083J29K1183N4758k3384m3246l734O7738n781
6514H5550k2815k1479m6484l7288k954j4796N1820P2880l0141l6858K0110L3782
6502E1327r245k4000m8194N409J0901L0699p227r191o672j3587p203L7946J9599
6489C0562J544l9821m250j6245r980O3026J3792r480l6794j2019k5752j5800l072
$$ plain form
6579 -33778 -29658 43912 88019 35690 28770 34435 28180 31398 71107 53512 -7370 -16353 -4215
6566 -4215 -15363 -6079 -4743 20245 58655 101598 85269 93467 43465 -19303 -39656 -34604 -43747
6553 -43747 -66505 -60264 -9558 24490 43789 47217 37626 31792 11680 -33579 -9486 -12809 -7617
6540 -7617 -1111 17783 56207 56930 43177 33230 25916 47483 58130 62768 50268 20618 3267
6527 3267 14604 17961 22279 9804 17887 18016 39199 93957 70573 27327 23593 91331 85550
6514 85550 62735 41256 -5228 -42516 -45470 -60266 -8446 64434 34293 -2565 17545 51327
6502 51327 42082 18082 -30112 -24703 -13802 16897 9670 479 -6193 -19780 -26983 10963 30562
6489 30562 32106 -7715 -11965 -28210 -38190 24836 38628 29148 -7646 -19665 -45417 -61217 -64289
6476f4289L8833K9964j1152l4484J5726J5582K8493j2202p671K0943k6223l1914
6464c8394m88j417K536n773J9580m653l1582J8382K2752p77P866o3496m675L7362
6450d2777M2686J0568l151P771k7188q235K445J0058M374k988L5276p927M222
6437B5134P111k6898k161L984m2567l7848l403O1262M4758J3966J0060K0140k1285
6424E2253l9264n6196j9513l150l592J2229J1289J0427m627M2092K5223m171Q667
6411C1667l3156j1797k6101K4553K5947P058l1834l5959J1775M0446k133m1667
6399d1201Q334L0197j2260J4485M8828k1208m7657K8136J4490P038P654k4360
6387A2476j392R429j0277j9848J7921J52j8887R690k8723j3583K9743K3585m4646
$$ plain form
6476 -64289 -25456 4508 -6644 -41128 -25402 -9820 18673 6471 -1200 19743 -6480 -38394
6464 -38394 -38882 -40299 -37763 -43536 -23956 -28609 -60191 -41809 -19057 -19834 -11968 -75464 -80139 -42777
6450 -42777 -91 10477 7326 15097 -12091 -20326 -17881 -7823 -3449 -6437 28839 20912 25134
6437 25134 32245 5347 3186 7170 -35397 -73245 -76648 -15386 29372 43338 53398 73538 52253
6424 52253 12989 -43207 -62720 -65870 -69462 -57233 -45944 -35517 -40144 1948 27171 23000 31667
6411 31667 -1489 -13286 -39387 -14834 11113 18171 -13663 -49622 -37847 2599 466 -41201
6399 -41201 -32867 -2670 -14930 -445 48383 27175 -20482 7654 22144 29182 36836 12476
6387 12476 11084 20513 10236 -9612 8309 8461 -10426 -736 -29459 -43042 -13299 10286 -34360
6374c4360n0419m030J7724R80L5772L7412q386l105J1516J748l7419m1114j9866
6361i3547K0396L4189K8035J3094n923m247l973l0161J1326K2347j9881k6845
6349e5190L2260P531J7975M9403r51l8923p240J3377k8441L1052k0376k5660J4350
6336a0833k4945L9838J7877m2729L752p777L949J3892L1823J9105l8779p293K7907
6323B5787J4471k4790n3013k9361M5627L5814Q629m0343k2398j6589k9100j656
6311h6922K1135k1515K2868Q4869j843n710j8499k8231Q931M2064K0803R28k1165
6298A7713n1443K0661j1002m033p640j7857M036J6416J5267L0097p739l2646L0692
6285B522K5198k169j9044L840r822p401J4251j948l0101K0582J0821J0995L7208
$$ plain form
6374 -34360 -84779 -88809 -71085 -70105 -34333 3079 -5307 -8412 3104 4852 -32567 -73681 -93547
6361 -93547 -73151 -38962 -10927 2167 -3756 -8003 -11976 -42137 -30811 -8464 -28345 -55190
6349 -55190 -22930 -15399 2576 51979 51028 12105 4865 18242 -10199 20853 477 -25183 -10833
6336 -10833 -35778 4060 21937 -20792 -17040 -24817 -20868 -6976 24847 43952 5173 -2120 25787
6323 25787 40258 15468 -37545 -66906 -21279 14535 23164 -17179 -39577 -56166 -85266 -86922
6311 -86922 -65787 -87302 -64434 20435 18592 12882 -5617 -33848 -24917 17147 37950 38878 17713
6298 17713 -33730 -13069 -24071 -28104 -35744 -53601 -49565 -33149 -17882 12215 4476 -28170 2522
6285 2522 27720 25551 6507 10347 525 -6876 7375 5427 -24674 -4092 6729 17724 54932
6272E4932k75l6891l2535j8786k4134O416L5881j6826k8583J3327K6897k2383
6260d2960j3935L8187J9359R127j9816j0958J0049j4884l673K7577J5439m741
6248H771J2339K625m6283k3824m614K3999M704j6687r63K1992m2544R688M2352
6235h445k9884j080j2367M2603L1114p165J0790m7055l9534n39m980L3106N1920
6222A8484q389k5939j8270J4159L6869J932l7063k506O929o4792l2082N0484M8897
6209a1287j705j0351j4240J5244m667j2470P185M857q191q363J9075L246L8042
6196A6375K1517J3569j9272J856K7971j8264j5395J6028J9497m5620j5147m7903
6184d4788m7445l3160J2491M0450L7996k42j915j8752Q932p795m9055O065l898
$$ plain form
6272 54932 54657 17766 -14769 -33555 -57689 -51273 -15392 -32218 -60801 -47474 -20577 -42960
6260 -42960 -56895 -18708 651 9778 -10038 -20996 -10947 -25831 -29504 -1927 13512 8771
6248 8771 21110 23735 -22548 -46372 -50986 -26987 -22283 -38970 -39933 -17941 -60485 -50797 -8445
6235 -8445 -38329 -39409 -51776 -9173 21941 14776 25566 -21489 -61023 -61562 -66542 -33436 18484
6222 18484 10095 -15844 -34114 -19955 16914 18846 -18217 -20723 -13794 -78586 -110668 -60184 -11287
6209 -11287 -12992 -23343 -37583 -22339 -27006 -39476 -32291 -27434 -35625 -43988 -24913 -21667 16375
6196 16375 37892 51461 32189 34045 62016 43752 28357 44385 63882 18262 3115 -44788
6184 -44788 -92233 -125393 -112902 -72452 -34456 -34698 -36613 -55365 -46433 -54228 -103283 -97218 -101116
6171a01116K6921N0160J0855q174j3802k5581J4687J1248J1349j7528q573O5480
6159A5926P6629j1976l4134m383J7415L517o1873l3224j0358p250O611j882m2952
6146h7934n149K9779j1864N641N5026k6383n5750M783N6556M8459M619m82j0881
6133F420j1355k7594l206J4928J7656J4205P649L1168L4577r998n5749m3789O788
6120a8300K01K6123J2423q583k556k560k1219L510J1264j7557j4799K3876J8376
6107A0199M3170o932j9979n226j2492J1446m914j4911k937l3539p989j1545N6618
6094I69L7818l6395j6624j6453J1065J7733J9512o32j6975J8089m2547j0664J9835
6081a5269l0230l2683L2201q251k446L8332k0063l5339l6086M9173K9827j8314
$$ plain form
6171 -101116 -74195 -24035 -13180 -21354 -35156 -60737 -46050 -34802 -23453 -40981 -49554 15926
6159 15926 92555 80579 46445 42062 59477 62994 1121 -32103 -42461 -49711 -43100 -44982 -87934
6146 -87934 -93083 -63304 -75168 -69527 -14501 -40884 -96634 -91851 -35295 13164 17783 17301 6420
6133 6420 -4935 -32529 -35735 -20807 -3151 11054 18703 49871 84448 74450 18701 -25088 -18300
6120 -18300 -18099 8024 20447 11864 9308 6748 -14471 -10961 303 -17254 -32053 -8177 10199
6107 10199 53369 46437 26458 21232 8740 20186 15272 361 -2576 -36115 -44104 -55649 969
6094 969 38787 2392 -14232 -30685 -19620 -1887 17625 16993 18 18107 -24440 -35104 -15269
6081 -15269 -45499 -78182 -45981 -54232 -56678 -18346 -38409 -73748 -109834 -60661 -30834 -49148
6069d9148M026j0607J1569L9803j1601k2388M702K8519j78k5900r649k048q623
6056e1523N010o75J7531n769L3345J8984M6614j961m9190o1264L528k5260J3N8896
6042a1721J5146n979K6156q757J1427j5022j0206k2990j0985L8796k3140k7027
6030d4302J3120M3205N908m5493J8833O90m1062R135L3886L7986l2682r597n916
6017a6289L092K4960P292n902l9211n3836r633L9093L2549r933l115m532J8390
6004a7075J9563n117k2416K2276k7968j3853K850N784L7145K2083Q543R456Q487
5991D9758j9604o784M4874p513p308k568m600j5170O071n165k684q729k8220l3679
5977d1321k0769N4286Q381K2893J8297L840j0271j3511j4512k0282L7751N3896
$$ plain form
6069 -49148 -45122 -55729 -44160 -4357 -15958 -38346 -33644 -5125 -5303 -31203 -40852 -42900 -51523
6056 -51523 -46513 -47188 -29657 -35426 -2081 16903 63517 61556 12366 -48898 -45370 -70630 -70617 -11721
6042 -11721 3425 -2554 23602 14845 26272 11250 1044 -21946 -32931 5865 -17275 -44302
6030 -44302 -31182 12023 17931 -27562 -8729 -8039 -49101 -39966 -6080 31906 -776 -10373 -16289
6017 -16289 -13197 11763 19055 13153 -26058 -79894 -89527 -50434 -17885 -27818 -30933 -35465 -17075
6004 -17075 2488 -2629 -25045 -2769 -30737 -44590 -41740 -35956 1189 23272 31815 41271 49758
5991 49758 30154 23370 68244 60731 53423 50855 46255 31085 37156 31991 29307 20578 -7642 -41321
5977 -41321 -62090 -7804 577 23470 41767 45607 35336 21825 7313 -12969 24782 78678
5965G8678k3824j4579j9757J5831J0862N547Q301k8090k3623j2087J2864O715
5953A6838K7923O384m6246l4430j31L3255n874j0790q8K1825o02k8351p669O273
5939b1683o395J0496L3319L721j2555j7066o478j188k4676J4853K7763J3471j2417
5926A165l8749l6527n648K9202M7235k5697l917l2035l19J8196N0357k233m858
5913c828N6098L6143m2234m1999R205j8986j5311q0527K8041P3092k358j2217
5901a4881R765K931M2150J3328m2134r711k1591j3307K2607j2566n7221l372K6673
5888e7329j7143J6655O1491K9847j5961k0472K6417N689l4100j3173N481K620
5876i978L445P907m958K7126l007p414l3315j1351r37R987k6189M574l028l9653
$$ plain form
5965 78678 54854 40275 20518 36349 47211 52758 61059 32969 9346 -2741 10123 16838
5953 16838 44761 51145 4899 -29531 -29662 3593 -2281 -13071 -13159 8666 8064 -20287 -27956 -21683
5939 -21683 -28078 -17582 15737 19458 6903 -10163 -16641 -17829 -42505 -27652 111 13582 1165
5926 1165 -37584 -74111 -79759 -50557 -3322 -29019 -32936 -64971 -65290 -47094 3263 1030 -3828
5913 -3828 52270 88413 46179 4180 13385 -5601 -20912 -101439 -73398 -306 -2664 -14881
5901 -14881 -5116 -2185 39965 53293 11159 1448 -20143 -33450 -10843 -23409 -80630 -84002 -57329
5888 -57329 -74472 -57817 3674 33521 17560 -2912 23505 29194 -4906 -18079 -12598 -9978
5876 -9978 -6533 1374 -3584 23542 20535 13121 -20194 -31545 -32482 -22495 -48684 -44110 -47138 -86791
5862h6791K873q083J0890K2522K0673p697K2418J9183m029l1965M456L1457R01
5849c192O022k0140L1774k334N903n0592k8240j3117j7481K055P2453K2067L1889
5836C7067K1577j0675k9102j0088j0105N0694q185m1509j3640k1668j482M841
5824c2275K3266J0773R554M5784R261J81k2657k3899j6123k7928K6110j5235j7474
5811c0662J3028k08k7669K8991j3939j5387M4658l6097L213K9175j5890m609p621
5798c3017r78N67M9360J1982k1148J8243Q566l1206m6706j7454L0101P308P150
5785a7232P252P434Q920j1587K2699L522n980L053j6860K5848M778L789j7513
5772A8123j9890p684l0686J8328J8601J1768j5207k8664n8846q600J2879J0542
$$ plain form
5862 -86791 -83918 -92001 -81111 -58589 -37916 -45613 -23195 -4012 -8041 -40006 -35550 -4093 -3192
5849 -3192 2830 -17310 14464 12130 18033 -32559 -60799 -73916 -91397 -89342 -16889 5178 37067
5836 37067 58644 47969 18867 8779 -1326 49368 41183 -326 -13966 -35634 -37116 -32275
5824 -32275 -9009 1764 11318 57102 66363 66544 43887 19988 3865 -24063 2047 -13188 -30662
5811 -30662 -17634 -17842 -45511 -16520 -30459 -45846 -1188 -37285 -34072 -4897 -20787 -25396 -33017
5798 -33017 -33995 -33428 15932 27914 6766 25009 33575 2369 -44337 -61791 -31690 -24382 -17232
5785 -17232 -9980 -2546 6374 -5213 17486 21008 15028 18081 1221 27069 31847 35636 18123
5772 18123 -1767 -9451 -40137 -21809 -3208 8560 -6647 -35311 -94157 -102757 -89878 -79336
5760g9336K9564M893L074M3880o118q296l211J367M599j7026k145K213j3257k1031
5746f0830N2465J1046M040K9802J4229r022l036N264m4515o0144P895M675l760
5733e1891K1426J1083K9170J6808L104M553K4463q515m0933J0518M6798P116k0599
5720E3101j6579j1779m862l2223J9515l3101L721K7383N372N718l1928m3440m54
5707e9556l5672J947K7278N2532L9879j1904j7477R782J2315q289j9470p639M146
5694a2128K1J273J1531P261k2953m6282o0623K3474O3980J7354K8891M9807K0536
5681H2142k3042J2862m813k3044n0835l0018M7162J4138l4186L1205N160l1285
5669d554L939J7733k1853j7823l6363l29j7670K5423L9362k688N7007M3356j6036
$$ plain form
5760 -79336 -49772 -44879 -41805 2075 -4043 -12339 -15550 -14183 -9584 -26610 -28755 -26542 -39799 -60830
5746 -60830 -8365 2681 6721 36523 50752 41730 38694 43958 -557 -60701 -52806 -48131 -51891
5733 -51891 -30465 -19382 9788 26596 29700 34253 58716 50201 9268 19786 66584 73700 53101
5720 53101 36522 24743 19881 -12342 7173 -25928 -22207 5176 10548 16266 -15662 -59102 -59556
5707 -59556 -95228 -93281 -66003 -13471 26408 14504 -2973 6809 19124 10835 -8635 -16274 -12128
5694 -12128 -12107 -10834 697 7958 -14995 -61277 -121900 -98426 -34446 -17092 11799 61606 82142
5681 82142 59100 71962 67149 44105 -6730 -36748 10414 24552 -9634 21571 26731 -4554
5669 -4554 -615 17118 -4735 -22558 -58921 -59250 -76920 -51497 -12135 -14823 42184 85540 69504
5656F9504l4576l6844J3080L9138K2262J682n5098l455j8754K8351O331L2326
5644F3947L487m2713j2617m4136j8368L0027K9195m2684k8197m128K0378K4820
5632b0989o434N587J2572J7692j6355m90M5669M6829n7237n371R251r728j1077
5619I919L356j4480k2966O6692K8130o8316m1597m228K9019J8384Q702l80l3206
5606b0971K3035R552n573M1896J7463N206o922j0489k4625k1978j9422K9341J9264
5593C5777l2978j484K7161K7210L837j3958j0101l0092J072J991J7186L6057Q729
5580G0407l926n462k6183j7313m7396K3820M8721L4442j705k2715j0527O662l0144
5567A8681p384k1914m965O43K0478K8699J749o815k262k2140k3871K0384J2079
$$ plain form
5656 69504 34928 -1916 11164 50302 72564 74246 19148 15693 -3061 25290 31621 63947
5644 63947 67434 24721 12104 -32032 -50400 -20373 8822 -33862 -62059 -66187 -45809 -20989
5632 -20989 -27423 -21836 -9264 8428 -7927 -8417 37252 84081 26844 21473 30724 20996 9919
5619 9919 13275 -1205 -24171 42521 70651 2335 -39262 -43490 -14471 3913 12615 12235 -20971
5606 -20971 2064 11616 6043 47939 65402 70608 63686 53197 28572 6594 -12828 16513 35777
5593 35777 2799 1315 28476 55686 59523 45565 35464 5372 6444 8435 25621 61678 70407
5580 70407 66481 61019 34836 17523 -29873 -6053 42668 77110 75405 52690 42163 48825 18681
5567 18681 11297 -10617 -15582 -14939 5539 34238 35987 29172 26910 4770 -19101 1283 13362
5554A3362K901l2016l7207j4497p045m950J7730P2980O2607l9153j7689m2882
5542b5859m8299K4738P4663M7689J0378o2595k9553J6600k6486J319M2605K8928
5530E4128M94j1695m9622p3861L0070L2469P133q684k1432K8028J4287N772K874
5517I961O1162M546m4453m5608j3267J1271K7090j9896k4190M568P979R684K8296
5504A7143J2638O337M112l410k3988l3317N490j9962m5909j0483Q277J4009K2023
5491d7040o623j0029J9419L2495k057N819l0769m7339J4614L9898j409k4908P0069
5478A2140L7884P758O82j5756j1580k4977l5547J1391M626K9415J2172l8457p643
5465a7892M2967j8174l7504J4383N7039k1713k1895j3706J0716j2811j4533j1836
$$ plain form
5554 13362 16263 -15753 -52960 -67457 -74502 -79452 -61722 11258 73865 34712 17023 -25859
5542 -25859 -74158 -49420 25243 72932 83310 20715 -8838 7762 -18724 -17405 25200 54128
5530 54128 54622 42927 -6695 -80556 -50486 -18017 -10884 -19568 -41000 -12972 1315 7087 9961
5517 9961 71123 75669 31216 -14392 -27659 -16388 10702 -9194 -33384 -28816 -20837 -11153 17143
5504 17143 29781 36118 40230 36820 12832 -20485 -14995 -34957 -80866 -91349 -83072 -69063 -47040
5491 -47040 -53663 -63692 -44273 -11778 -13835 -8016 -38785 -86124 -71510 -31612 -33021 -57929 12140
5478 12140 50024 57782 58464 42708 31128 6151 -29396 -18005 -13379 16036 28208 -10249 -17892
5465 -17892 25075 6901 -30603 -16220 40819 19106 -2789 -16495 -5779 -18590 -33123 -44959
5453d4959j3011N7613J3262J2705J7581j6009j106j4040J3824O218K584K2500
5441E7162k8364j4500j2266R07L6977j0883M54l1507m992N383j419J588K5085
5428B3625J0830q6k2574k2027j8818j9174q071J9713N7782K3691J3895p0210k8127
5415c9551j47K6895K3099o818k8096n2760m707M8110k23J511J3629L3473K5683
5402D0098l3630P843q053o5155j3257J7938K7458k874j8231m226J165M105K9144
5389a7675N3341j2327k0768J3101N184p301J2115k3512k3120J4496N170l038K55
5376d079j941l8195L282M9520M7201k0822r859q068j6806K2982j1105m808m015
5363C287l5525P441J8471j8787j236L8842J1163k0387J5335J2069j7226j365q801
$$ plain form
5453 -44959 -57970 -357 12905 25610 43191 27182 26076 12036 25860 32078 34662 57162
5441 57162 28798 14298 2032 2939 39916 29033 29487 -2020 -7012 -1629 -3048 -1460 23625
5428 23625 34455 34369 11795 -10232 -29050 -48224 -56295 -36582 21200 44891 58786 -11424 -39551
5415 -39551 -39698 -12803 10296 3478 -24618 -77378 -82085 -33975 -34198 -32687 -19058 14415 40098
5402 40098 6468 14311 6258 -58897 -72154 -54216 -26758 -29632 -47863 -52089 -50924 -46819 -17675
5389 -17675 35666 23339 2571 15672 20856 13555 25670 2158 -20962 -6466 -1296 -4334 -4079
5376 -4079 -6020 -44215 -40933 8587 55788 34966 25107 17039 233 23215 12110 7302 3287
5363 3287 -32238 -24797 -6326 -25113 -26349 12493 23656 3269 18604 30673 13447 12082 3281
5350C281J3588j7595n0993j4123M5680K6763j6742J322L3378j7324j6429J791
5338g403K5826J4698L5716j6563n2028j7822K1330K9345j4191m5198J1377N4861
5326C9948N5785k5124n8489O209j1066k5414l944j1743O5l143K8365M0416K0454
5313E2319l1639n6074o826J4591L8787J5278m3205M8554J8862k9437r635R891
5301B1466m389p113l1113m147k8142j536r370J2521L3892K4900J3486l3616n0590
5288f3751j5326L6681K2212K9812k1677l4676j5842m436J4180J7769J6871l088
5276b1271j5686L4104j2060M128q994k9123L5881N520o739r295j5443k4725O746
5263e6957K8432Q206L2550k2741k002l90j750R43j6309J8380J8104J6988l7941
$$ plain form
5350 3281 16869 -726 -51719 -65842 -20162 6601 -10141 -8819 24559 7235 -9194 -7403
5338 -7403 18423 33121 68837 52274 246 -17576 3754 33099 18908 -26290 -14913 39948
5326 39948 95733 70609 12120 18329 7263 -18151 -22095 -33838 -33773 -36916 -8551 31865 52319
5313 52319 20680 -35394 -42220 -27629 11158 26436 -16769 31785 50647 21210 11575 21466
5301 21466 17077 9964 -21149 -25296 -53438 -54974 -64344 -51823 -17931 6969 20455 -13161 -63751
5288 -63751 -79077 -42396 -20184 9628 -12049 -46725 -62567 -67003 -52823 -35054 -18183 -21271
5276 -21271 -36957 -2853 -14913 -10785 -19779 -48902 -13021 -7501 -14240 -23535 -38978 -63703 -56957
5263 -56957 -28525 -20319 12231 -10510 -12512 -12902 -14652 -13709 -30018 -11638 6466 23454 -14487
5250a4487Q432L6263M1099m5014k3021j4339J8670l991p945j9557m1971Q725M6754
5237a0382K6394k2008l2381N253L3355k0678o866J8428J0730o897m914J1641J5822
5224A7497L1739j1017j3781K2288k6268k3054j8742j593K0537M2600l710l9579
5212c083l3917j4674K592p205j525k4643j8058j1337Q2211O7154J7595k5992Q189
5199C7307Q129K6367k7281k9112J6601m1201K3062O690J6530M598o485j3191K844
5186B4858M261R258j7066l327N261j943j0389J8975K3074k667K669p666p508l0809
5172F981j3524k9980k9885L0873P9885p228J050j8076l0751K727R974O610m603
5159D053L8058m9473n936L3242J3559J180m0023n1230M423P240J2034j5053J6097
$$ plain form
5250 -14487 -6055 30208 71307 26293 3272 -11067 7603 3612 -4333 -23890 -65861 -57136 -10382
5237 -10382 16012 -5996 -38377 -33124 231 -20447 -27313 -8885 1845 -5052 -9966 1675 17497
5224 17497 49236 38219 24438 46726 20458 -2596 -21338 -22931 -2394 40206 36496 -3083
5212 -3083 -37000 -51674 -49082 -56287 -57812 -82455 -100513 -111850 -29639 37515 55110 29118 37307
5199 37307 45436 71803 44522 15410 32011 -9190 13872 20562 37092 41690 35205 22014 24858
5186 24858 29119 38377 21311 17984 23245 21302 10913 29888 52962 50295 52964 45298 37790 6981
5172 6981 -6543 -36523 -66408 -35535 44350 37122 38172 20096 -10655 -7928 2046 8656 4053
5159 4053 42111 -7362 -13298 19944 33503 34683 -5340 -56570 -52147 -44907 -32873 -47926 -31829
5146c1829K7771L8022j241J1287P520k5732K8694L258n1664k1087k3308J1581
5134b6728M2173m2224l5655K3429L0380l045j7959P728L6935n7k5008j1840M563
5121a7308K7684K845j199L099K7234J2840j6794k2310m506K2938J5559l2091l5901
5108a7910k7011N022J4231J765L8061j650r883J0486J9479K0226Q028m4951J119
5095A7012L0371J0305k8232J6784q789n0633q682K701K1223K5695J391j4697l2905
5082a8456J7583k3357l6442M236M3024L0078J6541k8086k5417k143k371k0823
5070d5633L2207R883O40L688k5059J017L0920L5450k2410j3892J0190l221J7962
5057C1742K0120l0405k4862J7452K0616o758J215k0724J2621q874k0183j5644
$$ plain form
5146 -31829 -4058 33964 32723 44010 51530 25798 54492 57750 6086 -15001 -38309 -26728
5134 -26728 15445 -26779 -62434 -39005 -8625 -11670 -29629 -21901 15034 14977 -10031 -21871 -17308
5121 -17308 10376 13221 12022 15121 42355 55195 38401 16091 11585 34523 50082 17991 -17910
5108 -17910 -44921 -39899 -25668 -23903 14158 12508 2625 13111 32590 52816 60844 15893 17012
5095 17012 47383 57688 29456 46240 37451 -13182 -21864 -19163 2060 27755 29146 14449 -18456
5082 -18456 -873 -24230 -60672 -56436 -13412 16666 33207 5121 -20296 -22439 -24810 -45633
5070 -45633 -13426 -3543 -2903 785 -24274 -23257 7663 43113 20703 6811 17001 13780 31742
5057 31742 51862 21457 -3405 14047 34663 27905 29120 8396 21017 12143 -8040 -23684
5045b3684Q129j6549K1010J3031j0814n398k672M1384K9186m191L1163j3135l0361
5032C7099j5999k946l8414k482L8415M2439n5201J0468L6925l8236k5111N27j2986
5019b5502R685J9314J8271R769k4806j3192J552J2170R284k702j4424J0395K1872
5006C1686K7438K4667l3645n02J690j0312J348p803k1558P65q685k6058k3454
4993d4423K3063J1815L3902j4695Q116J5842J0921q449N930J5877p565l604m340
4980D2390l7479m4461k2618k0891k043l056L0897K0032O750j1749k1228J4218
4968d9238K2656J2498K582R603m5377K299K1814p049N111p135k1195n956k3158
4955h2545P662j7882L8871p018k5130L7304M8794l196K0225J5888l5352L074k3849
$$ plain form
5045 -23684 -15555 -32104 -11094 1937 -8877 -14275 -16947 24437 53623 49432 80595 67460 37099
5032 37099 21100 18154 -20260 -22742 15673 58112 2911 13379 50304 12068 -13043 -12516 -25502
5019 -25502 -15817 3497 21768 31537 6731 -6461 -4909 7261 16545 13843 -581 9814 31686
5006 31686 59124 83791 50146 49644 51334 41022 42370 34567 13009 13774 5089 -20969 -44423
4993 -44423 -21360 -9545 24357 9662 17778 33620 44541 36092 42022 57899 50334 46730 42390
4980 42390 4911 -39550 -62168 -83059 -85102 -88158 -57261 -37229 -30479 -42228 -63456 -49238
4968 -49238 -26582 -14084 -11502 -1899 -47276 -44977 -23163 -30212 -25101 -32236 -53431 -59387 -82545
4955 -82545 -74883 -92765 -53894 -60912 -86042 -48738 56 -3140 17085 32973 -2379 695 -23154
4942b3154m760K2926j2963k9819m0369P290J6849J7628J9002l906n91K5282O038
4929e47l5273l8161j7754j2581j6069L3875N7885P877K7297K819j1686K3461L7796
4916E8939K3319l9652n4592l7250k0792L9658M9333P65l344l341q221J5992j3084
4903G730r526J080J912L9231K3042r794J6922n8735j6691N6944J3365k4204k531
4890C8745j0866L641n396K660O817Q193J4538J5228l3769k3504M166n816J7019
4877C1656O8807l707l7244J0144Q422l7476k3574k5815n2513R320P678L4857M9506
4864D0061L0304J9271K378j3306p1051m5601K8493O3588k2562J3946J5323k9450
4852C1394j3430l5114J1594L5586P454k4956m8177n3517j8398M8091J5862J2343
$$ plain form
4942 -23154 -27914 -4988 -17951 -47770 -88139 -80849 -64000 -46372 -27370 -31276 -31867 -6585 -547
4929 -547 -35820 -73981 -91735 -104316 -120385 -86510 -28625 -20748 6549 9368 -2318 21143 58939
4916 58939 82258 42606 -11986 -49236 -70028 -30370 18963 19728 16384 13043 4822 20814 7730
4903 7730 -1796 -716 1196 40427 63469 53675 70597 11862 -4829 52115 65480 41276 38745
4890 38745 27879 31520 26124 28784 35601 43794 58332 73560 39791 16287 20453 14637 31656
4877 31656 100463 96756 59512 69656 78078 40602 17028 -8787 -61300 -51980 -44302 -9445 40061
4864 40061 70365 89636 92014 78708 7657 -37944 -9451 54137 31575 45521 60844 31394
4852 31394 17964 -17150 -5556 30030 37484 12528 -35649 -89166 -107564 -59473 -43611 -31268
4840c1268J5458J2416r684k1719j529q20n640j7070l052O64l2071j5995N5232
$$ plain form
4840 -31268 -15810 -3394 -13078 -34797 -36326 -37146 -42786 -59856 -62908 -62244 -94315 -110310 -55078
$$ [...]
##END NTUPLES=NMR SPECTRUM
##END=
