##TITLE=Analysis number 307761
Compound Code cc 39108
Book Reference 399/155
Project Code adrs
Chemist Name evam
##JCAMPDX= 6.0         $$ Bruker NMR JCAMP-DX V2.0
##DATA TYPE= NMR SPECTRUM
##DATA CLASS= NTUPLES
##ORIGIN= Bruker BioSpin GmbH
##OWNER= NMR
$$ XWIN-NMR		Version 3.5
$$ Thu May 12 12:39:15 2005 GMT Daylight Time (UT+1h)  MAYBRIDGE\NMR@NMR_250MHZ
##.OBSERVE FREQUENCY= 250.131544655141
##.OBSERVE NUCLEUS= ^1H
##.ACQUISITION MODE= SIMULTANEOUS (DQD)
##.ACQUISITION SCHEME= undefined
##.AVERAGES= 16
##.DIGITISER RES= 18
##SPECTROMETER/DATA SYSTEM= dpx250
##.PULSE SEQUENCE= zg30
##.SOLVENT NAME= CDCl3
##.SHIFT REFERENCE= (INTERNAL, CDCl3, 0, 16.4503)
##AUDIT TRAIL= $$ (NUMBER, WHEN, WHO, WHERE, WHAT)
$$ ##TITLE= Audit trail, XWIN-NMR		Version 3.5
$$ ##JCAMPDX= 5.01
$$ ##ORIGIN= Bruker BioSpin GmbH
$$ ##OWNER= NMR
$$ C:\u/data/dgb/nmr/ADRS/2850/pdata/1/auditp.txt
$$ ##AUDIT TRAIL=  $$ (NUMBER, WHEN, WHO, WHERE, WHAT)
(   1,<2005-05-12 12:38:40.42 +100>,<MAYBRIDGE\NMR>,<NMR_250MHZ>,
      <created by zg, POWCHK disabled, PULCHK disabled
       configuration hash MD5:
       62 19 C7 07 E1 42 D1 B7 37 6C 3D D0 77 39 F9 E6
       data hash MD5: 64K
       04 AE 2C 72 1D 8E C7 58 5E 25 C9 F0 53 4A 5E 66>)
(   2,<2005-05-12 12:38:56.65 +100>,<MAYBRIDGE\NMR>,<NMR_250MHZ>,
      <Start of raw data processing
       ef LB = 0.3 FT_mod = 6 PKNL = 1 SI = 32K 
       data hash MD5: 32K
       84 D7 2F 4D 33 D4 40 2A C2 BE 72 11 B7 73 D2 09>)
(   3,<2005-05-12 12:39:01.20 +100>,<MAYBRIDGE\NMR>,<NMR_250MHZ>,
      <apk 
       data hash MD5: 32K
       1F 21 44 97 DA 18 6D F6 02 CC 83 29 3F 42 57 61>)
(   4,<2005-05-12 12:39:02.35 +100>,<MAYBRIDGE\NMR>,<NMR_250MHZ>,
      <abs ABSG = 5 
       data hash MD5: 32K
       27 52 CA E1 A2 32 A4 0E 3D AB 2C 54 EA 6A 2A 0B>)
$$ ##END=
$$ 
$$ hash MD5
$$ 7C 78 92 CE 95 65 07 9A 37 28 74 E0 56 F3 12 D5
##$RELAX= 
##$RELAX= 
##$RELAX= 
##$RELAX= 
##$RELAX= 
##$RELAX= 
##$RELAX= 
$$ Bruker specific parameters
$$ --------------------------
##$DU= <C:\u>
##$EXPNO= 2850
##$NAME= <ADRS>
##$PROCNO= 1
##$TYPE= <nmr>
##$USER= <dgb>
##$AMP= (0..31)
100 100 100 100 100 100 100 100 100 100 100 100 100 100 100 100 100 100 
100 100 100 100 100 100 100 100 100 100 100 100 100 100 
##$AQSEQ= 0
##$AQ_mod= 3
##$AUNM= <au_zg>
##$AUTOPOS= <22 >
##$BF1= 250.13
##$BF2= 250.13
##$BF3= 250.13
##$BF4= 250.13
##$BF5= 500.13
##$BF6= 500.13
##$BF7= 500.13
##$BF8= 500.13
##$BYTORDA= 1
##$CFDGTYP= 0
##$CFRGTYP= 5
##$CHEMSTR= <none>
##$CNST= (0..31)
1 1 145 1 1 1 1 1 1 1 1 1 1 1 1 1 1 1 1 1 1 1 1 1 1 1 1 1 1 1 1 1 
##$CPDPRG= <>
##$CPDPRG1= <>
##$CPDPRG2= <>
##$CPDPRG3= <>
##$CPDPRG4= <mlev>
##$CPDPRG5= <mlev>
##$CPDPRG6= <mlev>
##$CPDPRG7= <mlev>
##$CPDPRG8= <mlev>
##$CPDPRGB= <>
##$CPDPRGT= <>
##$D= (0..31)
0 1 0 0 0 0 0 0 0 0.06 0 0 0 0 0 0 0.0002 0 0 0 0 0 0 0 0 0 0 0 0 0 0 
0 
##$DATE= 1115897919
##$DBL= (0..7)
120 120 120 120 120 120 120 120 
##$DBP= (0..7)
150 150 150 150 150 150 150 150 
##$DBP07= 0
##$DBPNAM0= <>
##$DBPNAM1= <>
$$ [...]
##$SUBNAM8= <"">
##$SUBNAM9= <"">
##$SW= 20.6930455092707
##$SWIBOX= (0..15)
0 0 3 0 0 0 0 0 0 0 0 0 0 0 0 0 
##$SW_h= 5175.983436853
##$TD= 65536
##$TD0= 1
##$TE= 295.16
##$TE2= 300
##$TE3= 300
##$TEG= 300
##$TL= (0..7)
0 120 120 120 120 120 120 120 
##$TP= (0..7)
150 150 150 150 150 150 150 150 
##$TP07= 0
##$TPNAME0= <>
##$TPNAME1= <>
##$TPNAME2= <>
##$TPNAME3= <>
##$TPNAME4= <>
##$TPNAME5= <>
##$TPNAME6= <>
##$TPNAME7= <>
##$TPOAL= (0..7)
0.5 0.5 0.5 0.5 0.5 0.5 0.5 0.5 
##$TPOFFS= (0..7)
0 0 0 0 0 0 0 0 
##$TUNHIN= 0
##$TUNHOUT= 0
##$TUNXOUT= 0
##$USERA1= <user>
##$USERA2= <user>
##$USERA3= <user>
##$USERA4= <user>
##$USERA5= <user>
##$V9= 5
##$VALIST= <valist>
##$VCLIST= <CCCCCCCCCCCCCCC>
##$VD= 0
##$VDLIST= <DDDDDDDDDDDDDDD>
##$VPLIST= <PPPPPPPPPPPPPPP>
##$VTLIST= <TTTTTTTTTTTTTTT>
##$WBST= 1024
##$WBSW= 4
##$XGAIN= (0..3)
0 0 0 0 
##$XL= 0
##$YL= 0
##$YMAX_a= 322489
##$YMIN_a= -319802
##$ZGOPTNS= <>
##$ZL1= 120
##$ZL2= 120
##$ZL3= 120
##$ZL4= 120
##$ABSF1= 16.45035
##$ABSF2= -4.242823
##$ABSG= 5
##$ABSL= 3
##$ALPHA= 0
##$AQORDER= 0
##$ASSFAC= 0
##$ASSFACI= 0
##$ASSFACX= 0
##$ASSWID= 0
##$AUNMP= <proc_1d>
##$AZFE= 0.1
##$AZFW= 0.1
##$BCFW= 0
##$BC_mod= 0
##$BYTORDP= 0
##$COROFFS= 0
##$CY= 12.5
##$DATMOD= 1
##$DC= 0
##$DFILT= <>
##$DTYPP= 0
##$F1P= 14.0000005364418
##$F2P= -0.99999901652339
##$FCOR= 0.5
##$FTSIZE= 32768
##$FT_mod= 6
##$GAMMA= 0
##$GB= 0
##$INTBC= 1
##$INTSCL= 1
##$ISEN= 128
##$LB= 0.3
##$LEV0= 0
##$LPBIN= 0
##$MAXI= 10000
##$MC2= 0
##$MEAN= 0
##$ME_mod= 0
##$MI= 0
##$NCOEF= 0
##$NC_proc= -2
##$NLEV= 6
##$NOISF1= 0
##$NOISF2= 0
##$NSP= 0
##$NTH_PI= 0
##$NZP= 0
##$OFFSET= 16.45035
##$PC= 1
##$PHC0= -72.08392
##$PHC1= 6.631085
##$PH_mod= 1
##$PKNL= yes
##$PPARMOD= 0
##$PSCAL= 4
##$PSIGN= 0
##$REVERSE= no
##$SF= 250.130017920615
##$SI= 32768
##$SIGF1= 0
##$SIGF2= 0
##$SINO= 400
##$SIOLD= 32768
##$SREGLST= <1H.CDCl3>
##$SSB= 0
##$STSI= 32768
##$STSR= 0
##$SW_p= 5175.98343685301
##$SYMM= 0
##$S_DEV= 0
##$TDeff= 65536
##$TDoff= 0
##$TI= <Analysis number 999999
Compound Code 99
Book Reference 9
Project Code 9>
##$TILT= no
##$TM1= 0
##$TM2= 0
##$TOPLEV= 0
##$USERP1= <user>
##$USERP2= <user>
##$USERP3= <user>
##$USERP4= <user>
##$USERP5= <user>
##$WDW= 1
##$XDIM= 32768
##$YMAX_p= 307983384
##$YMIN_p= -1702695
$$ End of Bruker specific parameters
$$ ---------------------------------
##NTUPLES= NMR SPECTRUM
##VAR_NAME=  FREQUENCY,     SPECTRUM/REAL,   SPECTRUM/IMAG
##SYMBOL=    X,             R,               I
##VAR_TYPE=  INDEPENDENT,   DEPENDENT,       DEPENDENT
##VAR_FORM=  AFFN,          ASDF,            ASDF
##VAR_DIM=   32768,         32768,           32768
##UNITS=     HZ,            ARBITRARY UNITS, ARBITRARY UNITS
##FACTOR=    0.157963299565203, 1,           1
##FIRST=     4114.72629221021, 0,            0
##LAST=      -1061.2571446428, 0,            0
##MIN=       -1061.2571446428, -1702695,     0
##MAX=       4114.72629221021, 307983384,    0
$$ Real data points
##PAGE= N=1
##DATA TABLE= (X++(R..R)), XYDATA
$$ [...]
$$ plain form
17201 -2940 4207 -863 -7931 -14387 -18026 -12122 -14596 -6573 -2972 -7628 -15510 -11305 -2601 -3028 2437
17186 2437 4123 440 -3664 -8767 6118 15067 5452 8445 20087 25556 27607 16361 2691 -14012
17172 -14012 -2004 -10115 -19304 -23155 -21755 -16525 -22555 -30776 -16173 -9574 -9572 -6518 -12645 -27458
17158 -27458 -32040 -38605 -28499 -18033 -11208 -14788 -6896 -9135 -12415 -20471 -23298 -21097 -13906 -8566
17144 -8566 -875 449 -2263 366 2717 -3863 -2509 -4322 -10235 4846 11068 17146 10143 -2344
17130 -2344 -15548 -24548 -31965 -22558 -16638 2288 5738 -12427 -22220 -11202 936 -6879 -26113
17117 -26113 -23670 -19766 -22871 -25622 -20659 -15954 -6849 4509 -10749 -3683 1721 -3027 -6052 -9067
17103 -9067 -11955 -8352 -10167 -12175 -23812 -22327 -14270 -7159 4271 17158 28617 22181 15587 3916
$$ packed form
17201b940P147n070p068o456l639N904k474Q023L601m656p882M205Q704m27N465
17186B437J686l683m104n103J4885Q949r615K993J1642N469K051j1246j3670j6703
17172a4012J2008q111r189l851J400N230o030q221J4603O599KL054o127j4813
17158b7458m582o565J0106J0466O825l580P892k239l280q056k827K201P191N340
17144h566P691J324k712K629K351o580J354j813n913J5081O222O078p003j2487
17130b344j3204r000p417R407N920J8926L450j8165r793J1018J2138p815j9234
17117b6113K443L904l105k751M963M705R105J1358j5258P066N404m748l025l015
17103i067k888L603j815k008j1637J485Q057P111J1430J2887J1459o436o594j1671
$$ plain form
17089 3916 -7677 -13230 3653 8026 -5016 -5929 -18739 -19792 -24371 -31842 -32889 -27226 -20724 -5894
17075 -5894 -7270 -6828 -16239 -25711 -19685 -5087 -11769 -26230 -14172 -3077 -26 4300 4628 12774
17061 12774 11935 3899 -15322 -22047 -27419 -17715 -16448 -21694 -13017 -3284 3690 496 155 12136
17047 12136 7974 -1381 3389 14854 13217 -8590 -14202 -4521 -7207 -13520 -17142 -13263 -19980 -16051
17033 -16051 -5983 -1816 -18676 -22085 -13753 -11870 3693 -2196 -3306 48 7486 11449 3654 4292
17019 4292 10754 12425 14754 27670 36346 19148 4982 -8206 8088 11262 8235 9320 18238
17006 18238 24196 16819 17191 -1013 -17091 -11616 -4769 -8418 -11058 3505 11292 19655 27990 27197
16992 27197 13857 -5489 -5236 5434 19455 23929 19473 7410 -987 3060 2658 2933 5230 -1357
$$ packed form
17089C916j1593n553J6883M373j3042r13j2810j053m579p471j047N663O502J4830
17075e894j376M42r411r472O026J4598o682j4461J2058J1095L051M326L28Q146
17061A2774q39q036j9221o725n372R704J267n246Q677R733O974l194l41J1981
17047A2136m162r355M770J1465j637k1807n612R681k686o313l622L879o717L929
17033a6051J0068M167j6860l409Q332J883J5563n889j110L354P438L963p795O38
17019D292O462J671K329J2916Q676j7198j4166j3188J6294L174l027J085Q918
17006A8238N958p377L72j8204j6078N475O847l649k640J4563P787Q363Q335p93
16992B7197j3340j9346K53J0670J4021M474m456j2063q397M047m02K75K297o587
$$ plain form
16978 -1357 9223 13360 -2722 -14442 -9590 -11976 -11156 2354 6265 -3075 -5863 -5167 1713 7453
16964 7453 4569 -6454 -410 9262 6519 -4157 -11755 -11745 -4951 1024 8287 -4059 -17110 -17991
16950 -17991 -13323 -20415 -18991 -14840 -11960 2794 60 4255 19674 32714 25085 544 -1422
16937 -1422 1064 946 -10466 -6580 4988 7730 -1177 1836 7657 -2057 -3613 -450 -7175 -10070
16923 -10070 -7491 -10276 -10882 -3152 228 453 -7869 -3861 9942 17813 -2904 -5070 -696 -15167
16909 -15167 -15259 -266 -5222 -6227 3718 16707 7448 13561 16096 4783 1725 -5798 -8365 2804
16895 2804 1445 -1876 -10347 -10194 -6833 -6268 575 2552 -11171 -19176 -11852 -6819 -14652 -16934 -28030
16880 -28030 -26289 -15836 3245 -10317 -27428 -25946 -15749 -17706 -14250 -18783 -15234 -16831 -3439
$$ packed form
16978a357J0580M137j6082j1720M852k386Q20J3510L911r340k788O96O880N740
16964G453k884j1023O044R672k743j0676p598J0O794N975P263j2346j3051q81
16950a7991M668p092J424M151K880J4754k734M195J5419J3040p629k4541j966
16937a422K486j18j1412L886J1568K742q907L013N821r714j556L163o725k895
16923a0070K579k785o06P730L380K25q322M008J3803P871k0717k166M374j4471
16909a5167r2J4993m956j005R945J2989r259O113K535j1313l058p523k567J1169
16895B804j359l321q471J53L361N65O843J977j3723q005P324N033p833k282j1096
16880b8030J741J0453J9081j3562j7111J482J0197j957L456m533L549j597J3392
$$ plain form
16867 -3439 14118 14969 14934 5994 -4092 -11176 -16092 -13852 -11213 -7859 3364 3137 643 692 7737
16852 7737 4329 -6640 -10316 -16446 -4475 -752 -1589 3832 17116 353 -8310 -4744 -4346 -6512
16838 -6512 730 -8379 -10737 -16034 -8800 -14886 -30654 -26962 -21165 -15460 -5896 -7703 -6945 -11523 -3262
16823 -3262 8365 -17162 -20761 -22540 -13778 -13199 -13016 -13322 -18563 -26249 -28918 -15115 1517 -7809
16809 -7809 -29583 -30043 -23940 -16682 -20698 -22871 -22100 -12641 -19141 -5991 2813 9519 6446 569 -5296
16794 -5296 -937 -16554 -10092 -7800 -5991 10542 22020 5947 -997 1121 -508 5902 10974 9186
16780 9186 -9722 -1427 15312 29639 35366 32491 14542 -1672 -15701 -14731 -5665 -10837 -12946
16767 -12946 -11854 -837 9949 9512 4547 -4113 7313 4960 1556 1984 6154 3612 10074 29401
$$ packed form
16867c439J7557Q51l5q940j0086p084m916K240K639L354J1223k27k494M9P045
16852G737l408j0969l676o130J1971L723q37N421J3284j6763q663L566L98k166
16838f512P242r109k358n297P234o086j5768L692N797N705R564j807P58m578Q261
16823c262J1627k5527l599j779Q762N79J83l06n241p686k669J3803J6632r326
16809g809k1774m60O103P258m016k173P71R459o500J3150Q804O706l073n877n865
16794e296M359j5617O462K292J809J6533J1478j6073o944K118j629O410N072j788
16780I186j8908Q295J6739J4327N727k875j7949j6214j4029R70R066n172k109
16767a2946J092J1017J0786m37m965q660J1426k353l404M28M170k542O462J9327
$$ plain form
16753 29401 22122 5308 8308 6110 6487 -355 -5198 7690 20910 27919 21095 10912 -3696
16740 -3696 -18615 -11979 -358 7000 15114 16926 6103 241 -11115 -3484 2777 -3125 -5535 -13846
16726 -13846 -23690 -43156 -27791 -30081 -27362 -13554 -1621 -508 -15464 -24833 -26243 -6874 2534
16713 2534 -808 -11275 -13141 -11995 -18786 -10712 -16357 -24409 -3480 14884 -701 -24683 -40299
16700 -40299 -15399 12299 5303 -11021 -28201 -20397 -13940 -23979 -21146 -20623 -10862 -12079 -33610
16687 -33610 -38040 -34685 -25889 -20590 -10449 -14315 -8388 -8961 -15072 -9627 -4838 -3230 1955 15154
16673 15154 19399 18345 15837 4014 2935 -1654 -8846 5584 1960 1986 983 724 -2226 340 1705
16658 1705 -12078 -12947 9919 4191 -20008 -31534 -32935 -24818 -31175 -22387 -14874 -12219 -16442 -25369
$$ packed form
16753B9401p279j6814L000k198L77o842m843J2888J3220P009o824j0183j4608
16740c696j4919O636J1621P358Q114J812j0823n862j1356P631O261n902k410q311
16726a3846r844j9466J5365k290K719J3808J1933J113j4956r369j410J9369R408
16713B534l342j0467j866J146o791Q074n645q052K0929J8364j5585k3982j5616
16700d0299K4900K7698o996j6324j7180P804O457j0039K833N23R761j217k1531
16687c3610m430L355Q796N299J0141l866N927n73o111N445M789J608N185J3199
16673A5154M245j054k508j1823j079m589p192J4430l624K6j003k59k950K566J365
16658A705j3783q69K2866n728k4199j1526j401Q117o357Q788P513K655m223q927
$$ plain form
16644 -25369 -23014 -23863 -10635 -3265 2272 -8180 -21289 -14268 -3030 2929 8284 14576 -3895
16631 -3895 -371 9447 1238 -238 -5899 -577 -13019 -32031 -17887 -15528 -21199 -14623 -10385 -22071
16617 -22071 -25621 -23988 -17791 -20513 -21767 -10596 -12511 -10550 -8494 -15870 -16870 -11985 -15822 -8029
16603 -8029 2203 831 8082 4042 8220 15159 18245 15390 8221 3423 5341 9296 15681 15876 4060
16588 4060 -2654 -998 4898 11809 7044 5301 10823 3679 2190 -797 -6536 -18323 -21308 -20880 -20531
16573 -20531 -19107 -10887 -7289 -6463 -11653 -3166 7203 -17734 -39215 -39047 -28967 -19693 -3980 -10022
16559 -10022 -31390 -26791 -21682 -18400 -6775 5460 8303 -13411 -24315 -3635 3064 -14222 -14905
16546 -14905 -16859 -23908 -8045 3967 27131 35084 31725 15125 2642 -1918 -16581 -22010 -22548
$$ packed form
16644b5369K355q49J3228P370N537j0452j3109P021J1238N959N355O292j8471
16631c895L524R818q209j476n661N322j2442j9012J4144K359n671O576M238j1686
16617b2071l550J633O197k722j254J1171j915J961K056p376j000M885l837P793
16603h029J0232j372P251m040M178O939L086k855p169m798J918L955O385J95j1816
16588D060o714J656N896O911m765j743N522p144j489k987n739j1787k985M28L49
16573b0531J424Q220L598Q26n190Q487J0369k4937k1481J68J0080R274J5713o042
16559a0022k1368M599N109L282J1625J2235K843k1714j0904K0680O699j7286o83
16546a4905j954p049J5863J2012K3164P953l359j6600j2483m560j4663n429n38
$$ plain form
16533 -22548 -22668 -7647 6491 13505 8329 2421 -6610 2560 11088 15658 16659 21882 30106 32326
16519 32326 26894 19423 8407 8870 3260 -17286 -19118 -23902 -34498 -28154 -6284 13240 5254
16506 5254 -8718 -19605 -28361 -22337 -30230 -32345 -34925 -28814 -23422 -13097 -3480 11858 878
16493 878 -7887 -8962 -15478 -15449 -841 2247 12757 8562 401 -7722 -9827 10507 15268 9677 9231
16478 9231 1345 4151 6222 -202 -14170 -16407 -15207 -12050 7351 8877 19214 13397 10714 14042
16464 14042 10630 22153 27390 22385 18741 18951 24962 20134 16176 14034 13448 33163 37184 15165
16450 15165 -3955 -13502 -15970 -6082 2602 8682 4013 2276 6803 2093 9436 5283 -4290 -12159
16436 -12159 -10517 -20241 -7250 11114 21432 15424 -3956 1597 7336 317 820 695 -8889 -6382
$$ packed form
16533b2548j20J5021J4138P014n176n908r031R170Q528M570J001N223Q224K220
16519C2326n432p471j1016M63n610k0546j832m784j0596O344K1870J9524p986
16506E254j3972j0887q756O024p893k115k580O111N392J0325R617J5338j0980
16493H78q765j075o516K9J4608L088J0510m195q161q123k105K0334M761n591m46
16478I231p886K806K071o424j3968k237J200L157J9401J526J0337n817k683L328
16464A4042l412J1523N237n005l644K10O011m828l958k142n86J9715M021k2019
16450A5165j9120r547k468R888Q684O080m669j737M527m710P343m153r573p869
16436a2159J642r724J2991J8364J0318o008j9380N553N739p019N03j25r584K507
$$ plain form
16422 -6382 3334 8559 1711 -18341 -22097 -21691 -10903 6765 3886 13254 13494 458 -20813 -30134
16408 -30134 -27003 -13239 -18164 -19471 -7947 -11411 -16196 4286 20313 14637 -6740 -17017 -20071
16395 -20071 -20432 -12986 -15902 -23064 -22359 -14148 -9277 -4690 3745 -8702 -8525 -1710 -7959 -9739 -10644
16380 -10644 -7116 3767 11707 18310 16391 7058 16611 20415 22712 19429 3722 -7822 -3706 -3091
16366 -3091 -5987 -5302 -18960 -17213 -6632 10951 7849 -2593 2375 -4556 -6010 877 11720 13586
16352 13586 13719 19857 20860 15538 3191 -16156 -21865 -9766 -2497 3515 -5481 -1719 -11678 -23520
16338 -23520 -19728 -6429 -7620 -14569 -7391 609 9972 12201 8430 16280 17888 9965 -5716 -20378
16324 -20378 -26973 -27170 -26541 -19144 2365 9948 -1035 -7867 -15144 -5045 -8516 -24515 -15793 -12711
$$ packed form
16422f382R716N225o848k0052l756M06J0788J7668k879R368K40j3036k1271r321
16408c0134L131J3764m925j307J1524l464m785K0482J6027n676k1377j0277l054
16395b0071l61P446k916p162P05Q211M871M587Q435j2447J77O815o249j780r05
16380a0644L528J0883P940O603j919r333R553L804K297l283j5707j1544M116O15
16366c091k896O85j3658J747J0581J7583l102j0442M968o931j454O887J0843J866
16352A3586J33O138J003n322j2347j9347n709J2099P269O012q996L762r959j1842
16338b3520L792J3299j191o949P178Q000R363K229l771P850J608p923j5681j4662
16324b0378o595j97O29P397K1509P583j0983o832p277J0099l471j5999Q722L082
$$ plain form
16310 -12711 -6223 -5222 -7457 -10249 3745 6131 347 -8619 -10577 -7229 -6092 -343 12518 12766
16296 12766 1090 -1591 -2102 103 535 -2082 -15883 -23382 -17743 -199 7908 2195 -15251 -26061
16282 -26061 -24913 -17395 1603 6440 3871 3303 12183 17507 -323 -16346 -20049 -13048 -23374 -25312
16268 -25312 -9670 -204 -5886 -12324 -8300 -7732 -7950 865 -5623 -16639 -23948 -21528 -17329 -8995
16254 -8995 -6428 -13417 -14330 -14091 -18268 -6302 10343 22861 18556 11553 -16339 -20969 -15042 -3227
16240 -3227 4099 106 -5328 -12894 -2404 -1216 -14005 -18023 -15602 -5090 8234 8192 11005 7160
16226 7160 -7317 -11192 -11811 -4471 8231 16759 24469 29947 23888 19372 22472 14450 10727 18003
16212 18003 29830 35197 26664 16206 -3628 -1261 14295 17274 21328 18686 4202 8087 12623
$$ packed form
16310a2711O488J001k235k792J3994K386n784q966j958L348J137N749J2861K48
16296A2766j1676k681n11K205M32k617j3801p499N639J7544Q107n713j7446j0810
16282b6061J148P518J8998M837k569n68Q880N324j7830j6023l703P001j0326j938
16268b5312J5642R466n682o438M024N68k18Q815o488j1016p309K420M199Q334
16254h995K567o989r13K39m177J1966J6645J2518m305p003k7892m630N927J1815
16240c227P326l993n434p566J0490J188j2789m018K421J0512J3324m2K813l845
16226G160j4477l875o19P340J2702Q528P710N478o059m516L100q022l723P276
16212A8003J1827N367q533j0458j9834K367J5556K979M054k642j4484L885M536
$$ plain form
16199 12623 12414 24346 21799 17072 20090 15480 25120 23182 17877 7775 2231 2039 14356 5995
16185 5995 -5119 -8085 -24891 -19051 1792 29131 25033 5081 -4407 -4256 20 -5953 8478
16172 8478 6397 -5381 -10034 -7954 -10253 -2431 8104 -14869 -20256 -18275 -12956 9647 9802 -8937
16158 -8937 -21197 -21131 -17008 -14806 -10604 -2180 11734 1252 -633 7127 7166 2450 6871 -450 -4504
16143 -4504 -1554 14240 10813 -14833 -22654 -13109 -10048 -11503 -3974 9486 5293 9773 5371 -460
16129 -460 -7285 -1911 245 7039 5708 5579 6355 -9609 -3467 -12383 -27083 -21652 -17692 -6718 -25552
16114 -25552 -29644 -22375 -12421 -10074 -9588 2824 21593 34181 43286 44978 30054 16491 16702 14040
16100 14040 14707 8507 444 -556 1834 -1470 -1716 9351 12891 9414 -8495 -20180 -10082 -4963
$$ packed form
16199A2623k09J1932k547m727L018m610R640j938n305j0102n544j92J2317q361
16185E995j1114k966j6806N840K0843K7339m098j9952r488J51M276n973J4431
16172H478k081j1778m653K080k299P822J0535k2973n387J981N319K2603J55j8739
16158h937j2260O6M123K202M202Q424J3914j0482j885P760L9m716M421p321m054
16143d504K950J5794l427k5646p821R545L061j455P529J3460m193M480m402n831
16129d60o825N374K156O794j331j29P76j5964O142q916j4700N431L960J0974j8834
16114b5552m092P269R954K347M86J2412J8769J2588R105J692j4924j3563K11k662
16100A4040O67o200q063j000K390l304k46J1067L540l477j7909j1685J0098N119
$$ plain form
16086 -4963 -11991 -17285 -31458 -29443 -25257 -23715 -16096 1929 19921 11898 -13401 -12843 -7447 -11846
16072 -11846 -4142 -6235 -18849 -23001 -20528 -6230 -5243 -17067 -12501 -9078 -1246 11780 26725
16059 26725 21801 19315 8643 -1037 -6096 -532 -12447 -21594 -13988 -17437 -16547 -5001 -11441 -15499
16045 -15499 5454 5257 5117 21725 35210 35133 28616 8388 5575 17474 23003 19291 20744 17571
16031 17571 3421 -15317 -12019 -12226 -4032 -3877 -8871 -9396 -15277 -14678 -13765 -13962 1778 11154 19018
16016 19018 16874 4841 2598 -6485 -11980 -17301 -20667 -22375 -6089 -2815 -8571 -11764 -7410 -10284
16002 -10284 -30257 -25141 -14656 -21112 -5260 -10101 -7562 6225 -475 -3066 2715 22757 25628
15989 25628 17513 14510 -3605 -2120 -8261 -9071 -1841 6534 -3100 -5043 -5321 1079 8612 -2783
$$ packed form
16086d963p028n294j4173K015M186J542P619J8025J7992q023k5299N58N396m399
16072a1846P704k093j2614m152K473J4298R87j1824M566L423P832J3026J4945
16059B6725m924k486j0672r680n059N564j1915r147P606l449Q90J1546o440m058
16045a5499K0953j97j40J6608J3485p7o517k0228k813J1899N529l712J453l173
16031A7571j4150j8738L298k07Q194J55m994n25n881N99R13j97J5740R376P864
16016A9018k144j2033k243r083n495n321l366j708J6286L274n756l193M354k874
16002a0284j9973N116J0485o456J5852m841K539J3787o700k591N781K0042K871
15989B5628q115l003j8115J485o141q10P230Q375r634j943k78O400P533j1395
$$ plain form
15975 -2783 -5050 -2324 18690 28187 24723 12985 15213 2086 4171 2677 7904 9856 -16511 -36884
15961 -36884 -31727 -26114 -15473 -4663 -2249 616 -11105 -11523 -16502 -7101 -8362 -13033 124 21636
15947 21636 9001 -19243 -23670 -14786 -7789 -2771 -8135 -20822 -23305 -13124 -5643 -6907 -6210 -21137
15933 -21137 -24842 30 -1180 -12524 -18515 -19691 -8163 -5259 -446 -8866 -15840 -18264 -12781 -3390
15919 -3390 -6089 -3844 -2173 -2698 4404 5724 8425 17101 22767 15581 2718 -17752 -676 14076
15905 14076 11488 -2206 -2254 5062 13963 11077 1377 -4054 7859 9108 11486 4730 4686 -2504 -5589
15890 -5589 -2795 -3000 -3617 -1956 -12392 -4895 7287 -6319 1383 8159 -12980 -17642 -6572 16865
15876 16865 25389 39929 25017 13179 521 -9287 -12998 -21194 -10416 -11712 -3385 7946 11564
$$ packed form
15975b783k267K726K1014R497l464j1738K228j3127K085j494N227J952k6367k0373
15961c6884N157N613J0641J0810K414K865j1721m18m979R401j261m671J3157K1512
15947B1636j2635k8244m427Q884O997N018n364j2687k483J0181P481j264O97j4927
15933b1137l705K4872j210j1344n991j176J1528K904M813q420o974k424N483R391
15919c390k699K245J671n25P102J320K701Q676N666p186j2863k0470J7076J4752
15905A4076k588j3694m8P316Q901k886r700n431J1913J249K378o756m4p190l085
15890e589K794k05o17J661j0436P497J2182j3606P702O776k1139m662J1070K3437
15876A6865Q524J4540j4912j1838j2658r808l711q196J0778j296Q327J1331L618
$$ plain form
15863 11564 3799 -7053 -3220 -509 2972 13601 22414 13200 -7020 -21456 -23868 -23604 -23996 -11646
15849 -11646 -4941 -19351 -36245 -5542 26552 28267 10262 4021 8289 17705 7438 599 -4792
15836 -4792 -11597 -23627 -30576 -18097 -10738 -6545 -10360 5889 577 5612 12525 21920 12915 -7936
15822 -7936 -21240 -6865 6770 13621 22000 10336 14570 15947 7111 15292 27530 24002 14717
15809 14717 8240 -343 343 13147 14412 -3327 -15755 -13029 -10103 -25415 -28946 -10604 -10068 -3936
15795 -3936 16023 25731 29318 26246 20481 17070 24221 13412 -3393 -2152 29882 30323 1744 -8337
15781 -8337 7334 8547 13909 14812 -455 -3847 -2225 2588 10811 -2245 -18026 -31548 -33378 -24041
15767 -24041 -21763 -3541 -2209 -3749 -8613 -14896 -13205 -10183 -14251 -11219 6711 16501 15595 15713
$$ packed form
15863A1564p765j0852L833K711L481J0629Q813r214k0220j4436k412K64l92J2350
15849a1646O705j4410j6894L0703L2094J715j8005o241M268R416j0267o839n391
15836d792o805j2030o949J2479P359M193l815J6249n312N035O913R395r005k0851
15822g936j3304J4375J3635O851Q379j1664M234J377q836Q181J2238l528r285
15809A4717o477q583O86J2804J265j7739j2428K726K926j5312l531J8342N36O132
15795c936J9959R708L587l072n765l411P151j0809j6805J241L2034M41k8579j0081
15781h337J5671J213N362R03j5267l392J622M813Q223j3056j5781j3522j830R337
15767b4041K278J8222J332j540m864o283J691L022m068L032J7930R790r06J18
$$ plain form
15753 15713 8278 -2303 1063 8403 4651 -2666 -12912 -29661 -26017 -21844 -16416 -7575 -3416 -8924
15739 -8924 -8220 -19505 -20756 -2996 6648 9339 3425 3338 9373 3622 -1786 4308 15702 18001 17953
15724 17953 13236 -1604 -19855 -32766 -28555 -20674 -16813 -13508 -19598 -11714 -7996 -19265 -6601
15711 -6601 2404 4712 8398 8621 11788 12383 16209 8059 1532 1007 7654 11939 5171 8002 -585
15696 -585 -11785 -1091 -2286 -505 -8335 833 -7057 -9508 -14486 -11891 -4334 -11701 -15096 -12092
15682 -12092 -14166 -1958 4985 -4518 -9446 -6699 -16229 -23042 -10561 948 1095 -2415 -89 6900
15668 6900 11344 10154 -530 -18910 -4409 -1726 -5575 -7945 642 7706 3051 -5734 -16606 -19802
15654 -19802 -13477 -4179 -6631 -7156 -16510 -26627 -14268 -8264 -6522 -2519 6966 14315 240 -15945
$$ packed form
15753A5713p435j0581L366P340l752p317j0246j6749L644M173N428Q841M159n508
15739h924P04j1285j251J7760R644K691n914q7O035n751n408O094J1394K299m8
15724A7953m717j4840j8251j2911M211P881L861L305o090P884L718j1269J2664
15711f601R005K308L686K23L167N95L826q150o527n25O647M285o768K831q587
15696e85j1200J0694j195J781p830R168p890k451m978K595P557p367l395L004
15682a2092k074J2208O943r503m928K747r530o813J2481J1509J47l510K326O989
15668F900M444j190j0684j8380J4501K683l849k370Q587P064m655q785j0872l196
15654a9802O325R298k452n25r354j0117J2359O004J742M003R485P349j4075j6185
$$ plain form
15640 -15945 -20623 -30343 -23973 -16626 -1222 3444 3613 -946 -4061 -4149 6728 320 -4261 -9436 -16035
15625 -16035 -18603 -10751 -12573 -835 7008 9568 10339 9615 15030 21233 13108 8002 2820 3084 6963
15610 6963 3324 6438 5007 3699 9565 17978 22408 18664 20039 14802 1691 1607 -3566 9445 10859
15595 10859 9546 6100 -8127 -11142 7246 23351 36069 26887 11383 -11677 -894 -1347 -10227
15582 -10227 339 13214 17051 17944 13783 4579 -3842 2256 6324 12618 15208 23678 18876 4566
15568 4566 -12855 -10143 -7258 12861 27136 27714 23840 25130 22056 7183 -8640 -14721 -12669 -17714
15554 -17714 -7303 -3107 -12514 -20448 -25054 -26150 -37243 -32526 -16726 -10720 -1741 -11892 -15197
15541 -15197 -25659 -26248 -19657 -12902 -3223 -4224 -12228 -27572 -31513 -30456 -23199 -9724 -10194 -17109
$$ packed form
15640a5945m678r720O370P347J5404M666J69m559l115q8J0877o408m581n175o599
15625a6035k568P852j822J1738P843K560P71p24N415O203q125n106n182K64L879
15610F963l639L114j431j308N866Q413M430l744J375n237j3111q4n173J3011J414
15595A0859j313l446j4227l015J8388J6105J2718r182j5504k3060J0783m53q880
15582a0227J0566J2875L837Q93m161r204q421O098M068O294K590Q470m802j4310
15568D566j7421K712K885K0119J4275N78l874J290l074j4873j5823o081K052n045
15554a7714J0411M196r407p934m606j096j1093M717J5800O006Q979j0151l305
15541a5197j0462n89O591O755R679j001q004j5344l941J057P257J3475m70o915
$$ plain form
15527 -17109 -28015 -28009 -34971 -31927 -14520 -7381 -11552 -10233 -14529 -19069 -12547 5545 15056 12518
15513 12518 9667 8146 14106 22980 17475 13634 -9390 -28753 -18925 -13649 -10767 -1486 -2521 6343
15499 6343 6393 -1293 -3748 3061 -8167 -10191 -17845 -18469 -7008 1388 4766 9400 5565 7460 6573
15484 6573 -5773 6224 5122 -947 -19445 -24734 -21337 6234 22742 29310 30570 21849 22579 11355
15470 11355 10189 18921 10450 16373 25487 23082 10246 196 -1551 2390 10114 8429 10516 7026
15456 7026 -4043 -9953 -12207 -7394 -9183 -1843 11877 10612 8017 -11777 -22809 -10107 -6517
15443 -6517 -7333 -12993 -4797 -2835 -22459 -26365 -13717 -2212 -12394 -3765 5750 -1264 -6235 -50
15429 -50 5764 4040 -10167 -5682 -22303 -20748 -11454 -9969 -13011 -10067 12473 11950 16376 22291 17727
$$ packed form
15527a7109j0906Oo962L044J7407P139m171J319m296m540O522J8092R511k538
15513A2518k851j521N960Q874n505l841k3024j9363R828N276K882R281j035Q864
15499F343N0p686k455O809j1228k024p654o24J1461Q396L378M634l835J895q87
15484F573j2346J1997j102o069j8498n289L397K7571J6508O568J260q721P30j1224
15470A1355j166Q732q471N923R114k405j2836j0050j747L941P724j685K087l490
15456G026j1069n910k254M813j789P340J3720j265k595j9794j1032J2702L590
15443f517q16n660Q196J962j9624l906J2648J1505j0182Q629R515p014m971O185
15429e0N814j724j4207M485j6621J555R294J485l042K944K2540n23M426N915m564
$$ plain form
15414 17727 2575 -3655 -416 -6336 -11889 -19182 -4055 6887 13344 -937 -5306 -6289 -3403 13896
15400 13896 17930 10818 1908 200 2237 5414 10124 8403 2956 4970 -5167 -7725 -7551 2020
15386 2020 -6999 -1170 2624 2625 -12950 -26161 -14607 -26648 -8063 3441 -15510 -22206 -14960 9448
15372 9448 22866 -22 -26667 -27132 -4131 6426 901 -4164 10848 13323 2358 -1407 1201
15359 1201 2407 -6264 -19392 -21720 -21015 -10197 -5454 -2881 -2921 -3396 -4033 12234 18034 16519 19058
15344 19058 33732 41355 51589 75987 89263 78747 47579 29448 22130 1871 643 13579
15332 13579 3178 -3285 3531 -1132 -1161 -5309 -5826 -3622 -12446 -22467 -9886 4470 10477 -7490
15318 -7490 -16546 -14078 -14808 -6362 4300 3754 10675 15318 -771 -16109 -9411 -20818 -9215 2714
$$ packed form
15414A7727j5152o230L239n920n553p293J5127J0942O457j4281m369r83K886J7299
15400A3896M034p112q910j708K037L177M710j721n447K014j0137k558J74R571
15386B020r019N829L794Jj5575j3211J1554j2041J8585J1504j8951o696P246K4408
15372I448J3418k2888k6645m65K3001J0557n525n065J5012K475j0965l765K608
15359A201J206q671j3128k328P05J0818M743K573m0m75o37J6267N800j515K539
15344A9058J4674P623J0234K4398J3276j0516l1168j8131p318k0259j228J2936
15332A3579j0401o463O816m663k9m148n17K204q824j0021J2581J4356O007j7967
15318g490r056K468p30Q446J0662n46O921M643j6089j5338O698j1407J1603J1929
$$ plain form
15304 2714 7730 11920 -1060 4700 14466 21886 17032 8829 5662 11836 15117 8546 -3555 -18323
15290 -18323 -19937 -24180 -19755 -16330 -11323 -9058 -15052 -19655 -9798 -14625 -7392 -1619 3316 -9599
15276 -9599 -9689 -2730 -9004 -9698 -8815 -7091 -12430 -17003 -5008 11165 5492 -10064 -14380 -1759 -2803
15261 -2803 8 7784 -5203 -12807 -15672 -6419 6632 16346 1429 -6474 -455 10438 10785 -9617
15247 -9617 -18477 -6994 3769 9199 18720 30096 23682 9910 6269 13343 12797 3301 -4019 -7711
15233 -7711 -6198 -12740 -19128 -30073 -25143 -20599 -4399 6218 16292 49 -6294 1037 2385
15220 2385 7554 24899 29595 19078 19972 1610 -8133 -5274 -9430 -5277 -2702 8900 18318 7152
15206 7152 7732 10646 17442 7777 11664 -7916 -9652 -5158 5 2807 198 -9863 -6541 -10208
$$ packed form
15304B714N016M190j2980N760R766P420m854q203l167O174L281o571j2101j4768
15290a8323j614m243M425L425N007K265n994m603R857m827P233N773M935j2915
15276i599r0O959o274o94Q83J724n339m573J1995J6173n673j5556m316J2621j044
15261b803K811P776j2987p604k865R253J3051R714j4917p903O019J0893L47k0402
15247i617q860J1483J0763N430R521J1376o414j3772l641P074n46r496p320l692
15233g711J513o542o388j0945M930M544J6200J0617J0074j6243o343P331J348
15220B385N169J7345M696j0517Q94j8362r743K859m156M153K575J1602R418j1166
15206G152N80K914O796r665L887j9580j736M494N163K802k609j0061L322l667
$$ plain form
15192 -10208 -18472 -12694 -13231 -19022 -10745 -17810 -19866 -5476 -1791 -5938 219 11996 1443 -17089
15178 -17089 -17507 -5739 8426 8874 14741 22437 23340 17480 16068 2763 -9305 -17291 -16084 -16148 -18206
15163 -18206 -7489 -2151 -5191 -746 1324 5758 18175 17068 8325 3031 16168 14396 12123 4834
15149 4834 24356 23444 29508 16225 -728 -3489 -422 -5617 -14135 -5100 6754 -3743 -13846
15136 -13846 -11456 5659 14638 10894 4887 2256 9526 19706 22990 25291 24170 21795 9193 -8803
15122 -8803 -21540 -25578 -5007 7536 6569 1730 -4050 2776 2974 -140 1033 -12175 -22282 -25611
15108 -25611 2801 1169 6885 -5834 -19749 -14094 -6806 -11533 4315 16637 23595 20429 10684
15095 10684 3537 -3499 -5482 -8235 -6189 -9290 -22747 4635 19642 11110 4315 -10478 -17669
$$ packed form
15192a0208q264N778n37n791Q277p065k056J4390L685m147O157J1777j0553j8532
15178a7089m18J1768J4165M48N867P696R03n860j412j3305j2068p986J207o4k058
15163a8206J0717N338l040M445K070M434J2417j107q743n294J3137j772k273p289
15149D834J9522r12O064j3283j6953k761L067n195q518R035J1854j0497j0103
15136a3846K390J7115Q979l744o007k631P270J0180L284K301j121k375j2602j7996
15122h803j2737m038K0571J2543r67m839n780O826J98l114J173j3208j0107l329
15108b5611K8412j632N716j2719j3915N655P288m727J5848J2322O958l166r745
15095A0684p147p036j983k753K046l101j3457K7382J5007q532o795j4793p191
$$ plain form
15082 -17669 -13414 -14650 -9126 -8618 -8746 -16192 -5211 11071 19810 14826 13691 9172 5504 11862
15068 11862 398 -19996 -24501 -2066 14207 16077 25810 26723 24234 10371 12676 18333 16963
15055 16963 21346 5178 -17030 -11925 1676 4186 3927 6001 11558 7129 -165 -6850 -2625 3214
15041 3214 7795 11378 9699 20188 23449 15483 -1860 8119 24602 16963 3165 -8050 7822
15028 7822 26059 26861 13319 3485 2436 -287 -3326 -5761 -3906 13242 11999 -6202 -12563 -12114
15014 -12114 -13615 -7928 -4586 -8653 344 10158 5487 7613 7769 2364 6763 12207 10268 2646 969
14999 969 -10168 -15765 -14233 -9480 4371 14291 12671 14049 14921 9158 -779 6852 11397 32678
14985 32678 38495 24731 10736 13950 13177 17904 13124 9846 7409 -3068 82 14306 6031 -11597
$$ packed form
15082a7669M255j236N524N08j28p446J0981J6282Q739m984j135m519l668O358
15068A1862j1464k0394m505K2435J6273J870R733R13k489j3863K305N657j370
15055A6963M383j6168k2208N105J3601K510k59K074N557m429p294o685M225N839
15041C214M581L583j679J0489L261p966j7343R979J6483p639j3798j1215J5872
15028G822J8237Q02j3542r834j049k723l039k435J855J7148j243j8201o361M49
15014a2114j501N687L342m067Q997R814m671K126J56n405M399N444j939p622j677
14999I69j1137n597J532M753J3851R920j620J378Q72n763r937P631M545K1281
14985C2678N817j3764j3995L214p73M727m780l278k437j0477L150J4224q275j7628
$$ plain form
14971 -11597 -18526 -12796 -14578 -2994 -6875 -17545 -17116 -11830 -10790 6244 9370 14516 12543 16732
14957 16732 5349 533 4990 2111 8995 5379 -4046 3413 8773 13991 22618 20902 1953 -18416
14943 -18416 -24327 -22525 -24385 -13746 -6024 7198 14810 9667 10283 11447 12406 16588 24614 13325
14929 13325 13770 4671 3295 15189 1704 2678 5677 6765 7098 16841 9346 12151 20094 16528 8022
14914 8022 14554 19194 23911 29990 40721 25571 16304 16073 13467 -4889 -23741 -18756 -17842 -18156
14900 -18156 -10813 -17402 -14711 -6472 -10078 7895 7344 1905 -11081 -5132 -404 -10517 -7258 -1307
14886 -1307 -10769 -10168 -2828 5188 7779 883 -11767 -10733 1893 -4962 -416 6515 1879 -15319
14872 -15319 -24812 -23933 -28010 -18170 -2186 7011 8564 3532 10375 21471 23241 22452 28394 41805
$$ packed form
14971a1597o929N730j782J1584l881j0670M29N286J040J7034L126N146j973M189
14957A6732j1383m816M457k879O884l616r425P459N360N218Q627j716j8949k0369
14943a8416n911J802j860J0639P722J3222P612n143O16J164R59M182Q026j1289
14929A3325M45r099j376J1894j3485R74K999J088L33R743p495K805P943l566q506
14914H022O532M640M717O079J0731j5150r267k31k606j8356j8852M985R14l14
14900a8156P343o589K691Q239l606J7973n51n439j2986N949M728j0113L259N951
14886a307r462O01P340Q016K591o896j2650J034J2626o855M546O931m636j7198
14872a5319r493Q79m077R840J5984R197J553n032O843J1096J770p89N942J3411
$$ plain form
14858 41805 39121 30692 35565 32662 26504 14793 15882 10456 21743 30810 31465 31134 37994 46005
14844 46005 56018 67786 74305 61330 49824 28869 22287 19038 33592 38057 39635 49437 62393
14831 62393 81219 99289 108399 93087 84093 80314 80402 80492 73725 60431 49808 28494 8356 2739
14817 2739 15552 32522 32182 35720 35621 13814 8291 4888 6665 12921 16584 9840 5033 13214 25305
14802 25305 17646 19424 26465 14368 7828 15654 29177 45983 51202 52504 62098 58535 68067 69962
14788 69962 95119 122363 151458 172088 206273 207104 197047 209762 208488 189806 165689 153829
14776 153829 130471 123488 128109 133111 134969 124979 109880 106193 114171 117635 112329 101808 77853
14763 77853 70828 62951 53784 39566 37652 33489 33051 37335 18168 9837 1391 -9660 -8670 3124
$$ packed form
14858D1805k684q429M873k903o158j1711J089n426J1287R067O55l31O860Q011
14844D6005J0013J1768O519j2975j1506k0955o582l249J4554M465J578R802J2956
14831F2393J8826J8070R110j5312q994l779Q8R0o767j3294j0623k1314k0138n617
14817B739J2813J6970l40L538r9k1807n523l403J777O256L663o744m807Q181J2091
14802B5305p659J778P041j2097o540P826J3523J6806N219J302R594l563R532J895
14788F9962K5157K7244K9095K0630L4185Q31j0057J2715j274j8682k4117j1860
14776A53829k3358o983M621N002J858r990j5099l687P978L464n306j0521k3955
14763G7853p025p877r167j4218j914m163m38M284j9167q331q446j1051R90J1794
$$ plain form
14749 3124 5039 -4687 93 7636 14196 22651 23548 24321 22535 6165 342 9086 25073 26845 14236
14734 14236 8774 5523 -7859 -7799 -7373 -86 8443 28561 25521 25347 10228 -2624 3512 -409
14720 -409 413 7783 6622 14749 19038 21704 31043 22462 23146 15886 13076 7918 7175 2631 -19129
14705 -19129 -18072 -10092 180 1157 2634 9312 7065 695 6270 11567 15895 10414 2546 10261
14691 10261 27462 34890 35640 26961 17040 15955 6402 -280 6387 9507 8629 14479 7139 3123 -14099
14676 -14099 -23437 -24337 -17532 5496 12476 21008 15226 4586 -5288 -10855 -16122 -13263 -1802 25239
14662 25239 37762 39990 34325 31650 28866 12078 9313 7644 6957 5745 1130 21159 17125 -946
14648 -946 -2547 -12004 -14845 -17892 -11440 -5932 -4411 -14826 -12525 -14353 -17727 -1074 4897 -3073
$$ packed form
14749C124J915r726M780P543O560Q455Q97P73j786j6370n823Q744J5987J772j2609
14734A4236n462l251j3382O0M26P287Q529K0118l040j74j5119j2852O136l921
14720d09Q22P370j161Q127M289K666R339q581O84p260k810n158p43m544k1760
14705a9129J057P980J0272R77J477O678k247o370N575N297M328n481p868P715
14691A0261J7201P428P50q679r921j085r553o682O667L120q78N850p340m016j7222
14676a4099r338r00O805K3028O980Q532n782j0640r874n567n267K859J1461K7041
14662B5239J2523K228n665k675k784j6788k765j669o87j212m615K0029m034j8071
14648i46j601r457k841l047O452N508J521j0415K301j828l374J6653N971p970
$$ plain form
14634 -3073 -10277 -5230 2843 7803 1388 -11961 -14698 -5752 987 -39 8154 18826 2723 -17253
14620 -17253 -29550 -31297 -7465 -1770 -6076 -689 -12343 -16784 -12273 6484 11665 6253 16855
14607 16855 23862 15855 8475 16758 9797 13726 22459 13955 8272 31780 41431 36387 40162 45006
14593 45006 38905 42273 33931 12734 14162 21683 21555 13295 -390 -5469 -9413 -9708 -4501 -7160
14579 -7160 5989 3216 556 10558 14374 15285 9864 -505 17469 13208 -7038 -5766 -6309 -13421
14565 -13421 1664 1308 -15637 -13910 -9694 -9805 -13847 -16401 -2332 14168 6192 -2467 7298 10167
14551 10167 14496 20241 20162 14414 23200 11473 -3292 -6511 -2695 -9149 15171 16152 -2750 -4956
14537 -4956 2209 11074 13758 27347 27105 -175 -10459 -9728 -6780 6814 9780 -9 1730 9056
$$ packed form
14634c073p204N047Q073M960o415j3349k737Q946O739j026Q193J0672j6103j9976
14620a7253j2297j747K3832N695m306N387j1654m441M511J8757N181n412J0602
14607A6855P007q007p380Q283o961L929Q733q504n683K3508R651n044L775M844
14593D5006o101L368q342k1197J428P521j28q260j3685n079l944k95N207k659
14579g160J3149k773k660J0002L816R11n421j0369J7974m261k0246J272n43p112
14565a3421J5085l56j6945J727M216j11m042k554J4069J6500p976q659R765K869
14551A0167M329N745p9n748Q786j1727j4765l219L816o454K4320R81j8902k206
14537d956P165Q865K684J3589k42k7280j0284P31K948J3594K966r789J739P326
$$ plain form
14523 9056 18560 27309 31806 13648 10606 11339 9906 -1276 6001 2443 -22088 -37576 -26803 2433
14509 2433 10621 -1003 -1308 7464 13390 14988 10388 12746 12024 13084 -311 -14712 -9354 4863
14495 4863 9875 7682 8224 6290 93 -13032 -6574 8716 13993 6298 -5278 -3389 -13079 -4048
14481 -4048 -5952 5142 7631 5810 3748 -5508 -22931 -22760 -18738 -11859 4231 10236 16623 -2765
14467 -2765 -7805 729 14873 1805 -5210 -10474 2114 5215 -4309 3361 3699 89 3766 2034
14453 2034 9200 23530 21764 12953 953 5837 13517 12994 24526 19185 15799 15193 18158 7980
14439 7980 2604 5964 10605 24176 23047 11861 11400 18146 22833 21921 12354 -583 6115 1975
14425 1975 11842 11653 6746 -5754 -11374 -702 2874 -1540 456 1633 10817 16381 22928 22816 43162
$$ packed form
14523I056R504Q749M497j8158l042P33j433j1182P277l558k4531j5488J0773K9236
14509B433Q188j1624l05Q772N926J598m600K358p22J060j3395j4401N358J4217
14495D863N012k193N42j934o197j3125O458J5290N277p695j1576J889r690R031
14481d048j904J1094K489j821k062r256j7423J71M022O879J6090O005O387j9388
14467b765n040Q534J4144j3068p015n264J2588L101r524P670L38l610L677j732
14453B034P166J4330j766q811j2000M884P680n23J1532n341l386o06K965j0178
14439G980n376L360M641J3571j129j1186m61O746M687r12r567j2937O698m140
14425A975R867j89m907j2500n620J0672L576m414J996J177R184N564O547j12K0346
$$ plain form
14410 43162 42559 33451 29784 16013 12462 16849 24364 26716 25699 13533 6304 14796 13523 6286
14396 6286 313 7472 13819 13788 12308 921 2968 11272 22563 38433 37228 20853 2930 18627
14382 18627 11754 10910 9130 20366 14943 16665 14747 11756 14738 190 -5418 1709 17435 30121
14368 30121 18399 -1555 -9897 -6678 190 14880 29856 16439 2013 4084 4680 6148 -3725
14355 -3725 -3003 -716 17117 30268 35301 22240 13078 14643 25793 24933 33780 30876 30698 34006
14341 34006 14810 12776 4197 2180 4199 16136 11044 9437 15855 31485 30848 11635 2959 2400
14327 2400 14311 19990 16523 283 -4867 -8858 -7222 -3854 -1396 -1085 538 18476 8197 11111
14313 11111 22088 16044 4148 5091 3289 2829 1564 12556 18922 20614 15132 23329 28862 26513
$$ packed form
14410D3162o03r108l667j3771l551M387P515K352j017j2166p229Q492j273p237
14396F286n973P159O347l1j480j1387K047Q304J1291J5870j205j6375j7923J5697
14382A8627o873q44j780J1236n423J722j918k991K982j4548n608P127J5726J2686
14368C0121j1722j9954q342L219O868J4690J4976j3417j4426K071N96J468r873
14355c725P22K287J7833J3151N033j3061r162J565J1150q60Q847k904j78L308
14341C4006j9196k034q579k017K019J1937n092j607O418J5630o37j9213q676n59
14327B400J1911N679l467j6240n150l991J636L368K458L11J623J7938j0279K914
14313A1111J0977o044j1896R43j802m60j265J0992O366J692n482Q197N533k349
$$ plain form
14299 26513 19072 26030 36799 35429 22448 12648 17077 15025 3795 -2358 6520 9036 8286 19354
14285 19354 45032 70148 77300 79239 94449 97921 102916 123203 142312 179100 244885 343990
14273 343990 454425 562116 661776 721414 717414 667320 592865 501726 387938 278436 199057
14262 199057 153139 124578 97851 80477 73499 66538 67439 58187 40475 50771 36755 31676 28861
14249 28861 21038 22243 29389 21416 18860 21591 10216 -1313 5715 9675 11094 8583 -3644 -12530
14235 -12530 -11879 -26277 -19999 -4051 20119 17721 -8002 -36317 -22019 491 1036 2669 -378
14222 -378 -5500 -6618 -5913 -4059 5025 12609 24783 36777 20241 9277 4512 -8154 -16225 -1596
14208 -1596 -7647 -4967 4811 3972 -12087 4261 13372 27418 17535 11406 21713 21158 -1584 -3227
$$ packed form
14299B6513p441O958J0769j370j2981r800M429k052j1230o153Q878K516p50J1068
14285A9354K5678K5116P152J939J5210L472M995K0287J9109L6788O5785R9105
14273C43990J10435J07691R9660N9638m000n0094p4455r1139j13788j09502p9379
14262A99057m5918k8561k6727j7374o978o961R01r252j7712J0296j4016n079k815
14249B8861p823J205P146p973k556K731j1375j1529P028L960J419k511j2227q886
14235a2530O51j4398O278J5948K4170k398k5723k8315J4298K2510N45J633l047
14222c78n122j118P05J854R084P584J2174J1994j6536j0964m765j2666q071J4629
14208a596o051K680R778q39j6059J6348R111J4046r883o129J0307n55k2742j643
$$ plain form
14194 -3227 8756 27931 39991 51566 66132 68514 70801 85470 89915 91616 96170 113233 148866
14181 148866 186554 241016 301001 334735 382263 438041 492143 515921 529362 534280 520503 482779
14169 482779 445174 409280 362349 293368 236740 204847 180575 154349 129711 110187 93314
14158 93314 65182 54258 55192 51085 48743 38598 31172 36619 35123 31810 32905 43921 45698 30040
14144 30040 7114 1845 9898 19956 8480 7438 9061 10682 22059 24599 8094 -211 10866
14131 10866 12687 12146 5724 8029 13084 3894 -14959 -18465 -11679 1923 11249 2185 -7589 -19821
14117 -19821 -33279 -34195 -33596 -26087 -8719 -9141 -10928 -15127 -18193 -48904 -56230 -58138 -58298 -59697 -66766
14102 -66766 -59510 -41321 -35955 -51081 -64079 -82536 -86292 -84467 -87720 -98140 -113980 -119022 -142458
$$ packed form
14194c227J1983J9175J2060J1575J4566K382K287J4669M445J701M554J7063L5633
14181A48866L7688N4462N9985L3734M7528N5778N4102K3778J3441M918j3777l7724
14169D82779l7605l5894m6931o8981n6628l1893k4272k6226k4638j9524j6873
14158I3314k8132j0924R34m107k342j0145p426N447j496l313J095J1016J777j5658
14144C0040k2926n269Q053J0058j1476j042J623J621J1377K540j6505q305J1077
14131A0866J821n41o422K305N055r190j8853l506O786J3602R326r064r774j2232
14117a9821j3458r16N99P509J7368m22j787m199l066l0711p326j908j60j399p069
14102f6766P256J8189N366j5126j2998j8457l756J825l253j0420j5840n042k3436
$$ plain form
14089 -142458 -167099 -198990 -233419 -296986 -366272 -448082 -551021 -658129 -744964 -762168 -724318
14078 -724318 -618444 -471505 -291069 -125746 -10705 68524 105138 120862 138064 145260 149291
14067 149291 143125 144787 137768 140343 131487 117866 126839 131113 122449 120463 123101 134074 121531
14054 121531 103691 102634 118883 114239 118337 141287 151269 157381 160905 175460 186815 182974 170954
14041 170954 173853 173807 153737 132276 113834 113626 120958 116911 105161 96428 106265 113218 114319 121959
14027 121959 131984 151890 144170 123696 98446 87198 90869 90553 92316 88758 90500 89440 78191
14014 78191 61992 62527 74537 88311 83721 79752 86822 94585 101450 98489 86093 78122 88692
14001 88692 94948 96615 88527 83178 88568 81103 83474 88926 96580 97787 112266 122278 113180 122938
$$ packed form
14089a42458k4641l1891l4429o3567o9286q1810j02939j07108q6835j7204L7850
14078g24318J05874J46939J80436J65323J15041P9229L6614J5724J7202P196M031
14067A49291o166J662p019K575q856j3621Q973M274q664j986K638J0973j2543
14054A21531j7840j057J6249m644M098K2950R982O112L524J4555J1355l841j2020
14041A70954K899m6k0070k1461j8442k08P332m047j1750q733R837O953J101P640
14027A21959J0025J9906p720k0474k5250j1248L671l16J763l558J742j060j1249
14014G8191j6199N35J2010J3774m590l969P070P763O865k961j2396p971J0570
14001H8692O256J667q088n349N390p465K371N452P654J207J4479J0012r098R758
$$ plain form
13987 122938 127592 110448 99801 90706 94784 81575 65724 89714 116165 117838 98924 96093
13975 96093 101373 96601 88838 89006 88793 116651 120634 110692 115963 134458 141493 134502 123236 129440
13961 129440 125118 119036 99701 80805 73431 79005 83220 84963 81310 73308 71750 80426 97860
13948 97860 111250 112268 102151 108092 105554 106896 106301 81279 80820 87183 91365 79149 68578 71535
13934 71535 65820 61125 65979 79873 92841 106887 102269 95343 82086 85049 92757 109497 124496
13921 124496 130406 113971 89836 84217 87652 81998 80445 88977 109112 112780 116874 109775 107734
13908 107734 106706 107693 112436 123434 111225 105289 116189 121276 131697 142713 145493 126916 113764
13895 113764 108810 119482 131279 131593 120169 126843 122585 123150 124884 128663 144001 152691 157559 157473
$$ packed form
13987A22938M654j7144j0647r095M078j3209j5851K3990K6451J673j8914k831
13975I6093N280m772p763J68k13K7858L983r942N271J8495P035o991j1266O204
13961A29440m322o082j9335j8896p374N574M215J743l653q002j558Q676J7434
13948I7860J3390J018j0117N941k538J342n95k5022m59O363M182j2216j0571K957
13934G1535n715m695M854J3894J2968J4046m618o926j3257K963P708J6740J4999
13921A24496N910j6435k4135n619L435n654j553Q532K0135L668M094p099k041
13908A07734j028R87M743J0998j2209n936J0900N087J0421J1016K780j8577j3152
13895A13764m954J0672J1797L14j1424O674m258N65J734L779J5338Q690M868q6
$$ plain form
13881 157473 153973 159313 165464 165373 157520 169955 182809 178310 181338 203456 211645 203012 205775 222260
13867 222260 234299 235365 231782 242905 245468 237603 239616 245970 237716 223774 236859 265434 275065
13854 275065 277361 268089 271515 270869 274873 295737 319739 325271 310752 311448 312526 330138 354623
13841 354623 390616 423767 445910 465176 490835 521244 545691 547122 553718 553190 562041 582041
13829 582041 601053 623813 653634 678787 699209 729441 778250 833867 891468 955191 1036929
13818 1036929 1123899 1201728 1295045 1407100 1534268 1681607 1876782 2158048 2490549 2889789
13808 2889789 3378305 3894401 4428515 4960672 5502585 6101603 6781482 7640000 8776618
13799 8776618 10355752 12674253 16280879 22128319 31615380 45997419 65446984 88592268
$$ packed form
13881A57473l500N340O151r1p853J2435J2854m499L028K2118Q189q633K763J6485
13867B22260J2039J066l583J1123K563p865K013O354q254j3942J3085K8575R631
13854B75065K296r272L426o46M004K0864K4002N532j4519O96J078J7612K4485
13841C54623L5993L3151K2143J9266K5659L0409K4447J431O596n28Q851K0000
13829E82041J9012K2760K9821K5153K0422L0232M8809N5617N7601O3723Q1738
13818A036929Q6970P7829R3317J12055J27168J47339J95175K81266L32501L99240
13808B889789M88516N16096N34114N32157N41913N99018O79879Q58518J136618
13799H776618J579134K318501L606626N847440R487061J4382039J9449565K3145284
$$ plain form
13791 88592268 112109672 130943651 140593863 138758764 125729915 105143867 81572919
13784 81572919 59334920 41376439 28664331 20368010 15056873 11616655 9364877 7859050
13776 7859050 6816000 6077047 5531400 5073050 4623125 4162799 3686137 3205812 2755647
13767 2755647 2344401 1984514 1699833 1489075 1325050 1186921 1078460 975686 882257 829634
13757 829634 761247 721004 677193 627983 593049 561066 526149 498121 469183 435110 395195
13746 395195 352539 327747 321280 293232 271617 272659 272631 280818 293815 307624 313395 307311 310518
13733 310518 326306 335914 337590 332779 323809 308817 304022 312779 326666 351066 385116 398075 381983
13720 381983 371331 338210 306095 282348 260253 250130 261696 265477 263316 256115 223696 201434
$$ packed form
13791H8592268K3517404J8833979R650212j835099j3028849k0586048k3570948
13784H1572919k2237999j7958481j2712108q296321n311137l440218k251778j505827
13776G859050j043050p38953n45647m58350m49925m60326m76662m80325m50165
13767B755647m11246l59887k84681k10758j64025j38129j08461j02774r3429n2623
13757H29634o8387m0243m3811m9210l4934l1983l4917k8028k8938l4073l9915
13746C95195m2656k4792o467k8048k1615J042k8Q187J2997J3809N771o084L207
13733C10518J5788R608J676m811q970j4992m795Q757J3887K4400L4050J2959j6092
13720C81983j0652l3121l2115k3747k2095j0123J1566L781k161p201l2419k2262
$$ plain form
13708 201434 187509 167913 166137 164880 130025 114646 117205 112789 98543 93613 83663 79115 86344
13695 86344 81682 58264 43201 49524 40636 47060 53907 64268 57517 64471 61830 66804 78100
13682 78100 71139 68020 66464 72768 77518 88552 98131 89329 79024 68278 57392 42013 49078
13669 49078 51635 56492 89606 104115 117315 133931 140875 143963 141894 129353 110498 89023 75484
13656 75484 59113 54520 52230 54367 54677 54769 59363 80667 80447 61087 51353 47954 45361 44667 47071
13641 47071 49279 49142 32525 288 -14084 -10635 -18039 -24048 -30792 -25772 -17826 -19681 -15989 -16944
13627 -16944 -20441 -21234 -5436 -4537 -12207 -25480 -31355 -38137 -27821 -17092 -10891 2986 7773 6530
13613 6530 10970 -356 -18836 -16699 6622 17377 8093 -4841 -7036 -11530 -17006 -10551 10622
$$ packed form
13708B01434j3925j9596j776j257l4855j5379K559m416j4246m930r950m548P229
13695H6344m662k3418j5063O323q888O424O847J0361o751O954k641M974J1296
13682G8100o961l119j556O304M750J1034R579q802j0305j0746j0886j5379P065
13669D9078K557M857L3114J4509J3200J6616O944L088k069j2541j8855k1475j3539
13656G5484j6371m593k290K137L10R2M594K1304k20j9360r734l399k593o94K404
13641D7071K208j37j6617l2237j4372L449p404o009o744N020P946j855L692r55
13627a6944l497p93J5798Q99p670j3273n875o782J0316J0729O201J3877M787j243
13613F530M440j1326j8480K137K3321J0755r284j2934k195m494n476O455K1173
$$ plain form
13600 10622 -1216 -17785 -20104 -17943 -17796 -24277 -46531 -48882 -46578 -46236 -34534 -29242 -29069 -24430
13586 -24430 -22524 -27948 -19765 -18932 -16653 -2957 -9418 -7869 -12819 -11663 -12759 -30324 -40098 -44184
13572 -44184 -45018 -25657 -3252 5527 9686 11747 4665 -5018 -15840 -23598 -17965 -21345 -37706 -40664
13558 -40664 -46317 -43039 -52565 -53244 -51027 -43889 -29014 -18822 -24704 -33818 -34865 -41618 -38756 -22561
13544 -22561 -20778 -28961 -43035 -58153 -41923 -27180 -31083 -37911 -38451 -31918 -34370 -35428 -33404 -33366
13530 -33366 -32581 -49132 -64302 -68723 -66745 -71087 -77436 -81987 -85505 -95245 -98456 -99339 -110795 -105959
13516 -105959 -90990 -92600 -105290 -117273 -125695 -130114 -128427 -119591 -117944 -112173 -106383 -81558 -18799
13503 -18799 85874 234189 397539 566321 711839 787727 791873 738547 654771 556298 452948
$$ packed form
13600A0622j1838j6569k319K161J47o481k2254k351K304L42J1702N292J73M639
13586b4430J906n424Q183Q33K279J3696o461J549m950J156j096j7565r774m086
13572d4184q34J9361K2405Q779M159K061p082r683j0822p758N633l380j6361k958
13558d0664n653L278r526o79K217P138J4875J0192n882r114j047o753K862J6195
13544b2561J783q183j4074j5118J6230J4743l903o828n40O533k452j058K024L8
13530c3366P85j6551j5170m421J978m342o349m551l518r740l211q83j1456M836
13516a05959J4969j610j2690j1983q422m419J687Q836J647N771N790K4825O2759
13503a8799J04673J48315J63350J68782J45518P5888M146n3326q3776r8473j03350
$$ plain form
13492 452948 371411 297290 242838 227481 200019 175847 144064 124546 127126 137614 132979 107654
13480 107654 98694 97764 86348 62751 44793 47267 45039 55842 75305 72277 68607 73075 51253
13467 51253 31566 26980 23437 35004 47823 55165 37578 41649 55251 45098 26028 19737 19946
13454 19946 24056 15309 14255 24618 23943 16904 12250 11840 20733 29274 20827 10402 7851 6626
13440 6626 3211 1357 -10676 604 13753 20751 17421 10644 17137 24379 22770 8357 4713 -7054
13426 -7054 -8998 11973 14485 6120 16865 18719 6879 -8020 -13580 -7779 1197 -806 -13721
13413 -13721 -13591 -4689 86 2402 -6012 -16169 -2334 14181 9235 4751 -8252 -5692 -1208 -6683
13399 -6683 8057 8701 20436 18639 48315 51679 31097 12894 2498 -4102 4941 9408 9221 12838
$$ packed form
13492D52948q1537p4121n4452j5357k7462k4172l1783j9518K580J0488m635k5325
13480A07654q960r30j1416k3597j7958K474k228J0803J9463l028l670M468k1822
13467E1253j9687m586l543J1567J2819P342j7587M071J3602j0153j9070o291K09
13454A9946M110q747j054J0363o75p039m654m10Q893Q541q447j0425k551j225
13440F626l415j854j2033J1280J3149O998l330o777O493P242j609j4413l644j1767
13426g054j944K0971K512q365J0745J854j1840j4899n560N801Q976k003j2915
13413a3721J30Q902M775K316q414j0157J3835J6515m946m484j3003K560M484n475
13399f683J4740O44J1735j797K9676L364k0582j8203j0396o600R043M467j87L617
$$ plain form
13385 12838 19525 19076 27498 35579 27572 16891 24126 36647 41372 42756 34661 23103 10139 6212
13371 6212 9781 16688 12675 5269 11907 792 -290 5016 -858 3271 18538 27694 26773 24084
13357 24084 37683 34605 32685 38865 43831 53171 54222 43779 34186 22869 6816 10983 22562
13344 22562 26527 24968 27548 11960 -5295 1854 -14574 -18306 -20354 -10130 -5590 -2305 6337
13331 6337 3897 4797 327 8726 14677 12935 24074 39142 38596 29574 25266 16086 24314 34201 29714
13316 29714 32509 34392 41509 60975 71217 67048 69390 92375 125361 183725 265272 364889 479929
13303 479929 599025 677586 712785 702796 638077 529041 422938 319882 229160 161028 112094
13292 112094 95556 75846 63196 65236 58999 50549 49110 40998 46644 36172 19905 20063 29442
$$ packed form
13385A2838O687m49Q422Q081q007j0681P235J2521M725J384q095j1558j2964l927
13371F212L569O907m013p406O638j1115j082N306n874M129J5267R156r21k689
13357B4084J3599l078j920O180M966R340J051j0443r593j1317j6053M167J1579
13344B2562L965j559K580j5588j7255P149j6428l732k048J0224M540L285Q642
13331F337k440R00m470Q399N951j742J1139J5068n46r022m308r180Q228R887m487
13316B9714K795J883P117J9466J0242m169K342K2985L2986N8364Q1547R9617J15040
13303D79929J19096P8561L5199r989o4719j09036j06103j03056r0722o8132m8934
13292A12094j6538j9710j2650K040o237q450j439q112N646j0472j6267J58R379
$$ plain form
13279 29442 29321 24082 22220 32924 42599 32838 16810 6300 -5291 -3444 11639 9204 20453
13266 20453 23187 17104 2100 -12171 -9494 13594 6886 -2837 -12168 -12851 -2830 -5289 2327 1656
13252 1656 8768 2225 -10116 -8201 -12352 -18157 -8567 -10744 -4722 874 -3985 -187 -8042 -17565
13238 -17565 -13549 3940 22691 28959 44482 54705 48937 52398 54399 42083 22266 17847 12645
13225 12645 -1897 -11713 -24258 -24496 -14933 -979 5004 11015 6915 3801 5052 3103 -4475 5185
13211 5185 8596 15638 5688 -15117 -18592 -10977 -6468 -16012 -21629 -11342 -1880 7578 22311 31097
13197 31097 22843 22435 13908 -2158 -3139 3417 19291 38909 31772 43322 71015 69785 70776 69757
13183 69757 54529 37329 27078 25654 27839 19748 22169 31571 38490 39161 29357 27405 24298 16856
$$ packed form
13279B9442j21n239j862J0704R675r761j6028j0510j1591J847J5083k435J1249
13266B0453K734o083j5004j4271K677K3088o708r723r331o83J0021k459P616o71
13252A656P112o543j2341J915m151n805R590k177O022N596m859L798p855r523
13238a7565M016J7489J8751O268J5523J0223n768L461K001j2316j9817m419n202
13225A2645j4542r816j2545k38R563J3954N983O011m100l114J251j949p578R660
13211E185L411P042r950k0805l475P615M509r544n617J0287R462R458J4733Q786
13197C1097q254m08q527j6066r81O556J5874J9618p137J1550K7693j230R91j019
13183F9757j5228j7200j0251j424K185q091K421R402O919O71r804j952l107p442
$$ plain form
13169 16856 10349 20272 25304 25438 30767 37102 39323 41863 36811 18242 10221 10118 19839 39407
13155 39407 48915 49401 44208 24249 18862 18530 10984 93 18325 35008 33374 34534 28853 22241
13141 22241 27447 25047 8886 1835 22016 23871 18383 18505 30372 39238 61687 71698 59625
13128 59625 48682 35272 25596 23245 29321 26428 16813 2121 2478 21004 15674 13058 24982
13115 24982 31138 27079 26402 2817 -6574 15185 27752 35496 24633 8859 11365 17986 -1015
13102 -1015 -9895 761 -9293 -23468 -16585 -8711 -4329 -14393 -9955 14139 30770 28807 26421
13089 26421 31284 33781 37480 16597 6724 4619 -2245 -13546 -8483 -3399 972 -9900 -11683 -4761
13075 -4761 3102 6411 7653 -1513 -1438 -2224 -3777 -13087 -11159 -58 6923 6959 -874 -308 17645 18576
$$ packed form
13169A6856o507R923N032J34N329O335K221K540n052j8569q021j03R721J9568
13155C9407R508M86n193j9959n387l32p546j0891J8232J6683j634J160n681o612
13141B2241N206k400j6161p051K0181J855n488J22J1867Q866K2449J0011j2073
13128E9625j0943j3410r676k351O076k893r615j4692L57J8526n330k616J1924
13115B4982O156m059o77k3585r391K1759J2567P744j0863j5774K506O621j9001
13102a015q880J0656j0054j4175O883P874M382j0064M438K4094J6631j963k386
13089B6421M863K497L699k0883r873k105o864j1301N063N084M371j0872j783O922
13075d761P863L309J242r166P5p86j553r310J928J1101O981L6p833N66J7953R31
$$ plain form
13059 18576 22513 16678 22863 14805 15413 4562 1822 7274 5147 -4998 -8112 2316 4293 -6682
13045 -6682 -16035 -3034 -4601 -6283 -2653 22191 10773 9041 14313 3192 5526 7768 10918 7646
13031 7646 7883 10222 12289 24517 18326 7752 6630 3325 -5329 -8680 -14816 -12462 4119 4368
13017 4368 3410 1958 317 10865 -760 -11891 -8953 -3796 -3679 -6855 11961 17810 8645 -1611
13003 -1611 -8830 1977 10221 1342 -2366 2754 223 11015 8229 -1270 -13629 -23942 -453
12990 -453 13595 8123 2151 16292 6187 -12488 -11773 -3140 6452 7689 -6823 -16590 -3835 6105
12976 6105 -6790 -3842 -2320 -13491 -24250 -31343 -35339 -35442 -31908 -26166 -19589 -15753 -11120 -13430
12962 -13430 -13539 -5861 4725 13381 6630 -5512 -3461 -551 3083 234 -3588 -3440 8209 8531
$$ packed form
13059A8576L937n835O185q058O08j0851k740N452k127j0145l114J0428J977j0975
13045f682r353J3001j567j682L630K4844j1418j732N272j1121K334K242L150l272
13031G646K37K339K067J2228o191j0574j122l305q654l351o136K354J6581K49
13017D368r58j452j641J0548j1625j1131K938N157J17l176J8816N849r165j0256
13003a611p219J0807Q244q879l708N120k531J0792k786r499j2359j0313K3489
12990d53J4048n472n972J4141j0105j8675P15Q633R592J237j4512r767J2755R940
12976F105j2895K948J522j1171j0759p093l996j03L534N742O577L836M633k310
12962a3430j09P678J0586Q656o751j2142K051K910L634k849l822J48J1649L22
$$ plain form
12948 8531 4740 864 -5760 -5448 -11234 -5091 -830 11132 20655 21961 14880 11693 10664 1879 -14957
12933 -14957 -3161 2302 2100 3013 4664 14881 23672 7712 -7697 -24570 -23898 -9152 1724
12920 1724 -245 -11565 -7341 -6117 -14661 -18776 -22800 -30137 -30530 -16616 -62 -1177 2051 10488
12906 10488 10972 -14027 -22852 -12759 -8330 -11314 -16992 -31061 -13008 -8487 -19779 -26035 -18926
12893 -18926 -5158 10746 2791 -4924 -13210 -7925 -5402 -978 -11043 -28005 -25256 -12495 -5246
12880 -5246 8271 -6549 -20515 -6150 9856 12347 8128 9935 12699 12977 8562 11144 10448 8698
12866 8698 18309 33544 15224 3040 2249 -4859 -25778 -17818 -17623 -16587 -10040 -9940 -14034 -12380
12852 -12380 -10014 -8417 -9070 2793 15150 19084 9213 -9454 -15211 -13839 -18525 -1289 24194
$$ packed form
12948H531l791l876o624L12n786O143M261J1962R523J306p081l187j029q785j6836
12933a4957J1796N463k02R13J651J0217Q791j5960j5409j6873O72J4746J0876
12920A724j969j1320M224J224q544m115m024p337l93J3914J6554j115L228Q437
12906A0488M84k4999q825J0093M429k984n678j4069J8053M521j1292o256P109
12893a8926J3768J5904p955p715q286N285K523M424j0065j6962K749J2761P249
12880e246J3517j4820j3966J4365J6006K491m219J807K764K78m415K582o96j750
12866H698R611J5235j8320j2184p91p108k0919P960J95J036O547J00m094J654
12852a2380K366J597o53J1863J2357L934r871j8667n757J372m686J7236K5483
$$ plain form
12839 24194 22836 -4906 -8549 5255 -1859 -704 885 -18350 -4385 -3256 -22625 -17468 -28
12826 -28 14972 18092 12156 8210 10575 -4476 -2848 8763 15128 9575 5665 751 -10492 -11151
12812 -11151 -19481 -19963 -8352 -6269 -3564 -13181 -22367 -31561 -26558 -9205 15627 18078 14467 -386
12798 -386 -6709 -14229 -18217 -7060 -2055 -1086 -1948 -17545 -13159 -7668 -15388 -24557 -14742 -17505 -24597
12783 -24597 -9608 -9144 2455 9152 8303 -5751 -16423 -12816 -10917 -19244 -17970 -8311 493 -3329
12769 -3329 -15535 -12299 -9666 -4301 -3578 -17990 -23895 -14173 -2138 3561 -2352 -853 20359 17559
12755 17559 -5952 -8082 -7352 -6216 -12208 -25222 -35885 -43397 -40866 -33351 -17430 -12575 -2607 -4084
12741 -4084 -11543 -11461 -11262 -9323 -8764 -3337 5754 -3902 -596 -23325 -30194 -21591 -21370 -34323 -30742
$$ packed form
12839B4194j358k7742l643J3804p114J155J589j9235J3965J129j9369N157J7440
12826b8J5000L120n936l946K365j5051J628J1611O365n553l910m914j1243o59
12812a1151q330m82J1611K083K705r617r186r194N003J7353K4832K451l611j4853
12798c86o323p520l988J1157N005R69q62j5597M386N491p720r169R815k763p092
12783b4597J4989M64J1599O697q49j4054j0672L607J899q327J274R659Q804l822
12769c329j2206L236K633N365P23j4412n905R722J2035N699n913J499K1212k800
12755A7559k3511k130P30J136n992j3014j0663p512K531P515J5921M855R968j477
12741d084p459Q2J99J939N59N427R091r656L306k2729o869Q603K21j2953L581
$$ plain form
12726 -30742 -37108 -34718 -30390 -19995 1078 4901 9782 -8149 -17468 -24826 -19701 -21848 -15664 -6349
12712 -6349 5683 5081 4209 5347 -17466 -16989 -11036 -3465 -5871 -2280 9622 9223 -4844 -10041 -15231
12697 -15231 -26977 -25602 -19834 -14689 -11696 -7649 -5568 -5685 -18545 -12710 -10007 -2688 6172 -12751
12683 -12751 -25513 -23799 -26583 -23518 -21379 -23389 -15178 -6728 3681 -10230 -14193 651 5660
12670 5660 8705 7670 -596 1984 2347 -69 9620 -3277 -14105 -4246 3219 5097 20021 7554
12656 7554 -5212 -16078 -17742 -16840 -16641 -7167 4520 718 -7412 -3439 -8466 1160 13690 14933
12642 14933 3185 -2191 -708 9322 -2560 -12163 -18751 -16510 -13109 -1132 3786 37 5333
12629 5333 -4296 524 4186 1775 -6819 -20942 -30882 -19119 -2308 5791 9119 13733 20031 2750
$$ packed form
12726c0742o366K390M328J0395K1073L823M881j7931r319p358N125k147O184R315
12712f349J2032o02q72J138k2813M77N953P571k406L591J1902l99j4067n197n190
12697a5231j1746J375N768N145K993M047K081j17j2860N835K703P319Q860j8923
12683a2751j2762J714k784L065K139k010Q211Q450J0409j3911l963J4844N009
12670E660L045j035q266K580L63k416R689j2897j0828R859P465J878J4924j2467
12656G554j2766j0866j664R02J99R474J1687l802q130L973n027R626J2530J243
12642A4933j1748n376J483J0030j1882r603o588K241L401J1977M918l749N296
12629E333r629M820L662k411q594j4123r940J1763J6811Q099L328M614O298j7281
$$ plain form
12615 2750 -10079 -13988 -5961 -5171 -8023 -7460 -14011 -2319 -8654 -8341 -16678 -31399 -24339 -2606
12601 -2606 -6875 -23190 -25953 -16922 -18067 -23730 -11096 -3104 -5491 -3429 -4575 -1299 6582 -6202
12587 -6202 347 1197 250 204 5673 4956 1372 -21646 -32724 -30993 -21156 -24232 -20430 -16178 -2865
12572 -2865 6171 23374 32013 14164 -4543 -5651 13075 18064 6239 7083 12219 32 8800
12559 8800 17809 27660 29209 32780 30141 18901 6778 -3255 74 8367 -7089 3109 10804
12546 10804 7089 2515 4156 -4260 -13961 -11284 11562 9828 9756 6084 5290 11620 6098 9361 19356
12531 19356 28446 24214 24596 22854 18220 28030 43033 55430 68336 77656 67483 61492 52634 41588
12517 41588 18353 1804 -2118 -251 2455 -3193 -3489 -12541 -7340 5055 13549 11203 6751 9703
$$ packed form
12615B750j2829l909Q027P90k852N63o551J1692o335L13q337j4721P060K1733
12601b606m269j6315k763R031j145n663J2634P992k387K062j146L276P881j2784
12587f202O549Q50r47m6N469p17l584k3018j1078J731R837l076L802M252J3313
12572b865R036J7203Q639j7849j8707j108J8726M989j1825Q44N136j2187Q768
12559H800R009R851J549L571k639j1240j2123j0033L329Q293j5456J0198P695
12546A0804l715m574J641q416r701K677K2846j734p2l672p94O330n522L263R995
12531A9356R090m232L82j742m634R810J5003J2397J2906R320j0173n991q858j1046
12517D1588k3235j6549l922J867K706n648k96r052N201J2395Q494k346m452K952
$$ plain form
12503 9703 357 1852 -758 -9126 -6217 -15958 -10950 -19979 -39910 -27178 -12836 -13548 -6913 -4115
12489 -4115 7942 8418 4233 24123 38298 38774 35667 43207 34926 28356 38832 58250 60223 52154
12475 52154 43017 36633 19326 6250 17204 19953 17092 17245 6887 -7466 -12392 -5078 -6426
12462 -6426 -2855 3089 5272 -1462 -11898 -12173 10145 5033 2635 -76 -10082 -12715 -18253 -15591
12448 -15591 -27986 -14169 -3570 -15132 -10960 -9782 3382 18069 22499 14548 7840 14625 24529
12435 24529 6213 -12313 -14596 -8077 -6069 -2401 48 -13261 -5595 -3433 -1869 1220 -5144 -1705
12421 -1705 -5400 -12477 -20585 -19157 -15267 -3654 -5742 -2137 5143 15194 5034 -7576 5349
12408 5349 20445 -4949 -22251 -21170 -19563 -11197 -1266 1312 -1631 -4683 -11246 -18042 -17252 -19229
$$ packed form
12503I703r346J495k610q368K909r741N008r029j9931J2732J4342p12O635K798
12489d115J2057M76m185J9890J4175M76l107P540q281o570J0476J9418J973q069
12475E2154r137o384j7307j3076J0954K749k861J53j0358j4353m926P314j348
12462f426L571N944K183o734j0436k75K2318n112k398k711j0006k633n538K662
12448a5591j2395J3817J0599j1562M172J178J3164J4687M430p951o708O785R904
12435B4529j8316j8526k283O519K008L668K449j3309P666K162J564L089o364L439
12421a705l695p077q108J428L890J1613k088L605P280J0051j0160j2610J2925
12408E349J5096k5394j7302J081J607Q366R931K578k943l052o563o796P90j977
$$ plain form
12394 -19229 -23382 -15983 -7589 -9701 -9518 -7807 -10581 -21987 -19290 -3572 949 4174 -210 11732
12380 11732 12268 7706 10203 8114 -1208 -9364 -9438 -6371 -4535 -2441 -11494 -6835 -2087 270 -7249
12365 -7249 1029 9165 6333 5074 4971 18869 26653 11924 8167 2069 25582 33004 34301 34634
12351 34634 15352 21569 17332 2575 -12704 -20877 -14281 271 9481 2935 -4314 -8297 -11972
12338 -11972 -15723 -4855 4102 10815 13598 15532 -1278 1137 526 -2009 -12882 -24680 -23491 -16756
12324 -16756 -16843 -5718 -5998 1475 4414 2783 7752 14223 11491 17614 15002 10211 -3646 3774 1308
12309 1308 -5725 -9823 3078 -16753 -9216 305 -524 -5608 -2638 -6894 -18529 -13192 -5553 -2690
12295 -2690 -963 -6073 -1370 -8530 -14983 -13350 -18105 -25036 -19056 -31851 -18118 -4375 -13353 -22971
$$ packed form
12394a9229m153P399Q394k112J83J711k774j1406K697J5718M521L225m384J1942
12380A1732N36m562K497k089r322q156p4L067J836K094r053M659M748K357p519
12365g249Q278Q136k832j259j03J3898P784j4729l757o098K3513P422J297L33
12351C4634j9282O217m237j4757j5279q173O596J4552R210o546p249l983l675
12338a1972l751J0868Q957O713K783J934j6810K415o11k535j0873j1798J189O735
12324a6756q7J1125k80P473K939j631M969O471k732O123k612m791j3857P420k466
12309A308p033m098J2901j9831P537R521q29n084K970m256j1635N337P639K863
12295b690J727n110M703p160o453J633m755o931N980j2795J3733J3743q978r618
$$ plain form
12281 -22971 -27812 -20627 -23690 -24124 -15939 -14952 -21328 -16765 -12260 -1651 12406 15469 2860 770
12267 770 -5708 -10098 -695 -5798 -1390 11035 9889 -7473 -6853 8004 17721 16586 -1261 -5725
12253 -5725 -9281 -4629 -8462 -16159 -12020 -12218 -10389 -20573 -9095 6822 6173 6597 5776 2527 1989
12238 1989 -3994 1767 12193 5379 -7125 -23002 -24251 -30049 -23756 -25527 -10650 8598 5905
12225 5905 79 3471 4662 5505 17210 29381 22108 19683 16942 15327 23221 23462 16391 13121 4705
12210 4705 -8190 -4755 2065 10728 12990 6456 -6929 -3910 7758 11034 21328 4253 -6720
12197 -6720 2887 13012 21117 21441 15812 2735 -7208 -8812 -6735 11113 20427 17544 20244 15391
12183 15391 16045 41903 64590 96632 121103 112239 83661 48061 42292 35599 32723 22984 20368
$$ packed form
12281b2971m841P185l063m34Q185R87o376M563M505J0609J4057L063j2609k090
12267G70o478m390R403n103M408J2425j146j7362O20J4857R717j135j7847m464
12253e725l556M652l833p697M139j98J829j0184J1478J5917o49M24q21l249n38
12238A989n983N761J0426o814j2504j5877j249n798O293j771J4877J9248k693
12225E905n826L392J191Q43J1705J2171p273k425k741j615P894K41p071l270q416
12210D705j2895L435O820Q663K262o534j3385L019J1668L276J0294j7075j0973
12197f720R607J0125Q105L24n629j3077r943j604K077J7848R314k883K700m853
12183A5391O54K5858K2687L2042K4471q864k8578l5600n769o693k876r739k616
$$ plain form
12170 20368 12120 13686 4995 -3199 -1553 -461 11630 32599 14338 -2269 -8333 -10910 -6679
12157 -6679 -8965 -16226 -7215 4564 4291 13521 21626 24474 15351 22043 16597 21614 19739 20044 34989
12142 34989 29074 22280 37900 79312 130160 206839 308875 373960 344124 253087 168466 125811
12130 125811 97057 67376 41674 33284 24086 14556 9336 2905 16724 12518 10686 2376 5292
12117 5292 21011 17915 13674 15553 18667 25477 31983 26665 15423 -390 -7314 -7788 5221 30243
12103 30243 45315 39002 36208 28676 22182 23959 37441 51532 78016 119150 181139 278678 371507
12090 371507 397132 346772 258247 169508 101486 67567 47717 41750 34833 32928 26847 13262
12078 13262 2295 -4828 -4565 1982 6892 16090 19944 9775 25369 22553 27740 16857 4188
$$ packed form
12170B0368q248J566q691q194J646J092J2091K0969j8261j6607o064k577M231
12157f679k286p261R011J1779k73R230Q105K848r123O692n446N017j875L05J4945
12142C4989n915o794J5620M1412N0848P6679J02036O5085k9836r1037q4621m2655
12130A25811k8754k9681k5702q390r198r530n220o431J3819m206j832q310K916
12117E292J5719l096m241J879L114O810O506n318j1242j5813o924m74J3009K5022
12103C0243J5072o313k794p532o494J777J3482J4091K6484M1134O1989R7539R2829
12090C71507K5625n0360q8525q8739o8022l3919j9850n967o917j905o081j3585
12078A3262j0967p123K63O547M910R198L854j0169J5594k816N187j0883j2669
$$ plain form
12065 4188 12298 11481 11420 6995 7938 14796 18584 6280 -7137 -4 16874 19306 7151 9387 27531
12050 27531 41359 48932 74634 111880 135203 117083 83481 51423 32919 15137 10341 9586
12038 9586 -5283 -15728 -18251 -12354 -4429 -9479 -7878 7754 13539 15922 20726 15776 11003 13913
12024 13913 15545 7938 8545 11560 15664 13792 1786 -19083 -13809 13066 24957 29615 26128 13044
12010 13044 -1984 -7104 -20165 -9128 -17466 -12289 -1870 6312 12311 9089 615 -6386 718
11997 718 -1595 -2114 320 10279 20485 13450 -3040 -178 8203 -2533 -8411 849 2761 3126 13793
11982 13793 19131 33276 33169 20829 14981 18583 10714 3280 5082 4740 -779 8541 5464 10045
11968 10045 4780 -18675 -26225 -19947 -19140 3183 8475 -5398 -15025 -3848 -2569 -18130 -21124
$$ packed form
12065D188Q110q17o1m425R43O858L788j2304j3417P133J6878K432j2155K236J8144
12050B7531J3828P573K5702L7246K3323j8120l3602l2058j8504j7782m796p55
12038I586j4869j0445k523N897P925n050J601J5632N785K383M804m950m773K910
12024A3913J632p607O07L015M104j872j2006k0869N274K6875J1891M658l487j3084
12010A3044j5028n120j3061J1037q338N177J0419Q182N999l222q474p001P104
11997G18k313n19K434R959J0206p035j6490K862Q381j0736n878R260J912L65J0667
11982A3793N338J4145j07j2340n848L602p869p434J802l42n519R320l077M581
11968A0045n265k3455p550O278Q07K2323N292j3873r627J1177J279j5561k994
$$ plain form
11955 -21124 -15049 -5470 9251 564 -12791 -10768 -8654 618 7190 -1771 -10393 -12972 -13118 -14678
11941 -14678 -19687 -20601 -23663 -29351 -25719 -13197 -14635 -19912 -10808 6344 14968 14713 13595 21149
11927 21149 16563 8229 -8565 -21532 -1959 5060 9338 9265 2624 6855 9195 14113 1188 -5648
11913 -5648 -11511 -1095 2109 -1579 -1744 -7440 1240 9583 4725 4444 10344 -1824 -621 9480
11899 9480 17650 20535 9050 -2578 271 20772 17698 21543 25730 6866 -2160 -4743 -26920
11886 -26920 -25099 -23490 -14672 -11466 -10935 -4468 2075 2354 4152 -761 -3361 -11065 107 4690 15556
11871 15556 7582 -1780 -2621 -8009 -41 14252 6213 -2937 -6003 -6380 -3962 -10191 -16189 -19640 -12118
11856 -12118 -8535 -536 17487 21007 23530 30854 34432 29578 6365 -13000 -31311 -34376 -16217
$$ packed form
11955b1124O075R579J4721q687j3355K023K114R272O572q961q622k579j46j560
11941a4678n009r14l062n688L632J2522j438n277R104J7152Q624k55j118P554
11927B1149m586q334j6794j2967J9573P019M278p3o641M231K340M918j2925o836
11913e648n863J0416L204l688j65n696Q680Q343m858k81N900j2168J203J0101
11899I480Q170K885j1485j1628K849K0501l074L845M187j8864r026k583k2177
11886b6920J821J609Q818L206N31O467O543K79J798m913k600p704J1172M583J0866
11871A5556p974r362q41n388P968J4293q039r150l066l77K418o229n998l451P522
11856a2118L583P999J8023L520K523P324L578m854k3213j9365j8311l065J8159
$$ plain form
11843 -16217 -4866 -1600 -13940 -11832 15296 11637 3775 5032 1142 3469 -2938 4570 2447 -10391
11829 -10391 -8692 -2083 6362 9457 554 -3540 -11847 -3996 -18146 -24176 -17493 -2983 4154 -9279
11815 -9279 -10420 -2964 1016 -10063 777 12136 4983 4203 13065 15295 11246 7760 -959 -10142
11801 -10142 -14706 -3061 -1179 -13148 -22259 -15929 2896 11223 20199 12299 -7451 -15644 -18923
11788 -18923 -6140 6499 7814 -2805 -1172 487 -10536 -10056 -15979 -24868 -33050 -15421 -826
11775 -826 13606 14105 20150 7000 5038 4880 6848 -563 -618 9338 1465 -82 -7668 -23671 -30039
11760 -30039 -24569 -6323 11990 18144 13098 14089 27512 41599 26111 18190 28040 24927 23620
11747 23620 23658 2156 -8907 -6151 -11530 -12190 -13897 -7042 -6156 -18499 -8989 1037 11614 17791
$$ packed form
11843a6217J1351L266j2340K108K7128l659p862J257l890K327o407P508k123j2838
11829a0391J699O609Q445L095q903m094q307P851j4150o030O683J4510P137j3433
11815i279j141P456L980j1079J0840J1359p153p80Q862K230m049l486q719r183
11801a0142m564J1645J882j1969r111O330J8825Q327Q976p900j9750q193l279
11788a8923J2783J2639J315j0619J633J659j1023M80n923q889q182J7629J4595
11775h26J4432M99O045j3150j962j58J968p411n5R956p873j547p586j6003o368
11760c0039N470J8246J8313O154n046R91J3423J4087j5488p921R850l113j307
11747B3620L8k1502j1063K756n379o60j707O855Q86j2343R510J0026J0577O177
$$ plain form
11733 17791 18060 16828 9837 11993 19171 16845 15907 6451 -3168 -11287 -10035 621 13 -8604 -13499
11718 -13499 -23049 -26810 -22689 -10462 -2779 -565 4605 -9907 -7773 -18528 -27398 -6877 3624
11705 3624 -5759 -17658 -13302 -397 10135 8776 7523 6809 322 12999 15687 12377 15149 5871
11691 5871 3219 4096 5627 456 -4547 5873 1208 -68 -3664 -16444 -13695 -10905 -2829 11319
11677 11319 14610 16523 27170 28199 12086 9256 18132 9401 3658 6406 15555 11639 10802 7540
11663 7540 4325 5104 122 4463 13339 16291 4062 -13655 -10050 -257 3639 21595 16661 13822
11649 13822 3908 7728 6199 13852 22832 25747 33071 33510 25633 13402 -9653 -21584 -15156 2074
11635 2074 21569 34101 32205 28854 31432 26443 25414 25193 18642 1348 -8947 -4115 -5824 93
$$ packed form
11733A7791K69j232o991K156P178k326r38r456r619q119J252J0656o08q617m895
11718a3499r550l761M121J2227P683K214N170j4512K134j0755q870K0521J0501
11705C624r383j1899M356J2905J0532j359j253p14o487J2677K688l310K772r278
11691E871k652Q77J531n171n003J0420m665j276l596j2780K749K790Q076J4148
11677A1319L291J913J0647J029j6113k830Q876q731n743K748R149l916q37l262
11663G540l215P79m982M341Q876K952j2229j7717L605R793L896J7956m934k839
11649A3822r914L820j529P653Q980K915P324M39p877j2231k3055j1931O428J7230
11635B074J9495J2532j896l351K578m989j029k21o551j7294j0295M832j709N917
$$ plain form
11621 93 17559 24024 22744 14863 -6874 -2278 15914 19093 20961 23957 37305 37078 19669 -574
11607 -574 5866 17408 25208 19836 16492 21850 19788 27727 29128 29538 30236 16534 20376 21202 26570
11592 26570 35192 36598 22336 8241 12027 9231 1735 3632 12047 -4374 4728 15182 6385
11579 6385 -7049 -2745 103 6483 33215 29727 13268 17159 24405 35790 27972 12108 7615
11566 7615 12806 -1181 -18658 -9739 -98 -14479 -10405 1105 11396 13635 15046 10816 8906
11553 8906 19825 40756 34831 18617 7898 12464 6626 3026 -5580 -13673 -12397 614 5858
11540 5858 3572 1214 9813 26743 18019 848 846 2034 6825 10968 24488 30342 26645 13340
11526 13340 7974 5103 14745 17657 12878 4844 -7145 12251 17956 -187 -3557 -6259 -10896 -6611
$$ packed form
11621I3J7466O465j280p881k1737M596J8192L179J868K996J3348k27j7409k0243
11607e74O440J1542P800n372l344N358k062P939J401M10O98j3702L842Q26N368
11592B6570Q622J406j4262j4095L786k796p496J897Q415j6421R102J0454q797
11579F385j3434M304K848O380K6732l488j6459L891P246J1385p818j5864m493
11566G615N191j3987j7477Q919R641j4381M074J1510J0291K239J411m230j910
11553H906J0919K0931n925j6214j0719M566n838l600q606q093J276J3011N244
11540E858k286k358Q599J6930q724j7171kJ188M791M143J3520N854l697j3305
11526A3340n366k871R642K912m779q034j1989J9396N705j8143l370k702m637M285
$$ plain form
11512 -6611 3778 23579 27788 29849 31002 32048 27332 34567 12719 3086 -2961 -13807 -10604 -19430
11498 -19430 -32274 -35953 -18614 580 -14 -5125 -5230 10445 18814 16677 14867 26471 26900 9974
11484 9974 -5821 -5434 347 16519 18657 13141 21485 36583 22243 21875 25296 16163 9622 3166
11470 3166 2010 5518 8669 10992 20807 15890 2216 6872 5461 -6189 -1941 8631 16185 8477
11456 8477 9904 13202 5039 4274 3048 -568 513 -8986 -17492 -5474 3092 818 -11615 -15617
11442 -15617 -23146 -15659 -712 1246 -3170 -12225 -8109 -7779 -19395 -10624 8331 15422 1865 -8231
11428 -8231 6277 23203 34466 22846 8726 4453 -6118 -15430 -11215 -17478 -25186 -15989 -9351
11415 -9351 1202 22358 17079 9376 13032 27361 29061 20051 28795 31019 32576 25456 25323 21189
$$ packed form
11512f611J0389J9801M209K061J153J046m716P235k1848r633o047j0846L203q826
11498a9430j2844l679J7339J9194n94n111j05J5675Q369k137j810J1604M29j6926
11484I974j5795L87N781J6172K138n516Q344J5098j4340l68L421r133o541o456
11470C166j156L508L151K323R815m917j3674M656j411j1650M248J0572P554p708
11456H477J427L298q163p65j226l616J081r499q506J2018Q566k274j2433m002
11442a5617p529P487J4947J958m416r055M116L30j1616Q771J8955P091j3557j0096
11428h231J4508J6926J1263j1620j4120m273j0571r312M215o263p708R197O638
11415i351J0553K1156n279p703L656J4329J700r010Q744K224J557p120j33m134
$$ plain form
11401 21189 6862 12021 17323 10978 11129 9416 6395 14422 15390 17705 10156 4969 -6654 -6592 -1525
11386 -1525 5198 -1735 -8916 -15247 -17186 -27120 -18080 -17911 -12360 5088 14263 13836 -4385 -11980 -5337
11371 -5337 -4612 -6942 8442 7960 2058 5054 15107 23102 36140 47284 46602 23841 21113 36317
11357 36317 31463 7724 -5281 -1697 3837 7058 8115 6545 31 3586 21366 23518 32459 28892
11343 28892 10800 8788 18907 31664 25038 21614 17628 14367 7090 -1619 6301 13998 23880 37473
11329 37473 37423 39643 35360 20608 8570 4689 5834 24142 41715 31966 12120 439 -455 8666
11315 8666 16608 28185 26153 13633 15154 19340 5863 6574 24567 32420 36380 45517 27224 13538
11301 13538 5994 17787 32895 31338 26668 27978 30369 33694 45226 40324 14716 16864 29095
$$ packed form
11401B1189j4327N159N302o345J51j713l021Q027R68K315p549n187j1623O2N067
11386a525O723o933p181o331j939r934R040J69N551J7448R175m27j8221p595O643
11371e337P25k330J5384m82n902K996J0053P995J3038J1144o82k2761k728J5204
11357C6317m854k3739j3005L584N534L221J057j570o514L555J7780K152Q941l567
11343B8892j8092k012J0119J2757o626l424l986l261p277q709P920P697R882J3593
11329C7473n0K220m283j4752j2038l881J145J8308J7573r749j9846j1681q94R121
11315H666P942J1577k032j2520J521M186j3477P11J7993P853L960R137j8293j3686
11301A3538p544J1793J5108j557m670J310K391L325J1532m902k5608K148J2231
$$ plain form
11288 29095 23156 9490 11881 23259 34074 34066 11379 7237 11755 9658 12140 15926 18001 12
11274 12 -1684 -10606 -16899 -3673 15226 21599 17862 -2354 -8556 -4881 -723 667 12831 26809
11260 26809 41139 42497 42719 37124 46769 48075 34132 27187 31984 52477 92440 136286 161216
11247 161216 194121 259460 374140 575255 898596 1307298 1567626 1471979 1088499 728295
11237 728295 493628 337977 234744 179711 151769 106671 79661 62095 34587 12706 -2450
11226 -2450 1815 22639 36076 36968 23607 22532 15878 7284 14540 29070 31162 15084 8678 858
11212 858 -335 3249 6414 15841 6612 -22856 -26272 -15957 -16054 1069 15447 11785 16346 14297
11198 14297 16584 18640 11311 -1105 -11606 -10645 -13832 -6366 -21992 -20190 -3819 3162 -5530 -4485
$$ packed form
11288B9095n939j3666K391J1378J0815qk2687m142M518k097K482L786K075j7989
11274A2j696q922o293J3226J8899O373l737k0216o202L675M158J390J2164J3978
11260B6809J4330J358K22n595R645J306j3943o945M797K0493L9963M3846K4930
11247A61216L2905O5339J14680K01115L23341M08702K60328r5647l83480l60204
11237G28295k34667j55651j03233n5033k7942m5098k7010j7566k7508k1881j5156
11226b450M265K0824J3437Q92j3361j075o654q594P256J4530K092j6078o406p820
11212H58j193L584L165R427r229k9468l416J0315r7J7123J4378l662M561k049
11198A4297K287K056p329j2416j0501R61l187P466j5626J802J6371O981q692J045
$$ plain form
11184 -4485 3829 12015 -2321 -6264 -14568 -4331 4233 -17854 -29244 -26681 -12366 -8406 -8065 -6909
11170 -6909 9 3813 -7390 -17980 -12981 -16189 -30493 -32746 -35502 -51233 -60402 -61693 -55098 -55274
11156 -55274 -53838 -51033 -61835 -60257 -61210 -70446 -77397 -84007 -84193 -82553 -96563 -95986 -91004 -79397
11142 -79397 -81594 -77982 -77779 -92958 -105117 -122338 -129151 -133255 -146882 -171083 -183203 -197715 -195485
11129 -195485 -222020 -262501 -288954 -326582 -376875 -444972 -561996 -730605 -965815 -1280698 -1602091
11118 -1602091 -1702695 -1339637 -685123 -180418 63382 171310 221316 245038 258040 258410
11108 258410 251089 228787 214556 218006 220943 219154 200264 168115 157566 163066 164773 162987 156204
11095 156204 156794 165600 156065 146672 141981 125019 119127 133682 149749 174664 213843 259070 286079
$$ packed form
11184d485Q314Q186j4336l943q304J0237Q564k2087j1390K563J4315L960L41J156
11170f909O918L804j1203j0590M999l208j4304k253k756j5731r169j291O595j76
11156e5274J436K805j0802J578r53r236o951o610j86J640j4010N77M982J1607
11142g9397k197L612K03j5179j2159j7221o813m104j3627k4201j2120j4512K230
11129a95485k6535m0481k6453l7628n0293o8097j17024j68609k35210l14883l21393
11118a602091j00604L63058O54514N04705K43800J07928N0006K3722J3002L70
11108B58410p321k2302j4231L450K937j789j8890l2149j0549N500J707j786o783
11095A56204N90Q806r535r393m691j6962n892J4555J6067K4915L9179M5227K7009
$$ plain form
11082 286079 276835 263587 236011 222353 205016 190821 159293 126665 105338 114706 120276 104102
11070 104102 98360 103366 111556 112676 107248 119158 127108 118685 113921 116189 112941 108139 104975 101545
11056 101545 101485 89905 91037 88435 77671 75807 75038 87305 95184 98289 114811 123618 125188 137459
11042 137459 139936 121417 96841 89780 85496 64556 66857 88208 102428 95202 97152 99121 89140
11029 89140 103062 120942 132862 127335 128751 126168 118159 107602 76661 75839 73913 67094 77067
11016 77067 93075 109158 109960 102043 105631 91224 89910 91305 89652 91429 92570 95456 95892 98656
11002 98656 96516 105594 110899 126579 129459 130633 123599 89093 69157 77643 88210 99093 105081
10989 105081 105282 122635 132224 140644 156621 164597 185238 200679 195175 171676 146240 111064 83639
$$ packed form
11082B86079r244j3248k7576j3658j7337j4195l1528l2628k1327R368N570j6174
11070A04102n742N006Q190J120n428J1910P950q423m764K268l248m802l164l430
11056A01545o0j1580J132k602j0764j864p69J2267P879L105J6522Q807J570J2271
11042A37459K477j8519k4576p061m284k0940K301K1351J4220p226J950J969r981
11029H9140J3922J7880J1920n527J416k583q009j0557l0941q22j926o819R973
11016G7067J6008J6083Q02p917L588j4407j314J395j653J777J141K886M36K764
11002I8656k140R078N305J5680K880J174p034l4506j9936Q486J0567J0883N988
10989A05081K01J7353R589Q420J5977P976K0641J5441n504k3499k5436l5176k7425
$$ plain form
10976 83639 77146 62736 65233 68777 63103 61197 51299 52962 57975 65833 94994 108579 96448
10963 96448 113877 130125 151227 168890 166718 164557 147983 99851 56263 76491 109424 149488
10951 149488 186896 193164 171179 160568 154972 147027 149591 148432 146430 153255 149486 150528 150109 160215
10937 160215 177008 184823 166639 173527 176602 178856 165057 151207 164897 175690 191695 186429
10925 186429 180035 179579 188178 191624 195484 194963 192637 202430 220045 227002 241684 252814 257006 275418
10911 275418 284277 285964 281558 274845 294934 299094 291404 299916 330864 352254 363988 366332 350882
10898 350882 346347 337637 329000 318520 322912 346555 374813 386727 398674 429358 455402 469653
10886 469653 465775 458409 456046 470461 511413 531801 544442 557036 600279 664934 726614 775391
$$ packed form
10976H3639o493j4410K497L544n674j906r898J663N013P858K9161J3585j2131
10963I6448J7429J6248K1102J7663k172k161j6574m8132m3588K0228L2933M0064
10951A49488L7408O268k1985j0611n596p945K564j159k002O825l769J042m19J0106
10937A60215J6793P815j8184O888L075K254j3799j3850J3690J0793J6005n266
10925A86429o394m56Q599L446L860n21k326R793J7615O957J4682J1130M192J8412
10911B75418Q859J687m406o713K0089M160p690Q512L0948K1390J1734K344j5450
10898C50882m535q710q637j0480M392K3643K8258J1914J1947L0684K6044J4251
10886D69653l878p366k363J4415M0952K0388J2641J2594M3243O4655O1680M8777
$$ plain form
10874 775391 805115 824095 819308 809627 807864 825963 857050 899444 956325 1016277 1078745 1132327
10862 1132327 1193843 1275140 1361793 1460755 1577132 1713783 1875208 2069386 2341517 2782635
10852 2782635 3360144 3911248 4127761 3944866 3746628 3764261 4018611 4435044 4954326 5558783
10842 5558783 6277746 7238480 8507232 10133771 12177921 14818342 18377886 23425612
10834 23425612 31002086 43278338 64623271 102193701 163625300 245243353 307983384
10827 307983384 299896216 225394219 148410129 97324949 66413147 47324472 34735237
10820 34735237 25741062 19260088 14768308 11662457 9475958 7912156 6735229 5801493
10812 5801493 5064349 4537539 4133497 3822628 3546271 3303736 3203144 3273304 3506198 3631596
$$ packed form
10874G75391K9724J8980m787r681j763J8099L1087M2394N6881N9952O2468N3582
10862A132327O1516Q1297Q6653R8962J16377J36651J61425J94178K72131M41118
10852B782635N77509N51104K16513j82895j98238J7633K54350M16433N19282O04457
10842E558783P18963R60734J268752J626539K044150K640421L559544N047726
10834B3425612P576474J2276252K1344933L7570430O1431599Q1618053O2740031
10827C07983384q087168p4501997p6984090n1085180l0911802j9088675j2589235
10820C4735237q994175o480974m491780l105851k186499j563802j176927r33736
10812E801493p37144n26810m04042l10869k76357k42535j00592P0160K32894J25398
$$ plain form
10802 3631596 3371596 2793708 2235321 1838271 1591060 1422109 1296132 1207946 1118629 1039057
10792 1039057 989171 933446 875924 819722 757803 695427 642019 600788 538494 464374 403323
10781 403323 375037 382814 404342 421294 417041 397092 371471 362544 365786 381797 365785 326145
10769 326145 292857 272773 271599 272182 270695 261769 261414 252119 244367 238717 231714 209622 183367 165121
10755 165121 178951 188261 188931 178860 157163 130865 126071 113977 96013 96344 90719 91199 95612
10742 95612 102287 98799 96034 107922 120033 128118 120743 110344 99699 97191 102458 98167 87718
10729 87718 79812 75481 76719 76113 79692 70597 63080 77403 82830 81595 64092 51474 47628 42661
10715 42661 53298 47696 48924 53094 56627 71058 72775 74508 83166 100372 118406 146154 182025
$$ packed form
10802C631596k60000n77888n58387l97050k47211j68951j25977q8186q9317p9572
10792A039057m9886n5725n7522n6202o1919o2376n3408m1231o2294p4120o1051
10781D03323k8286P777K1528J6952m253j9949k5621q927L242J6011j6012l9640
10769C26145l3288k0084j174N83j487q926l55r295p752n650p003k2092k6255j8246
10755A65121J3830R310O70j0071k1697k6298m794j2094j7964L31n625M80M413
10742I5612O675l488k765J1888J2111Q085p375j0399j0645k508N267m291j0449
10729H7718p906m331J238o06L579r095p517J4323N427j235j7503j2618l846m967
10715D2661J0637n602J228M170L533J4431J717J733Q658J7206J8034K7748L5871
$$ plain form
10702 182025 205628 218216 215742 178215 146902 135690 102883 75417 51818 58525 61149 51262
10690 51262 60154 63438 64641 82764 90747 87480 90069 68012 57893 74506 95266 88074 66922
10677 66922 26343 -18572 -54273 -73474 -60789 -41119 -36402 -38534 -31379 -24114 -10036 7566
10665 7566 20095 6837 1184 -8213 -14743 -15886 -21896 -24320 -33096 -33614 -29628 -22477 -25945 -23770
10651 -23770 8189 24081 18575 15485 10140 -762 -9201 -15476 -17605 -7968 -5727 -3655 3978 13262
10637 13262 14868 1186 -11052 -17153 -12300 -29095 -44837 -51804 -65622 -68235 -57072 -34839 -30499
10624 -30499 -44616 -47446 -39884 -32160 -34107 -28747 -29176 -37236 -22239 -11043 -27239 -45523 -43985
10611 -43985 -48276 -62173 -56778 -46135 -37244 -38968 -32923 -15500 -26189 -32243 -40967 -49572 -38073
$$ packed form
10702A82025K3603J2588k474l7527l1313j1212l2807k7466k3599O707K624r887
10690E1262Q892L284J203J8123P983l267K589k2057j0119J6613K0760p192k1152
10677F6922m0579m4915l5701j9201J2685J9670M717k132P155P265J4078J7602
10665G566J2529j3258n653r397o530j143o010k424q776n18L986P151l468K175
10651b3770L1959J5892n506l090n345j0902q439o275k129R637K241K072P633R284
10637A3262J606j3682j2238o101M853j6795j5742o967j3818k613J1163K2233M340
10624c0499j4117k830P562P724j947N360m29q060J4997J1196j6196j8284J538
10611d3985m291j3897N395J0643Q891j724O045J7423j0689o054q724q605J1499
$$ plain form
10598 -38073 -47808 -41565 -45034 -43903 -47732 -62168 -78232 -62708 -41754 -29200 -23575 -24286 -21591
10585 -21591 -11967 -29800 -40108 -32912 -36342 -37457 -49412 -64446 -61126 -58156 -45219 -35813 -44238
10572 -44238 -48333 -60869 -77248 -73153 -75393 -83232 -88642 -96024 -89234 -91588 -84245 -74608 -95047 -114661
10558 -114661 -120963 -132453 -154818 -162289 -177349 -174934 -169210 -176761 -185016 -182709 -188319 -203661 -224488
10545 -224488 -237412 -222890 -204752 -155315 -14197 308427 883254 1488543 1747423 1547637
10535 1547637 1214578 935290 732959 603293 502187 423241 369826 331685 295008 256200
10525 256200 238862 240981 226434 218367 200959 184718 166027 153724 159559 156329 141887 129650
10513 129650 117621 107430 100430 96465 83107 87917 79522 73317 75022 73568 70778 69973 79559 87246
$$ packed form
10598c8073r735O243l469J131l829j4436j6064J5524K0954J2554N625p11K695
10585b1591R624j7833j0308P196l430j115j1955j5034L320K970J2937R406q425
10572d4238m095j2536j6379M095k240p839n410p382O790k354P343R637k0439j9614
10558a14661o302j1490k2365p471j5060K415N724p551q255K307n610j5342k0827
10545b24488j2924J4522J8138M9437J41118L22624N74827O05289K58880j99786
10535A547637l33059k79288k02331j29666j01106p8946n3415l8141l6677l8808
10525B56200j7338K119j4547q067j7408j6241j8691j2303N835l230j4442j2237
10513A29650j2029j0191p000l965j3358M810q395o205J705j454k790q05R586P687
$$ plain form
10499 87246 79816 75622 76843 71235 61275 52012 54539 51214 50935 39120 39223 30033 18507 25327
10485 25327 43664 41605 43067 29318 22604 25824 25725 23510 21842 23858 30295 27894 16919 17856
10471 17856 39993 31974 23125 32883 26171 29507 31440 24107 14637 -4005 3995 122 5671 2247
10457 2247 3397 421 16462 18587 10650 7740 18098 27276 30976 34801 39734 32590 30167 31957
10443 31957 32226 38132 40956 29356 30261 32849 32493 39536 43085 49942 38106 31407 35983 42802 31543
10428 31543 26793 35937 44330 37963 39349 32910 44713 44401 66254 87320 97731 124706 149483
10415 149483 184365 258057 399203 603482 937971 1349085 1623497 1527605 1138378 743978
10405 743978 487732 344178 244677 187290 152976 126620 92553 73518 61834 56947 56862 48292
$$ packed form
10499H7246p430m194J221n608r960r263K527l325k79j1815J03r190j1526O820
10485B5327J8337k059J462j3749o714L220r9k215j668K016O437k401j0975R37
10471A7856K2137q019q849R758o712L336J933p333r470j8642Q000l873N549l424
10457B247J150k976J6041K125p937k910J0358R178L700L825M933p144k423J790
10443C1957K69N906K824j1600R05K588l56P043L549O857j1836o699M576O819j1259
10428C1543m750R144Q393o367J386o439J1803l12K1853K1066J0411K6975K4777
10415A49483L4882P3692J41146K04279L34489M11114K74412r5892l89227l94400
10405G43978k56246j43554r9501n7387l4314k6356l4067j9035j1684m887q5q570
$$ plain form
10393 48292 47269 56547 71236 82947 73560 59394 66412 45818 39655 37991 46743 41588 37340
10380 37340 22409 12267 9752 10539 2992 5741 4770 11037 4973 618 2996 4944 17282 7755
10366 7755 -2870 -16322 -17889 -24043 -34845 -33974 -31436 -28779 -32130 -30683 -16523 -8270 -2976 6338
10352 6338 4117 -2063 -5058 -18002 -24450 -39209 -42672 -25502 -9319 -1919 15015 12540 -1893
10339 -1893 -23265 -28751 -14969 -19046 -11988 -10698 -994 -358 -9775 -20231 -31967 -32553 -33745 -20969
10325 -20969 958 3085 -10011 -5669 -7515 -11233 -12809 -13657 -12435 -5157 -6202 -6963 -3940 -5783
10311 -5783 6326 32300 47632 43124 30292 29268 12092 3472 -9129 -12958 -20167 -37900 -35367
10298 -35367 -17438 -29089 -34011 -16757 -27214 -24658 -20986 -18433 8416 10719 2476 15713 15676
$$ packed form
10393D8292j023R278J4689J1711r387j4166P018k0594o163j664Q752n155m248
10380C7340j4931j0142k515P87p547K749r71O267o064m355K378J948J2338r527
10366G755j0625j3452j567o154j0802Q71K538K657l351J447J4160Q253N294R314
10352F338k221o180k995j2944o448j4759l463J7170J6183P400J6934k475j4433
10339a893k1372n486J3782m077P058J290R704O36r417j0456j1736n86j192J2776
10325b0969K1927K127j3096M342j846l718j576q48J222P278j045p61L023j843
10311e783J2109K5974J5332m508j2832j024j7176q620j2601l829p209j7733K533
10298c5367J7929j1651m922J7254j0457K556L672K553K6849K303q243J3237l7
$$ plain form
10285 15676 11045 -10187 -30078 -26456 -17706 -14144 -14138 -5356 -3613 -12640 -25684 -25227 -705 -1942
10271 -1942 2974 -3420 -10894 -8864 -6230 1090 -9177 -15817 -17898 -8931 -1399 -9593 -19066 -20577
10257 -20577 -9420 3360 4057 1870 1767 7133 6842 -2466 1903 -2654 -15013 -16061 -25291 -21581
10243 -21581 -20178 -14796 -19440 -17269 -3686 -1569 -3556 -11185 -21851 -20736 -1391 7850 5616 -8160
10229 -8160 -11641 6822 1865 -12194 -7755 -1772 9074 15797 12576 12329 9220 3196 2196 9005
10215 9005 5888 -2540 -2937 -9915 -10747 -11285 3529 5133 7157 10260 10298 6865 8602 -604 8190 14724
10199 14724 11470 -7673 -6988 15516 8190 1249 -2218 -10584 -4372 -1908 8498 16269 17036 17575
10185 17575 13775 13204 20395 18847 33713 53682 94840 153947 201307 201494 176822 143833 87816
$$ packed form
10285A5676m631k1232j9891L622Q750L562OQ782J743r027j3044M57K4522j237
10271a942M916o394p474K030K634P320j0267o640k081Q967P532q194r473j511
10257b0577J1157J2780O97k187j03N366k91r308M369m557j2359j048r230L710
10243b1581J403N382m644K171J3583K117j987p629j0666J115J9345R241k234j3776
10229h160l481J8463m957j4059M439N983J0846O723l221k47l109o024j000O809
10215I005l117q428l97o978q32n38J4814J604K024L103L8l433J737r206Q794O534
10199A4724l254j9143O85K2504p326o941l467q366O212K464J0406P771P67N39
10185A7575l800n71P191j548J4866J9969M1158N9107M7360J87k4672l2989n6017
$$ plain form
10172 87816 50339 42654 39069 26278 6585 5488 -1914 -5405 555 155 -7660 -17221 -12086 -14161
10158 -14161 -13243 -1943 12701 25299 27191 21123 20464 14854 981 -10803 -19950 -18795 -16314 -18587
10144 -18587 -28931 -24501 -17341 -12271 -7973 -14295 -14030 -12474 -17170 -10826 -7238 9495 6790 1585
10130 1585 3733 -815 8352 11148 7855 11143 12321 17576 13491 20380 24109 35532 31636 16438
10116 16438 5166 3032 13397 6186 -765 3406 7353 7228 3790 -1304 -4546 -4266 -2300 -684
10102 -684 7883 8324 2581 11117 17229 14470 -7445 -19398 -18210 -8418 -8475 -8096 2038 7636 -1976
10087 -1976 -7730 -4205 19922 20211 3574 6052 -3782 -22202 -23617 -19202 -7662 1686 -826 6894
10073 6894 -196 -4191 -1449 10417 5369 -115 -10 591 2462 -3889 -4732 1995 17701 42730 50134
$$ packed form
10172H7816l7477p685l585j2791j9693j097p402l491N960m00p815r561N135k075
10158a4161R18J1300J4644J2598J892o068o59n610j3873j1784r147J155K481k273
10144a8587j0344M430P160N070M298o322K65J556m696O344L588J6733k705n205
10130A585K148m548R167K796l293L288J178N255m085O889L729J1423l896j5198
10116A6438j1272k134J0365p211o951M171L947j25l438n094l242K80J966J616
10102f84Q567M41n743Q536O112k759k1915j1953J188R792n7L79J0134N598r612
10087a976n754L525K4127K89j6637K478r834j8420j415M415J1540R348k512P720
10073F894p090l995K742J1866n048n484J05O01J871o351q43O727J5706K5029P404
$$ plain form
10058 50134 52806 52560 33245 13786 -8749 -6252 8929 9658 9137 8848 11975 25701 30184 37811
10044 37811 43657 54787 55702 52295 44419 31331 14741 13368 16223 10600 9739 13592 8748 5546
10030 5546 -4592 -10374 -10391 12007 4165 -8268 -3504 -9021 -28173 -33874 -28702 -12717 -7901 -14485
10016 -14485 -19346 -14964 -5533 3309 -4558 -7210 -860 598 1463 2214 -6146 -15161 -12777 -9818 -12444
10001 -12444 -9292 156 12235 23271 15794 10561 3914 17055 2723 -13457 -15642 -15665 1804
9988 1804 16477 14734 10407 15635 12672 18452 33591 57174 86625 145389 260570 397395 478985
9975 478985 477456 371778 245685 142882 83354 47981 26971 9529 6992 10050 10324 9990
9963 9990 8563 11191 -68 -3807 -5352 -12468 8121 22584 21910 14990 9554 -6207 -1551 868
$$ packed form
10058E0134K672k46j9315j9459k2535K497J5181P29n21k89L127J3726M483P627
10044C7811N846J1130R15l407p876j3088j6590j373K855n623q61L853m844l202
10030E546j0138n782j7K2398p842j2433M764n517j9152n701N172J5985M816o584
10016a4485m861M382R431Q842p867k652O350J458Q65P51q360r015K384K959k626
10001a2444L152R448J2079J1036p477n233o647J3141j4332j6180k185k3J7469
9988A804J4673j743m327N228k963N780J5139K3583K9451N8764J15181J36825Q1590
9975D78985j529j05678j26093j02803n9528l5373k1010j7442k537L058K74l34
9963I990j427K628j1259l739j545p116K0589J4463o74o920n436j5761M656K419
$$ plain form
9949 868 11651 11554 -1649 6353 8697 11450 17196 8440 -3794 1740 -7476 -13442 -8745 -11943 5084
9934 5084 8415 8999 -13828 -37757 -35384 -30120 -22833 -5647 8088 -446 1190 15236 19680 13325
9920 13325 17671 11314 6517 3041 2212 3505 -8610 -21257 -21984 -12178 1504 -4253 -10986 -16888
9906 -16888 -5037 11269 13120 13899 10582 13239 7234 2627 10922 15021 19182 7124 -9887 11961
9892 11961 8566 5567 4299 7216 9823 27209 19568 15963 7645 2554 2090 -5747 -2896 18365
9878 18365 26233 24636 20376 18651 6243 -9964 -14087 -8286 -2842 -7273 -1408 1674 -7468 -7742
9864 -7742 -64 7353 10474 6712 -1546 -9591 -671 923 11424 10375 18918 25790 38889 46190
9850 46190 27249 11748 -2864 -12765 4801 32620 43198 43735 11490 -12108 -16578 -8974 489
$$ packed form
9949H68J0783r7j3203Q002K344K753N746q756j2234N534r216n966M697l198J7027
9934E084L331N84k2827k3929K373N264P287J7186J3735q534J636J4046M444o355
9920A3325M346o357m797l476q29J293j2115j2647p27R806J3682n757o733n902
9906a6888J1851J6306J851P79l317K657o005m607Q295M099M161j2058j7011K1848
9892A1961l395k999j268K917K607J7386p641l605q318n091m64p837K851K1261
9878A8365P868j597m260j725j2408j6207m123N801N444m431N865L082r142k74
9864g742P678P417L121l762q258q045Q920J594J0501j049Q543O872J3099P301
9850D6190j8941j5501j4612r901J7566K7819J0578N37l2245k3598m470P604R463
$$ plain form
9837 489 8620 14354 -1015 -20112 -27045 -19165 -3010 507 -7764 -13704 -13143 -11603 -22266 -12652
9823 -12652 -2492 3696 -2097 7589 -3 -12486 -14663 -9057 -20461 -4815 2490 5934 8982 1025
9809 1025 -166 8645 27330 25873 26867 34954 31230 19522 -757 -10969 -12937 -23306 -14798 -7839
9795 -7839 -7132 2456 10093 12313 8348 -3485 -1170 -1524 -16394 -17889 -9998 -3871 -9189 -9164 -12558
9780 -12558 -2941 -13936 -3099 1340 1779 9455 2115 -7880 -19379 -5393 15966 29121 23993
9767 23993 16683 4441 4959 19068 15975 22475 29972 7514 4080 18546 14345 9909 713 2817
9753 2817 10057 2631 -10039 -15369 -3926 -8317 -19786 -9893 2736 -6579 1102 12127 22254
9740 22254 28682 26138 5955 -4303 13077 15003 18025 22095 21283 17045 -4129 -19603 -24289 -14679
$$ packed form
9837D89Q131N734j5369j9097o933P880J6155L517q271n940N61J540j0663R614
9823a2652J0160O188n793R686p592j2483k177N606j1404J5646P305L444L048p957
9809A025j191Q811J8685j457R94Q087l724j1708k0279j0212j968j0369Q508O959
9795g839P07R588P637K220l965j1833K315l54j4870j495P891O127n318K5l394
9780a2558R617j0995J0837M439M39P676p340r995j1499J3986K1359J3155n128
9767B3993p310j2242N18J4109l093O500P497k2458l434J4466m201m436r196K104
9753B817P240p426j2670n330J1443m391j1469R893J2629r315P681J1025J0127
9740B2254O428k544k0183j0258J7380J926L022M070q12m238k1174j5474m686R610
$$ plain form
9726 -14679 -3140 16638 25658 20777 23432 23625 27545 36582 42213 49897 39280 29383 42686 52945
9712 52945 43793 20599 9144 11406 13088 12332 19717 13231 8726 6905 9524 19455 22979 6270
9698 6270 -2398 -4827 -4659 16962 25074 31413 28336 21490 14771 3628 -6438 -4518 -10242 -11345
9684 -11345 -20023 -12602 -7125 -1401 -7663 -5103 -6094 -14350 3649 8703 6964 1374 -15487 -22199
9670 -22199 -9393 -3305 14460 16323 6636 -10870 -7701 1853 8414 3939 -5835 -12039 11645 23220
9656 23220 24458 34223 56761 46109 32477 37979 42668 36520 7384 -5078 -11583 -4096 2668
9643 2668 6767 17239 12886 3885 13832 26572 38668 36460 24438 9643 9383 15502 10455 5149
9629 5149 -4328 1399 14218 14927 13097 2970 12627 21590 23907 12203 4598 5198 7268 8271 13446
$$ packed form
9726a4679J1539J9778R020m881K655J93L920R037N631P684j0617r897J3303J0259
9712E2945r152k3194j1455K262J682p56P385o486m505j821K619R931L524j6709
9698F270q668k429J68K1621Q112O339l077o846o719j1143j0066J920n724j103
9684a1345q678P421N477N724o262K560r91q256J7999N054j739n590j6861o712
9670b2199J2806O088J7765J863r687j7506L169R554O561m475r774o204K3684J1575
9656B3220J238R765K2538j0652j3632N502M689o148k9136j2462o505P487O764
9643B668M099J0472m353r001R947J2740J2096k208j2022j4795k60O119n047n306
9629E149r477N727J2819P09j830j0127R657Q963K317j1704p605O00K070J003N175
$$ plain form
9614 13446 17864 17574 12438 6051 -3022 -7353 -13810 -4589 2945 7390 29395 31226 2270 7544
9600 7544 14770 15817 -1022 -20454 -29745 -15638 6737 10180 17795 24948 44740 44005 44246 38664
9586 38664 29445 18081 12340 22602 10277 -11385 -9891 5435 23815 30392 36494 16020 17916
9573 17916 17558 6149 1602 2808 14554 17442 17988 24323 -5654 -10579 -15794 174 12851 -4016
9559 -4016 -11041 -4347 2561 17660 17019 16781 22042 26379 16549 21454 16379 15313 9166 3734 7710
9544 7710 8517 4136 6291 15477 14316 19964 30160 47003 38254 23398 13791 14645 26370 16282
9530 16282 -1863 -6539 -18386 -9795 2200 8259 3614 12134 23607 6685 -5921 -128 -3404
9517 -3404 5019 10463 5911 3408 9239 17928 24906 18610 6563 3029 4086 5268 3128 3356 7324
$$ packed form
9614A3446M418k90n136o387r073m331o457R221P534M445K2005J831k8956N274
9600G544P226J047j6839j9432r291J4107K2375L443P615P153J9792p35K41n582
9586C8664r219j1364n741J0262j2325k1662J494J5326J8380O577O102k0474J896
9573A7916l58j1409m547J206J1746K888N46O335k9977m925n215J5968J2677j6867
9559d016p025O694O908J5099o41k38N261M337r830M905n075j066o147n432L976
9544G710Q07m381K155R186j161N648J0196J6843q749j4856r607Q54J1725j0088
9530A6282j8145m676j1847Q591J1995O059m645Q520J1473j6922j2606N793l276
9517c404Q423N444m552k503N831Q689O978o296j2047l534J057J182k140K28L968
$$ plain form
9502 7324 24393 26147 4252 10 -70 -1145 6413 19610 23395 17878 19642 14576 12299 15182 20044
9487 20044 29972 34270 24603 23724 22897 32477 44346 43732 42102 46826 56833 59594 46669 29537
9473 29537 27354 18859 7722 15207 7427 16730 5043 -4148 6748 18095 46408 43399 32882
9460 32882 26470 25193 31139 39474 22518 8041 -4782 -4447 -5162 -8665 -8606 24708 35600 45485
9446 45485 38352 45406 51708 29643 22609 13762 1189 5704 7591 14838 31425 41791 27312
9433 27312 22406 38871 39084 44604 49735 43015 30107 21287 23278 17757 12962 8104 12607 7760
9419 7760 7800 5316 12660 22196 17676 23725 37596 28247 28685 28980 40024 45961 42403 33184 18850
9404 18850 13516 6034 16135 18481 24040 28062 38582 51705 50157 45109 53202 41533 27202
$$ packed form
9502G324J7069J754k1895m242q0j075P558J3197L785n517J764n066k277K883M862
9487B0044R928M298r667q79q27R580J1869o14j630M724J0007K761j2925j7132
9473B9537k183q495j1137P485p780R303j1687r191J0896J1347K8313l009j0517
9460C2882o412j277N946Q335j6956j4477j2823L35p15l503N9L3314J0892R885
9446D5485p133P054O302k2065p034q847j2573M515J887P247J6587J0366j4479
9433B7312m906J6465K13N520N131o720j2908q820J991n521m795m858M503m847
9419G760M0k484P344R536m520O049J3871r349M38K95J1044N937l558r219j4334
9404A8850n334p482J0101K346N559M022J0520J3123j548n048Q093j1669j4331
$$ plain form
9391 27202 27416 36039 30358 31816 30628 48443 48333 36332 35953 29621 44743 59668 45203 38163
9377 38163 36835 33204 45094 48965 51135 40305 28789 29843 32376 36254 39796 40816 43162 34251
9363 34251 15705 8716 29666 22089 13780 16191 9878 12288 16935 7994 19173 39096 52286
9350 52286 48525 33072 43129 42480 18115 21140 18426 21146 27445 26140 29720 46078 39409 46010
9336 46010 33390 29345 22609 21130 21549 17371 15689 10914 11976 28829 40947 33003 32646 43474
9322 43474 55107 64807 69492 54792 51031 67071 73180 74850 65076 54082 55874 56317 59167 33787
9308 33787 25265 44350 47122 48454 63366 51794 38877 48872 39015 30828 43217 48853 47291
9295 47291 55720 61762 66411 62365 53136 61408 58499 61457 66966 62760 74195 81708 80976 77083 65142
$$ packed form
9391B7202K14Q623n681J458j188J7815j10j2001l79o332J5122J4925j4465p040
9377C8163j328l631J1890L871K170j0830j1516J054K533L878L542J020K346q911
9363C4251j8546o989K0950p577q309K411o313K410M647q941J1179J9923J3190
9350E2286l761j5453J0057o49k4365L025k714K720O299j305L580J6358o669O601
9336D6010j2620m045o736j479M19m178j682m775J062J6853J2118p944l57J0828
9322D3474J1633R700M685j4700l761J6040O109J670r774j0994J792M43K850k5380
9308C3787q522J9085K772J332J4912j1572j2917R995r857q187J2389N636j562
9295D7291Q429O042M649m046r229Q272k909K958N509m206J1435P513p32l893j1941
$$ plain form
9280 65142 69888 85392 86644 84365 68006 61340 57712 73440 85627 102914 108846 88460 87481
9267 87481 85032 83435 97392 104371 103584 95372 103635 116574 113740 118963 118721 121517 116977 107611 102006
9252 102006 107595 122918 119857 121610 122432 120815 122389 134730 141899 148438 140097 145642 147842 155013
9238 155013 156263 164295 151151 152884 165400 158052 160600 163190 165343 171943 182264 191975 194917 180480
9224 180480 169235 176927 187304 198136 205386 221790 235188 235352 237782 242359 264568 267929 270564
9211 270564 274927 278037 283475 287646 284546 276246 250048 254688 278861 290690 295397 293918 292638 279783
9197 279783 279673 294788 317061 315561 311287 328386 343860 342183 341302 335984 343629 355794 340125
9184 340125 322872 322786 322859 329299 347008 345570 322261 326916 328325 342130 344396 345706 357604 353274
$$ packed form
9280F5142M746J5504J252k279j6359o666l628J5728J2187J7287N932k0386r79
9267H7481k449j597J3957O979p87q212Q263J2939k834N223k42K796m540r366n605
9252A02006N589J5323l061J753Q22j617J574J2341P169O539q341N545K200P171
9238A55013J250Q032j3144J733J2516p348K548K590K153O600J0321R711K942j4437
9224A80480j1245P692J0377J0832P250J6404J3398J64K430M577K2209L361K635
9211B70564M363L110N438M171l100q300k6198M640K4173J1829M707j479j280j2855
9197B79783j10J5115K2273j500m274J7099J5474j677q81n318P645J2165j5669
9184C40125j7253q6P3O440J7709j438k3309M655J409J3805K266J310J1898m330
$$ plain form
9170 353274 337434 334408 330569 333244 334365 325967 315192 303585 311764 306708 300767 298025 290903 271093
9156 271093 272470 287657 298147 285511 273070 280470 267143 257729 248809 244897 248018 235316 229760
9143 229760 224392 231925 231213 208539 197884 199842 191325 171185 159380 159943 159953 160392 166929 166516 162946
9128 162946 163018 185737 192397 179111 170258 156596 158424 155082 145394 155326 145374 140520 136716 136808 129566
9113 129566 122255 123976 114513 102021 97952 117680 117975 106348 106441 103602 101385 112567 124251 112471
9099 112471 100914 98472 101688 89765 103392 125764 125708 118058 104798 106648 103397 86918 92656
9086 92656 92046 84582 79194 92865 102913 101936 87472 80914 92237 96529 89658 79286 84746 109376
9072 109376 111503 107824 108448 106359 88448 76594 65443 70303 86515 85019 78101 60579 57816
$$ packed form
9170C53274j5840l026l839K675J121q398j0775j1607Q179n056n941k742p122j9810
9156B71093J377J5187J0490j2636j2441P400j3327r414q920l912L121j2702n556
9143B29760n368P533p12k2674j0655J958q517k0140j1805N63J0M39O537m13l570
9128A62946P2K2719O660j3286q853j3662J828l342r688R932r952m854l804R2p242
9113A29566p311J721r463j2492m069J9728K95j1627R3k839k217J1182J1684j1780
9099A12471j1557k442L216j1923J3627K2372n6p650j3260J850l251j6479N738
9086I2656o10p464n388J3671J0048r77j4464o558J1323M292o871j0372N460K4630
9072A09376K127l679O24k089j7911j1854j1151M860J6212j496o918j7522k763
$$ plain form
9059 57816 76346 84312 70420 55675 51933 47674 55569 56722 52678 45380 28656 15803 19630
9046 19630 19685 26278 34875 47657 61778 85844 90987 90530 76337 60331 51120 63659 76379 60989
9032 60989 51435 49916 50984 56623 48635 32586 30831 34388 23345 13658 8927 17228 38421 47919
9018 47919 40721 36608 35588 47965 47159 33283 40088 43120 31639 30799 42797 57481 44900 23419
9004 23419 12061 12351 7520 -1207 3667 5373 6264 12600 -2884 -12320 -10314 3265 12322 7149
8990 7149 18318 39320 31562 24115 28358 28703 34819 36239 29660 34421 22276 8473 -7081 -18389
8976 -18389 -26207 -13330 -1663 2042 17358 25995 30405 37248 30624 15942 22006 24665 24706 23896
8962 23896 5158 -4078 -9351 -10447 -2911 -1086 13628 22705 31764 37323 34758 22846 22313 15912
$$ packed form
9059E7816J8530P966j3892j4745l742m259P895J153m044p298j6724j2853L827
9046A9630N5O593Q597J2782J4121K4066N143m57j4193j6006r211J2539J2720j5390
9032F0989r554j519J068N639p988j6049j755L557j1043r687m731Q301K1193R498
9018D7919p198m113j020J2377q06j3876O805L032j1481q40J1998J4684j2581k1481
9004B3419j1358K90m831q727M874J706Q91O336j5484r436K006J3579R057n173
8990G149J1169K1002p758p447M243L45O116J420o579M761j2145j3803j5554j1308
8976a8389p818J2877J1667L705J5316Q637M410O843o624j4682O064K659M1q10
8962B3896j8738r236n273j096P536J825J4714R077R059N559k565j1912n33o401
$$ plain form
8948 15912 6459 6157 9647 10038 -1311 -2268 1008 4553 7148 13493 18748 1955 -6894 -3886 12466
8933 12466 16062 7615 13630 6671 2971 890 3646 6618 12279 17758 30116 23906 25680 25479 22727
8918 22727 7402 -8146 -4296 5363 12501 18627 21530 19829 9513 23455 20611 7450 1210
8905 1210 2536 11904 25007 20215 6450 -8168 -7991 -9479 -4036 2550 21419 32018 31390 26322
8891 26322 19487 25868 26416 6965 10965 17052 13749 8444 11 3112 117 -7344 15683 22851
8877 22851 17543 25024 31336 37282 54160 73336 74403 58848 45174 42775 40447 38506 28044
8864 28044 15722 10988 10923 22404 21683 9265 825 5072 19325 30238 25351 23074 22647 15486
8850 15486 22003 16022 5800 3583 10314 18493 16581 14784 19852 30040 20563 23457 23613 38238
$$ packed form
8948A5912r453l02L490L91j1349r57L276L545K595O345N255j6793q849L008J6352
8933A2466L596q447O015o959l700k081K756K972N661N479J2358o210J774k01k752
8918B2727j5325j5548L850R659P138O126K903j701j0316J3942k844j3161o240
8905A210J326R368J3103m792j3765j4618J77j488N443O586J8869J0599o28n068
8891B6322o835O381N48j9451M000O087l303n305q433L101k995p461K3027P168
8877B2851n308P481O312N946J6878J9176J067j5555j3674k399k328j941j0462
8864B8044j2322m734o5J1481p21j2418q440M247J4253J0913m887k277m27p161
8850A5486O517n981j0222k217O731Q179j912j797N068J0188r477K894J56J4625
$$ plain form
8836 38238 28933 14264 12025 24480 18734 11520 12727 18807 30521 39123 39225 43772 33582 31522
8822 31522 27532 16731 10992 21014 32567 43431 59757 64784 61865 50622 39888 26826 19553
8809 19553 8086 5775 6588 5709 310 -2687 7383 4837 3285 4365 13279 17717 12906 1608
8795 1608 17425 11460 2274 17029 39661 36514 18548 9031 26508 26191 23746 29567 21800 19933
8781 19933 31242 55459 87948 110854 116557 123042 125988 122255 122369 135988 133055 149030 164812
8768 164812 154771 124911 86690 61464 59383 58262 48968 36085 26743 13247 12243 4703 -2022
8755 -2022 1613 16014 18235 24176 33556 36014 34950 30069 36533 19180 30031 42851 42871 49244
8741 49244 40957 35147 43901 35166 35482 55028 88783 131531 180070 224169 251804 255461 236241
$$ packed form
8836C8238r305j4669k239J2455n746p214J207O080J1714Q602J02M547j0190k060
8822C1522l990j0801n739J0022J1553J0864J6326N027k919j1243j0734j3062p273
8809A9553j1467k311Q13q79n399k997J0070k546j552J080Q914M438m811j1298
8795A608J5817n965r186J4755K2632l147j7966r517J7477l17k445N821p767j867
8781A9933J1309K4217L2489K2906N703O485K946l733J14J3619k933J5975J5782
8768A64812j0041k9860l8221k5226k081j121r294j2883r342j3496j004p540o725
8755b022L635J4401K221N941R380K458j064m881O464j7353J0851J2820K0O373
8741D9244q287n810Q754q735L16J9546L3755M2748M8539M4099K7635L657j9220
$$ plain form
8728 236241 201600 159794 132656 110370 93970 88112 66635 53278 41627 31868 21533 8362
8716 8362 9452 1342 14117 21367 22327 32270 40827 42728 39463 35203 43344 39211 36279 30441 30667
8701 30667 34610 21186 14006 24928 30356 36912 47657 51243 39325 39044 30172 33060 69136 103728
8687 103728 115110 118621 112947 108840 100929 79258 43557 26883 22683 26530 15081 7574 979
8674 979 5278 14120 17940 15087 22180 23242 26587 31250 29226 23827 26852 34074 34876 42531 34346
8659 34346 15696 19619 19845 10489 1996 5276 12587 10828 21941 20711 30551 24618 1120 -13395
8645 -13395 -15881 -2908 14222 13138 13548 25022 20634 11558 23476 29676 39148 32315 25493 18014
8631 18014 13460 17403 8777 2759 -9171 1987 23705 34476 44498 43354 43646 59408 75409
$$ packed form
8728B36241l4641m1806k7138k2286j6400n858k1477j3357j1651r759j0335j3171
8716H362J090q110J2775P250R60R943Q557J901l265m260Q141m133k932n838K26
8701C0667L943j3424p180J0922N428O556J0745L586j1918k81q872K888L6076L4592
8687A03728J1382L511n674m107p911k1671l5701j6674m200L847j1449p507o595
8674I79M299Q842L820k853P093J062L345M663k024n399L025P222Q02P655q185
8659C4346j8650L923K26r356q493L280P311j759J1113j230R840n933k3498j4515
8645a3395k486J2973J7130j084M10J1474m388r076J1918O200R472o833o822p479
8631A8014m554L943q626o018j1930J1158K1718J0771J0022j144K92J5762J6001
$$ plain form
8618 75409 89843 95823 87594 61250 37177 22811 15681 27872 42284 30817 26612 21926 14988
8605 14988 28073 28520 38268 36678 17466 13139 11558 26873 43004 45530 49443 41475 55070 74131
8591 74131 72077 75892 62069 52499 48590 58673 54942 52304 50498 39946 26145 21473 29630 22886
8577 22886 29071 63477 91438 113863 142180 133564 100608 74476 65881 76856 122537 176696
8565 176696 259839 365705 425032 408627 305372 205940 140262 88484 59473 41326 45854
8554 45854 45656 43803 39076 33425 21768 18433 8253 8029 9294 6935 8347 13673 11923 21057 25068
8539 25068 28937 37837 56979 43444 22411 8545 19656 37811 68588 90362 101285 94443
8527 94443 82252 77344 78265 88074 127493 212174 356848 563376 770654 834899 695687 479005
$$ packed form
8618G5409J4434N980q229k6344k4073j4366p130J2191J4412j1467m205m686o938
8605A4988J3085M47R748j590j9212m327j581J5315J6131K526L913p968J3595J9061
8591G4131k054L815j3823r570l909J0083l731k638j806j0552j3801m672Q157o744
8577B2886O185L4406K7961K2425K8317q616l2956k6132q595J0975M5681N4159
8565A76696Q3143J05866N9327j6405j03255r9432o5678n1778k9011j8147M528
8554D5854j98j853m727n651j1657l335j0180k24J265k359J412N326j750R134M011
8539B5068L869Q900J9142j3535k1033j3866J1111J8155L0777K1774J0923o842
8527I4443j2191m908R21R809L9419Q4681J44674K06528K07278O4245j39212k16682
$$ plain form
8515 479005 302169 207584 148635 115412 86392 57022 50845 45941 48032 29567 18194 3717
8503 3717 9136 20374 30688 18513 -4316 -587 10313 16298 -650 -6139 8421 8976 -6342
8490 -6342 -2880 14302 20723 30054 36031 44536 63942 57434 50115 45462 53098 64029 97255 164344
8476 164344 246418 333449 384530 356111 270595 183937 126301 77054 42197 24777 21768 32170
8464 32170 28836 31685 36598 33953 23614 15877 7864 11046 4278 7779 19672 43262 42209 17975
8450 17975 9006 23984 18499 14991 8161 5497 11313 18203 4745 10523 21332 18778 8578 6784
8436 6784 9227 -675 1116 1985 18788 31850 16945 -2417 -9594 -5826 5355 6230 4767 13380
8422 13380 18554 14497 -5236 -28851 -27296 -15568 -15060 -10398 -9902 -6980 1195 -169 6016 1293
$$ packed form
8515D79005j76836r4585n8949l3223k9020k9370o177m904K091j8465j1373j4477
8503C717N419J1238J0314j2175k2829L729J0900N985j6948n489J4560N55j5318
8490f342L462J7182O421R331N977Q505J9406o508p319m653P636J0931L3226O7089
8476A64344Q2074Q7031N1081k8419q5516q6658n7636m9247l4857j7420l009J0402
8464C2170l334K849M913k645j0339p737q013L182o768L501J1893K3590j053k4234
8450A7975q969J4978n485l508o830k664N816O890j3458N778J0809k554j0200j794
8436F784K443r902J791Q69J6803J3062j4905j9362p177L768J1181Q75j463Q613
8422A3380N174m057j9733k3615J555J1728N08M662M96K922Q175j364O185m723
$$ plain form
8408 1293 -8528 778 -6826 -8053 -10199 -18223 -28384 -18939 -13880 -12447 -9876 -1231 11196 7315
8394 7315 2392 -13321 -17846 -25373 -18355 -9263 -4839 -2107 2638 13327 3431 -10786 -8909 4537
8380 4537 2342 -3339 2880 -5172 -18240 -5727 -17262 -16814 -9651 3544 -4517 -6406 -15963 -23922
8366 -23922 -9377 -456 -11785 -27322 -31347 -15657 5235 3146 6414 3167 5084 3056 11516
8353 11516 23394 23504 17405 24579 20417 18223 9936 2883 -1164 805 10148 2228 4 8949 14939
8338 14939 -6799 -20542 -21713 -10123 -9144 -12119 -18845 -32035 -17432 -1649 652 -2994 -3029 -142
8324 -142 13582 12544 -926 -5471 7666 12515 1278 -2542 7318 10902 5116 2244 -14164 -2167
8310 -2167 160 -8064 -21557 -17196 -1994 8658 -2876 -18382 -5209 15125 23986 18452 23209
$$ packed form
8408A293r821R306p604j227k146q024j0161R445N059J433K571Q645J2427l881
8394G315m923j5713m525p527P018R092M424K732M745J0689r896j4217J877J3446
8380D537k195n681O219q052j3068J2513j1535M48P163J3195q061j889r557p959
8366b3922J4545Q921j1329j5537m025J5690K0892k089L268l247J917k028Q460
8353A1516J1878J10o099P174m162k194q287p053m047J969R343p920k224Q945N990
8338A4939k1738j3743j171J1590R79k975o726j3190J4603J5783K301l646l5K887
8324a42J3724j038j3470m545J3137M849j1237l820R860L584n786k872j6408J1997
8310b167K327q224j3493M361J5202J0652j1534j5506J3173K0334Q861n534M757
$$ plain form
8297 23209 11283 -4397 6070 24379 18958 5667 -5215 -3282 -6575 -8727 -17207 -14566 -4097
8284 -4097 -11033 -12386 8948 12359 4126 5164 -3400 -22178 -28015 -14195 -2380 1302 1055 -12467
8270 -12467 -14744 -10876 -20463 -34715 -34681 -24796 -22883 -11813 420 -1870 -18223 -28539 -26449 -26472
8256 -26472 -30401 -35454 -36465 -18839 15674 18347 3813 4222 27772 32735 25776 21348 19914 9945
8242 9945 -11454 -18709 -7367 472 2450 2133 9920 6084 2150 -6776 -11731 -13729 -12028 -28244
8228 -28244 -16877 -2712 2855 5706 -11224 -8044 6186 14800 5657 -6441 -17674 -28549 -21121
8215 -21121 -14073 -19754 -23463 -13799 -13749 -11571 -859 -3097 3870 3337 -6363 -4800 2037 -4066 199
8200 199 -1668 7480 10632 6640 7061 3597 471 -2141 -539 -13255 -7351 9880 14311 1699 1283
$$ packed form
8297B3209j1926j5680J0467J8309n421j3291j0882J933l293k152q480K641J0469
8284d097o936j353K1334L411q233J038q564j8778n837J3820J1815L682k47j3522
8270a2467k277L868r587j4252L4R885J913J1070J2233k290j6353j0316K090k3
8256b6472l929n053j011J7626L4513K673j4534M09K3550M963o959m428j434r969
8242I945k1399p255J1342P839J978l17P787l836l934q926m955j998J701j6216
8228b8244J1367J4165N567K851j6930L180J4230Q614r143j2098j1233j0875P428
8215b1121P048n681l709R664N0K178J0712k238O967n33r700J563O837o103M265
8200A99j867R148L152l992M21l464l126k612J602j2716N904J7231M431j2612m16
$$ plain form
8185 1283 10693 12577 6602 8519 -1408 -10165 -7328 -4949 -9908 -6230 -4895 -6608 10570 12307 4795
8170 4795 2545 -1904 -8109 -16035 -18187 -16006 -12083 -3330 9170 -3716 -15566 -14498 -17855 -17483
8156 -17483 -10799 -9929 -13938 -12887 -21292 -10011 -3221 -2075 -3422 1058 -426 -8243 -12136 -17012 -9459
8141 -9459 1295 -8168 -24548 -18052 -23091 -14321 710 9892 -879 2318 -10036 -14254 -10813 5543
8127 5543 20388 8516 15569 17254 8888 3960 4919 3137 9431 10550 10598 15049 19472 8591 3761
8112 3761 -5321 5363 12783 13804 15929 4596 -3792 9018 15469 16289 10962 387 4852 7583
8098 7583 1309 -3178 -6810 -6205 -21035 -23134 -18699 -18746 -6481 4922 -1344 -281 -6674 -12152 -1414
8083 -1414 2221 3246 -6813 -9646 3590 7175 21527 9797 9506 9191 -3858 -11008 9721 20368
$$ packed form
8185A283R410J884n975J917r927q757K837K379m959L678J335j713J7178J737p512
8170D795k250m449o205p926k152K181L923Q753J2500j2886j1850J068l357L72
8156a7483O684Q70m009J051q405J1281O790J146j347M480j484p817l893m876P553
8141i459J0754r463j6380O496n039Q770J5031R182j0771L197j2354m218L441J6356
8127E543J4845j1872P053J685q366m928R59j782O294J119M8M451M423j0881m830
8112C761r082J0684P420J021K125j1333q388J2810O451Q20n327j0575M465K731
8098G583o274m487l632O05j4830k099M435m7J2265J1403o266J063o393n478J0738
8083a414L635J025j0059k833J3236L585J4352j1730k91l15j3049p150K0729J0647
$$ plain form
8069 20368 17566 7376 16552 28700 20275 20081 25352 29251 22655 9032 13654 12911 6865 2035
8055 2035 10657 16801 19880 10390 9549 23337 28315 14530 9771 -8491 -17868 -13577 -14424 -12930 -7892
8040 -7892 -10142 -8836 -16079 -11906 -2213 6542 2802 -6964 -13280 -2270 16240 25299 16298 -1602
8026 -1602 3635 12200 21325 23667 12127 4146 10084 32069 31064 10475 10131 27702 43437 37147
8012 37147 28272 16190 14678 6437 22258 24293 18369 18972 24381 25847 24318 7772 1459 -3330
7998 -3330 9682 13333 -7260 -6056 -5270 -4803 -8 2926 -2807 37 -1556 -13820 -4453 -2878 -13652
7983 -13652 4528 21180 28374 14768 4652 8246 20378 17069 10020 9697 11765 15533 6213 -1342
7969 -1342 -2755 -18508 -5214 -2572 -1942 5443 -6070 -3584 2918 11741 15179 22482 5999 1922
$$ packed form
8069B0368k802j0190R176J2148q425j94N271L899o596j3623M622p43o046m830
8055B035Q622O144L079r490q41J3788M978j3785m759j8262r377M291q47J494N038
8040g892k250J306p243M173R693Q755l740r766o316J1010J8510R059r001j7900
8026a602N237Q565R125K342j1540p981N938K1985j005k0589l44J7571J5735o290
8012C7147q875j2082j512q241J5821K035n924O03N409J466j529j6546o313m789
7998c330J3012L651k0593J204P86M67M795K934n733K844j593j2264R367J575j0774
7983a3652J8180J6652P194j3606j0116L594J2132l309p049l23K068L768r320p555
7969a342j413j5753J3294K642O30P385j1513K486O502Q823L438P303j6483m077
$$ plain form
7955 1922 -362 -10339 -16731 -12276 -11981 -29472 -31011 -27443 -22941 -19071 -17035 -4378 -2081 -14438
7941 -14438 -26025 -17457 -13737 -7399 -6774 -11479 5693 2145 5346 10930 12878 -7638 -8059 9271
7927 9271 25509 25156 20710 14050 21169 22165 12058 555 -10201 -20225 -6709 -841 -4267 1724
7913 1724 -6636 -20339 -19545 1318 6817 5454 10551 19146 16286 5001 -9162 -10860 -17880 -8631
7899 -8631 5129 -5611 1363 6035 9978 14978 13513 -2748 -11182 -10967 -8991 4314 3246 -8493
7885 -8493 -13936 -10007 -7718 -1242 -5729 -13681 -8946 4352 6122 7459 9546 2206 -13375 -6702
7871 -6702 7098 13031 33253 38758 41532 20228 -8095 -9188 -5261 -1469 3192 3108 3537 -3115 -2239
7856 -2239 -8410 -10959 -13985 -3381 6167 -14250 -16126 -12367 -19691 -6149 -2447 -10107 -22569 -23743
$$ packed form
7955A922k284r977o392M455K95j7491j539L568M502L870K036J2657K297j2357
7941a4438j1587Q568L720O338O25m705J7172l548L201N584J948k0516m21J7330
7927I271J6238l53m446o660P119R96j0107j1503j0756j0024J3516N868l426N991
7913A724q360j3703P94K0863N499j363N097Q595k860j1285j4163j698p020R249
7899h631J3760j0740O974M672L943N000j465j6261q434K15J976J3305j068j1739
7885h493n443L929K289O476m487p952M735J3298J770J337K087p340j5581O673
7871f702J3800N933K0222N505K774k1304k8323j093L927L792M661q4M29o652Q76
7856b239o171k549l026J0604R548k0417j876L759p324J3542L702p660j2462j174
$$ plain form
7842 -23743 -10078 -2794 -269 12243 24724 23176 12795 -4601 -12781 3130 17745 13914 13105
7829 13105 4216 1999 5642 10925 18808 27366 20284 15560 17990 3477 -11299 -29959 -31748 -34376
7815 -34376 -45269 -48283 -34921 -27433 -23784 -16541 -14482 -13797 666 6414 8375 13463 16775 5070
7801 5070 1442 2453 -2203 -9108 -4280 -4375 -17133 -27585 -28357 -23904 -18203 -14664 -13392 -15611 -12011
7786 -12011 -8799 -7328 -8976 -4171 -7753 -5676 -12600 -9739 9425 12896 8326 -813 7852 1999
7772 1999 -7479 -14511 -22919 -25897 -27618 -17261 -6999 -7259 -19647 -32717 -25703 -20530 -26301 -20038
7758 -20038 -16793 -18991 -5502 -1496 -1671 4545 6190 -6110 -9312 -19765 -14524 -18971 -17672 -14619
7744 -14619 -13841 -12127 -10671 -4468 -9251 -12245 -13349 -11512 -19315 -691 -7 -7452 -4738 -1331 -11735
$$ packed form
7842b3743J3665P284K525J2512J2481j548j0381j7396q180J5911J4615l831q09
7829A3105q889k217L643N283P883Q558p082m724K430j4513j4776j8660j789k628
7815c4376j0893l014J3362P488L649P243K059O85J4463N748J961N088L312j1705
7801E070l628J011m656o905M828r5j2758j0452p72M453N701L539J272k219L600
7786a2011L212J471j648M805l582K077o924K861J9164L471m570r139Q665n853
7772A999r478p032q408k978j721J0357J0262k60j2388j3070P014N173n771O263
7758b0038L245k198J3489M006j75O216J645j2300l202j0453N241m447J299L053
7744a4619P78J714J456O203m783k994j104J837p803J8624O84p445K714L407j0404
$$ plain form
7729 -11735 -15491 -8022 -14561 -19214 -25798 -20055 -3550 -713 5569 12629 25524 17240 7385 12384
7715 12384 4674 -16893 -22090 -22501 -28683 -36618 -28177 -32418 -24696 -23153 -15947 -12438 -27864 -13336
7701 -13336 -16072 -25165 -16999 -20610 -5055 2484 -5019 -7567 -7447 -11611 -10629 -22172 -20924 -6659
7687 -6659 6718 -9150 -14671 -28935 -26872 -29879 -25553 -18632 -10898 -12212 -27766 -27315 -339 11590
7673 11590 -2338 -3452 8466 4272 11617 10675 7951 9818 18309 22029 34346 34484 21987 8483
7659 8483 -1260 -13274 5323 11100 4980 -4483 -24319 -21452 -13269 -7833 -6262 -15872 -23100 -14068
7645 -14068 -10301 2429 -6533 -11855 -9802 -17796 -12199 58 7967 10173 14711 7886 1230 -5938
7631 -5938 -26646 -26383 -15876 -12989 -14193 -9312 -12725 -22458 -19617 -9506 -2973 7316 10225 5475
$$ packed form
7729a1735l756P469o539m653o584N743J6505K837O282P060J2895q284r855M999
7715A2384p710k1567n197m11o182p935Q441m241P722J543P206L509j5426J4528
7701a3336k736r093Q166l611J5555P539p503k548J20m164R82j1543J248J4265
7687f659J3377j5868n521j4264K063l007M326O921P734j314j5554M51K6976J1929
7673A1590j3928j114J1918m194P345r42k724J867Q491L720J2317J38j2497j3504
7659H483r743j2014J8597N777o120r463j9836K867Q183N436J571r610p228R032
7645a4068L767J2730q962n322K053p994N597J2257P909K206M538o825o656p168
7631e938k0708K63J0507K887j204M881l413r733K841J0111O533J0289K909m750
$$ plain form
7617 5475 -7149 -30696 -37059 -25607 -381 -4591 -17989 -13084 -11499 -676 107 3195 1821 7426
7603 7426 6011 138 -14823 -24661 -21792 -19646 -11472 -764 9869 -7756 -7459 -10226 -10531 -787
7589 -787 -10440 -34415 -14805 9504 26509 29576 16583 8827 8472 9121 3447 9746 3199 -7999
7575 -7999 -4367 6623 19660 16968 6876 1465 2870 -2817 -19334 -22863 -21300 -21459 -4290 58
7561 58 -7684 -19324 -17548 -10183 63 -4493 -10676 -22054 -13972 -10205 -8392 -4767 -12277 -15558 -16775
7546 -16775 -12581 -15765 -17164 -18253 -8044 18112 20337 336 1928 6824 18181 23112 19863 8170
7532 8170 5292 7151 11955 22723 8336 -3512 -10408 3063 12099 1405 -6235 -14636 -24843
7519 -24843 -18577 -13831 2535 4147 9725 -6262 -21991 -21742 -20857 -2194 1920 -10527 -4904 653
$$ packed form
7617E475j2624k3547o363J1452K5226m210j3398M905J585J0823P83L088j374N605
7603G426j415n873j4961r838K869K146Q174J0708J0633j7625K97k767l05R744
7589g87r653k3975J9610K4309J7005L067j2993p756l55O49n674O299o547j1198
7575g999L632J0990J3037k692j0092n411J405n687j6517l529J563j59J7169M348
7561E8p742j1640J776P365J0246m556o183j1378Q082L767J813L625p510l281j217
7546a6775M194l184j399j089J0209K6156K225k0001J592M896J1357M931l249j1693
7532H170k878J859M804J0768j4387j1848o896J3471R036j0694p640q401j0207
7519b4843O266M746J6366J612N578j5987j5729K49Q85J8663M114j2447N623N557
$$ plain form
7505 653 3376 -3301 5530 2255 -9143 -5050 -12754 -9177 6366 -5311 -15524 -222 17734 9581
7491 9581 5074 2310 -102 -20706 -23298 -37754 -25884 -7524 -7980 -17216 -10808 -4272 526 8446
7477 8446 9056 -6421 -17701 -16556 -4615 4298 -3349 -1757 -5479 5562 19476 10207 -8002 -18358
7463 -18358 -26111 -18979 -8895 -4884 -2042 -90 -210 7858 20254 33766 24310 7808 -12671 -924
7449 -924 -980 -11190 -12226 -13960 -13155 -12127 -2962 4098 12472 20476 4244 -8537 -801 17216 25063
7434 25063 10398 -11988 -11715 -2601 1468 -7869 -28107 -27654 -8415 -10491 -16160 -11931 -20283 -16732
7420 -16732 1019 3959 424 258 590 -3686 -15947 -21452 -30592 -18148 -20119 -26513 -28350 -11551
7406 -11551 -310 -11382 -16072 2324 16798 2635 -12964 -12092 -4647 5027 7094 1610 -4531
$$ packed form
7505F53K723o677Q831l275j1398M093p704L577J5543j1677j0213J5302J7956q153
7491I581m507k764k412k0604k592j4456J1870J8360m56r236O408O536M798P920
7477H446O10j5477j1280J145J1941Q913p647J592l722J1041J3914r269j8209j0356
7463a8358p753P132J0084M011K842J952j20Q068J2396J3512r456j6502k0479J1747
7449i24n6j0210j036j734Q05J028R165P060Q374Q004j6232j2781P736J8017P847
7434B5063j4665k2386K73R114M069r337k0238M53J9239k076n669M229q352L551
7420a6732J7751K940l535j66L32m276j2261n505r140J2444j971o394j837J6799
7406a1551J1241j1072m690J8396J4474j4163j5599Q72P445R674K067n484o141
$$ plain form
7393 -4531 -11078 -8222 1553 -6702 -21960 -31346 -16954 6780 19080 12049 107 -11750 -10763 -13981
7379 -13981 -733 -680 -13521 -18330 -29852 -22014 -8187 -2991 538 3762 12587 1665 -10264 -12420
7365 -12420 -24407 -29665 -19677 -14044 -5948 -13438 -10810 -9251 9124 10252 33 8009 7056 -5620
7351 -5620 -14169 -14216 -17583 -27161 -20856 -24718 -15514 -7766 -2734 5044 6291 -17612 -18982 -15372 -14582
7336 -14582 -13525 -9014 10802 -2246 -9875 5423 9740 8866 5092 -6246 717 6829 7101 4032
7322 4032 342 -44 4406 17061 13999 11080 14403 18636 13392 -3281 -20711 -18927 -15067 -11668
7308 -11668 -3671 7686 17622 22861 15954 5890 3259 15272 11245 737 -8491 -11117 -18501 -11668
7294 -11668 -10999 -5775 -4993 -12749 -27371 -28775 -23193 -14468 -8678 -18256 -23972 -25803 -17534 -12577 -13929
$$ packed form
7393d531o547K856R775q255j5258r386J4392K3734J2300p031j1942j1857R87l218
7379a3981J3248N3j2841m809j1522P838J3827N196L529L224Q825j0922j1929k156
7365a2420j1987n258R988N633Q096p490K628J559J8375J128j0219P976r53j2676
7351e620q549m7l367r578O305l862R204P748N032P778J247k3903j370L610P90
7336a4582J057M511J9816j3048p629J5298M317q74l774j1338O963O112K72l069
7322D032l690l86M450J2655l062k919L323M233n244j6673j7430J784L860L399
7308a1668P997J1357R936N239o907j0064k631J2013m027j0508r228k626p384O833
7294a1668O69N224P82p756j4622j404N582Q725N790r578n716j831Q269M957j352
$$ plain form
7279 -13929 -8769 -178 3349 -5944 -14901 -9848 -10098 -9182 -19687 -27659 -17767 -15711 -15617 -4105 5871
7264 5871 -1560 -12551 -11592 -15157 -6789 15533 15310 8933 22290 31173 26840 21225 1181 -9415
7250 -9415 2475 7452 9954 6925 -4056 -583 -2086 -815 1730 3317 8103 17370 21646 37562
7236 37562 19403 3523 -1607 6530 -5574 -12135 -10240 -6596 -13872 -6150 4527 9193 1867 -2684
7222 -2684 -4521 -616 1648 -2698 -11675 -20043 -14674 218 -1608 -486 5321 -1181 -3695 -11319 -14108
7207 -14108 -18077 -31532 -35475 -29740 -21133 -20932 -30204 -22696 -16877 -10651 8891 23064 5416 -7070
7193 -7070 -11431 -8329 -10762 -17755 -11428 -3570 8928 19291 9266 2277 541 -7071 -11990 -10803
7179 -10803 1131 14977 17998 3238 -371 6342 -6409 -21785 -13281 638 -32 1261 -16172
$$ packed form
7279a3929N160Q591L527r293q957N053k50R16j0505p972R892K056R4J1512R976
7264E871p431j0991R59l565Q368K2322k23o377J3357Q883m333n615k0044j0596
7250i415J1890M977K502l029j0981L473j503J271K545J587M786R267M276J5916
7236C7562j8159j5880n130Q137j2104o561J895L644p276P722J0677M666p326m551
7222b684j837L905K264m346q977q368N369J4892j826J122N807o502k514p624k789
7207a4108l969j3455l943N735Q607K01r272P508N819O226J9542J4173j7648j2486
7193g070m361L102k433o993O327P858J2498J0363j0025o989j736p612m919J187
7179a0803J1934J3846L021j4760l609O713j2751j5376Q504J3919o70J293j7433
$$ plain form
7166 -16172 -712 3191 1098 -15986 -23734 -6132 4048 -2282 3544 11765 9654 -7456 -18213
7153 -18213 -8395 -9991 -11547 -13057 -12050 -6810 -8963 -12330 -7722 -5279 3242 -805 -6964 -4496 457
7138 457 1372 7752 5672 10021 13469 -237 -11175 -5836 -10686 -16407 -16395 -18037 -11419 -6053 -3319
7123 -3319 -4249 -8712 -3480 -5604 -2440 -8229 -10872 -6003 -7546 -7327 -4956 -14413 -20513 -17288 -23906
7108 -23906 -13553 -9471 -8375 -12776 -29252 -9014 -7276 -3540 -2330 -16506 -19638 -16314 -18784 -3107
7094 -3107 16245 25696 28043 20102 24127 25924 23207 9589 8449 9841 13566 15305 6367 9868
7080 9868 22583 12538 -2875 -13620 -24318 -23862 -23321 -8862 -172 8307 2409 -11300 -6352 11154
7066 11154 12671 9555 10268 5574 13483 26072 23753 10649 6714 2888 -6570 -15188 -9456 -9023 -9648
$$ packed form
7166a6172J5460L903k093j7084p748J7602J0180o330N826Q221k111j7110j0757
7153a8213R818j596j556j510J007N240k153l367M608K443Q521m047o159K468M953
7138D57R15O380k080M349L448j3706j0938N339m850n721J2j642O618N366K734
7123c319r30m463N232k124L164n789k643M869j543K19K371r457o100L225o618
7108b3906J0353M082J096m401j6476K0238J738L736J210j4176l132L324k470J5677
7094c107J9352R451K347p941M025J797k717j3618j140J392L725J739q938L501
7080I868J2715j0045j5413j0745j0698M56N41J4459Q690Q479n898j3709M948J7506
7066A1154J517l116P13m694P909J2589k319j3104l935l826r458q618N732M33o25
$$ plain form
7051 -9648 -20212 -24917 -11942 -3466 -5084 -3206 -9205 -13263 -11670 -16699 -7136 1567 -11560 -41097
7037 -41097 -39851 -30511 -22040 -23548 -33502 -28617 -8547 -4879 -767 -10950 -18348 -17011 -2862 948
7023 948 7017 10019 5370 -393 -10647 -23138 -22505 -18440 -19662 -13157 3219 12615 -2623 -8592
7009 -8592 -10341 -21428 -15433 2594 5666 10843 10949 16174 15235 9941 -5446 -27898 -33745 -18578
6995 -18578 -11653 -19094 -25223 -33355 -25169 -1782 23272 12360 304 -2877 -3570 12855 8849 -65
6981 -65 -9652 635 6415 1030 -4774 2770 24338 17981 279 -11828 -22315 -7345 15432 32202
6967 32202 24138 15949 16207 8695 1409 4237 17795 29036 24870 16380 13008 14147 -3011 -9345
6953 -9345 4727 14596 7795 6694 -2625 -2944 -2695 -1178 -14210 -11790 -11213 -11413 -308 -15292 -16798
$$ packed form
7051i648j0564m705J2975Q476j618J878n999m058J593n029R563Q703j3127k9537
7037d1097J246R340Q471j508r954M885K0070L668M112j0183p398J337J4149L810
7023I48O069L002m649n763j0254j2491O33M065j222O505J6376R396j5238n969
7009h592j749j1087N995J8027L072N177J06N225r39n294j5387k2452n847J5167
6995a8578O925p441o129q132Q186K3387K5054j0912j2056l181o93J6425m006q914
6981f5r587J0287N780n385n804P544K1568o357j7702j2107j0487J4970K2777J6770
6967C2202q064q189K58p512p286K828J3558J1241m166q490l372J139j7158o334
6953i345J4072R869o801j101r319l19K49J517j3032K420N77k00J1105j4984j506
$$ plain form
6938 -16798 -12694 -15323 -8118 -272 -6289 -12785 -16788 -10154 -1102 16561 21700 10637 10219 19112
6924 19112 19961 4622 -5442 -18438 -11106 -24783 -41534 -21646 10898 38694 38475 28827 8439
6911 8439 10857 15914 13704 10413 3275 2554 44 3205 6659 29416 43294 44710 41808 45002 38214
6896 38214 32615 37857 44178 42785 39289 21885 10195 26248 29092 33946 43839 51911 36115 18009
6882 18009 19542 20290 8946 28213 43243 37589 19400 6352 14849 28321 40593 39308 31767
6869 31767 21241 17187 30635 54418 102838 164490 189509 165211 105886 47886 25717 16783
6857 16783 3390 -615 2643 9172 8254 4889 2752 3590 18933 32827 39126 40781 32003 33188
6843 33188 24382 28805 31464 23177 6454 -5693 -5483 1429 -8510 -13968 1802 11695 14125 20268
$$ packed form
6938a6798M104k629P205P846o017o496m003O634R052J7663N139j1063m18Q893
6924A9112Q49j5339j0064j2996P332j3677j6751J9888L2544K7796k19r648k0388
6911H439K418N057k210l291p138p21k510L161L454K2757J3878J416k902L194o788
6896C8214n599N242O321j393l496j7404j1690J6053K844M854R893Q072j5796j8106
6882A8009J533P48j1344J9267J5030n654j8189j3048Q497J3472J2272j285p541
6869C1767j0526m054J3448K3783M8420O1652K5019k4298n9325n8000k2169q934
6857A6783j3393m005L258O529r18l365k137Q38J5343J3894O299J655q778J185
6843C3188q806M423K659q287j6723j2147K10O912r939n458J5770R893K430O143
$$ plain form
6829 20268 7546 18589 50653 80249 74133 68443 50977 40700 25506 15460 7425 5764 5417
6816 5417 7211 3631 10444 8507 17043 25264 25647 26681 29702 37274 35180 35869 32365 24546 23517
6801 23517 15447 6287 -662 -9300 -10516 -5872 5391 20183 29587 43891 46795 33487 21185
6788 21185 16407 12600 15861 18790 26608 29461 15038 9743 28323 32875 24267 28416 27423 21922
6774 21922 19375 16739 24871 19214 16612 23528 38190 54288 63993 55161 40576 35194 47914 41094
6760 41094 45152 66422 69318 82439 109107 116222 125622 122724 105228 94500 111548 135366 176148
6747 176148 219798 247855 269347 304644 330012 334027 282889 216774 170572 146767 152533 151094
6735 151094 163094 196748 219166 249110 281961 323966 360340 415003 501036 621963 798904
$$ packed form
6829B0268j2722J1043L2064K9596o116n690j7466j0277j5194j0046q035j661l47
6816E417J794l580O813j937Q536Q221L83J034L021P572k094O89l504p819j029
6801B3517q070r160o949q638j216M644J1263J4792R404J4304K904j3308j2302
6788B1185m778l807L261K929P818K853j4423n295J8580M552q608M149r93n501
6774B1922k547k636Q132n657k602O916J4662J6098R705q832j4585n382J2720o820
6760D1094M058K1270K896J3121K6668P115R400k898j7496j0728J7048K3818M0782
6747A76148M3650K8057K1492L5297K5368M015n1138o6115m6202k3805N766j439
6735A51094J2000L3654K2418K9944L2851M2005L6374N4663Q6033J20927J76941
$$ plain form
6724 798904 1099691 1567194 2262422 3243259 4328454 5128838 5054597 4051220 2821491
6715 2821491 1886064 1284586 912411 661883 488647 372417 279341 206353 185296 167128
6705 167128 135841 108710 102657 97765 93433 94095 96601 121682 130971 158958 180051 159603 122477
6692 122477 87619 56449 51804 43850 37322 25769 19939 18326 8120 17881 35126 47763 60289
6679 60289 67249 42216 13150 748 14521 20165 17125 19710 16733 -2977 -660 16178 17076
6666 17076 13134 18729 15593 11646 -4720 -7913 -5810 -7024 -10162 -18008 -21275 -20980 -17789 -6961
6652 -6961 -2310 6805 11726 6907 3715 261 1430 5763 6405 18475 26971 5783 224 -2318 -2925
6637 -2925 -14082 -15812 -11584 -9686 -10682 -7201 10554 13121 2972 -3141 -22210 -33417 -27426 -26765
$$ packed form
6724G98904L00787M67503O95228R80837J085195Q00384p4241j003377j229729
6715B821491r35427o01478l72175k50528j73236j16230r3076p2988k1057j8168
6705A67128l1287k7131o053m892m332O62K506K5081R289K7987K1093k0448l7126
6692A22477l4858l1170m645p954o528j1553n830j613j0206R761J7245J2637J2526
6679F0289O960k5033k9066j2402J3773N644l040K585k977j9710K317J6838Q98
6666A7076l942N595l136l947j6366l193K103j214l138p846l267K95L191J0828
6652f961M651R115M921m819l192l454J169M333O42J2070Q496k1188n559k542o07
6637b925j1157j730M228J898r96L481J7755K567j0149o113j9069j1207N991O61
$$ plain form
6623 -26765 -20985 -23302 -14271 -9066 -4544 -2502 -4705 -18658 -17682 -2311 13473 19415 -2572 -9462
6609 -9462 411 6362 2331 3061 8251 594 -6833 -7450 -938 13819 17445 16725 -6768 360 -2808
6594 -2808 -15597 -8565 -1575 12722 7359 10167 8046 9644 17892 11914 6469 -2125 -10432 1571
6580 1571 8191 10581 12733 4684 -5482 -11647 -6882 -17272 -13888 -82 -402 -9423 -19319 -25816
6566 -25816 -33143 -48478 -54347 -31452 -8428 -7767 -24521 -28524 -21113 -23656 -4086 4711 -12293
6553 -12293 -8595 617 2566 -3157 -11039 -15628 -10605 5430 7259 12878 17259 12454 2607 -15410
6539 -15410 -5510 -2316 968 8958 2159 9018 9455 5606 -706 -8011 -13562 -13608 -11029 -6778 11755
6524 11755 6815 -5724 8231 7995 -15308 -16451 -9600 -5163 -13459 1207 12819 4890 -6325
$$ packed form
6623b6765N780k317R031N205M522K042k203j3953R76J5371J5784N942k1987o890
6609i462R873N951m031P30N190p657p427o17O512J4757L626p20k3493P128l168
6594b808j2789P032O990J4297n363K808k121J598Q248n978n445q594q307J2003
6580A571O620K390K152q049j0166o165M765j0390L384J3806l20r021r896o497
6566b5816p327j5335n869K2895K3024O61j6754m003P411k543J9570Q797j7004
6553a2293L698R212J949n723p882m589N023J6035J829N619M381m805r847j8017
6539a5410R900L194L284P990o799O859M37l849o312p305n551m6K579M251J8533
6524A1755m940j2539J3955k36k3303j143O851M437q296J4666J1612p929j1215
$$ plain form
6511 -6325 -6994 -11800 -20251 -14179 -16219 -8627 -5812 172 113 7421 919 -5088 14485 3486 -13179
6496 -13179 -3536 12082 19780 15459 14510 11398 -3570 -15452 -7976 2205 4399 12256 341 -12434
6482 -12434 -19982 -22515 -27512 -20140 -3615 601 511 2709 2049 3853 13591 22898 12085 7410 1554
6467 1554 -12664 -9989 -7628 -14042 -15098 -15840 -12252 -7065 -14632 -28011 -16968 -20561 -17191 -10677
6453 -10677 -3138 -3945 -5498 -7547 -5639 14514 12621 13610 10269 -2346 -1175 -3938 -2022 -15266
6439 -15266 -17033 -4613 879 3782 -6090 -13105 -13730 -4795 -2549 8586 16551 14772 7722 20208
6425 20208 21067 2054 -1150 -9972 -11292 3149 -5904 -25100 -23173 -8406 -7587 -9428 -19653 -18981
6411 -18981 -4613 9585 25631 30136 23407 17140 12103 2788 13998 24070 12016 11211 2575
$$ packed form
6511f325o69m806q451O072k040P592K815N984n9P308o502o007J9573j0999j6665
6496a3179R643J5618P698m321r49l112j4968j1882P476J0181K194P857j1915j2775
6482a2434p548k533m997P372J6525M216r0K198o60J804R738R307j0813m675n856
6467A554j4218K675K361o414j056p42L588N187p567j3379J1043l593L370O514
6453a0677P539q07j553k049J908K0153j893R89l341j2615J171k763J916j3244
6439a5266j767J2420N492K903r872p015o25Q935K246J1135P965j779p050J2486
6425B0208Q59j9013l204q822j320J4441r053j9196J927J4767Q19j841j0225O72
6411a8981J4368J4198J6046M505o729o267n037r315J1210J0072j2054q05q636
$$ plain form
6398 2575 -1067 -5450 -29304 -35919 -19351 -2329 16177 21694 13042 14261 19326 11708 1325 4514
6384 4514 7831 18717 5161 -15970 -4899 7551 5410 4057 1694 -3960 -4971 -177 -833 446
6370 446 2569 403 24008 28960 24575 23150 22019 1701 -9105 -4230 281 6606 -458 -20104
6356 -20104 -23711 -3609 16915 16226 14249 13027 10289 5419 1575 10351 19674 16481 23720 21859
6342 21859 20984 21370 10943 -4420 -10553 -11263 -14266 -18733 -18358 -8506 -9051 -5888 -10283 -21845 -30667
6327 -30667 -25987 -20167 -15264 -7617 11376 8016 4364 -13403 -4575 5686 642 -12869 -16128 894
6313 894 11409 14551 9710 -6425 -12686 -11353 -6979 89 7251 19394 6989 -14579 -16866 -10907
6299 -10907 -4205 1266 2554 8212 4581 1414 -7763 -13910 -6026 -6941 -10637 -10459 -4967 3961 2533
$$ packed form
6398B575l642m383k3854o615J6568J7022J8506N517q652J219N065p618j0383L189
6384D514L317J0886j3556k1131J1071J2450k141j353k363n654j011M794o56J279
6370D46K123k166K3605M952m385j425j131k0318j0806M875M511O325p064j9646
6356b0104l607K0102K0524o89j977j222k738m870l844Q776R323l193P239j861
6342B1859q75L86j0427j5363o133p10l003m467L75R852n45L163m395j1562q822
6327c0667M680N820M903P647J8993l360l652j7767Q828J0261n044j3511l259J7022
6313H94J0515L142m841j6135o261J333M374P068P162J2143j2405k1568k287N959
6299a0907O702N471J288N658l631l167r177o147P884r15l696J78N492Q928j428
$$ plain form
6284 2533 5489 4936 3419 10588 9988 5735 7870 16506 24429 10871 8605 12225 15795 1869 -4575
6269 -4575 5743 14006 17981 30902 19661 673 -1093 1783 7705 7973 -5108 -2860 16077 16717
6255 16717 26047 24884 6654 -8390 -11492 -8281 -9287 6499 15043 7056 -8908 5322 13547
6242 13547 -7386 -17192 -11595 -17313 -29211 -31896 -6348 6524 4620 17680 26228 20458 11733
6229 11733 3131 -13464 -9857 4506 3208 -3261 -14906 -14179 -20848 -16521 -8366 -22392 -20609 -21492
6215 -21492 -13464 3313 14285 14219 10611 10747 6921 13634 26023 25484 12867 -5068 -4472 7699
6201 7699 -7662 -19203 -18930 -15605 -24336 -24483 -22600 -18779 -18509 -31473 -25515 -34108 -39349 -24912 -15008
6186 -15008 -9638 -3085 277 923 -5032 -17913 -19384 -24632 -8935 -5409 -13555 -30668 -37027 -31185
$$ packed form
6284B533K956n53j517P169o00m253K135Q636P923j3558k266L620L570j3926o444
6269d575J0318Q263L975J2921j1241j8988j766K876N922K68j3081K248J8937O40
6255A6717R330j163j8230j5044l102L211j006J5786Q544p987j5964J4230Q225
6242A3547k0933r806N597n718j1898k685K5548J2872j904J3060Q548n770q725
6229A1733q602j6595L607J4363j298o469j1645P27o669M327Q155j4026J783q83
6215b1492Q028J6777J0972o6l608J36l826O713J2389n39j2617j7935N96J2171
6201G699j5361j1541K73L325q731j47J883L821K70j2964N958q593n241J4437R904
6186a5008N370O553L362O46n955j2881j471n248J5697L526q146j7113o359N842
$$ plain form
6172 -31185 -19298 1508 15085 14147 6170 -384 -5744 4147 2356 -7483 -1490 -3519 -15023 -14833
6158 -14833 -10836 -12603 -19517 -14957 -16117 -17978 -16901 -5992 -10802 -9330 -3318 6688 26993 33156
6144 33156 29861 28736 17282 7952 8630 -818 -10872 -2588 -5314 -2036 11822 891 -4424 -2946
6130 -2946 -4023 -12080 -23576 -23299 -8632 -13218 -26891 -22498 -10648 -13241 -19796 -25463 -34546 -16516
6116 -16516 -617 -6565 -9930 -1701 9013 9555 19180 28851 27206 17913 9839 3852 -5 -13107
6102 -13107 -3522 -3770 -24589 -30344 -22970 -3956 6723 -1598 -20377 -15308 -7588 -13342 -14651 -8340
6088 -8340 -11105 -9379 -5714 -4096 -16791 -18927 -4115 4235 1269 8601 4800 -5407 -12837 -17803
6074 -17803 -15545 -12367 -14062 -15051 -29487 -32502 -30678 -27601 -18051 -12991 -11447 1817 -727 -3521
$$ packed form
6172c1185J1887K0806J3577r38p977o554n360R891j791r839N993k029j1504J90
6158a4833L997j767o914M560j160j861J077J0909m810J472O012J0006K0305O163
6144C3156l295j125j1454r330O78r448j0054Q284k726L278J3858j0931n315J478
6130b946j077q057j1496K77J4667m586j3673M393J1850k593o555n667r083J8030
6116a6516J5899n948l365Q229J0714N42R625R671j645r293q074n987l857j3102
6102a3107R585k48k0819n755P374J9014J0679q321j8779N069P720n754j309O311
6088h340k765J726L665J618j2695k136J4812Q350k966P332l801j0207p430m966
6074a7803K258L178j695r89j4436l015J824L077R550N060J544J3264k544k794
$$ plain form
6060 -3521 -3567 -846 -3155 -9854 -10810 1452 12522 1294 -7251 -6969 -17398 -15367 -2761 4409 8953
6045 8953 -5438 -10576 -10237 -16485 -9644 1576 4323 5301 -48 -5756 2182 15631 30691 24483
6031 24483 14429 11327 21249 27254 10917 -4694 -3782 -3333 -9016 -8060 -1074 3335 8681 6639 15654
6016 15654 10100 5457 -684 -9309 -23401 -17596 -3149 8567 909 5268 8811 -9826 -21313
6003 -21313 -32225 -26973 -17569 -6264 8160 4873 3791 571 1139 10140 14344 -1884 6382 6761
5989 6761 -565 -10845 -11449 -7705 -1733 2068 15546 27046 19046 9568 12497 -4241 -6002 -19338
5975 -19338 -24912 -28706 -22505 -16916 -15822 -29073 -10356 11104 8163 -1797 3213 -7569 -13627 2825
5961 2825 13596 6296 8211 12991 11111 9129 333 -1247 -6723 -1116 -8882 -13897 -13567 -7247 -1084
$$ packed form
6060c521m6K721k309o699r56J2262J1070j1228q545K82j0429K031J2606P170M544
6045H953j4391n138L39o248O841J1220K747R78n349n708P938J3449J5060o208
6031B4483j0054l102R922O005j6337j5611R12M49n683R56O986M409N346k042R015
6016A5654n554m643o141q625j4092N805J4447J1716p658M359L543j8637j1487
6003b1313j0912N252R404J1305J4424l287j082l220N68R001M204j6228Q266L79
5989F761p326j0280o04L744N972L801J3478J1500q000r478K929j6738j761j3336
5975a9338n574l794O201N589J094j3251J8717K1460k941r960N010j0782o058J6452
5961B825J0771p300J915M780j880j982q796j580n476N607p766n015L30O320O163
$$ plain form
5946 -1084 -11440 -15922 -15774 -27261 -22479 -22524 -20136 -23787 -22092 -22520 -6420 -4271 -6172 -14483 -14158
5931 -14158 -15967 -1488 4340 -2130 9439 12703 29726 30389 30114 22702 24391 10160 -1751 -10106
5917 -10106 -10293 -8866 -15867 -14135 -16647 -18183 -21788 -7868 12090 6894 -16416 -20345 2999 2294
5903 2294 -8657 4578 5288 626 3189 11188 -2682 -24228 -12269 -9928 -20011 -25759 -12931
5890 -12931 4725 9283 -6883 -10359 -11707 -13484 -9292 -3089 -3711 -11463 -12970 1877 11495 -5818
5876 -5818 -12247 -2590 -3087 -4758 -9148 -3863 1246 9553 4110 -12769 -5459 10216 16116 15900 31346
5861 31346 19639 8865 6664 -4815 -14219 -6651 2252 2449 9513 6551 11909 10874 -856 -4309
5847 -4309 -10054 -21782 -10105 -12508 -19776 -19977 -22866 -21453 -8622 9802 -202 -7218 -9000 1182
$$ packed form
5946a084j0356m482J48j1487M782m5K388l651J695m28J6100K149j901q311L25
5931a4158j809J4479N828o470J1569L264J7023O63k75p412J689j4231j1911q355
5917a0106j87J427p001J732k512j536l605J3920J9958n196k3310l929K3344p05
5903B294j0951J3235P10m662K563P999j3870k1546J1959K341j0083n748J2828
5890a2931J7656M558j6166l476j348j777M192O203o22p752j507J4847R618j7313
5876e818o429R657m97j671m390N285N109Q307n443j6879P310J5675N900k16J5446
5861C1346j1707j0774k201j1479r404P568Q903J97P064k962N358j035j1730l453
5847d309n745j1728J1677k403p268k01k889J413J2831J8424j0004p016j782J0182
$$ plain form
5833 1182 -2836 -2459 1009 -5800 -5873 -4150 -16042 -26916 -34339 -27987 -22092 -12941 -10751 -13789 2140
5818 2140 13451 7856 6672 11372 7996 -6436 -10186 -12465 -8902 7466 4134 12636 21062 13322
5804 13322 16107 15200 6158 -13562 -31751 -36586 -14209 -3779 5958 19311 9644 9325 7634 -3808
5790 -3808 5443 9893 -8984 -29803 -32120 -24736 -11154 -13287 -5670 10957 4170 -6919 -13560 -19492
5776 -19492 -6586 13784 19605 11720 16218 218 3463 3300 13059 27101 20499 25115 32045 20290
5762 20290 9246 12732 1812 -2244 -2307 -9308 -13993 -11874 -17056 -1404 4497 -14577 -25355 -36046
5748 -36046 -31860 -15266 -3776 8013 5560 -1059 -6118 563 5400 4177 10314 9757 -6354 -6774
5734 -6774 -6261 -4657 -7884 -3817 -8212 1425 3898 11147 3062 -17137 -25220 -31053 -21345 -16894 -13399
$$ packed form
5833A182m018L77L468o809p3J723j1892j0874p423O352N895R151K190l038J5929
5818B140J1311n595j184M700l376j4432l750k279L563J6368l332Q502Q426p740
5804A3322K785r07r042j9720j8189m835K2377J0430R737J3353r667l19j691j1442
5790c808R251M450j8877k0819k317P384J3582k133P617J6627o787j1089o641n932
5776a9492J2906K0370N821p885M498j6000L245j63R759J4042o602M616O930j1755
5762B0290j1044L486j0920m056o3p001m685K119n182J5652N901j9074j0778j0691
5748c6046M186J6594J1490J1789k453o619n059O681M837j223O137n57j6111m20
5734f774N13J604l227M067m395R637K473P249q085k0199q083n833R708M451L495
$$ plain form
5719 -13399 -5021 -2908 -9632 -15138 -6690 3872 -1380 -2031 -4624 -7552 -1603 -5131 -10313 -30244
5705 -30244 -28232 -12870 -3974 -8651 -967 1759 10305 22662 16296 14108 12791 13172 26337 21608
5691 21608 14470 3865 1472 12317 12313 13705 19852 30901 12442 -3396 -18261 -22299 -24962 -14042
5677 -14042 -5890 -13945 -24032 -27459 -23545 -25568 -13577 5569 10220 9937 -1530 -10697 -4246 7180
5663 7180 4925 7483 13196 21489 10677 -19912 -34253 -22213 -4227 -4497 -6629 -13011 -11201 -2123
5649 -2123 6894 6713 10746 -5633 -12006 -6113 939 5635 -19983 -22681 -15365 -16528 -23660 -16038 -918
5634 -918 -4670 -12662 -22755 -26997 -11324 221 7751 -1244 1757 15956 27784 11941 -16214
5621 -16214 -20310 -12024 -187 -1915 2510 10660 -6225 -11610 -12902 -13869 -13958 -21864 -26623 -17328 -3446
$$ packed form
5719a3399Q378K113o724n506Q448J0562n252o51k593k928N949l528n182j9931
5705c0244K012J5362Q896m677P684K726Q546J2357o366k188j317L81J3165m729
5691B1608p138j0605k393J0845mJ392O147J1049j8459j5838j4865m038k663J0920
5677a4042Q152q055j0087l427L914k023J1991J9146M651k83j1467r167O451J1426
5663G180k255K558N713Q293j0812l0589j4341J2040J7986k70k132o382J810R078
5649b123R017j81M033j6379o373N893P052M696k5618k698P316j163p132P622J5120
5634i18l752p992j0093m242J5673J1545P530q995L001J4199J1828j5843k8155
5621a6214m096Q286J1837j728M425Q150j6885n385j292r67q9p906m759R295J3882
$$ plain form
5606 -3446 -45 7948 14373 13969 -13532 -12068 -14502 -21695 -12145 -3570 -11750 -5289 3416 11025 1106
5591 1106 -6785 -10072 -4398 6575 5784 -16256 -20563 -1818 -6118 -1270 7950 -4128 -9187 7822
5577 7822 27097 19896 8015 16887 4285 6164 11259 12130 923 -12510 -20469 -731 13472
5564 13472 10615 -10745 -8329 -1338 7996 6380 3885 -5199 -11544 -22921 -16833 -11781 -6020 -16664
5550 -16664 -21488 -20497 -24440 -34895 -36918 -28770 -7850 -3367 -11938 -7797 72 -19319 -16195 -2322
5536 -2322 7897 -4482 -15190 -23828 -25623 -12579 -3533 -12166 2927 21250 22154 15502 2896
5523 2896 -9529 -12587 -9702 -1330 -846 -12675 -12767 -14844 -17020 -27660 -38048 -34926 -38014 -45212 -36216
5508 -36216 -26753 -16112 -10491 -6633 -12595 -22768 -22808 -10414 -3347 3205 6399 -1192 2793 -5381
$$ packed form
5606c446L401P993O425m04k7501J464k434p193R550Q575q180O461Q705P609r919
5591A106p891l287N674J0973p91k2040m307J8745m300M848R220j2078n059J7009
5577G822J9275p201j1881Q872j2602J879N095Q71j1207j3433p959J9738J4203
5564A3472k857k1360K416O991R334j616k495r084o345j1377O088N052N761j0644
5550a6664m824R91l943j0455k023Q148K0920M483q571M141P869j9391L124J3873
5536b322J0219j2379j0708q638j795J3044R046q633J5093J8323R04o652j2606
5523B896j2425l058K885Q372M84j1829r2k077k176j0640j0388L122l088p198Q996
5508c6216R463J0641N621L858n962j0173m0J2394P067O552L194p591L985q174
$$ plain form
5494 -5381 -7440 -10871 -9989 -6156 -10286 -4770 2986 4737 7708 -4594 -20842 -18912 36 11853
5480 11853 7004 -1332 -8728 -15770 -15609 -20798 -23857 -26493 -23078 -25509 -14442 -14235 -187 -6750 -18501
5465 -18501 -32240 -31217 -15803 -1825 3120 -14774 -31646 -24944 -19585 -15152 -8272 1626 -4160
5452 -4160 -5028 -6590 -9567 6200 16592 9112 7326 -941 -5294 -12737 -16654 -8084 -250 -7293 -14458
5437 -14458 -18395 -19125 -22845 -6770 15170 30550 9478 -10339 -1917 7837 -6461 -14032 -16488
5424 -16488 -16813 -4354 798 -11136 -23649 -26882 -20570 -16131 -3760 -5711 8682 9239 -6321 -8317
5410 -8317 -22238 -18311 -2622 13225 7547 7351 -3656 -12114 35 -6550 -16412 -23513 -27607 -25807
5396 -25807 -22017 -21487 -13756 -3846 -989 -5722 -5835 6637 -1667 -9681 -1576 6010 19144 19104 12381
$$ packed form
5494e381k059l431Q82L833m130N516P756J751K971j2302j6248J930J8948J1817
5480A1853m849q336p396p042J61n189l059k636L415k431J1067K07J4048o563j1751
5465a8501j3739J023J5414J3978M945j7894j6872O702N359M433O880R898n786
5452d160q68j562k977J5767J0392p480j786q267m353p443l917Q570P834p043p165
5437a4458l937p30l720J6075K1940J5380k1072j9817Q422R754j4298p571k456
5424a6488l25J2459N152j1934j2513l233O312M439J2371j951J4393N57j5560j996
5410h317j3921L927J5689J5847n678j96j1007q458J2149o585r862p101m094J800
5396b5807L790N30P731R910K857m733j13J2472q304q014Q105P586J3134m0o723
$$ plain form
5381 12381 -205 -3231 547 -6108 -22845 -21196 -28384 -12454 -6656 -12489 -4130 4956 10707 11431
5367 11431 19484 16443 13177 1838 -15412 -12556 -19915 -32803 -16688 -2685 -844 -4794 -1948
5354 -1948 9424 14151 7394 7619 2000 10546 400 -13032 -8593 -2293 6715 5682 5674 2942 -6343
5339 -6343 -231 12163 16236 10470 700 1019 10927 12897 4684 -773 -6986 -980 1398 13431 18026
5324 18026 18870 8939 14511 12349 6846 12950 12082 19212 22419 14271 3221 2096 -10057 -4297 -5440
5309 -5440 1005 11764 -7427 -22066 -13960 -1689 11983 18061 26044 15119 10583 1655 312
5296 312 -8765 -14588 -15864 -15016 -4992 -1731 -11834 -10809 -10039 -9259 -12489 -8170 -5682 -956 2364
5281 2364 511 3033 8345 8328 7486 4234 -1133 -9201 -8363 -10262 -6835 990 -4118 -14331 -26213
$$ packed form
5381A2381j2586l026L778o655j6737J649p188J5930N798n833Q359R086N751P24
5367A1431Q053l041l266j1339j7250K856p359j2888J6115J4003J841l950K846
5354a948J1372M727o757K25n619Q546j0146j3432M439O300R008j033qk732r285
5339f343O112J2394M073n766r770L19R908J970q213n457o213O006K378J2033M595
5324A8026Q44r931N572k162n503O104q68P130L207q148j1050j125j2153N760j143
5309e440O445J0759j9191j4639Q106J2271J3672O078P983j0925m536q928j343
5296C12r077n823j276Q48J0024L261j0103J025P70P80l230M319K488M726L320
5281B364j853K522N312j7q42l252n367q068Q38j899L427P825n108j0213j1882
$$ plain form
5266 -26213 -33418 -24865 -11882 -15270 -2727 17917 40695 36255 19537 3518 15064 20973 14008
5253 14008 5618 -8134 -14711 -409 -4681 -9190 4250 4616 -6017 -5990 -12554 -8215 7871 10953
5239 10953 6820 8242 -4166 -642 15197 13357 981 -6744 -17803 -21950 -5652 -3970 -9468
5226 -9468 4176 22476 20873 4578 -2872 9230 5932 2031 9060 14645 12361 25068 40165
5213 40165 25703 23862 21286 14288 5503 -10617 -2019 -7156 -5757 6045 7436 8462 9059 -1965
5199 -1965 4164 20638 26330 14217 22520 30236 2254 -17084 -1312 427 -2241 -10196 -12645 -5440
5185 -5440 -2806 2779 7729 8914 -3171 -16875 -21246 -13812 11271 17701 21670 22184 14432 2895
5171 2895 3429 4249 -3978 -5447 -13216 -11912 -5716 -20281 -17367 -13565 -3649 -1039 11831 12026 10560
$$ packed form
5266b6213p205Q553J2983l388J2543K0644K2778m440j6718j6019J1546N909o965
5253A4008q390j3752o577J4302m272m509J3440L66j0633K7o564M339J6086L082
5239A0953m133J422j2408L524J5839j840j2376p725j1059m147J6298J682n498
5226i468J3644J8300j603j6295p450J2102l298l901P029N585k284J2707J5097
5213D0165j4462j841k576o998q785j6120Q598n137J399J1802J391J026N97j1024
5199a965O129J6474N692j2113Q303P716k7982j9338J5772J739k668p955k449P205
5185e440K634N585M950J185j2085j3704m371P434K5083O430L969N14p752j1537
5171B895N34Q20q227j469p769J304O196j4565K914L802R916K610J2870J95j466
$$ plain form
5156 10560 7732 6888 3886 -1055 -17980 -6877 2960 10643 11261 6927 17100 31984 25706 7716
5142 7716 6354 -2468 -1643 -14616 -32723 -38734 -40944 -41606 -35757 -28979 -21644 -27124 -12312 -2503 -8193
5127 -8193 -20913 -19816 -24610 -33047 -26789 -11623 -17340 -29559 -41636 -40224 -32108 -12527 11120
5114 11120 10620 3128 10289 18500 11133 14221 9800 1671 -6859 -16168 -8014 7286 2317 10616 21505
5099 21505 13021 6512 2821 -19347 -36458 -34418 -25852 -15605 -3743 -8945 -7308 -7857 -13465 -14608
5085 -14608 -6811 -3452 -1023 -14203 -9692 -11985 -13640 -16728 -18686 -9484 -3683 2645 1323 -16236
5071 -16236 -19470 -3483 2371 -3201 -1482 -8940 -12936 -5023 -1185 -8827 -18641 -20276 -15903 -25841
5057 -25841 -26379 -25492 -17649 -3149 2231 5040 -12529 -17539 -10254 -8216 -5203 -4139 -12025 -6047 -10041
$$ packed form
5156A0560k828q44l002m941j6925J1103R837P683O18m334J0173J4884o278j7990
5142G716j362q822Q25j2973j8107o011k210o62N849O778P335n480J4812R809n690
5127h193j2720J097m794q437O258J5166n717j2219j2077J412Q116J9581K3647
5114A1120n00p492P161Q211p367L088m421q129q530r309Q154J5300m969Q299J0889
5099B1505q484o509l691k2168j7111K040Q566J0247J1862n202J637n49n608j143
5085a4608P797L359K429j3180M511k293j655l088j958R202N801O328j322j7559
5071a6236l234J5987N854n572J719p458l996P913L838p642r814j635M373r938
5057b5841n38Q87P843J4500N380K809j7569n010P285K038L013J064p886N978l994
$$ plain form
5042 -10041 -12796 -18159 -14605 -5197 4898 -889 199 -15604 -27990 -32231 -29756 -29508 -21693 -13327
5028 -13327 7611 3768 -606 -3649 7135 24249 16196 592 -10190 -10095 -2031 12378 13930 2856
5014 2856 -14032 -18092 -21433 -19447 -23373 -8697 -1727 -10046 -15012 -13709 -10479 -5681 2830 -1264
5000 -1264 3895 15590 870 -17078 -23448 -28393 -11950 -6102 14 2718 -6292 -3601 -8870 -13917
4986 -13917 1282 8479 4321 6297 7964 1564 4156 -1970 -2544 -2489 -6261 -6240 5576 16987 15652
4971 15652 -885 -22616 -31537 -16802 -17771 -29360 -14641 -5436 -15007 -3690 -4890 -16355 -20643
4958 -20643 -20901 -13233 -8148 -11667 -15909 -17802 -4218 -6101 -38 26506 24561 17325 14898 4269
4944 4269 12140 3346 -8065 -12187 -17165 -13877 -13118 -9351 8686 20178 12116 11112 18657 10510
$$ packed form
5042a0041k755n363L554R408J0095n787J088j5803j2386m241K475K48P815Q366
5028a3327K0938l843m374l043J0784J7114q053j5604j0782R5Q064J4409J552j1074
5014B856j6888m060l341J986l926J4676O970q319m966J303L230M798Q511m094
5000a264N159J1695j4720j7948o370m945J6443N848O116K704r010K691n269n047
4986a3917J5199P197m158J976J667o400K592o126n74N5l772K1J1816J1411j335
4971A5652j6537k1731q921J4735r69j1589J4719R205r571J1317j200j1465m288
4958b0643k58P668N085l519m242j893J3584j883O063K6544j945p236k427j0629
4944D269P871q794j1411m122m978L288P59L767J8037J1492q062j004P545q147
$$ plain form
4930 10510 188 -2373 12546 7967 2569 8224 9555 -4925 -10793 -14945 -579 23366 26527
4917 26527 27616 24476 18016 14758 18009 13545 8211 -6783 -26524 -22742 -8517 -1428 -6482 -4466
4903 -4466 -3005 -6652 -1902 13216 16305 9340 10393 5312 -3826 -9897 -15066 -24257 -22010 -35097
4889 -35097 -26377 2745 3545 4464 290 -10530 -9181 -5285 -5156 -7674 -14522 -10890 564 23310
4875 23310 17443 9820 2802 14528 15242 -2167 -18881 -24394 -24757 -27998 -28178 -26301 -23600 -18254 -7494
4860 -7494 -9078 -26618 -24813 -20590 -21338 -9001 -7008 -8235 -10433 -11024 -2986 -8788 -2963 8259 591
4845 591 3315 9766 17519 13877 10162 10198 3322 -12198 -19683 -3450 18567 9242 4195 -887 -6515
4830 -6515 -3634 -1609 -2424 -16187 -11424 -10803 -28766 -18646 -395 8345 12546 -5264 -18507 -3275
$$ packed form
4930A0510j0322k561J4919m579n398N655J331j4480n868m152J4366K3945L161
4917B6527J089l140o460l258L251m464n334j4994j9741L782J4225P089n054K016
4903d466J461l647M750J5118L089o965J053n081r138o071n169r191K247j3087
4889c5097Q720K9122Q00R19m174j0820J349L896J29k518o848L632J1454K2746
4875B3310n867p623p018J1726P14j7409j6714n513l63l241j80J877K701N346J0760
4860g494j584j7540J805M223p48J2337J993j227k198n91Q038n802N825J1222p668
4845E91K724O451P753l642l715L6o876j5520p485J6233K2017r325n047n082n628
4830f515K881K025q15j3763M763O21j7963J0120J8251Q740M201j7810j3243J5232
$$ plain form
4816 -3275 2945 1478 -6413 -10424 -9494 -15313 -11628 -11311 -20234 -18202 -13861 -18811 -19384 -16465 -11869 -23031
4800 -23031 -21103 -24545 -38463 -43139 -42675 -37417 -18948 -3038 5781 1245 3519 -8079 -11186 -4701
4786 -4701 -2498 -1132 4841 5210 3124 -16332 -15049 -775 18621 22720 10482 9350 3818 87
4772 87 3354 4745 8403 -5646 -1473 -4342 -6306 673 -9424 -11719 -13155 -6084 468 874 1216
4757 1216 2613 -2927 -9687 2107 -530 -2406 4055 -7248 -20413 -22940 -15560 -19709 -27326 -26943
4743 -26943 -9837 -11612 -1250 -6337 -2629 11968 16426 -3644 -3335 6877 19253 9019 2243
4730 2243 -4067 -3519 10391 16663 -3368 -6141 -15119 -20254 -10026 -6472 703 2896 -6955 -20379
4716 -20379 -23027 -39034 -27259 -19025 -12379 -12348 -12179 -12819 -16802 -11572 2110 15369 12454 17171 16518
$$ packed form
4816c275O220j467p891m011R30n819L685L17q923K032M341m950n73K919M596j1162
4800b3031J928l442j3918m676M64N258J8469J5910Q819m536K274j1598l107O485
4786d701K203J366N973L69k086j9456J283J4274J9396M099j2238j132n532l731
4772H7L267J391L658j4049M173k869j964O979j0097k295j436P071O552M06L42
4757A216J397n540o760J1794k637j876O461j1303j3165k527P380m149p617L83
4743b6943J7106j775J0362n087L708J4597M458k0070L09J0212J2376j0234o776
4730B243o310N48J3910O272k0031k773q978n135J0228L554P175K193r851j3424
4716b0379k648j6007J1775Q234O646L1J69o40l983N230J3682J3259k915M717o53
$$ plain form
4701 16518 12767 19331 23065 9466 -1011 -3173 -20847 -29709 -29944 -17990 -9468 -23004 -19119 -24930
4687 -24930 -32144 -29324 -17093 1064 6839 -5108 -3910 3564 6049 2454 -1600 -1120 2265 11059
4673 11059 27577 35437 13724 -523 11850 13827 6131 941 -15324 -17317 -19749 -22244 -19375
4660 -19375 -22599 -6097 -4972 -14376 -6085 1578 6657 1442 857 -4772 587 5007 13923 21200 17500
4645 17500 13657 8571 -1846 -15318 -18620 -27297 -25738 -17191 -16208 -8612 -18695 -9328 2420 3826
4631 3826 -9265 -22630 -17112 -13902 -9749 -6103 -5025 -3091 11449 5723 -3825 7588 12639 17406
4617 17406 20341 5198 -13922 -28076 -20784 -14702 -16073 -20363 -15543 -13366 -22882 -17139 -16314 -24351
4603 -24351 -30387 -24970 -24972 -19655 -7334 -6855 -2285 -6235 -6856 9672 7945 -5064 -13034 307 8644
$$ packed form
4701A6518l751O564L734j3599j0477k162j7674q862k35J1954Q522j3536L885n811
4687b4930p214K820J2231J8157N775j1947J198P474K485l595m054M80L385Q794
4673A1059J6518P860k1713j4247J2373J977p696n190j6265j993k432k495K869
4660a9375l224J6502J125r404Q291P663N079n215n85n629N359M420Q916P277l700
4645A7500l843n086j0417j3472l302q677J559Q547R83P596j0083R367J1748J406
4631C826j3091j3365N518L210M153L646J078J934J4540n726r548J1413N051M767
4617A7406K935j5143j9120j4154P292O082j371m290M820K177r516N743Q25q037
4603b4351o036N417kN317J2321M79M570l950o21J6528j727j3009p970J3341Q337
$$ plain form
4588 8644 7492 -7329 -8107 -10463 -23667 -24589 -8614 -9625 49 7605 639 -6617 -9958 -12643 882
4573 882 4850 -2885 -4362 -11077 -16131 -12970 -20886 -14225 -5056 8151 -6898 -6903 -17498 -37587 -35380
4558 -35380 -32766 -22113 -13516 -14638 -14310 -9399 -24433 -21187 -14050 -1559 1837 6485 -2623 -9126
4544 -9126 -6577 6403 14027 7703 -14720 -23797 -20062 -17344 -5625 5943 20948 19756 11929 14701
4530 14701 9973 9365 4317 -4409 9020 6472 -10441 -16874 -10650 4125 -2488 -2206 -2233 -10130 -8016
4515 -8016 -3358 -5380 -15605 -9339 -9193 -4283 -8344 -3458 5075 13972 30613 19423 -16653 -17105
4501 -17105 -6325 2313 7345 6885 -3174 -10317 -8656 -14857 -20487 -22329 -3497 14369 18144 182
4487 182 1540 -13517 -11402 -12249 -9146 -8540 -19022 -22642 -15810 1641 5996 -1388 -14428 -3961
$$ packed form
4588H644j152j4821p78k356j3204r22J5975j011R674P556o966p256l341k685J3525
4573H82L968p735j477o715n054L161p916O661R169J3207j5049nj0595k0089K207
4558c5380K614J0653Q597j122L28M911j5034L246P137J2491L396M648r108o503
4544i126K549J2980P624o324k2423r077L735K718J1719J1568J5005j192p827K772
4530A4701m728o08n048q726J3429k548j6913o433O224J4775o613K82k7p897K114
4515h016M658k022j0225O266J46M910m061M886Q533Q897J6641j1190l6076m52
4501a7105J0780Q638N032m60j0059p143J661o201n630j842J8832J7866L775j7962
4487A82J358j5057K115q47L103O06j0482l620O832J7451M355p384j3040J0467
$$ plain form
4473 -3961 6137 -12172 -46468 -37388 -24028 -12446 -7601 -9744 -25165 -19997 -1679 -7106 -6280
4460 -6280 -4061 -5506 -7185 -8293 5066 3119 -4526 -13035 -14785 -19236 -20366 -25260 -15493 -8603 -12227
4445 -12227 -7401 -155 6968 18073 18980 9974 14749 11193 -2461 -11737 -9674 -8578 -1828 27194
4431 27194 48215 52340 40045 15199 9012 2935 -9464 -6897 -9705 -15410 -10597 -12365 -320
4418 -320 -6292 -9613 -31 2831 -10919 -17272 -4360 7504 16366 15427 9141 -6340 -14288 -4574
4404 -4574 11339 18764 25522 31000 25609 28232 21191 21508 25087 20020 21200 14624 9899 8654 11811
4389 11811 9106 3466 1327 4975 -5680 -20598 -8130 12099 5206 4510 -12339 -19521 -6074
4376 -6074 16814 27155 22863 7907 924 4476 -5805 -2817 2916 3989 -10598 -14041 -13651 -11572
$$ packed form
4473c961J0098j8309l4296R080J3360J1582M845k143j5421N168J8318n427Q26
4460f280K219j445j679j108J3359j947p645q509j750m451j130m894R767O890l624
4445a2227M826P246P123J1105R07r006M775l556j3654r276K063J096O750K9022
4431B7194K1021M125j2295k4846o187o077j2399K567k808n705M813j768J2045
4418c20n972l321R582K862j3750o353J2912J1864Q862r39o286j5481p948R714
4404d574J5913P425O758N478n391K623p041L17L579n067J180o576m725j245L157
4389A1811k705n640k139L648j0655j4918J2468K0229o893o96j6849p182J3447
4376f074K2888J0341m292j4956o983L552j0281K988N733J073j4587l443L90K079
$$ plain form
4362 -11572 -745 -5774 -6004 -2141 8440 6034 -18443 -19980 -27652 -21940 -356 1174 9284 15974
4348 15974 18163 11370 -13589 -13841 -6267 -12831 -17983 -14748 -20426 -8357 -10749 -15315 -21488 -10268
4334 -10268 4145 13641 9222 3641 4480 12354 16777 9901 5563 1959 11661 23806 10100 -4365
$$ packed form
4362a1572J0827n029k30L863J0581k406k4477j537p672N712K1584J530Q110O690
4348A5974K189o793k4959k52P574o564n152L235n678J2069k392m566o173J1220
4334a0268J4413R496m419n581Q39P874M423o876m338l604R702J2145j3706j4465
$$ [...]
##END NTUPLES=NMR SPECTRUM
##END=
