##TITLE=Analysis number 307346
Compound Code cc 39109
Book Reference 399/137
Project Code qc-cat
Chemist Name evam
##JCAMPDX= 6.0         $$ Bruker NMR JCAMP-DX V2.0
##DATA TYPE= NMR SPECTRUM
##DATA CLASS= NTUPLES
##ORIGIN= Bruker BioSpin GmbH
##OWNER= NMR
$$ XWIN-NMR		Version 3.5
$$ Thu Apr 28 11:18:31 2005 GMT Daylight Time (UT+1h)  MAYBRIDGE\NMR@NMR_250MHZ
##.OBSERVE FREQUENCY= 250.131544655141
##.OBSERVE NUCLEUS= ^1H
##.ACQUISITION MODE= SIMULTANEOUS (DQD)
##.ACQUISITION SCHEME= undefined
##.AVERAGES= 16
##.DIGITISER RES= 18
##SPECTROMETER/DATA SYSTEM= dpx250
##.PULSE SEQUENCE= zg30
##.SOLVENT NAME= DMSO
##.SHIFT REFERENCE= (INTERNAL, DMSO, 0, 16.522)
##AUDIT TRAIL= $$ (NUMBER, WHEN, WHO, WHERE, WHAT)
$$ ##TITLE= Audit trail, XWIN-NMR		Version 3.5
$$ ##JCAMPDX= 5.01
$$ ##ORIGIN= Bruker BioSpin GmbH
$$ ##OWNER= NMR
$$ C:\u/data/dgb/nmr/ADRS/2460/pdata/1/auditp.txt
$$ ##AUDIT TRAIL=  $$ (NUMBER, WHEN, WHO, WHERE, WHAT)
(   1,<2005-04-28 11:18:13.06 +100>,<MAYBRIDGE\NMR>,<NMR_250MHZ>,
      <created by zg, POWCHK disabled, PULCHK disabled
       configuration hash MD5:
       62 19 C7 07 E1 42 D1 B7 37 6C 3D D0 77 39 F9 E6
       data hash MD5: 64K
       8F CF EA 4F 85 36 D1 E9 3D 93 98 01 26 03 EA 0F>)
(   2,<2005-04-28 11:18:24.06 +100>,<MAYBRIDGE\NMR>,<NMR_250MHZ>,
      <Start of raw data processing
       ef LB = 0.3 FT_mod = 6 PKNL = 1 SI = 32K 
       data hash MD5: 32K
       18 6C E3 33 EA C2 1D 3D 85 F9 AA B3 5A 48 D9 8B>)
(   3,<2005-04-28 11:18:25.93 +100>,<MAYBRIDGE\NMR>,<NMR_250MHZ>,
      <apk 
       data hash MD5: 32K
       6E 49 5B BD E2 E1 96 DE AF A3 C0 9B 23 48 3E 83>)
(   4,<2005-04-28 11:18:26.60 +100>,<MAYBRIDGE\NMR>,<NMR_250MHZ>,
      <abs ABSG = 5 
       data hash MD5: 32K
       94 41 59 5F C4 DB 38 98 E1 63 70 F3 59 48 9B 20>)
$$ ##END=
$$ 
$$ hash MD5
$$ 69 C3 5D 86 35 E1 3A D0 14 98 25 FB BC D7 84 72
##$RELAX= 
##$RELAX= 
##$RELAX= 
##$RELAX= 
##$RELAX= 
##$RELAX= 
##$RELAX= 
$$ Bruker specific parameters
$$ --------------------------
##$DU= <C:\u>
##$EXPNO= 2460
##$NAME= <ADRS>
##$PROCNO= 1
##$TYPE= <nmr>
##$USER= <dgb>
##$AMP= (0..31)
100 100 100 100 100 100 100 100 100 100 100 100 100 100 100 100 100 100 
100 100 100 100 100 100 100 100 100 100 100 100 100 100 
##$AQSEQ= 0
##$AQ_mod= 3
##$AUNM= <au_zg>
##$AUTOPOS= <15 >
##$BF1= 250.13
##$BF2= 250.13
##$BF3= 250.13
##$BF4= 250.13
##$BF5= 500.13
##$BF6= 500.13
##$BF7= 500.13
##$BF8= 500.13
##$BYTORDA= 1
##$CFDGTYP= 0
##$CFRGTYP= 5
##$CHEMSTR= <none>
##$CNST= (0..31)
1 1 145 1 1 1 1 1 1 1 1 1 1 1 1 1 1 1 1 1 1 1 1 1 1 1 1 1 1 1 1 1 
##$CPDPRG= <>
##$CPDPRG1= <>
##$CPDPRG2= <>
##$CPDPRG3= <>
##$CPDPRG4= <mlev>
##$CPDPRG5= <mlev>
##$CPDPRG6= <mlev>
##$CPDPRG7= <mlev>
##$CPDPRG8= <mlev>
##$CPDPRGB= <>
##$CPDPRGT= <>
##$D= (0..31)
0 1 0 0 0 0 0 0 0 0.06 0 0 0 0 0 0 0.0002 0 0 0 0 0 0 0 0 0 0 0 0 0 0 
0 
##$DATE= 1114683492
##$DBL= (0..7)
120 120 120 120 120 120 120 120 
##$DBP= (0..7)
150 150 150 150 150 150 150 150 
##$DBP07= 0
##$DBPNAM0= <>
##$DBPNAM1= <>
$$ [...]
##$SUBNAM6= <"">
##$SUBNAM7= <"">
##$SUBNAM8= <"">
##$SUBNAM9= <"">
##$SW= 20.6930455092707
##$SWIBOX= (0..15)
0 0 3 0 0 0 0 0 0 0 0 0 0 0 0 0 
##$SW_h= 5175.983436853
##$TD= 65536
##$TD0= 1
##$TE= 295.16
##$TE2= 300
##$TE3= 300
##$TEG= 300
##$TL= (0..7)
0 120 120 120 120 120 120 120 
##$TP= (0..7)
150 150 150 150 150 150 150 150 
##$TP07= 0
##$TPNAME0= <>
##$TPNAME1= <>
##$TPNAME2= <>
##$TPNAME3= <>
##$TPNAME4= <>
##$TPNAME5= <>
##$TPNAME6= <>
##$TPNAME7= <>
##$TPOAL= (0..7)
0.5 0.5 0.5 0.5 0.5 0.5 0.5 0.5 
##$TPOFFS= (0..7)
0 0 0 0 0 0 0 0 
##$TUNHIN= 0
##$TUNHOUT= 0
##$TUNXOUT= 0
##$USERA1= <user>
##$USERA2= <user>
##$USERA3= <user>
##$USERA4= <user>
##$USERA5= <user>
##$V9= 5
##$VALIST= <valist>
##$VCLIST= <CCCCCCCCCCCCCCC>
##$VD= 0
##$VDLIST= <DDDDDDDDDDDDDDD>
##$VPLIST= <PPPPPPPPPPPPPPP>
##$VTLIST= <TTTTTTTTTTTTTTT>
##$WBST= 1024
##$WBSW= 4
##$XGAIN= (0..3)
0 0 0 0 
##$XL= 0
##$YL= 0
##$YMAX_a= 296066
##$YMIN_a= -420961
##$ZGOPTNS= <>
##$ZL1= 120
##$ZL2= 120
##$ZL3= 120
##$ZL4= 120
##$ABSF1= 16.522
##$ABSF2= -4.171173
##$ABSG= 5
##$ABSL= 3
##$ALPHA= 0
##$AQORDER= 0
##$ASSFAC= 0
##$ASSFACI= 0
##$ASSFACX= 0
##$ASSWID= 0
##$AUNMP= <proc_1d>
##$AZFE= 0.1
##$AZFW= 0.1
##$BCFW= 0
##$BC_mod= 0
##$BYTORDP= 0
##$COROFFS= 0
##$CY= 12.5
##$DATMOD= 1
##$DC= 0
##$DFILT= <>
##$DTYPP= 0
##$F1P= 14.0000005364418
##$F2P= -0.99999901652339
##$FCOR= 0.5
##$FTSIZE= 32768
##$FT_mod= 6
##$GAMMA= 0
##$GB= 0
##$INTBC= 1
##$INTSCL= 1
##$ISEN= 128
##$LB= 0.3
##$LEV0= 0
##$LPBIN= 0
##$MAXI= 10000
##$MC2= 0
##$MEAN= 0
##$ME_mod= 0
##$MI= 0
##$NCOEF= 0
##$NC_proc= -3
##$NLEV= 6
##$NOISF1= 0
##$NOISF2= 0
##$NSP= 0
##$NTH_PI= 0
##$NZP= 0
##$OFFSET= 16.522
##$PC= 1
##$PHC0= -88.72073
##$PHC1= 12.874
##$PH_mod= 1
##$PKNL= yes
##$PPARMOD= 0
##$PSCAL= 4
##$PSIGN= 0
##$REVERSE= no
##$SF= 250.13
##$SI= 32768
##$SIGF1= 0
##$SIGF2= 0
##$SINO= 400
##$SIOLD= 32768
##$SREGLST= <1H.DMSO>
##$SSB= 0
##$STSI= 32768
##$STSR= 0
##$SW_p= 5175.98343685301
##$SYMM= 0
##$S_DEV= 0
##$TDeff= 65536
##$TDoff= 0
##$TI= <Analysis number 999999
Compound Code 99
Book Reference 9
Project Code 9>
##$TILT= no
##$TM1= 0
##$TM2= 0
##$TOPLEV= 0
##$USERP1= <user>
##$USERP2= <user>
##$USERP3= <user>
##$USERP4= <user>
##$USERP5= <user>
##$WDW= 1
##$XDIM= 32768
##$YMAX_p= 334718997
##$YMIN_p= -147311
$$ End of Bruker specific parameters
$$ ---------------------------------
##NTUPLES= NMR SPECTRUM
##VAR_NAME=  FREQUENCY,     SPECTRUM/REAL,   SPECTRUM/IMAG
##SYMBOL=    X,             R,               I
##VAR_TYPE=  INDEPENDENT,   DEPENDENT,       DEPENDENT
##VAR_FORM=  AFFN,          ASDF,            ASDF
##VAR_DIM=   32768,         32768,           32768
##UNITS=     HZ,            ARBITRARY UNITS, ARBITRARY UNITS
##FACTOR=    0.157963299565203, 1,           1
##FIRST=     4132.6476996994, 0,             0
##LAST=      -1043.33573715361, 0,           0
##MIN=       -1043.33573715361, -147311,     0
##MAX=       4132.6476996994, 334718997,     0
$$ Real data points
##PAGE= N=1
##DATA TABLE= (X++(R..R)), XYDATA
$$ [...]
$$ plain form
16764 8367 2379 7475 -28550 -38311 -33893 -22050 -21699 -29785 -33247 -39033 -30959 -42584 -41993 -56956
16750 -56956 -51600 -20410 -287 2001 -14069 -30837 -46606 -40187 -51985 -33915 -14124 4495
16738 4495 17768 15264 10403 12118 15308 -11742 -6711 -6341 -4281 -454 -32866 -55629 -19345 10649
16724 10649 -23176 -35173 -28779 -27421 -40175 -41588 -55119 -52657 -38813 -43079 -22126 -18743 -32098
16711 -32098 -35169 -10306 7824 -21266 -15170 1419 7288 24427 32225 -6612 -26086 -22286 -21336
16698 -21336 12167 25345 -6703 -1920 22787 -8911 -16637 -3079 -25945 -35828 -53029 -13842
16686 -13842 8818 -13835 -30932 -6421 -6278 226 7642 -21588 -25694 8965 17545 -7440 -36007
16673 -36007 -41235 -31377 -28041 3202 22726 25452 19656 25669 -5730 -41700 -44252 -47226 -4038
$$ packed form
16764H367n988N096l6025r761M418J1843L51q086l462n786Q074j1625N91j4963
16750e6956N356L1190K0123K288j6070j6768j5769O419j1798J8070J9791J8619
16738D495J3273k504m861J715L190k7050N031L70K060L827l2412k2763L6284K9994
16724A0649l3825j1997O394J358j2754j413j3531K462J3844m266K0953L383j3355
16711c2098l071K4863J8130k9090O096J6589N869J7139P798l8837j9474L800R50
16698b1336L3503J3178l2048M783K4707l1698p726J3558k2866r883j7201L9187
16686a3842K2660k2653j7097K4511J43O504P416k9230m106L4659Q580k4985k8567
16673c6007n228R858L336L1243J9524K726n796O013l1399l5970k552k974M3188
$$ plain form
16660 -4038 19703 6895 -1820 5469 -2110 -36393 -46737 -47313 -49570 -60372 -69488 -35396 -12089
16647 -12089 -1487 7496 -655 4110 6908 20905 30831 1465 -47929 -56804 -48072 -38379 -7163
16634 -7163 1833 -14977 -16536 -43828 -46130 -37427 -23820 -5686 -615 -5781 -39859 -41689 -38076
16621 -38076 -37143 -70504 -77606 -59639 -26192 -26982 -50286 -34179 -7932 -8637 -21449 -29779 -39811
16608 -39811 -25011 4799 15525 20253 19251 14234 -17148 -53627 -33345 -34650 -48610 -39449 -25782
16595 -25782 -13079 -26059 -37678 -53333 -37036 -26495 -24288 -8005 14207 2914 -5538 -5028
16583 -5028 -2693 14889 -21343 -41775 -2336 -4436 -357 -7823 -26215 -25523 -8217 -16191 -24660
16570 -24660 -29901 -15776 -11436 -16212 -662 230 -12709 -20718 -7966 -12516 -9899 -4916 -4164 -5148
$$ packed form
16660d038K3741j2808q715P289p579l4283j0344n76k257j0802r116L4092K3307
16647a2089J0602Q983q151M765K798J3997R926k9366m9394q875Q732R693L1216
16634g163Q996j6810j559k7292k302Q703J3607J8134N071n166l4078j830L613
16621c8076R33l3361p102J7967L3447p90k3304J6107K6247p05j2812q330j0032
16608c9811J4800K9810J0726M728j002n017l1382l6479K0282j305j3960R161J3667
16595b5782J2703j2980j1619j5655J6297J0541K207J6283K2212j1293q452N10
16583e028K335J7582l6232k0432L9439k100M079p466j8392O92J7306p974q469
16570b4660n241J4125M340m776J5550Q92j2939q009J2752m550K617M983P52r84
$$ plain form
16556 -5148 6580 -15286 -40008 -37212 -14178 -3353 -6272 -10186 -8204 -15623 -10546 -26989 -51702
16543 -51702 -37708 -26832 19045 43507 42209 10850 -416 -21239 -20910 -37038 -36065 -20935 -2168
16530 -2168 -25040 -64949 -56920 -29526 -16506 10428 18981 17092 22487 15511 -15612 -38933 -33841
16517 -33841 -19460 -29738 -62429 -49820 -19624 21785 26260 24427 9106 -12100 -30614 -14039
16505 -14039 -4625 7505 -15575 -17056 7363 -321 -10785 -20036 -15953 -9425 -22795 -42511 -43271
16492 -43271 -42446 -22744 -20980 -29362 -21395 -3796 -17380 -46306 -46697 -5467 13524 26889 13034
16479 13034 -7679 9994 27942 33197 26418 54059 56608 51509 49351 33084 4742 2548 -525
16466 -525 -26162 -14752 12084 1546 -2317 4665 -20839 -48489 -49303 -47236 -44741 -37659 -25019
$$ packed form
16556e148J1728k1866k4722K796K3034J0825k919l914J982p419N077j6443k4713
16543e1702J3994J0876M5877K4462j298l1359j1266k0823L29j6128R73J5130J8767
16530b168k2872l9909Q029K7394J3020K6934Q553j889N395o976l1123k3321N092
16517c3841J4381j0278l2691J2609L0196M1409M475j833j5321k1206j8514J6575
16505a4039R414J2130k3080j481K4419p684j0464r251M083O528j3370j9716p60
16492d3271Q25J9702J764q382P967J7599j3584k8926l91M1230J8991J3365j3855
16479A3034k0713J7673J7948N255o779K7641K549n099k158j6267k8342k194l073
16466e25k5637J1410K6836j0538l863O982k5504k7650q14K067K495P082J2640
$$ plain form
16453 -25019 1966 -1897 -2548 -34517 -32381 -15426 -30591 -43846 -57998 -59773 -28790 -1522 13670
16440 13670 -14214 -20197 -1574 -6930 -23795 -41946 -34317 -23755 4696 8712 -3899 -42325
16428 -42325 -60444 -41578 -1416 21429 7158 -16266 -37610 -48321 -54123 -25937 2372 -14356
16416 -14356 -16225 -16765 -14898 1436 1065 -4957 9289 4695 -13061 -11253 5733 20433 17559 13868
16402 13868 20286 37091 6086 -1429 -22810 -45838 -26689 -9637 17387 4308 14204 7154
16390 7154 -16423 -29191 -29776 -50753 -65063 -47134 -4689 9594 -1288 -32149 -50215 -29493
16378 -29493 -14683 -17837 12093 5205 -16496 357 26398 25618 18248 -5142 -25813 -33814 -1078
16365 -1078 36781 22098 558 -4925 -5035 -1435 -12279 4258 3446 -8776 -8690 -5172 3289 -16292
$$ packed form
16453b5019K6985l863o51l1969K136J6955j5165j3255j4152j775L0983K7268J5192
16440A3670k7884n983J8623n356j6865j8151P629J0562K8451M016j2611l8426
16428d2325j8119J8866M0162K2845j4271k3424k1344j0711n802K8186K8309j6728
16416a4356j869n40J867J6334l71o022J4246m594j7756J808J6986J4700k874l691
16402A3868O418J6805l1005p515k1381k3028J9149J7052K7024j3079R896p050
16390G154k3577j2768n85k0977j4310J7929M2445J4283j0882l0861j8066K0722
16378b9493J4810l154K9930o888k1701J6853K6041p80p370k3390k0671q001L2736
16365a078L7859j4683k1540n483j10L600j0844J6537q12j2222Q6L518Q461j9581
$$ plain form
16351 -16292 -23220 -8749 6983 -9060 9878 43648 27927 -18655 -16910 3922 1490 3758
16339 3758 -23872 -55322 -45527 -46438 -50061 -59734 -71910 -64899 -34410 -12006 -11721 -5496 -18398 -30294
16325 -30294 -5698 29609 22572 23898 37537 43864 21478 5702 -6754 -5720 19302 30149
16313 30149 13659 -4345 -4893 -6242 -28316 -25124 -11893 -23896 -47630 -49124 -54173 -44537 -11060
16300 -11060 9550 4149 -3117 -23664 -29268 -38036 -53445 -44216 -32286 -32970 -28489 -29648 -17577
16287 -17577 -37092 -42746 -2823 -7121 7960 55245 43154 10239 41846 23355 3495 -6289
16275 -6289 -42378 -61421 -49927 -53333 -29914 -34117 -11049 -19187 -27145 -6822 6713 18388 49753
16262 49753 57462 27237 8495 -18072 -34734 -34842 -31422 -41533 -44822 -30211 -16709 7717 19298
$$ packed form
16351a6292o928J4471J5732j6043J8938L3770j5721m6582J745K0832k432K268
16339C758k7630l1450R795r11l623r673j2176P011L0489K2404K85O225j2902j1896
16325c0294K4596L5307p037J326J3639O327k2386j5776j2456J034K5022J0847
16313C0149j6490j8004n48j349k2074L192J3231j2003k3734j494n049R636L3477
16300a1060K0610n401p266k0547n604q768j5409R229J1930o84M481j159J2071
16287a7577j9515n654L9923m298J5081M7285j2091l2915L1607j8491j9860r784
16275f289l6089j9043J1494l406K3419m203K3068q138p958K0323J3535J1675L1365
16262D9753P709l0225j8742k6567j6662j08L420j0111l289J4611J3502K4426J1581
$$ plain form
16249 19298 34280 25675 -7342 -6483 -37555 -35035 -36076 -62226 -41828 -18403 -27876 -55208 -31208
16236 -31208 -6059 -19244 -50543 -56807 -48156 -24430 -38936 -57907 -71010 -67633 -64514 -51652
16224 -51652 -24357 1359 -7259 4134 -3578 -29884 -33364 -23564 -30306 -23164 -11990 -2914 16128
16211 16128 14536 31567 45076 41126 22672 31231 8594 -28891 -52084 -54951 -44434 -5675
16199 -5675 -8794 -19910 -17411 -4893 -33336 -52018 -46084 -19159 -24217 -6749 20354 25703 12689
16186 12689 -7058 -23542 -8024 -8291 -27112 -3211 -1430 -22897 -20156 -26655 -57466 -32439 -8539
16173 -8539 2199 -6620 -8620 -27032 -43445 -31903 -43099 -19161 -5860 -21007 624 27326
16161 27326 38352 15333 13211 1262 -5557 -26344 -851 23721 28139 37934 40394 30297 824
$$ packed form
16249A9298J4982q605l3017Q59l1072K520j041k6150K0398K3425r473k7332K4000
16236c1208K5149j3185l1299o264Q651K3726j4506j8971j3103L377L119J2862
16224e1652K7295K5716q618J1393p712k6306l480R800o742P142J1174R076J9042
16211A6128j592J7031J3509l950j8454Q559k2637l7485k3193k867J0517L8759
16199e675l119j1116K499J2518k8443j8682N934K6925n058J7468K7103N349j3014
16186A2689j9747j6484J5518k67j8821K3901J781k1467K741o499l0811K5027K3900
16173h539J0738q819k000j8412j6413J1542j1196K3938J3301j5147K1631K6702
16161B7326J1026k3019k122j1949o819k0787K5493K4572M418R795K460j0097k9473
$$ plain form
16148 824 645 -14721 -23338 -27352 4450 10261 7561 13147 8200 33078 35939 49761 74051 54534
16134 54534 26877 -16488 -18441 -5685 25412 36989 494 -23496 -27313 -22117 936 1575 -12384
16121 -12384 -18328 -21485 -45174 -47646 -49376 -36485 1269 23650 9128 -4983 -4161 -12875 -1206
16108 -1206 9023 -29567 -9953 19229 -7940 -12751 -10072 -8133 -12133 -13328 -3200 -9347 -8289
16095 -8289 -16420 -6405 1476 -4701 -9960 -9132 -15012 -19644 -25582 -37806 -34819 9521 1683 -35106
16081 -35106 -36797 -18732 -21101 -63928 -59933 -52659 -60106 -50637 -36035 -8289 -20825 -31406 -16772
16068 -16772 -8104 -18882 -27634 -12744 -10586 -9135 -28249 -35136 -41745 -41649 -35534 -15515 6719 21243
16054 21243 16846 9380 26485 26486 10187 -20193 -12756 10240 -4754 -35144 -34109 -24414 -17610 -38706
$$ packed form
16148H24j79j5366q617m014L1802N811k700N586m947K4878K861J3822K4290j9517
16134E4534k7657m3365j953J2756L1097J1577l6495k3990l817N196K3053O39j3959
16121a2384n944l157k3689k472j730J2891L7754K2381j4522j4111Q22q714J1669
16108a206J0229l8590J9614K9182k7169m811K679J939m000j195J0128o147J058
16095h289q131J0015P881o177n259Q28n880m632n938j2224K987M4340p838l6789
16081c5106j691J8065k369m2827L995P274p447R469J4602K7746j2536j0581J4634
16068a6772Q668j0778q752J4890K158J451j9114o887o609R6O115K0019K2234J4524
16054B1243m397p466J7105Jj6299l0380P437K2996j4994l0390J035R695O804k1096
$$ plain form
16040 -38706 -8567 -15094 -7747 -3077 -22808 -16392 -5988 -18888 -19178 -6944 -13077 -1309 -30279
16027 -30279 -72298 -78073 -86681 -60176 -48625 -64319 -52494 -42658 -38494 -18554 -32132 -43924
16015 -43924 -46806 -46329 -67144 -31267 16276 16306 19299 557 -3013 -11031 21445 -3625 -25286
16002 -25286 -24988 -37885 -42151 -22413 -3870 4432 26525 56222 64290 27574 17223 24166 -12098
15989 -12098 -34004 -18305 -4759 4133 868 5466 4065 14304 38331 44710 30225 22231 35840
15976 35840 34843 -7961 -24811 -23361 -15586 3270 -13738 -13662 -6696 -4434 -27641 -48040 -31115
15963 -31115 -14663 -25635 -37926 -55460 -67153 -62699 -63984 -53943 -33557 3409 11614 11945 730
15950 730 -2589 -28207 -27111 -7214 -19872 -34628 -22356 -15812 -5363 25555 46208 54603 38795
$$ packed form
16040c8706L0139o527P347M670j9731O416J0404j2900k90J2234o133J1768k8970
16027c0279m2019n775q608K6505J1551j5694J1825R836M164J9940j3578j1792
16015d3924k882M77k0815L5877M7543L0K993j8742l570q018L2476k5070k1661
16002b5286K98j2897m266J9738J8543Q302K2093K9697Q068l6716j0351O943l6264
15989a2098k1906J5699J3546Q892l265M598j401J0239K4027O379j4485p994J3609
15976C5840r97m2804j6850J450P775J8856j7008P6O966K262k3207k0399J6925
15963c1115J6452j0972j2291j7534j1693M454j285J0041K0386L6966Q205L31j1215
15950G30l319k5618J096J9897j2658j4756J2272O544J0449L0918K0653Q395j5808
$$ plain form
15937 38795 1878 3256 17098 2398 -6065 -3292 24889 54338 16505 11694 26595 25723 2960
15924 2960 -28091 -27280 -23844 -22120 -8283 149 -19619 -13691 -11168 -19048 -25168 -32722 -4578 13918
15910 13918 25913 -280 -10647 -10513 -22599 -53540 -32284 -3677 6790 8627 -10530 3830
15898 3830 -4002 -8940 2936 8687 15651 -8397 -22952 6613 15426 20895 30455 -1676 -17609
15885 -17609 -13286 -5907 115 14902 19428 -28395 -70413 -62455 -28391 -21703 -33673 -18139 11237
15872 11237 636 -5021 -2104 5749 9093 -27913 -59111 -37810 163 12453 19611 -13357 -32573
15859 -32573 -21971 -26844 -14736 -5894 -4751 -8352 -4403 -7563 7001 -12331 -42613 -60407 -50749
15846 -50749 -57395 -63613 -31948 -16195 1771 23613 27064 11878 21978 -5539 -13258 -3405 25577
$$ packed form
15937C8795l6917J378J3842j4700q463K773K8181K9449l7833m811J4901q72k2763
15924B960l1051Q11L436J724J3837Q432j9768N928K523p880o120p554K8144J8496
15910A3918J1995k6193j0367J34j2086l0941K1256K8607J0467J837j9157J4360
15898C830p832m938J1876N751O964k4048j4555K9565Q813N469R560l2131j5933
15885a7609M323P379O022J4787M526m7823m2018P958L4064O688j1970J5534K9376
15872A1237j0601n657K917P853L344l7006l1198K1301L7973J2290P158l2968j9216
15859c2573J0602m873J2108Q842J143l601L949l160J4564j9332l0282j7794R658
15846e0749o646o218L1665J5753J7966K1842L451j5186J0100k7517p719R853K8982
$$ plain form
15833 25577 39730 31103 30447 27282 20593 8923 7897 -20147 -14440 -41993 -45614 -22762 -6010
15820 -6010 7467 11714 8967 20470 19116 15045 20361 4592 -26021 -21692 74 -2624 15173
15807 15173 43166 24395 25993 33241 33602 27570 -69 2037 320 -15469 -5574 -9501 2106
15794 2106 -1325 -4923 10256 9896 1988 -1309 7496 19657 20950 19979 5543 -21053 278 21655
15780 21655 7432 -1568 20439 23872 -11378 -29719 -20575 -40219 -28794 -3366 -964 17147
15768 17147 23772 17619 14830 19647 16927 31255 14964 -6925 -19956 -12007 -33103 4259 27724
15755 27724 18338 34543 66594 135643 231072 359541 401008 362312 279498 204392 135422 114002
15743 114002 125167 122586 90604 46898 6087 10391 31077 50380 77426 79363 63032 46883
$$ packed form
15833B5577J4153q627o56l165o689j1670j026k8044N707k7553l621K2852J6752
15820f010J3477M247k747J1503j354m071N316j5769l0613M329K1766k698J7797
15807A5173K7993j8771J598P248L61o032k7639K106j717j5789R895l927J1607
15794B106l431l598J5179l60p908l297Q805J2161J293r71j4436k6596K1331K1377
15780B1655j4223r000K2007L433l5250j8341R144j9644J1425K5428K402J8111
15768A7147O625o153k789M817k720J4328j6291k1889j3031P949k1096L7362K3465
15755B7724r386J6205L2051O9049R5429J28469M1467l8696q2814p5106o8970k1420
15743A14002J1165k581l1982m3706m0811M304K0686J9303K7046J937j6331j6149
$$ plain form
15731 46883 32255 38580 52230 63553 46580 30193 11210 14352 37357 43874 27251 15896
15719 15896 -6354 8648 45674 62302 32914 19046 51182 90923 61614 32688 15227 25588
15707 25588 20726 19972 25210 46135 77524 118985 128804 133624 147925 124799 80712 72282 87158
15694 87158 72932 28346 12017 34107 73678 100263 116064 129790 95326 62340 54096 55978
15682 55978 75608 81737 94600 109894 102652 103890 144478 202466 261061 277400 307571 309180
15670 309180 265115 242728 227310 207248 167252 131231 122049 112424 115088 139547 156587 187873
15658 187873 235407 283695 330316 337637 344641 317521 291711 238571 196292 164711 133172 115207
15646 115207 115007 124591 150333 186206 227281 246892 318352 366913 368054 333850 303953 244290
$$ packed form
15731D6883j4628O325J3650J1323j6973j6387j8983L142K3005O517j6623j1355
15719A5896k2250J5002L7026J6628k9388j3868L2136L9741k9309k8926j7461J0361
15707B5588m862p54N238K0925L1389M1461R819M820J4301k3126m4087q430J4876
15694H7158j4226m4586j6329K2090L9571K6585J5801J3726l4464l2986q244J882
15682E5978J9630O129J2863J5294p242J238M0588N7988N8595J6339L0171J609
15670C09180m4065k2387j5418k0062l9996l6021r182r625K664K4459J7040L1286
15658A87873M7534M8288M6621P321P004k7120k5810n3140m2279l1581l1539j7965
15646A15207k00R584K5742L5873M1075J9611P1460M8561J141l4204k9897n9663
$$ plain form
15634 244290 199362 168312 140713 130709 161783 175387 194854 226941 246763 276550 324504
15623 324504 338804 300514 260929 232757 173663 114321 124533 112204 99482 87694 76366
15612 76366 42182 48116 63002 80844 90535 100657 122033 112550 83600 67134 47952 21462
15600 21462 31994 65934 84188 84147 88443 77876 82054 91614 107451 129192 127336 101297 103321
15587 103321 120118 103054 54536 39153 56228 49747 37102 50719 61380 46721 38378 45483
15575 45483 73311 62206 46751 43476 8125 30420 60942 72641 80511 54641 20763 -14823
15563 -14823 -24512 4713 22142 -2374 2952 8986 12682 13808 15326 -11065 -8078 -11410 -16364
15550 -16364 -26413 -19452 8323 17978 -4946 9486 3387 -8058 -174 35379 40562 36302 33968
$$ packed form
15634B44290m4928l1050k7599j0004L1074J3604J9467L2087J9822K9787M7954
15623C24504J4300l8290l9585k8172n9094n9342J0212j2329j2722j1788j1328
15612G6366l4184N934J4886J7842R691J0122K1376r483k8950j6466j9182k6490
15600B1462J0532L3940J8254m1M296j0567M178R560J5837K1741j856k6039K024
15587A03321J6797j7064m8518j5383J7075o481j2645J3617J0661j4659q343P105
15575D5483K7828j1105j5455l275l5351K2295L0522J1699P870k5870l3878l5586
15563a4823r689K9225J7429k4516N326O034L696J126J518k6391K987l332m954
15550a6364j0049O961K7775R655k2924J4432o099j1445P884L5553N183m260k334
$$ plain form
15537 33968 48001 14439 -39539 -66364 -54569 -43341 -40681 -38772 -12384 -9826 -190 -10605
15525 -10605 -31197 -27994 -30284 -2860 28265 -4478 -42811 -48530 -19691 6404 24231 20320
15513 20320 -2916 -14796 10293 -8173 -4825 20990 -618 -7071 8888 16961 20785 -8161
15501 -8161 -12297 -2001 -13172 -24079 -20785 -3661 2208 -5740 -7538 -13370 -8094 -25087 -33931
15488 -33931 -35815 -14857 -22336 -13429 -10962 -10569 -7213 -4462 6442 -14839 -18118 15229 8216 11099
15474 11099 -2155 -12452 -24709 -24578 -25152 5473 5314 11586 10090 4172 6553 6806 -353 -27007
15460 -27007 -20167 16804 28823 16416 432 -19610 -11915 -20052 -34201 -45132 -31225 -23409
15448 -23409 -27601 -22904 4487 -1147 -22149 -10393 12530 -7448 -4349 7152 19866 30624
$$ packed form
15537C3968J4033l3562n3978k6825J1795J1228K660J909K6388K558R636j0415
15525a0605k0592L203k290K7424L1125l2743l8333n719K8839K6095J7827l911
15513B0320k3236j1880K5089j8466L348K5815k1608o453J5959Q073L824k8946
15501h161m136J0296j1171j0907L294J7124N869p948j798n832N276j6993q844
15488c3931j884K0958p479Q907K467L93L356K751J0904k1281l279L3347p013K883
15474A1099j3254j0297j2257J31n74L0625j59O272j496n918K381K53p159k6654
15460b7007O840L6971J2019j2407j5984k0042P695q137j4149j0931J3907P816
15448b3409m192M697K7391n634k1002J1756K2923j9978L099J1501J2714J0758
$$ plain form
15436 30624 19314 9741 21938 21220 19525 54318 55585 37857 2221 14321 55800 47311 3522
15423 3522 17696 27155 19720 25396 26261 4131 -21766 -32917 -3193 4864 -7263 -19605 -16635
15410 -16635 -28730 -25135 -23893 -9032 7823 4726 2499 15383 3976 -3235 -969 13079 13214
15397 13214 -1346 11520 7776 21304 19655 13685 11592 14947 22276 47231 50871 44700 51387
15384 51387 67132 64611 56278 51312 65427 86319 82254 63987 70081 56012 14700 4732 -15419
15371 -15419 -5421 3204 6067 -10589 15804 15895 4123 14030 15095 -19544 -26524 -21064 -4342 4566
15357 4566 -16501 -53770 -46299 -22945 -40812 -59305 -65087 -30913 493 7898 4747 5174 42017
15344 42017 68831 57745 40032 34432 27751 29785 38422 44198 32877 15408 -2859 3243 -998
$$ packed form
15436C0624j1310r573J2197p18j695L4793J267j7728l5636J2100M1479q489m3789
15423C522J4174R459p435N676Q65k2130k5897j1151K9724Q057j2127j2342K970
15410a6635j2095L595J242J4861J6855l097k227J2884j1407p211K266J4048J35
15397A3214j4560J2866l744J3528j649n970k093L355P329K4955L640o171O687
15384E1387J5745k521q333m966J4115K0892m065j8267O094j4069m1312r968k0151
15371a5419R998Q625K863j6656K6393R1j1772R907J065l4639o980N460J6722Q908
15357D566k1067l7269P471K3354j7867j8493n782L4174L1406P405l151M27L6843
15344D2017K6814j1086j7713n600o681K034Q637N776j1321j7469j8267O102m241
$$ plain form
15331 -998 6573 18992 32060 31213 44731 19730 25447 43333 30679 -1908 -4096 35833 41367
15318 41367 48967 69316 50625 7198 2909 32012 42826 25225 36463 30204 -13610 -15931
15306 -15931 14075 24485 18165 6506 4617 14883 23831 41588 58213 54996 73871 82572 64008
15293 64008 41606 5003 -13979 -3677 7264 17528 32463 46364 70126 62672 69489 93237
15281 93237 62208 47464 75653 114797 115913 101314 93728 97033 91248 81349 71477 79361 78325
15268 78325 93935 107024 111461 111044 97780 126713 123916 112676 118839 122430 117720 81706 47784
15255 47784 40211 59901 36192 3062 -6969 5825 926 31017 50998 42190 56623 68293
15243 68293 61926 75437 81899 76463 88790 93046 105906 113052 98903 80704 87272 105782 145952
$$ packed form
15331i98P571J2419J3068q47J3518k5001N717J7886j2654l2587k188L9929N534
15318D1367P600K0349j8691m3427m289K9103J0814j7601J1238o259m3814k321
15306a5931L0006J0410o320j1659j889J0266Q948J7757J6625l217J8875Q701j8564
15293F4008k2402l6603j8982J0302J0941J0264J4935J3901K3762p454O817K3748
15281I3237l1029j4744K8189L9144J116j4599p586L305n785r899r872P884j036
15268G8325J5610J3089M437m17j3264K8933k797j1240O163L591m710l6014l3922
15255D7784p573J9690k3709l3130j0031J2794m899L0091J9981q808J4433J1670
15243F8293o367J3511O462n436J2327M256J2860P146j4149j8199O568J8510M0170
$$ plain form
15230 145952 147167 101670 103470 144263 157762 148735 138017 133334 105244 93643 94710 89772 82437
15217 82437 82844 76785 60301 76897 88140 106803 110063 120371 153907 190984 178156 177681 180657
15204 180657 174396 175073 191693 193005 247447 257074 264581 272795 280127 254067 283000 322606 356917
15191 356917 398233 442234 495802 532508 570487 596527 653485 731622 817076 918397 1025015
15180 1025015 1162422 1333292 1584985 1937111 2401327 2984733 3791568 4917489 6603401
15171 6603401 9215099 13301598 19180023 25509425 28619497 27496079 23430631 18137330
15163 18137330 13683427 10647244 8708559 7517994 6766304 6183498 5599237 5037007 4500493
15154 4500493 4023037 3643184 3330489 3088816 2883211 2756338 2684610 2627820 2644320 2741813
$$ packed form
15230A45952J215m5497J800M0793J3499r027j0718m683k8090j1601J067m938p335
15217H2437M07o059j6484J6596J1243J8663L260J0308L3536L7077j2828m75K976
15204A80657o261O77J6620J312N4442R627P507Q214P332k6060K8933L9606L4311
15191C56917M1316M4001N3568L6706L7979K6040N6958P8137Q5454J01321J06618
15180A025015J37407J70870K51693L52126M64216N83406Q06835J125921J685912
15171F603401K611698M086499N878425O329402L110072j123418m065448n293301
15163A8137330m453903l036183j938685j190565p51690n82806n84261n62230n36514
15154D500493m77456l79853l12695k41673k05605j26873p1728n6790J6500R7493
$$ plain form
15144 2741813 2916838 3153060 3489489 3943743 4627951 5631070 6972630 8845774 11547027
15135 11547027 15745111 22341177 32435600 46055394 59302662 64022433 58439810 47447572
15127 47447572 34867270 25316419 19404679 15933336 13844066 12528418 11416647 10201262
15119 10201262 8933127 7745291 6726599 5900277 5225488 4661527 4184852 3784840 3470422
15110 3470422 3239732 3058206 2973509 2943505 2984239 3112786 3334525 3699705 4227312 4976177
15100 4976177 6092697 7763621 10388784 14455724 20404848 27496592 32099450 31676503
15092 31676503 27526348 21510223 16011253 12135455 9647592 8117190 7167679 6464581
15084 6464581 5852757 5220716 4599041 4043300 3579657 3224676 2864465 2521052 2221076
$$ packed form
15144B741813J75025K36222L36429M54254O84208J003119J341560J873144K701253
15135A1547027M198084O596066J0094423J3619794J3247268M719771n582623j0992238
15127D7447572j2580302r550851n911740l471343k089270j315648j111771j215385
15119A0201262j268135j187836j018692q26322o74789n63961m76675m00012l14418
15110C470422k30690j81526q4697l0004M0734J28547K21739L65180N27607P48865
15100D976177J116520J670924K625163M066940N949124P091744M602858m22947
15092C1676503m150155o016125n498970l875798k487863j530402r49511p03098
15084F464581o11824o32041o21675n55741m63643l54981l60211l43413k99976
$$ plain form
15075 2221076 1945016 1696507 1470776 1294078 1113964 978205 886464 782466 692900 641353
15065 641353 596208 537211 491078 461394 439123 428281 401457 374046 352582 315077 302884
15054 302884 248397 264814 270855 253931 265922 296484 339146 384783 472982 589952 786504
15043 786504 981888 1112612 1044910 852903 670956 532337 431218 376006 339937 273497
15033 273497 242365 214078 205760 199952 186837 174224 148200 110550 100125 107530 106849 88510
15021 88510 97382 92161 88000 75665 79321 71914 74764 87288 91503 119498 164440 217449 282470
15008 282470 380013 536026 618658 610797 546019 437855 329212 268975 231801 185209 167143
14997 167143 148620 133360 153939 148783 123015 120555 110058 129434 114277 97199 76888 68991
$$ packed form
15075B221076k76060k48509k25731j76698j80114j35759r1741j03998q9566n1547
15065F41353m5145n8997m6133k9684k2271j0842k6824k7411k1464l7505j2193
15054C02884n4487J6417O041j6924J1991L0562M2662M5637Q8199J16970J96552
15043G86504J95384J30724o7702j92007j81947j38619j01119n5212l6069o6440
15033B73497l1132k8287q318n808j3115j2613k6024l7650j0425P405o81j8339
15021H8510Q872n221m161j2335L656p407K850J2524M215K7995M4942N3009O5021
15008B82470R7543J56013Q2632p861o4778j08164j08643o0237l7174m6592j8066
14997A67143j8523j5260K0579n156k5768k460j0497J9376j5157j7078k0311p897
$$ plain form
14985 68991 99722 92211 89084 75977 47237 53310 46149 15864 -3798 -12390 42567 67575 49251
14972 49251 23486 21487 26472 59804 49536 1681 -11331 -11295 -57 -7795 1037 17196 25325
14959 25325 47619 44039 17856 24148 36737 55590 59700 39888 19899 9022 -9431 17391
14947 17391 20302 48750 73214 74943 41641 29501 8031 -7361 1444 2346 -19214 4689 22461
14934 22461 18769 10380 23643 57637 83325 93085 67803 38014 247 -19031 19287 25478
14922 25478 35667 46659 44361 56788 85885 72561 68478 65174 57751 34203 10078 13489 4402
14909 4402 -12103 -7426 31841 46280 45193 32143 32973 39958 43938 23206 21966 17045 17347 36623
14895 36623 20294 758 22493 15675 1364 20317 56148 68838 63073 45837 68621 92529
$$ packed form
14985F8991L0731p511l127j3107k8740O073p161l0285j9662q592N4957K5008j8324
14972D9251k5765j999M985L3332j0268m7855j3012L6J1238p738Q832J6159Q129
14959B5325K2294l580k6183O292J2589J8853M110j9812j9989j0877j8453K6822
14947A7391K911K8448K4464J729l3302j2140k1470j5392Q805R02k1560K3903J7772
14934B2461l692q389J3263L3994K5688R760k5282k9789l7767j9278L8318O191
14922B5478J0189J0992k298J2427K9097j3324m083l304p423k3548k4125L411r087
14909D402j6505M677L9267J4439j087j3050Q30O985L980k0732j240m921L02J9276
14895C6623j6329j9536K1735o818j4311J8953L5831J2690n765j7236K2784K3908
$$ plain form
14883 92529 85822 92672 98420 105143 91836 66446 53506 55663 46603 48405 65221 64783 89447
14870 89447 93212 63525 70204 66860 53689 66098 67074 50477 9966 -4521 -29412 -27249 -29975
14857 -29975 -29598 -15773 -18797 -24024 -594 18673 8360 18325 44238 56740 83581 76941 79923
14844 79923 102035 127305 125438 118945 83032 47123 41562 23064 4345 -6032 12777 33250
14832 33250 32797 42245 55888 38422 18301 -20573 -7412 17967 13891 53322 66494 87212
14820 87212 94868 94450 78308 86820 113906 192299 242430 270144 298609 322879 356786 406115
14808 406115 399671 364992 346318 306710 262291 243112 199410 150514 136051 133516 108921 82647
14796 82647 45457 58293 85708 71951 39481 29135 21198 10371 -9217 13752 16672 752
$$ packed form
14883I2529o707O850N748O723j3307k5390j2940K157r060J802J6816m38K4664
14870H9447L765k9687O679l344j3171J2409R76j6597m0511j4487k4891K163k726
14857b9975L77J3825l024n227K3430J9267j0313R965K5913J2502K6841o640K982
14844G9923K2112K5270j867o493l5913l5909n561j8498j8719j0377J8809K0473
14832C3250m53R448J3643j7466k0121l8874J3161K5379m076L9431J3172K0718
14820H7212P656m18j6142Q512K7086P8393N0131K7714K8465K4270L3907M9329
14808D06115o444l4679j8674l9608m4419j9179m3702m8896j4463k535k4595k6274
14796H2647l7190J2836K7415j3757l2470j0346p937j0827j9588K2969K920j5920
$$ plain form
14784 752 -12976 -56086 -29177 2476 177 15932 29236 27657 35361 50546 57108 47464 16380
14771 16380 -20295 -1599 16652 8307 -21846 -2126 13252 23096 20947 -5778 -17477 -31528
14759 -31528 -25729 -15789 -31465 -28423 5741 29044 40202 30578 39156 46348 37651 -18848 -19111
14746 -19111 -10603 -10877 2740 9032 20052 10366 7040 20201 11371 11370 1699 24342 31213 29170
14732 29170 18400 19503 18272 38607 33820 28962 56321 72288 78472 67698 89238 90283 88366
14719 88366 81273 78385 98172 103473 136945 156524 140324 143486 115544 120466 122507 96950 71602
14706 71602 63522 40966 52121 69447 32373 13320 13361 -411 -11869 -19154 -29107 -42902 -33957
14693 -33957 10931 11100 15055 36669 35272 20135 15375 10816 7531 1926 -2007 543 8287 4938
$$ packed form
14784G52j3728m3110K6909L1653k299J5755J3304j579P704J5185O562r644l1084
14771A6380l6675J8696J8251q345l0153J9720J5378R844k149k6725j1699j4051
14759c1528N799R940j5676L042L4164K3303J1158r624Q578P192q697n6499k63
14746a9111Q508k74J3617O292J1020r686l326J3161q830jr671K2643O871k043
14732B9170j0770J103j231K0335m787m858K7359J5967O184j0774K1540J045j917
14719H8366p093k888J9787N301L3472J9579j6200L162k7942M922K041k5557k5348
14706G1602q080k2556J1155J7326l7074j9053M1j3772j1458p285r953j3795Q945
14693c3957M4888J69L955K1614j397j5137m760m559l285n605l933K550P744l349
$$ plain form
14679 4938 3269 -5682 4586 16889 6428 1464 31538 33032 12451 -10738 11637 391 22739
14666 22739 34672 4211 -14079 -22228 -20490 -5941 1549 48547 31101 -604 -29279 -31757
14654 -31757 -26034 -43030 -44071 -12807 24110 24883 26357 29329 6827 -19057 8500 16113 41097
14641 41097 83907 76740 45837 7469 252 20886 20874 8311 -750 -8627 -25149 -13588 -8415
14628 -8415 -8099 -14083 7690 21672 37825 65694 57050 65701 64126 44778 38227 13396 -6437
14615 -6437 -18029 -13199 15909 3659 -2017 -1424 -6962 1487 21097 45998 59912 21901 -7345
14602 -7345 -16497 -33293 -36052 -7367 21515 2266 4289 -3854 -38798 -47489 -25814 -14817 -17728
14589 -17728 -11648 -5808 12846 9150 40255 62579 37954 -11123 -1790 17672 11409 10021 36251
$$ packed form
14679D938j669q951J0268J2303j0461m964L0074J494k0581k3189K2375j1246K2348
14666B2739J1933l0461j8290q149J738J4549P490M6998j7446l1705k8675k478
14654c1757N723j6996j041L1264L6917P73J474K972k2502k5884K7557P613K4984
14641D1097M2810p167l0903l8368p217K0634j2j2563r061p877j6522J1561N173
14628h415L16n984K1773J3982J6153K7869q644Q651j575j9348o551k4831j9833
14615f437j1592M830K9108j2250n676N93n538Q449J9610K4901J3914l8011k9246
14602g345r152j6796k759K8685K8882j9249K023q143l4944q691K1675J0997k911
14589a7728O080N840J8654l696L1105K2324k4625m9077R333J9462o263j388K6230
$$ plain form
14576 36251 17136 -18847 -23242 -30497 -27329 5786 -43 -2852 17556 41310 43763 41097 26045
14563 26045 18003 9199 7404 4028 -1523 -13021 -4810 -17564 -22602 -3368 7474 -4153 2337
14550 2337 1166 13087 43074 62273 70148 33049 8556 -897 5477 18342 28146 7453 9599
14537 9599 -1992 -30770 -51382 -47068 -31716 2796 8621 18145 20728 51661 80673 71045 48237
14524 48237 28832 15827 17090 15474 6900 -15562 -23267 -24578 -2072 4769 13090 26051 15081
14511 15081 23648 387 7294 -1922 -6458 20830 23066 2315 -9176 -13161 10474 -3771 -6949
14498 -6949 37579 74837 59925 21733 2647 7612 17496 4928 -9693 3123 683 -3400 -7344
14485 -7344 -18054 -39581 -47852 -51674 -50550 -53836 -29642 -3621 37821 48441 15135 -27689 -64408
$$ packed form
14576C6251j9115l5983m395p255L168L3115n829k809K0408K3754K453k666j5052
14563B6045q042q804j795l376n551j1498Q211j2754n038J9234J0842j1627O490
14550B337j171J1921K9987J9199P875l7099k4493r453O374J2865R804k0693K146
14537I599j1591k8778k0612M314J5352L4512N825R524K583L0933K9012r628k2808
14524D8237j9405j3005J263j616q574k2462p705j311K2506O841Q321J2961j0970
14511A5081Q567k3261O907r216m536K7288K236k0751j1491l985K3635j4245l178
14498f949M4528L7258j4912l8192j9086M965R884j2568j4621J2816k440m083l944
14485g344j0710k1527q271l822J124l286K4194K6021M1442J0620l3306m2824l6719
$$ plain form
14472 -64408 -64951 -37234 -53725 -36629 -12060 -7072 -12713 -11046 -3290 8882 -2744 -11892 -13581
14459 -13581 -19930 -18687 -8240 12755 24832 28694 13412 -2193 -10928 -3517 -13430 2680 20465
14446 20465 37032 35625 7787 -16392 -11730 8045 11868 29125 14047 17409 32219 21967
14434 21967 -9912 -31180 -19594 13720 47831 43389 44312 48671 25334 7874 2630 7966 -8021
14421 -8021 5849 -15191 -17424 9604 7525 -23663 -39276 -64369 -59080 -33726 -26877 -30251 -25948
14408 -25948 -28840 -7251 33178 20243 -4915 -4471 20069 30015 49641 50530 48174 41466 7728
14395 7728 -3471 10856 -19995 -62892 -48513 -40818 -26308 -23090 -6140 -4268 12454 27126
14383 27126 16104 7089 12076 6305 20594 54401 28071 2148 -13530 -19038 -23067 -2981 29640
$$ packed form
14472f4408n43K7717j6491J7096K4569M988n641J667P756J2172j1626r148j689
14459a3581o349J243J0447K0995J2077L862j5282j5605q735P411r913J6110J7785
14446B0465J6567j407k7838k4179M662J9775L823J7257j5078L362J4810j0252
14434B1967l1879k1268J1586L3314L4111m442R23M359k3337j7460n244N336j5987
14421h021J3870k1040k233K7028k079l1188j5613k5093N289K5354O849l374M303
14408b5948k892K1589M0429j2935k5158M44K4540R946J9626Q89k356o708l3738
14395G728j1199J4327l0851m2897J4379P695J4510L218J6950J872J6722J4672
14383B7126j1022r015M987n771J4289L3807k6330k5923j5678n508m029K0086L2621
$$ plain form
14370 29640 56702 72905 88999 77835 30884 40872 37109 4607 36536 40433 44080 64719
14358 64719 86328 129130 140490 169060 204734 251409 297095 337479 346455 355764 381246 396364
14346 396364 397160 375265 338753 287173 235041 197693 185975 166221 143260 102249 64326 47422
14334 47422 48366 65326 72974 85445 66530 57861 60704 70177 113332 105353 76673 76730 75855 96796
14320 96796 135878 186059 206708 215450 220696 245577 278649 302503 321525 345489 335119 311455
14308 311455 306460 320909 288260 199089 114522 97628 100567 97748 84981 45107 48633 52858
14296 52858 27369 15049 14819 10833 6789 95 7594 5601 41254 61091 51714 49451 37231
14283 37231 37895 32473 46454 50405 26804 16411 2084 -5593 -759 -3217 -25369 -8581 13322
$$ packed form
14370B9640K7062J6203J6094j1164m6951R988l763l2502L1929L897L647K0639
14358F4719K1609M2802J1360K8570L5674M6675M5686M0384Q976R309K5482J5118
14346C96364P96k1895l6512n1580n2132l7348j1718j9754k2961m1011l7923j6904
14334D7422R44J6960P648J2471j8915q669K843R473M3155p979k8680N7q75K0941
14320I6796L9082N0181K0649Q742N246K4881L3072K3854J9022K3964j0370k3664
14308C11455m995J4449l2649q9171q4567j6894K939k819j2767l9874L526M225
14296E2858k5489j2320k30l986m044o694P499j993L5653J9837r377k263j2220
14283C7231O64n422J3981L951k3601j0393j4327p677M834k458k2152J6788K1903
$$ plain form
14270 13322 25007 -8257 -2425 3677 -19808 -3608 4993 16729 21503 33567 40536 42032 37989
14257 37989 -1061 5796 24513 32656 26630 53298 75049 68073 56056 37521 24226 30920 35067
14244 35067 15797 8478 30344 9425 25816 33048 10299 26833 35078 15731 -2861 -27780
14232 -27780 -29075 -20251 -13921 -23711 -16986 -14627 -8736 -14306 -52179 -51458 -47361 -35630 -16204 20120
14218 20120 15011 -12 27398 -1859 1677 29107 27790 1433 -15686 -15665 -11340 -10908 -5373 -211
14204 -211 36181 30129 35974 33944 14754 10123 12376 305 -25768 -39580 -34750 -20624 11806
14191 11806 -2032 -42465 -47887 -26899 -22903 -33396 -31815 -10740 16562 635 -5395 8231
14179 8231 9943 14781 28759 20010 -11056 -38477 2554 27050 24962 27590 23038 22560 24950 47398
$$ packed form
14270A3322J1685l3264N832O102k3485J6200Q601J1736M774J2064O969J496m043
14257C7989l9050O857J8717Q143o026K6668K1751o976j2017j8535j3295O694M147
14244C5067j9270p319K1866k0919J6391P232k2749J6534Q245j9347j8592k4919
14232b7780j295Q824O330r790O725K359N891n570l7873P21M097J1731J9426L6324
14218B0120n109j5023K7410k9257L536K7430j317k6357j7119K1M325M32N535N162
14204b11L6392o052N845k030j9190m631K253j2071k6073j3812M830J4126L2430
14191A1806j3838m0433n422K0988L996j0493J581K1075K7302j5927o030J3626
14179H231J712M838J3978q749l1066k7421M1031K4496k088K628m552m78K390K2448
$$ plain form
14165 47398 79509 110941 97673 72714 63370 52795 63413 66811 56279 76924 87603 63834
14153 63834 49431 40570 46306 76255 68065 32809 21937 46776 68680 45358 39038 48995 55503
14140 55503 67191 58293 62155 70007 61175 43420 19574 8210 44762 92594 91628 91493 95619
14127 95619 68298 41574 57657 80231 67722 44269 51957 70018 79510 76541 85164 70535
14115 70535 62774 35130 -1352 -10384 -38082 -24106 -16043 -19691 -7124 9523 20703 1892
14103 1892 -10081 17889 56401 91198 110719 94627 79785 55684 46254 64554 76821 75661
14091 75661 80007 61743 43508 37322 27988 40787 52686 38541 44105 45892 34407 29718 23726
14078 23726 25248 31199 25265 17394 38675 62523 61147 33566 25866 39727 47966 63676 46781
$$ packed form
14165D7398L2111L1432j3268k4959r344j0575J0618L398j0532K0645J0679k3769
14153F3834j4403q861N736K9949q190l5256j0872K4839K1904k3322o320R957O508
14140E5503J1688q898L862P852q832j7755k3846j1364L6552M7832r66j35M126
14127I5619k7321k6724J6083K2574j2509k3453P688J8061R492k969Q623j4629
14115G0535p761k7644l6482r032k7698J3976Q063l648J2567J6647J1180j8811
14103A892j1973K7970L8512L4797J9521j6092j4842k4101r430J8300J2267j160
14091G5661M346j8264j8235o186r334J2799J1899j4145N564J787j1485m689n992
14078B3726J522N951n934p871K1281K3848j376k7581p700J3861Q239J5710j6895
$$ plain form
14065 46781 28802 23887 48579 79622 89494 89984 107877 99172 119361 124416 93608 77037 94242
14052 94242 116596 120155 130112 140736 121993 82445 64314 66518 63584 75874 77913 91318 112452
14039 112452 80805 66850 87969 95321 86697 113771 111642 76790 76077 62368 42678 38639 57459
14026 57459 90816 87117 76236 68824 95522 113425 94311 91679 97464 125799 169698 169994 157797
14013 157797 181193 187436 167673 140871 147097 144108 162075 173577 189245 195517 193060 195184 198886
14000 198886 200541 193127 193606 179637 172432 160937 150268 155776 145716 142709 122178 131332 145737
13987 145737 171339 202448 184102 167076 179793 226713 248687 287363 302118 279320 253302
13976 253302 248290 287328 312778 292578 295471 318496 349169 354809 337502 354846 383991 425006
$$ packed form
14065D6781j7979m915K4692L1043R872M90J7893q705K0189N055l0808j6571J7205
14052I4242K2354L559R957J0624j8743l9548j8131K204k934J2290K039J3405K1134
14039A12452l1647j3955K1119P352q624K7074k129l4852p13j3709j9690m039J8820
14026E7459L3357l699j0881p412K6698J7903j9114k632N785K8335M3899K96j2197
14013A57797K3396O243j9763k6802O226k989J7967J1502J5668O272k457K124L702
14000A98886J655p414M79j3969p205j1495j0669N508j0060l007k0531R154J4405
13987A45737K5602L1109j8346j7026J2717M6920K1974L8676J4755k2798k6018
13976B53302n012L9038K5450k0200K893K3025L0673N640j7307J7344K9145M1015
$$ plain form
13964 425006 430993 432240 470183 468550 438287 442973 470749 493592 492403 491619 500740 526003 542553
13951 542553 535419 556501 611852 621996 647414 691453 688312 717084 769994 807998 840584 893986
13939 893986 940647 987057 1020117 1064577 1167564 1276139 1390977 1494536 1625884 1772149
13929 1772149 1910530 2108346 2402476 2704106 3049786 3468400 3980314 4560200 5259069
13920 5259069 6125025 7210833 8623194 10514475 13158259 16895477 22135880 28971865
13912 28971865 36928469 45410632 53932405 61539196 67567295 71780556 74199259 74852753
13904 74852753 73448131 69799079 64369381 57767469 50385624 42956845 36175933 30488141
13896 30488141 26029142 22632555 20027146 17884749 16090679 14580963 13285065 12233131
$$ packed form
13964D25006N987J247L7943j633l0263M686K7776K2843j189p84R121K5263J6550
13951E42553p134K1082N5351J0144K5418M4039l141K8772N2910L8004L2586N3402
13939H93986M6661M6410L3060M4460J02987J08575J14838J03559J31348J46265
13929A772149J38381J97816K94130L01630L45680M18614N11914N79886O98869
13920E259069Q65956J085808J412361J891281K643784L737218N240403O835985
13912B8971865P956604Q482163Q521773P606791O028099M213261K418703O53494
13904G4852753j404622l649052n429698o601912p381845p428779o780912n687792
13896C0488141m458999l396587k605409k142397j794070j509716j295898j051934
$$ plain form
13888 12233131 11380442 10749908 10355672 10226316 10344181 10723387 11420114 12540651 14265554
13879 14265554 16845379 20626477 25933903 32671649 40213062 47989290 55485101 61891605
13871 61891605 66780470 70034406 71607841 71260611 68771205 64381023 58636025 51915732
13863 51915732 44665142 37692107 31483535 26378236 22439206 19375378 16964717 14943450
13855 14943450 13165903 11598806 10183992 8944193 7888151 6947857 6111391 5391570
13847 5391570 4776181 4231424 3744703 3350708 3013502 2701875 2442140 2226534 2032051
13838 2032051 1868676 1753999 1668730 1571499 1480318 1391062 1305586 1257581 1229052 1223834 1221311
13827 1221311 1276777 1359989 1456668 1545846 1660086 1742095 1783167 1776779 1724422 1692031 1644647
$$ packed form
13888A2233131q52689o30534l94236j29356J17865L79206O96727J120537J724903
13879A4265554K579825L781098N307426O737746P541413P776228P495811O406504
13871F1891605M888865L253936J573435l47230k489406m390182n744998o720293
13863E1915732p250590o973035o208572n105299l939030l063828k410661k021267
13855A4943450j777547j567097j414814j239799j056042r40294q36466p19821
13847E391570o15389n44757m86721l93995l37206l11627k59735k15606j94483
13838B032051j63375j14677q5269r7231r1181q9256q5476m8005k8529n218k523
13827A221311N5466Q3212R6679Q9178J14240Q2009M1072o388n2357l2391m7384
$$ plain form
13816 1644647 1548740 1387628 1259770 1148395 1049418 939479 824067 756741 736619 662934
13806 662934 628292 577937 534270 480988 476150 476942 468864 473642 483594 483867 488167 499413 535032
13793 535032 626305 691223 762817 861174 983791 1130887 1278585 1405960 1470819 1501110 1515038
13782 1515038 1460117 1410773 1320319 1194372 1090625 964836 838365 704072 639050 597886
13772 597886 571545 546734 521479 479280 439991 416489 396052 374748 338753 311664 313898 317232
13760 317232 333171 291818 260245 230254 227367 242338 254270 275081 276451 310239 359831 416957
13748 416957 452717 447958 463392 476869 501808 495178 478532 469712 440239 374698 331983 314887
13736 314887 338049 342727 329046 322715 320853 299821 263900 235871 213091 186060 179979 180291 132903
$$ packed form
13816A644647r5907j61112j27858j11375r8977j09939j15412o7326k0122p3685
13806F62934l4642n0355m3667n3282m838P92q078M778R952K73M300J1246L5619
13793E35032R1273O4918P1594R8357J22617J47096J47698J27375O4859L0291J3928
13782A515038n4921m9344r0454j25947j03747j25789j26471j34293o5022m1164
13772E97886k6341k4811k5255m2199l9289k3502k0437k1304l5995k7089K234L334
13760C17232J5939m1353l1573k9991k887J4971J1932K0811J370L3788M9592N7126
13748D16957L5760m759J5434J3477K4939o630j6646q820k9473o5541m2715j7096
13736C14887K3162M678j3681o331j862k1032l5921k8029k2780k7031o081L12m7388
$$ plain form
13723 132903 115731 108000 113355 126621 134665 118341 123722 126267 126975 111528 105748 102700 122932
13710 122932 136526 142535 150662 177615 217584 213263 184612 155597 152819 143159 130490 155129
13698 155129 172120 152141 118446 100885 93892 107654 111290 124998 124202 119789 112754 77308 69588
13685 69588 86204 84686 53891 55285 38444 38989 54366 24291 50670 50801 60044 41634 29717
13672 29717 28333 36050 50382 58023 67398 75291 59921 73762 94741 101110 68810 27935 7232
13659 7232 26209 61326 60708 79170 83978 54405 47762 60537 66685 65203 48952 63336 49652
13646 49652 29706 45194 31244 36798 28320 19485 36881 61451 29763 21690 17388 28385 30766
13633 30766 26883 29905 52281 61366 58595 24692 6956 19803 4848 -3966 -184 -13390 11364
$$ packed form
13723A32903j7172p731N355J3266Q044j6324N381K545P08j5447n780l048K0232
13710A22932J3594O009Q127K6953L9969m321k8651k9015k778r660j2669K4639
13698A55129J6991j9979l3695j7561o993J3762L636J3708p96m413p035l5446p720
13685F9588J6616j518l0795J394j6841N45J5377l0075K6379J31R243j8410j1917
13672B9717j384P717J4332P641R375P893j5370J3841K0979O369l2300m0875k0703
13659G232J8977L5117o18J8462M808k9573o643J2775O148j482j6251J4384j3684
13646D9652j9946J5488j3950N554q478q835J7396K4570l1688q073m302J0997K381
13633C0766l883L022K2376R085k771l3903j7736J2847j4955q814L782j3206K4754
$$ plain form
13620 11364 35933 44007 32946 38744 31973 40674 45970 53586 65825 45130 5890 -13094 5722
13607 5722 -12095 -14109 -8588 -11892 3946 26850 4750 -4590 -19262 -34910 -9485 -9826 -23641
13594 -23641 -9942 7254 -2306 17546 20465 50047 52294 59220 43449 19071 6607 -10441
13582 -10441 -3186 3218 -13092 1245 -2513 3801 -3315 25896 48908 39291 26846 46622 23049
13569 23049 13980 -21621 -32639 -45644 -32900 -23168 8797 15541 29858 38165 56680 71014
13557 71014 83374 86039 59382 31304 26665 37828 44846 24588 21565 26226 46855 49484 42360
13544 42360 -2014 -1233 28644 26422 51128 81961 57640 10575 28568 30913 30954 18254 7054
13531 7054 9837 12742 9544 649 -17103 -20683 15939 24949 33866 44060 58665 50235 28244
$$ packed form
13620A1364K4569Q074j1061N798o771Q701N296P616J2239k0695l9240j8984J8816
13607E722j7817k014N521l304J5838K2904k2100r340j4672j5648K5425l41j3815
13594b3641J3699J7196r560J9852K919K9582K247O926j5771k4378j2464j7048
13582a0441P255O404j6310J4337l758O314p116K9211K3012r617j2445J9776k3573
13569B3049r069l5601j1018j3005J2744R732L1965O744J4317Q307J8515J4334
13557G1014J2360K665k6657k8078m639J1163P018k0258l023M661K0629K629p124
13544D2360m4374P81K9877k222K4706L0833k4321m7065J7993K345M1j2700j1200
13531G054K783K905l198q895j7752l580L6622R010Q917J0194J4605q430k1991
$$ plain form
13518 28244 -14532 -43630 -59166 -38232 -10423 -3523 11787 15398 20108 21796 6178 -6175
13506 -6175 1331 -2838 -31885 -16575 -13273 -9691 -5430 4432 22416 23938 18917 -6289 -1778 -9438
13492 -9438 -36034 -20731 -3546 -12305 -9468 -14314 4340 8843 -204 12246 25943 19410 31907
13479 31907 25293 21565 20273 -1902 -3976 7703 11028 29848 52246 43902 48468 73228 68139
13466 68139 80045 97125 127430 193893 246962 291140 306552 329382 372880 404214 406277 392840
13454 392840 373641 342010 310715 263613 251236 243749 207756 182727 155028 149756 124108 87078
13442 87078 83309 95973 51469 58968 40009 30580 39149 48451 62101 71132 86515 112601 121474
13429 121474 172503 193364 203275 242367 281654 312405 323540 357091 365219 346752 324988 319529
$$ packed form
13518B8244m2776k9098j5536K0934K7809O900J5310L611M710J688j5618j2353
13506f175P506m169k9047J5310L302L582M261R862J7984J522n021k5206M511p660
13492i438k6596J5303J7185q759K837m846J8654M503r047J2450J3697o533J2497
13479C1907o614l728j292k2175k074J1679L325J8820K2398q344M566K4760n089
13466F8139J1906J7080L0305O6463N3069M4178J5412K2830M3498L1334K063j3437
13454C92840j9199l1631l1295m7102j2377p487l5993k5029k7699n272k5648l7030
13442H7078l769J2664m4504P499j8959r429Q569R302J3650R031J5383K6086Q873
13429A21474N1029K0861R911L9092L9287L0751J1135L3551Q128j8467k1764n459
$$ plain form
13417 319529 289435 274217 242843 203371 147081 92990 77230 91788 79151 67952 74216 79142
13405 79142 35856 -2375 -27284 -23724 -9566 46 -4708 1429 11759 41124 57492 63204 28124
13392 28124 -14668 15690 31108 23668 -17955 -53318 -82814 -105653 -85025 -48283 -46611 -43240
13380 -43240 -6229 15829 6686 7348 16437 24173 33970 70515 53688 9420 7068 -23103 -29418
13367 -29418 -2274 2832 -8749 16085 -324 -6922 -79 -3604 -14923 -106 25508 55025
13355 55025 64886 39624 11545 7829 -12533 1846 -1755 -23149 -9332 19096 -1340 16549
13343 16549 1832 -14520 -13525 -11383 -25598 -25084 3383 3036 3618 802 -6083 -24787 -37756 -38589
13329 -38589 -32845 -35477 -51332 -11615 3269 -5722 -46237 -75447 -51709 -10565 -8281 4347
$$ packed form
13417C19529l0094j5218l1374l9472n6290n4091j5760J4558j2637j1199O264M926
13405G9142m3286l8231k4909L560J4158R612m754O137J0330K9365J6368N712l5080
13392B8124m2792L0358J5418p440m1623l5363k9496k2839K0628L6742J672L371
13380d3240L7011K2058r143O62R089P736R797L6545j6827m4268k352l0171o315
13367b9418K7144N106j1581K4834j6409o598O843l525j1319J4817K5614K9517
13355E5025R861k5262k8079l716k0362J4379l601k1394J3817K8428k0436J7889
13343A6549j4717j6352R95K142j4215N14K8467l47N82k816o885j8704j2969q33
13329c8589N744k632j5855L9717J4884q991m0515k9210K3738M1144K284J2628
$$ plain form
13317 4347 11845 2799 -16619 -1682 32875 27257 52662 42900 25114 24584 25308 9073 -5182
13304 -5182 -6389 -5564 -25462 -36218 -28889 -5876 -35 -10442 -12040 -6665 8304 25157 5115
13291 5115 -3127 10488 35484 8854 -3946 -6190 343 21534 39121 25191 47896 47560 12034
13278 12034 -15833 -13592 -29322 -39699 -51806 -48882 -35926 -58248 -52171 -35734 -21530 -19696
13266 -19696 -17247 -6992 -32216 -44525 -20557 -16202 -31650 -27473 -4315 -12945 -1788 14990
13254 14990 8782 1723 -8186 -14483 -31521 -28285 -37444 -59732 -48804 -27523 -2555 -30850 -30498
13241 -30498 -27439 -26297 -16237 105 5587 3458 -17076 -8826 19889 39976 15560 11101 2390
13228 2390 -3761 -17609 -32894 -9982 24533 2126 -23773 -46074 -10536 1372 -27315 -63799
$$ packed form
13317D347P498r046j9418J4937L4557n618K5405r762j7786n30P24j6235j4255
13304e182j207Q25j9898j0756P329K3013N841j0407j598N375J4969J6853k0042
13291E115q242J3615K4996k6630j2800k244O533K1191J7587j3930K2705l36l5526
13278A2034k7867K241j5730j0377j2107K924J2956k2322O077J6437J4204J834
13266a9696K449J0255k5224j2309K3968M355j5448M177K3158q630J1157J6778
13254A4990o208p059r909o297j7038L236r159k2288J0928K1281K4968k8295L52
13241c0498L059J142J0060J6342N482k129k0534Q250K8715K0087k4416m459q711
13228B390o151j3848j5285K2912L4515k2407k5899k2301L5538J1908k8687l6484
$$ plain form
13216 -63799 -66198 -39603 -9298 -8378 -11771 17745 26355 35606 41134 13413 -15252 -4727 4115
13203 4115 -7749 -32778 -59666 -36932 -45954 -35869 -17622 -2388 -14247 -27767 -20778 -13140
13191 -13140 -21005 -27233 -14002 -7365 -35257 -41419 -34629 -15314 3496 1203 -25794 -51681 -55549
13178 -55549 -47850 -18590 -4038 6943 16850 42653 59901 34496 3408 3361 -17458 -23600 -27617
13165 -27617 -36316 -35703 -17787 -19108 1592 29868 37552 46085 22390 -16160 -50078 -37547 -10584
13152 -10584 4951 -8607 -30261 -38810 -22972 3734 -6092 -37454 -33755 -2531 24116 13353
13140 13353 1588 4967 31579 12348 -15522 -20451 10909 9810 13647 23659 15667 20465 45076
13127 45076 21585 -8016 -15508 -33447 -16286 11882 11936 19912 18575 33084 42165 33001 53195
$$ packed form
13216f3799k399K6595L0305R20l393K9516Q610R251N528k7721k8665J0525Q842
13203D115j1864k5029k6888K2734r022J0085J8247J5234j1859j3520O989P638
13191a3140p865o228J3231O637k7892o162O790J9315J8810k293k6997k5887l868
13178e5549P699K9260J4552J0981R907K5803J7248k5405l1088m7k0819o142m017
13165b7617q699O13J7916j321K0700K8276P684Q533k3695l8550l3918J2531K6963
13152a0584J5535j3558k1654q549J5838K6706r826l1362L699L1224K6647j0763
13140A3353j1765L379K6612j9231k7870m929L1360j099L837J0012p992M798K4611
13127D5076k3491k9601p492j7939J7161K8168N4P976j337J4509R081r164K0194
$$ plain form
13114 53195 43576 20227 13358 17806 17767 -15848 -30080 -12037 4062 -8569 -23916 -27248 -30343
13101 -30343 -40219 -39929 -22902 -32842 -64308 -70997 -38179 -6505 2454 -3997 6925 5962 20462
13088 20462 3911 4825 -19849 -35069 -9421 -100 -1096 18543 11996 -2677 -11753 -4851 3046
13075 3046 4317 -33531 -40096 -28320 -34444 -26678 -4517 22334 6885 -2630 -16313 -11438 801
13062 801 2032 5201 -6553 -10048 -4652 6704 20980 23369 23917 8946 11764 -12529 -18672 8729
13048 8729 1156 2395 -1635 -27280 -24824 9009 45051 67645 59719 36817 19351 170 -14359
13035 -14359 -9813 -13696 -8253 -15125 -30002 -26804 2688 -17802 -29178 -45473 -35990 -61540 -83654
13022 -83654 -89534 -51533 -14603 -2383 -14585 -24995 -34105 -17724 -8209 -17620 -22462 -13804 3981
$$ packed form
13114E3195r619k3349o869M448l9l3615j4232J8043J6099j2631j5347l332l095
13101c0343r876K90J7027r940l1466o689L2818L1674Q959o451J0922r63J4500
13088B0462j6551R14k4674j5220K5648R321r96J9639o547j4673r076O902P897
13075C046J271l7848o565J1776o124P766K2161K6851j5449r515j3683M875J2239
13062H01J231L169j1754l495N396J1356J4276K389N48j4971K818k4293o143K7401
13048H729p573J239m030k5645K456L3833L6042K2594p926k2902j7466j9181j4529
13035a4359M546l883N443o872j4877L198K9492k0490j1376j6295R483k5550k2114
13022h3654n880L8001L6930J2220j2202j0410r110J6381R515r411m842Q658J7785
$$ plain form
13009 3981 23508 36517 24598 -23136 -16012 -1675 6280 -506 16775 27530 12755 7337 21391
12996 21391 1932 8154 5909 -13129 -11702 -19308 -19931 -46095 -34257 -29537 -2614 9848 3450
12983 3450 -25417 -35841 -8793 -133 -4385 4001 30759 42436 -393 13055 46828 20687
12971 20687 -7462 -395 17841 20976 -27678 -36949 -23907 3622 3942 -14480 -1745 -28437 -45255
12958 -45255 -34884 -1349 -10414 -13881 269 -6156 -37429 -48794 -30827 -2079 13116 -11292
12946 -11292 -29467 -47974 -58284 -58196 -33111 -10234 405 -14219 -23448 -3862 1421 -2372 7005
12933 7005 3079 19467 15492 18672 1650 13361 -2457 -22490 -21235 2788 31859 15723 -14663
12920 -14663 -34849 -12295 5845 9520 23486 20657 12558 17132 10662 -16989 -35802 -14789 -20891
$$ packed form
13009C981J9527J3009j1919m7734P124J4337P955o786J7281J0755j4775n418J4054
12996B1391j9459O222k245j9038J427p606o23k6164J1838M720K6923J2462o398
12983C450k8867j0424K7048Q660m252Q386K6758J1677m2829J3448L3773k6141
12971B0687k8149P067J8236L135m8654r271J3042K7529L20j8422J2735k6692j6818
12958d5255J0371L3535r065l467J4150o425l1273j1365J7967K8748J5195k4408
12946a1292j8175j8507j0310Q8K5085K2877J0639j4624r229J9586N283l793R377
12933G005l926J6388l975L180j7022J1711j5818k0033J255K4023K9071j6136l0386
12920a4663k0186K2554J8140L675J3966k829q099M574o470k7651j8813K1013o102
$$ plain form
12907 -20891 -56311 -53464 -36260 -8666 -5054 -4871 -22306 -11022 8137 19668 6113 13335 -8255
12894 -8255 -35481 -38041 -15224 -4034 -8578 5788 10906 -4721 -13463 -12077 -15043 -19823 -12666
12881 -12666 -15565 -1416 18579 9643 19098 5528 -721 10375 4874 5306 -2681 -10385 -23317
12868 -23317 -17976 -34692 -32814 -15717 -24201 -17559 10301 15916 2955 -11932 -30647 -31766 -2658
12855 -2658 16622 5195 14201 18592 53044 54504 27286 32284 22027 -12208 -15085 -6224 6122
12842 6122 -1456 -14973 -11148 -5670 -12700 -14741 -11937 16147 679 -9300 -4427 22646 9496
12829 9496 -15383 -23863 -34987 -28135 -30765 -40763 -10732 24242 17172 23459 28386 38633 42597
12816 42597 43417 17839 -8997 -2040 -3660 -23451 -27969 -3 -21197 -31779 -29619 3678 20852
$$ packed form
12907b0891l5420K847J7204K7594L612J83j7435J1284J9159J1531j3555P222k1590
12894h255k7226k560K2817J1190m544J4366N118j5627q742J386k966m780P157
12881a2666k899J4149J9995q936R455j3570o249J1096n501M32p987p704j2932
12868b3317N341j6716J878J7097q484O642K7860N615j2961j4887j8715j119K9108
12855b658J9280j1427R006M391L4452J460k7218M998j0257l4235k877Q861J2346
12842F122p578j3517L825N478p030k041K804K8084j5468r979M873K7073j3150
12829I496k4879q480j1124O852k630r998L0031L4974p070O287M927J0247L964
12816D2597Q20k5578k6836O957j620j9791m518K7966k1194j0582K160L3297J7174
$$ plain form
12803 20852 17486 17771 13823 -11357 -46295 -28397 -16442 -43626 -32531 213 -1044 -740 5562
12790 5562 -2381 -32138 -27772 -35292 -36689 -27626 -22693 -23488 -26598 -15900 -22052 -34726 -24746 -16351
12776 -16351 -7007 -23966 -39149 -46954 -45715 -33953 -39959 -34024 -27569 -11617 -29109 -46610 -2448
12763 -2448 16290 20219 26535 7503 3073 1876 8584 10234 23443 40557 40415 27030 26426 14207
12749 14207 11668 8145 -31364 -45420 -32484 -42635 -7099 21818 17314 16507 10430 14259 12833
12736 12833 -7951 5174 4510 -17993 5562 17707 11273 -11793 -23145 -19511 -26244 -20555 -9856
12723 -9856 -5636 6229 -13499 -47709 -44489 -13328 -3620 -9692 -22349 -20751 -47637 -74556 -69734
12710 -69734 -62569 -38241 -32522 -43457 -74680 -77430 -49057 -8648 -2198 -34498 -22739 -23094 -11256
$$ packed form
12803B0852l366K85l948k5180l4938J7898J1955k7184J1095L2744j257L04O302
12790E562p943k9757M366p520j397R063M933p95l110J0698o152j2674R980Q395
12776a6351R344j6959j5183p805J239J1762o006N935O455J5952j7492j7501M4162
12763b448J8738L929O316j9032m430j197O708J650J3209J7114j42j3385o04j2219
12749A4207k539l523l9509j4056J2936j0151L5536K8917m504q07o077L829j426
12736A2833k0784J3125o64k2503K3555J2145o434k3066j1352L634o733N689J0699
12723i856M220J1865j9728l4210L220L1161R708o072j2657J598k6886k6919M822
12710f9734P165K4328N719j0935l1223k750K8373M0409O450l2300J1759l55J1838
$$ plain form
12697 -11256 35886 39741 18521 -5500 8066 1514 -26508 -48432 -36593 -27910 -18061 -25813 -22245
12684 -22245 -18081 -14758 -37112 -34209 -17730 -10534 -17149 -25442 -16434 -11738 -27178 -10646 27988
12671 27988 11958 -23120 -16940 13256 32525 20036 26113 17368 34558 35749 21378 -8828
12659 -8828 -12318 -6943 -5606 -21041 -22834 -16200 -5298 7931 21878 14203 865 -1333 -24501
12646 -24501 -35162 -20629 -23020 -16847 -22331 -30555 -40753 -18939 -14080 3775 5632 -16195 -38705
12633 -38705 -47323 -44579 -24117 -16071 -28953 -31966 -17253 -22409 -28046 2224 -25092 -34281 -35298
12620 -35298 -36688 -35894 -47593 -52502 -28967 -7578 9315 5446 119 -23921 -27567 -48292 -36496
12607 -36496 -22794 -15956 -9905 -7841 -21857 -1730 32458 30369 4235 -14146 -27696 -19601 -16669
$$ packed form
12697a1256M7142L855k1220k4021J3566o552k8022k1924J1839Q683R849p752L568
12684b2245M164L323k2354K903J6479P196o615q293R008M696j5440J6532L8634
12671B7988j6030l5078O180L0196J9269j2489O077q745J7190J191j4371l0206
12659h828l490N375J337j5435j793O634J0902J3229J3947p675j3338k198k3168
12646b4501j0661J4533k391O173n484q224j0198K1814M859J7855J857k1827k2510
12633c8705q618K744K0462Q046j2882l013J4713n156n637L0270k7316r189j017
12620c5298j390P94j1699m909K3535K1389J6893l869n327k4040l646k0725J1796
12607c6496J3702O838O051K064j4016K0127L4188k089k6134j8381j3550Q095K932
$$ plain form
12594 -16669 -9458 -18490 -9144 -6165 4449 -9464 -38037 -64415 -35723 -43749 -55506 -42097 -62229
12581 -62229 -61562 -34694 -40995 -50128 -61628 -61894 -58672 -57930 -76953 -50540 -40555 -45033 -21633 7174
12567 7174 8024 19005 20115 17027 10792 39332 31989 26740 18054 31698 26277 7269 626 17946
12553 17946 8660 2900 20946 -15413 -43116 -33397 -11925 23536 46848 34979 23705 23185 6411
12540 6411 -10169 -15632 -23588 -29598 -11254 -38704 -29277 -10170 -11770 -14498 1246 8341 21622
12527 21622 12324 -21270 -16541 -11836 28348 24455 9643 24461 18600 -12274 -28738 -45883 -80772
12514 -80772 -21927 10431 11535 16304 7945 -13026 -21212 -27379 -25746 -16886 -21654 -44171 -30733
12501 -30733 -21490 -20155 -18623 -13192 -20874 -47172 -59840 -32478 14865 7726 -9177 -27413 -25095
$$ packed form
12594a6669P211r032R346K979J0614j3913k8573k6378K8692q026j1757J3409k0132
12581f2229O67K6868o301r133j1500k66L222P42j9023K6413R985m478K3400K8807
12567G174Q50J0981J110l088o235K8540p343n249q686J3644n421j9008o643J7320
12553A7946r286n760J8046l6359k7703R719K1472L5461K3312j1869j1274n20j6774
12540F411j6580n463p956o010J8344k7450R427J9107j600k728J5744P095J3281
12527B1622r298l3594M729M705M0184l893j4812J4818n861l0874j6464j7145l4889
12514h0772N8845L2358J104M769q359k0971q186o167J633Q860m768k2517J3438
12501c0733R243J335J532N431p682k6298j2668K7362M7343p139j6903j8236K318
$$ plain form
12488 -25095 -29242 -28910 -41579 -31473 -8319 -9496 -34449 -39722 -28505 1662 -2042 -15413 -32780
12475 -32780 -40153 -13557 4303 -5434 -27412 -21877 -13868 -8958 -240 1541 12275 13464 4486
12462 4486 -4274 -11775 -17843 -13047 -5371 -7413 -15465 -15806 -27274 -12989 -2347 1021 11237 -11148
12448 -11148 -16678 -15675 -18742 -26341 -36601 -46499 -22508 15607 13935 -12852 -47667 -30972 -1702
12435 -1702 -16364 -29033 -31810 -15787 21836 17530 -2735 -12462 -11214 -3660 11942 19894 54328
12422 54328 26551 -40314 -45883 -26951 -34648 -40629 -16131 -19959 -33943 -9402 14721 5277 -5256
12409 -5256 -9703 1376 17783 8941 21753 48531 61600 8843 -20929 -21706 -9385 -20814 -30929
12396 -30929 -32173 -57191 -59922 -37814 -27693 -6865 -22322 -46951 -35316 -42121 -50720 -54956 -46719
$$ packed form
12488b5095m147L32j2669J0106K3154j177k4953n273J1217L0167l704j3371j7367
12475c2780p373K6596J7860r737k1978N535Q009M910Q718J781J0734J189q978
12462D486q760p501o068M796P676k042q052l41j1468J4285J0642L368J0216k2385
12448a1148n530J003l067p599j0260r898K3991L8115j672k6787l4815J6695K9270
12435a702j4662j2669k777J6023L7623m306k0265r727J248P554J5602P952L4434
12422E4328k7777o6865n569J8932p697n981K4498l828j3984K4541K4123r444j0533
12409e256m447J1079J6407q842J2812K6778J3069n2757k9772p77J2321j1429j0115
12396c0929j244k5018k731K2108J0121K0828j5457k4629J1635o805q599m236Q237
$$ plain form
12383 -46719 -44199 -34828 -21920 -13795 -25773 -22792 -27551 -40658 -31005 -34844 -35705 -24916 -15038 -26197
12369 -26197 -37993 -33840 -46662 -44128 -48951 -42469 -51548 -46535 -46741 -24464 -19074 -16944 -23030 -3645
12355 -3645 -2125 -18041 -24020 -15983 -1405 23736 -15142 -20252 -20816 -60049 -56780 -51167 -36194
12342 -36194 -34675 -19130 18835 22969 39111 32241 35960 39398 27105 31053 52834 43503 18857
12329 18857 2538 10073 -5124 -18191 -337 2810 -1706 -44330 -69110 -67264 -31954 3639
12317 3639 7508 18553 18532 8160 14919 -4133 -5668 -10612 -6290 -16081 -16851 13045 -301 1982
12303 1982 4769 9530 19066 29769 21102 -404 10699 -1014 -22349 -30456 -2776 21745 7904
12290 7904 32265 20838 15789 3760 6760 15330 17763 22478 -5583 -30324 -19422 -21249 -11781
$$ packed form
12383d6719K520R371J2908Q125j1978K981m759j3107R653l839q61J0789R878j1159
12369b6197j1796M153j2822K534m823O482r079N013k06K2277N390K130o086J9385
12355c645J520j5916n979Q037J4578K5141l8878n110n64l9233L269N613J4973
12342c6194J519J5545L7965M134J6142o870L719L438j2293L948K1781r331k4646
12329A8857j6319P535j5197j3067J7854L147m516m2624k4780J846L5310L5593
12317C639L869J1045k1j0372O759j9052j535m944M322r791p70K9896j3346K283
12303A982K787M761R536J0703q667k1506J1103j1713k1335q107K7680K4521j3841
12290G904K4361j1427n049j2029L000Q570K433M715k8061k4741J0902j827R468
$$ plain form
12277 -11781 10178 18557 -3538 -23588 -9634 12314 13409 10763 -9943 -14505 -14191 -2790 22157
12264 22157 21161 -2578 -21555 -32814 -42047 -29032 -11870 -34421 -68216 -64414 -67667 -32273 -10384
12251 -10384 -11307 -35473 -50330 -28641 -16616 -16760 -34616 -4176 -7851 -31273 -23967 -15588 -13408
12238 -13408 -39132 -37255 -47665 -75352 -53209 -24493 5392 8993 20846 9580 -22927 -42760
12226 -42760 -19579 -5157 -12947 -6767 -21694 -30730 -27905 -43464 -34457 13056 27156 6379 1104
12213 1104 17557 22377 8734 -9988 -2289 -11400 -4799 25351 38530 50597 47103 13646 -11639
12200 -11639 1113 4673 26265 40889 28892 -699 11167 24716 9616 -10248 -7805 -8644
12188 -8644 -18902 -11856 -20245 -33288 -15972 5246 33451 60521 44187 45309 30638 32903 86716
$$ packed form
12277a1781K1959Q379k2095k0050J3954K1948J095k646k0706m562L14J1401K4947
12264B2157r96k3739j8977j1259r233J3015J7162k2551l3795L802l253L5394K1889
12251a0384r23k4166j4857K1689J2025j44j7856L0440l675k3422P306Q379K180
12238a3408k5724J877j0410k7687K2143K8716K9885L601J1853j1266l2507j9833
12226d2760K3181J4422p790O180j4927r036K825j5559R007M7513J4100k0777n275
12213A104J6453M820j3643j8722P699r111O601L0150J3179J2067l494l3457k5285
12200a1639J2752L560K1592J4624j1997k9591J1866J3549j5100j9864K443q39
12188h644j0258P046q389j3043J7316K1218K8205K7070j6334J122j4671K265N3813
$$ plain form
12175 86716 110520 95239 84573 76500 61921 32255 18713 17019 6614 -479 -31717 -16759
12163 -16759 -7885 -15332 -12523 -11850 -13682 -17633 8183 22511 -374 -30805 -26338 -14562 -11309
12150 -11309 -26651 -13980 -19913 -46616 -37347 -21368 -6156 5571 -5680 4127 12145 -1538
12138 -1538 3053 13462 27461 26162 34089 44388 16624 12619 -22786 -42559 -26681 -14465 -24071
12125 -24071 -39149 -30800 4529 29919 30082 36196 61007 60149 56510 58486 50758 59595 38982 26549
12111 26549 42600 43275 56317 55089 67298 86314 73125 66343 37006 -8482 -39674 -52282
12099 -52282 -40512 -17894 -9150 751 -8360 -34239 -25307 -8894 10711 5904 -190 -7814 -11499
12086 -11499 -3249 -16360 -39496 -29530 -44168 -49603 -31243 -7167 11664 25158 54455 52574
$$ packed form
12175H6716K3804j5281j0666q073j4579k9666j3542j694j0405p093l1238J4958
12163a6759Q874p447K809O73j832l951K5816J4328k2885l0431M467J1776L253
12150a1309j5342J2671n933k6703R269J5979J5212J1727j1251R807Q018j3683
12138a538M591J0409J3999j299P927J0299k7764m005l5405j9773J5878J2216r606
12125b4071j5078Q349L5329K5390J63O114K4811q58l639J976p728Q837k0613j2433
12111B6549J6051O75J3042j228J2209J9016j3189o782k9337m5488l1192j2608
12099e2282J1770K2618Q744R901r111k5879Q932J6413J9605m807o094p624l685
12086a1499Q250j3111k3136R966j4638n435J8360K4076J8831J3494K9297j881
$$ plain form
12074 52574 48053 65977 82760 94798 75836 88828 102471 97980 75255 69927 76189 68594 46706
12061 46706 33350 45186 57529 52980 48574 39622 43401 55746 56733 107406 106453 41624 -33949
12048 -33949 -88172 -56498 4760 1952 4529 22493 8436 3605 61 -4974 -3030 21660 28807
12035 28807 29984 9175 -7849 21996 27569 45137 61885 52511 60706 62349 24336 11726 35087
12022 35087 46302 61580 53493 52269 58172 34793 32233 29700 42421 48658 17976 14631 24464
12009 24464 39160 62589 85662 70314 56275 77284 102619 78308 96965 114315 118892 118642
11997 118642 81762 42563 24977 57895 84357 96200 111864 97297 80894 89965 121406 128649
11985 128649 124887 117186 113728 72895 46901 79300 120076 130451 123866 170245 213489 230347
$$ packed form
12074E2574m521J7924J6783J2038j8962J2992J3643m491k2725n328O262p595k1888
12061D6706j3356J1836J2343m549m406q952L779J2345R87N0673r53o4829p5573
12048c3949n4223L1674O1258k808K577J7964j4057m831l544n035J944K4690P147
12035B8807J177k0809j7024K9845N573J7568J6748r374Q195J643l8013j2610K3361
12022C5087J1215J5278q087j224N903k3379k560k533J2721O237l0682l345R833
12009B4464J4696K3429K3073j5348j4039K1009K5335k4311J8657J7350M577k50
11997A18642l6880l9199j7586L2918K6462J1843J5664j4567j6403R071L1441P243
11985A28649l762p701l458m0833k5994L2399M0776J0375o585M6379M3244J6858
$$ plain form
11973 230347 217509 211559 238230 243760 237125 251105 244512 276425 293934 273884 286457 339429
11961 339429 354359 386579 426637 488141 528136 547407 602354 678441 747184 808400 863858
11950 863858 928322 1014500 1098016 1172683 1290343 1387446 1499936 1622956 1826502 2064817
11940 2064817 2320088 2649321 3032192 3488877 4096375 4833037 5771829 7028581 8695916
11931 8695916 11038171 14394044 19377656 27046675 38936863 57257361 83037677 109449924
11923 109449924 120366780 113319921 94392150 71694820 53318498 40924606 33001780
11916 33001780 27994116 24736759 22193823 19659160 17121414 14798576 12754615 10993873
11908 10993873 9485530 8268400 7238571 6356579 5580339 4893248 4309309 3820063 3411871
$$ packed form
11973B30347j2838n950K6671N530o635J3980o593L1913J7509k0050J2573N2972
11961C39429J4930L2220M0058O1504L9995J9271N4947P6087O8743O1216N5458
11950H63858O4464Q6178Q3516P4667J17660R7103J12490J23020K03546K38315
11940B064817K55271L29233L82871M56685O07498P36662R38792J256752J667335
11931H695916K342255L355873M983612P669019J1890188J8320498K5780316K6412247
11923A09449924J0916856p046859j8927771k2697330j8376322j2393892p922826
11916C3001780n007664l257357k542936k534663k537746k322838k043961j760742
11908A0993873j508343j217130j029829q81992p76240o87091n83939m89246m08192
$$ plain form
11899 3411871 3083603 2773100 2517495 2297950 2080862 1915288 1777822 1654799 1537139
11890 1537139 1446397 1403466 1368376 1311011 1244276 1205457 1165936 1090661 1017683 943154 873904
11879 873904 815582 755914 707877 661343 609815 559008 528653 494126 463787 452493 407137
11868 407137 370139 358743 355213 336717 355795 331206 301346 291548 275685 269203 234828 222771
11856 222771 210495 216517 209872 227968 225856 212381 196197 172863 164975 198994 208422 223226
11844 223226 217907 212612 173484 163822 170056 171898 149370 131951 150630 158643 148225 132930 124951
11831 124951 127980 140396 129839 112729 116442 104988 116306 127873 119033 77524 85845 105028
11819 105028 111532 106497 85007 62445 92528 103598 100642 106395 110443 97491 99014 76680 89449
$$ packed form
11899C411871l28268l10503k55605k19545k17088j65574j37466j23023j17660
11890A537139r0742m2931l5090n7365o6735l8819l9521p5275p2978p4529o9250
11879H73904n8322n9668m8037m6534n1528n0807l0355l4527l0339j1294m5356
11868D07137l6998j1396l530j8496J9078k4589k9860r798j5863o482l4375j2057
11856B22771j2276O022o645J8096k112j3475j6184k3334p888L4019R428J4804
11844B23226n319n295l9128r662O234J842k2528j7419J8679Q013j0418j5295p979
11831A24951L029J2416j0557j7110L713j1454J1318J1567q840m1509Q321J9183
11819A05028O504n035k1490k2562L0083J1070k956N753M048j2952J523k2334J2769
$$ plain form
11806 89449 129813 140823 151560 168752 172867 171006 199133 267245 313181 304560 233399 183539
11794 183539 164311 152967 96744 78511 100961 90941 83049 95304 84423 80783 89765 90495
11782 90495 62783 23751 19593 48266 52302 57459 61509 52809 37657 29977 6044 8512 1495
11769 1495 10179 50955 82900 106334 96391 71032 65945 78237 83061 73523 37101 30857 38259
11756 38259 60815 79436 70162 46103 44198 39868 43014 34362 25663 -10235 -10732 -14985 -13274 18483
11742 18483 25639 30610 38896 16232 11402 10336 12576 8033 2439 220 12775 20337 11617 32752
11728 32752 34922 30803 37186 43969 40302 19226 29277 49447 71184 73349 53871 47980 51383
11715 51383 43208 37167 38426 44849 50305 29888 8597 -15869 -14422 26926 64852 45581 26686
$$ packed form
11806H9449M0364J1010J0737J7192M115j861K8127O8112M5936q621p1161m9860
11794A83539j9228j1344n6223j8233K2450j0020p892J2255j0881l640Q982P30
11782I0495k7712l9032m158K8673M036N157M050q700j5152p680k3933K468p017
11769A495Q684M0776L1945K3434r943k5359n087J2292M824r538l6422o244P402
11756C8259K2556J8621r274k4059j905m330L146q652q699l5898m97m253J711L1757
11742A8483P156M971Q286k2664m830j066K240m543n594k219J2555P562q720K1135
11728C2752K170m119O383O783l667k1076J0051K0170K1737K165j9478n891L403
11715E1383q175o041J259O423N456k0417k1291k4466J447M1348L7926j9271j8895
$$ plain form
11702 26686 10718 7239 26592 9205 15800 14654 9593 27748 1651 7274 59659 40410 31869
11689 31869 40929 42190 27246 27638 17052 41744 73983 81966 44261 7126 -2345 7129 4721
11676 4721 9925 -6387 -3288 17350 37523 37208 32036 13002 11459 -5251 -22816 7781 45795
11663 45795 57918 52322 28585 6954 5835 6384 43340 42333 27259 24588 16048 7893 8773 20796
11649 20796 16794 -16490 -35986 -34235 -20268 -15784 -21512 -9151 3934 -5242 -15548 -810 -1733
11636 -1733 -700 11255 33996 38261 38712 58525 55365 5293 -6585 -3300 -4997 -8223 4789
11623 4789 5654 6878 26476 35202 40775 56193 19955 -5543 -3190 -6387 7205 27499 -1916
11610 -1916 -3971 -948 14000 -5350 31589 66868 105468 97267 63616 42952 32066 42711
$$ packed form
11702B6686j5968l479J9353j7387O595j146n061J8155k6097N623N2385j9249q541
11689C1869R060J261j4944L92j0586K4692L2239P983l7705l7135r471R474k408
11676D721N204j6312L099K0638K0173l15n172j9034j543j6710j7565L0597L8014
11663D5795J2123n596k3737k1631j119N49L6956j007j5074k671q540q155Q80J2023
11649B0796m002l3284j9496J751J3967M484n728J2361J3085r176j0306J4738r23
11636a733J033J1955K2741M265M51J9813l160n0072j1878L285j697l226J3012
11623D789Q65J224J9598Q726N573J5418l6238k5498K353l197J3592K0294k9415
11610a916k055L023J4948j9350L6939L5279L8600q201l3651k0664j0886J0645
$$ plain form
11598 42711 50440 45956 51432 61734 41698 45601 24635 -20529 -26464 11066 3472 -18659 -26484
11585 -26484 -6994 8450 10351 36509 55083 48779 21975 27112 13183 19187 53630 49624 28132
11572 28132 -20415 -39708 -2357 18155 9365 -2224 -11087 -11872 959 24982 14042 9314 20611
11559 20611 37535 41752 38465 36056 40330 47091 11101 -16388 -13656 3079 -2978 1270 11001
11546 11001 -18677 -48482 -38743 -9502 -3661 -15302 -7989 -8730 3252 2914 -11931 -11455 -19657 -35648
11532 -35648 -21599 -2554 8381 -31005 -49363 -39532 -14775 -1009 31702 38334 32358 45319
11520 45319 12422 -3413 -25844 -32033 -29459 -25077 -29651 -9981 -9823 14998 27134 8429 22704
11507 22704 27026 11587 13537 27487 19032 9590 -34599 -79495 -75604 -52547 -34962 -15162 -12265
$$ packed form
11598D2711P729m484N476J0302k0036L903k0966m5164n935L7530p594k2131p825
11585b6484J9490J5444J901K6158J8574o304k6804N137j3929O004L4443m006k1492
11572B8132m8547j9293L7351K0512q790j1589q863p85J2831K4023j0940m728J1297
11559B0611J6924M217l287k409M274O761l5990k7489K732J6735o057M248R731
11546A1001k9678k9805R739K9241N841j1641P313p41J1982l38j4845M76q202j5991
11532c5648J4049J9045J0935l9386j8358R831K4757J3766L2711O632n976J2961
11520D5319l2897j5835k2431o189K574M382m574J9670J58K4821J2136j8705J4275
11507B2704M322j5439J950J3950q455r442m4189m4896L891K3057J7585J9800K897
$$ plain form
11494 -12265 2187 -4796 -856 -19504 -48432 -36588 -48098 -38935 -56546 -56369 -42592 -16948 23286
11481 23286 35100 13260 -11020 -48347 -51336 -49886 -30279 1481 -4114 -11449 -32845 -62021
11469 -62021 -34483 1371 3200 25177 6315 -14171 -16383 -17030 -10054 -12661 -1748 9784 -10114
11456 -10114 -17626 -18718 -15504 6867 206 -7163 9298 20385 11194 8906 14686 6993 6836 -11143
11442 -11143 -14317 9677 -5802 7631 32390 23973 7659 12423 8320 -10313 -24057 -17112 -3014
11429 -3014 -6259 -7054 -21146 -43779 -34631 -32755 3644 4824 -10472 -1752 10233 -2608 -13502
11416 -13502 -24955 -19547 8987 19578 11547 10877 5909 -14310 -2197 -27994 -63118 -59779 -48757
11403 -48757 -41925 -16122 25873 59182 46067 63505 54339 39407 28930 24567 30423 34627 28284
$$ packed form
11494a2265J4452o983L940j8648k8928J1844j1510R163j7611J77J3777K5644M0234
11481B3286J1814k1840k4280l7327k989J450J9607L1760n595p335k1396k9176
11469f2021K7538L5854J829K1977j8862k0486k212o47O976k607J0913J1532j9898
11456a0114p512j092L214K2371o661p369J6461J1087r191k288N780p693j57j7979
11442a1143l174K3994j5479J3433K4759q417j6314M764m103j8633j3744O945J4098
11429c014l245p95j4092k2633R148J876L6399J180j5296Q720J1985j2841j0894
11416a3502j1453N408K8534J0591q031o70m968k0219J2113k5797l5124L339J1022
11403d8757O832K5803M1995L3309j3115J7438r166j4932j0477m363N856M204o343
$$ plain form
11390 28284 -18965 -14967 -30993 -25689 -5819 9832 21766 28908 3617 -24044 -18142 -18613 -4126
11377 -4126 -14163 -29556 -23211 -28570 -33396 -39775 -26848 -36208 -82201 -62285 -18940 -4420 11282
11364 11282 46329 35313 29992 20422 20936 -490 -30279 -42338 -29169 -32393 -27709 -11843 -24296
11351 -24296 -9038 5443 10066 18475 38764 26710 15079 7123 -15990 -32233 -11308 -75249
11339 -75249 -92254 -80487 -41678 -25268 -23889 -20892 -21711 -17036 1799 -9403 9035 14348 7316
11326 7316 -13747 -21669 -20430 -25013 -12524 -16132 -15166 15987 5839 -57686 -47704 7718 42951
11313 42951 42308 28176 9105 1528 13782 41625 62970 66526 49278 37035 7494 7642 25920
11300 25920 19762 -9902 -16473 -14478 16861 26218 22158 23914 9034 38143 35485 29276 39910
$$ packed form
11390B8284m7249L998j6026N304J9870J5651J1934P142k5291k7661N902m71J4487
11377d126j0037j5393O345n359m826o379J2927r360m5993J9916M3345J4520J5702
11364A1282L5047j1016n321r570N14k1426k9789j2059J3169l224M684J5866j2453
11351b4296J5258J4481M623Q409K0289j2054j1631p956k3113j6243K0925o3941
11339g5249j7005J1767L8809J6410J379K997q19M675J8835j1202J8438N313p032
11326G316k1063p922J239m583J2489l608R66L1153j0148o3525R982N5422L5233
11313D2951o43j4132j9071p577J2254K7843K1345L556j7248j2243k9541J48J8278
11300B5920o158k9664o571J995L1339R357m060J756j4880K9109k658o209J0634
$$ plain form
11287 39910 19759 -15513 -39060 2339 283 9298 40297 43161 51160 71183 68017 81605 100732
11274 100732 85743 102920 136614 156599 189167 241728 319791 403526 509826 666692 900411
11263 900411 1209120 1499046 1634512 1588571 1405782 1125563 889672 697839 559151 488221
11253 488221 436801 404932 337688 272704 231586 189644 141257 128101 119241 99045 73293 42418
11241 42418 35846 44357 74522 59908 54849 41671 23311 54693 60931 64602 74521 75603 47424
11228 47424 28110 15136 12768 59733 75895 62226 31921 18677 29933 30376 24782 21837 47279
11215 47279 57737 44095 57019 47559 11493 4771 -3968 2068 1492 -27671 -31503 -38876 -49545
11202 -49545 -55982 -10522 -3426 -6619 -16645 -29918 -48648 -16010 -8904 -23183 -46289 -54647 -11336
$$ packed form
11287C9910k0151l5272k3547M1399k056R015L0999K864P999K0023l166J3588J9127
11274A00732j4989J7177L3694J9985L2568N2561P8063Q3735J06300J56866K33719
11263I00411L08709K89926J35466m5941j82789k80219k35891j91833j38688p0930
11253D88221n1420l1869o7244o4984m1118m1942m8387j3156q860k0196k5752l0875
11241D2418o572Q511L0165j4614n059j3178j8360L1382O238L671R919J082k8179
11228D7424j9314j2974k368M6965J6162j3669l0305j3244J1256M43n594k945K5442
11215D7279J0458j3642J2924r460l6066o722q739O036n76k9163l832p373j0669
11202d9545o437M5460P096l193j0026j3273j8730L2638P106j4279k3106q358M3311
$$ plain form
11189 -11336 1490 -10784 -17502 -10710 -36777 -50852 -29102 -19030 -5473 -17829 -29922 -24996
11177 -24996 -1596 16977 -7797 -38658 -28186 -42689 -32356 -8247 -21587 -70068 -84304 -87740
11165 -87740 -96925 -91480 -73543 -70058 -66618 -86063 -81019 -66169 -44319 -29988 -21252 -14762 4637
11152 4637 -1373 -28835 -42828 -23208 -12384 514 -4303 -3711 26509 46439 54566 72230 60096
11139 60096 33555 16870 15330 22253 22309 9076 30643 35671 13374 6634 26521 24781 13864
11126 13864 2180 -15840 -27138 755 -225 13814 2459 15644 37308 21974 -14894 -22525
11114 -22525 -11854 3974 31147 33977 27033 19268 32686 59014 86498 123615 155432 189880
11102 189880 205568 177161 163148 164476 172394 197019 184047 133620 79421 35609 -11361 -16691
$$ packed form
11189a1336J2826j2274o718O792k6067j4075K1750J0072J3557j2356j2093M926
11177b4996K3400J8573k4774l0861J0472j4503J0333K4109j3340m8481j4236l436
11165h7740r185N445J7937L485L440j9445N044J4850K1850J4331Q736O490J9399
11152D637o010k7462j3993J9620J0824J2898m817N92L0220J9930Q127J7664j2134
11139F0096k6541j6685j540O923N6j3233K1567N028k2297o740J9887j740j0917
11126A3864j1684j8020j1298K7893r80J4039j1355J3185K1664j5334l6868p631
11114b2525J0671J5828K7173K830o944p765J3418K6328K7484L7117L1817L4448
11102A89880J5688k8407j4013J328P918K4625j2972n0427n4199m3812m6970n330
$$ plain form
11090 -16691 -3417 -20432 -21665 -22179 -23744 -7103 17088 12067 8868 13009 -4013 -7486 -10707
11077 -10707 5287 -4457 -22335 -49413 -51108 -53496 -44815 -41361 -41371 -46701 -55208 -68242 -75523 -77647
11063 -77647 -39586 -19747 4033 19393 1712 -530 2901 -25576 -3746 -11522 -15685 -2268
11051 -2268 -11158 -7197 220 29218 48883 60360 69701 65378 94141 106012 100399 72742 83564
11038 83564 120565 141136 155841 160817 181356 172083 147984 128403 109394 134436 131018 104444
11026 104444 82526 76581 119581 182593 191936 202703 211926 215675 208127 203724 193128 155096 101444
11013 101444 108686 126386 143720 129745 136212 172501 172864 126057 113448 128957 171816 191134
11001 191134 224978 257449 233655 209799 214000 231258 199491 222545 205655 208515 188873 183439
$$ packed form
11090a6691J3274j7015j233n14j565J6641K4191n021l199M141j7022l473l221
11077a0707J5994r744j7878k7078j695k388Q681L454j0n330q507j3034p281k124
11063g7647L8061J9839K3780J5360j7681k242L431k8477K1830p776m163J3417
11051b268q890L961P417K8998J9665J1477R341m323K8763J1871n613k7657J0822
11038H3564L7001K0571J4705M976K0539r273k4099j9581j9009K5042l418k6574
11026A04444k1918n945M3000O3012R343J0767R223L749p548m403j0596l8032n3652
11013A01444P242J7700J7334j3975O467L6289L63m6807j2609J5509M2859J9318
11001A91134L3844L2471k3794k3856M201J7258l1767K3054j6890K860j9642n434
$$ plain form
10989 183439 184843 181418 191729 174535 173761 162722 166468 158995 171883 225793 280767 286440 292031
10976 292031 286030 171158 11762 -120452 -147311 -86069 -13704 -33157 -4947 40508 41117
10965 41117 55120 38292 21183 41201 54578 74316 83812 82250 94170 123463 142566 180509
10953 180509 199297 195774 201106 210015 251401 254545 253471 243960 213158 226075 238545 237993 227781
10940 227781 191340 206536 229946 223805 201327 217168 231925 231595 228678 244813 243752 232694
10928 232694 245502 265613 261958 254901 264355 285755 303227 325979 323968 349429 391969 404675
10916 404675 402228 397150 387207 421480 453986 489343 502307 508470 514400 510193 524789 529208 549318
10903 549318 616996 666109 657879 686148 688343 751057 811860 863803 948453 998238 1072210 1145794
$$ packed form
10989A83439J404l425J0311j7194p74j1039L746p473J2888N3910N4974N673N591
10976B92031o001j14872j59396j32214k6859O1242P2365j9453K8210M5455O09
10965D1117J4003j6828j7109K0018J3377J9738R496j562J1920K9293J9103L7943
10953A80509J8788l523N332Q909M1386L144j074r511l0802J2917J2470n52j0212
10940B27781l6441J5196K3410o141k2478J5841J4757l30k917J6135j061j1058
10928B32694J2808K0111l655p057R454K1400J7472K2752k011K5461M2540J2706
10916D04675k447n078r943L4273L2506L5357J2964O163N930m207J4596M419K0110
10903E49318O7678M9113q230K8269K195O2714O0803N1943Q4650M9785P3972P3584
$$ plain form
10891 1145794 1187176 1247167 1337174 1465585 1611329 1765582 1965330 2237957 2485911 2713012
10881 2713012 2863339 2950346 3022480 3135582 3274488 3485896 3774124 4163237 4677129 5325154
10871 5325154 5957379 6375400 6616922 6791385 7058113 7512395 8186697 9051336 10237366
10862 10237366 11785159 13673199 16025090 18908734 22555110 27376786 34003865 43329326
10854 43329326 56753996 76467985 105847036 149468203 210791483 283143207 333527709
10847 333527709 334718997 299432084 241639277 184840583 142232900 113455928 94562980
10840 94562980 82082100 73097302 65050646 57087011 49606760 42962247 37299509 32518924
10832 32518924 28437467 24951641 21992471 19452402 17310082 15488797 14016081 12891950
$$ packed form
10891A145794M1382N9991R0007J28411J45744J54253J99748K72627K47954K27101
10881B713012J50327Q7007P2134J13102J38906K11408K88228L89113N13892O48025
10871E325154O32225M18021K41522J74463K66728M54282O74302Q64639J186030
10862A0237366J547793J888040K351891K883644L646376M821676O627079R325461
10854D3329326J3424670J9713989K9379051M3621167O1323280P2351724N0384502
10847C33527709J191288l5286913n7792807n6798694m2607683k8776972j8892948
10840I4562980j2480880q984798q046656p963635p480251o644513n662738m780585
10832C2518924m081457l485826k959170k540069k142320j821285j472716j124131
$$ plain form
10824 12891950 12098078 11328939 10399112 9365275 8326812 7378481 6586044 5925161 5374350
10815 5374350 4912204 4480048 4121579 3848154 3613222 3402066 3213808 3017002 2811137
10806 2811137 2624550 2460910 2319031 2196138 2080843 1994294 1912494 1814057 1737834 1654252
10796 1654252 1584798 1535999 1490454 1455198 1424609 1385560 1334121 1275172 1235164 1181124 1111576
10785 1111576 1084184 1060176 1018781 953342 921021 930296 935617 909067 858549 821660 777942 768576
10773 768576 744018 691438 682796 648693 630671 623791 608216 617447 611805 594349 610730 606718
10761 606718 603515 586078 586666 582631 557731 546464 543671 512802 498948 464184 442960 471935
10749 471935 469889 472290 476239 480554 470685 461568 460594 472279 462155 457166 447941 416212 403331
$$ packed form
10824A2891950p93872p69139r29827j033837j038463r48331p92437o60883n50811
10815E374350m62146m32156l58469k73425k34932k11156j88258j96806k05865
10806B811137j86587j63640j41879j22893j15295q6549q1800r8437p6223q3582
10796A654252o9454m8799m5545l5256l0589l9049n1439n8949m0008n4040o9548
10785A111576k7392k4008m1395o5439l2321R275N321k6550n0518l6889m3718r366
10773G68576k4558n2580q642l4103j8022o880j5575R231n642j7456J6381m012
10761F06718l203j7437N88m035k4900j1267k793l0869j3854l4764k1224K8975
10749D71935k046K401L949M315r869r117r74J1685j0124m989r225l1729j2881
$$ plain form
10736 403331 368006 366627 402522 406998 417222 452081 475402 483065 489957 518114 580909 672736
10724 672736 762546 864275 933733 893298 790246 657189 527762 412662 384334 390183 381659
10713 381659 374490 396822 420821 385942 344575 330773 311334 311052 291773 281334 299794 295552
10701 295552 267917 230116 205256 175835 153930 129570 147861 179259 221158 232868 250919
10690 250919 288697 292340 284798 303897 308982 276503 252375 209183 216925 234407 222229 229736
10678 229736 249997 257266 242895 262500 256586 261573 259108 239651 254802 278684 245569 209982
10666 209982 222277 242001 252244 255504 229532 208231 211865 220360 227208 190785 169531 194204
10654 194204 196064 210855 241286 204626 186429 197055 222625 235860 251505 251686 235072 234689
$$ packed form
10736D03331l5325j379L5895M476J0224L4859K3321P663O892K8157O2795R1827
10724F72736Q9810J01729O9458m0435j03052j33057j29427j15100k8328N849q524
10713C81659p169K2332K3999l4879m1367j3802j9439k82j9279j0439J8460m242
10701B95552k7635l7801k4860k9421k1905k4360J8291L1398M1899J1710J8051
10690B50919L7778L643p542J9099N085l2479k4128m3192P742J7482j2178P507
10678B29736K0261P269j4371J9605n914M987k465j9457J5151K3882l3115l5587
10666B09982J2295J9724J0243L260k5972k1301L634Q495O848l6423k1254K4673
10654A94204J860J4791L0431l6660j8197J0626K5570J3235J5645J81j6614l83
$$ plain form
10642 234689 278957 316802 329674 345045 357825 359954 407211 471002 487193 536289 612139 649965
10630 649965 682893 746779 823422 932781 1014900 1109639 1238117 1450273 1728419 2094157
10620 2094157 2581153 3275136 4177310 5354936 6773327 8325347 9717303 10646350 11015285
10611 11015285 10970405 10709508 10580125 10827956 11565220 12952928 15102458 17899688 20994768
10602 20994768 23580226 24864622 24660315 23405663 21831014 20620322 20179661 20719086
10594 20719086 22332609 24996832 28507031 32224648 34907845 35531804 33997381 31037709
10586 31037709 27742989 24943351 23084199 22257509 22454231 23515358 25151253 26789641
10578 26789641 27622448 27037989 25072607 22269647 19364954 16984814 15284273 14244393
$$ packed form
10642B34689M4268L7845J2872J5371J2780K129M7257O3791J6191M9096P5850L7826
10630F49965L2928O3886P6643J09359Q2119R4739J28478K12156K78146L65738
10620B094157M86996O93983R02174J177626J418391J552020J391956R29047L68935
10611A1015285m4880k60897j29383K47831P37264J387708K149530K797230L095080
10602B0994768K585458J284396k04307j254652j574649j210692m40661N39425
10594B0719086J613523K664223L510199L717617K683197O23959j534423k959672
10586C1037709l294720k799638j859152q26690J96722J061127J635895J638388
10578B6789641Q32807n84459j965382k802960k904693k380140j700541j039880
$$ plain form
10570 14244393 13810119 13776396 13978173 14139601 13913386 13118248 11796861 10193186 8574777
10561 8574777 7193248 6086712 5208672 4527445 3972581 3509533 3100338 2723871 2419270
10552 2419270 2182501 1972620 1790289 1635845 1457038 1316035 1208789 1116963 1010143 899354
10542 899354 807715 754885 688885 629765 606486 628295 617362 587850 577117 567787 548384 562710
10530 562710 592233 585842 571379 515774 488091 482486 468036 431253 395945 325780 286430 294402
10518 294402 320121 309213 308935 299182 295425 286962 262537 248000 261054 266505 249234 240150 264773
10505 264773 252085 246985 252459 233814 237795 227254 209217 201022 236088 260698 244181 254888
10493 254888 271270 287681 270799 257004 250799 264432 264832 217558 189076 190084 176276 178351
$$ packed form
10570A4244393m34274l3723K01777J61428k26215p95138j321387j603675j618409
10561H574777j381529j106536q78040o81227n54864m63048m09195l76467l04601
10552B419270k36769k09881j82331j54444j78807j41003j07246r1826j06820j10789
10542H99354r1639n2830o6000n9120k3279K1809j0933k9512j0733r330j9403J4326
10530E62710K9523o391j4463n5605k7683n605j4450l6783l5308p0165l9350P972
10518B94402K5719j0908k78r753l757q463k4425j4537J3054N451j7271r084K4623
10505B64773j2688n100N474j8645L981j0541j8037q195L5066K4610j6517J0707
10493B54888J6382J6411j6882j3795o205J3633M00m7274k8482J008j3808K075
$$ plain form
10481 178351 163276 161034 157287 166641 173328 175271 190484 203001 185795 141004 151101 150328 167431
10468 167431 204952 238874 226724 218437 220021 235007 227462 234544 237102 239482 226874 238400 243876
10455 243876 200049 197260 216675 232066 207727 153786 170377 188725 206736 213994 207006 208947
10443 208947 226976 225658 228252 249487 254374 282176 289577 304958 395668 518902 649381 883228
10431 883228 1159646 1461706 1731310 1798207 1693450 1438284 1144725 923210 779285 668488
10421 668488 585293 520901 478527 455391 413074 346017 310090 302341 276709 245248 229189 210838
10409 210838 210640 178316 154124 142588 135262 124664 118288 88206 73574 78223 84066 76427 91679
10396 91679 94138 85303 88281 106786 119934 115255 76511 70264 82189 82685 87325 71731 59239
$$ packed form
10481A78351j5075k242l747R354O687J943J5213J2517j7206m4791J0097p73J7103
10468A67431L7521L3922j2150q287J584J4986p545P082K558K380j2608J1526N476
10455B43876m3827k789J9415J5391k4339n3941J6591J8348J8011P258o988J941
10443B08947J8029j318K594K1235M887K7802P401J5381R0710J23234J30479K33847
10431H83228K76418L02060K69604O6897j04757k55166k93559k21515j43925j10797
10421F68488q3195o4392m2374k3136m2317o7057l5927p749k5632l1461j6059j8351
10409B10838j98l2324k4192j1536p326j0598o376l0082j4632M649N843p639J5252
10396I1679K459q835K978J8505J3148m679l8744o247J1925M96M640j5594j2492
$$ plain form
10383 59239 85750 85210 88067 73366 55071 78972 75054 77758 63947 55138 52274 84901 114104
10370 114104 113609 90143 86582 90167 91987 72473 46794 69396 86467 115046 93614 77938
10358 77938 75265 65197 83729 102151 91296 78698 48767 28644 39515 35209 32949 46233
10346 46233 53620 83262 80876 60821 72250 83765 78881 76183 74185 71769 83131 125469 114789
10333 114789 97533 107580 91163 63147 50409 95448 101195 101548 67186 62317 65668 94334
10321 94334 94990 82372 84687 61085 31214 27636 52502 61044 15672 2665 6282 31177 59659
10308 59659 63352 68637 67011 44832 36139 32699 33972 28301 -4564 960 26636 38950 -818
10295 -818 -5181 24313 46273 31901 40340 66713 64867 55202 88242 51437 19138 11562 25296
$$ packed form
10383E9239K6511n40K857j4701j8295K3901l918K704j3811q809k864L2627K9203
10370A14104m95k3466l561L585J820j9514k5679K2602J7071K8579k1432j5676
10358G7938k673j0068J8532J8422j0855j2598k9931k0123J0871m306k260J3284
10346D6233P387K9642k386k0055J1429J1515m884k698j998k416J1362M2338j0680
10333A14789j7256J0047j6417k8016j2738M5039N747L53l4362m869L351K8666
10321I4334O56j2618K315k3602k9871l578K4866Q542m5372j3007L617K4895K8482
10308E9659L693N285j626k2179q693l440J273n671l2865N524K5676J2314l9768
10295h18m363K9494K1960j4372Q439K6373j846r665L3040l6805l2299p576J3734
$$ plain form
10282 25296 45438 42385 33221 62414 79428 92553 64762 73686 80166 92526 109549 109391 105504
10269 105504 74151 72874 76660 57843 48355 56633 60827 56679 58242 81117 79890 59836 45198
10256 45198 16654 31158 44821 36234 36338 29377 42500 51958 36399 49338 46169 36363 28397
10243 28397 53053 45165 57299 90729 97445 78137 59504 69165 70613 37717 40815 45394 34432
10230 34432 46966 54959 46842 35717 6984 20678 36958 36255 47191 30730 51011 68062
10218 68062 63614 64924 43308 41356 46410 51371 40392 13663 38600 73977 57189 47840 32789
10205 32789 40533 66543 58100 39619 45678 36472 21798 18893 -2392 -4090 44369 25954 -6089
10192 -6089 -12423 14198 63201 84774 66906 31736 13615 13840 46101 50361 45982 77940 87974
$$ packed form
10282B5296K0142l053r164K9193J7014J3125k7791Q924O480J2360J7023j58l887
10269A05504l1353j277L786j8817r488Q278M194m148J563K2875j227k0054j4638
10256D5198k8544J4504J3663q587J04o961J3123R458j5559J2939l169r806p966
10243B8397K4656p888J2134L3430O716j9308j8633R661J448l2896L098M579j0962
10230C4432J2534P993q117j1125k8733J3694J6280p03J0936j6461K0281J7051
10218F8062m448J310k1616j952N054M961j0979k6729K4937L5377j6788r349j5051
10205C2789P744K6010q443j8481O059r206j4674k905k1285j698M8459j8415l2043
10192f089o334K6621M9003K1573j7868l5170j8121K25L2261M260m379L1958J0034
$$ plain form
10179 87974 101871 108955 146712 142172 123822 134470 139654 123625 119918 122740 121673 91692 113338
10166 113338 128302 131239 148321 181341 204516 161260 144456 163228 192241 193058 222703 236494
10154 236494 232700 254639 309386 296267 234355 176018 153464 148199 159695 163580 161439 171672
10142 171672 151078 147497 169284 135028 115564 114768 130870 133272 109465 103999 118317 143388
10130 143388 158899 125559 91597 93556 70818 68405 68448 76751 75275 47496 53732 67189 43419
10117 43419 16157 18578 35018 57594 71113 64377 41511 38423 67910 82824 62972 41367
10105 41367 38340 35154 32679 29403 9573 -5138 13564 41477 58907 42449 60370 76122
10093 76122 82875 57783 52319 60302 53125 38812 69742 69881 32252 28576 46409 37527 32203
$$ packed form
10179H7974J3897P084L7757m540j8350J0648N184j6029l707K822j067k9981K1646
10166A13338J4964K937J7082L3020K3175m3256j6804J8772K9013Q17K9645J3791
10154B36494l794K1939N4747j3119o1912n8337k2554n265J1496L885k141J0233
10142A71672k0594l581K1787l4256j9464p96J6102K402k3807n466J4318K5071
10130A43388J5511l3340l3962J959k2738k413M3Q303j476k7779O236J3457k3770
10117D3419k7262K421J6440K2576J3519o736k2866l088K9487J4914j9852k1605
10105D1367l027l186k475l276j9830j4711J8702K7913J7430j6458J7921J5752
10093G6122O753k5092n464P983p177j4313L0930J39l7629l676J7833q882n324
$$ plain form
10080 32203 23444 882 9541 24131 47111 63609 36388 8613 3511 52910 49922 56426 50647
10067 50647 27786 3202 11205 31803 30062 29730 24207 20400 27551 42668 47482 38300 23315
10054 23315 32228 54487 77142 91426 78820 77384 91408 58415 28823 27072 7796 -741
10042 -741 8565 7402 26819 22867 27162 29943 48387 30764 -8655 -23868 -15528 -5666 1141 18570
10028 18570 -3061 -3636 -8313 -24155 -11197 11558 45696 69938 70189 50883 35076 33308 33361
10015 33361 23380 34404 11018 8146 17999 14377 34477 31547 26562 -1237 -11988 10351 16788
10002 16788 9777 4742 -3913 -2663 -13677 -8961 -18479 -32748 -16999 2957 40915 60378 77141
9989 77141 64947 55992 36488 20522 33672 29507 41904 48667 55785 57990 50652 69354 84355
$$ packed form
10080C2203q759k2562Q659J4590K2980J6498k7221k7775n102M9399k988O504n779
10067E0647k2861k4584Q003K0598j741l32n523l807P151J5117M814r182j4985
10054B3315Q913K2259K2655J4284j2606j436J4024l2993k9592j751j9276q537
10042g41R306j163J9417l952M295K781J8444j7623l9419j5213Q340R862O807J7429
10028A8570k1631n75m677j5842J2958K2755L4138K4242K51j9306j5807j768N3
10015C3361r981J1024k3386k872R853l622K0100k930m985k7799j0751K2339O437
10002A6788p011n035q655J250j1014M716r518j4269J5749J9956L7958J9463J6763
9989G7141j2194q955j9504j5966J3150m165J2397O763P118K205p338J8702J5001
$$ plain form
9976 84355 76397 44419 9975 11589 25214 35899 20130 17546 8000 -7172 2280 5935 19120
9963 19120 16371 5467 23485 21037 13835 15910 38608 39868 36445 61687 86838 54882 56532
9950 56532 83422 96320 102645 134169 143613 183986 242610 307296 374988 560068 750538 836695
9938 836695 807189 706378 556110 432980 381093 406081 510469 676223 919975 1051623
9928 1051623 1050650 982836 858653 771935 642814 491611 421253 369568 333478 276616 246661
9917 246661 232199 207168 191210 123001 113879 137507 109566 64395 40903 29732 26883 29340
9905 29340 38078 46369 73347 94176 83191 68301 74126 79208 57399 63306 62352 63299 55735 59765
9891 59765 40749 67312 81849 56821 35298 29232 41637 43794 25784 3477 29374 68193
$$ packed form
9976H4355p958l1978l4444J614J3625J0685j5769k584r546j5172R452L655J3185
9963A9120k749j0904J8018k448p202K075K2698J260l423K5242K5151l1956J650
9950E6532K6890J2898O325L1524R444M0373N8624O4686O7692J85080J90470Q6157
9938H36695k9506j00811j50268j23130n1887K4988J04388J65754K43752J31648
9928A051623r73o7814j24183q6718j29121j51203p0358n1685l6090n6862k9955
9917B46661j4462k5031j5958o8209r122K3628k7941m5171k3492j1171k849K457
9905B9340Q738Q291K6978K0829j0985j4890N825N082k1809N907r54R47p564M030
9891E9765j9016K6563J4537k5028k1523o066J2405K157j8010k2307K5897L8819
$$ plain form
9879 68193 78833 73774 60274 49840 52667 45566 30922 43103 75345 98809 75332 69561 39078
9866 39078 14955 26816 39623 31951 36430 27223 13557 5148 8949 14102 5080 26987 21888
9853 21888 21468 30047 57799 65109 39605 17223 10997 -2089 -15042 -23043 -31077 -32056 -2590 6532
9839 6532 7278 26727 30090 17433 -14020 -29804 -19713 -1678 -1947 -7421 -17547 -15105 16491
9826 16491 16500 653 13031 -4919 -11040 -46490 -30081 -3723 7890 7400 -19336 11805 21310
9813 21310 17543 -10615 -26476 -14040 37142 26324 4674 7774 12776 18870 32493 58694 53153
9800 53153 46033 45036 50219 46680 62903 50521 -7389 -1423 35834 33346 52431 56489 65772 41884
9786 41884 29875 -24783 -49699 -29100 946 7401 -1412 19069 3372 -12335 5846 29247
$$ packed form
9879F8193J0640n059j3500j0434K827p101j4644J2181L2242K3464k3477n771l0483
9866C9078k4123J1861J2807p672M479r207j3666q409L801N153r022K1907n099
9853B1888m20Q579K7752P310k5504k2382o226j3086j2953q001q034r79K9466R122
9839F532P46J9449L363j2657l1453j5784J0091J8035k69n474j0126K442L1596
9826A6491Rj5847J2378j7950o121l5450J6409K6358J1613m90k6736L1141R505
9813B1310l767k8158j5861J2436N1182j0818k1650L100N002O094J3623K6201n541
9800E3153p120r97N183l539J6223j2382n7910N966L7257k488J9085M058R283k3888
9786D1884j2009n4658k4916K0599L0046O455q813K0481j5697j5707J8181K3401
$$ plain form
9774 29247 57512 61823 54032 46107 34810 3860 -4679 9372 26675 8105 9379 26355 44412
9761 44412 33055 24149 44330 41957 19877 21544 28457 9818 6785 -1872 34324 27427 15506
9748 15506 18881 -11409 -13147 -5810 17151 27452 14974 12389 3684 5036 -3259 -3597 12769 -4573
9734 -4573 -23596 15994 12903 23995 14469 27426 14951 -23509 -31872 -32211 -16752 -6696 -9449
9721 -9449 -9877 24937 27426 3624 9606 17143 21838 15849 18048 47173 49766 26045 -15980 -17342
9707 -17342 12517 32764 39557 18314 8993 -19959 -17307 12817 15965 14976 5236 15111 35427
9694 35427 58081 67916 71119 99983 140188 154912 168460 180209 218224 265740 327843 351143
9682 351143 350581 347457 314951 253892 198904 151335 123811 120120 131935 128721 94678 94333 95532
$$ packed form
9774B9247K8265M311p791p925j1297l0950q539J4051J7303j8570J274J6976J8057
9761D4412j1357q906K0181k373k2080J667O913j8639l033q657L6196o897j1921
9748A5506L375l0290j738P337K2961J0301j2478k585q705J352q295l38J6366j7342
9734d573j9023L9590l091J1092r526J2957j2475l8460q363l39J5459J0056k753
9721i449m28L4814K489k3802N982P537M695n989K199K9125K593k3721m2025j362
9707a7342K9859K0247O793k1243r321k8952K652L0124L148r89r740R875K0316
9694C5427K2654R835L203K8864M0205J4724J3548J1749L8015M7516O2103K3300
9682C51143n62l124l2506o1059n4988m7569k7524l691J1815l214l4043l45J199
$$ plain form
9669 95532 97681 95500 82686 71842 92475 86118 53068 44011 56014 31414 17071 10915 -4143
9656 -4143 20148 49560 40279 41615 50402 83443 109101 93042 50358 63164 40385 35159 39009
9643 39009 28924 13203 18102 6877 12949 24920 31716 21533 22054 30383 46075 32363 33293
9630 33293 36832 25441 27374 27439 30404 22540 30826 33948 40040 47896 52965 42106 33282 13453
9616 13453 18210 27216 34738 14842 -12082 -56146 -53331 -2759 30771 19866 -2932 21730 11060
9603 11060 18582 22540 18554 45617 54687 52898 60667 51786 47915 50996 54831 51227 9542 -13875
9589 -13875 12170 20736 -3259 -1070 20624 48108 59182 15384 18771 50829 37552 41258 34261
9576 34261 8827 38333 37963 28211 40146 50989 54669 55054 71963 35066 4054 6265 13147
$$ packed form
9669I5532K149k181j2814j0844K0633o357l3050r057J2003k4600j4343o156j5058
9656d143K4291K9412r281J336Q787L3041K5658j6059m2684J2806k2779n226L850
9643C9009j0085j5721M899j1225O072J1971O796j0183N21Q329J5692j3712R30
9630C3293L539j1391J933O5K965p864Q286L122O092P856N069j0859q824j9829
9616A3453M757R006P522j9896k6924m4064K815N0572L3530j0905k2798K4662j0670
9603A1060P522L958l986K7063R070j789P769q881l871L081L835l604m1685k3417
9589a3875K6045Q566k3995K189K1694K7484J1074m3798L387L2058j3277L706o997
9576C4261k5434K9506l70r752J1935J0843L680L85J6909l6897l1012K211O882
$$ plain form
9563 13147 10552 17364 13635 39428 49254 44300 6500 -11846 -10225 7977 32761 31792 3281
9550 3281 -16351 -42070 -47160 -20386 -6118 23756 50241 21087 12998 13690 26559 21097 6934
9537 6934 -11884 -14817 -16001 -13530 -10552 -16237 -5729 -543 4981 17384 2959 -19345 -26303 -1718
9523 -1718 18550 39467 34436 43144 55068 35915 12626 1870 -6244 -28268 -44405 -13894 5329
9510 5329 10384 1242 -3657 -14552 -10985 -28274 9992 37563 43313 39074 27808 17673 5497
9497 5497 9434 20086 14200 -8080 13015 34619 22918 -17451 -33878 -39401 -39093 -15622 -6761
9484 -6761 -6804 15620 17189 18320 26431 32135 45676 28885 25567 13682 20427 10504 -1007 7570
9470 7570 20480 38891 29017 15940 9871 3334 -23383 -37349 -6711 6775 28791 27980 30582
$$ packed form
9563A3147k595O812l729K5793R826m954l7800j8346J621J8202K4784r69k8511
9550C281j9632k5719n090K6774J4268K9874K6485k9154q089O92J2869n462j4163
9537F934j8818k933j184K471K978n685J0508N186N524J2403j4425k2304o958K4585
9523a718K0268K0917n031Q708J1924j9153k3289j0756q114k2024j6137L0511J9223
9510E329N055r142m899j0895L567j7289L8266K7571N750m239j1266j0135j2176
9497E497L937J0652n886k2280K1095K1604j1701m0369j6427n523L08K3471Q861
9484f761m3K2424J569J131Q111N704J3541j6791l318j1885O745r923j1511Q577
9470G570J2910J8411r874j3077o069o537k6717j3966L0638J3486K2016q11K602
$$ plain form
9457 30582 37105 31448 21633 27295 21267 25322 36496 35663 6989 -1605 -13835 -21538 -1532 6805
9443 6805 27554 -8557 -35643 -28021 -19760 -535 -16012 -23711 -20798 -9129 7125 678 -19210
9430 -19210 -40587 -38222 3918 18649 19649 12782 3124 -73 -10635 -20628 -14749 5541 493
9417 493 1796 -15988 -3135 44354 43743 12829 28343 46385 52574 38498 11708 7176 -10041
9404 -10041 -12689 919 -7349 -30680 -7902 23884 25005 31973 26397 -2629 -3545 -184 15650
9391 15650 16944 4072 -5713 -10214 -6111 19470 50371 45153 15333 8892 -10719 -28307 -6729
9378 -6729 2640 2360 9249 13032 13511 19702 43924 33993 20332 19683 7503 -9745 -35140 -10982
9364 -10982 38140 51109 47781 24251 5745 8427 18985 -3646 -1616 4993 -12657 -3573 9139
$$ packed form
9457C0582O523n657r815N662o028M055J1174q33k8674q594j2230p703K0006Q337
9443F805K0749l6111k7086P622Q261J9225j5477p699K913J1669J6254o447j9888
9430a9210k1377K365M2140J4731J000o867r658l197j0562r993N879K0290n048
9417D93J303j7784J2853M7489o11l0914J5514J8042O189j4076k6790m532j7217
9404a0041k648J3608q268k3331K2778L1786J121O968n576k9026r16L361J5834
9391A5650J294j2872r785m501M103K5581L0901n218k9820o441j9611j7588K1578
9378f729R369k80O889L783M79O191K4222r931j3661o49j2180j7248k5395K4158
9364a0982M9122J2969l328k3530j8506K682J0558k2631K030O609j7650R084J2712
$$ plain form
9351 9139 11848 8119 -17305 -5963 14127 18376 18226 860 -18568 -23274 -34139 -47212 -47792 -11689
9337 -11689 17676 9061 -5185 12276 2356 -19328 -30044 -24561 -20853 -13581 -18728 -7499 -18686
9324 -18686 -24854 11143 14840 -940 1185 7443 -2439 10315 17803 3692 -5317 29892 66024
9311 66024 51167 12207 27468 36272 49176 17775 -10894 3645 -2832 -9501 -9418 -8316 -216
9298 -216 -13360 -25611 -3371 -7236 -12594 1138 13958 10988 5984 20974 30938 10166 -254
9285 -254 10094 38741 42570 37864 32712 14414 -7954 1672 24592 7873 -26324 -11740 23314
9272 23314 -10183 -30932 -23058 -4312 12877 -2988 -4002 -25812 -47285 -32747 11669 22592
9260 22592 22836 10670 4103 -9871 -27564 -23089 -25318 3884 14648 19076 37672 32122 25340
$$ packed form
9351I139K709l729k5424J1342K0090M249j50j7366j9428m706j0865j3073n80L6103
9337a1689K9365q615j4246J7461r920k1684j0716N483L708P272n147J1229j1187
9324a8686o168L5997L697j5780K125O258r882J2754P488j4111r009L5209L6132
9311F6024j4857l8960J5261Q804J2904l1401k8669J4539o477o669Q3J102Q100
9298b16j3144j2251K2240l865n358J3732J2820k970n004J4990R964k0772j0420
9285b54J0348K8647L829m706n152j8298k2368R626K2920j6719l4197J4584L5054
9272B3314l3497k0749P874J8746J7189j5865j014k1810k1473J4538M4416J0923
9260B2592K44j2166o567j3974j7693M475k229K9202J0764M428J8596n550o782
$$ plain form
9247 25340 37568 44729 21823 9737 -6951 -9050 6187 19344 19942 27633 32372 34752 4004
9234 4004 -14131 19361 7344 21798 43708 56734 56918 46449 20608 12208 34353 3597 -3648
9221 -3648 3936 22357 1375 5631 27527 19121 -1566 1689 -15633 16793 8612 -11904 18239
9208 18239 27590 -1731 -8108 -8455 5949 17204 41198 48189 30732 13387 15596 13732 22924
9195 22924 27961 27673 7274 12651 51283 69032 28067 4528 -5787 -14254 15159 28621 10266
9182 10266 -10208 -26927 -4336 6831 12861 1560 1483 25163 18253 -11881 -26140 -11293 -1601
9169 -1601 -6697 -12866 -21824 -16250 3927 18379 9005 22520 -3580 -11551 3678 -17731 -34595
9156 -34595 -57126 -50006 -37764 -2068 28521 36866 44554 47888 35015 33938 31924 9977 -4891
$$ packed form
9247B5340J2228P161k2906j2086j6688k099J5237J3157N98P691M739K380l0748
9234D004j8135L3492j2017J4454K1910J3026J84j0469k5841q400K2145l0756p245
9221c648P584J8421k0982M256K1896q406k0687L255j7322L2426q181k0516L0143
9208A8239R351k9321o377l47J4404J1255K3994O991j7457j7345K209j864R192
9195B2924N037k88k0399N377L8632J7749m0965k3539j0315q467K9413J3462j8355
9182A0266k0474j6719K2591J1167O030j1301p7K3680o910l0134j4259J4847R692
9169a601n096o169q958N574K0177J4452r374J3515k6100p971J5229k1409j6864
9156c4595k2531P120J2242L5696L0589Q345P688L334j2873j077k014k1947j4868
$$ plain form
9143 -4891 -6149 459 1188 11145 32794 24329 18866 15646 -105 -23929 -13811 -28777 -37831 15447
9129 15447 66081 97468 84379 51136 10943 -4185 11123 28662 39731 39049 31861 27024 18843
9116 18843 32081 16636 -4558 -1771 -1872 -16201 -2713 -9778 -16316 -6869 11578 1194 -3298
9103 -3298 18332 23669 21496 9683 2431 -3700 -20410 -4296 3003 -8807 -4898 707 -5357 -16517
9089 -16517 1316 -17546 -18214 -24000 -5877 27667 2950 -21215 -51866 -51648 -32368 -27684 -40306
9076 -40306 4124 51795 32616 13608 -13244 -15170 28228 50955 24289 -16783 -16005 -10416 996
9063 996 6736 18469 16105 30498 14927 22593 32676 50032 46351 40642 -1619 -19045 -2654
9050 -2654 22139 4552 14904 22369 42128 34649 24191 13246 -24110 -44278 -21014 -23757 -26604
$$ packed form
9143d891j258O608P29R957K1649q465n463l220j5751k3824J0118j4966r054N3278
9129A5447N0634L1387j3089l3243m0193j5128J5308J7539J1069o82p188m837q181
9116A8843J3238j5445k1194K787j01j4329J3488p065o538R447J8447j0384m492
9103c298K1630N337k173j1813p252o131j6710J6114P299j1810L909N605o064j1160
9089a6517J7833j8862o68n786J8123L3544k4717k4165l0651K18J9280M684j2622
9076d0306M4430M7671j9179j9008k6852j926M3398K2727k6666m1072P78N589J1412
9063I96N740J1733k364J4393j5571P666J0083J7356l681n709m2261j7426J6391
9050b654K4793j7587J0352P465J9759p479j0458j0945l7356k0168K3264k743k847
$$ plain form
9037 -26604 -35147 -33632 -36560 -35895 -18950 -15345 -8064 -10604 4314 11024 34960 66645 75873 61584
9023 61584 19766 -8103 12226 11485 4965 4577 21862 22961 37026 33192 34325 52914 31014
9010 31014 8175 1425 -14664 -39293 -28421 -4212 -2367 10420 450 -3297 -25967 -31543 -24917
8997 -24917 -6435 -10447 -36321 -25519 6184 -8245 -37637 -28656 -31094 -17851 -12755 8974 5643
8984 5643 -25372 -37056 -31267 -54178 -77894 -72221 -39351 -11765 4661 -15504 7227 25647
8972 25647 11808 -588 -1704 13639 1611 7524 16779 8992 -11840 -33776 -19691 -5445 -40292
8959 -40292 -70323 -73612 -65362 -53614 -14774 2950 8977 18748 -16331 -25686 -12562 -24522 3173
8946 3173 27689 22974 18704 -448 14401 2168 -18931 -9490 -14581 -12274 -13872 -13364 -2712 43360
$$ packed form
9037b6604q543J515k928O65J6945L605P281k540J4918O710K3936L1685R228j4289
9023F1584m1818k7869K0329p41o520l88J7285J099J4065l834J133J8589k1900
9010C1014k2839o750j6089k4629J0872K4209J845J2787r970l747k2670n576O626
8997b4917J8482m012k5874J0802L1703j4429k9392Q981k438J3243N096K1729l331
8984E643l1015j1684N789k2911k3716N673L2870K7586J6426k0165K2731J8420
8972B5647j3839j2396j116J5343j2028N913R255p787k0832k1936J4085J4246l4847
8959d0292l0031l289Q250J1748L8840J7724O027R771l5079r355J3124j1960K7695
8946C173K4516m715m270j9152J4849j2233k1099R441n091K307j598N08J0652M6072
$$ plain form
8932 43360 62501 66358 51682 53799 32582 -20630 -23675 -4428 885 1975 24518 1860 -7950
8919 -7950 -8470 -1284 -16600 -12188 8375 23766 18185 -11761 -8172 9558 18621 13592 -8128 -18302
8905 -18302 -25003 -3792 26264 61539 44553 33213 51185 39819 45072 48763 28504 699
8893 699 2986 6595 -15777 -20102 -22886 -39687 -12502 5244 -10637 8855 -204 -20204 -27299
8880 -27299 -39688 -16158 18450 15675 -2045 -402 11852 11621 -15248 -25237 -25108 -41532 -20913
8867 -20913 -25288 -12184 3174 15761 9262 2762 3453 -3879 -32339 -22910 -18404 -24467 -8981 5217
8853 5217 16232 24665 23503 27201 13597 8318 778 -15604 -21491 -26128 -30027 -22636 8003 29690
8839 29690 35526 32875 23546 19239 26102 56007 74077 88702 56093 29818 45953 81670 71416
$$ packed form
8932D3360J9141L857j4676K117k1217n3212l045J9247N313J090K2543k2658r810
8919g950n20P186j5316M412K0563J5391n581k9946L589J7730R063n029k1720j0174
8905a8302o701K1211L0056L5275j6986j1340J7972j1366N253L691k0259k7805
8893F99K287L609k2372m325k784j6801K7185J7746j5881J9492r059k0000p095
8880b7299j2389K3530L4608k775j7720J643J2254k31k6869r989J29j6424K0619
8867b0913m375J3104J5358J2587o499o500O91p332k8460R429M506o063J5486J4198
8853E217J1015Q433j162L698j3604n279p540j6382n887m637l899P391L0639K1687
8839B9690N836k651r329m307O863K9905J8070J4625l2609k6275J6135L5717j0254
$$ plain form
8826 71416 53200 17481 18644 43392 32903 5525 -18314 -28607 7673 17287 16335 30680 47943
8813 47943 56591 44028 45277 60676 70945 74535 74715 64662 65708 76767 94758 105254 138404
8800 138404 137262 132784 116270 105397 104801 121198 152297 190115 229943 251261 285355 338490
8788 338490 383107 372330 403720 458675 541775 687503 889592 1155902 1548352 1940895 2211976
8777 2211976 2243676 2084761 1824903 1505309 1232085 1020341 862309 754071 648116 587340
8767 587340 541410 483134 431176 407252 412158 409229 413955 433048 456875 490692 488137 470032
8755 470032 465685 484014 526886 585965 717864 887598 1161070 1513716 1882080 2160113 2246666
8744 2246666 2107916 1838838 1522739 1234308 1018828 853901 741462 622899 520573 465520
$$ packed form
8826G1416j8216l5719J163K4748j0489k7378k3839j0293L6280R614r52J4345J7263
8813D7943Q648j2563J249J5399J0269L590J80j0053J046J1059J7991J0496L3150
8800A38404j142m478j6514j0873n96J6397L1099L7818L9828K1318L4094N3135
8788C38490M4617j0777L1390N4955Q3100J45728K02089K66310L92450L92543K71081
8777B211976L1700j58915k59858l19594k73224k11744j58032j08238j05955o0776
8767E87340m5930n8276n1958k3924M906k929M726J9093K3827L3817k555j8105
8755D70032m347J8329M2872N9079J31899J69734K73472L52646L68364K78033Q6553
8744B246666j38750k69078l16099k88431k15480j64927j12439j18563j02326n5053
$$ plain form
8734 465520 405157 372743 334320 299025 259658 236339 227647 211708 188300 195661 194901 146289
8722 146289 118106 116057 100455 71053 35935 35849 41973 22380 34097 26186 24663 28270 38228
8709 38228 41374 34644 26454 23699 36622 24357 30079 11008 -9712 -4555 35611 -74 18134
8696 18134 30537 44672 69370 82304 88699 95416 85663 54607 56884 55634 34161 51674 59715
8683 59715 70163 68551 37793 19557 23799 28144 14827 21772 35256 25213 1616 -13415 14972
8670 14972 -6032 -32448 -33295 -8430 20935 11808 -230 8955 15076 30941 26958 38656 50644
8657 50644 67695 65666 70937 82611 59381 45215 40856 33390 29072 18835 9449 32014 46409
8644 46409 54886 19437 9466 787 -45 29154 30370 24218 21934 7491 -23548 4028 -2113 -8966
$$ packed form
8734D65520o0363l2414l8423l5295l9367k3319q692j5939k3408P361p60m8612
8722A46289k8183k049j5602k9402l5118q6O124j9593J1717p911j523L607R958
8709C8228L146o730q190k755J2923j2265N722j9071k0720N157M0166l5685J8208
8696A8134J2403J4135K4698J2934O395O717r753l1056K277j250k1473J7513Q041
8683E9715J0448j612l0758j8236M242M345j3317O945J3484j0043k3597j5031K8387
8670A4972k1004k6416q47K4865K9365r127j2038R185O121J5865l983J1698J1988
8657E0644J7051k029N271J1674k3230j4166m359p466m318j0237r386K2565J4395
8644D6409Q477l5449r971q679q32K9199J216o152k284j4443l1039K7576o141o853
$$ plain form
8630 -8966 6364 -9238 -16798 -6602 15614 30976 30629 15979 28939 5532 -7707 -18154 -9834
8617 -9834 21658 58594 29552 -18443 -32412 -24259 -754 2814 1655 8185 2086 9138 -7976
8604 -7976 4889 -192 1114 -1072 16767 29826 33349 -194 -8632 20785 15298 16989 18362 13988
8590 13988 19986 15759 23563 32514 30479 21616 29484 29205 13393 17519 30205 52097 47038 44809
8576 44809 41012 58887 42591 36454 28474 17972 31632 35903 19084 21848 28943 22662 40237
8563 40237 46687 58462 66041 81923 54879 27220 42796 26363 25327 49380 50591 55312 41999
8550 41999 28985 3821 854 21929 24519 14044 31798 23727 14672 14228 6979 -7532 -17534
8537 -17534 -45127 -49830 -44638 -45051 -24764 -15382 -7745 -2273 57145 71673 63907 25659 17517 14941
$$ packed form
8630h966J5330j5602p560J0196K2216J5362l47j4650J2960k3407j3239j0447Q320
8617i834L1492L6936k9042m7995j3969Q153K3505L568j159O530o099P052j7114
8604g976J2865n081J306k186J7839J3059L523l3543q438K9417n487J691J373m374
8590A3988N998m227P804Q951k035q863P868k79j5812M126J2686K1892n059k229
8576D4809l797J7875j6296o137p980j0502J3660M271j6819K764P095o281J7575
8563D0237O450J1775P579J5882k7044k7659J5576j6433j036K4053J211M721j3313
8550D1999j3014k5164k967K1075K590j0475J7754q071r055m44p249j4511j0002
8537a7534k7593m703N192m13K0287R382P637N472N9418J4528p766l8248q142k576
$$ plain form
8523 14941 9518 5701 11927 -3341 -5664 -4489 -9687 -13057 -24905 -33145 -28236 -17021 238 24176
8509 24176 8400 -22189 -39719 -61954 -56058 -34594 -29681 -13887 -852 -14400 -27924 -15338
8497 -15338 -1537 -5040 -6658 -14104 4133 49559 36429 21397 10528 -5216 -14413 -15290 -8022
8484 -8022 2545 -12501 -15549 -6805 6565 1038 26505 39132 37029 27083 25846 2951 -42172
8471 -42172 -47327 -45904 -29721 -25542 -38851 -36267 -29539 -24409 -28252 -2947 -4937 -1974 -4462 16452
8457 16452 17301 26816 52334 65539 22371 17112 -8700 -3166 15825 33495 36588 43563 70128
8444 70128 90729 102362 100213 61090 23954 -2252 4680 13862 5030 -23171 -3978 34848 41661
8431 41661 38186 5180 12661 48050 58685 21744 8904 26974 30841 19259 18072 32296 24151
$$ packed form
8523A4941n423l817O226j5268k323J175n198l370j1848q240M909J1215J7259K3938
8509B4176j5776l0589j7530k2235N896K1464M913J5794J3035j3548j3524J2586
8497a5338J3801l503j618p446J8237M5426j3130j5032j0869j5744r197q77P268
8484h022J0567j5046l048Q744J3370n527K5467J2627k103r946j237k2895m5123
8471d2172n155J423J6183M179j3309K584O728N130l843K5305j990K963k488K0914
8457A6452Q49R515K5518J3205m3168n259k5812N534J8991J7670L093O975K6565
8444G0128K0601J1633k149l9123l7136k6206O932R182q832k8201J9193L8826O813
8431D1661l475l3006P481L5389J0635l6941j2840J8070L867j1582j187J4224q145
$$ plain form
8418 24151 7664 -9173 9062 -1287 -23513 -8622 -4906 -8083 7739 20987 -1520 -20610
8406 -20610 -30548 87 28943 39366 29580 34687 60765 49947 17118 31374 43307 35572 23439
8393 23439 28623 24731 8789 -20839 -33678 -19528 -8127 -7690 -3072 20185 29436 52496 63020
8380 63020 60394 59740 56037 35991 20472 25473 28040 33559 26261 17640 -2894 -24634 -45739 -46578
8366 -46578 -34409 -21955 -47126 -47482 -34418 -27340 -18811 -32611 -38209 -45580 -80391 -74527 -58518
8353 -58518 -19937 -9096 -14921 -3522 -15136 -17339 -4112 -2641 -19314 -19637 -36055 -36862 -26996
8340 -26996 -14758 -913 11674 20412 12260 9046 -12746 -43837 -29293 -5439 -11718 -19898 -32758
8327 -32758 -44187 -50830 -23903 -1536 27257 29999 24742 36561 49455 39348 1756 -20148
$$ packed form
8418B4151j6487j6837J8235j0349k2226J4891L716l177J5822J3248k2507j9090
8406b0610r938L0635K8856J0423r786N107K6078j0818l2829J4256J1933p735j2133
8393B3439N184l892j5942k9628j2839J4150J1401M37M618K3257R251K3060J0524
8380F3020k626o54l703k0046j5519N001K567N519p298q621k0534k1740k1105q39
8366d6578J2169J2454k5171l56J3064P078Q529j3800n598p371l4811N864J6009
8353e8518L8581J0841n825J1399j1614k203J3227J471j6673l23j6418q07R866
8340b6996J2238J3845J2587Q738q152l214k1792l1091J4544K3854o279q180j2860
8327c2758j1429o643K6927K2367K8793K742n257J1819J2894j0107l7592k1904
$$ plain form
8315 -20148 -22804 -11526 -13301 -13472 -22372 -1332 4351 5469 -16945 -11627 16054 35861 54993
8302 54993 63192 39479 28580 36184 28373 -29097 -50260 -42067 -21163 -15822 -30162 -21128 -21479
8289 -21479 -27106 -35245 -19810 -7415 16950 28420 35940 28925 -12383 -35289 -11878 35269 35976
8276 35976 27662 15119 9103 -22163 -32411 -738 12928 -11786 -17083 36161 61888 49214
8264 49214 20628 11447 5677 -8822 -14332 4603 21127 30064 27620 13269 24532 18180 24648
8251 24648 23333 11700 5248 -5057 -3931 -4114 5277 -7181 -26543 -44952 -37230 -20579 -33637
8238 -33637 -35335 -41461 -47348 -14049 -1276 -10894 -16566 -7358 -2732 -4655 -13968 -40618 -46940 -49655
8224 -49655 -28660 -7880 19511 27276 31119 33357 32639 29234 12561 -7525 -24392 -34378 -48672
$$ packed form
8315b0148k656J1278j775j71q900K1040N683J118k2414N318K7681J9807J9132
8302E4993Q199k3713j0899P604p811n7470k1163Q193K0904N341j4340R034l51
8289b1479n627q139J5435J2395K4365J1470P520p015m1308k2906K3411M7147P07
8276C5976q314j2543o016l1266j0248L1673J3666k4714n297N3244K5727j2674
8264D9214k8586r181n770j4499n510J8935J6524Q937k444j4351J1263o352O468
8251B4648j315j1633o452j0305J126j83R391j2458j9362j8409P722J6651j3058
8238c3637j698o126n887L3299J2773r618n672R208M626j923r313k6650o322k715
8224d9655K0995K0780K7391P765L843K238p18l405j6673k0086j6867r986j4294
$$ plain form
8211 -48672 -39989 -37147 -36980 -11528 55689 73117 53255 32972 4808 6052 30716 37694 -8166
8198 -8166 -10865 -18484 4516 22810 -6521 -28129 -29956 -9426 11959 27742 36510 38622 72445
8185 72445 47883 14715 13006 -10053 -3595 18765 -19840 -48284 -30289 -45081 -55876 -45764
8173 -45764 -49680 -35055 -34460 -40629 -22274 -18465 -8905 -5169 9646 23236 8740 -20293 -34391
8160 -34391 -40347 4813 35729 32655 -831 1026 4449 -23525 -22648 -12829 -3391 18094 45852
8147 45852 24991 -23722 -44959 -37131 -30444 -49423 -43424 -44137 -17540 6501 -5556 20000 30120
8134 30120 20910 16877 31243 26877 14228 4625 -16138 -10671 6126 -36214 -34750 -23781 -27009
8121 -27009 -39544 -33899 -15684 -2070 -10545 -33784 -19149 -15032 -8590 9023 -11631 -4582 20751
$$ packed form
8211d8672Q683K842J67K5452O7217J7428j9862k0283k8164J244K4664O978m5860
8198h166k699p619K3000J8294k9331k1608j827K0530K1385J5783Q768K112L3823
8185G2445k4562l3168j709k3059O458K2360l8605k8444J7995j4792j0795J0112
8173d5764l916J4625N95o169J8355L809R560L736J4815J3590j4496k9033j4098
8160c4391n956M5160L0916l074l3486J857L423k7974Q77R819R438K1485K7758
8147D5852k0861m8713k1237P828O687j8979N999p13K6597K4041j2057K5556J0120
8134C0120r210m033J4366m366j2649r603k0763N467J6797m2340J464J0969l228
8121b7009j2535N645J8215J3614q475k3239J4635M117O442J7613k0654P049K5333
$$ plain form
8108 20751 29078 16980 15190 -13298 -32317 -30206 -15813 -22875 -22186 -17356 -7564 17345 58914
8095 58914 61106 42212 58058 78712 57222 18602 -8655 -37300 -51706 -47067 -38488 3575
8083 3575 27954 41290 34723 41468 40370 18772 1557 -20012 -14455 1313 28729 55703 57516
8070 57516 7489 -19909 -9878 -33943 -36249 -36642 -41232 -39006 -28751 -21464 -14825 -7858 8663
8057 8663 13057 19688 22147 -13568 16171 21959 19378 25294 7731 -7132 29718 51015 39782
8044 39782 342 -23724 -4286 29420 43546 37096 13689 -17328 -28430 -20127 -8318 -2460
8032 -2460 7729 10692 21137 31140 57881 88663 85852 79609 81856 38136 25137 33695 6233
8019 6233 -21259 -33145 -43122 -49375 -42432 -51882 -36575 -9441 15828 22968 14220 20577 7883
$$ packed form
8108B0751Q327j2098j790k8488j9019K111J4393p062O89M830R792K4909M1569
8095E8914K192j8894J5846K0654k1490l8620k7257k8645j4406M639Q579M2063
8083C575K4379J3336o567O745j098k1598j7215k1569N557J5768K7416K6974J813
8070E7516n0027k7398J0031k4065k306l93m590K226J0255P287O639O967J6521
8057H663M394O631K459l5715K9739N788k581N916j7563j4863L6850K1297j1233
8044C9782l9440k4066J9438L3706J4126o450k3407l1017j1102Q303J1809N858
8032b460J0189K963J0445J0003K6741L0782k811o243K247m3720j2999Q558k7462
8019F233k7492j1886r977o253O943r450J5307K7134K5269P140q748O357j2694
$$ plain form
8006 7883 -3421 18147 27133 22429 531 -6148 22577 28511 28157 33696 3211 -889 -12922 -884
7992 -884 31128 47751 40084 13464 -5964 19608 37246 35810 46793 56356 52314 52771 51507 39273
7978 39273 34604 41347 -5166 -37312 -33078 -48075 -40452 -38400 -20398 -8984 -12049 -13731 -30111
7965 -30111 -30788 -33341 -26020 -19388 6995 5492 -23213 -38259 -30950 -11382 -18466 -21385 -35353 -127
7951 -127 -8712 12869 18466 9003 3533 -2616 3312 4852 3655 1967 33157 36972 12958 11829
7937 11829 988 16059 40287 50185 33864 17666 41366 54707 56618 30222 10686 -11
7925 -11 13895 11384 23617 44462 92537 72109 72791 71692 28931 19199 43181 32767 50234
7912 50234 59440 53576 15635 -6738 -21020 3875 20054 16684 13370 -7924 7215 50958 61738
$$ packed form
8006G883j1304K1568Q986m704k1898o679K8725N934l54N539l0485m100j2033J2038
7992h84L2012J6623p667k6620j9428K5572J7638j436J0983R563m042M57j264j2234
7978C9273m669O743m6513l2146M234j4997P623K052J8002J1414l065j682j6380
7965c0111o77k553P321O632K6383j503k8705j5046P309J9568p084k919j3968L5226
7951a27q585K1581N597r463n470o149N928J540j197j688L1190L815k4014j129
7937A1829j0841J5071K4228R898j6321j6198K3700J3341J911k6396j9536j0697
7925a1J3906k511J2233K0845M8075k0428O82j099m2761r732K3982j0414J7467
7912E0234R206n864l7941k2373j4282K4895J6179l370l314k1294J5139M3743J0780
$$ plain form
7899 61738 35817 19201 31815 33784 20241 33282 32766 25299 17376 9365 12073 -17536 -9029
7886 -9029 -1602 -1394 -16981 -44301 -49520 -24988 -25657 1635 49271 49093 36223 6794 3006 494
7872 494 7008 32520 32740 9811 1513 2850 12969 46193 46693 53240 46304 31558 4122 -27162
7858 -27162 -46585 -5630 4343 19568 13883 4020 10953 22179 16658 38953 30755 49236 62224
7845 62224 52917 36893 13898 -11373 -32590 -31833 -25596 -5683 -15072 -40695 -39292 -11673 -27756
7832 -27756 -33881 -192 -1078 -6203 -548 -16412 -15643 -5004 -8397 -14735 -44600 -38717 -22997 -7726
7818 -7726 -6040 -13351 8846 29736 39844 31983 21450 999 -21059 -5790 6559 868 -18312
7805 -18312 -36148 -45143 674 22372 21504 11765 11692 21547 41961 51053 28962 40102 53426 65882
$$ packed form
7899F1738k5921j6616J2614J969j3543J3041n16p467p923q011K708k9609Q507
7886i029P427K08j5587k7320n219K4532o69K7292M7636j78j2870k9429l788k512
7872D94O514K5512K20k2929q298J337J0119L3224N00O547o936j4746k7436l1284
7858b7162j9423M0955R973J5225n685r863O933J1226n521K2295q198J8481J2988
7845F2224r307j6024k2995k5271k1217P57O237J9913r389k5623J403K7619j6083
7832b7756o125L3689q86n125N655j5864P69J0639l393o338k9865N883J5720J5271
7818g726J686p311K2197K0890J0108p861j0533k0451k2058J5269J2349n691j9180
7805a8312j7836q995M5817K1698q68r739p3R855K0414R092k2091J1140J3324J2456
$$ plain form
7791 65882 81444 49234 12108 -12023 -37036 -32577 7223 29528 22886 34797 40082 28318
7779 28318 31100 31618 13147 27383 36457 18863 21220 45405 37097 -1427 -8025 -20071 -19716 -35481
7765 -35481 -22363 -2306 22402 2610 517 -4569 15444 9782 -12895 -9740 7269 25269 20466
7752 20466 -8824 -26506 -13053 -3395 -4410 10086 36278 7588 -8474 -7084 -32791 -46790
7740 -46790 -35817 -46708 -58268 -48272 -23441 -24342 -23266 -27315 -20126 -19655 -18531 -19142 -16549 -6547
7726 -6547 8316 13691 -9532 -36125 -42148 -22520 -31114 -50088 -53150 -32522 -13020 -25105 -27420
7713 -27420 -30550 -6252 27448 46022 35492 23412 -6912 -18737 -35780 -64119 -49201 -37530
7701 -37530 -30553 3017 -571 2516 1320 -24072 -12729 29181 39976 49925 47142 21183 1036
$$ packed form
7791F5882J5562l2210l7126k4131k5013M459L9800K2305o642J1911N285j1764
7779B8318K782N18j8471J4236R074j7594K357K4185q308l8524o598j2046L55j5765
7765c5481J3118K0057K4708j9792k093n086K0013n662k2677L155J7009J8000m803
7752B0466k9290j7682J3453R658j015J4496K6192k8690j6062J390k5707j3999
7740d6790J0973j0891j1560R996K4831r01J076m049P189M71J124o11K593J0002
7726f547J4863N375k3223k6593o023J9628q594j8974l062K0628J9502j2085k315
7713b7420l130K4298L3700J8574j0530j2080l0324j1825j7043k8339J4918J1671
7701c7530O977L3570l588L087j196k5392J1343M1910J0795R949k783k5959k0147
$$ plain form
7688 1036 7023 22692 49039 35033 33915 39196 48335 66413 61351 75993 65255 32465 11296
7675 11296 19439 27718 31889 9017 -23590 -21146 -14468 -20580 -13666 14328 27766 46800 36850
7662 36850 16328 -22654 -25731 -24364 -32175 -30722 -18850 -13749 9300 10615 -832 5128 10524
7649 10524 16504 3761 19722 25848 20369 7441 9563 20326 11748 42025 44721 37974 61835
7636 61835 98260 101314 97791 74421 27136 -4976 -34389 -25409 -54260 -57598 -38405 -18605 9061
7623 9061 -12513 -43428 -33425 -37106 -69503 -71365 -59688 -22264 6481 -13791 -29727 -10388
7611 -10388 -3292 -11908 10466 21256 2502 17205 37224 28245 29150 14491 13795 18037 27536 45106
7597 45106 33236 18146 -10300 -28093 11007 26804 -2242 1437 17383 22854 15577 2828
$$ packed form
7688A036N987J5669K6347j4006j118N281R139J8078n062J4642j0738l2790k1169
7675A1296Q143Q279M171k2872l2607K444O678o112O914K7994J3438J9034r950
7662C6850k0522l8982l077J367p811J453J1872N101K3049J315j1447N960N396
7649A0524N980j2743J5961O126n479j2928K122J0763q578L0277K696o747K3861
7636F1835L6425L054l523k3370m7285l2112k9413Q980k8851l338J9193J9800K7666
7623I061k1574l0915J0003l681l2397j862J1677L7424K8745k0272j5936J9339
7611a0388P096q616K2374J0790j8754J4703K0019q979R05j4659o96M242R499J7570
7597D5106j1870j5090k8446j7793L9100J5797k9046L679J5946N471p277j2749
$$ plain form
7585 2828 7286 -23266 -57032 -42178 -6264 -8012 -10271 3967 5934 13462 15510 2305 -6426
7572 -6426 9722 -15866 1758 21882 1372 -9185 -3143 2586 -303 12581 9758 9126 1374
7559 1374 1087 34906 60952 34909 14265 14969 26670 37443 43279 42256 46228 63655 59676 50969
7545 50969 23222 -2442 10544 -9787 -36348 -26867 -5489 17740 218 -20286 -38052 -36836
7533 -36836 -44132 -31784 -6136 24708 10546 -8240 6282 2031 -524 281 11556 3007 -13994
7520 -13994 -18789 -25492 -25954 -28510 -9752 9257 373 -17246 -37005 -32889 -31427 -37406 -41825 -18847
7506 -18847 -6027 2321 11072 25550 11587 -13327 -25035 -29504 -17540 -14818 21033 21481 14265
7493 14265 11409 4294 -15828 -30850 -27824 -8626 7537 20631 11876 26729 11845 23127 31107
$$ packed form
7585B828M458l0552l3766J4854L5914j748k259J4238J967P528K048j3205q731
7572f426J6148k5588J7624K0124k0510j0557O042N729k889J2884k823o32p752
7559A374k87L3819K6046k6043k0644P04J1701J0773N836j023L972J7427l979q707
7545E0969k7747k5664J2986k0331k6561R481K1378K3229j7522k0504j7766J216
7533c6836p296J2348K5648L0844j4162j8786J4522m251k555Q05J1275q549j7001
7520a3994m795o703m62k556J8758J9009q884j7619j9759M116J462n979m419K2978
7506a8847J2820Q348Q751J4478j3963k4914j1708m469J1964K722L5851M48p216
7493A4265k856p115k0122j5022L026J9198J6163J3094q755J4853j4884J1282P980
$$ plain form
7480 31107 33495 13742 -892 -24233 -40324 -29198 10834 7103 -16842 -7113 -19140 -32390
7468 -32390 -44648 -28372 -38446 -52528 -51173 -14189 -14193 -20414 -26628 1431 -5121 -4057 -11266 -6476
7454 -6476 17647 11333 15810 43826 28016 -11429 -50347 -54653 -62602 -37544 -16161 12284 16644
7441 16644 19708 12179 11514 12416 12334 15143 -2256 -10816 -34111 -2377 -3869 -20214 -53231 -66199
7427 -66199 -72316 -38310 -31828 -29884 -25996 -10136 -1745 -29448 -32447 -10635 -8518 -5426 3250 6843
7413 6843 27149 61898 63509 52415 45746 24181 13073 -25426 -32406 -22216 -3486 24304 41082
7400 41082 18369 -4803 -11576 -16687 -9052 600 -6431 -10715 20718 9394 -32959 -48298 -43254
7387 -43254 -44762 -22819 -22279 -17323 -10894 -8451 -711 -24528 -62183 -85029 -61365 -43187 -22128
$$ packed form
7480C1107K388j9753j4634k3341j6091J1126M0032l731k3945R729j2027j3250
7468c2390j2258J6276j0074j4082J355L6984mo221o214K8059o552J064p209M790
7454f476K4123o314M477K8016j5810l9445l8918m306p949K5058K1383K8445M360
7441A6644L064p529o65R02q2K809j7399q560k3295L1734j492j6345l3017j2968
7427f6199o117L4006O482J944L888J5860Q391k7703k999K1812K117L092Q676L593
7413F843K0306L4749J611j1094o669k1565j1108l8499o980J0190J8730K7790J6778
7400D1082k2713k3172o773n111P635R652p031m284L1433j1324m2353j5339N044
7387d3254j508K1943N40M956O429K443P740k3817l7655k2846K3664J8178K1059
$$ plain form
7374 -22128 -31132 -7642 -6183 -20353 1327 28674 30697 31618 38656 32723 5993 -4844 -6138
7361 -6138 20746 27339 29474 24656 12836 112 -12732 -18688 -10381 20626 9023 -16822 1183
7348 1183 27067 22578 25298 25539 5245 8511 1185 -2229 -4545 -7537 -9714 2008 31420 16555
7334 16555 7436 -7343 -23452 -39220 -56673 -34432 -11850 -28431 -42472 -20316 -31030 4786
7322 4786 -8815 -30841 -37102 -43183 -53462 -25416 5030 6110 -1477 21969 14247 -15629 -12684
7309 -12684 -3800 12322 15649 -8578 -11196 -18170 -33967 -25577 -26116 -5050 19790 -3507 -27873
7296 -27873 -33399 -55070 -29610 -2150 3958 26949 62560 53753 65676 39918 39920 26528 -16729
7283 -16729 -26055 -19196 11503 6725 5189 -7353 29285 10328 -4378 -20105 -35732 -17925 -36040
$$ packed form
7374b2128r004K3490J459j4170K1680K7347K023R21P038n933k6730j0837j294
7361f138K6884O593K135m818j1820j2724j2844n956Q307L1007j1603k5845J8005
7348A183K5884m489K720K41k0294L266p326l414k316k992k177J1722K9412j4865
7334A6555r119j4779j6109j5768j7453K2241K2582j6581j4041K2156j0714L5816
7322D786j3601k2026o261o081j0279K8046L0446J080p587K3446p722k9876K945
7309a2684Q884J6122L327k4227k618o974j5797Q390n39K1066K4840k3297k4366
7296b7873n526k1671K5460K7460O108K2991L5611q807J1923k5758Kj3392m3257
7283a6729r326O859L0699m778j536j2542L6638j8957j4706j5727j5627J7807j8115
$$ plain form
7270 -36040 -25829 3685 16583 14651 -639 -16990 -41263 -36338 -15154 -8343 29954 54670
7258 54670 16016 24023 69765 81339 29173 7407 -21661 -21252 -4372 18990 6824 10666 20672
7245 20672 -8519 -11470 2758 17771 25406 19207 -23874 -23750 -9086 -4104 -8859 -2713 48168
7232 48168 61184 16632 -2953 -8260 5927 -10514 -5249 13414 22136 -10824 -33846 -1774
7220 -1774 26468 10405 -15384 -9555 13868 1001 -23888 -9301 3142 10348 14169 8433 -5865
7207 -5865 -15449 -18568 -26115 -26359 -765 8160 20441 30272 30157 28813 17152 24334 31968 30564 33452
7192 33452 25981 20586 848 -25334 -41431 -37059 -27386 -27212 -12051 9454 25196 19986 6828
7179 6828 5578 7390 19188 12253 -31531 -24931 -36346 -50504 -37009 -17497 -13493 10737 27899
$$ packed form
7270c6040J0211K9514J2898j932j5290j6351k4273M925K1184O811L8297K4716
7258E4670l8654Q007M5742J1574n2166k1766k9068M09J6880K3362j2166L842J0006
7245B0672k9191k951J4228J5013P635o199m3081J24J4664M982m755O146N0881
7232D8168J3016m4552j9585n307J4187j6441N265J8663Q722l2960k3022L2072
7220a774K8242j6063k5789N829K3423j2867k4889J4587J2443P206L821n736j4298
7207e865r584l119p547k44K5594Q925J2281R831j15j344j1661P182P634j404K888
7192C3452p471n395j9738k6182j6097M372R673J74J5161K1505J5742n210j3158
7179F828j250J812J1798o935m3784O600j1415j4158J3495J9512M004K4230J7162
$$ plain form
7166 27899 35688 62557 71511 59579 24675 -4202 -15497 5821 34110 28250 -5192 -33084
7154 -33084 -16585 -1836 -5238 -37574 -21685 -26972 -46900 -44506 -2241 49420 53191 33250 17888
7141 17888 -3020 -15883 -14088 -34899 -30660 -12418 15176 7962 -1238 4527 -1377 7734 40177
7128 40177 32770 27214 17726 27802 33267 17356 -1975 18410 4562 5551 -5104 -2842 2643
7115 2643 -15747 -22103 -8490 -2714 20850 15066 17183 21199 32183 3182 -11647 -17523 -14174
7102 -14174 -2569 11329 43679 33468 -1127 -28 20677 2621 -35652 -47173 -21450 -44526
7090 -44526 -76476 -80715 -36812 8379 -24068 -37706 -37451 -36311 -18822 12585 -3933 -24819 -25764
7077 -25764 -33421 -36283 -8291 -230 -1560 -3676 -18421 -20278 13382 20787 15242 17565 31036 10141
$$ packed form
7166B7899P789K6869Q954j1932l4904k8877j1295K1318K8289n860l3442k7892
7154c3084J6499J4749l402l2336J5889n287j9928K394M2265N1661L771j9941j5362
7141A7888k0908j2863J795k0811M239J8242K7594p214r200N765n904R111L2443
7128D0177p407n556r488J0076N465j5911j9331K0385j3848R89j0655K262N485
7115B643j8390o356J3613N776K3564n784K117M016J0984k9001j4829n876L349
7102a4174J1605J3898L2350j0211l4595J099K0705j8056l8273j1521K5723k3076
7090d4526l1950m239M3903M5191l2447j3638K55J140J7489L1407j6518k0886r45
7077b5764p657k862K7992Q061j330k116j4745j857L3660P405n545K323J3471k0895
$$ plain form
7063 10141 10547 7229 -3971 -35342 -27877 -23751 -19582 -5937 9976 17527 34149 26550 10664
7050 10664 -12207 4714 2679 -26276 -31060 -19450 -6947 -10184 -28332 -36660 -9973 5446 20942
7037 20942 32815 34037 33062 43283 23818 -9308 -9250 -16300 -30948 -9712 9119 32939 48850
7024 48850 32396 14542 7105 1177 -40342 -51621 -42411 -20366 23486 33785 5938 -28135
7012 -28135 -41030 -19950 -19968 -29927 -56911 -34614 -35069 6718 21282 9419 -12782 -14266 -20006
6999 -20006 -15640 -13715 -19523 -11446 -801 -8870 -7815 -12042 -17451 -6720 11810 10204 6134 37893
6985 37893 58921 51356 39501 31251 24758 38513 52990 40459 27426 36633 23487 8509 33178
6972 33178 33845 29231 24826 2522 -14450 -9805 23687 18829 -8700 -9161 -17260 -14069 -30431 -22769
$$ packed form
7063A0141M06l318j1200l1371P465M126M169J3645J5913P551J6622p599j5886
7050A0664k2871J6921k035k8955m784J1610J2503l237j8148q328K6687J5419J5496
7037B0942J1873J222r75J0221j9465l3126N8p050j4648K1236J8831K3820J5911
7024D8850j6454j7854p437n928m1519j1279R210K2045M3852J0299k7847l4073
7012b8135j2895K1080j8r959k6984K2297m55M1787J4564j1863k2201j484n740
6999b0006M366J925n808Q077J0645q069J055m227n409J0731J8530j606m070L1759
6985C7893K1028p565j1855q250o493J3755J4477j2531j3033R207j3146j4978K4669
6972C3178O67m614m405k2304j6972M645L3492m858k7529m61q099L191j6362P662
$$ plain form
6958 -22769 -37091 -33123 -25006 14747 32503 13426 -1279 -10051 -25255 -66300 -72631 -45122 -17832
6945 -17832 -14901 -24576 -22987 6667 9826 771 -4695 -1766 -19996 -25256 4954 16366 12170 -12527
6931 -12527 -24548 -31446 -24701 -21950 -18488 22444 38323 19091 40412 49069 38973 17467 2013
6918 2013 6299 9028 36108 47869 35396 4960 -15955 245 1118 16558 3719 -16492 -12704
6905 -12704 7948 25733 26286 3806 -11904 -8399 -10248 -492 -12971 -11445 -8886 -37274 -67249
6892 -67249 -54348 -48592 -29287 3561 15594 9730 11473 6923 15037 13043 -3587 4495 -11706
6879 -11706 -13432 -11763 10805 23596 4902 -27611 -5204 -28386 -44612 -14769 11222 -7154
6867 -7154 -25292 -34987 -50374 -35152 -36674 -21891 655 5843 4988 1588 5947 -4995 14310
$$ packed form
6958b2769j4322L968Q117L9753J7756j9077j4705q772j5204m1045o331K7509K7290
6945a7832K931r675J589K9654L159r055n466K929j8230n260L0210J1412m196k4697
6931a2527j2021o898O745K751L462M0932J5879j9232K1321Q657j0096k1506j5454
6918B013M286K729K7080J1761j2473l0436k0915J6200Q73J5440j2839k0211L788
6905a2704K0652J7785N53k2480j5710L505j849R756j2479J526K559k8388k9975
6892f7249J2901N756J9305L2848J2033n864J743m550Q114j994j6630Q082j6201
6879a1706j726J669K2568J2791j8694l2513K2407k3182j6226K9843K5991j8376
6867g154j8138r695j5387J5222j522J4783K2546N188q55l400M359j0942J9305
$$ plain form
6854 14310 24499 38048 40090 11393 7868 12553 14314 43385 32304 22102 2899 -7020 -4607
6841 -4607 27762 54092 8608 -13402 -15372 -42231 -32487 -43739 -30729 -31827 -7972 -5871 -16505
6828 -16505 -20685 6171 18516 19824 13209 10504 19838 30914 22327 -4345 11148 10328 -3239
6815 -3239 20844 43905 25546 12948 4017 -33769 -58536 -53563 -10204 16839 18507 27444 31235
6802 31235 30245 14602 17353 33469 34139 24904 35379 35780 38220 23390 26057 10065 -4670 -12744
6788 -12744 -7223 -16432 -34982 -44961 -33500 -37120 -38222 -18738 -9347 -37551 9223 5793 -36366
6775 -36366 -8720 20225 2122 1072 21046 11034 20434 45851 47451 54847 16056 3490 10408
6762 10408 -2929 9187 -2683 -7835 -13281 -25477 -25475 474 9167 23081 476 -16700 4918
$$ packed form
6854A4310J0189J3549K042k8697l525M685J761K9071j1081j0202j9203r919K413
6841d607L2369K6330m5484k2010j970k6859R744j1252J3010j098K3855K101j0634
6828a6505m180K6856J2345J308o615k705R334J1076q587k6672J5493q20j3567
6815c239K4083K3061j8359j2598q931l7786k4767M973M3359K7043J668Q937L791
6802C1235r90j5643K751J6116O70r235J0475M01K440j4830K667j5992j4735q074
6788a2744N521r209j8550r979J1461l620j102J9484R391k8204M6774l430m2159
6775c6366K7646K8945j8103j050J9974j0012R400K5417J600P396l8791j2566O918
6762A0408j3337J2116j1870n152n446j2196KK5949Q693J3914k2605j7176K1618
$$ plain form
6749 4918 26545 27573 21783 17490 28374 45266 64876 67026 50430 34106 24018 21910 28053
6736 28053 25932 12263 5258 13708 4085 -13536 -26798 -22221 -27943 -2295 27859 37956 41141
6723 41141 33250 17198 29158 51356 54952 68143 36772 2933 -8259 2671 -3199 8030
6711 8030 -4766 2512 2374 -2548 2705 9988 -2746 3491 -4245 -21934 -43991 -52746 -41678 -28290
6697 -28290 -18862 -39226 -27244 -14397 7730 3640 22909 28469 11493 18227 21177 35741 13498
6684 13498 -14080 -22483 -8173 12340 -2354 -40295 -79162 -53618 -11906 15939 60134 65628
6672 65628 52915 24865 -3221 -29812 -49701 -39301 -35153 581 19779 18346 40172 36901
6660 36901 28037 15948 8683 -7902 -17231 12911 12361 2357 6869 8076 -3918 -31812 -26551
$$ packed form
6749D918K1627J028n790m293J0884J6892J9610K150j6596j6324j0088k108O143
6736B8053k121j3669p005Q450r623j7621j3262M577n722K5648L0154J0097L185
6723D1141p891j6052J1960K2198L596J3191l1371l3839j1192J0930n870J1229
6711H030j2796P278j38m922N253P283j2734O237p736j7689k2057q755J1068J3388
6697b8290R428k0364J1982J2847K2127m090J9269N560j6976O734K950J4564k2243
6684A3498k7578q403J4310K0513j4694l7941l8867K5544M1712K7845M4195N494
6672F5628j2713k8050k8086k6591j9889J0400M148L5734J9198j433K1826l271
6660C6901q864j2089p265j6585r329L0142n50j0004M512J207j1994k7894N261
$$ plain form
6647 -26551 7694 25541 34953 35919 25425 12600 7696 -34824 3285 6481 3841 -24274 -31457
6634 -31457 -21719 -15337 -54355 -60177 -53376 -44355 -55729 -67150 -59891 -50523 -7878 29694 -10220
6621 -10220 -44655 -33088 4709 54724 45120 9142 -13446 -3313 2079 10588 9008 23470 41597
6608 41597 23288 26929 8378 -9148 -11925 10493 36945 25040 -1870 -8624 -29654 -27585 -16923
6595 -16923 -667 -7841 -36226 -22368 -18201 -38016 -21737 -7318 -23804 -7226 -18220 -16142
6583 -16142 1068 18176 9678 -6953 -12109 -7634 18129 27675 1208 -2701 -12168 -15609 -23173
6570 -23173 -43462 -18478 18288 13035 8739 36908 59170 37993 25494 -1565 -45449 -56837
6558 -56837 -71686 -42405 -13601 -12989 -25501 -40601 -37299 -39441 -45454 -52597 -42030 -57875 -54751
$$ packed form
6647b6551L4245J7847R412R66j0494j2825m904m2520L8109L196k640k8115p183
6634c1457R738O382l9018n822O801R021j1374j1421P259R368M2645L7572l9914
6621a0220l4435J1567L7797N0015r604l5978k2588J0133N392Q509j580J4462J8127
6608D1597j8309L641j8551j7526k777K2418K6452j1905k6910o754k1030K069J0662
6595a6923J6256p174k8385J3858M167j9815J6279J4419j6486J6578j0994K078
6583a6142J7210J7108q498j6631n156M475K5763R546k6467l909r467l441p564
6570b3173k0289K4984L6766n253m296K8169K2262k1177j2499k7059m3884j1388
6558e6837j4849K9281K8804O12j2512j5100L302k142o013p143J0567j5845L124
$$ plain form
6545 -54751 -34742 -44530 -47124 -3833 680 -7886 -3407 -703 -5590 -2503 1149 11083 -538 -8167
6531 -8167 5644 10186 4093 -1120 2595 -14458 -32992 -34923 -24894 -32577 -30455 -14150 -16561 -12315
6517 -12315 -3923 -21973 -23616 -32588 -40348 -41218 -22599 -19202 -20762 16984 55662 53522 41895 31477
6503 31477 45884 51464 45400 27298 8756 6590 14449 8134 -945 2906 -2616 -13180 -4246 144
6489 144 -1280 18746 10516 5025 -22650 -1286 -4132 -9698 10959 17439 33473 42352 13976 19014
6475 19014 13473 7887 -4537 -10567 -30281 -32251 -20948 -9557 -6636 -5868 -3510 30091 29618 3973
6461 3973 15006 27340 -9637 -144 -2060 -18852 -18640 20325 24106 -20840 -19356 19904 32865
6448 32865 16938 18931 19045 10815 22645 9540 19072 28247 7006 -18063 -33473 -13793 11254
$$ packed form
6545e4751K0009r788k594M3291M513q566M479K704m887L087L652R934j1621p629
6531h167J3811M542o093n213L715j7053j8534j931J0029p683K122J6305k411M246
6517a2315Q392j8050j643q972p760q70J8619L397j560L7746L8678k140j1627j0418
6503C1477J4407N580o064j8102j8542k166P859o315r079L851n522j0564Q934M390
6489A44j424K0026q230n491k7675K1364k846n566K0657O480J6034Q879k8376N038
6475A9014n541n586j2424o030j9714j970J1303J1391K921P68K358L3601m73k5645
6461C973J1033J2334l6977R493j916j6792K12L8965L781m4946J484L9260J2961
6448C2865j5927J993J14q230J1830j3105R532R175k1241k5069j5410J9680K5047
$$ plain form
6435 11254 -988 -34502 -45979 -30511 -25658 -32245 -13310 38803 31591 -3684 -34090 -7865
6423 -7865 31867 45077 55963 55388 6979 -17390 103 22291 5798 3908 -14114 -17604 -19697
6410 -19697 1900 -3347 -32926 921 1553 -14223 -43198 -35470 -32117 -54233 -51742 -50070 -46951
6397 -46951 -17495 18187 32755 21268 14209 18702 21206 35764 41311 25483 25686 17537 33899
6384 33899 50919 29958 8873 4924 -23945 -29754 -35224 -35720 -38402 -19710 -9642 -24630 -25747
6371 -25747 12734 25799 18697 23413 21889 11842 13518 -3563 -6872 12658 12534 -8695 -6638
6358 -6638 -18236 -46098 -36831 -32099 -29976 -35502 -38088 -19922 -2328 -13525 -12336 -1784 2209
6345 2209 -7109 5648 23779 8355 1344 -16851 5963 28132 10053 -24466 -33863 -25704 -17396
$$ packed form
6435A1254j2242l3514j1477J5468M853o587J8935N2113p212l5275l0406K6225
6423g865L9732J3210J0886n75m8409k4369J7493K2188j6493j890j8022l490k093
6410a9697K1597n247k9579L3847O32j5776k8975P728L353k2116K491J672L119
6397d6951K9456L5682J4568j1487p059M493K504J4558N547j5828K03q149J6362
6384C3899J7020k0961k1085l949k8869n809n470m96k682J8692J0068j4988j117
6371b5747L8481J3065p102M716j524j0047J676j7081l309J9530j24k1229K057
6358f638j1598k7862R267M732K123n526k586J8166J7594j1197J189J0552L993
6345B209r318J2757J8131j5424p011j8195K2814K2169j8079l4519r397Q159Q308
$$ plain form
6332 -17396 6903 29269 18229 -2078 -2191 -16009 -37805 -47978 -21094 -6660 -8500 -10050 -7770
6319 -7770 10620 -2174 -5826 -12225 -20356 -35836 -51993 -48833 -38939 -31524 -22463 -10176 -3639 -17964
6305 -17964 -15165 -28795 -31627 -15179 -14632 -7188 1057 -22686 -25424 -890 6596 -10108 -27128
6292 -27128 -4322 -3766 -25861 -34074 -38311 -43003 -25265 23100 35384 38673 29137 34225 39543 23203
6278 23203 14627 13550 -13047 -8069 -1258 -15043 13368 6693 5611 926 4037 21797 9186
6265 9186 3876 27329 7847 1668 17231 41782 69416 97002 103580 59692 50256 27569 8533
6252 8533 29635 43240 28233 28617 40039 29261 -25410 -29376 -31681 -25060 -55539 -73011 -73517
6239 -73517 -62121 -38396 -23351 5963 26302 31876 65013 41410 -8789 -38559 -32836 8087
$$ packed form
6332a7396K4299K2366j1040k0307j13j3818k1796j0173K6884J4434j840j550K280
6319g770J8390j2794l652o399q131j5480j6157L160R894P415R061J2287O537j4325
6305a7964K799j3630k832J6448N47P444Q245k3743k738K4534P486j6704j7020
6292b7128K2806N56k2095q213m237m692J7738M8365J2284L289r536N088N318j6340
6278B3203q576j077k6597M978O811j3785K8411o675j082m685L111J7760j2611
6265I186n310K3453j9482o179J5563K4551K7634K7586O578m3888r436k2687j9036
6252H533K1102J3605j5007L84J1422j0778n4671l966k305O621l0479j7472n06
6239g3517J1396K3725J5045K9314K0339N574L3137k3603n0199k9770N723M0923
$$ plain form
6227 8087 17766 26965 29094 2019 -1825 -1089 -7328 -18005 -933 18932 15620 20578 33530 38824
6213 38824 26325 -289 -9957 -7246 -8173 -2862 47378 17162 -16322 -26374 -1587 2763 -7398
6200 -7398 15675 13912 47293 48850 17212 11788 3080 -20438 -40857 -28888 -4930 -18859 -45429
6187 -45429 -20871 13717 32978 35011 28075 -2018 -7468 17528 3428 -51681 -34782 -7435
6175 -7435 -3750 5456 14539 14250 -6 -11759 1145 -4953 -23779 -11131 -5123 -495 -4420 -19027
6161 -19027 -2333 29808 14382 -3053 8621 19786 9914 7757 27858 63348 57827 25660
6149 25660 42086 46979 8712 -11215 -36671 -51737 -34669 -17379 6868 -1447 11069 31265
6137 31265 36459 18317 233 7922 -16579 -25928 -15336 -12297 -5620 5071 -12572 -29310 -15509
$$ packed form
6227H087R679R199K129k7075l844P36o239j0677J7072J9865l312M958J2952N294
6213C8824j2499k6614r668K711r27N311N0240l0216l3484j0052K4787M350j0161
6200g398K3073j763L3381J557l1638n424q708k3518k0419J1969K3958j3929k6570
6187d5429K4558L4588J9261K033o936l0093n450K4996j4100n5109J6899K7347
6175g435L685R206R083k89j4256j1753J2904o098j8826J2648O008M628l925j4607
6161a9027J6694L2141j5426j7435J1674J1165r872k157K0101L5490n521l2167
6149B5660J6426M893l8267j9927k5456j5066J7068J7290K4247q315J2516K0196
6137C1265N194j8142j8084P689k4501r349J0592L039O677J0691j7643j6738J3801
$$ plain form
6124 -15509 -1535 26386 22537 23266 31640 -7266 -28549 -16435 10881 5401 -10006 -14899 -4689
6111 -4689 -19617 -21148 1909 10123 16565 -15294 -24824 -41148 -41251 -34795 -26080 -1217 -3875 -23489
6097 -23489 -24992 3941 18431 7433 15157 -21978 -32365 -8010 -13218 -46047 -36507 -44391 -45439
6084 -45439 -35484 -31049 -31274 -18818 -35374 -28486 12172 36187 14988 9169 1760 -35621 -37666
6071 -37666 -21412 -9427 5776 7346 12791 7048 22955 15210 -3608 15098 -13354 -50718 -40979
6058 -40979 -25162 -9368 -5709 -14284 -27813 -27884 -52898 -89114 -75085 -65936 -80406 -63998 -59678
6045 -59678 -53436 -28528 4456 35694 8330 -13641 -6879 -14622 -16864 9642 36068 55017 52376
6032 52376 33958 -8533 -50605 -36943 -4119 -11109 591 8877 8927 17573 6551 1008 6639
$$ packed form
6124a5509J3974K7921l849P29Q374l8906k1283J2114K7316n480j5407m893J0210
6111d689j4928j531K3057Q214O442l1859r530j6324j03O456Q715K4863k658j9614
6097b3489j503K8933J4490j0998P724l7135j0387K4355n208l2829R540p884j048
6084d5439R955M435k25J2456j6556O888M0658K4015k1199n819p409l7381k045
6071c7666J6254J1985J5203J570N445n743J5907p745j8818J8706k8452l7364R739
6058d0979J5817J5794L659q575j3529p1k5014l6216J4029R149j4470J6408M320
6045e9678O242K4908L2984L1238k7364k1971O762p743k242K6506K6426J8949k641
6032E2376j8418m2491m2072J3662L2824o990J1700Q286N0Q646j1022n543N631
$$ plain form
6019 6639 583 -27833 -33426 11344 35507 12309 -2050 8238 28392 20927 38039 43264 19364
6006 19364 -10182 6769 33887 18952 -1900 30676 50997 40715 4517 -19214 -248 31672
5994 31672 16225 6333 -6925 -31540 -43854 -54505 -42280 1888 -6789 -19076 -13859 19554
5982 19554 -7253 -29249 10366 35792 21207 39397 25058 14638 39011 38779 6439 -10873
5970 -10873 -3552 25784 59374 61183 53296 30499 15084 2638 -12699 -12670 4891 11146 -6734
5957 -6734 -4519 -14673 -14256 -24463 -36400 -46665 -41897 -15503 603 -21300 -26974 -40270 -57335
5944 -57335 -22125 -5125 -6484 -20808 -19338 -57917 -34143 -15806 -37087 -26347 -1210 -31302
5932 -31302 -46548 -26849 -24058 -12333 -12706 -24958 -26861 -26597 -32154 -26331 -16573 -30801 -40887 -31340
$$ packed form
6019F639o056k8416n593M4770K4163k3198j4359J0288K0154p465J7112N225k3900
6006A9364k9546J6951K7118j4935k0852L2576K0321j0282l6198k3731J8966L1920
5994C1672j5447r892j3258k4615j2314j0651J2225M4168q677j2287N217L3413
5982A9554k6807k1996L9615K5426j4585J8190j4339j0420K4373k32l2340j7312
5970a0873P321K9336L3590J809p887k2797j5415j2446j5337K9J7561O255j7880
5957f734K215j0154M17j0207j1937j0265M768K6394J6106k1903n674j3296j7065
5944e7335L5210J7000j359j4324J470l8579K3774J8337k1281J0740K5137l0092
5932c1302j5246J9699K791J1725l73j2252j903K64n557N823R758j4228j0086R547
$$ plain form
5918 -31340 -9486 14079 13179 -6741 -18600 -14066 -8969 2325 13092 16662 -9002 -19311 8225
5905 8225 8993 2830 -13976 -31761 -28711 -28132 -20106 -19440 -14481 -16426 -19737 -20149 -28871 -27436 -15167
5890 -15167 -7519 -1883 -10304 -22053 7631 -11413 -39006 -32505 -16251 -4961 -26029 -21400 -20167
5877 -20167 -14263 -5932 -30764 -61819 -70024 -48984 -8492 -11613 -19505 -9906 29612 27303 9071
5864 9071 11890 -8203 -28023 -49842 -54154 -46730 -24446 -40174 -40919 -57308 -51644 -61522 -78378
5851 -78378 -32777 1189 -31653 -31064 -20680 -12311 -6043 214 18444 44173 53474 26283 21206
5838 21206 -3600 -1296 4264 -1672 -378 22742 34223 10722 10412 45017 66461 56508 19785
5825 19785 6307 -3815 -32414 -43506 -18725 6466 -4218 -13440 4042 2954 -3421 -4558 14743
$$ packed form
5918c1340K1854K3565r00j9920j1859M534N097J1294J0767L570k5664j0309K7536
5905H225P68o163j6806j7785L050N79Q026O66M959j945l311m12q722J435J2269
5890a5167P648N636q421j1749K9684j9044k7593O501J6254J1290k1068M629J233
5877b0167N904Q331k4832l1055q205K1040M0492l121p892R599L9518k309j8232
5864I071K819k0093j9820k1819m312P424K2284j5728p45j6389N664r878j6856
5851g8378M5601L3966l2842N89J0384Q369O268O257J8230K5729R301k7191n077
5838B1206k4806K304N560n936J294K3120J1481k3501l10L4605K1444r953l6723
5825A9785j3478j0122k8599j1092K4781K5191j0684r222J7482j088o375j137J9301
$$ plain form
5812 14743 -6054 -14860 -1455 3491 16802 23087 13049 -2310 -14672 -17440 -18612 -32924 -76648
5799 -76648 -74479 -41786 -36165 -49342 -45208 -60038 -44503 1211 13851 6644 -9568 -5994 -1579
5786 -1579 15063 27051 25336 19859 17975 2337 9962 -14095 -30638 5723 32201 13250 13382
5773 13382 42710 57641 72382 68590 46070 31790 38560 38438 18891 25689 42649 23652 26669
5760 26669 6492 1479 -10574 -27930 -29657 -17854 -4809 6757 -1165 7065 -5107 -43608 -44198
5747 -44198 -30153 -17483 -28909 3624 14173 23813 41271 52294 41354 39097 1252 -19052
5735 -19052 -21923 -35482 -38206 -27518 -6006 -12320 6069 39268 35560 12573 17274 12328 20267
5722 20267 31738 45495 51300 47572 45682 18684 -20074 -33913 -2338 16969 26465 11658 -1007
$$ packed form
5812A4743k0797q806J3405M946J3311O285j0038j5359j2362k768j172j4312m3724
5799g6648K169L2693N621j3177M134j4830J5535M5714J2640p207j6212L574M415
5786a579J6642J1988j715n477j884j5638P625k4057j6543L6361K6478j8951J32
5773A3382K9328J4931J4741l792k2520j4280O770j22j9547O798J6960j8997L017
5760B6669k0177n013j2053j7356j727J1803J3045J1566p922Q230j2172l8501n90
5747d4198J4045J2670j1426L2533J0549R640J7458J1023j0940k257l7845k0304
5735a9052k871j3559k724J0688K1512o314J8389L3199l708k2987M701m946P939
5722B0267J1471J3757N805l728j890k6998l8758j3839L1575J9307R496j4807j2665
$$ plain form
5709 -1007 -4821 -3755 5639 25516 -640 -10700 -50335 -65726 -66386 -62940 -63661 -47518 -65871 -63929
5695 -63929 -46391 -50023 -60755 -63548 -53213 -23636 3486 25694 923 -11669 -7175 24314
5683 24314 19522 5943 -9976 -19562 -5361 -9917 -20157 2386 -16022 612 13905 6625 13533
5670 13533 5376 13196 2153 -9403 -24458 1771 21821 49842 71275 74811 29945 17368
5658 17368 623 -21999 -44697 -53795 -65497 -25676 -21152 -29840 -17909 7267 3385 7214 -13925
5645 -13925 -36930 -12492 -6622 -18657 -15994 -4008 -11506 -19632 -6080 -7751 -27016 -364 10026
5632 10026 -16142 -32946 -38627 -48739 -26153 19173 14020 25382 20488 14754 -20265 -37027 -13624
5619 -13624 26540 35528 21955 38245 36225 -5249 -7848 -15320 -43349 -35847 -16506 2755 29865
$$ packed form
5709a007l814J066R394J9877k6156j0060l9635j5391o60L446p21J6143j8353J942
5695f3929J7538l632j0732k793J0335K9577K7122K2208k4771j2592M494L1489
5683B4314m792j3579j5919r586J4201m556j0240K2543j8408J6634J3293p280O908
5670A3533q157P820j1043j1556j5055K6229K0050K8021K1433L536m4866j2577
5658A7368j6745k2622k2698r098j1702L9821M524q688J1931K5176l882L829k1139
5645a3925k3005K4438N870j2035K663J1986p498q126J3552j671j9265K6652J0390
5632A0026k6168j6804n681j0112K2586M5326n153J1362m894n734l5019j6762K3403
5619a3624M0164Q988j3573J6290k020m1474k599p472k8029P502J9341J9261K7110
$$ plain form
5606 29865 17772 -10812 2638 13739 5273 11699 11999 21636 30964 8496 3766 4743 40131 53684
5592 53684 20932 13540 20331 27598 36962 44768 34943 -10206 -43121 -32785 -11797 -32457 -31628
5579 -31628 -24013 -18493 -15412 -20788 -30500 197 13677 -2991 11276 46100 55927 31071 29797
5566 29797 -2731 -14079 -24637 -23155 -11982 -24065 -6312 23052 -1106 -9272 -15487 -6383 12382
5553 12382 -25041 -34794 -10418 -20895 -17516 370 18322 15867 4465 -14344 -8654 -14183 -10281
5540 -10281 -54314 -67505 -10284 16778 -7928 -35318 -31458 -29085 -27304 -26524 -37102 -62329 -48261
5527 -48261 -44733 -45036 -31652 -31006 -29610 -43319 -8725 -33280 -37922 -37081 -40993 -46147 -28297 -15502
5513 -15502 -23647 -27454 -22699 -28756 -25664 -35595 -46292 -24340 5533 25318 18774 4126 12673
$$ packed form
5606B9865j2093k8584J3450J1101q466O426L00R637R328k2468m730R77L5388J3553
5592E3684l2752p392O791P267R364P806r825m5149l2915J0336K0988k0660Q29
5579c1628P615N520L081n376r712L0697J3480j6668J4267L4824R827k4856j274
5566B9797l2528j1348j0558J482J1173j2083J7753K9364k4158q166o215R104J8765
5553A2382l7423r753K4376j0477L379J7886J7952k455j1402j8809N690n529L902
5540a0281m4033j3191N7221K7062k4706k7390L860K373J781P80j0578k5227J4068
5527d8261L528l03J3384O46J396j3709L4594k4555m642Q41l912n154J7850J2795
5513a5502q145l807M755o057L092r931j0697K1952K9873J9785o544j4648Q547
$$ plain form
5500 12673 241 -5796 -33555 -27548 11146 3034 -16852 -3820 5547 -18494 -53235 -51960 -35216
5487 -35216 -37005 -61941 -56908 -57305 -44902 -1254 -2813 -16465 -27540 -19085 -16111 -13820 -42983
5474 -42983 -30696 -4585 561 -11497 5096 44384 40075 45444 46053 6735 -9895 -21376 -13397
5461 -13397 5106 -3515 -27468 14798 18032 25128 18443 -18990 -55281 -54353 -27419 -16981 -2752
5448 -2752 11286 13617 -6645 -11381 -16688 -5907 1196 -21573 5997 25101 28944 10435 7608
5435 7608 -10373 -17460 -7540 4506 15717 6813 -9331 3336 17327 -3318 -28626 -60999 -66535
5422 -66535 -60445 -23392 -18116 317 4893 -6549 4050 16303 19795 -8582 -27492 -21250 -11362
5409 -11362 -18182 -8026 17403 2870 -4922 11560 18460 6000 -404 -10591 -6790 1731 4247
$$ packed form
5500A2673j2432o037k7759O007L8694q112j9886J3032R367k4041l4741J275J6744
5487c5216j789k4936N033l97J2403M3648j559j3652j1075Q455K974K291k9163
5474d2983J2287K6111N146j2058J6593L9288m309N369O09l9318j6630j1481P979
5461a3397J8503q621k3953M2266L234P096o685l7433l6291R28K6934J0438J4229
5448b752J4038K331k0262m736n307J0781P103k2769K7570J9104L843j8509k827
5435G608j7981p087R920J2046J1211q904j6144J2667J3991k0645k5308l2373n536
5422f6535O090L7053N276J8433M576j1442J0599J2253L492k8377j8910O242R888
5409a1362o820J0156K5429j4533p792J6482O900j2460o404j0187L801Q521K516
$$ plain form
5396 4247 63 7220 -5939 2213 36393 61460 47825 36025 -3219 -24352 -20077 9283 2243
5383 2243 -3342 -32824 -26850 -24277 -3136 -2952 28540 58479 46280 39968 27061 7091 204
5370 204 38151 23921 2153 -11700 -46861 -46198 -61152 -74558 -59240 -62242 -61729 -38435 -38468 -18273
5356 -18273 21646 36113 40390 35078 1381 -30916 -24244 -18721 -3133 -30793 -31070 -15857 -24145
5343 -24145 -3039 22668 1515 -1127 2914 10386 -27506 -34932 -48179 -41611 -70798 -49764 -42525
5330 -42525 -26676 -29019 -24500 -29629 -38503 -35202 -31220 -14541 13951 14014 794 37708 27721 37860
5316 37860 26051 5268 24839 26242 6931 -26219 -8650 -10833 8808 -7122 -13730 -30433
5304 -30433 -63913 -44526 -8852 3332 5279 -19134 -34369 -42182 -9238 19012 5610 -8895
$$ packed form
5396D247m184P157j3159Q152L4180K5067j3635j1800l9244k1133M275K9360p040
5383B243n585k9482N974K573K1141J84L1492K9939j2199o312j2907j9970o887
5370B04L7947j4230k1768j3853l5161O63j4954j3406J5318l002N13K3294l3K0195
5356a8273L9919J4467M277n312l3697l2297O672N523J5588k7660k77J5213q288
5343b4145K1106K5707k1153k642M041P472l7892p426j3247O568k9187K1034P239
5330d2525J5849k343M519n129q874L301L982J6679K8492O3j3220L6914r987J0139
5316C7860j1809k0783J9571J403j9311l3150J7569k183J9641j5930o608j6703
5304c0433l3480J9387L5674J2184J947k4413j5235p813L2944K8250j3402j4505
$$ plain form
5292 -8895 -33142 -42756 -29969 -14135 -12811 -13972 19123 -13614 -33341 -36333 -22381 -9845 21209
5279 21209 20533 714 -9030 -85 -4465 12994 25233 59236 49702 20254 -9418 -25023 -13027
5266 -13027 -23836 -25164 -21430 -28902 -28975 -30028 8854 15808 -9698 -28766 -49690 -71419 -44192
5253 -44192 -23674 -27701 -45694 -46062 -34166 -33782 -10397 10624 13293 35285 18383 2734 16594
5240 16594 34662 39100 27399 7295 1843 -7148 -18189 -16014 -22560 -10638 -5956 -8497 -4535
5227 -4535 -9713 -40304 -27352 -15699 -39486 -39984 -40319 -43505 -51558 -49575 -43098 -26734 -206 4203
5213 4203 -8081 -5070 -8046 5006 11785 -970 11147 25387 12957 7655 23836 49519 42102
5200 42102 -18698 -10735 -2890 -30634 -13711 41893 11548 -37070 -37574 6981 33065 38256 -5034
$$ packed form
5292h895k4247r614J2787J5834J324j161L3095l2737j9727k992J3952J2536L1054
5279B1209o76j9819r744Q945m380J7459J2239L4003r534k9448k9672j5605J1996
5266a3027j0809j328L734p472p3j053L8882O954k5506j9068k0924k1729K7227
5253d4192K0518m027j7993l68J1896L84K3385K1021K669K1992j6902j5649J3860
5240A6594J8068M438j1701k0104n452q991j1041K175o546J1922M682k541L962
5227d535n178l0591J2952J1653k3787m98l35l186q053J983O477J6364K6528M409
5213D203j2284L011k976J3052O779j2755J2117J4240j2430n302J6181K5683p417
5200D2102o0800P963P845k7744J6923N5604l0345m8618n04M4555K6084N191m3290
$$ plain form
5187 -5034 -10765 -7206 815 -16117 -15570 -13365 10965 6636 -9550 -9347 -3178 17482 -3109 26403
5173 26403 36204 29161 35813 18611 -8459 -34292 -48266 -33041 -31387 -5696 -2532 4707 17386
5160 17386 19401 -5936 -43616 -46039 -32993 -17611 -4434 12541 13844 -6984 -16299 -37095 -52578
5147 -52578 -50942 -50596 -51852 -64768 -66782 -34096 -7135 4872 -24215 -55628 -61744 -26116 17619
5134 17619 14438 -22949 -36917 -32612 -26521 -38413 -63215 -59769 -40011 -27042 -5265 10685 -7537
5121 -7537 -12367 -12445 -33266 -44571 -36706 -6223 8205 35620 26424 1053 2657 12233 -1132 -10614
5107 -10614 -23859 -2973 -1937 -26326 -6496 -572 -13447 16993 27334 12067 -36203 -48819
5095 -48819 -21521 -25072 -45762 -48207 -40051 -24312 -5200 -6051 977 35148 30147 -1927 6482
$$ packed form
5187e034n731L559Q021j6932N47K205K4330m329j6186K03O169K0660k0591K9512
5173B6403R801p043O652j7202k7070k5833j3974J5225J654K5691L164P239J2679
5160A7386K015k5337l7680k423J3046J5382J3177J6975J303k0828r315k0796j5483
5147e2578J636L46j256j2916k014L2686K6961J2007k9087l1413o116L5628M3735
5134A7619l181l7387j3968M305O091j1892k4802L446J9758J2969K1777J5950j8222
5121g537m830p8k0821j1305P865L0483J4428K7415r196k5371J604R576j3365r482
5107a0614j3245K0886J036k4389J9830N924j2875L0440J0341j5267m8270j2616
5095d8819K7298l551k0690k445Q156J5739J9112q51P028L4171n001l2074Q409
$$ plain form
5082 6482 58396 59225 20148 -37857 -54625 -39912 -29364 -37965 -43937 -63694 -42780 -8626 -11867
5069 -11867 -9422 -8028 -8537 -1928 -14952 -15875 -15738 -8546 12758 1639 19895 27619 20178 -2733
5055 -2733 -26343 -17214 -13125 -32015 -21369 -15650 -4832 22324 28551 6835 29698 53782 67607
5042 67607 36196 15410 13426 16792 20593 39821 43288 27148 40553 37254 21162 11187 10380
5029 10380 12854 14688 6941 10465 16734 12774 -6654 6358 3441 -16466 -7455 6554 5857 -4188
5015 -4188 -19641 -15859 -47866 -46515 -33967 -29763 -8620 8618 5702 5627 -17931 -35680 -26975 -20319
5001 -20319 -17287 6551 1170 -3201 -14649 6303 43073 35130 25015 3680 -22316 8038 23912
4988 23912 22804 24668 11410 4587 14135 19167 22828 17598 -14339 -52190 -52770 -40184 -36612 -5429
$$ packed form
5082F482N1914Q29l9077n8005j6768J4713J0548q601n972j9757K0914L4154l241
5069a1867K445J394n09O609j3024r23J37P192K1304j1119J8256P724p441k2911
5055b733k3610R129M089j8890J0646N719J0818K7156O227k1716K2863K4084J3825
5042F7607l1411k0786j984L366L801J9228L467j6140J3405l299j6092r975q07
5029A0380K474J834p747L524O269l960j9428J3012k917j9907R011J4009o97j0045
5015d188j5453L782l2007J351J2548M204K1143J7238k916p5k3558j7749Q705O656
5001b0319L032K3838n381m371j1448K0952L6770p943j0115k1335k5996L0354J5874
4988B3912j108J864j3258o823R548N032L661n230l1937l7851n80J2586L572L1183
$$ plain form
4974 -5429 22330 7869 -16365 -14847 -17023 -23770 -453 -10903 -22841 -22021 -47350 -29468 -23768
4961 -23768 -6860 -3435 -10870 -982 14864 -52978 -93905 -66053 -18411 32733 25220 28703 3393
4948 3393 -20756 -52158 -47834 -57519 -57619 -37095 -34563 -39440 -23929 -28331 -12993 4658 4194 1285
4934 1285 -4372 -3709 -5079 19307 31563 38230 43552 34424 12288 -15178 -27352 -30537 -32086 -43135
4920 -43135 -56589 -48760 -31747 -22014 12116 -5019 -3424 18942 20798 19671 -2240 2365 -2915
4907 -2915 800 6060 22175 -16058 -30606 -6275 -17543 -18931 936 13529 -6198 5425 42545
4894 42545 34726 13951 -16074 -27260 -14523 -3355 -13982 -26600 -15782 -22361 -43918 -33565
4882 -33565 -12001 13872 30527 27799 16756 19683 27764 7233 -26477 2871 43476 57881
$$ packed form
4974e429K7759j4461k4234J518k176o747K3317j0450j1938Q20k5329J7882N700
4961b3768J6908L425p435R888J5846o7842m0927K7852M7642N1144p513L483k5310
4948C393k4149l1402M324r685j00K0524K532m877J5511m402J5338J7651m64k909
4934A285n657O63j370K4386J2256O667N322r128k2136k7466j2174l185j549j1049
4920d3135j3454P829J7013R733L4130j7135J595K2366J856j127k1911M605n280
4907b915L715N260J6115l8233j4548K4331j1268j388J9867J2593j9727J1623L7120
4894D2545p819k0775l0025j1186J2737J1168j0627j2618J0818o579k1557J0353
4882c3565K1564K5873J6655k728j1043K927Q081k0531l3710K9348M0605J4405
$$ plain form
4870 57881 47773 9525 34161 47436 34932 21775 4050 28706 57694 31918 -8077 -31451
4858 -31451 -22591 -36267 -14725 -24720 -24335 -26677 -34631 -22372 -13389 -12806 -9227 -10442 -21808 -34477
4844 -34477 -9789 -3966 -27791 -23332 12916 40723 22044 -18272 -56127 -27285 -24518 -42491
4832 -42491 -47259 -50247 -72181 -62625 -48661 -23598 -10604 -11839 -18055 -17166 496 23129 -2936
4819 -2936 -25575 -52963 -59441 -57124 -62529 -42686 -20196 -21103 -34484 -29984 -17129 -7022 -15919
4806 -15919 -19267 -23906 -16039 -17196 -24093 -28763 -44044 -45150 -37604 -18625 4320 29577 11976
4793 11976 6116 21475 1377 -23859 -39960 -14323 20278 8398 -10457 8053 25558 27555
4781 27555 31487 26081 41090 37004 32324 21533 5758 25577 39943 26259 11890 -287 -21607
$$ packed form
4870E7881j0108l8248K4636J3275j2504j3157j7725K4656K8988k5776l9995k3374
4858c1451Q860j3676K1542r995L85k342p954J2259Q983N83L579j215j1366j2669
4844c4477K4688N823k3825M459L6248K7807j8679m0316l7855K8842K767j7973
4832d2491m768k988k1934R556J3964K5063J2994j235o216Q89J7662K2633k6065
4819b936k2639k7388o478K317n405J9843K2490r07j3381M500J2855J0107q897
4806a5919l348m639P867j157o897m670j5281j106P546J8979K2945K5257j7601
4793A1976n860J5359k0098k5236j6101K5637L4601j1880j8855J8510J7505J997
4781B7555L932n406J5009m086m680j0791j5775J9819J4366j3684j4369j2177k1320
$$ plain form
4768 -21607 -42935 -36077 -46191 -52677 -23656 -25759 -40289 -57331 -47266 -24482 -21932 -49027 -41273
4755 -41273 -33969 -37022 -16770 -15795 -27338 -7711 2440 -5002 633 20178 25801 19142 20645 -11898
4741 -11898 -20644 11050 24435 21972 9851 7469 -9173 -8979 -15851 -52325 -71130 -77385 -37002
4728 -37002 -28957 -19242 -16217 18139 29048 36224 28035 7803 -4236 -32489 -40812 -36334 -15529
$$ packed form
4768b1607k1328O858j0114o486K9021k103j4530j7042J0065K2784K550k7095P754
4755d1273P304l053K0252R75j1543J9627J0151p442N635J9545N623o659J503l2543
4741a1898q746L1694J3385k463j2121k382j6642J94o872l6474j8805o255M0383
4728c7002Q045R715L025L4356J0909P176q189k0232j2039k8253q323M478K0805
$$ [...]
##END NTUPLES=NMR SPECTRUM
##END=
