##TITLE=Analysis number 312938
Compound Code cc 39222
Book Reference 413/172
Project Code adrs
Chemist Name stevem
##JCAMPDX= 6.0         $$ Bruker NMR JCAMP-DX V2.0
##DATA TYPE= NMR SPECTRUM
##DATA CLASS= NTUPLES
##ORIGIN= Bruker BioSpin GmbH
##OWNER= NMR
$$ XWIN-NMR		Version 3.5
$$ Thu Aug 18 14:29:27 2005 GMT Daylight Time (UT+1h)  MAYBRIDGE\NMR@NMR_250MHZ
##.OBSERVE FREQUENCY= 250.131544655141
##.OBSERVE NUCLEUS= ^1H
##.ACQUISITION MODE= SIMULTANEOUS (DQD)
##.ACQUISITION SCHEME= undefined
##.AVERAGES= 16
##.DIGITISER RES= 18
##SPECTROMETER/DATA SYSTEM= dpx250
##.PULSE SEQUENCE= zg30
##.SOLVENT NAME= DMSO
##.SHIFT REFERENCE= (INTERNAL, DMSO, 0, 16.522)
##AUDIT TRAIL= $$ (NUMBER, WHEN, WHO, WHERE, WHAT)
$$ ##TITLE= Audit trail, XWIN-NMR		Version 3.5
$$ ##JCAMPDX= 5.01
$$ ##ORIGIN= Bruker BioSpin GmbH
$$ ##OWNER= NMR
$$ C:\u/data/dgb/nmr/ADRS/8180/pdata/1/auditp.txt
$$ ##AUDIT TRAIL=  $$ (NUMBER, WHEN, WHO, WHERE, WHAT)
(   1,<2005-08-18 14:29:10.06 +100>,<MAYBRIDGE\NMR>,<NMR_250MHZ>,
      <created by zg, POWCHK disabled, PULCHK disabled
       configuration hash MD5:
       62 19 C7 07 E1 42 D1 B7 37 6C 3D D0 77 39 F9 E6
       data hash MD5: 64K
       C5 36 83 BD 4C C4 29 92 61 2F D9 DE 63 E8 EE C0>)
(   2,<2005-08-18 14:29:21.36 +100>,<MAYBRIDGE\NMR>,<NMR_250MHZ>,
      <Start of raw data processing
       ef LB = 0.3 FT_mod = 6 PKNL = 1 SI = 32K 
       data hash MD5: 32K
       A2 04 D1 0D 03 74 F0 3C B5 F6 CE DC 3E 60 DD 51>)
(   3,<2005-08-18 14:29:23.03 +100>,<MAYBRIDGE\NMR>,<NMR_250MHZ>,
      <apk 
       data hash MD5: 32K
       65 F0 34 26 F0 51 FE 87 3C 62 A9 DB B4 A6 15 23>)
(   4,<2005-08-18 14:29:23.69 +100>,<MAYBRIDGE\NMR>,<NMR_250MHZ>,
      <abs ABSG = 5 
       data hash MD5: 32K
       93 B7 F6 77 65 A4 A5 4B DF 30 A6 B5 00 C3 1A 2A>)
$$ ##END=
$$ 
$$ hash MD5
$$ C4 6D 94 22 83 21 B4 3A 7B 6F 8E C2 FD 09 B8 FC
##$RELAX= 
##$RELAX= 
##$RELAX= 
##$RELAX= 
##$RELAX= 
##$RELAX= 
##$RELAX= 
$$ Bruker specific parameters
$$ --------------------------
##$DU= <C:\u>
##$EXPNO= 8180
##$NAME= <ADRS>
##$PROCNO= 1
##$TYPE= <nmr>
##$USER= <dgb>
##$AMP= (0..31)
100 100 100 100 100 100 100 100 100 100 100 100 100 100 100 100 100 100 
100 100 100 100 100 100 100 100 100 100 100 100 100 100 
##$AQSEQ= 0
##$AQ_mod= 3
##$AUNM= <au_zg>
##$AUTOPOS= <27 >
##$BF1= 250.13
##$BF2= 250.13
##$BF3= 250.13
##$BF4= 250.13
##$BF5= 500.13
##$BF6= 500.13
##$BF7= 500.13
##$BF8= 500.13
##$BYTORDA= 1
##$CFDGTYP= 0
##$CFRGTYP= 5
##$CHEMSTR= <none>
##$CNST= (0..31)
1 1 145 1 1 1 1 1 1 1 1 1 1 1 1 1 1 1 1 1 1 1 1 1 1 1 1 1 1 1 1 1 
##$CPDPRG= <>
##$CPDPRG1= <>
##$CPDPRG2= <>
##$CPDPRG3= <>
##$CPDPRG4= <mlev>
##$CPDPRG5= <mlev>
##$CPDPRG6= <mlev>
##$CPDPRG7= <mlev>
##$CPDPRG8= <mlev>
##$CPDPRGB= <>
##$CPDPRGT= <>
##$D= (0..31)
0 1 0 0 0 0 0 0 0 0.06 0 0 0 0 0 0 0.0002 0 0 0 0 0 0 0 0 0 0 0 0 0 0 
0 
##$DATE= 1124371749
##$DBL= (0..7)
120 120 120 120 120 120 120 120 
##$DBP= (0..7)
150 150 150 150 150 150 150 150 
##$DBP07= 0
##$DBPNAM0= <>
##$DBPNAM1= <>
$$ [...]
##$SUBNAM7= <"">
##$SUBNAM8= <"">
##$SUBNAM9= <"">
##$SW= 20.6930455092707
##$SWIBOX= (0..15)
0 0 3 0 0 0 0 0 0 0 0 0 0 0 0 0 
##$SW_h= 5175.983436853
##$TD= 65536
##$TD0= 1
##$TE= 295.16
##$TE2= 300
##$TE3= 300
##$TEG= 300
##$TL= (0..7)
0 120 120 120 120 120 120 120 
##$TP= (0..7)
150 150 150 150 150 150 150 150 
##$TP07= 0
##$TPNAME0= <>
##$TPNAME1= <>
##$TPNAME2= <>
##$TPNAME3= <>
##$TPNAME4= <>
##$TPNAME5= <>
##$TPNAME6= <>
##$TPNAME7= <>
##$TPOAL= (0..7)
0.5 0.5 0.5 0.5 0.5 0.5 0.5 0.5 
##$TPOFFS= (0..7)
0 0 0 0 0 0 0 0 
##$TUNHIN= 0
##$TUNHOUT= 0
##$TUNXOUT= 0
##$USERA1= <user>
##$USERA2= <user>
##$USERA3= <user>
##$USERA4= <user>
##$USERA5= <user>
##$V9= 5
##$VALIST= <valist>
##$VCLIST= <CCCCCCCCCCCCCCC>
##$VD= 0
##$VDLIST= <DDDDDDDDDDDDDDD>
##$VPLIST= <PPPPPPPPPPPPPPP>
##$VTLIST= <TTTTTTTTTTTTTTT>
##$WBST= 1024
##$WBSW= 4
##$XGAIN= (0..3)
0 0 0 0 
##$XL= 0
##$YL= 0
##$YMAX_a= 271096
##$YMIN_a= -368452
##$ZGOPTNS= <>
##$ZL1= 120
##$ZL2= 120
##$ZL3= 120
##$ZL4= 120
##$ABSF1= 16.522
##$ABSF2= -4.171173
##$ABSG= 5
##$ABSL= 3
##$ALPHA= 0
##$AQORDER= 0
##$ASSFAC= 0
##$ASSFACI= 0
##$ASSFACX= 0
##$ASSWID= 0
##$AUNMP= <proc_1d>
##$AZFE= 0.1
##$AZFW= 0.1
##$BCFW= 0
##$BC_mod= 0
##$BYTORDP= 0
##$COROFFS= 0
##$CY= 12.5
##$DATMOD= 1
##$DC= 0
##$DFILT= <>
##$DTYPP= 0
##$F1P= 14.0000005364418
##$F2P= -0.99999901652339
##$FCOR= 0.5
##$FTSIZE= 32768
##$FT_mod= 6
##$GAMMA= 0
##$GB= 0
##$INTBC= 1
##$INTSCL= 1
##$ISEN= 128
##$LB= 0.3
##$LEV0= 0
##$LPBIN= 0
##$MAXI= 10000
##$MC2= 0
##$MEAN= 0
##$ME_mod= 0
##$MI= 0
##$NCOEF= 0
##$NC_proc= -3
##$NLEV= 6
##$NOISF1= 0
##$NOISF2= 0
##$NSP= 0
##$NTH_PI= 0
##$NZP= 0
##$OFFSET= 16.522
##$PC= 1
##$PHC0= -88.68865
##$PHC1= 11.67147
##$PH_mod= 1
##$PKNL= yes
##$PPARMOD= 0
##$PSCAL= 4
##$PSIGN= 0
##$REVERSE= no
##$SF= 250.13
##$SI= 32768
##$SIGF1= 0
##$SIGF2= 0
##$SINO= 400
##$SIOLD= 32768
##$SREGLST= <1H.DMSO>
##$SSB= 0
##$STSI= 32768
##$STSR= 0
##$SW_p= 5175.98343685301
##$SYMM= 0
##$S_DEV= 0
##$TDeff= 65536
##$TDoff= 0
##$TI= <Analysis number 999999
Compound Code 99
Book Reference 9
Project Code 9>
##$TILT= no
##$TM1= 0
##$TM2= 0
##$TOPLEV= 0
##$USERP1= <user>
##$USERP2= <user>
##$USERP3= <user>
##$USERP4= <user>
##$USERP5= <user>
##$WDW= 1
##$XDIM= 32768
##$YMAX_p= 293425589
##$YMIN_p= -212114
$$ End of Bruker specific parameters
$$ ---------------------------------
##NTUPLES= NMR SPECTRUM
##VAR_NAME=  FREQUENCY,     SPECTRUM/REAL,   SPECTRUM/IMAG
##SYMBOL=    X,             R,               I
##VAR_TYPE=  INDEPENDENT,   DEPENDENT,       DEPENDENT
##VAR_FORM=  AFFN,          ASDF,            ASDF
##VAR_DIM=   32768,         32768,           32768
##UNITS=     HZ,            ARBITRARY UNITS, ARBITRARY UNITS
##FACTOR=    0.157963299565203, 1,           1
##FIRST=     4132.6476996994, 0,             0
##LAST=      -1043.33573715361, 0,           0
##MIN=       -1043.33573715361, -212114,     0
##MAX=       4132.6476996994, 293425589,     0
$$ Real data points
##PAGE= N=1
##DATA TABLE= (X++(R..R)), XYDATA
$$ [...]
$$ plain form
18361 -46681 -72627 -50136 -43109 -38725 -6210 -83279 -98463 -80531 -37384 -17066 33249 46288
18349 46288 9150 1068 24307 51089 2427 11843 87605 116420 132204 97173 86073 89218
18337 89218 58951 17635 13967 27661 62029 60504 82158 105575 137711 96221 108198 133454
18325 133454 177755 225153 265198 254841 235751 196568 161018 187228 179610 205416 182250 163509
18313 163509 202910 215915 212275 217964 205185 123351 103585 88708 84341 40301 21712 80779
18301 80779 81423 90925 85395 42390 10792 -8062 33549 33743 3016 -114621 -104295 -21291 104433
18288 104433 137568 71751 -12142 -34574 -33688 5106 18660 33348 5119 -34164 -58270 -41677
18276 -41677 57331 87485 72941 30604 73037 74100 8195 -60982 -100872 -82638 -27197 -17944
$$ packed form
18361d6681k5946K2491P027M384L2515p7069j5184J7932M3147K0318N0315J3039
18349D6288l7138q082K3239K6782m8662R416P5762K8815J5784l5031j1100L145
18337H9218l0267m1316l668J3694L4368j525K1654K3417L2136m1490J1977K5256
18325A33454M4301M7398M0045j0357j9090l9183l5550K6210p618K5806k3166j8741
18313A63509L9401J3005l640N689j2779q1834j9766j4877m367m4040j8589N9067
18301H0779O44R502n530m3005l1598j8854M1611J94l0727j17637J0326Q3004J25724
18288A04433L3135o5817q3893k2432Q86L8794J3554J4688k8229l9283k4106J6593
18276d1677R9008L0154j4544m2337M2433J063o5905o9177l9890J8234N5441R253
$$ plain form
18264 -17944 -44200 -1827 9944 31253 84231 32694 -8145 -33147 -26379 -44324 -13488 -10005
18252 -10005 11638 21325 -1130 -18575 13870 10541 -17586 -24125 -47390 -46196 -70519 -44844
18240 -44844 -65543 -19348 -15219 -37209 -22127 -3778 51457 76602 73988 33106 23853 39210
18228 39210 25000 2714 38071 26148 -39217 19067 73190 92044 74739 53546 62128 86036
18216 86036 112486 102762 105300 26531 67336 110189 104489 94583 69616 28931 -22996 -3899
18204 -3899 15387 57124 36020 34702 68546 60321 -6224 -78131 -35592 32307 -6560 -25728
18192 -25728 -56162 -32615 -13309 1545 13455 -2237 -16922 -32391 -86687 -45864 -60967 -79570
18180 -79570 -65091 -33028 3372 -40852 -65992 -53499 -18545 13285 37735 75077 86500 99930
$$ packed form
18264a7944k6256M2373J1771K1309N2978n1537m0839k5002O768j7945L0836L483
18252a0005K1643R687k2455j7445L2445l329k8127o539k3265J194k4323K5675
18240d4844k0699M6195M129k1990J5082J8349N5235K5145k614m0882r253J5357
18228C9210j4210k2286L5357j1923o5365N8284N4123J8854j7305k1193Q582K3908
18216H6036K6450r724K538p8769M0805M2853n700r906k4967m0685n1927J9097
18204c899J9286M1737k1104j318L3844q225o6545p1907M2539O7899l8867j9168
18192b5728l0434K3547J9306J4854J1910j5692j4685j5469n4296M0823j5103j8603
18180g9570J4479L2063L6400m4224k5140J2493L4954L1830K4450L7342J1423J3430
$$ plain form
18168 99930 70817 109942 157556 127905 83498 28959 61628 74922 95364 138635 134473 141091
18156 141091 60401 3210 38105 31641 74150 87590 71368 24402 54509 44304 29754 3574
18144 3574 -40154 -31654 -22093 -1797 7979 45707 20220 -1446 -25757 -19108 26643 21913 78358
18131 78358 63497 21258 8428 30204 5686 -37765 -27768 14890 15108 40931 59359 81306
18119 81306 75530 85196 136898 175016 174660 78572 113727 178081 216838 155821 132380 118945
18107 118945 81979 -6918 -10999 48426 78406 61601 33321 37109 29163 -197 9064 1807
18095 1807 -40201 -8642 31017 53619 40799 99139 131563 96803 69247 35027 4497 76515
18083 76515 114464 69430 70819 128232 137258 108954 43604 38766 33312 22076 28056 109155 118433
$$ packed form
18168I9930k9113L9125M7614k9651m4407n4539L2669J3294K0442M3271m162O618
18156A41091q0690n7191L4895o464M2509J3440j6222m6966L0107j0205j4550k6180
18144C574m3728Q500R561K0296R776L7728k5487k1666k4311O649M5751m730N6445
18131G8358j4861m2239j2830K1776k4518m3451R997M2658K18K5823J8428K1947
18119H1306n776R666N1702L8118l56r6088L5155O4354L8757o1017k3441j3435
18107A18945l6966q8897m081N9425K9980j6805k8280L788p946k9360R261p257
18095A807m2008L1559L9659K2602j2820N8340L2424l4760k7556l4220l0530P2018
18083G6515L7949m5034J389N7413R026k8304o5350m838n454j1236N980Q1099R278
$$ plain form
18070 118433 108815 162594 197133 182167 139127 88829 51648 38752 79011 104649 88303 77717
18058 77717 65726 54057 60820 51578 59085 77952 94720 115162 193014 210583 199468 43124
18046 43124 -26497 -16721 -36224 -31668 -12105 33549 84364 81359 70181 31808 100286 124921
18034 124921 41168 18737 38805 69058 72329 86515 83517 24319 4360 8769 -20864 -44351
18022 -44351 -14616 44638 108658 133887 118286 76769 102121 153417 235650 190229 152513 115075
18010 115075 124049 137594 156541 162917 173342 193822 182609 171302 136739 125865 147105 148996
17998 148996 190078 206347 144988 47135 14496 48702 123384 73870 63665 69600 71936 100910
17986 100910 97653 108594 105403 124726 159494 118078 94169 119626 157337 146979 63210 12208
$$ packed form
18070A18433r618N3779L4539j4966m3040n0298l7181j2896M0259K5638j6346j0586
18058G7717j1991j1669O763r242P507J8867J6768K0442P7852J7569j1115j56344
18046D3124o9621R776j9503M556J9563M5654N0815l005j1178l8373O8478K4635
18034A24921q3753k2431K0068L0253L271J4186k998n9198j9959M409k9633k3487
18022d4351K9735N9254O4020K5229j5601m1517K5352N1296Q2233m5421l7716l7438
18010A15075Q974J3545J8947O376J0425K0480j1213j1307l4563j0874K1240J891
17998A48996M1082J6269o1359r7853l2639L4206P4682m9514j0205N935K336K8974
17986A00910l257J0941l191J9323L4768m1416k3909K5457L7711j0358q3769n1002
$$ plain form
17974 12208 57045 97367 82785 107359 142999 187936 131602 156263 250919 226882 170648 111364
17962 111364 63940 102125 115115 121470 102218 61354 73431 68474 16002 34452 86484 68943
17950 68943 79315 88190 133912 123105 127950 78119 6406 86733 145146 153145 120379 79046
17938 79046 78821 88668 47965 63791 27682 -9578 59314 38456 38940 89603 97132 61220 -13813
17925 -13813 -90523 -86372 -109886 -74196 4781 92765 65154 12854 36434 56325 56807 37574
17913 37574 56622 74992 67337 107632 72135 78325 176155 149275 149283 182373 124136 73875 41450
17900 41450 53578 152180 215033 216730 238870 271231 308803 256529 203392 241243 350024 373328
17888 373328 363267 376949 331589 315247 329906 381541 371359 314336 255242 245948 224988 158209
$$ packed form
17974A2208M4837M0322j4582K4574L5640M4937n6334K4661R4656k4037n6234n9284
17962A11364m7424L8185J2990O355j9252m0864J2077m957n2472J8450N2032j7541
17950F8943J0372Q875M5722j0807M845m9831p1713Q0327N8413P999l2766m1333
17938G9046k25R847m0703J5826l6109l7260O8892k0858M84N0663P529l5912p5033
17925a3813p6710M151k3514L5690P8977Q7984k7611n2300K3580J9891M82j9233
17913C7574J9048J8370p655M0295l5497O190R7830k6880QL3090n8237n0261l2425
17900D1450J2128R8602O2853J697K2140L2361L7572n2274n3137L7851J08781K3304
17888C73328j0061J3682m5360j6342J4659N1635j0182n7023n9094r294k0960o6779
$$ plain form
17876 158209 184256 192951 157650 159821 155657 103273 60242 59297 82293 95900 156208 130389
17864 130389 127988 144955 101316 55821 37716 25948 32984 63742 51979 86356 79907 63283
17852 63283 101018 118091 98581 105119 91734 88253 112537 108504 127040 93975 38217 11954
17840 11954 683 4807 32769 55908 80163 68745 71381 57223 43504 43844 86045 139975
17828 139975 133095 98894 70561 49196 28074 9792 34043 32714 42147 22319 13306 56702
17816 56702 43664 130199 104396 75650 66476 6754 -6722 67757 101164 65200 47812 -44528
17804 -44528 -74191 -9388 8778 48394 -7810 -54468 -31747 -31436 12210 46352 18427 18389 -7489
17791 -7489 17591 29154 34190 34085 35681 55972 87619 108780 103737 36625 -8369 -13253 55053
$$ packed form
17876A58209K6047Q695l5301K171m164n2384m3031r45K2996J3607O0308k5819
17864A30389k401J6967m3639m5495j8105j1768P036L0758j1763L4377o449j6624
17852F3283L7735J7073j9510O538j3385l481K4284m033J8536l3065n5758k6263
17840A1954j1271M124K7962K3139K4255j1418K636j4158j3719L40M2201N3930
17828A39975o880l4201k8333k1365k1122j8282K4251j329R433j9828r013M3396
17816E6702j3038Q6535k5803k8746r174n9722j3476P4479L3407l5964j7388r2340
17804d4528k9663O4803J8166L9616n6204m6658K2721L11M3646L4142k7925l8k5878
17791g489K5080J1563N036j05J596K0291L1647K1161n043o7112m4994m884O8306
$$ plain form
17778 55053 120783 76652 61134 37644 25789 -21673 -21638 -16289 -52990 348 -3928 -30610 -10085
17765 -10085 28145 9410 -12200 -18162 50868 74308 77399 48427 62961 108509 42196 -32455
17753 -32455 20966 80008 91441 85407 74061 45003 -7139 -21870 6393 7014 -573 -14810
17741 -14810 21292 40377 48943 11834 -3046 27922 25075 70739 144248 154487 128791 87254
17729 87254 57701 58872 67003 84375 103468 86340 107799 122746 93866 126098 70443 10507
17717 10507 22916 34392 -48973 -13078 21762 34211 23421 77523 125047 121266 96752 58286
17705 58286 40843 40326 25066 3684 11878 -2497 30184 67634 14297 17563 44565 33036
17693 33036 8812 35437 60450 92292 65918 58344 82183 126440 133253 148890 107125 71031
$$ packed form
17778E5053O5730m4131j5518k3490j1855m7462L5N349l6701N3338m276k6682K0525
17765a0085L8230j8735k1610n962O9030K3440L091k8972J4534M5548o6313p4651
17753c2455N3421N9042J1433o034j1346k9058n2142j4731K8263O21p587j4237
17741a4810L6102J9085Q566l7109j4880L0968k847M5664P3509J0239k5696m1537
17729H7254k9553J171Q131J7372J9093j7128K1459J4947k8880L2232n5655n9936
17717A0507J2409J1476q3365L5895L4840J2449j0790N4102M7524l781k4514l8466
17705E8286j7443n17j5260k1382Q194j4375L2681L7450n3337L266K7002j1529
17693C3036k4224K6625K5013L1842k6374p574K3839M4257O813J5637m1765l6094
$$ plain form
17681 71031 83381 96317 123587 90299 99985 145993 123194 38369 54833 82217 86799 88267
17669 88267 109125 110444 84165 87817 43196 87689 119747 79320 99868 130157 148833 162597
17657 162597 228558 279161 217734 203923 185352 203623 238234 228586 230891 213025 161125 154704
17645 154704 182041 190480 184988 218889 207519 192598 212587 219046 137352 115098 60351 -5267
17633 -5267 -9315 32519 24003 32810 76424 102672 76240 36561 50035 53820 79367 83357 21032
17620 21032 25198 54057 80013 73684 72104 99781 60343 47378 38981 24478 -3787 11891
17608 11891 7631 -28924 -18315 20488 11978 -12238 57112 38809 25903 33322 83590 103639
17596 103639 104223 107677 57265 81640 60533 18182 25943 -4120 30970 121832 110773 45280
$$ packed form
17681G1031J2350J2936K7270l3288R686M6008k2799q4825J6464K7384M582J468
17669H8267K0858J319k6279L652m4621M4493L2058m0427K0548L0289J8676J3764
17657A62597O5961N0603o1427j3811j8571J8271L4611r648K305j7866n1900o421
17645A54704K7337Q439n492L3901j1370j4921J9989O459q1694k2254n4747o5618
17633e267m048M1834q516Q807M3614K6248k6432l9679J3474L785K5547L990o2325
17620B1032M166K8859K5956o329j580K7677l9438j2965q397j4503k8265J5678
17608A1891m260l6555J0609L8803q510k4216O9350j8303j2906P419N0268K0049
17596A03639N84L454n0412K4375k1107m2351P761l0063L5090R0862j1059o5493
$$ plain form
17584 45280 55086 60211 56078 26202 5850 -39117 -49457 -5292 46778 27795 32478 14662
17572 14662 14738 -6549 -9046 -18277 -29932 35012 25244 -17817 -15699 -59158 -9084 53670 72954
17559 72954 63883 26001 -4043 17167 3586 16772 7197 65579 43767 15138 -11762 -39124
17547 -39124 -38240 11498 -20811 -43355 -63915 -71386 -50022 56191 94968 122714 117231 119541
17535 119541 116059 121544 113122 108200 100730 51791 21217 -34699 -13490 15731 38950 57851
17523 57851 73400 83815 84431 74007 82071 86899 110508 71465 90474 75289 89283 167566
17511 167566 132256 118753 112574 66612 51720 58556 52273 89143 78937 54233 32656 82351
17499 82351 110332 121656 160522 152577 160134 186660 158225 176558 142808 97576 96823 83688
$$ packed form
17584D5280R806N125m133k9876k0352m4967j0340M4165N2070j8983M683j7816
17572A4662P6k1287k497r231j1655O4944r768m3061K118m3459N0074O2754J9284
17559G2954r071l7882l0044K1210j3581J3186r575N8382k1812k8629k6900k7362
17547c9124Q84M9738l2309k2544k0560p471K1364J06213L8777K7746n483K310
17535A19541l482N485q422m922p470m8939l0574n5916K1209K9221K3219J8901
17523E7851J5549J0415O16j0424Q064M828K3609l9043J9009j5185J3994P8283
17511A67566l5310j3503o179m5962j4892O836o283L6870j0206k4704k1577M9695
17499H2351K7981J1324L8866p945P557K6526k8435J8333l3750m5232p53j3135
$$ plain form
17487 83688 119543 114019 58135 52864 82072 67833 70675 2685 31409 103270 93719 76767
17475 76767 83370 27454 7583 24779 14771 64104 69559 55724 76506 87459 120583 167810
17463 167810 190153 173334 147643 92145 37658 30685 17582 60757 87344 60917 104720 200167
17451 200167 249185 241611 205019 201637 201848 222758 220302 207481 201530 191240 189910 236332 169769
17438 169769 117972 162185 161045 179555 213830 222943 226623 281917 271949 260195 225022 162312
17426 162312 99619 138269 148772 171705 181910 208152 217570 204593 237316 294789 287413 303093
17414 303093 321928 346019 336950 347629 272928 263711 273859 256083 264117 310044 303843 287796
17402 287796 300710 290097 308319 270030 256815 292309 301369 308954 295197 300463 371003 372960
$$ packed form
17487H3688L5855n524n5884n271K9208j4239K842o7990K8724P1861r551j6952
17475G6767O603n5916j9871J7196j0008M9333N455j3835K0782J0953L3124M7227
17463A67810K2343j6819k5691n5498n4487o973j3103M3175K6587k6427M3803R5447
17451B00167M9018p574l6592l382K11K0910k456j2821n951j0290j330M6422o6563
17438A69769n1797M4213j140J8510L4275R113L680N5294r968j1754l5173o2710
17426A62312o2693L8650J0503K2933J0205K6242R418j2977L2723N7473p376J5680
17414C03093J8835K4091r069J0679p4701r217J0148j7776Q034M5927o201j6047
17402B87796J2914j0613J8222l8289j3215L5494R060P585j3757N266P0540J957
$$ plain form
17390 372960 311581 310043 379597 445751 449071 417104 390455 374695 441023 507371 521692 508473
17378 508473 512953 544842 541001 545220 554124 560929 629994 632230 626949 613677 658596 658353 745290
17365 745290 764514 771858 805625 862853 806793 807362 840912 908583 1032473 1093701 1179294 1254663
17353 1254663 1304247 1442204 1605160 1715515 1852980 2022343 2184051 2385646 2654038 2932875
17343 2932875 3366292 3864357 4466863 5269680 6381730 7886797 9896475 12570155 16004828
17334 16004828 20242974 25247730 30475778 35024530 38231596 39741604 40028243 40510783
17326 40510783 41972893 43876277 45129637 44991591 43908976 43208166 43367962 43671386 43063019
17317 43063019 41194868 39032917 37599718 36559614 34687924 30975731 25492951 19674217
$$ packed form
17390C72960o1379j538O9554O6154L320l1967k6649j5760O6328O6348J4321j3219
17378E08473M480L1889l841M219Q904O805O9065K236n281j3272M4919k43Q6937
17365G45290J9224P344L3767N7228n6060N69L3550O7671J23890O1228Q5593P5369
17353A254663M9584J37957J62956J10355J37465J69363J61708K01595K68392K78837
17343B932875M33417M98065O02506Q02817J112050J505067K009678K673680L434673
17334A6004828M238146N004756N228048M548752L207066J510008K86639M82540
17326D0510783J462110J903384J253360j38046j082615p00810J59796L03424o08367
17317D3063019j868151k161951j433199j040104j871690l712193n482780n818734
$$ plain form
17309 19674217 15113508 12221928 10479445 9292845 8454207 7785402 7298579 6938606 6676034
17300 6676034 6412926 6170278 5923997 5696092 5444110 5168390 5011451 4791442 4568559
17291 4568559 4349526 4120320 3884565 3656271 3461701 3255969 2997509 2776444 2644461
17282 2644461 2499960 2386995 2254883 2081490 1936820 1829904 1734177 1615766 1513454 1430626
17272 1430626 1342160 1290261 1251544 1186665 1042098 967702 934193 912981 872643 865953 820484
17261 820484 697782 629907 614504 593221 550185 536834 579534 601547 557712 501746 496741
17250 496741 487417 457590 397033 358599 373688 403933 395679 341859 334840 278230 242195 281604
17238 281604 240134 192079 224501 265804 257166 223259 211881 221862 172646 201079 246581 250917
$$ packed form
17309A9674217m560709k891580j742483j186600q38638o68805m86823l59973k62572
17300F676034k63108k42648k46281k27905k51982k75720j56939k20009k22883
17291D568559k19033k29206k35755k28294j94570k05732k58460k21065j31983
17282B644461j44501j12965j32112j73393j44670j06916r5727j18411j02312q2828
17272A430626q8466n1899l8717o4879j44567p4396l3509k1212m0338o690m5469
17261H20484j22702o7875j5403k1283m3036j3351M2700K2013m3835n5966n005
17250D96741r324k9827o0557l8434J5089L0245q254n3820p019n6610l6035L9409
17238B81604m1470m8055L2422M1303q638l3907j1378R981m9216K8433M5502M336
$$ plain form
17226 250917 228939 227311 186885 165339 196139 244690 275819 248746 255029 207237 185421 201729
17214 201729 191170 150214 119517 169373 217354 201086 153394 128941 166890 189278 215985
17203 215985 216294 181025 211691 232034 263482 241699 233568 225134 188211 197722 251962 312996
17191 312996 396724 417294 394990 277588 253715 285843 313700 284010 330505 329781 326125 344142
17179 344142 383519 344897 260527 253233 330269 333051 312211 305329 340545 416550 430624 405028
17167 405028 388812 405339 390154 350270 343995 366664 316270 345845 415848 413860 410053 374223
17155 374223 382339 398120 417554 441529 488262 451787 514506 636756 598688 520912 514174 580030
17143 580030 606193 606163 602643 647088 720385 692845 719368 748957 751714 742584 755416 846609 878689
$$ packed form
17226B50917k1978j628m0426k1546L0800M8551L1129k7073O283m7792k1816J6308
17214B01729j0559m0956l0697M9856M7981j6268m7692k4453L7949K2388K6707
17203B15985L09l5269L0666K0343L1448k1783q131q434l6923R511N4240O1034
17191C12996Q3728K0570k2304j17402k3873L2128K7857k9690M6495p24l656J8017
17179C44142L9377l8622q4370p294P7036K782k0840o882L5216P6005J4074k5596
17167D05028j6216J6527j5185l9884o275K2669n0394K9575P0003j988l807l5830
17155C74223Q116J5781J9434K3975M6733l6475O2719J22250l8068p7776o738O5856
17143E80030K6163l0l520M4445P3297k7540K6523K9589K757r130J2832R1193L2080
$$ plain form
17130 878689 915170 891400 910690 936746 1031572 1050698 1064775 1143217 1216585 1263411 1328119
17119 1328119 1403237 1563056 1704707 1880210 2063620 2242365 2424168 2562681 2841691 3285953
17109 3285953 3796523 4403352 5229356 6416477 8008162 10174850 12971426 16624278 21189807
17100 21189807 26522956 31948441 36692870 39823719 40747098 40086526 39125295 38878171 39124468
17091 39124468 38689790 36712848 33841762 31476473 31270533 33502577 36967189 40360473
17083 40360473 42529218 42647525 41196904 39332359 37962181 36937934 34918668 31013502
17075 31013502 25627601 19870594 15265342 12243821 10364052 9129457 8322629 7753619
17067 7753619 7267910 6826645 6447530 6169073 5952927 5706297 5450829 5244288 5078653
$$ packed form
17130H78689L6481k3770J9290K6056R4826J9126J4077P8442P3368M6826O4708
17119A328119P5118J59819J41651J75503J83410J78745J81803J38513K79010M44262
17109C285953N10570O06829Q26004J187121J591685K166688K796576L652852M565529
17100B1189807N333149N425485M744429L130849R23379o60572r61231k47124K46297
17091C9124468m34678j976942k871086k365289k05940K232044L464612L393284
17083D0360473K168745J18307j450621j864545j370178j024247k019266l905166
17075C1013502n385901n757007m605252l021521j879769j234595q06828n69010
17067G753619m85709m41265l79115k78457k16146k46630k55468k06541j65635
$$ plain form
17058 5078653 4900948 4698885 4540060 4344185 4173791 4020352 3821235 3578648 3369936
17049 3369936 3177729 2919722 2744525 2553732 2350018 2202471 2030510 1923563 1852530 1791475
17039 1791475 1682303 1530566 1383939 1332153 1255018 1189115 1132612 1036834 965331 922914 881316
17028 881316 866123 870167 787380 732879 699554 629839 586145 569792 572121 576315 558639 515055
17016 515055 450948 453823 434879 467185 450217 461385 485613 436234 373796 335396 279648 290701
17004 290701 308161 292783 255478 177594 163185 124487 89745 69090 60286 142670 135183 130569
16992 130569 104588 46768 84440 115135 172360 134608 140883 160368 175883 116899 41475 53825
16980 53825 113666 119411 121753 135370 129326 72353 44208 77432 84168 89055 132869 181969 132091
$$ packed form
17058E078653j77705k02063j58825j95875j70394j53439j99117k42587k08712
17049C369936j92207k58007j75197j90793k03714j47547j71961j06947p1033o1055
17039A791475j09172j51737j46627n1786p7135o5903n6503r5778p1503m2417m1598
17028H81316j5193M044q2787n4501l3325o9715m3694j6353K329M194j7676m3584
17016E15055o4107K875j8944L2306j6968J1168K4228m9379o2438l8400n5748J1053
17004B90701J7460j5378l7305p7884j4409l8698l4742k0655q804Q2384p487m614
16992A30569k5981n7820L7672L0695N7225l7752O275J9485J5515n8984p5424J2350
16980E3825N9841N745K342J3617o044n6973k8145L3224O736M887M3814M9100m9878
$$ plain form
16967 132091 74497 95589 55603 -20194 -52846 -37333 -206 18281 62286 71584 84874 109542
16955 109542 108592 99273 80660 33452 41506 73108 70058 80151 27008 26758 5414 7392 59539
16942 59539 64938 15312 -7296 -33732 17175 62551 56373 60360 36483 74333 89300 80172
16930 80172 67505 32421 77333 29741 -29230 -8926 16821 23094 26231 32195 6960 32994
16918 32994 37514 38145 64794 71639 57433 91437 99311 160468 97695 23109 -797 38958 113351
16905 113351 105771 112827 82589 53606 67287 92530 138677 76340 38905 100501 116144 123601
16893 123601 54702 16405 -3027 -64008 -14027 20649 32383 53588 73361 57722 61170 88656
16881 88656 46425 -5114 -18450 -9649 -22375 21158 34745 28178 791 18939 576 131
$$ packed form
16967A32091n7594K1092l9986p5797l2652J5513L7127J8487M4005R298J3290K4668
16955A09542r50r319j8613m7208Q054L1602l050J0093n3143k50k1344J978N2147
16942E9539N399m9626k2608k6436N0907M5376o178L987k3877L7850J4967r128
16930H0172j2667l5084M4912m7592n8971K0304K5747O273L137N964k5235K6034
16918C2994M520O31K6649O845j4206L4004P874O1157o2773p4586k3906L9755P4393
16905A13351p580P056l0238k8983J3681K5243M6147o2337l7435O1596J5643P457
16893A23601o8899l8297j9432o0981M9981L4676J1734K1205J9773j5639L448K7486
16881H8656m2231n1539j3336Q801j2726M3533J3587o567k7387J8148j8363m45
$$ plain form
16869 131 31953 41931 -29825 -65106 -45017 20027 65145 54602 36854 19003 -34986 -27542
16857 -27542 -18303 -35182 49388 32942 -39608 -88061 -85404 19039 59826 -17834 -76577 -47707
16845 -47707 -34194 -10718 -17067 -13297 14923 -34838 -13334 14829 40979 31741 39421 50098
16833 50098 -1270 -50497 -50922 -915 33734 52173 75807 68509 35924 58137 -11878 18463
16821 18463 62730 72313 37724 9376 15885 50916 74051 46305 41568 67016 40944 48473
16809 48473 71192 32993 -30582 -65767 -106124 -92757 -39132 51785 67570 57361 20134 -38193
16797 -38193 -62912 -28997 11597 54447 20271 1556 3764 18418 71582 36079 8927 73533
16785 73533 116624 119824 77310 29432 41853 78498 85187 114744 151033 163092 133196 147106
$$ packed form
16869A31L1822R978p1756l5281K0089O5044M5118j0543j7748j7851n3989P444
16857b7542R239j6879Q4570j6446p2550m8453K657J04443M0787p7660n8743K8870
16845d7707J3513K3476o349L770K8220m9761K1504K8163K6150r238P680J0677
16833E0098n1368m9227m25N0007L4649J8439K3634p298l2585K2213p0015L0341
16821A8463M4267R583l4589k8348O509L5031K3135k7746m737K5448k6072P529
16809D8473K2719l8199o3575l5185m0357J3367N3625R0917J5785j0209l7227n8327
16797c8193k4719L3915M0594M2850l4176j8715K208J4654N3164l5503k7152O4606
16785G3533M3091L200m2514m7878J2421L6645O689K9557L6289J2059k9896J3910
$$ plain form
16773 147106 66970 45226 77806 72499 119209 138316 135277 80418 102817 171956 203682 198230
16761 198230 216554 262996 284044 272261 306955 326767 286605 254593 232011 210404 199040
16750 199040 204287 240572 236998 237198 223366 191696 138874 149066 212528 176382 140330 146927
16738 146927 138168 115704 119282 148705 169452 148628 111061 125685 107162 63278 72068 98485
16726 98485 95926 69719 19556 18683 38575 43532 62335 34123 74131 84005 21451 33313 -36828
16713 -36828 -68309 -4890 27718 21668 59534 92227 84316 24411 -1764 -13234 -39254 -174
16701 -174 50557 66088 36511 35726 14696 -338 -11468 -1007 -24360 -48905 -49625 -58154 -42635
16688 -42635 44518 32856 1502 14275 45439 74899 108443 117371 89434 59992 34904 38134
$$ packed form
16773A47106q0136k1744L2580n307M6710J9107l039n4859K2399O9139L1726n452
16761A98230J8324M6442K1048j1783L4694J9812m0162l2012k2582k1607j1364
16750A99040N247L6285l574K00j3832l1670n2822J0192O3462l6146l6052O597
16738A46927q759k2464L578K9423K0747k0824l7567J4624j8523m3884Q790K6417
16726I8485k559k6207n0163q73J9892M957J8803k8212M0008R874o2554J1862p0141
16713c6828l1481O3419L2608o050L7866L2693p911n9905k6175j1470k6020L9080
16701a74N0731J5531k9577p85k1030j5034j1130J0461k3353k4545p20q529J5519
16688d2635Q7153j1662l1354J2773L1164K9460L3544Q928k7937k9442k5088L230
$$ plain form
16676 38134 44590 65215 46935 50745 34909 27399 75499 99248 87766 82453 25635 -22323
16664 -22323 -9210 24084 74174 46029 -49686 -61056 -31981 10232 11592 -52014 -96619 -41002
16652 -41002 -24707 -37798 -75350 -51879 -6074 -984 8473 45903 24307 15917 62584 88542
16640 88542 47844 97126 106251 88566 98015 101553 49599 28082 16081 22937 17194 65647 98268
16627 98268 75276 55595 45639 76380 91788 68521 25676 -10172 50781 81354 84357 71302
16615 71302 80724 41880 -56510 -39197 30072 29791 21754 -11604 -36168 -37988 -40279 18607 44002
16602 44002 58545 25675 24993 -1711 -9640 17171 91277 75120 9780 -26133 -4002 26392
16590 26392 -2977 -45260 -60227 3865 19359 14999 -18348 -18399 -24459 40164 42509 29317 -16862
$$ packed form
16676C8134O456K0625j8280L810j5836p510M8100K3749j1482n313n6818m7958
16664b2323J3113L3294N0090k8145r5715j1370K9075M2213J360o3606m4605N5617
16652d1002J6295j3091l7552K3471M5805N090R457L7430k1596q390M6667K5958
16640H8542m0698M9282R125j7685R449L538n1954k1517j2001O856n743M8453L2621
16627I8268k2992j9681r956L0741J5408k3267m2845l5848O0953L0573L003j3055
16615G1302R422l8844r8390J7313O9269k81q037l3358k4564j820k291N8886K5395
16602D4002J4543l2870o82k6704p929K6811P4106j6157o5340l5913K2131L0394
16590B6392k9369m2283j4967O4092J5494m360l3347n1o060O4623K345j3192m6179
$$ plain form
16577 -16862 -31061 -38375 -51899 -59744 -74819 -15667 -27249 -1806 -23039 12094 40757 101478
16565 101478 135863 56596 -6804 -32492 -60950 -75246 -22185 -4973 -12888 -40099 -84049 -65558
16553 -65558 -8600 -61 -10136 39147 94400 78924 52060 18330 -7295 25252 22571 -21241
16541 -21241 -3063 70988 88300 80882 144710 111059 107109 112519 90832 152421 169192 185381
16529 185381 214407 258508 236408 219483 209766 160554 119277 202901 242592 211487 155187 177993
16517 177993 226812 280937 289685 218060 174150 160695 168938 224560 287585 266322 215556 186718
16505 186718 185164 141594 133328 171187 112578 78621 81217 101098 129082 130310 83637 76846
16493 76846 91172 85665 87940 112957 53334 4312 -845 -9825 -24727 -37821 38686 83428
$$ packed form
16577a6862j4199p314j3524p845j5075N9152j1582K5443k1233L5133K8663O0721
16565A01478L4385p9267o3400k5688k8458j4296N3061J7212p915k7211m3950J8491
16553f5558N6958Q539j0075M9283N5253j5476k6864l3730k5625L2547k681m3812
16541b1241J8178P4051J7312p418O3828l3651l950N410k1687O1589J6771J6189
16529A85381K9026M4101k2100j6925r717m9212m1277Q3624L9691l1105n6300K2806
16517A77993M8819N4125Q748p1625m3910j3455Q243N5622O3025k1263n0766k8838
16505A86718j554m3570q266L7859n8609l3957K596J9881K7984J228m6673o791
16493G6846J4326n507K275K5017n9623m9022n157q980j4902j3094P6507M4742
$$ plain form
16481 83428 29501 41414 -4522 -61018 -96587 -83433 -2667 45225 23654 71738 70808 58594
16469 58594 -10712 -606 6090 88080 66704 75224 39846 -38916 -76517 -67488 -52034 -16122
16457 -16122 -3962 21693 16868 13226 8654 8898 -54438 -54969 -55733 -66815 -33595 -31629 -13999 -28550
16443 -28550 -28241 -23465 20143 26192 27645 3932 -21057 -32335 -56727 -55533 13038 75154 91091
16430 91091 114241 79031 68683 122879 111509 69439 44488 -1758 -52319 -50459 -53375 -72224
16418 -72224 -29843 17763 6554 20109 -15763 -39438 -52923 -115117 -177792 -133256 -77378 -95574
16406 -95574 -125996 -85956 -46719 -31390 -23856 -60526 -55416 -85723 -100430 -68515 -748 4445
16394 4445 6850 -1229 -46192 -94154 -66621 -81313 -88526 -19568 -43555 -87165 -93534 -66456 -59136
$$ packed form
16481H3428n3927J1913m5936n6496l5569J3154Q0766M7892k1571M8084r30j2214
16469E8594o9306J0106O696Q1990k1376Q520l5378p8762l7601R029J5454L5912
16457a6122J2160K5655m825l642m572K44o3336n31p64j1082L3220J966J7630j4551
16443b8550L09M776M3608O049J453k3713k4989j1278k4392J194O8571O2116J5937
16430I1091K3150l5210j0348N4196j1370m2070k4951m6246n0561J860k916j8849
16418g2224M2381M7606j1209J3555l5872k3675j3485o2194o2675M4536N5878j8196
16406i5574l0422M0040L9237J5329P534l6670N110l0307j4707L1915O7767N193
16394D445K405q079m4963m7962K7533j4692p213O8958k3987m3610o369K7078P320
$$ plain form
16381 -59136 -51053 -29957 -29563 -48138 -75005 -88244 -75845 -72572 -61283 -23760 24842 29978 71563
16368 71563 51247 7529 -19218 -7969 -31433 -64620 -29194 -6672 -23901 -97013 -24284 36105
16356 36105 25708 -13057 -12567 -25719 -16969 -39829 -51763 -64825 -22701 145 27875 48150
16344 48150 55989 53248 20576 -22766 -43325 1709 2927 -747 4925 15126 -2996 -11436 -18196
16331 -18196 -56669 -65716 -28781 15653 44125 51517 53785 83916 73246 49831 -26548 -76445
16319 -76445 -34768 -23880 -7433 -50957 -59559 -45432 -64890 -113975 -119391 -33505 10382 9695
16307 9695 -34072 -78286 -47928 9524 64734 68903 -14423 -32983 7519 61153 65030 29292
16295 29292 40329 57432 64395 -21785 -58982 -87600 -97030 -61186 -22840 -5976 -18419 -18319
$$ packed form
16381e9136Q083K1096L94j8575k6867j3239J2399L273J1289L7523M8602N136M1585
16368G1563k0316m3718k6747J1249k3464l3187L5426K2522j7229p3112P2729O0389
16356C6105j0397l8765M90j3152Q750k2860j1934j3062M2124K2846K7730K0275
16344D8150P839k741l2672m3342k0559M5034J218l674N672J0201j8122q440o760
16331a8196l8473r047L6935M4434K8472P392K268L0131j0670k3415p6379m9897
16319g6445M1677J0888J6447m3524q602J4127j9458m9085n416Q5886M3887o87
16307I695m3767m4214L0358N7452N5210M169q3326j8560M0502N3634L877l5738
16295B9292J1037J7103O963q6180l7197k8618r430L5844L8346J6864j2443J00
$$ plain form
16283 -18319 -5962 -5859 -47336 -8982 9016 17379 22853 52620 12153 -26474 4180 21902
16271 21902 18227 -7562 -41328 52572 48138 -8726 -25927 40166 33783 -1228 7752 843 -33998
16258 -33998 -6422 42210 37645 44005 20500 -59075 -67446 25258 63724 32473 11925 28009
16246 28009 5072 16845 -50747 -141649 -125639 -57973 -99263 -131358 -114433 -66218 -30792 25559
16234 25559 40783 27853 -7858 9529 8007 -4887 4758 -29993 -40502 -15571 -37912 -22201
16222 -22201 -37556 -18648 21530 8424 -6486 -31833 -26295 -1543 22590 -14338 -41188 -20687
16210 -20687 -12690 -79180 -77512 17996 29553 -17800 -13861 -10080 6731 -21457 -4694 -36729
16198 -36729 -45300 9285 52556 -20708 -73872 -39038 -19397 -25579 -50462 -59590 -18675 36113
$$ packed form
16283a8319J2357J03m1477L8354J7998Q363N474K9767m0467l8627L0654J7722
16271B1902l675k5789l3766R3900m434n6864j7201O6093o383l5011Q980o909l4841
16258c3998K7576M8632m565O360k3505p9575q371R2704L8466l1251k0548J6084
16246B8009k2937J1773o7592r0902J6010O7666m1290l2095J6925M8215L5426N6351
16234B5559J5224j2930l5711J7387j522j2894R645l4751j0509K4931k2341J5711
16222b2201j5355J8908M0178j3106j4910k5347N538K4752K4133l6928k6850K0501
16210b0687P997o6490J668R5508J1557m7353L939L781J6811k8188J6763l2035
16198c6729q571N4585M3271p3264n3164L4834J9641o182k4883r128M0915N4788
$$ plain form
16186 36113 38589 59885 100533 75034 34448 999 -3544 -61829 -69849 -76038 -26174 4126
16174 4126 -32926 21329 3753 -19950 25162 9718 1785 -18138 -18103 -44879 -31912 -4426 -6797
16161 -6797 -14787 -69947 -68420 -51708 -10355 -79 1456 5245 -58789 -22612 -20647 -35703 -4728
16148 -4728 -4062 -12944 -2586 32860 55311 34595 24583 43954 91097 55895 -20540 -9718
16136 -9718 9328 22418 45290 109318 60194 -11651 -28928 11651 97741 79276 -57537 -83572
16124 -83572 -59966 -15449 24467 -28396 -71069 -46139 -27970 -8217 5793 -14266 -71997 -78376
16112 -78376 -26976 -13455 -4668 38033 39321 -1215 -51855 -72261 -63038 -26346 -63009 7097
16100 7097 22514 -18015 -34025 -12754 -639 -40885 -88447 -100290 -117369 -106192 -49095 -13406
$$ packed form
16186C6113K476K1296M0648k5499m0586l3449m543n8285q020o189M9864L0300
16174D126l7052N4255j7576k3703M5112j5444p933j9923L5k6776J2967K7486k371
16161f797p990n5160J527J6712M1353J0276J535L789o4034L6177J965j5056L0975
16148d728O66q882J0358L5446K2451k0716j0012J9371M7143l5202p6435J0822
16136i718J9046J3090K2872O4028m9124p1845j7277M0579Q6090j8465j36813k6035
16124h3572K3606M4517L9916n2863m2673K4930J8169J9753J4010k0059n7731o379
16112g8376N1400J3521Q787M2701J288m0536n0640k0406R223L6692l6663P0106
16100G097J5417m0529j6010K1271J2115m0246m7562j1843j7079J1177N7097L5689
$$ plain form
16088 -13406 -44533 -116624 -134139 -71909 12456 11214 -35602 -110886 -80885 4722 -19794 1039
16076 1039 4528 -9187 -37333 -83571 -60964 3570 -24168 -55208 -48556 1468 11865 21906
16064 21906 -23620 -29599 2367 -10939 -76655 -89975 -59939 -49163 -20652 -6670 -14279 -11858
16052 -11858 19905 49896 27157 53808 77731 54422 52541 51630 30299 46080 53821 33406
16040 33406 69174 84205 40894 34931 -106 -7347 -37009 -53050 -69183 -114850 -120826 -112034
16028 -112034 -125585 -109311 -25648 16626 -21946 -80004 -81737 -93054 -58000 -54818 -50730 10179
16016 10179 22392 64176 34010 -34909 -107516 -132570 -42021 -14744 -30927 -62666 -67436 -24423
16004 -24423 -26034 -29220 21628 24951 -24583 -108117 -133630 -64003 -43344 -67773 -65396 -68531 -33851
$$ packed form
16088a3406l1127p2091j7515O2230Q4365j242m6816p5284L0001Q5607k4516K0833
16076A039L489j3715k8146m6238K2607O4534k7738l1040O652N0024J0397J0041
16064B1906m5526n979L1966j3306o5716j3320L0036J0776K8511J3982p609K421
16052a1858L1763K9991k2739K6651K3923k3309j881r11k1331J5781P741k0415
16040C3406L5768J5031m3311n963l5037p241k9662j6041j6133m5667n976Q792
16028a12034j3551J6274Q3663M2274l8572n8058j733j1317L5054L182M088O0909
16016A0179J2213M1784l0166o8919p2607k5054R0549K7277j6183l1739m770M3013
16004b4423j611l186N0848L323m9534q3534k5513O9627K0659k4429K377l135L4680
$$ plain form
15991 -33851 -4929 -12139 6143 49808 102620 64659 19012 -4420 53560 28982 26442 60126
15979 60126 47597 30393 -47583 -40512 -27124 -59323 -119997 -94402 -104049 -130488 -103088 -117465
15967 -117465 -119135 -45052 -29035 -10750 631 2383 -89050 -150733 -98891 -26889 -41481 -36434
15955 -36434 -1908 -40257 -38493 -38208 -71165 -52862 -21009 -34507 -45606 -61866 -57678 -68156
15943 -68156 -27611 -11190 -23757 -14581 -7587 -9934 4504 3343 -17278 -34809 -39935 -54902 -97812
15930 -97812 -89640 -6195 27040 16356 21896 41726 9122 -46335 -77329 -78830 -27021 -27344 -38140
15917 -38140 -40937 -77660 -93768 -25478 -26078 -63132 -36292 -35954 -58390 -25601 -16072 -15982 20753
15904 20753 18542 17040 65259 75002 22619 -4577 15054 -33083 -76497 -102004 -91828 -57372
$$ packed form
15991c3851K8922p210J8282M3665N2812l7961m5647k3432N7980k4578k540L3684
15979F0126j2529j7204p7976P071J3388l2199o0674K5595r647k6439K7400j4377
15967a17465j670P4083J6017J8285J1381J752r1433o1683N1842P2002j4592N047
15955c6434L4526l8349J764K85l2957J8303L1853j3498j1099j6260M188j0478
15943f8156M0545J6421j2567R176O994k347J4438j161k0621j7531n126j4967m2910
15930i7812Q172Q3445L3235j0684N540J9830l2604n5457l0994j501N1809l23j0796
15917c8140k797l6723j6108O8290o00l7054K6840L38k2436L2789R529R0L6735
15904B0753k211j502M8219R743n2383k7196J9631m8137m3414k5507J0176L4456
$$ plain form
15892 -57372 -20168 -42013 -68911 -29378 -20172 -28479 57715 102076 75254 87988 60457 18183
15880 18183 -18532 -52272 -55136 -95924 -61434 -6308 -28359 -28997 -42441 -39310 -14135 -57982
15868 -57982 -60570 -18551 2997 4181 24428 -11322 -18634 35824 50032 -21056 4681 25692
15856 25692 24274 -51836 -49562 19252 58144 84712 -2016 -22341 -6270 -27883 -4246 37070
15844 37070 41141 -3021 -344 40786 18239 -3260 -31281 -54409 -94738 -81113 -70688 -20686
15832 -20686 9487 21568 -6194 -60523 -87000 -75023 -61602 -56846 -82259 -81604 -121133 -123899
15820 -123899 -84406 -39658 -85182 -39526 10089 -16598 -96558 -92486 -58010 18650 46890 60686
15808 60686 41772 -30480 -27354 -45410 -57046 -55593 -28944 -6549 27614 35796 -333 -39075
$$ packed form
15892e7372L7204k1845k6898L9533R206q307Q6194M4361k6822J2734k7531m2274
15880A8183l6715l3740k864m0788L4490N5126k2051o38j3444L131K5175m3847
15868e7982k588M2019K1548J184K0247l5750p312N4458J4208p1088K5737K1011
15856B5692j418p6110K274O8814L8892K6568q6728k0325J6071k1613K3637M1316
15844C7070M071m4162K677M1130k2547k1499k8021k3128m0329J3625J0425N0002
15832b0686L0173J2081k7762n4329k6477J1977J3421M756k5413O55l9529k766
15820a23899L9493M4748m5524M5656M9615k6687p9960M072L4476P6660K8240J3796
15808F0686j8914p2252L126j8056j1636J453K6649K2395L4163Q182l6129l8742
$$ plain form
15796 -39075 -72541 -113838 -137874 -144709 -91082 -44715 -49363 -81125 -101452 -60526 -69765 -103593
15784 -103593 -69777 6627 -16248 -56567 -39945 57987 78906 71389 92442 62389 45983 8376
15772 8376 51240 81006 15015 -34553 -43614 -71065 -61450 -33106 -46146 -71911 -53289 31049
15760 31049 -11313 -46389 -66094 -79261 -39495 -53966 -67949 -32084 -6955 26486 57663 47854
15748 47854 31851 47045 103989 103671 21363 24055 53963 55065 104460 83922 55402 19828
15736 19828 12384 -30589 -28666 -21648 -4253 42445 85675 115751 104272 52658 16567 -4865
15724 -4865 24486 83793 36802 21523 -48058 -59132 20942 8880 -22691 -94511 -81384 -30869
15712 -30869 3496 47708 27697 32460 53436 46021 51135 -10807 -39811 -30191 40178 19629
$$ packed form
15796c9075l3466m1297k4036o835N3627M6367m648l1762k0327M0926r239l3828
15784a03593L3816P6404k2875m0319J6622R7932K0919p517K1053l0053j6406l7607
15772H376M2864K9766o5991m9568r061k7451R615K8344j3040k5765J8622Q4338
15760C1049m2362l5076j9705j3167L9766j4471j3983L5865K5129L3441L1177r809
15748D7854j6003J5194N6944l18q2308K692K9908J102M9395k0538k8520l5574
15736A9828p444m2973J923P018J7395M6698M3230L0076j1479n1614l6091k1432
15724d865K9351N9307m6991j5279o9581j1074Q0074j2062l1571p1820J3127N0515
15712c0869L4365M4212k0011M763K0976p415N114o1942k9004R620P0369k0549
$$ plain form
15700 19629 9835 -21762 -46638 -27878 -32656 -41830 -18943 49612 10367 -31975 -5511 16541
15688 16541 7055 19203 86451 80396 15158 -17652 -6380 -24721 -35186 -46617 -30031 -75275
15676 -75275 -93941 -60962 -67525 -57547 -61785 -43249 21623 35626 25893 -12171 -22789 -55433
15664 -55433 -32155 -24673 -19426 472 -50121 -61665 -24557 -17696 -73480 -98971 11917 5710
15652 5710 29419 23619 2675 -11224 -15262 25463 28799 -852 -6043 -20842 -3340 83113 100119
15639 100119 93317 73581 46406 31761 85377 95093 73615 43349 -17610 -60796 -46365 24177
15627 24177 73738 27669 -28087 2077 4466 -45349 -6251 16510 33245 -20230 -69429 -55261
15615 -55261 -34219 -17396 3041 7576 -177 32498 -18450 4050 22192 -22391 -122981 -158642
$$ packed form
15700A9629r794l1597k4876J8760m778r174K2887O8555l9245m2342K6464K2052
15688A6541r486J2148O7248o055o5238l2810J1272j8341j0465j1431J6586m5244
15676g5275j8666L2979o563R978m238J8536O4872J4003r733l8064j0618l2644
15664e5433K3278P482N247J9898n0593j1544L7108O861n5784k5491J10888o207
15652E710K3709n800k0944j3899m038M0725L336k9651n191j4799J7502Q6453J7006
15639A00119o802j9736k7175j4645N3616R716k1478l0266o0959m3186J4431P0542
15627B4177M9561m6069n5756L0164K389m9815L9098K2761J6735n3475m9199J4168
15615e5261K1042J6823K0437M535p753L2675n0948K2500J8142m4583j00590l5661
$$ plain form
15603 -158642 -142962 -62889 -54494 -25799 -18203 -11439 3658 29479 8144 -25635 -55719 -39257
15591 -39257 -8507 -40424 -83598 -100528 -115209 -103054 -86581 -72899 -75883 -85943 -97717 -74339
15579 -74339 -34804 -53707 -44343 -46718 -44420 -69224 -52097 -24057 -2716 -30529 8704 1354
15567 1354 -3266 -52666 -67418 -49662 -33001 5477 2057 49450 102603 114039 95322 66614
15555 66614 25469 8396 17593 3614 11674 9301 55534 40843 -64051 -85509 -45901 -5948
15543 -5948 -34695 -41494 -31581 16924 26956 81742 60587 39633 25909 3722 -1209 -25354
15531 -25354 -3577 12166 29298 38546 51605 89381 54889 49474 36655 9041 5249 -6919
15519 -6919 -36317 -60892 -110232 -62544 -68949 -19428 -14880 -31523 -19547 -59098 -42501 -10070
$$ packed form
15603a58642J5680Q0073Q395K8695P596O764J5097K5821k1335l3779l0084J6462
15591c9257L0750l1917m3174j6930j4681J2155J6473J3682k984j0060j1774K3378
15579g4339L9535j8903R364k375K298k4804J7127K8040K1341k7813L9233p350
15567A354m620m9400j4752J7756J6661L8478l420M7393N3153J1436j8717k8708
15555F6614m1145j7073R197j3979Q060k373M6233j4691j04894k1458L9608L9953
15543e948k8747o799R913M8505J0032N4786k1155k0954j3724k2187m931k4145
15531b5354K1777J5743J7132R248J3059L7776l4492n415j2819k7614l792j2168
15519f919k9398k4575m9340M7688o405M9521M548j6643J1976l9551J6597L2431
$$ plain form
15507 -10070 -22134 -48568 -67052 -32020 26653 7667 -497 -11356 -4393 -46487 -40147 36490
15495 36490 53507 55480 15960 -12132 -32518 -81398 -79240 -59784 -76211 -86728 -33408 -2601
15483 -2601 55078 34507 7030 59860 61377 50886 43991 43145 7605 -25965 -64097 -75513 -110229
15470 -110229 -53758 -235 6641 -68094 -44262 2130 8122 -14190 -93927 -108618 -141728 -170335
15458 -170335 -131030 -62154 1812 8832 -33460 -61713 -2920 -8267 -26030 -41760 -42563 -41777 -47242
15445 -47242 -19832 14553 -14302 -42034 -55439 -67635 -53488 -53066 -20368 20865 5684 12496
15433 12496 57227 41831 21203 69617 92061 44399 9572 19735 -18730 -119886 -108330
15422 -108330 -84992 -63215 -53142 -68191 -50158 3275 4221 34563 90205 59445 52045 18878
$$ packed form
15507a0070j2064k6434j8484L5032N8673j8986q164j0859O963m2094O340P6637
15495C6490J7017J973l9520k8092k0386m8880K158J9456j6427j0517N3320L0807
15483b601N7679k0571k7477N2830J517j0491o895q46l5540l3570l8132j1416l4716
15470a10229N6471N3523O876p4735K3832M6392N992k2312p9737j4691l3110k8607
15458a70335L9305O8876O3966P020m2292k8253N8793n347j7763j5730q03P86n465
15445d7242K7410L4385k8855k7732j3405j2196J4147M22L2698M1233j5181O812
15433A2496M4731j5396k0628M8414K2444m7662l4827J0163l8465j01156J1556
15422a08330K3338K1777J0073j5049J8033N3433R46L0342N5642l0760p400l3167
$$ plain form
15410 18878 -10094 3051 -12841 -14042 -37088 -53695 -36670 -34986 -64147 -68662 -64889 -72040 -85553
15397 -85553 -31803 -3044 39654 52996 54375 11288 -106298 -85998 -12873 -48128 -28074 -27886
15385 -27886 -87306 -109786 -126836 -71728 -68816 -82145 -94909 -91884 -51268 -19988 5508 20302
15373 20302 -16398 -11417 -22166 -44698 22306 41579 -40451 -79989 -68459 -19563 -23482 -13516
15361 -13516 -33755 -21479 -35819 -22359 -39992 -60957 -60486 -43706 35837 31922 23766 86520
15349 86520 86823 127112 88653 88733 87547 77617 30300 32063 40544 67035 45186 12247 49966
15336 49966 31821 -17134 -16316 -68735 -118541 -157527 -158464 -146036 -130185 -140342 -112186 -68005
15324 -68005 -42148 -84531 -101005 -61580 4620 49686 47858 71102 40283 -2831 -7350 -17636
$$ packed form
15410A8878k8972J3145j5892j201k3046j6607J7025J684k9161m515L773p151j3513
15397h5553N3750K8759M2698J3342J379m3087j17586K0300P3125l5255K0054J88
15385b7886n9420k2480j7050N5108K912j3329j2764L025M0616L1280K5496J4794
15373B0302l6700M981j0749k2532O7004J9273q2030l9538J1530M8896l919R966
15361a3516k0239J2276j4340J3460j7633k0965M71J6780P9543l915q156O2754
15349H6520L03M0289l8459Q0j186r930m7317J763Q481K6491k1849l2939L7719
15336D9966j8145m8955Q18n2419m9806l8986r37J2428J5851j0157K8156M4181
15324f8005K5857m2383j6474L9425O6200M5066j828K3244l0819m3114m519j0286
$$ plain form
15312 -17636 -39336 -31225 -17181 -59387 -73794 -49026 51393 63771 9903 -25282 1179 -12206
15300 -12206 -68456 -44462 -72393 -111087 -161172 -139212 -77264 -65073 -34974 -27714 -30267 -49071
15288 -49071 -53708 -55095 -60367 -5974 35959 56090 87910 41549 30791 31611 -31062 -4675 55962
15275 55962 72790 18874 18263 -5387 -21748 -59806 -71583 -76972 -64826 -53934 -46957 -41334 5952
15262 5952 26500 13770 -5482 -45746 -13848 -8783 -4640 -3831 4863 -14774 -6311 -20725 -29636
15249 -29636 -53807 -82764 -127136 -112750 -101002 -132994 -118265 -108362 -79178 -27567 -35757 -51197
15237 -51197 -92845 -98944 -39862 4300 40343 42924 252 -5552 -42109 -57660 -10382 -3864
15225 -3864 -16157 -8605 -56717 -79525 -40051 -37251 10350 90480 85252 48375 48458 6220 11377
$$ packed form
15312a7636k1700Q111J4044m2206j4407K4768J00419J2378n3868l5185K6461j3385
15300a2206n6250K3994k7931l8694n0085K1960O1948J2191L0099P260k553j8804
15288d9071m637j387n272N4393M1933K0131L1820m6361j0758Q20o2673K6387O0637
15275E5962J6828n3916o11k3650j6361l8058j1777n389J2146J0892O977N623M7286
15262E952K0548j2730j9252m0264L1898N065M143Q09Q694j9637Q463j4414q911
15249b9636k4171k8957m4372J4386J1748l1992J4729R903K9184N1611q190j5440
15237e1197m1648o099N9082M4162L6043K581m2672n804l6557j5551M7278O518
15225c864j2293P552m8112k2808L9474K800M7601Q0130n228l6877Q3m2238N157
$$ plain form
15212 11377 -34436 -37404 -7464 21376 4476 29656 43368 45855 94533 102558 69002 47909
15200 47909 29559 16902 14682 -16051 -58040 -69534 -26122 18876 37107 33073 20528 -370
15188 -370 -65418 -79882 -109397 -67465 -77737 -57930 -20254 -1924 22684 3761 -33443 -29208
15176 -29208 -53545 -4457 14783 -30351 -73155 -65672 -37654 -31079 -32194 -50674 -67899 -17124
15164 -17124 -59277 -96273 -119705 -116028 -117451 -84433 -67543 -11148 -18562 -23253 7602 17176 -13580
15151 -13580 -55963 -3733 -12990 -30010 41495 77266 120660 153743 118128 88121 41126 51885
15139 51885 90066 82619 24484 20908 963 18520 -226 -18287 -36062 -39545 -61524 -5836
15127 -5836 20064 67384 92786 35880 -25396 -22194 -43386 3563 20038 17672 -57825 -63250
$$ packed form
15212A1377m5813k968K9940K8840j6900K5180J3712K487M8678Q025l3556k1093
15200D7909j8350j2657k220l0733m1989j1494M3412M4998J8231m034j2545k0898
15188c70o5048j4464k9515M1932j0272J9807L7676J8330K4608j8923l7204M235
15176b9208k4337M9088J9240m5134m2804P483K8018O575j115j8480j7225N0775
15164a7124m2153l6996k3432L677j423L3018J6890N6395p414m691L0855R574l0756
15151a3580m2383N2230r257j7020P1505L5771M3394L3083l5615l0007m6995J0759
15139E1885L8181p447n8135l576j9945J7557j8746j8061j7775l483k1979N5688
15127e836K5900M7320K5402n6906o1276L202k1192M6949J6475k366p5497n425
$$ plain form
15115 -63250 -12990 -30470 -16042 -4823 41856 45923 -16168 -40298 -17837 13584 -12043 -37190
15103 -37190 -45841 32358 4735 -43966 -51087 3450 70386 63285 9554 -7440 -541 -54023
15091 -54023 -93928 -114010 -90411 -94621 -79434 -74922 -99622 -87716 -72316 -53451 -59396 -37694
15079 -37694 -56960 -4816 52495 65061 44434 12912 42045 90908 97502 48328 42844 54394
15067 54394 56500 68675 112401 59344 18243 25687 40244 34536 30905 9438 -24600 -41283
15055 -41283 -20904 -26577 -36390 -33762 -42564 -116819 -57984 6900 36143 31892 -23461 -32892 -19465
15042 -19465 -12984 -31690 -40448 -31724 -13247 -49896 -37295 18005 32338 19626 23745 36262
15030 36262 58466 54235 44860 39200 26691 -16154 -35416 -16722 46312 45828 42293 49138 14034
$$ packed form
15115f3250N0260j7480J4428J1219M6679M067o2091k4130K2461L1421k5627k5147
15103c7190q651P8199k7623m8701p121N4537O6936p101n3731j6994O899n3482
15091e4023l9905k0082K3599m210J5187M512k4700J1906J5400J8865n945K1702
15079c7694j9266N2144N7311J2566k0627l1522K9133M8863O594m9174n484J1550
15067E4394K106J2175M3726n3057m1101P444J4557n708l631k1467l4038j6683
15055d1283K0379n673r813K628q802p4255N8835O4884K9243m251n5353r431J3427
15042a9465O481j8706q758Q724J8477l6649J2601N5300J4333j2712M119J2517
15030C6262K2204m231r375n660j2509m2845j9262J8694O3034m84l535O845l5104
$$ plain form
15017 14034 18933 22305 -13571 -6580 -4280 -46407 -45660 -57810 9897 23704 9485 -18331 -24082
15004 -24082 11240 92735 78433 57902 6539 -34008 -8185 -27097 -14159 -48539 -55664 -51931
14992 -51931 -54695 -61796 -16598 36286 25274 82733 49143 34127 57052 73046 50153 5833
14980 5833 -74041 -101998 -109662 -125433 -85240 -33344 -6907 -63430 -40784 -41351 -4213 -229 -75010
14967 -75010 -83835 -46511 -4201 50434 95375 62642 -15135 27575 39482 -39294 -46672 -67500
14955 -67500 -88239 -149543 -178119 -158167 -78741 15220 73647 24310 -2913 -34810 -63119 -74799
14943 -74799 -81910 -23953 17175 66919 67754 39566 49899 59808 74147 121813 22392 -7374
14931 -7374 23998 42017 -37302 -90052 -89301 -90374 -65230 -42460 7065 48212 19864 27373 9135
$$ packed form
15017A4034M899L372l5876O991K300m2127P47j2150O7707J3807j4219k7816n751
15004b4082L5322Q1495j4302k0531n1363m0547K5823j8912J2938l4380p125L733
14992e1931k764p101M5198N2884j1012N7459l3590j5016K2925J5994k2893m4320
14980E833p9874k7957p664j5771M0193N1896K6437n6523K2646n67L7138L984p4781
14967g5010q825L7324M2310N4635M4941l2733p7777M2710J1907p8776p378k0828
14955f7500k0739o1304k8576J9952P9426R3961N8427m9337k7223l1897k8309j1680
14943g4799p111N7957M1128M9744Q35k8188J0333R909J4339M7666r9421k9766
14931g374L1372J8019p9319n2750P51j073K5144K2770M9525M1147k8348P509j8238
$$ plain form
14918 9135 -18338 -46583 -29497 4768 27842 7106 -45658 -61344 -42522 -6604 -50558 -49665
14906 -49665 -46548 1459 46306 46468 -24074 -38635 -5358 21158 13928 14065 -23084 -10286 10702
14893 10702 8907 24057 -11894 1434 3156 -1206 5852 4315 -635 91970 100184 40694 -16346
14880 -16346 -32900 -2646 31717 -30977 -2811 -1669 -11450 -25570 -19329 -25636 -16577 17710 51898
14867 51898 41896 -27865 -49776 -51672 -76185 -88149 -49202 -43771 -23159 -34549 -81114 -93590
14855 -93590 -95554 -114580 -134715 -114854 -93301 -135430 -83918 -766 38682 47462 37282 4498
14843 4498 8600 -20516 -1048 4720 19913 50508 81303 110580 74686 115545 65305 33489
14831 33489 34396 16648 -28700 -58179 -36899 -26992 -49955 -70067 8816 31706 17635 15555
$$ packed form
14918I135k7473k8245J7086L4265K3074k0736n2764j5686J8822L5918m3954Q93
14906d9665L117M8007M4847J62p0542j4561L3277K6516p230J37l7149J2798K0988
14893A0702j795J5150l5951J3328J722m362P058j537m950R2605Q214n9490n7040
14880a6346j6554L0254L4363o2694K8166J142r781j4120O241o307R059L4287L4188
14867E1898j0002o9761k1911j896k4513j1964L8947N431K0612j1390m6565j2476
14855i3590j964j9026k0135J9861K1553m2129N1512Q3152L9448Q780j0180l2784
14843D498M102k9116J9468N768J5193L0595L0795K9277l5894M0859n0240l1816
14831C3489R07j7748m5348k9479K1280R907k2963k0112P8883K2890j4071k080
$$ plain form
14819 15555 30197 86385 95878 81223 46629 50417 -21312 -61939 -39644 12522 77693 77002
14807 77002 28739 -34264 -7490 18923 12620 -8325 -17090 48533 104210 96353 22353 63671
14795 63671 56331 -50030 -50404 -29856 -41306 -30264 -4495 61844 70589 13339 -10480 56728
14783 56728 80331 53969 68703 20930 25593 -8857 -51725 -9677 13808 -7505 -6766 3642
14771 3642 -31002 -57618 -62446 -89616 -94664 -40433 -29212 -40845 -135809 -122283 -46048 -21308
14759 -21308 -2195 34321 57310 65690 -11806 -64347 -77544 -22448 -23976 609 23372 -1300
14747 -1300 -31528 -17964 13347 44973 -6168 -71652 -34783 68624 107400 125891 155093 133001
14735 133001 38362 -29904 -91820 -57676 -45697 -31457 24008 3557 -22533 -162 -44401
$$ packed form
14819A5555J4642N6188R493j4655l4594L788p1729m0627K2295N2166O5171o91
14807G7002m8263o3003K6774K6413o303k0945q765O5623N5677p857p4000M1318
14795F3671p340j06361l74K0548j1450J1042K5769O6339Q745n7250k3819O7208
14783E6728K3603k6362J4734m7773M663l4450m2868M2048K3485k1313P39J0408
14771C642l4644k6616m828k7170n048N4231J1221j1633r4964J3526P6235K4740
14759b1308J9113L6516K2989Q380p7496n2541j3197N5096j528K4585K2763k4672
14747a300l0228J3564L1311L1626n1141o5484L6869J03407L8776J8491K9202k2092
14735A33001r4639o8266o1916L4144J1979J4240N5465k0451k6090K2371m4239
$$ plain form
14724 -44401 -62007 -27814 -27675 439 -3103 13902 80878 77203 51127 35871 16834 -31501
14712 -31501 -47476 23369 44392 32634 25678 8725 -27680 -54478 -51239 -9959 -26429 -37935
14700 -37935 -9696 4197 8138 -1999 -44525 -28991 52203 83333 69688 37646 8620 43334
14688 43334 59566 74427 42397 11394 38979 42363 56858 40536 76127 34106 -5816 -10765
14676 -10765 39182 69966 41078 39967 71201 43062 19052 -41836 -78120 4249 9098 -31990
14664 -31990 -58675 -85738 -100054 -73983 -101722 -52233 14072 22207 41237 60143 68229 53244
14652 53244 39380 36759 -6152 -39993 4814 3920 27296 40477 67385 26360 640 46775
14640 46775 70584 23047 17814 30269 48554 -28458 -68829 -75756 -57174 -69708 -64302 -12855
$$ packed form
14724d4401j7606L4193J39K8114l542J7005O6976l675k6076j5256j9037m8335
14712c1501j5975P0845K1023j1758o956j6953l6405k6798L239M1280j6470j1506
14700c7935K8239J3893L941j0137m2526J5534Q1194L1130j3645l2042k9026L4714
14688D3334J6232J4861l2030l1003K7585L384J4495j6322L5591m2021l9922m949
14676a0765M9947L0784k8888j111L1234k8139k4010o0888l6284Q2369M849m1088
14664c1990k6685k7063j4316K6071k7739M9489O6305Q135J9030J8906Q086j4985
14652E3244j3864k621m2911l3841M4807q94K3376J3181K6908m1025k5720M6135
14640D6775K3809m7537n233J2455J8285p7012m0371o927J8582j2534N406N1447
$$ plain form
14628 -12855 73615 56493 -16538 -20396 46199 73835 24460 -46543 -3837 -12293 -25120 -45291
14616 -45291 -69935 -75283 -97771 -57628 -10457 -600 30732 57691 45994 -13707 15291 79972
14604 79972 65706 1666 -44090 -64051 -51381 -28493 -19069 15935 60250 40990 37950 36231
14592 36231 -14794 -80439 -106691 -82358 -47214 -48745 -23374 -56222 -54163 -59193 -17575 -38482
14580 -38482 -65310 -23822 22111 41928 -3636 -40183 -40210 -74032 -39349 5713 24274 25989
14568 25989 35366 42486 49420 67033 61103 70927 17233 -27275 -74734 -35953 -15730 8657 221
14555 221 -11840 -28112 -100939 -123278 -81736 -78977 -13352 21104 7756 -30764 -37636 -47345 -26633
14542 -26633 -5792 -28458 -54503 -49103 -23425 -17320 -18262 23449 18994 -893 -49064 -21544 8065
$$ packed form
14628a2855Q6470j7122p3031l858O6595K7636m9375p1003M2706q456j2827k0171
14616d5291k4644n348k2488M0143M7171R857L1332K6959j1697n9701K8998O4681
14604G9972j4266o4040m5756j9961J2670K2888R424L5004M4315j9260l040j719
14592C6231n1025o5645k6252K4333L5144j531K5371l2848K059n030M1618k0907
14580c8482k6828M1488M5933J9817m5564l6547k7l3822L4683M5062J8561J715
14568B5989R377P120O934J7613n930R824n3694m4508m7459L8781K0223K4387q436
14555B21j2061j6272p2827k2339M1542K759O5625L4456j3348l8520o872r709K0712
14542b6633K0841k2666k6045N400K5678O105r42M1711m455j9887m8171K7520K9609
$$ plain form
14529 8065 11879 -31621 -88974 -110806 -78965 -67126 -41784 -52032 30979 13631 -19960 -3567
14517 -3567 3993 -4826 -20835 -38026 -35539 -15129 -10414 -13017 -25704 -57850 -62311 -68048 -79782
14504 -79782 -17860 -17898 -13422 -18603 30685 71017 32991 3336 14953 -28896 -62543 -62817 -11194
14491 -11194 25113 2106 -69919 -96818 -76273 -48295 -68442 -68074 -45520 -71972 -60836 -52891
14479 -52891 -59433 -42188 -35189 -22805 46587 19383 17351 32825 53317 66593 69873 46456
14467 46456 56979 101139 71970 42491 -18392 1382 20142 -29118 -29544 -41691 40377 48556
14455 48556 9003 -26171 21511 42163 51626 97254 97548 16749 -44399 -71226 -68685 -13603
14443 -13603 69411 101358 117766 93370 49908 56720 93917 127666 41515 -21629 13493 19802
$$ packed form
14529H065L814m3500n7353k1832L1841J1839K5342j0248Q3011j7348l3591J6393
14517c567P560q819j6009j7191K487K0410M715k603j2687l2146m461n737j1734
14504g9782O1922l8M476n181M9288M0332l8026k9655J1617m3849l3647k74N1623
14491a1194L6307k3007p2025k6899K0545K7978k0147L68K2554k6452J1136P945
14479e2891o542J7245O999J2384O9392k7204k032J5474K0492J3276L280k3417
14467D6456J0523M4160k9169k9479o0883J9774J8760m9260m26j2147Q2068Q179
14455D8556l9553l5174M7682K0652R463M5628K94q0799o1148k6827K541N5082
14443a3603Q3014L1947J6408k4396m3462O812L7197L3749q6151o3144L5122O309
$$ plain form
14431 19802 -28475 -33925 -30179 -74628 -70873 -55991 -80088 -68041 -25902 -1315 -13598 -25060
14419 -25060 -951 -9809 -62515 -38131 -34887 -22932 1888 -60397 -102173 -125686 -98136 -97407
14407 -97407 -118608 -158280 -131437 -133785 -97189 -78468 -83222 -115410 -102051 -78538 -5488 56349
14395 56349 67554 70631 78719 98482 44159 -11118 -91597 -85309 -31232 -9661 -33228 -16807
14383 -16807 -11779 -2035 -7820 -36502 -64040 -46630 -29245 -47412 -81251 -32894 -17472 -73748
14371 -73748 -67191 -91614 -114930 -103724 -75749 -122528 -110398 -66385 40510 68314 10515 -57773
14359 -57773 -73919 -43740 18417 -10391 10420 28565 57115 20424 -59246 -94820 -109608 -99067
14347 -99067 -64439 -16323 -8619 -26884 15069 52134 37027 17047 17667 36563 -11337 -82175
$$ packed form
14431A9802m8277n450L746m4449L755J4882k4097J2047M2139K4587j2283j1462
14419b5060K4109q858n2706K4384L244J1955K4820o2285m1776k3513K7550P29
14407i7407k1201l9672K6843k348L6596J8721m754l2188J3359K3513P3050O1837
14395E6349J1205L077Q088J9763n4323n5277q0479O288N4077K1571k3567J6421
14383a6807N028R744n785k8682k7538J7410J7385j8167l3839M8357J5422n6276
14371g3748O557k4423k3316J1206K7975m6779J2130M4013J06895K7804n7799o8288
14359e7773j6146L0179O2157k8808K0811J8145K8550l6691p9670l5574j4788J0541
14347i9067L4628M8116P704j8265M1953L7065j5107j9980O20J8896m7900p0838
$$ plain form
14335 -82175 -131826 -159472 -107422 -132963 -118638 -42277 -26869 -11360 11293 -13427 -64787 -155938
14323 -155938 -138424 -97887 -62065 -64366 -34770 23884 61488 109317 108928 16652 -34649 -41681
14311 -41681 -66489 -73909 -50931 19392 41434 18228 35819 26213 -25770 -30170 -3422 -22087
14299 -22087 -52747 -61989 -1489 -12747 -33868 48874 68526 36538 60725 57828 56492 59400
14287 59400 64409 63595 961 39067 25112 -16429 -45814 -68208 -104890 -57523 -32320 -54466
14275 -54466 -16204 -26924 -6216 4201 -14178 5687 13983 3800 -29639 -21381 12940 -239
14263 -239 5821 -1051 9758 -12145 -59330 -53604 -1539 90949 79389 52267 36973 -7998 -19220
14250 -19220 20340 36945 36398 43536 -4295 23760 16982 -17683 5454 9003 33356 57331 42262
$$ packed form
14335h2175m9651k7646N2050k5541J4325P6361J5408J5509K2653k4720n1360r1151
14323a55938J7514M0537L5822k301K9596N8654L7604M7829l89r2276n1301p032
14311d1681k4808p420K2978P0323K2042k3206J7591r606n1983m400K6748j8665
14299b2087l0660r242O0500j1258k1121Q2742J9652l1988K4187k897j336K908
14287E9400N009q14o2634L8106j3955m1541k9385k2394l6682M7367K5203k2146
14275e4466L8262j0720K0708J0417j8379J9865Q296j0183l3439Q258L4321j3179
14263b39O060o872J0809k1903m7185N726N2065R2488j1560k7122j5294m4971j1222
14250a9220L9560J6605n47P138m7831K8055o778l4665K3137L549K4353K3975j5069
$$ plain form
14237 42262 61564 46022 -20805 -25508 4270 -7613 -50374 -68379 -103987 -51735 5765 33085
14225 33085 5006 -31388 -34925 -48530 -90771 -98512 -47112 -5864 9750 18932 12921 4441 -53397
14212 -53397 -31929 28935 51423 31371 18541 -72587 -123487 -117953 -135085 -151933 -96100 -39706
14200 -39706 -82967 -121058 -89257 -29588 -6541 -53528 -67147 -40246 -40501 -49596 -69892 -60535
14188 -60535 -109787 -115238 -89502 -126793 -72986 -3560 10656 -35631 -36632 -23702 -6135 27406
14176 27406 22947 56431 -83 17799 40297 -11824 -15666 -23700 -5656 -23852 -15540 -56634
14164 -56634 -43172 -11758 34737 127282 119952 100091 74713 48238 3619 -34970 -48482 -49904
14152 -49904 -69305 -21270 -42343 -15256 26432 -4509 35819 71325 45295 50358 58231 43361
$$ packed form
14237D2262J9302j5542o6827m703K9778j1883m2761j8005l5608N2252N7500K7320
14225C3085k8079l6394l537j3605m2241p741N1400M1248J5614R182o011q480n7838
14212e3397K1468O0864K2488k0052j2830r1128n0900N534j7132j6848N5833N6394
14200c9706m3261l8091L1801N9669K3047m6987j3619K6901k55r095k0296R357
14188f0535m9252n451K5736l7291N3807O9426J4216m6287j001J2930J7567L3541
14176B7406m459L3484n6514J7882K2498n2121l842q034J8044j8196Q312m1094
14164e6634J3462L1414M6495R2545p330j9861k5378k6475m4619l8589j3512j422
14152d9904j9401M8035k1073K7087M1688l0941M0328L5506k6030N063P873j4870
$$ plain form
14140 43361 5872 -29119 -25673 -31319 30530 94787 81998 32659 -20759 -17576 3686 31848
14128 31848 21815 -4936 -3079 -22656 -30630 -37578 -41826 -65633 -69645 -85464 -59337 -58359 -33679
14115 -33679 -36637 -11581 35587 57913 75213 49861 4128 11801 -9858 23206 50106 26256
14103 26256 -8812 -7169 -25431 -15537 -18255 -15102 -20555 -33305 -76500 -139016 -121268 -55466 -24150
14090 -24150 -26074 -50386 -25682 8983 1051 -13336 -73452 -119120 -99689 -95536 -92424 -69329
14078 -69329 -70304 -6532 -326 -8443 -17062 16699 -5669 -10132 9211 2666 -343 11453 -7683
14065 -7683 4525 -14235 12102 1323 -16905 -20237 17307 44609 7307 19333 -14499 -59931
14053 -59931 -21771 35762 7298 -26024 8558 1238 1340 -23647 -9631 29468 61791 -11654
$$ packed form
14140D3361l7489l4991L446n646O1849O4257j2789m9339n3418L183K1262K8162
14128C1848j0033k6751J857j9577p974o948m248k3807m012j5819K6127R78K4680
14115c3679k958K5056M7168K2326J7300k5352m5733P673k1659L3064K6900k3850
14103B6256l5068J643j8262R894k718L153n453j2750m3195o2516J7748O5802L1316
14090b4150j924k4312K4704L4665p932j4387o0116m5668J9431M153L112K3095
14078f9329r75O3772O206q117q619L3761k2368m463J9343o545l009J1796j9136
14065g683J2208j8760K6337j0779j8228l332L7544K7302l7302J2026l3832m5432
14053e9931L8160N7533k8464l3322L4582p320J02k4987J4016L9099L2323p3445
$$ plain form
14041 -11654 -65778 -33322 -11653 -37703 -81046 -56632 -11620 12684 47707 34540 -9871 -10648
14029 -10648 -1080 -7982 -68232 -55249 -749 13252 -46028 -33600 10059 42827 48349 21622
14017 21622 -12482 -35617 -10334 62493 57422 94104 89998 104755 50205 -25586 -70843 -42324
14005 -42324 -33382 -49302 -62333 -30644 15819 20779 59227 76412 61973 47271 66633 25151
13993 25151 -32773 -6892 27230 92039 78944 27464 -17528 -47406 -28234 7981 -29696 -89659
13981 -89659 -49663 -41800 -112457 -166551 -180342 -106116 -41607 -21345 10932 18974 -9732 -37048
13969 -37048 -66521 -58617 -35433 -52770 -88023 -77505 -94207 -131785 -158926 -127339 -40197 34172
13957 34172 53634 49745 38306 8360 -15389 34780 72321 42800 18978 10337 -3059 28295
$$ packed form
14041a1654n4124L2456K1669k6050m3343K4414M5012K4304L5023j3167m4411p77
14029a0648R568o902o0250J2983N4500J4001n9280J2428M3659L2768N522k6727
14017B1622l4104k3135K5283P2827n071L6682m106J4757n4550p5791m5257K8519
14005d2324Q942j5920j3031L1689M6463M960L8448J7185j4439j4702J9362m1482
13993B5151n7924K5881L4122O4809j3095n1480m4992k9878J9172L6215l7677n9963
13981h9659L9996P863p0657n4094j3791P4226O4509K0262L2277Q042k8706k7316
13969c7048k9473P904K3184j7337l5253J0518j6702l7578k7141L1587Q7142P4369
13957C4172J9462l889j1439k9946k3749N0169L7541k9521k3822q641j3396L1354
$$ plain form
13945 28295 -3626 -45389 -77828 -41127 40077 59544 4280 877 2981 -36244 -84227 -72945
13933 -72945 -14953 15898 10052 -45086 -102651 -88638 -24720 42226 49603 79072 44554 27459
13921 27459 42657 23060 15326 -9326 9841 16636 57697 37321 -9032 -35756 -28422 -799
13909 -799 53943 43849 16050 -9991 34445 76415 62714 61191 33127 13552 -20917 -47474
13897 -47474 -41550 -25505 -48911 -47075 -12470 4769 27598 46106 23383 33098 41402 67932
13885 67932 31902 -80399 -71669 -43201 -46573 -86905 -105931 -104642 -58701 -26220 -23891 -29914
13873 -29914 -45543 -28793 -51991 -130040 -137139 -134119 -22934 52858 34364 49584 85512 49100
13861 49100 42733 37318 48753 71449 101765 84245 47195 -28114 -60383 -7995 -25449 7015
$$ packed form
13945B8295l1921m1763l2439L6701Q1204J9467n5264l403K104l9225m7983J1282
13933g2945N7992L0851n846n5138n7565J4013O3918O6946P377K9469l4518j7095
13921B7459J5198j9597p734k4652J9167O795M1061k0376m6353k6724P334K7623
13909g99N4742j0094k7799k6041M4436M1970j3701j523k8064j9575l4469k6557
13897d7474N924J6045k3406J836L4605J7239K2829J8508k2723R715Q304K6530
13885F7932l6030j12301Q730K8468l372m0332j9026J289M5941L2481K329o023
13873b9914j5629J6750k3198p8049p099L020J11185P5792j8494J5220L5928l6412
13861D9100o367n415J1435K2696L0316j7520l7050p5309l2269N2388j7454L2464
$$ plain form
13849 7015 21224 -48584 -75415 -53456 -30726 -9835 -55025 -65653 -55149 -3352 36345 81056
13837 81056 94760 101648 128781 125550 108201 104056 51525 -9911 -19036 24464 86699 38940
13825 38940 51381 63464 112161 97543 55752 48220 24158 15856 -12028 -22793 6868 -1986
13813 -1986 315 -74526 -98859 -93055 -81583 -49249 7271 22686 5241 -79528 -158270 -171240
13801 -171240 -120068 -133919 -93049 -76989 -43895 -71095 -75495 -88496 -33587 -28446 32057 90798
13789 90798 133016 149798 103108 87147 77740 69281 104928 77539 28279 41430 80627 52849
13777 52849 30760 -14813 -9557 1329 -23972 5208 -263 -16077 -3331 -8289 -19265 29119
13765 29119 20951 20040 37772 37662 -6356 36168 -7367 -3848 10532 4951 30139 42728 75524
$$ packed form
13849G015J4209o9808k6831K1959K2730K0891m5190j0628J0504N1797L9697M4711
13837H1056J3704O888K7133l231j7349m145n2531o1436r125M3500O2235m7759
13825C8940J2441J2083M8697j4618m1791p532k4062q302k7884j0765K9661q854
13813a986K301p4841k4333N804J1472L2334N6520J5415j7445q4769p8742j2970
13801a71240N1172j3851M0870J6060L3094k7200m400j3001N4909N141O0503N8741
13789I0798M2218J6782m6690j5961r407q459L5647k7389m9260J3151L9197k7778
13777E2849k2089m5573N256J0886k5301K9180n471j5814J2746m958j0976M8384
13765B9119q168r11J7732j10m4018M2524m3535L519J4380n581K5188J2589L2796
$$ plain form
13752 75524 111383 59022 -11034 -66060 -68942 -46406 -30664 -14611 15748 37410 58804 110049
13740 110049 89420 69852 73744 121753 160906 174699 128425 36590 8944 -8518 -21518 -84947
13728 -84947 -67854 -4367 -3402 2442 4097 11521 45296 49765 49128 17551 56301 104023 125217
13715 125217 94466 33636 -2361 -12138 -85307 -77231 -29133 -6033 25247 25751 75720 41248
13703 41248 15599 35944 9038 -42264 -73981 -35536 -26736 22698 18625 -1860 -985 -26656
13691 -26656 -13821 -43253 -34214 6548 -35202 -60156 -56359 -79006 -107001 -64765 -44481 47144
13679 47144 56077 -22665 2146 -37642 -63264 -64736 -46222 -44773 -11665 -21955 -55927 -51722
13667 -51722 -49020 -36778 -44162 -39394 -43045 -44593 -42555 -61553 -39165 33144 105837 65860 59220
$$ packed form
13752G5524L5859n2361p0056n5026k882K2536J5742J6053L0359K1662K1394N1245
13740A10049k0629j9568L892M8009L9153J3793m6274r1835k7646j7462j3000o3429
13728h4947J7093O3487R65N844J655P424L3775M469o37l1577L8750M7722K1194
13715A25217l0751o0830l5997r777p3169Q076M8098K3100L1280N04M9969l4472
13703D1248k5649K0345k6906n1302l1717L8445Q800M9434m073k0485Q75k5671
13691b6656J2835k9432R039M0762m1750k4954L797k2647k7995M2236K0284R1625
13679D7144Q933p8742K4811l9788k5622j472J8514J449L3108j0290l3972M205
13667e1722K702J2242p384M768l651j548K038j8998K2388P2309P2693l9977o640
$$ plain form
13654 59220 -15890 10086 28484 -10203 16553 58141 45251 10365 -23271 -28827 -2980 -2574
13642 -2574 43535 59935 77019 79911 37424 8502 2456 18331 2334 -66321 -57166 -18618
13630 -18618 -8994 -71089 -82415 -140799 -109579 -17509 25540 62989 29477 24679 -25465 3062
13618 3062 30729 -34990 -1608 63633 75409 22053 9439 21413 52329 67855 22765 -38369
13606 -38369 -28269 -14614 -4010 34001 -12710 -56975 -29807 18087 7443 -50655 -73815 -98674
13594 -98674 -97748 -94037 -87448 -49871 -40792 -57236 -86608 -98034 -73430 -39652 -44827 -58178 -40033
13581 -40033 -15382 -35346 -81477 -88454 -64499 -21193 19068 -19795 -45616 15418 15107 2666
13569 2666 38327 51609 -17683 -79435 -66722 -10754 13360 23063 17552 26731 12799 -26338
$$ packed form
13654E9220p5110K5976J8398l8687K6756M1588j2890l4886l3636n556K5847M06
13642b574M6109J6400J7084K892m2487k8922o046J5875j5997o8655R155L8548
13630a8618R624o2095j1326n8384L1220R2070M3049L7449l3512m798n0144K8527
13618C062K7667o5719L3382O5241J1776n3356j2614J1974L0916J5526m5090o1134
13606c8369J0100J3655J0604L8011m6711m4265K7168M7894j0644n8098k3160k4859
13594i8674R26L711O589L7577R079j6444k9372j1426K4604L3778n175j3351J8145
13581d0033K4651j9964m6131o977K3955M3306M0261l8863k5821O1034l11j2441
13569B666L5661J3282o9292o1752J2713N5968K4114R703n511R179j3932l9137
$$ plain form
13557 -26338 -5097 16453 5458 -38507 -64631 -88109 -75003 -76611 -80117 -8199 46781 13798
13545 13798 -16913 3852 -5605 -31263 -73892 -28375 54000 72200 64843 16965 -35255 -12359
13533 -12359 -34066 -49670 -56695 -37239 -292 42469 57938 38379 15561 34666 18297 31663
13521 31663 -5139 -20487 5828 42608 53896 -1568 4142 -26170 -57091 -98046 -130392 -79529
13509 -79529 -23966 5649 -37240 -14379 -3018 -17565 -68941 -3078 10918 47814 59873 66756
13497 66756 88612 123021 139930 76448 24858 55610 67488 98034 60321 5866 -5076 10050
13485 10050 28055 34273 45749 -706 11732 32746 -17970 -44157 -58559 -91553 -134164 -81450
13473 -81450 -36601 -76654 -53816 -23356 12125 51069 24246 23108 1087 -5237 4894 46826
$$ packed form
13557b6338K1241K1550j0995m3965k6124k3478J3106j608l506P1918N4980l2983
13545A3798l0711K0765r457k5658m2629M5517Q2375J8200p357m7878n2220K2896
13533a2359k1707j5604p025J9456L6947M2761J5469j9559k2818J9105j6369J3366
13521C1663l6802j5348K6315L6780J1288n5464N710l0312l0921m0955l2346N0863
13509g9529N5563K9615m2889K2861J1361j4547n1376O5863J3996L6896J2059O883
13497F6756K1856L4409J6909o3482n1590L0752J1878L0546l7713n4455j0942J5126
13485A0050J8005O218J1476m6455J2438K1014n0716k6187j4402l2994m2611N2714
13473h1450M4849m0053K2838L0460L5481L8944k6823j138k2021o324J0131M1932
$$ plain form
13461 46826 76809 77313 124553 111429 90371 56469 32488 10353 -1310 -58765 -62138 13275
13449 13275 31598 -7849 19347 40095 84773 113790 126370 101262 89363 81296 82293 -17905
13437 -17905 -70986 5959 35667 12336 9297 18446 -31570 -58994 -16683 4129 -18006 -17895
13425 -17895 -22764 6487 16696 66024 99375 110250 80701 38169 -21297 -51515 20415 -16988
13413 -16988 -63102 -20288 -3707 1019 -15269 -28501 -56252 -25771 8625 -10580 -58506 -62263
13401 -62263 -46448 -8087 -9890 -26010 29225 14975 -20870 -34858 -12056 -8775 1868 10131
13389 10131 -15169 15526 45066 -5474 -12679 8833 18975 46616 9805 20559 65446 18861
13377 18861 -4649 39474 72608 36490 13044 2678 41343 43025 39303 66143 91713 76035
$$ packed form
13461D6826K9983N04M7240j3124k1058l3902k3981k2135j1663n7455l373P5413
13449A3275J8323l9447K7196K0748M4678K9017J2580k5108j1899q067R97j00198
13437a7905n3081P6945K9708k3331l039R149n0016k7424M2311K0812k2135J11
13425a7895m869K9251J0209M9328L3351J0875k9549m2532n9466l0218P1930l7403
13413a6988m6114M2814J6581M726j6288j3232k7751L0481L4396j9205m7926l757
13401f2263J5815L8361j803j6120N5235j4250l5845j3988K2802L281J0643Q263
13389A0131k5300L0695K9540n0540p205K1512J0142K7641l6811J0754M4887m6585
13377A8861k3510M4123L3134l6118k3446j0366L8665J682l722K6840K5570j5678
$$ plain form
13365 76035 73786 50257 37094 9022 -6892 -17217 38277 77359 76425 43253 41409 26248
13353 26248 -28588 -28850 -10259 3619 2650 50027 55965 32958 26030 46505 59670 80749 20591
13340 20591 -17217 -14268 -7912 -15195 36689 38676 21432 20268 99462 26928 -17733 -26006 33871
13327 33871 67119 45104 15378 4466 -3064 -32160 -13264 81511 162242 149500 128687 93728
13315 93728 44580 82296 107850 109463 29865 1297 -8963 -26982 -54733 -86076 -46921 3306
13303 3306 -31944 -25704 23222 63701 50144 -20766 -58354 -106646 -73719 -8731 -26896 -37129
13291 -37129 -44595 -48327 -16570 16104 56616 47569 19459 22932 -11626 -15990 -15037 -26084 -56745
13278 -56745 -108105 -83028 -8774 -34975 -34454 -52214 -88828 -42551 -9307 -59784 -46054 -12212
$$ packed form
13365G6035k249k3529j3163k8072j5914j0325N5494L9082r34l3172j844j5161
13353B6248n4836k62J8591J3878r69M7377N938k3007o928K0475J3165K1079o0158
13340B0591l7808K949O356p283N1884J987j7244j164P9194p2534m4661q273N9877
13327C3871L3248k2015k9726j0912p530k9096J8896R4775Q0731j2742k0813l4959
13315I3728m9148L7716K5554J613p9598k8568j0260j8019k7751l1343L9155N0227
13303C306l5250O240M8926M0479j3557p0910l7588m8292L2927O4988j8165j0233
13291c7129p466l732L1757L2674M0512r047k8110L473l4558m364R53j1047l0661
13278e6745n1360K5077P4254k6201N21j7760l6614M6277L3244n0477J3730L3842
$$ plain form
13266 -12212 -55451 -52888 -38423 -13788 -30009 -88639 -71405 -39485 3627 -20318 -27376 13152
13254 13152 44076 37202 8124 -4751 -27365 -73120 -117456 -119217 -44010 19350 59932 30498
13242 30498 -28584 -41720 -56798 -74769 -34784 -57340 -61706 -76612 -48222 -20025 29951 22337
13230 22337 7850 -10110 -26976 41572 76616 57384 8864 -16031 -28512 -33025 -20879 35741
13218 35741 56849 51511 45134 27991 31714 51369 -28938 -54824 -35324 8390 66816 74121
13206 74121 75439 6742 -27849 -3515 50671 -1389 -9724 21757 43738 34417 26248 85429
13194 85429 53931 -5153 -63195 -35898 21687 2484 -79829 -98017 -66432 -26448 4700 70327
13182 70327 88227 70410 47466 6507 -54839 -92950 -84005 -33578 37330 47032 14862 -40469
$$ packed form
13266a2212m3239K563J4465K4635j6221n8630J7234L1920M3112k3945p058M0528
13254A3152L0924o874k9078j2875k2614m5755m4336j761P5207O3360M0582k9434
13242C0498n9082j3136j5078j7971L9985k2556m366j4906K8390K8197M9976p614
13230B2337j4487j7960j6866O8548L5044j9232m8520k4895j2481m513J2146N6620
13218C5741K1108n338o377j7143L723J9655q0307k5886J9500M3714N8426P305
13206G4121J318o8697l4591K4334N4186n2060q335L1481K1981r321q169N9181
13194H5429l1498n9084n8042K7297N7585j9203q2313j8188L1585L9984L1148O5627
13182G0327J7900j7817k2944m0959o1346l8111Q945N0427P0908R702l2170n5331
$$ plain form
13170 -40469 -49624 -18541 20540 21743 36280 38611 46866 77810 75699 101165 96525 55759 76925
13157 76925 34928 86780 135144 110802 80258 141276 134687 94094 37499 -22854 -24665 966
13145 966 -17547 -1037 15110 3672 -16920 24311 38748 45994 74262 78680 20892 -49125
13133 -49125 -51413 -15625 15523 17627 -3949 -25183 4225 -47131 -24036 19371 24564 31563
13121 31563 63111 83485 68144 63769 114604 125600 123637 87875 93914 49922 89921 138736
13109 138736 188079 162801 152496 118952 124903 141603 100058 48809 4164 50087 65094 64940
13097 64940 52018 106123 130559 81234 62202 35040 47548 119696 142620 134571 127759 146045
13085 146045 182247 258892 382884 488667 575922 701606 872998 1030818 1210809 1320674
$$ packed form
13170d0469r155L1083L9081J203J4537K331Q255L0944k111K5466m640m0766K1166
13157G6925m1997N1852M8364k4342l0544O1018o589m0593n6595o0353j811K5631
13145I66j8513J6510J6147j1438k0592M1231J4437P246K8268M418n7788p0017
13133d9125k288L5788L1148K104k1576k1234K9408n1356K3095M3407N193O999
13121C1563L1548K0374j5341m375N0835J0996j963l5762O039m3992L9999M8815
13109A38736M9343k5278j0305l3544N951J6700m1545n1249m4645M5923J5007j54
13097F4940j2922N4105K4436m9325j9032k7162J2508P2148K2924q049o812J8286
13085A46045L6202P6645J23992J05783Q7255J25684J71392J57820J79991J09865
$$ plain form
13075 1320674 1471105 1466628 1210154 918006 750828 618545 524334 422289 312337 258884
13065 258884 238246 193963 130110 103890 129581 218271 258313 231393 199811 180648 219808
13054 219808 238940 257482 261932 187814 145121 104866 135303 156013 100281 89015 6928 -22078
13042 -22078 -44697 16641 105903 129045 102321 98475 75778 70244 53744 72073 87476 104805
13030 104805 114092 75445 43401 -15652 -25982 46181 22546 7693 38241 53513 -3734 -35294
13018 -35294 49817 78167 101717 84374 25078 18269 -18587 -30902 -29879 -23941 -12297 -7546
13006 -7546 34328 16537 36652 43973 62748 24092 8299 51951 59096 18464 -5368 -60265
12994 -60265 -43206 16020 65287 39551 50798 31049 8210 -10705 -9788 -2855 -19707 34806
$$ packed form
13075A320674J50431m477k56474k92148j67178j32283r4211j02045j09952n3453
13065B58884k0638m4283o3853k6220K5691Q8690M0042k6920l1582j9163L9160
13054B19808J9132J8542M450p4118m2693m0255L0437K0710n5732j1266q2087k9006
13042b2078k2619O1338Q9262K3142k6724l846k2697n534j6500J8329J5403J7329
13030A04805R287l8647l2044n9053j0330P2163k3635j4853L0548J5272n7247l1560
13018c5294Q5111K8350K3550j7343n9296o809l6856j2315J023N938J1644M751
13006g546M1874j7791K0115P321J8775l8656j5793M3652P145m0632k3832n4897
12994f0265J7059N9226M9267k5736J1247j9749k2839j8915R17O933j6852N4513
$$ plain form
12982 34806 36239 -8800 -27211 1407 15515 -31484 22219 106384 89246 15109 6116 -5675
12970 -5675 14857 55782 96802 75815 18880 -36252 -72115 -23448 10469 30490 77595 96823
12958 96823 25667 7752 57597 130750 105765 60056 81940 98929 69270 43921 21869 25980
12946 25980 47338 -35051 -43756 34837 8539 -35375 -1621 -8696 13226 28518 62026 54649
12934 54649 66892 56855 4217 31468 7493 42491 80010 110427 138361 116973 47431 19548
12922 19548 55545 23126 -10876 -9355 59158 75209 64635 155224 163155 191476 199066 178517
12910 178517 143374 13602 37279 46710 57757 47908 105054 104361 43747 3029 93677 114240
12898 114240 66221 88383 104559 99685 92306 71556 54696 2433 22943 82454 122853 172426
$$ packed form
12982C4806J433m5039j8411K8618J4108m6999N3703Q4165j7138p4137q993j1791
12970e675K0532M0925M1020k0987n6935n5132l5863M8667L3917K0021M7105J9228
12958I6823p1156j7915M9845P3153k4985m5709K1884J6989k9659k5349k2052M111
12946B5980K1358q2389q705P8593k6298m3914L3754p075K1922J5292L3508p377
12934E4649J2243j0037n2638K7251k3975L4998L7519L0417K7934k1388o9542k7883
12922A9548L5997l2419l4002J521O8513J6051j0574R0589P931K8321P590k0549
12910A78517l5143j29772K3677R431J1047r849N7146o93o0614m0718R0648K0563
12898A14240m8019K2162J6176m874p379k0750j6860n2263K0510N9511M0399M9573
$$ plain form
12886 172426 197458 225626 259200 228579 172739 200918 195445 140675 107764 117930 129432 153431
12874 153431 185111 180372 202041 173716 114090 72946 64774 29031 68955 79458 92120 109395
12862 109395 92633 68283 66857 55119 43844 40686 108774 128781 124540 104477 129282 105560
12850 105560 48357 962 13358 3824 44134 100272 120666 127887 147703 149147 128606 177398
12838 177398 185232 173204 75123 86425 103958 67669 115583 145534 147790 122059 118947 128101
12826 128101 124765 108270 124436 147279 161329 165144 142468 104805 101570 131805 111586 98223
12814 98223 76785 96133 107192 112076 122071 132323 176432 155309 149323 181090 216539 225232
12802 225232 209543 246784 287156 305311 294574 264198 226387 229690 277658 277004 332669 303800
$$ packed form
12886A72426K5032K8168L3574l0621n5840K8179n473n4770l2911J0166J1502K3999
12874A53431L1680m739K1669k8325n9626m1144q172l5743L9924J0503J2662J7275
12862A09395j6762k4350j426j1738j1275l158O8088K0007m241k0063K4805k3722
12850A05560n7203m7395J2396r534M0310N6138K0394P221J9816J444k0541M8792
12838A77398P834j2028r8081J1302J7533l6289M7914K9951K256k5731l112R154
12826A28101l336j6495J6166K2843J4050L815k2676l7663l235L0235k0219j3363
12814I8223k1438J9348J1059M884R995J0252M4109k1123n986L1767L5449Q693
12802B25232j5689L7241M0372J8155j0737l0376l7811L303M7968o54N5665k8869
$$ plain form
12790 303800 265312 236776 256089 304094 329616 324546 262786 188709 142862 160162 116886 74158
12778 74158 78031 128266 166683 245530 304409 266583 277860 280462 318650 335556 303664 252422
12766 252422 267152 314901 297449 252982 182822 169241 177308 142919 157058 133938 88263 127122
12754 127122 199848 153073 187489 270549 350040 390517 444332 499372 525083 464330 395887
12743 395887 495364 599271 628394 655609 642853 594738 513043 502654 514865 540907 541460 529518
12731 529518 556521 562647 514528 464372 464908 496308 490182 549787 592802 592941 633505 622753 676337
12718 676337 736338 745338 760721 737121 681210 700071 729391 802014 836286 834233 844883 849634
12706 849634 830354 843062 798789 805932 863720 908246 830215 872990 942141 960340 918030 884150
$$ packed form
12790C03800l8488k8536J9313M8005K5522n070o1760p4077m5847J7300m3276m2728
12778G4158L873N0235L8417P8847N8879l7826J1277K602L8188J6906l1892n1242
12766B52422J4730M7749j7452m4467p0160j3581Q067l4389J4139k3120m5675L8859
12754A27122P2726m6775L4416Q3060P9491M0477N3815N5040K5711o0753o8443
12743C95887R9477J03907K9123K7215j2756m8115q1695j0389J2211K6042N53j1942
12731E29518K7003O126m8119n0156N36L1400o126N9605M3015J39M0564j0752N3584
12718F76337O0001R000J5383k3600n5911J8861K9320P2623L4272k053J0650M751
12706H49634j9280J2708m4273P143N7788M4526p8031M2775O9151J8199m2310l3880
$$ plain form
12694 884150 872605 948209 991155 1002880 961559 969941 983566 1008614 1025780 1045005 1119300 1188002
12682 1188002 1173722 1170397 1189581 1214212 1222061 1234590 1289992 1347109 1372284 1487218 1561574
12671 1561574 1552345 1521598 1549789 1556450 1539733 1633151 1732655 1825711 1971874 2041068 2033245 2019713
12659 2019713 2082699 2131257 2132749 2206474 2295239 2431360 2539459 2563653 2654256 2800778 2906561
12648 2906561 3094835 3314724 3513960 3662671 3866830 4118165 4369623 4698850 5063693
12639 5063693 5462695 5954867 6459250 7009917 7733905 8652322 9672744 10831846 12322459
12630 12322459 14146330 16360015 19111507 22578318 26892470 32285660 39219323 48347175
12622 48347175 60558713 76904345 98348340 125818749 159532002 198568591 239959473
$$ packed form
12694H84150j1545P5604M2946J1725m1321Q382J3625K5048J7166J9225P4295O8702
12682A188002j4280l325J9184K4631P849J2529N5402N7117K5175J14934P4356
12671A561574r229l0747K8191O661j6717R3418R9504R3056J46163O9194p823j3532
12659B019713O2986M8558J492P3725Q8765J36121J08099K4194R0603J46522J05783
12648B906561J88274K19889J99236J48711K04159K51335K51458L29227L64843
12639E063693L99002M92172N04383N50667P23988R18417J020422J159102J490613
12630A2322459J823871K213685K751492L466811M314152N393190O933663R127852
12622D8347175J2211538J6345632K1443995K7470409L3713253L9036589M1390882
$$ plain form
12615 239959473 275464490 293425589 288087533 255822250 202352916 149362508 109924815
12608 109924815 84003475 67217107 55989264 48070325 42303152 38061786 34786541
12601 34786541 32201448 30039812 28093519 26394367 25048209 23848662 22926509 22328660
12593 22328660 21924512 21598645 21452406 21313879 20823429 19949878 18915192 17790963 16639586
12584 16639586 15549760 14545380 13668418 12893327 12197256 11562079 10897234 10358169 9845668
12575 9845668 9327671 8835883 8379059 7925250 7439097 6964965 6564289 6229341 5864655
12566 5864655 5536451 5218278 4950867 4733671 4530279 4296695 4084999 3839488 3624403
12557 3624403 3490660 3382931 3261297 3136884 3022702 2904396 2790480 2666945 2550731
$$ packed form
12615B39959473L5505017J7961099n338056l2265283n3469334n2990408l9437693
12608A09924815k5921340j6786368j1227843p918939n767173m241366l275245
12601C4786541k585093k161636j946293j699152j346158j199547r22153n97849
12593B2328660m04148l25867j46239j38527m90450q73551j034686j124229j151377
12584A6639586j089826j004380q76962p75091o96071o35177o64845n39065n12501
12575I845668n17997m91788m56824m53809m86153m74132m00676l34948l64686
12566E864655l28204l18173k67411k17196k03392k33584k11696k45511k15085
12557C624403j33743j07729j21634j24413j14182j18306j13916j23535j16214
$$ plain form
12548 2550731 2436436 2250925 2082060 1939977 1825259 1811785 1765582 1730736 1673376 1555038
12538 1555038 1473276 1418622 1448249 1425473 1302614 1194167 1152069 1125188 1112770 1056833 1052735
12527 1052735 1103081 1091436 1015728 930608 862933 809284 820303 844604 828805 784996 743691
12516 743691 698353 663134 645637 654306 627416 622866 568450 471119 431560 427051 439512 458331
12504 458331 456317 464511 491931 509140 444047 336219 280793 317204 381556 427162 452902 446649
12492 446649 393283 372147 388895 387459 405092 449650 446220 479833 538480 497747 475657 504223
12480 504223 564776 576089 509064 404747 396382 431114 459133 477995 455394 429072 444668
12469 444668 432283 450119 409205 383511 363846 373487 392767 369021 351551 329204 315388 408418
$$ packed form
12548B550731j14295j85511j68865j42083j14718j3474m6203l4846n7360j18338
12538A555038q1762n4654K9627k2776j22859j08447m2098k6881j2418n5937m098
12527A052735N0346j1645p5708q5120o7675n3649J1019K4301j5799m3809m1305
12516G43691m5338l5219j7497Q669k6890m550n4416r7331l9559m509J2461J8819
12504D58331k014Q194K7420J7209o5093j07828n5426L6411O4352M5606K5740o253
12492D46649n3366k1136J6748j436J7633M4558l430L3613N8647m0733k2090K8566
12480E04223O0553J1313o7025j04317q365L4732K8019J8862k2601k6322J5596
12469D44668j2385J7836m0914k5694j9665R641J9280k3746j7470k2347j3816R3030
$$ plain form
12457 408418 463928 383183 331303 364795 367456 358050 369174 367782 379441 438492 463459 471963
12445 471963 472250 488114 527220 565633 528655 512460 447975 487631 535937 522039 537989 519814
12433 519814 476302 446061 423758 478899 523033 521133 517056 508502 553300 525130 467120 458545
12421 458545 436638 399062 366756 392463 387334 409706 384780 345315 385472 439735 399137 412143
12409 412143 473522 500544 402169 339006 326328 361680 378626 358328 321595 269339 230653
12398 230653 173900 171169 206660 237292 286647 359119 389667 357278 340436 280317 275825 308590
12386 308590 306113 340686 283916 186375 214849 218136 218495 201918 229615 286044 306315 292584
12374 292584 272786 259698 235077 205620 213565 229274 219007 240779 280732 308922 289587 274975
$$ packed form
12457D08418N5510q0745n1880L3492K661r406J1124j392J1659N9051K4967Q504
12445D71963K87J5864L9106L8413l6978j6195o4485L9656M8306j3898J5950j8175
12433E19814m3512l0241k2303N5141M4134j900m077q554M4798k8170n8010q575
12421D58545k1907l7576l2306K5707n129K2372k4926l9465M0157N4263m0598J3006
12409D12143O1379K7022r8375o3163j2678L5352J6946k0298l6733n2256l8686
12398B30653n6753k731L5491L0632M9355P2472L0548l2389j6842o0119m492L2765
12386C08590k477L4573n6770r7541K8474L287L59j6577K7697N6429K0271j3731
12374B92584j9798j3088k4621k9457P945J5709j0267K1772L9953K8190j9335j4612
$$ plain form
12362 274975 297575 346667 364340 333240 328868 353592 320756 235741 197835 179333 229386 261211
12350 261211 243350 260802 262631 294586 296661 301740 302996 262627 244700 257782 279553 309735
12338 309735 262959 218076 214813 211358 213266 158965 135614 181697 235509 246062 216138 224692
12326 224692 216748 148214 137736 121837 133109 174256 193073 176722 189360 217782 255579 234576
12314 234576 244272 234035 184256 210961 200623 185499 194104 237258 232513 201518 222711 190001
12302 190001 212788 233146 234303 252506 230398 221168 252678 213921 171535 161027 191383 192118
12290 192118 223977 214639 195266 182459 157611 188989 181531 171488 141904 110420 107824 172670
12278 172670 178503 187376 209980 214866 235791 205932 89358 65295 78463 74884 114138 162263
$$ packed form
12362B74975K2600M9092J7673l1100m372K4724l2836q5015l7906j8502N0053L1825
12350B61211j7861J7452J829L1955K075N079J256m0369j7927J3082K1771L0182
12338C09735m6776m4883l263l455J908n4301k3351M6083N3812J0553k9924Q554
12326B24692p944o8534j0478j5899J1272M1147J8817j6351J2638K8422L7797k1003
12314B34576R696j0237m9779K6705j0338j5124Q605M3154m745l0995K1193l2710
12302A90001K2787K0358J157J8203k2108r230L1510l8757m2386j0508L0356P35
12290A92118L1859r338j9373j2807k4848L1378p458j0043k9584l1484k596O4846
12278A72670N833Q873K2604M886K0925k9859j16574k4063J3168l579L9254M8125
$$ plain form
12266 162263 199601 199271 168684 132010 120853 150237 152537 115366 121384 101132 67314 52752
12254 52752 108027 109160 149157 200480 234254 223015 161951 145841 133533 112721 95282 89535
12242 89535 99183 104796 143433 225721 273495 274630 238845 173986 131145 106594 155749 187174
12230 187174 164314 85292 40882 98699 136308 152007 172765 118761 131756 163523 155099 200762
12218 200762 183860 139110 128251 199635 211746 145698 112289 100638 96431 148852 144032 125955
12206 125955 142155 152248 179453 199322 177808 166217 160809 121699 104368 84177 86085 78755
12194 78755 105540 150308 216664 255452 284736 256566 188755 224000 240289 250111 275090 258646
12182 258646 258538 272971 282812 236339 263935 268555 242385 276231 246365 167826 175825 252987
$$ packed form
12266A62263L7338l30l0587l6674j1157K9384K300l7171O018k0252l3818j4562
12254E2752N5275J133L9997N1323L3774j1239o1064j6110j2308k0812j7439n747
12242H9535R648N613L8637Q2288M7774J135l5785o4859m2841k4551M9155L1425
12230A87174k2860p9022m4410N7817L7609J5699K0758n4004J2995L1767q424M5663
12218B00762j6902m4750j0859P1384J2111o6048l3409j1651m207N2421m820j8077
12206A25955J6200J0093K7205J9869k1514j1591n408l9110j7331k0191J908p330
12194G8755K6785M4768O6356L8788K9284k8170o7811L5245J6289R822K4979j6444
12182B58646j08J4433R841m6473K7596M620k6170L3846k9866p8539P999P7162
$$ plain form
12170 252987 281801 282099 294487 279989 257632 237213 230441 206036 208773 266759 312597 297548
12158 297548 299255 332993 375713 371270 389641 425208 492277 632275 795283 986269 1191666
12147 1191666 1409178 1513510 1591292 1556876 1462355 1269521 1024130 825921 683050 580398
12137 580398 533389 458963 399082 354604 348766 342356 297947 249384 220158 185267 240289 313631
12125 313631 343460 347698 274838 245866 279682 322914 300310 259090 245651 226360 243371 224223
12113 224223 201209 195030 203285 182731 211978 253316 231332 177578 141732 161834 188418 215660
12101 215660 245107 180795 190100 206903 193672 175005 192641 197894 193171 142423 129741 130436
12089 130436 135806 121196 112940 127195 182710 193954 192519 175642 195246 247589 215133 161228
$$ packed form
12170B52987K8814K98J2388j4498k2357k0419o772k4405K737N7986M5838j5049
12158B97548J707L3738M2720m443J8371L5567O7069J39998J63008J90986K05397
12147A191666K17512J04332P7782l4416r4521j92834k45391j98209j42871j02652
12137E80398m7009p4426n9881m4478n838o410m4409m8563k9226l4891N5022P3342
12125C13631K9829M238p2860k8972L3816M3232k2604m1220j3439j9291J7011j9148
12113B24223k3014o179Q255k0554K9247M1338k1984n3754l5846K0102K6584K7242
12101B15660K9447o4312R305J6803j3231j8667J7636N253m723n0748j2682O95
12089A30436N370j4610q256J4255N5515J1244j435j6877J9604N2343l2456n3905
$$ plain form
12077 161228 146557 114472 100068 144970 179444 151178 106055 135663 165722 226758 250379
12066 250379 227176 253683 284045 283805 282904 215643 139500 105989 96572 131536 99170 144020
12054 144020 197159 164627 121869 114757 118879 123720 112640 123929 155399 135721 143179 199051
12042 199051 247234 266324 284399 324714 288936 282781 346295 318260 277613 219178 146356 130405
12030 130405 149693 217066 226404 240262 248446 198987 207500 274511 317815 267510 219522 247056
12018 247056 302494 340104 353096 345606 283829 258470 243306 258988 301184 267916 297594 298532
12006 298532 304675 314489 340597 397625 432246 423734 355586 298283 361894 416954 389752 353279
11994 353279 339095 315140 310397 311418 325080 344042 332291 372792 413557 441121 437516 452873
$$ packed form
12077A61228j4671l2085j4404M4902L4474k8266m5123K9608L0059O1036K3621
12066B50379k3203K6507L0362k40r01o7261p6143l3511r417L4964l2366M4850
12054A44020N3139l2532m2758p112M122M841j1080J1289L1470j9678P458N5872
12042A99051M8183J9090J8075M0315l5778o155O3514k8035m0647n8435p2822j5951
12030A30405J9288O7373R338J3858Q184m9459Q513O7011M3304n0305m7988K7534
12018B47056N5438L7610J2992p490o1777k5359j5164J5682M2196l3268K9678R38
12006B98532O143R814K6108N7028L4621q512o8148n7303O3611N5060k7202l6473
11994C53279j4184k3955m743J021J3662J8962j1751M0501M0765K7564l605J5357
$$ plain form
11982 452873 433418 437003 442599 489565 458616 499845 566084 552906 557161 542067 541156 549761 541712
11969 541712 520839 533337 547942 614850 671761 645136 624936 598379 642702 687991 683238 694801
11957 694801 713278 747925 808318 810534 834505 870587 867142 889912 973697 1018646 1085310 1110072
11945 1110072 1099679 1194705 1334947 1432988 1441842 1540696 1623805 1748894 1902840 2104685 2301487
11934 2301487 2498601 2673616 2910098 3273504 3667186 4185795 4787680 5548233 6515987
11925 6515987 7664641 9128999 11108296 13717777 17098800 21675691 27797055 35841552
11917 35841552 46319855 59362074 74711510 91556704 106933856 116080283 116582598
11910 116582598 107085446 87769300 65632988 47816239 35748922 27974869 22911011
$$ packed form
11982D52873j9455L585N596M6966l0949M1229O6239j3178M255j5094r11Q605q049
11969E41712k0873J2498J4605O6908N6911k6625k0200k6557M4323M5289m753J1563
11957F94801J8477L4647O0393K216K3971L6082l445K2770Q3785M4949O6664K4762
11945A110072j0393R5026J40242R8041Q854R8854Q3109J25089J53946K01845J96802
11934B301487J97114J75015K36482L63406L93682N18609O01885P60553R67754
11925F515987J148654J464358J979297K609481L381023M576891O121364Q044497
11917C5841552J0478303J3042219J5349436J6845194J5377152R146427N02315
11910A16582598r497152j9316146k2136312j7816749j2067317p774053n063858
$$ plain form
11903 22911011 19390927 16832055 15023563 13617075 12512101 11630156 10887717 10255130
11895 10255130 9830632 9500326 9190409 8952710 8755407 8587815 8608241 8605216 8444093 8090533
11885 8090533 7687413 7319657 6900018 6455647 6019277 5669290 5364112 5074899 4823061
11876 4823061 4608543 4404332 4161930 3898342 3696155 3470460 3205837 2965799 2767045
11867 2767045 2600572 2451547 2331266 2225110 2137956 1976769 1865927 1759723 1637668 1554328
11857 1554328 1455325 1368502 1330670 1370471 1313001 1279602 1257642 1235979 1166687 1114517 1036128
11846 1036128 1006616 899842 827059 832130 859511 802502 776792 823325 826003 786164 732307
11835 732307 732377 670102 569964 558758 539930 473532 477140 477008 441769 378702 330727 316601
$$ packed form
11903B2911011l520084k558872j808492j406488j104974q81945p42439o32587
11895A0255130m24498l30306l09917k37699j97303j67592K0426l025j61123l53560
11885H090533m03120l67756m19639m44371m36370l49987l05178k89213k51838
11876D823061k14518k04211k42402k63588k02187k25695k64623k40038j98754
11867B767045j66473j49025j20281j06156q7154j61187j10842j06204j22055q3340
11857A554328r9003q6823l7832L9801n7470l3399k1960k1663o9292n2170p8389
11846A036128k9512j06774p2783N071K7381n7009k5710M6533K678l9839n3857
11835G32307P0o2275j00138j1206j8828o6398L608j32l5239o3067m7975j4126
$$ plain form
11823 316601 347041 320240 333047 335255 305929 289705 273139 262805 292535 264856 270240 270383
11811 270383 244991 217709 159662 172303 205645 183646 230567 209394 169270 145018 160738
11800 160738 169589 189063 212560 195223 186768 187869 202786 162841 113718 169163 261563 260535
11788 260535 247368 219478 194373 207249 231450 240286 217399 140346 155321 219212 245292 242595
11776 242595 240481 195710 135389 187986 180568 173965 214231 218264 175848 122532 112816 103451 79075
11763 79075 53313 -2644 -49784 19862 63646 46889 11010 10987 41463 65937 65123 74832 114880
11750 114880 175718 156897 148603 139408 166983 131061 144241 203582 212596 190621 179995 172139
11738 172139 199934 270634 264585 222153 141059 78546 76986 88342 92112 148232 132243 106012
$$ packed form
11823C16601L0440k6801J2807K208k9326j6224j6566j0334K9730k7679N384J43
11811B70383k5392k7282n8047J2641L3342k1999M6921k1173m0124k4252J5720
11800A60738Q851J9474K3497j7337q455J101J4917l9945m9123N5445R2400j028
11788B60535j3167k7890k5105J2876K4201Q836k2887p7053J4975O3891K6080k697
11776B42595k114m4771o0321N2597p418o603M0266M033m2416n3316r716r365k4376
11763G9075k5762n5957m7140O9646M3784j6757l5879k3L0476K4474q14R709M0048
11750A14880O0838j8821q294r195K7575l5922J3180N9341R014k1975j0626p856
11738A72139K7795P0700o049m2432q1094o2513j560J1356L770N6120j5989k6231
$$ plain form
11726 106012 190140 171649 206566 177003 100707 74891 110743 120344 99322 77486 113019 131900
11714 131900 119493 95545 71948 82691 88466 43311 103765 143558 148442 148108 170086 131722
11702 131722 105691 97312 131423 189677 139304 130913 118443 128911 148820 118100 86791 29628
11690 29628 45664 73916 14901 20819 51977 84189 83094 70827 101558 114227 122420 83775
11678 83775 68595 157805 209938 142785 49844 22826 -21454 -26677 -15613 67932 127593 100398
11666 100398 82746 47222 33168 74179 106717 95470 93979 117215 157463 120062 79085 33938
11654 33938 16615 44316 102301 114387 102089 45219 -12851 32027 62939 64628 62393 60406
11642 60406 77227 85744 98930 98950 73419 66116 72881 94549 76880 62874 28747 -7467 -36453
$$ packed form
11726A06012Q4128j8491L4917k9563p6296k5816L5852R601k1022k1836L5533J8881
11714A31900j2407k3948k3597J0743N775m5155O0454L9793M884l34K1978l8364
11702A31722k6031q379L4111N8254n0373q391j2470J0468J9909l0720l1309n7163
11690B9628J6036K8252n9015N918L1158L2212j095j2267L0731J2669Q193l8645
11678H3775j5180Q9210N2133o7153r2941k7018m4280n223J1064Q3545N9661k7195
11666A00398j7652l5524j4054M1011L2538j1247j491K3236M0248l7401m0977m5147
11654C3938j7323K7701N7985J2086j2298n6870n8070M4878L0912J689k235j987
11642F0406J6821Q517J3186K0k5531p303O765K1668j7669j4006l4127l6214k8986
$$ plain form
11629 -36453 -47218 26558 62916 78093 50020 1439 48634 58981 28451 73959 99370 75988
11617 75988 97624 84281 125627 139469 75858 53237 58811 99755 113458 31982 39117 91794
11605 91794 130958 116498 131643 115894 49798 -3636 -24916 -5536 16721 -1028 -37438 -12365
11593 -12365 30210 40339 20811 -18712 12107 -10264 -3157 12017 -38587 -40664 12872 78010
11581 78010 72356 73427 70561 37400 -3897 4182 64340 63890 109046 185976 96885 36979 -24362
11568 -24362 -29531 70168 101442 84382 35234 -8055 19636 31739 14970 10668 -24674 -14807
11556 -14807 5595 48399 112062 85703 51333 64710 65831 75473 42561 100112 109655 133520
11544 133520 101449 78204 57516 70188 111089 119329 56028 39955 14038 15659 18282 73693
$$ packed form
11629c6453j0765P3776L6358J5177k8073m8581M7195J0347l0530M5508K5411k3382
11617G5988K1636j3343M1346J3842o3611k2621N574M0944J3703q1476P135N2677
11605I1794L9164j4460J5145j5749o6096n3434k1280J9380K2257j7749l6410K5073
11593a2365M2575J0129j9528l9523L0819k2371P107J5174n0604k077N3536O5138
11581G8010n654J071k866l3161m1297Q079O0158m50M5156P6930q9091n9906o1341
11568b4362n169R9699L1274j7060m9148m3289K7691J2103j6769m302l5342R867
11556a4807K0402M2804O3663k6359l4370J3377J121R642l2912N7551R543K3865
11544A33520l2071k3245k0688J2672M0901Q240o3301j6073k5917J621K623N5411
$$ plain form
11532 73693 110958 40477 -38601 -50124 -2847 43324 50125 60932 46727 53165 44123 8952
11520 8952 -34469 -52257 -25095 -7788 28479 -39004 -17687 17812 14583 -12030 -2594 50822
11508 50822 33221 80700 65247 35224 1606 9816 22078 62964 39747 65573 72906 48459
11496 48459 47849 76865 111782 132932 122588 85978 14518 -44854 -53704 -43568 -40829 -47662 14898
11483 14898 65323 45287 39165 72261 51449 82339 100815 136078 158564 109120 64263 81907
11471 81907 49025 33283 106962 68968 52185 65063 103234 99881 106882 76630 83615 83507 100196
11458 100196 117470 111825 91869 29056 6124 38010 78439 56193 62065 28024 19327 13528
11446 13528 -8222 77780 139181 149426 70560 12467 57499 65341 54307 26023 -22503 -47725
$$ packed form
11532G3693L7265p0481p9078j1523M7277M6171O801J0807j4205O438r042l5171
11520H952m3421j7788K7162J7307L6267o7483K1317L5499l229k6613R436N3416
11508E0822j7601M7479j5453l0023l3618Q210J2262M0886k3217K5826P333k4447
11496D8459o10K9016L4917K1150j0344l6610p1460n9372q850J0136K739o833O2560
11483A4898N0425k0036o122L3096k0812L0890J8476L5263K2486m9444m4857J7644
11471H1907l2882j5742P3679l7994j6783J2878L8171l353P001l0252O985j08J6689
11458A00196J7274n645j9956o2813k2932L1886M0429k2246N872l4041q697n799
11446A3528k1750Q6002O1401J0245p8866n8093M5032P842j1034k8284m8526k5222
$$ plain form
11434 -47725 -82717 -96242 -89406 -53676 6048 40463 -32353 -83120 -73583 -52616 -7989 20180
11422 20180 39847 -113 30308 -43832 -107490 -86431 -48934 44514 30508 -12454 -36572 -23895
11410 -23895 33736 74361 68448 42813 49536 57636 33892 -10037 -19448 -20633 -53301 -53028 -25095
11397 -25095 -6586 -7879 -30835 -76714 -79023 2765 22505 -13480 -24952 -22183 811 971 13180
11384 13180 2762 -23357 -26508 -45287 38118 79067 72710 4981 -12271 -35758 -81977 -67024
11372 -67024 -65085 -54628 -65470 -69332 -35858 6978 59982 94893 68985 -12574 -26033 -75495
11360 -75495 -68226 -12843 18777 39765 23513 59187 108070 106401 85416 21284 -9529 -42339
11348 -42339 -37533 -3960 -13423 -19539 -59331 -100640 -93375 -66707 -60531 -32263 14795 36079 30320
$$ packed form
11434d7725l4992j3525O836L5730N9724L4415p2816n0767R537K0967M4627K8169
11422B0180J9667l9960L0421p4140o3658K1059L7497R3448j4006m2962k4118J2677
11410b3895N7631M0625n913k5635O723Q100k3744m3929r411j185l2668K73K7933
11397b5095J8509j293k2956m5879k309Q1788J9740l5985j1472K769K2994J60J2209
11384A3180j0418k6119l151j8779Q3405M0949o357o7729j7252k3487m6219J4953
11372f7024J939J0457j0842l862L3474M2836N3004L4911k5908q1559j3459m9462
11360g5495P269N5383L1620K0988j6252L5674M8883j669k0985o4132l0813l2810
11348d2339M806L3573r463o116l9792m1309P265K6668O176K8268M7058K1284n759
$$ plain form
11335 30320 9021 -26918 -75270 -95580 -53381 -26995 10429 61834 59688 74963 155305 158663
11323 158663 87472 16625 -7047 -21195 -2575 1932 -31529 -8662 -34734 -59036 -63698 -12650
11311 -12650 12063 -120 -49891 -34148 31905 70750 20281 20662 23617 11494 31326 19534
11299 19534 -45094 -23186 -56467 -68328 -13571 38176 19107 -29132 10405 39872 119651 128428
11287 128428 84507 40381 63299 28602 -35142 -50992 -4865 -27948 -18087 6970 39866 41424
11275 41424 5348 -43080 -1913 6802 43821 28567 20824 -51781 -77882 -53381 -79037 -90953
11263 -90953 -96832 -54768 19693 25898 57904 52880 36516 -17858 2679 37793 87188 126715
11251 126715 77212 -11435 -15651 -7435 38122 53713 35275 17281 25173 37270 -28211 -61443
$$ packed form
11335C0320k1299l5939m8352k0310M2199K6386L7424N1405k146J5275Q0342L358
11323A58663p1191p0847k3672j4148J8620M507l3461K2867k6072k4302m662N1048
11311a2650K4713j2183m9771J5743O6053L8845n0469L81K955j2123J9832j1792
11299A9534o4628K1908l3281j1861N4757N1747j9069m8239L9537K9467P9779Q777
11287A28428m3921m4126K2918l4697o3744j5850M6127k3083R861K5057L2896J558
11275D1424l6076m8428M1167Q715L7019j5254p743p2605k6101K4501k5656j1916
11263i0953n879M2064P4461O205L2006n024j6364n4374K0537L5114M9395L9527
11251A26715m9503q8647m216Q216M5557J5591j8438j7994P892J2097o5481l3232
$$ plain form
11239 -61443 -65431 -46463 -14631 21998 11576 -28901 -55561 -69448 -55193 5214 64446 114169
11227 114169 118303 127479 68682 60069 22664 -22629 -33746 -28600 -29362 -17905 -23038 -6327 42287
11214 42287 21971 1253 40192 57561 89357 93137 62768 29334 23136 18970 -36714 -35208
11202 -35208 -22397 -58552 -47875 3322 -27377 -53229 -76920 -59919 -30040 -94118 -62904 16862
11190 16862 37438 -775 -6507 9881 23942 69891 56042 3013 -20044 -65439 -90633 -60145
11178 -60145 3818 17547 -2356 -41065 -34636 -976 40381 106881 94618 53225 -11483 40653
11166 40653 45575 43288 23422 -3419 32557 113361 115328 89604 109869 34372 -79978 -102802
11154 -102802 -62133 31605 37719 -21653 -32368 -4520 5339 -27467 -84620 -63702 -34890 -12780
$$ packed form
11239f1443l988J8968L1832L6629j0422m0477k6660j3887J4255O0407N9232M9723
11227A14169M134R176n8797q613l7405m5293j1117N146p62J1457n133J6711M8614
11214D2287k0316k0718L8939J7369L1796L780l0369l3434o198m166n5684J506
11202c5208J2811l6155J0677N1197l0699k5852k3691J7001K9879o4078L1214P9766
11190A6862K0576l8213n732J6388J4061M5949j3849n3029k3057m5395k5194L0488
11178f0145O3963J3729j9903l8709O429L3660M1357O6500j2263m1393o4708N2136
11166D0653M922k287j9866k6841L5976Q0804J967k5724K0265p5497j14350k2824
11154a02802M0669R3738O114n9372j0715K7848R859l2806n7153K0918K8812K2110
$$ plain form
11142 -12780 23580 46222 39688 -7819 -28315 -32302 8756 26413 20108 22225 19396 34041 38007
11129 38007 20800 20151 -52807 -87150 -104269 -63783 11848 -19794 -91659 -100927 -73394 -44341
11117 -44341 15631 46766 -41323 -44105 -38891 2814 -4933 3180 44453 57827 41252 48026 63445
11104 63445 -13683 -47317 -53581 -71873 -62513 -15321 -44122 -90810 -120189 -53610 -25858 2597
11092 2597 43180 46602 14979 20341 -24107 -64404 -21481 51361 36096 10874 -5113 19938
11080 19938 64785 69481 60850 23918 19361 -30470 -55591 -7956 -16175 -33748 14823 42277
11068 42277 -20129 -62924 -39258 -64529 -130641 -171702 -120716 -42251 -26908 17482 67224 93212
11056 93212 87444 98464 107832 93000 58643 23535 48666 23731 43892 52944 73654 71869
$$ packed form
11142a2780L6360K2642o534m7507k0496l987M1058J7657o305K117k829J4645L966
11129C8007j7207o49p2958l4343j7119M0486P5631l1642p1865r268K7533K9053
11117d4341N9972L1135q8089k782N214M1705p747Q113M1273J3374j6575O774J5419
11104F3445p7128l3634o264j8292R360M7192k8801m6688k9379O6579K7752K8455
11092B597M0583L422l1623N362m4448m0297M2923P2842j5265k5222j5987K5051
11080A9938M4847M696q631l6932m557m9831k5121M7635q219j7573M8571K7454
11068D2277o2406m2795K3666k5271o6112m1061N0986P8465J5343M4390M9742K5988
11056I3212n768J1020R368j4832l4357l5108K5131k4935K0161R052K0710j785
$$ plain form
11044 71869 70502 34971 73942 146404 180166 97349 74502 95185 182012 198354 165558 177845
11032 177845 200598 235396 211971 229373 216085 230701 220524 187573 214760 195797 235472
11021 235472 298803 340205 320816 264160 241419 281890 282503 316764 297202 208194 204027 201596
11009 201596 220788 219033 222936 254359 231205 135774 124290 179906 217308 179151 125038 179593
10997 179593 202421 200109 148517 95413 112783 107065 98488 58516 9554 -10410 -11344 -472
10985 -472 -40284 -92062 -43325 -25264 -7395 58188 22045 56123 115361 186362 153556 64901
10973 64901 47179 -3625 36275 38837 119519 142260 63619 38127 53927 74291 35669 -24715
10961 -24715 7075 -6045 -3093 1093 -27063 -49703 -27369 8162 45319 64463 63972 30759
$$ packed form
11044G1869j367l5531L8971P2462L3762q2817k2847K0683Q6827J6342l2796J2287
11032A77845K2753L4798k3425J7402j3288J4616j0177l2951K7187j8963L9675
11021B35472O3331M1402j9389n6656k2741M0471O13L4261j9562q9008m167k431
11009B01596J9192j755L903L1423k3154r5431j1484N5616L7402l8157n4113N4555
10997A79593K2828k312n1592n3104J7370n718q577l9972m8962j9964r34J0872
10985d72l9812n1778M8737J8061J7869O5583l6143L4078N9238P1001l2806q8655
10973F4901j7722n0804L9900K562Q0682K2741p8641k5492J5800K0364l8622o0384
10961b4715L1790j3120K952M186k8156k2640K2334L5531L7157J9144m91l3213
$$ plain form
10949 30759 -54293 -72450 -62644 -11574 11830 6681 -936 42718 40644 22829 -3597 -21123
10937 -21123 -23761 -74288 -76529 -61606 -45498 1185 25431 37324 53463 68731 77413 32022
10925 32022 18351 31654 52613 55575 98955 74049 33825 20653 -8683 -17608 -37901 -85628
10913 -85628 -43765 -1015 -1880 -21625 -68910 -52867 -14431 -33422 -36222 -10676 -2920 -9252 29034
10900 29034 -3152 -19777 36704 55811 61892 68972 66457 34233 20733 -84705 -98664 20824
10888 20824 49609 29806 -2747 -17886 -72316 -78711 -35933 -11261 -14835 4431 17787 -9886
10876 -9886 30 49487 66761 88689 93386 65430 85786 105504 82750 46608 -48700 -48418 -25892
10863 -25892 15886 45390 14143 26110 36685 67183 88998 88313 19459 -38839 -23419 29509
$$ packed form
10949C0759q5052j8157R806N1070K3404n149p617M3654k074j7815k6426j7526
10937b1123k638n0527k241J4923J6108M6683K4246J1893J6139J5268Q682m5391
10925C2022j3671J3303K0959K962M3380k4906m0224j3172k9336q925k0293m7727
10913h5628M1863M2750q65j9745m7285J6043L8436j8991k800K5546P756o332L8286
10900B9034l2186j6625N6481J9107O081P080k515l2224j3500j05438j3959J19488
10888B0824K8785j9803l2553j5139n4430o395M2778K4672l574J9266J3356k7673
10876i886R916M9457J7274K1928M697k7956K0356J9718k2754l6142r5308K82K2526
10863b5892M1778K9504l1247J1967J0575L0498K1815o85o8854n8298J5420N2928
$$ plain form
10851 29509 81600 89323 79861 24027 -38649 -38228 -12136 12515 55141 77289 52178 9622
10839 9622 24877 6773 3710 85216 112497 15089 -6577 -1032 -49744 -78052 -48052 31285
10827 31285 69814 47965 -33831 -87993 -86414 -48507 7579 9321 39977 51365 6096 -4556
10815 -4556 -7802 -6584 -778 41059 51844 672 17340 31671 33590 6133 29379 52008 5258
10802 5258 -42723 -44317 -68444 -84637 -88782 -70961 -82700 -59435 -34582 -3314 -15345 -50006
10790 -50006 -73701 -6527 -13079 -49987 -37068 -16276 -3852 11703 -20118 -18887 10737 8914
10778 8914 27317 66620 40980 37145 38012 14181 -33667 -14564 -5007 -10168 -8776 -1574 11778
10765 11778 24756 47917 24675 -32752 -49905 -26935 2294 59810 30825 41435 49042 21233
$$ packed form
10851B9509N2091P723r462n5834o2676M21K6092K4651M2626K2148k5111m2556
10839I622J5255j8104l063Q1506K7281r7408k1666N545m8712k8308L0000P9337
10827C1285L8529k1849q1796n4162J579L7907N6086J742L0656J1388m5269j0652
10815d556l246J218N806M1837J0785n1172J6668J4331J919k7457K3246K2629m6750
10802E258m7981j594k4127j6193m145J7821j1739K3265K4853L1268j2031l4661
10790e0006k3695O7174o552l6908J2919K0792J2424J5555l1821J231K9624j823
10778H914J8403L9303k5640l835Q67k3831m7848J9103R557n161J392P202J3352
10765A1778J2978K3161k3242n7427j7153K2970K9229N7516k8985J0610P607k7809
$$ plain form
10753 21233 -36032 -31354 54428 73122 15407 27140 61234 98217 101453 55494 12818 -27622
10741 -27622 -27550 8239 17995 -21313 3530 68275 48503 45866 84514 135056 111905 84565 77653
10728 77653 91244 103373 122645 123247 71460 117531 142277 77835 103044 72902 37223 34972
10716 34972 61118 104157 173370 160372 196339 198546 180709 139630 86458 107183 72847 66728
10704 66728 86864 128771 182756 150762 145618 219938 238211 276793 312594 366940 394503 336712
10692 336712 306395 272032 270807 292504 272960 307188 346720 343493 295596 285473 323674 344742
10680 344742 318129 260569 251539 232682 238469 266285 335374 353735 390090 404035 302318 269897
10668 269897 284755 313245 334514 345055 405159 489166 468710 489508 496433 464968 502673 528503
$$ packed form
10753B1233n7265M678Q5782J8694n7715J1733L4094L6983L236m5959m2676m0440
10741b7622P2L5789R756l9308K4843O4745j9772k637L8648N0542k3151k7340o912
10728G7653J3591J2129J9272O02n1787M6071K4746o4442K5209l0142l5679k251
10716C4972K6146M3039O9213j2998L5967K207j7837m1079n3172K0725l4336o119
10704F6728K0136M1907N3985l1994n144P4320J8273L8582L5801N4346K7563n7791
10692C36712l0317l4363j225K1697j9544L4228L9532l227m7897j0123L8201K1068
10680C44742k6613n7560r030j8857N787K7816O9089J8361L6355J3945j01717l2421
10668B69897J4858K8490K1269J0541O0104Q4007k0456K0798O925l1465L7705K5830
$$ plain form
10656 528503 514130 497976 519197 548369 561072 558436 591291 594685 599600 629058 656264 694192
10644 694192 692269 725179 807540 891946 961156 1003860 990517 1008065 1051082 1095154 1176770 1279480
10632 1279480 1362567 1470208 1613895 1790146 1987708 2248584 2591705 2968586 3403539 3911000
10622 3911000 4615885 5526994 6635161 8085775 9859013 11927911 14246117 16713085
10614 16713085 19162599 21211796 22638591 23367489 23570666 23686708 24260728 25597668 27931340
10605 27931340 31230744 35267321 39674572 43863006 47003994 48443745 48072473 46352786
10597 46352786 44376764 43331429 43850253 46058551 49743683 54464632 59546167 63809649
10589 63809649 66183998 65908691 62859961 57794604 52269294 47985616 45548963 44866137
$$ packed form
10656E28503j4373j6154K1221K9172J2703k636L2855L394M915K9458K7206L7928
10644F94192j923L2910Q2361Q4406O9210M2704j3343J7548M3017M4072Q1616J02710
10632A279480Q3087J07641J43687J76251J97562K60876L43121L76881M34953N07461
10622C911000P04885R11109J108167J450614J773238K068898K318206K466968
10614A6713085K449514K049197J426795P28898K03177J16042N74020J336940K333672
10605B7931340L299404M036577M407251M188434L140988J439751l71272j719687
10597D6352786j976022j045335N18824K208298L685132M720949N081535M263482
10589F3809649K374349k75307l048730n065357n525310m283678k436653o82826
$$ plain form
10581 44866137 45601601 47355528 49440127 50969600 51111386 49456596 45949447 41259762
10573 41259762 36492958 32619169 30097024 28740674 28198283 28128722 28186086 27944808 27161434
10564 27161434 25585512 23264651 20523881 17756488 15348199 13370765 11887533 10772871
10556 10772871 9852360 9119775 8553577 8062182 7627199 7207810 6767553 6393561 6046716
10547 6046716 5662982 5343187 5096757 4823704 4516075 4342790 4199764 3998162 3843283
10538 3843283 3621183 3359181 3107136 2990142 2908903 2779380 2645464 2452485 2294088 2172765
10528 2172765 2048332 1924904 1754330 1677365 1583003 1479903 1409286 1393253 1327159 1218929
10518 1218929 1115602 1035551 1056838 1074137 1039098 940121 853963 816909 745970 696421 686109
$$ packed form
10581D4866137P35464J753927K084599J529473J41786j654790l507149m689685
10573D1259762m766804l873789k522145j356350n42391o9561N7364k41278p83374
10564B7161434j575922k320861k740770k767393k408289j977434j483232j114662
10556A0772871r20511p32585n66198m91395m34983m19389m40257l73992l46845
10547F046716l83734l19795k46430k73053l07629j73285j43026k01602j54879
10538C843283k22100k62002k52045j16994q1239j29523j33916j92979j58397j21323
10528B172765j24433j23428j70574p6965r4362j03100p0617j6033o6094j08230
10518A218929j03327q0051K1287J7299l5039r8977q6158l7054p0939m9549j0312
$$ plain form
10507 686109 677863 660272 666804 697363 638757 576954 565821 516282 486148 451892 409410 391846
10495 391846 433838 487391 460281 408755 406381 349176 289887 272161 267213 290542 294293 237249
10483 237249 211113 198040 200986 239249 186516 171043 96264 79563 105321 151523 142725 100428
10471 100428 126020 150930 170563 143612 116419 140593 125461 144341 204729 189769 112999
10460 112999 69853 47509 128775 195359 177602 199864 197752 207736 197554 176386 126792 114864
10448 114864 123596 136683 159337 164404 136518 192395 239004 208262 223147 193138 187586 194519
10436 194519 172399 127138 149690 195687 165128 127279 141532 153851 171336 129111 154940
10425 154940 169669 161568 129369 125085 172314 157533 102203 69514 99493 136277 193458 177626
$$ packed form
10507F86109q246j7591O532L0559n8606o1803j1133m9539l0134l4256m2482j7564
10495C91846M1992N3553k7110n1526k374n7205n9289j7726m948K3329L751n7044
10483B37249k6136j3073K946L8263n2733j5473p4779j6701K5758M6202q798m2297
10471A00428K5592K4910J9633k6951k7193K4174j5132J8880O0388j4960p6770
10460A12999m3146k2344Q1266O6584j7757K2262k112R984j0182k1168m9594j1928
10448A14864Q732J3087K2654N067k7886N5877M6609l0742J4885l0009n552O933
10436A94519k2120m5261K2552M5997l0559l7849J4253J2319J7485m2225K5829
10425A54940J4729q101l2199m284M7229j4781n5330l2689K9979L6784N7181j5832
$$ plain form
10413 177626 204952 214473 211246 164554 206849 174066 150093 176451 190155 170278 226564 242659
10401 242659 253856 247810 270309 258576 232264 174587 130000 179205 152022 149019 158792 162673
10389 162673 163973 170790 165118 171113 208554 264540 323185 311591 333093 310068 380477 427741
10377 427741 489897 490062 444310 473068 481270 443857 479580 545857 552460 517364 467141 439245
10365 439245 392637 344697 305456 270019 203379 212632 251879 221963 175334 163244 145663 101104
10353 101104 101923 89184 105841 107067 86974 151476 160283 167193 166111 127361 201676 202467 165876
10340 165876 138583 87602 26767 495 13806 77843 110144 135570 177421 194920 124390
10329 124390 98754 67990 47080 73769 113058 140300 145577 104979 66168 78720 82943 77794
$$ packed form
10413A77626K7326R521l227m6692M2295l2783k3973K6358J3704j9877N6286J6095
10401B42659J1197o046K2499j1733k6312n7677m4587M9205k7183l003R773L881
10389A62673J300O817n672N995L7441N5986N8645j1594K1502k3025P0409M7264
10377D27741O2156J65m5752K8758Q202l7413L5723O6277O603l5096n0223k7896
10365D39245m6608m7940l9241l5437o6640R253L9247k9916m6629j2090j7581m4559
10353A01104Q19j2739J6657J226k0093O4502Q807O910j082l8750P4315P91l6591
10340A65876k7293n0981o0835k6272J3311O4037L2301K5426M1851J7499p0530
10329A24390k5636l0764k0910K6689L9289K7242N277m0598l8811J2552M223n149
$$ plain form
10317 77794 143488 158054 104713 56617 56873 107686 129038 120713 68361 41605 37402 33289 62036
10304 62036 112804 153215 117319 106184 106474 80941 10344 4372 2061 4353 41724 80307 63329
10291 63329 58389 57011 45907 10087 25621 9413 -10566 14553 29845 36610 119010 154696
10279 154696 125166 77518 84270 132765 213132 237961 300318 440470 478319 496751 557165
10268 557165 612868 623440 641170 684298 653570 619275 575563 505159 392474 358364 295209
10257 295209 228600 173900 119845 118226 140967 141944 125079 135476 109288 84730 70645 139905
10245 139905 197284 204579 162645 90190 59368 69018 124626 188974 134779 53325 18518 -15618
10233 -15618 11945 63212 65512 49390 47700 21182 28434 15873 -13177 12742 25300 6633
$$ packed form
10317G7794O5694J4566n3341m8096K56N0813K1352q325n2352k6756m203m113K8747
10304F2036N0768M0411l5896j1135K90k5533p0597n972k311K292L7371L8583j6978
10291F3329m940j378j1104l5820J5534j6208j9979K5119J5292O765Q2400L5686
10279A54696k9530m7648O752M8495Q0367K4829O2357J40152L7849J8432O0414
10268E57165N5703J0572J7730M3128l0728l4295m3712p0404j12685l4110o3155
10257B95209o6609n4700n4055j619K2741R77j6865J0397k6188k4558j4085O9260
10245A39905N7379P295m1934p2455l0822R650N5608O4348n4195q1454l4807l4136
10233a5618K7563N1267K300j6122j690k6518P252j2561k9050K5919J2558j8667
$$ plain form
10221 6633 7553 61681 92800 58795 11626 16905 28322 28727 14067 -17442 14191 62913 68549
10208 68549 29682 64537 42346 9107 12183 35093 29910 44919 40909 30047 66176 12650
10196 12650 -11106 5577 11285 8539 5325 30667 94185 93354 53524 32269 -59106 -40117 3251
10183 3251 32745 41754 26510 48493 108665 115761 135507 133854 153699 134156 136533 128030 139104
10170 139104 147157 246172 278095 245184 290301 289548 277553 247773 221358 215571 212089 271351
10158 271351 289044 265185 283549 307778 318250 333976 342596 265261 257063 280061 293565 282044
10146 282044 290705 300950 319574 356216 314692 297336 273281 272813 295162 258601 219625 185309
10134 185309 210416 230247 204703 193456 205556 185686 140066 131337 105156 100152 170758 130873
$$ packed form
10221F633R20N4128L1119l4005m7169N279J1417M05j4660l1509L1633M8722N636
10208F8549l8867L4855k2191l3239L076K2910n183J5009m010j0862L6129n3526
10196A2650k3756J6683N708k746l214K5342O3518q31l9830k1255r1375J8989M3368
10183C251K9494R009j5244K1983O0172P096J9746j653J9845j9543K377q503J1074
10170A39104Q053R9015L1923l2911M5117p53j1995k9780k6415n787l482N9262
10158B71351J7693k3859J8364K4229J0472J5726Q620p7335q198K2998J3504j1521
10146B82044Q661J0245J8624L6642m1524j7356k4055m68K2349l6561l8976l4316
10134A85309K5107J9831k5544j1247J2100j9870m5620q729k6181n004P0606l9885
$$ plain form
10122 130873 88980 99769 127320 164909 155771 132880 145676 149921 112403 51808 15201 -20849
10110 -20849 -8384 19821 4373 -13657 -12666 -12482 24577 42832 52625 7662 -4392 -579 44266
10097 44266 45433 -3669 41491 105563 81313 66475 -29819 -59636 -11857 22187 32824 -3721
10085 -3721 -39626 -63293 -26282 18551 41860 548 9067 38721 29103 34379 71485 103885
10073 103885 94340 3722 -43305 -26462 -21812 -11831 -24964 -24705 14451 -8865 55115 105815
10061 105815 55616 -24583 -97001 -101910 -108933 -97814 -124137 -54886 2602 -4570 -38658 -52382
10049 -52382 -48533 -55415 -36763 -19886 45062 30104 -26569 -38354 -55138 -41284 -35443 -54860
10037 -54860 -80475 -77807 -43204 15080 21332 40922 46156 -11516 7483 55103 6695 -61639
$$ packed form
10122A30873m1893J0789K7551L7589r138k2891J2796M245l7518o0595l6607l6050
10110b0849J2465K8205j5448j8030R91J84L7059J8255R793m4963j2054L813M4845
10097D4266J167m9102M5160O4072k4250j4838r6294k9817M7779L4044J0637l6545
10085c721l5905k3667L7011M4833K3309m1312Q519K9654r618N276L7106L2400
10073A03885r545r0618m7027J6843M650R981j3133K59L9156k3316O3980N0700
10061A05815n0199q0199p2418m909p023J1119k6323O9251N7488p172l4088j3724
10049e2382L849o882J8652J6877O4948j4958n6673j1785j6784J3854N841j9417
10037e4860k5615K668L4603N8284O252J9590N234n7672J8999M7620m8408o8334
$$ plain form
10025 -61639 -51261 2841 -29524 -44704 -64920 -37752 -21860 -47084 -20696 -35263 -92622 -48812
10013 -48812 -3657 -39919 -68100 -88698 -122963 -156530 -100106 -42604 -10223 -64227 -133921 -212114
10001 -212114 -174508 -138267 -111055 -87803 -100694 -103125 -74157 -40571 528 20685 12001 62535
9989 62535 112397 101034 56938 42687 41980 29064 57762 47583 79483 70729 24877 5131
9977 5131 -20136 -36940 11071 46664 53113 50418 16450 -18508 -18408 9793 33230 56963 79510
9964 79510 38129 -12479 -9089 -16741 -23579 -9969 5101 -510 -41090 -28478 -50704 -36591 21918
9951 21918 70801 73825 40760 4981 -38342 -26607 19159 64221 118694 151025 110976 96301
9939 96301 72664 37840 -9194 -100025 -85548 -49680 -8333 62681 61228 77465 54819 8565
$$ packed form
10025f1639J0378N4102l2365j5180k0216K7168J5892k5224K6388j4567n7359M3810
10013d8812M5155l6262k8181k0598l4265l3567N6424N7502L2381n4004o9694p8193
10001b12114L7606L6241K7212K3252j2891k431K8968L3586M1099K0157q684N0534
9989F2535M9862j1363m4096j4251p07j2916K8698j0179L1900q754m5852j9746
9977E131k5267j6804M8011L5593O449k695l3968l4958J00K8201K3437K3733K2547
9964G9510m1381n0608L390p652o838J3610J5070n611m0580J2612k2226J4113N8509
9951B1918M8883L024l3065l5779m3323J1735M5766M5062N4473L2331m0049j4675
9939I6301k3637l4824m7034r0831J4477L5868M1347P1014j453J6237k2646m6254
$$ plain form
9927 8565 -25742 -52736 -3927 11438 14599 -22231 -53799 -25963 -15888 -140 5708 -23544
9915 -23544 -33249 -60578 -87840 -97475 -15556 34592 12831 -13134 16461 30345 19000 -17957
9903 -17957 -54898 -35583 -20359 -27953 28197 50331 39054 37932 63249 50888 30982 48107
9891 48107 96551 49966 -1012 3097 -31646 -44144 -51310 -35290 18807 71892 46709 36808
9879 36808 2483 -13085 13554 62765 102027 107730 44862 9232 35269 15054 22082 23367
9867 23367 63233 15205 -726 -15070 -28312 -3606 52610 25979 7378 13872 53625 85321
9855 85321 33202 1913 46831 44464 37079 47386 61616 53292 37325 -4732 -10289 10793 -34339
9842 -34339 -76744 -12512 -6255 -14428 -13324 -28781 -66324 -57919 -95790 -91036 -91288 -61812 -38768
$$ packed form
9927H565l4307k6994M8809J5365L161l6830l1568K7836J0075J5748N848k9252
9915b3544r705k7329k7262r635Q1919N0148k1761k5965K9595J3884j1345l6957
9903a7957l6941J9315J5224p594N6150K2134j1277j122K5317j2361j9906J7125
9891D8107M8444m6585n0978M109l4743j2498p166J6020N4097N3085k5183r901
9879C6808l4325j5568K6639M9211L9262N703o2868l5630K6037k0215P028J285
9867B3367L9866m8028j5931j4344j3242K4706N6216k6631j8601O494L9753L1696
9855H5321n2119l1289M4918k367p385J0307J4230q324j5967m2057n557K1082m5132
9842c4339m2405O4232O257q173J104j5457l7543Q405l7871M754k52K9476K3044
$$ plain form
9829 -38768 -65256 -14860 -45356 -88396 -121054 -111680 -20875 79543 44573 16688 44100 114849
9817 114849 93428 6292 -50780 -11269 -5066 -50217 -97859 -86600 -63031 198 -8862 -26900
9805 -26900 -87146 -107707 -46669 -8315 -20521 1578 30724 29213 -15476 -8128 63866 50926
9793 50926 7202 63255 82333 59649 -935 -22839 -44233 -11477 573 -11670 -934 -19294
9781 -19294 -55005 -53428 -52104 -73982 -65752 -38777 -11052 -1743 24032 41033 5097 -5027 15092
9768 15092 17890 1410 34292 81355 52413 -9324 -20208 14355 42289 35431 32087 -5280
9756 -5280 3910 8122 36574 6062 -85847 -95473 -142846 -157570 -70557 -77371 -90330 -59341 -28911
9743 -28911 44867 54340 -31058 -32479 -32083 -62478 -50060 -365 18153 43423 82824 83007 96112
$$ packed form
9829c8768k6488N0396l0496m3040l2658R374R0805J00418l4970k7885K7412P0749
9817A14849k1421q7136n7072L9511O203m5151m7642J1259K3569O3229r060j8038
9805b6900o0246k0561O1038L8354j2206K2099K9146j511m4689P348P1994j2940
9793E0926m3724N6053J9078k2684o0584k1904k1394L2756J2050j2243J0736j8360
9781a9294l5711J577J324k1878Q230K6975K7725R309K5775J7001l5936j0124K0119
9768A5092K798j6480L2882M7063k8942o1737j0884L4563K7934o858l344l7367
9756e280R190M212K8452l0512r1909r626m7373j4724Q7013o814j2959L0989L0430
9743b8911P3778R473q5398j421L96l0395J2418M9695J8518K5270L9401J83J3105
$$ plain form
9730 96112 70258 43392 77629 108832 137626 132871 106857 36137 -3715 28021 53666 45305
9718 45305 65073 104542 71114 76389 57529 42773 34293 55301 38894 47812 35976 29597 -68549
9705 -68549 -81997 -74434 -68578 -28161 2393 30284 94783 85865 58471 6403 34608 67639
9693 67639 37694 55145 55003 50643 68264 32337 -10747 6849 -15347 -51608 -42162 -56069 -76595
9680 -76595 -84958 -79663 -18640 -5146 -47672 -7425 99240 79595 13477 13328 6167 7235 54728
9667 54728 3515 -33166 15272 50811 69878 57298 4487 1914 4620 22235 2502 47956
9655 47956 108847 138935 171178 194791 193765 206359 182237 166991 84705 15947 31330 14915
9643 14915 -3686 23483 64187 46360 59941 68917 22840 26965 28980 -23299 -16279 3157 23484
$$ packed form
9730I6112k5854k6866L4237L1203K8794m755k6014p0720l9852L1736K5645q361
9718D5305J9768L9469l3428N275j8860j4756q480K1008j6407Q918j1836o379r8146
9705f8549j3448P563N856M0417L0554K7891O4499q918k7394n2068K8205L3031
9693F7639k9945J7451j42m360J7621l5927m3084J7596k2196l6261R446j3907k0526
9680g6595q363N295O1023J3494m2526M0247J06665j9645o6118j49p161J068M7493
9667E4728n1213l6681M8438L5539J9067j2580n2811k573K706J7615j9733M5454
9655D7956O0891L0088L2243K3613j026J2594k4122j5246q2286o8758J5383j6415
9643A4915j8601K7169M0704j7827J3581Q976m6077M125K015n2279P020J9436K0327
$$ plain form
9630 23484 87282 86386 61073 106568 108745 112418 47621 9281 -24509 -37265 -10973 -15309 -5720
9617 -5720 -37891 -37879 -16273 41254 35701 -53314 -39555 27360 57431 21429 -29243 -107859 -93709
9604 -93709 -68627 -65412 -49107 -19073 30619 92033 67041 60835 72802 85583 58553 56313
9592 56313 10966 12183 54242 18901 2832 20672 19591 23309 52347 43923 -16583 -44930 7991
9579 7991 31928 -28768 -76242 -55883 -9512 -21559 -7584 6525 48039 34150 10918 -1704
9567 -1704 -31560 -44575 -70423 -137540 -153439 -52346 -40847 -32778 -25558 13200 40227 56908
9555 56908 56984 8402 -20370 -52586 -66804 -77654 -75229 -80194 -69292 -22549 9097 20871 1505
9542 1505 -33387 -10771 11953 2702 -61704 -146004 -133962 -112341 -65454 -26529 -54069 -65776
$$ packed form
9630B3484O3798q96k5313M5495K177L673o4797l8340l3790j2756K6292m336R589
9617e720l2171J2K1606N7527n553q9015J3759O6915L0071l6002n0672p8616J4150
9604i3709K5082L215J6305L0034M9692O1414k4992o206J1967J2781k7030k240
9592E6313m5347J217M2059l5341j6069J7840j081L718K9038q424o0506k8347N2921
9579G991K3937o0696m7474K0359M6371j2047J3975J4109M1514j3889k3232j2622
9567a704k9856j3015k5848o7117j5899J01093J1499Q069P220L8758K7027J6681
9555E6908P6m8582k8772l2216j4218j0850K425m965J0902M6743L1646J1774j9366
9542A505l4892K2616K2724r251o4406q4300J2042K1621M6887L8925k7540j1707
$$ plain form
9530 -65776 -45063 -24488 -174 6976 18563 1143 -4308 38557 28666 57219 102843 104145 63520
9517 63520 23589 9899 25508 43751 93437 101209 100132 97721 48669 11506 27453 13853
9505 13853 -5996 -34888 5414 43786 52647 42030 -9067 -15636 -17313 -32868 25631 -7666
9493 -7666 -55605 -29788 -59559 -28875 53898 42725 -3941 23904 37917 -9262 27954 31617
9481 31617 -22321 -54141 -62202 -65834 -59820 -85257 -71992 -46853 -5342 1818 13688 -30961 -128814
9468 -128814 -75785 -18799 -14731 941 -22826 -73618 -20352 25724 23320 -25160 -44864 -18322
9456 -18322 -34814 2768 6521 9765 -9523 3017 -57511 -68732 -55662 -11399 7115 69101
9444 69101 63931 3228 23107 91026 103141 72077 31192 -3219 8646 42369 -5181 -7820
$$ packed form
9530f5776K0713K0575K4314P150J1587j7420n451M2865r891K8553M5624J302m0625
9517F3520l9931j3690J5609J8243M9686P772j077k411m9052l7163J5947j3600
9505A3853j9849k8892M0302L8372Q861j0617n1097o569j677j5555N8499l3297
9493g666m7939K5817k9771L0684Q2773j1173m6666K7845J4013m7179L7216L663
9481C1617n3938l1820q061l632O014k5437J3265K5139M1511P160J1870m4649r7853
9468a28814N3029N6986M068J5672k3767n0792N3266M6076k404m8480j9704K6542
9456a8322j6492L7582L753L244j9288J2540o0528j1221J3070M4263J8514O1986
9444F9101n170o0703J9879O7919J2115l1064m0885l4411J1865L3723m7550k639
$$ plain form
9432 -7820 -17147 -46600 -86542 -66665 -63448 -43361 785 35080 7291 -3701 5637 -25584 -13863
9419 -13863 14948 78231 101492 101461 40297 59966 118274 156987 117104 99838 82302 24362
9407 24362 -45215 -59360 8111 63592 42297 9104 -10931 11879 -4420 -16483 -29743 -37126
9395 -37126 -16356 -37743 -7963 -38976 -86436 -77987 -105226 -44668 -23661 -46442 -86277 -126360
9383 -126360 -88837 -40513 42068 67682 13864 14174 2159 -17948 -65040 -120096 -112865 -102641
9371 -102641 -98003 -47864 -1649 14102 25802 -29967 -56763 -52125 -63645 -27803 -17913 -61413
9359 -61413 -40731 -92759 -172634 -136755 -104640 -62103 -27416 -3909 -27806 685 27580 44096
9347 44096 18324 20504 39943 46209 -8096 -25900 -7528 -25130 -10032 -36085 -16472 42769
$$ packed form
9432g820r327k9453l9942J9877L217K0087M4146L4295k7789j0992R338l1221J1721
9419a3863K8811O3283K3261l1o1164J9669N8308L8713l9883j7266j7536n7940
9407B4362o9577j4145O7471N5481k1295l3193k0035K2810j6299j2063j3260p383
9395c7126K0770k1387K9780l1013m7460Q449k7239O0558K1007k2781l9835m0083
9383a26360L7523M8324Q2581K5614n3818L10j2015k0107m7092n5056P231J0224
9371a02641M638N0139M6215J5751J1700n5769k6796M638j1520L5842R890m3500
9359f1413K0682n2028p9875L5879L2115M2537L4687K3507k3897K8491K6895J6516
9347D4096k5772K180J9439O266n4305j7804J8372j7602J5098k6053J9613N9241
$$ plain form
9335 42769 40832 -2504 -28058 -29566 -24252 -7662 69257 65482 10053 -13229 -7994 -37524 -40747
9322 -40747 -32828 5025 10983 10632 9092 30149 7745 36460 84975 86374 35823 41239 -45554
9309 -45554 -20778 12783 -28172 -24003 -2916 32053 25136 27506 3519 -31701 -31184 36287 66975
9296 66975 109496 62929 13140 32548 42138 9726 23563 77078 15195 -70405 -42426 38664
9284 38664 23898 -2483 -41144 -44196 35804 25986 -70087 -64549 -123664 -67909 -33757 -24223 -7686
9271 -7686 -69608 -73787 -70945 -64680 34586 76845 34955 33215 3115 -8706 -26745 -93803 -121014
9258 -121014 -36411 9156 2391 -54694 -56154 -5410 915 37830 12381 -6948 17222 35416
9246 35416 35082 59742 44956 8117 24031 13479 -43820 -17370 -42870 -114365 -141814 -140429
$$ packed form
9335D2769j937m3336k5554j508N314J6590P6919l775n5429k3282N235k9530l223
9322d0747P919L7853N958l51j540K1057k2404K8715M8515J399n0551N416q6793
9309d5554K4776L3561m0955M169K1087L4969o917K370k3987l5220N17O7471L0688
9296F6975M2521m6567m9789J9408R590l2412J3837N3515o1883q5600K7979Q1090
9284C8664j4766k6381l8661l052Q0000r818r6073N538n9115N5755L4152R534J6537
9271g686o1922m179K842O265R9266M2259m1890j740l0100j1821j8039o7058k7211
9258a21014Q4603M5567o765n7085j460N0744O325L6915k5449j9329K4170J8194
9246C5416l34K4660j4786l6839J5914j0552n7299K6450k5500p1495k7449J385
$$ plain form
9234 -140429 -89026 -56697 8356 32194 5242 -65262 -52730 -50526 8197 16701 3567 5800
9222 5800 25129 -24366 -60891 -3890 -9389 -52106 -29118 -33641 -6941 -36568 -7868 5591
9210 5591 -1932 86390 65467 52986 12600 42323 69068 753 -30076 21629 87283 113459
9198 113459 44213 34069 -10100 -52957 -30104 -8119 -4411 7749 21744 -37724 -44490 -22327
9186 -22327 -4754 744 24794 41408 13166 9183 54666 41891 31346 44231 20077 394
9174 394 -13367 -47105 -39675 -24146 -21215 -3140 25222 15966 13048 321 -47576 -108934 -86378
9161 -86378 -54428 -35141 28018 68726 111699 107307 51224 -13015 -173 2572 -9412 -27911
9149 -27911 -52758 -44059 -60309 7189 28476 4588 -45876 -102936 -82083 -48701 -37996 -38449
$$ packed form
9234a40429N1403L2329O5053K3838k6952p0504J2532K204N8723Q504j3134K233
9222E800J9329m9495l6525N7001n499m2717K2988m523K6700k9627K8700J3459
9210E591p523Q8322k0923j2481m0386K9723K6745o8315l0829N1705O5654K6176
9198A13459o9246j0144m4169m2857K2853K1985L708J2160J3995n9468o766K2163
9186b2327J7573N498K4050J6614k8242l983M5483j2775j0545J2885k4154j9683
9174C94j3761l3738P430J5529K931J8075K8362r256k918j2727m7897o1358K2556
9161h6378L1950J9287O3159M0708M2973m392n6083o4239J2842K745j1984j8499
9149b7911k4847Q699j6250O7498K1287k3888n0464n7060K0853L3382J0705m53
$$ plain form
9137 -38449 -895 6694 14253 -15843 -39676 -60802 -66514 -25260 -30638 1452 -49311 -42106 5589
9124 5589 -29858 -8476 26420 32650 -1300 -67981 -48501 35110 31372 35442 -10092 -44772 -26564
9111 -26564 6753 15546 38762 29589 10473 8702 15607 63460 30379 -17426 -25519 -21532 10645
9098 10645 52918 52579 13569 -25802 -41787 -21886 4983 49426 12472 -53401 -73155 -6761
9086 -6761 -25204 -52002 -74753 -50990 12961 30715 16441 -18885 -9136 -19792 -22374 -63883
9074 -63883 -42312 -3958 -12709 4920 2249 4701 35812 64665 60915 17245 -46741 -70586 -59056
9061 -59056 -29221 -22521 -31712 -17502 29694 34153 21586 8438 -8716 10599 32011 50032
9049 50032 -10644 -76691 -73368 -40552 8126 -35992 -46020 3335 32703 44306 63077 9217
$$ packed form
9137c8449L7554P589P559l0096k3833k1126n712M1254n378L2090n0763P205M7695
9124E589l5447K1382L4896O230l3950o6681J9480Q3611l738M070m5534l4680J8208
9111b6564L3317Q793K3216r173j9116j771O905M7853l3081m7805q093L987L2177
9098A0645M2273l39l9010l9371j5985J9901K6869M4443l6954o5873j9754O6394
9086f761j8443k6798k2751K3763O3951J7754j4274l5326R749j0656k582m1509
9074f3883K1571L8354q751J7629k671K452L1111K8853l750m3670o3986k3845J1530
9061e9056K9835O700r191J4210M7196M459j2567j3148j7154J9315K1412J8021
9049E0032o0676o6047L323L2816M8678m4118j0028M9355K9368J1603J8771n3860
$$ plain form
9037 9217 39313 64732 90927 66362 46162 2444 28376 35134 20042 -31122 -79485 -113865
9025 -113865 -112962 -98220 -53663 -74891 -63109 -45134 -24975 -20397 -37699 -71329 -81936 -43298
9013 -43298 -9282 -50977 -66197 -37784 -12108 -3376 4233 26904 -35515 -35561 28154 51958 51563
9000 51563 36848 37213 63648 95379 114573 64757 3425 3306 -3114 -14966 20668 53755 10472
8987 10472 6122 2487 47983 23722 -31798 -9424 -8010 -56247 -42888 -54226 -45505 -50622 -33366
8974 -33366 -15794 49160 59469 38021 34545 38781 -15813 -45102 -28203 -61111 -63497 -25326
8962 -25326 34993 72957 32851 -23928 -3406 -39170 -41062 -57618 -50306 -57607 -19568 39111
8950 39111 56691 12287 -31472 -71046 -50248 -93409 -142098 -123984 -104591 -44363 -1972 -54068
$$ packed form
9037I217L0096K5419K6195k4565k0200m3718K5932O758j5092n1164m8363l4380
9025a13865R03J4742M4557k1228J1782J7975K0159M578j7302l3630j0607L8638
9013d3298L4016m1695j5220K8413K5676Q732P609K2671o2419m6O3715K3804l95
9000E1563j4715L65K6435L1731J9194m9816o1332j19o420j1852L5634L3087m3283
8987A0472m350l635M5496k4261n5520K2374J414m8237J3359j1338Q721n117J7256
8974c3366J7572O4954J0309k1448l476M236n4594k9289J6899l2908k386L8171
8962b5326O0319L7964m0106n6779K0522l5764j892j6556P312p301L8039N8679
8950C9111J7580m4404m3759l9574K0798m3161m8689J8114J9393O0228M2391n2096
$$ plain form
8938 -54068 -122845 -141922 -83924 1685 4657 49045 66023 59170 39832 8977 -15126 -29448
8926 -29448 -11263 37263 73822 48262 -6244 -13402 14659 -1770 -38678 -70765 -65222 -83428
8914 -83428 -44560 -62972 -41720 -59376 -74258 -82449 -93053 -26722 42996 30298 2786 -4479
8902 -4479 -41997 -49466 -22689 21599 -1159 44362 51667 64156 40751 54693 35260 -37863
8890 -37863 35527 82475 15405 -32245 -54451 -68016 -96657 -123344 -71275 -9989 12562 4086
8878 4086 -18579 -31980 -15350 -35280 -57166 -43704 -44477 -52906 -13075 25270 22598 9791 159
8865 159 41937 -20807 1160 128007 127545 83411 35214 3298 41077 96938 79023 69096 57501
8852 57501 41642 25963 47834 79719 58635 29026 22227 -7037 -19421 18125 10033 5285
$$ packed form
8938e4068o8777j9077N7998Q5609K972M4388J6978o853j9338l0855k4103j4322
8926b9448J8185M8526L6559k5560n4506p158K8061j6429l6908l2087N543j8206
8914h3428L8868j8412K1252j7656j4882q191j0604O6331O9718j2698k7512p265
8902d479l7518p469K6777M4288k2758M5521P305J2489k3405J3942j9433p3123
8890c7863P3390M6948o7070m7650k2206j3565k8641k6687N2069O1286K2551q476
8878D086k2665j3401J6630j9930k1886J3462p73q429L9831L8345k672j2807r632
8865A59M1778o2744K1967J26847m62m4134m8197l1916L7779N5861j7915r927j1595
8852E7501j5859j5679K1871L1885k1084k9609o799k9264j2384L7546q092m748
$$ plain form
8840 5285 -22138 -20886 -5718 8772 28476 37248 17197 -26050 21730 63910 -8243 -55065
8828 -55065 -2523 -12168 -11650 40550 41244 27538 47000 55095 48822 6427 -33785 -34050 -25893 -19849
8814 -19849 -31095 -20579 -26486 -57217 -108862 -87244 -39532 -4317 -13729 -20651 -43217 22037
8802 22037 41240 -12207 -29640 -40082 -3989 10134 22679 27757 81072 131293 127676 91405
8790 91405 59190 34238 6792 -16842 -14743 347 22616 88181 74691 58150 16353 -43038
8778 -43038 -30547 17127 -46574 -80969 -80511 -85861 -45283 45000 20775 5965 12072 16013 19791
8765 19791 22174 38572 27027 36436 79456 113441 74532 32561 11337 9618 -2175 25204
8753 25204 46504 33713 -26074 -4752 23237 -60298 -86296 -109606 -47157 -12493 -30991 -28310
$$ packed form
8840E285k7423J252J5168J4490J9704Q772k0051m3247M7780M2180p2153m6822
8828e5065N2542r645N18N2200O94j3706J9462Q095o273m2395m0212k65Q157O044
8814a9849j1246J0516n907l0731n1645K1618M7712L5215r412o922k2566O5254
8802B2037J9203n3447j7433j0442L6093J4123J2545N078N3315N0221l617l6271
8790I1405l2215k4952k7446k3634K099J5090K2269O5565j3490j6541m1797n9391
8778d3038J2491M7674o3701l4395M58n350M0578R0283k4225j4810O107L941L778
8765A9791K383J6398j1545R409M3020L3985l8909m1971k1224j719j1793K7379
8753B5204K1300j2791n9787K1322K7989q3535k5998k3310O2449L4664j8498K681
$$ plain form
8741 -28310 -85801 -70495 -77443 -85330 -62166 -92881 -103892 -87810 -102371 -49891 33948 34002 -3925
8728 -3925 20257 -1183 -16892 -22802 -29694 28558 82212 94370 90236 37547 -15306 -45267 -92747
8715 -92747 -70463 -5166 -41406 -97751 -90307 -43082 35253 35230 8688 -36347 -70951 -14524 55678
8702 55678 2132 -41653 -38135 -40689 -25922 10708 15451 10879 35441 54377 45830 7418 -16889
8689 -16889 -32908 -85600 -52586 25496 47510 43071 8029 -47062 -36240 -21069 13201 61820
8677 61820 28267 51479 77915 92468 82279 79008 9336 -19490 -20710 58136 86174 64760
8665 64760 62828 95575 68136 -50676 -120866 -110896 -74639 -66806 -22162 9143 25239 7926
8653 7926 6780 11032 -10878 -926 44170 54161 29920 -58828 -11515 26289 4789 16978 30414
$$ packed form
8741b8310n7491J5306o948p887K3164l0715j1011J6082j4561N2480Q3839N4l7927
8728c925K4182k1440j5709n910o892N8252N3654J2158m134n2689n2853k9961m7480
8715i2747K2284O5297l6240n6345P444M7225P8335k3k6542m5035l4604N6427P0202
8702E5678n3546m3785L518k554J4767L6630M743m572K4562J8936q547l8412k4307
8689a6889j6019n2692L3014P8082K2014m439l5042n5091J0822J5171L4270M8619
8677F1820l3553K3212K6436J4553j0189l271o9672k8826j220P8846K8038k1414
8665F4760j932L2747k7439j18812p0190R970L6257P833M4644L1305J6096j7313
8653G926j146M252k1910R952M5096R991k4241q8748M7313L7804k1500J2189J3436
$$ plain form
8640 30414 34993 -5162 786 -15136 5657 7858 -17053 -10737 30286 33335 10930 21427 80089
8627 80089 116362 98930 91010 112625 131051 118345 83670 37584 27017 31065 71461 96247
8615 96247 84923 38939 -15074 1529 -9014 33158 66273 68693 44488 20651 27819 97111
8603 97111 103066 81782 81733 107716 121042 169256 195549 195989 172245 159929 178707 203314 219866
8590 219866 195281 156201 123380 116471 130395 129814 127546 69339 72475 40324 41484 24409 64060
8577 64060 149010 163541 147793 90628 57510 64150 30515 60870 -21516 -89961 -63869 6307
8565 6307 101756 89033 86727 77108 5641 -624 6670 -6723 -4774 82253 115022 127322 71124
8552 71124 57794 77091 75133 58613 41546 30061 5564 73368 107857 95884 86538 72758
$$ packed form
8640C0414M579m0155N948j5922K0793K201k4911O316M1023L049k2405J0497N8662
8627H0089L6273j7432p920K1615J8426j2706l4675m6086j0567M048M0396K4786
8615I6247j1324m5984n4013J6603j0543M2172L3115K420k4205k3837P168O9292
8603I7111N955k1284m9K5983J3326M8214K6293M40k3744j2316J8778K4607J6552
8590B19866k4585l9080l2821o909J3924n81k268n8207L136l2151J160j7075L9651
8577F4060Q4950J4531j5748n7165l3118O640l3635L0355q2386o8445K6092P0176
8565F307R5449j2723k306r619p1467o265P294j3393J949Q7027L2769J2300n6198
8552G1124j3330J9297j958j6520j7067j1485k4497O7804L4489j1973r346j3780
$$ plain form
8540 72758 60090 71161 14322 23464 60136 22090 -31875 -8168 75644 96793 44196 -10674
8528 -10674 19296 -13580 -95676 -73663 -79072 -73080 -79191 2430 22710 -11433 -39655 -33763 -35780
8515 -35780 -49673 -39837 38422 85324 38124 18892 80284 95791 80624 63781 49883 49377
8503 49377 21409 -14161 -85896 -84625 -76011 -64109 -26364 14397 -32773 -39747 -20148 -2972
8491 -2972 -2089 345 -28293 -43849 -47667 -29580 5929 46747 33174 27633 36913 59741 70323
8478 70323 24329 53404 61032 24990 69542 91917 43046 66305 41285 30032 39685 26566
8466 26566 12740 64185 54709 -6168 -26416 9986 1374 -37245 -43962 10144 30391 2553
8454 2553 51409 88319 102318 92201 99797 110422 62253 59639 92824 50834 90943 107353
$$ packed form
8540G2758j2668J1071n6839R142L6672l8046n3965K3707Q3812K1149n2597n4870
8528a0674K9970l2876q2096K2013n409N992o111Q1621K0280l4143k8222N892k017
8515c5780j3893R836P8259M6902m7200j9232O1392J5507j5167j6843j3898n06
8503D9377k7968l5570p1735J271Q614J1902L7745M0761m7170o974J9599J7176
8491b972Q83K434k8638j5556l818J8087L5509M0818j3573n541R280K2828J0582
8478G0323m5994K9075P628l6042M4552K2375m8871K3259k5020j1253R653j3119
8466B6566j3826N1445r476o0877k0248L6402q612l8619o717N4106K0247k7838
8454B553M8856L6910J3999j0117P596J0625m8169k614L3185m1990M0109J6410
$$ plain form
8442 107353 70028 43001 110978 119320 73724 76691 46047 -9031 -8849 37868 117859 71246
8430 71246 24588 -38001 -61193 -45368 25495 41776 22556 37318 44346 74288 53924 26857
8418 26857 23679 19467 710 -37882 -25422 9463 -11341 4051 21143 2536 16199 -84672
8406 -84672 -86208 -73999 13400 47315 16625 -34831 -48755 -67771 -44024 24429 11626 -22975
8394 -22975 -48954 -41112 -28509 -37950 -38173 -10210 31947 20908 -48154 -55115 -57086 -106799 -123208
8381 -123208 -76142 -52565 -76109 -53113 1138 9078 -21908 -81292 -135521 -50561 -32900 -42878
8369 -42878 -37386 -43146 -66452 -62030 -37258 -26969 2740 -19008 -74638 -134606 -151542 -72423
8357 -72423 -81143 -124322 -99955 -53219 -15271 -59031 -77595 -100233 -66232 -112735 -101361 -53611
$$ packed form
8442A07353l7325k7027O7977Q342m5596K967l0644n5078J82M6717P9991m6613
8430G1246m6658o2589k3192J5825P0863J6281j9220J4762P028K9942k0364k7067
8418B6857l178m212j8757l8592J2460L4885k0804J5392J7092j8607J3663j00871
8406h4672j536J2209Q7399L3915l0690n1456j3924j9016K3747O8453j2803l4601
8394b2975k5979P842J2603r441k23K7963M2157j1039o9062o961j971m9713j6409
8381a23208M7066K3577k3544K2996N4251P940l0986n9384n4229Q4960J7661r978
8369d2878N492n760k3306M422K4772J0289K9709k1748n5630n9968j6936P9119
8357g2423q720m3179K4367M6736L7948m3760j8564k2638L4001m6503J1374M7750
$$ plain form
8345 -53611 -64627 -10522 7417 -22799 -1429 8999 17244 27139 13905 56265 62077 46610
8333 46610 20598 -32502 -31871 -30013 -138700 -133911 -134223 -124896 -34587 -49805 -50622 -50207 -32589 -30959
8319 -30959 -76355 -111685 -95543 -39692 -15967 11825 4468 -18442 -19110 -27781 -30089 -32726 24140
8306 24140 82207 49913 27010 26565 93291 132943 114705 14231 -11265 76532 83422 48825
8294 48825 -2460 -25127 9648 100460 26767 -15341 34756 34554 -70358 -58895 1607 46507
8282 46507 17978 57291 70625 59294 81017 70851 39521 59970 18898 -5278 239 16566
8270 16566 37833 64451 31475 24500 4903 39544 64385 -3309 -16912 -4933 -9294 -9621 -5718
8257 -5718 3637 -7519 -143 -4743 -26664 -64599 -34785 -8015 -5913 -1909 27591 -20791 -24461
$$ packed form
8345e3611j1016N4105J7939l0216K1370J0428Q245R895j3234M2360N812j5467
8333D6610k6012n3100O31J858j08687M789l12R327R0309j5218q17M15J7618J630
8319c0959m5396l5330J6142N5851K3725K7792p357k2910o68q671k308k637N6866
8306B4140N8067l2294k2903m45O6726L9652j8238j00474k5496Q7797O890l4597
8294D8825n1285k2667L4775R0812p3693m2108N0097k02j04912J1463O0502M4900
8282D6507k8529L9313J3334j1331K1723j0166l1330K0449m1072k4176N517J6327
8270A6566K1267K6618l2976o975j9597L4641K4841o7694j3603J1979m361l27L903
8257e718R355j1156P376m600k1921l7935K9814K6770K102M004K9500m8382l670
$$ plain form
8244 -24461 -12687 -45000 -30319 -24995 14967 45059 14312 24966 2984 11618 -14127 67566
8232 67566 57096 24435 -62880 -81503 -11899 17553 -34509 -26623 -54426 -67023 -43974 -21079
8220 -21079 -37122 -27895 20301 2256 -29765 2980 50593 37228 -4171 -19934 -14855 -67555
8208 -67555 -93443 -51746 -21617 28535 24266 70047 96121 37599 -39534 -49248 -84375 -121121
8196 -121121 -41582 -14220 1796 -11720 14297 59160 76026 30542 -12945 -43920 -85394 -68921
8184 -68921 -31587 1952 24114 16779 2901 -52020 -58970 -2751 14626 8033 36360 -11426
8172 -11426 -9556 -7428 14129 9744 -8905 15034 15129 -11706 7446 22736 55722 48641 -66449
8159 -66449 -133521 -101216 -75583 10192 22285 726 -2021 25519 -1236 74318 158882 159615
$$ packed form
8244b4461J1774l2313J4681N324L9962L0092l0747J0654k1982Q634k5745Q1693
8232F7566j0470l2661q7315j8623O9604K9452n2062P886k7803j2597K3049K2895
8220b1079j6043R227M8196j8045l2021L2745M7613j3365m1399j5763N079n2700
8208f7555k5888M1697L0129N0152m269M5781K6074n8522p7133r714l5127l6746
8196a21121P9539K7362J6016j3516K6017M4863J6866m5484m3487l0975m1474J6473
8184f8921L7334L3539K2162p335j3878n4921o950N6219J7377o593K8327m7786
8172a1426J870K128K1557m385j8649K3939R5k6835J9152J5290L2986p081j15090
8159f6449o7072L2305K5633Q5775J2093k1559k747K7540k6755P5554Q4564P33
$$ plain form
8147 159615 127122 96521 79535 61902 44916 75396 108938 86458 26100 10457 -46740 -43206
8135 -43206 -25309 -32775 -53646 -46413 -17007 31172 106224 144209 168599 122928 85810 18215
8123 18215 -45720 -49994 -62894 -16094 24196 75454 3179 -49263 -33062 -26226 18436 8847
8111 8847 -18844 -34145 -43775 -95880 -79372 -1071 105514 98089 75786 -3391 -17871 -17007 12041
8098 12041 19714 35126 40344 10817 -782 -21922 -49022 -47620 -24070 29387 11015 14201 30449
8085 30449 23111 25866 -3494 -27799 14305 55199 -6560 -61387 -78928 -68619 -38517 -9975
8073 -9975 -52911 -92374 -88478 -70693 -65163 -59094 11084 59705 36831 33904 -46332 -72532 -7646
8060 -7646 4702 -25027 -6878 -4323 -36974 -70403 -80658 -46869 -51844 -21913 4052 -51945
$$ packed form
8147A59615l2493l0601j6986j7633j6986L0480L3542k2480o0358j5643n7197L534
8135d3206J7897p466k0871P233K9406M8179P5052L7985K4390m5671l7118o7595
8123A8215o3935m274j2900M6800M0290N1258p2275n2442J6201O836M4662r589
8111H847k7691j5301r630n2105J6508P8301J06585p425k2303p9177j4480Q64K9048
8098A2041P673J5412N218k9527j1599k1140k7100J402K3550N3457j8372L186J6248
8085C0449p338K755k9360k4305M2104M0894o1759n4827j7541J0309L0102K8542
8073i975m2936l9463L896J7785N530O069P0178M8621k2874k927q0236k6200O4886
8060g646J2348k9729J8149K555l2651l3429j0255L3789m975K9931K5965n5997
$$ plain form
8048 -51945 -14614 22952 26438 9103 -28314 -58080 -61943 -44558 -38742 5751 21337 -1606
8036 -1606 -10569 17066 -15653 19602 67459 23198 33024 82402 94838 10509 -33107 -14626
8024 -14626 -2477 10575 33238 67984 57171 3475 -56483 -64365 -33155 31722 97632 99882
8012 99882 79611 60344 47390 27283 32344 20906 15585 18714 -18267 -24653 -37027 7729 74184
7999 74184 57701 -6916 -29220 972 49000 10095 -13032 -28359 7892 2402 18092 87914
7987 87914 132231 158571 150637 143848 202198 209073 135938 82522 -3823 -25357 41365 54468
7975 54468 52531 45030 72083 82063 89490 87128 117160 15313 -4222 29658 14745 -1165 -40837
7962 -40837 -94949 -18173 50502 140118 152451 138076 107937 76912 69231 82556 51615 13885
$$ packed form
8048e1945L7331L7566L486j7335l7417k9766l863J7385N816M4493J5586k2943
8036a606q963K7635l2719L5255M7857m4261R826M9378J2436q4329m3616J8481
8024a4626J2149J3052K2663L4746j0813n3696n9958p882L1210O4877O5910K250
8012I9882k0271j9267j2954k0107N061j1438n321L129l6981o386j2374M4756O6455
7999G4184j6483o4617k2304L0192M8028l8905k3127j5327L6251n490J5690O9822
7987H7914M4317K6340p934o789N8350O875p3135n3416q6345k1534O6722J3103
7975E4468j937p501K7053R980P427k362L0032j01847j9535L3880j4913j5910l9672
7962d0837n4112P6776O8675Q9616J2333j4375l0139l1025p681J3325l0941l7730
$$ plain form
7950 13885 97447 109422 102662 68835 31585 25775 50775 119319 139168 96966 68517 77100
7938 77100 28056 34009 42858 15596 38020 36489 7607 6393 25404 27273 43371 74315 19848
7925 19848 18045 -115 19807 82473 117179 111369 77763 29719 52254 83624 58646 36458
7913 36458 21247 97200 102048 68299 82409 80291 15979 -72392 -77948 -97092 -62519 16469
7901 16469 37272 51763 64089 54147 66121 48380 -27607 -60076 -59455 -69312 -35617 -12214 2726
7888 2726 -283 32784 60275 71566 119573 84035 68451 61424 29642 22344 8463 2181 -18665
7875 -18665 29376 123975 96646 74086 48839 43630 -29128 -42657 -31417 -32856 41936 20396
7863 20396 -59944 -78978 -153575 -167850 -110770 -135092 -130804 -69593 -71976 -68068 -46778 -38395 -41628
$$ packed form
7950A3885Q3562J1975o760l3827l7250n810K5000O8544J9849m2202k8449Q583
7938G7100m9044N953Q849k7262K2424j531k8882j214J9011J869J6098L0944n4467
7925A9848j803j8160J9922O2666L4706n810l3606m8044K2535L1370k4978k2188
7913C6458j5211P5953M848l3749J4110k118o4312q8371n556j9144L4573P8988
7901A6469K0803J4491J2326r942J1974j7741p5987l2469O21r857L3695K3403J4940
7888B726l009L3067K7491J1291M8007l5538j5584p027l1782p298j3881o282k0846
7875a8665M8041R4599k7329k2560k5247n209p2758j3529J1240j439P4792k1540
7863B0396q0340j9034p4597j4275N7080k4322M288O1211k383L908K1290Q383l233
$$ plain form
7850 -41628 -21796 22342 -4760 36046 53282 8317 -47243 -53301 -34383 37102 34771 -39935
7838 -39935 -35731 25535 58637 12605 -48367 -69010 -55795 -20119 -16058 -12928 -1949 50527
7826 50527 29208 51146 54573 36078 38940 55076 29437 -13063 -32227 -41583 3493 77307
7814 77307 49368 -22760 -40214 -68735 -66123 -55417 -43757 -62224 -77524 -61630 -22319 -76661
7802 -76661 -118217 -60747 -15109 57492 50064 28417 21902 31230 74545 93256 98794 77384 70794
7789 70794 6914 -7319 11906 -10376 -4439 1107 -14976 -27465 -30850 -55397 -67907 -21827
7777 -21827 22339 72493 72526 -294 -39984 -45916 -30317 -48685 -78596 -101532 -97774 -56316 -15788
7764 -15788 -16218 33250 -3617 -20741 -46673 -100674 -105104 -67037 -32236 21783 69146 79224
$$ packed form
7850d1628J9832M4138k7102M0806J7236m4965n5560o058J8918P1485k331p4706
7838c9935M204O1266L3102m6032o0972k0643J3215L5676M061L130J0979N2476
7826E0527k1319K1938L427j8495K862J6136k5639m2500j9164r356M5076P3814
7814G7307k7939p2128j7454k8521K612J0706J1660j8467j5300J5894L9311n4342
7802g6661m1556N7470M5638P2601p428k1647o515R328M3315J8711N538k1410o590
7789G0794o3880j4233J9225k2282N937N546j6083j2489l385k4547j2510M6080
7777b1827M4166N0154L3p2820l9690n932J5599j8368k9911k2936L758M1458M0528
7764a5788m30M9468l6867j7124k5932n4001m430L8067L4801N4019M7363J0078
$$ plain form
7752 79224 54911 34151 -49675 -100228 -75951 -77573 25684 27277 -5619 -25031 14591 53858
7740 53858 44235 12671 9869 -8521 -62099 -85395 -96928 10094 100048 81408 29018 -15129
7728 -15129 -11543 -11899 17917 51716 57984 70071 90287 84201 49126 11080 -29347 -40168 8879
7715 8879 64173 46688 85188 51314 49819 83218 88115 114376 70372 53100 36056 51738
7703 51738 28884 397 65752 40061 13497 33717 15731 -45974 -38850 -38657 -31486 3473 -8825
7690 -8825 -201 47092 21209 -73050 -85940 -14397 -14949 -38336 14625 86520 28434 -49729 -96623
7677 -96623 -72016 -49601 -63792 -44420 -50596 -40238 12505 4081 13320 -3545 -17665 -11409 -6773
7664 -6773 -16002 9650 50780 10399 -61836 -13457 50620 -20401 -117939 -128471 -65212 -15053
$$ packed form
7752G9224k4313k0760q3826n0553K4277j622J03257J593l2896j9412L9622L9267
7740E3858r623l1564k802j8390n3578k3296j1533J07022Q9954j8640n2390m4147
7728a5129L586l56K9816L3799O268J2087K0216o086l5075l8046m0427j0821M9047
7715H879N5294j7485L8500l3874j495L3399M897K6261m4004j7272j7044J5682
7703E1738k2854k8487O5355k5691k6564K0220j7986o1705P124J93P171L4959j2298
7690h825Q624M7293k5883r4259j2890P1543n52k3387N2961P1895n8086p8163m6894
7677i6623K4607K2415j4191J9372o176J0358N2743q424R239j6865j4120O256M636
7664f773r229K5652M1130m0381p2235M8379O4077p1021r7538j0532O3259N0159
$$ plain form
7652 -15053 8842 46895 23711 24742 29017 33041 31839 7813 -4693 7429 -24611 -35512 -33548
7639 -33548 -57275 -77784 -47059 -6305 -37950 -104429 -169665 -138701 -38758 15911 40600 22456
7627 22456 -64459 -122576 -108125 -48757 -18970 -48176 -39211 -26473 -60642 -110534 -39121 45271
7615 45271 77319 7708 -47759 -4177 -7474 -42076 -23736 37978 46313 -62137 -141844 -93709
7603 -93709 -25567 22483 6206 -30930 -20935 -44833 -71705 -11983 18825 -78639 -113073 -82425
7591 -82425 -32084 17936 25300 -11620 8076 27851 -9489 -46661 -10766 -34767 -85164 -88915
7579 -88915 -43707 -8240 -33377 -39732 -1831 40117 99207 67072 -1923 -13147 -57584 -74357
7567 -74357 -106304 -72980 -52196 -30701 -76064 -101140 -71389 -26735 -11731 32125 66036 45213
$$ packed form
7652a5053K3895L8053k3184J031M275M024j202k4026j2506J2122l2040j0901J964
7639c3548k3727k0509L0725M0754l1645o6479o5236L0964R9943N4669K4689j8144
7627B2456q6915n8117J4451N9368K9787k9206Q965J2738l4169m9892P1413Q4392
7615D5271L2048o9611n5467M3582l297l4602J8340O1714Q335j08450p9707M8135
7603i3709O8142M8050j6277l7136R995k3898k6872N9722L0808r7464l4434L0648
7591h2425N0341N0020P364l6920J9696J9775l7340l7172L5895k4001n0397l751
7579h8915M5208L5467k5137o355L7901M1948N9090l2135o8995j1224m4437j6773
7567g4357l1947L3324K0784K1495m5363k5076K9751M4654J5004M3856L3911k0823
$$ plain form
7555 45213 33566 -28097 -68118 -59020 -96020 -137357 -137882 -62417 -1519 26360 -6563 -21490
7543 -21490 -15044 -85150 -106181 -47082 16748 46878 89237 27364 -38961 -69023 -41396 5051
7531 5051 47261 -5029 2367 57330 76449 67295 22017 -14732 23908 55498 64105 48030 -5157
7518 -5157 -12023 -34669 -21579 7492 30894 30965 -60984 -54897 -12076 -26379 -56883 -42572 -45428
7505 -45428 -28392 -20460 -11741 -25949 -74865 -69621 -97615 -93111 -69541 -95042 -77086 -37339 25069
7492 25069 59203 18737 15024 -29969 -41247 16395 11983 -25930 -87489 -93527 -93100 -98942 -89196
7479 -89196 -97768 -76169 -40561 17706 33856 -7675 -37380 -57158 -40484 -20262 -30326 -47181
7467 -47181 8140 63907 29175 -30328 -18851 -89536 -122437 -148665 -172077 -125521 -98617 -147419
$$ packed form
7555D5213j1647o1663m0021R098l7000m1337n25P5465O0898K7879l2923j4927
7543b1490O446p0106k1031N9099O3830L0130M2359o1873o6325l0062K7627M6447
7531E051M2210n2290P396N4963J9119r154m5278l6749L8640L1590Q607j6075n3187
7518e157o866k2646J3090K9071K3402P1r1949O087M2821j4303l0504J4311k856
7505d5428J7036P932Q719j4208m8916N244k7994M504K3570k5501J7956L9747O2408
7492B5069L4134m0466l713m4993j1278N7642m412l7913o1559o038M27n842R746
7479h9196q572K1599L5608N8267J6150m1531k9705j9778J6674K0222j0064j6855
7467d7181N5321N5767l4732n9503J1477p0685l2901k6228k3412M6556K6904m8802
$$ plain form
7455 -147419 -48061 64367 972 -27071 -25883 -17463 -83275 -119234 -106466 -32449 -33100 -45190
7443 -45190 -29934 5986 51917 32635 1664 6308 -12370 -9830 -13688 26549 43783 39911 70803
7430 70803 73719 41552 31846 -1263 -3841 27862 23112 48713 35188 -31085 -68888 -63076 -40758
7417 -40758 3907 -1230 -45764 -39025 -18372 -16750 -106915 -114031 -43799 -67469 -47260 -58631 -17355
7404 -17355 38516 -18796 -17723 24848 25196 -19630 -53163 -14884 27998 -9818 -46503 -39691 -44234
7391 -44234 -43428 28104 48676 26905 18776 27213 -1722 -117112 -181431 -99707 -55391 -38559
7379 -38559 -20065 17565 -1025 13075 10177 13177 9017 -20506 -68925 -21990 31152 -48409
7367 -48409 -56131 -45218 -19447 13695 17028 43627 -11048 -117778 -67998 -42805 -21154 2828
$$ packed form
7455a47419R9358J12428o3395k8043J188Q420o5812l5959J2768P4017o51j2090
7443d5190J5256L5920M5931j9282l0971M644j8678K540l858M0237J7234l872L0892
7430G0803K916l2167r706l3109k578L1703m750K5601j3525o6273l7803N812K2318
7417d0758M4665n137m4534O739K0653J622r0165p116P0232k3670K0209j1371M1276
7404a7355N5871n7312J073M2571L48m4826l3533L8279M2882l7816l6685O812m543
7391d4234Q06P1532K0572k1771q129Q437k8935j15390o4319Q1724M4316J6832
7379c8559J8494L7630j8590J4100k898L000m160k9523m8419M6935N3142p9561
7367d8409p722J0913K5771L3142L333K6599n4675j06730M9780K5193K1651K3982
$$ plain form
7355 2828 26234 16753 27394 72341 99874 80718 31387 40283 50335 47296 50994 37541 10171
7342 10171 9241 -5227 42570 20485 9602 47397 33245 -31442 -57721 -80138 -55183 -22352
7330 -22352 -16783 -44600 21564 106128 103367 23695 22692 33842 40836 22980 58948 56597 31634
7317 31634 -36027 -48316 6020 42599 108915 141243 104739 70063 33977 63522 53588 77134
7305 77134 77682 66867 54257 70808 52221 18611 16227 -52606 -50424 -15696 -1783 -4485 -10706
7292 -10706 12603 22122 21561 -4004 -50618 -74752 -25631 18873 50252 33459 17606 22150 7665
7279 7665 -32789 -36985 -42809 -36127 4724 25357 28687 42069 108858 81533 18711 36104 46911
7266 46911 62021 18813 41569 47725 13458 -9454 4269 25608 -20281 -38276 -29604 -37241
$$ packed form
7355B828K3406r481J0641M4947K7533j9156m9331Q896J0052l039L698j3453k7370
7342A0171r30j4468M7797k2085j0883L7795j4152o4687k6279k2417K4955L2831
7330b2352N569k7817O6164Q4564k761p9672j003J1150O994j7856L5968k351k4963
7317C1634o7661j2289N4336L6579O6316L2328l6504l4676l6086K9545r934K3546
7305G7134N48j0815j2610J6551j8587l3610k384o8833K182L4728J3913k702o221
7292a0706K3309R519n61k5565m6614k4134M9121M4504L1379j6793j5853M544j4485
7279G665m0454m196n824O682M0851K0633L330J3382O6789k7325o2822J7393J0807
7266D6911J5110m3208K2756O156l4267k2912J3723K1339m5889j7995Q672p637
$$ plain form
7254 -37241 -55634 -78140 -114374 -70450 36556 82350 55327 1121 -77609 -72485 -34801 630
7242 630 -11592 -32213 -29693 -24301 -50477 -56322 12645 13804 15197 4970 -26632 -39594 -33198
7229 -33198 -42048 -86563 -41234 70712 14871 -65712 -55749 -42570 -55460 -23432 -962 -17862
7217 -17862 -7046 -9074 -14991 30773 89509 58739 55864 33544 -6991 10057 37496 10991
7205 10991 35817 52382 40399 8841 6319 5651 -26747 14925 32476 50217 11493 -25697
7193 -25697 -96282 -102528 -39623 21442 46979 4646 40254 75361 109213 88904 26321 -8709
7181 -8709 -73062 -86790 -10429 -14916 -55021 1758 10127 -3781 6336 -16952 7259 59393
7169 59393 35087 30350 70117 52764 38776 -6566 19393 23004 -13264 -21089 6172 7227 -37881
$$ packed form
7254c7241j8393k2506l6234M3924J07006M5794k7023n4206p8730N124L7684L5431
7242F30j2222k0621K520N392k6176n845O8967J159J393j0227l1602j2962O396
7229c3198q850m4515M5329J11946n5841q0583R963J3179j2890L2028K2470j6900
7217a7862J0816k028n917M5764N8736l0770k875k2320m0535J7048K7439k6505
7205A0991K4826J6565j1983l1558k522o68l2398M1672J7551J7741l8724l7190
7193b5697p0585o246O2905O1065K5537m2333L5608L5107L3852k0309o2583l5030
7181h709o4353j3728P6361m487m0105N6779Q369j3908J0117k3288K4211N2134
7169E9393k4306m737L9767j7353j3988m5342K5959L611l6268p825K7261J055m5108
$$ plain form
7156 -37881 -58776 -45299 -75265 -76384 -75371 -61866 -75349 -120187 -95801 -72646 -93546 -91755
7144 -91755 -85887 -77287 -25160 17650 53568 38806 24159 44047 23155 -11795 9391 15371
7132 15371 39986 38092 30857 33732 6100 15940 -5002 -64325 -80807 -45658 -39610 -29448 4328
7119 4328 36421 17804 -19726 -58494 -40290 -16214 -10642 -1375 22433 26883 -24956 -69783 -84890
7106 -84890 -27715 30036 19316 21577 35108 22884 6602 27426 24396 6775 6656 37858 72411
7093 72411 50693 49845 41900 52277 11366 -64738 -58696 -43928 -22421 -11947 -5338 9905 841
7080 841 -35895 -39675 16103 46508 2360 -31236 -15828 -6259 5017 -27467 26965 42240 8405
7067 8405 -6556 3907 36909 31828 -6173 14468 87527 52073 11115 -29488 -7452 -39170
$$ packed form
7156c7881k0895J3477k9966j119J013J3505j3483m4838K4386K3155k0900J791
7144i1755N868Q600N2127M2810L5918j4762j4647J9888k0892l4950K1186N980
7132A5371K4615j894p235K875k7632R840k0942n9323j6482L5149O048J0162L3776
7119D328L2093j8617l7530l8768J8204K4076N572R267K3808M450n1839m4827j5107
7106h4890N7175N7751j0720K261J3531j2224j6282K0824l030j7621j19L1202L4553
7093G2411k1718q48p945J0377m0911p6104O042J4768K1507J0474O609J5243r064
7080H41l6736l780N5778L0405m4148l3596J5408R569J1276l2484N4432J5275l3835
7067H405j4961J0463L3002n081l8001K0641P3059l5454m0958m0603K2036l1718
$$ plain form
7055 -39170 -85797 -47151 -48316 -4564 -6817 29921 -2186 14653 44277 -13295 -100143 -80531
7043 -80531 -48662 -73076 -86265 -91167 -112106 -77677 -33171 37825 48292 -7624 -66009 -61638
7031 -61638 -10387 40456 19633 -19251 -33969 -68338 -61272 -57483 -48366 -47272 -4625 -38879 -108513
7018 -108513 -109728 -52724 -46678 -70181 -59835 -16849 19166 -3809 -49996 -19703 14571 11273
7006 11273 40450 33889 27336 33670 18119 -19865 -34339 3310 -42511 -47285 -4951 -18852 -12266
6993 -12266 -24308 -32360 -48641 -45290 3321 81560 73265 13684 -5764 723 36583 50439 35811
6980 35811 31063 5407 -41208 -57206 -63043 -30054 17004 48600 32721 -5737 -19158 -74957
6968 -74957 -30469 -52307 -59294 -92492 -69130 -67044 -67821 -96316 -100174 -78066 -57365 -42283 -54037
$$ packed form
7055c9170m6627L8646j165M3752k253L6738l2107J6839K9624n7572q6848J9612
7043h0531L1869k4414j3189m902k0939L4429M4506P0996J0467n5916n8385M371
7031f1638N1251N0843k0823l8884j4718l4369P066L789R117J094M2647l4254o9634
7018a08513j215N7004O046k3503J0346M2986L6015k2975m6187L0293L4274l298
7006A1273K9177o561o553O334j5551l7984j4474L7649m5821m774M2334j3901O586
6993a2266j2042q052j6281L351M8611P8239q295n9581j9448O487L5860J3856j4628
6980C5811m748k5656m6615j5998n837L2989M7058L1596j5879l8458j3421n5799
6968g4957M4488k1838o987l3198K3362K086p77k8495l858K2108K0701J5082j1754
$$ plain form
6955 -54037 -45828 -25072 -47808 -42511 -20205 -29604 -4456 -644 -5467 -5547 -1248 -58257 -32719 -34614
6941 -34614 24291 57195 -8849 -74431 -95952 -63784 -45713 -1659 -7081 -11984 55177 60366
6929 60366 72193 39619 11515 70021 108076 69154 30618 50268 20043 14777 16723 -1531
6917 -1531 -34293 -44935 -73961 -59482 -28707 -21192 -6138 -48694 -104579 -86434 -36855 -27720
6905 -27720 -64189 -71491 -29659 32293 27690 31674 2533 -74516 -63523 -20260 -50951 1917
6893 1917 36202 4111 -20018 -24042 -39139 -32029 10003 -19503 -22576 -51814 -27925 18714 47512
6880 47512 24264 1797 33880 26563 705 -33670 -8768 -13984 -118758 -110580 -36824 6298
6868 6298 -8120 -31623 519 12956 -20901 -3423 -13819 997 18100 32481 -49431 -63256
$$ packed form
6955e4037Q209K0756k2736N297K2306r399K5148L812m823q0M299n7009K5538j895
6941c4614N8905L2904o6044o5582k1521L2168J8071M4054n422m903O7161N189
6929F0366J1827l2574k8104N8506L8055l8922l8536J9650l0225n266J946j8254
6917a531l2762j0642k9026J4479L0775P515J5054m2556n5885J8145M9579R135
6905b7720l6469p302M1832O1952m603L984k9141p7049J0993M3263l0691N2868
6893A917L4285l2091k4129m024j5097P110M2032k9506l073k9238K3889M6639K8798
6880D7512k3248k2467L2083p317k5858l4375K4902n216j04774Q178P3756M3122
6868F298j4418k3503L2142J2437l3857J7478j0396J4816J7103J4381q1912j3825
$$ plain form
6856 -63256 28641 49332 22004 5655 -18853 -50497 -21865 16364 62128 32017 47734 60919
$$ packed form
6856f3256R1897K0691k7328j6349k4508l1644K8632L8229M5764l0111J5717J3185
$$ [...]
##END NTUPLES=NMR SPECTRUM
##END=
