##TITLE=Analysis number 312945
Compound Code cc 39322
Book Reference 413/190/2
Project Code adrs
Chemist Name stevem
##JCAMPDX= 6.0         $$ Bruker NMR JCAMP-DX V2.0
##DATA TYPE= NMR SPECTRUM
##DATA CLASS= NTUPLES
##ORIGIN= Bruker BioSpin GmbH
##OWNER= NMR
$$ XWIN-NMR		Version 3.5
$$ Thu Aug 18 14:36:58 2005 GMT Daylight Time (UT+1h)  MAYBRIDGE\NMR@NMR_250MHZ
##.OBSERVE FREQUENCY= 250.131544655141
##.OBSERVE NUCLEUS= ^1H
##.ACQUISITION MODE= SIMULTANEOUS (DQD)
##.ACQUISITION SCHEME= undefined
##.AVERAGES= 16
##.DIGITISER RES= 18
##SPECTROMETER/DATA SYSTEM= dpx250
##.PULSE SEQUENCE= zg30
##.SOLVENT NAME= DMSO
##.SHIFT REFERENCE= (INTERNAL, DMSO, 0, 16.522)
##AUDIT TRAIL= $$ (NUMBER, WHEN, WHO, WHERE, WHAT)
$$ ##TITLE= Audit trail, XWIN-NMR		Version 3.5
$$ ##JCAMPDX= 5.01
$$ ##ORIGIN= Bruker BioSpin GmbH
$$ ##OWNER= NMR
$$ C:\u/data/dgb/nmr/ADRS/8190/pdata/1/auditp.txt
$$ ##AUDIT TRAIL=  $$ (NUMBER, WHEN, WHO, WHERE, WHAT)
(   1,<2005-08-18 14:36:39.85 +100>,<MAYBRIDGE\NMR>,<NMR_250MHZ>,
      <created by zg, POWCHK disabled, PULCHK disabled
       configuration hash MD5:
       62 19 C7 07 E1 42 D1 B7 37 6C 3D D0 77 39 F9 E6
       data hash MD5: 64K
       D1 C2 83 B8 E8 AC AF C4 63 94 17 3B A7 4E 2E DD>)
(   2,<2005-08-18 14:36:51.42 +100>,<MAYBRIDGE\NMR>,<NMR_250MHZ>,
      <Start of raw data processing
       ef LB = 0.3 FT_mod = 6 PKNL = 1 SI = 32K 
       data hash MD5: 32K
       43 89 39 48 6A 9C 22 81 C3 AA AE 9A B9 22 C2 12>)
(   3,<2005-08-18 14:36:53.08 +100>,<MAYBRIDGE\NMR>,<NMR_250MHZ>,
      <apk 
       data hash MD5: 32K
       BA 31 79 5E B9 E4 D6 3E 19 A0 A1 A6 B1 1D AF E9>)
(   4,<2005-08-18 14:36:53.74 +100>,<MAYBRIDGE\NMR>,<NMR_250MHZ>,
      <abs ABSG = 5 
       data hash MD5: 32K
       13 00 BE 6E B5 4F D7 5C 5E 99 DF 27 BB CE 9D 53>)
$$ ##END=
$$ 
$$ hash MD5
$$ 24 65 04 35 3E 25 99 29 C9 AD C5 5A 47 A5 DF 0E
##$RELAX= 
##$RELAX= 
##$RELAX= 
##$RELAX= 
##$RELAX= 
##$RELAX= 
##$RELAX= 
$$ Bruker specific parameters
$$ --------------------------
##$DU= <C:\u>
##$EXPNO= 8190
##$NAME= <ADRS>
##$PROCNO= 1
##$TYPE= <nmr>
##$USER= <dgb>
##$AMP= (0..31)
100 100 100 100 100 100 100 100 100 100 100 100 100 100 100 100 100 100 
100 100 100 100 100 100 100 100 100 100 100 100 100 100 
##$AQSEQ= 0
##$AQ_mod= 3
##$AUNM= <au_zg>
##$AUTOPOS= <28 >
##$BF1= 250.13
##$BF2= 250.13
##$BF3= 250.13
##$BF4= 250.13
##$BF5= 500.13
##$BF6= 500.13
##$BF7= 500.13
##$BF8= 500.13
##$BYTORDA= 1
##$CFDGTYP= 0
##$CFRGTYP= 5
##$CHEMSTR= <none>
##$CNST= (0..31)
1 1 145 1 1 1 1 1 1 1 1 1 1 1 1 1 1 1 1 1 1 1 1 1 1 1 1 1 1 1 1 1 
##$CPDPRG= <>
##$CPDPRG1= <>
##$CPDPRG2= <>
##$CPDPRG3= <>
##$CPDPRG4= <mlev>
##$CPDPRG5= <mlev>
##$CPDPRG6= <mlev>
##$CPDPRG7= <mlev>
##$CPDPRG8= <mlev>
##$CPDPRGB= <>
##$CPDPRGT= <>
##$D= (0..31)
0 1 0 0 0 0 0 0 0 0.06 0 0 0 0 0 0 0.0002 0 0 0 0 0 0 0 0 0 0 0 0 0 0 
0 
##$DATE= 1124372198
##$DBL= (0..7)
120 120 120 120 120 120 120 120 
##$DBP= (0..7)
150 150 150 150 150 150 150 150 
##$DBP07= 0
##$DBPNAM0= <>
##$DBPNAM1= <>
$$ [...]
##$SUBNAM7= <"">
##$SUBNAM8= <"">
##$SUBNAM9= <"">
##$SW= 20.6930455092707
##$SWIBOX= (0..15)
0 0 3 0 0 0 0 0 0 0 0 0 0 0 0 0 
##$SW_h= 5175.983436853
##$TD= 65536
##$TD0= 1
##$TE= 295.16
##$TE2= 300
##$TE3= 300
##$TEG= 300
##$TL= (0..7)
0 120 120 120 120 120 120 120 
##$TP= (0..7)
150 150 150 150 150 150 150 150 
##$TP07= 0
##$TPNAME0= <>
##$TPNAME1= <>
##$TPNAME2= <>
##$TPNAME3= <>
##$TPNAME4= <>
##$TPNAME5= <>
##$TPNAME6= <>
##$TPNAME7= <>
##$TPOAL= (0..7)
0.5 0.5 0.5 0.5 0.5 0.5 0.5 0.5 
##$TPOFFS= (0..7)
0 0 0 0 0 0 0 0 
##$TUNHIN= 0
##$TUNHOUT= 0
##$TUNXOUT= 0
##$USERA1= <user>
##$USERA2= <user>
##$USERA3= <user>
##$USERA4= <user>
##$USERA5= <user>
##$V9= 5
##$VALIST= <valist>
##$VCLIST= <CCCCCCCCCCCCCCC>
##$VD= 0
##$VDLIST= <DDDDDDDDDDDDDDD>
##$VPLIST= <PPPPPPPPPPPPPPP>
##$VTLIST= <TTTTTTTTTTTTTTT>
##$WBST= 1024
##$WBSW= 4
##$XGAIN= (0..3)
0 0 0 0 
##$XL= 0
##$YL= 0
##$YMAX_a= 371712
##$YMIN_a= -363455
##$ZGOPTNS= <>
##$ZL1= 120
##$ZL2= 120
##$ZL3= 120
##$ZL4= 120
##$ABSF1= 16.522
##$ABSF2= -4.171173
##$ABSG= 5
##$ABSL= 3
##$ALPHA= 0
##$AQORDER= 0
##$ASSFAC= 0
##$ASSFACI= 0
##$ASSFACX= 0
##$ASSWID= 0
##$AUNMP= <proc_1d>
##$AZFE= 0.1
##$AZFW= 0.1
##$BCFW= 0
##$BC_mod= 0
##$BYTORDP= 0
##$COROFFS= 0
##$CY= 12.5
##$DATMOD= 1
##$DC= 0
##$DFILT= <>
##$DTYPP= 0
##$F1P= 14.0000005364418
##$F2P= -0.99999901652339
##$FCOR= 0.5
##$FTSIZE= 32768
##$FT_mod= 6
##$GAMMA= 0
##$GB= 0
##$INTBC= 1
##$INTSCL= 1
##$ISEN= 128
##$LB= 0.3
##$LEV0= 0
##$LPBIN= 0
##$MAXI= 10000
##$MC2= 0
##$MEAN= 0
##$ME_mod= 0
##$MI= 0
##$NCOEF= 0
##$NC_proc= -3
##$NLEV= 6
##$NOISF1= 0
##$NOISF2= 0
##$NSP= 0
##$NTH_PI= 0
##$NZP= 0
##$OFFSET= 16.522
##$PC= 1
##$PHC0= -83.53924
##$PHC1= 2.776947
##$PH_mod= 1
##$PKNL= yes
##$PPARMOD= 0
##$PSCAL= 4
##$PSIGN= 0
##$REVERSE= no
##$SF= 250.13
##$SI= 32768
##$SIGF1= 0
##$SIGF2= 0
##$SINO= 400
##$SIOLD= 32768
##$SREGLST= <1H.DMSO>
##$SSB= 0
##$STSI= 32768
##$STSR= 0
##$SW_p= 5175.98343685301
##$SYMM= 0
##$S_DEV= 0
##$TDeff= 65536
##$TDoff= 0
##$TI= <Analysis number 999999
Compound Code 99
Book Reference 9
Project Code 9>
##$TILT= no
##$TM1= 0
##$TM2= 0
##$TOPLEV= 0
##$USERP1= <user>
##$USERP2= <user>
##$USERP3= <user>
##$USERP4= <user>
##$USERP5= <user>
##$WDW= 1
##$XDIM= 32768
##$YMAX_p= 383932872
##$YMIN_p= -254784
$$ End of Bruker specific parameters
$$ ---------------------------------
##NTUPLES= NMR SPECTRUM
##VAR_NAME=  FREQUENCY,     SPECTRUM/REAL,   SPECTRUM/IMAG
##SYMBOL=    X,             R,               I
##VAR_TYPE=  INDEPENDENT,   DEPENDENT,       DEPENDENT
##VAR_FORM=  AFFN,          ASDF,            ASDF
##VAR_DIM=   32768,         32768,           32768
##UNITS=     HZ,            ARBITRARY UNITS, ARBITRARY UNITS
##FACTOR=    0.157963299565203, 1,           1
##FIRST=     4132.6476996994, 0,             0
##LAST=      -1043.33573715361, 0,           0
##MIN=       -1043.33573715361, -254784,     0
##MAX=       4132.6476996994, 383932872,     0
$$ Real data points
##PAGE= N=1
##DATA TABLE= (X++(R..R)), XYDATA
$$ [...]
$$ plain form
18472 129022 121070 97106 74600 102945 117232 90469 75240 57655 40387 61824 94525 105223
18460 105223 84379 38011 67567 57138 48850 41978 79245 104100 89553 73668 47007 14141
18448 14141 27791 60354 82238 89865 61695 71142 109454 106193 66784 14366 30469 46941
18436 46941 44737 55788 37993 52697 62117 65290 71531 46501 30410 19578 30367 -13837
18424 -13837 -27257 -21701 7069 13475 12045 57217 115476 120070 61671 33452 51597 71788
18412 71788 86857 54589 13926 30361 58884 45061 27422 42925 57664 92740 114701 67134
18400 67134 59398 44072 70041 106022 117624 119071 103470 99830 123304 127117 136329 143661 94267
18387 94267 60172 58767 57313 25957 19999 16173 -23989 -6038 25355 43654 25164 57654
$$ packed form
18472A29022p952k3964k2506K8345J4287k6763j5229j7585j7268K1437L2701J0698
18460A05223k0844m6368K9556j0429q288o872L7267K4855j4547j5885k6661l2866
18448A4141J3650L2563K1884P627k8170R447L8312l261l9409n2418J6103J6472
18436D6941k204J1051j7795J4704R420L173O241k5030j6091j0832J0789m4204
18424a3837j3420N556K8770O406j430M5172N8259M594n8399k8219J8145K0191
18412G1788J5069l2268m0663J6435K8523j3823j7639J5503J4739L5076K1961m7567
18400F7134p736j5326K5969L5981J1602J447j5601l640K3474L813R212P332m9394
18387I4267l4095j405j454l1356n958l826m0162J7951L1393J8299j8490L2490
$$ plain form
18375 57654 44835 37266 68183 83678 48499 49543 55829 47267 68049 84357 59932 20278
18363 20278 25095 41584 85370 91815 99797 103534 117263 153654 123634 120368 91724 86717 59661
18350 59661 20038 10853 11131 49345 71387 66896 52280 20587 32355 3207 -13181 -8599 3574
18337 3574 18283 17260 60694 70981 61032 48781 42221 24234 -655 -40927 -40216 5814 11014
18324 11014 22800 51908 69487 102188 65990 6316 -30397 -7582 23612 11063 9921 16695
18312 16695 -8814 9853 21986 18433 37897 73696 72488 78247 91270 91449 107624 130934 166196
18299 166196 212656 231157 257009 281424 292013 299343 287616 220280 163547 135132 132533 93948
18287 93948 40230 55067 132421 131285 112682 99991 119051 171148 246032 350604 424952 476618
$$ packed form
18375E7654j2819p569L0917J5495l5179J044O286q562K0782J6308k4425l9654
18363B0278M817J6489M3786O445P982L737J3729L6391l0020l266k8644n007k7056
18350E9661l9623r185K78L8214K2042m491j4616l1693J1768k9148j6388M582J2173
18337C574J4709j023M3434J0287r949j2251o560j7987k4889m0272P11M6030N200
18324A1014J1786K9108J7579L2701l6198n9674l6713K2815L1194j2549j142O774
18312A6695k5509J8667J2133l553J9464L5799j208N759J3023J79J6175K3310L5262
18299A66196M6460J8501K5852K4415J0589P330j1727o7336n6733k8415k599l8585
18287I3948n3718J4837P7354j136j8603j2691J9060N2097P4884J04572P4348N1666
$$ plain form
18275 476618 542547 583537 561135 553349 536175 510334 445339 395219 364318 367303 400673 419804
18263 419804 448148 443810 483863 494375 429979 306775 199957 160584 132153 114759 119954
18252 119954 143931 135695 139847 138751 78217 60381 78249 90691 111489 100337 51200 77898
18240 77898 89470 87408 66142 86886 71551 55890 70791 62691 35043 42979 82489 86143
18228 86143 82055 61584 58996 45394 72125 40887 -13515 11435 50726 50842 31832 14054
18216 14054 15245 42376 36011 26502 37342 22709 21964 41322 41789 43702 30918 438 1398 30334
18202 30334 20970 -12411 -57775 -41180 -8222 -14560 -6731 1852 -17353 -10632 -31804 -65650 -67898
18189 -67898 -78415 -65198 -78040 -66876 -49927 -8315 45229 73386 38454 4265 -3275 9635
$$ packed form
18275D76618O5929M0990k2402p786j7174k5841o4995n0120l0901K985L3370J9131
18263D19804K8344m338M0053J0512o4396j23204j06818l9373k8431j7394N195
18252A19954K3977q236M152j096o0534j7836J7868J2442K0798j1152m9137K6698
18240G7898J1572k062k1266K0744j5335j5661J4901q100k7648P936L9510L654
18228H6143m088k0471k588j3602K6731l1238n4402K4950L9291J16j9010j7778
18216A4054J191K7131o365r509J0840j4633p45J9358M67J913j2784l0480R60K8936
18202C0334r364l3381m5364J6595L2958o338P829Q583j9205O721k1172l3846k248
18189f7898j0517J3217j2842J1164J6949M1612N3544K8157l4932l4189p540J2910
$$ plain form
18177 9635 42280 6970 -1536 -12552 23031 54315 77706 71198 33769 27863 26942 17232 1270
18164 1270 -13486 -13878 26592 39763 46468 39724 14957 38509 58531 116643 153791 140432 109413
18151 109413 54608 42912 27173 36503 97014 134344 155064 139243 101911 80024 73644 90313
18139 90313 69789 52258 70890 -4477 -48837 -57681 -63990 -46231 8455 22441 61511 97674
18127 97674 90809 72478 61709 19740 -10306 9470 67135 89046 88851 107832 103998 64745
18115 64745 24851 42677 75053 102343 97327 102177 78804 83772 73898 76434 84659 106243 122762
18102 122762 67521 66682 62205 64014 38409 635 19155 -14657 -14268 -14970 -29699 -43636 -41546
18089 -41546 8107 51028 17234 -50499 -62572 -36025 -34765 -46301 -39285 -25676 -20558 -8694
$$ packed form
18177I635L2645l5310q506j1016L5583L1284K3391o508l7429n906r21r710j5962
18164A270j4756l92M0470J3171O705o744k4767K3552K0022N8112L7148j3359l1019
18151A09413n4805j1696j5739R330O0511L7330K0720j5821l7332k1887o380J6669
18139I0313k0524j7531J8632p5367m4360q844o309J7759N4686J3986L9070L6163
18127I7674o865j8331j0769m1969l0046J9776N7665K1911j95J8981l834l9253
18115F4745l9894J7826L2376K7290n016M850k3373M968r874K536Q225K1584J6519
18102A22762n5241q39m477J809k5605l7774J8520l3812L89p02j4729j3937K090
18089d1546M9653M2921l3794o7733j2073K6547J260j1536P016J3609N118J1864
$$ plain form
18077 -8694 40147 71701 114283 120552 112506 86250 64554 57028 62798 82677 88163 116321 91884
18064 91884 65456 56766 66157 77447 43639 52728 57455 20061 27734 54734 76480 110544 131149
18051 131149 114673 119006 120737 144884 145119 31258 -26063 -5587 -4364 59073 104381 124270
18039 124270 107546 104546 112072 79406 62205 81275 122878 136318 130125 90669 63818 90026
18027 90026 96104 63299 62501 91218 77680 110960 194099 249286 232612 260271 270837 272824
18015 272824 299253 303071 290636 221579 169133 147241 154520 143819 124932 147631 153057 158900
18003 158900 200148 225885 211137 163520 169723 225429 236969 248648 217144 169265 150940 159667
17991 159667 167073 186422 211095 225379 244387 279280 324066 339254 293636 300169 317200 354639
$$ packed form
18077h694M8841L1554M2582O269q046k6256k1696p526N770J9879N486K8158k4437
18064I1884k6428q690R391J1290l3808R089M727l7394P673K7000K1746L4064K0605
18051A31149j6476M333J731K4147K35j13861n7321K0476J223O3437M5308J9889
18039A24270j6724l000P526l2666j7201J9070M1603J3440o193l9456k6851K6208
18027I0026O078l2805p98K8717j3538L3280Q3139N5187j6674K7659J0566J987
18015B72824K6429L818j2435o9057n2446k1892P279j0701j8887K2699N426N843
18003A58900M1248K5737j4748m7617O203N5706J1540J1679l1504m7879j8325Q727
17991A59667P406J9349K4673J4284J9008L4893M4786J5188m5618O533J7031L7439
$$ plain form
17979 354639 359925 342351 356660 352929 319829 295233 318920 380167 415013 415264 420270 446220
17967 446220 447455 444960 423411 420961 442013 458945 463209 493942 545204 590341 617363 681200
17955 681200 790345 900530 953570 986147 942186 918542 932174 984426 1045851 1085298 1049030
17944 1049030 1011828 1041626 1083071 1143805 1252173 1417852 1672117 1944545 2327788 2898458
17934 2898458 3645114 4542924 5741404 7361769 9600127 12789549 17464893 23923400
17926 23923400 31982612 41651230 51985894 58628065 59662149 53516633 39657396 26245099
17918 26245099 18011370 13210308 10472434 8849838 7823201 7080265 6540119 6094253
17910 6094253 5769770 5568190 5466698 5468478 5497968 5614497 5822392 6160030 6682076 7454586
$$ packed form
17979C54639N286j7574J4309l731l3100k4596K3687O1247L4846K51N006K5950
17967D46220J235k495k1549k450K1052J6932M264L0733N1262M5137K7022O3837
17955F81200J09145J10185N3040L2577m3961k3644J3632N2252O1425L9447l6268
17944A049030l7202K9798M1445O0734J08368J65679K54265K72428L83243N70670
17934B898458P46656Q97810J198480J620365K238358L189422M675344O458507
17926B3923400Q059212R668618J0334664O642171J034084o145516j3859237j3412297
17918B6245099q233729m801062k737874j622596j026637p42936n40146m45866
17910F094253l24483k01580j01492J780K9490J16529K07895L37638N22046P72510
$$ plain form
17900 7454586 8552443 10008521 11798149 14089511 17250812 21759868 28484213 37954838
17892 37954838 49789254 63918541 79161685 89404363 91205527 82496856 62028126
17885 62028126 41260352 28112945 20468786 15923531 13104630 11255714 9969057 9006151
17877 9006151 8275666 7714367 7235092 6861314 6552466 6306105 6071413 5888660 5765008
17868 5765008 5672332 5660506 5745869 5849412 5911587 5909095 5730475 5427775 5130014 4844987
17858 4844987 4627360 4404896 4140965 3871715 3596393 3358483 3162577 2987781 2831782
17849 2831782 2692913 2569913 2434433 2264905 2091690 1970475 1845733 1773307 1692452 1587551
17839 1587551 1517555 1469938 1405059 1312759 1319731 1240888 1133208 1076208 1063500 1040554 1033638
$$ packed form
17900G454586J097857J456078J789628K291362L161301M509056O724345R470625
17892C7954838J1834416J4129287J5243144J0242678J801164q708671k0468730
17885F2028126k0767774j3147407p644159m545255k818901j848916j286657r62906
17877I006151p30485n61299m79275l73778l08848k46361k34692j82753j23652
17868E765008r2676j1826Q5363J03543O2175k492j78620l02700k97761k85027
17858D844987k17627k22464k63931k69250k75322k37910j95906j74796j55999
17849B831782j38869j23000j35480j69528j73215j21215j24742p2426q0855j04901
17839A587551o9996m7617o4879r2300O972p8843j07680n7000j2708k2946o916
$$ plain form
17828 1033638 1004143 973745 969943 964866 937731 904148 900653 888351 835727 811925 839887 880415
17816 880415 807593 751108 790892 803690 787847 788381 782840 765029 739398 757297 765605 776413
17804 776413 820557 854766 840131 839066 835931 822046 796199 789517 865868 950202 969075 1000203
17792 1000203 1090176 1226804 1328753 1443748 1553832 1642344 1675597 1665303 1651815 1681327
17782 1681327 1729330 1787681 1786240 1846294 2001696 2165557 2361856 2611672 2881704 3144707
17772 3144707 3460400 3875375 4497623 5407682 6682984 8321303 10465945 13425747 17562285
17763 17562285 23501783 31960359 42975691 56245141 71447561 84622165 90235002
17756 90235002 86798376 71537162 50324587 34144302 24604374 19180404 16032483 14086362
$$ packed form
17828A033638k9495l0398l802n077k7135l3583l495j2302n2624k3802K7962M0528
17816H80415p2822n6485L9784J2798j5843N34n541j7811k5631J7899Q308J0808
17804G76413M4144L4209j4635j065l135j3885k5847o682P6351Q4334J8873L1128
17792A000203Q9973J36628J01949J14995J10084Q8512L3253j0294j3488K9512
17782A681327M8003N8351j441O0054J55402J63861J96299K49816K70032K63003
17772C144707L15693M14975O22248R10059J275302J638319K144642K959802M136538
17763A7562285N939498Q458576J1015332J3269450J5202420J3174604N612837
17756I0235002l436626j5261214k1212575j6180285r539928n423970l147921j946121
$$ plain form
17748 14086362 12807296 11922388 11180373 10641627 10374163 10288816 10393420 10574967 10863440
17739 10863440 11168100 11619216 12265763 13175917 14566176 16568025 19111739 22255476 26202334
17730 26202334 31385825 38612306 48835353 62614485 80432376 102478094 126213396
17723 126213396 147006379 162144432 165409470 155525412 137864322 114013748 87856915
17716 87856915 65992413 50577757 40282839 33396321 28647554 25203963 22678876 20766093
17708 20766093 19229267 17948684 16877855 15989848 15181913 14506345 14013638 13648059 13464279
17699 13464279 13425776 13426970 13356251 13177360 12811367 12266058 11735482 11149707 10480206 9752897
17689 9752897 9030279 8325060 7688511 7201652 6697381 6213136 5797119 5457548 5158437
$$ packed form
17748A4086362j279066q84908p42015n38746k67464q5347J04604J81547K88473
17739A0863440L04660M51116O46547R10154J390259K001849K543714L143737L946858
17730B6202334N183491P226481J0223047J3779132J7817891K2045718K3735302
17723A26213396K0792983J5138053L265038r884058j7661090k3850574k6156833
17716H7856915k1864502j5414656j0294918o886518m748767l443591k525087j912783
17708B0766093j536826j280583j070829q88007q07935o75568m92707l65579j83780
17699A3464279l8503J194p0719j78891l65993n45309n30576n85775o69501p27309
17689I752897p22618p05219o36549m86859n04271m84245m16017l39571k99111
$$ plain form
17680 5158437 4845356 4556839 4304166 4079434 3883716 3734738 3603237 3429459 3254837
17671 3254837 3091378 2943833 2814051 2694253 2582217 2455395 2351749 2245632 2122729
17662 2122729 2008141 1895180 1798083 1694592 1611680 1574381 1481696 1435497 1390031 1329546 1292680
17651 1292680 1219411 1151707 1097343 1019769 979526 958599 948903 990414 953631 861432 805757
17640 805757 774392 771364 766064 737916 727735 737013 708928 728217 751027 702610 608618 586267
17628 586267 591669 583714 566559 523343 492074 474580 477611 440540 463698 490964 468844 463287
17616 463287 387986 333850 296210 343959 345005 352875 337075 332635 346964 352435 371932 374671
17604 374671 384587 397349 433474 484074 496858 512471 519191 519045 492536 412923 379393 373871
$$ packed form
17680E158437l13081k88517k52673k24732j95718j48978j31501j73778j74622
17671C254837j63459j47545j29782j19798j12036j26822j03646j06117j22903
17662B122729j14588j12961r7097j03491q2912l7299r2685m6199m5466o0485l6866
17651A292680p3269o7704n4364p7574m0243k0927r696M1511l6783r2199n5675
17640H05757l1365l028n300k8148j0181R278k8085J9289K2810m8417r3992k2351
17628E86267N402p955j7155m3216l1269j7494L031l7071K3158K7266k2120n557
17616D63287p5301n4136l7640M7749J046P870j5800m440J4329N471J9497K739
17604C74671R916J2762L6125N0600J2784J5613O720j46k6509p9613l3530n522
$$ plain form
17592 373871 357815 310789 312462 304160 259302 254935 290165 246266 216659 273742 318438 363539
17580 363539 326006 277493 249173 248907 235794 259186 261763 274813 254991 257754 316658 385203
17568 385203 398172 415289 435247 447525 466989 414130 401345 413929 367012 352459 344882 335258
17556 335258 363093 368226 369643 347187 310118 315312 351242 330644 335142 361663 385077 397697
17544 397697 352310 293676 302819 339021 345875 322303 310819 281181 311835 298840 295684 266358
17532 266358 262407 239773 207114 212643 217190 192563 165523 189755 206771 193619 178103 190057
17520 190057 218097 227515 197708 173734 195638 213450 203998 185994 216862 246101 256772 224185
17508 224185 185438 200481 216180 208202 183420 158542 188645 182300 165927 143699 107944 116923
$$ packed form
17592C73871j6056m7026J673q302m4858m367L5230m3899k9607N7083M4696M5101
17580C63539l7533m8513k8320k66j3113K3392K577J3050j9822K763N8904O8545
17568C85203J2969J7117J9958J2278J9464n2859j2785J2584m6917j4553p577r624
17556C35258K7835N133J417k2456l7069N194L5930k0598M498K6521K3414J2620
17544C97697m5387n8634R143L6202O854k3572j1484k9638L0654j2995l156k9326
17532B66358l951k2634l2659N529M547k4627k7040K4232J7016j3152j5516J1954
17520A90057K8040R418k9807k3974K1904J7812r452j8004L0868K9239J0671l2587
17508B24185l8747J5043J5699p978k4782k4878L0103o345j6373k2228l5755Q979
$$ plain form
17496 116923 100556 85920 102817 98400 78591 118813 171431 173783 188459 192552 175241 143023
17484 143023 126858 144238 173190 180994 175503 120141 111657 140641 141540 126360 141093 136054 122107
17471 122107 123521 135765 118191 88984 94163 111575 130977 126382 113641 111279 119294 89538
17459 89538 78469 110617 130279 157711 165923 162041 177080 140695 110896 118353 92535 62079
17447 62079 35745 99556 101994 69650 99380 74001 44592 50668 53409 29601 63096 95513
17435 95513 146856 145985 105696 79278 78334 72244 81630 121982 155429 166710 193299 182006 148343
17422 148343 138559 120907 135994 177455 169826 130552 121616 145386 131312 112250 81412 66050
17410 66050 116525 89885 76724 45473 628 24666 77183 115121 120600 111191 123934 144743
$$ packed form
17496A16923j6367j4636J6897m417j9809M0222N2618K352J4676M093j7311l2218
17484A43023j6165J7380K8952P804n491n5362q484K8984Q99j5180J4733n039j3947
17471A22107J414J2244j7574k9207N179J7412J9402m595j2741k362Q015k9756
17459H9538j1069L2148J9662K7432Q212l882J5039l6385k9799P457k5818l0456
17447F2079k6334O3811K438l2344K9730k5379k9409O076K741k3808L3495L2417
17435I5513N1343q71m0289k6418r44o090R386M0352L3447J1281K6589j1293l3663
17422A48343r784j7652J5087M1461p629l9274q936K3770j4074j9062l0838j5362
17410F6050N0475k6640j3161l1251m4845K4038N2517L7938N479r409J2743K0809
$$ plain form
17398 144743 160918 126047 113090 85343 63844 59808 74810 19987 16276 17756 62483 75399
17386 75399 65005 41306 33480 -4375 11132 53941 45653 48469 41819 15277 28672 75553
17374 75553 90018 52721 37230 22525 2105 15628 47543 58895 50092 57229 37168 38584
17362 38584 20253 9607 -907 17492 50431 31953 6991 17432 32732 55999 67323 73639
17350 73639 63936 74770 99890 85156 41042 -2677 -9517 10623 9432 37838 48233 43166
17338 43166 8361 7892 47211 39021 22749 45476 54750 61023 95060 140652 154771 165960 174780
17325 174780 180491 259001 320125 348184 340601 342527 306960 273470 256561 208653 167447 170904
17313 170904 132848 117547 114836 78724 61841 89566 121367 152520 136775 89333 100817 102226
$$ packed form
17398A44743J6175l4871j2957k7747k1499m036J5002n4823l711J480M4727J2916
17386G5399j0394k3699p826l7855J5507M2809q288K816o650k6542J3395M6881
17374G5553J4465l7297j5491j4705k0420J3523L1915J1352q803P137k0061J416
17362C8584j8331j0646j0514J8399L2939j8478k4962J0441J5300K3267J1324O316
17350G3639r703J0834K5120j4734m4114m3719o840K0140j191K8406J0395n067
17338D3166l4805m69L9319q190j6272K2727R274O273L4037M5592J4119J1189Q820
17325A74780N711P8510O1124K8059p583J926l5567l3490j6909m7908m1206L457
17313A70904l8056j5301k711l6112j6883K7725L1801L1153j5745m7442J1484J409
$$ plain form
17301 102226 124380 77991 35982 60971 82993 95443 108526 81853 90563 100500 149278 208617
17289 208617 250562 274560 282683 296070 312665 306525 230138 181689 171884 161593 160310 140757
17277 140757 99117 121935 149152 148467 140899 153076 113423 70871 85269 105882 83457 72756
17265 72756 53861 83965 123579 84917 61545 63524 42252 50931 62928 50397 46342 63256
17253 63256 64660 63642 38339 14515 1475 -4649 19347 47185 53554 49577 61075 62589 74900
17240 74900 64596 45184 29189 -12999 -13941 7763 35323 72303 79840 77601 74314 57891 39155
17227 39155 46870 46846 59573 79319 130109 140431 194016 317676 387799 374927 345444 292950
17215 292950 271552 243618 195080 185273 128254 82353 70624 53942 63656 75686 99471 125849
$$ packed form
17301A02226K2154m6389m2009K4989K2022J2450J3083k6673Q710R937M8778N9339
17289B08617M1945K3998Q123J3387J6595o140p6387m8449r805j0291j283j9553
17277A40757m1640K2818K7217o85p568J2177l9653m2552J4398K0613k2425j0701
17265G2756j8895L0104L9614l8662k3372J979k1272Q679J1997j2531m055J6914
17253F3256J404j018k5303k3824j3040o124K3996K7838O369l977J1498J514J2311
17240G4900j0304j9412j5995m2188r42K1704K7560L6980P537k239l287j6423j8736
17227C9155P715k4J2727J9746N0790J0322N3585J23660P0123j2872k9483n2494
17215B92950k1398k7934m8538r807n7019m5901j1729j6682R714J2030K3785K6378
$$ plain form
17203 125849 90822 103983 123472 80776 85695 110848 85748 56379 88473 116907 133277 125241
17191 125241 95254 111699 143447 172071 212443 293290 331186 346039 348096 328605 270916 234198
17179 234198 212773 204441 215717 189985 168482 133114 163535 208574 200652 180602 210837 245761
17167 245761 243866 288743 360700 449533 509084 537836 557335 575595 531212 422553 340383
17156 340383 259470 185543 99314 101172 125438 112991 87663 118448 102076 77781 67003 61529
17144 61529 107377 99508 73997 45803 79873 129230 92555 47505 19713 21690 72635 72589 63574
17131 63574 44605 27600 50324 37531 23675 19349 59643 100496 74120 43580 19799 21203
17119 21203 60870 87300 78913 63778 48289 18611 8456 16431 23064 14594 28707 28606 21115
$$ packed form
17203A25849l5027J3161J9489m2696M919K5153k5100k9369L2094K8434J6370q036
17191A25241k9987J6445L1748K8624M0372Q0847L7896J4853K057j9491n7689l6718
17179B34198k1425q332J1276k5732k1503l5368L0421M5039p922k0050L0235L4924
17167B45761j895M4877P1957Q8833N9551K8752J9499J8260m4383j08659q2170
17156C40383q0913p3927q6229J858K4266j2447k5328L0785j6372k4295j0778n474
17144F1529M5848p869k5511k8194L4070M9357l6675m5050k7792J977N0945m6r015
17131F3574j8969j7005K2724j2793j3856m326M0294M0853k6376l0540k3781J404
17119B1203L9667K6430q387j5135j5489k9678j0155P975O633q470J4113j01p491
$$ plain form
17106 21115 40900 64110 56069 25843 66187 97487 83816 32603 10459 20269 26648 13864
17094 13864 -8290 -14193 20846 16988 -37289 -39192 21650 48054 47292 49863 77293 35866 -9980
17081 -9980 -42315 -61422 -51570 -59600 -30084 -2122 -6127 10527 28449 8527 -5159 16367
17069 16367 44935 48302 22277 30395 28709 15977 7695 32706 63089 80230 87484 124655 119696
17056 119696 70533 -13718 -28720 -35076 -88836 -57538 4708 -9258 -1672 21585 37407 20267
17044 20267 46062 70421 46424 18447 34401 57105 40924 42978 40430 43732 60319 49221
17032 49221 50748 45152 58357 62361 54821 52760 79607 98033 69424 -7144 19387 53361 44851
17019 44851 49925 71552 73591 53809 33116 43808 69030 63758 21316 -7323 10520 34422
$$ packed form
17106B1115J9785K3210q041l0226M0344L1300j3671n1213k2144R810O379j2784
17094A3864k2154n903L5039l858n4277j903O0842K6404p62K571K7430m1427m5846
17081i980l2335j9107R852q030K9516K7962m005J6654J7922j9922j3686K1526
17069A6367K8568L367k6025Q118j686j2732q282K5011L0383J7141P254L7171m959
17056A19696m9163q4251j5002o356n3760L1298O2246j3966P586K3257J5822j7140
17044B0267K5795K4359k3997k7977J5954K2704j6181K054k548L302J6587j1098
17032D9221J527n596J3205M004p540k061K6847J8426k8609p6568K6531L3974q510
17019D4851N074K1627K039j9782k0693J0692K5222n272m2442k8639J7843K3902
$$ plain form
17007 34422 12547 26795 10159 -5464 -22182 -26382 -31383 -30969 -55425 -55617 -41410 -20669 -19777
16994 -19777 -21677 -8491 -13231 659 1090 16970 15864 32835 55796 47084 6258 -12431 18981
16981 18981 12914 -29745 -16871 -44231 -74364 -54692 -21745 -25663 -42849 -62221 -13594 -16745
16969 -16745 -29298 -33956 -22730 -29339 11225 52707 21532 -38859 -76297 -48469 -6010 4528
16957 4528 -45840 -68423 -57875 -23052 18573 39168 -34015 -33493 -1467 -32534 -60041 -62091
16945 -62091 -46854 -49633 -25816 -24270 -25186 -35620 -791 28088 48474 54322 38030 71532 91146
16932 91146 87870 49440 44276 25938 26566 26077 -34626 -44773 -36697 -56464 -65242 -35265 -24235
16919 -24235 -10421 -1069 41120 58916 61435 47955 36807 11086 3601 4855 26797 31763 23077
$$ packed form
17007C4422k1875J4248j6636j5623j6718m200n001M14k4456j92J4207K0741Q92
16994a9777j900J3186m740J3890M31J5880j106J6971K2961q712m0826j8689L1412
16981A8981o067m2659J2874k7360l0133J9672L2947l918j7186j9372M8627l151
16969a6745j2553m658J1226o609M0564M1482l1175o0391l7438K7828M2459J0538
16957D528n0368k2583J0548L4823M1625K0595p3183N22L2026l1067k7507k050
16945f2091J5237k779K3817J546r16j0434L4829K8879K0386N848j6292L3502J9614
16932I1146l276l8430n164j8338O28m89o0703j0147Q076j9767q778K9977J1030
16919b4235J3814R352M2189J7796K519j3480j1148k5721p485J254K1942M966q686
$$ plain form
16906 23077 21759 33067 85597 120818 68476 20060 5378 58592 58147 10795 -16539 2877
16894 2877 20971 21808 13977 32572 60732 47952 27187 31615 14829 38689 50502 47447 40441
16881 40441 44575 31177 24248 -1046 4213 -29552 -56542 -33878 -4107 2956 -6754 -5368 -2098
16868 -2098 -11485 -1765 22743 22810 -1273 22173 27306 26191 31341 32126 -7137 -62501 -90090 -90122
16854 -90122 -40483 -252 11647 21061 -8164 -27975 -8973 18516 16324 30448 39659 19916
16842 19916 11225 30320 18897 19089 15648 24047 17706 -9471 -38210 -20432 -9312 3495 16330
16829 16330 -14633 -8101 11158 3387 14043 52484 54305 51850 43325 13382 -32092 -26056 185
16816 185 45338 39069 15336 7026 -13144 -23015 -10343 -6369 -27924 13496 67280 115243 126218
$$ packed form
16906B3077j318J1308N2530L5221n2342m8416j4682N3214m45m7352k7334J9416
16894B877J8094Q37p831J8595K8160j2780k0765M428j6786K3860J1813l055p006
16881D0441M134j3398o929k5294N259l3765k6990K2664K9771P063r710J386L270
16868b098r387R720K4508O7k4083K3446N133j115N150P85l9263n5364k7589l2
16854i0122M9639M0231J1899R414k9225j9811J9002K7489k192J4124R211j9743
16842A9916q691J9095j1423J92l441Q399o341k7177k8739J7778J1120J2807J2835
16829A6330l0963O532J9259p771J0656L8441J821k455q525k9943m5474O036K6241
16816A85M5153o269k3733q310k0170r871J2672L974k1555M1420N3784M7963J0975
$$ plain form
16803 126218 85609 45088 39344 52897 72810 74496 22667 -19315 -28155 -50375 -57885 -36875
16791 -36875 -5559 37548 65917 12113 -15784 -24795 -60202 -43356 -54590 -88950 -122432 -123983
16779 -123983 -106320 -109919 -107508 -114381 -91354 -74743 -42062 -11092 -11473 -6874 -18244 -52645 -13190
16766 -13190 50415 41685 -9012 -23237 -11478 -9584 37102 24489 20803 4229 -9274 -34878
16754 -34878 -30514 8123 15246 20479 23269 -24639 -63405 -76083 -83096 -59487 -28050 27376 56153
16741 56153 79867 61953 45414 11071 -26142 -24740 -32448 -64522 -53228 -26056 15477 27849
16729 27849 5242 2681 -20137 -41879 -48998 -60269 -54264 -19705 9273 25042 10523 -8034
16717 -8034 -2457 5584 8912 5865 -9164 3576 23693 7287 -11432 -35686 -42526 -89642 -77426
$$ packed form
16803A26218m0609m0521n744J3553J9913J686n1829m1982q840k2220p510K1010
16791c6875L1316M3107K8369n3804k7897r011l5407J6846j1234l4360l3482j551
16779a23983J7663l599K411o873K3027J6611L2681L0970l81M599j1370l4401L9455
16766a3190O3605q730n0697j4225J1759J894M6686j2613l686j6574j3503k5604
16754c4878M364L8637P123N233K790m7908l8766j2678p013K3609L1437N5426K8777
16741E6153K3714j7914j6539l4343l7213J402p708l2074J1294K7172M1533J2372
16729B7849k2607k561k2818k1742p119j1271O005L4559K8978J5769j4519j8557
16717h034N577Q041L328l047j5029J2740K0117j6406j8719k4254o840m7116J2216
$$ plain form
16704 -77426 -41472 -34807 -2959 -10585 -53388 -37733 12130 22102 30575 28360 18414 11794 -32922
16691 -32922 -10554 19774 16952 -8330 12618 35647 715 13204 4520 -24759 -39102 -49463
16679 -49463 -60732 -38866 -42753 -39123 -25358 -47499 -66979 -27678 26914 14842 4531 -6709
16667 -6709 3275 29220 19565 14467 13872 2931 -58527 -68971 -65881 -64863 -71040 -55664 -4181
16654 -4181 15568 -5926 7978 21772 -2541 -21246 -22466 5764 -30641 -27924 -5755 -16971
16642 -16971 -42675 -52738 -22432 -10388 -5203 1331 14331 35333 11664 -2557 34588 14737
16630 14737 -11539 1068 35899 41740 12651 3946 27343 1271 -16214 -57485 -84907 -56782
16618 -56782 -13243 -25092 -91695 -117364 -80680 -33608 -44358 -56870 -50754 -32129 -12470 -10289
$$ packed form
16704g7426L5954O665L1848p626m2803J5655M9863R972Q473k215r946o620m4716
16691c2922K2368L0328k822k5282K0948K3029l4932J2489q684k9279j4343j0361
16679d9463j1269K1866l887L630J3765k2141j9480L9301N4592j2072j0311j1240
16667f709R984K5945r655n098n95j0941o1458j0444L090J018o177J5376N1483
16654d181J9749k1494J3904J3794k4313j8705j220K8230l6405K717K2169j1216
16642a6971k5704j0063L0306J2044N185O534J3000K1002k3669j4221L7145j9851
16630A4737k6276J2607L4831N841k9089q705K3397k6072j7485m1271k7422K8125
16618e6782M3539j1849o6603k5669L6684M7072j0750j2512O116J8625J9659K181
$$ plain form
16606 -10289 -11160 -13803 -2283 -17907 2194 64896 66778 7237 -4390 -3974 -28998 -37195 -13554
16593 -13554 -3118 1976 9121 974 12253 45682 23174 -21692 -53793 -42986 -29965 4590
16581 4590 7136 25291 43466 3750 -1795 -11334 -10080 -21640 15946 11721 25753 47916 35161
16568 35161 35457 28737 60120 87255 83613 44706 56893 9157 -56500 -22257 17273 32207
16556 32207 28507 -20754 -10111 -38048 -69332 -111836 -96506 -38500 -19298 -23351 -28811 12948
16544 12948 27051 6495 41204 18552 -12548 -25144 -2980 2859 18543 13089 40728 26317
16532 26317 -28781 -19662 24507 51601 36154 49557 30538 27056 -34010 -73662 -46225 -16734
16520 -16734 -30738 -33216 -39011 -18827 -31460 -48538 -17806 -6266 57337 65888 21429 23925
$$ packed form
16606a0289q71k643J1520j5624K0101O2702J882n9541j1627M16k5024q197K3641
16593a3554J0436N094P145q147J1279L3429k2508m4866l2101J0807J3021L4555
16581D590K546J8155J8175l9716n545r539J254j1560L7586m225J4032K2163j2755
16568C5161K96o720L1383K7135l642l8907J2187m7736o5657L4243L9530J4934
16556C2207l700m9261J0643k7937l1284m2504J5330N8006J9202m053n460M1759
16544A2948J4103k0556L4709k2652l1100j2596K2164N839J5684n454K7639j4411
16532B6317n5098R119M4169K7094j5447J3403j9019l482o1066l9652K7437K9491
16520a6734j4004k478n795K0184j2633j7078L0732J1540O3603Q551m4459K496
$$ plain form
16508 23925 34576 36207 15011 -15630 -49278 -69982 -66077 -54063 -33920 -39526 -50414 -71470
16496 -71470 -71954 -52621 -25413 28421 57027 40267 37475 27678 -18763 -2517 -3553 -9004 2521
16483 2521 -15815 -41474 -16706 1737 -26538 -58233 -54628 -32346 -9122 35834 39280 -2660
16471 -2660 -10427 -8830 2268 -40598 -36313 -15861 -37017 -10681 13624 18584 11215 19429 11525
16458 11525 -25522 -4582 -15770 -13789 -27171 -23637 -28219 -29617 -49191 -38166 -28695 -19233 -46656
16445 -46656 -33397 -8902 10541 4340 -9541 -11970 -12421 -17633 10830 40968 13555 5499 30882
16432 30882 26704 17402 18495 -5544 -8835 -8451 -21127 -25112 -5210 -15050 -2546 -30301 -27020
16419 -27020 -34260 -9567 12397 -5344 8253 29423 20834 -15412 -47717 -42535 -16093 -13975
$$ packed form
16508B3925J0651J631k1196l0641l3648k0704L905J2014K0143n606j0888k1056
16496g1470m84J9333K7208N3834K8606j6760k792r797m6441J6246j036n451J1525
16483B521j8336k5659K4768J8443k8275l1695L605K2282K3224M4956L446m1940
16471b660p767J597J1098m2866M285K0452k1156K6336K4305M960p369Q214p904
16458A1525l7047K0940j1188J981j3382L534m582j398j9574J1025R471R462k7423
16445d6656J3259K4495J9443o201j3881k429m51n212K8463L0138k7413q056K5383
16432C0882m178r302J093k4039l291L84j2676l985J9902r840J2504k7755L281
16419b7020p240K4693K1964j7741J3597K1170q589l6246l2305N182K6442K118
$$ plain form
16407 -13975 -7434 23997 34719 51472 39292 31454 29848 14761 -7680 -35166 -39930 -42789 -62253
16394 -62253 -82585 -38358 -28574 -40193 -30560 -5991 13939 32501 21839 8790 -16826 -44051
16382 -44051 -52367 -27534 -36318 -15193 16280 41415 27135 31767 49898 2998 -6586 36595
16370 36595 66080 45578 -39962 -30432 -15034 1003 8154 -16811 -24021 -25171 -17754 -6419 8270
16357 8270 15877 15818 4454 8520 51476 69326 57013 67959 73777 52640 28894 51621 40138
16344 40138 18978 33509 69304 64462 22520 22585 11730 -17982 -11494 -23876 -2600 34353 35980
16331 35980 29943 -4183 -24619 -23105 -15435 19094 16563 -18391 -30074 -59418 -12227 2649
16319 2649 -10442 -16268 -7827 43182 65716 42963 48528 40868 22822 22287 -12843 -22290 12117
$$ packed form
16407a3975O541L1431J0722J6753j2180p838j606j5087k2441k7486m764k859j9464
16394f2253k0332M4227R784j1619R633K4569J9930J8562j0662j3049k5616k7225
16382d4051q316K4833q784K1125L1473K5135j4280M632J8131m6900r584M3181
16370C6595K9485k0502q5540R530J5398J6037P151k4965p210j150P417J1335J4689
16357H270P607n9j1364M066M2956J7850j2313J0946N818k1137k3746K2727j1483
16344D0138k1160J4531L5795m842m1942O5j0855k9712O488j2382K1276L6953J627
16331C5980o037l4126k0436J514P670L4529k531l4954j1683k9344M7191J4876
16319B649j3091n826Q441N1009K2534k2753N565p660j8046n35l5130r447L4407
$$ plain form
16306 12117 53978 58234 44346 37216 34061 13668 -23016 -12954 -1857 -21821 -55686 -63400
16294 -63400 -39824 -12564 -37443 -65707 -79940 -66572 -51081 -18367 18226 27711 16688 34776
16282 34776 26660 12236 -17345 -7771 -16784 -20957 -31905 -24302 -25142 -11478 -47437 -52603 -77755
16269 -77755 -44678 -12208 -23087 -30058 -50471 -48783 -46979 -58178 -73811 -79932 -12048 4276
16257 4276 -7128 -2282 -20851 8970 27629 2429 -13976 -26738 -23428 -30069 -7544 -2467 14046
16244 14046 25138 6538 23294 21634 -4105 -14759 8700 26733 29670 25748 -10224 -25204
16232 -25204 11860 -1265 -30651 -37399 -30606 -75147 -101600 -57782 -24661 -22611 -60152 -52409
16220 -52409 -6733 9548 32479 11089 6922 492 -2980 42974 59683 31011 6705 24461
$$ packed form
16306A2117M1861M256j3888p130l155k0393l6684J0062J1097j9964l3865p714
16294f3400K3576K7260k4879k8264j4233J3368J5491L2714L6593R485j1023J8088
16282C4776q116j4424k9581R574r013m173j0948P603q40J3664l5959n166k5152
16269g7755L3077L2470j0879o971k0413J688J804j1199j5633o121O7884J6324
16257D276j1404M846j8569K9821J8659k5200j6405j2762L310o641K2525N077J6513
16244A4046J1092j8600J6756j660k5739j0654K3459J8033K937l922l5972j4980
16232b5204L7064j3125k9386o748O793m4541k6453M3818L3121K050l7541P743
16220e2409M5676J6281K2931k1390m167o430l472M5954J6709k8672k4306J7756
$$ plain form
16208 24461 27844 32251 43021 22172 -13184 5238 24057 13168 -14315 -23115 1347 -15466
16196 -15466 -32293 -31669 -10275 -59551 -49233 15483 56370 27824 -5699 -20830 -31103 -5040
16184 -5040 -12829 45269 67753 55966 61794 47101 -5346 -45792 -26820 -24752 -13857 -9788 -12612
16171 -12612 -647 21360 48248 42140 30812 781 -15296 -58471 -106448 -101750 -49688 -69318
16159 -69318 -80002 -39949 6282 -6150 15769 21049 -2928 -14464 -13927 -48437 -84203 -52746
16147 -52746 -34371 -59382 -50660 -11950 -1525 29867 48438 34917 19247 36187 37104 -7741
16135 -7741 18834 -9231 -27062 -28702 5051 17468 57832 26997 8441 -10797 -20314 -44546
16123 -44546 -23480 5039 -14543 -41155 -7007 -6923 -27429 -37583 -57635 -54703 -13377 -8906 15288
$$ packed form
16208B4461L383M407J0770k0849l5356J8422J8819j0889k7483q800K4462j6813
16196a5466j6827O24K1394m9276J0318O4716M0887k8546l3523j5131j0273K6063
16184e040p789N8098K2484j1787N828j4693n2447m0446J8972K068J0895M069k824
16171a2612J1965K2007K6888o108j1328l0031j6077m3175m7977M698N2062j9630
16159f9318j0684M0053M6231j2432K1919N280k3977j1536N37l4510l5766L1457
16147e2746J8375k5011Q722L8710J0425L1392J8571j3521j5670J6940R17m4845
16135g741K6575k8065j7831j640L3753J2417M0364l0835j8556j9238r517k4232
16123d4546K1066K8519j9582k6612L4148Q4k0506j0154k0052K932M1326M471K4194
$$ plain form
16110 15288 27799 -21078 -70160 -76599 -69814 -74364 -32515 -2422 -33883 -40307 -8268 -14649 -11244
16097 -11244 -3843 -5857 14860 31197 26603 -10076 9323 28831 12645 5817 26620 33230 50175
16084 50175 75304 72043 49961 48857 44969 3135 7660 14229 -18826 -43474 -48163 -29289 4607
16071 4607 31437 -6486 -31729 -5176 -39747 -42361 -24466 -56943 -46147 15755 39643 46341
16059 46341 17032 -10003 -1919 -3177 -12967 -28290 -21334 -8810 -35978 -54197 -15989 3098
16047 3098 5665 -2468 -30473 -50085 -76890 -104484 -91645 -51190 -67807 -45821 -31676 1704
16035 1704 15498 -25675 -72196 -61081 -35906 -48983 -54124 -30073 -1205 8637 21891 -12868
16023 -12868 -40928 -23386 -33978 -25294 -16686 -10207 -21989 -25940 -28367 -40915 -50811 -78385 -58450
$$ packed form
16110A5288J2511m8877m9082o439O785m550M1849L0093l1461o424L2039o381L405
16097a1244P401k014K0717J6337m594l6679J9399J9508j6186o828K0803O610J6945
16084E0175K5129l261k2082j104l888m1834M525O569l3055k4648m689J8874L3896
16071D607K6830l7923k5243K6553l4571k614J7895l2477J0796O1902K3888O698
16059D6341k9309k7035Q084j258r790j5323O956J2524k7168j8219L8208J9087
16047C098K567q133k8005j9612k6805k7594J2839M0455j6617K1986J4145L3380
16035A704J3794m1173m6521J1115K5175j3077n141K4051K8868R842J3254l4759
16023a2868k8060J7542j0592Q684Q608O479j1782l951k427j2548r896k7574J9935
$$ plain form
16010 -58450 -40074 -16584 14559 20826 3346 7683 -10244 -30343 -67300 -72831 -20256 36704
15998 36704 45410 30926 2284 -21107 -33490 -52871 -67456 -33070 9638 78678 110118 77102
15986 77102 43086 32696 46657 10838 6923 14678 16624 39339 41203 61118 51434 36654 49909
15973 49909 54113 66360 64638 34163 42597 18383 5912 -21980 -37371 27927 68862 66143
15961 66143 71755 83858 41698 42270 18821 14675 -25222 -9128 -5471 -23075 -4652 30325 33722
15948 33722 54129 27721 -448 2567 34636 38503 18404 12868 -16527 -12046 7517 24451
15936 24451 -14551 -35475 -50188 -35106 -7443 -34199 -63528 -77124 -31929 -12176 -11273 -14657
15924 -14657 -6940 -12314 3512 -29560 -33871 9895 3990 3512 -682 17531 20332 -31604 -22614
$$ packed form
16010e8450J8376K3490L1143O267j7480M337j7927k0099l6957n531N2575N6960
15998C6704Q706j4484k8642k3391j2383j9381j4585L4386M2708O9040L1440l3016
15986G7102l4016j0390J3961l5819l915P755J946K2715J864J9915r684j4780J3255
15973D9909M204J2247j722l0475Q434k4214j2471k7892j5391O5298M0935k719
15961F6143N612J2103m2160N72k3449m146l9897J6094L657j7604J8423L4977L397
15948C3722K0407k6408k8169L015L2069L867k0099n536k9395M481J9563J6934
15936B4451l9002k0924j4713J5082K7663k6756k9329j3596M5195J9753R03l384
15924a4657P717n374J5826l3072m311M3766n905m78m194J8213K801n1936Q990
$$ plain form
15911 -22614 -5395 16570 34098 3375 5105 -15561 -21523 12669 9161 -18749 -25884 -5942
15899 -5942 16755 5327 -3276 -25976 -5645 9865 30118 23283 12058 25324 22742 9876
15887 9876 -13908 9671 -9625 -28169 -9301 1402 -21911 -14663 -11429 -28208 -34477 -8994
15875 -8994 12228 23628 60674 56529 30930 25811 10236 21471 33358 4758 -2027 -5373 -29358
15862 -29358 -50429 -19865 -4532 -20406 -17976 -24624 -43895 -31139 -15130 -46652 -80476 -64449
15850 -64449 -39770 -14309 -7089 -20166 -11741 -6464 23584 -44987 -83308 -68793 -77851 -22797
15838 -22797 62391 59072 42128 47753 29032 8935 369 -72467 -110730 -82814 -63247 -28129
15826 -28129 17332 77277 75314 80695 97439 95952 100325 74550 39261 -11145 -40705 -49333 -53705
$$ packed form
15911b2614J7219K1965J7528l0723J730k0666n962L4192l508k7910p135J9942
15899e942K2697j1428q603k2700K0331J5510K0253o835j1225J3266k582j2866
15887I876k3784K3579j9296j8544J8868J0703k3313P248L234j6779o269K5483
15875h994K1222J1400L7046m145k5599n119j5575J1235J1887k8600o785l346k3985
15862b9358k1071L0564J5333j5874K430o648j9271J2756J6009l1522l3824J6027
15850f4449K4679K5461P220j3077Q425N277L0048o8571l8321J4515r058N5054
15838b2797Q5188l319j6944N625j8721k0097q566p2836l8263K7916J9567L5118
15826b8129M5461N9945j963N381J6744j487M373k5775l5289n0406k9560q628m372
$$ plain form
15813 -53705 -40149 -24613 -27929 -64452 -104942 -100009 -69079 -66532 -52738 -97731 -129693 -87531
15801 -87531 -68849 -95420 -72474 -18829 38948 55770 46568 58575 36874 12565 -4848 28683
15789 28683 71183 46443 40402 64449 68156 49133 25447 29572 58869 31730 -13771 -16861
15777 -16861 -13070 -22886 4499 18537 1594 3083 12920 -26378 -40506 -19902 1460 -15173
15765 -15173 -18207 24011 48685 44843 25132 22302 -4557 -35812 -43779 -96708 -110663 -110577 -105516
15752 -105516 -82696 -66358 -50118 -20469 -64708 -35343 -13457 -6001 -28992 -36713 -44041 -28805
15740 -28805 -16661 -47745 -39847 -13323 -80 8672 7697 5912 31525 59991 93252 66012 19325
15727 19325 -2884 -26409 15089 26793 3678 -19155 -9270 13130 8502 38656 73294 69191
$$ packed form
15813e3705J3556J5536l316l6523m0490M933L0930K547J3794m4993l1962M2162
15801h7531J8682k6571K2946N3645N7777J6822r202J2007k1701k4309j7413L3531
15789B8683M2500k4740o041K4047L707j9023k3686M125K9297k7139m5501l090
15777a6861L791r816K7385J4038j6943J489R837l9298j4128K0604K1362j6633
15765a5173l034M2218K4674l842j9711k830k6859l1255p967n2929j3955Q6N061
15752a05516K2820J6338J6240K9649m4239K9365K1886P456k2991p721p328J5236
15740b8805J2144l1084P898K6524J3243Q752r75j785K5613K8466L3261k7240m6687
15727A9325k2209k3525M1498J1704k3115k2833R885K2400m628L0154L4638m103
$$ plain form
15715 69191 13623 -40349 -42068 -17207 -70388 -81908 -48934 -56478 -51945 18661 46091 12222
15703 12222 -3789 -25140 -53610 -62790 -29171 6401 -9772 -19208 4400 30707 16682 -20709
15691 -20709 -25645 -32529 -61814 -63653 -63894 -42029 -20145 -33083 1318 -13819 -19228 -38291 -62651
15678 -62651 -64408 -62801 -56617 -23146 4184 11001 -22131 -23237 -6461 -33685 -45179 -47568 -29055
15665 -29055 -25514 -36413 -30907 -25455 -21154 -12274 -17216 -31855 -20183 -18628 -8212 -21827 7645
15652 7645 30023 12881 3568 11296 -7422 -12481 -34289 -25304 13545 39443 44491 33340 42341
15639 42341 62959 73109 66939 60715 28415 16936 50043 22592 -27076 -37126 -37857 1463
15627 1463 39426 -3986 5553 25182 17966 -23185 -7860 6831 16764 27175 10029 26438
$$ packed form
15715F9191n5568n3972j719K4861n3181j1520L2974p544M533P0606K7430l3869
15703A2222j6011k1351k8470r180L3619L5572j6173r436K3608K6307j4025l7391
15691b0709m936o884k9285j839k41K1865K1884j2938L4401j5137n409j9063k4360
15678f2651j757J607O184L3471K7330O817l3132j106J6776k7224j1494k389J8513
15665b9055L541j0899N506N452M301Q880m942j4639J1672J555J0416j3615K9472
15652G645K2378j7142r313P728j8718n059k1808Q985L8849K5898N048j1151R001
15639D2341K0618J0150o170o224l2300j1479L3107k7451m9668j0050p31L9320
15627A463L7963m3412R539J9629p216m1151J5325J4691R933J0411j7146J6409
$$ plain form
15615 26438 -1787 1526 31916 32245 520 9979 45934 51158 13589 12164 31746 13196 -18209
15602 -18209 -58924 -57284 -53321 -68026 -54870 -8499 25834 14562 6903 38560 93268 111993
15590 111993 101909 91658 103189 57564 60206 63790 58655 23870 9341 -171 32559 60333
15578 60333 60418 25791 18856 16189 -2865 9526 21044 26444 36158 8306 -1128 -3956 -8265 -42040
15564 -42040 -80782 -53021 -16985 -4831 27185 31145 -4461 1947 -13484 9601 54540 80249
15552 80249 43484 45246 62863 36969 -28775 -33825 -16698 -9968 836 44238 59717 64633
15540 64633 40283 32175 45695 13641 20884 35343 66390 48446 9376 25008 4905 -51766
15528 -51766 -38044 -51348 -42801 -23117 -18170 -8299 19353 31436 22988 22991 -12439 -98877 -104889
$$ packed form
15615B6438k8225L313L0390L29l1725R459L5955N224l7569j425J9582j8550l1405
15602a8209m0715J640L963j4705J3156M6371L4333j1272p659L1657N4708J8725
15590A11993j0084j0251J1531m5625K642L584n135l4785j4529r512L2730K7774
15578F0333Q5l4627o935k667j9054J2391J1518N400R714k7852r434k828m309l3775
15564d2040l8742K7761L6036J2154L2016L960l5606O408j5431K3085M4939K5709
15552H0249l6765J762J7617k5894o5744n050J7127O730J0804M3402J5479M916
15540F4633k4350q108J3520l2054P243J4459L1047j7944l9070J5632k0103n6671
15528e1766J3722j3304Q547J9684M947R871K7652J2083q448Ll5430q6438o012
$$ plain form
15515 -104889 -68275 -31108 -10857 -2314 356 -6892 11132 13105 16922 9354 10262 37935 8690
15502 8690 -7375 -17100 -13292 -28367 -40681 -23829 -9347 14441 16832 26099 6358 -58716 -74596
15489 -74596 -1710 9756 -3048 -45611 -54796 -22608 2465 -2417 -5580 -38522 -48158 -44270 -57612
15476 -57612 -47267 12973 29769 28072 -2177 -26612 -2926 50824 80590 75077 13499 3633
15464 3633 22621 23880 54889 64673 44206 20922 41152 26208 9842 36293 85332 81492
15452 81492 48999 9227 -6798 10401 -11815 -20946 -95976 -92201 -60790 -74244 -67690 -61506
15440 -61506 -75163 -73766 -72992 -33481 29843 20145 10028 -50052 -48337 -23139 9529 -8292 7220
15427 7220 -19621 -36391 -20314 21859 12566 -9406 4914 23525 30235 31125 37474 -26833 -45086
$$ packed form
15515a04889L6614L7167K0251Q543K670p248J8024J973L817p568R08K7673k9245
15502H690j6065r725L808j5075j2314J6852J4482K3788K391R267j9741o5074j5880
15489g4596P2886J1466j2804m2563r185L2188K5073m882l163l2942r636L888j3342
15476e7612J0345O0240J6796j697l0249k4435K3686N3750K9766n513o1578r866
15464C633J8988J259L1009R784k0467k3284K0230j4944j6366K6451M9039l840
15452H1492l2493l9772j6025J7199k2216r131p5030L775L1411j3454O554O184
15440f1506j3657J397P74L9511O3324r698j0117o0080J715K5198L2668j7821J5512
15427G220k6841j6770J6077M2173r293k1972J4320J8611O710Q90O349o4307j8253
$$ plain form
15414 -45086 -6468 -27250 -91368 -103889 -42808 6310 8390 13008 -27189 -23240 -52768 -76531
15402 -76531 -43528 -37148 -37771 -11397 -864 -22711 -71253 -44353 2623 -9676 -28829 -4337
15390 -4337 -10993 7272 18224 774 29882 34768 36894 33827 25180 568 -53122 -28398 -30742
15377 -30742 -35513 -82052 -65493 -44605 -55941 -43963 -29689 -34483 -47808 -63220 -73550 -89020
15365 -89020 -83078 -28770 1798 27819 36456 17996 -30881 -50454 -28281 -36649 -473 20878
15353 20878 53914 33894 57616 77789 43702 19396 -4579 -19298 -25559 2012 10395 -78
15341 -78 2922 -9473 -6721 63460 16940 -18019 6568 24078 6247 11839 -27946 -90713 -84663
15328 -84663 -62020 -70847 -57307 -61313 -56785 -38949 -17945 3548 -26600 -23911 -22831 -9346 -13536
$$ packed form
15414d5086L8618k0782o4118j2521O1081M9118K080M618m0197L949k9528k3763
15402g6531L3003O380o23K6374J0533k1847m8542K6900M6976j2299j9153K4492
15390d337o656J8265J0952j7450K9108M886K126l067q647k4612n3690K4724k344
15377c0742m771m6539J6559K0888j1336J1978J4274m794j3325j5412j0330j5470
15365h9020N942N4308L0568K6021Q637j8460m8877j9573K2173q368L6176K1351
15353B0878L3036k0020K3722K0173l4087k4306k3975j4719o261K7571Q383j0473
15341g8L000j2395K752P0181m6520l4959K4587J7510j7831N592l9785o2767O050
15328h4663K2643q827J3540m006M528J7836K1004K1493l0148K689J080J3485m190
$$ plain form
15315 -13536 -53676 -32793 8076 5945 43751 52710 48546 7044 16822 43452 37012 7918 -8761
15302 -8761 -37495 2865 19738 15833 26309 33589 -5250 6839 32383 42742 14186 -6609
15290 -6609 -11338 244 25589 33121 50070 53549 25321 -6192 -764 -32840 -19107 -59236 -45277
15277 -45277 7983 35781 33491 -14941 -63461 -54116 -33989 21243 60756 34283 -5135 -27661
15265 -27661 21248 78460 102979 89694 31249 -35757 -42873 -20636 -40694 -46862 -36760 -31907
15253 -31907 6796 7136 -38230 -80614 -84338 -79002 -56390 -49401 -19087 12159 10137 25149 -5433
15240 -5433 -33669 -56846 -29449 405 -26768 -34935 9042 -12542 7431 14896 13500 -2544
15228 -2544 6890 21800 16196 13395 -2572 16316 10409 25387 50666 53072 31966 -42742 -2963
$$ packed form
15315a3536m0140K0883M0869k131L7806Q959m164m1502R778K6630o440k9094j6679
15302h761k8734M0360J6873l905J0476P280l8839J2089K5544J0359k8556k0795
15290f609m729J1582K5345P532J6949L479k8228l1513N428l2076J3733m0129J3959
15277d5277N3260K7798k290m8432m8520R345K0127N5232L9513k6473l9418k2526
15265b7661M8909N7212K4519j3285n8445o7006p116K2237k0058o168J0102M853
15253c1907L8703L40m5366m2384l724N336K2612O989L0314L1246k022J5012l0582
15240e433k8236k3177K7397K9854k7173q167M3977k1584J9973P465j396j6044
15228b544R434J4910n604k801j5967J8888n907J4978K5279K406k1106p4708L9779
$$ plain form
15215 -2963 29485 -5788 -17443 -16783 4492 7152 23153 16948 -40552 -66603 -55421 -51538 -41587
15202 -41587 -58586 -59962 -31036 -36573 -43305 -80220 -62653 -48786 -2665 17259 40685 88851
15190 88851 93224 59059 22953 3621 15528 16332 18327 48377 62871 50496 46133 31915 50501
15177 50501 19865 -14854 2878 13936 4906 -6126 342 -22291 -35197 779 11125 -15264
15165 -15264 -32053 -49342 -63096 -63925 -61283 -42520 -42275 -50800 -53258 -19106 -29362 -54698 -74693
15152 -74693 -64846 -63325 -55772 -25119 -6060 32724 24265 -7981 -2519 11076 -18095 -4311 41831
15139 41831 8571 -19578 -38071 -34849 -46913 -55653 -79444 -97646 -97065 -66667 -30314 -37988 -49196
15126 -49196 -40242 -24375 -49853 -84358 -44831 -12622 4575 -26650 -31684 -25254 -25694 -20393 -14793
$$ packed form
15215b963L2448l5273j1655O60K1275K660J6001o205n7500k6051J1182L883R951
15202d1587j6999j376K8926n537o732l6915J7567J3867M6121J9924K3426M8166
15190H8851M373l4165l6106j9332J1907Q04J995L0050J4494j2375m363j4218J8586
15177E0501l0636l4719J7732J1058r030j1032O468k2633j2906L5976J0346k6389
15165a5264j6789j7289j3754q29K642J8763K45q525k458L4152j0256k5336j9995
15152g4693R847J521P553L0653J9059L8784q459l2246N462J3595k9171J3784M6142
15139D1831l3260k8149j8493L222j2064q740k3791j8202N81L0398L6353p674j1208
15126d9196Q954J5867k5478l4505L9527L2209J7197l1225n034O430m40N301N600
$$ plain form
15113 -14793 -5952 2473 -4382 -30003 -85239 -87304 -103101 -96239 -61748 -51605 -45585 -70082 -60043
15100 -60043 -19823 19106 23770 19904 35299 23743 19366 17134 26106 11290 46819 74059 94131
15087 94131 60378 61752 66332 86831 85226 58169 903 -1199 -1893 28703 58467 8795 -44384
15074 -44384 -51219 1827 4962 -33728 -52515 8906 45344 26750 5116 -4270 -25603 -29510
15062 -29510 -40478 -80385 -46117 -28229 1139 5582 1079 -9356 13350 41438 72652 93321
15050 93321 112287 102866 48932 -617 -7594 -13109 -53101 -47518 -55616 10760 73902 94731 68892
15037 68892 6204 19953 16641 34627 61635 90885 47651 3193 9701 -20634 -42788 29265
15025 29265 57023 39094 41123 34543 28800 -7988 2789 28955 36490 18855 5710 19863
$$ packed form
15113a4793Q841Q425o855k5621n5236k065j5797O862L4491J0143O020k4497J0039
15100f0043M0220L8929M664l866J5395j1556m377k232Q972j4816L5529K7240K0072
15087I4131l3753J374M580K0499j605k7057n7266k102o94L0596K9764m9672n3179
15074d4384o835N3046L135l8690j8787O1421L6438j8594k1634r386k1333l907
15062b9510j0968l9907L4268J7888K9368M443m503j0435K2706K8088L1214K0669
15050I3321J8966r421n3934m9549o977n515l9992N583q098O6376O3142K0829k5839
15037F8892o2688J3749l312J7986K7008K9250m3234m4458O508l0335k2154P2053
15025B9265K7758j7929K029o580n743l6788J0777K6166P535j7635j3145J4153
$$ plain form
15013 19863 6654 -25551 -3634 29147 36413 855 -15294 -2288 -25038 -32504 -23422 13114
15001 13114 23782 28767 -114 26473 37936 -22898 -20913 -15900 -68024 -113597 -73909 -22015
14989 -22015 -7492 -15382 -24126 2660 740 -46968 -45955 -51207 -16388 -12141 -16250 21883 37190
14976 37190 34472 334 3004 -5585 -18548 -11881 -30600 -16137 13916 9100 7911 18383 1197
14963 1197 10315 26745 -1341 -7246 8640 -17596 -28765 17927 33294 18413 18673 24944 18240
14950 18240 23593 13369 32983 40217 -27121 -33449 -16846 -9658 376 -35768 -43798 -39225 -19627
14937 -19627 2834 -1589 12345 8001 14382 24200 46344 31776 13784 -772 -49267 -58580 -25549
14924 -25549 -6315 4892 -17536 -39962 -73395 -92863 -4468 19893 6700 35893 31327 -8319
$$ packed form
15013A9863j3209l2205K1917L2781P266l5558j6149J3006k2750p466R082L6536
15001A3114J0668M985k8881K6587J1463o0834J985N013n2124m5573L9688N1894
14989b2015J4523p890q744K6786j920m7708J013n252L4819M247m109L8133J5307
14976C7190k718l4138K670q589j2963O667j8719J4463L0053m816j189J0472j7186
14963A197R118J6430k8086n905J5886k6236j1169M6692J5367j4881K60O271o704
14950A8240N353j0224J9614P234o7338o328J6603P188J0034l6144q030M573J9598
14937a9627K2461m423J3934m344O381R818K2144j4568j7992j4556m8495r313L3031
14924b5549J9234J1207k2428k2426l3433j9468Q8395K4361j3193K9193m566l9646
$$ plain form
14912 -8319 -26198 9816 67066 94417 83939 57559 84568 71991 -7793 -597 20857 10570
14900 10570 -37455 -33948 -38592 -23417 2142 -58097 -61534 -32641 -22613 -15854 -12307 -28359 -53369
14887 -53369 -30723 23456 52853 48011 32004 36055 -269 -23318 3693 26031 6519 -13732
14875 -13732 -11887 -33161 -58838 -39763 -28432 -36063 -83116 -91217 -52403 -64575 -31135 -8407
14863 -8407 5488 2326 -14032 -25477 3330 8260 -19967 -21342 -22948 -8805 -27607 -68233 -46988
14850 -46988 -24683 -14984 -25300 -26665 -15675 -9873 -2381 8461 10751 -11435 -66919 -61077 -40878
14837 -40878 -20776 -11784 -32278 -19013 -20420 -11036 -1674 9702 7663 16533 -2445 -9932 18039
14824 18039 -372 -35111 21149 69703 68869 31338 -164 -37465 -17639 6958 5127 4611 5817
$$ packed form
14912h319j7879L6014N7250K7351j0478k6380K7009j2577p9784P196K1454j0287
14900A0570m8025L507m644J5175K5559o0239l437K8893J0028O759L547j6052k5010
14887e3369K2646N4179K9397m842j6007M051l6324k3049K7011K2338j9512k0251
14875a3732J845k1274k5677J9075J1331p631m7053q101L8814j2172L3440K2728
14863h407J3895l162j6358j1445K8807M930k8227j375j606J4143j8802m0626K1245
14850d6988K2305R699j0316j365J0990N802P492J0842K290k2186n5484N842K0199
14837d0878K0102Q992k0494J3265j407R384R362J1376k039Q870j8978p487K7971
14824A8039j8411l4739N6260M8554q34l7531l1502l7301J9826K4597j831n16J206
$$ plain form
14811 5817 9145 27736 33709 -4099 -48126 -42205 -28986 -14382 -31483 -13710 17795 -4014
14799 -4014 -14219 -34731 -6791 -29226 -39623 -24886 -12469 -3122 -23626 -5553 -13033 -20044
14787 -20044 -56710 -95900 -34689 20465 22391 11470 181 -31366 -8848 -651 -29499 -68891
14775 -68891 -43585 -40059 -43455 -36857 -32280 -59892 -24466 21262 30049 22734 30671 9207 -13246
14762 -13246 -14864 -11547 -3494 -29987 -10249 15755 -11363 -3914 13389 -1412 -40292 -17078
14750 -17078 -5429 -1280 -7943 -8691 -24265 35455 29748 16258 13396 5655 -12245 -46565 -42486
14737 -42486 -19179 -41886 -28565 -4604 -25484 -24579 -27011 -17237 -33582 -19764 13261 48494
14725 48494 51822 44097 48045 39710 -10176 -14813 -4492 -22161 -32649 -42805 -9392 -11979 -32610
$$ packed form
14811E817L328J8591N973l7808m4027N921J3219J4604j7101J7773L1505k1809
14799d014j0205k0512K7940k2435j0397J4737J2417R347k0504J8073p480p011
14787b0044l6666l9190O1211N5154J926j0921j1289l1547K2518Q197k8848l9392
14775f8891K5306L526l396O598M577k7612L5426M5728Q787p315P937k1464k2453
14762a3246j618L317Q053k6493J9738K6004k7118P449J7303j4801l8880K3214
14750a7078J1649M149o663p48j5574N9720n707j3490k862p741j7900l4320M079
14737d2486K3307k2707J3321K3961k0880R05k432R774j6345J3818L3025L5233
14725D8494L328p725L948q335m9886m637J0321j7669j0488j0156L3413k587k0631
$$ plain form
14712 -32610 -47904 -48271 -81370 -37744 -14468 5129 21497 49048 31137 19968 50942 57044
14700 57044 24816 22213 -12200 -22497 -26316 -67704 -47374 -25125 -6270 -7990 -8059 -20822 -69039
14687 -69039 -75283 -97326 -80120 -49258 -30798 -33000 -27049 -44723 -21655 -8705 -36502 311
14675 311 24256 8418 -22210 -11081 -8357 -15818 -13726 -426 -54235 -64881 -57294 -44146 4441
14662 4441 39492 16797 -27262 -62951 -50659 -39409 -27183 -11280 -21774 -48933 -73739 -60025
14650 -60025 -70077 -53590 -36910 -8690 36630 63955 47530 16489 8157 10914 13772 4560
14638 4560 23005 6012 19031 36083 69952 83790 84492 42746 37139 16292 -38315 -25184
14626 -25184 35700 49445 45235 -14998 -26393 3452 -7381 -21737 -5711 19776 -15431 -39320
$$ packed form
14712c2610j5294l67l3099M3626K3276J9597J6368K7551j7911j1169L0974O102
14700E7044l2228k603l4413j0297l819m1388K0330K2249J8855j720o9j2763m8217
14687f9039o244k2043J7206L0862J8460k202N951j7674K3068J2950k7797L6813
14675C11K3945j5838l0628J1129K724p461K092J3300n3809j0646P587J3148M8587
14662D441L5051k2695m4059l5689J2292J1250J2226J5903j0494k7159k4806J3714
14650f0025j0052J6487J6680K8220M5320K7325j6425l1041q332K757K858r212
14638D560J8445j6993J3019J7052L3869J3838P02m1746n607k0847n4607J3131
14626b5184O0884J3745m210o0233j1395K9845j0833j4356J6026K5487l5207k3889
$$ plain form
14614 -39320 -13834 7811 10618 -25887 -30891 -30920 -43546 -65400 -50923 -13914 -16947 -8650 -7457
14601 -7457 23559 12701 22032 37920 48672 53651 55112 10475 17118 34471 45791 17112 22110
14588 22110 25076 39516 23976 50291 56269 83557 41856 12122 24304 8448 -26097 -44460
14576 -44460 -74114 -68288 -50350 -23133 -3870 -30676 -40431 4907 4101 -1581 -3376 13120 6146
14563 6146 -9132 47368 87895 51503 60874 61449 47799 31434 21197 47673 22743 -11066
14551 -11066 -43905 -85504 -84846 -73911 -57665 -39679 -23574 -4539 -24740 -34854 -48516 -36408
14539 -36408 5952 15802 13180 34880 68148 79803 50161 19031 46997 66768 6898 -24311
14527 -24311 11773 36833 -5658 -15232 -142 -8869 16838 921 16118 38826 63885 19699
$$ packed form
14614c9320K5486K1645K807l6505n004k9j2626k1854J4477L7009l033Q297J193
14601g457L1016j0858R331J5888J0752M979J461m4637O643J7353J1320k8679M998
14588B2110K966J4440j5540K6315N978K7288m1701k9734J2182j5856l4545j8363
14576d4460k9654N826J7938K7217J9263k6806r755M5338q06n682j795J6496o974
14563F146j5278N6500M0527l6392R371N75j3650j6365j0237K6476k4930l3809
14551a1066l2839m1599O58J0935J6246J7986J6105J9035k0201j0114j3662J2108
14539c6408M2360R850k622K1700L3268J1655k9642l1130K7966J9771n9870l1209
14527b4311L6084K5060m2491r574J5090q727K5707j5917J5197K2708K5059m4186
$$ plain form
14515 19699 4307 20555 10922 2918 10075 -16507 -48087 -62628 -56978 -7576 -15837 -33202 -40475
14502 -40475 -40292 -15889 21683 50772 46623 54488 43950 25449 24204 25648 45893 52194 40978
14489 40978 44193 24979 -19866 -16423 20538 49452 21462 2454 1639 -2014 31440 14084 -2930
14476 -2930 12562 31914 41188 42576 25833 13279 2560 12119 34793 21595 33731 37233 31719
14463 31719 17489 -390 -24760 -25497 -25058 -10803 -56851 -71545 -42455 -41581 -8577 2144 21960
14450 21960 -10168 -13894 10569 -1236 -25960 -33612 -49879 -28233 -34365 -53398 -61555 -59637 -40997
14437 -40997 -31473 -36752 -60443 -85495 -113404 -100576 -85322 -74807 -57760 -8414 18546 22019
14425 22019 35614 10817 34748 26546 10979 -13283 -54773 -67369 -43583 -44490 -52959 -10861
$$ packed form
14515A9699j5392J6248r633q004P157k6582l1580j4541N650M9402q261j7365p273
14502d0475J83K4403L7572K9089m149P865j0538j8501j245J444K0245O301j1216
14489D0978L215j9214m4845L443L6961K8914k7990j9008q15l653L3454j7356j7014
14476b930J5492J9352R274J388j6743j2554j0719R559K2674j3198J2136L502n514
14463C1719j4230j7879k4370p37M39J4255m6048j4694K9090Q74L3004J0721J9816
14450B1960l2128l726K4463j1805k4724p652j6267K1646o132j9033q157J918J8640
14437d0997R524n279k3691k5052k7909J2828J5254J0515J7047M9346K6960L473
14425B2019J3595k4797K3931q202j5567k4262m1490j2596K3786r07q469M2098
$$ plain form
14413 -10861 19767 37395 22362 1181 -40652 -68021 -37355 -12956 7185 6330 -25008 -42105
14401 -42105 1184 46482 25217 11619 7791 -3288 15803 37585 66911 66839 42819 4395
14389 4395 -7723 -50240 -47371 -7355 -10905 -42436 -39512 -23958 -10044 16449 20976 16422 -3176
14376 -3176 14727 32484 74475 76500 100261 77534 36854 -1580 -48723 -71565 -24518 34145
14364 34145 51149 74063 35559 -21073 -29037 -9628 -4838 -20001 -2889 15297 -12381 -13420
14352 -13420 -18290 10969 -479 17208 32000 -22843 -36221 -9740 -8199 -28183 -61868 -74907
14340 -74907 -48478 -20276 -18143 -5413 -19050 1745 27101 -4740 -28084 -10815 -4009 15442
14328 15442 39832 27483 50986 69388 58372 4932 -36239 -19623 -29030 -58323 -82493 -54405
$$ packed form
14413a0861L0628J7628j5033k1181m1833k7369L0666K4399K0141q55l1338j7097
14401d2105M3289M5298k1265j3598l828j1079J9091K1782K9326p2k4020l8424
14389D395j2118m2517K869M0016l550l1531K924J5554J3914K6493M527m554j9598
14376c176J7903J7757M1991K025K3761k2727m0680l8434m7143k2842M7047N8663
14364C4145J7004K2914l8504n6632p964J9409M790j5163J7112J8186k7678j039
14352a3420m870K9259j1448J7687J4792n4843j3378K6481J541j9984l3685j3039
14340g4907K6429K8202K133J2730j3637K0795K5356l1841k3344J7269O806J9451
14328A5442K4390j2349K3503J8402j1016n3440m1171J6616r407k9293k4170K8088
$$ plain form
14316 -54405 -48444 -45831 -149 -24736 -12349 9512 3258 28605 35985 -12929 -13677 1490 -17781
14303 -17781 -27161 -12561 -13800 -22181 11656 2660 15305 -401 -37505 -41983 -25352 -72593 -81687
14290 -81687 -39066 19537 15022 -2498 24076 14705 -14330 -17494 -4330 9046 33828 13362
14278 13362 -28936 -29750 -18810 -18142 -2106 -1092 3105 49761 35737 7107 -17174 -9939 5428
14265 5428 -2406 12250 16203 158 -16834 -11736 23525 20019 6218 480 10064 12148 31146
14252 31146 30762 8847 29007 38785 25865 -20302 -95036 -50725 -11083 -21309 -49618 -61145
14240 -61145 -11224 12492 14874 47626 64697 50759 19126 4090 -1364 -10126 4742 21510
14228 21510 27403 -18563 -31782 -13732 1557 4038 5438 6573 4095 11106 49212 25321 17608
$$ packed form
14316e4405N961K613M5682k4587J2387K1861o254K5347P380m8914p48J5167j9271
14303a7781r380J4600j239q381L3837q996J2645j5706l7104m478J6631m7241r094
14290h1687M2621N8603m515j7520K6574r371k9035l164J3164J3376K4782k0466
14278A3362m2298q14J0940O68J6036J014M197M6656j4024k8630k4281P235J5367
14265E428p834J4656L953j6045j6992N098L5261l506j3801n738R584K084J8998
14252C1146l84k1915K0160R778j2920m6167p4734M4311L9642j0226k8309j1527
14240f1145M9921K3716K382L2752J7071j3938l1633j5036n454q762J4868J6768
14228B1510N893m5966j3219J8050J5289K481J400J135k478P011L8106k3891p713
$$ plain form
14215 17608 25790 52662 93797 73835 72171 63440 37171 56272 55171 60128 38678 29235 23014
14202 23014 23604 9923 3820 8830 6746 -5030 -5679 -7593 -13265 -41701 -80037 -85494 -35654 -8881
14188 -8881 16323 16939 -4163 7034 880 -18635 -30553 -27352 -18313 -43775 -11647 19196 51849
14175 51849 61711 26970 -4321 -11965 3931 38228 35403 49461 29148 -32465 -43580 -15659
14163 -15659 35840 57496 6375 2620 33255 14000 -9932 -43422 -63535 -58122 -50871 -33532
14151 -33532 -10778 -18409 1003 7255 6669 20736 7497 3945 25105 12738 29692 40025 -6958
14138 -6958 -17800 -12973 3855 59474 62741 31928 22724 12054 22189 41572 33042 37231 34882
14125 34882 42315 17099 -23514 -71482 -95941 -82826 -50297 -40568 3453 62059 30640 29469
$$ packed form
14215A7608Q182K6872M1135j9962j664q731k6269J9101j101M957k1450r443o221
14202B3014N90j3681o103N010k084j1776o49j914n672k8436l8336n457M9840K6773
14188h881K5204O16k1102J1197o154j9515j1918L201R039k5462L2128L0843L2653
14175E1849R862l4741l1291p644J5896L4297k825J4058k0313o1613j1115K7921
14163a5659N1499K1656n1121l755L0635j9255k3932l3490k0113N413P251J7339
14151c3532K2754p631J9412O252n86J4067j3239l552K1160j2367J6954J0333m6983
14138f958j0842M827J6828N5619L267l0813r204j0670J0135J9383q530M189k349
14125C4882P433k5216m0613m7968k4459J3115L2529R729M4021N8606l1419j171
$$ plain form
14113 29469 47972 17722 -21299 2908 30262 44743 8823 -50307 -57798 -60120 -46956 -50320
14101 -50320 -58397 -116992 -149469 -102273 -102465 -76626 -7343 27939 30116 -18537 -74882 -43318
14089 -43318 -40674 -29469 17476 -21611 -24674 19445 8866 10499 45558 74401 65138 10721
14077 10721 1246 -10609 -28334 -49237 -63826 -27899 -15162 -18842 -50151 -62569 -44766 -37424
14065 -37424 -5661 9316 -1269 -4808 5130 12313 18403 562 -41680 -63792 -27383 3934
14053 3934 -9534 -13614 -20801 -2269 29298 49888 -3902 -37209 -27246 -8551 -21754 -25746 -13915
14040 -13915 -28253 -31029 -33598 -20268 -20290 -32000 -27950 -35003 -35760 7115 13327 11510 8888 -17965
14026 -17965 9319 46872 17133 27484 35447 5331 -5059 -29810 -21889 -13046 -19875 -21183 -29480
$$ packed form
14113B9469J8503l0250l9021K4207K7354J4481l5920n9130p491k322J3164l364
14101e0320q077n8595l2477M7196j92K5839O9283L5282K177m8653n6345L1564
14089d3318K644J1205M6945l9087l063M4119j0579J633L5059K8843r263n4417
14077A0721r475j1855j7725k0903j4589L5927J2737l680l1309j2418J7803P342
14065c7424L1763J4977j0585l539R938P183O090j7841m2242k2112L6409L1317
14053C934j3468m080p187J8532L1567K0590n3790l3307R963J8695j3203l992J1831
14040a3915j4338k776k569J3330k2j1710M050p053p57M2875O212j817k622k6853
14026a7965K7284L7553k9739J0351P963l0116j0390k4751P921Q843o829j308q297
$$ plain form
14013 -29480 -34699 -46509 -13762 2776 -8958 -42676 5214 18993 18660 53246 48345 2605
14001 2605 2577 22169 -9072 -8187 -19684 -27735 -4164 26942 1101 -15602 2996 -7922 -5020
13988 -5020 15350 -25032 -27455 3726 21624 -11193 -30332 -10954 19076 9570 -34848 -59000
13976 -59000 -21206 -17993 -24619 -31067 -6306 17015 13678 1346 -13172 6173 -7773 -5728 254
13963 254 -11894 -12440 -12935 9046 -16260 -37392 -35003 -54060 -33011 -42813 -24262 -24868 -14443 17287
13949 17287 30796 -8399 -1044 23974 30325 8198 17925 40729 30296 -4497 -43694 263
13937 263 51539 60604 51486 16480 6648 -12523 -13620 -1628 7257 35368 57137 -895 -41771
13924 -41771 -15844 40948 70644 82062 21057 -22547 -15077 4005 13635 12862 38881 47681 50709
$$ packed form
14013b9480n219j1810L2747J6538j1734l3718M7890J3779l33L4586m901m5740
14001B605k8J9592l1241Q85j1497q051K3571L1106k5841j6703J8598j0918K902
13988e020K0370m0382k423L1181J7898l2817j9139J9378L0030r506m4418k4152
13976e9000L7794L213o626o448K4761K3321l337j2332j4518J9345j3946K045N982
13963B54j2148n46m95K1981k5306k1132K389j9057K1049r802J8551o06J0425L1730
13949A7287J3509l9195P355K5018O351k2127R727K2804j0433l4793l9197M3957
13937B63N1276R065r118l5006r832j9171j097J1992Q885K8111K1769n8032m0876
13924d1771K5927N6792K9696J1418o1005m3604P470J9082R630p73K6019Q800L028
$$ plain form
13911 50709 73241 45575 22964 -8658 -19785 -46772 -39632 -18492 -34375 -28930 -6128 16333
13899 16333 11638 -17317 -23196 -12444 2353 -2741 -43436 -33846 -25495 -15049 -8768 -20366 193
13886 193 11584 22914 59208 65176 59328 54831 51938 3535 -60087 -68105 -51045 -49997 -41839
13873 -41839 -20907 -35628 -55885 -60463 -73152 -53318 1715 5012 -5311 41314 3985 -9650
13861 -9650 19976 28234 18572 7474 18334 79446 84654 44714 6873 1541 -745 -18168 -8861
13848 -8861 -13493 -27286 -47347 -14972 -1332 17074 23097 -2494 -41664 -40771 -14915 14450 -820
13835 -820 -29610 -10948 9703 19543 5797 12497 18751 15291 7740 5805 -24714 -56857 -39889
13822 -39889 -33542 -73955 -120673 -138821 -76760 -77174 -20102 11296 6677 11986 -801 31297 44534
$$ packed form
13911E0709K2532k7666k2611l1622j1127k6987P140K1140j5883N445K2802K2461
13899A6333m695k8955n879J0752J4797n094m0695R590Q351J0446O281j1598K0559
13886A93J1391J1330L6294N968n848m497k893m8403o3622q018J7060J048Q158
13873d1839K0932j4721k0257m578j2689J9834N5033L297j0323M6625l7329j3635
13861i650K9626Q258r662j1098J0860O1112N208l9940l7841n332k286j7423R307
13848h861m632j3793k0061L2375J3640J8406O023k5591l9170Q93K5856K9365j5270
13835h20k8790J8662K0651R840j3746O700O254l460p551j935l0519l2143J6968
13822c9889O347m0413m6718j8148O2061m14N7072L1398m619N309j2787L2098J3237
$$ plain form
13809 44534 51009 34845 20449 15890 -13936 -8262 27397 10831 13811 34083 14636 7914 6547
13796 6547 12556 19776 32427 50601 34677 28355 24146 6376 -21891 -33867 -71166 -43982 -26293
13783 -26293 -59721 -93924 -25792 -12430 8989 20449 -10938 -8973 35189 48754 28779 7297
13771 7297 -15941 730 6942 5668 -17222 -24504 -6716 15366 18215 34095 48502 49477 20802
13758 20802 -210 14068 5401 -12599 -20893 5630 12371 20590 3850 -1745 -24597 -30943 -24742
13745 -24742 -36710 -43227 -11198 16440 -7536 28859 34692 19146 -6261 -23462 -44448 -48209
13733 -48209 -59631 -59352 -49337 -37862 -8535 41251 14901 6475 7804 11991 8474 732 9265
13720 9265 16290 7028 37837 23950 -7353 4938 3542 -19157 -13648 32617 56999 72277 41061
$$ packed form
13809D4534O475j6164j4396m559k9826N674L5659j6566K980K0272j9447o722j367
13796F547O009P220J2651J8174j5924o322m209j7770k8267j1976l7299K7184J7689
13783b6293l3428l4203O8132J3362K1419J1460l1387J965M4162J3565j9975k1482
13771G297k3238J6671O212j274k2890p282J7788K2082K849J5880J4407R75k8675
13758B0802k1012J4278q667j8000q294K6523O741Q219j6740n595k2852o346O201
13745b4742j1968o517L2029K7638k3976L6395N833j5546k5407j7201k0986l761
13733d8209j1422K79J0015J1475K9327M9786k6350q426J329M187l517p742Q533
13720I265P025r262L0809j3887l1303J2291j396k2699N509M6265K4382J5278l1216
$$ plain form
13707 41061 36648 44896 36715 1761 -3700 24262 8725 3993 10538 4585 -25008 -37985 21004
13694 21004 45451 54791 65506 67487 48544 28624 -6963 22944 38004 20837 8641 32847
13682 32847 42364 39344 45162 51284 62180 73289 17022 17428 40873 30786 27023 9791 -22985
13669 -22985 -15347 -698 4350 44193 20217 43186 42507 31983 -22672 -53163 -36373 -7099
13657 -7099 -26002 -15205 962 -13021 -12572 -22800 6692 24796 8212 -30876 -2042 30487
13645 30487 -1554 -32633 -36237 -44416 -60026 -18551 14522 15866 24760 3269 -19114 -32188
13633 -32188 -38219 3615 11836 36967 52703 27202 -11670 18771 29398 29921 38922 31442 23056
13620 23056 -21377 -13766 10292 87 -7391 -28927 -35772 -29853 -30870 -66761 -23678 6927 2373
$$ packed form
13707D1061m413Q248q181l4954n461K7962j5537m732O545n953k9593j2977N8989
13694B1004K4447R340J0715J981j8943j9920l5587K9907J5060j7167j2196K4206
13682C2847R517l020N818O122J0896J1109n6267M06K3445j0087l763j7232l2776
13669b2985P638J4649N048L9843k3976K2969o79j0524n4655l0491J6790K9274
13657g099j8903J0797J6167j3983M49j0228K9492J8104j6584l9088K8834L2529
13645C0487l2041l1079l604q179j5610M1475L3073J344Q894k1491k2383j3074
13633c2188o031M1834Q221K5131J5736k5501l8872L0441J0627N23R001p480q386
13620B3056m4433P611K4058j0205p478k1536o845N919j017l5891M3083L0605m554
$$ plain form
13607 2373 13722 48695 67876 75847 45846 -20935 -28423 -31944 5296 -6417 -15483 -38819 -54905
13594 -54905 -53288 -76273 -61049 -20184 -53531 -54998 -30237 -24924 -35456 -36504 -13439 -61737
13582 -61737 -71394 -47491 -12858 -7080 -39537 -63994 -53391 -21558 -6935 40267 84846 65632
13570 65632 53656 26298 33792 8562 345 -18594 -49128 -17511 17337 34377 57270 65472
13558 65472 45335 65288 74220 66039 86963 127243 61583 5624 -6 -12105 -8205 -25015
13546 -25015 -51866 -35626 7350 22544 -18083 1553 23398 -6354 9943 25877 4497 491
13534 491 -30215 -35218 -33157 7108 -1634 -5456 14364 14652 -1063 20808 18422 -7960 14899
13521 14899 10854 -18020 -15311 -28234 -33776 -36207 -24487 -27083 -8073 -6334 -18410 -3203 -1703
$$ packed form
13607B373J1349L4973J9181P971l0001o6781p488l521L7240j1713r066k3336j6086
13594e4905J617k2985J5224M0865l3347j467K4761N313j0532j048K3065m8298
13582f1737r657K3903L4633N778l2457k4457J0603L1833J4623M7202M4579j9214
13570F5632j1976k7358P494k5230q217j8939l0534L1617L4848J7040K2893Q202
13558F5472k0137J9953Q932q181K0924M0280o5660n5959n630j2099L900j6810
13546b5015k6851J6240M2976J5194m0627J9636K1845k9752J6297J5934k1380m006
13534D91l0706n003K061M0265q742l822J9820K88j5715K1871k386k6382K2859
13521A4899m045k8874K709j2923n542k431J1720k596J9010J739j2076J5207J500
$$ plain form
13508 -1703 -33427 -32253 20920 52632 90451 73858 47115 32317 28010 12309 19399 2205
13496 2205 12315 27559 38733 44189 49566 30672 -2217 1731 14915 -5462 -10465 1984 -3878
13483 -3878 -28826 -48778 -23759 -22897 -23569 22522 61537 47305 8692 20652 10874 23260 46829
13470 46829 56283 61344 75952 91728 95036 63834 47861 44192 9537 519 -17008 -62350 -84115
13457 -84115 -69578 -4790 6357 9359 2051 14133 38179 47673 56094 16861 15561 22454 25472
13444 25472 18812 43983 10078 -19160 -41620 -45037 -42729 -21618 -32503 -46150 -59230 -76406
13432 -76406 -62632 -21429 10426 23278 32309 17075 21954 28739 53444 71615 71840 43082 11965
13419 11965 -18044 -12946 -5009 40958 63969 35390 2979 -15611 -33512 5825 -10321 -33770
$$ packed form
13508a703l1724J174N3173L1712L7819j6593k6743j4798m307j5701P090j7194
13496B205J0110J5244J1174N456N377j8894l2889L948J3184k0377n003J2449n862
13483c878k4948j9952K5019Q62o72M6091L9015j4232l8613J1960r778J2386K3569
13470D6829R454N061J4608J5776L308l1202j5973l669l4655r018j7527m5342k1765
13457h4115J4537O4788J1147L002p308J2082K4046R494Q421l9233j300O893L018
13444B5472o660K5171l3905k9238k2460l417K308K1111j0885j3647j3080j7176
13432g6406J3774M1203L1855J2852R031j5234M879O785K4705J8171K25k8758l1117
13419A1965l0009N098P937M5967K3011k8579l2411j8590j7901L9337j6146k3449
$$ plain form
13407 -33770 -6963 -151 -12675 22072 38460 37137 42930 38811 -2855 -39786 -40388 -49342 -15100
13394 -15100 34186 14502 -17487 -54353 -65047 -52688 -1722 17679 -5396 8278 27566 48846
13382 48846 63684 28704 8360 -16105 -14170 -5730 -18852 -16991 8625 12085 6055 -456 10033
13369 10033 29086 32844 49673 73492 32284 20988 32161 48272 11345 -51020 -20123 32241
13357 32241 36370 19972 5538 -2996 -15460 -8061 8516 -19636 -36803 -14705 10067 44933
13345 44933 29971 -10664 -76002 -57248 -12753 -2862 -7001 15477 -2203 10257 12226 -5560
13333 -5560 -18128 -14222 -6859 5880 33676 93273 72067 37000 49845 39955 -4127 -5312 11852
13320 11852 -24017 -38616 -18021 -11677 4683 4506 12260 15993 -11056 -58541 -65127 -33928 -40547
$$ packed form
13407c3770K6807O812j2524L4747J6388j323N793m119m1666l6931o02q954L4242
13394a5100M9286j9684l1989l6866j0694J2359N0966J9401k3075J3674J9288K1280
13382D8846J4838l4980k0344k4465J935Q440j3122J861K5616L460o030o511J0489
13369A0033J9053L758J6829K3819m1208j1296J1173J6111l6927o2365L0897N2364
13357C2241M129j6398j4434q534j2464P399J6577k8152j7167K2098K4772L4866
13345D4933j4962m0635o5338J8754M4495R891m139K2478j7680J2460J969j7786
13333e560j2568L906P363J2739K7796N9597k1206l5067J2845r890m4082j185J7164
13320A1852l5869j4599K0595O344J6360j77P754L733k7049m7485o586L1199o619
$$ plain form
13307 -40547 -55393 -18715 -22447 -5562 -7505 17034 49662 54336 53839 41881 31790 17829 4804
13294 4804 -15490 -10503 1559 24494 76603 111097 104693 70146 55064 45937 33491 34329 17460
13281 17460 47528 103595 99894 15336 -13071 -8125 -2206 16613 85285 89524 40557 34178 26300
13268 26300 9751 -21809 -4148 18016 22946 -558 19727 4730 12920 23309 -7208 -1792
13256 -1792 -17681 -30328 -12541 -9216 -12569 -6022 -33232 -39363 -10419 35872 95795 74313 41573
13243 41573 20619 12105 40239 65987 86755 50926 24135 -6882 -26235 -30330 -19308 10094
13231 10094 7330 14153 18374 6343 -7057 -22408 -16269 30500 -11069 -70884 -64576 -81828 -85386
13218 -85386 -73998 -33082 -4693 1284 16802 32409 22082 51971 40182 686 8854 38552
$$ packed form
13307d0547j4846L6678l732J6885j943K4539L2628M674m97j1958j0091j3961j3025
13294D804k0294M987J2062K2935N2109L4494o404l4547j5082r127j2446Q38j6869
13281A7460L0068N6067l701q4558k8407M946N919J8819O8672M239m8967o379p878
13268B6300j6549l1560J7661K2164M930k3504K0285j4997Q190J0389l0517N416
13256a792j5889j2647J7787L325l353O547k7210o131K8944M6291N9923k1482l2740
13243D1573k0954q514K8134K5748K0768l5829k6791l1017j9353m095J1022K9402
13231A0094k764O823M221j2031j3400j5351O139M6769m1569n9815O308j7252l558
13218h5386J1388M0916K8389N977J5518J5607j0327K9889j1789l9496Q168K9698
$$ plain form
13206 38552 65551 51387 30548 37336 38130 31251 16 10858 54438 53838 42546 19395 22492
13193 22492 21905 9977 8232 19720 52665 50431 41627 62050 52516 63337 40920 8263 2494
13180 2494 -18388 -1093 46444 91268 72872 58337 55334 22033 -6235 -19100 -8244 40864
13168 40864 3758 -58320 -46364 -11800 15380 37796 27656 50753 26667 16967 12430 18468
13156 18468 13530 -13465 25503 72797 93199 111697 106761 61015 41086 17670 1516 33503
13144 33503 45798 17367 38198 61260 54036 30358 12222 -8108 -37504 -9679 21922 40327
13132 40327 81723 110098 131419 138702 148306 208486 264589 271571 283225 300197 334595 403927
13120 403927 466855 569055 742349 980460 1200161 1455068 1758773 1905551 1881813 1683228
$$ packed form
13206C8552K6999j4164k0839O788P94o879l1235J0842M3580o00j1292k3151L097
13193B2492n87j1928j745J1488L2945k234q804K0423r534J0821k2417l2657n769
13180B494k0882J7295M7537M4824j8396j4535l003l3301k8268j2865J0856M9108
13168D0864l7106o2078J1956L4564K7180K2416j0140K3097k4086r700m537O038
13156A8468m938k6995L8968M7294K0402J8498m936m5746j9929k3416j6154L1987
13144C3503J2295k8431K0831K3062p224k3678j8136k0330k9396K7825L1601J8405
13132D0327M1396K8375K1321P283R604O0180N6103O982J1654J6972L4398O9332
13120D03927O2928J02200J73294K38111K19701K54907L03705J46778k3738j98585
$$ plain form
13110 1683228 1371873 1085818 792079 597998 515782 427375 384028 305037 260825 277713
13100 277713 256575 206724 141598 137197 130871 142637 156319 168564 178211 184214 114003 134972
13088 134972 159832 150397 120366 98696 94950 62104 34913 41355 60631 44628 59422 50446
13076 50446 63632 68275 57061 62444 89008 81969 94250 114561 120484 88044 56189 79405
13064 79405 67313 61689 44888 42246 40794 33782 10420 49392 56339 53313 46827 53504 66639
13051 66639 56802 44928 47046 24368 41117 49426 31205 32362 17452 29959 23923 28305 30224
13038 30224 17195 4132 22734 41425 40714 1956 818 511 7093 23566 70498 47073 7988
13025 7988 27833 56818 73381 70795 31380 37886 39218 34818 40920 69385 57703 59216 92174
$$ packed form
13110A683228l11355k86055k93739j94081q2216q8407m3347p8991m4212J6888
13100B77713k1138m9851o5126m401o326J1766J3682J2245R647O003p0211K0969
13088A34972K4860r435l0031k1670l746l2846k7191O442J9276j6003J4794q976
13076E0446J3186M643j1214N383K6564p039J2281K0311N923l2440l1855K3216
13064G9405j2092n624j6801k642j452p012k3362L8972O947l026o486O677J3135
13051F6639r837j1874K118k2678J6749Q309j8221J157j4910J2507o036M382J919
13038C0224j3029j3063J8602J8691p11l8758j138l07O582J6473M6932k3425l9085
13025G988J9845K8985J6563k586l9415O506J332m400O102K8465j1682J513L2958
$$ plain form
13012 92174 132864 145191 123765 72771 62147 51929 54136 64706 60373 77734 70129 67659
13000 67659 84450 71795 97527 69267 37733 35129 29163 41688 25014 2243 637 19027
12988 19027 39715 61647 62948 42600 35283 8163 -4685 42585 38488 28947 50524 49641 35534
12975 35534 66060 60045 13459 1494 -4048 39984 68806 78789 67015 20801 41521 45901
12963 45901 64372 74511 63061 82109 60384 44379 13772 11213 27193 40785 48455 77118
12951 77118 80844 51563 37340 75140 86191 75076 53636 65784 55459 50950 40267 15465
12939 15465 43181 62031 50035 38956 27753 30263 31261 28293 23753 30788 54591 29348 21612
12926 21612 11905 9353 31575 73504 101800 68368 82153 131225 163687 165913 168408 198698
$$ packed form
13012I2174M0690J2327k1426n0994j0624j0218K207J0570m333J7361p605k470
13000F7659J6791j2655K5732k8260l1534k604n966J2525j6674k2771j606J8390
12988A9027K0688K1932J301k0348p317k7120j2848M7270m097r541K1577q83j4107
12975C5534L0526o015m6586j1965n542M4032K8822R983j1774m6214K0720M380
12963D5901J8471J0139j1450J9048k1725j6005l0607k559J5980J3592P670K8663
12951G7118L726k9281j4223L7800J1051j1115k1440J2148j0325m509j0683k4802
12939A5465K7716J8850j1996j1079j1203K510R98k968m540P035K3803k5243p736
12926B1612r707k552K2222M1929K8296l3432J3785M9072L2462K226K495L0290
$$ plain form
12914 198698 225169 232473 232660 270148 319767 314102 320193 318098 313112 331431 355828 351977 332269
12901 332269 262938 208844 200311 161770 132195 111566 87417 86995 125505 153511 142110 127417
12889 127417 125563 179948 227566 217195 156834 102595 111859 75786 88186 61452 66710 120746
12877 120746 117930 83609 54358 77684 103177 142721 130279 108026 61056 73689 125128 134173
12865 134173 115452 93469 104551 81187 37497 21668 44555 50966 59746 57276 115726 168864
12853 168864 215598 193617 142728 148906 140162 149678 154860 134154 113829 78907 91103 88356
12841 88356 89878 164618 170358 161973 144341 184600 148490 134741 112464 90012 109912 91967
12829 91967 47173 41829 82697 66152 52075 55216 83726 72787 73113 74382 94784 106901 78404
$$ packed form
12914A98698K6471P304J87L7488M9619n665O091k095m986J8319K4397l851j9708
12901C32269o9331n4094q533l8541k9575k0629k4149m22L8510K8006j1401j4693
12889A27417j854N4385M7618j0371o0361n4239R264l6073J2400k6734N258N4036
12877A20746k816l4321k9251K3326K5493L9544j2442k2253m6970J2633N1439R045
12865A34173j8721k1983J1082k3364m3690j5829K2887O411Q780k470N8450N3138
12853A68864M6734k1981n0889O178q744R516N182k0706k0325l4922J2196k747
12841H8356J522P4740N740q385j7632M0259l6110j3749k2277k2452J9900j7945
12829I1967m4794n344M0868j6545j4077L141K8510j0939L26J269K0402J2117k8497
$$ plain form
12816 78404 47610 11547 -50025 -122046 -177434 -197832 -206753 -227964 -254041 -254784 -244585 -119796
12804 -119796 47419 113842 157504 189944 209306 234105 251934 289080 275736 269193 270568 274322
12792 274322 325725 376731 426117 421806 413517 444287 514501 601579 711812 783363 851838 953284
12780 953284 993527 983802 903379 773009 661907 562216 521920 500250 478789 442910 409060
12769 409060 335471 339169 369880 447304 479994 493517 466854 463684 468289 477065 496559 452187
12757 452187 418966 430882 476789 505216 542364 557155 558611 557564 587655 591306 624424 662787
12745 662787 622585 594895 658678 686699 712031 711183 694459 702398 770834 796469 841937 880988
12733 880988 898156 917020 924934 935962 969363 1001025 992175 995502 1063012 1127432 1144967 1168863
$$ packed form
12816G8404l0794l6063o1572p2021n5388k0398q921k1211k6077p43J0199J24789
12804a19796J67215O6423M3662L2440J9362K4799J7829L7146j3344o543J375L754
12792B74322N1403N1006M9386m311q289L0770P0214Q7078J10233P1551O8475J01446
12780I53284M0243r725q0423j30370j11102r9691m0296k1670k1461l5879l3850
12769D09060p3589L698L0711P7424L2690J3523k6663l170M605Q776J9494m4372
12757D52187l3221J1916M5907K8427L7148J4791J456j047L0091L651L3118L8363
12745F62787m0202k7690O3783K8021K5332q48j6724P939O8436K5635M5468L9051
12733H80988J7168J8864P914J1028L3401L1662q850L327O7510O4420J7535K3896
$$ plain form
12721 1168863 1186198 1221999 1249858 1260263 1285220 1286459 1280792 1314249 1349308 1378108 1394650 1464538
12709 1464538 1492606 1521910 1515986 1528856 1553130 1589977 1615264 1629872 1663721 1679376 1778654
12698 1778654 1838665 1906232 2000721 2138784 2249951 2304857 2394613 2501840 2580262 2640536 2765356
12687 2765356 2922985 3069840 3169246 3323281 3510222 3713557 3932195 4230382 4560435 4937606
12677 4937606 5370033 5807446 6252418 6799190 7500165 8355308 9335515 10495291 11899074
12668 11899074 13622206 15663850 18305987 21638125 25822786 31106381 37703179 45976248
12660 45976248 56699248 71065087 90653478 117463156 153470189 198857066 251719950
12653 251719950 308625787 358800341 383932872 375908315 328839703 254031726 184374313
$$ packed form
12721A168863J7335L5801K7859J0405K4957J239n667L3457L5059K8800J6542O9888
12709A464538K8068K9304n924J2870K4274L6847K5287J4608L3849J5655R9278
12698A778654O0011O7567R4489J38063J11167N4906Q9756J07227P8422O0274J24820
12687B765356J57629J46855R9406J54035J86941K03335K18638K98187L30053L77171
12677D937606M32427M37413M44972N46772P00975Q55143R80207J159776J403783
12668A1899074J723132K041644K642137L332138M184661N283595O596798Q273069
12660D5976248J0723000J4365839J9588391K6809678L6007033M5386877N2862884
12653B51719950N6905837N0174554K5132531q024557m7068612p4807977o9657413
$$ plain form
12646 184374313 135273506 103245001 82488002 68690372 59109665 52251285 47064428
12639 47064428 42966573 39559268 36660038 34085581 31789661 29866414 28373263 27227699
12631 27227699 26411122 25831920 25512686 25421503 25360011 24975995 24197195 23098126 21887687
12622 21887687 20675253 19467304 18252353 17123474 16127023 15161703 14232147 13401021 12593598
12613 12593598 11856737 11177652 10540766 9899064 9267676 8734926 8278574 7868764 7494977
12604 7494977 7085109 6741290 6405905 6039226 5707838 5438819 5209443 4928476 4647946
12595 4647946 4386722 4198085 4065642 3894368 3707850 3565741 3412320 3242836 3061448
12586 3061448 2876780 2729520 2602184 2490818 2388232 2263565 2170932 2075692 1962621 1897952
$$ packed form
12646A84374313m9100807l2028505k0756999j3797630r580707o858380n186857
12639D7064428m097855l407305k899230k574457k295920j923247j493151j145564
12631B7227699q16577n79202l19234r1183o1492l84016p78800j099069j210439
12622B1887687j212434j207949j214951j128879r96451r65320r29556q31126q07423
12613A2593598p36861o79085o36886o41702o31388n32750m56352m09810l73787
12604G494977m09868l43819l35385l66679l31388k69019k29376k80967k80530
12595D647946k61224j88637j32443j71274j86518j42109j53421j69484j81388
12586C061448j84668j47260j27336j11366j02586j24667r2633r5240j13071o4669
$$ plain form
12576 1897952 1848126 1786284 1716537 1625908 1561577 1515750 1453571 1408375 1386073 1377787 1317787
12565 1317787 1285554 1246505 1184276 1167467 1124018 1096651 1083757 1049807 1003600 989323 959190
12554 959190 890560 816620 793314 809732 795329 797095 801338 789687 791094 728827 652611 632864
12542 632864 610904 619797 629815 636220 635992 626472 653977 651111 640137 689305 700311 735775 762066
12529 762066 788375 819407 852290 857179 844116 784952 738908 673913 624061 614594 619941 628073
12517 628073 643239 641924 638949 566222 498744 420798 389376 348885 333046 351956 329777 345631
12505 345631 365557 367273 336377 301838 306234 388464 434869 471458 584436 719119 816256
12494 816256 897801 928565 889945 778970 725054 718613 736042 692169 659490 654185 648013 609223
$$ packed form
12576A897952m9826o1842o9747r0629o4331m5827o2179m5196k2302q286o0000
12565A317787l2233l9049o2229j6809m3449k7367j2894l3950m6207j4277l0133
12554I59190o8630p3940k3306J6418j4403J766M243j1651J407o2267p6216j9747
12542F32864k1960Q893J0018O405k28r520K7505k866j0974M9168J1006L5464K6291
12529G62066K6309L1032L2883M889j3063n9164m6044o4995m9852r467N347Q132
12517F28073J5166j315k975p2727o7478p7946l1422m0491j5839J8910k2179J5854
12505C45631J9926J716l0896l4539M396Q2230M6405L6589J12978J34683R7137
12494H16256Q1545L0764l8620j10975n3916o441J7429m3873l2679n305o172l8790
$$ plain form
12482 609223 614665 613815 623115 655424 680006 690387 669343 614956 622656 629483 584412 556063 542747
12469 542747 542901 560105 525050 495528 481690 489397 461471 451557 464132 490120 497772 494672 489972
12456 489972 475766 458994 446359 492713 456636 419629 419182 460613 495571 478176 445716 458120
12444 458120 434327 420099 422209 396613 386659 351310 310891 328738 310354 288991 284552 265434
12432 265434 230357 267788 303788 300814 272985 241874 224313 246328 268817 243407 239013 222670
12420 222670 163157 142861 161981 174866 221087 251196 224592 215019 221214 204300 210721 257837
12408 257837 274596 266355 249007 249564 265414 251602 232576 204373 216701 235467 257018 261455
12396 261455 234975 239428 265836 270425 269494 276949 301158 288453 307710 309042 279615 222443 191865
$$ packed form
12482F09223N442q50R300L2309K4582J0381k1044n4387P700O827m5071k8349j3316
12469E42747J54J7204l5055k9522j3838P707k7926r914J2575K5988P652l100m700
12456D89972j4206j6772j2635M6354l6077l7007m47M1431L4958j7395l2460J2404
12444D58120k3793j4228K110k5596r954l5349m0419J7847j8384k1363m439j9118
12432B65434l5077L7431L6000k974k7829l1111j7561K2015K2489k5410m394j6343
12420B22670n9513k0296J9120J2885M6221L0109k6604r573O195j6914O421M7116
12408B57837J6759q241j7348N57J5850j3812j9026k8203J2328J8766K1551M437
12396B61455k6480M453K6408M589r31P455K4209j2705J9257J332k9427n7172l0578
$$ plain form
12383 191865 221293 221365 189723 186916 201899 179800 166276 140268 163524 193314 172547 166504
12371 166504 171868 168062 148610 166732 139915 155560 127606 150223 152233 142031 127552 99480
12359 99480 50408 36595 70422 93328 124963 137361 141410 132886 125096 134362 153685 154206 175911
12346 175911 185543 158096 149616 159194 120644 117568 148472 179520 142683 100554 104234 154043
12334 154043 164512 137269 120625 155956 125792 78240 87041 129850 149380 160465 119426 124119
12322 124119 101509 95191 125165 157910 203219 198444 205051 204377 189602 133967 109673 99205
12310 99205 96497 100454 117471 129185 108506 121314 152028 108549 103463 94075 104025 98853 72865
12297 72865 78783 73492 105570 131917 145873 148338 153669 141385 123685 103290 83239 76063 97969
$$ packed form
12383A91865K9428P2l1642k807J4983k2099j3524k6008K3256K9790k0767o043
12371A66504N364l806j9452J8122k6817J5645k7954K2617K010j0202j4479k8072
12359I9480m9072j3813L3827K2906L1635J2398M049q524p790R266J9323N21K1705
12346A75911R632k7447q480R578l8550l076L0904L1048l6837m2129L680M9809
12334A54043J0469k7243j6644L5331l0164m7552Q801M2809J9530J1085m1039M693
12322A24119k2610o318K9974L2745M5309m775O607o74j4775n5635k4294j0468
12310I9205k708L957J7017J1714k0679J2808L0714m3479n086r388R950n172k5988
12297G2865N918n291L2078K6347J3956K465N331j2284j7700k0395k0051p176K1906
$$ plain form
12284 97969 88491 111471 112863 64364 56582 82595 125519 121981 78268 76503 49094 35264 67524
12271 67524 92039 85055 68510 61500 68963 81643 91928 62800 39438 76823 118783 130702
12259 130702 91242 63477 46440 43702 52683 51946 70877 99612 121625 114314 92696 74960
12247 74960 56902 71857 102122 104486 89062 71226 82002 71878 87285 116561 169254 145740
12235 145740 115885 78178 92342 111583 80413 83474 102861 74588 91223 103618 73916 48172
12223 48172 26874 53635 25913 50569 67961 40412 58902 67409 98047 110170 64175 59735
12211 59735 78567 109255 129180 141110 140819 144779 131326 115142 147036 153043 187158 218756
12199 218756 204159 221770 250951 259411 305342 319396 350389 321884 325533 411623 459430 612421
$$ packed form
12284I7969r478K2980J392m8499p782K6013M2924l538m3713j765k7409j3830L2260
12271F7524K4515o984j6545p010P463J2680J0285k9128k3362L7385M1960J1919
12259A30702l9460k7765j7037k738Q981p37J8931K8735K2013p311k1618j7736
12247G4960j8058J4955L0265K364j5424j7836J0776j0124J5407K9276N2693k3514
12235A45740k9855l7707J4164J9241l1170L061J9387k8273J6635J2395k9702k5744
12223D8172k1298K6761k7722K4656J7392k7549J8490Q507L0638J2123m5995m440
12211E9735J8832L0688J9925J1930k91L960j3453j6184L1894O007L4115L1598
12199B18756j4597J7611K9181Q460M5931J4054L0993k8505L649Q6090M7807J52991
$$ plain form
12187 612421 814881 1006043 1210377 1485827 1791913 2022003 2050198 1972429 1753066 1460453
12177 1460453 1133913 861568 742561 698962 653724 588151 525819 486834 455340 411667 358941
12166 358941 337813 303681 257371 245863 262190 276102 242418 203700 222314 237939 210216
12155 210216 188100 163839 124571 128769 144976 144539 163502 208237 229615 161565 132510 153631
12143 153631 168040 156398 98626 60285 95857 140818 137907 105745 116584 138687 155967 160105
12131 160105 141402 142385 136471 131853 115614 120367 111210 63079 58434 73414 99616 138599 93452
12118 93452 77152 67037 40177 29295 35280 92116 109407 86971 91421 44251 34008 30632
12106 30632 67297 75401 53439 69481 85683 36056 -18345 6234 35105 69366 62638 82082
$$ packed form
12187F12421K02460J91162K04334K75450L06086K30090K8195p7769k19363k92613
12177A460453l26540k72345j19007m3599m5238o5573o2332l8985l1494m3673n2726
12166C58941k1128l4132m6310j1508J6327J3912l3684l8718J8614J5625k7723
12155B10216k2116k4261l9268M198J6207m37J8963M4735K1378o8050k9055K1121
12143A53631J4409j1642n7772l8341L5572M4961k911l2162J0839K2103J7280M138
12131A60105j8703R83n914m618j6239M753r157m8131m645J4980K6202L8983m5147
12118I3452j6300j0115k6860j0882N985N6836J7291k2436M450m7170j0243l376
12106C0632L6665Q104k1962J6042J6202m9627n4401K4579K8871L4261o728J9444
$$ plain form
12094 82082 110717 82217 65962 59880 74426 48801 14548 13683 12099 -2697 -27724 -27469 -3800
12081 -3800 -10751 1306 43181 23826 9771 6399 -11624 9864 28553 69072 78073 81705 70240
12068 70240 79052 74012 108262 144216 154750 132157 82313 39680 51758 77655 98958 108473
12056 108473 141840 158048 142033 166984 161673 185533 223194 193124 162095 203180 233862 240238
12044 240238 251304 255862 226007 204367 221310 198510 181671 184168 163572 164856 185973 189712
12032 189712 197385 184018 194128 165897 177423 204244 196188 174894 147527 151612 137442 174093
12020 174093 170460 155263 170037 183775 149784 143673 151919 178803 210660 243137 234272 191208
12008 191208 154681 175797 181940 183952 215033 249398 287694 321980 284688 246138 211440 221129
$$ packed form
12094H2082K8635k8500j6255o082J4546k5625l4253q65j584j4796k5027K55K3669
12081c800o951J2057M1875j9355j4055l372j8023K1488J8689M0519R001L632j1465
12068G0240Q812n040L4250L5954J0534k2593m9844m2633J2078K5897K1303R515
12056A08473L3367J6208j6015K4951n311K3860L7661l0070l1029M1085L0682O376
12044B40238J1066M558k9855k1640J6943k2800j6839K497k0596J284K1117L739
12032A89712P673j3367J0110k8231J1526K6821q056k1294k7367M085j4170L6651
12020A74093l633j5197J4774J3738l3991o111Q246K6884L1857L2477q865m3064
12008A91208l6527K1116O143K012L1081L4365L8296L4286l7292l8550l4698R689
$$ plain form
11996 221129 223974 203154 197062 210680 208045 206059 226202 247121 272991 274090 289734 252663
11984 252663 274242 276424 270743 323543 352890 385139 392756 351987 353163 336350 348916 394793
11972 394793 378966 355669 380134 397637 400382 415685 438912 479974 496547 489596 496718 500100
11960 500100 497203 521570 545706 582975 574696 564792 572410 588415 659500 681513 732357 773851
11948 773851 824358 849593 924128 996961 1087384 1217792 1316697 1403243 1534114 1706953 1898186
11937 1898186 2090734 2306630 2590063 2922704 3371084 3892937 4548054 5440390 6608398
11928 6608398 8110179 10022200 12535017 15796944 20076822 25858782 33478711 42881327
11920 42881327 53656442 64805855 73935970 78054190 75467258 65669103 51576657 38389261
$$ packed form
11996B21129K845k0820o092J3618k635j986K0143K0919K5870J099J5644l7071
11984B52663K1579K182n681N2800K9347L2249P617m0769J176j6813J2566M5877
11972C94793j5827k3297K4465J7503K745J5303K3227M1062J6573o951P122L382
11960E00100k897K4367K4136L7269q279r904P618J6005P1085K2013N0844M1494
11948G73851N0507K5235P4535P2833R0423J30408R8905Q6546J30871J72839J91233
11937A898186J92548K15896K83433L32641M48380N21853O55117Q92336J168008
11928F608398J501781J912021K512817L261927M279878N781960P619929R402616
11920D2881327J0775115J1149413R130115M118220k586932r798155j4092446j3187396
$$ plain form
11912 38389261 28685350 22114618 17748755 14766251 12628162 11099877 9913730 8959088
11904 8959088 8146003 7490749 7021115 6618352 6270479 5966229 5760250 5609093 5462165
11895 5462165 5378225 5323300 5275306 5206413 5085612 4875392 4606405 4391921 4233717 4004450
11885 4004450 3773501 3555538 3368469 3185909 2994679 2855011 2701456 2525053 2350566
11876 2350566 2201841 2030586 1879041 1788064 1703893 1596764 1532749 1429020 1344372 1298490
11866 1298490 1213203 1106702 1054396 1008705 948188 915005 903553 861126 835812 793294 755263
11855 755263 746617 742211 716532 690604 666376 605035 561372 519759 510590 500187 519008 499189
11843 499189 450148 414929 379850 355626 361098 350804 334531 314062 309962 281637 274478 303386
$$ packed form
11912C8389261r703911o570732m365863k982504k138089j528285j186147r54642
11904H959088q13085o55254m69634m02763l47873l04250k05979j51157j46928
11895E462165q3940n4925m7994o8893j20801k10220k68987k14484j58204k29267
11885D004450k30949k17963j87069j82560j91230j39668j53555j76403j74487
11876B350566j48725j71255j51545r0977q4171j07129o4015j03729q4648m5882
11866A298490q5287j06501n2306m5691o0517l3183j1452m2427k5314m2518l8031
11855G55263q646m406k5679k5928k4228o1341m3663m1613r169j0403J8821j9819
11843D99189m9041l5219l5079k4224N472j0294j6273k0469m100k8325p159K8908
$$ plain form
11831 303386 331440 307486 260124 246248 232875 204329 180343 196595 193854 152934 128435 159734
11819 159734 184710 180085 201379 160302 149036 147818 147350 154615 149213 177357 179659 193364 172710
11806 172710 166746 167465 141752 115291 136735 150188 136766 154461 174807 202590 229679 204620
11794 204620 168587 128114 135312 104455 104195 90599 85622 109409 108469 90234 75596 58010 67859
11781 67859 48568 20983 24536 63166 72241 96066 86303 70403 78266 53582 10645 20810
11769 20810 49470 50443 93727 92384 75651 70726 100228 117861 141557 146471 168075 140271 135605
11756 135605 155052 142956 128403 138672 108151 99849 85388 84526 109514 104978 92242 92500 65681
11743 65681 85701 148219 132179 159362 159401 136100 138741 158653 173721 134620 118073 96697
$$ packed form
11831C03386K8054k3954m7362j3876j3373k8546k3986J6252k741m0920k4499L1299
11819A59734K4976m625K1294m1077j1266j218m68P265n402K8144K302J3705k0654
11806A72710n964P19k5713k6461K1444J3453j3422J7695K0346K7783K7089k5059
11794B04620l6033m0473P198l0857k60j3596m977K3787r40j8235j4638j7586R849
11781F7859j9291k7585L553L8630R075K3825r763j5900P863k4684m2937J0165
11769B0810K8660R73M3284j343j6733m925K9502J7633K3696M914K1604k7804m666
11756A35605J9447j2096j4553J0269l0521q302j4461q62K4988m536j2736K58k6819
11743F5681K0020O2518j6040K7183L9k3301K641J9912J5068l9101j6547k1376
$$ plain form
11731 96697 93122 132495 110040 54025 57309 58850 68482 118186 130244 142164 121075 82443
11719 82443 90135 78046 49375 44489 35378 20823 60406 73745 76530 53729 51759 40485 61475
11706 61475 49972 85050 90914 63736 52475 81942 94970 131606 127174 107630 80058 58855
11694 58855 62918 107009 137138 103561 76575 100298 107845 71052 54124 56862 50088 54035 93731
11681 93731 84589 111640 90111 31031 20513 40934 9797 34857 29424 21976 49160 55415
11669 55415 41596 18611 -7653 -23867 13540 47856 39563 25707 20252 48247 73225 77544
11657 77544 114414 43659 780 8868 16542 738 15017 -8218 22226 38174 44464 54926
11645 54926 47541 27231 -3772 10130 51295 60790 87987 94980 97980 104313 59063 33190 31366
$$ packed form
11731I6697l575L9373k2455n6015L284J541R632M9704J2058J1920k1089l8632
11719H2443P692j2089k8671m886r111j4555L9583J3339K785k2801j970j1274K0990
11706F1475j1503L5078N864k7178j1261K9467J3028L6636m432j9544k7572k1203
11694E8855M063M4091L0129l3577k6986K3723P547l6793j6928K738o774L947L9696
11681I3731r142K7051k1529n9080j0518K0421l1137K5060n433p448K7184O255
11669E5415j3819k2985k6264j6214L7407L4316q293j3856n455K7995K4978M319
11657G7544L6870p0755m2879Q088P674j5804J4279k3235L0444J5948O290J0462
11645E4926p385k0310l1003J3902M1165R495K7197O993L000O333m5250k5873j824
$$ plain form
11632 31366 79259 64661 2050 -25353 6452 35964 45396 23127 -11441 11674 20025 3149
11620 3149 12916 3351 27001 49959 19279 10779 21924 28737 -960 -11037 34448 33284 28283
11607 28283 39960 62607 72943 84847 92206 67038 63731 49161 43039 26641 53372 51147
11595 51147 781 -28620 -21976 -18878 -787 29587 37019 20900 56283 53496 82709 83805 43429
11582 43429 20740 46141 49567 70898 48964 38763 77456 72368 36418 21134 23009 30952
11570 30952 29802 31357 38455 16836 8498 48417 80934 70449 49980 53604 38511 37841 43977
11557 43977 58605 59060 24897 55028 68760 60828 79871 92040 108635 99308 61773 50805
11545 50805 36664 23466 46044 62507 43409 56569 34059 -19791 -14672 2478 17663 -4674
$$ packed form
11632C1366M7893j4598o2611k7403L1805K9512R432k2269l4568K3115Q351j6876
11620C149R767r565K3650K2958l0680q500J1145O813k9697j0077M5485j164n001
11607B8283J1677K2647J0336J1904P359k5168l307j4570o122j6398K6731k225
11595E1147n0366k9401O644L098J8091L0374P432j6119L5383k787K9213J096m0376
11582D3429k2689K5401L426K1331k1934j0201L8693n088l5950j5284J875P943
11570C0952j150J555P098k1619q338L9919L2517j0485k0469L624j5093o70O136
11557D3977J4628M55l4163L0131J3732p932J9043J2169J6595r327l7535j0968
11545E0805j4141j3198K2578J6463j9098J3160k2510n3850N119J7150J5185k2337
$$ plain form
11533 -4674 -66040 -42691 -10473 -23421 -26186 -74258 -94089 -70356 -68294 -52081 -21319 -15276
11521 -15276 -19810 -18682 14376 21296 20676 -659 -6903 -1170 29092 21408 5873 41118 51051
11508 51051 51805 35894 -16871 -2135 26157 18729 39411 42375 23782 -4366 1698 30847 40896
11495 40896 34419 8540 -19432 -34326 -60355 -74050 -69477 -41620 -39943 -56690 -34512 -13329
11483 -13329 18514 33219 35799 12804 3703 7117 -232 -7670 -1186 23217 30445 23425 -9462
11470 -9462 -31116 -46076 -41161 -40988 -23565 -8049 22826 34707 38559 21881 -13042 -30136 -15421
11457 -15421 11659 27891 51368 38808 9875 7572 4536 -10076 1881 -8904 3223 18429
11445 18429 -25224 -68258 -21363 -16838 4062 25335 44321 25675 26100 1132 -2162 -6360 -59827
$$ packed form
11533d674o1366K3349L2218j2948k765m8072j9831K3733K062J6213L0762O043
11521a5276m534J128L3058O920o20k1335o244N733L0262p684j5535L5245R933
11508E1051P54j5911n2765J4736K8292p428K0682K964j8593k8148O064K9149J0049
11495D0896o477k5879k7972j4894k6029j3695M573K7857J677j6747K2178K1183
11483a3329L1843J4705K580k2995r101L414p349p438O484K4403P228p020l2887
11470i462k1654j4960M915J73J7423J5516L0875J1881L852j6678l4923j7094J4715
11457a5421K7080J6232K3477j2560k8933k303l036j4612J1957j0785J2127J5206
11445A8429m3653m3034M6895M525K0900K1273J8986j8646M25k4968l294m198n3467
$$ plain form
11432 -59827 -22422 7139 12352 58977 55262 22442 -42 -22174 -29563 -2404 33532 51950
11420 51950 33249 8131 16251 47004 64763 75886 67075 64728 73089 42011 9196 9072 -10757
11407 -10757 -34923 -22692 10721 49614 37516 22869 -24244 -42383 -30947 -36952 -27296 -2356
11395 -2356 -4771 17607 44824 14729 -2440 30427 76245 43770 313 22129 -17088 -57426
11383 -57426 -82003 -64843 -57899 -62543 -45088 -11704 -14330 -20474 -14129 12244 41695 22136 17097
11370 17097 27005 5271 -1345 -29370 -50094 -54695 -21051 14505 -11125 2685 26075 11714
11358 11714 19430 28740 30218 26238 18197 2186 -9618 -22787 -28976 -18265 2743 28101 45724
11345 45724 67336 54593 15162 12747 -14782 -37884 -11461 9811 21568 11747 -10012 -41839
$$ packed form
11432e9827L7405K9561N213M6625l715l2820k2484k2132p389K7159L5936J8418
11420E1950j8701k5118Q120L0753J7759J1123q811k347Q361l1078l2815j24j9829
11407a0757k4166J2231L3413L8893j2098j4647m7113j8139J1436o005R656K4940
11395b356k415K2378K7217l0095j7169L2867M5818l2475m3457K1816l9217m0338
11383e7426k4577J7160O944m644J7455L3384k626o144O345K6373K9451j9559n039
11370A7097R908k1734o616k8025k0724m601L3644L5556k5630J3810K3390j4361
11358A1714P716R310J478l980q041j6011j1804j3169o189J0711K1008K5358J7623
11345D5724K1612j2743l9431k415k7529k3102K6423K1272J1757r821k1759l1827
$$ plain form
11333 -41839 -90727 -76959 -16942 52374 121292 112724 81401 68474 26833 3776 -5759 -5345
11321 -5345 -3167 20436 39829 39340 15336 -13746 -50774 -100619 -113260 -37834 6958 14928 11590
11308 11590 8810 19487 10471 -21089 -48167 -24397 -7831 -22135 -33390 -9867 6736 14699
11296 14699 75505 73840 38104 2144 -11736 16469 11117 -10108 -15866 -20141 -39346 -26855
11284 -26855 -50339 -25369 9904 7144 -1008 -22368 -42162 -46269 -76183 -94942 -70270 -97181
11272 -97181 -111454 -84105 -59702 -58989 -34937 797 24369 48939 36204 155 -15603 -905
11260 -905 18713 19313 -12640 -1578 31336 52300 49168 38952 46422 1767 -21122 -8112 6301
11247 6301 19848 13844 -11142 7121 -27718 -33479 -19002 -17796 -11830 6360 -1354 -44037 -47570
$$ packed form
11333d1839m8888J3768O0017O9316O8918q568l1323j2927m1641k3057r535M14
11321e345K178K3603J9393m89k4004k9082l7028m9845j2641P5426M4792P970l338
11308A1590k780J0677r016l1560k7078K3770J6566j4304j1255K3523J6603P963
11296A4699O0806j665l5736l5960j3880K8205n352k1225n758m275j9205J2491
11284b6855k3484K4970L5273k760q152k1360j9794m107k9914j8759K4672k6911
11272i7181j4273K7349K4403P13K4052L5734K3572K4570j2735l6049j5758J4698
11260i05J9618O00l1953J1062L2914K0964l132j0216P470m4655k2889J3010J4413
11247F301J3547o004k4986J8263l4839n761J4477J206N966J8190p714m2683l533
$$ plain form
11234 -47570 -6723 19178 -7974 -24738 -16791 17411 39876 1948 -14427 -11538 18342 -113
11222 -113 1679 2585 -28036 -41815 -31567 -37750 -48073 -22861 4531 24083 63723 61276 22956
11209 22956 21321 58513 69303 42047 7759 11822 -14570 -13573 18039 12475 24674 33587 31357
11196 31357 36287 -3091 12545 48298 36774 -3737 -18882 3715 35159 59622 29048 24468
11184 24468 632 -18498 -27106 -21713 -26528 -36689 -24964 -26912 -26590 12532 -4283 3397 21832
11171 21832 17432 -3195 -51792 -81374 -83120 -103756 -62869 -30181 33715 53299 8180 -61165
11159 -61165 -56529 -1118 7741 39473 36867 34433 71005 82875 56543 35656 42569 12746 10577
11146 10577 -25700 -8597 8421 -9476 -53986 -42932 14461 20212 30541 20334 -893 17644
$$ packed form
11234d7570M0847K5901k7152j6764P947L4202K2465l7928j6375K889K9880j8455
11222a13J792R06l0621j3779J0248o183j0323K5212K7392J9552L9640k447l8320
11209B2956j635L7192J0790k7256l4288M063k6392R97L1612n564J2199Q913k230
11196C1357M930l9378J5636L5753j1524m0511j5145K2597L1444K4463l0574m580
11184B4468k3836j9130q608N393m815j0161J1725j948L22L9122j6815P680J8435
11171B1832m400k0627m8597k9582j746k0636M0887L2688O3896J9584m5119o9345
11159f1165M636N5411Q859L1732k606k434L6572J1870k6332k0887O913k9823k169
11146A0577l6277J7103J7018j7897m4510J1054N7393N751J0329j0207k1227J8537
$$ plain form
11134 17644 -9523 -5921 17774 60408 16996 -10130 8443 28598 35367 31517 46310 73038
11122 73038 57467 50442 75354 67806 25085 26501 22250 23407 27305 43568 40106 5988 -34088
11109 -34088 -27102 -11787 20228 20363 4074 18885 25721 -13831 -43005 -34232 -30457 14640 -19077
11096 -19077 -54989 -67962 -39086 -61807 -40653 9781 59414 57265 14307 16820 38497 44021
11084 44021 37001 -5068 -8722 6524 8926 -8821 -24761 -67 -14268 1949 6124 -3032 -8266
11071 -8266 -33533 -37278 -31167 -32905 -566 35978 67062 70137 41831 32201 10932 5880 -9785
11058 -9785 1015 7366 7 -3813 10561 16173 -13273 -25420 22092 61592 106027 132237 99033
11045 99033 97518 83947 24978 11986 44689 64828 84266 105140 93762 83055 79190 94440
$$ packed form
11134A7644k7167L602K3695M2634m3412k7126J8573K0155O769l850J4793K6728
11122G3038j5571p025K4912p548m2721J416m251J157L898J6263l462l4118m0076
11109c4088O986J5315L2015J35j6289J4811O836l9552k9174Q773L775M5097l3717
11096a9077l5912j2973K8876k2721K1154N0434M9633k149m2958K513K1677N524
11084D4021p020m2069l654J5246K402j7747j5940K4694j4201J6217M175r156n234
11071h266k5267l745O111j738L2339L6544L1084L075k8306r630k1269n052j5665
11058i785J0800O351p359l820J4374N612k9446j2147M7512L9500M4435K6210l3204
11045I9033j515j3571n8969j2992L2703K0139J9438K0874j1378j0707l865J5250
$$ plain form
11033 94440 135369 187873 216690 237021 212552 187380 148913 132111 112590 102445 159686 220417
11021 220417 264547 329800 337503 340937 309384 292096 277497 240515 196324 213182 205588 185107
11009 185107 182550 214964 235588 214795 184669 122723 81833 101946 139723 153387 165041 172421
10997 172421 160980 140236 98446 104639 88050 102461 108423 86941 91674 91179 52382 14020
10985 14020 46103 51193 47906 45741 13165 6318 8383 -22894 -2226 33076 42074 37928 1455
10972 1455 -36200 -22969 -1748 41574 48847 -1747 -44255 -59059 -58641 -56902 -62776 -84787 -58800
10959 -58800 -42110 -7882 -13111 -7012 -13538 -33572 -30924 -6915 7242 47530 67936 71987 67152
10946 67152 75324 81815 29021 1213 -8847 -36774 -54716 -33319 659 26570 16527 -17511
$$ packed form
11033I4440M0929N2504K8817K0331k4469k5172l8467j6802j9521j0145N7241O0731
11021B20417M4130O5253P703L434l1553j7288j4599l6982m4191J6858p594k0481
11009A85107k557L2414K0624k0793l0126o1946m0890K0113L7777J3664J1654P380
10997A72421j1441k0744m1790O193j6589J4411N962k1482M733m95l8797l8362
10985A4020L2083N090l287k165l2576o847K065l1277K0668L5302Q998m146l6473
10972A455l7655J3231K1221M3322P273n0594m2508j4804M18J739n874k2011K5987
10959e8800J6690L4228n229O099o526k0034K648K4009J4157M0288K0406M051m835
10946F7152Q172O491n2794k7808j0060k7927j7942K1397L3978K5911j0043l4038
$$ plain form
10934 -17511 6698 12841 16138 11994 4796 -1225 311 49751 51912 26340 32074 6229 -19461
10921 -19461 2803 29773 12498 -6428 22916 71727 97291 83145 116335 109487 61922 39522
10909 39522 -8428 -22804 -21829 -13060 -16220 -23522 -33622 -28215 -6950 -1916 15760 34934 28574
10896 28574 11412 8549 10127 49737 67431 41491 -3525 -8916 8041 38853 20097 -34395
10884 -34395 -56278 -47076 -12302 11485 45314 31951 -10016 -12835 -9651 -36162 -56708 -42997
10872 -42997 -22412 -4382 45761 55291 76859 51724 26764 6297 418 21463 62149 70270
10860 70270 60963 103000 113883 94251 83631 87003 105698 115722 102075 33827 -391 31042
10848 31042 77226 79390 88317 95134 71206 52961 51028 84146 80485 84393 38957 3722 27006
$$ packed form
10934a7511K4209O143L297m144p198o021J536M9440K161k5572N734k5845k5690
10921a9461K2264K6970j7275j8926K9344M8811K5564j4146L3190o848m7565k2400
10909C9522m7950j4376R75Q769l160p302j0100N407K1265N034J7676J9174o360
10896B8574j7162k863J578L9610J7694k5940m5016n391J6957L0812j8756n4492
10884c4395k1883R202L4774K3787L3829j3363m1967k819L184k6511k0546J3711
10872d2997K0585J8030N0143R530K1568k5135k4960k0467n879K1045M0686Q121
10860G0270r307M2037J0883j9632j0620L372J8695J0024j3647o8248l4218L1433
10848C1042M6184K164Q927O817k3928j8245j933L3118l661L908m5436l5235K3284
$$ plain form
10835 27006 33847 4013 20927 24078 44567 57347 60271 31350 -5373 -53203 -51376 -33267
10823 -33267 -21724 -1155 2008 22942 31759 40597 16754 -4111 -6337 39298 64456 46718
10811 46718 -3461 12530 38958 60204 58809 38821 6492 6186 10014 20782 -34381 -33195 -31609
10798 -31609 -3363 23211 43367 40138 32414 21135 38725 58582 31036 14348 65072 109282
10786 109282 88909 33711 -8555 1786 22068 36818 56866 53326 69896 64328 24951 27439
10774 27439 516 -11669 -7249 26855 10530 -3863 22635 52149 22597 40219 58433 41845
10762 41845 22726 -37091 -90711 -73413 -35622 -21169 -48984 -53015 -43063 -57213 -9601 21844
10750 21844 -44337 -58423 -40078 -57162 -77735 -55567 -23343 10547 34992 72047 80475 48908
$$ packed form
10835B7006O841k9834J6914L151K0489J2780K924k8921l6723m7830J827J8109
10823c3267J1543K0569L163K0934Q817Q838k3843k0865k226M5635K5158j7738
10811D6718n0179J5991K6428K1246j395j9988l2329l06L828J0768n5163J186J586
10798c1609K8246K6574K0156l229p724j1279J7590J9857k7546j6688N0724M4210
10786A09282k0373n5198m2266J0341K0282J4750K0048l540J6570n568l9377K488
10774B7439k6923j2185M420L4104j6325j4393K6498K9514k9552J7622J8214j6588
10762D1845j9119n9817n3620J7298L7791J4453k7815m031R952j4150M7612L1445
10750B1844o6181j4086J8345j7084k0573K2168L2224L3890K4445L7055Q428l1567
$$ plain form
10738 48908 18795 50210 60784 56385 90234 130843 106399 63120 42797 36223 43440 92531
10726 92531 137355 177378 148020 106397 83436 86314 104595 114728 84544 86606 101351 111344
10714 111344 134344 148321 127753 126824 153688 166129 179323 165893 173873 221137 265432 267819
10702 267819 253334 190079 129714 151082 189211 181106 181442 153311 128970 100744 82854 68457
10690 68457 52369 79007 87750 116778 152693 163980 186335 175760 179521 174341 202455 270324
10678 270324 308053 285694 286191 282357 301407 307235 256807 195481 158822 155254 200166 270451
10666 270451 295481 287232 272387 265814 268569 313082 346908 315728 309057 333963 379755 370554
10654 370554 390377 445682 417384 412080 432884 418452 409064 428403 418808 449078 488466 518184
$$ packed form
10738D8908l0113L1415J0574m399L3849M0609k4444m3279k0323o574P217M9091
10726I2531M4824M0023k9358m1623k2961K878J8281J0133l0184K062J4745R993
10714A11344K3000J3977k0568r29K6864J2441J3194j3430P980M7264M4295K387
10702B67819j4485o3255o0365K1368L8129q105L36k8131k4341k8226j7890j4397
10690F8457j6088K6638Q743K9028L5915J1287K2355j0575L761n180K8114O7869
10678B70324L7729k2359M97l834J9050N828n0428o1326l6659l568M4912P0285
10666B70451K5030q249j4845o573K755M4513L3826l1180o671K4906M5792r201
10654C70554J9823N5305k8298n304K0804j4432r388J9339r595L0270L9388K9718
$$ plain form
10642 518184 511509 486694 521512 576252 653024 669389 648836 703328 805342 918278 1009239
10631 1009239 1068414 1185643 1319027 1454778 1616350 1798276 2010149 2285201 2637459 3117827
10621 3117827 3760389 4617113 5715405 7053198 8645366 10456064 12315096 14140897
10613 14140897 15655069 16600898 16938461 16884901 16880416 17292100 18366107 20225332 22827911
10604 22827911 26042362 29550141 32788810 35052046 35826232 35104280 33417803 31727410
10596 31727410 30959881 31442208 33315605 36398874 40274028 44291799 47617853 49312243
10588 49312243 48725493 45809939 41481423 37184870 34039512 32432431 32224207 33080103
10580 33080103 34659140 36414656 37653257 37684129 36185807 33159674 29299814 25638604
$$ packed form
10642E18184o675k4815L4818N4740P6772J6365k0553N4492J02014J12936R0961
10631A009239N9175J17229J33384J35751J61572J81926K11873K75052L52258M80368
10621C117827O42562Q56724J098292J337793J592168J810698J859032J825801
10613A4140897J514172R45829L37563n3560m485M11684J074007J859225K602579
10604B2827911L214451L507779L238669K263236P74186p21952j686477j690393
10596C1727410p67529M82327J873397L083269L875154M017771L326054J694390
10588D9312243n86750k915554m328516m296553l145358j607081k08224Q55896
10580C3080103J579037J755516J238601L0872j498322l026133l859860l661210
$$ plain form
10572 25638604 22944494 21242746 20349944 20096862 20204102 20348934 20235650 19562667 18290945
10563 18290945 16471992 14327184 12285319 10524252 9130035 8102140 7347974 6747262
10555 6747262 6224844 5875234 5557843 5256304 4953822 4651587 4389272 4146090 3929798
10546 3929798 3738631 3554179 3337112 3111931 2956314 2852792 2753006 2621142 2523014 2363521
10536 2363521 2237673 2043197 1916004 1830890 1728797 1612406 1529129 1441562 1329625 1275458
10526 1275458 1227577 1159294 1116038 1064438 996298 955181 925357 894541 824425 754185 733319
10515 733319 681981 613184 578779 550526 538127 532125 525683 482912 463391 452634 400384 347411
10503 347411 328632 345244 354786 329002 334586 314416 273985 243277 231487 205761 208988 197630
$$ packed form
10572B5638604k694110j701748q92802k53082J07240J44832j13284o72983j271722
10563A8290945j818953k144808k041865j761067j394217j027895p54166o00712
10555F747262n22418l49610l17391l01539l02482l02235k62315k43182k16292
10546C929798j91167j84452k17067k25181j55617j03522r9786j31864r8128j59493
10536B363521j25848j94476j27193q5114j02093j16391q3277q7567j11937n4167
10526A275458m7881o8283m3256n1600o8140m1117k9824l0816p0116p0240k0866
10515G33319n1338o8797l4405k8253j2399o002o442m2771j9521j0757n2250n2973
10503C47411j8779J6612R542k5784N584k0170m0431l0708j1790k5726L227j1358
$$ plain form
10491 197630 214166 215733 217439 239634 221343 191372 174648 157745 122643 114169 114162 134578 163497
10478 163497 184195 185944 137526 146959 179952 148300 102935 110767 141677 124189 97105 113403
10466 113403 122266 134018 137503 142993 134122 141006 141288 81368 52567 48016 63641 93509 84092
10453 84092 91689 94209 121920 107663 67783 84383 100172 79696 46298 16471 40489 108022
10441 108022 138335 116917 122831 132113 131997 108942 97156 114065 135575 143123 99289 53255
10429 53255 41117 64186 69027 69875 75661 89924 106582 149245 174495 124387 107522 111954 144189
10416 144189 161036 197707 192077 183041 135291 134306 141367 123730 84441 55499 72524 91347
10404 91347 80615 103082 95412 74838 96115 107907 69315 55280 103621 101004 94904 124358
$$ packed form
10491A97630J6536J567J706K2195j8291k9971j6724j6903l5102q474pK0416K8919
10478A63497K0698J749m8418R433L2993l1652m5365P832L0910j7488k7084J6298
10466A13403Q863J1752L485N490q871O884K82n9920k8801m551J5625K9868r417
10453H4092P597K520K7711j4257l9880J6600J5789k0476l3398k9827K4018O7533
10441A08022L0313k1418N914R282j16k3055j1786J6909K1510P548m3834m6034
10429E3255j2138K3069M841Q48N786J4263J6658M2663K5250n0108j6865M432L2235
10416A44189J6847L6671n630r036m7750r85P061j7637l9289k8942J7025J8823
10404I1347j0732K2467p670k0574K1277J1792l8592j4035M8341k617o100K9454
$$ plain form
10392 124358 133818 154212 123788 121874 116919 125555 124835 89072 91261 60587 57197 68450 99325
10379 99325 85538 60233 77555 71098 62804 46271 21649 59149 62148 51653 48984 49921 54737
10366 54737 46882 70573 70444 35676 52627 75160 77515 57498 52228 78946 72889 66407 41408
10353 41408 23836 59875 78628 88039 57575 23494 20528 18864 24277 61957 46084 35708
10341 35708 54146 52979 27283 13203 6720 -5566 2532 40539 83517 96813 49185 23297
10329 23297 62752 54404 16870 21634 58432 65025 42655 38556 -1688 28771 11008 -24367
10317 -24367 -18410 34571 46588 13171 -2793 43533 69167 66585 68067 54981 59565 77548
10305 77548 65789 50422 18963 35122 74737 73769 73225 34637 17013 22618 54147 85678 95074
$$ packed form
10392A24358R460K0394l0424j914m955Q636p20l5763K189l0674l390J1253L0875
10379I9325j3787k5305J7322o457q294j6533k4622L7500K999j0495k669R37M816
10366E4737p855K3691j29l4768J6951K2533K355k0017n270K6718o057o482k4999
10353D1408j7572L6039J8753R411l0464l4081k966j664N413L7680j5873j0376
10341C5708J8438j167k5696j4080o483j2286Q098L8007M2978J3296m7628k5888
10329B3297L9455q348l7534M764L6798O593k2370m099m0244L0459j7763l5375
10317b4367N957N2981J2017l3417j5964M6326K5634k582J482j3086M584J7983
10305G7548j1759j5367l1459J6159L9615r68n44l8588j7624N605L1529L1531R396
$$ plain form
10292 95074 80903 83928 50597 37682 14130 -2274 -31805 19533 47440 42947 56517 43680
10280 43680 5311 11336 26504 -16226 -22924 51852 105163 97789 123265 184815 209561 252847
10268 252847 252522 242052 231772 296153 356973 379267 313946 236209 179879 190105 161662 125974
10256 125974 141335 97928 42464 10381 -19166 -35896 -45842 -17473 -301 15361 30343 28992
10244 28992 -2933 8185 17772 6436 22227 68298 97918 66891 22049 568 -42783 -49436
10232 -49436 -14200 9341 20924 6089 -12806 -4588 31688 37080 31335 3124 -15525 1681
10220 1681 -11668 -34400 -40364 -6599 28145 34135 17473 -1831 -3342 -34473 -31035 -2031 11420
10207 11420 9735 4563 -1749 34114 58155 39711 47426 80888 68454 41935 4234 5024 22493
$$ packed form
10292I5074j4171L025l3331j2915k3552j6404k9531N1338K7907m493J3570j2837
10280D3680l8369O025J5168m2730o698P4776N3311p374K5476O1550K4746M3286
10268B52847l25j0470j0280O4381O0820K2294o5321p7737n6330J0226k8443l5688
10256A25974J5361m3407n5464l2083k9547j6730r946K8369J7172J5662J4982j351
10244B8992l1925J1118R587j1336J5791M6071K9620l1027m4842k1481m3351o653
10232d9436L5236K3541J1583j4835j8895Q218L6276N392n745k8211j8649J7206
10220A681j3349k2732n964L3765L4744N990j6662j9304j511l1131L438K9004J3451
10207A1420j685n172o312L5863K4041j8444P715L3462j2434k6519l7701P90J7469
$$ plain form
10194 22493 43184 5629 -25981 -42156 -51934 -34326 13133 45021 39708 12442 1952 36379
10182 36379 64485 81068 64305 77964 81655 96466 80851 82681 102645 82123 76681 55615
10170 55615 62559 76900 95874 102621 136727 179634 188713 211544 212916 178525 191775 192387 173460
10157 173460 193529 260233 284997 287604 287906 295462 297064 281722 203081 154781 111480 95883
10145 95883 164956 190427 177198 192567 171107 132604 118540 125330 130825 105899 105215 89444
10133 89444 70583 75169 118002 135626 97965 74969 79764 92722 75205 87140 80759 87510
10121 87510 42093 20555 9756 39706 56002 22497 33238 26911 24317 -285 -21800 -3035
10109 -3035 -168 9400 -6501 10959 38422 37695 33280 51553 36408 -6518 -16603 -30963 -24978
$$ packed form
10194B2493K0691l7555l1610j6175r778J7608M7459L1888n313k7266j0490L4427
10182C6379K8106J6583j6763J3659L691J4811j5615J830J9964k0522n442k1066
10170E5615O944J4341J8974O747L4106M2907R079K2831J372l4391J3250O12j8927
10157A73460K0069O6704K4764K607L02P556J602j5342p8641m8300m3301j5597
10145I5883O9073K5471j3229J5369k1460l8503j4064O790N495k4926o84j5771
10133H9444j8861M586M2833J7624l7661k2996M795J2958j7517J1935o381O751
10121H7510m5417k1538j0799K9950J6296l3505J0741o327k594k4602k1515J8765
10109c035K867R568j5901J7460K7463p27m415J8273j5145m2926j0085j4360N985
$$ plain form
10096 -24978 7833 -27490 1207 -19389 -31331 -22583 10834 -17662 -42205 -16161 -32806 -32505
10084 -32505 11411 -16984 -59107 -76070 -44292 -470 -4097 -25029 -76652 -57175 -47495 -18167
10072 -18167 -31958 -53496 -56583 -57393 -65727 -99198 -69016 -30381 -14337 -23400 -63603 -42302 -28464
10059 -28464 -19765 -50078 -81054 -85741 -57401 -58546 -17374 -12517 -46484 -52928 -34649 -32902 -3426
10046 -3426 32285 25676 22531 -5139 -41774 -67747 -93089 -87274 -56586 -37654 -2458 -5981 26230
10033 26230 30341 1058 -11741 2110 29304 19212 3812 -29455 -37433 -60064 -82919 -109257
10021 -109257 -57457 -43407 -36892 -11179 -8430 9886 19376 6353 -19987 -15622 -26783 -47084
10009 -47084 -42483 -47551 -47747 -62574 -48582 -11342 -2448 13708 19707 12981 -18042 -18084 6638 -3525
$$ packed form
10096b4978L2811l5323K8697k0596j1942Q748L3417k8496k4543K6044j6645L01
10084c2505M3916k8395m2123j6963L1778M3822l627k0932n1623J9477R680K9328
10072a8167j3791k1538l087q10q334l3471L0182L8635J6044r063m0203K1301J3838
10059b8464Q699l0313l0976m687K8340j145M1172M857l3967o444J8279J747K9476
10046c426L5711o609l145k7670l6635k5973k5342N815L0688J8932L5196l523L2211
10033B6230M111k9283j2799J3851K7194j0092j5400l3267p978k2631k2855k6338
10021a09257N1800J4050O515K5713K749J8316R490j3023k6340M365j1161k0301
10009d7084M601n068j96j4827J3992L7240Q894J6156N999o726l1023m2K4722j0163
$$ plain form
9995 -3525 10165 -4749 -15407 -28072 -19427 -36892 -19104 -6819 28037 26571 23785 -8617 -33182
9982 -33182 -29331 10380 15217 10976 22189 44079 13713 -234 5303 21291 16872 -21630 -49162
9969 -49162 -23182 -39437 -31991 19508 50871 59971 19121 -974 -41864 -74536 -92010 -46997
9957 -46997 5611 21651 12001 -10318 -13262 -23383 -8942 -2958 -7346 8751 19069 4568 -17666
9944 -17666 6326 26958 32867 35278 25368 43232 16112 58118 60088 44393 26060 -7326 -33313
9931 -33313 -21163 -31885 -48014 -58932 -54157 4567 23579 26580 39499 48773 3363 -18284
9919 -18284 -32590 -42785 -15307 45879 43961 15011 1865 5358 20580 38729 35086 50044
9907 50044 70971 49072 -1937 -39147 -55278 -76828 -65939 -67738 -73296 -34006 -7256 -22630
$$ packed form
9995c525J3690j4914j0658j2665Q645j7465J7788J2285L4856j466k786l2402k4565
9982c3182L851L9711M837m241J1213K1890l0366j3947N537J5988m419l8502k7532
9969d9162K5980j6255P446N1499L1363R100m0850k0095m0890l2672j7474M5013
9957d6997N2608J6040r650k2319k944j0121J4441N984m388J6097J0318j4501k2234
9944a7666K3992K0632N909K411r910J7864k7120M2006J970j5695j8333l3386k5987
9931c3313J2150j0722j6129j0918M775N8724J9012L001J2919R274m5410k1647
9919a8284j4306j0195K7478O1186j918k8950j3146L493J5222J8149l643J4958
9907E0044K0927k1899n1009l7210j6131k1550J0889j799n558L9290K6750j5374
$$ plain form
9895 -22630 -25089 26362 14615 -6830 -39429 -48480 -50813 -19736 20123 17098 23594 74781 34658
9882 34658 13345 -37077 -58349 -43982 -24611 14453 19619 24267 23343 -33826 -58641 -40509 -19188
9869 -19188 -12755 2517 -2044 -983 -21092 -31232 -32608 -46691 -37716 -24300 -22991 24696 24117
9856 24117 6642 -19114 -65405 -64623 -29566 -11275 4703 -499 37062 27839 14337 4676 1992
9843 1992 -12208 3072 1557 -22854 -3404 -2796 -62424 -34702 -13645 -33785 -70362 -68938 -46439
9830 -46439 -10666 -5053 7174 -10729 -43362 -7185 37159 13342 6235 2293 18114 38723
9818 38723 62245 35384 20520 24542 15297 13671 13589 9525 31473 31515 63061 46668 3088 3118
9804 3118 8958 2541 -18810 -30595 -25255 -35565 -61007 -70394 -76403 -59042 -21049 -18107 -16689
$$ packed form
9895b2630k459N1451j1747k1445l2599r051k333L1077L9859l025O496N1187m0123
9882C4658k1313n0422k1272J4367J9371L9064N166M648r24n7169k4815J8132K1321
9869a9188O433J5272m561J061k0109j0140j376j4083Q975J3416J309M7687n79
9856B4117j7475k5756m6291P82L5057J8291J5978n202L7561r223j3502r661k684
9843A992j4200J5280j515k4411J9450O08n9628K7722K1057k0140l6577J424K2499
9830d6439L5773N613J2227j7903l2633L6177M4344k3817p107l942J5821K0609
9818C8723K3522k6861j4864M022r245j626q2m064K1948M2L1546j6393m3580L0
9804C118N840o417k1351j1785N340j0310k5442r387o009J7361L7993K942J418
$$ plain form
9791 -16689 -7110 -37 -9053 13851 -11713 31302 72975 50451 18753 -19672 13435 36472
9779 36472 2133 -55680 -63843 -35515 -38233 -31043 -17981 21747 39329 9314 -27746 -16139
9767 -16139 -34692 9281 58464 93594 75889 51198 55735 52238 5395 10864 15802 14976 -19158
9754 -19158 -22224 18572 -3547 -30139 -19699 8961 -15207 -40216 -39399 -53585 -49745 -52945 -6259
9741 -6259 11157 -5584 6345 14456 2471 14761 6708 12410 13861 14707 32647 18770 23086
9728 23086 10382 -15973 1307 12269 -4863 -19026 -76060 -75005 -26444 4207 11757 23274
9716 23274 39931 11655 -27875 -17548 6202 -3270 -1211 -20412 -2851 10029 -19588 -65096
9704 -65096 -66608 -62709 -75449 -92422 -77174 -40820 -43230 -36045 -36979 -64385 -52008 -70166 -78668
$$ packed form
9791a6689R579P073r016K2904k5564M3015M1673k2524l1698l8425L3107K3037
9779C6472l4339n7813q163K8328k718P190J3062L9728J7582l0015l7060J1607
9767a6139j8553M3973M9183L5130j7705k4691M537l497m6843N469M938q26l4134
9754a9158l066M0796k2119k6592J0440K8660k4168k5009Q17j4186L840l200M6686
9741f259J7416j6741J1929Q111j1985J2290q053N702J451Q46J7940j3877M316
9728B3086j2704k6355J7280J0962j7132j4163n7034J055M8561L0651P550J1517
9716B3274J6657k8276l9530J0327K3750r472K059j9201J7561J2880k9617m5508
9704f5096j512L899j2740j6973J5248L6354k410P185r34k7406J2377j8158q502
$$ plain form
9691 -78668 -61985 -5501 2581 -38393 -56720 -39857 -26640 -34198 -45585 -42878 -54877 -54677 -55597
9678 -55597 -79438 -97610 -91045 -57365 -54231 551 11765 7803 26079 -11591 -41142 -24283
9666 -24283 403 4258 24916 22742 -15584 -57945 -81812 -49780 -22007 -5139 -7767 3702
9654 3702 -15983 3511 59340 110881 82437 43244 36066 59286 116021 88137 81729 60568
9642 60568 56293 34763 -23 -11737 5296 -11348 -29202 -2877 44055 57637 13657 -30773
9630 -30773 -64096 -18102 432 18987 7602 -8375 -4631 14373 17596 15719 12231 -3051 -40437
9617 -40437 -19733 7750 -6841 -30909 -43528 -36195 -59219 -40951 -21180 -3090 19246 29138
9605 29138 1629 -7953 4991 -6919 -15877 -48526 -42939 -69267 -109293 -62132 -9879 -34939
$$ packed form
9691g8668J6683N6484Q082m0974j8327J6863J3217p558j1387K707j1999K00r20
9678e5597k3841j8172O565L3680L134N4782J1214l962J8276l7670k9551J6859
9666b4283K4686L855K0658k174l8326m2361k3867L2032K7773J6868k628J1469
9654C702j9685J9494N5829N1541k8444l9193p178K3220N6735k7884o408k1161
9642F0568m275k1530l4786j1714J7033j6644j7854K6325M6932J3582m3980m4430
9630c0773l3323M5994J8534J8555j1385j5977L744J9004L223j877l488j5282l7386
9617d0437K0704K7483j4591k4068j2619P333k3024J8268J9771J8090K2336R892
9605B9138k7509r582J2944j1910q958l2649N587k6328m0026M7161N2253k5060
$$ plain form
9593 -34939 -49979 -25863 -40727 -26042 2273 4013 -8933 10310 15165 22949 -10351 -19697 -11852
9580 -11852 -13681 30729 40933 28072 2856 -8129 1260 -25497 -34006 -12145 7636 34127
9568 34127 24546 -23254 -13344 -2093 10497 2327 -582 27775 20387 24385 18867 4747 -16272
9555 -16272 9876 21139 38046 51909 62654 64522 57435 28703 -22391 -4398 -11236 -10968 -24738
9542 -24738 -18394 -20790 -18261 -64456 -41517 -16774 -3694 -50103 -96557 -76242 -12015 -8206 -3616
9529 -3616 56590 76550 57447 26560 -16038 -72655 -72048 -62620 -40721 -41031 -61739 -19029 643
9516 643 -33075 -50693 -28693 -16489 16017 31876 24459 -1880 -27630 -48610 -14161 -41831
9504 -41831 -62806 -97532 -72878 -55954 -48713 -39019 -54068 -69774 -52345 -64167 -78876 -72913
$$ packed form
9593c4939j5040K4116j4864J4685K8315J740j2946J9243M855P784l3300r346P845
9580a1852j829M4410J0204j2861k5216j0985R389k6757q509K1861J9781K6491
9568C4127r581m7800R910J1251J2590q170k909K8357p388L998n518j4120k1019
9555a6272K6148J1263J6907J3863J0745J868p087k8732n1094J7993o838K68j3770
9542b4738O344k396K529m6195K2939K4743J3080m6409m6454K0315O4227L809M590
9529c616O0206J9960j9103l0887m2598n6617O07R428K1899l10k0708M2710J9672
9516F43l3718j7618K2000J2204L2506J5859p417k6339k5750k0980L4449k7670
9504d1831k0975l4726K4654J6924P241R694j5049j5706J7429j1822j4709N963
$$ plain form
9492 -72913 -64759 -43634 -34429 -1985 18212 26742 65371 63454 14679 21590 73899 40261 16709
9479 16709 17320 -18295 -49730 -77057 -82867 -47293 -38899 14701 16328 24951 12391 34649 39026
9466 39026 15244 8800 6468 -19464 -36513 -12786 -10462 -51630 -35754 -15979 -10688 -40561 -42213
9453 -42213 -9659 -5156 14984 -28345 -51679 -42340 -55977 -61241 -65136 -61036 -64970 -61408 -77312
9440 -77312 -37078 -25898 -27674 -4308 17327 5291 -11608 -35342 -53091 -54910 -11622 -4350
9428 -4350 -14233 -4934 -61826 -64343 -38327 -12688 -22853 -23980 -28624 -28810 -7160 38853 44982 48780
9414 48780 17214 -8652 -41877 -38376 -23884 -34462 -16724 -20261 -8197 -14422 -35864 -25314
9402 -25314 -12591 1146 811 -21594 -23439 -36378 -63675 -50269 -47675 -30336 -9623 -828 -40039
$$ packed form
9492g2913Q154K1125R205L2444K0197Q530L8629j917m8775O911N2309l3638k3552
9479A6709O11l5615l1435k7327n810L5574Q394N3600J627Q623j2560K2258M377
9466C9026k3782o444k332k5932j7049K3727K324m1168J5876J9775N291k9873j652
9453d2213L2554M503K0140m3329k3334R339j3637n264l895M100l934L562j5904
9440g7312M0234J1180j776K3366K1635j2036j6899k3734j7749j819M3288P272
9428d350r883R299n6892k517K6016K5639j0165j127m644j86K1650M6013O129L798
9414D8780l1566k5866l3225L501J4492j0578J7738l537J2064o225k1442J0550
9402b5314J2723J3737l35k2405j845j2939k7297J3406K594J7339K0713Q795l9211
$$ plain form
9389 -40039 -87403 -95241 -60210 -33205 22906 18099 3509 -5114 -49148 -32735 -19076 -11149 -27204
9376 -27204 -58705 -29132 -10682 16813 -5836 -12757 -23517 -7174 9155 13655 57643 51515
9364 51515 -13229 -15405 -29713 -41713 -34753 -12358 -28250 -50798 -20604 4644 -7520 -7055 -31402
9351 -31402 -17442 12317 9434 20910 8051 19432 47404 62391 12180 6735 -4427 -14389
9339 -14389 -7396 42151 66255 51094 31418 57563 20187 -25376 -49982 -40239 -7374 -928
9327 -928 44317 78664 67046 74048 47799 -29138 -68192 -45004 11138 45760 43365 24592 580
9314 580 -9282 15679 58241 13625 9566 28296 28731 36165 22884 4767 28836 20331 3621
9301 3621 -17167 -11616 -30199 -14948 -2637 -25487 30925 54394 26495 28570 -8936 -30330
$$ packed form
9389d0039m7364p838L5031K7005N6111m807j4590q623m4034J6413J3659P927j6055
9376b7204l1501K9573J8450K7495k2649o921j0760J6343J6329M500M3988o128
9364E1515o4744k176j4308j2000O960K2395j5892k2548L0194K5248j2164M65k4347
9351c1402J3960K9759k883J1476j2859J1381K7972J4987n0211n445j1162r962
9339a4389O993M9547K4104j5161j9676K6145l7376m5563k4606R743L2865O446
9327i28M5245L4347j1618P002k6249p6937l9054K3188N6142L4622k395j8773k4012
9314E80r862K4961M2562m4616m059J8730M35P434j3281j8117K4069q505j6710
9301C621k0788N551j8583J5251J2311k2850N6412K3469k7899K075l7506k1394
$$ plain form
9289 -30330 -15702 -12863 -33574 -58905 -42998 -12572 20219 10134 2740 -8794 -25339 -42723
9277 -42723 -39462 -45626 -74016 -98355 -65528 -27086 -15917 -16813 -22924 -34558 -41878 -42632 -48705 272
9263 272 33455 35084 -15133 -61239 -69959 -61474 -89533 -63229 -14081 19637 24832 14647 -15962
9250 -15962 -25161 -12922 -25024 -18028 2562 1679 5052 -28734 -35773 3438 14139 -4944 -27008
9237 -27008 -42062 -43205 -23759 -70587 -108209 -72568 -32579 -29180 -24203 -22964 -66218 -61916 -46708
9224 -46708 -40188 -43072 -22817 4158 -26229 -51753 -84589 -88032 -58084 -206 10000 28589
9212 28589 26062 23155 -285 -7747 4311 32063 59502 39361 33350 16329 -32671 -60298 -60726
9199 -60726 -41471 -45688 -5341 1046 19653 22383 4858 -13307 -15596 -44822 -44506 -31155 -23259
$$ packed form
9289c0330J4628K839k0711k5331J5907L0426L2791j0085p394j1534j6545j7384
9277d2723L261o164k8390k4339L2827L8442J1169q96o111j1634p320p54o073M8977
9263B72L3183J629n0217m6106q720Q485k8059K6304M9148L3718N195j0185l0609
9250a5962r199J2239j2102O996K0590q83L373l3786p039L9211J0701j9083k2064
9237b7008j5054j143J9446m6828l7622L5641L9989L399M977J239m3254M302J5208
9224d6708O520k884K0255K6975l0387k5524l2836l443K9948N7878J0206J8589
9212B8589k527k907k3440p462J2058K7752K7439k0141o011j7021m9000k7627m28
9199f0726J9255m217M0347O387J8607K730j7525j8165k289k9226L16J3351P896
$$ plain form
9186 -23259 -47428 -40327 -38016 -28861 -1369 45078 18876 -15544 -44173 -38163 -30633 -21374 -18640
9173 -18640 -663 -40680 -34457 -39236 -16856 -6272 -13479 -20794 8580 34852 54313 81503 60091
9160 60091 19329 37123 24459 30541 18541 -4676 23552 14923 -6206 -50516 -93231 -89265
9148 -89265 -50160 -45506 -67852 -76219 -84923 -58065 -19268 8852 -7559 -9974 18739 6665 -24541
9135 -24541 -51122 -48000 -52732 -38735 -18103 -28302 -68130 -109384 -126466 -109599 -75677 -64192
9123 -64192 -59268 -20289 -33756 -8550 48136 48209 48562 62888 67005 51322 12167 -25964 -78321
9110 -78321 -60250 -19196 25238 44399 9484 -19088 -3451 42364 28733 -19827 -34119 -45427
9098 -45427 -53204 -37961 9118 43509 44121 62088 50415 24752 17735 4226 784 -17640 -26287
$$ packed form
9186b3259k4169P101K311R155K7492M6447k6202l4420k8629O010P530R259K734
9173a8640J7977m0017O223m779K2380J0584p207p315K9374K6272J9461K7190k1412
9160F0091m0762J7794j2664O082j2000k3217K8228q629k1129m4310m2715L966
9148h9265L9105M654k2346q367q704K6858L8797K8120j6411k415K8713j2074l1206
9135b4541k6581L122m732J3997K0632j0199l9828m1254j7082J6867L3922J1485
9123f4192M924L8979j3467K5206N6686P3L53J4326M117j5683l9155l8131n2357
9110g8321J8071M1054M4434J9161l4915k8572J5637M5815j3631m8560j4292j1308
9098d5427p777J5243M7079L4391O12J7967j1673k5663p017j3509l442j8424q647
$$ plain form
9085 -26287 -5055 -20104 -40111 -34782 -9101 -25183 -30072 -4537 20839 -49 15599 -9845
9073 -9845 -23461 6300 -3454 -33533 -39601 -11068 -33759 -70298 -56101 -51877 -55350 -57624 -25525
9060 -25525 -7019 -31465 -32831 -23657 -8285 41822 46862 40088 58808 35364 -11633 -29368 -48263
9047 -48263 -28019 18860 30481 19318 6516 14557 14985 36840 18177 -15641 -12463 -22857 -66578
9034 -66578 -46343 -1936 8532 -22465 -47520 -24897 -32925 -53028 -83474 -107017 -96273 -60073
9022 -60073 -44752 -14516 8034 32485 42065 38564 26194 27072 22646 16843 10215 2337 -20287
9009 -20287 -21482 -22620 -31109 -14506 -755 19693 21653 -549 -1961 -31579 -30134 2590 4812
8996 4812 -10498 7280 1375 -32451 -48937 -39618 -50696 -47257 4655 1503 -6603 6614 21027
$$ packed form
9085b6287K1232j5049k0007N329K5681j6082m889K5535K5376k0888J5648k5444
9073i845j3616K9761r754l0079o068K8533k2691l6539J4197M224l473k274L2099
9060b5525J8506k4446j366R174J5372N0107N040o774J8720k3444m6997j7735j8895
9047d8263K0244M6879J1621j1163j2802Q041M28K1855j8663l3818L178j0394m3721
9034f6578K0235M4407J0468l0997k5055K2623q028k0103l0446k3543J0744L6200
9022f0073J5321L0236K2550K4451R580l501j2370Q78m426n803o628p878k2624
9009b0287j195j138q489J6603J3751K0448J960k2202j412k9618J445L2724K222
8996D812j5310J7778n905l3826j6486R319j1078L439N1912l152q106J3217J4413
$$ plain form
8983 21027 15335 9500 10083 -5440 -43948 -34937 -24573 -22680 -62488 -79052 -54888 -77674 -55323
8970 -55323 -28229 -33656 -7206 -45640 -50061 -10855 9741 22652 -13009 -56936 -57122 -62117 -11059
8957 -11059 23063 -6101 19750 88387 83594 49896 45984 34641 7737 -8267 26784 20574
8945 20574 6975 -4263 4806 2207 -42102 -42648 -45785 -35472 27400 25624 -5463 19384 40253
8932 40253 -8734 -18671 -58602 -59258 -25738 -7683 -16158 -28472 -35536 23479 29142 30884 9880
8919 9880 26140 54809 55365 63084 46398 37620 94312 105722 162333 148037 88025 88214 74077
8906 74077 75219 85968 115118 156908 217225 276938 414361 513804 562120 584731 566558 429709
8894 429709 282054 208104 136559 71625 17351 24518 78007 84034 40398 27289 42693 55919
$$ packed form
8983B1027n692n835N83j5523l8508R011J0364J893l9808j6564K4164k2786K2351
8970e5323K7094n427K6450l8434m421L9206K0596J2911l5661m3927j86m995N1058
8957a1059L4122k9164K5851O8637m793l3698l912j1343k6904j6004L5051o210
8945B0574j3599j1238R069k599m4309n46l137J0313O2872j776l1087K4847K0869
8932D0253m8987r937l9931o56L3520J8055q475j2314p064N9015N663J742k1004
8919I880J6260K8669N56P719j6686q778N6692J1410N6611j4296o0012J89j4137
8906G4077J142J0749K9150M1790O0317N9713J37423R9443M8316K2611j8173j36849
8894D29709j47655p3950p1545o4934n4274P167N3489O027m3636j3109J5404J3226
$$ plain form
8882 55919 57138 73611 42134 8111 9728 76875 129525 46342 -8569 52167 44592 5580
8870 5580 2767 -322 -27057 -52982 -29274 -56087 -57951 -34460 -70718 -75936 -54846 -24490 -32908
8857 -32908 -41474 -36328 -5127 -6522 -18011 -44787 -60330 -54677 -16608 -10866 -14337 -24855 -47696
8844 -47696 -20363 26804 16311 13678 -11337 -28523 -15943 35447 98529 53377 37585 55570
8832 55570 63833 50327 29859 10121 -1286 -4748 -23440 -1301 23182 57936 38766 16156
8820 16156 4481 6021 12450 23133 11434 -11276 -27507 -48424 -5006 -13952 -9044 -23928 -35248
8807 -35248 -56321 -37424 -10828 28247 33214 44123 39103 4980 4379 2599 2156 327 -17781
8794 -17781 -12384 -43743 -32228 -20966 4645 10076 20842 31992 2195 6042 -10299 -53895
$$ packed form
8882E5919J219J6473l1477l4023J617O7147N2650q3183n4911O0736p575l9012
8870E580k813l089k6735k5925K3708k6813j864K3491l6258n218K1090L0356q418
8857c2908q566N146L1201j395j1489k6776j5543N653L8069N742l471j0518k2841
8844d7696K7333M7167j0493k633k5015j7186J2580N1390O3082m5152j5792J7985
8832E5570Q263j3506k0468j9738j1407l462j8692K2139K4483L4754j9170k2610
8820A6156j1675J540O429J0683j1699k2710j6231k0917M3418q946M908j4884j1320
8807c5248k1073J8897K6596L9075M967J0909n020l4123o01j780m43j829j8108
8794a7781N397l1359J1515J1262K5611N431J0766J1150k9797L847j6341m3596
$$ plain form
8782 -53895 -47252 -19480 -25052 -66435 -105796 -112513 -106671 -107492 -63212 -30006 -2141 17533 44881
8769 44881 41405 38854 43822 55223 34459 13745 -33393 4000 39812 10840 -35080 -57233
8757 -57233 -72496 -53131 -25757 13071 60559 63881 -18452 -12587 -10874 -23660 -23618 -23782 -72140
8744 -72140 -68947 -57892 -58635 -73316 -66754 -27467 12972 41839 32085 43696 47826 38174 4236
8731 4236 5813 -2109 -19964 23198 2556 -43725 -10489 29616 23906 27668 39920 47772 21920
8718 21920 -19214 -23939 -25396 -26525 -41904 -33264 -17242 -9622 -22281 -5256 5356 9063 9852
8705 9852 -6041 -23860 -50366 -14046 2872 -3827 -23514 -4117 10323 18213 55368 24143
8693 24143 -14168 -27464 -26565 -22346 38995 44792 51288 22550 31970 62901 58444 51753 47160 22015
$$ packed form
8782e3895O643K7772n572m1383l9361o717N842q21M4280L3206K7865J9674K7348
8769D4881l476k551M968J1401k0764k0714m7138L7393L5812k8972m5920k2153
8757e7233j5263J9365K7374L8828M7488L322q2333N865J713j2786M2j64m8358
8744g2140L193J1055p43j4681O562L9287M0439K8867r754J1611M130r652l3938
8731D236J577p922j7855M3162k0642m6281L3236M0105n710L762J2252P852k5852
8718B1920m1134m725j457j129j5379Q640J6022P620j2659J7025J0612L707P89
8705I852j5893j7819k6506L6320J6918o699j9687J9397J4440P890L7155l1225
8693B4143l8311j3296Q99M219O1341N797O496k8738R420L0931m457o691m593k5145
$$ plain form
8679 22015 1521 8767 -15289 -14104 -21470 -26828 -32207 -26854 5241 44319 16551 3883 20131
8666 20131 19179 9856 24552 2031 1527 47644 47594 30194 30128 3767 18695 68415 52145 22900
8652 22900 12599 2242 -13960 -21806 -20579 -17481 -32375 -29690 -19581 53382 75562 76260 45492
8639 45492 11575 -25473 3448 5140 6889 45324 17633 1887 32533 32164 51844 72527 42159
8626 42159 56037 44222 19111 15056 24511 69516 90427 75663 71193 91707 90489 56818 8226
8613 8226 56597 60261 48420 19754 66130 104696 117780 147796 129393 132938 114068 98055
8601 98055 151911 201424 208635 162610 135494 154897 220555 253478 254386 257994 179695 139541 122274
8588 122274 94048 88470 109794 121159 104956 107933 103124 149932 179283 143338 114206 77546
$$ packed form
8679B2015k0494P246k4056J185p366n358n379N353L2095L9078k7768j2668J6248
8666B0131r52r323J4696k2521n04M6117n0j7400o6k6361J4928M9720j6270k9245
8652B2900j0301j0357j6202p846J227L098j4894K685J0109P2963K2180O98l0768
8639D5492l3917l7048K8921J692J749L8435k7691j5746L0646l69J9680K0683l0368
8626D2159J3878j1815k5111m055R455M5005K0911j4764m470K0514j218l3671m8592
8613H226M8371L664j1841k8666M6376L8566J3084L0016j8403L545j8870j6013
8601I8055N3856M9513P211m6025k7116J9403O5658L2923R08L608p8299m0154j7267
8588A22274k8226n578K1324J1365j6203K977m809M6808K9351l5945k9132l6660
$$ plain form
8576 77546 68730 61277 55143 59370 68437 64500 4094 70548 165316 153734 100340 66907 41075
8563 41075 72981 95969 55396 18812 -433 622 10499 13377 33001 36146 52196 40065 20369
8550 20369 43327 32282 31873 33172 942 -22452 -50354 -56782 -43297 -21213 -14608 -5526 11742
8537 11742 -17931 -27994 10212 22301 27941 58075 50767 37238 40589 26480 21610 -12882 -60852
8524 -60852 -41977 -26578 -26526 26435 34655 515 210 24219 19344 18870 34966 23583 9267 6590
8510 6590 17218 27932 33949 11855 -17121 37026 50097 30985 -54233 -76020 -43839 -49342
8498 -49342 -24598 -28757 -9114 46855 48532 10135 23884 35456 22070 -8327 -27062 -15455
8486 -15455 10598 -22746 12861 7907 -44080 -44001 -19294 26523 -8417 -21551 -38096 -19052 8856
$$ packed form
8576G7546q816p453o134M227R067l937o0406O6454R4768j1582n3394l3433k5832
8563D1075L1906K2988m0573l6584j9245J055R877K878J9624L145J6050j2131j9696
8550B0369K2958j1045m09J299l2230k3394k7902o428J3485K2084O605R082J7268
8537A1742k9673j0063L8206J2089N640L0134p308j3529L351j4109m870l4492m7970
8524f0852J8875J5399N2N2961Q220l4140l05K4009m875m74J6096j1383j4316k677
8510F590J0628J0714O017k2094k8976N4147J3071j9112q5218k1787L2181n503
8498d9342K4744m159J9643N5969J677l8397J3749J1572j3386l0397j8735J1607
8486a5455K6053l3344L5607m954n1987P9K4707M5817l4940j3134j6545J9044K7908
$$ plain form
8473 8856 6599 382 -326 -1090 15127 37215 41707 7372 -16759 25067 22265 39982 35194 13503
8459 13503 -5556 -24975 -44453 -62484 -32116 -29861 451 28837 18936 284 1886 42333
8447 42333 33108 48299 67594 93341 92173 95426 85797 59502 19710 -3390 17807 19611 4131
8434 4131 11067 16642 -6072 -26701 -44569 -27083 -22448 -26578 -6170 8509 14717 7278 9377
8421 9377 10416 -3492 -28946 -12595 19955 26267 26453 36012 62239 63471 69992 49786 22145
8408 22145 43516 44815 30484 -8667 31424 45559 31515 -2333 -60872 -77655 -92950 -37247
8396 -37247 -7588 -29883 -5343 22175 5516 405 10291 -17099 -27294 -34494 -27026 -3618 254
8383 254 9635 18693 12897 29722 7486 12302 7222 42193 72090 74196 52343 44680 37696 10989
$$ packed form
8473H856k257o217p08p64J6217K2088M492l4335k4131M1826k802J7717m788k1691
8459A3503j9059j9419j9478j8031L0368K255L0312K8386r901j8652J602M0447
8447D2333r225J5191J9295K5747j168L253r629k6295l9792k3100K1197J804j5480
8434D131O936N575k2714k0629j7868J7486M635m130K0408J4679O208p439K099
8421I377J039j3908k5454J6351L2550O312J86R559K6227J232O521k0206k7641
8408B2145K1371J299j4331l9151M0091J4135j4044l3848n8539j6783j5295N5703
8396c7247K9659k2295K4540K7518j6659n111R886k7390j0195p200P468K3408L872
8383B54R381R058n796J6825k2236M816n080L4971K9897K106k1853p663o984k6707
$$ plain form
8369 10989 23107 21219 18771 -2492 -38449 -61706 -47735 -55954 -57817 -29405 -46184 -40921 -11266
8356 -11266 8766 28131 13776 -20457 5863 29844 26188 2046 -10308 4855 24705 11935
8344 11935 -5765 13897 48420 62456 64501 60816 -5288 -56659 -99558 -47347 -1067 -17941
8332 -17941 -22729 -56208 -59711 -79713 -72699 -45207 -53818 -34824 -17259 -28931 -29371 -9715 -4893
8319 -4893 -29883 -55841 -69683 -28594 -14234 -46497 -28574 -9267 35397 -8608 -38068 -6795
8307 -6795 -13856 -68158 -81495 -62374 -22972 -17535 -4171 -7774 7896 381 -16452 -4071 54251
8294 54251 32617 -9664 -24819 -29557 -48191 -57369 -31010 5033 25524 8125 -15919 -45701
8282 -45701 -23875 -24892 -63886 -48944 -20273 -33184 -47424 -36789 -34866 -11510 10223 3085
$$ packed form
8369A0989J2118j888k448k1263l5957k3257J3971q219j863K8412j6779N263K9655
8356a1266K0032J9365j4355l4233K6320K3981l656k4142j2354J5163J9850j2770
8344A1935j7700J9662L4523J4036K045l685o6104n1371m2899N2211M6280j6874
8332a7941m788l3479l503k0002P014K7492q611J8994J7565j1672m40J9656M822
8319d893k4990k5958j3842M1089J4360l2263J7923J9307M4664m4005k9460L1273
8307f795p061n4302j3337J9121L9402N437J3364l603J5670p515j6833J2381N8322
8294E4251k1634m2281j5155m738j8634r178K6359L6043K0491j7399k4044k9782
8282d5701K1826j017l8994J4942K8671j2911j4240J0635J923K3356K1733p138
$$ plain form
8270 3085 3335 -4578 -10694 -23311 -48707 -23979 -5985 -14024 -30699 -16352 15286 9482 7357
8257 7357 -10985 9157 10838 -15768 -7261 -31592 -45333 -5163 8117 8791 -20701 -36992 -40309
8244 -40309 -9622 16649 70356 65079 51930 15372 35288 29865 19731 29519 -11860 -28758
8232 -28758 -57313 -61129 -36466 -20276 -49943 -77811 -50945 -50067 -85002 -89010 -73921 -21898 -21297
8219 -21297 -46655 -46035 -27257 21162 27330 40277 25088 19854 -7233 -4975 -19500 -67287 -97669
8206 -97669 -98546 -73475 -68815 -58929 -9407 34497 28897 17570 15078 16426 26003 67202 63132 50661
8192 50661 57923 10485 -5665 -8603 -31363 -22361 -17711 -40426 -26384 2062 43833 57581 49786
8179 49786 59059 96857 79408 38757 43218 28685 -7814 -29403 -5951 -13693 -13400 -33531 -2102
$$ packed form
8270C085K50p913o116j2617k5396K4728J7994q039j6675J4347L1638n804k125
8257G357j8342K0142J681k6606Q507k4331j3741M0170J3280O74k9492j6291l317
8244d0309L0687K6271N3707n277j3149l6558J9916n423j0134R788m1379j6898
8232b8758k8555l816K4663J6190k9667k7868K6866Q78l4935m008J5089N2023O01
8219b1297k5358O20J8778M8419O168J2947j5189n234k7087K258j4525m7787l0382
8206i7669q77K5071M660R886M9522M3904n600j1327k492J348R577M1199m070j2471
8192E0661P262m7438j6150k938k2760R002M650k2715J4042K8446M1771J3748p795
8179D9786R273L7798j7449m0651M461j4533l6499k1589K3452p742K93k0131L1429
$$ plain form
8166 -2102 10771 -9431 -13609 -12930 -29902 -57454 -27843 -9333 -29986 -7054 13025 -35657 -44002
8153 -44002 -4051 3808 -33046 -39299 -30413 -54983 -60275 -15840 -3454 -23895 -11504 -7133 6040
8140 6040 6180 -28269 -50500 -50731 -29528 -611 48721 21704 9921 3954 8077 -6020 1217
8127 1217 3335 41354 63391 51634 28874 23390 30457 25797 35656 36868 1486 -40332 -40042 -25505
8113 -25505 -15183 -6142 7150 -26539 -57399 -33162 10751 48456 7004 -2519 -12849 1621
8101 1621 42237 18154 4983 -12429 -30528 -13571 3621 -25631 -48042 -88838 -116617 -52143
8089 -52143 3379 -23234 -38748 -41701 -30837 -24369 -48558 -70693 -63256 -87077 -47543 -8141
8077 -8141 -278 -26671 2628 -37012 -74641 -72604 -57583 -48792 -45955 -25605 -19511 13888 20890
$$ packed form
8166b102J2873k0202m178O79j6972k7552K9611J8510k0653K2932K0079m8682q345
8153d4002L9951P859l6854o253Q886k4570n292M4435J2386k0441J2391M371J3173
8140F040J40l4449k2231k31K1203K8917M9332k7017j1783n967M123j4097P237
8127A217K118L8019K2037j1757k2760n484P067m660R859J212l5382m1818K90J4537
8113b5505J0322R041J3292l3689l0860K4237M3913L7705m1452r523j0330J4470
8101A621M0616k4083j3171j7412j8099J6957J7192k9252k2411m0796k7779O4474
8089e2143N5522k6613j5514k953J0864O468k4189k2135P437k3821L9534L9402
8077h141P863k6393K9299l9640l7629K037J5021Q791K837K0350O094L3399P002
$$ plain form
8064 20890 16448 1501 -9836 -11151 -53536 -48822 -11539 35918 83378 12753 -13414 -3920 -27734
8051 -27734 -56813 -51697 -27504 -1667 25852 34817 24475 48456 49022 42706 22096 -14627 -42418
8038 -42418 -47721 -15017 14342 20812 31001 61193 28449 -12855 5642 11643 23766 59489
8026 59489 40133 36085 56671 86920 97993 92301 87488 104482 102825 55782 39614 59062 94639
8013 94639 92683 74990 46014 55906 65356 62866 57008 43928 35283 24127 50031 44806 42217
8000 42217 43248 67415 54978 48307 19531 20546 36426 78861 102897 121909 137007 120723
7988 120723 129497 120434 157581 237201 288022 311443 302107 319237 321314 312169 264236 222887 188058
7975 188058 144246 119184 84853 59219 31461 9520 42568 47173 36826 61223 50495 43229
$$ packed form
8064B0890m442j4947j1337j315m2385M714L7283M7457M7460p0625k6167R494k3814
8051b7734k9079N116K4193K5837K7519Q965j0342K3981N66o316k0610l6723k7791
8038d2418n303L2704K9359O470J0189L0192l2744m1304J8497O001J2123L5723
8026E9489j9356m048K0586L0249J1073n692m813J6994j657m7043j6168J9448L5577
8013I4639j956j7693k8976R892R450k490n858j3080q645j1156K5904n225k589
8000D2217J031K4167j2437o671k8776J015J5880M2435K4036J9012J5098j6284
7988A20723Q774r063L7147P9620N0821K3421r336J7130K077r145m7933m1349l4829
7975A88058m3812k5062l4331k5634k7758k1941L3048M605j0347K4397j0728p266
$$ plain form
7963 43229 61564 105571 96786 92793 121498 126852 136187 121364 76839 90453 130280 140606 163567
7950 163567 165657 124690 131293 160438 186444 151174 134037 207557 245572 214437 184507 199747
7938 199747 166854 132571 129339 121985 85475 51341 12005 36492 72396 136509 140711 147168
7926 147168 164623 164410 121698 82760 68566 69104 76243 63602 35017 64344 57178 24887 13518
7913 13518 4265 14535 14200 8365 32552 68062 126121 144273 151094 147282 151878 143874 101170
7900 101170 64305 71330 81247 99902 53052 16184 -26447 -12815 -11708 -15796 -25292 -1965 567
7887 567 -23439 -34786 -10393 -47278 -66871 -101462 -60942 -36694 -1097 23341 26648 17387 -29639
7874 -29639 -515 40246 31702 13298 14305 10081 25260 -5131 1441 10278 24116 17377 -12368
$$ packed form
7963D3229J8335M4007q785l993K8705N354R335j4823m4525J3614L9827J0326K2961
7950A63567K090m0967O603K9145K6006l5270j7137P3520L8015l1135k9930J5240
7938A99747l2893l4283l232p354l6510l4134l9336K4487L5904O4113M202O457
7926A47168J7455k13m2712l8938j4194N38P139j2641k8585K9327p166l2291j1369
7913A3518r253J0270l35n835K4187L5510N8059J8152O821l812M596q004m2704
7900A01170l6865P025R917J8655m6850l6868m2631J3632J107m088r496K3327K532
7887E67k4006j1347K4393l6885j9593l4591M0520K4248L5597K4438L307r261m7026
7874b9639K9124M0761q544j8404J007m224J5179l0391O572Q837J3838o739k9745
$$ plain form
7861 -12368 -46595 -29495 -22840 18295 19288 -6610 22237 60583 53899 31231 6091 -73171 -100539
7848 -100539 -58808 -32423 -6428 -15292 14739 20502 36337 37591 735 28057 27246 13325 -13709
7835 -13709 -11649 -6180 6016 6276 4748 13007 20114 3771 -752 -10829 14112 41004 30829
7822 30829 -8804 -36138 947 -13009 -5259 23480 26789 15832 18010 41033 47962 25590 -468
7809 -468 -11935 2881 3799 -17225 8231 17376 12018 36101 64225 41639 60207 89061 36639
7796 36639 14972 18507 31626 306 -11126 -23294 -57209 -7849 8803 -17478 -22462 -16514
7784 -16514 -23211 2058 -2768 -20238 -15566 1753 22770 23646 -11246 -5857 20784 37414 12457
7771 12457 -9576 -13355 -24960 -37983 -5748 28935 16362 -2101 13133 52980 35160 25261
$$ packed form
7861a2368l4227J7100O655M1135R93k5898K8847L8346o684k2668k5140p9262k7368
7848a00539M1731K6385K5995q864L0031N763J5835J254l6856K7322q11j3921k7034
7835a3709K060N469J2196K60j528Q259P107j6343m523j0077K4941K6892j0175
7822C0829l9633k7334L7085j3956P750K8739L309j0957K178K3023O929k2372k6058
7809d68j1467J4816R18k1024K5456R145n358K4083K8124k2586J8568K8854n2422
7796C6639k1667L535J3119l1320j1432j2168l3915M9360J6652k6281m984N948
7784a6514o697K5269m826j7470M672J7319K1017Q76l4892N389K6641J6630k4957
7771A2457k2033l779j1605j3023L2235L4683j2573j8463J5234L9847j7820r899
$$ plain form
7759 25261 12300 -26143 -50273 -12370 -14995 -27443 -81721 -82256 -62044 -19857 -7343 -31937
7747 -31937 -29423 4501 -1066 5803 14828 24947 22612 26315 50876 33850 2011 -19622 -39648
7734 -39648 -61397 -36374 -3926 -62696 -65004 -48519 57 40943 52811 44301 31551 11434
7722 11434 13656 8264 48707 28101 -4401 -17262 -3313 -18481 -27522 -9840 28229 49219
7710 49219 76433 81928 49823 25906 -15173 -37243 -36731 -47531 5234 68513 38469 -11589
7698 -11589 1196 19859 18264 16554 1353 -7029 -7623 -61136 -98761 -78432 -55407 -1949 22472
7685 22472 3762 -44312 -32896 -40516 -47554 -38500 -10259 -34097 -21099 -29418 -4062 10382 980
7672 980 -7310 -10758 -44 63 1795 9567 13108 19971 6662 11505 1256 -17755 -54979 -48139
$$ packed form
7759B5261j2961l8443k4130L7903k625j2448n4278n35K0212M2187J2514k4594
7747c1937K514L3924n567O869R025J0119k335L703K4561j7026l1839k1633k0026
7734c9648k1749K5023L2448n8770k308J6485M8576M0886J1868q510j2750k0117
7722A1434K222n392M0443k0606l2502j2861J3949j5168r041J7682L8069K0990
7710D9219K7214N495l2105k3917m1079k2070N12j0800N2765O3279l0044n0058
7698a1589J2785J8663j595j710j5201q382n94n3513l7625K0329K3025N3458K4421
7685B2472j8710m8074J1416p620p038R054K8241k3838J2998q319K5356J4444r402
7672I80q290l448J0714J07J732P772L541O863j3309M843j0249j9011l7224O840
$$ plain form
7658 -48139 -18057 22004 7488 -5670 -12811 -18847 -34291 -56170 -73560 -28034 934 -24418
7646 -24418 -63089 -61055 -49423 -20257 22896 28232 11375 3644 6403 16401 51469 84023 50696
7633 50696 14722 -10371 -7624 -19637 -39742 -31066 31957 47002 20504 12114 62 19613
7621 19613 7361 -22359 -14327 -25653 -9383 -9826 -62740 -40754 -796 -28934 -23279 22100 49831
7608 49831 35867 22251 7947 21393 26252 11590 -5963 -42709 -10561 26330 -10798 -27359
7596 -27359 -50436 -52855 3721 9750 -34515 -27407 -14019 -30655 -30941 12360 11693 -2309 -9688
7583 -9688 -10643 27772 34818 28549 -5045 -30137 -32785 -41770 -65329 -52550 -26566 -40929 -113145
7570 -113145 -114940 -68308 -19302 -10482 -36964 -69000 -77677 -82411 -70225 -2710 -10898 -47658 -71404
$$ packed form
7658d8139L0082M0061j4516j3158p141o036j5444k1879j7390M5526K8968k5352
7646b4418l8671K034J1632K9166M3153N336j6857p731K759R998L5068L2554l3327
7633E0696l5974k5093K747j2013k0105Q676O3023J5045k6498q390j2052J9551
7621A9613j2252k9720Q032j1326J6270m43n2914K1986L9958k8138N655M5379K7731
7608D9831j3964j3616j4304J3446M859j4662j7553l6746L2148L6891l7128j6561
7596b7359k3077k419N6576O029m4265P108J3388j6636k86M3301o67j4002p379
7583i688r55L8415P046o269l3594k5092k648q985k3559J2779K5984j4363p2216
7570a13145j795M6632M9006Q820k6482l2036q677m734J2186O7515q188l6760k3746
$$ plain form
7557 -71404 -86325 -75648 -42724 -29200 -19888 -33380 -41203 -1801 1479 -3432 -11669 19296 16371
7544 16371 1258 53351 49792 2647 -51216 -64236 -92544 -121186 -126804 -89626 -85714 -81143 -47045
7531 -47045 -42592 -35072 -27885 15723 42045 25803 -10684 -30743 -54935 -38130 -39229 -41960 -12324
7518 -12324 -11839 -48452 -29196 -749 -34588 -85440 -89951 -50907 -47154 -57882 -20795 -37160 -32094
7505 -32094 -58780 -67202 -74034 -57914 -97954 -76535 -32123 -33963 -54974 -33484 -30440 -45102 -53663
7492 -53663 -64385 -46761 -870 13967 -10813 -37108 -16397 -9684 -32337 -41384 -34988 -31185 -32017
7479 -32017 -34785 -18618 -39284 -50798 -49983 -47988 -68791 -77307 -65936 -32276 -9764 -29464 -63414
7466 -63414 -42705 -16145 -22343 -50263 -39815 -44689 -59984 -64541 -63776 -41385 -402 17762 -647
$$ packed form
7557g1404j4921J0677L2924J3524R312j3492p823L9402L280m911q237L0965k925
7544A6371j5113N2093l559m7145n3863j3020k8308k8642n618L7178L912M571L4098
7531d7045M453P520P187M3608K6322j6242l6487k0059k4192J6805j099k731K9636
7518a2324M85l6613J9256K8447l3839n0852m511L9044L753j0728L7087j6365N066
7505c2094k6686q422o832J6120m0040K1419M4412j840k1011K1490L044j4662q561
7492e3663j0722J7624M5891J4837k4780k6295K0711O713k2653r047O396L803q32
7479c2017k768J6167k0666j1514Q15J995k0803q516J1371L3660K2512j9700l3950
7466f3414K0709K6560o198k7920J0448m874j5295m557P65K2391M0983J8164j8409
$$ plain form
7453 -647 -27775 -81317 -62554 -32480 -44342 13120 61680 20181 -20329 -23694 -16029 -5464 -11320
7440 -11320 -39292 23375 49961 33577 981 -9480 -29782 11840 49023 -6845 -42733 -35836
7428 -35836 -27211 -59515 -95585 -101574 -86842 -32610 17863 24730 5084 22249 30641 9499 -2856
7415 -2856 48608 91841 95620 43987 24931 33336 44476 25743 24314 6913 -40036 -20008 -2222
7402 -2222 21365 33082 22627 31844 48304 -1353 -10149 -10052 377 18095 7699 17534 24718
7389 24718 1652 11772 10914 22980 30989 31488 28972 18757 -12588 -19212 -45541 -31824 -30282
7376 -30282 -21801 -22816 -3202 -20599 -65519 -72027 -43768 -8428 56918 103262 111127 56574 35872
7363 35872 16997 37582 42222 30094 44337 53167 34741 -11359 -35539 -31430 -37724 -26024 -5173
$$ packed form
7453f47k7128n3542J8763L0074j1862N7462M8560m1499m0510l365P665J0565n856
7440a1320k7972O2667K6586j6384l2596j0461k0302M1622L7183n5868l5888O897
7428c5836Q625l2304l6070n989J4732N4232N0473O867j9646J7165Q392k1142j2355
7415b856N1464M3233L779n1633j9056Q405J1140j8733j429j7401m6949K0028J7786
7402b222K3587J1717j0455R217J6460m9657q796R7J0429J7718j0396R835P184
7389B4718k3066J0120q58J2066Q009M99k516j0215l1345o624k6329J3717J542
7376c0282Q481j015J9614j7397m4920o508K8259L5340O5346M6344P865n4553k0702
7363C5872j8875K0585M640j2128J4243Q830j8426m6100k4180M109o294J1700K0851
$$ plain form
7350 -5173 -3143 -1705 -20033 20910 3902 -4823 12275 9914 -9233 -27673 -28513 -49384 -27352
7337 -27352 -11712 1910 8556 8785 -13345 -25371 7722 28541 13765 -289 -26199 -48035
7325 -48035 -11613 -25178 -26805 1974 14519 45584 26968 18006 4057 -5406 -7330 -30964 -69046
7312 -69046 -58678 -3793 32401 42956 29330 -537 -2327 6413 16745 -29618 -87722 -95429
7300 -95429 -108441 -54963 -8057 21581 -32490 -65918 -17376 22921 22619 -38732 -82867 -63251
7288 -63251 -96681 -41286 -22995 -28743 -69451 -81965 -75072 -43423 -43387 -49673 28155 12118 -21388
7275 -21388 -26477 -38052 -3687 -2859 -27904 -41399 -46186 -43937 -18688 1058 16193 -13986 -35541
7262 -35541 -38628 -33686 -54452 -35133 -7486 1623 4453 12390 22951 46234 36635 19425 14946
$$ packed form
7350e173K030J438j8328M0943j7008q725J7098k361j9147j8440q40k0871K2032
7337b7352J5640J3622O646K29k2130j2026L3093K0819j4776j4054k5910k1836
7325d8035L6422j3565j627K8779J2545L1065j8616q962j3949r463j924k3634l8082
7312f9046J0368N4885L6194J0555j3626k9867j790Q740J0332m6363n8104p707
7300i5429j3012N3478M6906K9638n4071l3428M8542M0297l02o1351m4135J9616
7288f3251l3430N5395J8291n748m0708j2514O893L1649L6o286P7828j6037l3506
7275b1388n089j1575L4365Q28k5045j3495m787K249K5249J9746J5135l0179k1555
7262c5541l087M942k0766J9319K7647R109K830P937J0561K3283r599j7210m479
$$ plain form
7249 14946 33230 51394 30169 36032 -2408 -25726 -13737 -338 38583 34708 -20043 -31076
7237 -31076 -10023 18509 52113 17607 -26866 -27776 -23466 -24765 -19751 -6507 8025 -760 -34952
7224 -34952 -48381 -22438 -5961 -6764 12545 9946 -19381 -43063 -59714 -38396 -19945 -46528
7212 -46528 -32116 -6320 -19566 -41618 -44216 -43004 4238 -35848 -90518 -95906 -65075 -72327 -104793
7199 -104793 -124645 -69025 -3137 -35065 -26493 -28135 -19281 23071 8190 -45294 -75803 -75299 -66218
7186 -66218 -84397 -51540 10453 1610 -18121 -20717 -23499 -52376 -77894 -66951 -76768 -82039 -38637
7173 -38637 -20847 13962 -4872 -9458 12165 11711 30262 28473 54560 63514 15038 -16993 -13952
7160 -13952 15441 38927 20143 31996 16590 13743 34240 -4151 -39404 -68511 -45097 -21367
$$ packed form
7249A4946J8284J8164k1225N863l8440k3318J1989J3399L8921l875n4751j1033
7237c1076K1053K8532L3604l4506m4473r10M310j299N014J3244J4532q785l4192
7224c4952j3429K5943J6477q03J9309k599k9327k3682j6651K1318J8451k6583
7212d6528J4412K5796j3246k2052k598J212M7242m0086n4670n388L0831p252l2466
7199a04793j9852N5620O5888l1928Q572j642Q854M2352j4881n3484l0509N04R081
7186f6218j8179L2857O1993q843j9731k596k782k8877k5518J0943r817n271M3402
7173c8637J7790L4809j8834m586K1623m54J8551j789K6087Q954m8476l2031L041
7160a3952K9393K3486j8784J1853j5406k847K0497l8391l5253k9107K3414K3730
$$ plain form
7148 -21367 -57688 -65017 -46857 -44260 -65786 -77060 -37220 -25873 -35122 -33980 -6563 16766 -309
7135 -309 -57784 -69176 -38170 7935 19642 30008 7257 5591 62224 95079 76740 48003
7123 48003 9842 43796 21078 14140 59841 75207 76818 74696 68481 79050 58081 44186 25694
7110 25694 34697 51162 86942 48413 15929 -8895 -57055 -11215 34156 10352 -40577 -100715
7098 -100715 -106613 -49665 -49939 -59222 -76591 -85538 -77752 -47577 -17762 -10495 13105 16326 17404
7085 17404 35018 58752 35720 -397 -17135 -20707 -36331 -32448 -17655 -38 -9001 -43095
7073 -43095 -25129 -53767 -26923 9019 -4915 -30811 -5924 11090 8813 36202 28750 3852
7061 3852 -18546 -3437 38700 36635 44449 19715 11229 25828 -4388 -37611 -23855 -33071 -47978
$$ packed form
7148b1367l6321p329J8160K597k1526j1274L9840J1347r249J142K7417K3329j7075
7135c09n7475j1392L1006M6105J1707J0366k2751j666N6633L2855j8339k8737
7123D8003l8161L3954k2718o938M5701J5366J611k122o215J0569k0969j3895j8492
7110B5694R003J6465L5780l8529l2484k4824m8160M5840M5371k3804n0929o0138
7098a00715n898N6948k74r283j7369q947P786L0175K9815P267K3600L221J078
7085A7404J7614K3734k3032l6117j6738l572j5624L883J4793J7617q963l4094
7073d3095J7966k8638K6844L5942j3934k5896K4887J7014k277K7389p452k4898
7061C852k2398J5109M2137k065P814k4734q486J4599l0216l3223J3756r216j4907
$$ plain form
7048 -47978 -67614 -54393 -81501 -39707 -23157 -8649 247 -9283 -10589 -12371 15799 31110 15496
7035 15496 -45094 -65266 -44119 -5236 18524 26962 48303 28809 39341 76420 42047 24549
7023 24549 20584 16046 -18907 -29794 -53232 -66546 -35723 -8657 -12700 -1776 -4724 -1828 -11561
7010 -11561 -50329 -53421 -14177 6835 -21679 -36285 -57472 -26016 -18891 -26928 -72336 -65420 -31399
6997 -31399 -11016 11525 -27491 -71297 -102282 -57726 -22110 -11534 -19300 -44476 -64941 -73942
6985 -73942 -45220 -74917 -86434 -79578 -72389 -48046 -16308 -36351 -42654 -40178 -69693 -54173 -36180
6972 -36180 -19809 23784 30325 -3255 -3616 51674 64351 55901 27699 11546 9612 -17564 -62933
6959 -62933 -53763 -37302 -46968 -37821 -29279 -6077 25479 -8355 11627 3246 -15347 -25118 -15345
$$ packed form
7048d7978j9636J3221k7108M1794J6550J4508Q896r530j306j782K8170J5311j5614
7035A5496o0590k0172K1147L8883K3760Q438K1341j9494J0532L7079l4373j7498
7023B4549l965m538l4953j0887k3438j3314L0823K7066m043J0924k948K896r733
7010a1561l8768l092L9244K1012k8514j4606k1187L1456P125q037m5408O916L4021
6997c1399K0383K2541l9016m3806l0985M4556L5616J0576p766k5176k0465r001
6985g3942K8722k9697j1517O856P189K4343L1738k0043o303K476k9515J5520J7993
6972c6180J6371M3593O541l3580l61N5290J2677q450k8202j6153j934k7176m5369
6959f2933R170J6461r666R147Q542K3202L1556l3834J9982q381j8593r771R773
$$ plain form
6946 -15345 -41302 -49211 -28517 -503 -5399 -4165 15306 -13221 -85242 -55431 -28517 -14677
6934 -14677 -871 16111 17142 4468 -21177 -36956 -25669 -54532 -74276 -110034 -88861 -23291
6922 -23291 7634 11112 6971 12268 -25897 -3571 -740 -24232 4981 -5251 -47651 -60039 -40388
6909 -40388 -27967 -57530 -58303 -67216 -51360 -4654 -24945 -25771 13697 30422 21305 15062 -2904
6896 -2904 -11868 -38957 -33006 -45825 -38897 27447 36736 48471 80123 54133 -6862 -15076 13577
6883 13577 11272 -18727 -12645 -17721 28879 39305 24881 28301 12208 16727 8259 -7831 -30035
6870 -30035 -2466 52714 51633 56984 66499 53791 32608 26404 20615 21228 45560 -357 11380
6857 11380 35052 29680 22678 27554 3438 -25993 5625 63376 35166 3131 5688 -18960 -17016
$$ packed form
6946a5345k5957p909K0694K8014m896J234J9471k8527p2021K9811K6914J3840
6934a4677J3806J6982J031j2674k5645j5779J1287k8863j9744l5758K1173O5570
6922b3291L0925L478m141N297l8165K2326K831k3492K9213j0232m2400j2388J9651
6909d0388J2421k9563p73q913J5856M6706k0291q26L9468J6725r117o243j7966
6896b904q964k7089N951j2819O928O6344R289J1735L1652k5990o0995q214K8653
6883A3577k305k9999O082n076M6600J0426j4424L420j6093M519q468j6090k2204
6870c0035K7569N5180j081N351R515j2708k1183o204n789O13K4332m5917J1737
6857A1380K3672n372p002M876k4116k9431L1618N7751k8210l2035K557k4648J944
$$ plain form
6844 -17016 -33182 -36561 -29559 -17495 15317 4737 21068 -7047 -33123 -26130 24340 75020
6832 75020 67055 26807 12234 38038 38139 40939 40152 20721 33146 16986 28994 14040 -5685
6819 -5685 -3070 10803 16790 19543 14826 9441 12877 41211 -1983 -42378 -5747 23607 29966
6806 29966 38342 -22286 -30286 -14389 -8607 -17092 -25648 -15614 -2517 -18536 -17552 -23661 -994
6793 -994 7997 32223 38459 25900 7223 -12258 -44134 -59351 -30544 -40448 -46230 -35852 -31603
6780 -31603 -37211 -68836 -63123 -36389 -15342 -4165 -12845 -17879 -30764 -58426 -57296 -58322 -46781
6767 -46781 -28817 -11874 31174 2168 -32071 -40426 -29556 -21475 4699 22704 28037 2564
6755 2564 -58597 -53139 -28332 -19273 -28842 -34727 14131 33838 1436 16484 31047 -11559 -38747
$$ packed form
6844a7016j6166l379P002J2064L2812j0580J6331k8115k6076O993N0470N0680
6832G5020p965m0248j4573K5804J01K800p87j9431J2425j6160J2008j4954j9725
6819e685K615J3873N987K753m717n385L436K8334m3194m0395L6631K9354O359
6806B9966Q376o0628q000J5897N782q485q556J0034J3097j6019R84o109K2667
6793i94Q991K4226O236j2559j8677j9481l1876j5217K8807r904n782J0378M249
6780c1603n608l1625N713K6734K1047J1177q680n034j2885k7662J130j026J1541
6767d6781J7964J6943M3048k9006l4239q355J0870Q081K6174J8005N333k5473
6755B564o1161N458K4807R059r569n885M8858J9707l2402J5048J4563m2606k7188
$$ [...]
##END NTUPLES=NMR SPECTRUM
##END=
