##TITLE=Analysis number 311211
Compound Code cc 40014
Book Reference 416/184
Project Code adrs
Chemist Name stevep
##JCAMPDX= 6.0         $$ Bruker NMR JCAMP-DX V2.0
##DATA TYPE= NMR SPECTRUM
##DATA CLASS= NTUPLES
##ORIGIN= Bruker BioSpin GmbH
##OWNER= NMR
$$ XWIN-NMR		Version 3.5
$$ Mon Jul  4 11:08:09 2005 GMT Daylight Time (UT+1h)  MAYBRIDGE\NMR@NMR_250MHZ
##.OBSERVE FREQUENCY= 250.131544655141
##.OBSERVE NUCLEUS= ^1H
##.ACQUISITION MODE= SIMULTANEOUS (DQD)
##.ACQUISITION SCHEME= undefined
##.AVERAGES= 16
##.DIGITISER RES= 18
##SPECTROMETER/DATA SYSTEM= dpx250
##.PULSE SEQUENCE= zg30
##.SOLVENT NAME= CDCl3
##.SHIFT REFERENCE= (INTERNAL, CDCl3, 0, 16.522)
##AUDIT TRAIL= $$ (NUMBER, WHEN, WHO, WHERE, WHAT)
$$ ##TITLE= Audit trail, XWIN-NMR		Version 3.5
$$ ##JCAMPDX= 5.01
$$ ##ORIGIN= Bruker BioSpin GmbH
$$ ##OWNER= NMR
$$ C:\u/data/dgb/nmr/ADRS/5260/pdata/1/auditp.txt
$$ ##AUDIT TRAIL=  $$ (NUMBER, WHEN, WHO, WHERE, WHAT)
(   1,<2005-07-04 11:07:50.16 +100>,<MAYBRIDGE\NMR>,<NMR_250MHZ>,
      <created by zg, POWCHK disabled, PULCHK disabled
       configuration hash MD5:
       62 19 C7 07 E1 42 D1 B7 37 6C 3D D0 77 39 F9 E6
       data hash MD5: 64K
       5C AB 0D 0C 0D 0A A9 70 51 66 7E 74 96 BA 31 5F>)
(   2,<2005-07-04 11:08:01.02 +100>,<MAYBRIDGE\NMR>,<NMR_250MHZ>,
      <Start of raw data processing
       ef LB = 0.3 FT_mod = 6 PKNL = 1 SI = 32K 
       data hash MD5: 32K
       54 EB 5F 23 2B 89 7E BE 8D 3D 48 5A B3 C0 5C 30>)
(   3,<2005-07-04 11:08:02.82 +100>,<MAYBRIDGE\NMR>,<NMR_250MHZ>,
      <apk 
       data hash MD5: 32K
       41 79 02 08 98 BF E6 AB 13 85 1A 8C 91 2C 59 BC>)
(   4,<2005-07-04 11:08:03.54 +100>,<MAYBRIDGE\NMR>,<NMR_250MHZ>,
      <abs ABSG = 5 
       data hash MD5: 32K
       5C 10 46 C5 2F 75 44 27 CD 8F E8 B4 72 3C 7A D9>)
$$ ##END=
$$ 
$$ hash MD5
$$ A3 E8 A9 2E 60 CF 19 C6 7E 75 67 57 7B DE 2A F0
##$RELAX= 
##$RELAX= 
##$RELAX= 
##$RELAX= 
##$RELAX= 
##$RELAX= 
##$RELAX= 
$$ Bruker specific parameters
$$ --------------------------
##$DU= <C:\u>
##$EXPNO= 5260
##$NAME= <ADRS>
##$PROCNO= 1
##$TYPE= <nmr>
##$USER= <dgb>
##$AMP= (0..31)
100 100 100 100 100 100 100 100 100 100 100 100 100 100 100 100 100 100 
100 100 100 100 100 100 100 100 100 100 100 100 100 100 
##$AQSEQ= 0
##$AQ_mod= 3
##$AUNM= <au_zg>
##$AUTOPOS= <20 >
##$BF1= 250.13
##$BF2= 250.13
##$BF3= 250.13
##$BF4= 250.13
##$BF5= 500.13
##$BF6= 500.13
##$BF7= 500.13
##$BF8= 500.13
##$BYTORDA= 1
##$CFDGTYP= 0
##$CFRGTYP= 5
##$CHEMSTR= <none>
##$CNST= (0..31)
1 1 145 1 1 1 1 1 1 1 1 1 1 1 1 1 1 1 1 1 1 1 1 1 1 1 1 1 1 1 1 1 
##$CPDPRG= <>
##$CPDPRG1= <>
##$CPDPRG2= <>
##$CPDPRG3= <>
##$CPDPRG4= <mlev>
##$CPDPRG5= <mlev>
##$CPDPRG6= <mlev>
##$CPDPRG7= <mlev>
##$CPDPRG8= <mlev>
##$CPDPRGB= <>
##$CPDPRGT= <>
##$D= (0..31)
0 1 0 0 0 0 0 0 0 0.06 0 0 0 0 0 0 0.0002 0 0 0 0 0 0 0 0 0 0 0 0 0 0 
0 
##$DATE= 1120471669
##$DBL= (0..7)
120 120 120 120 120 120 120 120 
##$DBP= (0..7)
150 150 150 150 150 150 150 150 
##$DBP07= 0
##$DBPNAM0= <>
##$DBPNAM1= <>
$$ [...]
##$SUBNAM7= <"">
##$SUBNAM8= <"">
##$SUBNAM9= <"">
##$SW= 20.6930455092707
##$SWIBOX= (0..15)
0 0 3 0 0 0 0 0 0 0 0 0 0 0 0 0 
##$SW_h= 5175.983436853
##$TD= 65536
##$TD0= 1
##$TE= 295.16
##$TE2= 300
##$TE3= 300
##$TEG= 300
##$TL= (0..7)
0 120 120 120 120 120 120 120 
##$TP= (0..7)
150 150 150 150 150 150 150 150 
##$TP07= 0
##$TPNAME0= <>
##$TPNAME1= <>
##$TPNAME2= <>
##$TPNAME3= <>
##$TPNAME4= <>
##$TPNAME5= <>
##$TPNAME6= <>
##$TPNAME7= <>
##$TPOAL= (0..7)
0.5 0.5 0.5 0.5 0.5 0.5 0.5 0.5 
##$TPOFFS= (0..7)
0 0 0 0 0 0 0 0 
##$TUNHIN= 0
##$TUNHOUT= 0
##$TUNXOUT= 0
##$USERA1= <user>
##$USERA2= <user>
##$USERA3= <user>
##$USERA4= <user>
##$USERA5= <user>
##$V9= 5
##$VALIST= <valist>
##$VCLIST= <CCCCCCCCCCCCCCC>
##$VD= 0
##$VDLIST= <DDDDDDDDDDDDDDD>
##$VPLIST= <PPPPPPPPPPPPPPP>
##$VTLIST= <TTTTTTTTTTTTTTT>
##$WBST= 1024
##$WBSW= 4
##$XGAIN= (0..3)
0 0 0 0 
##$XL= 0
##$YL= 0
##$YMAX_a= 270853
##$YMIN_a= -169681
##$ZGOPTNS= <>
##$ZL1= 120
##$ZL2= 120
##$ZL3= 120
##$ZL4= 120
##$ABSF1= 16.522
##$ABSF2= -4.171173
##$ABSG= 5
##$ABSL= 3
##$ALPHA= 0
##$AQORDER= 0
##$ASSFAC= 0
##$ASSFACI= 0
##$ASSFACX= 0
##$ASSWID= 0
##$AUNMP= <proc_1d>
##$AZFE= 0.1
##$AZFW= 0.1
##$BCFW= 0
##$BC_mod= 0
##$BYTORDP= 0
##$COROFFS= 0
##$CY= 12.5
##$DATMOD= 1
##$DC= 0
##$DFILT= <>
##$DTYPP= 0
##$F1P= 14.0000005364418
##$F2P= -0.99999901652339
##$FCOR= 0.5
##$FTSIZE= 32768
##$FT_mod= 6
##$GAMMA= 0
##$GB= 0
##$INTBC= 1
##$INTSCL= 1
##$ISEN= 128
##$LB= 0.3
##$LEV0= 0
##$LPBIN= 0
##$MAXI= 10000
##$MC2= 0
##$MEAN= 0
##$ME_mod= 0
##$MI= 0
##$NCOEF= 0
##$NC_proc= -5
##$NLEV= 6
##$NOISF1= 0
##$NOISF2= 0
##$NSP= 0
##$NTH_PI= 0
##$NZP= 0
##$OFFSET= 16.522
##$PC= 1
##$PHC0= -76.19685
##$PHC1= 17.75922
##$PH_mod= 1
##$PKNL= yes
##$PPARMOD= 0
##$PSCAL= 4
##$PSIGN= 0
##$REVERSE= no
##$SF= 250.13
##$SI= 32768
##$SIGF1= 0
##$SIGF2= 0
##$SINO= 400
##$SIOLD= 32768
##$SREGLST= <1H.CDCl3>
##$SSB= 0
##$STSI= 32768
##$STSR= 0
##$SW_p= 5175.98343685301
##$SYMM= 0
##$S_DEV= 0
##$TDeff= 65536
##$TDoff= 0
##$TI= <Analysis number 999999
Compound Code 99
Book Reference 9
Project Code 9>
##$TILT= no
##$TM1= 0
##$TM2= 0
##$TOPLEV= 0
##$USERP1= <user>
##$USERP2= <user>
##$USERP3= <user>
##$USERP4= <user>
##$USERP5= <user>
##$WDW= 1
##$XDIM= 32768
##$YMAX_p= 286502341
##$YMIN_p= -908234
$$ End of Bruker specific parameters
$$ ---------------------------------
##NTUPLES= NMR SPECTRUM
##VAR_NAME=  FREQUENCY,     SPECTRUM/REAL,   SPECTRUM/IMAG
##SYMBOL=    X,             R,               I
##VAR_TYPE=  INDEPENDENT,   DEPENDENT,       DEPENDENT
##VAR_FORM=  AFFN,          ASDF,            ASDF
##VAR_DIM=   32768,         32768,           32768
##UNITS=     HZ,            ARBITRARY UNITS, ARBITRARY UNITS
##FACTOR=    0.157963299565203, 1,           1
##FIRST=     4132.6476996994, 0,             0
##LAST=      -1043.33573715361, 0,           0
##MIN=       -1043.33573715361, -908234,     0
##MAX=       4132.6476996994, 286502341,     0
$$ Real data points
##PAGE= N=1
##DATA TABLE= (X++(R..R)), XYDATA
$$ [...]
23067a45942l1689J86138J82317J8705j25649o5845J21543j12738J6691j0841
$$ -145942 -177631 8507 190824 209529 83880 18035 139578 26840 43531 32690
23057C2690J4709j11318j533M4587j9809k1688m4131N7588j10697K0919j19608
$$ 32690 47399 -63919 -65452 -20865 -40674 -62362 -106493 -48905 -159602 -138683 -258291
23046b58291R027L35001j36156j39054m6091K1517J22081N9518r6982J57956K42739
$$ -258291 -249264 85737 -50419 -189473 -235564 -214047 -91966 -32448 -129430 28526 271265
23035B71265K7692J82936k32762k95634j18244R5588M3648M8876J40315L3693
$$ 271265 298957 481893 249131 -46503 -164747 -69159 -25511 23365 163680 197373
23025A97373k29918k75638o3086J51720J36713j18990M5610L12359J04375l0730
$$ 197373 -32545 -308183 -371269 -219549 -82836 -201826 -156216 156143 260518 229788
23015B29788j46426J93255O8057k74144k36883n5260J31098L0106j70354O667
$$ 229788 83362 276617 344674 70530 -166353 -221613 -90515 -60409 -230763 -224096
23005b24096j31987J22629M7949j75079J80540K54530m8341K37161J01349j17480
$$ -224096 -356083 -233454 -185505 -360584 -180044 74486 26145 263306 364655 247175
22995B47175j30404k46122M2090J36851p314l3904M3383k4563m0437q5019k60849
$$ 247175 116771 -129351 -87261 49590 42276 8372 51755 27192 -13245 -98264 -359113
22984c59113J52367j13932j69886k9181K64602L66306J15424Q5913J40536j27888
$$ -359113 -206746 -320678 -490564 -519745 -255143 111163 226587 312500 453036 325148
22974C25148m04007q8462J53513J04616K98659P4317o3938j83977j33357k15292
$$ 325148 -78859 -167321 -13808 90808 389467 463784 399846 215869 82512 -132780
22964a32780r20L4286L2203M3599J8710r1498R4531j23968l2546L17068N9014
$$ -132780 -133700 -99414 -67211 -23612 -4902 -96400 -1869 -125837 -158383 158685 217699
22953B17699j13122P4441P2562N4695q3640j51023K43910k041l93680q3025p566
$$ 217699 104577 179018 251580 306275 222635 71612 315522 313481 -80199 -163224 -170790
22942a70790n9017J88623J22731j773j4308R5687l1366l3555j13239J30013J13
$$ -170790 -229807 -41184 81547 79774 65466 161153 129787 96232 -17007 113006 113119
22931A13119m0821N9856N976l15804j48445m7963J11543J97548Q087r1193n3488
$$ 113119 72298 132154 138130 -177674 -326119 -374082 -262539 -64991 -56904 -148097 -201585
22920b01585o8751j73936j39464J53264J67835J16413M3909k8793j54J16138J4590
$$ -201585 -270336 -444272 -583736 -430472 -262637 -146224 -102315 -131108 -131262 -15124 -534
22909e34j04145l486R1496j66228m4820K23299J31914J0718q3877o6961j21126
$$ -534 -104679 -108165 -16669 -182897 -227717 -4418 127496 138214 54337 -12624 -133750
22898a33750K05713N4871j9851q9000j68275Q0623n543O298K36163K24084j12045
$$ -133750 71963 126834 106983 17983 -150292 -69669 -75212 -68914 167249 391333 279288
22887B79288l6229Q9832l8655l3195l15356j42514q0351l0359Q6988J16943N4561
$$ 279288 243059 332891 294236 261041 -54315 -196829 -277180 -307539 -220551 -103608 -49047
22876d9047K04129q6401p833O9343j76175L2918O3276J0024J7770R4498j27225
$$ -49047 155082 68681 60848 130191 -45984 -13066 50210 60234 78004 172502 45277
22865D5277r7465J80833m03956j43605R2211j9312J8557K8903q997n1440J69971
$$ 45277 -52188 128645 -275311 -418916 -326705 -346017 -327460 -298557 -307554 -358994 -189023
22854a89023R1142j58408Q050R112k5624J99790J3838l1447r119J68015k02416
$$ -189023 -97881 -256289 -248239 -239127 -264751 -64961 -51123 -82570 -91689 76326 -126090
22843a26090k93984J40167L7075j38718j55374J39597K45982K67855M9629j50004
$$ -126090 -420074 -279907 -242832 -381550 -536924 -397327 -151345 116510 166139 16135
22833A6135m5605J62087m1164j26635J72042Q2729P72k50231k81990p1106J58851
$$ 16135 -29470 132617 91453 -35182 136860 219589 220361 -29870 -311860 -382966 -224115
22822b24115J4077M346Q5642K05118k38514j97037J59229n9303j3334R2899k2358
$$ -224115 -210038 -205692 -120050 85068 -153446 -350483 -191254 -250557 -263891 -170992 -193350
22811a93350q6991o591J46575j87249O1798k3829J19507J49294L5207r6359J6452
$$ -193350 -280341 -286932 -140357 -327606 -265808 -289637 -170130 -20836 14371 -81988 -65536
22800f5536J73222k3713j39571N4618j29527r4057K25388Q5538J55180M327J28745
$$ -65536 107686 83973 -55598 -980 -130507 -224564 824 86362 241542 245869 374614
22789C74614m6089k55924o3151O3099J60064p191l8500n4268k89743k36284n2196
$$ 374614 328525 72601 9450 72549 232613 225422 186922 132654 -157089 -393373 -445569
22778d45569m9174L47556J53940j38380J03313J17997M3927J12857J00025R1791
$$ -445569 -494743 -147187 6753 -131627 -28314 89683 133610 246467 346492 438283
22768D38283p0254k08311o0128j58544r9392p3975o1611j63554J44395J41893
$$ 438283 368029 159718 99590 -58954 -158346 -232321 -293932 -457486 -313091 -171198
22758a71198m7895o8125L29983L6782k08033j21367L3394K10524j87898L2308
$$ -171198 -219093 -287218 42765 79547 -128486 -249853 -216459 -5935 -193833 -161525
22748a61525K05268p98L0969j3062j46375N3191J68280P4288j67901k61974p0893
$$ -161525 43743 42945 73914 60852 -85523 -32332 135948 210236 42335 -219639 -290532
22737b90532K42076L5539j65359l6134J8538k999K1349J20867J3841m3727j04288
$$ -290532 -48456 -12917 -178276 -214410 -195872 -198871 -177522 -56655 -42814 -86541 -190829
22726a90829o9514Q9008J31310j51918J16874K67315M7269p4668J28773j02317
$$ -190829 -260343 -171335 -40025 -191943 -75069 192246 239515 164847 293620 191303
22716A91303o518j67725l52781k93884j66078J72744K58436J39940j8046j8798
$$ 191303 184785 17060 -335721 -629605 -795683 -622939 -364503 -224563 -242609 -261407
22706b61407J97888J0894k00152J58289Q2382J98557L9763J43968Q9228p0124
$$ -261407 -63519 -52625 -252777 -94488 -12106 186451 226214 370182 459410 389286
22696C89286M518k37449j91020r4286K1880j47402k15324K24536J75979O0300
$$ 389286 393804 156355 -34665 -128951 -107071 -254473 -469797 -245261 -69282 -8982
22686h982O6516J22936p1030j0298j20423k9263K09773J77398M0237j74652j06061
$$ -8982 57534 180470 109440 99142 -21281 -50544 159229 336627 376864 202212 96151
22675I6151J13361L1515j67653k80921n0306J02557R1585Q2439l9656j04619k34854
$$ 96151 209512 241027 73374 -207547 -257853 -155296 -63711 18728 -20928 -125547 -360401
22664c60401j28461O02O2869K34036M7751O6367J38647J39947K02217J09487j29903
$$ -360401 -488862 -488260 -425391 -191355 -143604 -77237 61410 201357 403574 513061 383158
22653C83158j89614k95145j79491O6136L08197R8071j61211q8239k71503k00077
$$ 383158 193544 -101601 -281092 -214956 93241 191312 30101 -58138 -329641 -529718
22643e29718l8092L96298J54813p8867O8630j13275J16743O4380m3181j26437
$$ -529718 -567810 -171512 -16699 -95566 -26936 -140211 -23468 40912 -2269 -128706
22633a28706M0668j64730j45147K43237j09768J18482J88793q603j06071M0528
$$ -128706 -88038 -252768 -397915 -154678 -264446 -145964 42829 34226 -71845 -31317
22623c1317J12559J31957P0286j41457o0248J07750J51283K53740J30037j74554
$$ -31317 81242 213199 283485 142028 81780 189530 340813 594553 724590 550036
22613E50036o8249j43171r7767J9219j16145j67665j16706L2929J74996J04231
$$ 550036 481787 338616 240849 260068 143923 -23742 -140448 -107519 67477 171708
22603A71708k14532k11191l2264J02907j11204j18847j45495p4110J54512K22696
$$ 171708 -42824 -254015 -286279 -183372 -294576 -413423 -558918 -633028 -478516 -255820
22593b55820K54073J41659K01875n6394o7032k65321j98221J13221N5855N585
$$ -255820 -1747 139912 341787 285393 218361 -46960 -245181 -131960 -76105 -70520
22583g0520Q2766K18134J24231j78439N1106j74410j00653n8680J37762J04209
$$ -70520 12246 230380 354611 176172 227278 52868 -47785 -106465 31297 135506
22573A35506j63309j87537K52248o1244n033J03094j1311R236O9066J36071o5671
$$ 135506 -27803 -215340 36908 -24336 -29369 73725 62414 71650 140716 276787 211116
22562B11116J08075j55054j37565K1892q4952J4784L00370L4625k84539P585Q598
$$ 211116 319191 164137 26572 48464 -36488 -21704 278666 313291 28752 36337 44935
22551D4935J04662k1407j44612k09168J3783p375l7121j8098O3007K09971K63366
$$ 44935 149597 128190 -16422 -225590 -211807 -219182 -256303 -274401 -211394 -1423 261943
22540B61943l315o4884j0017M2279k06931j21292J4969R3837J8515j43027j9914
$$ 261943 258628 193744 183727 226006 19075 -102217 -87248 6589 25104 -117923 -137837
22529a37837j27513M9661q5145L3790J94454K00961k59196j93460K09419K25208
$$ -137837 -265350 -215689 -300834 -267044 -72590 128371 -130825 -324285 -114866 110342
22519A10342j596M8716j82645j22489N5683J5665L14930k1477O176O4577J52101
$$ 110342 108746 157462 -25183 -147672 -91989 -76324 238606 217129 223305 287882 439983
22508D39983m9230k91422m843r581K4536q8450J51860J0068r0635l59421j77238
$$ 439983 390753 99331 94488 84907 109443 20993 172853 182921 92286 -267135 -444373
22497d44373P9972J38250K0953j78938R5633J59565M0027j45212j80501K4536
$$ -444373 -364401 -226151 -205198 -384136 -288503 -128938 -88911 -234123 -414624 -390088
22487c90088J95342l5691n397K90661k90359j2613O6628J66848R4505K5801M7185
$$ -390088 -194746 -230437 -235834 54827 -235532 -248145 -181517 -14669 79836 105637 152822
22476A52822l05524p8121K74841j34940o5285J7706L9611N9702m8990k29403L2232
$$ 152822 -152702 -230823 44018 -90922 -156207 -138501 -98890 -39188 -88178 -317581 -285349
22465b85349L8849n2573Q0853k9517J36062J80276j34274q0640K11796K49948
$$ -285349 -246500 -299073 -218220 -247737 -111675 68601 -65673 -146313 65483 315431
22455C15431j45159j70743J2437L5751j9472j28859j2654r266o3804J61058j38463
$$ 315431 170272 -471 11966 47717 28245 -100614 -113268 -122534 -186338 -25280 -163743
22444a63743p2868J05190N0686j27619R9534M981N7519j03560r249j52740Q9748
$$ -163743 -236611 -131421 -80735 -208354 -108820 -103839 -46320 -149880 -159129 -311869 -222121
22433b22121R8071J83463N3722n8570p0990L8119J19736j32737J02657J6897M8825
$$ -222121 -124050 59413 113135 54565 -16425 21694 141430 8693 111350 128247 177072
22422A77072R2300j09097j79841j74718k18930j55177N1523J9013K09829j78206
$$ 177072 269372 160275 -19566 -194284 -413214 -568391 -516868 -497855 -288026 -466232
22412d66232j6318J26079O6440J56082j17406J43278J15085Q6176P7938K07348
$$ -466232 -482550 -356471 -290031 -133949 -251355 -108077 7008 93184 171122 378470
22402C78470q4658k26858k7991j07796j36368R5123j2959l1021o2096J2828n4936
$$ 378470 293812 66954 38963 -68833 -205201 -110078 -123037 -154058 -216154 -203326 -258262
22391b58262J4450P6179L1805n8633j1621r8386p0490o180L41902k7125j36828
$$ -258262 -243812 -167633 -135828 -194461 -206082 -304468 -374958 -381138 -39236 -66361 -203189
22380b03189j72044n5174P670N2127J79172o4287J8666L01975J59633J15626J9006
$$ -203189 -375233 -430407 -422737 -370610 -191438 -255725 -237059 64916 224549 340175 359181
22369C59181j85388j34501M1055J1362J67536O422k37111j68332r0708j85269
$$ 359181 173793 39292 80347 91709 259245 265667 28556 -139776 -230484 -415753
22359d15753K01037J88164P6022j03982n1542K4504J44036l2392J09776L1201
$$ -415753 -214716 -26552 49470 -54512 -106054 -81550 62486 30094 139870 171071
22349A71071r0530M1209J36963j48797k45835l8663L60473K1974O2839k77709
$$ 171071 80541 121750 258713 109916 -135919 -174582 185891 207865 270704 -7005
22339g005N3651q9857n6606K5308K05129J84716K3970j31650j38785L7991O8322
$$ -7005 46646 -43211 -99817 -74509 130620 315336 339306 207656 68871 106862 175184
22328A75184Q3236J36543r0887j94738m9321r8675p8443m4036K5301J61489p068
$$ 175184 258420 394963 304076 109338 60017 -38658 -117101 -161137 -135836 25653 18585
22317A8585n153N6846k424L0245J44870J28645r4342j50306p9451j48717j879
$$ 18585 13432 70278 67854 98099 242969 371614 277272 126966 47515 -101202 -103081
22306a03081j0916J47443L6754j62533O7520N1801k03212o204J77403J83552J19679
$$ -103081 -113997 33446 70200 -92333 -24813 26988 -176224 -182428 -5025 178527 298206
22295B98206J24930j30800l221q1951o2895o5992J7573j5126j4490m5223J32066
$$ 298206 423136 292336 289115 207164 144269 78277 95850 80724 66234 21011 153077
22284A53077j71152k11237P7870J56563R3418j46988j5814k49146Q8879K06875
$$ 153077 -18075 -229312 -151442 5121 98539 -48449 -64263 -313409 -224530 -17655
22274a7655n555p1409j73728R4631K24652o0095j9355l7905J0109J9299J16200
$$ -17655 -23210 -94619 -268347 -173716 50936 -9159 -28514 -66419 -56310 -37011 79189
22263G9189j44815j07321m5707k2081K89695M33556J2021k69919j92710j55190
$$ 79189 -65626 -172947 -218654 -240735 48960 482516 494537 224618 31908 -123282
22253a23282m6270j735P3786K30687m7520k88546k00521k6935p4993k5190j50036
$$ -123282 -169552 -171287 -97501 133186 85666 -202880 -403401 -430336 -505329 -530519 -680555
22242f80555j1960K63306L41534j13847l53553M9035K77768j94664n3338O6466
$$ -680555 -692515 -429209 -87675 -201522 -555075 -506040 -228272 -422936 -476274 -409808
22232d09808K98577L61939J25259j58133r4303K035k06151k47057L09025J00351
$$ -409808 -111231 250708 375967 217834 123531 125566 -80585 -327642 -18617 81734
22222H1734j03917J64212q8754J69839Q1601j66061k59927j28163L05716J76971
$$ 81734 -22183 142029 53275 223114 304715 138654 -121273 -249436 56280 233251
22212B33251k17730j13720j23882j62553J76570l2692q8390J34362K21250O5373
$$ 233251 15521 -98199 -222081 -384634 -208064 -240756 -329146 -194784 26466 91839
22202I1839j30413k78929k37248J33172L43010Q9589k30762m2523J59826J66332
$$ 91839 -38574 -317503 -554751 -421579 -78569 11020 -219742 -262265 -102439 63893
22192F3893j7072n2149J89589P467j07802k08095j58019J11688M1780K94938K5623
$$ 63893 46821 -5328 184261 191728 83926 -124169 -282188 -170500 -128720 166218 191841
22181A91841r9480L3450J86302P142j21851k1882L072j48122P9482j39395L3926
$$ 191841 92361 125811 312113 319255 197404 175522 178594 30472 109954 -29441 4485
22170D485P3793j09120N543n7642q0056q4250J247M4665O7761J78443K19527o9021
$$ 4485 78278 -30842 -25299 -82941 -162997 -247247 -246000 -201335 -133574 44869 264396 195375
22158A95375N9983M9705j98836J3062r8667N6189K8795J50929J33346Q3401j28124
$$ 195375 255358 305063 106227 119289 20622 76811 105606 256535 389881 473282 345158
22147C45158p3983j49351O2734k34132Q8896O1897L872k5022P2234l59032L4816
$$ 345158 271175 121824 184558 -49574 39322 101219 105091 80069 152303 -206729 -171913
22136a71913J26058Q2296O004J6787j08967K4207j05754K59959J83275j71208
$$ -171913 -45855 36441 42445 59232 -49735 -25528 -131282 128677 311952 140744
22126A40744j2147j68074k6727Q3849K4958j28270o0582R6919J52942l00212k8968
$$ 140744 128597 -39477 -66204 17645 42603 -85667 -146249 -49330 103612 -196600 -225568
22115b25568J59698J12961J80301n2797j08879Q0680Q0121M1047j53233Q5469
$$ -225568 -65870 47091 227392 174595 65716 146396 226517 267564 114331 199800
22105A99800M773k3381K8595n1434J3776P8954k42364j05619J61187N7549N006
$$ 199800 204573 181192 209787 158353 172129 251083 8719 -96900 64287 121836 126842
22094A26842k5864r8327j67754q9572j0354L04478M05943k2745l40542k16261
$$ 126842 100978 2651 -165103 -254675 -265029 39449 445392 422647 82105 -134156
22084a34156R5710K49738J24555p9477j31918M8586O657M1481j99402J2196L9091
$$ -134156 -38446 211292 335847 256370 124452 173038 179695 221176 21774 33970 73061
22073G3061m6708J7849k7596J82070j76975k11545J53558J38632k1488k35800
$$ 73061 26353 44202 16606 198676 21701 -189844 -36286 102346 80858 -154942
22063a54942k01383L3053K13848j63429j17114O8171K07533J80842l1174j77784
$$ -154942 -356325 -323272 -109424 -272853 -389967 -321796 -114263 66579 35405 -142379
22053a42379L2378P1130p5567J4700N6934O7999k8759j55748r198l4532p6075
$$ -142379 -110001 -38871 -114438 -99738 -42804 25195 -3564 -159312 -168510 -203042 -279117
22042b79117J1769J38666J36712j85201p4552p073j40109J30913J5561K14592
$$ -279117 -267348 -128682 8030 -177171 -251723 -258796 -398905 -267992 -252431 -37839
22032c7839j21261J02283j63533K5502L80934k01229l7645O3015J23104l1856
$$ -37839 -159100 -56817 -220350 -194848 186086 -15143 -52788 10227 133331 101475
22022A01475n6894N5452K9258J43480j64779n0718J14514j71596o2147J3682L626
$$ 101475 44581 100033 129291 272771 107992 57274 171788 192 -61955 -48273 -44647
22011d4647J81072N3212j10225n5112J53027r2293q9701J84968j30495K35672
$$ -44647 136425 189637 79412 24300 177327 85034 -4667 180301 49806 285478
22001B85478p2169l17761j27559m6496j3510J13691o80P6497J49131j91738l5024
$$ 285478 213309 -104452 -232011 -278507 -292017 -178326 -179006 -102509 46622 -145116 -180140
21990a80140J33939k6503k37083J77339K08516k27445o8855K36474L4584j42839
$$ -180140 -46201 -72704 -309787 -132448 76068 -151377 -220232 16242 50826 -92013
21980i2013K0570J11940k97915p1930K71461P0189k79098j80152o6600P0147l2495
$$ -92013 -71443 40497 -257418 -329348 -57887 12302 -266796 -446948 -513548 -443401 -475896
21969d75896r6665K41831K48569J04338J06733j46238k420n9285k20636J79359
$$ -475896 -572561 -330730 -82161 22177 128910 -17328 -19748 -79033 -299669 -120310
21959a20310M3101o7592M6533L3117J28246k9380p9699j17463n6854k07952r94
$$ -120310 -77209 -144801 -98268 -65151 63095 33715 -45984 -163447 -220301 -428253 -429247
21948d29247J57517k8856R4273J06519k09660r6971P4156J46624J50570q2482
$$ -429247 -271730 -300586 -206313 -99794 -309454 -406425 -332269 -185645 -35075 -117557
21938a17557l1457J69184r428k2151r2733k7273J47467m1634Q6327P8162j06608
$$ -117557 -149014 20170 10742 -11409 -104142 -131415 16052 -25582 60745 138907 32299
21927C2299j14010p7586L42770K82141k30933j62501M2370q955l4553n4057j25171
$$ 32299 -81711 -159297 183473 465614 234681 72180 114550 105595 71042 16985 -108186
21916a08186J44630J17493k8818O129k13753k46871J51214K39417j88703Q7648
$$ -108186 36444 153937 125119 131248 -82505 -329376 -178162 61255 -127448 -39800
21906c9800M07122k17824k83688N7738J19338l8549j7858L5567P7203J95924p7362
$$ -39800 367322 149498 -134190 -76452 42886 4337 -13521 22046 99249 295173 217811
21895B17811j57018p2319j29011J3920l6928L6876P5490j87857p2335R2757J29947
$$ 217811 60793 -11526 -140537 -126617 -163545 -126669 -51179 -239036 -311371 -218614 -88667
21884h8667K11885l0927n9107j50871n3508q2628p4137J47094j4128K8620J6352
$$ -88667 123218 92291 33184 -117687 -171195 -253823 -327960 -180866 -194994 -166374 -150022
21873a50022j91741j93372M3149Q3665J38951J81621R1226j58939j6500p5617
$$ -150022 -341763 -535135 -491986 -408321 -269370 -87749 3477 -155462 -171962 -247579
21863b47579J67137J86648q0569Q7524q346j58363l9371o4831j70189j61877l3306
$$ -247579 -80442 106206 25637 113161 104815 -53548 -92919 -157750 -327939 -489816 -523122
21852e23122K93743L73047j57989p9903L103k6426O795J7701j33170j47104r7333
$$ -523122 -229379 143668 -14321 -94224 -91121 -117547 -110752 -93051 -226221 -373325 -470658
21841d70658K19847L35430N2719q0788N8962J6359k16336j24756L5312Q5164k1947
$$ -470658 -250811 84619 137338 56550 115512 131871 -84465 -209221 -173909 -88745 -110692
21830a10692J03960K02182m4033j02423j27845J9876j07648r5809O0271J88510
$$ -110692 -6732 195450 151417 48994 -78851 -58975 -166623 -262432 -202161 -13651
21820a3651J91694K5038m327k8757j94594j11703o6201Q4766j2122J11j09057
$$ -13651 178043 203081 198754 169997 -24597 -136300 -202501 -117735 -129857 -129746 -238803
21809b38803L1669j22701k24066J16382J11572K1017O4827K6062K83390N9242
$$ -238803 -207134 -329835 -553901 -437519 -325947 -304930 -240103 -214041 69349 128591
21799A28591k7288j26224J12021J13064J36560k59758J35307j16202r6413K9666
$$ 128591 101303 -24921 87100 200164 336724 76966 212273 96071 -342 29324
21789B9324O8170k00247J04134j14770R118Q3910J496L2744k30028n9640L3657
$$ 29324 97494 -102753 1381 -113389 -104271 -20361 -18865 13879 -216149 -275789 -242132
21778b42132J82186R9797J26219j28507p8860j0157M1103J63172J59271j0199
$$ -242132 -59946 39851 166070 37563 -41297 -51454 -10351 152821 312092 301893
21768C01893N452j9536q0642k5305p2690o6754N186j15737j01104K22735P8078
$$ 301893 307345 287809 207167 181862 109172 42418 47604 -68133 -169237 53498 131576
21757A31576l2206k9111k73012R9522q7763j74437r1560J84948K25287O199p7496
$$ 131576 99370 70259 -202753 -103231 -190994 -365431 -456991 -272043 -46756 -40557 -118053
21746a18053j5963r5044P4899K76176p1193q2286J53445J99231n1736j46271n2718
$$ -118053 -134016 -229060 -154161 122015 50822 -31464 121981 321212 269476 123205 70487
21735G0487r1731j15088o9911o7227n510O6413p7561k58286O1726K66664K51129
$$ 70487 -21244 -136332 -206243 -273470 -278980 -212567 -290128 -548414 -486688 -220024 31105
21724C1105J5464n2553J94370J11061m9436O6573q7344k2931J4216k20758j20072
$$ 31105 46569 -5984 188386 299447 250011 316584 229240 206309 220525 -233 -120305
21713a20305Q0472J07667K37130k26834k7560p9054L752j67205J40046K66245
$$ -120305 -39833 67834 304964 78130 50570 -28484 -24732 -191937 -51891 214354
21703B14354J02171p2515p2273o425j15559O0796m8422r2837p5572J14198o7586
$$ 214354 316525 244010 171737 165312 49753 110549 62127 -30710 -106282 7916 -59670
21692e9670q725O1787J53048P6586l7146Q5531o934k15695o7991j15970N0643
$$ -59670 -68395 -6608 146440 223026 185880 271411 264477 48782 -19209 -135179 -84536
21681h4536K26813q1216j63132j63915l7335J12094r8179k74508J33483K23578
$$ -84536 142277 61061 -102071 -265986 -303321 -191227 -289406 -563914 -430431 -206853
21671b06853K25135K5589J7672j34749j65540J76276L53609j21801j07645P5938
$$ -206853 18282 43871 61543 -73206 -238746 -62470 291139 169338 61693 137631
21661A37631p8194O4003r0948j16271j07166K4615k3325P3367j18456j80996J87197
$$ 137631 59437 123440 32492 -83779 -190945 -166330 -189655 -116288 -234744 -415740 -228543
21650b28543p1390j31257M0979J71307M05046J52347R5289j50554j32353j09093
$$ -228543 -299933 -431190 -390211 -218904 186142 338489 433778 283224 150871 41778
21640D1778Q7215K38082K4163j85847n7170j14032O6212j00190q3498J17279O9852
$$ 41778 128993 367075 391238 205391 148221 34189 100401 211 -83287 33992 103844
21629A03844k0024P3082K29304j21358l37858K2401J17331j81027j29825J3101
$$ 103844 83820 156902 386206 264848 -73010 -50609 66722 -114305 -244130 -231029
21619b31029J42683K09358R4824j4991q9124k14504K0709J00932J5204Q117p4236
$$ -231029 -88346 121012 215836 200845 111721 -102783 -82074 18858 34062 42179 -32057
21608c2057J40692R4409k89285j64033Q2751L8044L4577J26742m731q0065j48782
$$ -32057 108635 203044 -86241 -250274 -167523 -129479 -94902 31840 27109 -52956 -201738
21597b01738j11583J26353L9431k0440o104J79918J84171o2021p1723J16667j11000
$$ -201738 -313321 -186968 -147537 -167977 -174081 5837 190008 127987 56264 172931 61931
21586F1931o5386J13308J8345J71702j29588j06466m1226J29139j06209j28737
$$ 61931 -3455 109853 128198 299900 170312 63846 22620 151759 45550 -83187
21576h3187k1393J26682p5531k803m9336j8995Q930K32612j8319k18944j16924
$$ -83187 -104580 22102 -53429 -56232 -105568 -124563 -115633 116979 98660 -120284 -237208
21565b37208j46051j6909K22083O2514r8843J44226j30313r9033R1082n4162n2743
$$ -237208 -383259 -400168 -178085 -115571 -214414 -70188 -200501 -299534 -208452 -262614 -315357
21554c15357K78299o3843q2660J66537j18975O324N6411m3987j38004J47913K34229
$$ -315357 -37058 -100901 -183561 -17024 -135999 -129675 -73264 -117251 -255255 -107342 126887
21543A26887M1440j7006J20440L770j78576M8899j01116K0331q1017l5316n8258
$$ 126887 168327 151321 271761 275531 96955 145854 44738 65069 -15948 -51264 -109522
21532a09522l4975j64179J05795L78746R5656O3515J58051k158k17677n0966P4509
$$ -109522 -144497 -308676 -202881 175865 271521 335036 493087 490929 273252 222286 296795
21521B96795r7061n6540j70011K6816k8326j09040k2901O7044K4645K2356L9832
$$ 296795 199734 143194 -26817 -1 -28327 -137367 -160268 -93224 -68579 -46223 -6391
21510f391J01548J52705K667j16181j02138R6445Q7870j8907k05256j93499J3170
$$ -6391 95157 247862 250529 134348 32210 128655 216525 197618 -7638 -201137 -187967
21499a87967K05744K01200J27021r3839J52187j10796l2159J31816J89724j85962
$$ -187967 17777 218977 345998 252159 404346 293550 261391 393207 582931 396969
21489C96969l12535k56194J75148K93184k6916k21841J05734K82621R082k04563
$$ 396969 84434 -171760 3388 296572 269656 47815 153549 436170 445252 240689
21479B40689j74165m9765o3605k77452J27775r5976r5767J69731J07278q7177
$$ 240689 66524 16759 -46846 -324298 -196523 -292499 -388266 -218535 -111257 -198434
21469a98434k12723N9126M21856K77562l9052l4350O1748j07353j08524j19304
$$ -198434 -411157 -352031 69825 347387 308335 273985 335733 228380 119856 552
21459E52k1007K12752j44999j18941J28774P9311j6440J32831K27652J14845k45415
$$ 552 -20455 192297 47298 -71643 57131 136442 120002 252833 480485 595330 349915
21448C49915k56396j47554k73602j95329M2106K81233K84020K6555j73962O2023
$$ 349915 93519 -54035 -327637 -522966 -480860 -199627 84393 110948 -63014 -991
21438i91j09946k1652j1521l4955n4025j4293j27488K70619K83230J96901m3478
$$ -991 -110937 -132589 -144110 -179065 -233090 -247383 -374871 -104252 178978 375879 332401
21427C32401l18049k78943p9326J35993K79324J6544o9853J14774O2135j25989
$$ 332401 14352 -264591 -343917 -207924 71400 87944 18091 132865 195000 69011
21417F9011R0339n9755J6736m2458r3241N5256m5519j51714r8728J04096J46549
$$ 69011 159350 99595 116331 73873 -19368 35888 -9631 -161345 -260073 -155977 -9428
21406i428K5535j80024l5058m4205j46838Q6241J97762j00843K6315r7847j34877
$$ -9428 16107 -163917 -198975 -243180 -390018 -303777 -106015 -206858 -180543 -278390 -413267
21395d13267q4210R7112J14002K54557p0640N3967J77128J06814J08794j31973
$$ -413267 -497477 -400365 -286363 -31806 -102446 -48479 128649 235463 344257 212284
21385B12284k12211J78934K55560l5770k79502n0439p2611r819J04375q0169p9862
$$ 212284 73 179007 434567 398797 119295 68856 -3755 -13574 90801 10632 -69230
21374f9230j549J3381k0797l3170j05805q9988j48504k4538J72349J73268r7842
$$ -69230 -70779 -57398 -78195 -111365 -217170 -307158 -455662 -480200 -307851 -134583 -232425
21363b32425J72393K36683N2984j49329j40519J5286j72114K51990K41739O9043
$$ -232425 -60032 176651 229635 80306 -60213 -44927 -217041 34949 276688 345731
21353C45731j47734n2329l0440j53418Q794j16537L0272Q1956J00807n5220j67185
$$ 345731 197997 145668 115228 -38190 -29396 -145933 -115661 -33705 67102 11882 -155303
21342a55303r4165m2657K41975J43053Q857r6091j5915o9803J29456K34622O4134
$$ -155303 -249468 -292125 -50150 92903 101760 5669 -10246 -80049 49407 284029 348163
21331C48163k9350J4426O7725j66785j93610l3477k74760J91930K04801J1075
$$ 348163 318813 333239 400964 234179 40569 7092 -267668 -75738 129063 140138
21321A40138J762k9451J15609R6451K9562M1755k69189l70994J51127J42493Q8551
$$ 140138 141900 112449 228058 324509 354071 395826 126637 -244357 -93230 49263 137814
21310A37814J82571K7355r5944p8185L4265L0785o1369j03969k750J09574r4934
$$ 137814 320385 347740 251796 173611 207876 238661 177292 73323 70573 180147 85213
21299H5213l687q3677j21871j41202M8667K24982j49047j11128K0437J41436p841
$$ 85213 81526 -2151 -124022 -265224 -216557 8425 -140622 -251750 -231313 -89877 -97718
21288i7718J96424l7082k75423Q5524J29877M5488l2141M760o5755p1414Q5577
$$ -97718 98706 61624 -213799 -128275 1602 47090 14949 19709 -46046 -117460 -31883
21277c1883j10662N2903k73580l5443L04585J30173J53796j97613r0241n6108
$$ -31883 -142545 -89642 -363222 -398665 -94080 36093 189889 -7724 -97965 -154073
21267a54073J69852J78955k1243Q5967K9541j6842O1513k2830p0221l36600o9967
$$ -154073 15779 194734 173491 259458 288999 272157 333670 310840 240619 -95981 -165948
21256a65948J74256K05166J73355K01837P4077j43301k52565l40909N0751K93356
$$ -165948 8308 213474 386829 588666 662743 519442 266877 -74032 -23281 270075
21246B70075O3713l292J09343J30545J8130O7401j23704l64246j76847o5876J42808
$$ 270075 333788 330496 439839 570384 588514 655915 532211 167965 -8882 -74758 68050
21235F8050R3810M8204l3751q4421K9190j90813j45524J07989J33271j79928j29885
$$ 68050 161860 210064 176313 91892 121082 -69731 -215255 -107266 26005 -153923 -283808
21224b83808m605K38307K04641K57116M4529l41512k28807K42924K0235M4690
$$ -283808 -288413 -50106 154535 411651 456180 114668 -114139 128785 149020 193710
21214A93710K1722j89281l223R2433m4792p99l7803l50535O245N0086j0407k6285
$$ 193710 215432 26151 22928 115361 70569 69770 31967 -318568 -312323 -262237 -272644 -298929
21202b98929R6229k3455J4994R5165L17104M9800o2275M0980j23445k17709q8646
$$ -298929 -202700 -226155 -211161 -115996 201108 250908 188633 229613 106168 -111541 -200187
21191b00187J49880J62642p0823j10001q1933K8548o9568l0815K5022J26767j1720
$$ -200187 -50307 112335 41512 -68489 -150422 -121874 -191442 -222257 -197235 -70468 -82188
21180h2188J08225L9623J57104L1864L0229J35429l2376J27109n1177j84005k57516
$$ -82188 26037 65660 222764 254628 284857 420286 387910 515019 463842 279837 22321
21169B2321k55626n6517j1552Q9475P1286n1397r5538J13715K11978J52324m2987
$$ 22321 -233305 -289822 -301374 -211899 -140613 -192010 -287548 -173833 38145 190469 147482
21158A47482q259J32690l1502n1161q8802k9503p3943J79497q0052k11480j73980
$$ 147482 139223 271913 240411 189250 100448 70945 -2998 176499 96447 -115033 -289013
21147b89013n4627K78864J40709p750j99170q19K6597P5604K40369p5806k69828
$$ -289013 -343640 -64776 75933 68183 -130987 -131806 -105209 -29605 210764 134958 -134870
21136a34870q6185J75340K71594O0124m7073o6031O4743M8427j05288P4327J39958
$$ -134870 -221055 -45715 225879 286003 238930 172899 237642 286069 180781 255108 395066
21125C95066j00662m6561p0034P9310k65105m7227m1719K27646K16379m7954k22795
$$ 395066 294404 247843 177809 257119 -7986 -55213 -96932 130714 347093 299139 76344
21114G6344R873J86886J01008N5840j06819J03767L4207n5292M293J27711k503
$$ 76344 86217 273103 374111 429951 323132 426899 461106 405814 410107 537818 535315
21103E35315n003j18172k14429L9507L28844N6727j98089j7186J93535J67127
$$ 535315 530312 412140 197711 237218 566062 622789 424700 407514 601049 768176
21093G68176J76663j0636k16451j51492P4683J7818L2252k64757l43738k0311
$$ 768176 944839 934203 717752 566260 640943 658761 691013 426256 82518 62207
21083F2207m4174q9994J31581J69945J26515M32L1193J68989J25757n6984K2196
$$ 62207 18033 -71961 59620 229565 356080 356512 387705 556694 682451 625467 647663
21072F47663j40519j53171p3724J13142R0947J6570j20716j86271q2587o2346
$$ 647663 507144 353973 280249 393391 484338 500908 380192 193921 111334 48988
21062D8988K17478L18704j7886j49277M104M9165R2171M3886q5081k0636j95425
$$ 48988 266466 585170 567284 418007 422111 471276 563447 607333 522252 501616 306191
21051C06191j97110j53044j05758q704L9920k9399K5054m1056n7186r6787J86099
$$ 306191 109081 -43963 -149721 -158425 -118505 -147904 -122850 -163906 -221092 -317879 -131780
21040a31780O8191J24204J9728j44028J27372J10401M1102R1993q2541k49403
$$ -131780 -63589 60615 80343 -63685 63687 174088 215190 307183 224642 -24761
21030b4761j28759J32819J43411K58705Q7701Q6115K57270k40861k50100j05495
$$ -24761 -153520 -20701 122710 381415 469116 555231 812501 571640 321540 216045
21020B16045p4822k31461K37245M480R8496J55982l23635k22736l6929N1335j99391
$$ 216045 141223 -90238 147007 151487 249983 405965 82330 -140406 -177335 -126000 -325391
21009c25391k23004J33042J85319N3878L04326P2440J23697m801Q1519J4589k61776
$$ -325391 -548395 -415353 -230034 -176156 128170 200610 324307 319506 401025 415614 153838
20998A53838j71365J53430R3602k18658j8831k83374j13908M48912M21849J59333
$$ 153838 -17527 135903 229505 10847 -7984 -291358 -405266 43646 465495 624828
20988F24828J15315j12905n5991M0283J14988k20348k49913j44233j50902m3820
$$ 624828 740143 627238 571247 611530 726518 506170 256257 112024 -38878 -82698
20978h2698Q2293l908j44859J16844n984K3916j06128o7509J58735Q3328N6405
$$ -82698 -405 -4313 -149172 -32328 -38312 -14396 -120524 -188033 -29298 54030 110435
20967A10435P5019j89435R6818J85144R8976j08443l015k15821n5904q5853J0301
$$ 110435 185454 -3981 92837 277981 376957 268514 265499 49678 -6226 -92079 -81778
20956h1778K03785J12176J20036j7910j21337k07024l47481J23300J89857O2957
$$ -81778 122007 234183 354219 336309 214972 7948 -339533 -216233 -26376 36581
20946C6581j00350q2122K0873Q0861N5133k11358j65943Q9964K00503J51820p6942
$$ 36581 -63769 -145891 -125018 -44157 10976 -200382 -366325 -276361 -75858 75962 -980
20935i80q3332j76125P7105K69093J81384J38497j05422j67005k11026J03037
$$ -980 -84312 -260437 -183332 85761 267145 405642 300220 133215 -77811 25226
20925B5226Q2559j73463n6331p1624j85028P6631J06842R907N0178K9194j9578
$$ 25226 107785 -65678 -122009 -193633 -378661 -302030 -195188 -185281 -135103 -105909 -125487
20914a25487K53215K64060j9132J50473M2817J3092p4665j59127j47803M9940
$$ -125487 127728 391788 372656 523129 565946 579038 504373 345246 197443 247383
20904B47383r1157R763Q9424K4353k05293j30570k75754J1831R9444K42522n8722
$$ 247383 156226 165989 255413 279766 74473 -56097 -331851 -320020 -220576 21946 -36776
20893c6776Q1295L3607M5448J59422K4870j70305j25423o6738K3959R7527k340
$$ -36776 44519 78126 123574 282996 307866 137561 12138 -54600 -30641 66886 64546
20882F4546l8368J8770K80735Q1657J12930l44978j99039O3650J22895j04437
$$ 64546 26178 44948 325683 407340 520270 175292 -23747 39903 162798 58361
20872E8361k6867j4494j3082J47762n7638J35231k9003j11299J01236l849l4251
$$ 58361 31494 17000 3918 151680 94042 229273 200270 88971 190207 186358 152107
20861A52107P4043L4212j25704j39127N2524Q0515Q1031m3438M227j68451k19652
$$ 152107 226150 260362 134658 -4469 48055 128570 209601 166163 170390 1939 -217713
20850b17713o625K32431k85694o3941K07798K08586Q0637K48499j64608k67111
$$ -217713 -224338 8093 -277601 -341542 -133744 74842 155479 403978 239370 -27741
20840b7741r2893K65060J18869j52698K5528K19750j33519j15583K48397Q0825
$$ -27741 -120634 144426 263295 110597 136125 355875 222356 106773 355170 435995
20830D35995j76178N9853O4423M8664r265k92016m39817K89142J28753l2450j0040
$$ 435995 259817 319670 384093 432757 423492 131476 -308341 -19199 109554 77104 67064
20819F7064J9729M6787K0837J22134O1500l9902j47857K23203O8722j51420m1562
$$ 67064 86793 133580 154417 276551 338051 298149 150292 373495 442217 290797 249235
20808B49235J00564O4034J20958J33952j9167p1966n3549k07031l6528K2679k2174
$$ 249235 349799 413833 534791 668743 649576 577610 524061 317030 280502 303181 281007
20797B81007k37310M4215J89260j69879p6906j10617m2363J61771K39239j85093
$$ 281007 43697 87912 277172 107293 30387 -80230 -122593 39178 278417 93324
20787I3324l7119p1222r9516J16420J05233K9793J8769J43415l163j84620J46691
$$ 93324 56205 -15017 -114533 1887 107120 136913 155682 299097 295934 111314 258005
20776B58005M3550N0009J58012r4197o2270P6141N6364k590j2058j35079P994
$$ 258005 301555 351564 509576 415379 353109 429250 485614 483024 470966 335887 343881
20765C43881m990j86388r2609n6773j80892L5706K6922r6973O5372K56345K6001
$$ 343881 338891 152503 59894 3121 -177771 -142065 -115143 -212116 -146744 109601 135602
20754A35602j03947P5674J5056k10824J13510J58112o1727o6977Q8762J20456
$$ 135602 31655 107329 122385 -88439 25071 183183 121456 54479 143241 263697
20744B63697k94348q5139J7893J82648o5243K1728j9152Q3600L6247j25061J15845
$$ 263697 -30651 -115790 -97897 84751 19508 41236 22084 105684 141931 16870 132715
20733A32715j80189J991P9851J89001j35924J77221L67477P739j19090R8679R0023
$$ 132715 -47474 -45483 34368 223369 87445 264666 632143 639882 520792 619471 709494
20722G09494j64242j08589R6426q1605N1701J68551j2965m2774k1433j32949J61059
$$ 709494 545252 436663 533089 451484 503185 671736 658771 615997 594564 461615 622674
20711F22674N6185R5052k12461j09637P1267k61263j59308P8788J08281J12993
$$ 622674 678859 773911 561450 451813 523080 261817 102509 181297 289578 402571
20701D02571L4727q162J20288J55815n9033k3961q154K27507K055r9027k25714
$$ 402571 437298 429136 549424 705239 646206 622245 614091 841598 843653 744626 518912
20690E18912j49924J09512J98858m0132p0081j26700j2974J57414j27741k87831
$$ 518912 368988 478500 677358 637226 567145 440445 427471 584885 457144 169313
20680A69313k4728J59453l5732J9752j422L27420K33056K49909M1111j90707k14862
$$ 169313 144585 304038 268306 288058 286636 614056 847112 1097021 1138132 947425 732563
20669G32563P842J07754J92340j72206p6320M6898K5756k01536J09937J15627
$$ 732563 740405 848159 1040499 868293 791973 838871 864627 663091 773028 888655
20659H88655o6156m1267j33646M5254K87946O5340k660M7109J93440j1898K3022
$$ 888655 822499 781232 647586 692840 980786 1046126 1043466 1090575 1284015 1272117 1295139
20648A295139l821o01L076k35852q9086L02564J3129p6347j36715p2180K58665
$$ 1295139 1291318 1290717 1293793 1057941 968855 1271419 1284548 1208201 1071486 999306 1257971
20637A257971L04541J33105k52876j81918K34436j53936j02859K09019Q4170j51928
$$ 1257971 1562512 1695617 1442741 1260823 1495259 1341323 1238464 1447483 1531653 1379725
20627A379725J20907K10947j32005K4196j44301P2200p9753J63071J58342J88551
$$ 1379725 1500632 1711579 1579574 1603770 1459469 1531669 1451916 1614987 1773329 1961880
20617A961880L28978L3705N197l25477o0560j63044j17974M44917J21640q5010
$$ 1961880 2290858 2324563 2329760 2004283 1943723 1780679 1662705 2107622 2229262 2144252
20607B144252K11623K5671k7389j50860J39722p4579L93569J13559j9223m0638
$$ 2144252 2355875 2381546 2354157 2203297 2343019 2268440 2662009 2775568 2756345 2715707
20597B715707O1641K31386J10901K07025J72353P3734k389K93792Q9716R4127
$$ 2715707 2777348 3008734 3119635 3326660 3499013 3572747 3570358 3864150 3953866 4047993
20587D047993L52872J99505k7092L43434M41595M00895L02002M07996L38044M68072
$$ 4047993 4400865 4600370 4573278 4916712 5358307 5759202 6061204 6469200 6807244 7275316
20577G275316M64905N69342M96818M41291M47671N60635O31245P49349P62000
$$ 7275316 7740221 8309563 8806381 9247672 9695343 10255978 10887223 11636572 12398572
20568A2398572N85968O70801O95950O18956J021915J209412J323127J413629J830159
$$ 12398572 12984540 13655341 14351291 14970247 15992162 17201574 18524701 19938330 21768489
20559B1768489K778447L564825M450178O681944R001073R714636P541880K806041
$$ 21768489 24546936 28111761 32561939 39243883 48244956 57959592 65501472 68307513
20551F8307513n61806P8959K686726L132767L833m553931p134675n981146l225755
$$ 68307513 67745707 67824666 70511392 73644159 73647992 69094061 61959386 55978240 52752485
20542E2752485m66040K670599N700426P799015O862612K021783j989915k263199
$$ 52752485 52286445 54957044 60657470 68456485 75319097 77340880 75350965 73087766
20534G3087766O2244J791884l63837n355960q800290q676378o767599n273526
$$ 73087766 73150010 74941894 74578057 69222097 60421807 51745429 44977830 39704304
20526C9704304l666703k695789k155689j750801j174684j144038j248159r04775
$$ 39704304 36037601 33341812 31186123 29435322 28260638 27116600 25868441 24963666
20518B4963666q44458n99393p63823m40411o25871r22540q66241m17584n89466
$$ 24963666 24119208 23519815 22755992 22315581 21689710 20767170 19900929 19483345 18893879
20509A8893879p09103m47229m04680l55518j66294m80758n72206m03320m64725
$$ 18893879 18184776 17737547 17332867 16977349 16811055 16330297 15758091 15354771 14890046
20500A4890046o79646p71631m64075n20279p53175p61287p88044l75706n72915
$$ 14890046 14210400 13438769 12974694 12454415 11701240 10939953 10151909 9776203 9203288
20491I203288o20292m96213o27899k55842m04601l94111l12939l63749m70207
$$ 9203288 8582996 8086783 7458884 7203042 6798441 6404330 6091391 5727642 5257435
20482E257435j65821k98176j06868j4699k69385k89104j87631k68339l30558k3469
$$ 5257435 5091614 4793438 4686570 4671871 4402486 4113382 3925751 3657412 3326854 3303385
20472C303385k13860j60031j53082j53944J5226k665k16447n08341k48100l8136
$$ 3303385 3089525 2929494 2776412 2622468 2637694 2635029 2418582 1910241 1662141 1624005
20462A624005l6202N4490J18690j61099q4361k13821M3810J6274k87334m6934
$$ 1624005 1587803 1642293 1760983 1599884 1515523 1301702 1345512 1361786 1074452 1027518
20452A027518n6968p2306r7753j06941J03241n8763k95384K7294L40658j72241
$$ 1027518 970550 898244 800491 693550 796791 738028 442644 469938 810596 638355
20442F38355l4915P0974N4035r3930j08911P804j40677k23041j37541J14286J05528
$$ 638355 603440 674414 728449 634519 525608 533412 392735 169694 32153 146439 251967
20431B51967K05225K2893k31432N8393N5441k644M559J0257l1822j6991k28014
$$ 251967 457192 480085 248653 307046 362487 359843 364402 374659 342837 325846 97832
20420I7832j93421o3133J73294k9502k35031J37405J52452K4001O4668J75150
$$ 97832 -95589 -158722 14572 -14930 -249961 -112556 39896 63897 128565 303715
20410C03715K00973J24812o6457k8928j67815k30342j0231J1238k97358j69108
$$ 303715 504688 629500 563043 534115 366300 135958 125727 136965 -160393 -329501
20400c29501J06088K5022k0857J99402K48274m401K9303K40175K9229l30632O0996
$$ -329501 -223413 -198391 -219248 -19846 228428 224027 253330 493505 522734 192102 253098
20389B53098K6206L4999q6484J26801J17135n7542m3546j27037j8098M8431L1269
$$ 253098 279304 314303 227819 354620 471755 414213 370667 243630 225532 273963 305232
20378C05232P5111O7145L59905K18906j11979l19028k4275R299q0605l0956K51734
$$ 305232 380343 447488 807393 1026299 914320 595292 571017 580316 499711 468755 720489
20367G20489p6511m9701J57372j50290q7000J16104J77508K8472o1910m7259j75497
$$ 720489 643978 594277 751649 601359 514359 630463 807971 836443 774533 727274 551777
20356E51777j71728Q3046J76523L0063j27763j40166K3565k2759K36725m041o0392
$$ 551777 380049 463095 639618 669681 541918 401752 425317 402558 639283 635242 574850
20345E74850J10133J86518J48613j38496l68095M1322J79210m8121o9015Q6578
$$ 574850 684983 871501 1020114 881618 513523 554845 734055 685934 616919 703497
20335G03497r4099l85343J07442Q9531o2297J46074O9481J49221p5859n7469n0906
$$ 703497 609398 224055 331497 421028 358731 504805 574286 723507 647648 590179 539273
20324E39273o24Q5729r5851l0739m0071l2319k06313J9583K26170J47031J02987
$$ 539273 538649 624378 528527 497788 457717 425398 219085 238668 464838 611869 714856
20313G14856o3915j00141K03739J2962r4888j05448q410Q1736m5274m6163j22240
$$ 714856 650941 550800 754539 767501 672613 567165 558755 640491 595217 549054 426814
20302D26814L4933p7657k568j18224k24214j60989K52300L81352K14774j97312
$$ 426814 461747 384090 381522 263298 39084 -121905 130395 511747 726521 529209
20292E29209k77843J32442J34271r4679P9511k0731q2481O5947P5502j08422j88321
$$ 529209 251366 383808 518079 423400 502911 482180 399699 465646 541148 432726 244405
20281B44405j29048J0020j54047J4081R5121l558L7389L957k01724j56588K32179
$$ 244405 115357 125377 -28670 -14589 80532 76974 114363 118320 -83404 -239992 -7813
20270g813M29911R5575k78308k32387R3985R0818n6292j07698J66836Q5591m8111
$$ -7813 422098 517673 239365 6978 100963 191781 135489 27791 194627 280218 232107
20259B32107J16307K7926l9414l3002J16839J12347p8061j32509J3859K2305J8495
$$ 232107 348414 376340 336926 303924 420763 533110 455049 322540 336399 358704 377199
20248C77199r6324k45557j3413J27070o9362J67992P3314j19140j72455k01418
$$ 377199 280875 35318 21905 148975 79613 247605 320919 201779 29324 -172094
20238a72094P8752K67129J30401J13427L8764j42737J68647L8593l35499j86002
$$ -172094 -93342 173787 304188 417615 456379 313642 482289 520882 185383 -619
20228f19Q2296K17878R3038j65277Q3329J61649K09194J38078n6617k32221j9200
$$ -619 81677 299555 392593 227316 310645 472294 681488 819566 762949 530728 511528
20217E11528j99947O9751P2945q3824r400j07552Q6554Q3346l6777l6204p726
$$ 511528 311581 381332 454277 370453 361053 253501 340055 423401 386624 350420 342694
20206C42694r7240K6837K44624o2713j78907J32983J21476j43513j59751n153
$$ 342694 245454 272291 516915 454202 275295 408278 529754 386241 226490 221337
20196B21337R2645K01P8183O8574m2027M6099Q4876n9565P1892j38058K3799K4903
$$ 221337 313982 314183 392366 460940 418913 465012 549888 490323 562215 424157 447956 472859
20184D72859p4077j19576Q2159j19860J57696M09243L43401k13187k21009P3069
$$ 472859 398782 279206 361365 241505 399201 808444 1151845 938658 717649 790718
20174G90718M1719O2579K34742M5748j7954l6388n7706p6273K0616j54363K176
$$ 790718 832437 895016 1129758 1175506 1157552 1121164 1063458 987185 1007801 853438 855614
20163H55614J86521R8255O8329J4769N7273N2274J23881J57195J02689o1820Q4387
$$ 855614 1042135 1140390 1208719 1223488 1280761 1333035 1456916 1614111 1716800 1654980 1739367
20152A739367P0678j7411r1725K16030J39775N8559l5159K41956m6563L7518K30245
$$ 1739367 1810045 1792634 1700909 1916939 2056714 2115273 2080114 2322070 2275507 2313025 2543270
20141B543270J21445j27260Q6000O8418J87697R9872J31733J19222L12137J79682
$$ 2543270 2664715 2537455 2623455 2691873 2879570 2979442 3111175 3230397 3542534 3722216
20131C722216J34731K53740L36340L26008L76130N05483K95018J54202K98626
$$ 3722216 3856947 4110687 4447027 4773035 5149165 5654648 5949666 6103868 6402494
20122F402494N57288M57551L81660J63585J60428O42777N65533L26577M18708
$$ 6402494 6959782 7417333 7798993 7962578 8123006 8765783 9331316 9657893 10076601
20113A0076601M67743N13400O49730Q09146J188491J267166J559024K570782L375581
$$ 10076601 10544344 11057744 11707474 12516620 13705111 14972277 16531301 19102083 22477664
20104B2477664M259374N871608P778086P671032M613497p69274m649216n050890
$$ 22477664 26737038 32608646 40386732 48057764 52671261 51901987 47252771 42201881
20096D2201881l284024j157044J129316L206580N358911O946259N079566l64640
$$ 42201881 38917857 37760813 38890129 42096709 47455620 54401879 59481445 59116805
20088E9116805n672490p423535o142637m676940l307115k175540j449458j013146
$$ 59116805 53444315 46020780 39878143 35201203 31894088 29718548 28269090 27255944
20080B7255944n18555q1436M22728P92185J290899K221375L532470M990254O964290
$$ 27255944 26737389 26655953 27078681 27870866 29161765 31383140 34915610 39905864 46870154
20071D6870154Q527992O218847O59450m149611n933252m852303k600002o10137
$$ 46870154 55398146 61616993 62276443 58126832 52193580 47341277 44741275 44131138
20063D4131138J579136L989444O375021N901977J731818m402394p711544p721383
$$ 44131138 45710274 49699718 56074739 61976716 63708534 59306140 51594596 43873213
20055D3873213o272734m603645l423537k702966k296510j766912j470934j221798
$$ 43873213 37600479 32996834 29573297 26870331 24573821 22806909 21335975 20114177
20047B0114177j137289j022632q15385n46868m69741j95706k49558k23677l54209
$$ 20114177 18976888 17954256 17138871 16592003 16122262 15926556 15676998 15453321 15099112
20038A5099112l58736m37177l98352m51525o96491m78506j92898k04304j49270
$$ 15099112 14740376 14303199 13904847 13453322 12756831 12278325 12085427 11881123 11731853
20029A1731853k05702n70522m75821o78203n83655k49463l92994l92157l81410
$$ 11731853 11526151 10955629 10479808 9801605 9217950 8968487 8575493 8183336 7801926
20020G801926m49446l72198n17740o61909k86502l37228k22848j47202j810k86814
$$ 7801926 7352480 6980282 6462542 5800633 5514131 5176903 4954055 4806853 4805043 4518229
20010D518229m88497k25482j93534k47945k3055j37862j65919j19384L3056j67863
$$ 4518229 4029732 3804250 3610716 3362771 3339716 3201854 3035935 2916551 2949607 2781744
20000B781744m10485l3193J93l52388j41629q228j84300j44662R4863J39876j59428
$$ 2781744 2371259 2338066 2338259 1985871 1844242 1836014 1651714 1507052 1601915 1741791 1582363
19989A582363k2682L65297N6389k97786j22265q8454j18709j51665J36739L8617
$$ 1582363 1559681 1924978 1981367 1683581 1561316 1472862 1354153 1202488 1339227 1377844
19979A377844J7013l3256j32214j62410j26357l2707O4071j49527P0031K9405
$$ 1377844 1394857 1361601 1229387 1066977 940620 907913 971984 822457 892488 921893
19969I21893n2449q9873j6051k44466m0557Q2245k73506j38484j38235k143K75264
$$ 921893 869444 779571 763520 519054 478497 560742 287236 148752 10517 8374 283638
19958B83638L33321m6716r9947q6689k62821q5507K14946q5596N0354N6588m8524
$$ 283638 616959 570243 470296 383607 120786 35279 250225 164629 214983 271571 223047
19947B23047K9763j78761j53264n3525m3302P6774q915l18r7959j38118J843K8068
$$ 223047 252810 74049 -79215 -132740 -176042 -99268 -108183 -108501 -206460 -344578 -342735 -314667
19935c14667J36045Q6535J4879M195K9702J15092K64965j7477k9815j54501L2104
$$ -314667 -178622 -92087 -77208 -73013 -43311 71781 336746 319269 289454 134953 167057
19924A67057J4853N3954j44513L5642J09237J31375J05759o2987k34780p6355
$$ 167057 181910 235864 91351 126993 236230 367605 473364 410377 175597 99242
19914I9242j52351Q4590J85842j6969Q022j44775q8529j19374J87156K65215m3712
$$ 99242 -53109 31481 217323 200354 208376 63601 -24928 -144302 42854 308069 264357
19903B64357j17147J8892L20685K54231Q692q0827J9275p6352q0161J5788K13658
$$ 264357 147210 166102 486787 741018 749710 668883 688158 611806 531645 547433 761091
19892G61091J72073k39711l59855L9707Q3044j51791L6484J45745J6183k33545
$$ 761091 933164 693453 333598 373305 456349 304558 341042 486787 502970 269425
19882B69425l4127K21795j07454M381m4925j2168N0537J20072j20243K4946n3500
$$ 269425 235298 457093 349639 354020 309095 296927 347464 467536 347293 372239 318739
19871C18739J17380J09164K9998J43087J38705l23493k48628j22315j21195K50113
$$ 318739 436119 545283 575281 718368 857073 533580 284952 162637 41442 291555
19861B91555J20123l9477j88159J01254q5963j34189J30465R5449o9508k49263
$$ 291555 411678 372201 184042 285296 199333 65144 195609 291058 221550 -27713
19851b7713j47675J89103L25736K40545o457j81838m391J46457l6106P7262q2586
$$ -27713 -175388 13715 339451 579996 573539 391701 387310 533767 497661 574923 492337
19840D92337k13393j9837m8490j51038j34132K46319n0894k65607J81189J14920
$$ 492337 278944 259107 210617 59579 -74553 171766 120872 -144735 36454 151374
19830A51374m1278q963R3429j1050O1984q4761j17628K24081P8663k65741j58092
$$ 151374 110096 101133 194562 183512 245496 160735 43107 267188 345851 80110 -77982
19819g7982Q5315K33762K9081p3603J47696J33345L698j0472p0293l59780j07303
$$ -77982 7333 241095 270176 196573 344269 477614 481312 470840 400547 40767 -66536
19808f6536R2907q1176j29599M8327j01506j75753J21016K06162J08318J83147
$$ -66536 26371 -54805 -184404 -136077 -237583 -413336 -292320 -86158 22160 205307
19798B05307J68594r1645j46361l28621O109L88211K36945r5095j41273j77801
$$ 205307 373901 282256 135895 -192726 -186617 201594 438539 343444 202171 24370
19788B4370K0173K35154M2784j42266o0230k6493k3990O5385r5506m0551j12604
$$ 24370 44543 279697 322481 180215 119985 93492 69502 134887 39381 -1170 -113774
19777a13774q9343J87434K34803j60327j6155q4675k0226M4023J03620J97416
$$ -113774 -203117 -15683 219120 58793 42638 -42037 -62263 -18240 85380 282796
19767B82796k12693l8840k7835j01106q5800k9076q593R6243J93360j51988q2223
$$ 282796 70103 31263 3428 -97678 -183478 -212554 -221147 -124904 68456 -83532 -165755
19756a65755K12927m8940j72651j12513Q2079K35967J46158J5903M6244o7150
$$ -165755 47172 -1768 -174419 -286932 -204853 31114 177272 193175 239419 172269
19746A72269j9724j38669j68848j60144J37190J01958l12908Q382L00558J12540
$$ 172269 152545 13876 -154972 -315116 -177926 -75968 -388876 -380494 -79936 32604
19736C2604m9044J52407P4416J2554k27261j2152j1807J77263m3012j35355l3739
$$ 32604 -16440 135967 210383 222937 -4324 -16476 -28283 148980 105968 -29387 -63126
19725f3126p3151j44843J49164l048J8463r6153k20514J20693J40674l2780O1879
$$ -63126 -136277 -281120 -131956 -135004 -116541 -212694 -433208 -312515 -171841 -204621 -142742
19714a42742j26791L188K77378K7971j8019o1498r9352K23213j3328r959J58435
$$ -142742 -269533 -266345 11033 39004 20985 -40513 -139865 83348 70020 60061 218496
19703B18496J13421J8033n7003J5935j09682k03652P5896k05321K060M2914k10806
$$ 218496 331917 349950 292947 308882 199200 -4452 71444 -133877 -131817 -88903 -299709
19692b99709M6394P3472J30406K2371O5361j5636k3285Q3861p5724O1599j80369
$$ -299709 -253315 -179843 -49437 -27066 38295 22659 -626 83235 7511 69110 -111259
19681a11259k97779o1010N1126J40312J41386O1199Q9805j0070K3899j87168J28467
$$ -111259 -409038 -470048 -418922 -278610 -137224 -76025 13780 3710 27609 -159559 -31092
19670c1092J98631k87788j5147R9378L9191M8573k93853j10990K18260K7521R1113
$$ -31092 167539 -120249 -135396 -36018 3173 51746 -242107 -353097 -134837 -107316 -16203
19659a6203N7644k79481j66512J09925K19980K17283j65588j78831p3797j9786
$$ -16203 41441 -238040 -404552 -294627 -74647 142636 -22952 -201783 -275580 -295366
19649b95366K5070Q5719J66402m7376N8258Q4139J11375J72P2423j92108M4211
$$ -295366 -270296 -184577 -18175 -65551 -7293 76846 188221 188393 260816 68708 112919
19638A12919J25962j12700j60676j60336k13639J09482K12986K50719n5306k19611
$$ 112919 238881 126181 -34495 -194831 -408470 -298988 -86002 164717 109411 -110200
19628a10200j83018K29353K99067k08170j65367l390J69963J8232k01457j65461
$$ -110200 -293218 -63865 235202 27032 -138335 -141725 28238 46470 -154987 -320448
19618c20448J35867M42849K20702M520j19470k75869m8958P9518p5352n3927p6619
$$ -320448 -184581 258268 478970 483490 364020 88151 39193 118711 43359 -10568 -87187
19607h7187l4297K05704r6546k74044N8032J09385J59802O4132j50899L0522J51186
$$ -87187 -121484 84220 -12326 -286370 -228338 -118953 40849 104981 -45918 -15396 135790
19596A35790J53103q0942j25543j2146j35277j35798m8593P2200K5964j2697p4649
$$ 135790 288893 207951 82408 70262 -65015 -200813 -249406 -177206 -151242 -163939 -238588
19585b38588J3351R3078J93524J68441o6652r9985m0804K297J3416n0740q7502
$$ -238588 -225237 -132159 61365 229806 163154 63169 22365 24662 38078 -12662 -100164
19574a00164j94933j02824R9225J28371J33397R4036l7702j03203R086j45443
$$ -100164 -295097 -397921 -298696 -170325 -36928 57108 19406 -83797 -74711 -220154
19564b20154k33880j38J43050K36884m7496j93366p5548p3827R4895J52737K83058
$$ -220154 -454034 -454172 -311122 -74238 -121734 -315100 -390648 -464475 -369580 -216843 66215
19553F6215l6195J03951J46587q2290j01702l3810p6832j50492r406n1699M05208
$$ 66215 30020 133971 280558 198268 96566 62756 -14076 -164568 -173974 -225673 179535
19542A79535N27075K4055k03415j64989j56823k81930J47044j48343q9661K30141
$$ 179535 706610 730665 527250 362261 205438 -76492 70552 -77791 -167452 62689
19532F2689J68453J50301J65529K20652k43667M1368Q5900j87159j48946J12222
$$ 62689 231142 381443 546972 767624 523957 565325 651225 464066 315120 427342
19522D27342n9672J06432J92326j16521j86522M7342j24658j27789j34055j56579
$$ 427342 367670 474102 666428 549907 363385 410727 286069 158280 24225 -132354
19512a32354R0543K63622J11345l909m8232n1355J85634K59839J58689M3077k00639
$$ -132354 -41811 221811 333156 329247 281015 229660 415294 675133 833822 876899 676260
19501F76260k1945k7814O0093N4659l47618m9452j08006j22795K62422n4359j59906
$$ 676260 654315 626501 686594 741253 393635 344183 236177 113382 375804 321445 161539
19490A61539j58662j26974O3897K78250J31212L7714j10363j23384L7480p4608
$$ 161539 2877 -124097 -60200 218050 349262 386976 276613 153229 190709 116101
19480A16101q2012j48381K2861R7923Q9613j30634J43027J33240j59862l8293
$$ 116101 34089 -114292 -91431 6492 96105 -34529 108498 241738 81876 43583
19470D3583J00799J72248n4025N8041J09339j84762J3520N5722r1101R7287o7974
$$ 43583 144382 316630 262605 320646 429985 245223 258743 314465 223364 320651 252677
19459B52677k04711J632j01466M8658M23251J52737q5782k20586j44603j10522
$$ 252677 47966 49598 -51868 -3210 420041 572778 486996 266410 121807 11285
19449A1285L9204K6080j61703m8606J09059R9301J9338p0826N3660p6933p4028
$$ 11285 50489 76569 -85134 -133740 -24681 74620 93958 23132 76792 -141 -74169
19438g4169j62940j96430J39541K45686j68926o3064L003J79873L942j33700p6573
$$ -74169 -237109 -433539 -293998 -48312 -217238 -280302 -277299 -97426 -93484 -227184 -303757
19427c03757n7970K21011K43489P826k06813J01485O68k30175J80444N8329q5247
$$ -303757 -361727 -140716 102773 110599 -96214 5271 5939 -224236 -43792 14537 -70710
19416g0710k7332l1093j15649p0453K08534L40963j86478j66148j46493J32924
$$ -70710 -98042 -129135 -244784 -315237 -106703 234260 47782 -118366 -264859 -131935
19406a31935P2652j8359q8469K8798j5902p8500o6147O7090n6122K04304p0817
$$ -131935 -59283 -77642 -166111 -137313 -153215 -231715 -297862 -230772 -286894 -82590 -153407
19395a53407N5962l22986n6276J02604K34381L1308M8235J10516P5000P8569m0676
$$ -153407 -97445 -420431 -476707 -374103 -139722 -108414 -60179 50337 125337 203906 163230
19384A63230m0220m0549K1953m0623j28592j8735J950O9694J88840P8519k3710
$$ 163230 123010 82461 104414 63791 -64801 -83536 -81586 -11892 176948 255467 231757
19373B31757p3096r7104M1630J22261j44902k68794j7769J22761N4055J93957
$$ 231757 158661 61557 103187 225448 80546 -188248 -206017 -83256 -29201 164756
19363A64756N8229J8858k12676j51891N799O8738P5760j37193M3646K12451K187
$$ 164756 222985 241843 29167 -122724 -116925 -48187 27573 -109620 -65974 146477 148664
19352A48664J03443k01921m1614J3230m5994K65530j31162j2481J91333J00640
$$ 148664 252107 50186 8572 21802 -24192 241338 110176 97695 289028 389668
19342C89668l6988j82469J11781j05238l2839k01761O0658R9314r6584o8344J07594
$$ 389668 352680 170211 281992 176754 143915 -57846 2812 102126 5542 -62802 44792
19331D4792r9066M0538J2882l7910K6396k1687R8822K6954r0388j86136R5632
$$ 44792 -54274 -13736 -854 -38764 -12368 -34055 64767 91721 1333 -184803 -89171
19320h9171J63106L3227L0446K4227p8174q1422L8040R8896J47254p4815J03221
$$ -89171 73935 107162 137608 161835 83661 2239 40279 139175 286429 211614 314835
19309C14835K0522j24032k53544j77700j55299k19192K50665J17362L8210J90243
$$ 314835 335357 211325 -42219 -219919 -375218 -594410 -343745 -226383 -188173 2070
19299B070J04894j27295l15884j4459K48528P4174j7008M7671k12391J60247K28117
$$ 2070 106964 -20331 -336215 -350674 -102146 -27972 -44980 2691 -209700 -49453 178664
19288A78664o4887l86890p5775J37620n9795o3514K12745J91100J54024j24145
$$ 178664 113777 -273113 -348888 -211268 -271063 -334577 -121832 69268 223292 99147
19278I9147k5493R2853k02862L3789M981m3710l5721L4747K13790m5610n4228
$$ 99147 73654 166507 -36355 -2566 2415 -41295 -77016 -42269 171521 125911 71683
19267G1683n0595k10279O4919R1388N9183R9220n9568j16063q3952P7937j30681
$$ 71683 21088 -189191 -124272 -32884 26299 125519 65951 -50112 -134064 -56127 -186808
19256a86808j8336M1463L0543K89890K27617j0247j53524o0772L64537j22926
$$ -186808 -205144 -163681 -133138 156752 384369 374122 220598 159826 524363 401437
19246D01437j36946J60199L0284r0872J02928n6900j21584j01333j2234k83363
$$ 401437 264491 424690 454974 364102 467030 410130 288546 187213 174979 -108384
19236a08384o1972K5884J12998R654J4756o1373r3080l7665J09076P2441J55418
$$ -108384 -170356 -144472 -31474 -21820 -7064 -68437 -161517 -199182 -90106 -17665 137753
19225A37753M3547m6684p7636J02360K28152P3080j0382O3697n3406l05597M6294
$$ 137753 181300 134616 56980 159340 387492 460572 450190 513887 460481 154884 201178
19214B01178M8712k657p555O339K2308j10280j20967J09248L65470J49048J60920
$$ 201178 249890 247233 239678 246017 268325 158045 37078 146326 511796 660844 821764
19203H21764J85656k2691j84605k41177k53981p5852j21213j43517k427K8217
$$ 821764 1007420 984729 800124 558947 304966 229114 107901 -35616 -38043 -9826
19193i826J78926J61185Q8790J6517j89099q5573o8819j69835K74521J8437j44718
$$ -9826 169100 330285 419075 435592 246493 160920 92101 -77734 196787 215224 70506
19182G0506P8270J93731K09510J47288k2064n5439J30232p1791k43602N9047J45222
$$ 70506 148776 342507 552017 699305 677241 621802 752034 680243 436641 495688 640910
19171F40910n3926j8539j01669o0485P9357p755k65849j1529j10679j36121L2182
$$ 640910 586984 568445 466776 406291 485648 477893 212044 200515 89836 -46285 -14103
19160a4103o442n4727J24856K14225J10907p1000r1469R8521m3740n8055R9300
$$ -14103 -20545 -75272 49584 263809 374716 303716 212247 310768 267028 208973 308273
19149C08273K86085l99771j45184K56875J19815R9226J03945K36719j71281k50041
$$ 308273 594358 194587 49403 306278 426093 525319 629264 865983 694702 444661
19139D44661l45129j04263Q0478K44823K74131J30684r5599K5092l9227n4308
$$ 444661 99532 -4731 75747 320570 594701 725385 629786 654878 615651 561343
19129E61343L243k35206j55423m0083r7385J29171K11625l7708q0301N0453j15422
$$ 561343 564586 329380 173957 133874 36489 165660 377285 339577 259276 309729 194307
19118A94307r3324J0205J91825K43317K5949k2469j19875p6182j29966n5120K27086
$$ 194307 100983 111188 303013 546330 572279 549810 429935 353753 223787 168667 395753
19107C95753J07845q3728P8655Q405m0057k59507j2731K64016J58326K9467l2608
$$ 395753 503598 419870 498525 506930 466873 207366 194635 458651 616977 646444 613836
19096F13836n6744k03867q1820Q5060j823o0032K04856K59347n5044k57129R5250
$$ 613836 557092 353225 271405 356465 354642 294610 499466 758813 703769 446640 541890
19085E41890J36497k16722j77983R4323J67468N4982N2824J94717O2707p3277
$$ 541890 678387 461665 283682 378005 545473 600455 653279 847996 910703 837426
19075H37426l28164L03246K62899J82302j2535J54634j37151j53437n0782k58572
$$ 837426 509262 812508 1075407 1257709 1245174 1399808 1262657 1109220 1058438 799866
19065G99866J22137J00371m5768k02577J30636m4525R2090K51863K89041J57218
$$ 799866 922003 1022374 976606 774029 904665 860140 952230 1204093 1493134 1650352
19055A650352J03080j08163l02077k36771J36116L40934K66306J325r7469K04114
$$ 1650352 1753432 1645269 1343192 1106421 1242537 1583471 1849777 1851102 1753633 1957747
19045A957747m6149K297J29466R8315L1271J03772K85491J83344J02001Q6529
$$ 1957747 1911598 1913895 2043361 2141676 2172947 2276719 2562210 2745554 2847555 2934084
19035B934084k486J86925L39785K57526L85539L1234M4763K57325M55441K50462
$$ 2934084 2931598 3118523 3458308 3715834 4101373 4132607 4177370 4434695 4890136 5140598
19025E140598K16041L77754K66954K06456L64216N82858P16342O11566N86445
$$ 5140598 5356639 5734393 6001347 6207803 6572019 7154877 7871219 8482785 9069230
19016I069230P54616J149895J394780J840544L170099M933981O180024M132671
$$ 9069230 9823846 10973741 12368521 14209065 17379164 22313145 28493169 32625840
19008C2625840j351868m457390l609317j652102m23699Q20584J947768L865497
$$ 32625840 31273972 26816582 23207265 21555163 21131464 21952048 23899816 27765313
19000B7765313N732969N626026J717158j846771r40596J938918J861805k084047
$$ 27765313 33498282 39124308 40841466 38994695 38054099 39993017 41854822 39770775
18992C9770775n473360n031262k996406j448978j29936J285877K375334L891646
$$ 39770775 34297415 29266153 26269747 24820769 24690833 25976710 28352044 32243690
18984C2243690M702853R05504l830727m840119l831178k539851j438458j187279
$$ 32243690 36946543 37852047 34021320 29181201 25350023 22810172 21371714 20184435
18976B0184435r32933l02246o20692j39679N4757k6091P4845R9542J62228N86471
$$ 20184435 19251502 18949256 18328564 18188885 18243642 18217551 18292396 18391938 18554166 19140637
18966A9140637Q74678Q75697J031022J851975L157130M853763O545378N115188
$$ 19140637 20015315 20891012 21922034 23774009 26931139 31784902 38330280 43445468
18958D3445468l43668m870874m577698k754430j373614j29760J612044L573526
$$ 43445468 43101800 38230926 33653228 30898798 29525184 29395424 31007468 34580994
18950C4580994N814800O024604K487547j810302j560501J301457K465178j191782
$$ 34580994 40395794 46420398 48907945 47097643 45537142 46838599 49303777 48111995
18942D8111995n862974o226999m392749k573945j289456L69278K159326M224620
$$ 48111995 42249021 36022022 31629273 29055328 27765872 28135150 30294476 34519096
18934C4519096N064251K263566l567489o226841n105612l273892k636827j875304
$$ 34519096 39583347 41846913 38279424 32052583 26946971 23673079 21036252 19160948
18926A9160948j229886p84955j136314q62296p57026o05159l62596k73262l04848
$$ 19160948 17931062 17146107 16009793 15147497 14390471 13785312 13422716 13149454 12844606
18917A2844606j59973l95257o01021l40972l90113m09798k08064l29863o29401
$$ 12844606 12684633 12289376 11688355 11347383 10957270 10547472 10339408 10009545 9380144
18908I380144p21438j81304k49454j47998l42399k59128k70317o5289k67470m33977
$$ 9380144 8658706 8477402 8227948 8079950 7737551 7478423 7208106 7142817 6875347 6441370
18898F441370l00905k24819j68567m41392k73239k76170k09509j27979j69855
$$ 6441370 6140465 5915646 5747079 5305687 5032448 4756278 4546769 4418790 4248935
18889D248935n14234l49692k51155k51388k1116j33507n7077j03959m775l9431
$$ 4248935 3734701 3385009 3133854 2882466 2861350 2727843 2670766 2566807 2562032 2522601
18879B522601k11172j67202n5294K2537n2306l0181k22683K2775J7321j66752
$$ 2522601 2311429 2144227 2088933 2111470 2059164 2028983 1806300 1829075 1846396 1679644
18869A679644j33050j73323J85210p5554P5531K36182O7904k50595j99033o6626
$$ 1679644 1546594 1373271 1558481 1482927 1558458 1794640 1862544 1611949 1412916 1346290
18859A346290j80066k18528k9736R2022J08041m7513k25476j22012m910L29653
$$ 1346290 1166224 947696 917960 1009982 1118023 1070510 845034 723022 718112 1047765
18849A047765Q972m1854j64980M9474K24497n7924r4113j23469j9214q3135j73290
$$ 1047765 1056737 1014883 849903 899377 1123874 1065950 971837 848368 829154 746019 572729
18838E72729m1588M8280j06059l4668j68758p7119N2547k7046L51066K06411l73613
$$ 572729 531141 579421 473362 438694 269936 192817 245364 218318 569384 775795 402182
18827D02182m7122J43148J43674j0879o1436j87080p400q8251k25049K30911K36197
$$ 402182 355060 498208 641882 631003 569567 382487 375087 286836 61787 292698 528895
18816E28895M2685R2267K48229K9827j26952m7103L02940O7905M9351J16999k01157
$$ 528895 571580 663847 912076 941903 814951 767848 1070788 1138693 1188044 1305043 1103886
18805A103886l98M1444l748k0782k29075j01407l2576l1271J64580j33994j01644
$$ 1103886 1103488 1144932 1141184 1120402 891327 789920 757344 726073 890653 756659 655015
18794F55015j14721j73053m5752K38449J19645Q4340O6076J26256N89m6j64122
$$ 655015 540294 367241 321489 559938 679583 763923 829999 956255 956844 956798 792676
18783G92676j79361p8505l517P1011r5978m7439j69083k6622K60987J50336M3462
$$ 792676 613315 534810 531293 602304 506326 458887 289804 263182 524169 674505 717967
18772G17967q6728J06855K2698M04278K75139L01328J1994q8664k17648m48271
$$ 717967 631239 738094 760792 1165070 1440209 1741537 1753531 1664867 1447219 998948
18762I98948l25792n4170L307M4104j56639j32839k00001k8198R9546p5652j57896
$$ 998948 673156 618986 622293 666397 509758 376919 176918 148720 248266 172614 14718
18751A4718J44580N719J2168M7327j93684M9817j8410l7357R2461J29208L12986
$$ 14718 159298 165017 177185 224512 30828 80645 62235 24878 117339 246547 559533
18740E59533J8366j59866P4461l1496J1701p3919K6137K31424J49144M6741l0089
$$ 559533 577899 418033 492494 460998 472699 398780 424917 656341 805485 852226 822137
18729H22137l84006o7033q2114K3169P9140N8867k34899o3315m190j29841L6118
$$ 822137 438131 371098 288984 312153 391293 450160 215261 151946 147756 17915 54033
18718E4033K85226P2592j77688R6721j02017L6427K8836K5946r4639n9486J64071
$$ 54033 339259 411851 234163 330884 228867 265294 294130 320076 225437 165951 330022
18707C30022K42079J95976J21522J53922P4030k89280n7781r4835q6386N9769
$$ 330022 572101 768077 889599 1043521 1117551 828271 770490 675655 589269 649038
18697F49038j83683k72191j83908K33710M3093j6143N7586K6912k05533o962M6294
$$ 649038 465355 193164 9256 242966 286059 269916 327502 354414 148881 141919 188213
18686A88213K53591k82182j55781J56654r9981p1845J34161J19553l8094o8326
$$ 188213 441804 159622 3841 160495 60514 -11331 122830 242383 204289 135963
18676A35963o510M0205m8502K40149L58757k75875l56512r8520J22419J54543
$$ 135963 129453 169658 121156 361305 720062 444187 87675 -10845 111574 266117
18666B66117O8263n3461j71852O0558p621n7688k3748l0270K59020k4694j187
$$ 266117 334380 280919 109067 169625 162004 104316 80568 50298 309318 284624 283437
18655B83437n5201J01214j20794l68614k18459K03833K47666J65853J23870j5575
$$ 283437 228236 329450 208656 -159958 -378417 -174584 73082 238935 362805 347230
18645C47230k6816J16486J20854K3636j43962r3502k38018J50391O9577l55828
$$ 347230 320414 436900 557754 581390 437428 343926 105908 256299 325876 -29952
18635b9952j43406l9609K20628K00186q6716k03094J4710K57671M30212N7606
$$ -29952 -173358 -212967 7661 207847 121131 -81963 -67253 190418 620630 678236
18625F78236n8494l21832j63069k3763J99100O377j06714J22743J40714J2478
$$ 678236 619742 297910 134841 111078 310178 316555 209841 332584 473298 485776
18615D85776k18866Q1017J68563Q7049j50249j30243J0020R1552N5983J66898
$$ 485776 266910 347927 516490 603539 453290 323047 333067 424619 480602 647500
18605F47500j4424k47427j37617j05322J16302K66901j61137j16481J25342j45902
$$ 647500 633076 385649 248032 142710 259012 525913 364776 248295 373637 227735
18595B27735J68575j17042j16292j71583k25568Q010K354J54461K7255j9561o7135
$$ 227735 396310 279268 162976 -8607 -234175 -226165 -223811 -69350 -42095 -61656 -128791
18584a28791K65548K77735N1277j90167k03507J87025N6953L3292O1329J9143
$$ -128791 136757 414492 465769 275602 72095 259120 316073 349365 410694 429837
18574D29837k579O1064J04681J18466O4797j65202j03966N2855Q6250P2025j88992
$$ 429837 427258 488322 593003 711469 776266 611064 507098 559953 646203 718228 529236
18563E29236j63095q3476j43551J968J20404J10454J1976R2742O5827l04565p3354
$$ 529236 366141 282665 139114 141082 261486 371940 383916 476658 542485 237920 164566
18552A64566J93880j09926l8709r31J77787m1570n7068J13696L1722p6150r6496
$$ 164566 358446 248520 209811 208880 386667 345097 288029 401725 433447 357297 260801
18541B60801L1279J31610n6555j54483n4743k04909j10568J49713K92287M1094
$$ 260801 292080 423690 367135 212652 157909 -47000 -157568 -7855 284432 325526
18531C25526p2738O3086k00809j00173L19143L73160o6982j25439J1069K6384
$$ 325526 252788 315874 115065 14892 334035 707195 640213 514774 525843 552227
18521E52227l7961l03229l89714k3407L77155J60249K01421j87446k2616l482
$$ 552227 514266 211037 -178677 -202084 175071 335320 536741 349295 326679 323197
18511C23197O4943K23580J36830p5054r1741j19258J19838j29470Q6342K5912
$$ 323197 388140 611720 748550 673496 581755 462497 582335 452865 539207 565119
18501E65119r9118J01176K88399P6909J03868M1673j05515m6388l4597N203K1005
$$ 565119 466001 567177 855576 932485 1036353 1078026 972511 926123 891526 896729 917734
18490I17734j23742K0503m475k1399K9139K20991j27700k13180j15325L0535R7781
$$ 917734 793992 814495 810020 788621 817760 1038751 911051 697871 582546 613081 710862
18479G10862j30021K19339J53534Q5047j16320J10336K26048n7981k07419J41406
$$ 710862 580841 800180 953714 1038761 922441 1032777 1258825 1200844 993425 1134831
18469A134831n2157o2730j21538L8145M3961J35064J42474J969n7440J72971L13085
$$ 1134831 1082674 1019944 898406 936551 980512 1115576 1258050 1260019 1202579 1375550 1688635
18458A688635J67554J27613k70545k35815J34232J19038R6128K27350K15960J44572
$$ 1688635 1856189 1983802 1713257 1477442 1611674 1730712 1826840 2054190 2270150 2414722
18448B414722j63381j15716j14586k3776K6625j24173J02143K04389J32411j0458
$$ 2414722 2251341 2135625 2021039 1997263 2023888 1899715 2001858 2206247 2338658 2328200
18438B328200o9705j07349j22304K27294K41219p5859n4523p2431J88112K36187
$$ 2328200 2258495 2151146 2028842 2256136 2497355 2421496 2366973 2294542 2482654 2718841
18428B718841K41412N9501j40539J6671R1792k56428j23225J12576M17468K82371
$$ 2718841 2960253 3019754 2879215 2895886 2987678 2731250 2608025 2720601 3138069 3420440
18418C420440q9556n8582r0171J90475K44723J70195L05108J77568k6896J06143
$$ 3420440 3330884 3272302 3182131 3372606 3617329 3787524 4092632 4270200 4243304 4349447
18408D349447J11526J47524L04944J79694J99627L53630N05809N00929N62264
$$ 4349447 4460973 4608497 4913441 5093135 5292762 5646392 6152201 6653130 7215394
18399G215394N41979O17969L03761K95626R30911P20083P64491P32194M11802
$$ 7215394 7757373 8375342 8679103 8974729 9905640 10625723 11390214 12122408 12534210
18390A2534210P80408J264060J473770K151041K664536L089769K628323O83819
$$ 12534210 13314618 14578678 16052448 18203489 20868025 23957794 26586117 27269936
18382B7269936j212346j210765j066767k70362K14972Q58453J452108J883797
$$ 27269936 26057590 24846825 23780058 23509696 23724668 24583121 26035229 27919026
18374B7919026K842633M204694N941991R011772J4137551K1594747K7797235K1631905
$$ 27919026 30761659 34966353 40908344 49920116 64057667 85652414 113449649 135081554
18366A35081554J889730j1625921j3565824j3920466j4867949j2932762r065751
$$ 135081554 136971284 125345363 111779539 97859073 82991124 70058362 60992611
18359F0992611n471754k655997j09324K109186M660743N373688J457387m792980
$$ 60992611 55520857 52864860 52755536 54864722 59525465 64899153 66356540 61563560
18351F1563560p370177o391898m602822l015860k304179j598249p48510m48231
$$ 61563560 54193383 47801485 43198663 40182803 37878624 36280375 35531865 35083634
18343C5083634j63508J85771L38991M29904K12711L12310L51567M01949P46851
$$ 35083634 34920126 35105897 35444888 35874792 36087503 36399813 36751380 37153329 37900180
18334C7900180J316484J456879J375068J657821K544405L595442N197744O925898
$$ 37900180 39216664 40673543 42048611 43706432 46250837 49846279 55044023 61969921
18326F1969921O567094J725896l848112n463473l784267j511974P03795L246087
$$ 61969921 68537015 70262911 66414799 60951326 57167059 55655085 56358880 59604967
18318E9604967P138370J1597852J5878862J8424010J8683746J8827949J2519403
$$ 59604967 66743337 78341189 94220051 112644061 131327807 150155756 162675159
18311A62675159p464666k6649807k7721480j9554935j3242807r273582o312537
$$ 162675159 155210493 128560686 100839206 81284271 68041464 58767882 52455345
18304E2455345m492881l271717k475017j818997j546979p02664J45195J019074
$$ 52455345 47962464 44690747 42215730 40396733 38849754 38147090 38292285 39311359
18296C9311359J536220P62747j498293l267577l138284k166156j663146j487840
$$ 39311359 40847579 41610326 40112033 36844456 33706172 31540016 29876870 28389030
18288B8389030o65468q37422p71699n58218o74303l35780r7868l35168k79067
$$ 28389030 27723562 26886140 26114441 25556223 24881920 24546140 24448272 24113104 23834037
18279B3834037n41517p47397j039540j488461j113750j027402p60808p37819p62394
$$ 23834037 23292520 22545123 21505583 20017122 18903372 17875970 17115162 16377343 15614949
18270A5614949n35934o32583p49975p82084o53102o54170n58259m47723j47652
$$ 15614949 15079015 14446432 13696457 12914373 12261271 11607101 11048842 10601119 10453467
18261A0453467k94219l1890k28157k46292l85034l42660m44281n75807q7391Q9490
$$ 10453467 10159248 10127358 9899201 9652909 9267875 8925215 8480934 7905127 7817736 7907226
18251G907226j89567r7784j17768J02282L80590J29484N9891M3875O6549J61022
$$ 7907226 7717659 7619875 7502107 7604389 7984979 8114463 8174354 8218229 8284778 8445800
18241H445800J88826J40353L9705n6093K15445J89471L07633L11599K88056M55989
$$ 8445800 8634626 8774979 8814684 8758591 8974036 9163507 9471140 9782739 10070795 10526784
18231A0526784R54234J463546J706024K641391M029616O163393P552544M617096
$$ 10526784 11481018 12944564 14650588 17291979 21321595 27484988 35037532 39654628
18223C9654628p32489k656618m06882K780299L434601o47916n535164o230616
$$ 39654628 38922139 36265521 35858639 38638938 42073539 41425623 35890459 29659843
18215B9659843m798588k966930j856474j329415p79018p78772o33923k94663j99815
$$ 29659843 24861255 21894325 20037851 18708436 17929418 17150646 16516723 16222060 16022245
18206A6022245j67868R6156K29481O9389L32264Q40557J420066J696397K382496
$$ 16022245 15854377 15950533 16180014 16249403 16581667 17422224 18842290 20538687 22921183
18197B2921183L311121N001718P194550O322434J331551k227232j179265J571395
$$ 22921183 26232304 31234022 38428572 44751006 46082557 43855325 42676060 44247455
18189D4247455L430464J006714m073491o485263n241724l429888k150074j333335
$$ 44247455 47677919 48684633 44611142 38125879 32884155 29454267 27304193 25970858
18181B5970858r40733j65462O92703J251851K461908M322563N899412N062287
$$ 25970858 25030125 24864663 25557366 26809217 29271125 33593688 39493100 44555387
18173D4555387J69871k850666j301570J723523L121892J46117m497359n845142
$$ 44555387 44725258 41874592 40573022 42296545 45418437 45564554 41067195 35222053
18165C5222053m499000k954688j776476j364967j031876p74354n32435m59089
$$ 35222053 30723053 27768365 25991889 24626922 23595046 22820692 22288257 21829168
18157B1829168m91513k60565k49198m7628j58103K8331J78914M87991J004729
$$ 21829168 21337655 21077090 20827892 20780264 20622161 20650492 20829406 21317397 22322126
18148B2322126J730097K415259L910850N960861O332806K853438j697824j738442
$$ 22322126 24052223 26467482 30378332 36339193 42671999 45525437 43827613 42089171
18140D2089171Q37397L348854K589039k225873n342492m604773l107301j822900
$$ 42089171 42926568 46275422 48864461 46638588 41296096 36691323 33584022 31761122
18132C1761122j190602q02512k60258m4498M69916M87322N86038N30697j56724
$$ 31761122 30570520 29768008 29507750 29463252 29933168 30420490 31006528 31537225 31380501
18123C1380501l66308m02576j45566O82196J489334K196954L163179M379217O346342
$$ 31380501 31014193 30611617 30466051 31148247 32637581 34834535 37997714 42376931 48723273
18114D8723273Q983770J3054496K1299216L6953294O0911977P2872804K3703511
$$ 48723273 57707043 70761539 92060755 129014049 189926026 262798830 286502341
18107B86502341n4140077o6378911m3255177k6135127j6967900j1569446q347704
$$ 286502341 232362264 165983353 122728176 96593049 79625149 68055703 59707999
18100E9707999o563576n068818m100467l254021k367895k014407j746418j483662
$$ 59707999 53144423 48075605 43975138 40721117 38353222 36338815 34592397 33108735
18092C3108735j476564j110559o84261j002358j035335p84937o97192n10413j80224
$$ 33108735 31632171 30521612 29837351 28834993 27799658 27014721 26317529 25807116 25626892
18083B5626892l26246k21621j41391L2473N15856O33969M63431k84548o25596
$$ 25626892 25300646 25079025 24937634 24970107 25485963 26119932 26583363 26298815 25673219
18074B5673219j186024j352474j369846j495776j277322j084750q95472j165863
$$ 25673219 24487195 23134721 21764875 20269099 18991777 17907027 17011555 15845692
18066A5845692j154263q84674l26885p68457p59976j128345p73012m68122o22982
$$ 15845692 14691429 13806755 13479870 12711413 11951437 10823092 10050080 9581958 8958976
18057H958976m72021k75006k68648l87135p62018o13701k10766j77538m83183
$$ 8958976 8486955 8211949 7943301 7556166 6794148 6180447 5969681 5792143 5308960
18048E308960p6752j82099j31663k27497k63920n80383j43936K1047q7900j63736
$$ 5308960 5232208 5050109 4918446 4690949 4427029 3846646 3702710 3723757 3635857 3472121
18038C472121l32929k61928l64822j26299N2708p0984k69165J2829M0488k5112
$$ 3472121 3139192 2877264 2512442 2386143 2438851 2367867 2098702 2111531 2152019 2126907
18028B126907j56345j03795j07821n2316m076J571P154k58865r1892q0405k87823
$$ 2126907 1970562 1866767 1758946 1706630 1702554 1704125 1711279 1452414 1360522 1280117 992294
18017I92294j76567j87148m8143J25544R0119p7924p5169J20327j46208K2802
$$ 992294 815727 628579 580436 705980 796099 718175 643006 763333 617125 639927
18007F39927n8370M6285o2460R6347J13031j12686J479j94202j41395m4650K13282
$$ 639927 581557 627842 565382 661729 774760 662074 663553 469351 327956 283306 496588
17996D96588M16204k1118n5334j95798l10899M6113J19260o4879k78885K1314
$$ 496588 912792 891674 836340 640542 329643 375756 495016 430137 151252 172566
17986A72566K35730j51929K27374L49167J26066l96681k83291J68226j73477j79172
$$ 172566 408296 256367 483741 832908 958974 562293 279002 447228 273751 94579
17976I4579j53790K06500k7921m3794K45220J55245O3621j25711n0492l653j36244
$$ 94579 -59211 147289 119368 75574 320794 476039 539660 413949 363457 359804 223560
17965B23560K59052J44217j24960M4047l75362j64489J63077K53388O1786k39160
$$ 223560 482612 626829 501869 545916 170554 6065 169142 422530 484316 245156
17955B45156J29835K39035r6987j61135J5505r094J38749J33412j85117l20906
$$ 245156 374991 614026 517039 355904 371409 362315 501064 634476 449359 128453
17945A28453p6756J28327j491J10399J68245l5068k3356J03352J96652n5880M0673
$$ 128453 51697 180024 178533 288932 457177 422109 398753 502105 698757 642877 683550
17934F83550l13078R8835J05345k04878P8637K18092j36090K0925J52319J73946
$$ 683550 370472 469307 574652 369774 448411 666503 530413 551338 703657 877603
17924H77603j95381j54687n7654L85805J00510o0389j12240m25446p2143M3101
$$ 877603 682222 527535 469881 855686 956196 895807 783567 358121 285978 329079
17914C29079J64089J3778j20397m6576L0016J82979J13393P1439P9505J89620
$$ 329079 493168 506946 386549 339973 369989 552968 666361 737800 817305 1006925
17904A006925L31803j07375m12845l90508r1032K6600J89013P6796J606j15901
$$ 1006925 1338728 1231353 818508 428000 336968 363568 552581 629377 630983 515082
17894E15082p9842P8733K50422j79116j05616L59747j0424j89238j27286J176
$$ 515082 435240 513973 764395 585279 479663 839410 828986 639748 512462 513638
17884E13638J60715n8493J34235K2396J17328k06744L1584N0534j09173j62664
$$ 513638 674353 615860 750095 772491 889819 683075 714659 765193 656020 493356
17874D93356Q5276J87555K9579R1142P4496L4334K85409J64928J7510N3001k22823
$$ 493356 578632 766187 795766 886908 961404 995738 1281147 1446075 1463585 1516586 1293763
17863A293763l49965p0015R5820R29j27552O2976j09619r1643N45m1418j98803
$$ 1293763 943798 873783 969603 970532 842980 905956 796337 704694 705239 663821 465018
17852D65018K12031K82935P1531k64675R113L7072J39973L4624j04908j11369
$$ 465018 677049 959984 1031515 766840 775953 813025 952998 987622 882714 771345
17842G71345l18569j44706M2043J69119R9648R7834q5795L8891l4943K028N5734
$$ 771345 452776 308070 350113 519232 618880 716714 630919 669810 634867 636895 692629
17831F92629K15254q1767k3045J11720k43871j55639Q6419K11104J56472L4803
$$ 692629 907883 826116 803071 914791 670920 515281 601700 812804 969276 1004079
17821A004079L7889K3948m8287k89826k71804J4359J76008q2673J99535j93106
$$ 1004079 1041968 1065916 1017629 727803 455999 470358 646366 563693 763228 570122
17811E70122R9305K41232J92962O6168k02798L7867k31728j3954Q7149j575P7803
$$ 570122 669427 910659 1103621 1169789 966991 1004858 773130 759176 846325 844750 922553
17800I22553J931j65579j70433N2488o5898q2569k05643j43959K57824J82356
$$ 922553 924484 758905 588472 640960 575062 492493 286850 142891 400715 583071
17790E83071k26250o1898j26158k54742j03799q9912M442J33982J20518J58940
$$ 583071 356821 294923 168765 -85977 -189776 -279688 -275246 -141264 -20746 138194
17780A38194j20166j31775k874O2806l3100m6056k2709j44280j35329R7356Q7806
$$ 138194 18028 -113747 -116621 -53815 -86915 -132971 -155680 -299960 -435289 -337933 -250127
17769b50127o7233r7760J51942J15594J80568l6188L8683K4340q4733m3094j63249
$$ -250127 -317360 -415120 -263178 -147584 32984 -3204 35479 59819 -24914 -68008 -231257
17758b31257L6640R1681M0195J37179j02135o8095O2829L344N409N0288J9143
$$ -231257 -194617 -102936 -62741 74438 -27697 -95792 -32963 -29619 -24210 26078 45221
17747D5221K85621l9457j15914m09049J05172o7090k56293Q0638J86592K55622
$$ 45221 330842 291385 175471 -233578 -128406 -195496 -451789 -371151 -184559 71063
17737G1063k9115j64894k25624M7371R9885r8734p7836j12872R7158K25785l8223
$$ 71063 41948 -122946 -348570 -301199 -201314 -300048 -377884 -490756 -393598 -167813 -206036
17726b06036P7134K26482J76732q6279r5154O409j80172R9550j16225k499j21856
$$ -206036 -128902 97580 274312 188033 92879 99288 -80884 18666 -97559 -100058 -221914
17715b21914M8470J35517m7360j19815Q569j81231o3671K25800J61519K37558
$$ -221914 -173444 -37927 -85287 -205102 -196533 -377764 -441435 -215635 -54116 183442
17705A83442R496k27914K8282J07378J4102O3708j95220j64841J61175j02095
$$ 183442 192938 -34976 -6694 100684 114786 178494 -16726 -181567 -20392 -122487
17695a22487q1644J22320J2656k4162K8548k58L3580j3377o2968K10040N9958
$$ -122487 -204131 -81811 -69155 -93317 -64769 -65027 -31447 -44824 -107792 102248 162206
17684A62206k90165o9313j8584O7692p6696j94328j625J89016J50413j31820K5816
$$ 162206 -127959 -197272 -215856 -148164 -224860 -419188 -420813 -231797 -81384 -213204 -187388
17673a87388J10970J91103J68777J1189o2272P3814K2774j63997k74712R3787
$$ -187388 -76418 114685 283462 294651 232379 306193 328967 164970 -109742 -15955
17663a5955J10900j01989L5941J86999K92088O9603L1739k59103j71900n8000
$$ -15955 94945 -7044 28897 215896 507984 577587 609326 350223 178323 120323
17653A20323p0847m9747J34156O9264r0592o5180j35211L789J614J38006K80332
$$ 120323 49476 -271 133885 203149 112557 47377 -87834 -84045 -82431 55575 335907
17642C35907J28439J02060j26269j76710j18633k43813K04499K57810K5364k05601
$$ 335907 464346 566406 440137 263427 144794 -99019 105480 363290 388654 183053
17632A83053k2952N3822k30943k68126m2259m4847n5712L17249J35253O0518k03888
$$ 183053 160101 213923 -17020 -285146 -327405 -372252 -427964 -110715 24538 85056 -118832
17621a18832k0196J1100M859j4001j06962q9186L62279K60604m7290k64432j17460
$$ -118832 -139028 -127928 -123069 -137070 -244032 -333218 29061 289665 242375 -22057 -139517
17610a39517O0781L17949J05538l3247o9933m2324k85077q5804M83155J29953
$$ -139517 -78736 239213 344751 311504 241571 199247 -85830 -171634 311521 441474
17600D41474j11749p0354J3884P555K01711R1829j99340m5958o3311m59448J399
$$ 441474 329725 259371 273255 280810 482521 574350 375010 329052 265741 -193707 -192308
17589a92308J86646J65449j506j41402j00469K940J83185J56347n269q9229j2390
$$ -192308 -5662 159787 158281 16879 -83590 -80650 102535 258882 253613 164384 151994
17578A51994j56631J6657Q3908P8857l3267R2580l7173k54330J08942J90299K13512
$$ 151994 -4637 12020 95928 174785 141518 234098 196925 -57405 51537 241836 455348
17567D55348j17830k91872r1001K75228K5417O133J3157m0262L8746M6635m34408
$$ 455348 337518 45646 -45355 229873 255290 261423 274580 234318 273064 319699 -114709
17556a14709k00372L7272J97261N2460J155l25785R6958O8920j8393k48663j38840
$$ -114709 -315081 -277809 -80548 -28088 -26933 -352718 -255760 -186840 -205233 -453896 -592736
17545e92736J33551K75674J71094r4096j5240K00681J57441k40356q9899L5629
$$ -592736 -459185 -183511 -12417 -106513 -121753 78928 236369 -3987 -93886 -58257
17535e8257L8122J91855J01986J05988K6434J6567O6629k3313j43442j27640l2062
$$ -58257 -20135 171720 273706 379694 406128 422695 489324 466011 322569 194929 162867
17524A62867l5814p6428L3957J89771J31869j46330j9635p9122J05024j20014
$$ 162867 127053 50625 84582 274353 406222 259892 240257 161135 266159 146145
17514A46145p3470J16392m4721Q3557J19993j20473J7979Q8331j16695j50198
$$ 146145 72675 189067 144346 227903 347896 227423 245402 333733 217038 66840
17504F6840N0296M5085L6133J42882J09177K27605L1516j57930l9670k90619j91751
$$ 66840 117136 162221 198354 341236 450413 678018 709534 551604 511934 221315 29564
17493B9564J21869J66707L1971R987J46093P5595L6527k44603j63132K87819K21699
$$ 29564 151433 318140 350111 360098 506191 581786 618313 373710 210578 498397 720096
17482G20096Q3334j32823k1881J23217O0145P392J81681P6633k95233Q0599J6364
$$ 720096 803430 670607 648726 771943 832088 839480 1021161 1097794 802561 883160 899524
17471H99524j55074k3637J07495M8257j36955N9917K90820R5968P6734J04885
$$ 899524 744450 720813 828308 876565 739610 799527 1090347 1186315 1263049 1367934
17461A367934o8653P5611Q457l12632m801J14923K97452L16781L5568J2110j47598
$$ 1367934 1299281 1374892 1383349 1070717 1065916 1180839 1478291 1795072 1830640 1842750 1695152
17450A695152J22529J66312N7181Q6207K3706K45106L62022L76654M71905k64490
$$ 1695152 1817681 1983993 2041174 2127381 2151087 2396193 2758215 3134869 3606774 3342284
17440C342284k76235l16565r8853k6127L6112l9119J11412L4468J31467o3391
$$ 3342284 3066049 2749484 2650631 2624504 2660616 2621497 2732909 2767377 2898844 2835453
17430B835453J55166K05500L52116K19414K65488L68267K18601r205N342L14277
$$ 2835453 2990619 3196119 3548235 3767649 4033137 4401404 4620005 4610800 4616142 4930419
17420D930419N77454M55431M35291M18560M02058K04756M33108P14298N39971
$$ 4930419 5507873 5963304 6398595 6817155 7219213 7423969 7857077 8571375 9111346
17411I111346O80425R85632J110967J229545Q73543P69038J304794J840840K544239
$$ 9111346 9791771 10777403 11888370 13117915 13991458 14760496 16065290 17906130 20450369
17402B0450369L258160L657708K774642k83081k195578k041928r19414q8514P17460
$$ 20450369 23708529 27366237 30140879 29857798 27662220 25620292 24700878 24612364 25329824
17393B5329824J053836J909897K835935L689854N121112P668738J1827020J8512444
$$ 25329824 26383660 28293557 31129492 34819346 39940458 47609196 59436216 77948660
17385G7948660K7909645L1795393J7194730n882414j5713339j7051581j7239696
$$ 77948660 105858305 137653698 154848428 148966014 133252675 116201094 98961398
17378I8961398j5735582j1950772p968496m579036k490674M13390L184617N150851
$$ 98961398 83225816 71275044 63306548 58727512 56236838 56650228 59834845 64985696
17370F4985696M704532n22913o225943p679244o297434m491991l181559k252893
$$ 64985696 69690228 69167315 62941372 55262128 48964694 44472703 41291144 39038251
17362C9038251j352795p87857l29136l01818j60509j85594j05274K48198N67176
$$ 39038251 37685456 36897599 36568463 36266645 36106136 35920542 35815268 36063466 36630642
17353C6630642Q54560Q41498P51412O43234O92488R82382J656645K188874L492477
$$ 36630642 37485202 38326700 39078112 39721346 40413834 41396216 43052861 45241735 48734212
17344D8734212N316559O988546N587441L675m779605m799565k767498o50145J274005
$$ 48734212 54050771 61039317 66626758 66630433 61850828 57051263 54283765 53633620 54907625
17335E4907625M019670P470175J1842536J5087653J5851707J6256390J6136395
$$ 54907625 58927295 66397470 78240006 93327659 109179366 125435756 141572151
17328A41572151O427212j5030292k6700539k2178405j4915112j0067346p039743
$$ 141572151 147999363 132969071 106268532 84090127 69175015 59107669 52067926
17321E2067926n342888l922575k813098k274581j902564j498612p34457J24339
$$ 52067926 46725038 42802463 39989365 37714784 35812220 34313608 33579151 33703490
17313C3703490J050252J439514J71866k028557k709776k340042j762793j424971
$$ 33703490 34753742 36193256 36365122 34336565 31626789 29286747 27523954 26098983
17305B6098983j033679p76139r61492q21076m19909k88929j60740k30274k70710
$$ 26098983 25065304 24289165 23327673 22506597 22086688 21797759 21637019 21406745 21136035
17296B1136035n56235p20107p06163j118834j104359q94477q58681q30397p65561
$$ 21136035 20579800 19859693 19153530 18034696 16930337 16035860 15177179 14346782 13581221
17287A3581221q05687q29272p69549o41535m18318n29622n54057l77516j83144
$$ 13581221 12775534 11946262 11176713 10535178 10116860 9587238 9033181 8655665 8472521
17278H472521k94873m15576o77953o02626n06498k84218k06549J1586m52371l17749
$$ 8472521 8177648 7762072 7084119 6481493 5974995 5690777 5484228 5495814 5043443 4725694
17268D725694k00026m33468m85260k78734l33354j44629O7912j60869j14969k7679
$$ 4725694 4525668 4092200 3606940 3328206 2994852 2850223 2918135 2757266 2642297 2614618
17258B614618K6297j15931k54584m00692m7170j06839M0587L542k19258k65185
$$ 2614618 2640915 2524984 2270400 1869708 1822538 1715699 1756286 1759828 1540570 1275385
17248A275385j44764J36111J44011j20551M8068o9446l44642j83384r0657R0370
$$ 1275385 1130621 1266732 1410743 1290192 1338260 1268814 924172 740788 650131 740501
17238G40501L0936J0761j600j12784P5820R8911j48644l48899m6940J03092n4220
$$ 740501 771437 782198 780598 667814 743634 842545 693901 345002 298062 401154 346934
17227C46934r9232Q1070j48057j43999J07243J66742J93206M1495j09307j91890
$$ 346934 247702 328772 180715 36716 143959 310701 503907 545402 436095 244205
17217B44205L23750j4406j53653p4299j74431M5747Q6823J6751o9767q827l2N6783
$$ 244205 567955 553549 399896 325597 151166 196913 283736 300487 230720 221893 221861 278644
17205B78644J22398N1985p7713P190K14729j23755p911k78016J3870J15706J35605
$$ 278644 401042 453027 375314 382504 597233 473478 465567 187551 201421 317127 452732
17194D52732m3363r9595j52865n3319O5708O2782j24326j80589M0993J46383M7914
$$ 452732 409369 309774 156909 103590 169298 232080 107754 -72835 -31842 114541 162455
17183A62455J90921m1177J13373k3132P2703j64470M7903j8171r1782q945Q974
$$ 162455 353376 312199 425572 402440 475143 310673 358576 340405 248623 239678 248652
17172B48652r1583r1531Q4609L9693o1285l5464K50902n5519j58159K36896R6931
$$ 248652 157069 65538 150147 189840 128555 93091 343993 288474 130315 367211 464142
17161D64142L4432K5590q0135K25001K91499j78672k97766p6410J56154l7607
$$ 464142 498574 524164 444029 669030 960529 781857 484091 407681 563835 526228
17151E26228M8959j07043j76396j26594p8263K27070N7259n2124Q4489J14614
$$ 526228 575187 468144 291748 165154 86891 313961 371220 319096 403585 518199
17141E18199J02780k15276k30802J62456J66863l9859n0165K0392J15094O8009
$$ 518199 620979 405703 174901 337357 504220 464361 414196 434588 549682 617691
17131F17691m0272k2796q9768n5839K08230r7923j64499J54536k7877l64304l4346
$$ 617691 577419 554623 464855 409016 617246 519323 354824 509360 481483 117179 82833
17120H2833K39484P02k24643L5155L5307O4017r3930j1167J5584P3528j95504
$$ 82833 322317 323019 98376 133531 168838 232855 138925 127758 143342 216870 21366
17109B1366N1754k8377j97228k24899r5689K08437P9165K58914J43345k19281
$$ 21366 73120 44743 -152485 -377384 -473073 -264636 -185471 73443 216788 -2493
17099b493j55281J65863M0276o4032K20232J35262k76819m04954Q1138J52594
$$ -2493 -157774 8089 48365 -15667 204565 339827 63008 -341946 -260808 -108214
17089a08214P2969J37694M8673M9774Q2512p7580n0683n1824j4204K0526N8282
$$ -108214 -35245 102449 151122 200896 283408 205828 155145 103321 89117 109643 167925
17078A67925j7215k42483p0540J06208K50539O6042l07927j07634J23355J91027
$$ 167925 150710 -91773 -162313 -56105 194434 260476 -47451 -155085 -31730 159297
17068A59297r4053J44822q9020p1389m1783N1208k91163k25910L4553N813L80710
$$ 159297 65244 210066 121046 49657 7874 59082 -232081 -457991 -423438 -417625 -36915
17057c6915K2454J74028J57658j02567j21312K4293L3393J07024j98266m01062
$$ -36915 -14461 159567 317225 214658 93346 117639 151032 258056 59790 -341272
17047c41272j49384r961J28614J29037M6887J54967J37920J09949j36841O1362
$$ -341272 -490656 -500617 -372003 -242966 -196079 -41112 96808 206757 69916 131278
17037A31278N6978l49239k21659J8768k5134j69785K3194j62525J47580L4965
$$ 131278 188256 -160983 -382642 -363874 -389008 -558793 -535599 -698124 -550544 -515579
17027e15579o3546O4961L20722l5981J7829J86874L0756L3778j976l25483j83225
$$ -515579 -579125 -514164 -193442 -229423 -211594 -24720 6036 39814 37838 -287645 -470870
17016d70870J06671K54076m848o8800j99496m952j34605j71675l7368J93406O0202
$$ -470870 -364199 -110123 -114971 -183771 -383267 -388219 -522824 -694499 -731867 -538461 -478259
17005d78259j66634J26340K2869K6347P8247j9387J60962q410J22281J3233q7077
$$ -478259 -644893 -518553 -495684 -469337 -391090 -410477 -249515 -257925 -135644 -122411 -209488
16994b09488J79510j17986J16963J02015k08898r3300J68020J8547k13002j17816
$$ -209488 -29978 -147964 -31001 71014 -137884 -231184 -63164 -44617 -257619 -375435
16984c75435L806K11844K1172m153k11942Q2444J43359N3443k2335j30241P6147
$$ -375435 -371629 -159785 -138613 -142766 -354708 -272264 -128905 -75462 -97797 -228038 -151891
16973a51891M1635j68148n3943j49583J63312L45633M4197o3075Q554o1642j27343
$$ -151891 -110256 -278404 -332347 -481930 -318618 27015 71212 8137 16691 -44951 -172294
16962a72294M288j47568k35639J72265M18730J36998l249j54443L5030P975k16572
$$ -172294 -168006 -315574 -551213 -378948 39782 176780 173531 19088 54118 62093 -154479
16951a54479R1907R1513O4624k52879j0715j01180M3148K39358J69142n430l4456
$$ -154479 -62572 28941 93565 -159314 -170029 -271209 -228061 11297 180439 175009 140553
16940A40553k36335m1375M1753O8356q2383k18676j11891K41290L99504J11609
$$ 140553 -95782 -137157 -95404 -27048 -109431 -328107 -439998 -198708 200796 312405
16930C12405k1257r7522l9127j85383J10293J77929j23166o6077j0228M8817l3176
$$ 312405 291148 193626 154499 -30884 79409 257338 134172 68095 57867 106684 73508
16919G3508j3179N0827j8254k15122k09766J67174m1966r4458J16970J43471P2677
$$ 73508 60329 111156 92902 -122220 -331986 -164812 -206778 -301236 -184266 -40795 31882
16908C1882J157l5143p3933O5836J29587j38429J51575k9820L7730K26771Q1988
$$ 31882 33039 -2104 -76037 -10201 119386 -19043 132532 102712 140442 367213 449201
16897D49201j16098P64J88311k11082k38506O2706K02429l1900j64544q7204m8893
$$ 449201 333103 333867 522178 311096 72590 135296 337725 305825 141281 54077 5184
16886E184N0802J1728l6448R3343p5037j42740j89722K10369K35818L10193J17723
$$ 5184 55986 67714 31266 124609 49572 -93168 -282890 -72521 163297 473490 591213
16875E91213Q7273k23347k30946q3108K01824J43011N8603j20173o5913j5346
$$ 591213 678486 455139 224193 141085 342909 485920 544523 424350 358437 343091
16865C43091r2991J066k8496j89349M6625M757n1475P8535j69769l4065J94990
$$ 343091 250100 251166 222670 33321 79946 84703 33228 111763 -58006 -92071 102919
16854A02919J54737J39668j80424k2420n2719r346M7100q5580l274j78970P2438
$$ 102919 257656 397324 216900 194480 141761 132415 179515 93935 90661 -88309 -15871
16843a5871L29929J35989m9068m14029k2962J47443J7578O6669J32577n6296l5369
$$ -15871 314058 450047 400979 -13050 -36012 111431 129009 195678 328255 271959 236590
16832B36590j10926J32121l2383J44248o405j72856k41296J5174P0929O8486L15603
$$ 236590 125664 257785 225402 369650 363245 190389 -50907 -35733 35196 103682 419285
16821D19285K75342j49448j94359q9633M2216j17578J12670l3861o4170k3546
$$ 419285 694627 545179 350820 261187 303403 185825 298495 264634 200464 176918
16811A76918l5171k90523j09218J13463j0745j29436o6759J32312M3643J65938
$$ 176918 141747 -148776 -257994 -144531 -155276 -284712 -351471 -219159 -175516 -9578
16801i578M1974o0876j46425r2732N7899J13110k8642l23112J449J55999K943
$$ -9578 32396 -28480 -174905 -267637 -209738 -96628 -125270 -448382 -446933 -290934 -287991
16790b87991J48862J43991q2778M8720J45917j50744q6157l4686M7583R386j43787
$$ -287991 -139129 4862 -77916 -29196 116721 -34023 -120180 -154866 -107283 -97897 -241684
16779b41684K4272N7733j73292n879J24958K64604k4015L543o383l8177J27270
$$ -241684 -217412 -159679 -332971 -338850 -213892 50712 26697 30240 23857 -14320 112950
16768A12950m3967j29107k69291j06505J09474J62615j37113k05526j23765J44246
$$ 112950 68983 -60124 -329415 -435920 -326446 -163831 -300944 -506470 -630235 -485989
16758d85989N1209J43094J89315j7300j15050j87576N9718K38512L09729j1139
$$ -485989 -434780 -291686 -102371 -119671 -234721 -422297 -362579 -124067 185662 174523
16748A74523k78500j69457j02752p6541m8358O0479K72195J5162L137n9770r1545
$$ 174523 -103977 -273434 -376186 -452727 -501085 -440606 -168411 -153249 -150112 -209882 -301427
16737c01427L3100o478P39j48011P8547j38793K61626J96581j68366j81368P7516
$$ -301427 -268327 -274805 -274066 -422077 -343530 -482323 -220697 -24116 -192482 -373850 -296334
16726b96334l1874k4583J69565r6604P727L24960J06815m77565k17132R9956J42563
$$ -296334 -328208 -352791 -183226 -279830 -272103 52857 159672 -317893 -535025 -435069 -292506
16715b92506K06083r1606j39187k0450r1295J70460K29531J14559O4282k67600
$$ -292506 -86423 -178029 -317216 -337666 -428961 -258501 -28970 85589 149871 -117729
16705a17729q7961J86874J9758j64204K6626k3444j50557q0129q0193q0353n6604
$$ -117729 -205690 -18816 942 -163262 -136636 -160080 -310637 -390766 -470959 -551312 -607916
16694f07916j06285M4057K90800J26836q1618L1838K81059K06879p8018j93104
$$ -607916 -714201 -670144 -379344 -252508 -334126 -302288 -21229 185650 107632 -85472
16684h5472k60066j01008M0192J78423K05401K07031j38680j61791P951k0180
$$ -85472 -345538 -446546 -406354 -227931 -22530 184501 45821 -115970 -108019 -128199
16674a28199R6306P2449N7533j27223j24184j30256n7883R9396P0523j2226k4240
$$ -128199 -31893 40556 98089 -29134 -153318 -283574 -341457 -242061 -171538 -183764 -208004
16663b08004M4247J96675j93770k28157p3042N8162J66539m9230Q7743J18728
$$ -208004 -163757 32918 -160852 -389009 -462051 -403889 -237350 -286580 -198837 -80109
16653h0109o2707r4859M9242j17764j73616K27063N5798J4365Q5613M4856P1155
$$ -80109 -142816 -237675 -188433 -306197 -479813 -252750 -196952 -182587 -96974 -52118 19037
16642A9037m339q6833J06687J3075j95654J17358o9577j09393k0579J38717O0939
$$ 19037 14698 -72135 34552 47627 -148027 -30669 -100246 -209639 -230218 -91501 -30562
16631c0562R8831j68876j36962Q2727N4167J7587J57585j13399k39340O7993O3429
$$ -30562 68269 -100607 -237569 -154842 -100675 -83088 74497 -38902 -278242 -210249 -146820
16620a46820j70926J19890N4680K1910N9473m4524L4792O8435m3584O5032j829
$$ -146820 -317746 -197856 -143176 -121266 -61793 -106317 -71525 -3090 -46674 18358 16529
16609A6529j00261n1242J3973K53715J0761k00288q3238J56647M6464m9663j92064
$$ 16529 -83732 -134974 -121001 132714 143475 -56813 -140051 16596 63060 13397 -178667
16598a78667m4784J49024J73019j21251k50922o6770J57666J03078J16885J1521
$$ -178667 -223451 -74427 98592 -22659 -273581 -340351 -182685 -79607 37278 48799
16588D8799m2084j70752j16877o5875P0058L19787K47563j79036j78907m5271
$$ 48799 6715 -164037 -280914 -346789 -276731 43056 290619 111583 -67324 -112595
16578a12595l3973K60979J45787j16146k183R4465R4026j50970J41394Q800j42026
$$ -112595 -146568 114411 260198 144052 141869 236334 330360 179390 320784 329584 187558
16567A87558j98304j09432l08712J0984Q4247R5128M6784r73q2230r2282k85590
$$ 187558 -10746 -120178 -428890 -417906 -333659 -238531 -191747 -192720 -274950 -367232 -652822
16556f52822k25423K25531n2050K68905K65601K49352q2164k9774J74053j06658
$$ -652822 -878245 -652714 -704764 -435859 -170258 79094 -3070 -32844 141209 34551
16546C4551M6106o311j12474J58850Q6166J24395M9226j98182k2258j8165k1376
$$ 34551 80657 74346 -38128 120722 206888 331283 380509 182327 160069 141904 120528
16535A20528k65228n5231k79493l8636j05109p0781J10534J47635M2728J14492
$$ 120528 -144700 -199931 -479424 -518060 -623169 -693950 -583416 -435781 -393053 -278561
16525b78561J42290P5737q1197O9774L08583k1757r0782j26353q0196q9071j37512
$$ -278561 -136271 -60534 -141731 -71957 236626 214869 124087 -2266 -82462 -171533 -309045
16514c09045J4871J61197P9756Q289L7854O4984j38791j42214p383J86375J48336
$$ -309045 -294174 -132977 -53221 -44932 -7078 57906 -80885 -223099 -230482 -44107 104229
16503A04229l933K6755p6742p1476J16987r6160k88256p6159j59309r334J20725
$$ 104229 100296 127051 50309 -21167 95820 -340 -288596 -364755 -524064 -533398 -412673
16492d12673L57153m5531O8388L23J02942o0299r1540p368j61608P8610j85884
$$ -412673 -55520 -101051 -32663 -32340 70602 10303 -81237 -88605 -250213 -171603 -357487
16481c57487j83740K22730K81646k9356r6588m33347j16767J77607q4406J72883
$$ -357487 -541227 -318497 -36851 -66207 -162795 -596142 -712909 -535302 -619708 -446825
16471d46825K67597j05676P1022R9055o8771j19770J5992j4353L6951J22727J67768
$$ -446825 -179228 -284904 -213882 -114827 -183598 -303368 -287376 -301729 -264778 -142051 25717
16460B5717P3081P4744J34300N186o9418R423Q8187j47605q1883j65519L8325
$$ 25717 98798 173542 307842 313028 243610 253033 341220 193615 111732 -53787 -15462
16449a5462j90924J236k67518P1633J07754J20868J20463m4530p6498k3125O4316
$$ -15462 -206386 -205150 -472668 -401035 -293281 -172413 -51950 -96480 -172978 -196103 -131787
16438a31787K1940j26229k31850k336J39562L88044K08492L1209l5431l44251
$$ -131787 -109847 -236076 -467926 -470262 -330700 57344 265836 297045 261614 -82637
16428h2637k53154m7833L2777J72882q6114J0459J27892q2838k17445j5146K72280
$$ -82637 -335791 -383624 -350847 -177965 -264079 -253620 -125728 -208566 -426011 -441157 -168877
16417a68877K16966j1766j57737N040n0516r1053j52877K44893j41842j0236Q5477
$$ -168877 48089 36323 -121414 -116374 -166890 -257943 -410820 -165927 -307769 -318005 -232528
16406b32528M5738K91613O2727j44189k40371K9113n2514K36488R5618P8883k14178
$$ -232528 -186790 104823 167550 23361 -217010 -187897 -240411 -3923 91695 170578 -43600
16395d3600j53144K3270m5007R1697P8034R1852k39511k68605o7746J68824N7304
$$ -43600 -196744 -173474 -218481 -126784 -48750 43102 -196409 -465014 -532760 -363936 -306632
16384c06632j94823k6042K74398J2631J18545j2330k43195m4085K81709K41069
$$ -306632 -501455 -527497 -253099 -240468 -121923 -134253 -377448 -421533 -139824 101245
16374A01245K35521r3902l42186p5960o3187J56416J37264o0220j09569K26320
$$ 101245 336766 242864 -99322 -175282 -238469 -82053 55211 -5009 -114578 111742
16364A11742J14989r7636P8863q4297j85949k05802R2604J72571J97507J8878
$$ 111742 226731 129095 207958 123661 -62288 -268090 -175486 -2915 194592 213470
16354B13470o1059R3789l23676J34155K41757j41178r5363j57604j77268m4100
$$ 213470 152411 246200 -77476 56679 298436 157258 61895 -95709 -272977 -317077
16344c17077K6706k8944J65924R5169L5129K6596l3979j8423J20523N027P643
$$ -317077 -290371 -319315 -153391 -58222 -23093 3503 -30476 -48899 71624 76651 84294
16333H4294O0543k0184j15175l14854Q8431j03477J03955J80967l638o4353j23654
$$ 84294 144837 124653 9478 -305376 -216945 -320422 -216467 -35500 -39138 -103491 -227145
16322b27145l262J9214k90025j19232J3514J74715K75778r8536j6107K07550O2706
$$ -227145 -230407 -211193 -501218 -620450 -606936 -432221 -156443 -254979 -271086 -63536 -830
16311h30j32864l1988n2222L2091R9125j9154j23581L7270k83406J93246P4263
$$ -830 -133694 -165682 -217904 -185813 -86688 -105842 -229423 -192153 -475559 -282313 -208050
16300b08050j00250l6061N4952J79718p6113r9582K42412K38326o0462j09505
$$ -208050 -308300 -344361 -289409 -109691 -185804 -285386 -42974 195352 134890 25385
16290B5385j62966L2635J0677j51440M5605J88871K3920o4482Q9339l94883k79263
$$ 25385 -137581 -104946 -94269 -245709 -200104 -11233 12687 -51795 37544 -357339 -636602
16279f36602N4838K35258q278M7200K96242q2280j29153J37013q8363k6530k5657
$$ -636602 -581764 -346506 -354784 -307584 -11342 -93622 -222775 -85762 -174125 -200655 -226312
16268b26312j95027J76003R2549J27223j2208n7707l4082m6184O9720o346q2020
$$ -226312 -421339 -245336 -152787 -25564 -37772 -95479 -129561 -175745 -106025 -112371 -194391
16257a94391J84Q2395K6100j11159j60904q0363j6677k4066J77239J60036J19542
$$ -194391 -194207 -111812 -85712 -196871 -357775 -438138 -454815 -478881 -301642 -141606 -22064
16246b2064j2027P0094K17405O9469m1326j2393j87253n9508K5734q1756p5057
$$ -22064 -34091 36003 253408 322877 281551 269158 81905 22397 48131 -33625 -108682
16235a08682K0053J29514k2478k4409j01362k39461j6335K02615L07584j11572
$$ -108682 -88629 40885 18407 -6002 -107364 -346825 -363160 -160545 147039 35467
16225C5467k27360M4012K62284k1124l15750p797r8445j32054J30999J68077p2796
$$ 35467 -191893 -147881 114403 93279 -222471 -230268 -328713 -460767 -329768 -161691 -234487
16214b34487L7585J69454J25325J2532j5000l8715k3045O6229r7202K13290k8706
$$ -234487 -196902 -27448 97877 110409 95409 56694 33649 99878 2676 215966 187260
16203A87260J288J14069j39625l370M6844j30252j42008k95526l22660J17381
$$ 187260 188548 302617 162992 159622 206466 76214 -65794 -361320 -683980 -566599
16193e66599K27717N8856k0337J89104K62587J04946j08534J7800l6786k35067
$$ -566599 -338882 -280026 -300363 -111259 151328 256274 147740 165540 128754 -106313
16183a06313k29985j8280J33490J74587M5993K0137j44325M1860k8427K03321
$$ -106313 -336298 -354578 -221088 -46501 -508 19629 -124696 -82836 -111263 92058
16173I2058O4428N2754J39455j5876k61831m14650j16352K21423J60933k33487
$$ 92058 156486 209240 348695 332819 70988 -343662 -460014 -238591 -77658 -311145
16163c11145j2603l4397K96087K2066m1704M6845r0732r7790M0063j21336j68491
$$ -311145 -323748 -358145 -62058 -39992 -81696 -34851 -125583 -223373 -183310 -304646 -473137
16152d73137J81622K77347J21147K4403m1930q276p0014k0398Q2264j3846l93003
$$ -473137 -291515 -14168 106979 131382 89452 81176 11162 -9236 73028 59182 -333821
16141c33821l20567N9557J48131k002P4340k06148J37048L59850O1182n1509o594
$$ -333821 -654388 -594831 -446700 -448702 -374362 -580510 -443462 -83612 -22430 -73939 -80533
16130h0533k11681j56664J52977Q0846N625P754J82316m5128q1199q9098J19924
$$ -80533 -292214 -448878 -295901 -215055 -209430 -201676 -19360 -64488 -145687 -234785 -114861
16119a14861K5252j34636j9696N4047k19857j77787J46052J15536L26840O368
$$ -114861 -89609 -224245 -243941 -189894 -409751 -587538 -441486 -325950 890 7258
16109G258q2427J28288O8720l10105k7666K976J47579J10344m2415q2909J00335
$$ 7258 -75169 53119 121839 -188266 -215932 -212956 -65377 44967 2552 -80357 19978
16098A9978J37489M508J1426k90257j95976K2797L40745o8815j73526J3220L65442
$$ 19978 157467 161975 173401 -116856 -312832 -290035 50710 -18105 -191631 -178411 187031
16087A87031K8368j81934J7855m4751J71228n94K449K941n4562k41386J23706
$$ 187031 215399 33465 51320 6569 177797 177203 179652 182593 128031 -113355 10351
16076A0351J26258Q9847n6288j28295o3415L5126K1486O3350k06142j91890K26723
$$ 10351 136609 226456 170168 41873 -21542 13584 35070 98420 -107722 -299612 -72889
16065g2889J29610j67784j7673L15496J82223j20420q1817j90004k02266J16382
$$ -72889 56721 -111063 -128736 186760 368983 248563 166746 -23258 -225524 -109142
16055a09142J41945m9093P337L9569J26903k30253j9485Q4962J9885O6930J47120
$$ -109142 32803 -16290 -8953 30616 157519 -72734 -92219 -7257 12628 79558 226678
16044B26678k8500Q7096j11262j84437K37363j08612r2284N780k5192j04401j79107
$$ 226678 198178 285274 174012 -10425 226938 118326 26042 31822 6630 -97771 -276878
16033b76878o6942r2946j49976K7505J67700J49142R436Q9055R2777J31756O0594
$$ -276878 -343820 -436766 -586742 -559237 -391537 -242395 -232959 -143904 -51127 80629 141223
16022A41223k83l26804r394L85055J57476L933Q148j10454k48430k33375k48084
$$ 141223 140940 -185864 -195258 189797 347273 351206 359354 248900 470 -232905 -480989
16011d80989o38N0735L38392J04638o9764j40106M2498J0108m4066J50109J84348
$$ -480989 -481627 -430892 -92500 12138 -57626 -197732 -155234 -145126 -189192 -39083 145265
16000A45265j94011j35434M5782r1723j50082J14233l8075O345K29251Q1942k45202
$$ 145265 -48746 -184180 -138398 -230121 -380203 -265970 -304045 -297700 -68449 13493 -231709
15989b31709j57235J68365R0700j95864J99900J45357L20417J2308m3798j71189
$$ -231709 -388944 -220579 -129879 -325743 -125843 19514 339931 352239 308441 137252
15979A37252o2406m2505r9649r3613k93257j1445O3892r8327N2207L35894P5284
$$ 137252 74846 32341 -67308 -160921 -454178 -465623 -401731 -500058 -447851 -111957 -36673
15968c6673j04266N9985P0668p4977j75819j05131j7358K55388J94537k68982
$$ -36673 -140939 -80954 -10286 -85263 -261082 -366213 -383571 -128183 66354 -202628
15958b02628k42240K02382J35847o7742K3124j55704J3650K32927J8910r9126
$$ -202628 -444868 -242486 -106639 -174381 -151257 -306961 -293311 -60384 -41474 -140600
15948a40600J25300j27343o6908n0783Q3490K22704J82681L3341m547k6349n3480
$$ -140600 -15300 -142643 -209551 -260334 -176844 45860 228541 261882 257335 230986 177506
15937A77506q818K0369l8873k90216J21939K37908n730l49190j07700j01382J31652
$$ 177506 168688 189057 150184 -140032 -18093 219815 214085 -135105 -242805 -344187 -212535
15926b12535o4657k04748J62141J23742M2548J81921J1232o8505k92506j57495
$$ -212535 -277192 -481940 -319799 -196057 -153509 28412 39644 -28861 -321367 -478862
15916d78862K57334K05670J17889n0239k19501j65214j66553n2004L7119R0674
$$ -478862 -221528 -15858 102031 51792 -167709 -332923 -499476 -551480 -514361 -423687
15906d23687K01677L08056p3899k2087r1766j8472O9699N587j09030r3389p545
$$ -423687 -222010 86046 12147 -9940 -101706 -120178 -50479 -44892 -153922 -247311 -254856
15895b54856J53699J19757P0698J59659R804k39836R8780J1905k03563j17149
$$ -254856 -101157 18600 89298 248957 258761 18925 117705 129610 -73953 -191102
15885a91102P8725J8599l17653j63975J18164L22014K68739j55805K98l0488j96476
$$ -191102 -112377 -93778 -411431 -575406 -457242 -135228 133511 -22294 -21996 -52484 -248960
15874b48960j99643Q6747K4528L5393L05869N5495j21938K19453r9174j78315
$$ -248960 -448603 -361856 -337328 -301935 3934 59429 -62509 156944 57770 -120545
15864a20545J36783P0562K08354j47548l18638N4866J16253m5668p0454p2795
$$ -120545 16238 86800 295154 147606 -171032 -116166 87 -45581 -116035 -188830
15854a88830P6384O8546M336j8381j42688P4064O8383p0477K6123n729J0602j44277
$$ -188830 -112446 -43900 -39564 -57945 -200633 -126569 -58186 -128663 -102540 -108269 -97667 -241944
15842b41944J24034K7760N9272j6879k7938j77459R5677j39904O110J87798O5104
$$ -241944 -117910 -90150 -30878 -47757 -75695 -253154 -157477 -297381 -291271 -103473 -38369
15831c8369Q1344Q9469j13283j4282P7347r4015k34524K10323J0988k94888J54397
$$ -38369 42975 132444 19161 4879 82226 -11789 -246313 -35990 -25002 -319890 -165493
15820a65493J6635K7975q5910l7258L6500K29735M0712M026n2222J0627O3423
$$ -165493 -148858 -120883 -206793 -244051 -207551 22184 62896 66922 14700 25327 88750
15809H8750q3607j25982K5867k38727n8495q1256m5675J12007j71431l2736L20010
$$ 88750 5143 -120839 -94972 -333699 -392194 -473450 -519125 -407118 -578549 -611285 -291275
15798b91275P1890J65864o2526J049R1368J62491l2063l03727j95880R1042J28793
$$ -291275 -219385 -53521 -116047 -114998 -23630 138861 106798 -196929 -392809 -301767 -172974
15787a72974j78190P5909q0789L353j7667J08363J1460r1544k00030l1001L2825
$$ -172974 -351164 -275255 -356044 -352691 -370358 -261995 -250535 -342079 -542109 -573110 -540285
15776e40285K98456J01074l9502j44451R9695Q6181r1767o1853p4592R7390K3698
$$ -540285 -241829 -140755 -180257 -324708 -225013 -138832 -230599 -292452 -367044 -269654 -245956
15765b45956O3891l2137J21483J90088j40231n2678J58471P9431k34281j33511
$$ -245956 -182065 -214202 -92719 97369 -42862 -95540 62931 142362 -91919 -225430
15755b25430J34399J141J4043L0207L6396J4700l309k09771k0363q9505k89962
$$ -225430 -91031 -89890 -75847 -45640 -9244 5456 2147 -207624 -227987 -317492 -607454
15744f07454R848M43963J74224k50572q1242J76497k5205j54882j07308Q2784
$$ -607454 -597606 -153643 20581 -229991 -311233 -134736 -159941 -314823 -422131 -339347
15734c39347l1467r4134Q3500Q2293j21577n0193J29121J88698L22029j31402
$$ -339347 -370814 -464948 -381448 -299155 -420732 -470925 -341804 -153106 168923 37521
15724C7521j59940J07146k17138R650J28151K59323J83657j34969k67536J4269
$$ 37521 -122419 -15273 -232411 -222761 -94610 164713 348370 213401 -54135 -39866
15714c9866k96209o8638J28873N3166J17597j51167J21163K67177J17953k82061
$$ -39866 -336075 -404713 -275840 -222674 -105077 -256244 -135081 132096 250049 -32012
15704c2012l61828r5305K51480N688R2882J41201j16017m2119n9942q9413K88724
$$ -32012 -393840 -489145 -237665 -231977 -139095 2106 -113911 -156030 -215972 -305385 -16661
15693a6661J68544m3551O8070O9003j80786j57262k11973Q1942N6070N8700n8322
$$ -16661 151883 108332 176402 245405 64619 -92643 -304616 -222674 -166604 -107904 -166226
15682a66226K0692O8006P3440J28711p3818J25061p0349J0394k45692r5409k08865
$$ -166226 -145534 -77528 -4088 124623 50805 175866 105517 115911 -129781 -225190 -434055
15671d34055k1344J23304L03582n0587j65771J3995r394L0796q4194j9713p085
$$ -434055 -455399 -332095 -28513 -79100 -244871 -230876 -240270 -209474 -293668 -313381 -320466
15660c20466k4554j62047R707K45223J67411m668m9158o8844J85302K24053o133
$$ -320466 -345020 -507067 -497360 -252137 -84726 -89394 -138552 -207396 -22094 201959 195826
15649A95826L903k62446m15501o8870R0232J45429K53140J44980k41956K15309
$$ 195826 199729 -62717 -478218 -547088 -456856 -311427 -58287 86693 -155263 60046
15639F0046Q4061m9169k6649k92600j9206K4332j62414m228j06054o0940J24786
$$ 60046 144107 94938 68289 -224311 -243517 -219185 -381599 -385827 -491881 -552821 -428035
15628d28035M0060L3109r7817K80184n8525j25874K0910K63126j2660j85589l01100
$$ -428035 -387975 -354866 -452683 -172499 -231024 -356898 -335988 -72862 -85522 -271111 -572211
15617e72211p6539Q247K11006J91025J78964Q5741J27381J40274P1285l14133
$$ -572211 -648750 -640503 -429497 -238472 -59508 26233 153614 293888 365173 51040
15607E1040L2594M504O6177R620j8779j06768r6886j9534O5050K7348L7536r4383
$$ 51040 83634 88138 154315 163935 145156 38388 -58498 -78032 -12982 14366 51902 -42481
15595d2481J3036P224j70882j85134r795m0228L38134K05923J69462Q2655j46208
$$ -42481 -29445 -22221 -193103 -378237 -388032 -428260 -90126 115797 285259 367914 221706
15584B21706l92913j49094L6718L00792o3023j8796o8719k6801K77726R1421j24964
$$ 221706 -171207 -320301 -283583 17209 -45814 -64610 -133329 -160130 117596 209017 84053
15573H4053o9844m2808o1178K2127N8406Q6037J74599k64866j55017m3059k14705
$$ 84053 14209 -28599 -89777 -67650 -9244 76793 251392 -13474 -168491 -211550 -426255
15562d26255j08431j00630j06172L17587K18440K2005j19581j12879R1071j3119
$$ -426255 -534686 -635316 -741488 -423901 -205461 -183456 -303037 -415916 -324845 -337964
15552c37964K1939M6414K02373o4298M8776n9551J7210J92912n6828k97378j01126
$$ -337964 -316025 -269611 -67238 -131536 -82760 -142311 -125101 67811 10983 -286395 -387521
15541c87521P4709J5162k24301L3104L58355k4911k03763j01330j40586j27187
$$ -387521 -312812 -297650 -521951 -488847 -130492 -155403 -359166 -460496 -601082 -728269
15531g28269L70836K97093P9778N3098J6825o6437j66839L314j69189o085K32391
$$ -728269 -357433 -60340 19438 72536 89361 22924 -143915 -140601 -309790 -315875 -83484
15520h3484Q1986J59091O3254j10592J29206J53092j82331j1128O7530l69130
$$ -83484 -1498 157593 220847 110255 239461 392553 210222 199094 266624 -102506
15510a02506r7714n8055M6588r2270m9882k536J28951j43361m7583O8836n2029
$$ -102506 -200220 -258275 -211687 -303957 -353839 -356375 -227424 -370785 -418368 -349532 -401561
15499d01561O7647L68679K63656o4959k48651R8988J65503j28301k08631J3737
$$ -401561 -333914 34765 298421 233462 -15189 83799 249302 121001 -87630 -73893
15489g3893P581J24413J22552L9549j28777m09040j13285K12128K14827j95058
$$ -73893 -66312 58101 180653 220202 91425 -317615 -430900 -218772 -3945 -199003
15479a99003j85537O2822L00449O0190j50735j20643o3526J94265L8253k41245
$$ -199003 -384540 -321718 -21269 38921 -111814 -232457 -295983 -101718 -63465 -304710
15469c04710j19329l3408j10513j45996l1958N4533K89957n1359j55799m7576
$$ -304710 -424039 -457447 -567960 -713956 -745914 -691381 -401424 -452783 -608582 -656158
15459f56158J65157Q7652J77074K02087J90797r4317k23041Q9792R1087k97763
$$ -656158 -491001 -403349 -226275 -24188 166609 72292 -150749 -60957 30130 -267633
15449b67633n3669K06223J84380j12712j48415J73805p3281k55611J899O9096
$$ -267633 -321302 -115079 69301 -43411 -191826 -18021 -91302 -346913 -345014 -275918
15439b75918O7871m3384k67187q7896J16094j18050p4056J12108J58508J72964
$$ -275918 -208047 -251431 -518618 -606514 -490420 -608470 -682526 -570418 -411910 -238946
15429b38946J51614n6010L0356N6784K96815k12384j7372O3063k67199k7121P5160
$$ -238946 -87332 -143342 -112986 -56202 240613 28229 10857 73920 -193279 -220400 -145240
15418a45240J43042M1010j35410j77448O7898R8439j29885R3138K7090J2684J00418
$$ -145240 -2198 38812 -96598 -274046 -206148 -107709 -237594 -144456 -117366 -104682 -4264
15407d264m7336k42311J47279K54441k2031m7038m2856R2091M7838r3440j59679
$$ -4264 -51600 -293911 -146632 107809 85778 38740 -4116 87975 135813 42373 -117306
15396a17306K9548o7490O8226J37171j18367L7992P0049j32563o5858P649n4154
$$ -117306 -87758 -155248 -87022 50149 -68218 -30226 39823 -92740 -158598 -150949 -205103
15385b05103L2483R8918j35768L6017K292j64345J2734N1888l7938M1672R7292
$$ -205103 -172620 -73702 -209470 -173453 -171161 -335506 -322772 -270884 -308822 -267150 -169858
15374a69858P5693K33531J21906n4442l4256j560n2138p0350j52899r7177k24462
$$ -169858 -94165 139366 261272 206830 172574 171014 118876 48526 -104373 -201550 -426012
15363d26012r8404p5428J85994N7074j13937J08740J46524K61560j39871j28081
$$ -426012 -524416 -599844 -413850 -356776 -470713 -361973 -215449 46111 -93760 -221841
15353b21841K76411J60121q6551k12387k6470L8043K17361J18161j36612l21657
$$ -221841 54570 214691 128140 -84247 -110717 -72674 144687 262848 126236 -195421
15343a95421k83330J21961o7305J10607J11743J9966K5274J09043q0043q7141
$$ -195421 -478751 -356790 -424095 -313488 -201745 -181779 -156505 -47462 -127505 -214646
15333b14646m4610l10044Q7560J60841J43854j49355m6474J34939o5043K25962
$$ -214646 -259256 -569300 -481740 -320899 -177045 -326400 -372874 -237935 -302978 -77016
15323g7016P1592R3159j82066o5404j12069R0817J7104J41124m7504k38536l4911
$$ -77016 -5424 87735 -94331 -159735 -271804 -180987 -163883 -22759 -70263 -308799 -343710
15312c43710M3324Q5992j72407j05216j36314Q0069L10815K84560J4151j52202
$$ -343710 -300386 -214394 -386801 -492017 -628331 -548262 -237447 47113 61264 -90938
15302i0938l8914J34343L633k52285j13576K1630k6563j26544j43739L0364J59175
$$ -90938 -129852 4491 8124 -244161 -357737 -336107 -362670 -489214 -632953 -602589 -443414
15291d43414J62607k2532J10739J86733K81367L6916o2611l11857M8607J04529
$$ -443414 -280807 -303339 -192600 -5867 275500 312416 249805 -62052 -13445 91084
15281I1084k40623k27394J35630O0023N7628Q2855M91M8700L8094j93431q7267
$$ 91084 -149539 -376933 -241303 -181280 -123652 -40797 -40306 8394 46488 -146943 -234210
15270b34210l22248j20702J19013L62096K5960p8735L11614r7367k82343N8873
$$ -234210 -556458 -677160 -558147 -196051 -170091 -248826 62788 -34579 -316922 -258049
15260b58049N1702K40616P7822M6263p1767j58181l1098m1013Q1490l1198K02463
$$ -258049 -206347 34269 112091 158354 86587 -71594 -102692 -143705 -62215 -93413 109050
15249A09050j8863k55145q5664L02673J0225n878l318j57125j54561j04832o931
$$ 109050 90187 -164958 -250622 52051 62276 56398 53080 -104045 -258606 -363438 -370369
15238c70369R5741J05562J01849k52339j56909M4948L4600K17149K4274j33127
$$ -370369 -274628 -169066 -67217 -319556 -476465 -431517 -396917 -179768 -155494 -288621
15228b88621p0590J14751J54649J7651l293j4411J26185j36061j26319J60493
$$ -288621 -359211 -244460 -89811 -72160 -75453 -89864 36321 -99740 -226059 -65566
15218f5566k10254J924J9158K8144M1179j82520J07023R7382j08230j96268j58292
$$ -65566 -275820 -273896 -254738 -226594 -185415 -367935 -260912 -163530 -271760 -468028 -626320
15207f26320J85197J92914K1451m0545P3008R3308M5407Q2561l42491k94465m9828
$$ -626320 -441123 -248209 -226758 -267303 -194295 -100987 -55580 26981 -315510 -609975 -659803
15196f59803N1982J98254m6746j0542L1633p9524J50795J46774J83090r1429K5680
$$ -659803 -607821 -409567 -456313 -466855 -435222 -514746 -363951 -217177 -34087 -125516 -99836
15185i9836j24186j61260j7718L12078J8635o8976K3449J27521R0953J24794j87519
$$ -99836 -224022 -385282 -403000 -90922 -72287 -141263 -117814 9707 100660 225454 37935
15174C7935k47404k66123K10421M8207j82255o0417J1027K98385L12487P9704
$$ 37935 -209469 -475592 -265171 -216964 -399219 -459636 -448609 -150224 162263 241967
15164B41967k67303k00269j08631J86249K32366k6870j18836k22005r6345K45168
$$ 241967 -25336 -225605 -334236 -147987 84379 57509 -61327 -283332 -379677 -134509
15154a34509Q59j54568O8151Q4923j247J7454q7230k53629k4873j2253L02380
$$ -134509 -133650 -288218 -220067 -135144 -136391 -118937 -206167 -459796 -484669 -496922 -194542
15143a94542L39982K78741n0769o0425J44700j96012k39743Q8182k4329J8724
$$ -194542 145440 424181 373412 312987 457687 261675 21932 110114 85785 104509
15133A04509j02319k47398j45480p5829m5716l8824j80432k0918M4730J33834
$$ 104509 2190 -245208 -390688 -466517 -512233 -551057 -731489 -752407 -707677 -573843
15123e73843L39314J61370J83738n8030j24796j1842r4220Q5297n0281n2049j29128
$$ -573843 -234529 -73159 110579 52549 -72247 -84089 -178309 -93012 -143293 -195342 -324470
15112c24470k1127j17223N3457P7598J79608K04973j75504J0597j86291o4966
$$ -324470 -345597 -462820 -409363 -331765 -152157 52816 -122688 -112091 -298382 -363348
15102c63348r244N5677K12076J56065j07914j63634P5096L7117J2495r2931n8242
$$ -363348 -372592 -316915 -104839 51226 -56688 -220322 -145226 -108109 -95614 -188545 -246787
15091b46787j8334j79542j7006K21118l43k70454o3459K59001P217j10322O876
$$ -246787 -265121 -444663 -461669 -240551 -240894 -511348 -574807 -315806 -308589 -418911 -412035
15080d12035J49613J38095J07856n3159Q3122j33415M1192k51491j45996J43909
$$ -412035 -262422 -124327 -16471 -69630 13492 -119923 -78731 -330222 -476218 -332309
15070c32309N2965q258P0211p6385j527J43805q5750j09207p3867J02510k4375
$$ -332309 -279344 -287602 -217391 -293776 -295303 -151498 -237248 -346455 -420322 -317812 -342187
15059c42187j57982j71477Q1996L37347K57225q0896l17784k5016L5876j32131
$$ -342187 -500169 -671646 -589650 -252303 4922 -75974 -393758 -418774 -382898 -515029
15049e15029j02380J89229K74910Q4373j96915k052J22751J58698j64211O1031
$$ -515029 -617409 -428180 -153270 -68897 -265812 -267864 -145113 13585 -150626 -89595
15039h9595K38624k54352j73398J9529O6101J81140L39233N4536k1334j73129
$$ -89595 149029 -105323 -278721 -259192 -193091 -11951 327282 381818 360484 187355
15029A87355o1068j73965r615j91076M6161J03313O6386p9527K29307j86604m88833
$$ 187355 126287 -47678 -57293 -248369 -202208 -98895 -32509 -112036 117271 -69333 -558166
15018e58166k170K263k9073K47450o7850R1891L385K7528J30092K77070Q2775
$$ -558166 -560336 -558073 -587146 -339696 -407546 -315655 -312270 -284742 -154650 122420 205195
15007B05195k27883j05468J29074J3997J25763n0568q3093j50754O2008P8942
$$ 205195 -22688 -128156 918 14915 140678 90110 7017 -143737 -81729 -2787
14997b787j16440Q8977j3141M8605P4091q834J27307J08403j32986j63161j50596
$$ -2787 -119227 -30250 -43391 5214 79305 70471 197778 306181 173195 10034 -140562
14986a40562Q3357J23476k66970m9181N6806J39841k63365o1588J46351N7723
$$ -140562 -57205 66271 -200699 -249880 -193074 -53233 -316598 -378186 -231835 -174112
14976a74112J50137Q502k26356J931K75868q3370K9142R2897K4786k8152l19055
$$ -174112 -23975 -15473 -241829 -239898 35970 -47400 -18258 74639 99425 71273 -247782
14965b47782Q814k7559L7300p6139J2461J17050j71247M4771j9439j53807M6598
$$ -247782 -238968 -266527 -229227 -305366 -292905 -175855 -347102 -302331 -321770 -475577 -428979
14954d28979J74442J29520P0035j1091l4551R5570m4763k10240q5253r1651J57625
$$ -428979 -254537 -125017 -54982 -66073 -100624 -5054 -49817 -260057 -345310 -436961 -279336
14943b79336N4854j25616K5267J82187L26143o5058R3551M550j52061j22741k44550
$$ -279336 -224482 -350098 -324831 -142644 183499 118441 211992 216542 64481 -58260 -302810
14932c02810j62477k0644P6588J33028K90J75552K21901j61196k89967q0834J73508
$$ -302810 -465287 -485931 -409343 -276315 -276025 -100473 121428 -39768 -329735 -410569 -237061
14921b37061r332j30958K81685J62445K8391j67018K3403k6008R9424J50639o1278
$$ -237061 -246393 -377351 -95666 66779 95170 -71848 -48445 -74453 24971 175610 114332
14910A14332j46958M688Q9270m0668j15797J45464N4758j59352j68908o8649q0095
$$ 114332 -32626 -27938 61332 20664 -95133 50331 105089 -54263 -223171 -291820 -371915
14899c71915M3382P7625j00805j74621K41814J40229q6839J42717j03814n3590
$$ -371915 -328533 -250908 -351713 -526334 -284520 -144291 -231130 -88413 -192227 -245817
14889b45817P6262N12087j9197k02371r8457p4014l52878k13285l5053K30137
$$ -245817 -169555 342532 323335 120964 22507 -51507 -404385 -617670 -652723 -422586
14879d22586J46363r5185l715N5663L6010m2570j11560k16055Q2105J04451J13722
$$ -422586 -276223 -371408 -375123 -319460 -283450 -326020 -437580 -653635 -571530 -467079 -353357
14868c53357L3776R4880k40410n7720K26008L333J16289j8212k25145J51523L8673
$$ -353357 -319581 -224701 -465111 -522831 -296823 -293490 -177201 -195413 -420558 -269035 -230362
14857b30362r5699j159O2194l0056j0213K4379J39068J71132j03783j55700k15259
$$ -230362 -326061 -327220 -265026 -295082 -305295 -280916 -141848 29284 -74499 -230199 -445458
14846d45458L2056K14342M9102K06565R0794j16100l2662K426j9178j57753K7731
$$ -445458 -413402 -199060 -149958 56607 147401 31301 -1361 1065 -18113 -175866 -148135
14835a48135p4477k31719M0495O7991J19825J96242K1580J57160j13760O2651
$$ -148135 -222612 -454331 -413836 -345845 -226020 -29778 -8198 148962 35202 97853
14825I7853k97342K03545O6230k33416j21344Q6158k2422k3859n6499K26K7135
$$ 97853 -199489 4056 70286 -163130 -284474 -198316 -220738 -244597 -301096 -300870 -273735
14814b73735L11935j16963j03494o0950l9020j01834J50779J98187j69319k25287
$$ -273735 38200 -78763 -182257 -243207 -282227 -384061 -233282 -35095 -204414 -429701
14804d29701J01946K72843q414M2159q4437n6170K49583P5726j69133Q4794l9819
$$ -429701 -327755 -54912 -63326 -21167 -105604 -161774 87809 163535 -5598 79196 39377
14793C9377l25048O400J27449J49802l1287k22311N1643K17060n7130q7724P2104
$$ 39377 -285671 -279271 -151822 -2020 -33307 -255618 -203975 13085 -44045 -131769 -59665
14782e9665k20480L8160J40488l4075r872k95325m011J09261J4848J77621p4980
$$ -59665 -280145 -241985 -101497 -135572 -145444 -440769 -444780 -335519 -320671 -143050 -218030
14771b18030J44557J96002l4915j31684j75397n9609R1035j48113j36103j78817
$$ -218030 -73473 122529 87614 -44070 -219467 -279076 -188041 -336154 -472257 -651074
14761f51074O6724K10253R0427J29802P1853J6016p4778R9044J79845K15923J97840
$$ -651074 -584350 -374097 -283670 -153868 -82015 -65999 -140777 -41733 138112 354035 551875
14750E51875j28866k42469n5515j3073j18050m7510J52337m2587o1306j88309
$$ 551875 423009 180540 125025 111952 -6098 -53608 98729 56142 -5164 -193473
14740a93473Q656J00114J40206Q1904O6771j53040k02656k40621O097Q0142j40944
$$ -193473 -184817 -84703 55503 137407 204178 51138 -151518 -392139 -386042 -305900 -446844
14729d46844j88176p7875L2204J45009L13480j6404J04006p4818j43736N0905
$$ -446844 -635020 -712895 -680691 -535682 -222202 -238606 -134600 -209418 -353154 -302249
14719c02249P1265n0560K99170J83244j06987j13185j01385M0334L5583j35282
$$ -302249 -230984 -281544 17626 200870 93883 -19302 -120687 -80353 -44770 -180052
14709a80052J84206K42730M9851K45603M4670o0114l12490k13138J5161o0258
$$ -180052 4154 246884 296735 542338 587008 526894 214404 1266 16427 -43831
14699d3831j1450N9625J62945j30096r4304q1281L1141Q2056J09998L2149j54928
$$ -43831 -55281 4344 167289 37193 -57111 -138392 -107251 -25195 84803 116952 -37976
14688c7976j83293j21013Q8466K11806J46004j6074j56834P7973J37885k9702
$$ -37976 -221269 -342282 -253816 -42010 103994 87920 -68914 9059 146944 117242
14678A17242k95228k9928K1887k7478j77632m1472N2460K4978O8081L2284J24304
$$ 117242 -177986 -207914 -186027 -213505 -391137 -432609 -380149 -355171 -287090 -254806 -130502
14667a30502K16913J02168q0629n48134R094L08169P0495K1811M8032J3686Q6925
$$ -130502 86411 188579 107950 -440184 -431090 -122921 -52426 -30615 17417 31103 118028
14656A18028L9200R918l223j51091k39500J0613j28905o960l7074o179J83397
$$ 118028 157228 167146 163923 12832 -226668 -216055 -344960 -351920 -388994 -395173 -211776
14645b11776j55354j03711K25867L7333k4661m2136J05203J51832o4316p574P1035
$$ -211776 -367130 -470841 -244974 -207641 -232302 -274438 -169235 -17403 -81719 -89293 -18258
14634a8258K13714P0645o2076k01249m0405n1027l6972J55800J35240J49462L2359
$$ -18258 195456 266101 204025 2776 -37629 -88656 -125628 30172 165412 314874 347233
14623C47233m86027j51892K11150K93882K4377N0471j85104j55046o5579Q9966
$$ 347233 -138794 -290686 -79536 214346 238723 289194 104090 -50956 -116535 -26569
14613b6569Q3218K49328j444j58238k31222j02675M3022j95j1276N1451M9780
$$ -26569 56649 305977 304533 146295 -84927 -187602 -144580 -144775 -156051 -104600 -54820
14602e4820K33299J89562j55946j00235J70271J47095j89536j88628r1154j35665
$$ -54820 178479 368041 212095 111860 282131 429226 239690 51062 -40092 -175757
14592a75757L5838l2457J59687k21736j00112K02668Q2755K04120r3255k81710
$$ -175757 -139919 -172376 -12689 -234425 -334537 -131869 -49114 155006 61751 -219959
14582b19959k09913K81116J42981j31238k38947j65359M9133M6486J04648K14680
$$ -219959 -429872 -148756 -5775 -137013 -375960 -541319 -492186 -445700 -341052 -126372
14572a26372n214K5845M4196K35893k21664j65053M8659L801J1983n6494N1644
$$ -126372 -131586 -105741 -61545 174348 -47316 -212369 -163710 -159909 -147926 -204420 -152776
14561a52776Q2278M4977J86704J15716j80264k29930L6054R5166j01626o5361
$$ -152776 -70498 -25521 161183 276899 96635 -133295 -97241 -2075 -103701 -169062
14551a69062j00820J27701J3159O9924J29336N6814k05571k43596n5544K33446
$$ -169062 -269882 -142181 -129022 -59098 70238 127052 -78519 -322115 -377659 -144213
14541a44213J77427j30348k60609k4119k5883Q2551J44428P6360K66213j76175
$$ -144213 33214 -97134 -357743 -381862 -407745 -325194 -180766 -104406 161807 -14368
14531a4368k62068j08716L2652P0478o6601L92697K92713j89256l27166p7115
$$ -14368 -276436 -385152 -352500 -282022 -348623 44074 336787 147531 -179635 -256750
14521b56750J0274k0374J9391J84094N0800j21772K4623L105j32995M4821K7232
$$ -256750 -246476 -266850 -247459 -63365 -12565 -134337 -109714 -106609 -239604 -194783 -167551
14510a67551O2895o3182j52239r5942j44414K00972K02589L0008o903Q2324p7709
$$ -167551 -104656 -167838 -320077 -416019 -560433 -359461 -156872 -126864 -133767 -51443 -129152
14499a29152K18151N9313p4733j08937r9168K96329J91740j59429j19296r2953
$$ -129152 88999 148312 73579 -35358 -134526 161803 353543 194114 74818 -18135
14489a8135j07107m2505R3432j8721m8024m86599J08068M57040J18064j03437
$$ -18135 -125242 -167747 -74315 -93036 -141060 -627659 -519591 -62551 55513 -47924
14479d7924l25011p7438L62450J12489k79420o9919N1447p7857K6883P2427J2741
$$ -47924 -372935 -450373 -87923 24566 -254854 -324773 -273326 -351183 -324300 -251873 -239132
14468b39132L0735R0026l20132J04883J59470R9155L9816J28096J02815m1820
$$ -239132 -208397 -118371 -438503 -333620 -174150 -74995 -35179 92917 195732 153912
14458A53912N4772O2110p4723l29218k98694J36091K36266K1872J29340N4704
$$ 153912 208684 270794 196071 -133147 -431841 -295750 -59484 -37612 91728 146432
14448A46432j69006p4148r6452j20588Q4309J06345o1549j38801J40174J89026
$$ 146432 -22574 -96722 -193174 -313762 -229453 -123108 -184657 -323458 -183284 5742
14438E742L7071N5702k09856j17432n6054j61579o1054L69150J87588J38309L9002
$$ 5742 42813 98515 -111341 -228773 -284827 -446406 -507460 -138310 49278 187587 226589
14427B26589j85808k66838k26198J57887K93401l9424r3643J24974M7259k1240
$$ 226589 40781 -226057 -452255 -294368 -967 -40391 -134034 -9060 38199 16959
14417A6959m6104N7428K0485o0156r9435j79389K4991O3730J1875O5592M6508
$$ 16959 -29145 28283 48768 -11388 -110823 -290212 -265221 -201491 -189616 -124024 -77516
14406g7516J30115J34807K0599m109k91860R428j54935k37984M5187P5091J29207
$$ -77516 52599 187406 208005 203896 -87964 -78536 -233471 -471455 -426268 -351177 -221970
14395b21970J28821J1298j33037j52542l7918l47072j55814M23588J75267L1093
$$ -221970 -93149 -81851 -214888 -367430 -405348 -752420 -908234 -484646 -309379 -278286
14385b78286K25030P9801j46018r5384J56830J04535q2898j39438j51293J2763
$$ -278286 -53256 26545 -119473 -214857 -58027 46508 -36390 -175828 -327121 -314358
14375c14358J56731k2408Q8021J85876j7023l9868K39P6l3407Q3281J36593J6055
$$ -314358 -157627 -180035 -92014 93862 76839 36971 37210 37286 3879 87160 223753 239808
14363B39808p9883j53731j093k686L7458j06566j70826J88837J5515k09138o2729
$$ 239808 159925 6194 5101 2415 39873 -66693 -237519 -48682 -33167 -242305 -305034
14352c05034N9137J22329P4901k44211k11649Q7214R162l7521J21617J10362j02443
$$ -305034 -245897 -123568 -48667 -292878 -504527 -417313 -408151 -445672 -324055 -213693 -316136
14341c16136o6564K04632K62316Q0365j96230k00911l9373m9435r5065J29424
$$ -316136 -382700 -178068 84248 164613 -31617 -232528 -271901 -321336 -416401 -286977
14331b86977J60366k2744r2691j10277o9823N9777K21821j36271J24759Q5816
$$ -286977 -126611 -149355 -242046 -352323 -422146 -362369 -140548 -276819 -152060 -66244
14321f6244N7833k63614q4210r8824j57678j05967k810L75239k7867j6865O0677
$$ -66244 -8411 -272025 -356235 -455059 -612737 -718704 -721514 -346275 -374142 -391007 -330330
14310c30330o8102R9749r0619Q2982J43773J55428J07563k42034J1832L80626
$$ -330330 -398432 -298683 -389302 -306320 -162547 -7119 100444 -141590 -129758 250868
14300B50868K8968L4297n6441j68492r362O9764k08302k8802j62111L1915J48827
$$ 250868 279836 314133 257692 89200 79838 149602 -58700 -87502 -249613 -217698 -68871
14289f8871Q185O0779j1231l7000k114p2457J26490M1128j79552q7261J56568
$$ -68871 -60686 93 -11138 -48138 -50252 -122709 3781 44909 -134643 -221904 -65336
14278f5336J85726j74132j49532j17514J7286Q2155J17061N3051J49468N6454
$$ -65336 120390 -53742 -203274 -320788 -303502 -221347 -104286 -51235 98233 154687
14268A54687k26825p2755j6999j55134J78764J46805J47785k32231j34876j61243
$$ 154687 -72138 -144893 -161892 -317026 -138262 8543 156328 -75903 -210779 -372022
14258c72022j84069L3265R0890N2184R0568J87411J79047k6405n2932M9291P0422
$$ -372022 -556091 -522826 -431936 -379752 -289184 -101773 77274 50869 -2063 47228 117650
14247A17650O9542r8282p6106j70849o4806J60478J43407j52835M6606k3021m7950
$$ 117650 187192 88910 12804 -158045 -222851 -62373 81034 -71801 -25195 -48216 -96166
14236i6166Q6201o8650o8387O0381k7745k9448J60199Q1656p3781L2044M3444
$$ -96166 -9965 -78615 -147002 -86621 -114366 -143814 16385 98041 24260 56304 99748
14225I9748o2386K50579M6524M370l07692j07570K7995j03595r7470O329J07682
$$ 99748 37362 287941 334465 338835 31143 -76427 -48432 -152027 -249497 -243168 -135486
14214a35486J12909j03374L4377M2972J19715k12205k40480n0388J89672j3065
$$ -135486 -22577 -125951 -91574 -48602 71113 -141092 -381572 -431960 -242288 -255353
14204b55353j05896j6892R51L32687J38552k05080l3448K30479K05612j28957
$$ -255353 -361249 -378141 -377190 -44503 94049 -111031 -144479 86000 291612 162655
14194A62655p8127P4360k21496K3745N03188K9123k91326j92661j4730J15442
$$ 162655 84528 158888 -62608 -38863 464325 493448 202122 9461 -5269 110173
14184A10173m526k52164J20613N9072N3342K88529J05958l53356k40443J9775
$$ 110173 105647 -146517 -25904 33168 86510 375039 480997 127641 -112802 -93027
14174i3027J82150j34239j98793J44432K93327M9749k54315j8073j12518j05361
$$ -93027 89123 -45116 -243909 -99477 193850 243599 -10716 -28789 -141307 -246668
14164b46668K3618M2848M8805J20500j4016j79095m0663M8777m6772L6376K24002
$$ -246668 -223050 -180202 -131397 -10897 -24913 -204008 -244671 -195894 -242666 -206290 17712
14153A7712J42281k43817o5470J51930K6512J97661N734k69376q4496j34139J74171
$$ 17712 159993 -83824 -149294 2636 29148 226809 232543 -36833 -121329 -255468 -81297
14142h1297N9593M760R6750k6844k4633K8260r3814k16458O597L8458R8450J6384
$$ -81297 -21704 -16944 79806 52962 28329 56589 -37225 -253683 -247086 -208628 -110178 -93794
14130i3794R8115K07666J20540j97660m17269k08533M9523K41823j33687j64612
$$ -93794 4321 211987 332527 134867 -282402 -490935 -441412 -199589 -333276 -497888
14120d97888n8879O3021n8959L31217K63610j48777l6698P6290J54288N2006k8231
$$ -497888 -556767 -493746 -552705 -221488 42122 -106655 -143353 -67063 87225 139231 111000
14109A11000P9420K16843O0614J42321l4862l10885j50274m9530j01031j06541
$$ 111000 190420 407263 467877 610198 575336 264451 114177 64647 -36384 -142925
14099a42925k11310p4419J65254J30182K8434j33551l208O4894J3483k83867j27864
$$ -142925 -354235 -428654 -263400 -133218 -104784 -238335 -241543 -176649 -163166 -447033 -574897
14088e74897k9201K51399J89597J80462M5854j01678k80667j28874Q7752q9511
$$ -574897 -604098 -352699 -163102 17360 63214 -38464 -319131 -448005 -360253 -449764
14078d49764J83625J73131j35592l8601j5588M0541N782O4093l02997j05284N3754
$$ -449764 -266139 -93008 -228600 -267201 -282789 -242248 -236466 -172373 -475370 -580654 -526900
14067e26900K29772J13420R4617m2494K0560R0173K2155K9654r0020P543O7661
$$ -526900 -297128 -183708 -89091 -131585 -111025 -20852 1303 30957 -59063 -51520 16141
14056A6141J13729o19k47053P8939K72834J68212l5620k53803j84810j32079O8011
$$ 16141 129870 129251 -117802 -38863 233971 402183 366563 112760 -72050 -204129 -136118
14045a36118M4816J26485P9393J06076K9198n982m6060l8174m8910M4609J06830
$$ -136118 -91302 35183 114576 220652 249850 243868 197808 159634 110724 155333 262163
14034B62163R9868R5573j24051j12617L8647K28139p1382l5072n9461k03092M7848
$$ 262163 362031 457604 333553 220936 259583 487722 416340 381268 321807 118715 166563
14023A66563J9218j79820j60910P896P4664j2770j37351k5263o3398j50190J21792
$$ 166563 185781 5961 -154949 -147053 -72389 -85159 -222510 -247773 -311171 -461361 -339569
14012c39569K47372J79486L327J25836N4357K7878k75134j26786N3416R1773j22357
$$ -339569 -92197 87289 90616 216452 270809 298687 23553 -103233 -49817 41956 -80401
14001h0401O7415r4007n3042j47803j19970K61867J97894k3242n2651J95042n4603
$$ -80401 -12986 -106993 -160035 -307838 -427808 -165941 31953 8711 -43940 151102 96499
13990I6499k46406j51583j48976K2514n6063J29012K51304K08108R9389K6266
$$ 96499 -149907 -301490 -450466 -427952 -484015 -355003 -103699 104409 203798 230064
13980B30064j17501k03667J94592q2030r4023j51122k96377o8608K6063L58190
$$ 230064 112563 -91104 103488 21458 -72565 -223687 -520064 -588672 -562609 -204419
13970b04419o242k2391r2306p5240K1970J09713J52173k16029m408K7810n6356
$$ -204419 -210661 -233052 -325358 -400598 -378628 -268915 -116742 -332771 -337179 -309369 -365725
13959c65725J88320J11637J42727r840n1450Q6227j78014k06628m8311O0443K10442
$$ -365725 -177405 -65768 76959 67119 15669 101896 -76118 -282746 -331057 -270614 -60172
13948f0172j0795N9577k14153q9246r9884P8866J71789K58192J49119M1164R6929
$$ -60172 -70967 -11390 -225543 -314789 -414673 -335807 -164018 94174 243293 284457 381386
13937C81386j53381k01790P6121l3959l715N0357O9404J10209n3446j67693K0840
$$ 381386 228005 26215 102336 68377 64662 115019 184423 294632 241186 73493 94333
13926I4333O8837M4823J12102L3383m3304j45292l9339M9350m9821K1340O0921
$$ 94333 163170 207993 320095 353478 310174 164882 125543 174893 125072 146412 207333
13915B07333K1385p5103M665k23328p6808j14775J05495l0817k9749R1626m5244
$$ 207333 228718 153615 158280 -65048 -141856 -256631 -151136 -181953 -211702 -120076 -165320
13904a65320O2007J40184j17704j3906K82818p5556j24958K06876l1681p8888
$$ -165320 -103313 36871 -80833 -94739 188079 112523 -12435 194441 162760 83872
13894H3872n6173q5054o7305J2767j09125K26210L44811p632j36422M0620K1984
$$ 83872 27699 -57355 -124660 -111893 -221018 5192 350003 342371 205949 246569 268553
13883B68553n3686j05245J43819m4693j64393m0087j92342l4119j06823l328Q4542
$$ 268553 214867 109622 253441 208748 44355 4268 -188074 -222193 -329016 -332344 -247802
13872b47802J99732J43658J76204j51754L791P4052m3212p6650j56665j49050
$$ -247802 -48070 95588 271792 120038 123829 197881 154669 78019 -78646 -227696
13862b27696J72981L5847j23470j03493p0012q5344p27j3982J63419P2264q2714
$$ -227696 -54715 -18868 -142338 -245831 -315843 -401187 -401914 -415896 -252477 -180213 -262927
13851b62927M2320r6688J83954J73098J9739j64236J49339O0820p4992k5194j97994
$$ -262927 -220607 -317295 -133341 39757 59496 -104740 44599 105419 30427 5233 -192761
13840a92761o9796L0592L5987J4476O6456j04321O5829j35354P371J93915K77643
$$ -192761 -262557 -231965 -195978 -181502 -115046 -219367 -153538 -288892 -281521 -87606 190037
13829A90037n6675j4674R7229R4960o5454k35613m0568l781R5906J6410o003m7615
$$ 190037 133362 118688 215917 310877 245423 9810 -30758 -34539 61367 77777 71774 24159
13817B4159P6917M5555k26242j47715J7718j06121j46881P5366K46553J81436
$$ 24159 101076 146631 -79611 -227326 -209608 -315729 -462610 -387244 -140691 40745
13807D0745k70563j37591N9028Q3694K78132J19277r3993K04897K34453k21421
$$ 40745 -229818 -367409 -308381 -224687 53445 172722 78729 283626 518079 296658
13797B96658r1536M9702k43214l49242m3490j2484N5094J41419J05404k6159j01336
$$ 296658 205122 254824 11610 -337632 -381122 -393606 -338512 -197093 -91689 -117848 -219184
13786b19184j10183p6870J31009J62120j17525o1474J09192Q6290Q2092k29988
$$ -219184 -329367 -406237 -275228 -113108 -230633 -292107 -182915 -96625 -14533 -244521
13776b44521J22897Q8722r4833J24904R8758Q1053k5506o5024k45467l06597k26721
$$ -244521 -121624 -32902 -127735 -2831 95927 176980 151474 86450 -159017 -465614 -692335
13765f92335J98659L22136N2552m5614J77043J33905J46976k70915p1555R9025
$$ -692335 -493676 -171540 -118988 -164602 12441 146346 293322 22407 -49148 49877
13755D9877Q6992r6911r1382K0622j68283P4562J20568r4314K8740J8216n4697
$$ 49877 136869 39958 -51424 -30802 -199085 -124523 -3955 -98269 -69529 -51313 -106010
13744a06010J39890J2475j15180J9635l2060j08456N3O5070L53148K24830j0592
$$ -106010 33880 46355 -68825 -49190 -81250 -189706 -189653 -124583 228565 453395 442803
13733D42803j05000j36737j03003P2344O0434P5094P7715p0150m20382k77327
$$ 442803 337803 201066 98063 170407 230841 305935 383650 313500 -106882 -384209
13723c84209J50143j93008j42478P2150K60239J2558p802J97795K98529j4605
$$ -384209 -234066 -427074 -569552 -497402 -237163 -224605 -232407 -34612 263917 249312
13713B49312K7391L637j52799o062j3935M4446p0309m3466m4313P7744J40203
$$ 249312 276703 280340 127541 121479 107544 151990 81681 38215 -6098 71646 211849
13702B11849j83594k14968l4741l9014k2874M0831j71885J90743L12069p9529
$$ 211849 28255 -186713 -221454 -260468 -283342 -242511 -414396 -223653 88416 8887
13692H887L4059p0726j17137m8360M5624R3457p5777n0235r7179j33575J49015
$$ 8887 42946 -27780 -144917 -193277 -147653 -54196 -129973 -180208 -277387 -410962 -261947
13681b61947K93364R8856j88801q5851P1114K72326J47004k9748j21408j75986
$$ -261947 31417 130273 -58528 -144379 -73265 199061 346065 316317 194909 18923
13671A8923J15219J89392k4907k13267j13j45663j86124R5171r7946L17677J43361
$$ 18923 134142 323534 298627 85360 85247 -60416 -246540 -151369 -249315 68362 211723
13660B11723j69556k00242P243J10404o2735J11868o8625J23593j0469k59218
$$ 211723 42167 -158075 -150832 -40428 -103163 8705 -59920 63673 53204 -206014
13650b06014P1440K57414R9062J58840j22282j44938j80175j08070o205o973J03820
$$ -206014 -134574 122840 221902 380742 258460 113522 -66653 -174723 -180928 -187901 -84081
13639h4081j62806k5856q2391N0611P8697k90r0447N7558j582l8153p7660r8531
$$ -84081 -246887 -272743 -355134 -304523 -225826 -226116 -316563 -259005 -260587 -298740 -376400 -474931
13627d74931Q4482K42248J2358N3790J90546J8620j32034o7570j13504k466J18927
$$ -474931 -390449 -148201 -135843 -82053 108493 127113 -4921 -72491 -185995 -188461 -69534
13616f9534P5421J65977m4833j73771m6297O7322J80574L00233J11826k08908
$$ -69534 5887 171864 127031 -46740 -93037 -25715 154859 455092 566918 358010
13606C58010l97539p1885R5554K06484M660l35429l8629K2255J22934J15280J57795
$$ 358010 -39529 -111414 -15860 190624 195284 -140145 -178774 -156519 -33585 81695 239490
13595B39490p8232j47965J72767j2094O1123J2804M8031q4895k9904K1297P2868
$$ 239490 161258 13293 186060 173966 235089 247893 295924 211029 181125 202422 275290
13584B75290j69529m08939m8257L19197Q8787j69116k29253J02581J63616J75964
$$ 275290 105761 -303178 -351435 -32238 56549 -112567 -341820 -239239 -75623 100341
13574A00341L6374q083K2928o3091l3861j31064j62314k92411j28379Q0921J01000
$$ 100341 136715 128632 151560 88469 54608 -76456 -238770 -531181 -659560 -578639 -477639
13563d77639M7990Q9196P7307K45948j59282k04298N6835j46901L06595J39063
$$ -477639 -429649 -340453 -263146 -17198 -176480 -380778 -323943 -470844 -164249 -25186
13553b5186J77450j10753R2165r0507k28581k98404J30746J54825L05666K05480
$$ -25186 152264 41511 133676 43169 -185412 -483816 -353070 -198245 107421 312901
13543C12901p8977o5117L3497k09701j41768L6035P8331r348J09209o2329j32516
$$ 312901 233924 168807 202304 -7397 -149165 -113130 -34799 -44147 65062 2733 -129783
13532a29783R629q6401J34753L1872M8440j25622P2237K95377m12026m68739j01497
$$ -129783 -120154 -206555 -71802 -39930 8510 -117112 -44875 250502 -161524 -630263 -731760
13521g31760J37501K10863K23570o2995J1408j27109j21446K24393K8680m7498
$$ -731760 -594259 -383396 -159826 -222821 -211413 -338522 -459968 -235575 -206895 -254393
13511b54393K8461J50095N5625L9934j37382j14271K39413J70483j73671r9463
$$ -254393 -225932 -75837 -20212 19722 -117660 -231931 7482 177965 4294 -95169
13501i5169M5450j92873K9071K02536R0824n0699j84978j19330l7002j07287L0112
$$ -95169 -49719 -242592 -213521 -10985 79839 29140 -155838 -275168 -312170 -419457 -389345
13490c89345R3288K13371R3939K5837o5134M4362p8150P5070l811R736J10826
$$ -389345 -296057 -82686 11253 37090 -28044 16318 -61832 13238 9427 19163 129989
13479A29989j60029j81821J42428K11589j45464J91403K12564k85249J8033n0175
$$ 129989 -30040 -211861 -69433 142156 -3308 188095 400659 115410 133443 83268
13469H3268p6655n7372k82688J41057j18943l26644P917J16878J51710L7663J02073
$$ 83268 6613 -50759 -333447 -192390 -311333 -637977 -630060 -513182 -361472 -323809 -221736
13458b21736L0761J66093P4064K15006J42144j94220l47426j13614N7858Q8438
$$ -221736 -190975 -24882 49182 264188 406332 212112 -135314 -248928 -191070 -102632
13448a02632J87963K1108j56314l6114l0078k35547J05853J97320o9862j59052
$$ -102632 85331 106439 -49875 -85989 -116067 -351614 -245761 -48441 -118303 -277355
13438b77355j7066j17011K51687J59220j09455J19632K4414n0905m7950M6546
$$ -277355 -294421 -411432 -159745 -525 -109980 9652 34066 -16839 -64789 -18243
13428a8243N559N6125k00389j19292J44925L277k9676K19813K06452j65419j20802
$$ -18243 -12684 43441 -156948 -276240 -131315 -128038 -157714 62099 268551 103132 -17670
13417a7670l2261r0632L3702J46025J69679P1323j17450K06535n3818j95438j35520
$$ -17670 -49931 -140563 -106861 39164 208843 280166 162716 369251 315433 119995 -15525
13406a5525M3021j24828j86961J83836K09060K19376m8853l7139k54175j98775
$$ -15525 27496 -97332 -284293 -100457 108603 327979 279126 241987 -12188 -210963
13396b10963K64086O2867J15456k0571m500k87722j45139J76427J15652K20691
$$ -210963 53123 115990 231446 210875 206375 -81347 -226486 -50059 65593 286284
13386B86284j40509j34268j45448O730L8922l2796K4448J03596j82009K71396
$$ 286284 145775 11507 -133941 -127211 -88289 -121085 -96637 6959 -175050 96346
13376I6346O6789k83430j68695J99473j17277j66455K24581L16715N7591J39541
$$ 96346 163135 -120295 -288990 -89517 -206794 -373249 -148668 168047 225638 365179
13366C65179j23281l34752j53026o5740m3190N0654P2975j20550J80653K80935
$$ 365179 241898 -92854 -245880 -311620 -354810 -304156 -231181 -351731 -171078 109857
13356A09857O3409M1447P657J5028j39023j54840r6209J8032J22957J51916j02074
$$ 109857 173266 214713 222370 237398 98375 -56465 -152674 -134642 -11685 140231 38157
13345C8157j1054J04431j23971j20888j5873P6194K84109j01093P8908O1232K29412
$$ 38157 27103 131534 7563 -113325 -129198 -53004 231105 130012 208920 270152 499564
13334D99564n4410k15719J20486j12210k1472n5581k05047K20005K12605j38396
$$ 499564 445154 229435 349921 237711 216239 160658 -44389 175616 388221 249825
13324B49825j44286J60038J49839J39091p2842j17591j0728J9525k37439k79913
$$ 249825 105539 265577 415416 554507 481665 364074 353346 372871 135432 -144481
13314a44481j50337J76849J90616j12715l35153j6521K23953L46020K57369n7857
$$ -144481 -294818 -117969 72647 -40068 -375221 -391742 -167789 178231 435600 377743
13304C77743k33727j20622j32951m2914K72693j03782k3106o0389J07909L0562
$$ 377743 144016 23394 -109557 -152471 120222 16440 -6666 -67055 40854 71416
13294G1416P273l38720j66357J78188J06450K26533n6907j61225j33694K75315
$$ 71416 78689 -260031 -426388 -248200 -141750 84783 27876 -133349 -267043 8272
13284H272Q2451j62925j56121J50269Q6748K38684k36782Q412J21131L7803M409
$$ 8272 90723 -72202 -228323 -78054 8694 247378 10596 19008 140139 177942 182351
13273A82351J3893J57831j83540j05789R4676o2330N5726P8903k94511J28600
$$ 182351 196244 354075 170535 64746 159422 97092 152818 231721 -62790 65810
13263F5810K64507o0235j72237J87194j79079r2454K57574j4827j83121k00467
$$ 65810 330317 270082 97845 285039 105960 13506 271080 256253 73132 -127335
13253a27335Q8119J06340j36401M93567L03556k09206k52583J9636k750j37227
$$ -127335 -39216 67124 -69277 424290 727846 518640 266057 285693 282943 145716
13243A45716k32380j49316j17612R9195J01217L4071J00910J05272P0229J3480
$$ 145716 -86664 -235980 -353592 -254397 -153180 -119109 -18199 87073 157302 170782
13233A70782n5102k06879o5783L2375J17424J27193o5774j56623R4216J24931
$$ 170782 115680 -91199 -156982 -124607 -7183 120010 54236 -102387 -8171 116760
13223A16760R2081n7866p3783k7409L3363K9621J43278J56268j08166j94734r9791
$$ 116760 208841 150975 77192 49783 83146 112767 256045 412313 304147 109413 9622
13212I622k6952K28528k1354j65157K9541J31463j53606N5141j78447J27818K25723
$$ 9622 -17330 211198 189844 24687 54228 185691 32085 87226 -91221 36597 262320
13201B62320j96052j56602k25241J16833R3193J58954J01492j37639j92802p5382
$$ 262320 66268 -90334 -315575 -198742 -105549 53405 154897 17258 -175544 -250926
13191b50926K12189L57730m5152o8215o7765N4349j34776N5863Q3948K1157J4004
$$ -250926 -38737 318993 273841 205626 137861 192210 57434 113297 197245 218402 232406
13180B32406J33009M9141J19003j45585J24095J60229O8690j47986l49803k20260
$$ 232406 365415 414556 533559 387974 512069 672298 740988 593002 243199 22939
13170B2939Q3996j41288K6984N4159J6499j04060L5891r9749J91413Q4910L1306
$$ 22939 106935 -34353 -7369 46790 63289 -40771 -4880 -104629 86784 171694 203000
13159B03000Q5936K13119l29123P0891J33252K6424n416J65453O762j44918j98940
$$ 203000 288936 502055 172932 243823 377075 403499 398083 563536 570298 425380 226440
13148B26440k53807M2580J59682J03176n4819K9151j93905N3165O7777q9399n6217
$$ 226440 -27367 15213 174895 278071 223252 252403 58498 111663 179440 90041 33824
13137C3824K43987j41930l2878L89585J5230l3096P3050M6255n7540n3990J44617
$$ 33824 277811 135881 103003 492588 507818 474722 547772 594027 536487 482497 627114
13126F27114J14708N2746j84029k52283J03955J62994k33478k39720j3884n750
$$ 627114 741822 794568 610539 358256 462211 625205 391727 152007 138123 132373
13116A32373L1601J54545P110j56888n1936R6664p754o8578J05056j50041J71165
$$ 132373 163974 318519 325629 168741 116805 213469 205715 137137 242193 92152 263317
13105B63317J58847k92290q4795M6920l7947j90978M9072K22346K32840J7265
$$ 263317 422164 129874 45079 91999 54052 -136926 -87854 134492 367332 384597
13095C84597j28956j15460M8001j20077j52365j51574j1387N49587o830L6671
$$ 384597 255641 140181 188182 68105 -84260 -235834 -247221 302366 295536 332207
13085C32207J02060P4431q6907j73342R3182O1244l3915l5860m4587N1930J79909
$$ 332207 434267 508698 421791 248449 341631 402875 368960 333100 288513 340443 520352
13074E20352M0391J21999O3906J01724n00631k24645j64429m0321L40428J70512
$$ 520352 560743 682742 746648 848372 347741 123096 -41333 -81654 258774 429286
13064D29286r1992p2876J0567q4041L5520R7177m7328m396K41428L54984j35437
$$ 429286 337294 264418 274985 190944 226464 323641 276313 271917 513345 868329 732892
13053G32892j7744j39199n7323J90782r7186M6069n922j29951j13590k0685J8700
$$ 732892 715148 575949 518626 709408 612222 658291 652369 522418 408828 388143 406843
13042D06843P5288m6926r6016P9605o8622p8156o2426o6104K10712J44992K20186
$$ 406843 482131 435205 339189 418794 350172 272016 209590 143486 354198 499190 719376
13031G19376r693k05974j17713K11846Q1100j6207k24342j75044J10772k41250
$$ 719376 709683 503709 385996 597842 678942 662735 438393 263349 374121 132871
$$ [...]
##END NTUPLES=NMR SPECTRUM
##END=
