##TITLE=Analysis number 310281
Compound Code cc 40122
Book Reference 350/140/2
Project Code adrs
Chemist Name chrisr
##JCAMPDX= 6.0         $$ Bruker NMR JCAMP-DX V2.0
##DATA TYPE= NMR SPECTRUM
##DATA CLASS= NTUPLES
##ORIGIN= Bruker BioSpin GmbH
##OWNER= NMR
$$ XWIN-NMR		Version 3.5
$$ Thu Jun 16 10:51:19 2005 GMT Daylight Time (UT+1h)  MAYBRIDGE\NMR@NMR_250MHZ
##.OBSERVE FREQUENCY= 250.131544655141
##.OBSERVE NUCLEUS= ^1H
##.ACQUISITION MODE= SIMULTANEOUS (DQD)
##.ACQUISITION SCHEME= undefined
##.AVERAGES= 16
##.DIGITISER RES= 18
##SPECTROMETER/DATA SYSTEM= dpx250
##.PULSE SEQUENCE= zg30
##.SOLVENT NAME= CDCl3
##.SHIFT REFERENCE= (INTERNAL, CDCl3, 0, 16.522)
##AUDIT TRAIL= $$ (NUMBER, WHEN, WHO, WHERE, WHAT)
$$ ##TITLE= Audit trail, XWIN-NMR		Version 3.5
$$ ##JCAMPDX= 5.01
$$ ##ORIGIN= Bruker BioSpin GmbH
$$ ##OWNER= NMR
$$ C:\u/data/dgb/nmr/ADRS/4100/pdata/1/auditp.txt
$$ ##AUDIT TRAIL=  $$ (NUMBER, WHEN, WHO, WHERE, WHAT)
(   1,<2005-06-16 10:50:58.33 +100>,<MAYBRIDGE\NMR>,<NMR_250MHZ>,
      <created by zg, POWCHK disabled, PULCHK disabled
       configuration hash MD5:
       62 19 C7 07 E1 42 D1 B7 37 6C 3D D0 77 39 F9 E6
       data hash MD5: 64K
       97 D1 4F 20 79 0F AF 50 C7 CB 30 9B DB 7B 98 25>)
(   2,<2005-06-16 10:51:10.54 +100>,<MAYBRIDGE\NMR>,<NMR_250MHZ>,
      <Start of raw data processing
       ef LB = 0.3 FT_mod = 6 PKNL = 1 SI = 32K 
       data hash MD5: 32K
       64 F5 C5 40 F6 6E 2F 1E 11 3E E4 F0 C1 CF 6E FD>)
(   3,<2005-06-16 10:51:12.36 +100>,<MAYBRIDGE\NMR>,<NMR_250MHZ>,
      <apk 
       data hash MD5: 32K
       A4 46 86 DC B7 BE 53 A5 ED 92 15 2A 5B 8F A6 A2>)
(   4,<2005-06-16 10:51:13.19 +100>,<MAYBRIDGE\NMR>,<NMR_250MHZ>,
      <abs ABSG = 5 
       data hash MD5: 32K
       D3 5F D1 7E 26 8B DE 8E E7 30 83 E7 04 9D 2F 26>)
$$ ##END=
$$ 
$$ hash MD5
$$ D6 6E 8D B8 B1 EC C7 64 D1 47 F8 DB CC 24 C4 C8
##$RELAX= 
##$RELAX= 
##$RELAX= 
##$RELAX= 
##$RELAX= 
##$RELAX= 
##$RELAX= 
$$ Bruker specific parameters
$$ --------------------------
##$DU= <C:\u>
##$EXPNO= 4100
##$NAME= <ADRS>
##$PROCNO= 1
##$TYPE= <nmr>
##$USER= <dgb>
##$AMP= (0..31)
100 100 100 100 100 100 100 100 100 100 100 100 100 100 100 100 100 100 
100 100 100 100 100 100 100 100 100 100 100 100 100 100 
##$AQSEQ= 0
##$AQ_mod= 3
##$AUNM= <au_zg>
##$AUTOPOS= <11 >
##$BF1= 250.13
##$BF2= 250.13
##$BF3= 250.13
##$BF4= 250.13
##$BF5= 500.13
##$BF6= 500.13
##$BF7= 500.13
##$BF8= 500.13
##$BYTORDA= 1
##$CFDGTYP= 0
##$CFRGTYP= 5
##$CHEMSTR= <none>
##$CNST= (0..31)
1 1 145 1 1 1 1 1 1 1 1 1 1 1 1 1 1 1 1 1 1 1 1 1 1 1 1 1 1 1 1 1 
##$CPDPRG= <>
##$CPDPRG1= <>
##$CPDPRG2= <>
##$CPDPRG3= <>
##$CPDPRG4= <mlev>
##$CPDPRG5= <mlev>
##$CPDPRG6= <mlev>
##$CPDPRG7= <mlev>
##$CPDPRG8= <mlev>
##$CPDPRGB= <>
##$CPDPRGT= <>
##$D= (0..31)
0 1 0 0 0 0 0 0 0 0.06 0 0 0 0 0 0 0.0002 0 0 0 0 0 0 0 0 0 0 0 0 0 0 
0 
##$DATE= 1118915457
##$DBL= (0..7)
120 120 120 120 120 120 120 120 
##$DBP= (0..7)
150 150 150 150 150 150 150 150 
##$DBP07= 0
##$DBPNAM0= <>
##$DBPNAM1= <>
$$ [...]
##$SUBNAM7= <"">
##$SUBNAM8= <"">
##$SUBNAM9= <"">
##$SW= 20.6930455092707
##$SWIBOX= (0..15)
0 0 3 0 0 0 0 0 0 0 0 0 0 0 0 0 
##$SW_h= 5175.983436853
##$TD= 65536
##$TD0= 1
##$TE= 295.16
##$TE2= 300
##$TE3= 300
##$TEG= 300
##$TL= (0..7)
0 120 120 120 120 120 120 120 
##$TP= (0..7)
150 150 150 150 150 150 150 150 
##$TP07= 0
##$TPNAME0= <>
##$TPNAME1= <>
##$TPNAME2= <>
##$TPNAME3= <>
##$TPNAME4= <>
##$TPNAME5= <>
##$TPNAME6= <>
##$TPNAME7= <>
##$TPOAL= (0..7)
0.5 0.5 0.5 0.5 0.5 0.5 0.5 0.5 
##$TPOFFS= (0..7)
0 0 0 0 0 0 0 0 
##$TUNHIN= 0
##$TUNHOUT= 0
##$TUNXOUT= 0
##$USERA1= <user>
##$USERA2= <user>
##$USERA3= <user>
##$USERA4= <user>
##$USERA5= <user>
##$V9= 5
##$VALIST= <valist>
##$VCLIST= <CCCCCCCCCCCCCCC>
##$VD= 0
##$VDLIST= <DDDDDDDDDDDDDDD>
##$VPLIST= <PPPPPPPPPPPPPPP>
##$VTLIST= <TTTTTTTTTTTTTTT>
##$WBST= 1024
##$WBSW= 4
##$XGAIN= (0..3)
0 0 0 0 
##$XL= 0
##$YL= 0
##$YMAX_a= 387594
##$YMIN_a= -505498
##$ZGOPTNS= <>
##$ZL1= 120
##$ZL2= 120
##$ZL3= 120
##$ZL4= 120
##$ABSF1= 16.522
##$ABSF2= -4.171173
##$ABSG= 5
##$ABSL= 3
##$ALPHA= 0
##$AQORDER= 0
##$ASSFAC= 0
##$ASSFACI= 0
##$ASSFACX= 0
##$ASSWID= 0
##$AUNMP= <proc_1d>
##$AZFE= 0.1
##$AZFW= 0.1
##$BCFW= 0
##$BC_mod= 0
##$BYTORDP= 0
##$COROFFS= 0
##$CY= 12.5
##$DATMOD= 1
##$DC= 0
##$DFILT= <>
##$DTYPP= 0
##$F1P= 14.0000005364418
##$F2P= -0.99999901652339
##$FCOR= 0.5
##$FTSIZE= 32768
##$FT_mod= 6
##$GAMMA= 0
##$GB= 0
##$INTBC= 1
##$INTSCL= 1
##$ISEN= 128
##$LB= 0.3
##$LEV0= 0
##$LPBIN= 0
##$MAXI= 10000
##$MC2= 0
##$MEAN= 0
##$ME_mod= 0
##$MI= 0
##$NCOEF= 0
##$NC_proc= -4
##$NLEV= 6
##$NOISF1= 0
##$NOISF2= 0
##$NSP= 0
##$NTH_PI= 0
##$NZP= 0
##$OFFSET= 16.522
##$PC= 1
##$PHC0= -78.50246
##$PHC1= 8.377918
##$PH_mod= 1
##$PKNL= yes
##$PPARMOD= 0
##$PSCAL= 4
##$PSIGN= 0
##$REVERSE= no
##$SF= 250.13
##$SI= 32768
##$SIGF1= 0
##$SIGF2= 0
##$SINO= 400
##$SIOLD= 32768
##$SREGLST= <1H.CDCl3>
##$SSB= 0
##$STSI= 32768
##$STSR= 0
##$SW_p= 5175.98343685301
##$SYMM= 0
##$S_DEV= 0
##$TDeff= 65536
##$TDoff= 0
##$TI= <Analysis number 999999
Compound Code 99
Book Reference 9
Project Code 9>
##$TILT= no
##$TM1= 0
##$TM2= 0
##$TOPLEV= 0
##$USERP1= <user>
##$USERP2= <user>
##$USERP3= <user>
##$USERP4= <user>
##$USERP5= <user>
##$WDW= 1
##$XDIM= 32768
##$YMAX_p= 529136349
##$YMIN_p= -149011
$$ End of Bruker specific parameters
$$ ---------------------------------
##NTUPLES= NMR SPECTRUM
##VAR_NAME=  FREQUENCY,     SPECTRUM/REAL,   SPECTRUM/IMAG
##SYMBOL=    X,             R,               I
##VAR_TYPE=  INDEPENDENT,   DEPENDENT,       DEPENDENT
##VAR_FORM=  AFFN,          ASDF,            ASDF
##VAR_DIM=   32768,         32768,           32768
##UNITS=     HZ,            ARBITRARY UNITS, ARBITRARY UNITS
##FACTOR=    0.157963299565203, 1,           1
##FIRST=     4132.6476996994, 0,             0
##LAST=      -1043.33573715361, 0,           0
##MIN=       -1043.33573715361, -149011,     0
##MAX=       4132.6476996994, 529136349,     0
$$ Real data points
##PAGE= N=1
##DATA TABLE= (X++(R..R)), XYDATA
$$ [...]
18517A4361964k003241j611288j284886r81979p48411o05496m56845l55333k98496
$$ 14361964 12358723 10747435 9462549 8480570 7732159 7126663 6669818 6314485 6015989
18508F015989l09247k71661k26416j79450j47063j24114j44592j13742j13408
$$ 6015989 5706742 5435081 5208665 5029215 4882152 4758038 4613446 4499704 4386296
18499D386296j42794j00695q5708q7972r9622r4780o8630p5275j46096j54800
$$ 4386296 4243502 4142807 4057099 3969127 3869505 3774725 3706095 3630820 3484724 3329924
18489C329924j32852j45584j15586j27835j10959p1520j33229j53426j05891j38791
$$ 3329924 3197072 3051488 2935902 2808067 2697108 2625588 2492359 2338933 2233042 2094251
18479B094251r0411n8325p8274n1338p9861o9704o1517r1899n7178p0523p9481
$$ 2094251 2003840 1945515 1867241 1815903 1736042 1666338 1604821 1512922 1455744 1385221 1305740
18468A305740p2249n9800l8826P315j8m6756n1589m4502m417K169l6067n3604
$$ 1305740 1233491 1173691 1134865 1142180 1142162 1095406 1043817 999315 994898 997067 961000 907396
18456I07396j0131n7804l612K3674o907j045j6599j7653m825j0582J686j8282
$$ 907396 897265 839461 835849 859523 852616 851571 834972 817319 812494 801912 803598 785316
18444G85316k0628k2847l8429j1281r877n1499n0167m3563m3828j9041j1526l752
$$ 785316 764688 741841 703412 692131 682254 630755 580588 537025 493197 474156 462630 458878
18432D58878Q286N3280M58l8382K6937O7209J3362J4182j4716J1909j7208k7757
$$ 458878 467164 520444 520902 482520 509457 576666 590028 604210 589494 601403 584195 556438
18420E56438M0948R275o659J778J662J2250K5703J6772k115Q298J5970l642L4650
$$ 556438 597386 606661 600002 601780 603442 615692 641395 658167 656052 664350 680320 676678 711328
18407G11328N4127j2987m0479J0263M9584K3628q723M3822L8519O850K3166N0236
$$ 711328 765455 752468 711989 722252 771836 795464 786741 830563 869082 875932 899098 949334
18395I49334N8589N2056M0891O9556O7729R0427R6115J03884O3641N7058P7704
$$ 949334 1007923 1059979 1100870 1170426 1238155 1328582 1424697 1528581 1592222 1649280 1726984
18384A726984J1905P6026O4751P3605J47709J87273K21880K98313M14237N18328
$$ 1726984 1738889 1814915 1879666 1953271 2100980 2288253 2510133 2808446 3222683 3741011
18374C741011O17555Q68307J202249J719683K357137L256672M448402N550178
$$ 3741011 4358566 5226873 6429122 8148805 10505942 13762614 18211016 23761194
18366B3761194O023272N175541L429561J810242K38330j921115m097750n316363
$$ 23761194 29784466 34960007 38389568 40199810 40438140 38517025 34419275 29102912
18358B9102912n410760m766757l864080k933855k089801j543368j119328q31466
$$ 29102912 23692152 18925395 15061315 12127460 10037659 8494291 7374963 6543497
18350F543497o27028m79265l71514k74224j35211j09836m1023R330O9720P4605
$$ 6543497 5916469 5437204 5065690 4791466 4656255 4546419 4505396 4514726 4584446 4659051
18340D659051P3631N6796J574p0871m4224l9331j2603M7825J28105K06539K82520
$$ 4659051 4732682 4789478 4791052 4720181 4675957 4636626 4624023 4671848 4799953 5006492 5289012
18329E289012L86928M87942O59137Q85966J210520J606579K223758L099295M280416
$$ 5289012 5675940 6163882 6823019 7708985 8919505 10526084 12749842 15849137 20129553
18320B0129553N914339P793813R019147Q564735O250506L615966J239440j762312
$$ 20129553 26043892 33837705 42856852 51421587 57672093 61288059 62527499 60765187
18312F0765187n260185p700122q468005p843232o522524n036751l723456k722266
$$ 60765187 55505002 47804880 39336875 31493643 24971119 19934368 16210912 13488646
18304A3488646k043141j528771j141326q49453o71674n41181l94147l34166k41435
$$ 13488646 11445505 9916734 8775408 7925955 7254281 6713100 6318953 5984787 5743352
18295E743352j34602o6598p4713q1571o0925o3653j06153j37433j57649j47943
$$ 5743352 5608750 5542152 5467439 5385868 5324943 5261290 5155137 5017704 4860055 4712112
18285D712112r8866n4612L0400k8P2381J72817K30262K84691M47414N83156P40665
$$ 4712112 4613246 4558634 4589034 4589006 4661387 4834204 5064466 5349157 5796571 6379727 7120392
18274G120392J003292J423970K014923K769137L378615L438127K753428J711404
$$ 7120392 8123684 9547654 11562577 14331714 17710329 21148456 23901884 25613288
18266B5613288P28685l71664j749484k929676l445707l338827k890401k257446
$$ 25613288 26341973 25970309 24220825 21291149 17845442 14506615 11616214 9358768
18258I358768j649718j248489r09546p12582n09068m06618l53196k48683k06695
$$ 9358768 7709050 6460561 5551015 4838433 4329365 3922747 3569551 3320868 3114173
18249C114173k17724j44539r7278q1738o8253n0765l6590l4000k3239o3253p6351
$$ 3114173 2896449 2751910 2654632 2572894 2504641 2453876 2417286 2383286 2360047 2296794 2220443
18238B220443j17424r3271p1766j30142r9808o9581j7825k4552k4452k7751k0223
$$ 2220443 2103019 2009748 1937982 1807840 1708032 1638451 1620626 1596074 1571622 1543871 1523648
18227A523648m7774n9748j5425l5878o1467o7769l9861n4242n9506j04839o2506
$$ 1523648 1475874 1416126 1400701 1364823 1303356 1235587 1195726 1141484 1081978 977139 914633
18216I14633m1678k1466m4743m1214n4382j3051k433l2136k0882l9201m2525j0221
$$ 914633 872955 851489 806746 765532 711150 698099 695666 663530 642648 603447 560922 550701
18204E50701K4249R994m5933m9637M637k816K051J8729m6499p115J6721K1598
$$ 550701 574950 584944 539011 489374 494011 491195 493246 511975 465476 458361 475082 496680
18192D96680L5960J1193L1942K9296k6642k2579J6514l8196n5458k7341n725J8425
$$ 496680 532640 543833 575775 605071 578429 555850 572364 534168 478710 451369 445644 464069
18180D64069l484j1612m8875o3798k6133l1098j9858L0662J4420m840L34j4390
$$ 464069 460585 448973 400098 336300 310167 279069 259211 289873 304293 299453 299787 285397
18168B85397l4084k070N2379K3097k0558k435l0789k4868j8166L1285j0959N948
$$ 285397 251313 249243 301622 324719 304161 301726 270937 246069 227903 259188 248229 254177
18156B54177J4623K4154L3810j7238j7589K1527J0648q397O7507J6753k7225K2007
$$ 254177 268800 292954 326764 309526 291937 313464 324112 315715 383222 399975 372750 394757
18144C94757M0909K5129n87J1674j596J3355N1411J6545L0214L4639K6252L2522
$$ 394757 435666 460795 460208 471882 470286 483641 535052 551597 581811 616450 642702 675224
18132F75224K1518K8037J9384K0883O3783J04571R8202O6653J33065J44888J83386
$$ 675224 696742 724779 744163 765046 828829 933400 1031602 1098255 1231320 1376208 1559594
18121A559594K25528L22971L64432M92371O92904R18332J277470J840123K633645
$$ 1559594 1785122 2108093 2472525 2964896 3657800 4576132 5853602 7693725 10327370
18112A0327370L729538N685660R457213J4321644J2263902m01816r264834j0183775
$$ 10327370 14056908 19742568 29199781 43521425 55785327 55383511 46118677 35934902
18104C5934902r134979p414098n038514l316109k247592j575207j184047q60007
$$ 35934902 26799923 19385825 14347311 11031202 8783610 7208403 6024356 5164349
18096E164349o25420m70269l58658l32612k77447k09034j64446j00348j06721
$$ 5164349 4538929 4068660 3710002 3377390 3099943 2890909 2726463 2626115 2519394
18087B519394j57071r8615m8393r1599o7123k6726n5665l1974m6824Q625L0735
$$ 2519394 2362323 2263708 2215315 2123716 2056593 2029867 1974202 1942228 1895404 1904029 1934764
18076A934764M220q930R48K8080K581K5335J7577N663m8093n6604p6320j02273
$$ 1934764 1938984 1930054 1931002 1959082 1961663 1986998 2004575 2010238 1962145 1905541 1829221 1726948
18064A726948j14572j08990n6596n7599m6972p0431p9392q0207o7148n7071p2655
$$ 1726948 1612376 1503386 1446790 1389191 1342219 1271788 1192396 1112189 1045041 987970 915315
18053I15315n1879p2725q5392l7446j9318l4588n6293l0967L110J426l1986J4076
$$ 915315 863436 790711 705319 667873 648555 613967 557674 526707 529817 531243 499257 513333
18041E13333K321k9531j1260M799n406j8377j8467j8558k9785m2246l9352K9375
$$ 513333 515654 486123 474863 479662 474256 455879 437412 418854 389069 346823 307471 336846
18029C36846J2738m6903l132K5706m1122l345N048N4230j6286l1047J3379k6221
$$ 336846 349584 302681 299549 325255 284133 280788 285836 340066 323780 292733 306112 279891
18017B79891j8588k5749n196m1800k2420k9811K5321j125l3490j9196o868J4754
$$ 279891 261303 235554 230358 188558 166138 136327 161648 160523 127033 107837 100969 115723
18005A15723K0147j455k3112l1300O929K940Q173m667N945j4090p883k2646j690
$$ 115723 135870 134415 111303 80003 86932 89872 98045 93378 99323 85233 77350 54704 53014
17992E3014J457J8879l261m625J836L0707J0084R369J5136N6686K5814J2960l3138
$$ 53014 54471 73350 70089 65464 67300 98007 108091 117460 132596 189282 215096 228056 194918
17979A94918m8385n1489n2758K2882l8402m5045l8211m08L9698n32k5115k2321
$$ 194918 146533 95044 42286 65168 26766 -18279 -56490 -56898 -17200 -17732 -42847 -65168
17967f5168j4104K6969L6965m60J9157P684p296k0077j6175J7209j0052j0079
$$ -65168 -79272 -52303 -15338 -15798 3359 11043 3747 -16330 -32505 -15296 -25348 -35427
17955c5427O163n926j55n0068m365P0453L0271N014n801n0923j3787j2214k145
$$ -35427 -29264 -35190 -35345 -85413 -89778 -19325 10946 15960 10159 -40764 -54551 -66765 -68910
17942f8910M2099J6513J1587J6769K0766K6078j601N5577l6436p4477j7951O920
$$ -68910 -26811 -10298 1289 18058 38824 64902 63301 118878 82442 7965 -9986 -3066
17930c066L899J8848J1732l3418m7318O832J811L3420j5021l2978j4166M0468
$$ -3066 833 19681 31413 -2005 -49323 -42491 -40680 -7260 -22281 -55259 -69425 -28957
17918b8957L2697j0678k712j4442L8211O922p367m4328j7022J9811l8906J8155
$$ -28957 3740 -6938 -9650 -24092 14119 21041 13674 -30654 -47676 -27865 -66771 -48616
17906d8616L7973K6989O397k0927K8063j5770p3981j0588N858J1821j0666l739
$$ -48616 -10643 16346 22743 1816 29879 14109 -59872 -70460 -64602 -52781 -63447 -67186
17894f7186K2431j0238j1096j7417J1159J1363k291L7425N189J0295J3242j7714
$$ -67186 -44755 -54993 -66089 -83506 -72347 -60984 -63275 -25850 -20661 -10366 2876 -14838
17882a4838p4346l599J9322R709L080J0878K0343m884k894j3662J1817j2338m091
$$ -14838 -89184 -92783 -73461 -63752 -60672 -49794 -29451 -34335 -37229 -50891 -39074 -51412 -55503
17869e5503K3516K6271j1558j248j8444J3720L2058J9615j5586J1408q917j6273
$$ -55503 -31987 -5716 -17274 -18522 -36966 -23246 8812 28427 12841 24249 15332 -941
17857i41K4109O1550J2458K0568N175L1897p755j8276j3239n3115m3387J624P174
$$ -941 23168 84718 97176 117744 122919 154816 147061 128785 115546 62431 19044 20668 27842
17844B7842j4133J8619j2630l567l145r427j2209j4946o246k733K6679m0655j8496
$$ 27842 13709 32328 19698 16131 12986 3559 -8650 -23596 -29842 -32575 -5896 -46551 -65047
17831f5047J2517J2916j0296J2966L3865K749J7368j5801m840k1383k7362N4283
$$ -65047 -52530 -39614 -49910 -36944 -3079 -330 17038 1237 -3603 -24986 -52348 1935
17819A935L6816mj3032K1k286J4305k0902j1533K4866N1004M4559J8099L9613
$$ 1935 38751 38747 25715 25736 23450 37755 16853 5320 30186 81190 125749 143848 183461
17806A83461N5653J7118J6106j0987j0021k9983k9561j6766j0834m4912l6143
$$ 183461 239114 256232 272338 261351 251330 221347 191786 175020 164186 119274 83131
17795H3131L0146j4562k0367k2457m1335j2105k2959k1077J0310L4522N507J7951
$$ 83131 113277 98715 78348 55891 14556 2451 -20508 -41585 -31275 3247 8754 26705
17783B6705J8683L957K5125Q248j7671k1700j9049o972K3601L5674J0796l4717
$$ 26705 45388 49345 74470 82718 65047 43347 24298 17326 40927 76601 87397 52680
17771E2680n9023N952j5969k5467k0037o55K7731p197j5117J2175Q590N3681P1862
$$ 52680 -6343 -391 -16360 -41827 -61864 -62519 -34788 -41985 -57102 -44927 -36337 17344 89206
17758H9206K4479j2017L1915M564R532Q741m0257n1760k3984k2861o605J381J9149
$$ 89206 113685 101668 133583 138147 147679 156420 116163 64403 40419 17558 10953 12334 31483
17745C1483J2369j3658j3710j6045l7125Q236j3546m9340j6856R176K2419K3165
$$ 31483 43852 30194 16484 439 -36686 -28450 -41996 -91336 -108192 -99016 -76597 -53432
17733e3432j9451j0345L6368K7630R777m7876J3838j1636J6285p057j8938j5922
$$ -53432 -72883 -83228 -46860 -19230 -9453 -57329 -43491 -55127 -38842 -45899 -64837 -80759
17721h0759N404L478J0832L4557J8130j066N35K1331k8491n441M7146j5857k7754
$$ -80759 -75355 -71877 -61045 -26488 -8358 -9424 -8889 12442 -16049 -21490 25656 9799 -17955
17708a7955p460k2315J3328L3362J8889J2689q417m1462P603J540J0825j2214
$$ -17955 -25415 -47730 -34402 -1040 17849 30538 22121 -19341 -11738 -10198 627 -11587
17696a1587n5054l0622L0183N0322K1076m0114o069m086J3815j3777k3455j3834
$$ -11587 -66641 -97263 -67080 -16758 4318 -35796 -41865 -45951 -32136 -45913 -69368 -83202
17684h3202j0067L102j5827K3279L9171l1460j24K9289J6135l9995m1782L2886
$$ -83202 -93269 -90167 -105994 -82715 -43544 -75004 -75128 -45839 -29704 -69699 -111481 -78595
17672g8595M3230M7995p773m3441k4170M447L2527j7296k3211O242k5439K4491
$$ -78595 -35365 12630 4857 -38584 -62754 -58307 -25780 -43076 -66287 -60045 -85484 -60993
17660f0993L9570J6958j2854l6243l3608K0022Q460J134M810N943q975j0538k6466
$$ -60993 -21423 -4465 -17319 -53562 -87170 -67148 -58688 -57554 -52744 -46801 -55776 -66314 -92780
17647i2780j0426K1468K6673N804q54q436l3159K310L1294n929K0454J7796P40
$$ -92780 -103206 -81738 -55065 -49261 -50115 -58551 -91710 -89400 -58106 -64035 -43581 -25785 -25045
17634b5045j3859l3144l79J2362J3037l6821o26L6968L99j0374J0234j2149L0272
$$ -25045 -38904 -72048 -72427 -60065 -47028 -83849 -84475 -47507 -47108 -57482 -47248 -59397 -29125
17621b9125o322l5898m027L3012K1085l856J1654j0438j0650q240K4987K9679
$$ -29125 -35447 -71345 -75372 -42360 -21275 -25131 -13477 -23915 -34565 -42805 -17818 11861
17609A1861m3378k5238j6799J1491L7978j8572L7157l3817P645K1786l6945m0417
$$ 11861 -31517 -56755 -73554 -62063 -24085 -42657 -5500 -39317 -31672 -9886 -46831 -87248
17597h7248K3220J8527j0022K6306N2151l2627J0839o147L014k0430j9727j9563
$$ -87248 -64028 -45501 -55523 -29217 22934 -9693 1146 -5001 -1987 -22417 -42144 -61707
17585f1707j4325P597K1938J4600K2548Q514k8119m3336j0030L9341K7438K7676
$$ -61707 -76032 -68435 -46497 -31897 -9349 -835 -28954 -72290 -82320 -42979 -15541 12135
17573A2135k8602L7401J3539m5067k9237j6649K6384K0892k1296k3571L880l0456
$$ 12135 -16467 20934 34473 -10594 -39831 -56480 -30096 -9204 -30500 -54071 -50191 -80647
17561h0647m955K4053K6438k17j8827K3296Q075L000p694k7879r239P511L756
$$ -80647 -85602 -61549 -35111 -35328 -54155 -30859 -22784 -19784 -27478 -55357 -64596 -57085 -53329
17548e3329k3167j363p423j9353L3119j4655j764k7797J529l22Q708K5545K3425
$$ -53329 -76496 -77859 -85282 -104635 -71516 -86171 -87935 -115732 -114203 -114525 -105817 -80272 -56847
17535e6847j1786r51L6060J7706m2572o098m642k3674r456J9895L6111L7492j5730
$$ -56847 -68633 -69584 -33524 -15818 -58390 -64488 -69130 -92804 -102260 -82365 -46254 -8762 -24492
17522b4492j7754K349m3772k1567K3554p213k7131J3213L9729L7467j5805k764
$$ -24492 -42246 -39897 -83669 -105236 -81682 -88895 -116026 -102813 -63084 -25617 -41422 -44186
17510d4186K1494n76L4257J1956K3032k2484k0098n7338j6942o445K2063J8823
$$ -44186 -22692 -23268 10989 22945 45977 23493 3395 -53943 -70885 -77330 -55267 -36444
17498c6444M7455j6193q419J4296o446n4218j5462l7624m388N6346J4417N187
$$ -36444 11011 -5182 -13601 695 -5751 -59969 -75431 -113055 -117443 -61097 -46680 -41493
17486d1493K0370M4946l6228n825l792k7479r539P164J3537l372l728p596n447
$$ -41493 -21123 23823 -12405 -18230 -22022 -49501 -59040 -51876 -38339 -41711 -45439 -53035 -58482
17473e8482l870L7610J0337P029k4359j1819j60J4944j7688K8662J4051J1008
$$ -58482 -62352 -24742 -14405 -7376 -31735 -43554 -43714 -28770 -46458 -17796 -3745 7263
17461G263j9408j8141j4429n497k8576P807M3553L721p843L6241J7210J9868Q055
$$ 7263 -12145 -30286 -44715 -50212 -78788 -70981 -27428 -23707 -31550 4691 21901 41769 49824
17448D9824r689J470J0743L7077M199K5404N1301L7664k3271p2130m4324l1018
$$ 49824 40135 41605 52348 89425 93624 119028 170329 207993 184722 112592 68268 37250
17436C7250k703o019k0582M496j6206k7161o277K0657L9596L1656j8470m1776
$$ 37250 34547 28528 7946 12442 -3764 -30925 -37202 -16545 23051 54707 36237 -5539
17424e539j0187J647l0777m1276R39P507L5671J0727P720n466j7147o564L5808
$$ -5539 -15726 -14079 -44856 -86132 -85193 -77686 -42015 -31288 -23568 -29034 -46181 -52745 -16937
17411a6937N4135M637l1587k4211J0938K1473l2834l3234Q971J4974r92j2075
$$ -16937 37198 41835 10248 -13963 -3025 18448 -14386 -47620 -38649 -23675 -24667 -36742
17399c6742K2998j9346o433k8534k7005M261M237j6195K4873k2142L1101p61j5623
$$ -36742 -13744 -33090 -39523 -68057 -95062 -90801 -86564 -102759 -77886 -100028 -68927 -69688 -85311
17386h5311p706l34j6908N6868L2994k3644l0596k0531j8491N762J2857J1556
$$ -85311 -93017 -93351 -110259 -53391 -20397 -44041 -74637 -95168 -113659 -107897 -95040 -83484
17374h3484l493L229k767M1166K6951m733k2821M526j8160l486J7190m5959l9230
$$ -83484 -86977 -83748 -86515 -45349 -18398 -23131 -45952 -41426 -59586 -63072 -45882 -91841 -131071
17361a31071J238N5758J693j4792J3435N9421J403l1584L854R77j5029K7266M3205
$$ -131071 -129833 -74075 -72382 -87174 -73739 -14318 -12915 -44499 -40645 -39668 -54697 -27431 15774
17348A5774L6450j0644n818n6408l3505l4929o057J0112n203Q171k306k5218R234
$$ 15774 52224 41580 35762 -20646 -54151 -89080 -95137 -85025 -90228 -82057 -84363 -109581 -100347
17335a00347k743L5381K1532j1683M725m690l031m374n461J1739N139j235q066
$$ -100347 -103090 -67709 -46177 -57860 -53135 -57825 -60856 -65230 -70691 -58952 -53813 -55048 -63114
17322f3114L4140J7592k1675j2538l9267L7066N7581O361o474j696k3833J1817
$$ -63114 -28974 -11382 -33057 -45595 -84862 -47796 9785 16146 9672 7976 -15857 -4040
17310d040K425K1821K6541l0089R788j0707n3118k4208l5484K167J9284L7095
$$ -4040 -1615 20206 46747 16658 26446 15739 -37379 -61587 -97071 -94904 -75620 -38525
17298c8525J440k0810j1651K158k2299Q024L2628j470L0989J1104p782j2847O744
$$ -38525 -37085 -57895 -69546 -67388 -89687 -81663 -49035 -50505 -19516 -8412 -16194 -29041 -22297
17285b2297J9585L1131j850k8406l7268m553j8877k0604J0537K9847K505l8199
$$ -22297 -2712 28419 26569 -1837 -39105 -43658 -62535 -83139 -72602 -42755 -40250 -78449
17273g8449p972L3231j810J8007n906k2752K6009J557k9365l4906k4733J5659
$$ -78449 -86421 -53190 -55000 -36993 -42899 -65651 -39642 -38085 -67450 -102356 -127089 -111430
17261a11430P5397J6560k6558N841K2385M2845K8720m2612L250K061m4037k883
$$ -111430 -36033 -19473 -46031 -40190 -17805 25040 53760 11148 14398 16459 -27578 -30461
17249c0461M0379J1266l9630m5676K367P248j2860m9625j1698M2805J8093j4740
$$ -30461 9918 21184 -18446 -64122 -61755 -54507 -67367 -116992 -128690 -85885 -67792 -82532
17237h2532j3122Q092K1698O5981K2144m9578l007L2876J3406n643j2275j3516
$$ -82532 -95654 -87562 -65864 117 22261 -27317 -30324 2552 15958 10315 -1960 -15476
17225a5476j3291k4530j4228M2823P422P453p251j8426k0962j4137L2245j4760
$$ -15476 -28767 -53297 -67525 -24702 -17280 -9827 -17078 -35504 -56466 -70603 -38358 -53118
17213e3118K0857M0508o986J9561Q699L1479l104j8340m3878l4463n0357K9552
$$ -53118 -32261 8247 1261 20822 29521 61000 57896 39556 -4322 -38785 -89142 -59590
17201e9590L6921q266J9856j4344k6117j3872k6737L6579K5278K811p508j4772
$$ -59590 -22669 -30935 -11079 -25423 -51540 -65412 -92149 -55570 -30292 -27481 -34989 -49761
17189d9761j9925k3376N2602J4265J0316K5171Q505j5808J7073M7878M7567J3903
$$ -49761 -69686 -93062 -40460 -26195 -15879 9292 17797 1989 19062 66940 114507 128410
17177A28410J6420j7354j6241k5510o7817k4836p34J3712n279M32q088j886K2150
$$ 128410 144830 127476 111235 85725 17908 -6928 -7662 6050 771 1203 -6885 -8771 13379
17164A3379J3318J6682k9723l1788K1662k6854k3045J555j5419j4743P447j332
$$ 13379 26697 43379 13656 -18132 3530 -23324 -46369 -44814 -60233 -74976 -67529 -68861
17152f8861P46N0727K0764m829k3487K5727J3515j8183k8476j6937j2914P984
$$ -68861 -68115 -17388 3376 -1453 -24940 787 14302 -3881 -32357 -49294 -62208 -54224
17140e4224j6821o236L9274m4464k5192K2305M48j7684J3791L8792J2645k1850
$$ -54224 -71045 -77281 -38007 -82471 -107663 -85358 -84910 -102594 -88803 -50011 -37366 -59216
17128e9216k3260k1489k2109M1511K9869M610m4610k0966k7190K1926L7275O243
$$ -59216 -82476 -103965 -126074 -84563 -54694 -50084 -94694 -115660 -142850 -120924 -83649 -77406
17116g7406j8708l4048K1766N1442L5500L6896k2817k2173o259N121k2744j8066
$$ -77406 -96114 -130162 -108396 -56954 -21454 15442 -7375 -29548 -35807 -30686 -53430 -71496
17104g1496K3050k6477m629Q314k1536J115K1697K5187M1095J3443k8959k1112
$$ -71496 -48446 -74923 -79552 -71238 -92774 -91659 -69962 -44775 -3680 9763 -19196 -40308
17092d0308J8049n341M694J6684n877J7657k8150j1124m406n628L5938L757m1190
$$ -40308 -22259 -27600 -22906 -6222 -12099 5558 -22592 -33716 -38122 -43750 -7812 -4055 -45245
17079d5245j3517j9065k8583q854J7965J6565j9911j852j2697N597J9084j0602
$$ -45245 -58762 -77827 -106410 -115264 -97299 -80734 -100645 -102497 -115194 -109597 -90513 -101115
17067a01115J3884K4410M2974J0688l0384O185L2150P457m085K2541j9095j387
$$ -101115 -87231 -62821 -19847 -9159 -39543 -33358 -1208 6249 2164 24705 5610 4223
17055D223k2012k4360J6982O352l1046P051J6665K0178L4301r946J8565j5749
$$ 4223 -17789 -42149 -25167 -18815 -49861 -42810 -26145 -5967 28334 18388 36953 21204
17043B1204j7381L4797j0636k1821L932L3577k5886m0086l056j7149L6921J1794
$$ 21204 3823 38620 27984 6163 10095 43672 17786 -22300 -25356 -42505 -5584 6210
17031F210m0535m4909l000Q677L5248J6051p673K0893K3852n387j2847R377L62
$$ 6210 -34325 -79234 -82234 -73557 -38309 -22258 -29931 -9038 14814 9427 -3420 5957 6319
17018F319j1870j1894J0375J5909N772k8644l532J852l5614J2265L6849l2121
$$ 6319 -5551 -17445 -7070 8839 14611 -14033 -17565 -15713 -51327 -39062 -2213 -34334
17006c4334n4911n875K2068M3195j0171j0249j7105j9565P949O0524Q957j2908
$$ -34334 -89245 -95120 -73052 -29857 -40028 -50277 -67382 -86947 -78998 -18474 -9517 -22425
16994b2425j4854l4038k6735o43k6140Q013L9313L2897L094l0381K8840M3504
$$ -22425 -37279 -71317 -98052 -98695 -124835 -116822 -77509 -44612 -41518 -71899 -43059 445
16982D45L7637j282l8331k6716k2935j1417j9980J8262M3394l864l0777J2644
$$ 445 38082 36800 -1531 -28247 -51182 -62599 -82579 -64317 -20923 -24787 -55564 -42920
16970d2920N80k7751n682M4015j3297k3895J771q545r8J8940M0688k115L0720
$$ -42920 -42340 -70091 -75773 -31758 -45055 -68950 -67179 -75724 -75822 -56882 -16194 -18309 12411
16957A2411j0237k052N624K5631k2342l956j8967j6914J2503J2398m557j2286
$$ 12411 2174 122 5746 31377 9035 5079 -13888 -30802 -18299 -5901 -10458 -22744
16945b2744J5909M002k0674j8006j6172j523L390M87O844l2369J8107M4955l2883
$$ -22744 -6835 -2833 -23507 -41513 -57685 -59208 -55818 -55331 -48487 -80856 -62749 -17794 -50677
16932e0677k3926m003j6378j92n21J6300K8140L3742l6237p377J0582J7526O902
$$ -50677 -74603 -78606 -94984 -95176 -95697 -79397 -51257 -17515 -53752 -61129 -50547 -33021 -26119
16919b6119k196J9513M1445o003o700j3249r903j8307k4203k2638o07O3646j7768
$$ -26119 -28315 -8802 32643 26640 19940 6691 -3212 -21519 -45722 -68360 -68967 -5321 -23089
16906b3089j5050j4249n30J1700J8958L1780L4769o601o3161j7111k1486J7075
$$ -23089 -38139 -52388 -52918 -41218 -22260 9520 44289 37688 -25473 -42584 -64070 -46995
16894d6995M8273l6924l7716M0986M056k1379J1342m936P537Q428K1202K1517
$$ -46995 1278 -35646 -73362 -32376 -28320 -49699 -38357 -43293 -35756 -27328 -6126 15391
16882A5391o05P100j2537j7791k192m1835l4077m721k2217J4474J5838k640j3789
$$ 15391 14786 21886 9349 -8442 -10634 -52469 -86546 -91267 -113484 -99010 -83172 -85812 -99601
16869i9601L1304L9856j7777l3307l968j8697R0358M8529j0031l0430k85P962
$$ -99601 -68297 -28441 -46218 -79525 -83493 -102190 -11832 36697 26666 -3764 -4049 3913
16857C913K4177J0981k5589m1798j1601j6739m3233m4655M531M9509L0528l1719
$$ 3913 28090 39071 13482 -28316 -39917 -56656 -99889 -144544 -140013 -90504 -59976 -91695
16845i1695n522J5884Q632q658N0125j357k3756k1928n753L3864n10j1284O863
$$ -91695 -97217 -81333 -72701 -81359 -31234 -32591 -56347 -78275 -84028 -50164 -50674 -61958 -55095
16832e5095J1708J7787l0873p633J6205n177K5245J1700K4175P464Q095l0102
$$ -55095 -43387 -25600 -56473 -64106 -47901 -53078 -27833 -16133 8042 15506 23601 -6501
16820f501p164J3390J7240k7818j669M340K086N64K1484O901l9062j7222M417
$$ -6501 -13665 -275 16965 -10853 -12522 -8182 -6096 -5532 15952 22853 -16209 -33431 -29014
16807b9014k2344l992L3255O479l129M990K715l4167n1525k1505L6546J4387J736
$$ -29014 -51358 -55350 -22095 -15616 -18745 -13755 -11040 -45207 -96732 -118237 -81691 -67304 -65568
16794f5568j2111j0173J7025k998J519M1427L6769p314p0242l2177K7903P680
$$ -65568 -77679 -87852 -70827 -73825 -72306 -30879 5890 -1424 -71666 -103843 -75940 -68260
16782f8260M7486L188K516j7854O548m422J1649k8417K5071L4180j6999j435k0294
$$ -68260 -20774 -17586 -15070 -32924 -26376 -30798 -19149 -47566 -22495 11685 -5314 -6749 -27043
16769b7043o2260p689L6640O5747K7087J9216l6803l8909j9750J7873j0755m3532
$$ -27043 -89303 -96992 -60352 5395 32482 51698 14895 -24014 -43764 -25891 -36646 -80178
16757h0178J2569J4965L9943K3934K056j6123M663j0834k1954k3374l2379l3N4843
$$ -80178 -67609 -52644 -12701 11233 13289 -2834 1829 -9005 -30959 -54333 -86712 -86745 -31902
16744c1902r79m0232l231J2041L6163Q792m174j9052j5163R180P640K115j9098
$$ -31902 -32881 -73113 -76344 -64303 -28140 -19348 -23522 -42574 -57737 -48557 -40917 -38802 -57900
16731e7900K2285R249k5161J1975J2901j7442J0075K1699l0677j4302j4116j7779
$$ -57900 -35615 -26366 -51527 -39552 -26651 -44093 -34018 -12319 -42996 -57298 -71414 -89193
16719h9193j1477L3568P096r380j6481L4515j938j6901l859J8274L6734j0432
$$ -89193 -100670 -67102 -60006 -69386 -85867 -51352 -53290 -70191 -74050 -55776 -19042 -29474
16707b9474m0134K308J5895N156J7957J6926j7790j0539K0529J241n1630k9220
$$ -29474 -69608 -67300 -51405 -46249 -28292 -11366 -29156 -39695 -19166 -17925 -69555 -98775
16695i8775M4589J9836k5490m1845j2824n34K6255J9423j4850K5632J463R530
$$ -98775 -54186 -34350 -59840 -101685 -114509 -115043 -88788 -69365 -84215 -58583 -57120 -47590
16683d7590L0052k4331l3630R751K2114J0574k0444k904l4063k4751M8825O2449
$$ -47590 -17538 -41869 -75499 -65748 -43634 -33060 -53504 -56408 -90471 -115222 -66397 -3948
16671c948K4743R54j9519m6388j9756J8967j996j0069j3153j0485o138k163K5738
$$ -3948 20795 21749 2230 -44158 -63914 -44947 -46943 -57012 -70165 -80650 -86788 -88951 -63213
16658f3213j1036l7092K4322O1080L1240j6258j609J3625J5540R732k3127m0391
$$ -63213 -74249 -111341 -87019 -25939 5301 -10957 -12566 1059 16599 26331 3204 -37187
16646c7187k6379J8823N0786L927j2875N970j4751J458K3938K4210J3184j1983
$$ -37187 -63566 -44743 6043 9970 -2905 3065 -11686 -10228 13710 37920 51104 39121
16634C9121N642l3276n401k343j9011J66P096j1469j4969l8915j1441N4274L9855
$$ 39121 44763 11487 6086 3743 -15268 -15102 -8006 -19475 -34444 -73359 -84800 -30526 9329
16621I329l8805j8383J937l9221J0154P3304J9839j4652m2790l0549K2679j671
$$ 9329 -29476 -47859 -45922 -85143 -74989 -1685 18154 3502 -39288 -69837 -47158 -48829
16609d8829J0053M5171j0522k9594K1238J5979n0711k8044J6705L1648n465l76
$$ -48829 -38776 6395 -4127 -33721 -12483 3496 -47215 -75259 -58554 -26906 -32371 -32747
16597c2747j424r534J8685L252j5845j4261k4106J11P059K2722K1346J4161K6649
$$ -32747 -34171 -43705 -25020 -21768 -37613 -51874 -75980 -75869 -68810 -46088 -24742 -10581 16068
16584A6068k6644k1711l1709J285J4558r82R348l0657l7913O45J4141M5902M8717
$$ 16068 -10576 -32287 -63996 -62711 -48153 -49135 -39787 -70444 -108357 -107712 -93571 -47669 1048
16571A048J5561n7349l3381K4553L7838n824m7552J0927R993L255m24j2168R422
$$ 1048 16609 -40740 -74121 -49568 -11730 -17554 -65106 -54179 -44186 -40931 -41355 -53523 -44101
16558d4101O570n691k6555J2644L7012J8185J7520j876l9462j8242M8997L024
$$ -44101 -37531 -43222 -69777 -57133 -20121 -1936 15584 13708 -25754 -43996 5001 8025
16546H025j1319K8808M1005k407n1661o5109J6288J459j7552o777q825m5528l5418
$$ 8025 -3294 25514 66519 64112 12451 -52658 -36370 -34911 -52463 -59240 -68065 -113593 -149011
16533a49011L2320L9353K4273J3670p412k6159l0328r83L3187j848M8806M2683
$$ -149011 -116691 -77338 -53065 -39395 -46807 -72966 -103294 -104277 -71090 -72938 -24132 18551
16521A8551K543L003m1746o0305k9168J4934J8138L7297n743n144j1610L4794
$$ 18551 21094 24097 -17649 -77954 -107122 -92188 -74050 -36753 -42496 -47640 -59250 -24456
16509b4456K2767n3070m295L3578l82k1579j534q813o226R99k1828L2123O97J3213
$$ -24456 -1689 -54759 -59054 -25476 -25858 -47437 -48971 -57784 -64010 -63011 -84839 -52716 -52019 -38806
16495c8806Q523n3984k4234l508K6994K2509K6931j8162o789K6518n324J8712
$$ -38806 -30283 -84267 -108501 -112009 -85015 -62506 -35575 -53737 -60526 -34008 -39332 -20620
16483b0620J5105j3909l5338n637O4421O3m967k0659j4756l1352J3402M1865k828
$$ -20620 -5515 -19424 -54762 -60399 4022 4085 -882 -21541 -36297 -67649 -54247 -12382 -15210
16470a5210K1652J4501m1314j5337j0783Q659J6322M2370k514r016l1499j2122
$$ -15210 6442 20943 -20371 -35708 -46491 -37832 -21510 20860 18346 9330 -22169 -34291
16458c4291m990l4086n001M1617k6991o0567J6072Q335L5653j2225K0375N1863
$$ -34291 -39281 -73367 -78368 -36751 -63742 -124309 -108237 -99902 -64249 -76474 -56099 -4236
16446d236l3907K3481q760O12K1726k5727k8193K0064M5695J1043l284N163j6953
$$ -4236 -38143 -14662 -23422 -22810 -1084 -26811 -55004 -34940 10755 21798 18514 23677 6724
16433F724K2280j0632m4416l3542J1163P165k7812P811j0777R599K9221L7361
$$ 6724 29004 18372 -26044 -59586 -48423 -41258 -69070 -61259 -72036 -62437 -33216 4145
16421D145k538l0345j9295j6996J0794J3468L83k9293R385N312J0541K474K1617
$$ 4145 1607 -28738 -48033 -65029 -54235 -40767 -40384 -69677 -60292 -54980 -44439 -41965 -20348
16408b0348l4449l5393R087K5514J1575q284M1459O2038j6016m0382j9618k8796
$$ -20348 -54797 -90190 -81103 -55589 -44014 -52298 -10839 51199 35183 -5199 -24817 -53613
16396e3613p063j585K4538j1936j315p622Q972K7053m2402N2628N7453R116l6366
$$ -53613 -60676 -62261 -37723 -49659 -50974 -58596 -49624 -22571 -64973 -12345 45108 54224 17858
16383A7858m9749K3934K870j3045K859n703k2455J6091J1539o495J6521O017j2158
$$ 17858 -31891 -7957 -5087 -18132 -15273 -20976 -43431 -27340 -15801 -22296 -5775 242 -11916
16370a1916J8485n500j5665j2133j3529J1903l688n398k0812K5392M1182k0879
$$ -11916 6569 1069 -14596 -26729 -40258 -28355 -32043 -37441 -58253 -32861 8321 -12558
16358a2558l6037k2654j9690R048K6413J3495K3142M163k4747K6531K9861m7873
$$ -12558 -48595 -71249 -90939 -81891 -55478 -41983 -18841 -14678 -39425 -12894 16967 -30906
16346c0906j1161J2391R054K9411O808l6718k2718k6899k0911j0377J5228M4305
$$ -30906 -42067 -29676 -20622 8789 15597 -21121 -43839 -70738 -91649 -102026 -86798 -42493
16334d2493M3503k1090j0566M986k3890L0371N7602n66l9179k7082P031L0185
$$ -42493 1010 -20080 -30646 -25660 -49550 -19179 38423 37857 -1322 -28404 -21373 8812
16322H812k1216q322J43Q57j5554J9524k3536m839K4751J4765m0424L4102K195
$$ 8812 -12404 -20726 -20583 -19726 -35280 -15756 -39292 -44131 -19380 -4615 -45039 -10937 -8742
16309h742n806j4391l507O992j5233O3398M0883J2736m0619r364J2469j6478j8670
$$ -8742 -14548 -28939 -32446 -25454 -40687 22711 63594 76330 35711 26347 38816 22338 3668
16296C668r444k2020P094K1480J5209J0631J1053j3894o108j1223J1735M2540
$$ 3668 -5776 -27796 -20702 778 15987 26618 37671 23777 17669 6446 18181 60721
16284F0721j2839r3230l7227J0393J9162O768J7523m671k8107L909M4903K62j8369
$$ 60721 47882 -45348 -82575 -72182 -53020 -46252 -28729 -33400 -61507 -57598 -12695 -12433 -30802
16271c0802N738L9884K0346l3977o267l1696l9022L658m7723p545M8899K7743
$$ -30802 -25064 14820 35166 1189 -5078 -36774 -75796 -72138 -119861 -127406 -78507 -50764
16259e0764k9944J9243M4154r19k2964l766l09J2958M1430P638k859m3172R430
$$ -50764 -80708 -61465 -17311 -18230 -41194 -44960 -45269 -32311 9119 16757 13898 -29274 -19844
16246a9844j1376L02M953k449K6551Q939k3016J1619r385k0676m211k6840L7046
$$ -19844 -31220 -30918 -25965 -28414 -1863 7076 -15940 -4321 -13706 -34382 -38593 -65433 -28387
16233b8387P1434k2211k1363k7460l4578j1148L65j0100j3975k99L829L6125K8418
$$ -28387 43047 20836 -527 -27987 -62565 -73713 -73348 -83448 -97423 -97722 -93893 -57768 -29350
16220b9350J8465k1570J7308l7633j3794Q088L1348M1294J346k5204j7247J5528
$$ -29350 -10885 -32455 -15147 -52780 -66574 -58486 -27138 14156 15502 -9702 -26949 -11421
16208a1421J4768j2260n76K7754o047j0142p075k500J282l4784j2562M1340j809
$$ -11421 3347 -8913 -9489 18265 12218 2076 -4999 -7499 -6217 -41001 -53563 -12223 -14032
16195a4032j8647k8223L73o498K8582P729N789L0176L944l1195J2737J1860L198
$$ -14032 -32679 -60902 -60529 -67027 -38445 -30716 -24927 5249 9193 -22002 -9265 2595 5793
16182E793k1571j8413Q251k0805l7289r788J0868j1441r25K3685M5005M6433P904
$$ 5793 -15778 -34191 -25940 -46745 -84034 -93822 -82954 -94395 -95320 -71635 -26630 19803 27707
16169B7707l1275j7948L831r575Q68j6081r36J0476l7309M139R019J3229L209
$$ 27707 -3568 -21516 -17685 -27260 -26392 -42473 -43409 -32933 -70242 -66103 -57084 -43855 -40646
16156d0646n593k849k4206j0768m839M515K565J8996J295J362M747J3794k938
$$ -40646 -46239 -49088 -73294 -84062 -88901 -84386 -81821 -62825 -61530 -60168 -55421 -41627 -44565
16143d4565k5631l1651J7226J6489J2779R625J9969o589q725K65k199k2201N949
$$ -44565 -70196 -101847 -84621 -68132 -55353 -45728 -25759 -32348 -41073 -40808 -43007 -65208 -59259
16130e9259M0056O902j2996J9484k0291j2051k1533j2118o215J4182J986k2662
$$ -59259 -19203 -12301 -25297 -5813 -26104 -38155 -59688 -71806 -78021 -63839 -61853 -84515
16118h4515m151L0786L5328J0521o560j8287j9419K342l982N0715J985q869j067
$$ -84515 -88666 -57880 -22552 -12031 -18591 -36878 -56297 -53955 -57937 -7222 -5237 -14106 -15173
16105a5173j0895l4572J3743j6631k4372M813L2530n417k3233L5434M5267j4418
$$ -15173 -26068 -60640 -46897 -63528 -87900 -83087 -50557 -55974 -79207 -43773 1494 -12924
16093a2924m4724j2013k9909L0269K6289k031N4715L5291j3010m478o65l1278
$$ -12924 -57648 -69661 -99570 -69301 -43012 -45043 9672 44963 31953 27475 26810 -4468
16081d468j3490O555j9147J708R32k3303J5539P953n828Q157K0576Q10n664k3289
$$ -4468 -17958 -11403 -30550 -28842 -27910 -51213 -35674 -27721 -33549 -25392 -4816 -4006 -9670 -32959
16067c2959J184M140J449k960K4506J0891J2661n23k5269j5092k8510l7394k320
$$ -32959 -31775 -27635 -26186 -29146 -4640 6251 18912 18389 -6880 -21972 -50482 -87876 -90196
16054i0196K2369k858J2845M5688J9491J1727m304K184k0429k3973j9201l470
$$ -90196 -67827 -70685 -57840 -12152 7339 19066 14762 16946 -3483 -27456 -46657 -50127
16042e0127L491L2278L1736j7087l6566J600R332l952K3928K4993q668j0855j4305
$$ -50127 -46636 -14358 17378 291 -36275 -34675 -25343 -29295 -5367 19626 10958 103 -14202
16029a4202r884M695j2973J8431l980L3943M916j1793k7554J8984k4914L886K4391
$$ -14202 -24086 -19391 -32364 -13933 -17913 16030 20946 9153 -18401 583 -24331 -20445 3946
16016C946n8059j7740K2682m906K3089M2381l1841n677J7950j1746k4439j1409
$$ 3946 -54113 -71853 -49171 -54077 -30988 11393 -20448 -26125 -8175 -19921 -44360 -55769
16004e5769j218k0555L047K4609J8628J041L213k9062l3281l4454j0127J9624
$$ -55769 -56987 -77542 -74495 -49886 -31258 -30217 -27004 -56066 -89347 -123801 -133928 -114304
15992a14304O8573J6599L2708l9449p9295j5915M0478L1159J1709l4572m211K0738
$$ -114304 -45731 -29132 3576 -35873 -115168 -131083 -90605 -59446 -47737 -82309 -86520 -65782
15980f5782P156J2515K6914J6147o527J509l9722j2034K2198N988M273l0426j8036
$$ -65782 -58626 -46111 -19197 -3050 -9577 -8068 -47790 -59824 -37626 -31638 -27365 -57791 -75827
15967g5827j008M4191R650N525K8705m3031k7030K981K5040K9424k3549n9720
$$ -75827 -76835 -32644 -22994 -17469 11236 -31795 -58825 -55844 -30804 -1380 -24929 -84649
15955h4649j0697L5967J0747J0274L9931k799j3368j0213k494j9030l8008K0887
$$ -84649 -95346 -59379 -48632 -38358 1573 -1226 -14594 -24807 -27301 -46331 -84339 -63452
15943f3452J6486K7257j6674k0403o123J5836j8658L5663L4229j4614Q294J8413
$$ -63452 -46966 -19709 -36383 -56786 -62909 -47073 -65731 -30068 4161 -10453 -2159 16254
15931A6254K6220j3998l6417k0200K9927M548k3173k1425k6582L332p02j3662
$$ 16254 42474 28476 -7941 -28141 1786 6334 -16839 -38264 -64846 -61514 -62216 -75878
15919g5878N313Q2104J4380m8681p213M4573l553k2392m3296J5686N9076m282
$$ -75878 -70565 11539 25919 -22762 -29975 14598 11045 -11347 -54643 -38957 20119 15837
15907A5837n1124P11P129M982M6O437J8998J8528K1275j2988k7331K7431j5109
$$ 15837 -35287 -34576 -27447 -22465 -22419 -15982 3016 21544 42819 29831 2500 29931 14822
15894A4822k6777J561k3410p995J5296J2509m7574J1908M9591l849K4265q990
$$ 14822 -11955 -10394 -33804 -41799 -26503 -13994 -61568 -49660 -69 -3918 20347 11357
15882A1357p288J8041L5779p332o0650m7325Q147J6781L8533M2934J3123l2674
$$ 11357 4069 22110 57889 50557 -10093 -57418 -49271 -32490 6043 48977 62100 29426
15870B9426r697k1032k9785M0270k657j8995k0133j82l273j9717J3641K0908J4109
$$ 29426 19729 -1303 -31088 9182 6525 -12470 -32603 -32785 -36058 -55775 -42134 -21226 -7117
15857g117K8472j3614l681k0286M284J4015m068k255j7600j7488p201K2775K815
$$ -7117 21355 7741 4060 -16226 -11942 2073 -1995 -4250 -21850 -39338 -46539 -23764 -20949
15844b0949J1994k5678m4750L248N0998L3197L0065j7257l5602l7125l5099J3766
$$ -20949 -8955 -34633 -79383 -76135 -25137 8060 38125 20868 -14734 -51859 -86958 -73192
15832g3192N7592l1915o706p967k676J8013j9712J3556j4725l798J7772L9334
$$ -73192 -15600 -47515 -54221 -62188 -64864 -46851 -66563 -53007 -67732 -71530 -53758 -14424
15820a4424J2031k3234n0585J0712j402j9037L0931N2203Q689L082K7563o292
$$ -14424 -2393 -25627 -76212 -65500 -66902 -85939 -55008 -2805 5884 8966 36529 30237
15808C0237k0410j3739J637J8547Q178j1806k5448m0888j2772J4789K207K9878
$$ 30237 9827 -3912 -2275 16272 24450 12644 -12804 -53692 -66464 -51675 -49468 -19590
15796a9590N928k6024p881j2471k3145M4931Q203k8351l746R510L2773K125L967
$$ -19590 -13662 -39686 -47567 -60038 -83183 -38252 -30049 -58400 -62146 -52636 -19863 -17738 -13771
15783a3771m808j6702l5944k9008P458M3825K0396k0675R189K2139M1493J3921
$$ -13771 -18579 -35281 -71225 -100233 -92775 -48950 -28554 -49229 -40040 -17901 23592 37513
15771C7513l3777j0275O356L266J901j9205k1756R868k0179J3084R245j8061j9608
$$ 37513 3736 -6539 -183 3083 4984 -14221 -35977 -26109 -46288 -33204 -23959 -42020 -61628
15758f1628K3183J6988k3965j4549J1146M805j2357Q376j5148J622O368j3264
$$ -61628 -38445 -21457 -45422 -59971 -48825 -44020 -56377 -48001 -63149 -61527 -55159 -68423
15746f8423M6699J9249j8329j3081k133M599k6710K1032K3591j1219m138k07m433
$$ -68423 -21724 -2475 -20804 -33885 -36018 -31419 -58129 -37097 -13506 -24725 -28863 -29070 -33503
15733c3503j8184K7881M8992K4462m101K2393k8554n5929r278M465k0839j013
$$ -33503 -51687 -23806 25186 49648 45547 67940 39386 -16543 -25821 -21356 -42195 -43208
15721d3208K6139k9697j4333M3318j4863j7404J6166K280J943p495K7379K622
$$ -43208 -17069 -46766 -61099 -17781 -32644 -50048 -33882 -31602 -29659 -37154 -9775 -7153
15709g153j2987j2949L594K2611P972k5978j3774O653J4917O891Q392k5327k7118
$$ -7153 -20140 -33089 -29495 -6884 1088 -24890 -38664 -32011 -17094 -10203 -1811 -27138 -54256
15696e4256K9387k1110M598j5989K1013l3907k3796J0811K4445K4858K3816J6305
$$ -54256 -24869 -45979 -41381 -57370 -36357 -70264 -94060 -83249 -58804 -33946 -10130 6175
15684F175p027L0766P188k71k5496m5656j362m812m1036l1606L3765M8343J3817
$$ 6175 -852 29914 37102 36831 11335 -34321 -35683 -40495 -81531 -113137 -79372 -31029 -17212
15671a7212K239J8714k113j8531j9064l9013k208K1340L8704M16N303m944J1889
$$ -17212 -14973 3741 1628 -16903 -35967 -74980 -77188 -55848 -17144 -16728 -11425 -16369 -4480
15658d480K5795j8336J2184L2486J4468j8145j1162L2706N635J2330k2348j2210
$$ -4480 21315 2979 15163 47649 62117 43972 32810 65516 71151 83481 61133 48923
15646D8923P312l5661O845L2773P129k93N866k7217l1695N102k0656k3403L8846
$$ 48923 56235 20574 27419 60192 67321 67028 72894 45677 13982 19084 -1572 -24975 13871
15633A3871P366k6883j8220K597L1273k5725j7520K5688M5516m1266J8598L091
$$ 13871 21237 -5646 -23866 -21269 10004 -15721 -33241 -7553 37963 -3303 15295 18386
15621A8386k4992q906K2015J8099j7419k1444j1368J4539L8175K4272K2733n0694
$$ 18386 -6606 -15512 6503 24602 7183 -14261 -25629 -11090 27085 51357 74090 23396
15609B3396j4330J9552j714l9414K861L35k7529o403l2828l1111L7062L5838L0301
$$ 23396 9066 28618 26904 -12510 -9649 -9314 -36843 -43246 -76074 -107185 -70123 -34285 -3984
15596c984J4627o537K5577K96r350J6261K1037j8082j4809j7638M679N021l351
$$ -3984 10643 4106 29683 29979 20629 36890 57927 39845 25036 7398 12077 17098 13747
15583A3747k3728o496L0683k433o026l433J8207k8376l8007O359L9440K3425n2555
$$ 13747 -9981 -16477 14206 11773 5747 2314 20521 -7855 -45862 -39503 -63 23362 -29193
15570b9193r994j7667k040M511M3793j7599k7484J7869K2159L6224J542j9195
$$ -29193 -39187 -56854 -58894 -54383 -10590 -28189 -55673 -37804 -15645 20579 22121 2926
15558B926K507M417q581J573L7807J1497j1378P922k1032K2384j8320o1334J0542
$$ 2926 5433 9850 1269 2842 40649 52146 40768 48690 27658 50042 31722 -29612 -19070
15545a9070K2417L0107j6850J1821m908j1337K2311J3514L983k4663k8463j3565
$$ -19070 3347 33454 16604 28425 23517 12180 34491 48005 51988 27325 -1138 -14703
15533a4703j3997K5375K7577J1647k1134j4568j2825J3085J7801O244j4504n3166
$$ -14703 -28700 -3325 24252 35899 14765 197 -12628 457 18258 24502 9998 -43168
15521d3168l133Q792L7852O7251j3669k8191N718J5475K4670l8045j9944n842
$$ -43168 -46301 -37509 343 67594 53925 25734 31452 46927 71597 33552 13608 7766
15509G766j8280J2261J1480K6738K521j9302J4903J8946k3906p056J382j5042
$$ 7766 -10514 1747 13227 39965 42486 23184 38087 57033 33127 26071 27453 12411
15497A2411J7796q146j9088M6886j3166j7740K1617J3610j8641L887j2685P06
$$ 12411 30207 22061 2973 49859 36693 18953 40570 54180 35539 39426 26741 27447
15485B7447Q626k6317M3136q14l4412J1515j4317j0423k2529l5615K5464M3046
$$ 27447 36073 9756 52892 52078 17666 29181 14864 4441 -18088 -53703 -28239 14807
15473A4807N417k8876n915j3145p985m353K1906J4019J6256J4305K1653p318L226
$$ 14807 20224 -8652 -14567 -27712 -35697 -40050 -18144 -4125 12131 26436 48089 40771 43997
15460D3997k4258m5557m07N876J8674j8926n8591k278K3203m111J5863Q70J2923
$$ 43997 19739 -25818 -26225 -20349 -1675 -20601 -79192 -81470 -58267 -62378 -46515 -45645 -32722
15447c2722o449j0339J3426J9569K9374j6177p990j5589j0203J6767K7287O837
$$ -32722 -39171 -49510 -36084 -16515 12859 -3318 -11308 -26897 -37100 -20333 6954 13791
15435A3791Q181n673J6775j5569j5247K1709L9578j4438k7613j5890j318j7355
$$ 13791 21972 16299 33074 17505 2258 23967 63545 49107 21494 5604 4286 -13069
15423a3069m466O2531J3129m288l5859k7605J8942K3705q050O836j2252j2662
$$ -13069 -17535 44996 58125 53837 17978 -9627 9315 33020 24970 31806 19554 6892
15411F892J6597O868N932k0614N171J9574L2785K539k3149j8995k7537J4690j0600
$$ 6892 23489 30357 36289 15675 20846 40420 73205 75744 52595 33600 6063 20753 10153
15398A0153N49m0064o98M4866M6956k149j4046o366j6991j7652L3262L9086j5531
$$ 10153 10702 -29362 -30060 14806 61762 59613 45567 39201 22210 4558 37820 76906 61375
15385F1375j2331o448j7364n4631J1608J9243J3059j8215p45K6543O344j1286
$$ 61375 49044 42596 25232 -29399 -17791 1452 14511 -3704 -4449 22094 28438 17152
15373A7152j9803J9451q279j6820L617n07j4930K1369J700J2665P425O1083L8597
$$ 17152 -2651 16800 8521 -8299 -4682 -5189 -20119 1250 2950 15615 23040 84123 122720
15360A22720K4233k72o6468l9595J2963k75r602j118M786n843l991l354j1132
$$ 122720 146953 146681 80213 40618 53581 53306 43704 42586 47372 41529 37538 34184 23052
15347B3052j3315k8708l795m364K9460L1793r843m4931o909J9732K4868L0051
$$ 23052 9737 -18971 -22766 -27130 2330 34123 24280 -20651 -27560 -7828 17040 47091
15335D7091q824k3603L4731J1384N145l6100l8652J3704L6987m83k9540m849K5114
$$ 47091 38267 14664 49395 60779 65924 29824 -8828 4876 41863 41380 11840 6991 32105
15322C2105M3444k0149n9894N712M6337j8581q55J2401L6478N7624l2537k7548
$$ 32105 75549 55400 -4494 1218 47555 28974 28119 40520 76998 134622 102085 74537
15310G4537j0684N6588K2964o6546j2453L6769J4025k7028k2084K3951L481R964
$$ 74537 63853 120441 143405 76859 64406 101175 115200 88172 66088 90039 93520 103484
15298A03484m912P558j7889J4207K3848N568l0416p436K315j2486M595K422r803
$$ 103484 98572 106130 88241 102448 126296 131864 101448 94012 96327 83841 88436 90858 81055
15285H1055j2766J1558K1719K4617K7631O644L158k012k613k3576j6918L0362
$$ 81055 68289 79847 101566 126183 153814 160458 163616 161604 158991 135415 118497 148859
15273A48859J64o368k4098Q890J9021j0414K5987k41J8268M8947J1696j8358j6548
$$ 148859 149023 142655 118557 127447 146468 136054 162041 161800 180068 229015 240711 222353 205805
15260B05805J8024K6360L7784j8850m782J6221O6970J3129L827j8421m52j1699
$$ 205805 223829 250189 287973 269123 264341 280562 347532 360661 364488 346067 345615 333916
15248C33916m202j4618J8057L0115J8456K3338k2781j6510o599P099L7574L7255
$$ 333916 329714 315096 333153 363268 381724 405062 382281 365771 359172 366271 403845 441100
15236D41100j655N5621L5914M926O958j0845J6938M0427N2248N7490K7258L5319
$$ 441100 439445 495066 530980 535906 542864 532019 548957 589384 641632 699122 726380 761699
15224G61699K2452R228J8727P2362M8168P0590N2382O3583O9857K032Q3061J07834
$$ 761699 784151 793379 812106 884468 932636 1003226 1055608 1119191 1189048 1191080 1274141 1381975
15212A381975M9367J17992J55761J21364Q1336Q6553J13646J30848J27913J54866
$$ 1381975 1431342 1549334 1705095 1826459 1907795 1994348 2107994 2238842 2366755 2521621
15202B521621J38428J40039J80630J92734J85282J99535J98930J70950J87747
$$ 2521621 2660049 2800088 2980718 3173452 3358734 3558269 3757199 3928149 4115896
15193D115896J08552P5389O8828O9211N1763O7987K7698M580r5538r1203r6078
$$ 4115896 4224448 4299837 4368665 4437876 4489639 4557626 4585324 4589904 4494366 4403163 4307085
15182D307085j36418j71582j28799j29960j60248j56732k20590j45293j15719
$$ 4307085 4170667 3999085 3870286 3740326 3580078 3423346 3202756 3057463 2941744
15173B941744j02020q8858j31051j26131j24431r0641p4341r5388q4614q2475
$$ 2941744 2839724 2750866 2619815 2493684 2369253 2278612 2204271 2108883 2024269 1941794
15163A941794l6985n0679j10031p2392n3032n9091j4516n7683q4499o5847m7983
$$ 1941794 1904809 1854130 1744099 1671707 1618675 1559584 1545068 1487385 1402886 1337039 1289056
15152A289056j3770N900n2624p2575k8048k9539p1646l6764l2673n1235l6961
$$ 1289056 1275286 1281186 1228562 1155987 1127939 1098400 1026754 989990 957317 906082 869121
15141H69121k7379j8220r856k9013k3334m6510l2001l2386j5538j8871n9253j597
$$ 869121 841742 823522 813666 784653 761319 714809 682808 650422 634884 616013 556760 555163
15129E55163J0540l3855r437l696k5974k9055n1431J1143L871n871J125l7824
$$ 555163 565703 531848 522411 518715 492741 463686 412255 423398 427269 421398 422523 384699
15117C84699k8287J6007L736k1917J1626j1209o4457j0965N7831k14l1365n9017
$$ 384699 356412 372419 376155 354238 365864 354655 290198 279233 337064 336850 305485 246468
15105B46468k470M0510L2426l9955o7434J1366J9513j4142r830K359j4043l3734
$$ 246468 243998 284508 316934 276979 209545 220911 240424 226282 216452 218811 204768 171034
15093A71034K4104o989k9427O4p948Q838k5914l4632J8758J2308K5822R102k1047
$$ 171034 195138 188149 158722 158786 150838 159676 133762 99130 117888 130196 156018 165120 144073
15080A44073k2475K355K9058K3984p117l8547J0574l317j0827Q947O72K177m392
$$ 144073 121598 123953 153011 176995 169878 131331 141905 138588 127761 136708 137380 139557 135165
15067A35165k2141j8394J8112k515r779J8531j7000l6533K2329j1800k976k8083
$$ 135165 113024 94630 112742 110227 100448 118979 101979 65446 87775 75975 72999 44916
15055D4916M731L1094K9437j4528J7226L5228r150L824l5515k3137Q447j4891
$$ 44916 49647 80741 110178 95650 112876 148104 138954 142778 107263 84126 92573 77682
15043G7682J2316M534J8391j5753l3908j0699P278K7471L1699k0157J067j2743
$$ 77682 89998 94532 112923 97170 63262 52563 59841 87312 119011 98854 99921 87178
15031H7178n059j378j5416M2827L6732j1498n7803l2413p324K6976P805j0704
$$ 87178 82119 80741 65325 108152 144884 133386 75583 43170 35846 62822 70627 59923
15019E9923p879j8034K0436K3369j9592k3681K1200J9930K7196l7010K767j8540
$$ 59923 52044 34010 54446 77815 58223 34542 55742 75672 102868 65858 68625 50085
15007E0085k0483j5229J9165K7596J7905K3852K1054m049J8866k3769k7828k5413
$$ 50085 29602 14373 33538 61134 79039 102891 123945 119896 138762 114993 87165 61752
14995F1752l300P738n251K5331K667l1092J6233L489K6252L8354j1312l0301k3076
$$ 61752 58452 66190 60939 86270 88937 57845 74078 77567 103819 142173 130861 100560 77484
14982G7484n2399k3810j4182K0621N7389O665l608k6955k6410l3473J6323J1658
$$ 77484 25085 1275 -12907 7714 65103 71768 68160 41205 14795 -18678 -2355 9303
14970I303j9067J523j5779Q035J2441J2073L3859J0996k8218k2590j1967j1283
$$ 9303 -9764 -8241 -24020 -15985 -3544 8529 42388 53384 25166 2576 -9391 -20674
14958b0674J351J7384J8650J3436J3002l2399l9975K0020M4569J1205N094l6661
$$ -20674 -19323 -1939 16711 30147 43149 10750 -29225 -9205 35364 46569 51663 15002
14946A5002j482L9343J7216l2565l3316k3398l656K8214j8502j2867K3366l392
$$ 15002 13520 52863 70079 37514 4198 -19200 -22856 5358 -13144 -26011 -2645 -6037
14934f037K4647R032m8446l4147O418L3433N0208m07Q646O940l7458N884K155
$$ -6037 18610 27642 -20804 -54951 -48533 -15100 35108 34701 43347 50287 12829 18713 20868
14921B0868k3090J2113K0395J966J8200j4705k5977m0547k6573K2359K0674j1479
$$ 20868 -2222 9891 30286 32252 50452 35747 9770 -30777 -57350 -34991 -14317 -25796
14909b5796k3245K9366L3161k2850m1825l282J6057N7001M524k461k8503r686
$$ -25796 -49041 -19675 13486 -9364 -51189 -54471 -38414 18587 23111 20650 -7853 -17539
14897a7539K4781K3539j1185l5797M828p888l1771o364N5469J1743R363K6588
$$ -17539 7242 30781 19596 -16201 -11373 -19261 -51032 -57396 -1927 9816 19179 45767
14885D5767N032j9767o330o501j7549J424N7123m544j1426J6362l1750k0186j9226
$$ 45767 50799 31032 24702 18201 652 2076 59199 54655 43229 59591 27841 7655 -11571
14872a1571j3684p462N295N6947L6339l2172K0005o143j6410J3479j7394j7467
$$ -11571 -25255 -32717 -27422 29525 65864 33692 53697 47554 31144 44623 27229 9762
14860I762q856j6351j8757J7430O292m624J1349J2411L1483j1622m191Q61m921
$$ 9762 906 -15445 -34202 -16772 -10480 -15104 -3755 8656 40139 28517 24326 25187 20266
14847B0266j7955m0611r486M6854N2209L5360l0828l2463n7990L222K2566j1815
$$ 20266 2311 -38300 -47786 -932 51277 86637 55809 23346 -34644 -31422 -8856 -20671
14835b0671k6954J5900O186j233J1210J3783j1271k9098Q11J0460L7613M1581
$$ -20671 -47625 -31725 -25539 -26772 -15562 -1779 -13050 -42148 -41337 -30877 6736 48317
14823D8317m4608j3696K3347P951n728k0128p295J4568Q808J2255J1588J0555
$$ 48317 3709 -9987 13360 21311 15583 -4545 -11840 2728 11536 23791 35379 45934
14811D5934m540K0466K853K1462l6192j4223L841J627l7826k5382k2332J0374
$$ 45934 41394 61860 64713 86175 49983 35760 39601 41228 3402 -21980 -44312 -33938
14799c3938J6361L1103J4136p231j9281l072J5598m705K4799k6120K632j825M310
$$ -33938 -17577 13526 27662 20431 1150 -1922 13676 8971 33770 7650 10282 8457 12767
14786A2767R525j1499k200P721O393J1106J3450J1166n653k1465m3429L272r227
$$ 12767 22292 10793 8593 16314 22707 33813 47263 58429 52776 31311 -12118 -8846 -18073
14773a8073m2721P031Q246j1741L1124J7970n721Q035l610k8725k3165K7287N734
$$ -18073 -60794 -53763 -45517 -57258 -26134 -8164 -13885 -5850 -9460 -38185 -61350 -34063 -28329
14760b8329n809J8229P295L0716K3144K8093L257m7682L306k2561j6501K7514
$$ -28329 -34138 -15909 -8614 22102 45246 73339 76596 28914 32220 9659 -6842 20672
14748B0672j137j2945K6358r238N124k3571m5133k459R398N428L4680J4601k9071
$$ 20672 19535 6590 32948 23710 28834 5263 -39870 -42329 -32931 -27503 7177 21778 -7293
14735g293R117K1066j3242k8069j0118M8417J5536q675K861P592l2387k147m2992
$$ -7293 1824 22890 9648 -18421 -28539 19878 35414 26739 29600 37192 4805 2658 -40334
14722d0334k399P910o16M1427K5426p359l8185L2186J7683j2155m5187J114M9145
$$ -40334 -42733 -34823 -35439 5988 31414 24055 -14130 18056 35739 23584 -21603 -20489 28656
14709B8656J6349n25l3397j2773P457l1624k3731N0074L4746p700j6876j8747
$$ 28656 45005 44480 11083 -1690 5767 -25857 -49588 486 35232 27532 10656 -8091
14697h091J0780l234n72J9941K89J115R330R375k854k6988p720J9785j7226k1693
$$ -8091 2689 -545 -1117 18824 19113 20228 29558 38933 36079 9091 1371 21156 3930 -17763
14683a7763l9380J2780L4317J6227j2698l0939L4079J1066m712j266l502j1442
$$ -17763 -57143 -44363 -10046 6181 -6517 -37456 -3377 7689 2977 1711 -1791 -13233
14671a3233p160K6243P795P361l4802pp447K0567J5515j0186r192k0284j3125
$$ -13233 -20393 5850 13645 21006 -13796 -13803 -21250 -683 14832 4646 -4546 -24830 -37955
14658c7955L7844L1627K3169j0615N663j1084l0083m1789j6208J3082l170k2160
$$ -37955 -111 31516 54685 44070 49733 38649 8566 -33223 -49431 -36349 -39519 -61679
14646f1679L9892J6431N004l2829j5891K6755K8650J8611J3633k4133r730k793
$$ -61679 -21787 -5356 -352 -33181 -49072 -22317 6333 24944 38577 14444 4714 1921
14634A921K5790R537j9634k8229M963L9638L160m1225k7890J4277L6160L7847
$$ 1921 27711 37248 17614 -10615 -5652 33986 37146 -4079 -31969 -17692 18468 56315
14622E6315R043k8444j8385p515l5603k0139N717J0668k2339J6169L8139L9880
$$ 56315 65358 36914 18529 11014 -24589 -44728 -39011 -28343 -50682 -34513 3626 43506
14610D3506q479n345j3417J2706j9546J5956P194j7148l0005R404N0834K567l4159
$$ 43506 35027 29682 16265 28971 9425 25381 32575 15427 -14578 -5174 45660 48227 14068
14597A4068j5271L2293l4271j7797j3178R863K7795K2867l859n909j0574J843
$$ 14068 -1203 31090 -3181 -20978 -34156 -24293 3502 26369 22510 16601 6027 7870
14585G870j5168p651P495L7400j2229l0543j0079K107K2386p974l460K5099j1032
$$ 7870 -7298 -14949 -7454 29946 17717 -12826 -22905 -20798 1588 -6386 -9846 15253 4221
14572D221l256K0894K3000j9571j3902J1723k420j8405K5798L3233l8380k8057
$$ 4221 965 21859 44859 25288 11386 23109 20689 2284 28082 61315 22935 -5122
14560e122l3258k6432P874L0455K1105K1726l5206K902k2915J7919Q518J591m729
$$ -5122 -38380 -64812 -56938 -26483 -5378 16348 -18858 -15956 -38871 -20952 -12434 -10843 -15572
14547a5572J7061j468j5832J3159K9699J0188L0300l7785N7K9505J0948J7219
$$ -15572 1489 21 -15811 -2652 27047 37235 67535 29750 29807 59312 70260 87479
14535H7479l3425j5021l1772r894P997J0616J3847K5099Q143J5485q288l4845
$$ 87479 54054 39033 7261 -2633 5364 15980 29827 54926 63069 78554 70266 35421
14523C5421j9401R410k9856k813L375k4948O496K5112k3485K5358J6318l495k6753
$$ 35421 16020 25430 -4426 -7239 -3864 -28812 -22316 2796 -20689 4669 20987 17492 -9261
14510i261l3128q275k68N2233K275Q189l7623j8784N1533J8396j2566M255j7257
$$ -9261 -42389 -50664 -50932 1301 3576 11765 -25858 -44642 6891 25287 12721 16976 -281
14497b81j0582J6176K0876J00R213j2876J5427L4259j7661K2389J0087m5292l5919
$$ -281 -10863 5313 26189 26289 35502 22626 38053 72312 54651 77040 87127 41835 5916
14484E916L532K161j2337Q116k8880K859J0598J0700L0627j7236l3472L5396J2157
$$ 5916 9448 11609 -728 7388 -21492 -18633 -8035 2665 33292 16056 -17416 17980 30137
14471C0137R273j4681j4547O650j862J2686N4353j1411p3665l0999J4727J3720
$$ 30137 39410 24729 10182 16832 14970 27656 82009 70598 -3067 -34066 -19339 -5619
14459e619J9073L6348M7224N900l8033m0695n5032j3883J4374k1838j9165J9623
$$ -5619 13454 49802 97026 102926 64893 24198 -30834 -44717 -30343 -52181 -71346 -51723
14447e1723p970L0594J2061p269J7471N477J0627j7278O90L265J3244K623K873
$$ -51723 -59693 -29099 -17038 -24307 -6836 -1359 9268 -8010 -7320 -4055 9189 11812 14685
14434A4685j9082q199R98L7074p814m469o891L527K1187j5451l8211k7955P11
$$ 14685 -4397 -12596 -11598 25476 17662 13193 6302 9829 31016 15565 -22646 -50601 -49890
14421d9890n903M7491J1228K4037r015k2849m2945o860K6329P99J1372J8022j8438
$$ -49890 -55793 -8302 2926 26963 17948 -4901 -47846 -54706 -28377 -27578 -16206 1816 -16622
14408a6622j9482K7212p61M31j1216j1385K0777K9179j4641k0176p39j3919l7416
$$ -16622 -36104 -8892 -9653 -9222 -20438 -31823 -11046 18133 3492 -16684 -17423 -31342 -68758
14395f8758M406J819N572Q741L1601P288k6816j0827J8092J2313r40L2294K612
$$ -68758 -64352 -62533 -56961 -48220 -16619 -9331 -36147 -46974 -28882 -16569 -17509 14785 17397
14382A7397l0323J8611J2194J8021L545K762J152j6629l8288k0405J1204L7173
$$ 17397 -12926 5685 17879 35900 39445 42207 43359 26730 -11558 -31963 -20759 16414
14370A6414k1703k7398p727J0247k7093k954K8955O9918N5213p279K465o992k0476
$$ 16414 -5289 -32687 -40414 -30167 -57260 -60214 -31259 38659 93872 86593 89058 82066 61590
14357F1590m7049m7096k2137J3775K4266J4811K9622Q917R096O942j1935k663
$$ 61590 14541 -32555 -54692 -40917 -16651 -1840 27782 36699 45795 52737 40802 38139
14345C8139K269L6022Q478n934o146q521r25j3912O042k0041k1260J4985J0774
$$ 38139 40408 76430 84908 78974 72828 64307 63382 49470 55512 35471 14211 29196 39970
14332C9970R286j4199K4430k9011k9997M943L575N4479p914J1083j6338k829j4643
$$ 39970 49256 35057 59487 30476 479 5422 8997 63476 55562 66645 50307 47478 32835
14319C2835j6005O664l3856K730J3554k976K2871O476m7360l548K5391K8986j3707
$$ 32835 16830 23494 -10362 -7632 5922 2946 25817 32293 -15067 -18615 6776 35762 22055
14306B2055P217q999R704N548r034j1878o335k3278k029M2128r837N00j0739K201
$$ 22055 29272 20273 29977 35525 26491 14613 8278 -15000 -17029 25099 15262 15762 5023 7224
14292G224K9384k6015m287L6574M438J295J5981J0593l1161l3264q637J2573N437
$$ 7224 36608 10593 6306 42880 47318 48613 64594 75187 44026 10762 2125 14698 20135
14279B0135K0507j9524j6783L3740K5505j165n7284l0568J2410K5913j4468K2960
$$ 20135 40642 21118 4335 38075 63580 62415 5131 -25437 -13027 12886 -1582 21378
14267B1378J3497N70j2063m0098l1111j3736J3190N2520J0836J8072K8438L6173
$$ 21378 34875 35445 23382 -16716 -47827 -61563 -48373 4147 14983 33055 61493 97666
14255I7666j0682l9924n714j5022j3872L8569J29l8346j3619K0657k3064J7494
$$ 97666 86984 47060 41346 26324 12452 51021 51150 12804 -815 19842 -3222 14272
14243A4272L7524k8969k1210k105q201J4343j1062J3621K877j139J1475J1427
$$ 14272 51796 22827 1617 -488 -8689 5654 -5408 8213 11090 9951 21426 32853
14231C2853J7555q1983J1356M6153o992j4750L3643K8972J899J796k3323l369
$$ 32853 50408 -31575 -20219 25934 18942 4192 37835 66807 68706 70502 47179 43810
14219D3810n272o571l3044K8873O389k340jl3388l4383K0160K9931J3989j4838
$$ 43810 38538 31967 -1077 27796 34185 31845 31844 -1544 -35927 -15767 14164 28153 13315
14206A3315q344N667K7756J2331j0410n418O160Q349k7856k6620L365K5400J3236
$$ 13315 4971 10638 38394 50725 40315 34897 41057 49406 21550 -5070 -1705 23695 36931
14193C6931j5838n596J5650K3288j4392l5804m0795J7121L1645J4668m9362o899
$$ 36931 21093 15497 31147 54435 40043 4239 -36556 -19435 12210 26878 -22484 -29383
14181b9383J6320K0760l0871J2023k707n762R985k463J9134L2866k9625k5809
$$ -29383 -13063 7697 -23174 -11151 -13858 -19620 -9635 -12098 7036 39902 10277 -15532
14169a5532L7868p28J8968Q439k5824J2690K4871k3852j0044j4355J9726j1901
$$ -15532 22336 21608 40576 49015 23191 35881 60752 36900 26856 12501 32227 20326
14157B0326K493j8888K1541O0161K0268j4495l2900l0965j1729J5030M446J5653
$$ 20326 22819 3931 25472 85633 105901 91406 58506 27541 15812 30842 35288 50941
14145E0941M3735J6947L8808K8772M3960L7536J0393O8735M9398M265K1783K2599
$$ 50941 94676 111623 150431 179203 223163 260699 271092 339827 389225 393490 415273 437872
14133D37872K5841j6950l6642q4804m6921k2662m6104K2k315m2952n0201k980
$$ 437872 463713 446763 410121 325317 278396 255734 209630 209652 207337 164385 114184 111204
14121A11204l8240J017j679j9574k439J3200K2040m265N637M5985J9480n3495
$$ 111204 72964 73981 72302 52728 50289 63489 85529 81264 86901 132886 152366 98871
14109I8871l2121Q605o652m3576K3703K3516Q666j0716j3147J959k3820k668j8927
$$ 98871 66750 75355 68703 25127 48830 72346 81012 70296 57149 59108 35288 32620 13693
14096A3693J1979J4899M2036Q903l639M958l277o690o0434J1747K9947j842L516
$$ 13693 25672 40571 82607 91510 87871 92829 89552 82862 22428 34175 64122 62280 65796
14083F5796K3369j9387J0070L8291m9740n3029q951K4115K2160L0568l0775m9507
$$ 65796 89165 69778 79848 118139 68399 15370 6419 30534 52694 83262 52487 2980
14071B980k0920P387M4422J5550k1892n150J4611J8801j1211m0871j8201N4474
$$ 2980 -17940 -10553 33869 49419 27527 22377 36988 55789 44578 3707 -14494 39980
14059C9980O950K2950L7329K550k7476n3933J2471Q681J3055J9710j6133J2694
$$ 39980 46930 69880 107209 109759 82283 28350 40821 49502 62557 82267 66134 78828
14047G8828n605k6221M3834m640K91l8648r676Q119r217K5413j7144p397j5210
$$ 78828 73223 47002 90836 86196 86487 47839 38163 46282 37065 62478 45334 37937 22727
14034B2727m5007J4025K9609J0311l9148M79J7286K2635Q277k57m344n341K366
$$ 22727 -22280 -8255 21354 31665 -7483 -7004 10282 32917 41194 40937 36593 31252 33618
14021C3618k6452J7050M9028k3663k3802l5047q428R152K9809J8658J1263l155
$$ 33618 7166 24216 73244 49581 25779 -9268 -17696 -8544 21265 39923 51186 48031
14009D8031M0555L6k3947n2072l713K7421J8135J3106l5879j836K8708J780k2642
$$ 48031 88586 88622 64675 12603 8890 36311 54446 67552 31673 29837 58545 60325 37683
13996C7683q668K4078R448r314Q493j0696m6073L471J6693K6900K0826j6398k4633
$$ 37683 29015 53093 62541 53227 61720 51024 4951 8422 25115 52015 72841 56443 31810
13983C1810k0837q269L983K8203p612K9996K4215J7248p317M56k3926j0951q387
$$ 31810 10973 2704 6687 34890 27278 57274 81489 98737 91420 91876 67950 56999 48612
13970D8612j8990m507K3029l2539k3413P920L1956R758q989J4885K5998j5842
$$ 48612 29622 25115 48144 15605 -7808 112 32068 41826 32837 47722 73720 57878
13958E7878J0128J7073n702j5692l9360M81L5562J4385j3769q240k9532k705N955
$$ 57878 68006 85079 79377 63685 24325 24806 60368 74753 60984 52744 23212 20507 26462
13945B6462j2043j3086j3545M430N403o723K5593J37k9997K5427J8487J5738k6059
$$ 26462 14419 1333 -12212 -7782 -2379 -9102 16491 16628 -13369 12058 30545 46283 20224
13932B0224j198J4946k0916m1147R898K0009L9547p395L5051j7390M857L815k6762
$$ 20224 19026 33972 13056 -28091 -18193 1816 41363 33968 69019 51629 56486 60301 33539
13919C3539k3027j0877q188k274k0395k233M9759j7356M941K4892j4222L0244
$$ 33539 10512 -365 -8553 -10827 -31222 -33455 16304 -1052 3889 28781 14559 44803
13907D4803j273J778N277J9347j0164J5818J6035l041L3723k0343j6478j4242
$$ 44803 43530 45308 50585 69932 59768 75586 91621 88580 122303 101960 85482 71240
13895G1240J853r660K777J2671L800m0980l0015k1052j307M3248j0881L0610J6541
$$ 71240 73093 63433 66210 78881 82681 41701 11686 -9366 -10673 32575 21694 52304 68845
13882F8845k3451m9087k0154J5418L1193L6755m001M738j1885j9306J4324j2655
$$ 68845 45394 -3693 -23847 -8429 22764 59519 55518 60256 48371 29065 43389 30734
13870C0734j3852J4875P280K9347m935m6232M742K1763l7656j1762O528j8151
$$ 30734 16882 31757 39037 68384 63449 17217 21959 43722 6066 -5696 832 -17319
13858a7319Q070k2783j2720N4635J8596J760j1796J9793o20K2379k5276l7425
$$ -17319 -9249 -32032 -44752 9883 28479 30239 18443 38236 37616 59995 34719 -2706
13846b706k4092K5465J3080M1881j41J8036k9917j3670o046J1665J0316n581M0633
$$ -2706 -26798 -1333 11747 53628 53487 71523 41606 27936 21890 33555 43871 38290 78923
13833G8923j031m7495P481n657l9584J0221M619L3552m769K709J8747p085j5741
$$ 78923 77892 30397 37878 32221 -7363 2858 7477 41029 36260 38969 57716 50631 34890
13820C4890K4431J5074k1886p904l8140p014K1402L8652K3555O136J6986R601
$$ 34890 59321 74395 52509 44605 6465 -549 20853 59505 83060 89196 106182 115783
13808A15783k2574m0179J6653J5032L599j386K3996J1000p542j3922J9542N870
$$ 115783 93209 53030 69683 84715 88314 86928 110924 121924 114382 100460 120002 125872
13796A25872n7360j5101K2222N374j7473j4905R471k3254J0383J3027m088j735
$$ 125872 68512 53411 75633 81007 63534 48629 58100 34846 45229 58256 54168 52433
13784E2433r043j3477j685N1436K0598m2891l619N546L2014L6743l6957o9092
$$ 52433 43390 29913 28228 79664 100262 57371 53752 59298 91312 128055 91098 22006
13772B2006l3989J2237O0682K1255r063l6510Q164K6085L8163l8033r163L449
$$ 22006 -11983 254 60936 82191 73128 36618 44782 70867 109030 70997 61834 65283
13760F5283j9314j5238j2537K2037k1445N472L3677P535o242k0919m668J0744
$$ 65283 45969 30731 18194 40231 18786 24258 57935 65470 59228 38309 33641 44385
13748D4385K5374k4436l944J9722k7692K0580L5082j8044l8477L6989K4293q016
$$ 44385 69759 45323 41379 61101 33409 53989 89071 71027 32550 69539 93832 85816
13736H5816j8844K3089j5758k1175R636p609J1641J5086m1628r870L582j1377
$$ 85816 66972 90061 74303 53128 62764 55155 66796 81882 40254 30384 33966 22589
13724B2589j5534K010k005L77J4107p986p634K4567L0877R583K0707m2952k6504
$$ 22589 7055 9065 7060 7437 21544 13558 5924 30491 61368 70951 91658 48706 22202
13711B2202J0320K9543L897j6168J595k277L338p767j3565K3126K2519m893l1889
$$ 22202 32522 62065 65962 49794 51389 49112 52450 44683 31118 54244 76763 71870 39981
13698C9981j5898J77k1900K1107J1075K1909j271J4230j5187k6222k8015L1276
$$ 39981 24083 24260 2360 23467 34542 56451 55180 69410 54223 28001 -14 31262
13686C1262L7586j7201n79q974j3928K1108J0902J2130j9685K442l520k466K4204
$$ 31262 68848 51647 51068 42094 28166 49274 60176 72306 52621 55063 51543 49077 73281
13673G3281L6543J4276k6294l3978j0422O3346J0952k6863p014j2873j5478K4778
$$ 73281 109824 124100 97806 63828 53406 116752 127704 100841 93827 80954 65476 90254
13661I0254P356k7497j8046L1313N9074k8724l3924L268J4284k0441k5022N738
$$ 90254 97610 70113 52067 83380 142454 113730 79806 83074 97358 76917 51895 57633
13649E7633m6523j4449K0744J0935L1092p515p220L9572l437k553K197J5013O413
$$ 57633 11110 -3339 17405 28340 59432 51917 44697 84269 80832 78279 80476 95489 101902
13636A01902k6841j5261m0299j2083j4173L1941M0156k13j61K3946O966m88l0327
$$ 101902 75061 59800 19501 7418 -6755 25186 65342 65129 64968 88914 95880 95392 65065
13623F5065j4145j6124J0258k1118R260K4447j0757l259K7087j7521r398j627
$$ 65065 50920 34796 45054 23936 33196 57643 46886 43627 70714 53193 43795 42168
13611D2168M3881J3276J2510J0000n8395k905L8546p994p128l5097l2372K5309
$$ 42168 86049 99325 111835 121835 63440 60535 99081 91087 83959 48862 16490 41799
13599D1799L0352n940n600J3196j188J6983j1401k396k4764K3020M2245r543m8207
$$ 41799 72151 66211 60611 73807 72619 89602 78201 75805 51041 74061 116306 106763 58556
13586E8556k4330J3780L8516j603J1967k1277k2581j8898K9399J8815K3380j6360
$$ 58556 34226 48006 86522 84919 96886 75609 53028 34130 63529 82344 105724 89364
13574H9364j7165k2455k206M1293L6105P808k7197l1760l0916J3320J8597M826
$$ 89364 72199 49744 47538 88831 124936 132744 105547 73787 42871 56191 74788 79614
13562G9614L4662L0901j9558l632k0161k971L0518J8797m0840n5459m6997m56
$$ 79614 114276 145177 125619 121987 101826 98855 129373 148170 107330 51871 4874 4418
13550D418K7764K1810J3800K4300J0102J029L9862l3454j3596q630m8693k935
$$ 4418 32182 53992 67792 92092 102194 103223 143085 109631 96035 87405 38712 35777
13538C5777L1949L9243k0543j1216k1614l3664r312K7150K9639k0220k8112N431
$$ 35777 67726 106969 86426 75210 53596 19932 10620 37770 67409 47189 19077 24508
13526B4508N5421K5537k7539j5949k769K7211O201J3913j6906J3429n637K2179
$$ 24508 79929 105466 77927 61978 59209 86420 92621 106534 89628 103057 97420 119599
13514A19599j9634j7484K7263O131k524J1073p056l0506p548K048j488l0373k2358
$$ 119599 99965 82481 109744 115875 113351 124424 117368 86862 79314 81362 79874 49501 27143
13501B7143o746q011N0081L7747O125L5313L1380k0619m5874Q666j9183O314M5353
$$ 27143 20397 12386 62467 100214 106339 141652 173032 152413 106539 115205 96022 102336 147689
13488A47689K937l0095j9728o811J8848L0756J215j3886j2679k1275L1523J7741
$$ 147689 150626 120531 100803 93992 112840 143596 144811 130925 118246 96971 128494 146235
13476A46235m6584l8823k963R511L0285J9717J3431k9750k9315J3866L1371k5190
$$ 146235 99651 60828 57865 67376 97661 117378 130809 101059 71744 85610 116981 91791
13464I1791J6662J4257k6434k4452J3206K639L0937J6105N354n3302l7469m424
$$ 91791 108453 122710 96276 71824 85030 87669 118606 134711 140065 86763 49294 44870
13452D4870L872L9897j9852l2478J4958Q90q933P112L206K0461l6641j5992J4079
$$ 44870 48742 88639 68787 36309 51267 52157 43224 50336 53542 74003 37362 21370 35449
13439C5449N67J9274P079j2869K6665L1143p276k6312k2153l665m263J5557L943
$$ 35449 36016 55290 62369 49500 76165 107308 100032 73720 51567 47902 43639 59196 63139
13426F3139J5328K2283j5918M953L0095k7630j6935K7049L5283M6125o719Q954
$$ 63139 78467 100750 84832 89785 119880 92250 75315 102364 137647 183772 177053 186007
13414A86007J9177L8970J0707Q533J368P096k5997j7868k7904o4912k3090k9801
$$ 186007 205184 244154 254861 263394 264762 271858 245861 227993 200089 135177 112087 82286
13402H2286l6064P869M2254M7211L4646m3126j3492p912o066P622q131n640k205
$$ 82286 46222 54091 96345 143556 178202 135076 121584 113672 107606 115228 107097 101457 99252
13389I9252K6510m888k652R722j3745j0374K6888J8753l2687j4482L8265L204
$$ 99252 125762 120874 118222 127944 114199 103825 130713 149466 116779 102297 140562 143766
13377A43766P183p075K9741r892o176m934k3688j7079n478J3539L7846L847J9075
$$ 143766 150949 143874 173615 163723 157547 152613 128925 111846 106368 119907 157753 161600 180675
13364A80675N606m4037J8774L4364K1402o02k7381K0098R183r583J1430K9392
$$ 180675 186281 142244 161018 195382 216784 216182 188801 208899 218082 208499 219929 249321
13352B49321j0857j9756N1756J0395J0946k657k7494N759o31J2858K2385k1173
$$ 249321 238464 218708 270464 280859 291805 289148 261654 267413 266782 279640 302025 280852
13340B80852J324k1568o42R141K6271J4024J7876k7030k9569L4654O646K6033
$$ 280852 282176 260608 259966 269107 295378 309402 327278 300248 270679 305333 311979 338012
13328C38012N8617N0432K2909j3098K4591L8624K2957J5451L0460J3667K7077
$$ 338012 396629 447061 469970 456872 481463 520087 543044 558495 588955 602622 629699
13317F29699J5375N1902M9368L2914M3114O0373O1390N0534O4290M7293J50048
$$ 629699 645074 696976 746344 779258 822372 882745 944135 994669 1058959 1106252 1256300
13306A256300R6085K0066M9828P0516O1695Q7409N8440Q5923J9048P3960O0358
$$ 1256300 1352385 1372451 1422279 1492795 1554490 1641899 1700339 1786262 1805310 1879270 1939628
13295A939628K6755M6722N4716l115j4387J9497L971M801K0380N7666J4429J222
$$ 1939628 1966383 2013105 2067821 2064706 2050319 2069816 2073787 2078588 2098968 2156634 2171063 2172285
13283B172285L4770R4660J05119J15979J05855K22278K78267K73652L71466M67794
$$ 2172285 2207055 2301715 2406834 2522813 2628668 2850946 3129213 3402865 3774331 4242125
13273D242125N47664O67638M70641L4519l03123l65544l35899k95600k36444k05604
$$ 4242125 4789789 5457427 5928068 5962587 5659464 5293920 4958021 4662421 4425977 4220373
13263D220373j58221j55288q8762o9621q5171q8119j08405j02405m1330q4110
$$ 4220373 4062152 3906864 3818102 3748481 3663310 3575191 3466786 3364381 3323051 3238941
13253C238941j31598p6338o7048o4198m1129R054k5476k6685J3749K6250m2929
$$ 3238941 3107343 3031005 2963957 2899759 2858630 2867684 2842208 2815523 2829272 2855522 2812593
13242B812593l8228j3751l454J480J4290R170l5288p3537n0823m2102k1982p9295
$$ 2812593 2774365 2760614 2757160 2758640 2772930 2782100 2746812 2673275 2622452 2580350 2558368 2479073
13230B479073p6447j04299j27362o7151r5706q8674r2878o4992n6960p1618o0075
$$ 2479073 2402626 2298327 2170965 2103814 2008108 1919434 1826556 1761564 1704604 1632986 1572911
13219A572911j01165r7946n0759l6989o6599l8704n8782l0122p1716k9040r595
$$ 1572911 1471746 1373800 1323041 1286052 1219453 1180749 1121967 1091845 1020129 991089 981494
13208I81494k3787o204o150m1367j8851k9210k6123k7335m1896J0279J3867j8743
$$ 981494 957707 951503 945353 903986 885135 855925 829802 802467 760571 770850 784717 765974
13196G65974K3202J3474k6021P840m2778p4829j8356m2048j8732K0006m4451r9774
$$ 765974 789176 802650 776629 784469 741691 666862 648506 606458 587726 607732 563281 463507
13184D63507j2867N5091j3672k7264L9113m578k9042j2923n1970j1550o338K2165
$$ 463507 450640 505731 492059 464795 503908 499330 470288 457365 405395 393845 387507 409672
13172D09672M2717P820m059K8724j3179k8935j2474j5441q814q913K4636k7597
$$ 409672 452389 460209 456150 484874 471695 442760 430286 414845 406031 397118 421754 394157
13160C94157n4897N373j1925L611j4435M02J6116P685L7398L1634R2667P2253
$$ 394157 339260 344633 332708 336319 321884 322286 338402 346087 383485 415119 507786 580039
13148E80039P5002K1979k8630n7260o6115m5358o3022n2421Q068j5432l6790m445
$$ 580039 655041 677020 648390 591130 525015 479657 416635 364214 372282 356850 320060 315615
13136C15615k0767k748J2128m826J0005j0659J251O056k5911j3387K6285L756
$$ 315615 294848 292100 304228 299402 309407 298748 299999 306055 280144 266757 293042 296798
13124B96798q611j9707K447O449J8087J1521L284j450K0908J2413l5737J3152
$$ 296798 288187 268480 270927 277376 295463 306984 310268 308818 329726 342139 306402 319554
13112C19554Q161J945P873J9906L8775l739M0962N4642P5850K2913N631J2918
$$ 319554 327715 329660 337533 357439 396214 392475 433437 488079 563929 586842 592473 605391
13100F05391j0218m2668p1991l6916k5596l7714j9816j9036j0103L44J4002J4612
$$ 605391 595173 552505 480514 443598 418002 380288 360472 341436 331333 331677 345679 360291
13088C60291j4073k6502p76R710J6939J9301n43n23J2331J312j4284n744o717
$$ 360291 346218 319716 318940 328650 345589 364890 364347 363824 376155 377467 363183 357439 350722
13075C50722M3701N0835L6574j5614k6090J7176M2740R1788P2462P3742Q1579
$$ 350722 394423 445258 481832 466218 440128 457304 500044 591832 664294 738036 819615
13064H19615P3865J9754l2482j42221o2731p0401n6239L3029J3042k263k8810
$$ 819615 893480 913234 880752 738531 675800 605399 549160 582189 595231 592968 564158
13053E64158m4414j3588k4003K6295j9596k8111m9851l4064l6543n922j39M5733
$$ 564158 519744 506156 482153 508448 488852 460741 410890 376826 340283 334361 334222 379955
13041C79955R01j9733J0601J1147K1048O372j0851m8237m1068j9780k879K872
$$ 379955 380856 361123 371724 382871 403919 410291 399440 351203 310135 290355 287476 290348
13029B90348L349o522n873p120J0708k881M1922J0008m6314n3291l3368M0964
$$ 290348 293697 287175 281302 274182 284890 282009 323931 333939 287625 234334 200966 241930
13017B41930L9380M978L492J6861r108l9633j6546L5337J5719K0698k8537j9114
$$ 241930 281310 286288 289780 306641 297533 257900 241354 276691 292410 313108 284571 265457
13005B65457K0832j8679m7610J3648M2048p049k5150k2878l7828R595K0176K4346
$$ 265457 286289 267610 220000 233648 275696 268647 243497 220619 182791 192386 212562 236908
12993B36908J2794O323L6830p437l6316L789M3771M6461L448J1539K60J9403L3588
$$ 236908 249702 256025 292855 285418 249102 252891 296662 343123 346571 358110 358370 377773 411361
12980D11361L7034j9285j2594m3208J6897L0208R160R295J1762K7069J0775L5673
$$ 411361 448395 429110 416516 373308 390205 420413 429573 438868 450630 477699 488474 524147
12968E24147J2274N970k359q327J559l805M5306J04602J44201J56087O9989J1665
$$ 524147 536421 542391 540032 531705 533264 529459 574765 679367 823568 979655 1049644 1061309
12956A061309l542j1510m3450n5714m8934N209j0921j074N633M7052N2188M4700
$$ 1061309 1057767 1046257 1002807 947093 898159 903368 892447 891373 897006 944058 996246 1040946
12944A040946P2292N3458Q5518Q3171P0327N5455j0823j03860l23287l17716o6251
$$ 1040946 1113238 1166696 1252214 1335385 1405712 1461167 1450344 1346484 1023197 705481 639230
12933F39230M8696R7416M4464N4218N1360Q3194N4076k2015l3034j9982N0554
$$ 639230 687926 785342 829806 884024 935384 1018578 1072654 1050639 1017605 997623 1048177
12922A048177L3082R884R855q488J1593P389m960K6725J3645J7630n081J0292
$$ 1048177 1081259 1091143 1100998 1092510 1104103 1111492 1106532 1133257 1146902 1164532 1159451 1169743
12910A169743j3674M2032M5874L949L1966L5491M6269R1400Q5459O3763K6919
$$ 1169743 1156069 1198101 1243975 1247924 1279890 1315381 1361650 1453050 1538509 1602272 1629191
12899A629191Q4792L7309K0951J9399M3470P8712Q5130J19331K12702K13638M2138
$$ 1629191 1713983 1751292 1772243 1791642 1835112 1913824 1998954 2118285 2330987 2544625 2586763
12888B586763p5527j39116j48538q9644p8216l0426R556k580N083r436l6606J8164
$$ 2586763 2511236 2372120 2223582 2133938 2055722 2025296 2034852 2032272 2037355 2027919 1991313 2009477
12876B009477N8466N2855N1054L7585O6169Q8102Q3369N8917k535R8526J17880
$$ 2009477 2067943 2120798 2171852 2209437 2275606 2363708 2447077 2505994 2503459 2601985 2719865
12865B719865J25623J13373J12965J47553J68640J91621K54310L35947M01864
$$ 2719865 2845488 2958861 3071826 3219379 3388019 3579640 3833950 4169897 4571761
12856D571761M94838N29744N77574P32788Q76990J188371J598094K048450K554083
$$ 4571761 5066599 5596343 6173917 6906705 7783695 8972066 10570160 12618610 15172693
12847A5172693L365947M422944N082609L932754N13611k589251l766384l805094
$$ 15172693 18538640 22961584 28044193 31976947 32490558 29901307 26134923 22329829
12839B2329829l307883k538412j797520j172328p62978m87518k32735K3704J75826
$$ 22329829 19021946 16483534 14686014 13513686 12750708 12263190 12030455 12054159 12229985
12830A2229985L37350N95807Q76206J123977J440531J798785K228299K899335
$$ 12229985 12567335 13163142 14039348 15163325 16603856 18402641 20630940 23530275
12822B3530275L661970M349294N081742O434410Q612183J2012491J7159153K4401920
$$ 23530275 27192245 31541539 36623281 43057691 51669874 63682365 80841518 105243438
12814A05243438L4461773M9932743P6357688J11837068J14481772L6821867n4710639
$$ 105243438 139705211 189637954 265995642 377832710 492314482 529136349 474425710
12807D74425710q6695816q5114002p4505144n5987233l8659360k6711721j8828604
$$ 474425710 387729894 302615892 228110748 172123515 133464155 106752434 87923830
12800H7923830j3622357r942366p188497n532734m772040m226111l593373k940982
$$ 87923830 74301473 64359107 57170610 51637876 46865836 42639725 39046352 36105370
12792C6105370k420172j971178j692267j491793j302015j101761r54436q48542
$$ 36105370 33685198 31714020 30021753 28529960 27227945 26126184 25171748 24323206
12784B4323206p89866p02522n72394m38774l50118k57661k63015k30371j28745
$$ 24323206 23533340 22830818 22258424 21819650 21469532 21211871 20948856 20718485 20589740
12775B0589740n8181K8427J22498K06053J74477j57466n96546q62918r50469r12861
$$ 20589740 20531559 20559986 20682484 20888537 21063014 20905548 20309002 19446084 18495615 17582754
12765A7582754r01086q42711p14250p03934o25425o13470n86373n72836n74042
$$ 17582754 16681668 15838957 15124707 14420773 13795348 13181878 12595505 12022669 11448627
12756A1448627n46707n43757m81807m91006m85954l99686l64115l53341l83940
$$ 11448627 10901920 10358163 9876356 9385350 8899396 8499710 8135595 7782254 7398314
12747G398314l42169l03594k98203k89799k88728k78606k30660k50122k28188
$$ 7398314 7056145 6752551 6454348 6164549 5875821 5597215 5366555 5116433 4888245
12738D888245j93217j93306j70919j87398j56416j75345j53782j42889j85145
$$ 4888245 4695028 4501722 4330803 4143405 3986989 3811644 3657862 3514973 3329828
12729C329828j75959j25023q6184r606m3563j18265r7032o2999o3071q0116o6273
$$ 3329828 3153869 3028846 2942662 2933056 2889493 2771228 2674196 2611197 2548126 2468010 2401737
12718B401737m4897k4496o5219r7167j02670p6411p5407n5770r5010o7485l0185
$$ 2401737 2356840 2332344 2267125 2169958 2067288 1990877 1915470 1859700 1764690 1697205 1667020
12707A667020k5083r3343p5371k1738l8162P80k9569k8005l4015j4021k6579o3137
$$ 1667020 1641937 1548594 1473223 1451485 1413323 1414103 1384534 1356529 1322514 1308493 1281914 1218777
12695A218777k5104m222L3063K6371J7464L3152J02290J51736J56115K19761K50436
$$ 1218777 1193673 1189451 1222514 1248885 1266349 1299501 1401791 1553527 1709642 1929403 2179839
12684B179839K85937K33111r904l68010m04962k79474j86821j70531j44325p9547
$$ 2179839 2465776 2698887 2688983 2320973 1916011 1636537 1449716 1279185 1134860 1055313
12674A055313m1326j3396j0275k309l5443J1995l8125m1194m4319k0633n9033
$$ 1055313 1013987 1000591 990316 988007 952564 964559 926434 885240 840921 820288 761255
12663G61255p426l0980L4864K8469j3211j1443L3865P6359Q7683O4377K0762n5308
$$ 761255 753829 722849 757713 786182 772971 761528 795393 871752 959435 1023812 1044574 989266
12651I89266p3578l0170r336M448P4247N4631L3126J7677K362r769K8545M2688
$$ 989266 915688 885518 876182 880630 954877 1009508 1042634 1060311 1062673 1052904 1081449 1124137
12639A124137M6509M2715M5290L0803L0866R144K8543N7193J37026J13221J28421
$$ 1124137 1170646 1213361 1258651 1289454 1320320 1329464 1358007 1415200 1552226 1665447 1793868
12628A793868J28452J51480J16156Q1963L5432L4684R559l1641n5071j14224r9206
$$ 1793868 1922320 2073800 2189956 2271919 2307351 2342035 2351594 2319953 2264882 2150658 2051452
12617B051452o8329m6113j00755r8556j02646m0178l5158m5131k9331l2069J46
$$ 2051452 1983123 1937010 1836255 1737699 1635053 1594875 1559717 1514586 1485255 1453186 1453332
12606A453332n5812j7248j1631r282l652p163j2745k0078l585P301K1810J0363
$$ 1453332 1397520 1380272 1368641 1359359 1355707 1348544 1335799 1315721 1312136 1319437 1341247 1351610
12594A351610j117J6473J8053p504K3992m757L3434N4468L031l985L5588M7343
$$ 1351610 1350493 1366966 1385019 1377515 1401507 1396750 1430184 1484652 1487683 1483698 1519286 1566629
12582A566629k296M3903L8172n254K3840J0237m159j8109k8527l425K8149L2056
$$ 1566629 1564333 1608236 1646408 1641154 1664994 1675231 1671072 1652963 1624436 1621011 1649160 1681216
12570A681216K1136L6113J1655N7421Q2137N3262M5873N8244N768N8866P7553
$$ 1681216 1702352 1738465 1750120 1807541 1889678 1942940 1988813 2047057 2052825 2111691 2189244
12559B189244J14632J00374Q8932R7577L9294J2693L2832Q2357M1864O6889P4028
$$ 2189244 2303876 2404250 2493182 2590759 2630053 2642746 2675578 2757935 2799799 2866688 2940716
12548B940716R0942J08473R8693O8924R5604J20466J00346O6829J63347K36225
$$ 2940716 3031658 3140131 3238824 3307748 3403352 3523818 3624164 3690993 3854340 4090565
12538D090565K26487K20370J83031K45601K97827K85661L22317L84887M31560
$$ 4090565 4317052 4537422 4720453 4966054 5263881 5549542 5871859 6256746 6688306
12529F688306N03308N74642O67495P84681Q73076J022403J218455J390922J694736
$$ 6688306 7191614 7766256 8433751 9218432 10091508 11113911 12332366 13723288 15418024
12520A5418024K079049K609786L247697M100819N250671O652164Q328398J0361163
$$ 15418024 17497073 20106859 23354556 27455375 32706046 39358210 47686608 58047771
12512E8047771J2369684J3835475J3607141J0572990M984379j370142o489167
$$ 58047771 70417455 84252930 97860071 108433061 113417440 112047298 105558131
12505A05558131r403207j0219825r518884q071495o261048m462222k870076j430076
$$ 105558131 96154924 85935099 76416215 68344720 62083672 57621450 54751374 53321298
12497E3321298j62827R94467J994269K900648L724556M396963M877725N202825
$$ 53321298 53158471 54152938 56147207 59047855 62772411 67169374 72047099 77249924
12489G7249924N427131N614998N843418O007664O023735N955238N645359N062585
$$ 77249924 82677055 88292053 94135471 100143135 106166870 112122108 117767467 122830052
12481A22830052M235327L118647J770282L48804j083730k325694l337867m048713
$$ 122830052 127065379 130184026 131954308 132303112 131219382 128893688 125555821 121507108
12473A21507108m533000m727000m766512m768987m712360m721020m651647m548446
$$ 121507108 116974108 112247108 107480596 102711609 97999249 93278229 88626582 84078136
12465H4078136m381468m063795l636580l077365k367887j458410l92242P96159
$$ 84078136 79696668 75632873 71996293 68918928 66551041 65092631 64700389 65496548
12457F5496548K193625L736962N536407P599573R554570J0992883J1201449R097272
$$ 65496548 67690173 71427135 76963542 84563115 94117685 105110568 116312017 125409289
12449A25409289M464912j669264p322550j1040755j2598796j2393858j1146155
$$ 125409289 129874201 128204937 120882387 109841632 97242836 84848978 73702823
12442G3702823r500889p846580o415858n190543m196771l475621k833720k402039
$$ 73702823 64201934 56355354 49939496 44748953 40552182 37076561 34242841 31840802
12434C1840802k067245j787320j589559j444347j289013j174969j067251r68937
$$ 31840802 29773557 27986237 26396678 24952331 23663318 22488349 21421098 20452161
12426B0452161q98354q17134p76572p28617o74353n91330n26838m89355n16638
$$ 20452161 19553807 18736673 17960101 17231484 16557131 15965801 15438963 14949608 14432970
12417A4432970m58588l73312l78712l53434l35131l68925l43453k90431l50956
$$ 14432970 13974382 13601070 13222358 12868924 12533793 12164868 11821415 11530984 11180028
12408A1180028l92949l92246m26974m12665m14729m12949m29480l85200l47991
$$ 11180028 10787079 10394833 9967859 9555194 9140465 8727516 8298036 7912836 7564845
12399G564845l24378k76634k43830k08088k70161k53923k26889k03681j96056
$$ 7564845 7240467 6963833 6720003 6511915 6241754 5987831 5760942 5557261 5361205
12390E361205j90331k17320j94800j63297j25590r0821j19114r4635r8027j78054
$$ 5361205 5170874 4953554 4758754 4595457 4469867 4379046 4259932 4165297 4067270 3889216
12380C889216j54504j53976r8715j23464j19415o1037r4815j28868r6819q4480
$$ 3889216 3734712 3580736 3482021 3358557 3239142 3178105 3083290 2954422 2857603 2773123
12370B773123q7530j19964p3444m2191r0630o8907k5502j0608k2200m3766l4051
$$ 2773123 2685593 2565629 2492185 2449994 2359364 2290457 2264955 2254347 2232147 2188381 2154330
12359B154330p455q323l8771N3158J7192RQ25m678K02k3583n551k501N9105R0260
$$ 2154330 2146875 2138552 2099781 2152939 2170131 2170140 2170965 2166287 2166489 2142906 2137355 2134854 2193959 2284219
12345B284219Q2137J70814L23372N50779O77971M55891k4670l89660m58746m58354
$$ 2284219 2366356 2537170 2860542 3411321 4089292 4545183 4520513 4130853 3672107 3213753
12335C213753m08548l02942k16164j40082j34097j19023o3540p5038j9573J2747
$$ 3213753 2805205 2502263 2286099 2146017 2011920 1892897 1829357 1754319 1734746 1747493
12325A747493j643n2426J2924j4627k8831k8648m7324n8807o7877p5589o8793
$$ 1747493 1745850 1693424 1706348 1691721 1662890 1634242 1586918 1528111 1460234 1384645 1315852
12314A315852m9786K8332J5557J260n333j2765Q858M1286l2228j3896Q677L0944
$$ 1315852 1266066 1294398 1309955 1311215 1305882 1293117 1301975 1343261 1311033 1297137 1305814 1336758
12302A336758K9560J9841P487K0706J2740K0789J2503N1900J4491j5258j5683
$$ 1336758 1366318 1386159 1393646 1414352 1427092 1447881 1460384 1512284 1526775 1511517 1495834
12291A495834K3891L9033L2284P906R092k8146n838J5855O811R277L7206J7363
$$ 1495834 1519725 1558758 1591042 1598948 1608040 1579894 1574056 1589911 1596722 1605999 1643205 1660568
12279A660568j7721K6502L0776K1796j1102K3732J3745n523P1593K4583K1059
$$ 1660568 1642847 1669349 1700125 1721921 1710819 1734551 1748296 1742773 1814366 1838949 1860008
12268A860008m041Q566j4826J1282J7950n881M1727M9981O2301K5571N0283M1902
$$ 1860008 1855967 1864533 1849707 1860989 1878939 1873058 1914785 1964766 2027067 2052638 2102921 2144823
12256B144823K5327K87M347L1691N4190Q9337M0456L6767Q0769M9663P7150J12095
$$ 2144823 2170150 2170437 2174784 2206475 2260665 2350002 2390458 2427225 2507994 2557657 2634807 2746902
12244B746902J02456J47980J45336J47327J29665J84525K04505K37492K65803
$$ 2746902 2849358 2997338 3142674 3290001 3419666 3604191 3808696 4046188 4311991
12235D311991K60996L53389M14638M71130N57877O95357Q28982R51065J148712
$$ 4311991 4572987 4926376 5341014 5812144 6370021 7065378 7894360 8845425 9994137
12226I994137J329270J563872J787072K006033K228430K575021L054258L779502
$$ 9994137 11323407 12887279 14674351 16680384 18908814 21483835 24538093 28317595
12218B8317595M863951O498918Q787768J1743424J5050788J8018924K0362368
$$ 28317595 33181546 39680464 48468232 60211656 75262444 93281368 113643736
12211A13643736K1792508K1583520J8991186J4443397Q581588J750466n304968
$$ 113643736 135436244 157019764 176010950 190454347 199035935 200786401 195481433
12204A95481433j1749710j6572627j9350444k0392946j9855881j7905553j5032336
$$ 195481433 183731723 167159096 147808652 127415706 107559825 89654272 74621936
12197G4621936j1961567r215841o873104n212065m059846l205984k680557k382708
$$ 74621936 62660369 53444528 46571424 41359359 37299513 34093529 31412972 29030264
12189B9030264k128060j906298j755267j588219j369528j257392j046180r41535
$$ 29030264 26902204 24995906 23240639 21652420 20282892 19025500 17979320 17037785
12181A7037785p73775o02961n08849m35456l41631l14423k26956j65144j65887
$$ 17037785 16264010 15661049 15152200 14716744 14375113 14060690 13833734 13668590 13502703
12172A3502703j55457j43162j48666j94310k09010k52401l29847l79329m22311
$$ 13502703 13347246 13204084 13055418 12861108 12652098 12399697 12069850 11690521 11268210
12163A1268210m36370m27522m51121m80739m49654m30232m18906l61399l88020
$$ 11268210 10831840 10404318 9953197 9472458 9022804 8592572 8173666 7812267 7424247
12154G424247l42295l24461k89018l13731k95494k85848k59404k92471k37068
$$ 7424247 7081952 6757491 6468473 6154742 5859248 5573400 5313996 5021525 4784457
12145D784457k06539k01321k05766j72106j85853j54940j43143j51056j70356
$$ 4784457 4577918 4376597 4170831 3998725 3812872 3657932 3514789 3363733 3193377
12136C193377j77703j31496j21092j31164j19906j32001q2939q7280p8152m7248
$$ 3193377 3015674 2884178 2763086 2631922 2512016 2380015 2297076 2209796 2131644 2084396
12126B084396m5580p5596r8719p5807o6289q5628k5143o4585o8715m1787o5706
$$ 2084396 2038816 1963220 1864501 1788694 1722405 1636777 1611634 1547049 1478334 1436547 1370841
12115A370841p0387l0395l9789m7588k8894j4478l1296m9391p1473n8133m4178
$$ 1370841 1300454 1270059 1230270 1182682 1153788 1139310 1108014 1058623 987150 929017 884839
12104H84839o44O72n6262k7621m736k4933l2925K1318j1551p610K3762k504j9689
$$ 884839 884195 884867 828605 800984 796248 771315 738390 759708 748157 740547 764309 761805 742116
12091G42116o11J7867O187K3052P2338P5520P0521O1280M4536M0510K4255K474
$$ 742116 741505 759372 765559 788611 860949 936469 1006990 1068270 1112806 1153316 1177571 1180045
12079A180045o6410p5671o6837n6600m6544n8908j19651r4041k1741k3713m1305
$$ 1180045 1113635 1037964 971127 914527 867983 809075 689424 595383 573642 549929 508624
12068E08624j2999m853m9778q435K265j7701j4702l057j4781K1321N2867M4403
$$ 508624 495625 490772 440994 432559 434824 417123 402421 399364 384583 405904 458771 503174
12056E03174L8252N7349Q6155J07892O5472N691m9428k0796n1502o1779m8279
$$ 503174 541426 598775 684930 792822 858294 863985 814557 793761 742259 680480 632201
12045F32201m4100k190K7675k3562j1101J6228J0299K1061O653L1649M6740L3966
$$ 632201 588101 585911 613586 590024 578923 595151 605450 626511 633164 664813 711553 745519
12033G45519K6148L1562K7810M2392Q5518L5733J2157N1030K9638N862p525J1568
$$ 745519 771667 803229 831039 873431 958949 994682 1006839 1057869 1087507 1093369 1085844 1097412
12021A097412O880l8666J0791k1658j3318K787k2139n8045n4014l0494k9475j020
$$ 1097412 1104292 1065626 1076417 1054759 1041441 1044228 1022089 964044 910030 879536 850061 849041
12009H49041r796o9874n3982l5452j5440k3563K9649M2036J1431j338N981K8688
$$ 849041 839245 769371 715389 679937 664497 640934 670583 712619 724050 722712 728693 757381
11997G57381L7897J9974L8772N1539M6363J3483o872n257o4359p1556o7194m6101
$$ 757381 795278 815252 854024 905563 951926 965409 958537 953280 888921 817365 750171 704070
11985G04070o1749o7831k8028l578l4113k8885J031k1488J3355j3189k0474k5875
$$ 704070 642321 574490 546462 542884 508771 479886 480917 459429 472784 459595 439121 413246
11973D13246j2060m9432l3382l6122k644O601j8521K8193L4933L3874k6460k4134
$$ 413246 401186 351754 318372 282250 279606 286207 267686 295879 330812 364686 338226 314092
11961C14092k1030j6716j2415M9438L6173k1466j8778l922o4298j7816N762P515
$$ 314092 293062 276346 263931 313369 349542 328076 309298 305376 241078 223262 229024 236539
11949B36539j4975J0732j7785l7563K1333j3902j5442j3072j4158j6287k408n140
$$ 236539 221564 232296 214511 176948 198281 184379 168937 155865 141707 125420 123012 117872
11937A17872O957n38R084k3113J7850l750P186l198j4428L1624o2425j4730O668
$$ 117872 124829 124291 133375 110262 128112 124362 131548 128350 113922 145546 83121 68391 75059
11924G5059J8959J803R002J3734l8559l5392K1185j3861l3340J672K2878m544
$$ 75059 94018 95821 104823 118557 79998 44606 65791 51930 18590 20262 43140 38596
11912C8596J0555l589m883J5036K9235k74k2970K9035K1715j0987j6073j6426
$$ 38596 49151 45562 40679 55715 84950 84676 61706 90741 112456 101469 85396 68970
11900F8970j4744j7409O227P680K4279L955L6213R566L1732N484m4267j1583K3690
$$ 68970 54226 36817 43044 50724 75003 78958 115171 124737 156469 161953 117686 106103 129793
11887A29793K1345n641k1805Q932K2999L1452P125k0311p41J0382R993k0939o907
$$ 129793 151138 145497 123692 132624 155623 187075 194200 173889 173148 183530 193523 172584 165677
11874A65677J2143K0418k937J336l0988m6607k8500O778M2641K9042P705j5653
$$ 165677 177820 198238 195301 196637 165649 119042 90542 97320 139961 169003 176708 161055
11862A61055K432j0972o854n41m530q317j3834m7587n854K5880j122l9375r519
$$ 161055 163487 152515 145661 145120 140590 132273 118439 70852 64998 90878 89756 50381 40862
11849D0862J4504M7589J6197N133j083r746l3224k841N762M8383J274j3650m1344
$$ 40862 55366 102955 119152 124285 123202 113456 80232 77391 83153 131536 132810 119160 77816
11836G7816q518J0549j1132p833N148j02R360L9626q21l1529M454K813k0073L9761
$$ 77816 69298 79847 68715 60882 66030 65928 75288 114914 114093 82564 87018 89831 69758 109519
11822A09519P112l6187k5846K3561k3697Q32l5523J1709j6308q80N1074L1567
$$ 109519 116631 80444 54598 78159 54462 55294 19771 31480 15172 14292 65366 96933
11810I6933j1080j3086J8805m5344Q568K6716n719l4178K5447J6246J9339K4789
$$ 96933 85853 72767 91572 46228 54796 81512 75793 41615 67062 83308 102647 127436
11798A27436M2936J0058J7570n672J122L2856N0189J09506P6763R8328J00203
$$ 127436 170372 180430 198000 192328 193450 226306 276495 386001 462764 561092 661295
11787F61295J39273J19060N8660M3234K9784j447o7747n3917p9465p0835p2263
$$ 661295 800568 919628 978288 1021522 1051306 1049859 982112 928195 848730 777895 705632
11776G05632j44109j55597j00498m9994n1965k0732R48Q388K9773l3017j5230
$$ 705632 561523 405926 305428 255434 203469 182737 183685 192073 221846 188829 173599
11765A73599q835l6267n3311j8218J3053k695j5682Q710N4855L22j4963m8096
$$ 173599 164764 128497 75186 56968 70021 67326 51644 60354 115209 115531 100568 52472
11753E2472o6293K6834M6928K7702K5944l4846l5567N170j1396k5397M595J1663
$$ 52472 -13821 13013 59941 87643 113587 78741 43174 48344 36948 11551 16146 27809
11741B7809o424k1559M6973L0764l1734J8658O1227K7724J1124N1200r355j5867
$$ 27809 21385 -174 46799 77563 45829 64487 125714 153438 164562 215762 206407 190540
11729A90540O674l4707j210q579j1174j6180k2408m4273K8469K9848k110l9285
$$ 190540 197214 162507 161297 152718 141544 125364 102956 58683 87152 117000 114890 75605
11717G5605r592K0947k1236o498J1552N7930J0562j5955o629l8999K440L9486
$$ 75605 66013 86960 65724 59226 70778 128708 139270 123315 116686 77687 80127 119613
11705A19613r91l0843K31k6594k6812L7602J2519q623j4056P144K3594J0728l5929
$$ 119613 118622 87779 88010 61416 34604 72206 84725 76102 62046 69190 92784 103512 67583
11692F7583j8081m0463j8695m737p99Q447J2026p865k0266J5189l258k7724J0997
$$ 67583 49502 9039 -9656 -14393 -15192 -6745 5281 -2584 -22850 -7661 -10919 -38643 -27646
11679b7646J8903K6256r829R494K9742K0742J3538k0529K4722o242J692m745l7627
$$ -27646 -8743 17513 7684 17178 46920 67662 81200 60671 85393 79151 80843 76098 38471
11666C8471j6715L0987K96k2804j8312R749J5259N260j2941l566L3117n0o93M085
$$ 38471 21756 52743 53039 30235 11923 21672 36931 42191 29250 25684 58801 58751 58058 62143
11652F2143q629j0259l3807N298J4044M010K5732J6303n462p0621k2381L4482
$$ 62143 53514 43255 9448 14746 28790 32800 58532 74835 69373 -1248 -23629 10853
11640A0853K4860j6094K5851K0600M64k6546r950J7608r015L334K9957K8755K7755
$$ 10853 35713 19619 45470 66070 66534 39988 30038 47646 38631 41965 71922 100677 128432
11627A28432K075l7403k5173p252o061K4253N2154l4514o912J4407l6670j9909
$$ 128432 130507 93104 67931 60679 54618 78871 131025 96511 89599 104006 67336 47427
11615D7427K8082m242j6279k3863K9008M1079O437k7313N0528M4948j9913l8978
$$ 47427 75509 71267 54988 31125 60133 101212 107649 80336 130864 175812 155899 116921
11603A16921j0324k8029l3199j2140L486K8752K1759l5561l7285j724L9261J6439
$$ 116921 106597 78568 45369 33229 36715 65467 87226 51665 14380 12656 51917 68356
11591F8356j7923j0766Q2M4877K6091m8079j597L1418q635k3392R74j8252L133
$$ 68356 50433 39667 39749 84626 110717 62638 61041 92459 83824 60432 61406 43154 46287
11578D6287p349q150K33J7687J0226k455J850M7048n97j371O852l7563P599K5557
$$ 46287 38938 30788 31021 48708 58934 56479 58329 105377 104780 103409 110261 72698 80297 105854
11564A05854J0876j5338m2529L0019m722K097J2667K0897J0054j9528K4877j9644
$$ 105854 116730 101392 58863 88882 84160 86257 98924 119821 129875 110347 135224 115580
11552A15580P50j0455O015J5809k494L0219M7132j128J2360P9537K8471P07K4094
$$ 115580 116330 105875 111890 127699 125205 155424 202556 201428 213788 293325 321796 322503 346597
11539C46597j093K6565M8741O3922N5353N8312O4719J0280m49O227M3703K8362
$$ 346597 345504 372069 420810 484732 540085 598397 663116 673396 672947 679174 722877 751239
11527G51239j8397J0150J3188k9236r167K876p350N688k550j314q065k0058J0671
$$ 751239 732842 742992 756180 726944 717777 720653 713303 718991 716441 715127 707062 687004 697675
11514F97675P547P512J551k4631L2819J7409K8348M6055J0121n8K6223N2653Q4959
$$ 697675 705222 712734 714285 689654 722473 739882 768230 814285 824406 824348 850571 903224 988183
11501I88183L848J7313q11J0350j6784j5729j7331J2059k0082k5749m152R228
$$ 988183 992031 1009344 1008533 1018883 1002099 986370 969039 981098 961016 935267 931115 940343
11489I40343j9036q3994n2231j7753N271n5502l3495p523L824R466l1742M0627
$$ 940343 921307 837313 785082 767329 772600 717098 683603 676080 679904 689370 657628 698255
11477F98255K5571K7674p755q153K137R201K4255L9773J8086l9739j3172K905
$$ 698255 723826 751500 743745 735592 737729 746930 771185 810958 829044 789305 776133 779038
11465G79038k6223j5031o2329n6172l8180j5487o635m3854k7683n1805m7244j5088
$$ 779038 752815 737784 675455 619283 581103 565616 558981 515127 487444 435639 388395 373307
11453C73307j1184k2207j4701j0944q076k6393o0321p061K0705J3207j8789j9055
$$ 373307 362123 339916 325215 314271 306195 279802 219481 212420 233125 246332 227543 208488
11441B08488J0736o499K3625j0664l3368P143J5961O816K077l5840k4860j0261
$$ 208488 219224 212725 236350 225686 192318 199461 215422 222238 224315 188475 163615 153354
11429A53354M5679L687k7206o3030j1053j236J0357n419K4326J2615N249k1559
$$ 153354 199033 202720 175514 112484 101431 100195 110552 105133 129459 142074 147323 125764
11417A25764j2503k065l2370k704P87N072l929m949K0192J7915j4733k4342K2606
$$ 125764 113261 111196 78826 76122 76909 81981 78052 73103 93295 111210 96477 72135 94741
11404I4741j9198j8942j1571k0551R066Q177k7325O512K0842J1809r290k571L0691
$$ 94741 75543 56601 45030 24479 33545 41722 14397 20909 41751 53560 44270 41699 72390
11391G2390k150m3830l6363o122K2700N664p623k3258J5540N7522m802k1822J3490
$$ 72390 70240 26410 -9953 -16075 6625 12289 4666 -18592 -3052 54470 49668 27846 41336
11378D1336K8755k5620k415O453J3682j183n001K55J358L3920L1313L167n1358
$$ 41336 70091 44471 42056 48509 62191 61008 56007 56262 57620 91540 122853 126020 74662
11365G4662j9032J9938K0831l095k4842K02J2846l095L5935m0701l3852J8415
$$ 74662 55630 75568 96399 93304 68462 68664 81510 78415 114350 73649 39797 58212
11353E8212J3032o432j7031K8200j3496L8978j3770j3619N52m629l6190J0551
$$ 58212 71244 64812 47781 75981 62485 101463 87693 74074 74626 69997 33807 44358
11341D4358k182l3574j0440K1127J7106K144k4503R582J3032L3603K2425K7405
$$ 44358 42176 8602 -1838 19289 36395 38539 14036 23618 36650 70253 92678 120083
11329A20083P601l3783n1098o821K2414J9348j2386K0594K0812j4471J1360j4233
$$ 120083 127684 93901 42803 35982 58396 77744 65358 85952 106764 92293 103653 89420
11317H9420o0726l1206L6235J5941k595K6102J2588j0572j3223k9455j4479q224
$$ 89420 28694 -2512 33723 49664 47069 73171 85759 75187 61964 32509 18030 9806
11305I806k2870j324L0243l905l2977P770J9086N4254L4773J0602K5l6032J4334
$$ 9806 -13064 -14388 15855 11950 -21027 -13257 5829 60083 94856 105458 105483 69451 83785
11292H3785o777l6119M738j8798l863K435L6674L405n1120p0226p937K7518M3887
$$ 83785 77008 40889 45627 26829 22966 25401 62075 65480 14360 -55866 -63803 -36285 7602
11279G602j695k4205q640K2493K7770M3305J660O08k1937j7328j2801L1295N1287
$$ 7602 5907 -18298 -26938 -4445 23325 66630 68290 68898 46961 29633 16832 48127 99414
11266I9414j7206m6691l2949Q802K8683R98J4348L841j4128J835j3358L1129r889
$$ 99414 82208 35517 2568 11370 40053 41051 55399 59240 45112 46947 33589 64718 54829
11253E4829l7172K1453N3246P349j2209k9853j0369O5150j2906l7159J2971r672
$$ 54829 17657 39110 92356 99705 87496 57643 47274 112424 99518 62359 75330 65658
11241F5658k389J5678p590n3547M518o677N534j2632J8581j1908k1612K5060L4197
$$ 65658 63269 78947 71357 17810 22328 15651 21185 8553 27134 15226 -6386 18674 52871
11228E2871L3664k8015l3976j2022M8329K4034k0677k4441O318k1751q308M693
$$ 52871 86535 58520 24544 12522 60851 84885 64208 39767 46085 24334 16026 20719
11216B0719J0553K2302Q59N091j7832k793K6684K5411j656k4634J4885k9652j7360
$$ 20719 31272 53574 54433 59524 41692 38899 65583 90994 89338 64704 79589 49937 32577
11203C2577L3992J3204q78k263k222J2204n612J9141N330M238k3718j8258P322
$$ 32577 66569 79773 78895 76632 74410 86614 81002 100143 105473 109711 85993 67735 75057
11190G5057j0433r225P672K8575k5630o904l0490K0713L6196l1131m7747J4543
$$ 75057 64624 55399 63071 91646 66016 59112 28622 49335 85531 54400 6653 21196
11178B1196R446P075p482R193O276L0242J6039L645N084k1739L2343L4479n005
$$ 21196 30642 37717 30235 39428 45704 75946 91985 95630 100714 78975 111318 145797 140792
11165A40792k8622p263O374m1948k5533k9721j1787L4471j1436q738J5274L5741
$$ 140792 112170 104907 111281 69333 43800 14079 2292 36763 25327 16589 31863 67604
11153F7604K1987N7877N055k5752k5077j0624K947M350J907o360j7357j6461J0742
$$ 67604 89591 147468 152523 126771 101694 91070 94017 98367 100274 93914 76557 60096 70838
11140G0838j9219J30K7402N983k951j1844k9281Q139k8422J2965J8258k5351M4907
$$ 70838 51619 51749 79151 85134 82183 70339 41058 49197 20775 33740 51998 26647 71554
11127G1554M981k6034J3732l200n510J0457j7004j9152R033K1224K9127J5164
$$ 71554 76535 50501 64233 61033 55523 65980 48976 29824 38857 60081 89208 104372
11115A04372m3229j2050o590M8160o400L6115k9212j1292M273j088m3290j2552
$$ 104372 61143 49093 42503 90663 84263 120378 91166 79874 84147 83059 39769 27217
11103B7217j1674K4975L0446J2369J7849o858j3936k1803m749k6787n736N726
$$ 27217 15543 40518 70964 83333 101182 94324 80388 58585 53836 27049 21313 27039
11091B7039K6586j2019K2187J4346Q293L4917l564k4328n365k7975J6321J0833
$$ 27039 53625 41606 63793 78139 86432 121349 117785 93457 88092 60117 76438 87271
11079H7271o24R444J5759J2262K8872j0682p051q926j7902l065J1881l0872j1098
$$ 87271 86647 96091 111850 124112 152984 142302 135251 126325 108423 105358 117239 86367 75269
11066G5269p069j7784m243N719K0310j1980l030K6636n468j0127l7474J802L0638
$$ 75269 68200 50416 46173 51892 72202 60222 57192 83828 78360 68233 30759 32561 63199
11053F3199O0123L4514k5413K962j3193p314j2635J325j665K9751k5210n2740
$$ 63199 123322 157836 132423 135385 122192 114878 102243 103568 101903 131654 106444 53704
11041E3704k7022M6457J6406p134k7279j4492Q373P998N924L942n504N85r153
$$ 53704 26682 73139 89545 82411 55132 40640 49013 57011 62935 66877 61373 61958 52805
11028E2805K7672r475k7655L2892M6206j4679O913k4511K023O278r380j1046K272
$$ 52805 80477 71002 43347 76239 122445 107766 114679 90168 92191 98469 89089 78043 80315
11015H0315q229k4160m1505j9781N382K522N9975N9093J7189k1568k0659j0706
$$ 80315 72086 47926 6421 -13360 -7978 -5456 54519 113612 130801 109233 88574 77868
11003G7868k018j9369k1771L0466L3974k2281j2694N4288N300p433j9194j9039
$$ 77868 75850 56481 34710 65176 99150 76869 64175 118463 123763 116330 97136 78097
10991G8097k4695L534L139J9935j4115J5303J2555j4629R268L3884Q002j1609
$$ 78097 53402 56936 60075 80010 65895 81198 93753 79124 88392 122276 130278 118669
10979A18669J1079O303J243q4P889P863J307l7287J5414J6924K522Q903j642m7836
$$ 118669 129748 136051 137294 137210 145099 152962 154269 116982 132396 149320 151842 160745 159103 111267
10965A11267R771m366k5080K9940r013l34M0246K4705j4895o216L149K5488M6098
$$ 111267 121038 116672 91592 121532 112519 112185 152431 177136 162241 156025 159174 184662 230760
10952B30760K1227n551M608m7619n9472k3110M7628J5800M753q353j3545N238
$$ 230760 251987 246436 251044 203425 143953 120843 168471 184271 189024 180671 167126 172364
10940A72364k444K7348N0963L5046L9639K7833N041j2059J6269K4385O3615M2061
$$ 172364 169920 197268 248231 283277 322916 350749 355790 343731 360000 384385 448000 490061
10928D90061K9450J1556j4394K9524J6391O711K4122J3958l5284j6560J14j0247
$$ 490061 519511 531067 516673 546197 562588 569299 593421 607379 572095 555535 555649 545402
10916E45402n744Q160n0759k8160K8194J8285L6873M6257L1704M0597j1408k9304
$$ 545402 539658 547818 497059 468899 497093 515378 552251 598508 630212 670809 659401 630097
10904F30097J1829R725L0413L3031m029q829J2452K1044N7012K9865R467k2002
$$ 630097 641926 651651 682064 715095 711066 702237 714689 735733 792745 822610 832077 810075
10892H10075k5833o997O0015k6987j5825L183j8827k6997j388n753j3017l7980
$$ 810075 784242 777245 837260 810273 794448 797631 778804 751807 750419 744666 731649 693669
10880F93669k0135k3162j1409J2698k4677k8932K373K0653J9403K5357J9079j3950
$$ 693669 673534 650372 638963 651661 626984 598052 600425 621078 640481 665838 684917 670967
10868F70967J4590P239j2786K7723L0772k287R198m9533k7543m1067l5226l7016
$$ 670967 685557 692796 680010 707733 738505 736218 745416 695883 668340 627273 592047 555031
10856E55031n4399m7719q813M723l6205j4556l5866J1968j5379m3521K4319J5180
$$ 555031 500632 452913 444100 448823 412618 398062 362196 374164 358785 315264 339583 354763
10844C54763k5276O394j2746K9646L2770j2553l3509k4810j3897J940L880q643
$$ 354763 329487 335881 323135 352781 385551 372998 339489 314679 300782 302722 306602 297959
10832B97959j4816R852J1654j1380K7386J475l3742j0021M19K5703o915K427q401
$$ 297959 283143 292995 304649 293269 320655 322130 288388 278367 278786 304489 297574 300001 291600
10819B91600K1798K6989j172O028k3630P90J0749j7160l4319K8122J1932k5033
$$ 291600 313398 340387 339215 345243 321613 322403 333152 315992 281673 309795 321727 296694
10807B96694J3269J5004j7061j8514j8260p324j0023j5278N0587R475k3850L379
$$ 296694 309963 324967 307906 289392 271132 263808 253785 238507 289094 298569 274719 278098
10795B78098K0556j3858l1813M754L394K682O717J344M2759J3657n989k2022k307
$$ 278098 298654 284796 252983 257737 261131 263813 270530 271874 314633 328290 322301 300279 297972
10782B97972r834J487j721n045N174J4436K3264R624l6050M981K4546J3166N283
$$ 297972 288138 289625 287904 282859 288033 302469 325733 335357 299307 304288 328834 342000 347283
10769C47283P056K2592P528J1350R100J9245K3729K4494L2997M14m2116L091N116
$$ 347283 354339 376931 384459 395809 404909 424154 447883 472377 505374 505788 463672 466763 471879
10756D71879K3266m991l8668r598L2399o640K691O596j4847K664M891J33j4360
$$ 471879 495145 490154 451486 441888 474287 467647 470338 476934 462087 464751 469642 469775 455415
10743D55415K3280K441N6840j5058k4791K966L5097j2292J2949n149j8457k0824
$$ 455415 478695 481136 537976 522918 498127 501093 536190 523898 536847 531698 513241 492417
10731D92417k0830j6881K5381J0973k4043L739J0450L1480K5234p899Q56m4546
$$ 492417 471587 454706 480087 491060 467017 470756 481206 512686 537920 530021 530877 486331
10719D86331j9930O873M606l9633L0985J0086n77m2694j451m6365J7011N5213
$$ 486331 466401 473274 477880 438247 469232 479318 478741 436047 434596 388231 405242 460455
10707D60455J2066N166j4873l9038Q053L7096R350j1812n924N936l8189l3029
$$ 460455 472521 477687 462814 423776 431829 468925 478275 466463 460539 466475 428286 395257
10695C95257K9403K106j1685l077N060K5271j9281K4791l714R278J1132Q139m2661
$$ 395257 424660 426766 415081 412004 417064 442335 423054 447845 444131 453409 464541 472680 430019
10682D30019k2412K383L8993J0999k0457l5967p748Q294K6585M480J4615M111
$$ 430019 407607 409990 448983 459982 439525 403558 395810 404104 430689 435169 449784 453895
10670D53895n5964O141L4270j341L4031k6283j986J1061l3069k88l793J2193O0959
$$ 453895 397931 404072 438342 437001 471032 444749 442763 453824 420755 420467 416674 428867 489826
10657D89826J4814j5087J5287M5486O276k3330k1920K6698M710l659j7326Q252
$$ 489826 504640 489553 504840 550326 556602 533272 511352 538050 542760 539101 521775 530027
10645E30027O518P898L2007j3186L6525P8766N7489j4399j6343k9330R394p879
$$ 530027 536545 544443 576450 563264 599789 678555 736044 721645 705302 675972 685366 677487
10633F77487L4512K3983L4594J4598R587j2150j0769N1894L3676K0264O5131K2866
$$ 677487 711999 735982 770576 785174 794761 782611 771842 823736 857412 877676 942807 965673
10621I65673o99K3030K5422q520J2253K5557n847m7729k337K1587R185J391j81
$$ 965673 964974 988004 1013426 1004906 1017159 1042716 1036869 989140 986803 1008390 1017575 1018966 1018785
10608A018785M746K0549J6109M690r078o848l899k1704l0630L7157L7059K6924
$$ 1018785 1023531 1044080 1060189 1064879 1055801 1048953 1045054 1023350 992720 1029877 1066936 1093860
10596A093860m815K5625J268l183M0934N5760J8253K1271P6453O664k9136J430
$$ 1093860 1089045 1114670 1115938 1112755 1153689 1209449 1227702 1248973 1325426 1332090 1302954 1304384
10584A304384M7612M5716J8101J2034L3895M9666L3886N9103M1356J9878M0181
$$ 1304384 1351996 1397712 1415813 1427847 1461742 1511408 1545294 1604397 1645753 1665631 1705812
10573A705812M3425N3450M1939K750N4219K7497L6174L5069K9995N5053Q1192
$$ 1705812 1749237 1802687 1844626 1847376 1901595 1929092 1965266 2000335 2030330 2085383 2166575
10562B166575L8019P6803Q0276Q1998J41395R2670L9323M9874Q8672Q7014P2427
$$ 2166575 2204594 2281397 2361673 2443671 2585066 2677736 2717059 2766933 2855605 2942619 3015046
10551C015046J17937J37476R3409J17800J23264J27124J16352J32468J41331J49420
$$ 3015046 3132983 3270459 3363868 3481668 3604932 3732056 3848408 3980876 4122207 4271627
10541D271627J47338K18924K28282K62230K34216K36785K64254K50273L32334
$$ 4271627 4418965 4637889 4866171 5128401 5362617 5599402 5863656 6113929 6446263
10532F446263M09602M13330M44837M86403O18120P07805P65206Q46471R26369
$$ 6446263 6855865 7269195 7714032 8200435 8818555 9526360 10291566 11138037 12064406
10523A2064406J094712J277941J445450J671983J942450K276146K732568L278184
$$ 12064406 13159118 14437059 15882509 17554492 19496942 21773088 24505656 27783840
10515B7783840L906787M624970N437226O330424P247255P969832Q331776Q003451
$$ 27783840 31690627 36315597 41752823 48083247 55330502 63300334 71632110 79635561
10507G9635561O811419M704175K024405o89778k974336m494927n132039n103450
$$ 79635561 86446980 91151155 93175560 92485782 89511446 85016519 79884480 74781030
10499G4781030m551498l689816k642561j526176m11637O20349J650286K492429
$$ 74781030 70229532 66539716 63897155 62370979 61959342 62579691 64229977 66722406
10491F6722406L109908L359090L332833K945887K370772J849540J596279J732118
$$ 66722406 69832314 73191404 76524237 79470124 81840896 83690436 85286715 87018833
10483H7018833K236181K937937L800304M475735M837459M568848L621008K143140
$$ 87018833 89255014 92192951 95993255 100468990 105306449 109875297 113496305 115639445
10475A15639445L40293j506010k972317l836901m106836l857690l263354k562627
$$ 115639445 115979738 114473728 111501411 107664510 103557674 99699984 96436630 93874003
10467I3874003j920473j627966j667489k015249k492118k882931l172636l150639
$$ 93874003 91953530 90325564 88658075 86642826 84150708 81267777 78095141 74944502
10459G4944502k751541k127069j386757m88770M98335J504469K440998L319340
$$ 74944502 72192961 70065892 68679135 68190365 68688700 70193169 72634167 75953507
10451G5953507L982233M373709M317744L675819K340300L65550j754257l758618
$$ 75953507 79935740 84309449 88627193 92303012 94643312 95008862 93254605 89495987
10443H9495987n273779o197002o563842o377129n946093n393973m774051m166132
$$ 89495987 84222208 78025206 71461364 65084235 59138142 53744169 48970118 44803986
10435D4803986l636700l166873k759739k414464k107401j870087j698987j511506
$$ 44803986 41167286 38000413 35240674 32826210 30718809 28848722 27149735 25638229
10427B5638229j353537j232308j118933j010839r37806q49184p80321p48007o90955
$$ 25638229 24284692 23052384 21933451 20922612 19984806 19135622 18355301 17607294 16916339
10418A6916339o49670o03379n60315n00696m66306m53343m61435l83620m05909
$$ 16916339 16266669 15663290 15102975 14602279 14135973 13682630 13221195 12837575 12431666
10409A2431666l98211l68954l46674l66438l53540l75283m05045l56709l51059
$$ 12431666 12033455 11664501 11317827 10951389 10597849 10222566 9817521 9460812 9109753
10400I109753l45838l26357l26392l21765l26001l13410k64084k43819k64637
$$ 9109753 8763915 8437558 8111166 7789401 7463400 7149990 6885906 6642087 6377450
10391F377450k45079k14472j83139j77466j72403j83941j99286j59106j14865
$$ 6377450 6132371 5917899 5734760 5557294 5384891 5200950 5001664 4842558 4727693
10382D727693j18356j43246j69151j30007j22489j57463j58615j78302j34892
$$ 4727693 4609337 4466091 4296940 4166933 4044444 3886981 3728366 3550064 3415172
10373C415172r7155j11277j12059j11646m5824n7107q8795r8163n2558l3531m5104
$$ 3415172 3318017 3206740 3094681 2983035 2937211 2880104 2791309 2693146 2640588 2607057 2561953
10362B561953n1131o0444j4472n2546l5637l5668m6743n4358n2505o9367Q06k7301
$$ 2561953 2510822 2450378 2435906 2383360 2347723 2312055 2265312 2210954 2158449 2089082 2089888 2062587
10350B062587n7354j1554l1724m2373l2064k0013j0550q9510l3323l3457J2027
$$ 2062587 2005233 1993679 1961955 1919582 1887518 1867505 1856955 1767445 1734122 1700665 1712692
10339A712692K389q613J213p063j6271n6928l7138k4387K0016k8134m9675K6723
$$ 1712692 1715081 1706468 1707681 1700618 1684347 1627419 1590281 1565894 1585910 1557776 1508101 1534824
10327A534824Q082l0081R267p401J8860J2195j7888k3315o2225k3511l4678l6028
$$ 1534824 1542906 1512825 1522092 1514691 1533551 1545746 1527858 1504543 1442318 1418807 1384129 1348101
10315A348101n2141l281m2037o4513m9839K252K516j7392m8675k4486q620l0595
$$ 1348101 1295960 1292679 1250642 1186129 1136290 1138542 1141058 1123666 1074991 1050505 1041885 1011290
10303A011290n0351q429J2704O780k2726l0890J9622J1017k3036k4118m555K4958
$$ 1011290 960939 952510 965214 971994 949268 918378 938000 949017 925981 901863 897308 922266
10291I22266p474j0547j602m177L522K5589l5717m6802K9637j345K5439K2979
$$ 922266 914792 904245 902643 898466 901988 927577 891860 845058 874695 873350 898789 921768
10279I21768L000k4857k4205j8181J8006q387q885n8068k3273R280R337q803R455
$$ 921768 924768 899911 875706 857525 875531 867144 858259 800191 776918 786198 795535 786732 796187
10266G96187k6322J3645j3499j0183n43K7218j5201K303J7215m1697m1951N03
$$ 796187 769865 783510 770011 759828 759285 786503 771302 773605 790820 749123 707172 707675
10254G07675k1555k7407r833k6528j6149r546K7036P99O666j2631j965m04j6976
$$ 707675 686120 658713 648880 622352 606203 596657 623693 624492 631158 618527 616562 616158 599182
10241E99182O12K9454m586j5444m3762m7792j7053o00L4814k8022k1910J8070
$$ 599182 599794 629248 624662 609218 565456 517664 500611 500011 534825 506803 484893 502963
10229E02963J03k5637j0473L175k0303k1536J4652J5426o879J8618M19j8913k7225
$$ 502963 503066 477429 466956 470131 449828 428292 442944 458370 451491 470109 470528 451615 424390
10216D24390n0584j1573q517o174J5164J1043Q088k0792m1176k6569K2217L1684
$$ 424390 373806 362233 353716 347542 362706 373749 381837 361045 319869 293300 315517 347201
10204C47201K0670n94j771j8303k0052j2380k1694P552j0634m7692j7963K0337
$$ 347201 367871 367277 365506 347203 327151 314771 293077 300629 289995 242303 224340 244677
10192B44677J2525M4796R465M579R682k6119k5953j5487R541J7366O508J4543
$$ 244677 257202 301998 311463 316042 325724 299605 273652 258165 267706 285072 291580 306123
10180C06123P83k8756K0377O247l2780o454m772K3153j4831l2172J3738M779J1195
$$ 306123 306906 278150 298527 304774 271994 265540 260768 283921 269090 236918 250656 255435 266630
10167B66630L5331J7067o616L8343l395o1262k6098O607p988Q461J8583M2846
$$ 266630 301961 319028 312412 350755 347360 286098 260000 266607 258619 267080 285663 328509
10155C28509l704J8681J3408k7688j6748j1792J0124j7848m909j2261j2539O500
$$ 328509 324805 343486 356894 329206 312458 300666 310790 292942 288033 275772 263233 269733
10143B69733Q634J2699j4115R9M016K1431j6085j3463M4201L2631J2737m1824
$$ 269733 278367 291066 276951 277050 281066 302497 286412 272949 317150 349781 362518 320694
10131C20694m9440k5004p300L4742L5172J6333J6657K1493K4734K2069o433N25
$$ 320694 271254 246250 238950 273692 308864 325197 341854 363347 388081 410150 403717 404242
10119D04242k1528n97k6249N056N498N922j1417l3305j7210K1411p171p211o167
$$ 404242 382714 382117 355868 360924 366422 372344 360927 327622 310412 331823 324652 317441 311274
10106C11274k819Q192j0005J3356p757k2500j4197J6510R452j764J3539M0824
$$ 311274 308455 316647 306642 319998 312241 289741 275544 292054 301506 299742 313281 354105
10094C54105J0055L2455K3662K3438J0124J3262L0704P2921J2217n8585r297N6491
$$ 354105 364160 396615 420277 443715 453839 467101 497805 570726 582943 524358 515061 571552
10082E71552O8490N4403L3468l9606n8705p165O876o4118J4615K2369o363j0545
$$ 571552 640042 694445 727913 688307 629602 622437 629313 565195 579810 602179 595816 585271
10070E85271l5379j9454L0415K7560K0799K7683O436m581j0781p026N2809M4405
$$ 585271 549892 530438 560853 588413 609212 636895 643331 638750 627969 620943 673752 718157
10058G18157j8384J0148K0882J4866L1315Q965m4740N992J7153j8711n8647R190
$$ 718157 699773 709921 730803 745669 776984 785949 741209 747201 764354 745643 686996 696186
10046F96186L7686m9451m2823m1290q0111K0280K9424n141J3241j0075Q527J0125
$$ 696186 733872 684421 641598 600308 520197 540477 569901 564760 578001 567926 576453 586578
10034E86578r218j9639m4579J8450N806P610M4539n814M4426K1451K3819J1183
$$ 586578 577360 557721 513142 531592 537398 545008 589547 583733 628159 649610 673429 684612
10022F84612o553j6986l3199j3650k5019k4330l6242m0350q78k2319j7157l6597
$$ 684612 678059 661073 627874 614224 589205 564875 528633 488283 487405 465086 447929 411332
10010D11332j5773k2311M209j0735N389l952J6960k50l6602k8833M091J5803M021
$$ 411332 395559 373248 377457 366722 372111 368159 385119 384869 348267 319434 323525 339328 343349
9997C43349j5027j2089K9130j7019j8119j3892k490r469j819O364j8794J3420
$$ 343349 328322 316233 345363 328344 310225 296333 293843 284374 282555 288919 270125 283545
9985B83545j542K9293K7971l6450M591Q962j4362J204p82J3433r733J1366k7396
$$ 283545 282003 311296 339267 302817 307408 316370 302008 303212 302430 315863 306130 317496 290100
9972B90100k9161m993M851K3341P140k7577n9540J45J4764M8629N668m1529m916
$$ 290100 260939 255946 260797 284138 291278 263701 204161 204306 219070 267699 273367 231838 226922
9959B26922K8162k9278k1678J0045L3260R346k0739K2668J3056j0114k663q301
$$ 226922 255084 225806 204128 214173 247433 256779 236040 258708 271764 261650 258987 250686
9947B50686j8424J9509k3021J8175l1779j3727Q621J0092k914L4849J2072k0289
$$ 250686 232262 251771 228750 246925 215146 201419 210040 220132 217218 252067 264139 243850
9935B43850P487k0663L26l8198j7359j1378J6000N1899j053r644k6062N917K8145
$$ 243850 251337 230674 231000 192802 175443 164065 180065 231964 230911 221267 195205 201122 229267
9922B29267K9493M010k3602k6148j8463L122M5413K9342l0032q063J0195j8920
$$ 229267 258760 262770 239168 213020 194557 197679 243092 272434 242402 234339 244534 225614
9910B25614K4793O0565J5214l1024j6581k1122k2098O868j3907k9806J2789M7257
$$ 225614 250407 310972 326186 295162 278581 257459 235361 242229 228322 198516 211305 258562
9898B58562J7287j6342j2802R959J5719j1831o526j3211k7783J6922J7696K8511
$$ 258562 275849 259507 246705 256664 272383 260552 254026 240815 213032 229954 247650 276161
9886B76161j7247j8376O979J1650k3474j1891O48Q591K14K4039j2650l9305n283
$$ 276161 258914 240538 247517 259167 235693 223802 224450 233041 233255 257294 244644 205339 200056
9873B00056J413q054J8724j828L4588R983J169k4836J4641j6064J9982K7492m0264
$$ 200056 201469 193415 212139 210311 244899 254882 256051 231215 245856 229792 249774 277266 237002
9860B37002l4046j7828P34J5630M426k1447J2962J0768L3141L8761J664j456N4556
$$ 237002 202956 185128 185862 201492 205918 184471 197433 208201 241342 280103 281767 280311 334867
9847C34867N3446K8292N8318Q6322J89334K29868K78808L13802J63207o6443k37989
$$ 334867 388313 416605 474923 561245 750579 980447 1259255 1573057 1736264 1669821 1431832
9836A431832k54897k50304j85200j42513q0701n5227o0429o2834j651j2786k7896
$$ 1431832 1176935 926631 741431 598918 518217 462990 402561 339727 338076 325290 297394
9825B97394l653j7317j6041L8746j8172k03J2193m3085R945L5056k266l046l8981
$$ 297394 293741 276424 260383 299129 280957 280754 292947 249862 259807 294863 292597 289551 250570
9812B50570j9309o119j9874J5688N3984j4784N654k1336j1904M3834K4619J0479
$$ 250570 231261 225142 205268 220956 274940 260156 265810 244474 232570 276404 301023 311502
9800C11502N932K7954k4382J2290l195l358J197J6682J2305J9431J4024K8010
$$ 311502 317434 345388 321006 333296 330101 326743 327940 344622 356927 376358 390382 418392
9788D18392R4117J37314J61738K00049L33076N94004O50384K33209l26934m65037
$$ 418392 512509 649823 811561 1011610 1344686 1938690 2589074 2822283 2495349 2030312
9778B030312m56521l68809k38265j73705j07933p5690r4942q1269l8563j6817
$$ 2030312 1573791 1204982 966717 793012 685079 609389 514447 433178 394615 377798
9768C77798n0011l5751J0240j466k0685k5745j4022J8888L5845L0406k7744k7997
$$ 377798 327787 292036 302276 300810 280125 254380 240358 259246 295091 325497 297753 269756
9756B69756K22O154r012m7435q289K0238K1407L206l976l048j7894j9487j5358
$$ 269756 269978 276132 267120 219685 211396 231634 253041 256247 252271 249223 231329 211842 196484
9743A96484K634K795K3277K0448p355k3207Q723K0220M891Q077j3670m348k5632
$$ 196484 199118 201913 225190 245638 238283 215076 223799 244019 248910 256987 243317 238969 213337
9730B13337j4331L2797o686j4355K9084p589l8948r265j5931N412o851k489k1309
$$ 213337 199006 231803 225117 210762 239846 232257 193309 184044 168113 173525 166674 164185 142876
9717A42876O244L5154N4080m0242m0965l3436L060P404L2799K6045l775j4395
$$ 142876 149120 184274 238354 198112 157147 123711 126771 134175 166974 193019 189244 174849
9705A74849m847P84M3462M1190m9651k7580j0777l5290j2468j2335K3356M7540
$$ 174849 170002 170786 214248 255438 205787 178207 167430 132140 119672 107337 130693 178233
9693A78233K7454k1077j1660N321l7634J2030J1910k1162K5781j0212P811n203
$$ 178233 205687 184610 172950 178271 140637 152667 164577 143415 169196 158984 166795 161592
9681A61592J8065J3928j4558O043o96l8394L628J9010L3118R698j47o881o085
$$ 161592 179657 193585 179027 185070 184374 145980 149608 168618 201736 211434 211287 204406 198321
9668A98321l7402l0277K253J571J3892j6121j6239J2639r680O014K7235J2776
$$ 198321 160919 130642 132895 134466 148358 132237 115998 128637 118957 124971 152206 164982
9656A64982k4132Q445M746p1037J9190N0163M1110M592k4062k8029l892j0614
$$ 164982 140850 149295 154041 83004 102194 152357 193467 198059 173997 145968 142076 131462
9644A31462L0433J3928k2343j9632n139R96p25l5093K6329R424K2752k8295P314
$$ 131462 161895 175823 153480 133848 128709 129705 128980 93887 120216 129640 152392 124097 131411
9631A31411K3506k0672N674L2947l8727n0138k077j3681L908J8113O497l477j4912
$$ 131411 154917 134245 139919 172866 134139 84001 81924 68243 72151 90264 96761 93284 78372
9618G8372n759K6409J242K9050K9412j1736n404J1042P131p67j4523n4286j4486
$$ 78372 72613 99022 100264 129314 158726 146990 141586 152628 159759 158992 144469 90183 75697
9605G5697N4529L9496m3590l7604n904K9761K4235n651o019k1670R130M4284J5069
$$ 75697 130226 169722 126132 88528 82624 112385 136620 130969 124950 103280 112410 156694 171763
9592A71763k3558k4081k5853k1775J5377N2303J5718j2820Q030K556o671N140
$$ 171763 148205 124124 98271 76496 91873 144176 159894 147074 155104 157660 150989 156129
9580A56129J0606r891k4509l2415K2438P188o4871J03J8982K0005J7983M5960
$$ 156129 166735 156844 132335 99920 122358 129546 64675 64778 83760 103765 121748 167708
9568A67708r253k2064J9874O590o2259j7349J2887J6700o146P579P962q633l034
$$ 167708 158455 136391 156265 162855 100596 83247 96134 112834 106688 114267 122229 113596 110562
9555A10562N722K9896O120J4170k7019k5162l9896k5181L2378K7354k016k7272
$$ 110562 116284 146180 152300 166470 139451 114289 74393 49212 81590 108944 106928 79656
9543G9656P009n746k8713N064N1047Q279P691k4764l308q911k2023J638j6079
$$ 79656 86665 80919 52206 57270 108317 116596 124287 99523 96215 87304 65281 66919 50840
9530E0840K4233K424j8188K7862N2064k653J508l9660j8221K2994J137l2449n3193
$$ 50840 75073 77497 59309 87171 139235 136582 138090 98430 80209 103203 104340 71891 18698
9517A8698J280K9364L2952L7622J4809l7351j1494j2558K7050J7331M371p695
$$ 18698 19978 49342 82294 119916 134725 97374 85880 73322 100372 117703 122074 114379
9505A14379Q509j3767Q001j8228L5263M7087j4912m5627j5154L1664J8683k5354
$$ 114379 122888 109121 117122 98894 134157 181244 166332 120705 105551 137215 155898 130544
9493A30544k8172j5556k9108J6349K1399p652J4395R969j9086M314J8117N953
$$ 130544 102372 86816 57708 74057 95456 87804 102199 112168 93082 97396 115513 121466
9481A21466j0453J3384N01l7740k778l472J110r029o963J5981k9566j2893k363
$$ 121466 111013 124397 124898 87158 84380 80908 82018 72989 66026 82007 52441 39548 37185
9468C7185n164p061J4862O357M4366m768p968M930K9176j5192k544K9250n865
$$ 37185 32021 24960 39822 46179 90545 85777 77809 82739 111915 96723 94179 123429 117564
9455A17564k7229K1426K8605j6947n9585k6325K8627J4298j0344l2774J9004N1493
$$ 117564 90335 111761 140366 123419 63834 37509 66136 80434 70090 37316 56320 107813
9443A07813K4469o539j9368n1358L895K9435p829q219k6130K6636k834J310K5015
$$ 107813 132282 125743 106375 55017 58912 88347 80518 72299 46169 72805 69971 71281 96296
9430I6296K8615J0457R892j0236j311l3643k4499J1881O639K3004N824l569l722
$$ 96296 124911 135368 145260 135024 133713 100070 75571 87452 94091 117095 122919 119350 115628
9417A15628k6741N036J2472l2653K8375J9865k0607k128l700L08O421n180j0503
$$ 115628 88887 93923 106395 73742 102117 121982 101375 99247 95547 95855 102276 97096 86593
9404H6593J1729m804l879j6197o617J09N010j8566o515J2421J4452J3638r699
$$ 86593 98322 93518 89639 73442 66825 66934 71944 53378 46863 59284 73736 87374 77675
9391G7675l4995n586k5933K1744M0118K101l101L087J1802l1374K8277K6740n245
$$ 77675 42680 37094 11161 32905 73023 75124 72023 75110 86912 55538 83815 110555 105310
9378A05310r503N456j1351l42L82l5556n8211j2808M1060Q984m178L562K6591
$$ 105310 95807 101263 89912 89570 89952 54396 -3815 -16623 24437 33421 29243 32805 59396
9365E9396k510j1569K017L0372j0829j6152m9792j4786M7654M3797J1459p852
$$ 59396 56886 45317 47334 77706 66877 50725 933 -13853 33801 77598 89057 81205
9353H1205l0338o551M0161N878J1924R084j6867J0433r018o946j519o642k2748
$$ 81205 50867 44316 84477 90355 102279 111363 94496 104929 95911 88965 87446 80804 58056
9340E8056k110Q737Q239k3541j532J1997N574k5555n015K1749O123m285N1161
$$ 58056 55946 64683 72922 49381 47849 59846 65420 39865 34850 56599 62722 58437 109598
9327A09598K9979m1393k1063L958r080R18j4837R126L5094J9575r290p687O469
$$ 109598 139577 98184 77121 81079 71999 72917 58080 67206 102300 121875 112585 104898 111367
9314A11367j7757k1540r492k1898j7332m3452l301L8751J2537j9872K538r408
$$ 111367 93610 72070 62578 40680 23348 -20104 -23405 15346 27883 8011 10549 1141
9302A141k3350L1060L8601o107r550p682J4211Q498j8620q480J8397J8005m576
$$ 1141 -22209 8851 47452 41345 31795 24113 38324 46822 28202 19722 38119 56124 51548
9289E1548J8020J068N193p0364j6967N8772O2808p833r25l284k9185j0640M660
$$ 51548 69568 70636 75829 5465 -11502 47270 110078 102245 101320 98036 68851 58211 62871
9276F2871J1782k7312k8093K5667M1331O465k8399k5220J3179J3581n349j2208
$$ 62871 74653 47341 19248 44915 86246 92711 64312 39092 52271 65852 60503 48295
9264D8295j7214M598k0051l505J4941J0834K5298l1233j1147r860L1861L7237
$$ 48295 31081 35679 15628 12123 27064 37898 63196 31963 20816 10956 42817 80054
9252H0054P960l1978p992K4865k2005n7306p766J3650M822J9060J6273K3250P44
$$ 80054 88014 56036 48044 72909 50904 -6402 -14168 -518 4304 23364 39637 62887 63631
9239F3631m6037L6217K2183O333j857N610j4611L287k5327R173n652J4465N754
$$ 63631 17594 53811 75994 82327 80470 86080 71469 74756 49429 58602 52950 67415 73169
9226G3169R63l0726j6116J4413q59l5899k6145k9808L5035L5721J2089m394J2482
$$ 73169 74132 43406 27290 41703 40844 4945 -21200 -51008 -15973 19748 31837 27443 39925
9213C9925N4632O2369k4557l3293k9902k6093l1264L24J4845J0514K9151J4849
$$ 39925 94557 156926 132369 99076 69174 43081 11817 12141 26986 37500 66651 81500
9201H1500j804K765l2171k1757K5624O268K0599R635O978j8483L1292j385o0151
$$ 81500 79696 82461 50290 28533 54157 60425 81024 90659 97637 79154 110446 109061 48910
9188D8910l9773j2064l564K8646K6903q325n325J8762j718n6079k830K5058j1466
$$ 48910 9137 -2927 -6491 22155 49058 40733 35408 54170 52452 -3627 -6457 18601 7135
9175G135J7164J7193J1750J1678m346j5245K6434M8052q823l2579k2080p280L885
$$ 7135 24299 41492 53242 64920 60574 45329 71763 119815 110992 78413 56333 49053 52938
9162E2938J2534l817j406n495k5959l632Q032l6140p025J2295L0181J9683q255
$$ 52938 65472 61655 60249 54754 28795 25163 33195 -2945 -9970 2325 32506 52189 43934
9149D3934j0586O35J6359q427j9107m0774j6660Q632K8804L1077M6595K022k3786
$$ 43934 33348 33983 50342 41915 22808 -17966 -34626 -25994 2810 33887 80482 82504 58718
9136E8718j8243L0377J2458J4394K871j3443K1069l9718j4774q652j2619J1144
$$ 58718 40475 70852 83310 97704 100575 87132 108201 68483 53709 45057 32438 43582
9124D3582o17J8730L0074M3115k5743m3025j8522J9446j834j7806J3307p134l0386
$$ 43582 42965 61695 91769 134884 109141 66116 47594 67040 65206 47400 60707 53573 23187
9111B3187k133J4313K3956q617j0684k7425j570j3833J3601L3387j1504k5265
$$ 23187 21054 35367 59323 50706 40022 12597 11027 -2806 10795 44182 32678 7413
9099G413J8914J6990R870N228q381j2186m2300k7526N1305O6475j8365r283J5577
$$ 7413 26327 43317 53187 58415 50034 37848 -4452 -31978 19327 85802 67437 58154 73731
9086G3731K5138J831o3147K014o887J4276M2838m1581j2506J5235P485k836l1119
$$ 73731 98869 100700 37553 39567 32680 46956 89794 48213 35707 50942 58427 55591 24472
9073B4472J9150L3233Q025k4609J7442P21l6660l6381J0036k0174k7868L2327
$$ 24472 43622 76855 84880 60271 77713 78434 41774 5393 15429 -4745 -32613 -286
9061b86N4715k801j9953M7236J0134j8954k8372l8057K6446J1056l2219K2960
$$ -286 54429 51628 31675 78911 89045 70091 41719 3662 30108 41164 8945 31905
9049C1905K4376j1077n0139q923l957P355l921K443O431N5527K5624j1879n3100
$$ 31905 56281 45204 -4935 -13858 -17815 -10460 -14381 -11938 -5507 50020 75644 63765 10665
9036A0665j7201K729j6603J5898L5272m246j4278p24O5466k36o2622k5828L7307
$$ 10665 -6536 -3807 -20410 -4512 30760 26514 12236 11512 76978 76742 14120 -11708 25599
9023B5599j539k51M522p941m0443L6931L7841n633K2694n891l7732P663R586P251
$$ 25599 24060 23809 28331 20390 -20053 16878 54719 49086 71780 65889 28157 35820 45406 52657
9009E2657j7243j9431J0828J146n19J6824l422K1610K6149O014p8887m0946L4599
$$ 52657 35414 15983 26811 27957 27438 44262 40840 62450 88599 94613 15726 -25220 9379
8996I379Q61K0895K0957J1749P560j4446l5752M195q462J471K2769K0774J0479
$$ 9379 10240 31135 52092 63841 71401 56955 21203 25398 16936 18407 41176 61950 72429
8983G2429q392j9141m855j5022K4962k348k4230k9386j0895K7078J5030K8746
$$ 72429 64037 44896 40041 25019 49981 47633 23403 -5983 -16878 10200 25230 53976
8971E3976N7567q82l0708Q130j0932k9017k3600P276j658j7572k152J9282K7593
$$ 53976 111543 110661 79953 88083 77151 48134 24534 31810 30152 12580 10428 29710 57303
8958E7303k0051K9426j5767J18K3106m360O695m797k2851j1235M6184k599R654
$$ 57303 37252 66678 50911 51029 74135 69775 76470 71673 48822 37587 83771 81172 90826
8945I0826L505l7503k1740K0981j1561m6328K0651P4835O6264k2454m8827l1105
$$ 90826 94331 56828 35088 56069 44508 -1820 18831 93666 159930 137476 88649 57544
8933E7544j1226R808m9480j8944J7002R057K2231J6271j4348K617l1652j4612
$$ 57544 46318 56126 6646 -12298 4704 13761 35992 52263 37915 40532 8880 -5732
8921e732j7135N939M7467K4040J4590j482N745q617k1508q994Q925l0284O009
$$ -5732 -22867 -16928 30539 54579 69169 67687 73432 64815 43307 34313 43238 12954 18963
8908A8963k1339J1080J4478n123j7168K6489L6046k1893k74L0509j5341m9684
$$ 18963 -2376 8704 23182 18059 891 27380 63426 41533 41259 71768 56427 6743
8896F743j7914J4300K7335n203j5524N591J6789M2972l031j5555m734K690M376
$$ 6743 -11171 3129 30464 25261 9737 15328 32117 75089 72058 56503 51769 54459 58835
8883E8835L7802l0655m3696O477L2714L1691p706m3940q627q118k8511q222q759
$$ 58835 96637 65982 22286 28763 61477 93168 85462 41522 32895 24777 -3734 -11956 -20715
8870b0715K3307L9181l6819l1311K5203L9065k2099J8848J5715K6689j6135N94
$$ -20715 2592 41773 4954 -26357 -1154 37911 15812 34660 50375 77064 60929 61523
8858F1523k6548J9207P006P604j8334r073o49J5995L0595q610l4996n3380K3098
$$ 61523 34975 54182 61188 68792 50458 41385 40736 56731 87326 78716 43720 -9660 13438
8845A3438J4379J265m618k4746j6935K1274P213p59J5816m8548j3092L6143L5581
$$ 13438 27817 29082 24464 -282 -17217 4057 11270 10511 26327 -22221 -35313 830 36411
8832C6411m428P3570j5727n5860m7561N582K0918J7453J6391j7412L196J9857
$$ 36411 31983 105553 89826 33966 -13595 -8013 12905 30358 46749 29337 32533 52390
8820E2390J322L6978L8557J3835p5881l2634J400l487j3794J8238l347Q745M1070
$$ 52390 53712 90690 129247 143082 67201 34567 35967 32480 18686 36924 33577 42322 83392
8807H3392J5223m6941j6184J8321L7279q857l7632N85M023j5349K919L3822r74
$$ 83392 98615 51674 35490 53811 91090 82233 44601 45186 49209 33860 36779 70601 69627
8794F9627m3723l8050j4204R90J7536j4757m8063k7772L3165N5954O0527o6212
$$ 69627 25904 -12146 -26350 -25360 -7824 -22581 -70644 -98416 -65251 -9297 51230 -14982
8782a4982j0084M4969L0413j3027m1350J5790L4390M592j4870k7632k7068J6868
$$ -14982 -25066 19903 50316 37289 -4061 11729 46119 50711 35841 8209 -18859 -1991
8770a991N2364K1148O425l9918R25J3647l0170j3792K2086K5021j0173q133m014
$$ -1991 50373 71521 77946 38028 38953 52600 22430 8638 30724 55745 45572 37439 33425
8757C3425j676k6142J066L5303Q517k8687Q2N699k0824k6258L0662K7976r167
$$ 33425 31749 5607 6673 41976 50493 21806 21888 27587 6763 -19495 11167 39143 29976
8744B9976k3358R680P71k0514n62L393j9549J713L4301K1341j3564j9482N099
$$ 29976 6618 16298 17069 -3445 -4007 -614 -20163 -18450 15851 37192 23628 4146 9245
8731I245K580j1481J6639J158o699l9212o860K8055M973N84K1841K6015N168J0566
$$ 9245 11825 344 16983 18141 11442 -27770 -34630 -6575 -1602 -1018 20823 46838 52006 62572
8717F2572p930k7982m167M3432J129J1069j1349J5942j3521j7673j6265K8013
$$ 62572 54642 26660 22493 65925 67054 78123 66774 82716 69195 51522 35257 63270
8705F3270K823k3652k3793J73k539k6461L4463R175L7049p054k7151o038K885
$$ 63270 66093 42441 18648 18821 16282 -10179 24284 33459 70508 63454 36303 30265 33150
8692C3150J9776q622o876J2329r191m1106r708J5386j1868J1697Q387l183J786
$$ 33150 52926 44304 37428 49757 40566 -540 -10248 5138 -6730 4967 13354 10171 11957
8679A1957k5789N428L681J7631j1441L4319M504n078r322j0625j8879j4051Q782
$$ 11957 -13832 -8404 -4723 12908 1467 35786 40290 35212 25890 15265 -3614 -17665 -8883
8666h883J5054L5364J449j625L634J4800p817l7465k2677Q029K1590Q962p113
$$ -8883 6171 41535 42984 41359 44993 59793 51976 14511 -8166 -137 21453 30415 23302
8653B3302K252J1517J3403j0201n216P386M1470J5603J4498J1837N3116M2204
$$ 23302 25554 37071 50474 40273 35057 42443 83913 99516 114014 125851 178967 221171
8641B21171O780R7610O7610J6300p1867n0962p9424n6986m4846k5598j0568J8025
$$ 221171 227951 325561 393171 409471 337604 286642 207218 150232 105386 79788 69220 87245
8629H7245J8822j1813k0504L2833j0238n9210L22p038R107K8640j9949k1922J9997
$$ 87245 106067 94254 73750 106583 96345 37135 37457 30419 39526 68166 48217 26295 46292
8616D6292j6617J6306P6058k138l4558l3800L462J0200R378K017j4767k2097M415
$$ 46292 29675 45981 122039 119901 85343 51543 55005 65205 74583 76600 61833 39736 44151
8603D4151N7661M3902J6139k169J8612M4463P5181J20319J78648J90189P3072
$$ 44151 101812 145714 161853 159684 178296 222759 297940 418259 596907 787096 860168
8592H60168l9494j20912j42666j43022j31261n3185o460m7868r310q073J6292
$$ 860168 820674 699762 557096 414074 282813 229628 223168 175300 165990 157917 174209
8581A74209J2201j1367K4940R960q694k2357n8000n6554j8996M2147n840m750
$$ 174209 186410 175043 199983 209943 201249 178892 120892 64338 45342 87489 81649 76899
8569G6899m714k4693K1880M6751L586k822R547j3072l5677l3860J9105K8765l4367
$$ 76899 72185 47492 69372 116123 119709 116887 126434 113362 77685 43825 62930 91695 57328
8556E7328R833R689L4065M8392K8077L7798N7130Q8789M7239m1446n8727l8599
$$ 57328 67161 76850 110915 159307 187384 225182 282312 371101 418340 376894 318167 279568
8544B79568k2565m5186n1162k4204k6454m1385j7373j641k6174k2481J8405L8035
$$ 279568 257003 211817 160655 136451 109997 68612 51239 49598 23424 943 19348 57383
8532E7383K9954J2553j7975l2683l9461k2069m931J6860M9870J9692k9603k4503
$$ 57383 87337 99890 81915 49232 9771 -12298 -17229 -369 49501 69193 39590 15087
8520A5087J3880K9800L4936m5130l5857K936L6981J1724K9589k0057j8823M236
$$ 15087 28967 58767 93703 48573 12716 15652 52633 64357 93946 73889 55066 59302
8508E9302j695p52O885j3024j7243k4355J0154M6523k427l5804m2994l4676J2898
$$ 59302 57607 56855 63740 50716 33473 9118 19272 65795 63368 27564 -15430 -50106 -37208
8495c7208J8921J6241J6070Q925q295r030k0580L9518l108j2472k2354j7787j1919
$$ -37208 -18287 -2046 14024 22949 14654 5624 -14956 24562 21454 8982 -13372 -31159 -43078
8482d3078L4152J478k0440J7327J9331J1712J0699M6o397K2695N462j2128M214
$$ -43078 -8926 -7448 -27888 -10561 8770 20482 31181 31227 24830 47525 52987 40859 45073
8469D5073r667O549l9057J4102r647L277K0961J1522k9789k9560M581j0424K6395
$$ 45073 35406 41955 2898 17000 7353 10630 31591 43113 13324 -16236 -11655 -22079 4316
8456D316L1489k311L468J060k302k7947m564K80Q210J2630j1559R30j6284K4732
$$ 4316 35805 33494 36962 38022 35720 7773 3209 3489 11699 24329 12770 13700 -2584 22148
8442B2148O973o796L0190J905O808K7691L0670j9765j8021k8760j7123k0156j6130
$$ 22148 29121 22325 52515 54420 61228 88919 119589 99824 81803 53043 35920 15764 -366
8429c66k713N3603P619m453j5834k5590l6704M238K4901J335M3536K0519K4493
$$ -366 -3079 50524 58143 53690 37856 12266 -24438 -20200 4701 6036 49572 70091 94584
8416I4584j5285l3968l2317n865m5681R89K2673L1726k8573k4770M086K822J7357
$$ 94584 79299 45331 13014 7149 -38532 -37543 -14870 16856 -11717 -36487 -32401 -29579 -12222
8403a2222J0794j1890j9433J0851J2990p412N539K3017k0618n74r245l0974l2438
$$ -12222 -1428 -13318 -32751 -21900 -8910 -16322 -10783 12234 -8384 -8958 -18203 -49177 -81615
8390h1615K2564L9820J8358J8834r744k7170J8348M4645j523K789j0391k808l601
$$ -81615 -59051 -19231 -873 17961 8217 -18953 -605 44040 42517 45306 34915 32107 28506
8377B8506k0436j907k6810k3143J0747j6921l0025L620L5775P3286L0959k2615
$$ 28506 8070 6163 -20647 -43790 -33043 -49964 -79989 -76369 -40594 32692 63651 41036
8365D1036J3634O916j619j0261l4850o600l2854N208K5240k475k1129k818P546
$$ 41036 54670 61586 59967 49706 14856 8256 -24598 -19390 5850 3375 -17754 -20572 -13026
8352a3026R951K1055j5244J8015L6528k09l5436j5992L444n926j2395l107J6267
$$ -13026 -3075 17980 2736 20751 57279 57070 21634 5642 9086 3160 -9235 -12342 3925
8339C925J7689j2097j0971K2188O325m2067j1283K1779L4461M998j737j2140k4441
$$ 3925 21614 9517 -1454 20734 27059 -15008 -26291 -4512 29949 34947 33210 21070 -3371
8326c371o586K3794j9830o535K8193l433l1048j4206J5900j711M7202J6698j742
$$ -3371 -9957 13837 -5993 -12528 15665 12232 -18816 -33022 -17122 -18833 28369 45067 43325
8313D3325J3894r770k6387j9699j1667n063M592l676J4419L2427o558j2535p057
$$ 43325 57219 47449 21062 1363 -10304 -15367 -10775 -14451 -32 32395 25837 13302 6245
8300F245k6936k7734L3609M1069L6780k476j7633l4794k7943K4557M6346K3689
$$ 6245 -20691 -48425 -14816 26253 63033 60557 42924 8130 -19813 4744 51090 74779
8288G4779k3398P766k1122j3301L851J5020q256j8115J2169L5023r857k4777j0765
$$ 74779 51381 59147 38025 24724 28575 43595 35339 17224 29393 64416 54559 29782 19017
8275A9017r864j0453O091k0466L6344L5506O368l3122k1324M140Q800J8898l0981
$$ 19017 9153 -1300 4791 -15675 20669 56175 62543 29421 8097 12237 21037 39935 8954
8262H954j9263R11J8295J9453J8211J169m4550r243p850K0764J4263L64j9964
$$ 8954 -10309 -9398 8897 28350 46561 47730 3180 -6063 -13913 6851 21114 21478 1514
8249A514o094J4082j4223j5085k595qK7536L2450J6379k3854m2608p857K1352
$$ 1514 -4580 9502 -4721 -19806 -22401 -22409 5127 37577 53956 30102 -12506 -20363 989
8236I89q118k1329l2884K263L4732K0543j809J147K8769K1347k8229L8582L1888
$$ 989 -7129 -28458 -61342 -59079 -24347 -3804 -5613 -4466 24303 45650 17421 56003 87891
8223H7891n1707j5042J1157n393L467K3445J190j6364J386j0045O930J1255j4880
$$ 87891 36184 21142 32299 26906 30373 53818 55008 38644 40030 29985 36915 48170 33290
8210C3290R903j3203p956k6289k8362m409l062L5324o406L3374q65l5848j9825
$$ 33290 43193 29990 22034 -4255 -32617 -37026 -40088 -4764 -11170 22204 21339 -14509 -34334
8197c4334k3796l0920k4662L8648M2256M404J9054M7331p869n8399n620J672L5756
$$ -34334 -58130 -89050 -113712 -75064 -32808 -28404 -9350 37981 30112 -28287 -33907 -32235 3521
8184C521K7894j7997k2056m1283j6053K6608l1620l0695J2789Q265M7533J2722
$$ 3521 31415 13418 -8638 -49921 -65974 -39366 -70986 -101681 -88892 -80627 -33094 -20372
8172b0372k0265j9137R452J652k3045K2860J58j8184Q272p375j9917P783L7425
$$ -20372 -40637 -59774 -50322 -48670 -71715 -48855 -48697 -66881 -58609 -65984 -85901 -78118 -40693
8159d0693L4878J9353J5258l89j443n6689J9359k622o025J0541j7588J1828K167
$$ -40693 -5815 13538 28796 28407 26964 -29725 -10366 -12988 -19013 -8472 -26060 -14232 -12065
8146a2065k0391K4602J7100l9166R926k8273k8826j6724N713K2358K0625L387
$$ -12065 -32456 -7854 9246 -29920 -19994 -48267 -77093 -93817 -88104 -65746 -45121 -41734
8134d1734M0856K1969K213J0682j7884k6641J4486J5085L351k2715j7614j8814
$$ -41734 -878 21091 23304 33986 16102 -10539 3947 19032 22383 -332 -17946 -36760
8122c6760l209K0583P405M1296J0314m2051l2040J8289J5252j245J0672j9935
$$ -36760 -39969 -19386 -11981 29315 39629 -2422 -34462 -16173 -921 -2166 8506 -11429
8110a1429N187J2728J8713L98j9365j6057P340J558J7696J2949l2614j089J4050
$$ -11429 -6242 6486 25199 25597 6232 -9825 -2485 -927 16769 29718 -2896 -3985 10065
8097A0065l856k886m0602j75L699k4687L1291N642K311Q575l501J275K0917M494
$$ 10065 6209 3323 -37279 -37454 -33755 -58442 -27151 -21509 -19198 -10623 -14124 -12849 8068 12562
8083A2562J8536J9001N497k8111o212J5131K1746k3750J410J7138K1522k6150
$$ 12562 31098 50099 55596 27485 21273 36404 58150 34400 35810 52948 74470 48320
8071D8320r699l7296j4524J3401K0743K2409J4534n752k831k6504L692M4257J1578
$$ 48320 38621 1325 -13199 202 20945 43354 57888 52136 49305 22801 26493 70750 82328
8058H2328p0o3911j1555K0613J0631j6419k290k3318M4534J0827J234L9687k4592
$$ 82328 82258 18347 6792 27405 38036 21617 19327 -3991 40543 51370 52604 92291 67699
8045F7699l6988J213j509m0246j0765k5002j9368L8391K3361p194J0662q177l07
$$ 67699 30711 31924 30415 -9831 -20596 -45598 -64966 -26575 -3214 -10408 254 -7923 -8230
8032h230j1716P259L0843J2330m116k4832K2097L603k6062j1201L1349m995l5173
$$ -8230 -19946 -12687 18156 30486 26370 1538 23635 27238 1176 -10025 21324 16329 -18844
8019a8844m5409J7680J2035J7926J1213j0064k989K0424k5074J2157J0531j5275
$$ -18844 -64253 -46573 -34538 -16612 -5399 -15463 -18452 1972 -23102 -10945 -414 -15689
8007a5689K085p115Q319J5970m2088k0995K083K7036O296R800j8031j8441M3886
$$ -15689 -13604 -20719 -12400 3570 -38518 -59513 -57430 -30394 -24098 -14298 -32329 -50770 -6884
7994f884J9230j5181k3764N093l349R350K5286O928n345l8190l217J6901j2912
$$ -6884 12346 -2835 -26599 -21506 -24855 -15505 9781 16709 11364 -26826 -30043 -13142 -26054
7981b6054k46L9703n443q114Q359P975l3030p755R327L2218L3255k0426o550l782
$$ -26054 -26300 13403 7960 -154 8205 16180 -16850 -24605 -15278 16940 50195 29769 23219 19437
7967A9437k528n885M367o883J028J1130J4728k9899l307K8632M842m0088k0952
$$ 19437 16909 11024 15391 8508 9536 20666 35394 5495 2188 30820 35662 -4426 -25378
7954b5378J176J984p536j1048k443K6303L4385j8933J402J5842M3960K7230k0455
$$ -25378 -24202 -22218 -29754 -40802 -43245 -16942 17443 -1490 -88 15754 59714 86944 66489
7941F6489l0172Q097Q674j9106L104L472m605m1197k9158r552K2743O0852j45
$$ 66489 36317 44414 53088 33982 37086 40558 35953 -5244 -34402 -43954 -21211 39641 39496
7928C9496j7578k0246o4102Q439N464R523J6796k852m9276M3299M4001j9102j8349
$$ 39496 21918 1672 -62430 -53991 -48527 -39004 -22208 -25060 -74336 -31037 12964 -6138 -24487
7915b4487l119N2677J4543j6517n261q463O5850l421m2576M269J9817k9819k0051
$$ -24487 -27606 25071 39614 23097 17836 9373 75223 71802 29226 33495 53312 23493 3442
7902C442J6454k1381k8061L926J1347J7641Q53r69K3061J3269j7752R268L6498
$$ 3442 19896 -1485 -29546 -25620 -14273 3368 4221 3252 26313 39582 21830 31098 67596
7889F7596o314l6451k3125l2265J9310M061Q489M0299J5559n3261j5313r338J3804
$$ 67596 61282 24831 1706 -30559 -11249 -7188 1301 41600 57159 3898 -11415 -20753 -6949
7876f949J5037j0849J7711J5123j4558j6602P13m212J4189J4236L70k3337K7723
$$ -6949 8088 -2761 14950 30073 15515 -1087 -374 -4586 9603 23839 24209 872 28595
7863B8595K7594p223l5715k9006j5237J4468L7222K006p890m498k1843j0923J0803
$$ 28595 56189 48966 13251 -15755 -30992 -16524 20698 22704 14814 10316 -11527 -22450 -11647
7850a1647N0477L3237k9218l7540r71k991j9672P7l8022J7563J5188j0358R532
$$ -11647 38830 72067 42849 5309 4338 1347 -18325 -18248 -56270 -38707 -23519 -33877 -24345
7837b4345L359O992L3653q48P978l5365j5921J1576J3078R688N589J1865K320
$$ -24345 -20986 -13994 19659 18811 26789 -8576 -24497 -12921 157 9845 15434 27299 29619
7824B9619j8835J2408k7218k3459j4109J0497k3078P556O320k2868K7834O813
$$ 29619 10784 23192 -4026 -27485 -41594 -31097 -54175 -46619 -40299 -63167 -35333 -28520
7812b8520k4757r294O649J3559O373M164J4955J1007j9423r843K859q613m7177
$$ -28520 -53277 -62571 -55922 -42363 -35990 -31826 -16871 -5864 -25287 -35130 -32271 -40884 -88061
7799h8061j7394L4568O0146M8674k1136n4757l3123j108J9625L046k5314K350
$$ -88061 -105455 -70887 -10741 37933 16797 -37960 -71083 -72191 -52566 -49520 -74834 -72484
7787g2484J2778M878k8614M6028Q721k5773j6523n524j5769L9748M3943K7734
$$ -72484 -59706 -54828 -83442 -37414 -28693 -54466 -70989 -76513 -92282 -52534 -8591 19143
7775A9143J1611K1318n229j2546J8451j9736l530j4383j4781o77J8909K037j4007
$$ 19143 30754 52072 46843 34297 52748 33012 29482 15099 318 -359 18550 20587 6580
7762F580j7084O701K7242j2849l7730L9143r687l298j5716k4510j0385M250q95
$$ 6580 -10504 -3803 23439 10590 -27140 12003 2316 -982 -16698 -41208 -51593 -47343 -48238
7749d8238L0171J2295L7011m782l3162j4121J103K7545k6279k6450J5325J9946
$$ -48238 -18067 -5772 31239 26457 -6705 -20826 -19723 7822 -18457 -44907 -29582 -9636
7737i636L752J4564j1131j4483j6840k6986J3401M1536j3932l1551r218L319L3315
$$ -9636 -5884 8680 -2451 -16934 -33774 -60760 -47359 -5823 -19755 -51306 -60524 -57205 -23890
7724b3890n41k4646L26j6563J3107L8039N394q60j2478l3547K2876P8257j8037
$$ -23890 -24431 -49077 -48751 -65314 -52207 -14168 -8774 -9634 -22112 -55659 -32783 45474 27437
7711B7437m5748k9029J211q409j6014j7740k0724N3766K3977K2996o686j7945
$$ 27437 -18311 -47340 -46129 -54538 -70552 -88292 -109016 -55250 -31273 -8277 -14963 -32908
7699c2908j226M3574J8173m7607j4799k0318r129L0199L2207N1346J2615n2078
$$ -32908 -34134 9440 27613 -19994 -34793 -55111 -64240 -34041 -1834 49512 62127 10049
7687A0049j4042k2331l9348R142J9506J4384O546K1759M372J7905p753J2401P656
$$ 10049 -3993 -26324 -65672 -56530 -37024 -22640 -16094 5665 10037 27942 20189 32590 40246
7674D0246m1805j7986l0780o25M0085K3063m5633m7173p298J3081M0858K1295
$$ 40246 -1559 -19545 -50325 -50950 -10865 12198 -33435 -80608 -87906 -74825 -33967 -12672
7662a2672J1134L0816j0524P221R918n744j6177m8003j5502j4301K3318P72j8278
$$ -12672 -1538 29278 18754 25975 35893 30149 13972 -34031 -49533 -63834 -40516 -39744 -58022
7649e8022J9086M2451L282k5230r396l1730j6804K5570M6194j5433k8182N836
$$ -58022 -38936 3515 6797 -18433 -27829 -59559 -76363 -50793 -4599 -20032 -48214 -42378
7637d2378K5270j5635M726Q321J226P940K7678K0756q569J5127k0283k4253k0975
$$ -42378 -17108 -32743 -28017 -19696 -18470 -10530 17148 37904 29335 44462 24179 -74 -21049
7624b1049j7148K6139j7106j9980p923r255L1081O4268m1955k2497P744l181l5514
$$ -21049 -38197 -12058 -29164 -49144 -57067 -66322 -35241 29027 -12928 -35425 -27681 -30862 -66376
7611f6376P645M3168k555N39q386J2000O945J9713L7980j1118l0752K2010L3877
$$ -66376 -58731 -15563 -18118 -17579 -25965 -13965 -7020 12693 50673 39555 8803 30813 64690
7598F4690j6655k8910R295p999j6931j9392K495J4637r329j8169J8986L4798o342
$$ 64690 48035 19125 28420 20421 3490 -15902 -13407 1230 -8099 -26268 -7282 27516 21174
7585B1174j4701k8853J0289j9610N3517M4397j3815k0963o600k0890O363j6108
$$ 21174 6473 -22380 -12091 -31701 21816 66213 52398 31435 24835 3945 10308 -5800
7573e800j3522J5269j9428j2361K5740K4403K4106J367O804q598n7220m1491l3368
$$ -5800 -19322 -4053 -23481 -35842 -10102 14301 38407 39774 46578 37980 -19240 -60731 -94099
7560i4099M595K7165K8381k0820N091Q551j3178K9632K7354J3645L681k260o994
$$ -94099 -89504 -62339 -33958 -54778 -49687 -41136 -54314 -24682 2672 16317 19998 17738 10744
7547A0744K488R064j794Q121j0634n7940o1891k679J2992L878K1660M0090L3420
$$ 10744 13232 22296 20502 28623 17989 -39951 -101842 -104521 -91529 -87651 -65991 -25901 7519
7534G519Q1K8823J6168j3345l0263j5165J867j8448o769J8687K7350L6521k9653
$$ 7519 7600 36423 52591 39246 8983 -6182 -4315 -22763 -29532 -10845 16505 53026 23373
7521B3373k4224J2891J7721K842O033l3710j5610J4220j6516p30m269l148K6627
$$ 23373 -851 12040 29761 32603 38636 4926 -10684 3536 -12980 -13710 -17979 -21127 5500
7508E500j2565j0757n290L885j1943K915P989J7640N2558J7983l8727m2520R284
$$ 5500 -7065 -17822 -23112 -19227 -31170 -28255 -20266 -2626 49932 67915 29188 -13332 -4048
7495d048k0557j323N5113m98k1048j372n490l1764K2376Q850k0849M759J7495
$$ -4048 -24605 -25928 29185 28687 7639 6267 777 -30987 -8611 239 -20610 -15851 1644
7482A644m912O358j3262m4636K3878K6475m428k4710k8757J5159j1271j5739J8267
$$ 1644 -3268 3090 -10172 -54808 -30930 -4455 -8883 -33593 -62350 -47191 -58462 -74201 -55934
7469e5934n253J9220K1794r809L203l158N221j3236J2086L811m919Q881j4438
$$ -55934 -61187 -41967 -20173 -29982 -26779 -29937 -24716 -37952 -25866 -22055 -26974 -18093 -32531
7456c2531J0212j943n00l157j8991r706O065p079J7124M889J7472J4874j4853
$$ -32531 -22319 -24262 -24762 -27919 -46910 -56616 -50551 -57630 -40506 -35617 -18145 -3271 -18124
7443a8124J3800j8180K5837j5558l774O028k9451j2526j0775J4905J0932L3454
$$ -18124 -4324 -22504 3333 -12225 -15999 -9971 -39422 -51948 -62723 -47818 -36886 -3432
7431c432m555j3811K3888J5084J5470k8075q303k545K3578k0659j9834l5109K4639
$$ -3432 -7987 -21798 2090 17174 32644 4569 -3734 -6279 17299 -3360 -23194 -58303 -33664
7418c3664L5182r816j8778l1522j7034J5279J0573K5183Q245m00M414j1524o64
$$ -33664 1518 -8298 -27076 -58598 -75632 -60353 -49780 -24597 -16352 -16752 -12338 -23862 -24526
7405b4526K3626r298j8442n524L1838k2937l0434L0678N7381j1948J410J5298
$$ -24526 -900 -10198 -28640 -34164 -2326 -25263 -55697 -25019 32362 20414 21824 37122
7393C7122m3523o879J7290l3771J7850K854l9078r634l630K0387L4800L6993J165
$$ 37122 -6401 -13280 4010 -29761 -11911 -9057 -48135 -57769 -61399 -41012 -6212 30781 31946
7380C1946k8609J6072M3313P905o4577m3970J7637K625J43l879j3361J2091p394
$$ 31946 3337 19409 62722 70627 6050 -37920 -20283 -17658 -17515 -21394 -34755 -22664 -30058
7367c0058J5132L6686K9826J0338k4314l8533J1371L713l910M08l7735n961k4117
$$ -30058 -14926 21760 51586 61924 37610 -923 10448 14161 10251 10659 -27076 -33037 -57154
7354e7154K823k7112p03K3137K0032Q279K448m409k2812L30j7995K233k959L7895
$$ -57154 -54331 -81443 -82146 -59009 -38977 -30698 -28250 -32659 -55471 -55141 -73136 -70903 -73862 -35967
7340c5967O759k6266J6657j5717k4932M7398M3419K605j0849m185J6956L3120
$$ -35967 -29208 -55474 -38817 -54534 -79466 -32068 11351 13956 3107 -1078 15878 48998
7328D8998o455l6156J1679R424K799k9715q718O146j5370L7632N793m0804J2556
$$ 48998 42543 6387 18066 27490 30289 574 -8144 -1998 -17368 20264 26057 -14747 -2191
7315b191K0626j7941j226J6971l0077m1993L7683L9927L424R123q467k0109k3177
$$ -2191 18435 494 -732 16239 -13838 -55831 -18148 21779 25203 34326 25859 5750 -17427
7302a7427L016M7505j2070l0356J2566K211l0834r413n644P135J0808q445R778
$$ -17427 -14411 33094 21024 -9332 3234 5445 -25389 -34802 -40446 -33311 -22503 -30948 -21170
7289b1170O173K2753K2525l0575m0398J577M3853K2345M371m7361j0860m575n529
$$ -21170 -14997 7756 30281 -294 -40692 -39115 4738 27083 31454 -15907 -26767 -31342 -36871
7276c6871J6228j4402l0649J5160K7224K8613l0803j1354K617M910L1087K8291
$$ -36871 -20643 -35045 -65694 -50534 -23310 5303 -25500 -36854 -34237 -29327 1760 30051
7264C0051m404j4515o924k32J6743q635j4128K2701L7863K5132j7887L088k0320
$$ 30051 25647 11132 4208 3976 20719 12084 -2044 20657 58520 83652 65765 68853 48533
7251D8533m3765m5241j3580K4173P887k814L0241J8965L0477k0897l0378k5571
$$ 48533 4768 -40473 -54053 -29880 -21993 -24807 5434 24399 54876 33979 3601 -21970
7239b1970J594L7994J4347m5605k2801M2873L5146l552k2001j8875L7566k6442
$$ -21970 -20376 17618 31965 -13640 -36441 6432 41578 38026 16025 -2850 34716 8274
7227H274l0369j9321J3130O244Q548j8716p529J0321J1821M99j8726J7757K0088
$$ 8274 -22095 -41416 -28286 -22042 -13494 -32210 -39739 -29418 -17597 -17098 -35824 -18067 2021
7214B021n0229n5975M556J3048K0816M0127N0133O698r03L772j2930j6599q125
$$ 2021 -48208 -104183 -99627 -86579 -65763 -25636 24497 31195 30292 34064 21134 4535 -3590
7201c590k2958j7049o300K1127j590Q720O912j7337k349P775n600L1356J1998
$$ -3590 -26548 -43597 -49897 -28770 -30360 -21640 -14728 -32065 -34414 -26639 -32239 -883 11115
7188A1115o618l0410k392M5727j9456n779L3144j0355j9051l0J7441K4660j8801
$$ 11115 4497 -25913 -28305 17422 -2034 -7813 25331 14976 -4075 -4105 13336 37996 19195
7175A9195j7248l2059l3182R882m058J8288l260K4217K7524j1900k8666K1027
$$ 19195 1947 -30112 -63294 -53412 -57470 -39182 -42442 -18225 9299 -2601 -31267 -10240
$$ [...]
##END NTUPLES=NMR SPECTRUM
##END=
