##TITLE=Analysis number 310855
Compound Code cc 40151
Book Reference 350/148/6
Project Code adrs
Chemist Name chrisr
##JCAMPDX= 6.0         $$ Bruker NMR JCAMP-DX V2.0
##DATA TYPE= NMR SPECTRUM
##DATA CLASS= NTUPLES
##ORIGIN= Bruker BioSpin GmbH
##OWNER= NMR
$$ XWIN-NMR		Version 3.5
$$ Fri Jun 24 08:52:11 2005 GMT Daylight Time (UT+1h)  MAYBRIDGE\NMR@NMR_250MHZ
##.OBSERVE FREQUENCY= 250.131544655141
##.OBSERVE NUCLEUS= ^1H
##.ACQUISITION MODE= SIMULTANEOUS (DQD)
##.ACQUISITION SCHEME= undefined
##.AVERAGES= 16
##.DIGITISER RES= 18
##SPECTROMETER/DATA SYSTEM= dpx250
##.PULSE SEQUENCE= zg30
##.SOLVENT NAME= DMSO
##.SHIFT REFERENCE= (INTERNAL, DMSO, 0, 16.522)
##AUDIT TRAIL= $$ (NUMBER, WHEN, WHO, WHERE, WHAT)
$$ ##TITLE= Audit trail, XWIN-NMR		Version 3.5
$$ ##JCAMPDX= 5.01
$$ ##ORIGIN= Bruker BioSpin GmbH
$$ ##OWNER= NMR
$$ C:\u/data/dgb/nmr/ADRS/4760/pdata/1/auditp.txt
$$ ##AUDIT TRAIL=  $$ (NUMBER, WHEN, WHO, WHERE, WHAT)
(   1,<2005-06-24 08:51:46.46 +100>,<MAYBRIDGE\NMR>,<NMR_250MHZ>,
      <created by zg, POWCHK disabled, PULCHK disabled
       configuration hash MD5:
       62 19 C7 07 E1 42 D1 B7 37 6C 3D D0 77 39 F9 E6
       data hash MD5: 64K
       EB EE FF BF 79 B3 E3 3C D2 A4 22 37 63 9B E0 D9>)
(   2,<2005-06-24 08:52:01.19 +100>,<MAYBRIDGE\NMR>,<NMR_250MHZ>,
      <Start of raw data processing
       ef LB = 0.3 FT_mod = 6 PKNL = 1 SI = 32K 
       data hash MD5: 32K
       D1 14 8E D1 F6 06 67 E4 87 88 25 FC 34 50 B0 25>)
(   3,<2005-06-24 08:52:03.07 +100>,<MAYBRIDGE\NMR>,<NMR_250MHZ>,
      <apk 
       data hash MD5: 32K
       85 9E CF E4 07 6B 0B 42 CB 90 CE E2 B6 75 7B F7>)
(   4,<2005-06-24 08:52:03.83 +100>,<MAYBRIDGE\NMR>,<NMR_250MHZ>,
      <abs ABSG = 5 
       data hash MD5: 32K
       88 03 2D FE 40 F8 76 ED 52 B7 35 E5 2B 4D 58 22>)
$$ ##END=
$$ 
$$ hash MD5
$$ 5D EF C7 F7 48 A0 78 43 C9 20 1A 20 D8 A8 11 D7
##$RELAX= 
##$RELAX= 
##$RELAX= 
##$RELAX= 
##$RELAX= 
##$RELAX= 
##$RELAX= 
$$ Bruker specific parameters
$$ --------------------------
##$DU= <C:\u>
##$EXPNO= 4760
##$NAME= <ADRS>
##$PROCNO= 1
##$TYPE= <nmr>
##$USER= <dgb>
##$AMP= (0..31)
100 100 100 100 100 100 100 100 100 100 100 100 100 100 100 100 100 100 
100 100 100 100 100 100 100 100 100 100 100 100 100 100 
##$AQSEQ= 0
##$AQ_mod= 3
##$AUNM= <au_zg>
##$AUTOPOS= <3 >
##$BF1= 250.13
##$BF2= 250.13
##$BF3= 250.13
##$BF4= 250.13
##$BF5= 500.13
##$BF6= 500.13
##$BF7= 500.13
##$BF8= 500.13
##$BYTORDA= 1
##$CFDGTYP= 0
##$CFRGTYP= 5
##$CHEMSTR= <none>
##$CNST= (0..31)
1 1 145 1 1 1 1 1 1 1 1 1 1 1 1 1 1 1 1 1 1 1 1 1 1 1 1 1 1 1 1 1 
##$CPDPRG= <>
##$CPDPRG1= <>
##$CPDPRG2= <>
##$CPDPRG3= <>
##$CPDPRG4= <mlev>
##$CPDPRG5= <mlev>
##$CPDPRG6= <mlev>
##$CPDPRG7= <mlev>
##$CPDPRG8= <mlev>
##$CPDPRGB= <>
##$CPDPRGT= <>
##$D= (0..31)
0 1 0 0 0 0 0 0 0 0.06 0 0 0 0 0 0 0.0002 0 0 0 0 0 0 0 0 0 0 0 0 0 0 
0 
##$DATE= 1119599505
##$DBL= (0..7)
120 120 120 120 120 120 120 120 
##$DBP= (0..7)
150 150 150 150 150 150 150 150 
##$DBP07= 0
##$DBPNAM0= <>
##$DBPNAM1= <>
$$ [...]
##$SUBNAM7= <"">
##$SUBNAM8= <"">
##$SUBNAM9= <"">
##$SW= 20.6930455092707
##$SWIBOX= (0..15)
0 0 3 0 0 0 0 0 0 0 0 0 0 0 0 0 
##$SW_h= 5175.983436853
##$TD= 65536
##$TD0= 1
##$TE= 295.16
##$TE2= 300
##$TE3= 300
##$TEG= 300
##$TL= (0..7)
0 120 120 120 120 120 120 120 
##$TP= (0..7)
150 150 150 150 150 150 150 150 
##$TP07= 0
##$TPNAME0= <>
##$TPNAME1= <>
##$TPNAME2= <>
##$TPNAME3= <>
##$TPNAME4= <>
##$TPNAME5= <>
##$TPNAME6= <>
##$TPNAME7= <>
##$TPOAL= (0..7)
0.5 0.5 0.5 0.5 0.5 0.5 0.5 0.5 
##$TPOFFS= (0..7)
0 0 0 0 0 0 0 0 
##$TUNHIN= 0
##$TUNHOUT= 0
##$TUNXOUT= 0
##$USERA1= <user>
##$USERA2= <user>
##$USERA3= <user>
##$USERA4= <user>
##$USERA5= <user>
##$V9= 5
##$VALIST= <valist>
##$VCLIST= <CCCCCCCCCCCCCCC>
##$VD= 0
##$VDLIST= <DDDDDDDDDDDDDDD>
##$VPLIST= <PPPPPPPPPPPPPPP>
##$VTLIST= <TTTTTTTTTTTTTTT>
##$WBST= 1024
##$WBSW= 4
##$XGAIN= (0..3)
0 0 0 0 
##$XL= 0
##$YL= 0
##$YMAX_a= 303689
##$YMIN_a= -380743
##$ZGOPTNS= <>
##$ZL1= 120
##$ZL2= 120
##$ZL3= 120
##$ZL4= 120
##$ABSF1= 16.522
##$ABSF2= -4.171173
##$ABSG= 5
##$ABSL= 3
##$ALPHA= 0
##$AQORDER= 0
##$ASSFAC= 0
##$ASSFACI= 0
##$ASSFACX= 0
##$ASSWID= 0
##$AUNMP= <proc_1d>
##$AZFE= 0.1
##$AZFW= 0.1
##$BCFW= 0
##$BC_mod= 0
##$BYTORDP= 0
##$COROFFS= 0
##$CY= 12.5
##$DATMOD= 1
##$DC= 0
##$DFILT= <>
##$DTYPP= 0
##$F1P= 14.0000005364418
##$F2P= -0.99999901652339
##$FCOR= 0.5
##$FTSIZE= 32768
##$FT_mod= 6
##$GAMMA= 0
##$GB= 0
##$INTBC= 1
##$INTSCL= 1
##$ISEN= 128
##$LB= 0.3
##$LEV0= 0
##$LPBIN= 0
##$MAXI= 10000
##$MC2= 0
##$MEAN= 0
##$ME_mod= 0
##$MI= 0
##$NCOEF= 0
##$NC_proc= -7
##$NLEV= 6
##$NOISF1= 0
##$NOISF2= 0
##$NSP= 0
##$NTH_PI= 0
##$NZP= 0
##$OFFSET= 16.522
##$PC= 1
##$PHC0= -86.72607
##$PHC1= 5.146791
##$PH_mod= 1
##$PKNL= yes
##$PPARMOD= 0
##$PSCAL= 4
##$PSIGN= 0
##$REVERSE= no
##$SF= 250.13
##$SI= 32768
##$SIGF1= 0
##$SIGF2= 0
##$SINO= 400
##$SIOLD= 32768
##$SREGLST= <1H.DMSO>
##$SSB= 0
##$STSI= 32768
##$STSR= 0
##$SW_p= 5175.98343685301
##$SYMM= 0
##$S_DEV= 0
##$TDeff= 65536
##$TDoff= 0
##$TI= <Analysis number 999999
Compound Code 99
Book Reference 9
Project Code 9>
##$TILT= no
##$TM1= 0
##$TM2= 0
##$TOPLEV= 0
##$USERP1= <user>
##$USERP2= <user>
##$USERP3= <user>
##$USERP4= <user>
##$USERP5= <user>
##$WDW= 1
##$XDIM= 32768
##$YMAX_p= 518983943
##$YMIN_p= -1710020
$$ End of Bruker specific parameters
$$ ---------------------------------
##NTUPLES= NMR SPECTRUM
##VAR_NAME=  FREQUENCY,     SPECTRUM/REAL,   SPECTRUM/IMAG
##SYMBOL=    X,             R,               I
##VAR_TYPE=  INDEPENDENT,   DEPENDENT,       DEPENDENT
##VAR_FORM=  AFFN,          ASDF,            ASDF
##VAR_DIM=   32768,         32768,           32768
##UNITS=     HZ,            ARBITRARY UNITS, ARBITRARY UNITS
##FACTOR=    0.157963299565203, 1,           1
##FIRST=     4132.6476996994, 0,             0
##LAST=      -1043.33573715361, 0,           0
##MIN=       -1043.33573715361, -1710020,    0
##MAX=       4132.6476996994, 518983943,     0
$$ Real data points
##PAGE= N=1
##DATA TABLE= (X++(R..R)), XYDATA
$$ [...]
15140A71537K29314l32820j31894j59544J78449J66242l3217m46152J44826L75770
$$ 171537 400851 68031 -63863 -223407 -44958 121284 88067 -358085 -213259 162511
15130A62511r9337r2520J40456l62422J29064J15929J51440J48424r6553K559
$$ 162511 63174 -29346 111110 -251312 -122248 -6319 145121 293545 196992 199551
15120A99551j86181l80847j6664k4697K12646L28200l5966J65915r4147k36056
$$ 199551 13370 -367477 -384141 -408838 -196192 132008 96042 261957 167810 -68246
15110f8246k17509k28357k98578l02419K68551L02187L6161K88897K45828k79252
$$ -68246 -285755 -514112 -812690 -1115109 -846558 -544371 -508210 -219313 26515 -252737
15100b52737K71394j21161j81216L69792O0887J67914l22824k45519J40257K88516
$$ -252737 18657 -102504 -283720 86072 146959 314873 -7951 -253470 -113213 175303
15090A75303r1853L32427K26240j30444l85410o6748J02243k07498K53231l36057
$$ 175303 83450 415877 642117 511673 126263 59515 161758 -45740 207491 -128566
15080a28566p8574K37932j65480k47860l59339K75386N02491K78345k16191m17703
$$ -128566 -207140 30792 -134688 -382548 -741887 -466501 35990 314335 98144 -319559
15070c19559l11645J00489k5092P7530K65797k86295o6625j6913m4737R5420K89311
$$ -319559 -631204 -530715 -555807 -478277 -212480 -498775 -565400 -582313 -627050 -531630 -242319
15059b42319p687m8616k1147K9949k5867N24292K06840j86388q7262L46621q1072
$$ -242319 -250006 -298622 -319769 -289820 -315687 208605 415445 229057 141795 488416 407344
15048D07344o40731j03157J28963K89799j1295J21834j86651O5885J207j15009
$$ 407344 -233387 -336544 -207581 82218 70923 192757 6106 71991 73198 -41811
15038d1811L28785Q28224J45105k79104k51274j44799m1190m16208l89228q9736
$$ -41811 286974 1115198 1260303 981199 729925 585126 543936 127728 -261500 -351236
15028c51236l528K90935L89361k5367j71431J85134n36171k13685J90095m06035
$$ -351236 -354764 -63829 325532 300165 128734 313868 -222303 -435988 -245893 -651928
15018f51928k2504O93633q1722L6825K71787k54924J79590l10866k5350P1988
$$ -651928 -674432 19201 -62521 -25696 246091 -8833 170757 -140109 -165459 -93471
15008i3471J92056r9603p3919O39021k34614m99638K39498m59062j12307M82991
$$ -93471 98585 -1018 -74937 564084 329470 -170168 69330 -389732 -502039 -19048
14998a9048J16654j25394q6890m20151M1312O9076N9723p3381J64926K46593L57907
$$ -19048 97606 -27788 -114678 -534829 -493517 -424441 -364718 -438099 -273173 -26580 331327
14987C31327j26764l77110j73083M3325K40063N9822L82567M47344J187k84906
$$ 331327 204563 -172547 -345630 -302305 -62242 -2420 380147 827491 828678 543772
14977E43772K56809k38555m36828J37127J27361l9404m94222P022N79140J84824
$$ 543772 800581 562026 125198 262325 389686 350282 -143940 -136918 442222 627046
14967F27046l91713n65873n03746K55160p9778k64839P81611N25853o1091o1405
$$ 627046 235333 -330540 -834286 -579126 -658904 -923743 -142132 383721 322630 261225
14957B61225k43703l24306J95373k38039l24689L98763P06182L29198P6927j21029
$$ 261225 17522 -306784 -111411 -349450 -674139 -275376 430806 760004 836931 715902
14947G15902k33229r3964k18481J62255J62408P0037j10063j53277j20546k2550
$$ 715902 482673 388709 170228 332483 494891 564928 454865 301588 181042 158492
14937A58492K82631j22196j09735j46443J16249r4842p6371N6293J20229N67986
$$ 158492 441123 318927 209192 62749 178998 84156 7785 64078 184307 752293
14927G52293m0332n56342N3277L51149k1586m38986J97865P8201m11385R1542
$$ 752293 711961 155619 208896 560045 538459 99473 297338 375539 -35846 55696
14917E5696M12918n1183K15998j6632l31064J36208o8836K05338j89928j91492
$$ 55696 468614 417431 633429 616797 285733 421941 353105 558443 368515 177023
14907A77023m07408J10820J62157p9078j40262K67758L09655L24429k75802k66454
$$ 177023 -230385 -119565 42592 -36486 -176748 91010 400665 725094 449292 182838
14897A82838l79181l11310N665L27600J12052k52200M38095N31774L45269K9926
$$ 182838 -196343 -507653 -501988 -174388 -62336 -314536 123559 655333 1000602 1030528
14887A030528k018l65539m43758J50652l66309j73770J68147J99124L16994M0199
$$ 1030528 1028510 662971 219213 369865 3556 -170214 -2067 197057 514051 554250
14877E54250L88496J68000l50570L1301J13337l63728l10624L1269N53460q164
$$ 554250 942746 1110746 760176 791477 904814 541086 230462 261731 815191 807027
14867H07027n20321j86595Q776m92798q226J86181q4965J20277k25004N7651M82219
$$ 807027 286706 100111 108887 -383911 -392137 -205956 -290921 -170644 -395648 -337997 144222
14856A44222p0685j53876K01678J7661R7424K67064R5581k87124J06667M4471
$$ 144222 73537 -80339 121339 139000 236424 503488 599069 311945 418612 463083
14846D63083J07287l91931M9124R109r956j77719k97291R6428L06374l97167p0583
$$ 463083 570370 178439 227563 236672 226716 48997 -248294 -151866 154508 -242659 -313242
14835c13242M56930M75959Q0430q29119J22776L29630J90543l23302m09643K4377
$$ -313242 143688 619647 700077 -129042 -6266 323364 513907 190605 -219038 -194661
14825a94661k01244N9660N21431l12672J46437O38257M5975m2693K82994j23452
$$ -194661 -395905 -336245 185186 -127486 18951 657208 703183 660490 943484 820032
14815H20032o55874m15678L02191K75615K40441J22578j05545j00828m57606j00027
$$ 820032 164158 -251520 50671 326286 566727 689305 583760 482932 25326 -74701
14805g4701j24719N8431N05363Q2470o7686L01771n1395l33661o64841P190K17671
$$ -74701 -199420 -140989 364374 446844 379158 680929 629534 295873 -368968 -361778 -144107
14794a44107k57789p27814N37942J023269J2703N3378o7755l53905k14795k97338
$$ -144107 -401896 -1129710 -591768 431501 444204 497582 429827 75922 -138873 -436211
14784d36211j7115K72682K73776K26556k73234j99569J04019j01255l55893K09214
$$ -436211 -453326 -180644 93132 319688 46454 -153115 -49096 -150351 -506244 -297030
14774b97030L23K49336K60115K57706j77720N7220L14857n9118m20148m27112
$$ -297030 -296707 -47371 212744 470450 292730 349950 664807 605689 185541 -241571
14764b41571M48N34097j90918k7741l2579O53418K11667j38878l28511j27959
$$ -241571 -241123 292974 102056 74315 41736 695154 906821 767943 439432 311473
14754C11473l44047J03030j1642o19330p6734J6138j30666M60514O29124J92377
$$ 311473 -32574 70456 58814 -560516 -637250 -621112 -751778 -291264 337860 530237
14744E30237j24260M39463K46774j25799m79316p57296K3519J06666K08757k76089
$$ 530237 405977 845440 1092214 966415 487099 -270197 -246678 -140012 68745 -207344
14734b07344K6235L42329J70263m79093k91625J42986J2673J81059K55359k9561
$$ -207344 -181109 161220 331483 -147610 -439235 -296249 -283576 -102517 152842 123281
14724A23281R476M30012J41637m4075j14196j0834J19915k54649J2977j06929
$$ 123281 132757 562769 704406 660331 546135 535301 655216 400567 413544 306615
14714C06615n63025l6459K02922J977j93417K74655P46208P53177l3524m61689
$$ 306615 -256410 -292869 -89947 -87970 -281387 -6732 739476 1492653 1459129 997440
14704I97440j25677j22390p3004k06481K90819n50999n2178o8348m94524L8814
$$ 997440 871763 749373 676369 469888 760707 209708 157530 89182 -405342 -366528
14694c66528K4911J11444J47851O462j38981j83090K21710l50014l33943K69344
$$ -366528 -341617 -230173 -82322 -75860 -214841 -397931 -176221 -526235 -860178 -590834
14684e90834P90363J11561j40384j4849J96705p9278q4202J67379L22648R0686
$$ -590834 199529 311090 170706 155857 352562 273284 189082 356461 679109 769795
14674G69795P1494m02812j45813l8794O4288k45402O7179L27712M05180M45971
$$ 769795 841289 438477 292664 253870 318158 72756 139935 467647 872827 1318798
14664A318798J61065k9533m00047l14451o37164P8755j28980N3454N2079P4251
$$ 1318798 1479863 1450330 1050283 735832 98668 177423 48443 101897 153976 228227
14654B28227Q32029k91574j06313n488n37400p9036M46073J12647l29563J76997
$$ 228227 1060256 768682 662369 656881 119481 40445 486518 599165 269602 446599
14644D46599J3775j38229k61580l4766J30104K16726K13722R8291k02731l10602
$$ 446599 460374 322145 60565 25799 155903 372629 586351 684642 481911 171309
14634A71309L17785m16407r46671k01821K13130K17475L17375P5820L65680k00642
$$ 171309 489094 72687 -873984 -1075805 -862675 -645200 -327825 -252005 113675 -86967
14624h6967O7133j20812n77202K45523m0877r873j66669J07928N27780M02731
$$ -86967 -19834 -140646 -717848 -472325 -513202 -523075 -689744 -581816 -54036 348695
14614C48695M08198M993L0448L75166l01830n04896L2122j39391l26212j03428
$$ 348695 756893 761886 792334 1167500 865670 360774 392896 253505 -72707 -176135
14604a76135J90230Q139o8030k62950K41177N50377M61953j80203k53060l49221
$$ -176135 14095 22234 -45796 -308746 -67569 482808 944761 764558 511498 162277
14594A62277k4976J22592k15109o102K879K34485L63287l31964p25681m45567
$$ 162277 137301 259893 44784 38682 41561 276046 639333 307369 -418312 -863879
14584h63879K11691L98839M02769k54333o94559L10590M42229J74431k24709K32533
$$ -863879 -652188 -253349 149420 -104913 -799472 -488882 -46653 127778 -96931 135602
14574A35602M36966Q8669j6899k18122m9276k03996k73669O14961K50988L59099
$$ 135602 572568 661237 644338 426216 376940 172944 -100725 514236 765224 1124323
14564A124323J36517l90816l17711K54742L22340l16389k67923M25680L02739
$$ 1124323 1260840 870024 552313 807055 1129395 813006 545083 970763 1273502
14555A273502l3984l76452k11109l25272J02180Q2290O02302Q9316J110k51920
$$ 1273502 1239518 863066 651957 326685 428865 511155 1113457 1202773 1203883 951963
14545I51963o04575j45197R9879k38344l60957L73447n6282K11427L74597k35649
$$ 951963 347388 202191 302070 63726 -297231 76216 19934 231361 605958 370309
14535C70309l34689l25142K53311j425k3029L04499k12190K09176M19077K69632
$$ 370309 35620 -289522 -36211 -37636 -60665 243834 31644 240820 659897 929529
14525I29529j52840L1031j62350j76452n3318K77190J78580j41564K94353K05345
$$ 929529 776689 807720 645370 468918 415600 692790 871370 729806 1024159 1229504
14515A229504j62467k12636L02547L08228n24502l78494k0644P65285N99256j95465
$$ 1229504 1067037 854401 1156948 1465176 940674 562180 541536 1306821 1906077 1710612
14505A710612j2204L71668J81644l26088j86123k64894m328J09815l15509P09282
$$ 1710612 1698408 2070076 2251720 1925632 1739509 1474615 1470287 1580102 1264593 1973875
14495A973875N79831L90941L84817M6742l21962J55673m8230m68610j43672R10070
$$ 1973875 2553706 2944647 3329464 3376206 3054244 3209917 3161687 2693077 2549405 3459475
14485C459475L21171k09975K93178J99729J51488M4155M4512L89244l4424k40338
$$ 3459475 3780646 3570671 3863849 4063578 4215066 4259221 4303733 4692977 4658553 4418215
14475D418215J65730M35193j6936N03032Q04361J54278Q2099q0671o06599K13829
$$ 4418215 4583945 5019138 5002202 5505234 6309595 6463873 6545972 6465301 5858702 6072531
14465F072531P2907l12516l33251j53645j14820p0553k66116M1334J07004p8125
$$ 6072531 6145438 5832922 5499671 5346026 5231206 5160653 4894537 4935871 5042875 4964750
14455D964750l4823l72594l95721m01731m88925J00564M31398J33822m08564n93789
$$ 4964750 4929927 4557333 4161612 3759881 3270956 3371520 3802918 3936740 3528176 2934387
14445B934387O88263M80012P6597m07898m49817q52890n45405M36285m2038L27902
$$ 2934387 3622650 4102662 4179259 3771361 3321544 2468654 1923249 2359534 2317496 2645398
14435B645398j48148M1796J26124N36541k58531m48473k83287j54979J99486L5949
$$ 2645398 2497250 2539046 2665170 3201711 2943180 2494707 2211420 2056441 2255927 2291876
14425B291876n4341k06927O227O16942L03814l34715k40038l86499Q9861J11434
$$ 2291876 2237535 2030608 2036835 2653777 2957591 2622876 2382838 1996339 2086200 2197634
14415B197634j66983l66789J2514k15881l02688o3758o5011N98910j38150n4911
$$ 2197634 2030651 1663862 1676376 1460495 1157807 1094049 1029038 1627948 1489798 1434887
14405A434887M52105j16843j14681N015J22845J73400n49767n56067N8614k37867
$$ 1434887 1886992 1770149 1655468 1660483 1783328 1956728 1406961 850894 909508 671641
14395F71641k58933R6468J13889K65829J31970l23698K14370o7476k34644K00278
$$ 671641 412708 509176 623065 888894 1020864 697166 911536 844060 609416 809694
14385H09694L76982m36446l74631o3062J30648k57040R9595K41348k86721Q093
$$ 809694 1186676 750230 375599 312537 443185 186145 285740 527088 240367 248460
14375B48460K30489m3750J35837k47905l32046L30871N22146j66095J95038O42338
$$ 248460 478949 435199 571036 323131 -8915 321956 844102 678007 873045 1515383
14365A515383j8987p47771K8520L52840M06558m32370k95328l72019l74115j84840
$$ 1515383 1496396 748625 777145 1129985 1536543 1104173 808845 436826 62711 -122129
14355a22129k71170K68875j20898K91951M04306N11021l24531k61708K67522L90919
$$ -122129 -393299 -124424 -245322 46629 450935 961956 637425 375717 643239 1034158
14345A034158K97970m73886n6219n5672j79501K37753J32782n93834p4483J05084
$$ 1034158 1332128 858242 802023 746351 566850 804603 937385 343551 269068 374152
14335C74152M01034l29502j68559K57181O5281k07815J35361L54527J88083o39295
$$ 374152 775186 445684 277125 534306 599587 391772 527133 881660 1069743 430448
14325D30448N1417k91013J35830K28689J34282j51447k26819K78317k2508l37612
$$ 430448 481865 190852 326682 555371 689653 538206 311387 589704 567196 229584
14315B29584l46559O8975l213M8143N3574m0101k7765P3690l96059L217P45518
$$ 229584 -116975 -48000 -51213 -3070 50504 10403 -17362 56328 -339731 -336514 409004
14304D09004N88092m00873p45059J8653K98418P9226K0749N3485r530L2617P03979
$$ 409004 997096 596223 -148836 -130183 168235 247461 268210 321695 312165 344782 1048761
14293A048761K76963j19260k01353m42686J71626N45349j90372n86594L08683
$$ 1048761 1325724 1206464 1005111 562425 734051 1279400 1089028 502434 811117
14284H11117M23673m67385m41486M12290N39645m16297J26307K58646k54208L27564
$$ 811117 1234790 767405 325919 738209 1277854 861557 987864 1246510 992302 1319866
14274A319866K7726l06796J44777K82542j74647o34713k41827K69447J46280m85516
$$ 1319866 1347592 1040796 1185573 1468115 1293468 658755 416928 686375 832655 347139
14264C47139j00442J7216M68524K38906k07138m43673k44816m01419J47820M8190
$$ 347139 246697 263913 732437 971343 764205 320532 75716 -325703 -177883 -129693
14254a29693k7340j14042N24313L32502l45414L2444O13755K627p5771J16438
$$ -129693 -157033 -271075 253238 585740 240326 272770 886525 889152 813381 929819
14244I29819m33402l35589O086M44855j65106j82743M6490N6446K01378l25960
$$ 929819 496417 160828 166914 611769 446663 263920 310410 366856 568234 242274
14234B42274n34124j48191M85936M57620K47076j74831m70864l39294L47164M85969
$$ 242274 -291850 -440041 45895 503515 750591 575760 104896 -234398 112766 598735
14224E98735j0090k4012L28579L99873k405n49003M6102m7528l0191L25076j86867
$$ 598735 588645 564633 893212 1293085 1290680 741677 787779 740251 710060 1035136 848269
14213H48269k58998O4837M15182J62707r1801k24828l97504m67633o5329P58885
$$ 848269 589271 654108 1069290 1231997 1140196 915368 517864 50231 -15098 743787
14203G43787N75404j42592n31669l33195k05384r4847R6201J89313J12587N7353
$$ 743787 1319191 1176599 644930 311735 106351 11504 107705 297018 409605 466958
14193D66958J43240K75879p9658k66292P1135m55414q1271N42002N1698m61256
$$ 466958 610198 886077 806419 540127 611262 155848 74577 616579 668277 207021
14183B07021K1084L64223k84418M717L46828k45471j81123K71152M33993K0381
$$ 207021 228105 592328 307910 312627 659455 413984 232861 504013 938006 958387
14173I58387l24496l48666j34450L47587m08914m3222N9223K65988L64581N6465
$$ 958387 633891 285225 150775 498362 89448 46226 105449 371437 736018 792483
14163G92483K01567k04638j53592p38359k08381M28210L82758j7645M5256K43314
$$ 792483 994050 789412 635820 -102539 -310920 117290 500048 482403 527659 770973
14153G70973n7541K88967M5356j94209m3404K84171N53570j20306l90577j96280
$$ 770973 713432 1002399 1047755 853546 810142 1094313 1647883 1527577 1137000 940720
14143I40720j91342r8782k38306k28769K04740l6199J68550K99532K14298M0101
$$ 940720 749378 650596 412290 183521 388261 352062 520612 820144 1034442 1074543
14133A074543K5203l50070l86003o28J37774l25132k15612l1925P0713K42963
$$ 1074543 1099746 749676 363673 363045 500819 175687 -39925 -71850 -1137 241826
14123B41826L84599N48267M29916k01815j81604l93447l77381j90143j55371L93836
$$ 241826 626425 1174692 1604608 1402793 1221189 827742 450361 260218 104847 498683
14113D98683J7128J142N79490K72026K69777K19930k7428o35036l6838M8754n48426
$$ 498683 515811 516953 1096443 1368469 1638246 1858176 1830748 1195712 1158874 1207628 659202
14102F59202n4085K34005J03335J85215J88174K46441L81626k52834l33442m36922
$$ 659202 605117 839122 942457 1127672 1315846 1562287 1943913 1691079 1357637 920715
14092I20715m38095O79037N28014j31537l2194n44343R6157n2355K01428J82742
$$ 920715 482620 1161657 1689671 1558134 1525940 981597 1077754 1025399 1226827 1409569
14082A409569M5891j25986j43770m8741J44647K76465l9803o240j27929L9870
$$ 1409569 1455460 1329474 1185704 1136963 1281610 1558075 1518272 1512032 1384103 1423973
14072A423973K44219M49974L35477l62247n13300m39641l62738K31810l23310
$$ 1423973 1668192 2118166 2453643 2091396 1578096 1138455 775717 1007527 684217
14063F84217K60882o7729L87975M45293k31172j76019J5128J20627J70809M15252
$$ 684217 945099 877370 1265345 1710638 1479466 1303447 1318575 1439202 1610011 2025263
14053B025263J21629j26421K5867q0580J61455R2947l38578m61179k13026K81001
$$ 2025263 2146892 2020471 2046338 1965758 2127213 2220160 1881582 1420403 1207377 1488378
14043A488378L33222K75166J58973M32030J74831l62471n7566k32014r8334n88426
$$ 1488378 1821600 2096766 2255739 2687769 2862600 2500129 2442563 2210549 2112215 1523789
14033A523789j43250J77436k95424j29556M40971J46054J82565O7181l65286j57945
$$ 1523789 1380539 1557975 1262551 1132995 1573966 1720020 1902585 1969766 1604480 1446535
14023A446535J61748j89695K78452K25983m47390j60263K69600L24002R9778o62345
$$ 1446535 1608283 1418588 1697040 1923023 1475633 1315370 1584970 1908972 2008750 1346405
14013A346405n23859q9369L19594L38381L81551r6836n32875l38713L9955N11504
$$ 1346405 822546 733177 1052771 1391152 1772703 1675867 1142992 804279 844234 1355738
14003A355738K3680J34273j40046J59089R2185k72063m90571j12290J02476M55726
$$ 1355738 1379418 1513691 1373645 1532734 1624919 1352856 862285 749995 852471 1308197
13993A308197K59012j3552l66450r7640K61358J24374l61141L4347L64947m80273
$$ 1308197 1567209 1553657 1187207 1089567 1350925 1475299 1114158 1148505 1513452 1033179
13983A033179n6424P7489J28159Q1616j86469l16993m5026K38751O7388j96219
$$ 1033179 976755 1054244 1182403 1264019 1077550 760557 715531 954282 1021670 825451
13973H25451j81356N1349K50890O1773J677k95651Q061l56133m24962L96990N78807
$$ 825451 644095 695444 946334 1008107 1009784 714133 722194 366061 -58901 338089 916896
13962I16896L87321N25393K841n62451j29127k55057k26745J8641N3781k96429
$$ 916896 1304217 1829610 1832451 1270000 1140873 885816 659071 677712 731493 435064
13952D35064k2784J43296J41429p3847M08718K41935l5566l84356k36647K67661
$$ 435064 412280 555576 697005 623158 1031876 1273811 1238245 853889 617242 884903
13942H84903K78011j70714j49702k20417j20084l82185n4841J07122N73971j51981
$$ 884903 1162914 992200 842498 622081 501997 119812 64971 172093 746064 594083
13932E94083j6149N78704j5747J4504k1304p0979K74411l74376K97175L15962
$$ 594083 577934 1156638 1140891 1155395 1134091 1063112 1337523 963147 1260322 1576284
13922A576284l0673K08369m71594R6589K2333l27886K36512K20572K4800J63036
$$ 1576284 1545611 1753980 1282386 1378975 1401308 1073422 1309934 1530506 1555306 1718342
13912A718342m71029j22916M3649l88132k85663J15049k00738k7697Q54542K77037
$$ 1718342 1247313 1124397 1168046 779914 494251 609300 408562 380865 1235407 1512444
13902A512444j53880j12410j07682J40373l4497Q8328j55161Q5275K84851O6583
$$ 1512444 1358564 1246154 1138472 1278845 1244348 1332676 1177515 1262790 1547641 1614224
13892A614224j67141m04771r0791N43823J10114k84520J37006K45527j34411k85771
$$ 1614224 1447083 1042312 951521 1495344 1605458 1320938 1457944 1703471 1569060 1283289
13882A283289j23716J30357J05888L85146M59230J12615j41828k4319K78223j79251
$$ 1283289 1159573 1289930 1395818 1780964 2240194 2352809 2210981 2186662 2464885 2285634
13872B285634j35890k58173n83014r1009P5248J19896M49298M87900K54837m93252
$$ 2285634 2149744 1891571 1308557 1217548 1292796 1412692 1861990 2349890 2604727 2111475
13862B111475n57357l36518K81943N74531k1644j87787J71009L4983k82569l02739
$$ 2111475 1554118 1217600 1499543 2074074 2052430 1864643 2035652 2070635 1788066 1485327
13852A485327j76750L43861N34171J57779j68666J28244K63405r99N0407p2166
$$ 1485327 1308577 1652438 2186609 2344388 2175722 2303966 2567371 2566372 2616779 2544613
13842B544613K2387J93229J24478K28618n59841k78774j16713P2575K42422K3225
$$ 2544613 2567000 2760229 2884707 3113325 2553484 2274710 2157997 2230572 2472994 2496219
13832B496219J02781j60438r5712K08361J31808J51507l86824l75632N48286P8519
$$ 2496219 2599000 2438562 2342850 2551211 2683019 2834526 2447702 2072070 2620356 2698875
13822B698875l57751r8724K40694r3512L48702L32671J6219j13239r3029j32437
$$ 2698875 2341124 2242400 2483094 2389582 2738284 3070955 3087174 2973935 2880906 2748469
13812B748469m27719o61280j25102k12704L09073J28961j18321J71113J19942
$$ 2748469 2320750 1659470 1534368 1321664 1630737 1759698 1641377 1812490 1932432
13803A932432N46593J81239j93339m49513l25821K14075n704L47778m318l62064
$$ 1932432 2479025 2660264 2466925 2017412 1691591 1905666 1899962 2247740 2243422 1881358
13793A881358N09312L38207m9788j86361L52197L44485p2354n3432P2696j38362
$$ 1881358 2390670 2728877 2679089 2492728 2844925 3189410 3117056 3063624 3136320 2997958
13783B997958Q7108K4474r8336L97238l3416M4756J51903J16410M49431j65663
$$ 2997958 3085066 3109540 3011204 3408442 3375026 3419782 3571685 3688095 4137526 3971863
13773C971863l48509l7309k46832j63484R0821j53911j178j39396k1437L93810
$$ 3971863 3623354 3586045 3339213 3175729 3266550 3112639 3111461 2972065 2950628 3344438
13763C344438L86122n27612K805P3445N97501J68794k06500M20035M78733K40533
$$ 3344438 3730560 3202948 3205753 3279198 3876699 4045493 3838993 4259028 4737761 4978294
13753D978294j34382j65158n64012K0099j05158J95697O05417L76406K90854k07370
$$ 4978294 4843912 4678754 4114742 4134841 4029683 4225380 4830797 5207203 5498057 5290687
13743E290687m43522K07705L06538k20872M57992M41814p6081k95501k88363K26782
$$ 5290687 4847165 5054870 5361408 5140536 5598528 6040342 5964261 5668760 5380397 5607179
13733E607179J89872K59737K57978N32586Q7148l47190k61941J49045K28168N29407
$$ 5607179 5797051 6056788 6314766 6847352 6934500 6587310 6325369 6474414 6702582 7231989
13723G231989K63981L89841J45563j07052k40451L44265M98167L0514k29121L03880
$$ 7231989 7495970 7885811 8031374 7924322 7683871 8028136 8526303 8556817 8327696 8631576
13713H631576m3012M5778N28122K47637L13268K74134N49594k0018J29121M7198
$$ 8631576 8588564 8634342 9162464 9410101 9723369 9997503 10547097 10527079 10656200 10703398
13703A0703398P4221j61554K50753O76143O59421N13084N86200K41852o5229l4277
$$ 10703398 10777619 10616065 10866818 11542961 12202382 12715466 13301666 13543518 13478289 13444012
13693A3444012L98022P78156Q48048K56819o085K12719L12503M48931K02709O74278
$$ 13444012 13842034 14620190 15468238 15725057 15718972 15931691 16244194 16693125 16895834 17570112
13683A7570112N10048N80030O50574R21665L87105N12098R29049K94672Q48422
$$ 17570112 18080160 18660190 19310764 20232429 20619534 21131632 22060681 22355353 23203775
13674B3203775O69399N46596P98299J323297Q70162Q23034O81450Q65533J037260
$$ 23203775 23873174 24419770 25218069 26541366 27411528 28234562 28916012 29781545 30818805
13665C0818805J017511J402537J161164J185234J399916J682013J877630J820058
$$ 30818805 31836316 33238853 34400017 35585251 36985167 38667180 40544810 42364868
13657D2364868J472110J380921K023151K562605K311251K037705J938288K595033
$$ 42364868 43836978 45217899 47241050 49803655 52114906 54152611 56090899 58685932
13649E8685932K989103L143029K539968L183115M146927M010883L788704L742467
$$ 58685932 61675035 64818064 67358032 70541147 74688074 78698957 82487661 86230128
13641H6230128M020658M186084M813267M362975M507135M687263M552418M472365
$$ 86230128 90250786 94436870 99250137 103613112 108120247 112807510 117359928 121832293
13633A21832293M988582N161815M475345M421953M663868M253055M543453M374548
$$ 121832293 126820875 131982690 136458035 140879988 145543856 149796911 154340364 158714912
13625A58714912M104193L457911L806689L431917L480055L832215L460873L653082
$$ 158714912 162819105 166277016 170083705 173515622 176995677 180827892 184288765 187941847
13617A87941847L194694L492436L673673L881572L642052L032172L783477M136563
$$ 187941847 191136541 194628977 198302650 202184222 205826274 208858446 212641923 216778486
13609B16778486L902678M303297M510364L697671L368920L504879L190043K949034
$$ 216778486 220681164 224984461 229494825 233192496 236561416 240066295 243256338 246205372
13601B46205372K536062K206253J602884R24208N41882k1242j238465j933363
$$ 246205372 248741434 250947687 252550571 253474779 254016661 253995419 252756954 250823591
13593B50823591k299391k754401l161192m083057m916365n449430n344509n046982
$$ 250823591 248524200 245769799 242608607 238525550 233609185 228159755 222815246 217768264
13585B17768264n517843n805380n672060o261093n618947n514689n702233n225302
$$ 217768264 212250421 206445041 200772981 194511888 188892941 183378252 177676019 172450717
13577A72450717m885221n324083n248953m921135m362451m714626m069729m014464
$$ 172450717 167565496 162241413 156992460 152071325 147708874 142994248 138924519 134910055
13569A34910055l957717l691870l392578l973420m075272l143502k852797l334402
$$ 134910055 130952338 127260468 123867890 119894470 115819198 112675696 109822899 106488497
13561A06488497l202526l385367l325894k780850k738818k777942k637301l036393
$$ 106488497 103285971 99900604 96574710 93793860 91055042 88277100 85639799 82603406
13553H2603406k892709j908980k320678l113685k379171j796837k146910k182481
$$ 82603406 79710697 77801717 75481039 72367354 69988183 68191346 66044436 63861955
13545F3861955k007252k114855j707489j709144j380213j493425k352468j739202
$$ 63861955 61854703 59739848 58032359 56323215 54943002 53449577 51097109 49357907
13537D9357907j510844j401683j480348k221609j511198j591390j353605r02135
$$ 49357907 47847063 46445380 44965032 42743423 41232225 39640835 38287230 37385095
13529C7385095r21209j486632j201306q86877j299956r32443j328422l80979n84934
$$ 37385095 36463886 34977254 33775948 32889071 31589115 30656672 29328250 28947271 28362337
13520B8362337j031236j228894n61045q15358p05646j87648m79838p45376j029658
$$ 28362337 27331101 26102207 25541162 24725804 24020158 23832510 23352672 22607296 21577638
13511B1577638k19689n32702o65180r1812m07436m59301n70775o67353m54650
$$ 21577638 21357949 20825247 20160067 20068255 19660819 19201518 18630743 17963390 17508740
13502A7508740m32562r77127p11872J30003l91308k02735j59995L65651p60097
$$ 17508740 17076178 16099051 15387179 15517182 15125874 14923139 14763144 15128795 14368698
13493A4368698j473324o81227m36414m66074K39978K46126P217j28750j57695
$$ 14368698 12895374 12214147 11777733 11311659 11551637 11797763 11804980 11676230 11518535
13484A1518535m16125k22221l5510k85301l23430k38636j0331l15595k26961k92757
$$ 11518535 11102410 10880189 10844679 10559378 10235948 9997312 9986981 9671386 9444425 9151668
13474I151668l74229k42091J5193Q8632j59742M51236k31094J6539L62068m5619
$$ 9151668 8777439 8535348 8550541 8639173 8479431 8930667 8699573 8716112 9078180 9032561
13464I032561r4981m40386n17791l90013m97945L59884N78877J05978n8066k0203
$$ 9032561 8937580 8497194 7979403 7589390 7091445 7451329 8030206 8136184 8078118 8057915
13454H057915J55319l3387k16029k35307j76502j99959l02987m3102J653j78856
$$ 8057915 8213234 8179847 7963818 7728511 7552009 7352050 7049063 7005961 7007614 6828758
13444F828758m14275j58793j3749R1024N41956L33588l55683k39796M0998m28442
$$ 6828758 6414483 6255690 6241941 6332965 6874921 7208509 6852826 6613030 6654028 6225586
13434F225586m93115l13703N7847Q0151K82332J97942p9917M751L86947P9133
$$ 6225586 5732471 5418768 5476615 5556766 5839098 6037040 5957123 5961874 6348821 6427954
13424F427954K01351k05011n4359k14631j83715J03902l41946n4619k97974k39076
$$ 6427954 6629305 6424294 6369935 6155304 5971589 6075491 5733545 5678926 5380952 5141876
13414E141876Q9628K94742L31196K66179N10175J24346L48677m01157n96008m75644
$$ 5141876 5231504 5526246 5857442 6123621 6633796 6758142 7106819 6705662 6109654 5634010
13404E634010k02080k47293n36159L60177N48525K50955j90876k18282K9827J38569
$$ 5634010 5431930 5184637 4648478 5008655 5557180 5808135 5617259 5398977 5428804 5567373
13394E567373n0234l83998m33155K49314J30682j96264l78424j9594J69349j36010
$$ 5567373 5517139 5133141 4699986 4949300 5079982 4883718 4505294 4485700 4655049 4519039
13384D519039n6725l0052N7103O3829K34478J58117L52256N0778j35542k23973
$$ 4519039 4462314 4432262 4489365 4553194 4787672 4945789 5298045 5348823 5213281 4989308
13374D989308k74592k84363L03931n73866n31950l24781r3785O17686N28447N9555
$$ 4989308 4714716 4430353 4734284 4160418 3628468 3303687 3209902 3827588 4356035 4415590
13364D415590J13028l89937O9840J62317J00775q6340J77262K1356Q1428k64826
$$ 4415590 4528618 4138681 4208521 4370838 4471613 4385273 4562535 4583891 4665319 4400493
13354D400493O4435L9215n1331J33238K40904j71129n57376o29203o625M0052
$$ 4400493 4464928 4504143 4452812 4586050 4826954 4655825 4098449 3469246 3462621 3502673
13344C502673R5509Q659n4174R1930K48995k10081m73925j94530j8324M44141
$$ 3502673 3598182 3606841 3552667 3644597 3893592 3683511 3209586 3015056 2996732 3440873
13334C440873M10004l39181J45124N86392l45257q37832l55215K80217O08626
$$ 3440873 3850877 3511696 3656820 4243212 3897955 3060123 2704908 2985125 3593751
13325C593751n1349j015377l59648J36729J481k16034L62481L92000K79846k00420
$$ 3593751 3542402 2527025 2167377 2304106 2305587 2089553 2452034 2844034 3123880 2923460
13315B923460M2300J5138M31969L1094k90413j78846k27395J06166j53352j89704
$$ 2923460 2965760 2980898 3412867 3443961 3153548 2974702 2747307 2853473 2700121 2510417
13305B510417K83658L64283M9386P9459J68853k01257K98651M50045k38030l09093
$$ 2510417 2794075 3158358 3207744 3287203 3456056 3254799 3553450 4003495 3765465 3456372
13295C456372K88731L64083L3938l8710k09247r7776m61524J72695J52095J30586
$$ 3456372 3745103 4109186 4143124 4104414 3895167 3797391 3335867 3508562 3660657 3791243
13285C791243K7800j02600O5050J34654J127L74270m0382j02031O7886j10842
$$ 3791243 3819043 3716443 3781493 3916147 3917274 4291544 4251162 4149131 4217017 4106175
13275D106175l36391J92898k80795K23952O6817J36232L20875P0117l926j79776
$$ 4106175 3769784 3962682 3681887 3905839 3972656 4108888 4429763 4499880 4495954 4316178
13265D316178K43736j58152k54211q4966J1567K19799m5287k45741L31403q9152
$$ 4316178 4559914 4401762 4147551 4062585 4074152 4293951 4248664 4002923 4334326 4245174
13255D245174j35888K32004K13069L65649K54170K10304n4617j59995J57552L09779
$$ 4245174 4109286 4341290 4554359 4920008 5174178 5384482 5329865 5169870 5327422 5637201
13245E637201K35637R006J1081j53587k36150P457K68953K50242k32874j16982
$$ 5637201 5872838 5881844 5892925 5739338 5503188 5510645 5779598 6029840 5796966 5679984
13235E679984n9283k35513k51681J15587L27213L71986q0548j17001m2584l21
$$ 5679984 5620701 5385188 5133507 5249094 5576307 5948293 5867745 5750744 5708160 5707839
13225E707839L18175P1459O4562Q9056m18067m40927l50188J43391M42046M53959
$$ 5707839 6026014 6097473 6162035 6251091 5833024 5392097 5041909 5185300 5627346 6081305
13215F081305Q4695k84744J62020k40128l06949j49960N1632N68714Q53253r1958
$$ 6081305 6166000 5881256 6043276 5803148 5496199 5346239 5397871 5966585 6819838 6727880
13205F727880k46209J71070l73274p46185P053J52365K68644L50945R5246P7415
$$ 6727880 6481671 6652741 6279467 5533282 5540335 5692700 5961344 6312289 6407535 6484950
13195F484950K02182m1600J42164n76999l34794j11610P2766p0944J78030K30095
$$ 6484950 6687132 6645532 6787696 6210697 5875903 5764293 5837059 5766115 5944145 6174240
13185F174240K02784m8787j72833j91026j53436k33529l161m131K26408K35844
$$ 6174240 6377024 6328237 6155404 5964378 5810942 5577413 5574252 5570121 5796529 6032373
13175F032373j57720m6253l34435m1251k0328K39202K23761M8472j18534j5810
$$ 6032373 5874653 5828400 5493965 5452714 5432386 5671588 5895349 5943821 5825287 5809477
13165E809477l67487j42181l04579n7159K23798j05887J36212M19206o7641j42590
$$ 5809477 5441990 5299809 4995230 4938071 5161869 5055982 5192194 5611400 5543759 5401169
13155E401169o45493j23361K8253L31314J37655l60574l34443L51184J98273j88386
$$ 5401169 4755676 4632315 4660568 4991882 5129537 4768963 4434520 4785704 4983977 4795591
13145D795591J54960L87135O451N9085K88077j76501j71685J27114J41385L40121
$$ 4795591 4950551 5337686 5344137 5403222 5691299 5514798 5343113 5470227 5611612 5951733
13135E951733l62422q96488m01599O64394l50271O511M99873j66233m15515m45772
$$ 5951733 5589311 4692823 4291224 4955618 4605347 4611858 5111731 4945498 4529983 4084211
13125D084211j13003Q2187J58424N01310J90748m46395o59243J69017M26843m5338
$$ 4084211 3971208 4053395 4211819 4713129 4903877 4457482 3798239 3967256 4394099 4348761
13115D348761p64161l75239J09670J84592k84662K4993K0595J41194M67951N78527
$$ 4348761 3584600 3209361 3319031 3503623 3218961 3243954 3264549 3405743 3873694 4452221
13105D452221l71505o20841N13204j17812l06574L9355J37523j67301k85394j33521
$$ 4452221 4080716 3459875 3973079 3855267 3548693 3588048 3725571 3558270 3272876 3139355
13095C139355j64159k89984J20729L49673J71311k99128R7924M56659M59126K43613
$$ 3139355 2975196 2685212 2805941 3155614 3326925 3027797 3125721 3582380 4041506 4285119
13085D285119l08577m72331J40460J59365K44114j63397l30724j14328M16902
$$ 4285119 3976542 3504211 3644671 3804036 4048150 3884753 3554029 3439701 3856603
13076C856603M69622r4596P87j86921K56835p6135J38224o6846m24k23566O1726
$$ 3856603 4326225 4231629 4232416 4045495 4302330 4226195 4364419 4297573 4297149 4073583 4135309
13065D135309l612J959K3660l67851l23575j70174N69847q9728o39974j65876
$$ 4135309 4131697 4133656 4157316 3789465 3465890 3295716 3865563 3775835 3135861 2969985
13055B969985K05511m5378J26653j23204n1834K74603O7453M828k98802M57369
$$ 2969985 3175496 3130118 3256771 3133567 3081733 3356336 3423789 3428617 3129815 3587184
13045C587184J09833l06954n669k26498K577P5569J65288j01397m351j83104J66653
$$ 3587184 3697017 3390063 3384394 3157896 3160473 3236042 3401330 3299933 3295582 3112478 3279131
13034C279131N83421K23438j23265p628M4182q7179j97560k39732L13703J4703
$$ 3279131 3862552 4085990 3962725 3955097 3999279 3912100 3714540 3474808 3788511 3803214
13024C803214J39982L33699K12370K84163m4628m15307n1428Q9006k26861k09447
$$ 3803214 3943196 4276895 4489265 4773428 4728800 4313493 4262065 4351071 4124210 3914763
13014C914763J55787O63739K54827J13024m39791m34380p1361Q9047K45522J74251
$$ 3914763 4070550 4734289 4989116 5102140 4662349 4227969 4156608 4245655 4491177 4665428
13004D665428J5083J15359j53053r9992K50524O11684p3774l54039j49909n1751
$$ 4665428 4680511 4795870 4642817 4542825 4793349 5405033 5331259 4977220 4827311 4775560
12994D775560J92884M68052L87584j09301j34870J27594J83592M62948O4300j10851
$$ 4775560 4968444 5436496 5824080 5714779 5579909 5707503 5891095 6354043 6418343 6307492
12984F307492K72340J97950j94499q8906L20069K6562K83629M47366L3364k67826
$$ 6307492 6579832 6777782 6583283 6494377 6814446 6841008 7124637 7572003 7605367 7337541
12974G337541r5644J2181o74553k4265L08878L76402J32728K26085J97152p7369
$$ 7337541 7241897 7254078 6579525 6555260 6864138 7240540 7373268 7599353 7796505 7719136
12964G719136K17214k7510l43530K03260j01394K60218M70355L43296J6181j33510
$$ 7719136 7936350 7908840 7565310 7768570 7667176 7927394 8397749 8741045 8757226 8623716
12954H623716O53236N03359M7827L98296K27471M48372N62471j83812n3914M52009
$$ 8623716 9276952 9780311 9828138 10226434 10453905 10902277 11464748 11280936 11227022 11679031
12944A1679031K75702M57290P88204P01725L08225L07357M12322O13865N42058
$$ 11679031 11954733 12412023 13200227 13901952 14210177 14517534 14929856 15543721 16085779
12935A6085779J047617R57991N75736M16539M85869N31220M71977Q48404R77382
$$ 16085779 17133396 18091387 18667123 19083662 19569531 20100751 20572728 21421132 22398514
12926B2398514P01699J222886J058091J171883J097488Q19504J537857J815106
$$ 22398514 23100213 24323099 25381190 26553073 27650561 28470065 30007922 31823028
12918C1823028J201514J321805J586881J961108J616220J600845J273441J747655
$$ 31823028 33024542 34346347 35933228 37894336 39510556 41111401 42384842 44132497
12910D4132497K029458J621337J676938J743987K206410J916611J919281K192444
$$ 44132497 46161955 47783292 49460230 51204217 53410627 55327238 57246519 59438963
12902E9438963J386172J723519K112434J894640J433613J386413Q12250O06163
$$ 59438963 60825135 62548654 64661088 66555728 67989341 69375754 70188004 70794167
12894G0794167J309651J441317J139093J304318R15342J042560O18731N70133
$$ 70794167 72103818 73545135 74684228 75988546 76903888 77946448 78565179 79135312
12886G9135312J263456J730167J260876R48115J110567P29561K55503O59690M53724
$$ 79135312 80398768 82128935 83389811 84337926 85448493 86178054 86433557 87093247 87546971
12877H7546971L08284Q32468M70731l92841k59645k69191n13740k04463m67761
$$ 87546971 87855255 88687723 89158454 88765613 88505968 88236777 87723037 87518574 87050813
12868H7050813q23377r59139r49122j104579j093880r37885r15938n09322j071833
$$ 87050813 86227436 85268297 84319175 83214596 82120716 81182831 80266893 79757571 78685738
12859G8685738j132607m34566k48252l98047l04843J3981l369k54196m5058m25169
$$ 78685738 77553131 77118565 76870313 76472266 76167423 76181404 76178035 75923839 75878781 75453612
12849G5453612K50522M72586L88901M57499N73284R72179J134066R68105J479147
$$ 75453612 75704134 76176720 76565621 77023120 77596404 78568583 79702649 80670754 82149901
12840H2149901J633038K203947K561882K665998L460059L266396L602915L505375
$$ 82149901 83782939 85986886 88548768 91214766 94674825 97941221 101544136 105049511
12832A05049511L891995M174639M244522M303704M143534M998929M685906N002600
$$ 105049511 108941506 113116145 117360667 121664371 125807905 130806834 135492740 140495340
12824A40495340M866777M293579M350181M068933L850640L514117L735860L509100
$$ 140495340 145362117 149655696 154005877 158074810 161925450 165439567 169175427 172684527
12816A72684527L282101L066602K536176K377518J940861K162453K628447K392272
$$ 172684527 175966628 179033230 181569406 183946924 185887785 188050238 190678685 193070957
12808A93070957K331618J850429J281317J475187J033304N12005r5916Q7330k51824
$$ 193070957 195402575 197253004 198534321 200009508 201042812 201554817 201458901 201546231 201294407
12799B01294407o81256o23648p61796j524260j509647j745355j706180l096811
$$ 201294407 200613151 199989503 199227707 197703447 196193800 194448445 192742265 189645454
12791A89645454l251131l089037l023470l031735l584355l651594l858852m298568
$$ 189645454 186394323 183305286 180281816 177250081 173665726 170014132 166155280 161856712
12783A61856712m197186m173714m360143m296191l353180l616682l504037l911741
$$ 161856712 157659526 153485812 149125669 144829478 141476298 137859616 134355579 130443838
12775A30443838l788742l115616l746280l140979k890852k962582l263149k664433
$$ 130443838 126655096 123539480 119793200 116652221 113761369 110798787 107535638 104871205
12767A04871205j986378k278441k585966l221543k257295k081261k272785k511225
$$ 104871205 102884827 100606386 98020420 94798877 92541582 90460321 88187536 85676311
12759H5676311k062016j845401j701321j323766j306203k041619k352730j732849
$$ 85676311 83614295 81768894 80067573 78743807 77437604 75395985 73043255 71310406
12751G1310406j137018j222207j215889j257499j501798p18145p38153j033848
$$ 71310406 70173388 68951181 67735292 66477793 64975995 64257850 63519697 62485849
12743F2485849j247140p48608j070703j061987j083069o01906k45601p57916m91429
$$ 62485849 61238709 60490101 59419398 58357411 57274342 56672436 56426835 55668919 55177490
12734E5177490m68975n73710k12963k26771o3438L99126O80162K94423N30916
$$ 55177490 54708515 54134805 53921842 53695071 53631633 54030759 54710921 55005344 55536260
12725E5536260O03482O45454P06478M79905J013688J356247J852989J929421J593841
$$ 55536260 56139742 56785196 57491674 57971579 58985267 60341514 62194503 64123924 65717765
12716F5717765J624146J927460K141452K236432K431651K911507K793922K755386
$$ 65717765 67341911 69269371 71410823 73647255 76078906 78990413 81784335 84539721
12708H4539721L205220L485304K883221K593824L232988L811531L095923K532392
$$ 84539721 87744941 91230245 94113466 96707290 99940278 103751809 106847732 109380124
12700A09380124K532590J963350J955865J775774J681282R53176J452812J009757
$$ 109380124 111912714 113876064 115831929 117607703 119288985 120242161 121694973 122704730
12692A22704730M40473N24562K28709N5770m56080m40028k13594o15081j028392
$$ 122704730 123145203 123669765 123898474 123954244 123498164 123058136 122844542 122229461 121201069
12683A21201069j415623j395279j155665j215233j693948k207660j910529j511233
$$ 121201069 119785446 118390167 117234502 116019269 114325321 112117661 110207132 108695899
12675A08695899j576115j261200j686090j469759j338049j073282j440162j183522
$$ 108695899 107119784 105858584 104172494 102702735 101364686 100291404 98851242 97667720
12667I7667720q79399j288674j011480p09081k94690n53390m09562r10192l07269
$$ 97667720 96788321 95499647 94488167 93779086 93484396 92931006 92521444 91611252 91303983
12658I1303983j54987j04445K94647N32796O93858N73258P43914P84193Q14203
$$ 91303983 91148996 91044551 91339198 91871994 92565852 93139110 93883024 94667217 95481420
12649I5481420J147132J263192J374833J562800J905949K384418K690575K125247
$$ 95481420 96628552 97891744 99266577 100829377 102735326 105119744 107810319 109935566
12641A09935566K317915K797385K335040K708422L259893L345089L881939L388221
$$ 109935566 112253481 115050866 117385906 120094328 123354221 126699310 130581249 133969470
12633A33969470K978270K553959K893078K484977K515953K338616J819580J576649
$$ 133969470 136947740 139501699 142394777 144879754 147395707 149734323 151553903 153130552
12625A53130552J327996J556313J820170J569233Q90679M78703J026509O58927
$$ 153130552 154458548 156014861 157835031 159404264 160294943 160773646 161800155 162459082
12617A62459082M46225j10796k82139q54786j058073r91144j483561j907137k407867
$$ 162459082 162905307 162794511 162512372 161657586 160599513 159608369 158124808 156217671 153809804
12608A53809804k668614k957963k690313k837028l276269k967425l403173l213916
$$ 153809804 151141190 148183227 145492914 142655886 139379617 136412192 133009019 129795103
12600A29795103l144449m094411l901550l263180k803452k787274l181426k820548
$$ 129795103 126650654 122556243 118654693 115391513 112588061 109800787 106619361 103798813
12592A03798813k596433k914177l038892k395711k013149k166705k268501j855743
$$ 103798813 101202380 98288203 95249311 92853600 90840451 88673746 86405245 84549502
12584H4549502j752445j414968j346183k013157k143974j798433j776863r67154
$$ 84549502 82797057 81382089 80035906 78022749 75878775 74080342 72303479 71336325
12576G1336325p80239p69288r07286o16663o99193p67373p53830n38930n48661
$$ 71336325 70556086 69786798 68879512 68262849 67563656 66796283 66042453 65503523 64954862
12567F4954862J16742J78675m92275j96448L15306K61195R25668O72958K69312
$$ 64954862 65071604 65250279 64758004 64561556 64876862 65138057 66063725 66736683 67005995
12558F7005995O59704R59760N76499M13050K21268J014417Q60012N49729M93644
$$ 67005995 67665699 68625459 69201958 69615008 69836276 70850693 71710705 72260434 72754078
12549G2754078K75723K11227J77786l83139r11662j012552p54676k68458k59598
$$ 72754078 73029801 73241028 73418814 73035675 72124013 71111461 70356785 70088327 69828729
12540F9828729p37033o67239j038945o63527p40139j154610q58579m26835q68554
$$ 69828729 69091696 68424457 67385512 66721985 65981846 64827236 63968657 63541822 62673268
12531F2673268j594181j435054j339390j711828j415060j002930j312246j064585
$$ 62673268 61079087 59644033 58304643 56592815 55177755 54174825 52862579 51797994
12523E1797994j091577j155021j375925j010193j169459j255723j247714j553075
$$ 51797994 50706417 49551396 48175471 47165278 45995819 44740096 43492382 41939307
12515D1939307r47127p94211j358712j593946r14844p21171r86248o94532o74929
$$ 41939307 40992180 40197969 38839257 37245311 36330467 35609296 34623048 33928516 33253587
12506C3253587l47124j242600r41822n77440n16201o81400q01690o77361p64308
$$ 33253587 32906463 31663863 30722041 30144601 29628400 28947000 28145310 27467949 26703641
12497B6703641p47789p51091o42499l85695r96032r90631o20316j20257l87463
$$ 26703641 25955852 25204761 24562262 24176567 23180535 22189904 21569588 21449331 21061868
12488B1061868K6550n4046j33830j221399r58987l54838q21950m10314k53561
$$ 21061868 21088418 21034372 20900542 19679143 18720156 18365318 17543368 17133054 16879493
12479A6879493j936m29157j78240k33222j60795j75169m39336n41940o99625r0301
$$ 16879493 16877557 16448400 16270160 16036938 15876143 15700974 15261638 14719698 14020073 13929772
12469A3929772n48952n70845p61904l79733L96392j68702L45257j98416j93010
$$ 13929772 13380820 12809975 12048071 11668338 12064730 11896028 12241285 12042869 11849859
12460A1849859L44777P2272j31838l26374l25521j57722L9749P294n07678m2121
$$ 11849859 12194636 12266908 12135070 11808696 11483175 11325453 11365202 11372496 10864818 10822697
12450A0822697m59584j022667n03954J56809J57444k71570n42224k35175J10648
$$ 10822697 10363113 9340446 8836492 8993301 9150745 8879175 8336951 8101776 8212424
12441H212424K395L47490Q4776k33330k78423m8328J37550M44341j97834l21372
$$ 8212424 8214819 8562309 8647085 8413755 8135332 8087004 8224554 8668895 8471061 8149689
12431H149689j81597l21607j69658J23453J10558Q2646L60418O3766j71294n0788
$$ 8149689 7968092 7646485 7476827 7600280 7710838 7793484 8153902 8217668 8046374 7995586
12421G995586j48692m68652M839L13585k30907M8903m35236j80260N55863J48324
$$ 7995586 7846894 7378242 7383081 7696666 7465759 7514662 7079426 6899166 7455029 7603353
12411G603353P0963L031k46135J65960J31046k11559L38606m97662m23041J39893
$$ 7603353 7674316 7677347 7431212 7597172 7728218 7516659 7855265 7357603 6934562 7074455
12401G074455L32291j7314l30550m61906M2303M45332q6856k14771j27244l896
$$ 7074455 7406746 7389432 7058882 6596976 6639279 7084611 6997755 6782984 6655740 6651844
12391F651844L87557l6307J86475J8804o5645j44283l27112k70824l559M51521
$$ 6651844 7039401 7003094 7189569 7208373 7142728 6998445 6671333 6400509 6396950 6848471
12381F848471k18135j58045k11751J22505n0423k75818K75665L94161K5620l04051
$$ 6848471 6630336 6472291 6260540 6383045 6332622 6056804 6332469 6726630 6752250 6448199
12371F448199K88165O0186R5970l87203m78129l91194M793O63810K25948n07389
$$ 6448199 6736364 6796550 6892520 6505317 6027188 5635994 5640787 6304597 6530545 6023156
12361F023156k45050J02414J52202j22233J00635N06577J91218p2275J47877j88380
$$ 6023156 5778106 5880520 6032722 5910489 6011124 6517701 6708919 6636644 6784521 6596141
12351F596141k38685O4706l28439R608M41633M93759N4746j29685L12227J72599
$$ 6596141 6357456 6422162 6093723 6103331 6544964 7038723 7093469 6963784 7276011 7448610
12341G448610N2773j80964m2463k48707o48815j64886j28149M09662M68726n29376
$$ 7448610 7501383 7320419 7277956 7029249 6380434 6215548 6087399 6497061 6965787 6436411
12331F436411m97250J70070J71315q6847m65539m78746L35737K13795M10333N20843
$$ 6436411 5939161 6109231 6280546 6193699 5728160 5249414 5585151 5798946 6209279 6730122
12321F730122K25064j08902J9688j1229p203K72145L9660j25787l52250k40037
$$ 6730122 6955186 6846284 6865972 6854743 6847540 7119685 7159345 7033558 6681308 6441271
12311F441271o78387R9600J32446r3547J11882J05974K34386L19662j23249l33390
$$ 6441271 5762884 5862484 5994930 5901383 6013265 6119239 6353625 6673287 6550038 6216648
12301F216648J51491J69076P9257J3964J64679L6089j55343l74642m57023r1973
$$ 6216648 6368139 6537215 6616472 6630436 6795115 6831204 6675861 6301219 5844196 5752223
12291E752223o5266J6183J95321M71519M47109j44302K52320M8393k93231l48737
$$ 5752223 5686957 5703140 5898461 6369980 6817089 6672787 6925107 6973500 6680269 6331532
12281F331532l7321j83633J35250N36160R0435l19595K16350K81616J76125P7247
$$ 6331532 6294211 6110578 6245828 6781988 6872423 6552828 6769178 7050794 7226919 7304166
12271G304166o74061j25670M69076M22555N4783j68933m10940q4156R7870j42131
$$ 7304166 6630105 6504435 6973511 7396066 7450849 7281916 6870976 6786820 6884690 6742559
12261F742559m26535J13516L73379M57329K89626n7634q9443k42136K8172M84637
$$ 6742559 6316024 6429540 6802919 7260248 7549874 7492240 7402797 7160661 7188833 7673470
12251G673470k01135Q7335K16107J58859P0101N2926k29932k33009P9110O21528
$$ 7673470 7472335 7559670 7775777 7934636 8004737 8057663 7827731 7594722 7673832 8295360
12241H295360O33062l3872J03484L48062L60817l54910p04583k82193j94646j27517
$$ 8295360 8928422 8894550 8998034 9346096 9706913 9352003 8647420 8365227 8170581 8043064
12231H043064p6284L14856k46466j49784K39399L71029J24508N6627j75249N3492
$$ 8043064 7966780 8281636 8035170 7885386 8124785 8495814 8620322 8676949 8501700 8555192
12221H555192N9840P465p8567l4933l9845L75860J48064j59456O8873L62342K08121
$$ 8555192 8615032 8622497 8543930 8508997 8469152 8845012 8993076 8833620 8902493 9264835 9472956
12210I472956J79952j28450K2715N64971q0385l03594k43137r5591K87545L20780
$$ 9472956 9652908 9524458 9547173 10112144 10031759 9728165 9485028 9389437 9676982 9997762
12200I997762N67954j20469o50088K41718M25913K39855j47837R5181L89252K22809
$$ 9997762 10565716 10445247 9795159 10036877 10462790 10702645 10554808 10649989 11039241 11262050
12190A1262050k79094J16364k19295j091940k34701K27264L69319O52771J83236
$$ 11262050 10982956 11099320 10880025 9788085 9553384 9780648 10149967 10802738 10985974
12181A0985974K75237P8755Q3871m9814L26299J75323n84367n75296K49298N38808
$$ 10985974 11261211 11339966 11423837 11374023 11700322 11875645 11291278 10715982 10965280 11504088
12171A1504088L62130M81181k9304m09533K63465J14204o7271K30139K46842P4088
$$ 11504088 11866218 12347399 12318095 11908562 12172027 12286231 12218960 12449099 12695941 12770029
12161A2770029J59068j07778O4724K52610R7809q3960K37295M97805L61391L14890
$$ 12770029 12929097 12821319 12886043 13138653 13236462 13152502 13389797 13887602 14248993 14563883
12151A4563883m9418m29328m26088l3177M10771j15423M06640K23061J62468j02784
$$ 14563883 14514465 14085137 13659049 13625872 14036643 13921220 14327860 14550921 14713389 14610605
12141A4610605Q4013L82603J62478J40340M06776o5829j09068M65895O85663J00052
$$ 14610605 14694618 15077221 15239699 15380039 15786815 15720986 15611918 16077813 16763476 16863528
12131A6863528J88612J42966m99849k22099N06601N15975J5049J56861r0084O23001
$$ 16863528 17052140 17195106 16695257 16473158 16979759 17495734 17510783 17667644 17577560 18200561
12121A8200561N20382J18613J27033J32830K95080P00718M63067M61230J14070
$$ 18200561 18720943 18839556 18966589 19099419 19394499 20095217 20558284 21019514 21133584
12112B1133584l06341Q1963M07556K42078K67606J95914K31940K65380J60627
$$ 21133584 20827243 20909206 21316762 21558840 21826446 22022360 22254300 22519680 22680307
12103B2680307P54828N55686M38198L59709J13088j09353N34218P05893O78792
$$ 22680307 23435135 23990821 24429019 24788728 24901816 24792463 25326681 26032574 26711366
12094B6711366J087738N20803R5993K73211M50400M28784J45738K26843j32620
$$ 26711366 27799104 28319907 28415900 28689111 29139511 29568295 29714033 29940876 29808256
12085B9808256Q58044P59410J98098N98943J001669M43304N79286L41909K13828
$$ 29808256 30666300 31425710 31623808 32222751 33224420 33667724 34247010 34588919 34802747
12076C4802747M60076O18971N36858N22095O59102Q39230N08317J038031J489896
$$ 34802747 35262823 35881794 36418652 36940747 37599849 38439079 38947396 39985427 41475323
12067D1475323M84142L14652O42040R15481J028733J132676Q36557L90166O70326
$$ 41475323 41959465 42274117 42916157 43831638 44860371 45993047 46829604 47219770 47890096
12058D7890096R92744M06044N56675J375715J682457J039672J201073J322912
$$ 47890096 48882840 49288884 49845559 51221274 52903731 53943403 55144476 56467388
12050E6467388R60741J084712J592996J628540J382845O60355J184598J581558
$$ 56467388 57428129 58512841 60105837 61734377 63117222 63777577 64962175 66543733
12042F6543733J558097J636202J532374J325065J592016J825863K239169K438619
$$ 66543733 68101830 69738032 71270406 72595471 74187487 76013350 78252519 80691138
12034H0691138K212355J727946K187933J666657J561905J943146K203416L093152
$$ 80691138 82903493 84631439 86819372 88486029 90047934 91991080 94194496 97287648
12026I7287648L223079K845196K840471L060421K663767K654515L424737L071655
$$ 97287648 100510727 103355923 106196394 109256815 111920582 114575097 117999834 121071489
12018A21071489L792116L150537K983839L781099L816235M191309M378723M451121
$$ 121071489 124863605 128014142 130997981 134779080 138595315 142786624 147165347 151616468
12010A51616468L986339M393429M404701M340264N175379N448591N433710N288858
$$ 151616468 155602807 159996236 164400937 168741201 173916580 179365171 184798881 190087739
12002A90087739N216899N157353N740615O006216N803979N538154N424237N795649
$$ 190087739 195304638 200461991 206202606 212208822 218012801 223550955 228975192 234770841
11994B34770841N622551N352535N567612N782868N199354N085062M781098M391081
$$ 234770841 240393392 245745927 251313539 257096407 262295761 267380823 272161921 276553002
11986B76553002M132803M169719M070551K977511K593444K720168J878867J532653
$$ 276553002 280685805 284855524 288926075 291903586 294497030 297217198 299096065 300628718
11978C00628718R44307O82061L74993J623j8033m31015j127570j847216k206459
$$ 300628718 301573025 302255086 302630079 302631702 302613669 302182654 301055084 299207868 297001409
11969B97001409k062523j728225k359636l251752l567250l319904l279180l607216
$$ 297001409 294938886 293210661 290851025 287599273 284032023 280712119 277432939 273825723
11961B73825723l528930l558098l801868m096866l929149m105382m331058m047696
$$ 273825723 270296793 266738695 262936827 258839961 254910812 250805430 246474372 242426676
11953B42426676m676270m466662m051844m070685l674635l635676m203647m168911
$$ 242426676 237750406 233283744 229231900 225161215 221486580 217850904 213647257 209478346
11945B09478346m134443m231849l822286l428161l759542m514572m023274l755210
$$ 209478346 205343903 201112054 197289768 193861607 190102065 185587493 181564219 177809009
11937A77809009l493098l735016l372034l374659l526039l300919l589378l704771
$$ 177809009 174315911 170580895 167208861 163834202 160308163 157007244 153417866 149713095
11929A49713095l207987k956359l160352k619082k665439l535513l006086k347086
$$ 149713095 146505108 143548749 140388397 137769315 135103876 131568363 128562277 126215191
11921A26215191k761897k732975k499454k083187k153975k912571k414041k637051
$$ 126215191 123453294 120720319 118220865 116137678 113983703 111071132 108657091 106020040
11913A06020040k438698k554139k244860k282025j691184j726591k004425k140137
$$ 106020040 103581342 101027203 98782343 96500318 94809134 93082543 91078118 88937981
11905H8937981k061062j510269j386784j449782k221518j675607j461015j670643
$$ 88937981 86876919 85366650 83979866 82530084 80308566 78632959 77171944 75501301
11897G5501301j762608j380127j748361j607424j403942r60226q53753j046155
$$ 75501301 73738693 72358566 70610205 69002781 67598839 66638613 65784860 64738705
11889F4738705j011536j179201j368376q03757p89423j050371j304684j069202
$$ 64738705 63727169 62547968 61179592 60375835 59586412 58536041 57231357 56162155
11881E6162155q52213n99898j436699j391629p17119n88971q83407j333813j59007
$$ 56162155 55309942 54710044 53273345 51881716 51164597 50575626 49692219 48358406 48199399
11872D8199399k79302j164134o42028l12285o24116j75026p06454k85909l19144
$$ 48199399 47920097 46755963 46113935 45801650 45177534 45002508 44296054 44010145 43691001
11863D3691001p04108j025340l14683m96613o80474k05434l68710q36245o59125
$$ 43691001 42986893 41961553 41646870 41150257 40469783 40264349 39895639 39059394 38400269
11854C8400269o34993q2925k97557l53051p778l54375o75266q03061l73162m38829
$$ 38400269 37765276 37682351 37384794 37031743 37023965 36669590 35994324 35191263 34818101 34379272
11844C4379272r8266l08983k84636L5847l19309m15317k83603k29404Q808J65748
$$ 34379272 34281006 33972023 33687387 33723234 33403925 32988608 32705005 32475601 32484409 32650157
11834C2650157N8940j41212m85555l52290k70155j24967l12059K44986l8922j92961
$$ 32650157 32709097 32567885 32082330 31730040 31459885 31334918 31022859 31267845 31228923 31035962
11824C1035962j60306l39869K07757m93247l85326J14992J37669J10458K28360
$$ 31035962 30875656 30535787 30743544 30250297 29864971 29979963 30117632 30228090 30456450
11815C0456450p3586j14761m09944m16960K14053K20230K23424J58835K36979
$$ 30456450 30382864 30268103 29858159 29441199 29655252 29875482 30098906 30257741 30494720
11806C0494720k36060j9542M49646L0547J67311N87389L23292L59319j89316j37394
$$ 30494720 30258660 30239118 30688764 30719311 30886622 31474011 31797303 32156622 31967306 31829912
11796C1829912N34979J178103Q48117L71007K19878O56824O96365N46445P23981
$$ 31829912 32364891 33542994 34391111 34762118 34981996 35638820 36335185 36881630 37605611
11787C7605611M96278P89513P79698R25697R84099N68293K63692P98851J200596
$$ 37605611 38101889 38891402 39671100 40596797 41580896 42149189 42412881 43211732 44412328
11778D4412328J159040R69780J306476J491210R26696R79617J146258J599871
$$ 44412328 45571368 46541148 47847624 49338834 50265530 51245147 52391405 53991276
11770E3991276J210506J446472J268215J132788J434558J512754Q77081J383829
$$ 53991276 55201782 56648254 57916469 59049257 60483815 61996569 62873650 64257479
11762F4257479J526169J465920J694711J644696J037545J498177J657953J147903
$$ 64257479 65783648 67249568 68944279 70588975 71626520 73124697 74782650 75930553
11754G5930553J151893J359572N30149J223911J049146J369834J410410N83320
$$ 75930553 77082446 78442018 78972167 80196078 81245224 82615058 84025468 84608788
11746H4608788M41503K66377P06135P50570K92936J50912M9772K15677J91430
$$ 84608788 85050291 85316668 86022803 86773373 87066309 87217221 87266993 87482670 87674100
11737H7674100J82075Q34135J94916R2098n08645o86003l28348j28889j68940
$$ 87674100 87856175 88690310 88885226 88977324 88468679 87782676 87454328 87325439 87156499
11728H7156499L82428k29966k28356n14279m73939m41229k1105n39766j55644
$$ 87156499 87538927 87308961 87080605 86566326 86092387 85651158 85630053 85090287 84934643
11719H4934643K99581m32342j46953J2154Q66600K45425P64996R84375Q58777
$$ 84934643 85234224 84801882 84654929 84667083 85533683 85779108 86544104 87528479 88387256
11710H8387256K63829m6442J130870R51081J337824J412527J160370J343928J370176
$$ 88387256 88651085 88604643 89735513 90686594 92024418 93436945 94597315 95941243 97311419
11701I7311419J979568K305572K568100K522306K354456K494268K783924K616351
$$ 97311419 99290987 101596559 104164659 106686965 109041421 111535689 114319613 116935964
11693A16935964K736002L537349L458953L972947L982660L745498M147907L884501
$$ 116935964 119671966 123209315 126668268 130641215 134623875 138369373 142517280 146401781
11685A46401781L273679L801523M639170L870901L544580L734949L742932L252061
$$ 146401781 149675460 153476983 158116153 161987054 165531634 169266583 173009515 176261576
11677A76261576L151988L386356L787667L310061K563203K600362J916297J929402
$$ 176261576 179413564 182799920 186587587 189897648 192460851 195061213 196977510 198906912
11669A98906912J716839J460385J020360J212936M27764J2956l93730l68550j48307
$$ 198906912 200623751 202084136 203104496 204317432 204745196 204758152 204364422 203995872 203847565
11660B03847565l23725q79991j346990j869098j839115j694293k514553j976189
$$ 203847565 203523840 202643849 201296859 199427761 197588646 195894353 193379800 191403611
11652A91403611j961516k389732j997329j913683k152443k575879k553500k505969
$$ 191403611 189442095 187052363 185055034 183141351 180988908 178413029 175859529 173353560
11644A73353560k303236k260819k493891k631769j994622k198045k670388k293315
$$ 173353560 171050324 168789505 166295614 163663845 161669223 159471178 156800790 154507475
11636A54507475j972550j829096j678887j794777j812463j147265j594265j653982
$$ 154507475 152534925 150705829 149026942 147232165 145419702 144272437 142678172 141024190
11628A41024190j373978j581576j619908j325864m50441j111109j261553j748213
$$ 141024190 139650212 138068636 136448728 135122864 134672423 133561314 132299761 130551548
11620A30551548j210459j222281r04470j029038j975997j865758j269449l76697
$$ 130551548 129341089 128118808 127214338 126185300 124209303 122343545 121074096 120697399
11612A20697399p66080o88319n09662p21703l81306q46488o00681l82289l74854
$$ 120697399 119931319 119243000 118733338 118011635 117630329 116783841 116183160 115800871 115426017
11603A15426017l81089r25492j226525n88885k41273j020999r64034k52580j64665
$$ 115426017 115044928 114119436 112892911 112304026 112062753 111041754 110077720 109825140 109660475
11594A09660475J70668M6018j94099k39677K63782L92569M03590J29958n5338
$$ 109660475 109831143 109877161 109683062 109443385 109707167 110099736 110503326 110633284 110577946
11585A10577946J34217J09913O02066p7551j81646M24506Q07106O57497P69581
$$ 110577946 110712163 110822076 111424142 111346591 111164945 111589451 112396557 113054054 113823635
11576A13823635P27241J149893N69075O03992Q90232O10052M94575o6638O84593
$$ 113823635 114550876 115700769 116269844 116873836 117764068 118374120 118868695 118802057 119486650
11567A19486650Q32651J146587J176257J097604J215300N3055m4251K74857Q52677
$$ 119486650 120319301 121465888 122642145 123739749 124955049 125008104 124963853 125238710 126091387
11558A26091387R04316P68557N37071M21938L68543L11627k35297k82907L04763
$$ 126091387 126995703 127764260 128301331 128723269 129091812 129403439 129168142 128885235 129189998
11549A29189998N41744n61652m71986l73353J03279j67860p24128n95157l03981
$$ 129189998 129731742 129170090 128698104 128324751 128428030 128260170 127536042 126940885 126636904
11540A26636904m92401m11806m14946m66463m42002o48897m46056l28636o68876
$$ 126636904 126144503 125732697 125317751 124851288 124409286 123760389 123314333 122985697 122316821
11531A22316821o97876p04993p16540o25944o09320n6570p36569j286116p57590
$$ 122316821 121618945 120913952 120197412 119571468 118962148 118905578 118169009 116882893 116125303
11522A16125303k30909k43851k70422l39019l54510o65702n21087n34097j81075
$$ 116125303 115894394 115650543 115380121 115041102 114686592 114020890 113499803 112965706 112784631
11513A12784631k91537n6237l36053n05543n00513l18375n6306k00811J8877j45473
$$ 112784631 112493094 112436857 112100804 111595261 111094748 110776373 110720067 110519256 110538133 110392660
11503A10392660J82265K34641K3300n26257r4029k57823j66202M8063l10696m37084
$$ 110392660 110574925 110809566 110832866 110306609 110212580 109954757 109788555 109836618 109525922 109088838
11493A09088838j026796o05984J5381m0778k48829j33001k55731K073m77735n89521
$$ 109088838 108062042 107456058 107471439 107430661 107181832 107048831 106793100 106795173 106317438 105727917
11483A05727917r44984m51639J34469p20304r12252k45229k09403j001315j000079
$$ 105727917 104782933 104331294 104465763 103745459 102833207 102587978 102378575 101377260 100377181
11474A00377181j133634j366072j620186j283030p65794r89769j299806j659024
$$ 100377181 99243547 97877475 96257289 94974259 94208465 93218696 91918890 90259866
11466I0259866j411177j305544j048558j157026j216162q15641r52862j071097
$$ 90259866 88848689 87543145 86494587 85337561 84121399 83305758 82352896 81281799
11458H1281799k008477k151550j467013j023278j146633j358906j498486j261487
$$ 81281799 79273322 77121772 75654759 74631481 73484848 72125942 70627456 69365969
11450F9365969r60014r59776m09205r91516j100149j149061r17808p62170j013045
$$ 69365969 68405955 67446179 67036974 66045458 64945309 63796248 62878440 62116270 61103225
11441F1103225j227505j297797j000265j30622o90205p10447p04690n78040n52544
$$ 61103225 59875720 58577923 57577658 57447036 56756831 56046384 55341694 54763654 54211110
11432E4211110l48569n13875n21004n73520l79998p92971q43376o29898o80474
$$ 54211110 53862541 53348666 52827662 52254142 51874144 51081173 50237797 49607899 48927425
11423D8927425k90091l74070q87771o12705p02000q72409J5589m13358o72894
$$ 48927425 48637334 48263264 47375493 46762788 46060788 45188379 45203968 44790610 44117716
11414D4117716n98758n68808m51153m04779p71884p22002j98995q20833p26129
$$ 44117716 43518958 42950150 42498997 42094218 41322334 40600332 40401337 39580504 38854375
11405C8854375l14645l96919l95003m74767q51604j156898r46784m28714O2536
$$ 38854375 38539730 38142811 37747808 37273041 36421437 35264539 34317755 33889041 33951577
11396C3951577k22355q08513q24937n88037o60710p37748m17942j010678j013000
$$ 33951577 33729222 32920709 32095772 31507735 30847025 30109277 29691335 28680657 27667657
11387B7667657k29441l58585n40859l41536j91729o15810n34522m80011r19609
$$ 27667657 27438216 27079631 26538772 26197236 26005507 25389697 24855175 24375164 23455555
11378B3455555j55068J51947p61181o78746n42188m66284l00845o60345j025675
$$ 23455555 23300487 23452434 22691253 22012507 21470319 21004035 20703190 20042845 19017170
11369A9017170j35175l29773j23642k57133n26695l42670q40117n70010k73419
$$ 19017170 18881995 18552222 18428580 18171447 17644752 17302082 16461965 15891955 15618536
11360A5618536p7398N3784J98985K43239j21813k30122l95049p32965l70593l78147
$$ 15618536 15541138 15594922 15793907 16037146 15915333 15685211 15290162 14557197 14186604 13808457
11350A3808457l43474J42931k91752m58132k39281r43852l61763J85143L88975
$$ 13808457 13464983 13607914 13316162 12858030 12618749 11674897 11313134 11498277 11887252
11341A1887252j40946n03993l31190n21579k28484J73268J78405M6801L16166
$$ 11887252 11746306 11242313 10911123 10389544 10161060 10334328 10512733 10559534 10875700
11332A0875700k04004r39305p24455n94458K47423N11266L22151k19999l31815
$$ 10875700 10671696 9732391 9007936 8413478 8660901 9172167 9494318 9274319 8942504
11323H942504p1852k68938k45333j10709n14299n19371M6881P22534N54966k49900
$$ 8942504 8870652 8601714 8356381 8245672 7731373 7212002 7258883 7981417 8536383 8286483
11313H286483k37662k4678L01601n42320l80744k55128k16816J42328N9704J16313
$$ 8286483 8048821 8024143 8325744 7783424 7402680 7147552 6930736 7073064 7132768 7249081
11303G249081L46615R5977j95524l93727m45404m669K1353m38611J60567O2293
$$ 7249081 7595696 7691673 7496149 7102422 6657018 6652349 6673702 6235091 6395658 6457951
11293F457951m4540K44951K59445J16080k99150m7716m72471j4455j1545l8747
$$ 6457951 6413411 6658362 6917807 7033887 6734737 6687021 6214550 6200095 6188550 6149803
11283F149803R6429J14059j80737m49131k3743j0209L6437K40197q8868l15520
$$ 6149803 6246232 6360291 6179554 5730423 5706680 5696471 5732908 5973105 5884237 5568717
11273E568717p9144m02279k4774J60970K5965n4683k49377J61020r5603M3109
$$ 5568717 5489573 5087294 5062520 5223490 5249455 5194772 4945395 5106415 5010812 5053921
11263E053921L64715Q2443l67322K08156R7541m12433K37693N8662j00896j41180
$$ 5053921 5418636 5501079 5133757 5341913 5439454 5027021 5264714 5323376 5222480 5081300
11253E081300J93437o3224j9652L53079l92925k64673K88641r0028M6808l21438
$$ 5081300 5274737 5211513 5191861 5544940 5152015 4887342 5175983 5085955 5132763 4811325
11243D811325r5056J50171r6932j86974k49120K30865K83227J11819j19653o18267
$$ 4811325 4716269 4866440 4769508 4582534 4333414 4564279 4847506 4959325 4839672 4221405
11233D221405J07815k16613J9850n1078l59383K40342J64144K90344O6333K41058
$$ 4221405 4329220 4112607 4132457 4081379 3721996 3962338 4126482 4416826 4483159 4724217
11223D724217k18586l34482j42909L09608L21068j90372J24195J25744O25408
$$ 4724217 4505631 4171149 4028240 4337848 4658916 4468544 4592739 4718483 5343891
11214E343891K49718j26157o14298m21862N6713K09284L7030k39155m2660n0181
$$ 5343891 5593609 5467452 4853154 4431292 4488005 4697289 4734319 4495164 4452504 4402323
11204D402323J04170k29521n3248j69511j46961L4791m96903l15527q9419J83435
$$ 4402323 4506493 4276972 4223724 4054213 3907252 3942043 3445140 3129613 3040194 3223629
11194C223629P38404M1313J71573J5812j43878j12902K70148J03408p9583L57081
$$ 3223629 3962033 4003346 4174919 4190731 4046853 3933951 4204099 4307507 4227924 4585005
11184D585005j95817K9737K19096J85776j29474l94521n69136o02892l68508K03354
$$ 4585005 4389188 4418925 4638021 4823797 4694323 4299802 3730666 3127774 2759266 2962620
11174B962620N58855L94979k75574o26994j98803K38743J2451j01011K1796L22401
$$ 2962620 3521475 3916454 3640880 3013886 2815083 3053826 3066277 2965266 2987062 3309463
11164C309463Q2837R8203J47887M11534J9004k76220n04045l28992L59630K28092
$$ 3309463 3392300 3490503 3638390 4049924 4068928 3792708 3288663 2959671 3319301 3547393
11154C547393k56444m66383l380N56995l48952m20118r0602K58149K41244r5691
$$ 3547393 3290949 2824566 2821186 3378181 3029229 2609111 2518509 2776658 3017902 2922211
11144B922211K17623K41839p14689k8268P06056K56665P781m97563j97434J06898
$$ 2922211 3139834 3381673 2666984 2638716 3344772 3601437 3609218 3111655 2914221 3021119
11134C021119j81688l78619N10021J72060j88553J93502l03398j87273Q8610n2222
$$ 3021119 2839431 2460812 2970833 3142893 2954340 3147842 2844444 2657171 2745781 2693559
11124B693559k18389M0088K67032J64077J7494k65720M45551M25954m44665l83525
$$ 2693559 2475170 2515258 2782290 2946367 2963861 2698141 3143692 3569646 3124981 2741456
11114B741456n3325M72634K15464o16935J12969q9421j22363p7423M7081J75328
$$ 2741456 2688131 3160765 3376229 2759294 2872263 2782842 2660479 2583056 2630137 2805465
11104B805465j12193J76094j62318J14361j17951N541K13801r5861l6148K6681
$$ 2805465 2693272 2869366 2707048 2821409 2703458 2708999 2922800 2826939 2790791 2817472
11094B817472K28946Q9942R1454k16693j00794n93262n15799j44268N07423M87035
$$ 2817472 3046418 3136360 3227814 3011121 2910327 2317065 1801266 1656998 2164421 2651456
11084B651456N2357M72548J35116k65607k51308k04673k13689J4535Q2634j20809
$$ 2651456 2703813 3176361 3311477 3045870 2794562 2589889 2376200 2390735 2473369 2352560
11074B352560j91533J17028J00957j10266K31595l16538J3683M7327J02477O7675
$$ 2352560 2161027 2278055 2379012 2268746 2500341 2183803 2197486 2244813 2347290 2414965
11064B414965o944r8423j7263K30844J97115L14835n03846m45311R1263k9852
$$ 2414965 2408021 2309598 2292335 2523179 2720294 3035129 2531283 2085972 2177235 2147383
11054B147383k05233o3177j19669l24100L75997J69685K89149J57992N05451J89742
$$ 2147383 1942150 1878973 1759304 1435204 1811201 1980886 2270035 2428027 2933478 3123220
11044C123220M6669m4767j40554j9490K42681j7925l21933J98567O08158l9738
$$ 3123220 3169889 3125122 2984568 2965078 3207759 3189834 2867901 3066468 3674626 3634888
11034C634888j789J05483N79829L10560j10591j20434J50260J9510m9354j48868
$$ 3634888 3633099 3738582 4318411 4628971 4518380 4397946 4548206 4567716 4518362 4369494
11024D369494m59220K53667K48140j18116j54471L30358O00822q03837p45242
$$ 4369494 3910274 4163941 4412081 4293965 4139494 4469852 5070674 4266837 3521595
11015C521595J67549Q2968M73459J82220N8421p4698O3428M29418j24169m10424
$$ 3521595 3689144 3772112 4245571 4427791 4486212 4411514 4474942 4904360 4780191 4369767
11005D369767n11705R7055K73248j26816J64070K82167j47520k23666l99243m02521
$$ 4369767 3858062 3955117 4228365 4101549 4265619 4547786 4400266 4176600 3777357 3374836
10995C374836k01774J96343k59271l95690k78101J33879K7443J94525L69722O3001
$$ 3374836 3173062 3369405 3110134 2714444 2436343 2570222 2597665 2792190 3161912 3224913
10985C224913k02154j28713k2266k22607k15102p7651L66385L18599m33807n2039
$$ 3224913 3022759 2894046 2871780 2649173 2434071 2356420 2722805 3041404 2607597 2555558
10975B555558N10626J81846n06989k11236J92037j64554O1431Q6090L5693j56954
$$ 2555558 3066184 3248030 2741041 2529805 2721842 2557288 2618719 2704809 2740502 2583548
10965B583548l80586j10157m64518J8887O7261J71611O5167j52330p54033r9283
$$ 2583548 2202962 2092805 1628287 1647174 1714435 1886046 1951213 1798883 1044850 945567
10955I45567J05183L22180N00716J34833O4409k88239k69115n2717J08097j05911
$$ 945567 1050750 1372930 1873646 2008479 2072888 1784649 1515534 1462817 1570914 1465003
10945A465003q431L1302K84185J05428m6522K82623m45762k47222J71639j47301
$$ 1465003 1456572 1487874 1772059 1877487 1830965 2113588 1667826 1420604 1592243 1444942
10935A444942k45629P02311K98099k87784k97275m16513k79203K77000m8698k91254
$$ 1444942 1199313 1901624 2199723 1911939 1614664 1198151 918948 1195948 1147250 855996
10925H55996J6350M8914J36031l27223l69477j64706P22481P38136M28943p6522
$$ 855996 872346 921260 1057291 730068 360591 195885 918366 1656502 2085445 2008923
10915B008923j72804r4174j75293m72525k4880N9140J79771J61022k66438n86864
$$ 2008923 1836119 1741945 1566652 1094127 1069247 1128387 1308158 1469180 1202742 615878
10905F15878k96761L17294j1352K30648l4804k70915L1113K86505K83558J00655
$$ 615878 319117 636411 625059 855707 820903 549988 581101 867606 1151164 1251819
10895A251819R0562l05376o05606k6153K17846m6106Q4294P4749m66140l7286
$$ 1251819 1342381 1037005 431399 405246 623092 576986 661280 736029 269889 232603
10885B32603L68599N89251K07438J3205N87855M2750l68717R8124K63644K26246
$$ 232603 601202 1190453 1397891 1411096 1998951 2041701 1672984 1771108 2034752 2260998
10875B260998l11361r4016q3181l93724J70934O09154k6627n9566k72571K28344
$$ 2260998 1949637 1855621 1772440 1378716 1549650 2158804 2132177 2072611 1800040 2028384
10865B028384n3904m0038o760l51039k09274q898n5986K00397j01339L54248j22393
$$ 2028384 1974480 1934442 1927682 1576643 1367369 1358471 1302485 1502882 1401543 1755791 1633398
10854A633398o84147M2526J65759J38727L75085L67294M84468K92096l53670o51346
$$ 1633398 949251 991777 1157536 1296263 1671348 2038642 2523110 2815206 2461536 1810190
10844A810190q9461J79002M21580r515K05056K29770k79547l49883J8304j67083
$$ 1810190 1720729 1899731 2321311 2311796 2516852 2746622 2467075 2117192 2135496 1968413
10834A968413k42260J88484j08737k44752J29202K94329O60246J0678j5989j83623
$$ 1968413 1726153 1914637 1805900 1561148 1690350 1984679 2644925 2655603 2639614 2455991
10824B455991p22039j47004m64611l38672K3099L50055J89307j82056m74303J2299
$$ 2455991 1733952 1586948 1122337 783665 806764 1156819 1346126 1164070 689767 702066
10814G02066P7679J9132K19064l61875K77821J47947j13060J58081L66359l7286
$$ 702066 779745 798877 1017941 656066 933887 1081834 968774 1126855 1493214 1455928
10804A455928r1578j04520K44063m57425m89471j59463O61066J07772o3796j28218
$$ 1455928 1364350 1259830 1503893 1046468 556997 397534 1058600 1166372 1102576 974358
10794I74358L65243K77767J73090j45240l29508l02099k90628j86818o6363j08271
$$ 974358 1339601 1617368 1790458 1645218 1315710 1013611 722983 536165 469802 361531
10784C61531O3036M86230j69863M93572r192J37788J81079L7369K15013l26402
$$ 361531 424567 910797 740934 1234506 1225314 1363102 1544181 1581550 1796563 1470161
10774A470161n57997n59233P1886J87937K36605L27767k75130l05155l1748L43532
$$ 1470161 912164 352931 424817 612754 849359 1177126 901996 596841 565093 908625
10764I08625K79003L01079k93520k21973l38902n19544R4225J46364L23691J88460
$$ 908625 1187628 1488707 1195187 973214 634312 114768 208993 355357 679048 867508
10754H67508J36779l07222j17776l16914K83148L85336j3605k02486m45748K82281
$$ 867508 1004287 697065 579289 262375 545523 930859 917254 714768 269020 551301
10744E51301M83900P1778k16641L4234Q8855o9609J16276Q3611J64189l87754
$$ 551301 1035201 1106979 890338 924572 1013427 943818 1060094 1143705 1307894 920140
10734I20140l79641j0610K23657J51624q2184J78570J84840L41298j53632l95631
$$ 920140 540499 529889 753546 905170 822986 1001556 1186396 1527694 1374062 978431
10724I78431j64719L50182k08954l13483l19628m74209J35908J37461N50589K16631
$$ 978431 813712 1163894 954940 641457 321829 -152380 -16472 120989 671578 888209
10714H88209J11815L04493M53093l91360J09519O432l98636L07452K17327j33457
$$ 888209 1000024 1304517 1757610 1366250 1475769 1482201 1083565 1391017 1608344 1474887
10704A474887L28560K54475J32585l49026j38763M18887M84595R4221n8263k02624
$$ 1474887 1803447 2057922 2190507 1841481 1702718 2121605 2606200 2700421 2642158 2439534
10694B439534M16088M61768L13863l38318K63845M21081m83377k02409K27945
$$ 2439534 2855622 3317390 3631253 3292935 3556780 3977861 3494484 3292075 3520020
10685C520020n5579j57744N2367M68930M10045k27168r9319Q8522o2361K8969
$$ 3520020 3464441 3306697 3359064 3827994 4238039 4010871 3911552 4000074 3937713 3966682
10675C966682K33060K09901P23324N68955J22217K3584K73363K1415O4803j85002
$$ 3966682 4199742 4409643 5132967 5701922 5824139 5847723 6121086 6142501 6207304 6022302
10665F022302k0649K72454L52756L62383L57241M42241L56628l45369K12073N70703
$$ 6022302 6001653 6274107 6626863 6989246 7346487 7788728 8145356 7799987 8012060 8582763
10655H582763j42862p6809K7021P0813N6390P9339K6757l11559L98609L08271
$$ 8582763 8439901 8363092 8390113 8460926 8517316 8596655 8623412 8311853 8710462 9018733
10645I018733j6303K33685J38485M50110Q03520M85072L60222k99452K18544R07431
$$ 9018733 9002430 9236115 9374600 9824710 10628230 11113302 11473524 11174072 11392616 12300047
10635A2300047J058866N58427J077030J134793Q53341R56288J238232J636842
$$ 12300047 13358913 13917340 14994370 16129163 16982504 17938792 19177024 20813866
10627B0813866K140156K943838L652927M162389N812904P482910R837919J2588268
$$ 20813866 22954022 25897860 29550787 33713176 39526080 47008990 56846909 69435177
10619F9435177J5051662J7938558J9306494J8019042J4166016Q446359L234078
$$ 69435177 84486839 102425397 121731891 139750933 153916949 162363308 165597386
10612A65597386O95678J982822N875862J1101163J9249084K7648556L3548161
$$ 165597386 166293064 168275886 174151748 185252911 204501995 232150551 265698712
10605B65698712L6414352L1866259J9670023M733561p161282j2257396r414038
$$ 265698712 302113064 333979323 353649346 358382907 351221625 338964229 329550191
10598C29550191j633739Q673429K0504165L2290368M1597632M2695669L2647589
$$ 329550191 327916452 336589881 357094046 389384414 430982046 473677715 506325304
10591E06325304J2658639j0722950k7723496l3549958l0018835k1160362r909688
$$ 506325304 518983943 508260993 480537497 446987539 416968704 395808342 385898654
10584C85898654J514685J1380841J7962125J7882489R966979l580946j8464929
$$ 385898654 387413339 398794180 416756305 434638794 444605773 441024827 422559898
10577D22559898k8526813l0793944k7216031k0755215j3288308p489807k192243
$$ 422559898 394033085 363239141 336023110 315267895 301979587 294489780 292297537
10570B92297537J69558j81398l154952q747823j4777044j8335500j8697947j7285089
$$ 292297537 292467095 292285697 289130745 280382922 265605878 247270378 228572431 211287342
10562B11287342j5430350j2673860j0102924q789982p935122o793309n879047
$$ 211287342 195856992 183183132 173080208 164290226 156355104 149561795 143682748
10555A43682748n316177n402191m948481m514100m535026m539406l939073l829827
$$ 143682748 138366571 132964380 128015899 123501799 118966773 114427367 110488294 106658467
10547A06658467l631018l964834m130244l302527l713892l732238l502000l394679
$$ 106658467 103027449 99062615 94932371 91629844 87915952 84183714 80681714 77287035
10539G7287035l250113l387213k813951k997801k884923k791307k669543k949440
$$ 77287035 74036922 70649709 67835758 64837957 61953034 59161727 56492184 53542744
10531E3542744l030677k261598k317895k136052k479798j843393j971098k390091
$$ 53542744 50512067 48250469 45932574 43796522 41316724 39473331 37502233 35112142
10523C5112142j709338j896380j527025j137591j536229j290739j664411j330456
$$ 35112142 33402804 31506424 29979399 28841808 27305579 26014840 24350429 23019973
10515B3019973r45532j113392r16835j403526j495645j040783k03124o73836q95506
$$ 23019973 22074441 20961049 20044214 18640688 17145043 16104260 15901136 15227300 14331794
10506A4331794p27718m93007m47736q95190n57900o69813p85038n10841m41056
$$ 14331794 13604076 13111069 12663333 11768143 11210243 10540430 9755392 9244551 8803495
10497H803495K2004j11960o80157l94701m20269l27927j13978k40903k83592j02718
$$ 8803495 8825499 8713539 8033382 7638681 7218412 6890485 6776507 6535604 6252012 6149294
10487F149294m7857L91180J3069p36727r07596n29164J81902j10445j97076R2060
$$ 6149294 6101437 6492617 6505686 5768959 4861363 4332199 4514101 4403656 4206580 4298640
10477D298640J62999J3269n96383q11306K80028M13145p27717n17183J17278K8105
$$ 4298640 4461639 4474908 3878525 3067219 3347247 3760392 3032675 2515492 2632770 2660875
10467B660875K38785K40116N2169r0584K8618j59195o5414k69864m83359J30350
$$ 2660875 2899660 3139776 3191945 3101361 3129979 2970784 2905370 2635506 2152147 2282497
10457B282497M19535m0416J03766k34499K6193K08221M25160M06220l88586k70995
$$ 2282497 2702032 2661616 2765382 2530883 2557076 2765297 3190457 3596677 3208091 2937096
10447B937096K18465l44019L1896K23926j30493j69668l21686k68816P4482J039756
$$ 2937096 3155561 2811542 2843438 3067364 2936871 2767203 2445517 2176701 2251183 3290939
10437C290939R55184K02268m5490n10803m45923j33022K66525Q755N4183J02199
$$ 3290939 4246123 4448391 4402901 3892098 3446175 3313153 3579678 3588433 3642616 3744815
10427C744815M2360L2912l26762J56829j12745j67922K27829M8670o00317k55981
$$ 3744815 3787175 3820087 3493325 3650154 3537409 3369487 3597316 3645986 3045669 2789688
10417B789688M7525K81281L8190J39533J07549N7693L05455j02711o11490j68349
$$ 2789688 2837213 3118494 3156684 3296217 3403766 3461459 3766914 3664203 3052713 2884364
10407B884364N83420P22339l47588l08959k12327N76018J71095m61061p58680
$$ 2884364 3467784 4190123 3842535 3533576 3321249 3897267 4068362 3607301 2848621
10398B848621j19878J51513K46009j06095m1838L15976O37093j53565l77316m37004
$$ 2848621 2728743 2880256 3126265 3020170 2978332 3294308 3931401 3777836 3400520 2963516
10388B963516K00014l4897J93853M29911k03481K165m9718m74118l8997N06131
$$ 2963516 3163530 3128633 3322486 3752397 3548916 3551081 3501363 3027245 2988248 3494379
10378C494379L6003O6247k07618k11871j59053j49221P0460j53532Q058o7680
$$ 3494379 3530382 3596629 3389011 3177140 3018087 2868866 2939326 2785794 2793852 2726172
10368B726172m90035P3651k43212m9735O6622L67948l67292m18751j18247N39267
$$ 2726172 2236137 2309788 2066576 2016841 2083463 2451411 2084119 1665368 1547121 2086388
10358B086388K61227N1528K30208r9428j89047j12341J80956m82055n01669J34766
$$ 2086388 2347615 2399143 2629351 2529923 2340876 2228535 2409491 1927436 1425767 1560533
10348A560533N9650k5865O7691J48763k23471l45815j33815J64661p6362l3320
$$ 1560533 1620183 1594318 1662009 1810772 1587301 1241486 1107671 1272332 1195970 1162650
10338A162650K85724J72324l09857k35572K20323M25821k29606J4864P72034k37859
$$ 1162650 1448374 1620698 1310841 1075269 1295592 1721413 1491807 1506671 2278705 2040846
10328B040846o49311k21791j39680r0525j8468J66907j6510J6164K81332o37895
$$ 2040846 1391535 1169744 1030064 939539 921071 1087978 1071468 1087632 1368964 731069
10318G31069j43517K18605M4502K7089K31048l47414m79748K3140O12489K52481
$$ 731069 587552 806157 850659 877748 1108796 761382 281634 304774 917263 1169744
10308A169744L02714j10643k34992k87848j0980l45879l92479l03478K40482N1026
$$ 1169744 1472458 1361815 1126823 838975 827995 482116 89637 -213841 26641 77667
10298G7667l00717k07056j91524j15240J82499M00965N94363L23706j13728K97359
$$ 77667 -223050 -430106 -621630 -736870 -554371 -153406 440957 764663 650935 948294
10288I48294K00179J21996m806m5550L05425j92716o49889q7670J19974M59553
$$ 948294 1148473 1270469 1265663 1220113 1525538 1332822 682933 595263 715237 1174790
10278A174790K9039l07358k8372M05001j04763J51629J22383O9384l82055k69176
$$ 1174790 1203829 896471 868099 1273100 1168337 1319966 1442349 1511733 1129678 860502
10268H60502n69092n38362k42028K95433K43814P9487K18757m35163o6515J90798
$$ 860502 291410 -246952 -488980 -193547 50267 129754 348511 -86652 -153167 37631
10258C7631k7623K12635L54292M6119m7674R619J79332J97461o03008j70996J70318
$$ 37631 10008 222643 576935 623054 575380 584999 764331 961792 358784 187788 358106
10247C58106K17297J54906l7473k67602j76773j17422M47530O77634J16509k59895
$$ 358106 575403 730309 692836 425234 248461 131039 578569 1256203 1372712 1112817
10237A112817k29878j56875k135Q5507R8238j65031J74490Q1914j97594Q5754
$$ 1112817 882939 726064 723929 809436 907674 742643 917133 999047 801453 887207
10227H87207K54931j35089N6844J77818J73093O9246l83347J30878k46517j53505
$$ 887207 1142138 1007049 1063893 1241711 1414804 1484050 1100703 1231581 985064 831559
10217H31559j13151k17187M59962M74629k19877K42558m26375q14992l3666P69277
$$ 831559 718408 501221 961183 1435812 1215935 1458493 1032118 217126 183460 952737
10207I52737J69814l21850J81249j7934j59186K53028K96620k89476j46450k06074
$$ 952737 1122551 800701 981950 964016 804830 1057858 1354478 1065002 918552 712478
10197G12478l31058p4772J55956K35972p743r4769P7213O7511K19742O0722L01379
$$ 712478 381420 306648 462604 698576 690833 596064 673277 740788 960530 1021252 1322631
10186A322631L0134K14191R3895m40503l73482j92140K36196L47692p5063J71897
$$ 1322631 1352765 1566956 1660851 1220348 846866 654726 890922 1238614 1163551 1335448
10176A335448J78928L69381k30395k20985k58540M55964M54281K98343M7359j32429
$$ 1335448 1514376 1883757 1653362 1432377 1173837 1629801 2084082 2382425 2429784 2297355
10166B297355o50702L4048K24610J39875K92619R1589O086K60971j83301K05922
$$ 2297355 1646653 1680701 1905311 2045186 2337805 2429394 2435480 2696451 2513150 2719072
10156B719072L38506K9915l77753K10706m2379J80665r8423k7840R7770k77201
$$ 2719072 3057578 3087493 2709740 2920446 2878067 3058732 2960309 2932469 3030239 2753038
10146B753038k63549K86937K30560J59537n36634m06674M114m57291K33329P21561
$$ 2753038 2489489 2776426 3006986 3166523 2629889 2223215 2227329 1770038 2003367 2724928
10136B724928N17040n77036l64346l8113k74167l84213j10435K27506q2692Q9117
$$ 2724928 3241968 2664932 2300586 2262473 1988306 1604093 1493658 1721164 1638472 1727589
10126A727589J17987r8819N0234p01131l17858P19653O68432L9924N7189R8189
$$ 1727589 1845576 1746757 1796991 1095860 778002 1497655 2166087 2206011 2263200 2361389
10116B361389K48025o95404r12398l17411L79291l95691L98338M16773K19540
$$ 2361389 2609414 1914010 1001612 684201 1063492 667801 1066139 1482912 1702452
10107A702452j07536p14545n2596j76220j39847k48534J66465M22958K4423j34634
$$ 1702452 1594916 880371 827775 651555 511708 263174 429639 852597 877020 742386
10097G42386k80148N82572J6320l49856j05444K65507R5963M9171L82770J68653
$$ 742386 462238 1044810 1061130 711274 605830 871337 967300 1016471 1399241 1567894
10087A567894k50021j7246K2865J83124m25335o21101K07105J46563K8305k0126
$$ 1567894 1317873 1300627 1323492 1506616 1081281 460180 667285 813848 842153 822027
10077H22027l1803K19263j18191p56380k88292N4298J11931L05338K01325M20612
$$ 822027 790224 1009487 891296 134916 -153376 -99078 12853 318191 519516 940128
10067I40128k80330k88694j5309r2434l98863r2047M1308K83933k22777l10641
$$ 940128 659798 371104 355795 263361 -135502 -227549 -186241 97692 -125085 -435726
10057d35726J82222J81990J36933M7534k18200m9528M25069L62184J08614J89363
$$ -435726 -253504 -71514 65419 112953 -105247 -154775 270294 632478 741092 930455
10047I30455m11902l14024m36950K7907O57237M46999L10738m38464m79388m80524
$$ 930455 518553 204529 -232421 -204514 452723 899722 1210460 771996 292608 -187916
10037a87916J57409p6447j1606Q7486N78578K68010k53046k1656L7114J15552
$$ -187916 -30507 -106954 -118560 -31074 547504 815514 562468 540812 577926 693478
10027F93478k83175j82178k7032j11450O40084Q0782k76831j91905K84279K23868
$$ 693478 410303 228125 201093 89643 729727 810509 533678 341773 626052 849920
10017H49920l4274q8608J08072L82838l42206o91914k9767M20068N60482M4874
$$ 849920 815646 727038 835110 1217948 875742 183828 154061 574129 1134611 1179485
10007A179485m28371l48202m61047L70865P9648j6090K42125j28597J2578J19391
$$ 1179485 751114 402912 -58135 312730 392378 376288 618413 489816 502394 621785
9997F21785j34976o44380l78441l6654P03408O40039j06003j71171k69467J39134
$$ 621785 486809 -157571 -536012 -572666 130742 770781 664778 493607 224140 363274
9987C63274R7363L1361J6230l1243L52033Q6083k88937l46802K46931j85436J81918
$$ 363274 460637 491998 508228 476985 829018 915101 626164 279362 526293 340857 522775
9976E22775l3963K4968m19166r1808k6796O5230M96994L91566J57680k53995N2079
$$ 522775 488812 513780 94614 2806 -23990 41240 538234 929800 1087480 833485 885564
9965H85564J36637l49035l39858j46730Q3151L06318j27511J83808M0465l84315
$$ 885564 1022201 673166 333308 186578 269729 576047 448536 632344 672809 288494
9955B88494l51434m91447J90770M26483J17419O46992J65549m64330k65110L03510
$$ 288494 -62940 -554387 -363617 62866 180285 827277 992826 528496 263386 566896
9945E66896J7981r298Q2629j35820m84049J07664L31244L11945m22685l70571
$$ 566896 584877 575579 658208 522388 38339 146003 477247 789192 366507 -4064
9935d064J40050l87569p2838N12197N22035J94623m09313k17917l88395q551Q0481
$$ -4064 135986 -251583 -324421 187776 709811 904434 495121 277204 -111191 -119742 -39261
9924c9261M07073k13082j93418J83342N0977L29004j79403K26541l50247m26868
$$ -39261 367812 154730 -38688 144654 195631 524635 345232 571773 221526 -205342
9914b05342j8257L18719k3382K35309K01334L5117O8589k50390o5951K89333J05838
$$ -205342 -223599 95120 71738 307047 508381 543498 612087 361697 295746 585079 690917
9903F90917l00417m61385K73405M37779n2005n25890k41450l04401N6290M37790
$$ 690917 390500 -70885 202520 640299 588294 62404 -179046 -483447 -427157 10633
9893A0633o1003l37077J27087M45425P1215k09431L21081J11868l32792P0533
$$ 10633 -50370 -387447 -260360 185065 256280 46849 367930 479798 147006 217539
9883B17539K95293j8422l43322k76169J97042j31724m4182L42988L76055P0033
$$ 217539 512832 494410 151088 -125081 71961 -59763 -103945 239043 615098 685131
9873F85131K1172k77089k18922k2507L5547l35106K3399J42171K44274l35316
$$ 685131 706303 429214 210292 187785 223332 -111774 -88375 53796 298070 -37246
9863c7246P6729J61687O6287K58776j72813k26334P1377j96034l14556l21181
$$ -37246 39483 201170 267457 526233 353420 127086 198463 2429 -312127 -633308
9853f33308j91256L60833M3323J99295L06190L06032J10222k1483l40267r4140
$$ -633308 -824564 -463731 -420408 -221113 85077 391109 501331 479848 139581 45441
9843D5441k85776l46961M96146M40038p35471o2489L07352J25426K11815K9457
$$ 45441 -240335 -587296 -91150 348888 -386583 -449072 -141720 -16294 195521 224978
9833B24978k68274l14006j32945m32233q5568L66557Q0826M45352L2955l60415
$$ 224978 -43296 -357302 -490247 -922480 -1008048 -641491 -560665 -115313 -82358 -442773
9823d42773M76086N73495J75131K02098J16532J95070L72000l93273k76701K0219
$$ -442773 33313 606808 781939 984037 1100569 1295639 1667639 1274366 997665 1017884
9813A017884k60030l93934j10607K26778j55225l73846J68602J72040L88759K46674
$$ 1017884 757854 363920 253313 480091 324866 -48980 119622 291662 680421 927095
9803I27095J58326k33373j6756J57153J63857k57319l88719k30154J67916k83699
$$ 927095 1085421 852048 835292 992445 1156302 898983 510264 280110 448026 164327
9793A64327k83517K80979n0211m90236k05328J09489m01042J32310L49074L99038
$$ 164327 -119190 161789 111578 -378658 -583986 -474497 -875539 -743229 -394155 4883
9783D883K50922J71691P41608L51874K73088O0855P2858K80564k450j82425p3237
$$ 4883 255805 427496 1169104 1520978 1794066 1854921 1927779 2208343 2205893 2023468 1950231
9772A950231l08845j35809k04941M33624K1961M3191l29548l24757k51189J61654
$$ 1950231 1641386 1505577 1300636 1734260 1756221 1799412 1469864 1145107 893918 1055572
9762A055572l03261m89117j37249L14775J70458k42164m0254K54463K60624j45318
$$ 1055572 752311 263194 125945 440720 611178 369014 328760 583223 843847 698529
9752F98529k18848N7811Q8852j16239o0066M71600j21162l22448P5159m472N06056
$$ 698529 479681 537492 626344 510105 450039 921639 800477 478029 553188 548716 1054772
9741A054772R5616k87025k55868k58349m23633j82912M1334K24121N15693L73530
$$ 1054772 1150388 863363 607495 349146 -74487 -257399 -216065 8056 523749 897279
9731H97279n63953o11067M9030L63678j22426k62827J94678M80255M33715j35528
$$ 897279 333326 -277741 -228711 134967 12541 -250286 -55608 424647 858362 722834
9721G22834k59604j64869j56186O2286j43736m1202l9470L29530K11237O7876
$$ 722834 463230 298361 142175 204461 60725 19523 -19947 309583 520820 588696
9711E88696L0902K03031P6620J48946r3456m50751K60335L15144J03721q647l94373
$$ 588696 619598 822629 899249 1048195 954739 503988 764323 1079467 1183188 1174541 780168
9700G80168K78188k24495k41840j31781m41860j35876L77134M73283J19932j92594
$$ 780168 1058356 833861 592021 460240 18380 -117496 259638 732921 852853 660259
9690F60259j57925K15322J15596N9946m1749k39763k65961k33021j80052m97358
$$ 660259 502334 717656 833252 893198 851449 611686 345725 112704 -67348 -564706
9680e64706j49905N72319J65754l32463K61316m58j51997L55564L38248j83778
$$ -564706 -714611 -142292 23462 -309001 -47685 -48143 -200140 155424 493672 309894
9670C09894m03948P8162j57108L61756L96118M01380j23073j07919J55029Q6400
$$ 309894 -94054 -15892 -173000 188756 584874 986254 863181 755262 910291 996691
9660I96691n32373j67512J86013M08566L72705Q1207M07031J186417J085214N32968
$$ 996691 464318 296806 482819 891385 1264090 1345297 1752328 2938745 4023959 4556927
9650D556927J39749n04266o35524o38162o90556j006250L42173L37806n60749
$$ 4556927 4696676 4192410 3556886 2918724 2228168 1221918 1564091 1901897 1341148
9641A341148n35610j9465l88352K03953L20684L82377k54558j31628J87679n9170
$$ 1341148 805538 786073 397721 601674 922358 1304735 1050177 918549 1106228 1047058
9631A047058l2808K5091m98781k16302J54315N3857k39830l03662N3611k12125
$$ 1047058 1014250 1039341 540560 324258 478573 532430 292600 -11062 42549 -169576
9621a69576L06648Q8348J17418L85098j45479k44659k67908p8333O0788K17405
$$ -169576 137072 225420 342838 727936 582457 337798 69890 -8443 52345 269750
9611B69750L47663L70847m5014J72610j03376j19058n537j51069l72622k98823
$$ 269750 617413 988260 943246 1115856 1012480 893422 887885 736816 364194 65371
9601F5371j57141J7790K84246K30303j58709j72222j25288L40620J84510L6081
$$ 65371 -91770 -73980 210266 440569 281860 109638 -15650 324970 509480 545561
9591E45561l61621r8292L72095K46961o28133j5190N87423J07352j20475J28984
$$ 545561 183940 85648 457743 704704 76571 61381 648804 756156 635681 764665
9581G64665J5485P4697k37779n19714j79789r8620J61927J54845L31493k01306
$$ 764665 780150 854847 617068 97354 -82435 -181055 -19128 135717 467210 265904
9571B65904k92172k1006J13334l81566q0988J70494K63001K51138K63711J39067
$$ 265904 -26268 -47274 66060 -315506 -396494 -226000 37001 288139 551850 690917
9561F90917l03722m60888r183k3859J95570Q0883j48229K01402J06814k22939
$$ 690917 387195 -73693 -82876 -106735 88835 169718 21489 222891 329705 106766
9551A06766K32383p4641J07359J69112l7921L08630m7749l50857M19289k7028
$$ 106766 339149 264508 371867 540979 503058 811688 763939 413082 832371 805343
9541H05343k29770J99547j69354n69629j33441L94428j86819l68555Q1986K00016
$$ 805343 575573 775120 605766 36137 -97304 297124 110305 -258250 -176264 23752
9531B3752p3387L5349J30468J9797q6542L44021K77441J4194m831o04151J00107
$$ 23752 -49635 -14286 116182 135979 49437 393458 670899 685093 680262 76111 176218
9520A76218M29635J63295o74045j8841J50581M75615L12220l40156l75905M02234
$$ 176218 605853 769148 95103 76262 226843 702458 1014678 674522 298617 700851
9510G00851M9042k77254k60933l66266q0893K32951J43040l04750l85598L15713
$$ 700851 749893 472639 211706 -154560 -235453 -2502 140538 -164212 -549810 -234097
9500b34097l6550K46350J54804O82066j29073l21447m86365k20615L66688M02465
$$ -234097 -270647 -24297 130507 812573 683500 362053 -124312 -344927 21761 424226
9490D24226R4223J0361m7408k65839n41814m6835M98125O3276k91085J1037J04545
$$ 424226 518449 528810 481402 215563 -326251 -373086 125039 188315 -102770 -91733 12812
9479A2812J52084j84566K71769J0725j60650j75178r3892J68646R5747N6306k06308
$$ 12812 164896 -19670 252099 262824 102174 -73004 -166896 1750 97497 153803 -52505
9468e2505p04306K28396J67355L5734K52442l04148N13670L33111n75427j73920
$$ -52505 -756811 -528415 -361060 -325326 -72884 -377032 136638 469749 -105678 -279598
9458b79598L4742M49499N70442o8445l02896L25450K56325k44537K5339l27544
$$ -279598 -244856 204643 775085 706640 403744 729194 985519 740982 766321 438777
9448D38777q54M9229J00289q1206l67312K38741P86583o239q0858K32836p4050
$$ 438777 437923 487152 587441 506235 138923 377664 1164247 1158008 1077150 1309986 1235936
9437A235936l01965j30514k29441k44423q74008k3337K47620r0732k7136L25889
$$ 1235936 933971 803457 574016 329593 -544415 -567752 -320132 -410864 -438000 -112111
9427a12111J9341j0008M14399J06212p8668k41496j71211j37847J26032j6635
$$ -112111 -92770 -102778 311621 417833 339165 97669 -73542 -211389 -85357 -101992
9417a01992n15303J08860j24675N23826Q64023j51819q22680n0958N0819J0866
$$ -101992 -617295 -508435 -633110 -109284 754739 602920 -219760 -270718 -219899 -209033
9407b09033N77303L13257l70968l39468j6621K84345J40104j0863j36252J81817
$$ -209033 368270 681527 310559 -28909 -45530 238815 378919 368056 231804 413621
9397D13621l38202J35514j04954k34272O319J05356p3774r0023M84666k95702
$$ 413621 75419 210933 105979 -128293 -121974 -16618 -90392 -180415 304251 8549
9387H549j72367K3913K03870L43066o5743o03869K76676K80605j60206o1124L3873
$$ 8549 -163818 -139905 63965 407031 341288 -262581 14095 294700 134494 73370 107243
9376A07243M1224J48604k23523L49178J48145m08723l30403L30471K46873m8802
$$ 107243 148467 297071 73548 422726 570871 162148 -168255 162216 409089 360287
9366C60287r5688J5418R5406L31317n5840m91794l69313j20921O26959Q287j21473
$$ 360287 264599 280017 375423 706740 650900 159106 -210207 -331128 295831 304118 182645
9355A82645P4169j30048o04994r7293L80719j88324o270r7542k60599M89260L59374
$$ 182645 256814 126766 -478228 -575521 -194802 -383126 -389396 -486938 -747537 -258277 101097
9344A01097J78304k4606k52092M3824J57280M765M77885K53537k75032o6062j28559
$$ 101097 279401 254795 2703 46527 203807 208572 686457 939994 664962 598900 470341
9333D70341k90635P5731j72542k47439P0205m25065j08588L01665K20667j66714
$$ 470341 179706 255437 82895 -164544 -94339 -519404 -627992 -326327 -105660 -272374
9323b72374o4758J9870J02420K09175J90395k30686N36038j79397j21148k60308
$$ -272374 -337132 -317262 -214842 -5667 184728 -45958 490080 310683 189535 -70773
9313g0773J82839P9376Q6202l40030l37203j58927O12676m762m32411M38897R4473
$$ -70773 112066 191442 277644 -62386 -399589 -558516 54160 49398 -383013 55884 150357
9302A50357L85390o2693m98548J53651r9802j83142n4223j57959j7698M21969
$$ 150357 535747 473054 -25494 128157 28355 -154787 -209010 -366969 -384667 37302
9292C7302k37289j38452L9148O6818N76157M22271q1117k13925j448K01055k835
$$ 37302 -199987 -338439 -299291 -232473 343684 765955 684838 470913 469465 670520 667685
9281F67685j52550J0015m1944l99394k45210k10672l82853K36560L49070j11512
$$ 667685 515135 525150 483206 83812 -161398 -372070 -754923 -518363 -169293 -280805
9271b80805N7669J4797n72789R3561M91979K17502L82376l57819p56333J96714
$$ -280805 -223136 -208339 -781128 -687567 -195588 21914 404290 46471 -709862 -513148
9261e13148L76064J14731M21062K96295j30555M7542K29637l73873m97948J68275
$$ -513148 -137084 -22353 398709 695004 564449 611991 841628 467755 -30193 138082
9251A38082j2742j08887p5343p9935j13993M43535K44268j90101K00180k08761
$$ 138082 125340 16453 -58890 -138825 -252818 190717 434985 244884 445064 236303
9241B36303k9149k95119l83865J73642J77653N09812J30185R1310p2768m43852
$$ 236303 207154 -87965 -471830 -298188 -120535 389277 519462 610772 538004 94152
9231I4152l4304M42239K64069M38506L3732o56978q58357J32703O63384j55888
$$ 94152 59848 502087 766156 1204662 1238394 581416 -276941 -144238 519146 363258
9221C63258m90108O6216K91590j09643k94479l50073K8141M29159L37365l6149
$$ 363258 -126850 -60634 230956 121313 -173166 -523239 -495098 -65939 271426 235277
9211B35277j37555l52408l9157p7519L37312J28182J34470K43797j45193J05309
$$ 235277 97722 -254686 -293843 -371362 -34050 94132 228602 472399 327206 432515
9201D32515J49740k86139Q3782L15532R4833k52457j65939j56629j96827j39824
$$ 432515 582255 296116 379898 695430 790263 537806 371867 215238 18411 -121413
9191a21413K95255N6474j18327m2618K40672L47303k42779j87785j65567M941
$$ -121413 173842 230316 111989 69371 310043 657346 414567 226782 61215 66156
9181F6156J91539J67539n71802k16225J25330R4594J76686J50821K25771j70047
$$ 66156 257695 425234 -146568 -362793 -237463 -142869 33817 184638 410409 240362
9171B40362r5454k91569q1693k90899o125K75099j45842J87818P4453j72676m01356
$$ 240362 144908 -146661 -228354 -519253 -525378 -250279 -396121 -208303 -133850 -306526 -707882
9160g07882K10283N68053J81085K46283k49276L86962R2759j47083l83347n75532
$$ -707882 -497599 70454 251539 497822 248546 635508 728267 581184 197837 -377695
9150c77695J29192Q1845J82218j71696k39877j02991l64903j63192N47879J79081
$$ -377695 -248503 -166658 15560 -156136 -396013 -499004 -863907 -1027099 -479220 -300139
9140c00139k39166M5297M95956k33153n20008M29970L44690M33217J78064N0480
$$ -300139 -539305 -494008 1948 -231205 -751213 -321243 23447 456664 634728 685208
9130F85208J679O9511j22797k45324m30213p7109j85576m77900n9306j71814O5718
$$ 685208 686887 756398 633601 388277 -41936 -119045 -304621 -782521 -841827 -1013641 -947923
9119i47923M15912K02120L1017L36794m8944q8060o3680j4472p1588L95803r1706
$$ -947923 -532011 -329891 -298874 37920 -11024 -99084 -162764 -177236 -248824 146979 55273
9108E5273l05762k41485k03334M14014K93152L35337J67557o57566m14300K13425
$$ 55273 -250489 -491974 -695308 -281294 11858 347195 514752 -142814 -557114 -343689
9098c43689l9914K15758J05649l9572k27404K37158K36534K13169j45001J27255
$$ -343689 -383603 -167845 -62196 -101768 -329172 -92014 144520 357689 212688 339943
9088C39943N6727j69143n08026k166j09373j37176J01110N3561K01987k9304n6988
$$ 339943 396670 227527 -280499 -282665 -392038 -529214 -428104 -374543 -172556 -201860 -258848
9077b58848K41355K40294r6247J07027J98608J01497J98245j09903k08501k62924
$$ -258848 -17493 222801 126554 233581 432189 533686 731931 622028 413527 150603
9067A50603j79127n88778l09817M77041J06184O518K29602Q9919J56830L0877
$$ 150603 -28524 -617302 -927119 -450078 -343894 -337376 -107774 -17855 138975 169852
9057A69852j21657j19840K41807k88916N30568M17945L8782k42825Q4382j06993
$$ 169852 48195 -71645 170162 -118754 411814 829759 868541 625716 710098 603105
9047F03105M5230O9477m49625p6471j93428O7293n00290n2332j99861m8154J91580
$$ 603105 648335 717812 268187 191716 -1712 65581 -434709 -487041 -686902 -735056 -543476
9036e43476L47327L21786j19895J77847L59144l43312o89336k71973J31699O6950
$$ -543476 -196149 125637 5742 183589 542733 199421 -489915 -761888 -630189 -563239
9026e63239q8766n0736K02104K66933L86467k97173O2853j75764L48759k83178
$$ -563239 -652005 -702741 -500637 -233704 152763 -144410 -81557 -257321 91438 -191740
9016a91740m53912p568M45914M79982J98874l42055j42030J78669l50936o86191
$$ -191740 -645652 -653220 -207306 272676 471550 129495 -12535 166134 -184802 -870993
9006h70993J75091M38283N51039K7872O3707K46757L4057J12147k85442j4568
$$ -870993 -695902 -257619 293420 321292 384999 631756 665813 777960 492518 477950
8996D77950l078l17004J51564M0437j46173P7894J03950j72990J97355L14483
$$ 477950 474872 157868 309432 349869 203696 281590 385540 212550 409905 724388
8986G24388M24611j30391m04854k70179j43609j2788k8086L16046N14712j72772
$$ 724388 1148999 1018608 613754 343575 199966 187178 159092 475138 989850 817078
8976H17078m75470l96016j85312j04717J33194N73442J32857m65743p2223J49089
$$ 817078 341608 -54408 -239720 -344437 -211243 362199 495056 29313 -42910 106179
8966A06179P49262J36690l01881R3009l91739j34925k06889j48993k75143j61604
$$ 106179 855441 992131 690250 783259 391520 256595 49706 -99287 -374430 -536034
8956e36034L82656O94004r0358J06465m83555l85218r9731J48856N45256M88533
$$ -536034 -153378 540626 450268 556733 73178 -312040 -411771 -262915 282341 770874
8946G70874j77397m68111l66593p3031m39806J00523J07671k06995P0385m7197
$$ 770874 593477 125366 -241227 -314258 -754064 -653541 -545870 -752865 -682480 -729677
8936g29677m9288J23464m6590L96405O08686L96002j57224J39564m04178k52719
$$ -729677 -778965 -655501 -702091 -305686 303000 699002 541778 681342 277164 24445
8926B4445P1965j66766j20615J84469j8796j02224m40429l16788J35233O93444
$$ 24445 96410 -70356 -190971 -6502 -25298 -127522 -567951 -884739 -749506 -56062
8916e6062O24066K61795k95921o17896K62550K82679K74046L22152j3524n20842
$$ -56062 568004 829799 533878 -84018 178532 461211 735257 1057409 1043885 523043
8906E23043M7440J76608j88387J49472j66523n62038k00582k64862K74314l1843
$$ 523043 570483 747091 558704 708176 541653 -20385 -220967 -485829 -211515 -243358
8896b43358K60432O379l24902M02544O43369n35268l25703q4545J59484k08208
$$ -243358 17074 23453 -301449 101095 744464 209196 -116507 -201052 -41568 -249776
8886b49776Q3305J9971J51314M35112K36919n24194k8014M4357m08207p9972J20140
$$ -249776 -166471 -146500 4814 439926 676845 152651 124637 168994 -239213 -319185 -199045
8875a99045k18686J88659K23462J03741J44143m8546l6380J53322j71585l22158
$$ -199045 -417731 -229072 -5610 98131 242274 193728 157348 310670 139085 -183073
8865a83073M5420K21655r619K28436Q8287j28101j07078J59100q8244k60681J49528
$$ -183073 -137653 84002 74383 302819 391106 263005 155927 315027 226783 -33898 115630
8854A15630k11348r9700L9740M1761M247M00511n83658o15728L89721J20034K72408
$$ 115630 -95718 -195418 -155678 -113917 -109670 290841 -292817 -908545 -518824 -398790 -126382
8843a26382K34213M69209M51942M5954n86970n20088R6037n2415p4580j53199
$$ -126382 107831 577040 1028982 1074936 487966 -32122 63915 11500 -63080 -216279
8833b16279M13036o773m05972K12617k24842j61983J81195L95257P2658m109o6803
$$ -216279 196757 189984 -215988 -3371 -228213 -390196 -209001 186256 258914 254805 188002
8822A88002R2184K72487M75417m65044l07449R6973m60297k12389K25573l31477
$$ 188002 280186 552673 1028090 563046 255597 352570 -107727 -320116 -94543 -426020
8812d26020j47585J49966L80256K66927k46181o5353K74989m3195k3401q119m41071
$$ -426020 -573605 -423639 -43383 223544 -22637 -87990 186999 143804 120403 112284 -328787
8801c28787k43049N92658K18881P1030j43790M8509m37380k87517l6057j40623
$$ -328787 -571836 20822 239703 310733 166943 215452 -221928 -509445 -545502 -686125
8791f86125O98178L10544m43906j76957J23426q0786N01385O3868k24618K75906
$$ -686125 12053 322597 -121309 -298266 -174840 -255626 245759 309627 85009 360915
8781C60915q5828p35293j06739k26135K97090K27135p205N9620j19491K1005O3033
$$ 360915 275087 -460206 -566945 -793080 -495990 -268855 -276060 -216440 -335931 -314926 -251893
8770b51893j83382p3391O02880K64668J9298M52181m2061k94518j51708l8336
$$ -251893 -435275 -508666 94214 358882 378180 830361 788300 493782 342074 303738
8760C03738j95284k33604r884J47702K24287M2778r8073M0585j20949n657K87050
$$ 303738 108454 -125150 -135034 12668 236955 279733 181660 222245 101296 95639 382689
8749C82689K84531L16439l20812l30775l82636J5490k6188k6518N25798N72500
$$ 382689 667220 983659 662847 332072 -50564 -35074 -61262 -87780 438018 1010518
8739A010518N1929l06715m13353k12250j08502j62243k11318O22854L63703l17087
$$ 1010518 1062447 755732 342379 130129 21627 -140616 -351934 270920 634623 317536
8729C17536o07058J67983J14472J62260M535j24907j74827M01024l2478l11877
$$ 317536 -289522 -121539 -7067 155193 159728 34821 -140006 261018 228540 -83337
8719h3337k45094o8853K51983q7261Q0653k02550P2670K12825K07472Q96498k13759
$$ -83337 -328431 -397284 -145301 -232562 -151909 -354459 -281789 -68964 138508 1035006 821247
8708H21247q54914l58792K89269k1212k98667K15940j50095O3291Q1359M67536
$$ 821247 -33667 -392459 -103190 -124402 -423069 -207129 -357224 -293933 -212574 254962
8698B54962K53937o7668J73718j52081m75311l30937L24597J96223J45561o85261
$$ 254962 508899 441231 614949 462868 -12443 -343380 -18783 177440 323001 -362260
8688c62260N6594M36374j13319M09342j87677R4517L22099n90378j77864m9806
$$ -362260 -305666 130708 17389 426731 239054 333571 655670 65292 -112572 -162378
8678a62378J12870M85556K56663J13635K58763K44255k11293l79457K22719j33532
$$ -162378 -49508 436048 692711 806346 1065109 1309364 1098071 718614 941333 807801
8668H07801L44512m3129j53599l13257l39602k58856j2450k47988k9440K06788
$$ 807801 1152313 1109184 955585 642328 302726 43870 31420 -216568 -246008 -39220
8658c9220J22315K69450M6671j2516l32991m6699K61277J24861j89729l018j60974
$$ -39220 83095 352545 399216 386700 53709 7010 268287 393148 203419 200401 39427
8647C9427j84773o9479J77220k37158K54096n7421m49194j36793L48841L88717
$$ 39427 -145346 -214825 -37605 -274763 -20667 -78088 -527282 -664075 -315234 73483
8637G3483j86271j62425M07403K47220J18287k73092k80213l88897k66730k32514
$$ 73483 -112788 -275213 132190 379410 497697 224605 -55608 -444505 -711235 -943749
8627i43749m44511K99496M24911L23847K98364k61398k61587O74272J48074q4422
$$ -943749 -1388260 -1088764 -663853 -340006 -41642 -303040 -564627 109645 257719 173297
8617A73297R6541K5263j77348j29740p4772R9448p7111j01113q4368J24238l12847
$$ 173297 269838 295101 117753 -11987 -86759 12689 -64422 -165535 -249903 -125665 -438512
8606d38512j1907L05983N2906J69122r6962m87477N53173L24407K34959L04619
$$ -438512 -450419 -144436 -91530 77592 -19370 -506847 46326 370733 605692 910311
8596I10311j57276o08715l80018L16258k83973J81099N76164L59161L46730l40122
$$ 910311 753035 144320 -235698 80560 -203413 -22314 553850 913011 1259741 919619
8586I19619q67545l04023Q8910p5974L50452K26706m7959R190K99214J215N5221
$$ 919619 52074 -251949 -163039 -239013 111439 338145 290186 299376 598590 599805 655026
8575F55026n9872m49533j27202k70036Q8712r7079J30721O26739j4220o84337
$$ 655026 595154 145621 18419 -251617 -162905 -259984 -129263 497476 483256 -201081
8565b01081n37792M56536K23794q4037l86865k40939L41617J81703l46404k94076
$$ -201081 -738873 -282337 -58543 -142580 -529445 -770384 -428767 -247064 -593468 -887544
8555h87544J69736l26398L31835N36579K23294J28127J80828K76961q9629j13449
$$ -887544 -717808 -1044206 -712371 -175792 47502 175629 356457 633418 543789 430340
8545D30340m1137j38232n19839k33985N30428J55200K33315k03540k11210J97666
$$ 430340 389203 250971 -268868 -502853 27575 182775 416090 212550 1340 199006
8535A99006j61299K2327N38112k0808K42543M77669k67284n51396j64532R478
$$ 199006 37707 60034 598146 577338 819881 1297550 1030266 478870 314338 323816
8525C23816K71924j40574l87536L56790L84998m08710n28482K91412O34663k70592
$$ 323816 595740 455166 67630 424420 809418 400708 -127774 163638 798301 527709
8515E27709j94559R9343K3060K92785l12692j50429l04940L307J55228K5927K09163
$$ 527709 333150 432493 455553 748338 435646 285217 -19723 -16416 138812 164739 373902
8504C73902M40182m88631k56836j26278K93565L05533k29222l30098J48610J40392
$$ 373902 814084 325453 68617 -57661 235904 541437 312215 -17883 130727 271119
8494B71119K7626k54517p4898J60241K42246L00752L9720m16576M3755M84159
$$ 271119 298745 44228 -30670 129571 371817 672569 712289 295713 339468 823627
8484H23627L35154K86214O7523p00458j13096J60052j87591k65632k26451K02833
$$ 823627 1158781 1444995 1512518 812060 698964 859016 671425 405793 179342 382175
8474C82175K08198J85841o1478k71446m54386J66628J27377j0842K16717R3j81191
$$ 382175 590373 776214 714736 443290 -11096 155532 282909 272067 488784 488877 307686
8463C07686J68483j4854l7600m2989R132R8244R4349j32319k86156J21606J1423
$$ 307686 476169 461315 423715 380726 389858 488102 582451 450132 163976 285582 297005
8452B97005J62112k79749k00118J5453L32861m9024j39700K85848K25788K48699
$$ 297005 459117 179368 -20750 -5297 327564 278540 138840 424688 650476 899175
8442H99175N2333j60984k24002R8891Q00631N5323m34547m00979n44465k63217
$$ 899175 951508 790524 566522 665413 1466044 1521367 1086820 685841 141376 -121841
8432a21841P6398L61233j84969j64391J9245M34882l89085k22309l01587J12867
$$ -121841 -45443 315790 130821 -33570 -14325 420557 31472 -190837 -492424 -379557
8422c79557M93777l690K93153K41089j09459l93262k53674j76641j97887k80352
$$ -379557 114220 110530 403683 644772 535313 142051 -111623 -288264 -486151 -766503
8412g66503M47673M93590K29699j99360j42301M84522k98874k39161q4413m56267
$$ -766503 -318830 174760 404459 205099 62798 547320 248446 9285 -75128 -531395
8402e31395L73093M74308m30532J33861K58770L14598N78175P1704k89762n65840
$$ -531395 -158302 316006 -114526 19335 278105 592703 1170878 1242582 952820 386980
8392C86980k18884j91339J91236K52818j82992m97219k35423L20036M18104j27009
$$ 386980 168096 -23243 167993 420811 237819 -259400 -494823 -174787 243317 116308
8382A16308j49508m9692P9449K7990m7081K49272j94583j70413j40043l68825
$$ 116308 -33200 -82892 -3443 24547 -22534 226738 32155 -138258 -278301 -647126
8372f47126J79043K41517K24309k70526l39191J08232k11269J82057M96614J39701
$$ -647126 -468083 -226566 -2257 -272783 -611974 -503742 -715011 -532954 -36340 103361
8362A03361p3609Q6927L8779K05196j55434j31749j28144R0816K99524K70933
$$ 103361 29752 116679 155458 360654 205220 73471 -54673 36143 335667 606600
8352F06600J71359m34573j07819j39386m71608m16219L47500K44153J56878n924
$$ 606600 777959 343386 235567 96181 -375427 -791646 -444146 -199993 -43115 -49039
8342d9039j95679j4974J70282K691j66964q5781M19688k2053j44242k26686L1488
$$ -49039 -244718 -259692 -89410 -86719 -253683 -339464 80224 58171 -86071 -312757 -281269
8331b81269p3411L26319k00642p10375k61419K07608O8761m9976N89452l00512
$$ -281269 -354680 -28361 -229003 -939378 -1200797 -993189 -924428 -974404 -384952 -685464
8321f85464m82550K90244M72427K57788m75234l29351j8022P4752N16557R5683
$$ -685464 -1168014 -877770 -405343 -147555 -622789 -952140 -970162 -895410 -378853 -283170
8311b83170l05829J43324L98335Q6206l12351J75259l1624o1770j11029J86664
$$ -283170 -588999 -445675 -47340 38866 -273485 -98226 -129850 -191620 -302649 -115985
8301a15985O00918p1682l83945j88279m8766M06039K44010J07865m18694j05259
$$ -115985 484933 413251 29306 -158973 -207739 198300 442310 550175 131481 26222
8291B6222k9815J30983k93842K75029O32485l16356n50686r2812m55J44314L93806
$$ 26222 -3593 127390 -166452 108577 741062 424706 -125980 -218792 -219247 -74933 318873
8280C18873K6920J424m49549q9368j92343J31582O0548m1033O29279o0922k35887
$$ 318873 345793 347217 -102332 -191700 -384043 -252461 -191913 -232946 396333 335411 99524
8269I9524R428J37422j08439o2035K10845K09570o9102m28838j95093J19873M74638
$$ 99524 108952 246374 137935 75900 286745 496315 427213 -1625 -196718 -76845 397793
8258C97793j83162l39330j29824O61952K16732l47004J41591l0714j28473O4144
$$ 397793 214631 -124699 -254523 407429 624161 277157 418748 388034 259561 323705
8248C23705n0839L15166K136O40633N2173m85242m61213j98327j72853j35334
$$ 323705 272866 588032 590168 1230801 1282974 797732 336519 138192 -34661 -169995
8238a69995j61556K8931K00923N21633k9029q8733j74199k02550l2669j9678L30681
$$ -169995 -331551 -302620 -101697 419936 390907 302174 127975 -74575 -107244 -126922 203759
8227B03759k12877J59483p5154J65061m1117k01769J4424j20978j61292L29287
$$ 203759 -9118 150365 75211 240272 199155 -2614 11810 -109168 -270460 58827
8217E8827q8644n12024l50843L03962L67427O97842O3259j73810L03468K11155
$$ 58827 -29817 -541841 -892684 -588722 -221295 476547 539806 365996 669464 880619
8207H80619m15054l20809R9755j41304M7019p0766j28302k44835M0920K13686
$$ 880619 465565 144756 244511 103207 150226 79460 -48842 -293677 -252757 -39071
8197c9071Q8610L8815K42487r7529j21520j33514K34080j39613j5621K41512L06867
$$ -39071 49539 88354 330841 233312 111792 -21722 212358 72745 57124 298636 605503
8186F05503l91501k85078K04611K98580j52118m26221P6396K08945L27561N3523
$$ 605503 214002 -71076 133535 432115 279997 -146224 -69828 139117 466678 520201
8176E20201k60559j37588J03169l80881j36028j58440k26370N47793J42618k3341
$$ 520201 259642 122054 225223 -155658 -291686 -450126 -676496 -128703 13915 -9426
8166i426k566K69884J4833k04595l16359n45893k70747N58155K11162L02535J16557
$$ -9426 -11992 257892 272725 68130 -248229 -794122 -1064869 -506714 -295552 6983 123540
8155A23540M96232L00123j65084l72574o18586m25482K75685j56025L49914L93121
$$ 123540 619772 919895 754811 382237 -236349 -661831 -386146 -542171 -192257 200864
8145B00864j26780J12208J43060m55318q9475N70412K35992J12642K45221o1758
$$ 200864 74084 186292 329352 -125966 -215441 354971 590963 703605 948826 887068
8135H87068q24763j74202L42177q2956L47431p3971l67169L10124j12735l34184
$$ 887068 62305 -111897 230280 147324 494755 420784 53615 363739 251004 -83180
8125h3180K84150K29908K17643P7507m30009m9571j24367M1908J27716j53895
$$ -83180 200970 430878 648521 726028 296019 246448 122081 163989 291705 137810
8115A37810l28229j14015O5191J6573M83793L73870m1540Q7845J06867j27376
$$ 137810 -190419 -304434 -239243 -222670 261123 634993 593453 681298 788165 660789
8105F60789P9729j64947k14029q1781k00058N61374k08980K91627M6705k4856
$$ 660789 740518 575571 361542 279761 79703 641077 432097 723724 770429 745573
8095G45573j36940K18033j07735j40459n74l91641l83737m0466N95854o9230q6458
$$ 745573 608633 826666 718931 578472 577898 186257 -197480 -237946 357908 288678 202220
8084B02220J50361L4469L98234K38418k08670m99023k61485k03267J38979K1888
$$ 202220 352581 387050 785284 1023702 815032 316009 54524 -148743 -9764 12124
8074A2124m4536M66722L91815j2226l07178K11082k0884k9250l86749L20605k52490
$$ 12124 -32412 434310 826125 813899 506721 717803 696919 667669 280920 601525 349035
8063C49035M2858l2267j47478N8904K28500K75723k96098m15840O2356J06699
$$ 349035 391893 359626 212148 271052 499552 775275 479177 63337 125693 232392
8053B32392j16574n68453k41655L07319M56090K64738m34406l65599Q50740N07645
$$ 232392 115818 -452635 -694290 -386971 69119 333857 -100549 -466148 384592 892237
8043H92237K77033n00860m29359j1932L064k86670m45800M79266L900l12185J86760
$$ 892237 1169270 668410 239051 227119 230183 -56487 -502287 -23021 -19121 -331306 -144546
8032a44546k91526p0437R3835O2997J19874M18482L12956J93935k43929n19305
$$ -144546 -436072 -506509 -412674 -349677 -229803 188679 501635 695570 451641 -67664
8022f7664k29179j38600M2959L2010J53339J93563k70932L80163L78759K12345
$$ -67664 -296843 -435443 -392484 -360474 -207135 -13572 -284504 95659 474418 686763
8012F86763K23499J38269k89875n2400l96551m65923j5727k1237j1037j25169
$$ 686763 910262 1048531 758656 706256 309705 -156218 -171945 -193182 -204219 -329388
8002c29388L85981N99200n17597k68611N02651M81784k10722L82057n02090j192637
$$ -329388 56593 655793 138196 -130415 372236 854020 643298 1025355 523265 -669372
7992f69372j70467R27621N01889O5946m91954N0213m6602j98867J12892l13290
$$ -669372 -839839 87782 589671 655617 163663 213876 167274 -31593 81299 -231991
7982b31991o86120M66727Q60132Q4434k79391K78549J55333k9159n65986R5958
$$ -231991 -918111 -451384 408748 493182 213791 492340 647673 618514 52528 148486
7972A48486J67086P3691j2119k61097J20752P9795o08695j48159L94555K1282
$$ 148486 315572 389263 377144 116047 236799 316594 -292101 -440260 -45705 -24423
7962b4423R7861l63357k67035J3191K61362k76483P4160J92836R1749J08578J07603
$$ -24423 73438 -289919 -556954 -543763 -282401 -558884 -484724 -291888 -200139 -91561 16042
7951A6042Q4786o05546K2072K43530J95846o3520N4703K92004r9472J78871k94785
$$ 16042 100828 -504718 -482646 -239116 -43270 -106790 -52087 239917 140445 319316 24531
7940B4531J75080Q9287k30231l70885k56410J0306J41453j88813l12419j51332
$$ 24531 199611 288898 58667 -312218 -568628 -558322 -416869 -605682 -918101 -1069433
7930a069433K32029J41181N25944J04185Q6308M71628k97318l58526k4166k75024
$$ -1069433 -837404 -696223 -170279 -66094 20214 491842 194524 -164002 -188168 -463192
7920d63192m16740m0201L19761K46139K25539L03673j71535K93648L3111l6343
$$ -463192 -879932 -920133 -600372 -354233 -128694 174979 3444 297092 330203 293860
7910B93860J76358K32022j0003n93921k05873N47091J0031n94886m43987j14972
$$ 293860 470218 702240 692237 98316 -107557 439534 449565 -145321 -589308 -704280
7900g04280N85075L14372l68213k39249K63364J31655j01018m403k0052K77705
$$ -704280 -119205 195167 -173046 -412295 -148931 -17276 -118294 -122697 -142749 134956
7890A34956L43958j5416l30212k36855r3381k36366k51252L1438M38618r7004
$$ 134956 478914 463498 133286 -103569 -196950 -433316 -684568 -653130 -214512 -311516
7880c11516l06043j6379j98704M62181K06654k77408L40242L70325L41680k40637
$$ -311516 -617559 -633938 -832642 -370461 -163807 -441215 -100973 269352 611032 370395
7870C70395j80768j09634J49717j74164l5607l46691L85759q2572n2533M63426
$$ 370395 189627 79993 229710 55546 19939 -326752 59007 -23565 -76098 387328
7860C87328L34646j37239j70667n16323n19513M51246N09079N57696k42609l56071
$$ 387328 721974 584735 414068 -102255 -621768 -170522 338557 896253 653644 297573
7850B97573r9559j08414k83212J9687k62178J33748l50727j59400M05357k21279
$$ 297573 198014 89600 -193612 -173925 -436103 -302355 -653082 -812482 -407125 -628404
7840f28404q1372K86049L61734l98131K71180O18445Q1528m67802K61877K8973
$$ -628404 -709776 -423727 -61993 -460124 -188944 429501 511029 43227 305104 334077
7830C34077J85486p6376l2937K11513m2106j26381k28274k53893r0821p6609p0925
$$ 334077 519563 443187 410250 621763 579657 453276 225002 -28891 -119712 -196321 -267246
7819b67246J71610k5085N61940J51254p28862l67182L20951K70504j21594j79762
$$ -267246 -95636 -120721 441219 592473 -136389 -503571 -182620 87884 -33710 -213472
7809b13472j45095J41803L07622N09419k87613j94028K16339j18985Q1332K4008
$$ -213472 -358567 -216764 90858 600277 312664 118636 334975 215990 297322 321330
7799C21330k72093l80798L02652j46121L6442k66984K36686J89645J27379K65908
$$ 321330 49237 -331561 -28909 -175030 -138588 -405572 -168886 20759 148138 414046
7789D14046k12747M87179L16448m39269j11900p3526j81510N6336J8863m36788
$$ 414046 201299 688478 1004926 565657 453757 380231 198721 255057 273920 -162868
7779a62868m96730l65500K31437K26871o6397J97791K67281j90437M29699N96079
$$ -162868 -659598 -1025098 -793661 -566790 -633187 -435396 -168115 -358552 71147 667226
7769F67226L42755l59721k05277l36374m19997J51629O86215M9554N0572j81188
$$ 667226 1009981 650260 444983 108609 -311388 -159759 526456 576010 626582 445394
7759D45394l33287k84428k27350J71089O26580J28532K7716O6229O8031J94924
$$ 445394 112107 -172321 -399671 -228582 397998 526530 554246 620475 688506 883430
7749H83430p71005n57687j28104N83679k94612N3167N87973J82168j19749k50891
$$ 883430 112425 -445262 -573366 10313 -284299 -231132 356841 539009 419260 168369
7739A68369l27799J7204n0027K683R4598Q5269j20558k73023m16530J11989j83603
$$ 168369 -159430 -142226 -192253 -189570 -94972 -9703 -130261 -403284 -819814 -707825 -891428
7728h91428L80912M15026l83847j04438m40837k17360L81413O32674J17574J94779
$$ -891428 -510516 -95490 -479337 -583775 -1024612 -1241972 -860559 -227885 -110311 84468
7718H4468p3988p21646J3760K39957o29803J275K43773L48620j226l47364L03877
$$ 84468 10480 -711166 -697406 -457449 -1087252 -1085977 -842204 -493584 -494810 -842174 -538297
7707e38297M08383P917J92086j0744k67838J38845K21770K55927k98598m02112
$$ -538297 -129914 -121997 70089 59345 -208493 -69648 152122 408049 109451 -292661
7697b92661k81704j24698L25749O6824K03591k36426r0516J80842K09777k67464
$$ -292661 -574365 -699063 -373314 -306490 -102899 -339325 -429841 -248999 -39222 -306686
7687c06686l04432j11604L48268J19944m32828J20336L91869o2387J85257O4013
$$ -306686 -611118 -722722 -374454 -254510 -687338 -567002 -175133 -237520 -52263 11750
7677A1750N5484j47090r6676K41019o3407L68332p1020N6740l41919k13827K35993
$$ 11750 67234 -79856 -176532 64487 1080 369412 298392 355132 13213 -200614 35379
7666C5379J54204r9944l10564L45224M90l9356m40005p4633j61593m44101L03098
$$ 35379 189583 89639 -220925 124299 124789 85433 -354572 -429205 -590798 -1034899 -731801
7655g31801J11828R7175L70916L84246J23079j21642j57136L12601J50167k13796
$$ -731801 -619973 -522798 -151882 232364 355443 233801 76665 389266 539433 325637
7645C25637l92065m40516K48894J13502K74579L34209j4301L84092j24177m09773
$$ 325637 -66428 -506944 -258050 -144548 130031 464240 449939 834031 709854 300081
7635C00081n09764L89156M98918l56756q21851k38812L70945j58626L01773m2664
$$ 300081 -209683 179473 678391 321635 -500216 -739028 -368083 -526709 -224936 -267600
7625b67600N13508L93638j12131j47324N16570l08616l86302k20643r4828K7563
$$ -267600 245908 639546 527415 380091 896661 588045 201743 -18900 -113728 -86165
7615h6165L08205J05655K99688j62617j75230j99507j83812K3951O42735r8022
$$ -86165 222040 327695 627383 464766 289536 90029 -93783 -69832 572903 474881
7605D74881m77448l41320j33000J4364K06907P4542j1559n62058K3068O17628
$$ 474881 -2567 -343887 -476887 -462523 -255616 -181074 -192633 -754691 -731623 -113995
7595a13995J07960L52687j58471l29996l81387k80366j72502L82949K4434m50510
$$ -113995 -6035 346652 188181 -141815 -523202 -803568 -976070 -593121 -568687 -1019197
7585a019197N97379M76464P4541j87710m04737N2752j7051K82467M59319P002
$$ -1019197 -421818 54646 129187 -58523 -463260 -410508 -427559 -145092 314227 321229
7575C21229l9855k35087j76421K15553J33840l07699l420L16783k91749m8287
$$ 321229 281374 46287 -130134 85419 219259 -88440 -91860 224923 -66826 -115113
7565a15113Q2678j53915L01815K94131R3404k2288J08756M4141k72578p41993
$$ -115113 -32435 -186350 115465 409596 503000 480712 589468 633609 361031 -380962
7555c80962o19873j19722J39124L07157K35546L49102N62201K41218R8494m02
$$ -380962 -1000835 -1120557 -981433 -674276 -438730 -89628 472573 713791 812285 811883
7545H11883j29544n29818m45424m1760K68018O7332K96552K86531O4402m34960
$$ 811883 682339 152521 -292903 -334663 -66645 687 297239 583770 648172 213212
7535B13212l29622j93059M83098K39515j08000k01328j65412q3662J04770k82243
$$ 213212 -116410 -309469 173629 413144 305144 103816 -61596 -145258 -40488 -322731
7525c22731r8119j23662P535K33934k0764k21253M62622r014l46233l3924K3184
$$ -322731 -420850 -544512 -536977 -303043 -323807 -545060 -82438 -91452 -437685 -471609 -448425
7514d48425K88588J36434O2024l600k3925J45012p5786j12472J98930J89193k10488
$$ -448425 -159837 -23403 38621 35021 11096 156108 80322 -32150 166780 355973 145485
7503A45485l34074N155L20263M3478P7338k40080n0387k09774K22568l51978k02379
$$ 145485 -188589 -183434 136829 180307 257645 17565 -32822 -242596 -20028 -372006 -574385
7492e74385L48445K20645L3874j24464L31131J39914Q1282l25917m17585j68904
$$ -574385 -225940 -5295 28579 -95885 235246 375160 456442 130525 -287060 -455964
7482d55964p8562L53697n2662J70195k42918n45392M8924n6902k53673J60528
$$ -455964 -534526 -180829 -233491 -63296 -306214 -851606 -802682 -859584 -1113257 -952729
7472i52729M13870M17015L95792k26768m17867j84403K19876K67265n242j12978
$$ -952729 -538859 -121844 273948 47180 -370687 -555090 -335214 -67949 -73191 -186169
7462a86169n96465k91283R9795J99986J5431N633N50281P1688L85459p1140P653
$$ -186169 -782634 -1073917 -974122 -774136 -758705 -753072 -202791 -131103 254356 183216 190869
7451A90869j51187m9541J42675K26661K58595J72708k9478j59470K55248l77918
$$ 190869 39682 -9859 132816 359477 618072 790780 761302 601832 857080 479162
7441D79162k62395m1931l83476K64258M99498L56126m88201o00623j52699L93913
$$ 479162 216767 174836 -208640 55618 555116 911242 423041 -177582 -330281 63632
7431F3632N89934K47641N0706k39475J84944N8586o2887k75228n95246k45738
$$ 63632 653566 901207 951913 712438 897382 955968 893081 617853 22607 -223131
7421b23131k70008K09475J35056K38343K50690l2675R765M7772J9738j63697m49133
$$ -223131 -493139 -283664 -148608 89735 340425 307750 317515 365287 385025 221328 -227805
7410b27805n6655N7885J11316k68421J10664K84775K3192j84107J23817K80587
$$ -227805 -284460 -226575 -115259 -383680 -273016 11759 34951 -149156 -25339 255248
7400B55248R1258p6009L43240M1322k27698m68148j16132l51212k72121j89345
$$ 255248 346506 270497 613737 655059 427361 -40787 -156919 -508131 -780252 -969597
7390i69597L43353P49589J89936K97572n01758M311M05270O2895l84431l77257
$$ -969597 -626244 123345 313281 610853 109095 113406 518676 581571 197140 -180117
7380a80117k30613o2260k7248K71752M78097L50306N91425m55853p43204k09968
$$ -180117 -410730 -472990 -500238 -228486 249611 599917 1191342 735489 -7715 -217683
7370b17683P6737l57167n2049K94717L15366q3576j72932k67822J97159P4441
$$ -217683 -140946 -498113 -550162 -255445 59921 -23655 -196587 -464409 -267250 -192809
7360a92809k62290o3515L72444Q6412l86056o4846M18594n1379l12335j97245
$$ -192809 -455099 -518614 -146170 -59758 -445814 -510660 -92066 -143445 -455780 -653025
7350f53025M97635L32812l43738o90475K99529M88177O59672j10289l49711j12481
$$ -653025 -155390 177422 -166316 -856791 -557262 -69085 590587 480298 130587 18106
7340A8106l81212k57222L87638L80445M78502p4705M2504L18689N13575j83996
$$ 18106 -363106 -620328 -232690 147755 626257 551552 594056 912745 1426320 1242324
7330A242324o10130l27572k67702J67604q6806m01666k11225M9587N4820K84616
$$ 1242324 632194 304622 36920 204524 117718 -283948 -495173 -445586 -390766 -106150
7320a06150M59288J04908k25338l14624k04327k88999K49069M12667o3907K09416
$$ -106150 353138 458046 232708 -81916 -286243 -575242 -326173 86494 22587 232003
7310B32003J44466j21544m3392k08651n38909M4953j36149p1401J55424N097k64360
$$ 232003 376469 254925 211533 2882 -536027 -491074 -627223 -698624 -543200 -538103 -802463
7299h02463q2582k18686J81513M67623N26774r7235l51691j81673K48161q1326
$$ -802463 -885045 -1103731 -922218 -454595 72179 -25056 -376747 -558420 -310259 -391585
7289c91585M37955K21611l37229K53603k81648j99426Q854j82018m22594K71781
$$ -391585 46370 267981 -69248 184355 -97293 -296719 -287865 -469883 -892477 -620696
7279f20696J98701K31249l67705j95844J63312L62197R0688k92562j04079N45813
$$ -620696 -421995 -190746 -558451 -754295 -590983 -228786 -138098 -430660 -534739 11074
7269A1074M5365J28690p5109k06798k36456K7788q8562K66907J07285K65153j64315
$$ 11074 56439 185129 110020 -96778 -333234 -305446 -394008 -127101 -19816 245337 81022
7258H1022k02248M1114L32712J42794M09132j05659k02238k01187m83521j69274
$$ 81022 -121226 -80112 252600 395394 804526 698867 496629 295442 -188079 -357353
7248c57353j44313K4339J03139J13202o5571L88273k32768M0045K45592L19503
$$ -357353 -501666 -477327 -374188 -260986 -326557 61716 -171052 -131007 114585 434088
7238D34088j9780m37663k57036L93139q863k2277l8438L5045M83930j19202m68857
$$ 434088 414308 -23355 -280391 112748 103885 81608 43170 78215 562145 442943 -25914
7227b5914o21612l05815j24541L52840N46051K23059P7996k04938l1877l81892
$$ -25914 -647526 -953341 -1077882 -725042 -178991 44068 122064 -82874 -114751 -496643
7217d96643M4152M14795J27233J02467J33999M67191r7440n57445R0336N3785
$$ -496643 -452491 -37696 89537 192004 326003 793194 695754 138309 228645 282430
7207B82430j59246K61497j45254l42402k85435r6607L21304p5567j17216m679
$$ 282430 123184 384681 239427 -102975 -388410 -485017 -163713 -239280 -356496 -361175
7197c61175O44804M26046j69547m19866K5973m6345l6802l79680j97599p583O2338
$$ -361175 283629 709675 540128 120262 146235 99890 63088 -316592 -514191 -521774 -459436
7186d59436L3943L96195p0684k2807k17929j34718L77236J14206n203r0578n30110
$$ -459436 -425493 -29298 -99982 -122789 -340718 -475436 -98200 16006 10803 -79775 -609885
7175f09885k9614L59977l2799J75143K26712n06278m4927K24940K3380M02894
$$ -609885 -639499 -279522 -312321 -137178 89534 -416744 -461671 -236731 -213351 189543
7165A89543M9359q4805l29108r5633J66665J54145k85016k61059j85277J15062
$$ 189543 238902 154097 -175011 -270644 -103979 50166 -234850 -495909 -681186 -566124
7155e66124m42718K46911M58493M27018J9627N96322L44239j91756j75590l18853
$$ -566124 -1008842 -761931 -303438 123580 143207 739529 1083768 892012 716422 397569
7145C97569o5464L23247l54421l05458k9006J09008o14074n13795k23364K77322
$$ 397569 332105 655352 300931 -4527 -33533 75475 -538599 -1052394 -1275758 -998436
7135i98436l45468K63632N18153N42578M47824P6625k80106q3588K33179Q3219
$$ -998436 -1343904 -1080272 -562119 -19541 428283 504908 224802 141214 374393 457612
7125D57612l48006l91023m8486K22684M73208L0658j59447k03474j10826L09929
$$ 457612 109606 -281417 -329903 -107219 365989 396647 237200 33726 -77100 232829
7115B32829l0022l96104N6215M9094L95821L53510Q5963j50367j94911Q8262M3401
$$ 232829 202807 -193297 -137082 -87988 307833 661343 747306 596939 402028 490290 533691
7104E33691k47124p38156l18723K77931L38875k09684M9558l07671n36479J71838
$$ 533691 286567 -451589 -770312 -492381 -153506 -363190 -313632 -621303 -1157782 -985944
7094i85944N10119M98642N2477n34582J25105M33322q7278m75565q7330K100K55290
$$ -985944 -475825 22817 75294 -459288 -334183 99139 11861 -463704 -551034 -548934 -293644
7083b93644l6474j71824K46725P2842k20302N47056P45535L30070o95244k76225
$$ -293644 -330118 -501942 -255217 -182375 -402677 144379 889914 1219984 524740 248515
7073B48515J06094m2594J10429k2663l28801l52731l69570J66233L55724J48129
$$ 248515 354609 312015 422444 399781 70980 -281751 -651321 -485088 -129364 18765
7063A8765j41727j89640o911j35490K95946K74815J10484r4028J78542j22275
$$ 18765 -122962 -312602 -319513 -455003 -159057 115758 226242 132214 310756 188481
7053A88481l69911j86806k46729k8072l76723L9037L94878K05385J53583M61221
$$ 188481 -181430 -368236 -614965 -643037 -1019760 -980723 -585845 -380460 -226877 234344
7043B34344J50023j57505K8967l0542k07435Q0238n805k69123N3372l92397l36968
$$ 234344 384367 226862 255829 225287 17852 98090 92285 -176838 -123466 -515863 -852831
7032h52831L77659K47108j19288j04856L34189P75545k87158n36327J54742o386
$$ -852831 -475172 -228064 -347352 -452208 -118019 657526 370368 -165959 -11217 -17603
7022a7603m63929k85829J3306J19158M92221O38111M2526k26403n27525n7837
$$ -17603 -481532 -767361 -754055 -634897 -142676 495435 537961 311558 -215967 -273804
7012b73804M6225J75311L64339K72101K4011k80139L07682o116n04482l58642
$$ -273804 -227579 -52268 312071 584172 608183 328044 635726 629610 125128 -233514
7002b33514k13494J27553K40504M47251J81410j39234r0364m2618m25879n21761
$$ -233514 -447008 -319455 -78951 368300 549710 410476 320112 277494 -148385 -670146
6992f70146J57780K88295K71788L0723k40839j86935J44027k03286l93254k21429
$$ -670146 -512366 -224071 47717 78440 -162399 -349334 -205307 -408593 -801847 -1023276
6982a023276L50599P05999J85972j13978o8166l66831Q8193K86309K03488q50531
$$ -1023276 -672677 33322 219294 105316 37150 -329681 -241488 44821 248309 -602222
6972f02222k86707j4820r4586J50314N98432N87475J53755m53106o1918q8236
$$ -602222 -888929 -903749 -998335 -848021 -249589 337886 491641 38535 -23383 -111619
6962a11619K4208N7001k03008m0635K87170q6512l56431j01877M09856j75041
$$ -111619 -87411 -30410 -233418 -274053 13117 -73395 -429826 -531703 -121847 -296888
6952b96888j13992L490J22061J07791k58752K2980N18796L19548K76419N8027
$$ -296888 -410880 -407390 -285329 -177538 -436290 -413310 105486 425034 701453 759480
6942G59480o00321j00715L67398N35299j55599l31302k70918j09243L98831L72975
$$ 759480 159159 58444 425842 961141 805542 474240 203322 94079 492910 865885
6932H65885k23080k89390m95441J3569L51498Q8424l56853n93382o9601J75870
$$ 865885 642805 353415 -142026 -128457 223041 311465 -45388 -638770 -708371 -532501
6922e32501K15034M07921K28249l096l08295M3387R2623K98314J88803n37166
$$ -532501 -317467 90454 318703 315607 7312 50699 143322 441636 630439 93273
6912I3273l03207J7452l9685M2203K20729J31058k49867K05456L68298j02299
$$ 93273 -209934 -192482 -232167 -189964 30765 161823 -88044 117412 485710 383411
6902C83411l18894p4851o7058r4331k45665k41198j83611K58510L95946N71302
$$ 383411 64517 -10334 -77392 -171723 -417388 -658586 -842197 -583687 -187741 383561
6892C83561L67519k72947J11837j80059j92752j78073M11740k78202j98045j34069
$$ 383561 751080 478133 589970 409911 217159 39086 450826 172624 -25421 -159490
6882a59490l14520K90259O00323M35565N9373j89152M36763m468l14810r9843
$$ -159490 -474010 -183751 416572 852137 911510 722358 1159121 1154653 839843 740000
6872G40000j99231o67605p2907J09566j36438J47494L07563L15073J05180j55635
$$ 740000 540769 -126836 -199743 -90177 -226615 -79121 228442 543515 648695 493060
6862D93060L0561Q6110j04042j20364k93990l69607O15579K6408l17800l20017
$$ 493060 523621 609731 505689 385325 91335 -278272 337307 363715 45915 -274102
6852b74102p8386L14699L34071L9161R182l36727q2708J69280J69710L45688L6352
$$ -274102 -352488 -37789 296282 335443 344625 7898 -74810 94470 264180 609868 646220
6841F46220l17032K26483o5692l90819k25646J98996l7616J0970J1545k24727
$$ 646220 329188 555671 489979 99160 -126486 72510 34894 45864 57409 -167318
6831a67318j36729k51853k68919l55189J93910L96736K11680J27974m51326M2915
$$ -167318 -304047 -555900 -824819 -1180008 -986098 -589362 -377682 -249708 -701034 -658119
6821f58119P50508L84421Q77m53125J00219L56638R7885k99130N19759M633n31094
$$ -658119 92389 476810 477687 24562 124781 481419 579304 280174 799933 804566 273472
6810B73472l67992K55108j87406n37687n8879M65568N98753J19803o00124q10833
$$ 273472 -94520 160588 -26818 -564505 -623384 -157816 440937 560740 -39384 -850217
6800h50217j3017O56001J88171O337l06032M189j0611M2598k81699m05880p6604
$$ -850217 -863234 -207233 -19062 -12725 -318757 -314568 -325179 -282581 -564280 -970160 -1046764
6789a046764L70982L52850L95432J0897l43039Q9243O776r2357j66568j69209
$$ -1046764 -675782 -322932 72500 83397 -259642 -170399 -163623 -255980 -422548 -591757
6779e91757J42433L44452O30208j0610n36090k09312j2546K52669k89974k74623
$$ -591757 -449324 -104872 525336 514726 -21364 -230676 -243222 9447 -280527 -555150
6769e55150r5133L11528K93689J45139N0263P2242q4711L369j53776j09750l1330
$$ -555150 -650283 -338755 -45066 100073 150336 222578 137867 141236 -12540 -122290 -153620
6758a53620p0972R2059k86145r8466L03979N48496Q859k54081K16357J89403k91002
$$ -153620 -224592 -132533 -418678 -517144 -213165 335331 344190 90109 306466 495869 204867
6747B04867j81877L30218o53409j51750K51689l77089l50514j87365K68810J06726
$$ 204867 22990 353208 -300201 -451951 -200262 -577351 -927865 -1115230 -846420 -739694
6737g39694J34192k34482j77953N22742O64849p0235o80048J29913L02500M1687
$$ -739694 -605502 -839984 -1017937 -495195 169654 99419 -580629 -450716 -148216 -106529
6727a06529L88458k57152n28660l55613Q7173K37735m0709K8671P348L36504l5484
$$ -106529 281929 24777 -503883 -859496 -772323 -534588 -575297 -546626 -539278 -202774 -238258
6716b38258m6156l30469k78016L60117L02231M48389m19029j83776N99540J27745
$$ -238258 -284414 -614883 -892899 -532782 -230551 217838 -201191 -384967 214573 342318
6706C42318k56077j96511N5140K83179l16557l96934l3507R8310K79100L1274
$$ 342318 86241 -110270 -55130 228049 -88508 -485442 -518949 -420639 -141539 -110265
6696a10265K33219p7130n68313o8906N6742n5121L70807j1928m14443J56404K52018
$$ -110265 122954 45824 -522489 -591395 -534653 -589774 -218967 -230895 -645338 -488934 -236916
6685b36916j52840r2374J28662j60216j8804M59664k34330j78554Q7565j34352
$$ -236916 -389756 -482130 -353468 -513684 -532488 -72824 -307154 -485708 -398143 -532495
6675e32495K14169M65064J13045n14631L7365j2089l73983k28054L26213O11838
$$ -532495 -318326 146738 259783 -254848 -217483 -229572 -603555 -831609 -505396 106442
6665A06442M324l1014J34898k66486o28941k44631M77693M96866o5405P7895J7411
$$ 106442 110766 79752 214650 -51836 -680777 -925408 -447715 49151 -16254 61641 79052
6654G9052K1691P3584j25033K50737K07804j27467j70366M3933K58753K76274
$$ 79052 100743 174327 49294 300031 507835 380368 210002 253935 512688 788962
6644G88962k54388J74425Q8085k40809n49898j91795J86802Q7618J12912m16926
$$ 788962 534574 708999 797084 556275 6377 -185418 1384 89002 201914 -215012
6634b15012R1187M83081K7842l74930j377O94602j66173m479P5275n59754l12719
$$ -215012 -123825 359256 387098 12168 10791 705393 539220 534741 610016 50262 -262457
6623b62457P7531K07813K8121l52639J3876n1779j14871M8724L58197K65895m0159
$$ -262457 -184926 22887 51008 -301631 -287755 -339534 -454405 -405681 -47484 218411 178252
6612A78252j58041M65322M44030k37577n38858m76366n2813L05428K02000j19874
$$ 178252 20211 485533 929563 691986 153128 -323238 -376051 -70623 131377 11503
6602A1503k93738j89279o1288R2555j71283j55836L61187L44449Q1412l02828
$$ 11503 -282235 -471514 -532802 -440247 -611530 -767366 -406179 -61730 19682 -283146
6592b83146n25951L0922J00840K33645L49118M30050j78519n13522j71284j71307
$$ -283146 -809097 -778175 -677335 -443690 -94572 335478 156959 -356563 -527847 -699154
6582f99154p7038n6180M13708L20501m40181J64709L56113K40345K63005j38938
$$ -699154 -776192 -832372 -418664 -98163 -538344 -373635 -17522 222823 485828 346890
6572C46890k14614j29560J92048j82958J20823j61453l91950l09250M58982Q9929
$$ 346890 132276 2716 194764 11806 132629 -28824 -420774 -730024 -271042 -181113
6562a81113k77746k03005l67270j58640L92937j55987M23747J72124j58190J46783
$$ -181113 -458859 -661864 -1029134 -1187774 -794837 -950824 -527077 -354953 -513143 -366360
6552c66360J24562k811k81898j65402J59347J51633j24054K06449r0121j89970
$$ -366360 -241798 -244609 -526507 -691909 -532562 -380929 -504983 -298534 -388655 -578625
6542e78625J20644j70805J43859M86511L5457J06325k53190k34673j38690L3061
$$ -578625 -457981 -628786 -484927 1584 37041 143366 -109824 -344497 -483187 -450126
6532d50126J03260j26715M40930L51070J60045o41086k48591J92579M02933J59553
$$ -450126 -346866 -473581 -32651 318419 478464 -162622 -411213 -218634 184299 343852
6522C43852j00833o52554P5208o4868l96832K53627O63073L60368j61575j62452
$$ 343852 243019 -409535 -334327 -399195 -796027 -542400 120673 481041 319466 157014
6512A57014L015J15804q0217l72990k4276l32036J40248J38878j12888J7113M26769
$$ 157014 160029 275833 195616 -177374 -201650 -533686 -393438 -254560 -367448 -350335 76434
6501G6434J77517m05218o4991K01496L8231P3868m8261k72367m11201j4742K65569
$$ 76434 253951 -151267 -216258 -14762 23469 97337 49076 -223291 -634492 -649234 -383665
6490c83665K93549K1380L3554L47755L85791k23366j67616l17832l04685J13778
$$ -383665 -90116 -68736 -35182 312573 698364 474998 307382 -10450 -315135 -201357
6480b01357n84499n5737M01289L82028J19124M71373K84759j30325k70773l27763
$$ -201357 -785856 -841593 -440304 -58276 60848 532221 816980 686655 415882 88119
6470H8119j78250n46421J62413L33733J69754J53914j95966l8132O23674q5331
$$ 88119 -90131 -636552 -474139 -140406 29348 183262 -12704 -50836 572838 487507
6460D87507L24221J8969o88735j97595k7177k75704K86653K70748q6891K13543
$$ 487507 811728 830697 141962 -55633 -82810 -358514 -71861 198887 111996 325539
6450C25539R4156l36425j67852j8018k3111m9795o23850k76635K78370J86732
$$ 325539 419695 83270 -84582 -102600 -125711 -175506 -799356 -1075991 -797621 -610889
6440f10889j67681J34225M70861k3300k66115q039L99385J51306Q9181j85447
$$ -610889 -778570 -644345 -173484 -196784 -462899 -470938 -71553 79753 168934 -16513
6430a6513q8045K91076J18122m22605j45983l30088R1912J36943K36544L12039
$$ -16513 -104558 186518 304640 -117965 -263948 -594036 -502124 -365181 -128637 183402
6420A83402K9650m56004m83110N5822K42044K15090p4126o29678o2958P6027k31718
$$ 183402 213052 -242952 -726062 -670240 -428196 -213106 -287232 -916910 -979868 -903841 -1135559
6409a135559j77906N04395K13190J28214L7349k98717N65811r9096N2664P92620
$$ -1135559 -1313465 -809070 -595880 -467666 -430317 -729034 -163223 -262319 -209655 582965
6399E82965j87698j19943J03350J01289m5511j30615l22905q23684L72107N53699
$$ 582965 395267 275324 378674 479963 434452 303837 -19068 -842752 -470645 83054
6389H3054L56885m35258m957j45973J4132j9225l61404J5359L09182P10343J36941
$$ 83054 439939 4681 -276 -146249 -132117 -151342 -512746 -497387 -188205 522138 659079
6378F59079m51824k50430j66370P9407l16172J46105J45736o8593l36609K61625
$$ 659079 207255 -43175 -209545 -130138 -446310 -300205 -154469 -223062 -559671 -298046
6368b98046j50464j813L79325M32256o3285l17082J145k30160j88598K06848K69455
$$ -298046 -448510 -450323 -70998 361258 297973 -19109 -17964 -248124 -436722 -229874 39581
6357C9581K07734J13344n68162l11143J16968J08910k4658L60596r8277j20962
$$ 39581 247315 360659 -207503 -518646 -401678 -292768 -317426 43170 -55107 -176069
6347a76069k37300K53757K89718j03689N5898M43820j04646j41998l42704j95038
$$ -176069 -413369 -159612 130106 26417 82315 526135 421489 279491 -63213 -258251
6337b58251J86584k56584K64955L59854j49735k59822k53288p2449j48994J22810
$$ -258251 -71667 -328251 -63296 296558 146823 -112999 -366287 -438736 -587730 -464920
6327d64920O75503L00930l44769j75968k94522L92824N60055k46593j44863j91051
$$ -464920 210583 511513 166744 -9224 -303746 89078 649133 402540 257677 66626
6317F6626m06580J60824O9163j91837l16164o8287k3177K28482m9862K15556l9444
$$ 66626 -339954 -179130 -109967 -301804 -617968 -686255 -709432 -480950 -530812 -315256 -354700
6306c54700k62529N61881K06233M7327j17655j83693j22610K1883L31894J46948
$$ -354700 -617229 -55348 150885 198212 80557 -103136 -225746 -203863 128031 274979
6296B74979j07770m15834K43166q2452l48215O6350K82695P0832J57197K26239
$$ 274979 167209 -248625 -5459 -87911 -436126 -369776 -87081 -16249 140948 367187
6286C67187K13717L5380j88584o22480l60615k52487P51258k13211J27007K11139
$$ 367187 580904 616284 427700 -194780 -555395 -807882 -56624 -269835 -142828 68311
6276F8311J14670j15783k97924k17695L49649j08386k05484J90796q0800K71967
$$ 68311 182981 67198 -230726 -448421 -98772 -207158 -412642 -221846 -302646 -30679
6266c0679K98724p6683L47933l4334k20842L3748j43355k05058k74955m3652m477
$$ -30679 268045 191362 539295 504961 284119 317867 174512 -30546 -305501 -349153 -353630
6255c53630k90756j41003O9584r229n5265j7545k2244N00154L72619j71053J55524
$$ -353630 -644386 -785389 -715805 -725034 -780299 -797844 -820088 -319934 52685 -118368 37156
6244C7156j2807k71350K16304R7235j79151j4754l42334J42987J70335r182M43080
$$ 37156 24349 -247001 -30697 66538 -112613 -127367 -469701 -326714 -156379 -165561 277519
6233B77519K79298k57547l12940k63109m39361L01414L88048l63267K70222J88694
$$ 277519 556817 299270 -13670 -276779 -716140 -414726 -26678 -389945 -119723 68971
6223F8971K23850j93147o17407J85210P64780J66114j94613m93339J61427k47495
$$ 68971 292821 99674 -517733 -332523 432257 598371 403758 -89581 71846 -175649
6213a75649l27194r9820K0050M48151o6396J59318J4304k1771J57568r1260m59543
$$ -175649 -502843 -602663 -582613 -134462 -200858 -41540 -27236 -49007 108561 17301 -442242
6202d42242M64361k73037L1947j13693J44427K93211r7537j91883k82846Q8437
$$ -442242 22119 -250918 -218971 -332664 -188237 104974 7437 -184446 -467292 -378855
6192c78855M25631j32472K15496N7319k02807L354J16198J62107K39883j60606
$$ -378855 46776 -85696 129800 187119 -15688 -12334 103864 265971 505854 345248
6182C45248k10673M3070k56362n45782Q6969O19571J78503k9166k04601k14077
$$ 345248 134575 177645 -78717 -624499 -537530 82041 260544 231378 26777 -187300
6172a87300K72644J73520K99678j80540j20633j79231k91660L181k87302j29919
$$ -187300 85344 258864 558542 378002 257369 78138 -213522 -210341 -497643 -627562
6162f27562N00952M06982j47429J14042J42260l3326P462l56425R0344K20544
$$ -627562 -126610 280372 132943 246985 389245 355919 363381 6956 97300 317844
6152C17844K01267k85954n69175k1505K17174k0804Q7448K09233n10306k55589
$$ 317844 519111 233157 -336018 -357523 -140349 -161153 -73705 135528 -374778 -630367
6142f30367o55526r5081J90716L29317L32265J48915k66456J57364Q474L46820
$$ -630367 -1285893 -1380974 -1190258 -860941 -528676 -379761 -646217 -488853 -480379 -133559
6132a33559J61748L8762K62378K15533j5901l44010j52714p8154k23195L00650
$$ -133559 28189 66951 329329 544862 528961 184951 32237 -45917 -269112 31538
6122C1538P06752k92653j10098r3988P9533n22640n94974j20160N00119r591k85503
$$ 31538 738290 445637 335539 241551 321084 -201556 -796530 -916690 -416571 -426162 -711665
6111g11665L31767K61522l0580m27317k62627j51458M53868P94944J07640k03737
$$ -711665 -379898 -118376 -148956 -576273 -838900 -990358 -536490 258454 366094 162357
6101A62357k74289l6643j01522k417K24763j43137K31398N31933J03741l31784
$$ 162357 -111932 -148575 -250097 -252514 -27751 -170888 60510 592443 696184 364400
6091C64400l92043n36807L96549K05805l16226R6306p6997J1335P732J85070N61678
$$ 364400 -27643 -564450 -167901 37904 -278322 -182016 -259013 -247678 -239946 -54876 506802
6080E06802m1752k71977l2789l04913R2485K70407j29872l98032k3974O5669l1964
$$ 506802 465050 193073 160284 -144629 -52144 218263 88391 -309641 -333615 -267946 -299910
6069b99910l6029M3199Q5850J9527L33155m8604o543k64758m00835j691K8338
$$ -299910 -335939 -292740 -206890 -187363 145792 97188 90645 -174113 -574948 -576639 -548301
6058e48301M11999o19977o67363M09864N51415P93884J16249l44069m35800j22615
$$ -548301 -136302 -756279 -1423642 -1013778 -462363 331521 447770 103701 -332099 -454714
6048d54714L23567J70192N04013J34920q5162o94022j75237J7792k16509j22916
$$ -454714 -131147 39045 543058 677978 592816 -101206 -276443 -258651 -475160 -598076
6038e98076L91707L4005J17836M08560O4567K1014K04057m91060m31738L29622
$$ -598076 -206369 -172364 -54528 354032 418599 439613 643670 152610 -279128 50494
6028E0494K77294J2568l05305j80599L65816K51012j65078m5316Q4183M6856n62110
$$ 50494 327788 340356 35051 -145548 220268 471280 306202 260886 345069 391925 -170185
6017a70185j22327K43176l96531J07916J28742M17635L35708m43383L57199r1630
$$ -170185 -292512 -49336 -445867 -337951 -209209 208426 544134 100751 457950 366320
6007C66320L7291l63126o37967M14422N36819k23781K24371j37231N0413j22026
$$ 366320 403611 40485 -597482 -183060 353759 129978 354349 217118 267531 145505
5997A45505M5335J08768l57047J49973j21703L5749O29207J03352j40769L30015
$$ 145505 190840 299608 -57439 92534 -29169 6580 635787 739139 598370 928385
5987I28385J2471k29427p51226m2906k6964R0646p5369q4271o52234j90178J89595
$$ 928385 940856 711429 -39797 -82703 -109667 -19021 -94390 -178661 -830895 -1021073 -831478
5976h31478L42679L63349M04275J82643l61855n05956m39385j03778J32797M22425
$$ -831478 -488799 -125450 278825 461468 99613 -406343 -845728 -949506 -816709 -394284
5966c94284K9036J01244J43643J6511Q6059J90025o5629j23758R0290o8193n53196
$$ -394284 -365248 -264004 -120361 -103850 -17791 172234 106605 -17153 73137 4944 -548252
5955e48252l24079L90972M8815j11779L59096L50072l3629k65274L7152l72305
$$ -548252 -872331 -481359 -432544 -544323 -185227 164845 131216 -134058 -96906 -469211
5945d69211L13694L00796Q204J55274N24485j31342m60856n73977K31113M82965
$$ -469211 -155517 145279 153483 308757 833242 701900 241044 -332933 -101820 381145
5935C81145k7045l81053L6152l19618n7155j57836N7015j01098K02361O24355
$$ 381145 354100 -26953 9199 -310419 -367574 -525410 -468395 -569493 -367132 257223
5925B57223M54045l90821p98436j17687j1917j76492P5873J08025L87067L24469
$$ 257223 711268 320447 -477989 -595676 -607593 -784085 -708212 -600187 -213120 111349
5915A11349K14291j17815m24871l12431J43508L08941N97685L3498K31649p26467
$$ 111349 325640 207825 -217046 -529477 -385969 -77028 520657 554155 785804 59337
5905E9337k81563l6983j91817R6135j26578K35166K50414Q9063q6328J58814l1404
$$ 59337 -222226 -259209 -451026 -354891 -481469 -246303 4111 93174 6846 165660 134256
5894A34256m13105j29035j8895j35941J24928k05020l06986K33334J55978j70838
$$ 134256 -278849 -407884 -426779 -562720 -437792 -642812 -949798 -716464 -560486 -731324
5884g31324K78512K76323L30321M53339m5158k81591N6013q083l74549m17237
$$ -731324 -452812 -176489 153832 607171 562013 280422 336435 328352 -46197 -463434
5874d63434K59813P3836M9933L0573m6264k29928r7698M04919q945o79893N8969
$$ -463434 -203621 -129785 -79852 -49279 -95543 -325471 -423169 -18250 -27195 -707088 -648119
5863f48119J20717K43046j18041r9286j26976l15570K09238M395K39671J24352
$$ -648119 -527402 -284356 -402397 -501683 -628659 -944229 -734991 -730596 -490925 -366573
5853c66573K72944K21024K65362k34970j33607m60193k11715N30247N39442M3086
$$ -366573 -93629 127395 392757 157787 24180 -436013 -647728 -117481 421961 465047
5843D65047n19327k582j70108K48602K06568o5827k99133N4086L40648m0058l72004
$$ 465047 -54280 -56862 -226970 21632 228200 162373 -136760 -82674 257974 217916 -154088
5832a54088k1228J88413J22994k45405k89485j05315K06994k3079k3372j54712
$$ -154088 -175316 13097 136091 -109314 -398799 -504114 -297120 -320199 -343571 -498283
5822d98283J08589p5834k91149q0408K63711J17570j2328J53839K42394L88366
$$ -498283 -389694 -465528 -756677 -837085 -573374 -455804 -468132 -314293 -71899 316467
5812C16467r3233n07251l40121n652K64776k46278k55218N24569K00369q7720
$$ 316467 223234 -284017 -624138 -629790 -365014 -611292 -866510 -341941 -141572 -229292
5802b29292O7470J17104J29777k49179k53916l2648M00285O63210n33297j5731
$$ -229292 -161822 -44718 85059 -164120 -418036 -450684 -50399 612811 79514 63783
5792F3783k98409j02045j17667k94785J15576K39601q4622j38842N3766q0094
$$ 63783 -234626 -336671 -454338 -749123 -633547 -393946 -478568 -617410 -563644 -643738
5782f43738L19851Q54171j4890j89647k959r9805j17153Q847R9405j53034L0938
$$ -643738 -323887 530284 515394 325747 322788 222983 105830 114677 214082 61048 91986
5771I1986p7829j73755J08205j25888k63655O2558J61362N2518l8733k41968J79470
$$ 91986 14157 -159598 -51393 -177281 -440936 -378378 -217016 -164498 -203231 -445199 -265729
5760b65729J36190m5294O9031Q798j18356J51073L04155j24861q3958R9699R1602
$$ -265729 -129539 -174833 -105802 -97004 -215360 -64287 239868 115007 31049 130748 222350
5749B22350J64157j12733m13257R3176L51295K21486k86707j65716l48656l25440
$$ 222350 386507 273774 -139483 -46307 304988 526474 239767 74051 -274605 -600045
5739f00045K03389P27660k23530n17704Q9038P58125p0664m45261r1029P2797
$$ -600045 -396656 331004 107474 -410230 -321192 436933 366269 -78992 -170021 -97224
5729i7224M75276L68097l13734l82915m65338K98745L42583L1499k75647k34601
$$ -97224 378052 746149 432415 49500 -415838 -117093 225490 256989 -18658 -253259
5719b53259k41723J07647M69737K88361n5037L3323j149o3038j85487O4322k23227
$$ -253259 -494982 -387335 82402 370763 315726 349049 347900 284862 99375 163697 -59530
5708e9530K49595L22679J57610k30025k67505J78644K48827p6789n71560l0682
$$ -59530 190065 512744 670354 440329 172824 351468 600295 523506 -48054 -78736
5698g8736N00888O34700n26295n70500j23441J46656j54125m9755l27667o16150
$$ -78736 422152 1056852 530557 -39943 -163384 -16728 -170853 -220608 -548275 -1164425
$$ [...]
##END NTUPLES=NMR SPECTRUM
##END=
