##TITLE=Analysis number 311041
Compound Code cc 40301
Book Reference 382/82/1
Project Code adrs
Chemist Name simons
##JCAMPDX= 6.0         $$ Bruker NMR JCAMP-DX V2.0
##DATA TYPE= NMR SPECTRUM
##DATA CLASS= NTUPLES
##ORIGIN= Bruker BioSpin GmbH
##OWNER= NMR
$$ XWIN-NMR		Version 3.5
$$ Wed Jun 29 13:54:49 2005 GMT Daylight Time (UT+1h)  MAYBRIDGE\NMR@NMR_250MHZ
##.OBSERVE FREQUENCY= 250.131544655141
##.OBSERVE NUCLEUS= ^1H
##.ACQUISITION MODE= SIMULTANEOUS (DQD)
##.ACQUISITION SCHEME= undefined
##.AVERAGES= 16
##.DIGITISER RES= 18
##SPECTROMETER/DATA SYSTEM= dpx250
##.PULSE SEQUENCE= zg30
##.SOLVENT NAME= DMSO
##.SHIFT REFERENCE= (INTERNAL, DMSO, 0, 16.522)
##AUDIT TRAIL= $$ (NUMBER, WHEN, WHO, WHERE, WHAT)
$$ ##TITLE= Audit trail, XWIN-NMR		Version 3.5
$$ ##JCAMPDX= 5.01
$$ ##ORIGIN= Bruker BioSpin GmbH
$$ ##OWNER= NMR
$$ C:\u/data/dgb/nmr/ADRS/5020/pdata/1/auditp.txt
$$ ##AUDIT TRAIL=  $$ (NUMBER, WHEN, WHO, WHERE, WHAT)
(   1,<2005-06-29 13:54:21.97 +100>,<MAYBRIDGE\NMR>,<NMR_250MHZ>,
      <created by zg, POWCHK disabled, PULCHK disabled
       configuration hash MD5:
       62 19 C7 07 E1 42 D1 B7 37 6C 3D D0 77 39 F9 E6
       data hash MD5: 64K
       59 34 12 60 5D 9A 8E C5 C8 B9 1C 9E 18 8D 6D 28>)
(   2,<2005-06-29 13:54:37.54 +100>,<MAYBRIDGE\NMR>,<NMR_250MHZ>,
      <Start of raw data processing
       ef LB = 0.3 FT_mod = 6 PKNL = 1 SI = 32K 
       data hash MD5: 32K
       F4 76 83 20 8B 50 48 B1 4F C6 2F A8 6A F9 D4 2D>)
(   3,<2005-06-29 13:54:39.75 +100>,<MAYBRIDGE\NMR>,<NMR_250MHZ>,
      <apk 
       data hash MD5: 32K
       60 7C AE 56 86 16 27 62 F9 70 7A 6C 45 09 6D 00>)
(   4,<2005-06-29 13:54:40.49 +100>,<MAYBRIDGE\NMR>,<NMR_250MHZ>,
      <abs ABSG = 5 
       data hash MD5: 32K
       D9 BC 94 F6 D4 99 35 26 98 39 61 8D 1C 53 25 26>)
$$ ##END=
$$ 
$$ hash MD5
$$ 9E C5 8E 8A A2 F6 4F 14 B6 ED D4 94 1C 0E ED 9D
##$RELAX= 
##$RELAX= 
##$RELAX= 
##$RELAX= 
##$RELAX= 
##$RELAX= 
##$RELAX= 
$$ Bruker specific parameters
$$ --------------------------
##$DU= <C:\u>
##$EXPNO= 5020
##$NAME= <ADRS>
##$PROCNO= 1
##$TYPE= <nmr>
##$USER= <dgb>
##$AMP= (0..31)
100 100 100 100 100 100 100 100 100 100 100 100 100 100 100 100 100 100 
100 100 100 100 100 100 100 100 100 100 100 100 100 100 
##$AQSEQ= 0
##$AQ_mod= 3
##$AUNM= <au_zg>
##$AUTOPOS= <36 >
##$BF1= 250.13
##$BF2= 250.13
##$BF3= 250.13
##$BF4= 250.13
##$BF5= 500.13
##$BF6= 500.13
##$BF7= 500.13
##$BF8= 500.13
##$BYTORDA= 1
##$CFDGTYP= 0
##$CFRGTYP= 5
##$CHEMSTR= <none>
##$CNST= (0..31)
1 1 145 1 1 1 1 1 1 1 1 1 1 1 1 1 1 1 1 1 1 1 1 1 1 1 1 1 1 1 1 1 
##$CPDPRG= <>
##$CPDPRG1= <>
##$CPDPRG2= <>
##$CPDPRG3= <>
##$CPDPRG4= <mlev>
##$CPDPRG5= <mlev>
##$CPDPRG6= <mlev>
##$CPDPRG7= <mlev>
##$CPDPRG8= <mlev>
##$CPDPRGB= <>
##$CPDPRGT= <>
##$D= (0..31)
0 1 0 0 0 0 0 0 0 0.06 0 0 0 0 0 0 0.0002 0 0 0 0 0 0 0 0 0 0 0 0 0 0 
0 
##$DATE= 1120049661
##$DBL= (0..7)
120 120 120 120 120 120 120 120 
##$DBP= (0..7)
150 150 150 150 150 150 150 150 
##$DBP07= 0
##$DBPNAM0= <>
##$DBPNAM1= <>
$$ [...]
##$SUBNAM7= <"">
##$SUBNAM8= <"">
##$SUBNAM9= <"">
##$SW= 20.6930455092707
##$SWIBOX= (0..15)
0 0 3 0 0 0 0 0 0 0 0 0 0 0 0 0 
##$SW_h= 5175.983436853
##$TD= 65536
##$TD0= 1
##$TE= 295.16
##$TE2= 300
##$TE3= 300
##$TEG= 300
##$TL= (0..7)
0 120 120 120 120 120 120 120 
##$TP= (0..7)
150 150 150 150 150 150 150 150 
##$TP07= 0
##$TPNAME0= <>
##$TPNAME1= <>
##$TPNAME2= <>
##$TPNAME3= <>
##$TPNAME4= <>
##$TPNAME5= <>
##$TPNAME6= <>
##$TPNAME7= <>
##$TPOAL= (0..7)
0.5 0.5 0.5 0.5 0.5 0.5 0.5 0.5 
##$TPOFFS= (0..7)
0 0 0 0 0 0 0 0 
##$TUNHIN= 0
##$TUNHOUT= 0
##$TUNXOUT= 0
##$USERA1= <user>
##$USERA2= <user>
##$USERA3= <user>
##$USERA4= <user>
##$USERA5= <user>
##$V9= 5
##$VALIST= <valist>
##$VCLIST= <CCCCCCCCCCCCCCC>
##$VD= 0
##$VDLIST= <DDDDDDDDDDDDDDD>
##$VPLIST= <PPPPPPPPPPPPPPP>
##$VTLIST= <TTTTTTTTTTTTTTT>
##$WBST= 1024
##$WBSW= 4
##$XGAIN= (0..3)
0 0 0 0 
##$XL= 0
##$YL= 0
##$YMAX_a= 338505
##$YMIN_a= -364746
##$ZGOPTNS= <>
##$ZL1= 120
##$ZL2= 120
##$ZL3= 120
##$ZL4= 120
##$ABSF1= 16.522
##$ABSF2= -4.171173
##$ABSG= 5
##$ABSL= 3
##$ALPHA= 0
##$AQORDER= 0
##$ASSFAC= 0
##$ASSFACI= 0
##$ASSFACX= 0
##$ASSWID= 0
##$AUNMP= <proc_1d>
##$AZFE= 0.1
##$AZFW= 0.1
##$BCFW= 0
##$BC_mod= 0
##$BYTORDP= 0
##$COROFFS= 0
##$CY= 12.5
##$DATMOD= 1
##$DC= 0
##$DFILT= <>
##$DTYPP= 0
##$F1P= 14.0000005364418
##$F2P= -0.99999901652339
##$FCOR= 0.5
##$FTSIZE= 32768
##$FT_mod= 6
##$GAMMA= 0
##$GB= 0
##$INTBC= 1
##$INTSCL= 1
##$ISEN= 128
##$LB= 0.3
##$LEV0= 0
##$LPBIN= 0
##$MAXI= 10000
##$MC2= 0
##$MEAN= 0
##$ME_mod= 0
##$MI= 0
##$NCOEF= 0
##$NC_proc= -5
##$NLEV= 6
##$NOISF1= 0
##$NOISF2= 0
##$NSP= 0
##$NTH_PI= 0
##$NZP= 0
##$OFFSET= 16.522
##$PC= 1
##$PHC0= -84.07224
##$PHC1= 2.836226
##$PH_mod= 1
##$PKNL= yes
##$PPARMOD= 0
##$PSCAL= 4
##$PSIGN= 0
##$REVERSE= no
##$SF= 250.13
##$SI= 32768
##$SIGF1= 0
##$SIGF2= 0
##$SINO= 400
##$SIOLD= 32768
##$SREGLST= <1H.DMSO>
##$SSB= 0
##$STSI= 32768
##$STSR= 0
##$SW_p= 5175.98343685301
##$SYMM= 0
##$S_DEV= 0
##$TDeff= 65536
##$TDoff= 0
##$TI= <Analysis number 999999
Compound Code 99
Book Reference 9
Project Code 9>
##$TILT= no
##$TM1= 0
##$TM2= 0
##$TOPLEV= 0
##$USERP1= <user>
##$USERP2= <user>
##$USERP3= <user>
##$USERP4= <user>
##$USERP5= <user>
##$WDW= 1
##$XDIM= 32768
##$YMAX_p= 500996250
##$YMIN_p= -794760
$$ End of Bruker specific parameters
$$ ---------------------------------
##NTUPLES= NMR SPECTRUM
##VAR_NAME=  FREQUENCY,     SPECTRUM/REAL,   SPECTRUM/IMAG
##SYMBOL=    X,             R,               I
##VAR_TYPE=  INDEPENDENT,   DEPENDENT,       DEPENDENT
##VAR_FORM=  AFFN,          ASDF,            ASDF
##VAR_DIM=   32768,         32768,           32768
##UNITS=     HZ,            ARBITRARY UNITS, ARBITRARY UNITS
##FACTOR=    0.157963299565203, 1,           1
##FIRST=     4132.6476996994, 0,             0
##LAST=      -1043.33573715361, 0,           0
##MIN=       -1043.33573715361, -794760,     0
##MAX=       4132.6476996994, 500996250,     0
$$ Real data points
##PAGE= N=1
##DATA TABLE= (X++(R..R)), XYDATA
$$ [...]
19804 466443 523621 839636 762674 697750 603776 622371 209928 238411 403440 512228 591837
19793 591837 543700 346046 364519 602677 679531 676137 594331 334593 -30665 -104545 -60352
19782 -60352 -197763 -329201 -274837 -115540 -20024 2585 299864 389692 376236 390554 209288
19771 209288 145729 227097 255603 306700 435393 650707 661421 822155 869486 1061487 1038487
19760 1038487 1006907 803923 709261 616673 298041 301835 342551 240213 183493 232636 583388
19749 583388 923041 880102 612016 452921 472364 373916 293450 195316 110847 71846 136248
19738 136248 68527 -251444 -349386 -298319 -183606 -78499 90235 205674 221426 486649
19728 486649 484154 283497 365943 254147 276122 429795 344837 272236 280300 441311 441191
19717 441191 470212 393164 404068 463030 563447 578868 641425 480135 323515 466425 736829
19706 736829 748664 637465 742506 694484 797530 813383 722456 714481 508500 481262 621047
19695 621047 756449 704021 676002 615419 322549 328321 241105 269867 302589 315808 367711
19684 367711 306292 376005 446630 434939 242181 218433 217040 65602 30726 -38957 -250077
19673 -250077 -224472 205529 150984 262057 427555 316875 195360 22797 77107 105144
19663 105144 58809 236283 440086 521118 327808 317196 597695 847462 791325 684108
19653 684108 626929 466559 305173 357198 505727 457361 278309 359471 423554 526953
19643 526953 606067 773902 614420 597103 482247 655868 836604 788826 682047 729275
19633 729275 812987 917648 843190 752721 651801 480432 474850 373053 235110 463766
19623 463766 785153 729960 740958 816000 1144194 1103751 927079 1042437 1314316 1357937
19613 1357937 1275099 1330456 1184721 839121 773629 630125 519660 640408 676310 611432
19603 611432 589824 502111 622456 622684 829066 1148512 1430031 1124834 907157 1009379
19593 1009379 1079502 1087635 1253431 1228935 933139 656940 698705 867383 954149 808538
19583 808538 822131 833915 604066 537979 635822 640989 664966 573483 561265 473988 566927
19572 566927 740853 966941 956685 777854 559819 507929 604440 723470 954196 1130102
19562 1130102 1059936 1146866 1047380 1337360 1587451 1605336 1649533 1856933 1956838 2046152 1750157
19551 1750157 1648728 1589586 1401765 1391864 1480212 1741006 1788827 1968868 2203682 1975474
19541 1975474 1989406 2068324 2157140 1988880 1741687 1842974 1859194 1898742 1974121 1827440
19531 1827440 2133100 2264290 2015766 1793007 1983064 2010585 1984459 2004345 1779585 1810638
19521 1810638 2280449 2314393 2190090 1784605 1486463 1642445 1877345 1996076 1952092 2167079
19511 2167079 2127495 2074699 2129713 2453199 2425840 2511776 2628045 2514584 2737048 2831480
19501 2831480 2982701 2991172 3088910 3450393 3426305 3776423 3833640 3883942 4100965 4289839
19491 4289839 4469769 4692411 5047938 5669310 5919617 6157001 6532590 7120030 7650505
19482 7650505 8236747 9006191 10052128 11233211 12858155 14268819 15572554 16863322
19474 16863322 18704526 21165298 24590667 28947607 34657855 42463120 53559977 68673237
19466 68673237 89510748 116751766 146941468 171820865 181633513 172012415 147828017
19459 147828017 120541462 98405836 81820575 69789436 60679385 53829578 48340028
19452 48340028 44064564 40614792 37788499 35699648 33895592 32338337 31267665 30118128
19444 30118128 29112787 28295731 27608391 26843381 26200681 25700295 25314414 24710777 24171793
19435 24171793 23913729 23990628 23991842 24057634 24182104 24268846 24063987 23955321 23705846 23156000
19425 23156000 22397758 21472296 20723709 20042847 19258572 18722927 18097106 17540991 16766823
19416 16766823 15916808 15282865 14925812 14623443 14422141 14227134 14170671 14233641 14139542 14296211
19406 14296211 14866256 15631854 16574948 17948225 19195464 20363576 21842750 23860603
19398 23860603 26220930 29358997 33784647 39868295 46792959 52945910 57193022 58654894
19390 58654894 57846444 56438926 54960314 53296784 50370043 46507563 42918570 40570503
19382 40570503 39078791 38370754 38131303 37831893 36892339 34834092 31952734 29293016 27375437
19373 27375437 26001802 25009506 24047003 23566785 23089789 22845318 22400093 22156772 21956678
19364 21956678 22328733 22874970 23482747 24343135 25444354 26724700 28244226 30207722 32762943
19355 32762943 35994233 39818352 43958936 48174293 51573402 53786862 55301840 56623931
19347 56623931 58755677 62313358 67977680 76165127 88029512 103970157 124086490 146502917
19339 146502917 167731204 183618831 191226833 189422129 179320826 163834337 146756532
19332 146756532 131243679 118936653 109638836 101606089 93478521 85751031 78332011 71662505
19324 71662505 66515886 62131970 58397257 55468282 53146011 51253595 49931261 48677509
19316 48677509 47659640 47067157 46628470 46167875 45680974 45612782 45828414 45692470 45951069
19307 45951069 46655927 47582225 48935798 50717703 53011229 56258255 60085663 64901229
19299 64901229 71074885 78185622 86236427 94314428 103528041 115085618 130537300 149398826
19291 149398826 169744149 187628853 199110228 201623735 194393535 179125377 159855222
19284 159855222 140055577 123123465 110151303 100279434 93380399 88638758 85411103
19277 85411103 83372887 81910243 80049110 77234274 73291974 68383326 63608845 59631134
19269 59631134 56093552 53291221 51018856 49093200 47602158 46344890 45198345 44427355
19261 44427355 43734248 43005997 42576517 42143663 42066183 41906224 41777335 41788006 42099079 42651219
19251 42651219 43515132 44939340 46255717 47716067 49022825 49540803 49277249 48873382 49309692
19242 49309692 50950567 53579029 57296314 61353344 64595723 66960860 68899262 70995196
19234 70995196 72379997 70991630 66384117 59397449 52412102 46673524 42646844 39571186
19226 39571186 36823976 34461962 32349210 30085216 28244482 26495353 24805216 23551869
19218 23551869 22457188 21564349 20857112 20237014 19919700 19647804 19007893 18317916 18020975
19209 18020975 17643109 17107482 16389064 15894702 15561978 15089586 14687638 14319773 13897458
19200 13897458 13331483 12780971 12575596 12290447 11982571 11470634 10974305 10754295 10204245
19191 10204245 9842833 9463943 9187305 9012204 8617802 8383241 8166336 7930951 7748506
19182 7748506 7384788 7116562 6877088 6827932 6640056 6379101 6078430 5961581 6020191 5882129
19172 5882129 5743308 5574226 5352266 5036110 4866477 4878114 4712987 4789822 5033840 4975444
19162 4975444 4700124 4630941 4431013 4260204 4080338 3900309 3667911 3552444 3470768 3311644
19152 3311644 3080792 3067079 3231780 3154339 2945596 2904743 2851005 2748970 2816569 2877872
19142 2877872 2889754 2703067 2671814 2642680 2344747 2348921 2566793 2496816 2072368 1665935
19132 1665935 1620572 1684451 1841556 1833692 1795894 1750539 1610817 1574202 1703096 1737950 1758693
19121 1758693 1818046 1776680 1693920 1668556 1832457 1974580 1936414 1848697 1861034 1793605 1678526
19110 1678526 1598362 1488524 1262518 1355429 1634312 1485219 1388873 1486142 1504619 1371390
19100 1371390 1468444 1494971 1374988 1294058 1137862 1279676 1481503 1474307 1614947 1840153
19090 1840153 1759650 1669940 1566452 1246344 1319672 1369183 1309307 1207126 1068729 1217182
19080 1217182 1202939 1036462 983947 962730 712393 652373 705269 507715 543344 434589
19070 434589 588097 605299 681985 810189 684191 812103 952727 919282 656015 698934
19060 698934 777237 864699 716106 702858 516867 436071 777026 963546 741191 602780
19050 602780 672886 804623 771602 520064 585293 782800 908177 1037019 976257 811219
19040 811219 717125 555328 637972 627081 626163 679168 806651 958422 911525 806685 697140
19029 697140 668811 719685 634934 465610 235370 305141 579577 710791 661922 522828
19019 522828 678370 452109 394242 503874 647772 440838 228791 244145 284360 312949
19009 312949 443337 458888 442959 447953 310378 359266 296240 106768 -20031 197645 329122
18998 329122 313623 382608 513329 538876 654621 710789 560437 473654 558610 438605 471706
18987 471706 352925 202552 538746 627183 465030 278605 345880 365071 490997 567828
18977 567828 660068 537553 418283 444828 260092 130265 330396 487245 460995 504131
18967 504131 580779 549471 452687 336347 376256 455450 441383 424955 306217 248614 402903
18956 402903 570247 274645 321401 428386 242036 128306 92688 76759 390706 471007
18946 471007 374250 363778 471891 292533 192769 139784 90933 279267 277469 472959 359854
18935 359854 215097 440607 398996 253097 324153 319682 342008 448849 505530 494463 378326
18924 378326 392360 157610 -31030 -85022 -183567 -126874 116439 137171 129755 107400 98191
18913 98191 150034 186398 359294 410347 177420 292713 222912 363291 387958 270814 127124
18902 127124 -40509 -87845 78 126677 118885 250445 309251 114689 -117934 -260535
18892 -260535 -231943 17914 234189 504638 478670 471306 516408 519597 547244 340307 199303
18881 199303 471548 407888 237430 391736 596191 867545 1066321 1124014 1003699 706940
18871 706940 479675 551577 655364 660195 647293 768931 787156 748814 919438 1204057 1362396
18860 1362396 1496290 1580064 1432516 1314838 1304339 1096915 981497 1070478 1151525 988636
18850 988636 826472 864629 732581 497729 581495 665335 756975 712582 606826 543161 663071
18839 663071 547425 593139 648566 684302 874845 710536 731901 574759 299765 175924
18829 175924 -10105 163112 257485 395423 629825 655057 609023 607171 594259 468438 365561
18818 365561 637415 675107 566897 589190 551049 474334 308101 205695 308761 480128
18808 480128 473521 530950 307178 542190 563122 339075 124803 56952 232157 522394
18798 522394 482711 613111 646806 549226 603979 423291 251852 152134 320654 317969 378353
18787 378353 452970 393347 372504 344076 287732 218505 323511 401193 520983 557463 400996
18776 400996 390545 702374 938164 945594 746228 952642 708583 252662 57457 63882
18766 63882 156073 86638 100942 16574 115405 134776 244004 382098 338504 361957 545238
18755 545238 462512 468498 355635 336514 352224 322715 382553 388202 524894 834141 709050
18744 709050 500650 210612 220240 249626 177898 107428 5988 109104 251247 325477 298380
18733 298380 357530 417284 370194 85717 64972 362807 401305 196987 30101 152564
18723 152564 373390 340029 391134 213842 -5033 112111 327992 210290 62269 187599
18713 187599 504840 297453 251356 206170 414799 413259 373301 165275 153188 142055 259133
18702 259133 491596 158175 -140578 14771 286559 188690 254531 162808 -2572 -130601
18692 -130601 -111363 -144349 -64537 -26312 191747 335654 123331 -31323 -118518 195142
18682 195142 297969 97865 22412 16552 -146351 -41915 50840 22204 -74634 -169696 -5444
18671 -5444 284585 387184 244009 223848 112785 -58914 -242614 -97716 138190 330144
18661 330144 512005 330804 117398 140158 385780 258716 -167074 -325121 -171432 75703
18651 75703 234735 336631 269321 199982 355937 370854 31703 -5541 21321 133036 163399
18640 163399 -7889 -51114 183005 297208 163248 -101213 -220453 -84575 -70408 -10202
18630 -10202 68078 108473 -66902 -137335 -183922 -169784 -177658 -133154 13218 176929 268054
18619 268054 284161 263952 109823 137567 278526 479005 469769 275894 204449 94929 -114493
18608 -114493 -224394 -81048 46355 346363 260151 155675 102507 -66288 13175 -133774
18598 -133774 8211 427235 380522 137084 -44427 -90065 -53472 -76625 -178994 -174077 -334643
18587 -334643 -314812 -108832 -61102 -247351 -457791 -422192 -194585 -367926 -378698 -292664
18577 -292664 -134089 -49798 -128938 -281181 -101067 120500 -76336 -74619 229003 136848
18567 136848 -96867 -439396 -375017 -203850 -77084 -138711 -9908 -144477 -301214 -217104
18557 -217104 150083 438922 256041 183100 42876 -30186 -82512 -329225 -310021 -346923
18547 -346923 -397980 -384288 -149361 -231699 -493444 -449722 -310226 -339837 -286889 -197099 56667
18536 56667 7569 -44926 -139714 -172517 -193246 -248136 -99689 -103645 -220020 -116641 168526
18525 168526 -30907 -90286 135955 118895 -94771 -111549 -135405 -115331 -17713 111086 4031
18514 4031 -187355 -241179 121822 -9081 -149031 -273228 -261086 -112947 -209522 -52017
18504 -52017 207322 195783 137806 70152 117030 143775 222148 167846 73318 -62579 -75505
18493 -75505 -176691 -289148 -152176 218515 421522 335347 268067 278595 301080 115543
18483 115543 -127673 3718 374111 283974 -154524 -120984 -71060 -242642 -323962 -167826
18473 -167826 -266382 -379326 -522335 -327563 -238935 -226846 -343923 -309131 -198592 41097
18463 41097 67174 206559 149197 37080 -92066 -109157 -168293 -191207 -382875 -499271 -430240
18452 -430240 -275919 124059 210573 -1775 115645 77994 -6774 -137306 -332748 -256505
18442 -256505 -32394 69451 93355 170966 107260 -39627 -70751 -36862 -102709 -273185 -317049
18431 -317049 -271538 -122553 -81026 -67480 -70893 -178698 -126284 175541 159008 83880 211806
18420 211806 53758 40997 -56265 -314162 -328962 -31622 212757 223618 152348 183389 21098
18409 21098 192695 -24193 -139573 -194046 -23868 51079 70576 -169821 -528937 -460657
18399 -460657 -259972 -218026 -161911 -47905 162759 256678 67913 169543 -8494 33583
18389 33583 48741 76925 -14384 -219106 -310565 -51838 113499 184546 108338 12470 4274
18378 4274 -177730 -125768 -150951 -151442 209395 256648 63582 181176 88598 -76632 -109119
18367 -109119 -68007 -131822 -238149 -97003 183484 256246 167210 129259 77786 -151991 -324228
18356 -324228 -363230 -163629 -111114 70506 -110758 -325084 -171387 -124124 -60177 115757
18346 115757 94744 5991 36006 -28777 -40007 -122809 -227055 -384893 -395456 -288130 -121716
18335 -121716 -48595 -459120 -411071 -86348 -23696 -89225 -204343 -8132 149940 341387
18325 341387 495479 418376 165944 137000 92651 66052 -148334 -305923 -106006 -9906
18315 -9906 36993 133898 -70065 -220083 -304747 -273696 -448222 -578266 -468233 -274372 -201220
18304 -201220 -172953 -104733 -78602 -131010 -151463 -5120 -173808 -351513 -162271 -62022
18294 -62022 141049 -24564 30308 -36482 -287623 -292906 -164087 -172805 -236113 -234397 -1423
18283 -1423 105807 -50788 73462 217226 295400 74591 -47488 -107657 -221904 -195738
18273 -195738 -108684 -13552 -180073 -322552 -302829 -311219 -376748 -378188 -347692 -252649 -136084
18262 -136084 -125846 -196073 -205149 -140016 -84928 -129448 -140926 56367 80073 -119120 36446
18251 36446 112127 322102 239423 108879 -74238 18778 120025 83033 -73005 -90403 -136780
18240 -136780 -208490 -303130 -248224 -109631 -136201 -189945 -163866 -111840 -125112 -39655 -46603
18229 -46603 -137481 -34211 20848 102960 253172 187269 76022 -162343 -344348 -416374 -204799
18218 -204799 -213779 -205131 43354 63034 165601 230646 243513 43654 -186983 -77942 33208
18207 33208 -53286 -326980 -383758 -308059 -240379 -122366 -268944 -392320 -251328 18861
18197 18861 146159 283887 121280 -23686 -7258 -272691 -552854 -474126 -556835 -755836
18187 -755836 -510488 -377137 -408309 -346127 38882 281772 161220 58448 80598 47011
18177 47011 94993 -66796 -402329 -590877 -414878 -302612 -330309 -173681 238944 369332
18167 369332 96647 -87855 -21815 -232987 -253221 -173027 -300947 -287607 -144540 212877
18157 212877 335326 384997 277834 81149 65609 -10005 86897 254811 278013 -59133
18147 -59133 -219007 -243507 -208146 -212793 -318968 -327585 -230409 82985 231511 231444 389328 99398
18135 99398 -231500 45829 332398 204183 72307 97427 351567 414235 176038 147205
18125 147205 -39012 -128534 -272476 -184285 -230790 -167685 -88431 -69163 -138689 -41407 59584
18114 59584 -15575 -11502 -15756 -67641 -241199 -309829 -166635 -16186 77375 -208651 -338232
18103 -338232 -154555 266862 281521 371255 326606 182255 104928 113362 240493 307410 74197
18092 74197 -212783 -225673 -38677 5791 -150477 -8098 108212 -169779 -122773 89847
18082 89847 258664 -40648 -289439 -300905 -260658 -347926 -418354 -299795 -273053 -388139 -342424
18071 -342424 -249721 -359852 -431618 -179905 -123203 -296283 -342131 -287929 -373810 -77924 17924
18060 17924 84140 -1075 -250521 -468683 -528674 -407690 -321140 -175245 -222353 -200026 -74286
18049 -74286 -101250 -173786 -14042 -117340 -483 84216 -40134 4184 327872 210278
18039 210278 190638 177966 53485 -3880 150071 -63538 -194157 -177249 -239882 -258092 -214472
18028 -214472 -89211 256816 319691 202163 -39383 -200817 -176304 49449 -89722 -353944
18018 -353944 -452197 -421726 -24011 48733 -58935 -217431 -159203 -253269 -424915 -298762
18008 -298762 -319666 -425042 -201975 -51811 -119360 -32432 49139 -14602 162918 102665 -202497
17997 -202497 -307893 -264065 -2829 3753 -119461 -200496 -471499 -327686 -317923 -395070 -629565
17986 -629565 -617365 -421005 -375714 -244808 -307341 -268003 -179158 -62544 105872 -121979
17976 -121979 -264916 -239253 -253327 -48540 -119464 -125135 -162780 -268451 -272916 -299510 -247271
17965 -247271 -312537 -559274 -738972 -651115 -384105 -124728 207670 195666 -15652 -50292
17955 -50292 -106599 73423 147020 102979 133811 51185 -29135 119764 339169 509166 612190
17944 612190 526867 236472 -73186 -54280 31335 -3875 8222 71110 82112 -174474 -354707
17933 -354707 -147712 202492 201126 202596 414485 424025 306129 140307 49692 -89058 -91428
17922 -91428 -190109 -129794 -21389 -192165 -303134 -15635 -68053 -170054 -370868 -542939
17912 -542939 -472390 -479210 -531339 -561112 -485433 -573137 -596020 -540811 -327466 -357693 -297026
17901 -297026 -331876 -226948 -259608 -144890 -127484 -61586 -257976 -232221 -84518 -62510 12441
17890 12441 -14930 164196 267650 485441 442222 261313 67107 -328622 -178837 -101050
17880 -101050 3566 314177 344787 75645 113545 40601 -21687 -124382 39833 -90954
17870 -90954 -83275 40518 -194146 38325 -127570 -171562 -263512 -353205 -224733 -401621 -641620
17859 -641620 -495997 -212862 -121430 -76584 -99126 -82999 -53390 121463 284476 -16597
17849 -16597 -318615 -326624 -324770 -122437 74818 48764 -151423 -209022 -141965 -32632 -11396
17838 -11396 -306473 -432966 -318389 -127690 -174510 -407317 -327445 -227373 -391063 -313642
17828 -313642 -308839 -301269 -334426 -335411 -335044 -175838 -459857 -504067 -445997 -321085 -141937 -63166
17816 -63166 44701 -22453 -150583 -362703 -381471 -248838 54464 48606 156962 209712 340706
17805 340706 309108 5529 559 138636 -30046 -28034 36068 -107601 -235676 -9161 -14760
17794 -14760 -146087 -239077 -149247 -188629 -180306 -230925 -135739 -194845 -145793 -70488 35072
17783 35072 92329 128065 -10832 95942 68703 -114357 -70432 40609 -103242 -95911 53779
17772 53779 120958 164858 211442 147732 -144697 -268041 -374761 -559704 -623042 -610323 -325045
17761 -325045 -300154 -323118 -245825 -241504 -318956 -334614 -394103 -449389 -380268 -239086 -88756
17750 -88756 -37354 -111434 -26525 79996 114652 162403 132130 252719 189387 3912 -174933
17739 -174933 -182689 -93732 -9670 -111763 -290868 -357696 -486522 -632905 -434413 -335195 -201314
17728 -201314 3208 32440 43977 72687 93037 -113230 -146479 -10889 46522 129150 -71918
17717 -71918 -324825 -357931 -343145 -287276 -280494 -452966 -787944 -791765 -529951 -178277 -227162
17706 -227162 -385697 -160393 -198759 -196927 -24391 18628 31032 123660 5814 40785 -24480
17695 -24480 -64268 -430664 -543541 -211065 4467 -93958 -20603 -22429 52713 -99317 -244942
17684 -244942 -183962 -94606 -306030 -272781 -135266 -104316 -3290 -69602 -9215 -103710 -191326
17673 -191326 58197 229800 88328 -179291 -167605 121532 6486 -74536 -104846 -21859
17663 -21859 106484 247130 112012 104635 185633 274773 45798 -225140 -171725 -231209 -310448
17652 -310448 -207365 -323042 -424791 -175239 -39154 -110586 -262427 -111271 -162287 -296147
17642 -296147 -258801 -38710 72135 184317 119976 24845 108795 -178302 -335243 -117975
17632 -117975 194751 276412 70248 89499 62626 11510 -100204 39338 -14260 -276807
17622 -276807 -109638 208392 360794 148637 135519 11736 105227 89395 116619 -123547
17612 -123547 -135603 -840 71099 -135584 -174361 -61448 -67715 25304 -137600 -134602 -106312
17601 -106312 55213 271844 200566 -153024 -351703 -52742 -31910 -332975 -461364 -445204
17591 -445204 -369779 -439090 -405957 -294380 -278800 -104206 -6795 91631 229806 277398 379575
17580 379575 497515 234063 80889 59871 -87707 -272035 -137726 -76060 -47866 -41602
17570 -41602 17277 -1181 -2846 -242315 -371187 -460336 -187573 -9741 -118715 -270714 -240604
17559 -240604 -236326 -447302 -512402 -358726 -116599 12447 42807 -109260 -73409 103384
17549 103384 -14688 -188314 -239918 -343333 -344275 -264977 -115001 -48826 -70967 -129719 -229640
17538 -229640 -453187 -140710 -29585 -121579 -86571 -154598 -290638 -135328 58576 -55016
17528 -55016 -94705 -83603 -56860 -89412 -216018 -278553 -253625 58311 117775 124868 -18915
17517 -18915 -1868 -163582 -153221 -245520 -305521 -155478 -368479 -568020 -438279 -350779 -422639
17506 -422639 -411489 -293681 -306426 11437 268422 44351 37245 51674 94671 161210 422992
17495 422992 159038 -135439 -215598 -168688 -105418 -55581 -83597 -67376 -137287 -215097 -195699
17484 -195699 -235168 -161136 42466 50771 12415 34785 -300556 -346789 -321491 -188130 -11147
17473 -11147 -78686 -51328 74536 175794 -31728 -177966 -145703 -4355 193644 251871
17463 251871 37343 -75960 -50843 -38072 173604 155267 76421 113352 128063 57801 -12789
17452 -12789 -134494 -180353 -232600 -7607 4096 -62489 -19112 55761 99761 176978 313213
17441 313213 335931 269808 377517 400301 227447 324026 417251 374076 218040 170108 133301
17430 133301 70007 26962 389252 553486 315658 110962 3391 -47969 -58688 201280
17420 201280 322006 253548 349113 185712 189451 -73050 -63274 19776 -41646 14697 255000
17409 255000 454582 239299 -66834 -281191 -150602 81232 16349 -150293 -182853 -61952
17399 -61952 -137017 -68124 177833 278431 339727 171457 60035 -65979 -47163 -136929 -13075
17388 -13075 -161982 -247070 -152064 -217203 -249866 -110200 106521 86044 43415 -20462 167231
17377 167231 11499 -185082 -15062 -56825 -218127 -420853 -709730 -619479 -344152 78849
17367 78849 212361 52437 38618 -45265 6571 15429 -18424 -87463 -117185 -56832 -147006
17356 -147006 -131536 -103249 172916 27195 -307611 -408838 -382134 -179514 -138889 -167790
17346 -167790 -226075 -174893 63429 47585 52606 60734 126264 -36825 -190656 49343 153909
17335 153909 172717 133003 -73714 -377685 -397589 -384696 -225656 -74444 19095 -62992 -108463
17324 -108463 -78025 32967 26629 -142715 -246164 26075 33892 4406 -218965 -361149 -238600
17313 -238600 -228379 -116449 -10285 -51321 -94734 -132166 -76223 -57783 -197433 77761 91313
17302 91313 27796 116947 -19310 -43127 -113187 32715 72980 -97490 -253172 -576309 -564915
17291 -564915 -414193 -323950 -62496 -95157 -30958 67971 43701 163674 157895 21643 -178449
17280 -178449 29680 2229 56422 -27066 22696 -3657 -176390 -275203 -192778 -124285 -78333
17269 -78333 -15767 -15982 -92663 65230 43314 -250839 63925 158160 -71328 -78227 -208149
17258 -208149 -235473 -81275 -52332 54109 31502 -61816 38456 162704 -32425 -221762
17248 -221762 -123187 -144844 -253151 -143583 -59425 221055 117869 -285329 -372316 -230606
17238 -230606 -75296 29890 -111637 -231253 -245768 -136403 64941 -90432 -239241 -267407
17228 -267407 -231971 -168037 7183 54618 43210 20297 63859 93260 67122 -17345 30223
17217 30223 133045 244315 230340 -5057 -154601 -55086 -128101 -104320 -338421 -462615
17207 -462615 -415219 -441753 -205712 -194084 -284117 106257 39166 -115094 38597 15097 -91939
17196 -91939 134215 154831 32840 -51749 -179551 -281794 12610 -1050 -40075 -31274 69037
17185 69037 59838 -100455 -139549 -154505 59620 235015 166567 -114675 -276419 -442263 -370928
17174 -370928 -304954 -432476 -476231 -323656 -403462 -477615 -452802 -410130 -111826 -64419 -55225
17163 -55225 4136 133641 34960 76217 120411 -125436 -99335 -206752 -167803 149707 100722
17152 100722 162789 99934 17091 -181963 -250379 -82513 84236 16016 -150278 76387
17142 76387 100266 42972 208339 343417 229875 -31202 -342833 -393816 -515520 -523784 -321688
17131 -321688 -206855 -2716 49774 -8915 23083 24719 153456 63385 -38672 85030 214555
17120 214555 395721 473442 286909 187745 273778 312482 379320 207146 70610 49903 -30770
17109 -30770 -373988 -591235 -662760 -394365 -262017 -256232 -180951 13931 86421 18209 -34060
17098 -34060 60145 226101 344048 354806 223876 69358 25219 -92774 -96250 5240 -138429
17087 -138429 -122664 8144 48005 33283 -195903 -192721 -217264 -215517 -106271 -36830 20351
17076 20351 187209 -36178 -195549 -280946 -319323 -272425 -286435 -189368 -63803 -229697 -136446
17065 -136446 -217387 -182312 -203964 -381895 -376819 -10325 -24891 -250095 -253622 -251508 -383728
17054 -383728 -386345 -422954 -297325 -131320 62214 -133919 -308451 -202824 -189940 -329239
17044 -329239 -645931 -455400 -213715 -104575 -158096 -267835 -172533 -221293 -133657 -87893
17034 -87893 55522 63369 -190223 -456854 -561634 -539874 -512006 -411885 -229386 -128061
17024 -128061 -291167 -338379 -164066 22158 -17988 -45900 78542 213841 -133797 -282892
17014 -282892 -297701 -404177 -415615 -409479 -308725 -197081 -159111 -160392 -282631 -286192 -389895
17003 -389895 -209201 -77860 -258095 -261481 -151373 -260754 -335235 -347902 -362832 -386312 -568489
16992 -568489 -418368 4341 217903 299719 77491 46690 -77611 -23557 -142691 -371113
16982 -371113 -330447 -261534 -270161 -205428 -106397 22949 -13448 -16852 -139725 -12467 133734
16971 133734 259142 215304 85704 -94179 -131191 -218662 -304551 -193326 52355 -132404
16961 -132404 -327737 -148569 -11079 295855 544522 525948 402853 352175 138524 125633
16951 125633 92877 -19878 144907 335910 433279 195378 -117806 -118434 -370068 -402646 -196870
16940 -196870 110156 164689 92204 184131 294865 149902 -180965 -279044 -231426 -238474 -277073
16929 -277073 -230945 4455 316448 174095 -143180 -137618 90262 170955 213841 -99808
16919 -99808 -232551 -245087 -335280 -132481 32279 -179472 -310590 -284861 -443150 -428578
16909 -428578 -220599 -61823 -50258 -90145 -139931 -128389 -165091 -262570 -40354 113461 -37579
16898 -37579 -50028 205488 366228 456463 457049 335496 20913 -288741 -332568 -272224 -164981
16887 -164981 72873 175478 85822 -87708 -373683 -455135 -411412 -362714 137731 474517
16877 474517 371901 133921 104749 171646 193514 214583 309561 47171 -129143 -222408 -298235
16866 -298235 -104410 30030 18778 64890 124086 69872 34805 -58338 -112427 -9505 58255
16855 58255 -28845 -19991 268 -128354 -383443 -380361 -159547 101701 85807 -120912 -49870
16844 -49870 -15854 -10966 -29756 -121126 -175352 -35786 -87854 -203321 -122314 134137 306025
16833 306025 139460 -40918 -35308 116600 148995 -73775 -221688 -186275 -17654 107019
16823 107019 -68819 -355642 -469418 -419559 -443976 -411355 -125423 88883 -31094 102335
16813 102335 252788 106434 -114545 -21403 277022 288265 70717 64907 137785 176561 257700
16802 257700 110713 -181188 -408368 -507521 -550198 -396831 -270011 -3816 -85265 -55541
16792 -55541 -14505 59915 70241 -130329 -408600 -313454 -291581 -293044 -411314 -457408 -486003
16781 -486003 -225565 -142554 -101538 -128646 -208459 -119691 -133925 -767 117018 243419 390567
16770 390567 158322 124158 97172 -53686 -9507 -16375 -157917 -315394 -333242 -259166 -333036
16759 -333036 -334191 -459402 -217260 -2155 -1148 124653 100475 635 -139328 -231835 -279558
16748 -279558 -201834 -280893 -406837 -377808 -151921 36694 7586 198550 161643 67585 1380
16737 1380 157359 213294 -28806 -74424 -168860 -284683 -356889 -441583 -231898 -29915 -3224
16726 -3224 111934 28716 -153283 -90518 111837 72719 -451 26155 -25650 -157290 -79256
16715 -79256 -111685 -281844 -229716 -154736 -67530 72536 93746 27725 140874 193971 26645
16704 26645 -93082 -35674 -23286 115136 111683 28235 82900 -80889 -160780 -134879 -33045
16693 -33045 -309267 -326513 -292859 -114585 -99288 -48935 57383 171835 -58481 -199139
16683 -199139 -346919 -79488 61001 33559 -97045 -125539 -105754 130490 -28413 -275837
16673 -275837 -100307 612 -134290 -263055 101642 169558 -43586 -177640 -220814 -82423
16663 -82423 62125 122729 131471 185596 64253 121444 133005 315287 356966 368926 75081
16652 75081 -34429 135230 263927 -52296 -209550 -205634 -304194 -212618 -56824 -54595 36707
16641 36707 113447 -117724 -233225 -156161 -134500 57369 55490 8000 -54338 -79644 18894
16630 18894 42740 15336 7755 -68006 109791 167902 -82306 -319427 -438577 -308297 -57316
16619 -57316 45232 184326 346084 383108 577386 547451 311620 141170 95651 161432
16609 161432 142313 102524 -23342 63009 93955 -57571 -230271 -268220 -42860 -34380 103675
16598 103675 268301 404061 320413 446509 278769 128108 137931 288671 205107 178151
16588 178151 42558 41875 -83278 -22373 -113560 -225932 -318017 -278190 -97665 -61616 8060
16577 8060 169684 386540 251767 220635 240187 246446 225898 210185 10413 -210156 -90998
16566 -90998 -83616 -111010 171389 420314 431470 267701 162053 153693 63649 48186 38815
16555 38815 -119001 -183221 -288676 -144151 -42282 91108 55033 11420 -95791 -244529
16545 -244529 -359198 -342436 -226043 -122090 -62680 -108159 -93705 -92912 -46519 193724 241306
16534 241306 461729 282965 257765 154671 104923 188061 186621 80955 -138252 -558303
16524 -558303 -623026 -391956 -287585 -150545 -41371 104393 181433 161009 174206 -16695
16514 -16695 -117978 -43457 53743 55914 -6831 135559 243327 49928 -174555 -362307 -206901
16503 -206901 -207090 -139573 -230623 -306478 -69289 52883 574 -673 -27189 -33467 7036 -216171
16491 -216171 -342876 -280371 -188077 -279910 -281292 -156843 41097 -18687 -109865 -148546 -29948
16480 -29948 -8735 35101 87058 4154 -210390 -283367 -163496 1929 -266939 -217918 -102898
16469 -102898 14984 -124708 -248927 -314144 -153705 -70208 -15957 -78616 -75948 -51267 -56706
16458 -56706 37771 -76305 -202960 -271021 -126570 -82004 -19899 176454 -11416 19228 302915
16447 302915 262627 213212 -5603 -131812 -133608 -164229 -85297 -37043 39725 115714 147760
16436 147760 -20515 -40255 16024 -127974 -120391 -114808 -99075 -91466 -20148 -54937 -68194 106987
16424 106987 361525 403861 326225 213670 194072 175801 -35112 -57080 -155075 -221969 -357174
16413 -357174 -289940 -224626 -255036 -355749 -238888 24022 -165119 -215171 -206032 -159058 3516
16402 3516 343447 519812 404996 328247 298866 297571 128299 151335 237352 262208 27546
16391 27546 -42413 5310 -20824 -55327 -127448 -250256 -151542 -83916 -316468 -388532 -158654
16380 -158654 -37925 -36943 -114243 -275522 -91643 -12077 -72291 -177834 -77363 -181602 -145078
16369 -145078 62695 214638 374717 443606 253859 145209 251134 314037 285649 183825
16359 183825 -53876 -290638 -121101 129042 243550 35723 -218450 -442929 -539869 -337559
16349 -337559 -242229 -237696 -126443 -115386 -220493 -147589 -18538 -182843 -346898 -378970 -328533
16338 -328533 -333881 -76540 -6934 -48310 -136054 -329723 -562932 -342515 17696 -103590
16328 -103590 -148673 40248 118969 228205 258024 54484 84265 155275 233724 246788 322486
16317 322486 108069 -97562 1560 74877 197552 208925 160889 75129 56453 215025 283701
16306 283701 198716 349926 120150 65803 252937 189124 294231 243420 188565 -39704
16296 -39704 -309342 -295179 -103342 9927 -99313 -178225 40352 115755 175980 249929 334559
16285 334559 119569 227161 229892 177745 -109478 -272271 -100434 -119943 -120593 73986 234440
16274 234440 146982 187485 186578 244915 235510 -52466 -171491 -112951 -50750 51128 -21578
16263 -21578 -67852 -222738 -263887 -193171 -282694 -362312 -327996 -28776 -15690 -120245 -120455
16252 -120455 -266915 -96381 -71866 -180151 -162636 -301407 -343617 -34296 58815 1867
16242 1867 -220051 -363647 -473665 -453543 -209774 -136154 17509 42826 -13175 27522 74011
16231 74011 108895 210562 169847 -28168 -227386 -10968 205789 195174 107719 19272 124228
16220 124228 21338 -227872 -396662 -160302 8257 44157 7433 51936 15265 -92693
16210 -92693 -76529 -253136 -210458 -179555 -231009 -368040 -325747 -84546 -138573 -58530 -167788
16199 -167788 -111318 -61871 25932 121539 90532 122877 191589 246727 177199 83002 196874
16188 196874 159119 -23726 -121352 -67779 -126928 -247695 -279224 5199 235786 -28933
16178 -28933 -313314 -416819 -334574 -98011 222260 172959 -93144 -3221 135222 196556
16168 196556 215836 254574 336401 579437 420291 349641 294490 2285 -254533 -531098
16158 -531098 -515000 -237786 -81258 -1328 -68171 -207322 -201053 -55357 244195 307330 101335
16147 101335 -152853 -66972 18587 76765 -84049 -173073 -81095 -213543 -315845 -251281 -124014
16136 -124014 -258489 -295455 -199039 -228306 73121 267273 205680 222843 -46687 -54284 -39063
16125 -39063 -187582 -43737 251135 353165 200382 -107 -34132 102215 142106 33494
16115 33494 127353 241354 106162 7074 29427 -138539 -346394 -418737 -105935 -12910 223489
16104 223489 251884 -1242 3284 192652 434319 290124 218695 227032 248622 67637 -40500
16093 -40500 -234062 -183774 42627 122859 372263 538301 243909 176588 380245 461418
16083 461418 402717 403955 394356 19484 -76187 -6607 21804 214634 431172 344150 180637
16072 180637 -60425 38453 176583 118835 115052 222563 154944 -33739 -152775 -88377 -95593
16061 -95593 -179973 -235543 -289589 -149267 -202987 -416895 -444285 -303184 -269915 -369818 -410236
16050 -410236 -168727 89402 238554 121875 30628 202523 179238 297018 432015 402162
16040 402162 146559 115817 95614 -33107 -154325 -264984 -381296 -349891 -203248 -257030
16030 -257030 -271106 -257546 -235309 -151052 -3775 -138025 -185799 62289 115579 205546 227749
16019 227749 139976 99343 135193 414461 211716 -192288 -506966 -439273 -465496 -583941
16009 -583941 -611132 -291881 -28521 -89297 -127914 -75462 78828 209037 364768 350281
15999 350281 256151 229772 -73690 -258266 -80865 -91967 -152753 -167745 -4117 121565
15989 121565 221953 343386 237753 -8765 -165571 -154290 -113339 -143761 -54178 90716
15979 90716 131300 19899 -69414 -3249 47876 -168188 -245217 -2797 114907 140064 310037
15968 310037 388862 496929 439886 290178 266742 242227 214890 99624 26965 -202140 -189147
15957 -189147 78520 268072 294463 164511 52090 104415 -23325 126486 90150 -188747
15947 -188747 -263004 -113283 -212650 -236789 -267520 -390918 -410214 -38569 161991 220907 22170
15936 22170 -282005 -135054 -71237 -315433 -436051 -137733 103585 54155 164265 60008
15926 60008 -116831 -6304 95747 -124014 -14516 417 46964 125685 368540 328637
15916 328637 282209 257181 291398 265085 218070 376855 674443 634254 413570 169922 320940
15905 320940 297436 290156 435911 433496 526120 441826 153843 -49820 95012 418889 516721
15894 516721 504956 541443 370576 102405 -45665 -218093 -399189 -411534 -366773 -316492
15884 -316492 -242032 -305562 -276013 -39825 41802 -86425 -66391 89702 8819 85447 29416
15873 29416 -53595 -14932 151377 101965 161359 41112 -97491 -146813 -32935 -62175 10562
15862 10562 59916 -1899 -60011 -46844 -99307 -69467 9330 73830 1142 170911 120534
15851 120534 163548 362627 325213 235385 361361 344536 209267 271010 253477 40564 -145559
15840 -145559 -3020 96762 -35184 2924 83896 23890 -74696 -40628 103155 189312 165755
15829 165755 188948 125928 179803 300493 357125 433904 325465 -44587 -232360 -275966 -22212
15818 -22212 31220 -23213 17938 231091 306341 379609 339214 405566 322477 113667 351858
15807 351858 413027 177251 98318 150908 283311 424730 372519 271441 210755 132993 255684
15796 255684 359184 369592 119439 115974 92176 94406 128499 173019 89216 -40842 -3763
15785 -3763 -65577 -25705 -32397 -109705 -43095 274238 158440 200545 33034 152992 180214
15774 180214 203823 367419 431135 524042 546217 269402 112816 292523 454332 263619
15764 263619 9605 -48444 428877 528325 361828 347772 258800 231649 134069 -20277 24954
15753 24954 139655 417900 592972 789589 449950 139447 207572 289218 224189 203274
15743 203274 50982 -29233 31988 131058 -182171 -256992 62728 199327 167426 156993 124263
15732 124263 66555 3569 -52368 -248804 -190695 63629 18864 -234826 -252395 -315764 -150458
15721 -150458 120088 118415 27648 -2014 170296 23562 -241428 -225049 -96116 -113688 42258
15710 42258 239470 189216 156237 175491 170904 344405 597217 536209 577473 414640 111933
15699 111933 -147318 -91213 -116670 12111 323467 198236 238114 301267 305669 503020 637776
15688 637776 818522 768411 431556 309394 325334 454105 558654 454806 550724 600784
15678 600784 600151 394378 410291 312448 261821 336735 140906 89045 180678 174324 -24116
15667 -24116 -133944 -244473 -235231 18386 230134 272980 100254 50660 -63586 -207845
15657 -207845 -272458 -31946 86675 231731 286170 243349 160644 90224 -149029 -306487
15647 -306487 -225922 -271827 -251044 -210225 -173282 -54332 8781 64460 -67364 -450745 -373419
15636 -373419 -149611 -70344 -46208 -21275 122964 65379 -163933 -211815 -327015 -194080
15626 -194080 59569 229849 323208 224121 173745 169586 90288 -57881 46419 214022 310250
15615 310250 302824 99916 -47247 -86840 277680 442658 294953 207257 -25493 -221298
15605 -221298 -4336 195510 290576 451472 415875 190248 158844 236341 231590 344866 464855
15594 464855 366252 254236 158927 -27166 -154148 -39932 82304 128595 13896 -205046
15584 -205046 -95323 -133132 -23218 -18609 205100 408286 337412 381035 254846 150787
15574 150787 214036 161382 189467 237048 274403 411463 453138 248331 84153 13720 -107239
15563 -107239 -159215 -219821 -315099 -326778 -82446 82792 -34709 -40258 -91975 32690 147508
15552 147508 251024 345956 436150 230586 -28615 -188921 -183953 -304125 -337661 -233951
15542 -233951 -140117 -241073 -171713 -26193 -140871 37275 165195 231282 192329 72056
15532 72056 64475 25800 -201417 -272300 -149366 -23428 8484 8594 156292 324635 296182
15521 296182 85190 -67478 -102207 -117480 -154895 -399913 -388108 -163586 -178123 -193990 -141589
15510 -141589 59255 6594 71929 209454 214067 185015 194489 245388 324695 355010 414155
15499 414155 376644 182089 118146 -34871 77177 335607 162579 108586 340827 276150
15489 276150 509874 584494 517099 311434 151530 -64934 54240 201759 297029 243860
15479 243860 43491 5966 -53021 -203955 -289219 -282009 -149441 15678 74309 259544 360359
15468 360359 285552 281476 272665 196359 175764 215113 125107 -117487 10539 103143 237620
15457 237620 347501 323235 241380 160300 305745 386748 199742 177802 188621 167146 -34630
15446 -34630 -118668 -209089 -211718 26763 160094 115301 -35747 12266 160863 102681 110111
15435 110111 331073 347304 338667 303704 147911 149367 213271 149943 -1784 -193091 -176336
15424 -176336 -70326 -145762 -237530 54021 345750 294638 136004 -81358 -97541 -49116
15414 -49116 59259 -64953 110939 75134 -125351 -69943 76062 118724 -940 -85403
15404 -85403 -272348 -435279 -430084 -139690 -159868 -90570 212087 433187 427122 428725 318766
15393 318766 220753 -227898 -286567 -120676 -45204 -162846 26007 253421 205451 178546
15383 178546 193887 88027 91570 8729 -136797 93042 175497 112136 -49306 -45186 43167
15372 43167 196188 337323 322973 156830 72833 -134734 -63302 205847 270252 254327 229590
15361 229590 229768 196036 192076 183243 295016 418482 594250 717968 618948 669267 616729
15350 616729 424519 722230 686682 373439 170903 75456 253117 226564 18884 -8
15340 -8 -71720 -229957 -174997 -452420 -400029 -102168 -31307 227214 267431 155099 56796
15329 56796 -2800 200720 269633 395679 349421 300596 342316 371171 266478 379289 287527
15318 287527 255395 302854 200154 316297 282290 203759 238767 360936 270207 184571 98794
15307 98794 -166162 -218064 -75115 161868 219908 234326 1324 -126597 -55940 171250
15297 171250 186913 336149 386851 454253 438511 175580 -89886 -227975 -177260 -26859
15287 -26859 -20505 -128722 -67537 -22873 -4671 105036 106904 188558 64152 264096 271051
15276 271051 412166 234438 -94933 35636 -28585 212926 430212 468913 395328 303500
15266 303500 328124 309265 252512 114713 284393 143726 -6334 156384 143595 155941
15256 155941 253343 675095 549698 305032 -19967 -102690 -15950 191351 14519 -118135
15246 -118135 208103 527503 569218 739844 949233 743816 563673 526063 484437 394637
15236 394637 280935 277511 255411 334039 347093 345786 64628 124165 227370 352992 191594
15225 191594 105577 124353 134639 306985 408504 251875 150128 239192 282392 61663
15215 61663 -40327 26424 52194 37921 154889 -42961 -266237 -174895 -8554 283110
15205 283110 328575 198776 365506 430744 280093 69605 2369 51595 -6185 257267
15195 257267 165767 106141 282457 398949 192512 -25016 -112543 46 6860 70244 27494
15184 27494 -83706 -114439 -53991 -22884 99393 341892 326712 363484 302737 160187 168016
15173 168016 287150 172936 -40529 -155557 -91950 99086 169127 214998 168184 175864 4275
15162 4275 80090 352677 383093 243978 245804 213558 350938 399377 224909 142871 -156910
15151 -156910 -56015 45850 259564 226697 161785 211609 374537 370184 306633 174790 55143
15140 55143 -113174 -139897 -7347 -21733 63953 180791 361482 315108 50686 20944 258358
15129 258358 450701 327579 382856 451286 495794 432150 289893 250946 290954 401104 444290
15118 444290 387010 575720 678457 617038 412996 276799 337969 219638 360992 442314
15108 442314 329719 229567 253088 2954 -14864 179786 289298 181729 350321 394618
15098 394618 216218 193968 243680 360037 416163 791945 894409 701602 476449 690976
15088 690976 657455 487514 261429 192560 112011 163270 355542 404222 377091 314940 226671
15077 226671 173639 36968 85681 394310 536934 484179 362696 160453 91988 249003
15067 249003 485755 495626 482340 608361 497801 412888 387865 325880 275744 405198 344185
15056 344185 171165 -129350 -130343 157479 120205 340837 467037 247063 221589 385183
15046 385183 378082 290514 155134 123142 268999 374426 465996 324124 89346 -164290
15036 -164290 -133609 64424 205309 216165 290833 280121 233964 224367 321768 323804 328470 555324
15024 555324 486062 337812 363590 161427 247822 338956 249443 411205 604108 611995 450122
15013 450122 334704 487131 511700 178009 -132453 -110458 45025 173339 400760 371584
15003 371584 565158 889457 826274 571229 508148 350731 185550 149568 -53871 -269776
14993 -269776 -190369 17727 81948 143090 181584 213258 234858 403382 349370 195629 186277
14982 186277 359960 342277 368659 436064 333129 72264 -12337 -8762 58356 88894 84575
14971 84575 247563 357524 451470 355722 254809 285716 359498 264981 2447 -155037 -69853
14960 -69853 323602 413947 399848 613725 450339 260420 257833 257864 235016 216685 356357
14949 356357 468327 612298 285107 265741 301331 150298 269547 458175 706691 552886
14939 552886 496788 218305 -33863 -76703 -14972 -76467 110217 395439 310314 231031 297345
14928 297345 376252 328609 478425 362321 334934 268699 123682 -3872 226803 725994
14918 725994 753295 589938 596554 441451 180788 65105 128449 70892 42579 110538 122280
14907 122280 307897 315484 168767 127758 165872 269442 376688 420708 468177 559917 438443
14896 438443 426842 155252 80083 171341 316785 310046 172117 240617 53644 35459 349826
14885 349826 504932 534621 600913 665219 952839 893748 740691 684472 356329 48624
14875 48624 209456 240550 315871 265355 357942 446869 389016 351562 506588 768833 589762
14864 589762 462753 384442 397691 544059 514302 483309 576496 459654 475712 474890 501836
14853 501836 583499 440714 532299 511420 397238 485443 399851 191392 152116 94144 146609
14842 146609 91813 99078 294728 188347 330932 213556 202028 250906 148076 120973 368523
14831 368523 586542 636313 486943 529755 469887 513534 504761 229821 221493 309933 392937
14820 392937 454511 321152 218799 293228 219679 250072 284727 373750 426953 240934 272318
14809 272318 395831 312167 262910 228440 -22230 -34282 185961 307484 203278 238764
14799 238764 280700 363989 435010 482212 764891 731379 596039 578749 368838 310818 484784
14788 484784 352423 329089 347884 389150 269447 330046 275574 241941 81706 112069 -180086
14777 -180086 -400906 -293325 -131737 -53499 -10299 -28898 134124 308683 402584 471878
14767 471878 497186 508321 267405 138975 134840 251776 224379 325402 401756 421843 492365
14756 492365 350725 398909 660668 577093 355647 250750 213972 365579 597090 490212
14746 490212 383294 475492 588389 636964 416899 200804 -21337 -12367 19212 242430
14736 242430 299197 279697 262188 169560 266818 256417 281002 256694 595807 756487 844757
14725 844757 795278 599989 463106 296821 313472 313768 549278 641315 744962 569422 275667
14714 275667 381160 371494 278151 96148 -108553 -28224 167986 421072 452095 266933
14704 266933 259266 351985 399358 455634 504964 400291 486026 402294 199550 102853 125798
14693 125798 22832 94022 423553 576414 433471 297229 309257 295002 285047 387155
14683 387155 429206 658308 488142 503255 542750 451837 416170 512308 404147 202323 1450
14672 1450 8583 -15555 268946 444301 176997 78134 64156 207337 267981 189160 61091
14661 61091 167267 192406 217067 225457 282532 478416 484455 275014 229911 92235 59265
14650 59265 133722 92950 106567 351542 217243 129735 240830 392233 328883 446763 519975
14639 519975 449058 541793 573877 391201 103567 121563 243880 199635 204942 325212 181919
14628 181919 44923 128961 302784 232189 507423 752871 785983 680668 556254 730584
14618 730584 931618 956503 882611 730105 449280 122848 -27464 -29934 -70876 108713
14608 108713 339071 502485 245428 172690 391258 667820 802194 634968 231650 203343
14598 203343 121870 -78069 -54575 7744 178403 242640 426317 421772 484532 555153 368290
14587 368290 310945 259306 405324 524262 774607 730307 632711 491445 424536 343145 279263
14576 279263 537135 456238 424302 332066 417905 304013 152552 -43222 -14425 69136 251288
14565 251288 282254 7396 12267 29403 25405 17097 77923 105243 153264 215976 311109 261021
14553 261021 212917 306491 460293 486686 611703 649777 309702 128584 144376 102839 80759
14542 80759 -4917 -54281 164909 204698 368498 588886 538040 732457 848613 767602 685705
14531 685705 439631 409964 299156 289660 204064 134318 -34609 81998 274267 442205
14521 442205 362524 321816 268063 31886 97828 385254 435332 376934 201630 181432 322968
14510 322968 334231 317971 405159 428381 324003 275598 315238 57318 110877 248678 540725
14499 540725 453947 402352 532986 358023 307016 171241 172249 289742 384739 519819 509888
14488 509888 567670 464988 131026 41426 161739 444144 455528 462713 439368 432766 532052
14477 532052 474607 302847 177265 330095 436561 429958 368492 405083 573116 484962 292591
14466 292591 213403 242818 179279 398619 608123 623507 503541 388352 189810 252934
14456 252934 433156 527094 531900 590999 470083 414093 383637 400668 531650 437396 266836
14445 266836 276715 259095 205937 36203 61777 333746 380654 414609 445485 524951 692075
14434 692075 556040 320446 152145 186323 380464 372626 258032 71249 30157 300984
14424 300984 361600 296337 354759 458030 459723 660649 604379 446894 544781 509011 441796
14413 441796 401049 354058 466369 440665 485500 524423 478853 507652 738544 800294 593960
14402 593960 282072 475667 482662 410496 274876 261867 280090 337501 339168 157063 86259
14391 86259 274151 567801 826825 743198 769766 834111 625584 553730 429853 209761
14381 209761 405675 318216 208261 -10230 -50483 144058 303471 574078 667279 645804
14371 645804 327498 209468 232112 204969 245349 609601 902728 823054 715448 625603
14361 625603 546351 299163 388255 344581 494557 256293 185316 380829 380994 569604 872361
14350 872361 956874 1077599 1011261 763111 914937 807514 589347 522735 534250 634208
14340 634208 424381 436151 487084 403150 542577 629484 661362 764423 772959 830339 861447
14329 861447 700574 706511 815017 1014248 871520 629298 438307 425261 703832 567633
14319 567633 419329 271283 303163 513853 641520 543564 490643 480958 430817 426719 355970
14308 355970 156504 341830 412528 352106 535785 775175 840781 992873 1027530 1007376
14298 1007376 871452 736874 452702 454924 399918 347697 648763 566841 609075 622351 729427
14287 729427 692879 485508 449356 316641 326023 542041 461086 488719 679826 609061 486365
14276 486365 632009 802905 926311 923477 711846 648315 648972 563510 590999 553174 547938
14265 547938 708566 733344 706233 552452 501089 520510 447593 403499 553995 708925 654617
14254 654617 675877 402224 417705 691551 576225 608810 488996 527828 523390 493879 384556
14243 384556 606578 813263 856397 1040510 808287 673537 551247 449452 583055 693732
14233 693732 612836 550150 457115 508331 581028 514897 722747 684311 563309 628706 449705
14222 449705 342266 485162 595949 480409 418007 493193 642297 568273 582440 572553 556928
14211 556928 746346 1066176 1197987 1038021 688139 498884 515747 568906 499933 781997
14201 781997 869256 944307 900584 859564 457802 312997 583394 1018575 928393 760085
14191 760085 607237 604738 885302 822175 587700 486384 498380 483126 479971 710218 872226
14180 872226 1038258 1041225 885160 871343 1012358 802763 859860 955196 815137 563270
14170 563270 493534 434378 309026 400011 649735 751238 861673 787947 747913 693648 569649
14159 569649 448247 473386 435277 558645 940497 1004235 800873 861113 931567 713058
14149 713058 392947 236674 491645 736905 860813 715901 733227 681366 594676 681894
14139 681894 698141 857689 1007163 1149275 1126717 848415 964480 892291 721308 499051
14129 499051 409982 470691 674713 657371 532913 504711 614427 692286 585733 613559 565869
14118 565869 503132 499222 570635 587567 631900 844988 751693 469689 277555 179804 394702
14107 394702 457257 397991 666503 902263 1057394 958696 659243 502550 710069 1041482
14097 1041482 1139495 1094099 1123362 1315690 1069276 826082 740174 605534 462892 278860
14087 278860 450740 680404 553929 460696 599243 820331 803018 710513 433263 468278
14077 468278 794442 884243 575319 505050 509488 514907 437829 480542 696737 772929 729891
14066 729891 1067846 938228 829245 736271 795719 779814 580055 567175 506345 516397 610820
14055 610820 585169 551131 497831 612376 551339 648336 536906 460778 480848 520058 588370
14044 588370 768301 725791 780196 747846 656564 776214 848448 630326 778641 1036740
14034 1036740 1004285 704527 434053 256966 426199 616315 724983 913557 897197 1027701
14024 1027701 1129424 905832 719791 591362 499015 712681 938954 980985 1218035 1265481
14014 1265481 850208 736793 951481 791171 602677 661368 774784 708712 716899 822662
14004 822662 960634 882667 863176 982378 974082 1115570 1247320 1182745 1129670 890512 910960
13993 910960 1122834 1148395 984285 651124 737869 778625 786083 962811 979844 1047088 972661
13982 972661 845212 920664 922202 771518 748908 807903 764331 993702 976379 919628 965001
13971 965001 1161536 1351117 1228513 1251603 1205842 1019202 715309 655263 791838 1195606
13961 1195606 1214890 1031193 991544 1067654 896710 956471 1075089 923159 721800 842646
13951 842646 1193585 1371602 1084849 894832 988962 1204587 1046358 866431 725131 850290
13941 850290 783331 581189 459563 334426 305735 462184 654663 697623 842143 590055
13931 590055 316166 430590 208332 123829 477821 530014 446111 455443 389533 533601 455818
13920 455818 524512 552813 451800 372011 377540 383692 491936 678842 793853 777746 713823
13909 713823 703984 788713 912622 897921 687528 666727 825492 775374 658501 778279 955852
13898 955852 934726 795912 627734 533384 842424 1125426 985648 743262 674455 937248
13888 937248 1052698 953510 985761 952643 1002899 981863 996316 1200739 1183044 890573 876682
13877 876682 745561 766968 1022107 1060302 1063192 672484 675084 775834 795154 970645 1037460
13866 1037460 1021567 973757 982259 1236169 1029049 964988 1139382 1121680 929404 982141 1270473
13855 1270473 1305182 1222982 1076082 846801 888365 904525 919631 870967 950371 862741 949298
13844 949298 917294 668385 613384 666900 603327 875137 1058204 853457 652477 898331
13834 898331 1052013 1033716 974327 1013420 1180273 1076760 856052 709774 716992 988193
13824 988193 1240863 1407200 1274245 1151544 1135992 1132426 1110142 1212643 970496 638199
13814 638199 813028 1017341 946013 814308 688331 730516 932586 1059367 996054 1168427
13804 1168427 1387232 1303187 1246096 1269260 1258971 944584 954060 1149446 1412784 1487844 1282993
13793 1282993 1113919 944489 698858 493440 317574 476968 629555 685406 817955 1004299
13783 1004299 881971 816207 793031 801810 808644 868629 908491 868227 845366 937422 972318
13772 972318 914645 962998 883855 806837 948988 794813 438621 481703 791374 821235 703644
13761 703644 847723 848988 838955 893772 905124 871877 696383 736516 761043 807140 841966
13750 841966 1003644 869322 979480 985133 988451 1067430 1094709 877969 814746 1100111 1270799
13739 1270799 1291541 1437331 1634942 1433997 1079978 1055243 1022752 1097074 1036948 802450
13729 802450 804765 921566 875423 954918 1196590 1213386 1078696 975872 846330 616013
13719 616013 619399 939005 1001092 801654 888283 1078371 1229944 1224521 934725 842878 937808
13708 937808 1003080 1079515 1046885 986939 898093 764576 815928 804038 754172 820809 851831
13697 851831 852469 857455 1068388 1175003 1069793 1066021 1063204 1076341 1266982 1069392 1005038
13686 1005038 1078674 1055064 1271141 1239906 870557 639409 575811 954809 1244114 1359679
13676 1359679 1214903 1091023 869019 604116 484225 526838 643888 771458 945681 1154456
13666 1154456 1117840 1219452 1286320 1189294 1171363 1251745 1336266 1380279 1271957 1143471 900361
13655 900361 503345 611150 692661 799626 662530 684709 751442 903846 1284694 1300975
13645 1300975 1316318 1228929 1170280 959707 1025813 1101556 1143027 1368794 1296189 1220554 1047900
13634 1047900 745937 852601 1077958 1146978 1161338 1057152 880692 719520 909794 898500
13624 898500 854178 919580 822316 708227 871766 977950 1078155 1141060 1215577 1245107 1102654
13613 1102654 903011 646325 743857 881812 1013657 1021433 918250 876624 994822 1239881
13603 1239881 1453034 1601112 1407467 971533 915213 960013 1005741 1123708 1293365 1395412
13593 1395412 1526601 1496065 1175068 1253026 1575441 1479182 1416794 1368746 1331221 1286667 1301097
13582 1301097 1294789 1378270 1496269 1491380 1300696 1129957 988376 1106513 1165617 1202382 1374498
13571 1374498 1476740 1476848 1471580 1501859 1501674 1674956 1677470 1651769 1594467 1430209 1437893 1237591
13559 1237591 1369429 1371880 1145530 1047015 1171813 1343706 1350104 1299648 1127891 1074646 1067644
13548 1067644 1225360 1329439 1357013 1419513 1475028 1457753 1330293 1291837 1294499 1373789 1456581
13537 1456581 1370092 1341346 1363452 1346841 1424093 1386546 1330101 1402836 1535880 1350544 1517782
13526 1517782 1431714 1221944 1129080 1068544 1024732 1230766 1366533 1261123 1147667 1203417
13516 1203417 1231243 1231887 1258902 1326709 1406953 1402754 1260599 1416326 1203904 880696 1020230
13505 1020230 1226310 1507469 1578132 1382157 1448358 1423644 1307827 1352202 1520206 1555310
13495 1555310 1311590 1140244 1023722 1289168 1363906 1248840 1238066 1248966 1243296 1237716 1474111
13484 1474111 1638464 1535413 1235691 1011594 1152581 1221724 1224736 1397823 1467879 1450151
13474 1450151 1354765 1383307 1324034 1166373 1092575 1003301 1128892 1611285 1770887 1582265
13464 1582265 1398277 1342061 1293354 1325985 1424596 1565465 1587528 1707578 1881228 1787716
13454 1787716 1448065 1239072 1328234 1399592 1448243 1411470 1268016 1373082 1292897 1086430
13444 1086430 1376948 1771953 1745439 1580289 1520047 1599807 1422061 1489407 1740543 1624933
13434 1624933 1389246 1434167 1506129 1367844 1308691 1217579 1144603 1308654 1329324 1436452
13424 1436452 1399195 1273077 1428049 1524818 1492639 1562224 1685213 1735369 1648100 1518207
13414 1518207 1196481 1301012 1351426 1071896 1120601 1387729 1429288 1291808 1340903 1298844
13404 1298844 1387724 1471853 1525918 1509568 1444936 1442363 1484341 1617766 1754234 1632890 1836636
13393 1836636 1793022 1642207 1358154 1142052 1145503 1365742 1491266 1684840 1735418 1714253
13383 1714253 1601088 1704162 1694394 1542514 1481993 1559445 1439603 1553986 1767889 1600171
13373 1600171 1367547 1473913 1729330 1733529 1617976 1657466 1611628 1539350 1423396 1397318
13363 1397318 1402615 1302408 1230702 1187855 1099777 1139458 1236838 1149911 1264931 1298269 1413591
13352 1413591 1495582 1458164 1475346 1417801 1402413 1480426 1368944 1292107 1292069 1432449 1547482
13341 1547482 1744539 1588684 1697639 1885503 1871609 1700932 1598339 1743719 1731873 1528829
13331 1528829 1369385 1292537 1452308 1632556 1453210 1373891 1492024 1584921 1941422 2106491
13321 2106491 1850395 1535454 1508192 1442664 1438691 1668549 1868993 1739091 1693038 1715164
13311 1715164 1820376 1718664 1533653 1452941 1439848 1444237 1658601 1738532 1814833 1847926 1950922
13300 1950922 1978775 1975513 1833178 1686014 1562775 1661486 1754905 1873866 1931008 1707663
13290 1707663 1457942 1488346 1537032 1502930 1554777 1485327 1469031 1525378 1549854 1562073 1712901
13279 1712901 1558720 1388123 1435308 1446220 1465051 1470700 1683366 1842455 1836238 1612548 1467074
13268 1467074 1228208 1123385 1274682 1346937 1186265 1069142 966317 1200418 1411410 1516689
13258 1516689 1275339 1196586 1215057 1278311 1243558 1537103 1955016 1953655 1972550 1880185 1827368
13247 1827368 1788315 1597941 1523385 1562161 1856680 2181568 2065579 1744825 1763024 1936078
13237 1936078 1901517 1952816 1894840 1874013 1815517 1934374 2062364 1947961 1870943 1676473
13227 1676473 1489855 1751131 1869181 1913259 1727428 1691692 1728321 2000469 2029367 1916328
13217 1916328 1860083 1662072 1522653 1564928 1733347 1886123 2122511 2279619 2144329 1924059
13207 1924059 1908902 1988755 2049244 1956454 1886834 1629757 1769156 1814627 1762572 1701620 1871348
13196 1871348 2081080 2276848 2184983 1920766 1797457 1748673 1802293 1807707 1690435 1523537
13186 1523537 1753431 2021170 2085674 2049630 2120994 2305269 2246653 2134438 1982904 1719869
13176 1719869 1660244 1735680 2085395 2299197 2334656 2104993 2080328 2138292 2073007 1926455
13166 1926455 1867821 1925200 2040198 2223001 2147148 2233844 2255952 2152521 2187579 2154937 2271204
13155 2271204 2245866 2082083 2036081 1842890 1675393 1814788 1838736 1838567 1969477 2026406 1896396
13144 1896396 1829104 1986547 2186197 2232448 2111512 1986812 1959513 1842323 1811144 1841516
13134 1841516 1716286 1760999 1806022 1923871 1549361 1529326 1792493 2105595 2203022 2070726
13124 2070726 1986772 2114256 1972318 1892952 1870819 1707475 1627240 1730671 1906908 2002422
13114 2002422 1922535 1862840 1776258 1899774 2206424 2081274 2028206 2008679 1894905 2070733
13104 2070733 2287355 2024867 1839364 2023901 2108745 2345469 2538880 2291492 2157876 2338143
13094 2338143 2402536 2295151 2290891 2364905 2210726 2036485 2356873 2620807 2334473 2009561
13084 2009561 2079674 2241227 2198027 2221022 2138994 2258541 2109515 2001637 2111804 2130122
13074 2130122 2272898 2310425 2047397 2074017 2145251 2192493 2193768 2251083 2119164 2219468 2644177
13063 2644177 2693331 2688792 2606518 2773044 2830326 2812825 2581192 2162964 2111091 2210793 2190352
13052 2190352 2283790 2080776 2024853 2214545 2420102 2324643 2172635 1870977 1688765 1962489
13042 1962489 2156461 2222933 2268943 2497957 2652749 2863946 2981410 2987862 2866378 2495216
13032 2495216 2479339 2694294 2657832 2772918 2920904 2895175 2921518 2889729 2977713 2935734 2761760
13021 2761760 2880282 2762906 2827777 2678385 2715036 2732792 2421088 2313994 2320409 2354636
13011 2354636 2381972 2368905 2685905 2771144 2731751 2811106 2932471 2827729 2708222 2680320
13001 2680320 2611773 2445298 2271779 2238160 2192358 2508547 2604543 2464184 2526440 2744008
12991 2744008 2884374 2939985 3192190 3291459 3196737 3314929 3427865 3318460 3150886 3134727
12981 3134727 2716467 2604551 2878060 2851905 2702565 2499808 2690928 2775341 2661641 2530062
12971 2530062 2387125 2369233 2548914 2843260 3106976 3009687 2911513 2913208 2849489 2982815
12961 2982815 3026495 2978573 3001718 2851322 2711280 2358066 2342324 2328382 2377489 2446121 2476278
12950 2476278 2428769 2406320 2824970 3086532 3073051 2938286 2918040 2990486 3117509 2943014
12940 2943014 2794496 2969389 3027387 3130681 3070371 2775961 2667796 2615595 2778415 2941484
12930 2941484 2887637 2838368 2578108 2584895 2830435 2793586 2703687 2744527 2745828 2735166 2782600
12919 2782600 2755655 2781829 2689522 2571982 2503696 2309598 2224013 2447017 2524378 2422012
12909 2422012 2345406 2399247 2298207 2370073 2456145 2405744 2463103 2406855 2513308 2341575 2082710
12898 2082710 2148735 2269881 2396789 2589745 2911574 2840117 2703960 2562586 2512129 2674218
12888 2674218 2396545 2372804 2654845 2780801 2599691 2233808 2051426 2281666 2659808 2744976
12878 2744976 2769068 2766979 2785897 2782825 2718428 2747335 2948003 3093475 3138692 3326687 3437272
12867 3437272 3154414 2983775 3055291 2978129 2917667 2921716 3022898 2983225 2822601 2784020 2804618
12856 2804618 2963626 2792279 2598680 2669989 2639976 2983929 3127125 3095982 2989243 2776484
12846 2776484 2885035 2941755 2793840 2799832 2948967 3024351 3030778 2833782 2976580 3099913
12836 3099913 2943734 3102499 3036641 2973833 3042350 3086005 3189465 3183068 3023715 2942852 3015452
12825 3015452 3095174 3150582 3247596 3542258 3458754 3397291 3374656 3329665 3386433 3246412 3057101
12814 3057101 2991610 2942178 2849379 2985764 3117753 3235320 3114933 3046900 2882012 2914196
12804 2914196 2988955 2985908 3116712 2917026 3094670 3190641 3205978 3082769 3084332 3238978 3141956
12793 3141956 3093104 2996256 2909609 2846032 3018415 3171513 3072181 3025099 3331082 3416685 3421091
12782 3421091 3458254 3300469 3263091 3018686 2860361 2925723 3148997 3377537 3221624 3088019
12772 3088019 2941775 2951507 3036456 3115533 3100393 3087546 3053950 3192960 3256583 3263368 3382657
12761 3382657 3349372 3613820 3548605 3217546 3074469 3127799 3218236 3488216 3617207 3478392
12751 3478392 3337164 3362058 3416774 3476906 3475867 3643229 3815002 3670054 3697491 3747953 3496648
12740 3496648 3233388 3515972 3705660 3487046 3479862 3352324 3284950 3324792 3262815 3232162
12730 3232162 3294488 3507917 3491430 3617787 3634277 3488334 3473313 3437098 3553886 3546270 3373153
12719 3373153 3217866 3510244 3627989 3533799 3480710 3289603 3188127 3379995 3406890 3506823
12709 3506823 3762995 4001277 3869359 3612711 3588746 3645880 3778712 3861168 3640016 3545637
12699 3545637 3666772 3825096 4025691 4057404 3960611 3861802 3875275 3747101 3677897 3583869
12689 3583869 3469339 3686750 3781212 3804750 3847648 3726129 3810447 3816964 3755808 3692732 3797740
12678 3797740 3972626 4098032 3916958 3714650 3767080 3673333 3426556 3486483 3648603 3533049
12668 3533049 3556819 3967379 4096185 3924695 3969923 4150282 4193258 3983739 3987021 4042490
12658 4042490 4179194 4068699 3827505 3740827 4035467 4166734 4082639 4077260 4127946 4017458
12648 4017458 3942204 3872796 3707962 3368072 3276657 3587668 3737040 3770653 3750449 3681752
12638 3681752 3677130 3740199 3766181 3766074 3828535 3936782 4286002 4239090 4165816 4135520 3956434
12627 3956434 3846483 3956901 3988840 3914673 3842699 3885650 3926840 4027558 3961111 3899050 3878040
12616 3878040 4015736 4265845 4254840 4153031 4278206 4207550 4027638 4157417 4386743 4276420
12606 4276420 4116783 4212093 4136199 3963203 3832511 3964287 4153113 4370142 4179508 3742618
12596 3742618 3595295 3870176 4041318 4232599 4466289 4518593 4385337 4322172 4537266 4633947
12586 4633947 4529189 4353117 4184795 4604040 4602786 4438683 4181114 4312783 4502934 4523741
12576 4523741 4618365 4610646 4528025 4410277 4477272 4528243 4347517 4521188 4499327 4550819 4714142
12565 4714142 4601102 4591397 4641092 4822057 4763292 4508644 4325538 4179789 4255572 4682013
12555 4682013 4791586 4636927 4584317 4698888 4802308 4566584 4427036 4614292 4795145 4615305
12545 4615305 4569295 4655056 4733929 4620862 4436221 4608197 4764213 4723845 4831507 4893854
12535 4893854 5176021 5089931 4881748 4919797 4931407 4934115 4858947 4774107 4816089 4693669 4667590
12524 4667590 4641997 4882265 5169362 5195359 4951955 4740502 4708595 4692278 4664940 4830122
12514 4830122 4923755 5071221 4948809 4737937 4638917 4626841 4735431 4572403 4367725 4311919
12504 4311919 4281096 4529956 4383783 4438968 4519306 4368853 4268044 4254415 4435055 4707998
12494 4707998 4759722 4534212 4204746 4294021 4456941 4684758 4776247 4745826 4769311 4730125
12484 4730125 4518513 4592255 4766960 4917099 4910737 4992966 4828475 4783464 4825421 5008411
12474 5008411 5027146 5124782 5248569 5320102 5355254 5384897 5417751 5420615 5384486 5479319 5319272
12463 5319272 5179979 5006726 4877974 4868587 5072494 5082764 5075700 4958714 5032034 4989691 5097449
12452 5097449 5158755 5314946 5139251 5299475 5245283 5054164 5052305 5088699 5111662 5150926 5368329
12441 5368329 5461848 5460676 5393866 5313895 5352345 5501969 5277269 5094088 5331365 5442192
12431 5442192 5395793 5502476 5657204 5544978 5737075 5938012 5645786 5575252 5630196 5525914
12421 5525914 5477629 5503026 5563847 5545494 5254113 5336082 5433179 5271679 5297575 5445822 5380029
12410 5380029 5260906 5236705 5131260 5144392 5244838 5648370 5596697 5235112 5179440 5161302
12400 5161302 5254096 5335130 5651001 5742292 5758598 5755344 5582165 5627363 5611635 5750702 5750745
12389 5750745 5647622 5617451 5613811 5876542 5897844 5830336 5696615 5635850 5753092 5545551
12379 5545551 5358899 5581932 5690501 5496959 5344773 5356097 5480696 5524655 5615768 5429389
12369 5429389 5401333 5640730 5749104 6077413 6060377 5840671 5834141 5627102 5502621 5613193
12359 5613193 5951678 5979147 5895695 5919431 6018588 5951602 5841273 5662642 5789177 5865074
12349 5865074 5745686 5681650 5441570 5602631 5681152 5713339 5797514 5860505 6024941 6120773
12339 6120773 6047827 5843588 5669234 5446132 5758818 6052045 5944799 6072149 6108855 5945304
12329 5945304 5808709 5784029 5871364 5868993 5933613 5807817 5810189 5929305 6026626 6124110 6089649
12318 6089649 5945490 5692669 5910624 5996467 6086509 6141410 6121676 6267960 6419299 6372899
12308 6372899 6247760 6151097 6308640 6420639 6373333 6476942 6418109 6300154 6189097 6143642
12298 6143642 6136153 6274312 6294028 6096571 5987022 6180630 6410048 6534991 6249443 6000281
12288 6000281 6017046 6304777 6422493 6468842 6342640 6264967 6073758 6128842 6083624 6138698
12278 6138698 6061841 6169513 6236010 6241969 6132684 6046223 6180533 6424906 6490115 6440159 6361454
12267 6361454 6080910 6041690 6155494 6135440 6042155 6016287 6141560 6308590 6463146 6593449
12257 6593449 6665883 6621030 6618443 6616406 6526137 6468503 6414783 6285267 6234521 6085758 6144923
12246 6144923 6261433 6445471 6552943 6646229 6729926 6657042 6392944 6538327 6700145 6734250
12236 6734250 6643065 6618019 6689919 6369351 6122061 6273802 6313129 6523376 6798446 6677318
12226 6677318 6718031 6522306 6273491 6394781 6679992 6828081 6775030 6592559 6650394 6881952
12216 6881952 6750427 6525766 6159815 6385426 6592742 6600796 6504196 6540233 6564500 6560864 6575461
12205 6575461 6920911 6991117 6763069 6792882 6860190 6899843 7130579 7140708 6818468 6690871
12195 6690871 6802895 6938468 6965732 7101954 7021582 7133714 7053611 6882259 6911946 6686012
12185 6686012 6642082 6668764 6601153 6502688 6548377 6680097 6902485 6949609 6818670 6584104
12175 6584104 6734554 6829283 6651521 6740244 6968716 7006268 6980999 6997859 6910586 6813292 6929969
12164 6929969 6961189 7086348 6944693 6722369 6633319 6559489 6652052 6777083 6819637 6860831
12154 6860831 6967255 7041011 6841114 6852473 6851845 6836009 6763489 6814340 6862230 6792882 6796433
12143 6796433 6967514 7118731 7304042 7219565 7023501 6897876 6711892 6780176 6855922 6940663
12133 6940663 6903190 6786561 6699430 6798294 6897231 7017942 7007550 6956161 6929253 7127667 7141511
12122 7141511 7203952 7240175 6962685 6746717 6623393 6871634 7144057 7222428 7172849 7164413
12112 7164413 7237991 7033896 6957852 6978780 6973679 6966487 6995763 6965644 6780264 6836140 6816880
12101 6816880 7115905 7154509 6991744 7132506 7368144 7156331 7060241 7118470 7100544 6884804
12091 6884804 6917355 7182270 7240961 7162594 6830443 6772424 6944894 7036898 6913015 6990330
12081 6990330 6951191 6819234 7019027 7108445 6972595 6938960 7042170 7103778 6807883 6779816
12071 6779816 6864999 6829795 6882634 6927858 6936649 6972679 7048363 7217141 7157357 6940505 6904160
12060 6904160 6945617 7043133 7046450 6960410 6996853 7089009 7251471 7467251 7753753 7726478 7288910
12049 7288910 7053529 7035864 7062097 7138686 7309947 7361365 7058065 7012997 7224243 7173690
12039 7173690 6945215 7092055 7159468 7201540 7198461 7396284 7256413 7264390 7419823 7504803 7145273
12028 7145273 6840156 6863429 6973266 7081447 7112930 7161984 7061241 6901868 6933571 7090127
12018 7090127 7257645 7332518 7485940 7512055 7279170 7120671 6862092 6656530 6478747 6584431
12008 6584431 6714670 6582209 6485580 6529558 6644877 6700673 6791942 6792288 6708075 6638330 6691668
11997 6691668 7042885 7020563 6984432 6768812 6691800 6819676 7067497 7280215 7232493 6891991
11987 6891991 6819678 6989130 6959789 6728748 6804806 6984026 7073043 6916592 6918397 6873550 7040722
11976 7040722 7204412 7147302 7029345 6971823 6844108 6778763 7064758 7201974 6915121 6906322
11966 6906322 6983125 6861716 6897928 6890541 7058499 7101226 7023675 6801118 6671673 6771818
11956 6771818 6975067 7049427 7083646 7152162 7006736 6860276 6778880 6729449 6684966 6679457 6679892
11945 6679892 6747929 6911172 6869197 6866288 6946831 6954769 6779515 6511788 6489181 6668863 6658300
11934 6658300 6517082 6436621 6381723 6422581 6659611 6760586 6676358 6444432 6256931 6376435
11924 6376435 6612596 6773509 6901406 6944966 6689254 6452859 6483093 6483914 6552514 6623701 6537534
11913 6537534 6590102 6810265 6918708 7076470 6900329 6741350 6567812 6563327 6396829 6304671
11903 6304671 6568227 6870433 6780376 6618042 6447365 6382256 6562198 6627581 6582012 6446781
11893 6446781 6559574 6394094 6384472 6398432 6488745 6426736 6457146 6731354 6608935 6474281
11883 6474281 6539562 6608063 6591235 6586491 6425245 6177963 6228349 6320585 6344802 6372380 6382433
11872 6382433 6360121 6311361 6101552 5846666 5749768 5889860 6214856 6393411 6338520 6318042
11862 6318042 6531831 6609004 6609164 6580824 6400203 6369568 6493424 6440706 6299582 6490443 6681591
11851 6681591 6590112 6307784 6135903 6137745 6200404 6116624 6064809 6248584 6311036 6280804 6307397
11840 6307397 6299566 6201170 6041503 5954690 6086120 5981754 5959372 6082480 6300441 6082418
11830 6082418 5777914 5716348 5698001 5766391 5978309 6134232 6319208 6324454 6313819 6102321
11820 6102321 6008897 5978354 6322014 6589475 6543883 6173270 5990196 5987402 6036904 6072591 6260095
11809 6260095 6299548 6092913 6001698 6214537 6427667 6522942 6407820 5952755 5808340 5885727
11799 5885727 6047696 6279552 6174144 6035933 6106703 5929453 5813656 5912038 5900494 5821388
11789 5821388 5976134 6109832 6148009 6141023 6008259 6035574 5966630 6017568 6133542 6150460 6097157
11778 6097157 5949765 6090084 6138121 5999567 5914126 5800200 5785642 5764822 6032385 6147103
11768 6147103 5895399 5602018 5587770 5576291 5775105 5920743 5956211 5843075 5788228 5585901
11758 5585901 5628821 5643245 5446121 5350343 5477077 5297924 5236554 5260989 5477585 5329967
11748 5329967 5207707 5324986 5559523 5523459 5582119 5679667 5883897 5768026 5590226 5626265
11738 5626265 5523504 5468799 5385217 5541986 5848383 5726645 5334551 5166450 5204357 5429237
11728 5429237 5563730 5648877 5640139 5488556 5346203 5293532 5434370 5615600 5430824 5419502
11718 5419502 5613053 5544148 5322639 5407211 5527497 5479689 5546901 5594998 5436096 5463415
11708 5463415 5513905 5513601 5562248 5523081 5347666 5274219 5179821 5117545 5296396 5618615 5474600
11697 5474600 5406558 5267823 5009640 4866298 4764008 5050199 5321548 5408539 5485403 5303186
11687 5303186 5186423 5171557 5133981 5209599 5225552 5244706 5140507 5108566 5081341 5078036 5286069
11676 5286069 5395772 5262677 5200130 5448734 5498070 5367737 5317548 5325613 5041245 5050167 5048404
11665 5048404 4875791 4657367 4676454 4833569 4932439 4960964 4887834 4925415 4814734 4513562
11655 4513562 4461218 4556712 4757014 4857506 5154656 5178928 5059204 4819609 4972685 4750257
11645 4750257 4802111 4772466 4793351 4717571 4819035 4913769 4914284 5101614 5149308 5008953 4829938
11634 4829938 4631408 4619271 4613943 4602511 4689737 4728452 4773589 4707363 4700435 4632992 4660865
11623 4660865 4848604 5147364 5082605 4792406 4821064 4929820 4830780 4751894 4773085 4650013
11613 4650013 4400122 4447400 4485534 4552314 4673850 4694654 4757063 4644644 4678122 4487475
11603 4487475 4332681 4281908 4364361 4473123 4667860 4670910 4580203 4654796 4764147 4628980
11593 4628980 4889441 4824785 4399532 4071090 4391067 4406903 4344517 4222275 3962552 4263342
11583 4263342 4334233 4231056 4234259 4442038 4718619 4756217 4708894 4821455 4866339 4716189
11573 4716189 4410507 4259853 4531157 4684597 4445198 4126184 4139668 4029108 3976618 4213273
11563 4213273 4322242 4150979 4168824 4295042 4510850 4471327 4368445 4427133 4349738 4102520
11553 4102520 3959579 4080449 4197047 4152442 4068527 4064526 4310567 4468895 4332590 4041242
11543 4041242 4044420 4295290 4417685 4156181 4084574 4178397 4256522 4244442 4180291 4231773 4375451
11532 4375451 4208462 3999750 3812128 3828009 4038280 4116713 4429898 4718406 4760985 4529241
11522 4529241 4352543 4216125 4055045 3907453 3821407 3800857 3686743 3436318 3389770 3614627
11512 3614627 3755568 3875971 4084109 4117945 4103687 3958870 3768356 3850297 3899203 3865131
11502 3865131 3873232 3939183 3946172 3770575 3735502 3948955 4047897 4067076 4151914 4230991 4100791
11491 4100791 3952669 3648712 3627888 3618220 3987466 4159356 4167115 4066979 3994858 3913693 3720954
11480 3720954 3635385 3890792 4093619 3897200 3609714 3484875 3364397 3298239 3456969 3579901
11470 3579901 3697943 3736225 3925207 4112763 3990030 3803696 3795379 3713066 3544316 3883550
11460 3883550 4157085 4211834 4244775 4399983 4557259 4446676 4303615 4144398 3947580 3680977
11450 3680977 3712640 3708315 3725141 3688990 3795729 3803009 3835847 3584763 3657705 3601825 3663342
11439 3663342 3786627 3625336 3449596 3539417 3464939 3494340 3666341 3553235 3261815 3219716
11429 3219716 3188980 3298976 3536682 3559931 3454325 3358975 3351372 3289433 3191942 3368065 3365852
11418 3365852 3369764 3581579 3699594 3688017 3636888 3481810 3614203 3683578 3730111 3560294
11408 3560294 3390497 3443811 3431209 3525629 3672476 3660114 3652058 3808656 3730783 3433618 3181714
11397 3181714 3151539 3091518 3215648 3111674 3134700 3178051 3344482 3525114 3502617 3435198
11387 3435198 3169227 3204079 3326047 3370391 3438736 3505492 3409068 3682923 3899678 3679801
11377 3679801 3471867 3599292 3821792 4009840 4291429 4348117 4354818 4190396 4019371 4095741
11367 4095741 4486130 4784760 4953422 5417744 5706887 5677664 5481353 5136938 4752752 4615915
11357 4615915 4476774 4163872 4071840 4285218 4394995 4225233 4145458 4231105 4187766 3968221
11347 3968221 3976665 3852158 3685744 3354713 3321044 3521122 3786870 3907635 3819223 3747824
11337 3747824 3769077 3915639 4032248 4099591 4069590 4069423 3880931 3855036 3819795 3822643 3455017
11326 3455017 3213670 3270632 3185286 3285100 3595782 3448133 3330951 3284136 3262229 3386724
11316 3386724 3436475 3505299 3325055 3141030 3105100 3295396 3459776 3456013 3533538 3381769
11306 3381769 3301554 3289089 3344677 3308502 3319100 3485161 3342813 2967295 2917073 2894048 3070850
11295 3070850 3260052 3201957 2943063 2941566 3066298 3116361 3066287 2831614 3024834 3137887
11285 3137887 2985409 2825291 2801117 2789359 2908864 2793492 2769419 2985698 3023852 2903631
11275 2903631 3002326 2944694 2609611 2560585 2702499 2920774 3043375 3157193 3174257 2970617
11265 2970617 2763086 2766021 2857786 2780209 2836253 2848599 2596525 2452283 2589190 2745634
11255 2745634 2824181 2883219 2755643 2679971 2865410 2935254 2822952 2868507 2752646 2710247
11245 2710247 2814680 2794703 2625558 2640651 2792437 2802947 2904156 2906807 2872045 2663399
11235 2663399 2664428 2961252 3057574 3127223 3093364 3113009 2947601 2928964 2953309 2928192 2840765
11224 2840765 2915987 2928283 2784464 2694580 2852809 3079996 3078332 3201914 3323989 3190203
11214 3190203 3054507 2984021 3037400 3351645 3321161 3312460 3429342 3663788 3938380 4096233
11204 4096233 4154403 3924434 3773041 3744729 3457520 3215453 3255313 3136422 3033383 3075643
11194 3075643 3105678 2907269 2755419 2853079 2774918 2618956 2708965 2965613 3041080 2928522
11184 2928522 2932867 3061338 2937401 2768775 2919795 3056896 2983209 2561773 2311643 2461773
11174 2461773 2641644 2500024 2432727 2485901 2627417 2613223 2532454 2371936 2434083 2844459
11164 2844459 2996393 2819676 2785366 2756543 2668455 2578669 2603004 2541667 2578480 2758459 2802966
11153 2802966 2998276 3129533 2961509 2769528 2773889 2792027 2736497 2690485 2767508 2747600 2695985
11142 2695985 2585377 2581837 2618559 2801478 2729550 2706920 2498967 2640173 2958180 3291951
11132 3291951 3200643 2951028 2996996 2999543 2977564 3007486 3173048 3051957 3111624 3309788 3291578
11121 3291578 3330412 3539163 3707585 3781981 3687084 3571759 3496607 3454836 3462343 3557064 3609645
11110 3609645 3509659 3263721 2840879 2694680 2712650 2670379 2649513 2683642 2649829 2664162 2895658
11099 2895658 3100980 3086141 2776687 2844032 2957925 3225651 3120294 2762394 2849598 2947898
11089 2947898 2803501 2768055 2886744 2937353 2970866 2768189 2479850 1895610 1518746 1475714
11079 1475714 1499784 1587522 1889383 2111097 2342636 2397151 2339064 2182714 2110354 2393237
11069 2393237 2617287 2442042 2300663 2448411 2712569 2808101 2971924 3003790 2994254 3218749
11059 3218749 3273094 3254560 3323527 3268657 3105748 3206482 3351389 3400230 3673064 3716816
11049 3716816 3698384 3837955 4062558 4119473 4153967 4575610 4739064 4610774 4641502 4752574
11039 4752574 4755380 4773115 4858147 4916337 5162952 5393986 5565566 5826443 5865114 5747891
11029 5747891 5919703 6300693 6497977 6619446 6696795 6776914 6680767 6886745 7050999 7053613
11019 7053613 7102614 7289042 7269671 7018025 6909631 7097030 7204187 7297219 7357979 7283053
11009 7283053 7605128 7712023 7952737 8073887 7857422 7883840 8043708 8069442 8152761 8390525
10999 8390525 8720714 8883122 9230971 9098475 9275864 9675173 10111268 10255139 10483154
10990 10483154 10977740 11374673 11817795 12307288 12727804 13215653 13881637 14640854 15407850
10981 15407850 16252313 17190322 18422841 19615337 20861750 22011269 23110489 24334039
10973 24334039 25964303 28025693 30424576 33473607 37520520 42574326 48887271 56942033
10965 56942033 67038040 79834977 96523802 118446356 147220958 185524809 236493870
10958 236493870 302674354 380937599 455414015 500996250 499008843 449236807 376220010
10951 376220010 309958840 258385456 219479306 190051802 167577704 149666499 135360155
10944 135360155 123949728 114386057 106372752 99977859 94558655 90199951 86370185 82921831
10936 82921831 80030128 77776021 75758466 73939287 72604152 71430724 70062153 68911012
10928 68911012 67691013 66730421 66188314 65810483 65738876 65700930 65315183 64418898 63230253
10919 63230253 61569748 59489647 57288188 54628692 52035436 49148600 46460523 44024125
10911 44024125 41869188 39561510 37303412 35156131 33357085 31281606 29570077 28059098
10903 28059098 26647500 25509267 24289062 22826753 21687051 20624331 19694642 18662406
10895 18662406 17776367 17101535 16404394 15617052 14922135 14118967 13550246 12969600 12404162
10886 12404162 11937639 11404101 11032986 10607293 10096580 9717921 9327624 9046808 8509271
10877 8509271 8312457 8048212 7571793 7256503 6948211 6812235 6354714 5999640 5886920
10868 5886920 5899198 5677080 5386103 5394242 5168981 4764977 4688151 4504724 4325065 4439662
10858 4439662 4498720 4413191 4269376 3890289 3620528 3809469 3752236 3726396 3795240 3545442
10848 3545442 3496570 3389044 3218494 3293151 3299087 3165494 3137053 3208204 3383164 3498397
10838 3498397 3564864 3537770 3474176 3480587 3703587 4149349 4730054 5393742 6050456 6160113
10828 6160113 5921183 5508154 4918381 4359167 4139751 3853410 3596810 3586064 3452438 3188944
10818 3188944 3256700 3302336 3282005 2954314 2567590 2773339 2915226 2857271 2791185 2837562
10808 2837562 2766020 2777156 2749693 2725714 2598958 2805812 2981074 2836769 2643225 2058098
10798 2058098 1947079 2016796 2107662 2197665 2087044 2390096 2656178 2779993 2915011 2949469
10788 2949469 2827065 2697748 2780478 2891334 3049778 3077628 2979201 2746206 2781082 2827033
10778 2827033 2968620 3044268 3176209 3195912 2959262 2975520 3222965 3338192 3207803 3084389
10768 3084389 3008957 3082317 3290328 3343957 3405708 3383666 3341630 3511900 3770915 3691709 3477103
10757 3477103 3694840 3815306 3924678 4186072 4086082 3830639 3533295 3338583 3393953 3465391
10747 3465391 3378588 3049171 2833818 2816110 2840997 2859529 2775100 2504038 2380332 2444594
10737 2444594 2403917 2393016 2353827 2469081 2501890 2411478 2054333 1672146 1822684 2094970
10727 2094970 2095053 2171644 2532796 2234875 2220810 2374509 2393863 2243041 2155843 2001522 1819710
10716 1819710 1623570 1801610 2069757 2215082 2097676 1939185 1927302 2106269 2176589 2083431
10706 2083431 1934341 1922790 1715988 1591801 1622860 1981701 2107641 2030775 1896525 1687134
10696 1687134 1810994 1904416 2040701 2266781 2309701 2258928 2289675 2313269 2443342 2510380
10686 2510380 2653648 2814791 2813953 2910112 2993278 3215377 3218604 3392449 3635497 3309840 3389243
10675 3389243 3557975 3740782 3659284 3658925 3704203 3770602 4062156 4062394 4057632 4274754 4694671
10664 4694671 4765467 4633898 5077707 5198614 4790101 4860598 4932172 4865412 4854516 5144909
10654 5144909 5544225 5662424 5567554 5456763 5770931 5973563 5994982 6002709 6214423 6385273
10644 6385273 6481090 6829181 6979654 7167157 7145190 7130504 7194806 7523987 7979824 8605280
10634 8605280 9241516 9948346 10495587 11170629 11872112 12826117 13801553 15068335 16381377
10625 16381377 18171351 20427078 23273621 26735696 31348575 37264670 44519554 53117658
10617 53117658 62278210 70796427 77585481 81710537 83619028 84422985 85505589 88152279
10609 88152279 93582298 102315733 114301628 129418747 146320721 161524185 171800086
10602 171800086 174939329 171903296 166443497 162144601 161261034 164879895 173864834 187981302
10594 187981302 205998831 225314894 240908669 248159292 244573141 232067160 216107787
10587 216107787 201805526 191814537 186803411 186912779 191101157 198232175 206233926 211335983
10579 211335983 210714974 202979818 189705767 174836457 161744654 151770905 144939804 141167214
10571 141167214 139823751 139792879 139644193 138297082 134462755 127780847 119120908 109743026
10563 109743026 101178610 94162709 88058382 83191520 79002632 75201018 72089245 69117643
10555 69117643 66119225 63681769 61663582 59522455 57422019 55359790 53382500 51481949
10547 51481949 49864569 48336048 46990062 45645147 44234281 42634761 41061578 39496134
10539 39496134 37902539 36126619 34179937 32337599 30935152 29528978 28080646 26663178
10531 26663178 25459743 24284549 22832736 21444658 20491819 19515879 18334265 17266485
10523 17266485 16246829 15341612 14381714 13752641 13325854 12799020 12245396 11574903 11041464
10514 11041464 10792074 10372100 9665464 9051863 8507914 7941274 7450186 6954203 6735066
10505 6735066 6402978 6209411 6014263 5706462 5690082 5414158 5017748 4828862 4612729 4275938
10495 4275938 4059219 4019907 3900053 3744939 3596890 3479273 3269291 3092236 2984649 2952873
10485 2952873 2913481 2743239 2587404 2498285 2376792 2249764 2364456 2623403 2479522 2533747
10475 2533747 2678783 2801024 2706837 2616667 2767137 2772569 2698219 2761693 2952028 3010656 2858460
10464 2858460 2731940 2688867 2606816 2651359 2313135 2270323 2277601 2303899 2336552 2423203 2519412
10453 2519412 2416054 2231579 2024431 1937699 1954738 2129673 2058035 1910428 1977061 2007636
10443 2007636 1957297 2056508 2058852 1914633 2012572 1888429 1986882 1894871 1927837 1790219 1315607
10432 1315607 1047642 1197245 1217670 1263606 1325140 1315390 1341561 1132010 968026 1154499
10422 1154499 1266377 1349693 1305754 1292282 1313691 1423107 1475014 1643705 1742208 1751940 1620290
10411 1620290 1563927 1708650 1813106 1901617 1837653 1767971 1638250 1438119 1405153 1549145
10401 1549145 1562491 1602202 1665238 1756300 1438343 1490798 1653456 1824147 1878904 1726066
10391 1726066 1546014 1511627 1324260 1405322 1547755 1835423 1868489 1742183 1576026 1561435
10381 1561435 1639528 1547335 1343073 1215139 1357472 1399754 1200069 1148701 912488 1052658
10371 1052658 1296445 1221167 1191340 1017705 959617 1112917 1058095 1079499 1038008 1038861 1143049
10360 1143049 994230 853792 744862 700653 658509 717576 887857 855388 889831 984764
10350 984764 1096525 913577 950173 1011598 866416 994331 1040265 1168048 1107880 859331
10340 859331 658233 500787 321710 381995 650383 933087 880448 937571 895666 897491 825713
10329 825713 607108 402497 589117 567710 526262 503833 284687 398689 520190 406351
10319 406351 429190 297927 292337 156085 160623 447637 327564 118263 83071 -12323 -81900
10308 -81900 108903 290227 384200 186832 115715 130032 214231 292292 456178 485997 451885
10297 451885 185108 331748 399694 374338 387954 349140 523489 636565 727919 614939
10287 614939 476752 430826 459858 548894 367585 515985 443250 452179 619728 670876 739712
10276 739712 732075 655399 792010 864014 878422 937324 1005160 1042976 937551 917027 1052441
10265 1052441 1140514 885291 837877 909178 834625 625388 684021 577815 388613 484112
10255 484112 760639 789940 601016 653086 731205 624591 810063 861363 718303 599423
10245 599423 756181 797973 729194 750864 919637 885974 823466 900160 890112 841075 557449
10234 557449 506245 566592 581429 642648 504274 396170 596700 737247 593404 627599
10224 627599 556820 589964 720791 848315 792337 660797 581543 531984 566291 633706 418058
10213 418058 438659 310067 327232 385391 334366 402153 504590 671406 609674 412182 245792
10202 245792 300368 427387 427249 253686 436593 470626 272772 78934 137421 264482 444406
10191 444406 688110 688307 558351 588454 491626 338390 479742 528773 504456 544283 615697
10180 615697 1063267 1086965 828782 720077 507413 446750 759608 778218 951878 1089587
10170 1089587 951229 828063 823853 822688 810527 877211 970076 1320316 1398315 1167591 1346139
10159 1346139 1345227 1351030 1521281 1639587 1818529 1713926 1446799 1289849 1360550 1238900
10149 1238900 1058864 997354 1124871 1086669 1129204 1162053 1184658 1184658 1147830 1105586 968988
10138 968988 1039691 1091387 1173273 1135364 1246995 1072568 1200884 1266631 1450245 1340722
10128 1340722 1192288 960728 995194 996538 951004 876206 802825 824771 875944 677278 509006
10117 509006 314028 363882 575168 690916 686491 500813 639807 763302 801579 979448
10107 979448 807124 622365 646237 479604 209837 307382 462343 431666 416620 417231 412605
10096 412605 665507 959355 799534 729746 760787 662052 557290 221735 241915 252615
10086 252615 400472 545582 503788 379338 267638 79338 -90463 -87540 93969 286172
10076 286172 281924 118463 -229222 -229989 -70956 27893 169088 223115 267414 272007 304427
10065 304427 249688 371723 368069 326375 187224 87625 101584 82884 132435 253426 352799
10054 352799 639714 679901 708079 484021 407224 580092 535205 511404 389805 361150 447884
10043 447884 245641 105128 -50962 21404 245861 432219 295857 242207 259666 157263
10033 157263 127385 289849 244250 37484 21292 135317 217536 150942 121683 132304 37281
10022 37281 118499 376022 335191 293668 220156 166604 293488 361351 296907 300266 406582
10011 406582 280780 214409 147069 397677 334969 289866 219572 124177 96906 279718 557076
10000 557076 571251 544292 471278 475071 617546 636972 655349 596960 623881 670398 729016
9989 729016 604356 586420 292829 247846 207877 -85988 -227610 -17443 191619 394249
9979 394249 258427 327345 396943 414138 437142 277218 338042 627176 477744 490339 401545
9968 401545 231944 268347 260780 447506 590136 535216 491504 513437 228370 505826 785605
9957 785605 716608 593312 437170 388912 519357 597805 502946 474416 327685 448390 338877
9946 338877 271044 123640 21792 259370 180748 264076 362141 365775 133350 58570 125852
9935 125852 65364 58573 258777 319144 246949 221610 201493 91249 -18310 9101 229891
9924 229891 369529 251470 151200 131802 158457 103527 3919 -61005 -194795 -133064 -81479
9913 -81479 22925 287303 309368 568114 715489 434650 426946 460088 492679 321498 105204
9902 105204 189896 373210 394408 308350 198353 142625 38937 -47941 199010 150009 -10808
9891 -10808 53393 284917 462795 321961 257469 227442 129112 42325 1415 -47450 90201
9880 90201 226751 288165 269787 55414 124867 187154 191606 116853 192485 378059 313318
9869 313318 179999 61657 207239 -105873 -42311 -171633 -206802 -152616 -25718 141948
9859 141948 195907 24258 -113498 -90388 15272 -10312 -208004 -157861 -48653 -136573 -90296
9848 -90296 -38494 -163540 44358 476508 353601 168417 115356 221142 177452 247187 322746
9837 322746 440131 597742 424774 299119 339110 321622 350966 351020 228586 55077 181269
9826 181269 242365 249861 185045 149454 241820 380978 289440 60109 129352 -81604 -72779
9815 -72779 -103274 147961 268874 185569 159531 116801 288946 478117 408619 395170 379966
9804 379966 162470 116874 197007 265473 -68544 -107395 26485 84679 146176 254043 340309
9793 340309 500390 804916 839893 603542 419459 249986 474035 752399 878578 1130221
9783 1130221 1441277 1438819 1745918 2231620 2723982 2851428 2744425 2507152 1885706 1454116
9773 1454116 1451131 1554811 1318089 1145616 1099166 999277 717786 566284 696257 780967
9763 780967 885093 925197 802385 646100 838172 1034647 760896 688235 733302 777901
9753 777901 659758 375302 257118 319665 519169 623546 492296 495909 436410 291558
9743 291558 371449 602131 427854 370086 485938 375016 442512 426354 235656 233116 426119
9732 426119 445164 512935 541565 434972 336828 193911 6537 -41481 11850 48678 233599
9721 233599 370916 260574 127485 113064 113660 328516 308695 310915 364949 258479 -143017
9710 -143017 -153512 108687 163425 202896 301537 207772 34501 68685 234460 344219 445751
9699 445751 510749 523244 732337 792620 1052703 1252735 975033 688612 556262 337259
9689 337259 257415 450843 485806 530614 674877 677645 863222 868481 966364 1005402 815822
9678 815822 602680 708444 869710 1037615 1177558 1549492 1865458 1986514 2211491 2178457
9668 2178457 2289905 2463096 2891657 3373379 3856629 4524823 5090676 5962820 7101800
9659 7101800 8701690 11247815 14882286 19882800 26972592 36371642 45847357 51765209
9651 51765209 51200719 44094940 34513703 26951971 21764139 18244565 15683215 13553412
9643 13553412 12161080 11167302 10224577 9354243 8732641 8307754 7703999 7429766 7198736
9634 7198736 6716621 6449619 6389121 6317403 6302155 5983889 5752862 5467746 5338143 5355649
9624 5355649 5340976 5322468 5324605 5448609 5755485 5648504 5418281 5469778 5263945 5374177
9614 5374177 5193066 5062734 4612236 4136627 3684385 3202116 3022123 3209201 3118419 3006014
9604 3006014 3062199 2962131 2652757 2498808 2074453 2020891 1979967 2038425 1869471 1837923
9594 1837923 1468387 1269512 1268668 1338421 1181061 1225954 964056 779837 699561 702109 837948
9583 837948 627598 656146 670333 730026 866064 560651 474428 462150 630741 714987 775430
9572 775430 656846 664794 638073 524811 390232 317775 327548 591562 655781 503612 555235
9561 555235 564000 407496 435386 369904 270901 338011 599543 732261 433229 382563 350900
9550 350900 385198 445908 292726 270380 247326 175970 142621 205019 277389 284562 133998
9539 133998 106415 157440 117434 121057 112357 383522 507046 371460 111841 -117897 184624
9528 184624 523215 641069 835367 967790 706178 379692 291382 199328 404208 390648
9518 390648 209785 14940 -126448 69872 223457 292035 321265 114753 63795 6828
9508 6828 -152164 14489 265828 286402 115371 96187 218158 254303 284860 291313 188893
9497 188893 93936 140439 12772 32390 -168410 -136674 -27053 15800 -33530 10167 -75878
9486 -75878 -268703 -116048 -20037 63095 -14467 -107002 -108623 -19811 22826 -99651 -74065
9475 -74065 -249671 -232796 -33936 264350 159345 102226 176340 221368 163686 -23820 106408
9464 106408 199035 177997 252524 411792 483692 413873 195376 -34718 -89302 85352 -31922
9453 -31922 -121219 -65291 54394 233946 229072 180621 320570 413898 162722 2507 3794
9442 3794 -186360 -139796 -98360 -197357 -180129 -121075 -150144 -75022 -133033 -72650 -100714 -171716
9430 -171716 -286144 -190517 56348 -102668 -92133 268702 377940 362440 203272 116960
9420 116960 249057 240376 111717 155314 209794 189738 104844 -7945 17098 244146 300954
9409 300954 199275 68107 -38295 49177 -2169 -81537 -93789 -66460 -33045 1118 16764
9398 16764 -98841 130224 359337 248301 -6654 -148471 -378470 -232072 71624 49550
9388 49550 8521 -80166 62755 179 37183 114052 68016 146884 -140332 -222622 -228548 53540
9376 53540 139824 85348 -5913 -190198 -139523 -20819 34014 95012 130142 -39625 -224111
9365 -224111 -208976 -206361 -171162 -41050 111377 171170 156964 155850 156936 184008 -25578 -161242
9353 -161242 -164363 -223440 -120901 150220 157412 -88358 -53585 -149518 -86621 42756 -64041
9342 -64041 -375725 -540607 -539887 -496286 -301997 -294944 -377104 -378056 -189178 -222073 -254649 -98000
9330 -98000 -211354 -111406 111051 282843 63513 -104532 2832 196173 278136 104732
9320 104732 -67315 121616 362237 228530 -154830 -294270 -390176 -224737 -3154 50923
9310 50923 257931 217968 158963 147471 60284 4824 41654 -19750 -85335 -215635 -123261
9299 -123261 -59486 -247367 -147069 -19014 152028 -42356 -200901 -186810 -104053 -6872
9289 -6872 119742 18036 224003 297774 38607 107336 207156 194647 159768 208428 305188
9278 305188 496119 747960 655004 352363 357908 152014 -47321 43554 106327 99373 -127740
9267 -127740 -130006 143087 166353 126843 70436 -25112 -72774 23397 214719 -13042 -244544
9256 -244544 -175548 -34078 -16188 -21321 67336 -47616 -307104 -419885 -225177 -5476 340800
9245 340800 514068 615719 529565 719183 590558 335358 377114 105129 -278844 -217900
9235 -217900 -25687 112695 235246 128894 212487 197201 82944 -137207 -108882 -187707
9225 -187707 82711 198490 242971 -36583 -148929 41950 27170 -92530 -200689 -484370
9215 -484370 -656522 -631066 -423369 -80502 -170921 -267074 -286184 -284813 61694 110604 9769
9204 9769 -71246 31065 76392 96516 -9160 -148984 24599 202745 -148295 -368802 -390821
9193 -390821 -343276 -127601 80800 343501 156298 14287 4216 259386 290044 -15222
9183 -15222 -177023 -201474 -111259 62706 33315 212224 283806 172467 107455 139763 -11134
9172 -11134 -57546 35244 31343 150298 169552 -102383 -80275 -49815 -3270 -634 139041 102385
9160 102385 232252 306549 189467 -91010 -85157 -539 178636 291044 177960 214970 25372
9149 25372 -130517 -84225 129547 260818 241251 200745 175731 144069 -175059 -140751 -35230
9138 -35230 -9343 313514 356316 214251 229112 283306 335720 405815 525028 281392 165957
9127 165957 237819 49780 -43790 166447 243031 74872 -84628 -210330 -386369 -300612
9117 -300612 -262951 -44485 242101 388375 302485 142682 250899 407089 456663 337462
9107 337462 -20552 90573 106474 184296 184666 15243 -225492 -359222 -471339 -288816 -138821
9096 -138821 -62533 -107487 -133120 -34990 -119355 -119919 -69180 181972 236571 55258 -59819
9085 -59819 -100871 -145424 -99065 -20493 -188568 -372599 -565101 -499951 -439793 -443871 -285014
9074 -285014 -231881 -155429 -183858 -61863 30374 11541 13049 20984 -230863 -284327 -174632
9063 -174632 -154210 -158224 -36533 -28539 -304263 -570967 -515562 -356457 -467849 -447626 -348237
9052 -348237 -507595 -630599 -535880 -466256 -288486 -286429 -77350 13075 28422 236307 257108
9041 257108 220825 227646 159038 359824 333090 366735 467694 133400 38110 -277938 -293066
9030 -293066 -195029 -159079 -217942 -193424 18152 -111946 -277796 -6769 239666 156498 359837
9019 359837 669983 489627 345141 338345 250073 86823 -111991 -311213 -386779 -424804 -585899
9008 -585899 -469521 -414843 -147900 49349 176132 172028 255629 385003 68754 -221853
8998 -221853 -137595 -259337 -437619 -169945 58751 -49702 -167622 -207356 -238008 -399322
8988 -399322 -164548 -256708 -332391 -414810 -372200 -259272 -151517 -249525 -133635 86725 251263
8977 251263 261880 225123 288783 365774 405731 358622 185258 111215 224541 181675 124650
8966 124650 -31289 -192090 -232887 -243701 -210676 -183717 -379454 -292024 -297246 -227069 -181890
8955 -181890 -214050 -45431 -139514 -74433 31849 113569 141848 276880 122166 -3684 136103
8944 136103 146651 -62975 -252688 -305575 -400276 -445239 -231591 -115607 24125 107676 -29102
8933 -29102 -77874 -83402 -14378 -51643 -54144 -36162 -84537 -44054 52120 34027 82945 -8740
8921 -8740 -66 38944 100222 56756 -32589 -2662 278558 329864 360760 261265 86287 10708
8909 10708 -59919 75204 102384 299633 143064 -15055 -56902 7189 -81980 30602 251110
8898 251110 140458 -85416 -145163 -122682 119254 324670 177397 45479 -3646 122857
8888 122857 178842 194819 123705 197422 164132 92577 120658 -81076 -278490 -291471 -344117
8877 -344117 -175370 -245723 -131100 -88802 -80987 9073 -43172 158918 -152250 -314661 -140549
8866 -140549 -37620 59152 115873 262568 312064 170955 -111152 -219560 -270821 -88870
8856 -88870 -76356 29565 277761 295293 79413 -189871 -103532 35943 45564 11719 -150048
8845 -150048 -147869 -245413 -37340 312878 435577 -94618 -441419 -479038 -223693 -266076 -196563
8834 -196563 -40940 -77910 -132904 -12273 -111944 -76023 257738 260456 178731 209291 90297
8823 90297 -173415 -289124 -165686 -241453 -199366 -196357 -252388 -354547 -285020 -297030 -493339
8812 -493339 -476446 -420883 -275597 -56559 100121 47910 -91564 -44927 -117900 -69076 -98777
8801 -98777 -250027 -284048 68102 115621 -32419 -277871 -65376 155429 203403 34046
8791 34046 -185682 -405322 -340371 -125887 -77720 81410 180865 83047 -12390 184935 -64121
8780 -64121 -416323 -423435 -213887 91107 244524 167044 59703 34714 214561 391205 323594
8769 323594 186055 356153 413659 197896 141381 116085 137538 196490 66377 -53576 -55343
8758 -55343 -160938 -418990 -553335 -378062 -178246 8381 62589 99692 39449 -23217 -62722
8747 -62722 43796 -42773 -295919 -191519 -103344 70616 -42014 -76009 -198261 -187917 -82459
8736 -82459 22897 28299 62400 15040 48205 357694 207523 321480 297644 86620 -88695
8725 -88695 -142972 -266719 -212822 -144740 -46161 -31338 10013 -191911 -387797 -118754 60784
8714 60784 -16917 -100048 -46560 -47913 40747 -125185 -274763 -257616 -56035 248995 368896
8703 368896 255369 -93395 8733 130459 -25941 43842 43568 -35016 81813 80322 -281
8692 -281 -125970 -35726 43267 3820 130761 81254 53307 82877 -114826 42624 72908
8681 72908 19910 21 34742 202380 136286 21220 -186516 -184402 -16277 279380 70351
8670 70351 -197978 -50572 -44479 -312976 -326430 -245603 -166091 -89644 84211 164511 174027
8659 174027 151799 -14391 -57777 200393 197619 48041 97879 67695 20656 -48093 -12363
8648 -12363 -37193 9100 204183 17020 -66712 286661 320190 126354 -73610 -10328 83625
8637 83625 72797 -106915 -124874 -24055 -91456 -118222 184821 44236 -360290 -269823 80359
8626 80359 240567 54983 -164411 -150526 -223234 -313664 -171324 -62522 -18506 -10193 -216176
8615 -216176 -188690 -109040 -11466 -14326 -97834 -211335 239607 343661 77117 -139584 -212680
8604 -212680 -159561 -64263 -88849 53980 330055 474306 212604 -22435 -128192 -62467
8594 -62467 25461 29306 159892 125334 -161725 -290324 -139333 89845 42772 62236 -128043
8583 -128043 -254204 -236805 -82863 82765 289981 320115 210976 171442 -185992 -238444
8573 -238444 -170358 -155532 -213029 -266745 -336129 -420245 -402558 -199300 -34769 -46203 -187049
8562 -187049 -254175 -203893 -77289 58062 186475 142975 -53140 -26855 -163826 -141881 29670
8551 29670 110740 121601 -2900 -78323 -304061 -255129 -63134 97569 48765 114477 56349
8540 56349 65608 256752 323401 362311 415132 526712 348106 262124 211171 228072 563934
8529 563934 769637 706751 799713 885494 785271 550105 499985 525991 290167 70052 -271803
8518 -271803 -264210 27854 218025 180275 -6990 55258 143057 29775 -148886 -298158 -116065
8507 -116065 -50889 7399 -134101 70711 67721 43863 109829 -48681 164188 382053 379028
8496 379028 289673 212567 144982 329570 637653 870242 841615 691412 952874 1490170
8486 1490170 1761470 1421124 1088925 840204 780802 704013 982481 1078062 836106 724223
8476 724223 546964 349022 534987 492628 412446 278691 116328 198552 441820 256391
8466 256391 88254 -170369 -244917 -101260 23395 104829 229692 231695 9818 74101 282123
8455 282123 529869 241724 -63000 -174034 -10620 19462 11329 -56266 220790 335765
8445 335765 439426 440537 557880 947210 1133117 1043294 569330 439775 285886 305989
8435 305989 441460 576167 420682 46917 -114077 -266869 -265424 -47595 67697 115649
8425 115649 159559 57397 283666 302248 367670 322144 255364 289660 191390 -80672 -396083
8414 -396083 -468254 -500083 -485610 -541177 -451858 -172154 -141582 128647 12082 -112441 19262
8403 19262 -12713 -11572 -22258 86274 220643 486442 371519 341396 174215 -1979 -106927
8392 -106927 -40934 -225810 -335747 -229133 10327 74048 -36089 -239879 -193870 -193822 -276573
8381 -276573 -360927 -321745 -244110 -551 36337 255558 164403 206577 69500 -216777 -465111
8370 -465111 -231493 -152 -48074 -186846 -157267 -6923 22460 -102403 -225623 -108694
8360 -108694 2104 -37126 -78562 -132070 -104601 -105383 -393526 -422473 -315257 -57206 191674
8349 191674 25729 42503 -39275 -7336 -50154 24076 27131 76467 184853 -80874 -40519
8338 -40519 51536 -82681 -101145 -361467 -402596 -211284 -42458 133024 242923 38144
8328 38144 -12297 -49810 -254313 -127885 18855 35643 -118611 -106918 144058 110972 74114
8317 74114 178158 178896 231286 316396 546166 410855 313173 280277 297216 123022 142186
8306 142186 174905 308959 455446 460704 579050 514098 397572 384417 417481 464072 397032
8295 397032 255671 66506 -67080 -28623 152461 190900 132235 191376 179420 238938 471585
8284 471585 356129 12336 -230745 -26297 272574 253516 211327 107619 219194 94607
8274 94607 -15735 149275 332013 195204 149559 207064 338517 583838 616801 399899
8264 399899 351668 163812 -102222 -157922 -175679 37769 257491 238616 479215 681074
8254 681074 700448 476408 401526 278396 -47338 -191558 5181 211261 257555 97334
8244 97334 -185485 -308369 -344238 -132895 -238203 -244354 -160577 59114 134408 45021 30408
8233 30408 71693 161888 203155 298298 289602 113395 -92108 -230743 -56531 -76010 9166
8222 9166 -46638 -37229 -188664 -57735 9852 105458 146293 352735 438597 286821 294676 252767
8210 252767 -50764 -260422 -146384 121621 1300 -87716 -240571 -473889 -369416 -247746
8200 -247746 -165553 -77148 -97027 112333 129802 44389 -68149 -25588 -1054 121522 363838
8189 363838 102880 -170603 -160420 -220407 -205525 -54944 16367 203555 198853 68540 186181
8178 186181 218114 234692 107394 16821 90935 168533 181593 116929 69991 2454 -44699
8167 -44699 -35412 -70007 -49084 27781 110955 -218002 -204713 -16791 -74088 62587 63807 57574
8155 57574 -105378 -277625 -449787 -513681 -267864 210228 274589 118022 -6371 -257250
8145 -257250 -354957 -284914 -68495 -41738 -292077 -316815 -220410 973 -172778 -330703 -335911
8134 -335911 -181143 -234441 -336342 -277952 -429210 -525994 -454496 -492216 -634256 -577854 -385593
8123 -385593 -52946 -311604 -458736 -550681 -749963 -535888 -289403 -152904 -88083 -192602
8113 -192602 -32792 -64354 -55519 -6171 -132385 -241853 -230967 -251981 -129512 -7010 34235
8102 34235 -101246 -177069 -311536 -546805 -666231 -415079 -59787 -218252 -239222 -237310 -137132
8091 -137132 150922 387459 483797 443801 423735 386730 138257 25799 117867 171377 62995
8080 62995 -64284 8636 235115 394575 5988 -213256 -186021 -171686 -65875 -122896 77427
8069 77427 217137 123693 167311 105499 -247006 -121686 -275 42188 370775 129088 -27244
8058 -27244 164328 217027 -98175 -101412 -128253 -74491 177926 249370 161531 117845 -84851
8047 -84851 -298121 -189920 -99083 -9136 91090 284824 58789 -150695 -78424 283465
8037 283465 434803 284306 214238 202105 41132 168445 139677 72373 150565 118016 219939
8026 219939 44471 -75155 -20476 48936 -8196 -33919 50075 3010 281871 293230 289089
8015 289089 134007 114383 -104365 -82812 -195409 -225554 -138132 -147735 -148767 -87193 -139430
8004 -139430 43895 42866 -76855 -60034 85068 70776 75367 219665 82985 -23579 4248
7993 4248 -42919 -51423 152823 303742 285593 177142 70325 -139898 -269356 -298110 -85883
7982 -85883 280123 373074 -104698 -443321 -422171 -286942 -218780 -249720 -268080 -251272 -87297
7971 -87297 -25440 93006 89744 150148 -186725 -280111 -258189 -242434 -191016 -283561 -213296 -172343
7959 -172343 -211129 -188266 -415938 -547690 -382302 -264156 -231568 -6871 91151 -2608 24872
7948 24872 -63453 -35630 -82406 -90210 6021 53519 -8098 98892 173425 185067 60881 -9334
7936 -9334 -48317 -94984 -50338 39079 3117 41394 262006 162039 -205028 -501967 -498853 -443509
7924 -443509 -453463 -561001 -510772 -639912 -464663 -239712 -248420 -429849 -583132 -593309 -414301
7913 -414301 -282155 -170497 -326950 -282581 -190005 -25861 -2389 60773 205220 49210
7903 49210 -105174 -146301 -262298 -224292 -110781 160617 173740 184267 150934 54129 -138220
7892 -138220 -129566 -95296 -204413 -87462 145844 196113 51881 -30839 121470 -156280 -243746
7881 -243746 -103157 -125752 -253493 -226074 -84103 -36738 90945 269267 53693 -78569
7871 -78569 -123113 -143782 -282481 -295575 -156305 -353265 -410027 -170582 107619 78540 -200623
7860 -200623 -135982 -39049 -60357 -81067 -38276 172991 14681 -137404 -115030 -178142 -82650
7849 -82650 -2474 9353 -92566 -342 -57143 -104827 -377494 -647529 -500994 -112513 -222892
7838 -222892 -297849 -251843 -351644 -369496 -210923 -264943 -251664 -331269 -331800 -419738 -401972 -356839
7826 -356839 -180590 -276542 -61737 113147 -34936 -34376 -97889 -278348 -339947 -370729 -345665
7815 -345665 -355285 -537862 -428017 -283414 -87638 -115525 -51979 82310 56023 -14136 52115
7804 52115 70042 277885 106706 105269 40342 -131272 -126059 -118498 -166866 -186352 -108816 162128
7792 162128 249615 259967 4663 -329020 -257495 -107899 53937 -136284 -385267 -247687
7782 -247687 -93946 80245 -25554 -115366 18633 374532 483873 380356 229837 8169
7772 8169 1776 -380309 -603007 -535338 -352886 -209341 -151379 -72244 80679 195044 397699
7761 397699 276396 267244 78324 176891 176634 268975 294689 -88910 -292453 -69161 -174713
7750 -174713 -255709 -466738 -437600 -318047 -249331 -115769 168616 275065 48704 -106417
7740 -106417 -298984 -294370 -456250 -449893 -448456 -440488 -559816 -598597 -340663 -101399 -16062
7729 -16062 4676 13152 131113 187884 -14481 -135253 -25743 -26696 -158175 -267554 -194448
7718 -194448 -179650 -218761 -393959 -200363 14922 -60046 -205598 -96023 -207981 -156208
7708 -156208 -26429 7785 5759 -23341 -142059 123934 418910 386814 31531 -149159 -424102
7697 -424102 -428768 -209412 -67860 -110367 -8505 -33638 -6954 574 20486 -150336 -237072
7686 -237072 -163848 -194118 -68475 17031 210308 292657 401084 395290 269230 31337 -329479
7675 -329479 -334566 -302620 -269718 -356979 -176193 -202550 -208815 -231134 -87507 102367 99312 -166282
7663 -166282 -238880 -57895 -310319 -338012 -58876 -112623 -165538 -24179 -128659 -252857
7653 -252857 -48215 -86126 -15698 137064 185303 351166 497953 224864 61248 91693
7643 91693 4180 71366 239363 339557 124236 192955 205070 -52796 -349191 -398429 -238470
7632 -238470 -106787 -12603 -78814 -62403 -34397 82559 30702 -181759 -354540 -282857 -92160
7621 -92160 27663 -115474 -273983 -42283 -66072 -129177 -222217 89679 203657 176344 413479
7610 413479 286572 97485 126661 297597 371872 305293 118301 289477 319412 444973
7600 444973 261699 80154 211677 294366 15172 -151217 -488730 -529854 -410248 -439994
7590 -439994 -377521 18415 94666 93575 -38718 114124 11318 -274562 -346955 -264676 -211731
7579 -211731 -124557 -51690 -87959 4437 59346 -65004 -408973 -347966 -32447 165177 124332
7568 124332 72923 65131 -199183 -291193 -302141 -192476 -87043 195127 208214 181134 -28417
7557 -28417 55935 127107 175387 98633 72827 -180964 -53546 269707 46527 -92962 -82862
7546 -82862 39959 161999 -91458 -233880 -118515 -42731 -362133 -479991 -394833 -389720 -160950
7535 -160950 -25587 99521 31981 -74120 75825 471436 364485 200884 199874 220979
7525 220979 298815 239891 13870 -79416 208753 264111 -44942 -55748 30611 -200793 -183585
7514 -183585 -105901 -93443 -179062 -72369 14527 31774 -75063 -293846 -577818 -442959 -437585
7503 -437585 -358484 -439678 -542887 -660713 -556605 -406492 -468880 -442088 -138937 167484
7493 167484 219966 277301 132905 135688 157394 19220 -141919 -235023 -70546 26342 29223
7482 29223 -126383 -272016 -105242 -169406 -23303 59669 -146011 -40156 -52865 -207553
7472 -207553 -161171 -306031 -374634 -357104 -476247 -193970 -7206 187013 204609 8241
7462 8241 34167 209213 56803 -178632 -242259 -316432 -452988 -450920 -500203 -344934 -27751
7451 -27751 154731 -95893 -77262 -23579 -185185 -280235 -325130 -200860 -220088 7741 -149332
7440 -149332 -119828 -74829 -269518 -250729 -208584 -203147 -4382 169499 15706 103555 164974
7429 164974 273027 160943 -121829 -2182 120016 184555 152104 -64349 -215518 -83986
7419 -83986 -55294 53085 90838 123314 82472 -29968 -59397 -199838 -501971 -503521 -419857
7408 -419857 -237083 -84354 -397329 -275545 -246475 -176879 -146930 -93536 -122372 41879 99926
7397 99926 115042 4422 -51 -136288 -136975 -47243 -43540 -108884 14848 149313 226923 96508
7385 96508 -25714 -266237 -295244 -393959 -176293 35057 -73035 68168 209376 151187
7375 151187 50232 140961 176111 195520 -51294 -81438 -77122 -320055 -343903 -296178 -407214
7364 -407214 -230520 33876 70916 25191 24528 -6433 -44870 23176 148331 -107972 -290294
7353 -290294 -411601 -216151 -141832 111071 185311 268683 398072 235467 17556 66363
7343 66363 377420 534161 233405 -4550 -16818 -268413 -496105 -517583 -403531 -190311
7333 -190311 -358490 -93848 -25987 -71445 -70811 -220866 -82808 95408 -24431 -102779 -191209
7322 -191209 -294411 -485764 -377376 -173717 -155825 -280153 -174660 -103875 -290411 -192968
7312 -192968 -29701 20097 -95630 -100027 -52338 -372649 -614803 -594913 -414101 -216922 -148136
7301 -148136 -187653 -278531 -149075 2771 35429 154888 253408 174300 -56139 -94906 75448
7290 75448 223230 241913 305853 179447 82073 -206532 -394709 -503255 -479066 -271872 2825
7279 2825 63877 -95659 51774 -72576 -338198 -275804 -366312 -479100 -379220 -242227 -47845
7268 -47845 -44871 195782 213055 253938 324780 252862 133524 183299 242045 157285 -141064
7257 -141064 -346242 -144995 183 -271483 -347316 -19496 118811 -92588 -215654 -246756
7247 -246756 -78681 -106431 -209201 -181945 -7080 5834 10157 155506 153863 120448 -144674
7236 -144674 -10700 155166 74682 -93486 -13350 72922 53948 -36170 -144885 -156945 -290174
7225 -290174 -274381 -271847 -186087 319 177762 105865 107650 84749 -38247 -219287 -280698
7214 -280698 -268209 -95098 -219615 -317995 -207849 -256788 -303583 -149546 -218849 -133433 1751
7203 1751 -192594 -197147 43025 275359 151808 -15942 -127453 -65970 -166129 -165700 -129091
7192 -129091 -283872 -400831 -264640 -183346 -185796 -158161 92840 43057 -165688 -142383 -107557
7181 -107557 -215478 -340506 -360201 -242687 -157160 -134756 -156307 33844 68003 43582 20347
7170 20347 -74425 -40307 -55387 -41639 40946 91354 112519 25613 19776 -140546 -190561 -138731
7158 -138731 -121731 -71538 118632 116888 -74509 -193005 -128887 -120544 -33288 -29676 -283750
7147 -283750 -285439 -199108 -157648 -215849 -225857 -105834 -23462 19247 -42514 -188970 -266424
7136 -266424 -325591 -214042 -235782 -119928 -211869 -25904 21558 -154652 -61256 -138937 -241238
7125 -241238 -162828 -90205 4348 44348 72523 26169 32295 104232 177016 313535 329064 -148212
7113 -148212 -181856 10054 68012 -110901 -266747 -397874 -597759 -544351 -246482 -355608
7103 -355608 -154658 27677 -132995 -209443 -209101 -141384 -109426 -101455 -84140 -15739 -40418 -66897
7091 -66897 -63362 -140208 -90409 227884 380459 153690 143746 174510 290529 255653 309523
7080 309523 378813 437598 402997 288775 274872 158926 159253 232435 79190 -71268 -43509
7069 -43509 -31284 -6615 -62116 -129812 -100077 -40464 -138297 -135497 -68330 32839 -150035 -152867
7057 -152867 -151594 -121661 -111110 47549 139292 103518 87751 -46345 -399765 -258039 -35605
7046 -35605 -19969 100659 209947 246224 220197 81051 -52177 -252341 3299 76412 100724
7035 100724 -62747 -2180 -74676 154299 177828 305816 258382 2110 -138416 -84134 -8233
7024 -8233 -10684 -153290 -248216 -324251 -287517 -456151 -497579 -365220 -148279 122588 188767
7013 188767 247933 32548 -143890 -128489 1619 40443 24703 -141552 21665 109320 -137654
7002 -137654 -217820 -3958 163449 227743 380412 373990 319660 6852 -127954 -4566 -170590
6991 -170590 -194821 -36016 248914 130044 234660 18952 -251363 -280939 -222940 -87726
6981 -87726 -123871 -18850 -18553 -51581 -42032 315318 379700 120972 72980 170758 285938 258835
6969 258835 182144 -3666 -154441 -117612 -213647 -283296 -51441 10714 -94072 -281712 -290442
6958 -290442 -152561 94675 138885 40996 -208831 -284702 -224636 -240149 -200905 -114968 -36525
6947 -36525 -83662 -144506 -203992 -171216 -135050 -180131 -294557 -223963 -224862 -359753 -511907 -315209
6935 -315209 -128076 -58722 -81221 -40252 20597 -66236 -258984 -374543 -301174 -56721 -9302
6924 -9302 -201177 -226278 -331352 -290891 -99892 7978 -96314 -103346 -228532 -356206 -351457
6913 -351457 -517539 -542323 -591286 -578985 -437878 -94989 61345 -113403 -118935 -88580 -185066
6902 -185066 -132878 -212053 -237698 14305 52594 -12909 -64899 -37719 -130407 -144306 -154044 -329410
6890 -329410 -193423 84193 -44228 -200386 -93621 -226089 -37524 65632 -23873 -249939
6880 -249939 -212788 -201893 -149297 -13975 2607 -51432 51835 -106131 -141176 -29823 231585
6869 231585 370905 240118 149800 92770 91347 218710 220092 192818 -16850 -276933 -358106
6858 -358106 -270003 13143 78158 89981 55535 -72920 -52226 45586 42991 -122082 65380
6847 65380 29290 -32640 -51899 52464 8341 -46055 -5924 -41746 -36764 35439 -42454 -30391
6835 -30391 -36919 -130917 24078 123584 216443 34042 -265043 -328619 -161506 -173311 -164940
6824 -164940 -33592 180371 549115 510071 97375 129969 182104 128494 -7982 -46170 247189
6813 247189 350587 210034 -5271 -200559 -65345 20653 -79208 117199 336605 505145
6803 505145 274656 97972 23424 21869 199191 176841 -56479 -70024 -117933 -94634 -277960
6792 -277960 -298049 -98946 132784 235861 134064 80420 143902 93867 35648 146088 -15496
6781 -15496 -71666 -128504 -80065 71987 27396 -41330 -4689 -12203 -169612 -103181 -277887
6770 -277887 -413201 -217766 -365990 -387331 -344722 -165205 -123720 -119801 -269088 -226628 -224448
6759 -224448 -368616 -220358 -100944 64856 103284 140416 172624 186169 22568 -38938 93506
6748 93506 108884 33920 98567 158727 30533 3409 11881 -5425 -91922 43457 10235 33110
6736 33110 119179 35843 -193701 -113972 121759 384247 223380 207726 151750 86613 11864
6725 11864 175655 129838 -118837 -239525 -211248 106382 79908 -29818 403974 558264
6715 558264 296556 231091 202745 337731 313619 189095 -6458 -12442 -298871 -347382 -198881
6704 -198881 -280950 49968 30711 21506 91938 -29645 -279620 -218004 -27744 111584 54939
6693 54939 -157591 -38185 157860 152193 6298 86812 118778 74 -140320 -46468 136516
6682 136516 99327 -291921 -384333 -378867 -313489 -193090 78111 184198 63154 -63685 -1572
6671 -1572 -82270 -122092 -100124 -254057 -228593 -285149 -381157 -63552 -165011 -352273 -376993
6660 -376993 -162262 -89911 54588 250680 224763 195714 161962 10615 53032 208012 121387
6649 121387 -80669 163604 363524 351202 258738 -64658 -163038 -44078 4037 100196 44028
6638 44028 121693 156049 132633 225154 28375 97401 360342 593866 307320 60732 82256
6627 82256 246779 60483 225362 27426 -81607 -133695 -282466 -254416 -123524 -8439
6617 -8439 -273501 -103612 169699 13680 13934 89087 40398 -74345 -266614 -276597 -403575
6606 -403575 -546772 -500996 -468117 -433121 -436550 -118108 83510 314368 285325 426316 423176
6595 423176 59669 -43965 -108279 -37453 114915 78052 -132226 -157975 -153330 17925 340120
6584 340120 536844 285086 13624 -199733 -460444 -390397 -300526 -440381 -355832 -280609
6574 -280609 -432518 -389894 -126154 -1363 111391 49980 149818 -11782 -48141 -34700 -223516
6563 -223516 -364694 -175721 84114 52361 -67039 -166942 -74836 48793 24025 -13613 -354032
6552 -354032 -324150 -171657 -124592 -194208 -279964 -340536 -234211 -73886 -137493 -214995 -250257
6541 -250257 -182667 -59906 -106513 -153352 -16193 159163 45529 -108302 130067 -52442
6531 -52442 -133773 68319 423425 464672 411755 222146 120111 118474 203035 268869 229896
6520 229896 40366 81679 190662 122374 -112275 -163705 -110362 -105678 -130488 22797 323136
6509 323136 317418 220374 310899 352892 94683 -24253 94386 -56385 -157681 21387 19377
6498 19377 6344 71444 -23057 -238615 -184758 -238354 -111917 101306 18093 -22408 -96441
6487 -96441 -386204 -332928 -207091 74035 261969 108528 89028 12522 -153665 -235946 -303148
6476 -303148 -290674 -247001 -188357 -121500 -26852 73236 86688 -58113 -249089 -240201 -218060
6465 -218060 -189467 -18005 118998 90715 238972 198518 -18731 -182636 -86338 -1162 -213553
6454 -213553 -129493 167968 100623 -200035 -274410 -138125 -151985 -279417 -301584 -395424 -201839
6443 -201839 -49114 166738 265573 116302 -152963 17508 25830 -170136 -44907 182747
6433 182747 308341 240362 159834 21287 -70342 -212482 -64550 253668 192853 234019 271503
6422 271503 76296 105095 -53523 -181392 -280933 -366134 -266340 -504783 -593509 -577855 -394620
6411 -394620 18059 203821 -38659 -303061 -370851 -276656 -252581 -171911 -122380 -10278 30334
6400 30334 -41375 -3733 131007 80964 17305 -80608 -77954 111118 14964 36393 11133 55883
6388 55883 -5001 -70890 148947 131957 -265897 -201278 -12020 106990 -27502 -245861 -272486
6377 -272486 -56454 -82401 -27172 -150787 -303896 -197884 -360326 -347783 -408853 -282825
6367 -282825 -243667 -15211 67887 143057 243992 59419 -179568 -64592 81339 -7064
6357 -7064 -31025 -159086 -495215 -622203 -463953 -306922 -62522 218150 308667 241839 -19920
6346 -19920 -140173 -241582 -178423 -103415 -9827 16511 109575 73351 -29924 -36786 -247467
6335 -247467 -382449 -330897 -253658 -209058 -47275 -268479 -188815 -11113 206868 443790
6325 443790 528036 294432 228676 178433 264826 236323 246540 257267 495837 595168 542364
6314 542364 560836 381018 -60987 79243 273336 257704 55546 88488 81954 205874 157170
6303 157170 86369 144244 212032 153611 83969 83110 140892 186355 304554 265512 244067 235846
6291 235846 171037 484663 411633 258801 209256 107064 -92592 -151371 -228420 -145598 62574
6280 62574 65377 100045 35761 -89255 -38434 -47860 -25692 54910 54627 -51161 106351 15088
6268 15088 -126514 -75910 51386 -45968 -4959 167473 313146 440287 302701 30030
6258 30030 -24220 822 25436 -59693 98235 662 -15419 10020 -33337 15898 -26106 1962
6246 1962 -74004 -60602 85444 3840 -212819 -136730 -84294 -170204 -441752 -309318 -30734
6235 -30734 -31922 -78578 -66897 81467 109769 322569 511870 316014 -113479 -332179 -385294
6224 -385294 -330221 -126299 47553 127251 178467 51530 79420 -124681 -188039 -135026 135575
6213 135575 510603 422743 44954 -286241 -479859 -436251 -273440 -289417 -184347 -145626
6203 -145626 -228646 -271784 -298338 -161721 77107 183640 347210 380606 200431 -147563
6193 -147563 -311397 -213340 -106137 42527 -223563 -84766 135168 177146 159125 191148
6183 191148 311528 181026 120529 13759 -12879 35354 97340 386046 309703 23934 -4222
6172 -4222 55812 205705 153638 52751 75395 125688 255037 282132 133639 25937 -95712
6161 -95712 -212528 -217805 -277893 -460008 -490704 -406746 -210180 -121766 -23188 95764 258998
6150 258998 8654 -51253 -15800 -1147 181065 183509 113425 -145830 -363461 -205451 -56446
6139 -56446 -186334 -237150 -218385 -15702 136360 14179 2928 232564 230405 229037 101702
6128 101702 -20887 -17106 245812 343040 232769 74904 69886 277543 353847 335669 -10510
6117 -10510 -163848 -63917 38948 90973 62601 165235 259787 164401 26058 -131479 -837
6106 -837 -86036 -176387 -210686 -76545 108225 247440 390540 179090 -73157 -96983 -313820
6095 -313820 -445822 -356054 -173892 -2402 59145 39144 -32783 52280 116454 89073 59216
6084 59216 -78565 -321838 -306654 -129493 -12404 71787 263986 323213 258742 34017 -106684
6073 -106684 -200690 -35102 -26265 -244929 -363898 -204914 -116617 -241979 -93246 -181182 -77092
6062 -77092 -57061 -109739 -146908 -34411 106264 35936 134536 1357 -103006 -169219 -136986
6051 -136986 -165421 -73102 59272 -36202 -188799 -86514 11985 -5024 -3745 -216180 -501003
6040 -501003 -491625 -157055 -35614 223852 244900 148922 95450 -81708 -32866 204506 363846
6029 363846 72114 -266338 -169457 -122874 -184358 -204493 -221404 -328937 -397233 -449243 -404029
6018 -404029 -200238 -166557 -207621 -32809 85417 -54450 -90570 44136 20165 180609
6008 180609 -33569 -305326 -247049 -226288 -242207 -285887 -298763 -174660 -88776 15521 26553
5997 26553 -99488 -147581 -55923 -82363 -191792 -114826 -35117 152299 -1853 -273433 -375063
5986 -375063 -219349 -117315 -116818 -176774 -342398 -449579 -365015 -367000 -227492 -137793 101216
5975 101216 193691 274101 131389 -92963 -33857 -5394 -87562 -3838 -63967 -27889 -32703
5964 -32703 -23872 104114 145439 8646 194503 59982 10016 30429 105959 140615 221478
5953 221478 -42307 -357481 -423032 -244101 -128790 73174 13241 -3669 78575 270016
5943 270016 266849 199340 -56471 -114916 -132175 -194659 -52161 -153223 -180673 -101398 -114481
5932 -114481 -261682 -242457 143 62523 82088 68253 170852 124056 129512 208640 -66637
5921 -66637 -144324 -122681 -261796 -317848 -272451 -489460 -375721 -190402 -245708 -363634 -457847
5910 -457847 -240796 -211879 -190331 -86452 -24997 5973 -47797 -133013 183814 425438 446711
5899 446711 266254 115493 76848 -25312 15094 22512 55299 76302 13649 132661 123511
5888 123511 -291364 -371334 -11422 286305 -8541 -203881 6818 44648 -74094 -299843
5878 -299843 -177101 -142774 -204078 -204676 -27701 -14086 54319 9320 -106796 -83529 -233141
5867 -233141 -242226 -116090 -66072 -338587 -512480 -396335 -121021 168282 402874 379159
5857 379159 278285 -64260 -289143 -467717 -393432 -304894 -325395 -354246 -113839 91548
5847 91548 55220 66747 277899 39811 -213236 -191068 -168948 -192651 -372950 -503579 -283634
5836 -283634 -181565 -310960 -330907 -317083 -350238 -320361 -157285 -36106 117205 106147 208182
5825 208182 191909 235597 -8157 9859 145049 -58712 -70106 -61091 -137633 -125380 -31140
5814 -31140 -74350 -257106 -373749 -525098 -352806 -341175 -316070 36852 -52437 -75174 -3506
5803 -3506 -251248 -118828 291078 218896 139011 96361 29573 180340 29026 -169751 -194652
5792 -194652 -66509 -247779 -425277 -350464 -295443 -113712 78680 -72831 -257587 -223591
5782 -223591 -290059 -156987 -212800 -254208 -146467 95534 107463 136874 53759 -137013 -411646
5771 -411646 -564105 -386058 31841 186192 4303 -151826 -13926 7370 -33727 -99525
5761 -99525 -302152 -354549 -30784 53984 56714 155615 149194 -41453 -132676 -139039 73561 128933
5749 128933 15163 188545 72154 -46864 6003 106264 240021 26371 -274952 -429263
5739 -429263 -300498 -368266 -358474 -335996 -200120 -171267 -236688 -296656 -192202 -279772 -586883
5728 -586883 -492144 -288810 -217966 -67516 -5711 86120 133964 139956 -51779 -245592 -390078
5717 -390078 -364917 -506512 -454677 -217030 37 15588 -169905 -132974 52149 48895 45018
5706 45018 -99223 -185123 -152578 -78236 -149533 5251 -80131 -225214 -304838 -376402 -99088
5695 -99088 29355 -100032 -41527 13470 -57577 -13551 -44826 205457 373835 187207 54503
5684 54503 163551 63400 -46648 89764 -48950 -114135 27155 225756 374024 253378
5674 253378 -115083 -220654 -345070 -223416 -98444 -192566 -387643 -399586 -365545 -132984
5664 -132984 -80847 -5619 -22945 -100608 14747 -33772 -48158 64968 14801 -43722 -14704
5653 -14704 2153 144467 163134 101472 -294582 -277229 -131260 97904 143719 128680 36974
5642 36974 72394 131475 188796 158559 52869 -80291 -30413 10740 26308 -63328 143316
5631 143316 72185 169985 217140 286711 270726 251432 214785 33269 -61044 -242147 -255903
5620 -255903 -146862 -85660 -181112 -299607 -385558 -355718 -279866 -121213 -28629 -251627 -213145
5609 -213145 -128495 -111208 -114089 -129971 33051 3743 -47598 -89183 -694 62556 -38581
5598 -38581 -19586 -23401 107472 249535 173207 143503 22614 -32218 9261 -160622 -228574
5587 -228574 -329942 -323516 -178353 -40599 226695 352214 376366 172307 162327 50782 53907
5576 53907 -98983 -85122 -184137 -332055 -387698 -525787 -427022 -62731 83901 -33270 -91221
5565 -91221 -112219 1722 -77122 -168227 -144071 -126560 -120064 -47714 23214 499 -18895 39929
5553 39929 415887 462538 407431 406189 236338 51326 172005 157301 -27527 -46755 -67087
5542 -67087 -4408 48933 237025 381511 407283 281346 134462 45203 116212 84758 105418
5531 105418 111715 235376 242315 226123 -68249 -242308 -45264 115817 145471 143433 229849
5520 229849 92221 -33084 -28611 223269 395410 244400 28534 -70897 -186943 -189182 33215
5509 33215 170789 246282 421097 253483 23390 -249632 -305612 -618495 -699483 -786133 -564792
5498 -564792 -446162 -145026 -166035 -346073 -519410 -397020 -187298 -143153 -199159 36276
5488 36276 111572 137936 134735 414274 642383 654398 460293 156040 -242904 -307639 -147568
5477 -147568 170593 217112 102909 5551 52587 201166 117710 118439 -6280 -39011 -117232
5466 -117232 -5842 178907 122734 15142 156518 345056 339551 153708 -128786 -361398
5456 -361398 -286014 -123045 -87328 -42448 -172700 -168436 -194453 -232573 -30672 -17778 -14292
5445 -14292 -55162 -10399 151128 97285 7855 -150794 -78681 -171812 -305631 -296311 -297001 17840
5433 17840 233723 266310 241919 328740 300367 222843 153766 -40549 -269878 -211679 -74227
5422 -74227 -80967 84888 -78068 -307426 -447787 -306435 -148682 45710 149072 268484
5412 268484 201198 137456 315238 219818 98832 -2871 365865 551614 552965 392166 116297
5401 116297 27892 90045 162141 -139969 -184179 -109754 -246311 -391881 20845 185245 98824
5390 98824 122304 300623 421997 258804 52734 -105185 -56832 -26506 -252476 -230937 -13103
5379 -13103 -67127 -122098 155462 284316 115196 -188906 -244922 -500385 -610879 -644923 -471920
5368 -471920 -185159 -304491 -112387 -2634 -83875 -272756 -234467 -310644 -313816 -413172 -418405
5357 -418405 3384 155930 85721 20977 55721 -225247 -67834 -40271 -145462 -244820 -89603
5346 -89603 -21235 -291849 -204144 -291147 -69216 100533 53005 186424 322687 84382 -183605
5335 -183605 -164395 -243686 -140429 -298263 -418745 -475885 -376778 -220719 -304387 -289138 -196732
5324 -196732 -137576 -77385 -96726 -178079 -181633 -523 158471 142755 -329096 -383962 -343150
5313 -343150 -410081 -298469 -243365 -151967 29539 54102 -72245 -55439 71726 89168 -49614
5302 -49614 63126 261624 473758 421528 185577 21834 -50281 -163438 -141568 -321727
5292 -321727 -318287 -246000 -154843 -318469 -244652 -267080 -220355 30866 12625 -68215 12785
5281 12785 266568 313251 367562 433121 294773 58674 48801 47869 -30803 -148321 -65862 -24381
5269 -24381 151548 -8453 -174621 -329778 -455480 -494257 -351253 -231753 -321406 -37144
5259 -37144 154156 55209 84412 119605 76005 158715 376654 343789 239887 67357 -293390
5248 -293390 -348263 -51480 -266472 -307890 -153895 -15906 -69318 -53260 21964 -63087 385
5237 385 -76216 -123877 -129318 -64368 -101969 -146786 -227463 -91012 68187 208659 149331 -72615
5225 -72615 -153224 -113850 138681 134995 -80211 -143494 -144265 -116308 -284754 -564380 -769632
5214 -769632 -568098 -275465 -226775 95743 121928 154105 113312 188094 179122 400794 547516
5203 547516 252754 3925 44627 51520 -204818 -180893 -206625 -169649 -18879 272045 441956
5192 441956 69047 46078 -31072 -209813 -310112 -182181 21205 -2487 -149946 -89814
5182 -89814 -72231 -177420 2702 -72102 41892 346727 496582 328254 209030 156433
5172 156433 82460 -82765 -78854 -199806 -125876 68153 239627 165385 -267 -63471 -125201
5161 -125201 -244451 -31291 -131443 -50669 90468 -101668 -230282 -268423 -306628 -298069 -73253
5150 -73253 52384 146738 -8896 -75376 -28934 58859 136874 7889 21949 49835 17093
5139 17093 154349 323493 275040 298461 174586 28913 -126054 -118810 -329023 -211494 47507
5128 47507 103487 17327 1417 32118 159948 276376 -1229 38244 179007 163794 201163
5117 201163 -39414 -178192 -176833 -191915 -75737 -17397 -197790 -281057 -298263 -174448 22349
5106 22349 -127843 -98896 131721 89054 -52643 145171 175022 154439 195038 287974 351630
5095 351630 99111 81568 159608 -1694 -46662 -24931 -2020 148724 309515 491563 310364
5084 310364 -108295 -205187 -119201 137467 243812 55943 -56603 -7725 13901 79415 -6759
5073 -6759 15810 -163772 -255251 -283372 -157763 -63697 -765 -122577 -325428 -419483 -327764
5062 -327764 -32968 79884 18854 -9520 -101724 -84491 69888 123133 322456 304995 37082
5051 37082 -132463 -333769 -299207 -17072 117542 259865 332968 351399 234669 98916
5041 98916 96568 58859 -93758 -175577 -178563 -89438 -168341 -314028 -122255 81914 153018
5030 153018 214515 78940 34586 73979 60638 180081 186163 78493 -23945 -81440 -279837
5019 -279837 -375292 -565106 -519737 -120945 76926 55862 45295 -9936 -67049 -234092 -318903
5008 -318903 -81691 152733 400073 369292 -51167 -134041 -178430 -209943 113596 108080 159598
4997 159598 19657 70088 192006 167000 -20133 -126510 -40319 -92717 93197 250682
4987 250682 427828 193133 69650 -222331 -582207 -465150 -393001 -346273 -292668 -5070
4977 -5070 285653 407133 383642 316006 240776 84734 -142904 -113736 27275 167368 47033
4966 47033 -50642 -188608 -141245 -52055 238861 383282 280317 79123 53043 -74923 163338
4955 163338 386072 250280 -11242 13325 120615 238563 348097 186767 217993 336775
4945 336775 85311 -197200 -275759 -322723 -291339 -392363 -117773 -38661 -349946 -197934
4935 -197934 -120469 -70525 14248 -193576 -177254 -114719 -200479 -32364 66467 53872 135410
4924 135410 -39715 6616 -253149 -254136 -253165 -86469 -134525 -30305 258473 -156933 -313020
4913 -313020 -255914 -245426 -121472 26861 7504 131730 8996 171192 342338 327955
4903 327955 214750 213456 194828 39807 2424 37124 -135479 -186531 20670 -4177 -93416
4892 -93416 208260 331532 171542 91940 -90802 -125713 -225093 -282260 70891 374291 398632
4881 398632 272690 188256 166012 487870 519927 493087 218796 -20893 -139795 -340344
4871 -340344 -401762 -101791 -217421 -237601 7481 -49420 23912 89321 201128 161133 -100648
4860 -100648 4953 191997 94697 171200 229773 -38700 -185735 -280295 -100526 -142185 -83320
4849 -83320 29893 492 -25335 -119952 -68072 121720 143979 249559 266239 177049 250690
4838 250690 515483 405151 290260 175669 150143 138766 193382 224550 102355 161042 199908
4827 199908 105290 181688 100289 96686 43355 -144483 -65518 35753 46691 51318 31699 -197642
4815 -197642 -203275 13634 46896 -48592 112629 343519 324585 354982 320899 162280 187277
4804 187277 369746 460318 589670 551244 342608 281631 51601 149779 146221 127083 267401
4793 267401 76264 34384 -111158 8103 -75510 -7645 -62728 -133696 -4145 129433 254541
4782 254541 265900 -86374 2754 56178 126242 109797 157469 61609 32602 -95060 -103395
4771 -103395 148584 537053 358580 -16913 3924 231773 467713 372401 111920 -73281
4761 -73281 -13050 64838 180308 137918 -99966 -236576 -156308 12622 -154421 -453449 -417427
4750 -417427 -339608 -358502 -296518 -326333 -241116 -81837 -92579 205146 398384 174351 -100379
4739 -100379 -147337 -256860 -378484 -302333 -285778 -114677 75372 253426 230903 114141
4729 114141 29865 -9154 114872 351043 324633 228350 276306 355227 418914 380668 249297
4718 249297 164517 64360 139330 262428 200086 2126 -136443 -192208 -356591 -306962 -243295
4707 -243295 -141653 -297884 -421797 -342682 -26228 62976 195457 97309 -86957 -187204
4697 -187204 -127984 36074 130799 250908 260518 338190 110949 14668 -95403 -59194 325169
4686 325169 56626 -237042 -206195 -345116 -487874 -456190 -91502 -99126 -54057 -101929 -210536
4675 -210536 -313264 -265625 -251126 -49051 68340 -53379 -45809 -133078 -309110 -93827 48158
4664 48158 -45576 -231579 -157722 18019 233056 358848 233222 9832 -24868 126208
4654 126208 190496 318862 358861 -37322 -454328 -499148 -278363 -136206 -255206 -205714
4644 -205714 29670 123106 337689 299659 42405 -302588 -443321 -399928 -244495 -223793
4634 -223793 -299374 -404050 -284211 -30274 60034 69637 -19699 -170352 -536087 -571346 -373267
4623 -373267 60445 74576 87718 232996 259270 206240 48505 -79788 -84069 3685 69643
4612 69643 -178186 -2689 -53908 -41643 121847 156457 -2810 114143 248499 316679 229749
4601 229749 81453 -141355 -108731 -32865 -81994 -158427 -31847 115464 50203 79395 211215
4590 211215 137467 36640 -88149 -125488 -129337 -19984 196873 188305 118662 -36202 -25226
4579 -25226 -64671 42688 169852 40077 -19671 -114580 -50517 -246891 -248539 -108071 -68094
4568 -68094 -197348 -128318 -113981 -194234 -149672 -229865 -219769 -185282 -186246 -187287 -101602 -240318
4556 -240318 -452468 -486445 -163517 -116517 -66873 -99411 -132886 -7536 13220 31914 -29634
4545 -29634 -67360 -222731 -255796 -360958 -427278 -384973 -340785 -192376 -273538 -257508 -184307
4534 -184307 69400 166328 226184 -10746 -249978 -141261 26770 116735 -41229 -164540
4524 -164540 -155086 -126660 -456721 -365690 -332409 -311876 -251280 -87795 -47974 58864 294644
4513 294644 401069 348285 410179 312258 42585 -46688 -36383 -96258 -119040 13177 108952
4502 108952 156902 15400 -106194 -109847 -83214 104771 78291 27574 -16274 162675 222027
4491 222027 128805 193865 312390 280859 396426 283327 224606 140926 -40503 60997 -58900
4480 -58900 -276303 -174561 -60753 -176190 -349111 -258723 -68991 10786 91060 64830 -294593
4469 -294593 -446207 -258047 -47874 64874 -55438 21900 -13034 -117932 205205 316172
4459 316172 173942 115375 -22405 -102888 -303691 -473699 -399890 60651 249243 91414
4449 91414 58378 124323 21007 -274331 -639462 -502877 -233955 -59362 -44108 -11798 61209
4438 61209 175336 61723 63659 -80604 -29678 -49405 -234731 -137748 -24754 -16392 50382
4427 50382 -16944 -48574 41408 -92269 -4851 263437 414974 250695 85169 92844 -111079
4416 -111079 -115312 -97769 31792 56520 -1902 -101948 -167401 -61434 58436 -33225 -79304
4405 -79304 -23835 113621 200653 22268 -268300 -375868 -208324 -98348 -56775 -144557 -55030
4394 -55030 176107 139901 -82481 84686 170206 318012 129142 64064 134126 57326 20619
4383 20619 -50472 93613 74351 150151 214466 178513 222784 202997 85422 173653 -175627
4372 -175627 -146733 -127627 -79201 95199 244336 158459 -126331 -133713 -11887 118840 297016
4361 297016 340946 211162 -19636 -183657 -262802 -84947 -151668 3568 -26099 -138422
4351 -138422 -347190 -651310 -625099 -289137 -148412 -94272 -163626 80987 316055 332455
4341 332455 -40710 -128138 21311 -52266 -150097 -156324 -33555 -80682 -200263 114302 207799
4330 207799 147037 -107174 -207559 -426859 -214463 -76341 -133824 126139 185901 214360
4320 214360 267540 -145315 -396015 -554905 -438023 -105585 107184 309797 32670 -95341
4310 -95341 -32656 -3204 -139784 -270615 -342814 -382631 -391937 -357067 -213458 -227456 -116374
4299 -116374 87886 60392 -53063 44209 -2425 -48456 -105920 -163836 -140974 -25120 198090
4288 198090 193816 121838 164122 222627 180867 172406 114063 -88456 -257820 -298668 108236
4277 108236 276685 262459 199590 70511 100191 144495 318235 553850 578787 418299 531368
4266 531368 155973 196960 181907 184230 247920 -51676 -224350 36419 398929 449200 286802
4255 286802 -111151 -171680 308201 546244 332029 207803 173992 -17829 36881 114215
4245 114215 212414 23667 95675 9094 -144187 -135286 -91266 -249943 -255812 -152527 -52010
4234 -52010 89083 62156 10778 70547 -70200 -141506 -224289 -78330 112358 -88957 -57116
4223 -57116 -70438 -82550 59286 24698 -182644 -235727 -58150 27037 189295 129258 104970
4212 104970 65709 -14798 143116 119488 -20137 -166169 -55774 73297 240740 415613
4202 415613 185265 104205 171474 135283 163070 64867 -16187 -125378 -93864 -48038 -165134
4191 -165134 -192833 -146925 -138168 52103 219352 235159 213946 125088 -190292 -171799 -358806
4180 -358806 -498945 -384433 -261793 -197546 114847 -12492 -118844 269204 320494 85653
4170 85653 -7678 -70898 -98502 -102838 66812 57579 145743 102335 -39101 -172801 -141915 26504
4158 26504 -109463 -315028 -281663 -54429 -152926 -36030 61300 72189 192222 98212 -57410
4147 -57410 -64511 93679 41982 -196217 -103206 158466 94344 10696 197485 198700 83050
4136 83050 105782 33182 -46482 44360 228266 333385 99917 -135851 -249830 -259116 -172671
4125 -172671 -128481 19051 130254 174420 150342 37462 5929 96056 137155 -23182 -151092
4114 -151092 -39090 86053 6263 -96316 -157199 -262641 -160021 -28509 -21595 113522
4104 113522 193041 316702 369760 245588 -28100 33585 138722 72598 -25517 66221 195153
4093 195153 356990 393985 407563 358569 295376 65234 -59632 -126215 -10497 -5089 -5990
4082 -5990 -54076 -192969 -190925 17733 152513 46676 -88089 -152980 -159130 -119102 -93045
4071 -93045 -174139 30830 252660 224991 -23014 -286485 -440479 -513027 -354823 -205938
4061 -205938 -162356 -181316 -105946 -22592 116853 235084 -2748 148849 274281 304812 93342
4050 93342 208591 241172 134878 -2384 -138575 -104883 -61754 -52566 -287848 -506221 -444084
4039 -444084 -187628 -56096 -211595 -228455 -206841 -174441 -197516 -142838 -29297 58857 -33604
4028 -33604 -167936 -105328 -76284 -104999 9759 -121861 -231509 -130174 -113763 -19960 -74182
4017 -74182 -295354 -415031 -290774 -102604 -5506 91627 349481 402584 163426 56725
4007 56725 -122067 -174284 -445023 -463695 -296606 -45466 -105705 -184405 19026 65956 -40631
3996 -40631 147476 20202 12972 41804 8510 57467 -57490 36836 91575 -177251 -383550
3985 -383550 -289334 79811 108583 38149 32793 90209 73342 -11853 -99911 -139820 -163359 33826
3973 33826 181205 147527 -51159 -30017 -204670 -133844 -187263 -291229 -141270 -3058 -55148
3962 -55148 -26923 -196211 -333899 -276309 -421570 -425583 -328951 -108663 59619 141862 118591
3951 118591 115367 84436 -217557 -84088 195759 149189 -44582 -160660 -188437 -35221 -44219
3940 -44219 -31368 34315 -7112 -67426 -148017 -311460 -355985 -281832 -473696 -445214 -279653
3929 -279653 -413471 -475897 -365161 -140161 104968 7506 143390 203215 143151 -77054
3919 -77054 -154347 -158861 -123618 -192280 -224669 -206853 131471 278540 235203 -3968 93721
3908 93721 84183 -7259 -116691 -13775 -61636 -57391 -159410 -259527 -325867 -411435 -292718
3897 -292718 -196342 -112957 -158134 -344241 -235101 142329 238529 240704 207753 122133 9703
3886 9703 97420 135220 81631 234159 61223 -234545 -327054 -353240 -511917 -380185 -358335
3875 -358335 -300139 -96710 -46124 -25557 -73881 -74248 -27899 19485 40885 114535 275285 -62731
3863 -62731 -291642 -53375 -92477 -129136 -174669 -350449 -202699 -305655 -132297 15077
3853 15077 64385 116515 102898 -116607 -128448 -146555 9747 300731 418077 156410 31732
3842 31732 -66068 -101851 -89302 16467 211247 263657 215091 148384 215160 228691 127477
3831 127477 89927 51486 72580 13367 -88846 -113278 -242474 -177744 -241379 -215000 9475
3820 9475 291256 457512 238752 218198 167854 21291 73150 91303 151901 115643 -66605
3809 -66605 82514 217463 251271 404590 575219 324683 -70572 -13802 -100033 -81778 -171356
3798 -171356 -15024 110791 216485 261793 311437 195303 137982 -29176 -281404 -307319
3788 -307319 -329265 -382624 -232178 29894 143124 143051 138488 286958 332347 230393 133401
3777 133401 -67048 -247058 -702415 -742512 -313227 -174168 47201 -25496 -172435 -189161
3767 -189161 -67419 -84087 -110838 12351 260155 403587 400121 171721 62690 -19698 -44626
3756 -44626 121817 31018 58139 162104 293662 421419 276259 196939 211490 135976 154186
3745 154186 350200 239345 -375 -179366 -371019 -212882 40598 213216 208164 210496
3735 210496 51957 -192523 -39317 150904 -13024 -81564 23968 304225 183561 -7867
3725 -7867 59936 288529 310542 129719 50663 -96844 -278278 -311809 -227279 -114888 -48807
3714 -48807 15688 281183 158335 44071 52768 80877 145299 123762 -44640 -71149 -277224
3703 -277224 -292554 -226200 -68191 25829 -100973 -218423 -312210 -348756 -281116 -215254 -17347
3692 -17347 -46582 -303164 -274061 21879 169699 99599 125870 -198972 -203063 -145721 -63409
3681 -63409 -33086 -28862 -139774 117165 105896 137128 252902 375594 428446 386079 46598
3670 46598 98024 109398 205019 269412 564060 628849 487835 505818 327667 33296 -82684
3659 -82684 -23355 26821 -44633 125912 -28813 106189 150389 186058 57886 -27691 -121020
3648 -121020 -415110 -429744 -372825 -143322 -86619 -34006 169612 46623 -256109 -308594 -152908
3637 -152908 -80587 148285 124432 129272 -89467 -174212 -94334 -150021 -235266 -473238 -548809
3626 -548809 -349487 -354097 -395846 -257888 -202692 -279130 -276463 16619 40435 101762 187405
3615 187405 234958 106692 -207398 -364051 -303329 -344923 -520551 -293550 -137412 -185824
3605 -185824 -231628 -142933 -107860 -11665 96710 336049 306913 130843 100409 229585 150454
3594 150454 49595 95550 4375 -170037 -187104 -213130 -353249 -146397 44945 -138360
3584 -138360 -258640 -63855 127391 221504 338476 286265 19571 -106250 129022 98631
3574 98631 74732 142527 167533 133220 267316 82359 96628 347522 380504 92663 28717
3563 28717 123303 73098 271647 141861 117131 45691 -240382 -105080 162707 510601 492010
3552 492010 488324 422510 442396 603358 388177 235678 293640 427279 442212 259081 67436
3541 67436 53350 28286 76111 137664 170558 95315 142188 151678 56500 189816 257381 112369
3529 112369 -112562 -149772 -13890 90620 244213 141436 1156 11733 314277 307321
3519 307321 148615 487765 421370 171870 199024 180473 -126643 -60113 -6016 -48944 28775
3508 28775 -90313 130904 117883 184153 271391 214523 197025 265240 144220 152002 9547
3497 9547 -9238 60306 70666 81909 273647 377975 201240 125609 -51103 -31858 -123860
3486 -123860 -239234 -87309 -83626 -47394 98699 -125359 -247771 -135458 -225623 -295469 -478944
3475 -478944 -246258 58165 25631 -196421 -139554 27499 207492 258130 330342 270665 205661
3464 205661 7721 -128607 -397939 -396309 -155033 176501 134358 -108586 -282367 -326837
3454 -326837 -201252 -14520 205306 201669 164414 279297 150512 -40048 -40 50612 42366
3443 42366 67532 136329 215300 211078 -157496 -165122 246631 329315 84439 73840 -139898
3432 -139898 -389573 -331218 -88944 100332 148652 -86850 114458 241985 333762 379774
3422 379774 369416 318424 298779 164537 53138 91904 140338 228878 112315 36616 -96094
3411 -96094 -182936 -81485 -73832 -24462 -74683 5542 48336 189518 185942 13850 -187589
3400 -187589 -345762 -237606 -214450 -196035 -168144 -39334 98616 128643 173691 120786 41086
3389 41086 70081 142301 -224212 -310869 -244606 -121097 -101266 -142205 -133152 -121445 -160068 -149043
3377 -149043 43455 91992 48503 88342 164758 -23130 45074 236860 238987 6202 61059
3366 61059 86340 157122 -122422 -401687 -303526 11851 173623 321792 42491 -187940
3356 -187940 -241023 -241327 -38198 137241 281614 55792 -71355 147125 208284 133821 -12121
3345 -12121 -123463 75297 62651 -145626 -87373 -23496 -110435 -264616 -195826 -120122 -208744
3334 -208744 -108692 28010 187907 202545 51485 -128835 -129127 -183989 -257682 -295169 -303155
3323 -303155 -271089 13572 140718 99211 -171036 -340008 -78598 -39205 -170452 -297828
3313 -297828 -283775 -284891 -179796 -148024 -245812 -246796 -211652 3616 120802 39028 -141755
3302 -141755 -91704 -128312 -322200 -342435 -227237 -220439 -349327 -574393 -565478 -305889 -94647
3291 -94647 -15442 40379 42439 25227 284525 227782 81127 21374 -65111 -162120 -217338 41139
3279 41139 48183 -41071 -139820 -48615 204999 65350 -253662 -429698 -291583 -102943 -41252
3268 -41252 75771 31976 -176225 -369357 -277456 -67559 79161 -40088 -37291 205701 332832
3257 332832 367099 198082 5363 -104198 -373610 -359629 -181614 -326317 -194565 -144258
3247 -144258 -26845 -23514 117997 140922 346102 487702 444797 250032 -91871 -204022
3237 -204022 -36673 128323 296334 187686 58872 144906 291972 506198 439936 167486
3227 167486 51652 246548 80501 16074 332205 514143 274148 127486 395217 342211
3217 342211 332398 187289 228437 173868 -46506 -112170 -123870 -67517 15103 86139 154503
3206 154503 350486 270074 149873 299924 316462 81194 -14634 171874 435938 434496 408254
3195 408254 327357 228286 35632 -60795 56945 -125884 -390411 -408585 -294399 -200627 -360472
3184 -360472 -402621 -271051 -154748 -200380 -342324 -326827 -85010 62421 31206 43928 -10630
3173 -10630 -44682 -13712 -24905 -146304 -73149 114334 386480 511431 544370 498624 370288
3162 370288 259582 444670 488128 287204 11831 -275129 -211452 -91500 96151 -77374
3152 -77374 -44121 197560 349057 300762 144210 94567 -137508 -205156 -146914 -99162 -80299
3141 -80299 -169902 -234916 -175944 47047 103136 161834 200676 187026 94272 -150504 -276868
3130 -276868 -72408 11518 113088 -100667 -193956 -288185 -409920 -249433 52231 76815
3120 76815 -140490 -404375 -479707 -341078 -216868 -372351 -345352 -225858 -169447 -174589 14515
3109 14515 29997 27434 -18285 -19408 196762 251358 164815 106698 157955 66588 140960 218154
3097 218154 539650 480818 292236 163693 434143 641815 398270 206748 -11895 17875
3087 17875 52597 64161 38991 -227328 -269944 -91575 -136883 -103653 -78264 73348 190395
3076 190395 93166 -91788 -298618 -287639 -188793 -187269 -306122 -518131 -478673 -250651 -293793
3065 -293793 -357450 -236477 -189203 -104982 35125 91860 55220 -4473 115707 68825 61359
3054 61359 -2902 -29589 27234 45835 97873 112110 -59798 -118808 -136565 -244237 34321
3043 34321 149779 314210 400064 145791 11970 -163935 -106204 37111 10530 -169799
3033 -169799 -307956 -351695 -114246 164909 491152 582511 359032 419494 252228 109399
3023 109399 181061 41310 -67080 -114387 -189643 -119576 119563 -35370 -118846 -25783 -50105
3012 -50105 -118516 -116901 -135534 -135781 39819 378224 556505 556159 630725 647134 788539 743331
3000 743331 634811 429753 306258 150578 129646 60941 32332 152255 277530 317584
2990 317584 282264 274704 197097 76713 -98457 -226420 -57131 -42857 -55127 -77166 53887
2979 53887 204221 378296 405081 352233 -43831 -158495 52276 172656 61879 -36323
2969 -36323 -66894 -143428 -111576 -69554 106226 -20569 -370185 -271924 -276682 -359367 -409211
2958 -409211 -271325 -175459 18302 21868 -68502 228661 269216 30184 71558 284375 156828
2947 156828 136935 11396 192329 357758 185222 -33719 19910 153646 198165 151779
2937 151779 30650 -116386 -88785 -263610 -387264 -297509 -124646 1169 -42935 83042
2927 83042 147532 194116 108052 -69375 -23009 -43036 -266278 -574491 -604536 -439745 -227140
2916 -227140 -235735 -319583 -285698 -226639 -199550 51865 167200 160993 79597 -6445 28773 -71175
2904 -71175 -207963 -164788 -14862 82154 35016 -84811 -92642 -166957 -148717 -47717 101018
2893 101018 81347 -60847 -137284 -206018 -132758 -69056 -33750 133972 48916 -232931 -121980
2882 -121980 -313245 -435077 -434697 -343619 -312415 -214058 -33923 -104256 -67882 -113320 -133945
2871 -133945 -94499 70999 38787 -148423 -57518 -68871 -326735 -392215 -281366 -59539 8186
2860 8186 -83918 144901 350480 308705 299266 -36492 -130960 -81415 -37547 -92769 -224739
2849 -224739 -4026 200939 170161 61566 -143847 -372807 -508745 -543096 -82794 205186
2839 205186 161538 295229 251524 351111 222675 333670 413961 314517 321293 226532 76171
2828 76171 205024 241414 539247 546252 350768 155961 123300 245675 68655 41181 -35655
2817 -35655 -58271 53365 246458 136927 45172 57128 225667 -29612 -11685 -26321 29077
2806 29077 70389 -102650 -147839 66853 112362 -58454 -136872 -101893 -185686 -73858 -641
2795 -641 -37193 -148619 -20152 -7229 -146618 -377337 -239725 -141490 -128053 -36615 103682
2784 103682 80000 155269 56248 159172 80962 49617 119921 200342 298498 162706 253068
2773 253068 352205 343233 299707 258577 178142 363442 275470 227365 67971 166732 189266
2762 189266 -181409 -223826 -111247 -119030 -141326 -35265 75527 -120122 -225938 56374
2752 56374 -48793 -227878 -50225 12574 3969 -87821 -137213 -318219 -53002 366927 280249
2741 280249 7521 -169770 -252178 -211959 -374763 -329248 -245007 -227876 -87692 -115964 -58711
2730 -58711 -30989 -113955 -123337 -138021 -112264 -223875 -83055 173538 55269 5980 115365
2719 115365 74349 -25648 -38738 -42706 -10245 -178691 -691579 -584309 -189678 46223 -277
2708 -277 -108721 80080 192812 227553 -25806 -193923 -147107 -61975 -81892 10234 246086
2697 246086 217185 125726 20858 -299855 -116061 -107195 -165275 -5324 -38579 -256427 -152833
2686 -152833 -115530 -87035 47632 38668 204473 484511 365851 342657 85330 -4230 102718
2675 102718 208617 70110 234948 238747 170507 251770 -70175 -363785 -287834 -72796 185599
2664 185599 413131 524952 505116 278119 40287 -22915 53410 -59183 -338966 -406723
2654 -406723 -207849 -54884 -38135 -132849 -121363 117488 -142180 -303301 -238293 -115071
2644 -115071 154291 130715 202975 100725 -269807 -331583 -280618 -361369 -294563 -175871 67222
2633 67222 267806 162015 -162379 -472561 -438835 -383091 -127614 130806 120296 -46575
2623 -46575 -49940 128201 168203 -44150 -188940 -160857 -204342 -204948 -221332 -406677 -383730 -195293
2611 -195293 146919 252605 250152 113680 10162 -328557 -305769 -212866 -237052 -190221 -294371
2600 -294371 -278334 -136843 -93555 56437 -211261 -357157 -314357 -164247 -11472 -39736
2590 -39736 -112929 41419 95506 44720 71614 118429 175445 325215 337041 350605 183239
2579 183239 181396 244480 227730 95889 200972 135343 63466 -72445 -127542 -824 -22188
2568 -22188 -2172 -59436 -80816 48152 237930 298290 394923 365083 240703 243980 227642
2557 227642 211327 200688 83461 -87853 8359 338660 397678 296177 240514 308423 316782
2546 316782 145558 39148 16551 -166297 -199811 -1309 -89908 -94710 -28142 152642 55824
2535 55824 -37154 188235 255398 348952 272183 156968 68219 147375 169633 321493 366567
2524 366567 430252 468810 465204 341000 136087 140190 199428 342568 253617 264424 45283
2513 45283 30611 41072 -45447 -103169 -21774 24409 207705 207547 219447 156926 5749 -31740
2501 -31740 106183 -213276 -298435 -405050 -180488 -38675 -76959 40898 77837 -18601 267584
2490 267584 241560 390944 419637 166834 -149740 49791 134770 -64557 119686 314012
2480 314012 341365 180736 42089 -50664 -19639 13257 65328 38117 -31675 -152373 -283572
2469 -283572 -240256 -218006 -103183 71442 167503 243407 18506 -173721 -67369 45339
2459 45339 78087 30676 136597 108922 -5958 23150 -187386 -85976 60837 260760 257866
2448 257866 365685 248892 -38615 -126761 -81740 -30993 -71157 -110812 -308960 -313724 -104762
2437 -104762 -86758 43681 -98042 -156960 -135735 -141266 -322169 -362836 -137309 -42662 -118225
2426 -118225 -107672 -416324 -401115 -87066 208428 374663 296667 127176 420771 462354
2416 462354 351306 148890 20034 278356 567227 652886 660513 623195 381289 236352
2406 236352 333901 421889 288271 10170 -8534 4332 68949 61579 -6188 62261 -30431
2395 -30431 6777 57077 331045 107410 -63616 61194 140273 56516 -105976 -247461 -358046
2384 -358046 -243686 -159147 206848 409987 404394 52975 -145483 -38386 187839 347941
2374 347941 298863 119402 -19334 -137846 -2418 -188260 -288341 -188376 163679 247575
2364 247575 290539 421827 274399 205369 164295 45276 -41538 -85531 248602 351193 249195
2353 249195 109103 161640 140677 -129166 87579 310591 342064 176035 274710 395502
2343 395502 352304 81231 180698 103037 87867 397489 385142 129800 87951 94864 36057
2332 36057 -71022 -1038 -72215 -77021 -137382 -82468 -74667 -474810 -545633 -230398 -188077 36589
2320 36589 455262 489665 229782 186726 124187 34958 93476 -22227 -28361 -21087 -179113
2309 -179113 -86492 -38117 111370 199483 262262 178928 44951 -75465 -291377 49540 257542
2298 257542 144403 110661 215249 416993 368527 193021 314631 174914 329397 183270
2288 183270 -67172 -46249 80976 170202 170431 202014 125924 -64898 -31209 105827 97310
2277 97310 144149 310684 280310 309464 256400 205696 576282 484934 285133 351828 210253
2266 210253 90610 -6940 -139117 -164920 5638 54352 116375 44156 50300 257877 273131
2255 273131 450267 539857 446230 386331 234703 166545 212733 160077 106452 47354 -46998
2244 -46998 -3115 95092 226432 351990 466411 449189 440091 409228 30953 117204 192929
2233 192929 275401 193372 -16786 161400 200204 -10865 -71895 -47125 52663 -86886 -175075
2222 -175075 -163953 -221231 -282811 -156368 76680 186644 85415 3556 71121 -11437 135128
2211 135128 431370 324099 294808 311266 262467 100544 183983 106115 -71894 -310095 -258449
2200 -258449 -87911 -6685 -66109 -184305 -111817 -248266 -216916 -3980 -63931 -273980 -371658
2189 -371658 -384851 -364125 -247995 -163443 -47222 73150 116732 155477 45774 -16117 106552
2178 106552 245734 375410 437976 297544 356809 469944 266085 131859 -31051 -115885
2168 -115885 -241459 -303179 -216658 -93400 -95214 -217374 -403643 -445200 -99452 108569 -34720
2157 -34720 -60342 37588 222154 223275 193777 -42768 -340274 -667261 -537331 -202953 -135285
2146 -135285 -190192 -142385 -178222 -66331 -7181 -57531 44434 111457 94377 -214733 -248475
2135 -248475 -217313 -98552 85327 195696 62119 129022 131450 202566 290343 119601 56478
2124 56478 -29378 -97480 40945 238207 221975 3466 214651 320999 346486 342571 288790
2113 288790 222435 243883 297915 244914 377384 297212 74089 -191529 -170682 -109785 20992
2102 20992 128260 23129 -88653 -183761 -232457 -354855 -195517 -273484 -371544 -271325 -34233
2091 -34233 -165320 -136863 -157827 -368573 -353959 -203682 -137867 195834 263406 186448 299333
2080 299333 408650 299563 238259 80332 -185315 -280770 -63822 -12098 -121937 -182202
2070 -182202 -168921 54238 26164 -67247 -60607 -124663 -169769 -212816 -148448 -76471 79881
2059 79881 214138 182132 374793 86363 -260323 -371723 -194022 57190 -226799 -162015
2049 -162015 35165 53379 -26545 -237347 -425659 -256083 -170431 -267663 -178217 181120 297829
2038 297829 155459 107549 11601 167846 218787 117035 -73958 -287191 -359056 -213896
2028 -213896 -312652 -381670 -405830 -263087 -111079 -164285 -12936 169618 25648 -92026
2018 -92026 -116196 -210015 -305876 -186672 -173170 -219545 -184987 -220773 -244355 -277543 -269487 -172158
2006 -172158 -136528 -148565 34270 177613 -36175 -456223 -620758 -565947 -500992 -406026 -375516
1995 -375516 -393170 -420631 -324530 -94488 -24376 -122097 -178870 -117928 -32584 27317 -8284
1984 -8284 120896 317182 138875 -162598 -216289 -162594 -496726 -649544 -499981 -383572
1974 -383572 -296749 -278171 -50712 -115760 -198859 -312958 -326567 -254682 -352425 -226876 -36848
1963 -36848 65516 -56944 -88699 -76469 -170980 -279734 -286873 -91423 -65819 -7629 88243
1952 88243 201155 381653 383409 348601 279944 347625 362047 282002 269308 54173 -263061
1941 -263061 -69835 55171 13177 96597 225190 516126 500849 110715 -49995 27896
1931 27896 124579 327764 168053 -30184 15838 282978 236447 1349 -102875 -65960 -26175
1920 -26175 148187 180474 204705 400021 207281 27557 954 29970 -142999 -68645 -155519
1909 -155519 -277952 -209402 -145584 -44130 48765 182182 226678 192310 184217 179029 31043
1898 31043 -28463 -19490 -140750 -69452 -45194 163631 250974 219136 138827 -7736 -345719
1887 -345719 -371876 -210389 -149648 -158163 144559 192563 43443 141218 158645 137735 168333
1876 168333 171610 -175181 -467389 -433194 -426289 -339468 -254173 -103760 -86151 -80691 -127713 -17627
1864 -17627 264670 449570 248097 160616 128564 168704 224617 104180 128044 345020 422476
1853 422476 318966 78175 -75707 -60140 129286 127976 65736 62887 -54459 -232363 -199455
1842 -199455 -265354 -396629 -208228 5085 -5612 -71929 12533 212314 352312 294966 -52907
$$ [...]
##END NTUPLES=NMR SPECTRUM
##END=
