##TITLE=Analysis number 310620
Compound Code cc 40304
Book Reference 382/80/1
Project Code adrs
Chemist Name simons
##JCAMPDX= 6.0         $$ Bruker NMR JCAMP-DX V2.0
##DATA TYPE= NMR SPECTRUM
##DATA CLASS= NTUPLES
##ORIGIN= Bruker BioSpin GmbH
##OWNER= NMR
$$ XWIN-NMR		Version 3.5
$$ Tue Jun 21 11:34:39 2005 GMT Daylight Time (UT+1h)  MAYBRIDGE\NMR@NMR_250MHZ
##.OBSERVE FREQUENCY= 250.131544655141
##.OBSERVE NUCLEUS= ^1H
##.ACQUISITION MODE= SIMULTANEOUS (DQD)
##.ACQUISITION SCHEME= undefined
##.AVERAGES= 16
##.DIGITISER RES= 18
##SPECTROMETER/DATA SYSTEM= dpx250
##.PULSE SEQUENCE= zg30
##.SOLVENT NAME= CDCl3
##.SHIFT REFERENCE= (INTERNAL, CDCl3, 0, 16.4508)
##AUDIT TRAIL= $$ (NUMBER, WHEN, WHO, WHERE, WHAT)
$$ ##TITLE= Audit trail, XWIN-NMR		Version 3.5
$$ ##JCAMPDX= 5.01
$$ ##ORIGIN= Bruker BioSpin GmbH
$$ ##OWNER= NMR
$$ C:\u/data/dgb/nmr/ADRS/4380/pdata/1/auditp.txt
$$ ##AUDIT TRAIL=  $$ (NUMBER, WHEN, WHO, WHERE, WHAT)
(   1,<2005-06-21 11:34:20.21 +100>,<MAYBRIDGE\NMR>,<NMR_250MHZ>,
      <created by zg, POWCHK disabled, PULCHK disabled
       configuration hash MD5:
       62 19 C7 07 E1 42 D1 B7 37 6C 3D D0 77 39 F9 E6
       data hash MD5: 64K
       6B CF 7B 88 A7 4E 4C D5 DC 7E 59 7B C3 BE D2 43>)
(   2,<2005-06-21 11:34:32.57 +100>,<MAYBRIDGE\NMR>,<NMR_250MHZ>,
      <Start of raw data processing
       ef LB = 0.3 FT_mod = 6 PKNL = 1 SI = 32K 
       data hash MD5: 32K
       8C 32 A7 96 DB 61 0D E0 43 38 5F 78 16 8B F4 ED>)
(   3,<2005-06-21 11:34:34.24 +100>,<MAYBRIDGE\NMR>,<NMR_250MHZ>,
      <apk 
       data hash MD5: 32K
       1C 03 86 63 A5 BD 3B 39 04 60 34 C3 BB 9C 80 2E>)
(   4,<2005-06-21 11:34:34.88 +100>,<MAYBRIDGE\NMR>,<NMR_250MHZ>,
      <abs ABSG = 5 
       data hash MD5: 32K
       76 11 BB 0B BC F8 78 E0 35 3F 7B AB B4 4F B8 25>)
$$ ##END=
$$ 
$$ hash MD5
$$ 6F 52 93 0A B3 AA D0 29 A5 08 90 5D DB 57 57 69
##$RELAX= 
##$RELAX= 
##$RELAX= 
##$RELAX= 
##$RELAX= 
##$RELAX= 
##$RELAX= 
$$ Bruker specific parameters
$$ --------------------------
##$DU= <C:\u>
##$EXPNO= 4380
##$NAME= <ADRS>
##$PROCNO= 1
##$TYPE= <nmr>
##$USER= <dgb>
##$AMP= (0..31)
100 100 100 100 100 100 100 100 100 100 100 100 100 100 100 100 100 100 
100 100 100 100 100 100 100 100 100 100 100 100 100 100 
##$AQSEQ= 0
##$AQ_mod= 3
##$AUNM= <au_zg>
##$AUTOPOS= <16 >
##$BF1= 250.13
##$BF2= 250.13
##$BF3= 250.13
##$BF4= 250.13
##$BF5= 500.13
##$BF6= 500.13
##$BF7= 500.13
##$BF8= 500.13
##$BYTORDA= 1
##$CFDGTYP= 0
##$CFRGTYP= 5
##$CHEMSTR= <none>
##$CNST= (0..31)
1 1 145 1 1 1 1 1 1 1 1 1 1 1 1 1 1 1 1 1 1 1 1 1 1 1 1 1 1 1 1 1 
##$CPDPRG= <>
##$CPDPRG1= <>
##$CPDPRG2= <>
##$CPDPRG3= <>
##$CPDPRG4= <mlev>
##$CPDPRG5= <mlev>
##$CPDPRG6= <mlev>
##$CPDPRG7= <mlev>
##$CPDPRG8= <mlev>
##$CPDPRGB= <>
##$CPDPRGT= <>
##$D= (0..31)
0 1 0 0 0 0 0 0 0 0.06 0 0 0 0 0 0 0.0002 0 0 0 0 0 0 0 0 0 0 0 0 0 0 
0 
##$DATE= 1119350059
##$DBL= (0..7)
120 120 120 120 120 120 120 120 
##$DBP= (0..7)
150 150 150 150 150 150 150 150 
##$DBP07= 0
##$DBPNAM0= <>
##$DBPNAM1= <>
$$ [...]
##$SUBNAM7= <"">
##$SUBNAM8= <"">
##$SUBNAM9= <"">
##$SW= 20.6930455092707
##$SWIBOX= (0..15)
0 0 3 0 0 0 0 0 0 0 0 0 0 0 0 0 
##$SW_h= 5175.983436853
##$TD= 65536
##$TD0= 1
##$TE= 295.16
##$TE2= 300
##$TE3= 300
##$TEG= 300
##$TL= (0..7)
0 120 120 120 120 120 120 120 
##$TP= (0..7)
150 150 150 150 150 150 150 150 
##$TP07= 0
##$TPNAME0= <>
##$TPNAME1= <>
##$TPNAME2= <>
##$TPNAME3= <>
##$TPNAME4= <>
##$TPNAME5= <>
##$TPNAME6= <>
##$TPNAME7= <>
##$TPOAL= (0..7)
0.5 0.5 0.5 0.5 0.5 0.5 0.5 0.5 
##$TPOFFS= (0..7)
0 0 0 0 0 0 0 0 
##$TUNHIN= 0
##$TUNHOUT= 0
##$TUNXOUT= 0
##$USERA1= <user>
##$USERA2= <user>
##$USERA3= <user>
##$USERA4= <user>
##$USERA5= <user>
##$V9= 5
##$VALIST= <valist>
##$VCLIST= <CCCCCCCCCCCCCCC>
##$VD= 0
##$VDLIST= <DDDDDDDDDDDDDDD>
##$VPLIST= <PPPPPPPPPPPPPPP>
##$VTLIST= <TTTTTTTTTTTTTTT>
##$WBST= 1024
##$WBSW= 4
##$XGAIN= (0..3)
0 0 0 0 
##$XL= 0
##$YL= 0
##$YMAX_a= 238699
##$YMIN_a= -218844
##$ZGOPTNS= <>
##$ZL1= 120
##$ZL2= 120
##$ZL3= 120
##$ZL4= 120
##$ABSF1= 16.45082
##$ABSF2= -4.242352
##$ABSG= 5
##$ABSL= 3
##$ALPHA= 0
##$AQORDER= 0
##$ASSFAC= 0
##$ASSFACI= 0
##$ASSFACX= 0
##$ASSWID= 0
##$AUNMP= <proc_1d>
##$AZFE= 0.1
##$AZFW= 0.1
##$BCFW= 0
##$BC_mod= 0
##$BYTORDP= 0
##$COROFFS= 0
##$CY= 12.5
##$DATMOD= 1
##$DC= 0
##$DFILT= <>
##$DTYPP= 0
##$F1P= 14.0000005364418
##$F2P= -0.99999901652339
##$FCOR= 0.5
##$FTSIZE= 32768
##$FT_mod= 6
##$GAMMA= 0
##$GB= 0
##$INTBC= 1
##$INTSCL= 1
##$ISEN= 128
##$LB= 0.3
##$LEV0= 0
##$LPBIN= 0
##$MAXI= 10000
##$MC2= 0
##$MEAN= 0
##$ME_mod= 0
##$MI= 0
##$NCOEF= 0
##$NC_proc= -4
##$NLEV= 6
##$NOISF1= 0
##$NOISF2= 0
##$NSP= 0
##$NTH_PI= 0
##$NZP= 0
##$OFFSET= 16.45082
##$PC= 1
##$PHC0= -69.94432
##$PHC1= 3.019716
##$PH_mod= 1
##$PKNL= yes
##$PPARMOD= 0
##$PSCAL= 4
##$PSIGN= 0
##$REVERSE= no
##$SF= 250.130017801529
##$SI= 32768
##$SIGF1= 0
##$SIGF2= 0
##$SINO= 400
##$SIOLD= 32768
##$SREGLST= <1H.CDCl3>
##$SSB= 0
##$STSI= 32768
##$STSR= 0
##$SW_p= 5175.98343685301
##$SYMM= 0
##$S_DEV= 0
##$TDeff= 65536
##$TDoff= 0
##$TI= <Analysis number 999999
Compound Code 99
Book Reference 9
Project Code 9>
##$TILT= no
##$TM1= 0
##$TM2= 0
##$TOPLEV= 0
##$USERP1= <user>
##$USERP2= <user>
##$USERP3= <user>
##$USERP4= <user>
##$USERP5= <user>
##$WDW= 1
##$XDIM= 32768
##$YMAX_p= 489046899
##$YMIN_p= -489727
$$ End of Bruker specific parameters
$$ ---------------------------------
##NTUPLES= NMR SPECTRUM
##VAR_NAME=  FREQUENCY,     SPECTRUM/REAL,   SPECTRUM/IMAG
##SYMBOL=    X,             R,               I
##VAR_TYPE=  INDEPENDENT,   DEPENDENT,       DEPENDENT
##VAR_FORM=  AFFN,          ASDF,            ASDF
##VAR_DIM=   32768,         32768,           32768
##UNITS=     HZ,            ARBITRARY UNITS, ARBITRARY UNITS
##FACTOR=    0.157963299565203, 1,           1
##FIRST=     4114.84413028263, 0,            0
##LAST=      -1061.13930657038, 0,           0
##MIN=       -1061.13930657038, -489727,     0
##MAX=       4114.84413028263, 489046899,    0
$$ Real data points
##PAGE= N=1
##DATA TABLE= (X++(R..R)), XYDATA
$$ [...]
16483D8730l476L363o7934j5284K8175J67591k0614k08453j67036O0074J00524
16472g4340J1616R036K4362l9210M898k9355m4786R2663N0319j15141J67147L0120
16460H7329q870n580m116R3276k5161j65468r6645k7332j5020O8467J14431o2289
16448d6978j40206l1113J03003j173j342L4526K1685K4604j8734n0299Q0648J1326
16436a4053m4059Q431N6995p0048M6778n0878o4898K9859J8669m0478k7280M5948
16424a05014M4471j17620n8390L360m2552L9104R6763J46282N0199K1739O546
16413H4888M3819k7031q1979K467m2185P784j2096O5894R2607l7405o9253k0615
16401F895Q0017M134j13789j4528m650P7721N0021j11688J7683O2393k2055q3486
$$ plain form
16483 48730 45254 48617 -19317 -34601 -6426 161165 140551 -67902 -234938 -174864 -74340
16472 -74340 -62724 -53688 -29326 -68536 -63638 -92993 -137779 -45116 5203 -109938 57209 87329
16460 87329 78459 72879 68763 162039 136878 -28590 -125235 -152567 -167587 -99120 15311 -46978
16448 -46978 -187184 -218297 -115294 -116467 -117809 -83283 -61598 -36994 -55728 -106027 -25379 -14053
16436 -14053 -58112 -49681 7314 -62734 -15956 -66834 -131732 -101873 -83204 -123682 -150962 -105014
16424 -105014 -60543 -178163 -236553 -233193 -275745 -236641 -139878 6404 56603 78342 84888
16413 84888 128707 101676 19697 22164 -20021 -12237 -24333 41561 134168 96763 27510 6895
16401 6895 86912 91046 -22743 -37271 -41921 35800 85821 -25867 -8184 54209 32154 -51332
16389e1332j7707n0128k944q752J06462K2938n1008J9516k3185m0915P8925o3348
16377h1478J354n78M7911j5357l3319l7932L0512K7784M3774j9639k3652N1409
16365i211N51m014J7668L7021q4597k6672j5576K3483m1158j1540j1265k0366
16353a45676J19974L9589j5008J4364j9609o7879n8211Q615Q8151j7072K281K0643
16341b9838J8885o4054p7027M0222M6631R8657R4347M6887p2251p4559r9826k7531
16329i9457q4868l3990J63046J10185j1200p1133k3045J4754M7620j2322j28777
16318a29187j7622J27707q337l2026J20373o136q254j288j2203K6159L0636N0212
16306A40034l0229p6160j52481l2921Q2417J76379L2464n6973j35845m5366J15096
$$ plain form
16389 -51332 -69039 -119167 -122111 -130863 -24401 -1463 -52471 -32955 -56140 -97055 -18130 -81478
16377 -81478 -80124 -80702 -32791 -48148 -81467 -119399 -88887 -61103 -17329 -36968 -60620 -9211
16365 -9211 -8660 -12674 4994 42015 -42582 -69254 -84830 -61347 -102505 -114045 -125310 -145676
16353 -145676 -25702 13887 -1121 13243 -6366 -74245 -132456 -123841 -35690 -52762 -50481 -29838
16341 -29838 -10953 -75007 -152034 -111812 -65181 33476 127823 174710 102459 27900 -71926 -99457
16329 -99457 -184325 -218315 -55269 54916 43716 -27417 -50462 -35708 11912 -410 -129187
16318 -129187 -146809 -19102 -27439 -59465 60908 54772 46518 45230 33027 59186 89822 140034
16306 140034 109805 33645 -118836 -151757 -69340 107039 139503 82530 -53315 -98681 16415
16295A6415K4657p4969L3062L4287J33839k5776r2154p8113q3718k0025r378k6195
16283a68068k2052j9409L8399J11552Q6984K5930q3429K1458Q5415N9365j01858
16272C4287r7385J671P6284p2515j11823O3173N2910l2669R275j3539o0642K5299
16260a25674j02298L4388J45208J40506P3219m907j13931j03321m1080L7983R742
16249e0165l0226Q1747K6359m8803j2186J19468n3411o4731o511K5175n470L3290
16237A4536p4727M3345q9270R601K6593l115J9857m9813N8427M8275M6761L6339
16225H6809k2521n7769N7901o7009j1475r6584n571L2023K7758k7585n438J4079
16213g5382l2759k0106R0895K3570J03400Q3740j08585q9360K1182R4547R2724
$$ plain form
16295 16415 41072 -33897 -835 33452 167291 141515 49361 -28752 -112470 -132495 -141873 -168068
16283 -168068 -190120 -209529 -171130 -59578 27406 53336 -30093 -8635 76780 136145 34287
16272 34287 -63098 -61427 14857 -57658 -169481 -106308 -53398 -86067 -76792 -90331 -150973 -125674
16260 -125674 -227972 -193584 -48376 92130 165349 160442 46511 -56810 -97890 -59907 -50165
16249 -50165 -80391 1356 27715 -21088 -33274 86194 32783 -31948 -38459 -13284 -18754 14536
16237 14536 -60191 -16846 -106116 -96515 -69922 -73037 -53180 -102993 -44566 3709 50470 86809
16225 86809 64288 6519 64420 -2589 -14064 -110648 -116219 -84196 -56438 -84023 -89461 -75382
16213 -75382 -108141 -128247 -37352 -13782 89618 173358 64773 -24587 -3405 91142 183866
16202A83866p9653R451o3589p6979L5131n1440k6270o0947O0193N9862Q8742k1825
16190E6542R3788l0388m4610J213j2395M0295Q539j8464r1616j30718j9996J47299
16178e11m3928M6073K1473m766J00526m1094j67028m0407n2438Q5278J06149k0343
16166a1016j6068N9535k488O3482n5885p1565J03314r752P067p136k3091O5553
16154A01950k693J0717M3249p7313O2881o8665j56425r7877r0663r7220Q153O0205
16142c03701P3582M6456K8285j8971l6678l5137J24455M7018l4941l5344J05368
16131c9608J04120m1649r1193j25249K9126R5449k6696q6274j08486J4219J63561
16120a12680O2407k1763k5359P8142J4288p4807j29799j3312J06515J20469J19371
$$ plain form
16202 183866 104213 113664 50075 -26904 8227 -43213 -69483 -130430 -70237 -10375 78367 56542
16190 56542 150330 119942 75332 76545 64150 104445 112984 94520 2904 -127814 -147810 -511
16178 -511 -44439 1634 23107 18341 118867 77773 -89255 -129662 -182100 -96822 9327 -11016
16166 -11016 -27084 32451 29963 93445 37560 -34005 69309 59557 66624 59488 36397 101950
16154 101950 99257 109974 153223 75910 138791 70126 -86299 -184176 -274839 -372059 -363906 -303701
16142 -303701 -230119 -183663 -155378 -174349 -211027 -246164 -121709 -74691 -109632 -144976 -39608
16131 -39608 64512 22863 -68330 -193579 -164453 -69004 -95700 -181974 -290460 -276241 -112680
16120 -112680 -50273 -72036 -97395 -19253 -4965 -79772 -209571 -222883 -116368 4101 123472
16109A23472n7309j10977M6615K2012q9650o5748J23908O111r3551j9446j26268
16098b40831q9228J00428J43165M3619L0244N1334j4899L9474J3755M7457p9833
16087D4685R324N1622L337l9252m8836J7912M3506J7403M0475k6109q5973j6509
16075A1585l1784N1277k1186j21696m7890M5664L3797Q1179J4252l1417L3972
16064A7753Q7030M5904l8198r9135n2037L0669n8713M904L8813j66338j5383J30238
16052g4493J30350r5388j07689L8115j5182j3540O9767L4010O1856J05449o004
16041A27251K3235M458o599j64355o0323q8885j8690o940r9713O0518L7209J6480
16029a76354q261p1899R0595R7703R3679J5359P8181n5256j07390r6839j8949
$$ plain form
16109 123472 66163 -44814 1801 23813 -65837 -131585 -7677 -1566 -95117 -114563 -240831
16098 -240831 -330059 -229631 -86466 -42847 -12603 38731 23832 63306 77061 124518 44685
16087 44685 54009 105631 108968 69716 20880 38792 82298 99701 140176 114067 28094 11585
16075 11585 -20199 31078 9892 -111804 -159694 -114030 -80233 946 15198 -16219 17753
16064 17753 104783 150687 112489 13354 -38683 -8014 -66727 -61823 -23010 -189348 -204731 -74493
16052 -74493 55857 -39531 -147220 -109105 -124287 -137827 -68060 -34050 27806 133255 127251
16041 127251 150486 154944 148345 -16010 -76333 -165218 -183908 -190848 -290561 -230043 -192834 -176354
16029 -176354 -184615 -256514 -165919 -68216 25463 40822 119003 63747 -43643 -140482 -159431
16018a59431O9174J9373N1291n6116L7146N8327m417P9316m3187j49379q3058
16007a80961O165O6759Q3116K9119O3867J70715j9984j28655j59592j1775j7364
15996i8590r3281N8160K22801J47457p6979n8749l4666L090k4452j5308J26917
15985A56400J2728l4373n1831l3681k04760m159M4725N9623N0451J4439K9387
15974C8949m6322L3257j287j73008j2413Q1113n4992J06410L1805k9053r7348
15963a22889N498l34o9924K0340M7149K6332K06317J25220j57267q8036p2618
15952h0212n6980R3437r3159k066P7543L0397L0202P1811k6048n4974l3589l5804
15940g9442j7116O4026M024q2014K1492L1734o162K9010q1711K7041N7554P228
$$ plain form
16018 -159431 -90257 -70884 -19593 -75709 -38563 19764 15347 94663 51476 -97903 -180961
16007 -180961 -174796 -108037 -24921 4198 68065 238780 218796 90141 -69451 -81226 -98590
15996 -98590 -191871 -133711 89090 236547 159568 100819 66153 69243 44791 29483 156400
15985 156400 169128 134755 82924 49243 -155517 -159676 -114951 -55328 -4877 9562 38949
15974 38949 -7373 25884 24597 -148411 -160824 -79711 -134703 -28293 3512 -25541 -122889
15963 -122889 -117391 -117725 -187649 -167309 -120160 -93828 112489 237709 80442 -7594 -80212
15952 -80212 -137192 -43755 -136914 -138980 -61437 -31040 -838 70973 44925 -10049 -43638 -79442
15940 -79442 -96558 -32532 -28508 -110522 -89030 -57296 -63458 -34448 -116159 -89118 -31564 -24336
15928b4336L773O5685L3003L3866l1533q8752L8202m4588k3686O1158J0809j09104
15916g5503j65702l8259J01507R4804j9703J03262l9842j01289R926Q8300N0197
15905G698k0907M4871N8142N2945r0083j13270j02518K0687O5849M7707m4446
15894g3325M5189J9760k5266K510R544n1328q575o7079M9777R0735q1577l4583
15882a24218J33077M1116O1636K9058r8980l8462O1727L6308j2050m5679k4499
15871A9034m2035q0658j9741n9463L5181J0967J7869j0205J7939m1361n7540Q4691
15859a25322J03977P7875P03L0342j05122L2639M9954q5863l3439P2485J04643
15848A22872M4594k1941l2796m5048q7222J7578R7305L4971j9192l8744l8439
$$ plain form
15928 -24336 -20563 45122 78125 111991 80458 -8294 29908 -14680 -38366 22792 33601 -75503
15916 -75503 -241205 -279464 -177957 -83153 -102856 406 -39436 -140725 -130799 -42499 7698
15905 7698 -13209 31662 89804 142749 52666 -60604 -163122 -142435 -76586 -28879 -73325
15894 -73325 -28136 -8376 -33642 -31132 -21588 -72916 -81491 -148570 -98793 -8058 -89635 -124218
15882 -124218 8859 49975 111611 140669 41689 3227 64954 101262 89212 43533 19034
15871 19034 -23001 -103659 -123400 -182863 -147682 -136715 -118846 -129051 -111112 -152473 -210013 -125322
15859 -125322 -21345 56530 57233 87575 -17547 15092 65046 -20817 -54256 18229 122872
15848 122872 167466 145525 112729 67681 -19541 -1963 95342 130313 111121 72377 33938
15837C3938M2433M3046n007n9855k9239O0096n0827j15918J15271R1176K7426
15826A52540p7229p8732M0258K3846j04367l5853M6482N2767l1776k9298r9621
15815a40983K8328J02781N8097M178r1868q3150r2382M865K1522N0253p3942j7030
15803b29331n725J65910P0984q925Q8859o6866k5744L7588o7879m0146n3848O1988
15791g3135P0848m851L3579n613p585q4090n0777l8602m7365M757J8769K026J01826
15778h0213N8704P7211j97710m6647J44667O9426o5430L2755k7434K2434K3215
15767A0978n0148M832K0763M4623R422L8317N0111j77920j12083M9034J961M2685
15755f7425p7626j38629M9741j0668P0077J08500P4740k0621N9470L8081P8495
$$ plain form
15837 33938 76371 119417 114410 54555 25316 85412 34585 -81333 33938 125114 152540
15826 152540 75311 -3421 36837 60683 -43684 -79537 -33055 19712 -12064 -41362 -140983
15815 -140983 -112655 -9874 48223 52401 -39467 -122617 -214999 -210134 -188612 -138359 -212301 -229331
15803 -229331 -235056 -69146 1838 -7087 81772 14906 -10838 26750 -41129 -81275 -135123 -73135
15791 -73135 -2287 -7138 26441 20828 13243 -70847 -121624 -160226 -207591 -202834 -184065 -182039 -80213
15778 -80213 -21509 55702 -142008 -188655 -43988 25438 -39992 -7237 -34671 -12237 10978
15767 10978 -39170 -34338 -13575 31048 40470 78787 128898 -49022 -161105 -112071 -110110 -67425
15755 -67425 -145051 -283680 -233939 -244607 -174530 -66030 8710 -11911 47559 85640 164135
15744A64135N3760Q7081o3434j47569r9989j3690j482j61k0843m5570K11248J9866
15732A43352j32202r4411O9284K2272J11217J9565m7581l6622j29113k5118R5708
15721c649P3364l2745J7732m6080j15258M0757o5451R1781J04884k7237L4260
15710G2358J28195J1771q9873j8645j24688k8271n1255q0447k5145p7444N9869
15699b23575J34149O0135J07591K0139j4197m2181J2279O8010K5870m6512k2656
15688G9052L3892M4227p5211j09761j5556j8743Q1168J47149r5372k0248M1827
15677I2424q7887p6129k3134k4034n3417J0466L2709j2458J21308k5734j1748
15666e7634n7701J7202Q9387J1076N0476P0329o8551l4857N7895J8264k2715k51418
$$ plain form
15744 164135 217895 304976 241542 93973 -6016 -19706 -21188 -21349 -42192 -87762 123486 143352
15732 143352 11150 -83261 -13977 8295 119512 139077 91496 54874 -74239 -99357 -3649
15721 -3649 69715 36970 54702 8622 -106636 -65879 -131330 -39549 65335 38098 72358
15710 72358 200553 212324 122451 103806 -20882 -49153 -100408 -180855 -206000 -283444 -223575
15699 -223575 -89426 -29291 78300 98439 84242 42061 54340 122350 148220 101708 79052
15688 79052 112944 157171 81960 -27801 -43357 -62100 19068 166217 70845 50597 92424
15677 92424 4537 -71592 -94726 -118760 -172177 -161711 -129002 -141460 -20152 -45886 -57634
15666 -57634 -115335 -98133 -8746 2330 52806 123135 54584 19727 77622 95886 73171 -178247
15654a78247N6240J02552m5128k8948m0446j00094m8361K1929P7412N9666K5011
15643i8414R1589N7531Q9560l2309o1966q5747m2728N0577J33766M3901j27059
15632A8701n6382k6610p388o3384Q4843R0554l2130j02220j7480J5879Q2211J18848
15620A05442l4093j5581J8584k4020M8107j5575P7534l3842L8196o4949p1783
15609B8020l5472n6343K860j05207n164N1523J09295J07860j8962j8390o8011
15598g991L4035M3513j670p8845l484p653J15798n3573n4253k2857J0665Q0789
15586E4474K1817l8330M215n3748J7653N7430n8826j38595L4054Q9055R306K2329
15574B0834J1693J2566m9392J9645j37613n3287K4976N2906j675l0231J4760J67803
$$ plain form
15654 -178247 -122007 -19455 -64583 -93531 -133977 -234071 -282432 -260503 -183091 -123425 -98414
15643 -98414 -6825 50706 140266 107957 45991 -39756 -82484 -31907 101859 145760 18701
15632 18701 -37681 -64291 -71679 -135063 -50220 40334 8204 -94016 -111496 -95617 -13406 105442
15620 105442 71349 55768 74352 50332 98439 82864 160398 126556 164752 99803 28020
15609 28020 -7452 -63795 -60935 -166142 -171306 -119783 -10488 97372 78410 60020 -7991
15598 -7991 26044 69557 67887 -10958 -14442 -22095 93703 40130 -14123 -36980 -26315 54474
15586 54474 76291 37961 42176 -11572 6081 63511 4685 -133910 -99856 -10801 -1495 20834
15574 20834 32527 45093 -4299 15346 -122267 -175554 -150578 -97672 -99347 -129578 -114818 52985
15562E2985l2773j1608l2607r6006N8944K6700M8654m6426o5476m706R7024P3616
15550F8321j3413j5576r3235K8892M8268j26470l2056Q5053J39338K9510m7714
15539G0918j22313k2691k010Q2597P4574J3137N336j41141n8511J36933j13758
15528g6929r6802l899j5837R2734L9307N5652L5131M6271R6706k5403j39992K4388
15516C1327N5009J7403q8591J7549N0650m8967p2748j18437j7670L2087K9860
15505a12528J444o0483l2244Q5879R3416n1985j06644k7329J23304P0669L1280
15494A4779p2430j95546O2498J66236J5318J5354N1j2834K2707M4036K4504k3156
15482F1517j07406o2431J02955J13323j93904j76208Q5572R5144O8812L7796N8743
$$ plain form
15562 52985 20212 8604 -24003 -120009 -61065 -34365 14289 -32137 -97613 -102319 -5295 68321
15550 68321 54908 39332 -53903 -25011 23257 -103213 -135269 -50216 89122 118632 70918
15539 70918 -51395 -74086 -76096 6501 81075 94212 99548 -41593 -100104 36829 -76929
15528 -76929 -173731 -177630 -193467 -100733 -61426 -5774 29357 75628 172334 146931 6939 31327
15516 31327 86336 103739 15148 32697 83347 34380 -38368 -156805 -174475 -142388 -112528
15505 -112528 -111084 -171567 -203811 -117932 -24516 -76501 -183145 -210474 -87170 -16501 14779
15494 14779 -57651 -253197 -190699 -24463 -9145 6209 6260 -6574 16133 60169 84673 61517
15482 61517 -45889 -108320 -5365 107958 -85946 -262154 -176582 -81438 -12626 25170 83913
15471H3913Q5758L4340r8942j23123j896M8193L5356O706O108q304O5875K9273
15459A63257l1849r4795q4832j01099n5097M7985J5667J5018J43233L9939O4035
15448A21462J2632j06254o8800N4132j7393l8422l799n7815m2862K7600J52999
15437C3480Q6872R3059R0888l6447l5275Q0109o1858k6600l6538M1878L4746N737
15425B70051j0754k1648j9915r9376l9500J38122p7978q2212j79842l4409M3541
15414a13920J43800P7376n995j39354p1386P3918J6008q8611J1772Q9901k3713
15403c0204n3800M6524P0358L7025j09227M538o9072l0542J9092j3202M3356Q372
15391g6782l7761J3028J45108l3647n983P9957j1777j10119k3717q3224L3211
$$ plain form
15471 83913 169671 204011 105069 -18054 -19950 28243 63599 70305 76413 68109 133984 163257
15459 163257 131408 36613 -48219 -149318 -204415 -156430 -140763 -125745 17488 57427 121462
15448 121462 134094 27840 -40960 13172 -4221 -42643 -46442 -104257 -147119 -119519 33480
15437 33480 120352 213411 304299 267852 232577 312686 250828 224228 187690 229568 264314 270051
15425 270051 259297 237649 217734 118358 78858 216980 139002 56790 -123052 -157461 -113920
15414 -113920 29880 107256 101261 -38093 -109479 -35561 -19553 -108164 -96392 -6491 -30204
15403 -30204 -84004 -37480 32878 69903 -39324 -34786 -103858 -134400 -115308 -128510 -85154 -76782
15391 -76782 -114543 -101515 43593 9946 3963 83920 72143 -37976 -61693 -144917 -111706
15380a11706k9014K0733k6013J3894Q0140m7474J05146P5313j3692Q0385N4424
15369B02136J18636J4730K5441K8957L0731J07328J6450q0743j60481j23907L3898
15358B13176L5861J06592Q6992M9874q4863j25132j63690J9645k8805L0537J00055
15347B40242p7000j34614k3880N0713J8861m096k0966O1348K1280P0407q2342
15336A19953k05308m8777K7227J29273N6121m587K5051J1443j32178n0342J6195
15325e5929N7040j71787l9039N6791M3006K8146N9925K7949m7904n5980P9898
15314a7884k2531j32295q8782R1342J09355l8745M4716Q4808k0345p171q0877
15303g8409p7750L9382Q5034k2245L4491J16797K482j60161j3709R5049L1949
$$ plain form
15380 -111706 -140720 -119987 -146000 -132106 -51966 -99440 5706 81019 67327 147712 202136
15369 202136 320772 335502 360943 389900 420631 527959 544409 463666 303185 179278 213176
15358 213176 249037 355629 442621 492495 407632 282500 118810 138455 109650 140187 240242
15347 240242 163242 28628 4748 55461 74322 70226 49260 110608 131888 202295 119953
15336 119953 -85355 -134132 -106905 22368 78489 73902 98953 110396 -21782 -72124 -55929
15325 -55929 1111 -170676 -209715 -152924 -109918 -81772 -21847 6102 -41802 -97782 -17884
15314 -17884 -40415 -172710 -261492 -170150 -60795 -99540 -54824 29984 9639 2468 -78409
15303 -78409 -156159 -116777 -31743 -53988 -19497 97300 99782 -60379 -74088 20961 52910
15292E2910R9980q4574j56686J0603M0674K8426j1010j17588l7412O5123l5659
15281a45213m40J47702L7704m5383R4129Q2554j18609K180j78847j3816J41509
15270C470Q7620j03184l9712l7515M0433N2390J6974n634r7707J4554J03343j9455
15258A5577q0542k5326p5758o2054N9499Q9312k8231l5716l7174O8712q8274N0509
15246a49466J57362K161K4064L4997p8605m0963K7814R4554J0077j39268p767
15235f5040J24910L0445j38133r3015n2544k2037K3525O4534m3623P3089J46034
15224D8145n2946M0993p7965l9233J27467J18305q4435n3570P1189J49018J1080
15213B58048m4545m5290J3093m2981l2691k1849P3284l812n1132j07951o9266
$$ plain form
15292 52910 152890 68316 -88370 -77767 -37093 -8667 -19677 -137265 -174677 -109554 -145213
15281 -145213 -145653 2049 39753 -5630 88499 171053 52444 54624 -124223 -138039 3470
15270 3470 91090 -12094 -51806 -89321 -48888 3502 20476 14842 -82865 -68311 35032 15577
15258 15577 -64965 -90291 -166049 -228103 -168604 -79292 -107523 -143239 -180413 -111701 -199975 -149466
15246 -149466 7896 10057 34121 69118 -9487 -50450 -22636 71918 81995 -57273 -65040
15235 -65040 59870 90315 -47818 -140833 -193377 -215414 -191889 -127355 -170978 -97889 48145
15224 48145 -4801 36192 -41773 -81006 46461 164766 80331 26761 97950 246968 258048
15213 258048 213503 168213 181306 138325 105634 83785 157069 153257 102125 -5826 -75092
15202g5092j7587l7330L4044O4376L3097J7931K5438j9251m4187R019J4022j54564
15190a50084L0323M032N4019j3884K8348p2705K0947P5894k704j2167P7183k3154
15178A6048k6451n4905M7008J42443N2773J2304K95l2707j73424K8156j9439M9960
15166D2061m0539Q60p7546N8937N9246J90942j816j12978m3339m8575j2138P3694
15154H8809m7963j01636P8166M5776o9454N5543L3202P7298n5223o2839n2920
15143a1241l245J07728P8826n6294q6401n2638m2153j1068N2518O495p8513l050
15131i9036P2953m1426j36622l3726N7662P7357J57774P0894o8882l751k1095
15120C2102J679M4179J28555M8090k9089j7147K3785M2307N4529q0984j01629
$$ plain form
15202 -75092 -92679 -130009 -95965 -31589 1508 19439 44877 25626 -18561 -9542 4480 -150084
15190 -150084 -119761 -115729 -61710 -75594 -47246 -119951 -99004 -23110 -25814 -37981 39202 16048
15178 16048 -10403 -65308 -18300 124143 176916 189220 189515 156808 -16616 11540 -7899 42061
15166 42061 1522 2382 -75164 -16227 43019 233961 232145 119167 75828 27253 15115 88809
15154 88809 40846 -60790 17376 63152 -6302 49241 82443 159741 104518 41679 -11241
15143 -11241 -14486 93242 172068 115774 29373 -23265 -65418 -76486 -23968 -17473 -95986 -99036
15131 -99036 -26083 -67509 -204131 -237857 -180195 -102838 54936 125830 56948 53197 32102
15120 32102 33781 77960 206515 254605 225516 208369 232154 274461 328990 248006 146377
15109A46377j6737N909j4259j39297K3203L6398k3994N1507o3926n0652q5645
15098a31116k5722L5478J94759O9457j40408j0824P8032r711j6418K9532j1475
15087F1584j2977J48070j1846n9125j11446j14823O014L755K0958j12118J9075
15076a62879P256Q6774M3742j2081L2682m9243j5608m5277K1159m067K4439k0268
15064i3371o7514n6634P4335M6710j1562K0829K0970k9590J4341N0765J3530O309
15052a0882O6736j01148R9053J54283J27354j67697n4641j1569o2396m069Q5122
15041A20146P8752n6758o6726k6572k4506J95454J41730j46886p2752k1630J1617
15030A31869j3597l321l3032l3358O4294R734l2216j09012l4606j2212n1195n6361
$$ plain form
15109 146377 129640 135549 121290 -18007 5196 41594 17600 69107 5181 -45471 -131116
15098 -131116 -156838 -121360 73399 142856 2448 -8376 69656 59945 43527 73059 61584
15087 61584 48607 196677 184831 125706 14260 -100563 -94549 -90794 -69836 -181954 -162879
15076 -162879 -155623 -68849 -25107 -37188 -4506 -53749 -69357 -114634 -93475 -97542 -73103 -93371
15064 -93371 -160885 -217519 -143184 -96474 -108036 -87207 -66237 -95827 -81486 -30721 -17191 -10882
15052 -10882 55854 -45294 53759 208042 335396 167699 113058 101489 39093 35024 120146
15041 120146 198898 142140 75414 48842 24336 219790 361520 214634 141882 120252 131869
15030 131869 118272 114951 81919 48561 112855 122589 90373 -18639 -53245 -65457 -116652 -173013
15018a73013N7956j7144P5505m2825j1750J44029N6502J1140J18155J11538J87669
15007E17762K00881K85725M01270N01971N62576N86839K87556n65715p29827l66893
14997A682145l56958l54123j82521k33179j35290j08935m321N6177o9652l3478
14987B59865M6732M889k3490j3266j09264M8748j31296r228K7298j04898J47442
14976A43532m5872j37761R2688J13788j34405q101N111j05201j3556J08600O5793
14965H4616l0746m7228j2241J1325J33553N6906J4638R8802Q488n9902J9301k8330
14953B49182l139k4425l2340j19539M1622l334k7256K8017j07740p1595K9386
14942d1161L8871K4936q2414O6960o017p3033O2280J16032K2019n2425j4914n600
$$ plain form
15018 -173013 -115057 -132201 -56696 -99521 -111271 32758 89260 100400 218555 330093 517762
15007 517762 718643 1004368 1405638 1907609 2470185 3057024 3344580 2778865 2049038 1682145
14997 1682145 1325187 971064 788543 555364 420074 311139 306818 362995 293343 259865
14987 259865 306597 311486 287996 274730 165466 214214 82918 73690 100988 -3910 143532
14976 143532 97660 -40101 52587 166375 31970 23869 28980 -76221 -89777 18823 84616
14965 84616 53870 6642 -5599 5726 139279 196185 210823 309625 318113 258211 277512 249182
14953 249182 246043 221618 189278 69739 111361 108027 80771 108788 1048 -70547 -41161
14942 -41161 -2290 22646 -59768 7192 1175 -71858 -9578 106454 128473 76048 61134 55534
14930E5534p53o7912r326L4043K4250Q6891O9981o8873j57933j04416J09503K54036
14918B25025R3833m2639r9972k0914r9962k2801j6773m5182k5110J08834L811
14907E8150k0329k948P5029q99K1014k5731n2848J0497P033N2665k2176m5244
14895E4213o4086m0636n5639J31478m0464p1557P2785K612M5399J25010l5029
14884A24086n7283k6537N7488K1865N201r4600q6404l1407M4646m1053M6707O8379
14872C1088R8767L3278l9619P974Q3402L3054j6171j56253j29817J1634L6947
14861e716Q7037M1902J0070J0768o1198l6291J3830J28621J88648k363J5225J2887
14849D03420J41945J30664J43314K12265R6360K33774J99793M2204R4736O17J0991
$$ plain form
14930 55534 54781 -13131 -22457 11586 35836 122727 192708 123835 -34098 -138514 -29011 225025
14918 225025 318858 276219 176247 155333 55371 32570 15797 -29385 -54495 54339 58150
14907 58150 37821 34873 109902 109003 130017 104286 51438 61935 68968 121633 99457 54213
14895 54213 -9873 -50509 -106148 25330 -15134 -86691 -13906 -11294 34105 159115 124086
14884 124086 66803 40266 97754 119619 124820 30220 -56184 -87591 -42945 -83998 -37291 31088
14872 31088 129855 163133 123514 131488 214890 247944 231773 75520 -54297 -42663 -5716
14861 -5716 81321 123223 133293 144061 82863 46572 60402 189023 377671 375308 390533 403420
14849 403420 545365 676029 819343 1031608 1127968 1361742 1561535 1603739 1698475 1699092 1710083
14838A710083j37829j65824k08036k87682j63308j35849j82229n6611l350j9908
14828C49457j09210K6583k2237K9865k3419o3704j67345L3902n0280m4217l4671
14817g5276R9689J64647k6948r5292M0595j9348j11304o6238J29843R7147O4289
14806B01804J2498p8365j38246M8132J07150q288j14935j11572L1260P3515L2963
14795E5916P3712N3986p5554j92380k0199J12173m6186k4094J73107n3705l7408
14784A9368J04581q8682j29874j3711J13940Q144p354q2114j2711J42783M615
14773E8985o3011j01736J466K3332J32474L8542J9350l0753j6045k9514J10004
14762A43094j3691O7689p2226j80034l6006J84L0938J00773J07102l9159r4002
$$ plain form
14838 1710083 1572254 1406430 1198394 910712 747404 611555 429326 372715 369365 349457
14828 349457 240247 266830 244593 274458 251039 187335 19990 53892 3612 -40605 -75276
14817 -75276 24413 189060 162112 66820 107415 88067 -23237 -89475 40368 137515 201804
14806 201804 214302 135937 -2309 45823 152973 144685 29750 -81822 -50562 22953 55916
14795 55916 129628 183614 108060 -84320 -104519 7654 -38532 -62626 110481 56776 19368
14784 19368 123949 35267 -94607 -108318 5622 13766 6412 -75702 -88413 54370 58985
14773 58985 -4026 -105762 -104296 -80964 51510 90052 109402 78649 62604 33090 143094
14762 143094 129403 197092 124866 -55168 -91174 -90990 -60052 40721 147823 108664 14662
14751A4662n4608J3099J8943J02896k0439r7015m8416n5500j29825l2586J4832
14740b73957K9819J28147N9738P1085N6961L3452J7354R5906j19499j21999J2029
14729a0964R3848j02398j1530n7285p3924m9955N5348n423J2760K4480J4464K736
14717a07843m513l8129p2211l6602K0715L3840P0585L6616P0744Q2340J8522J28959
14705B03023k6798j30339L2029q905n5342j9714Q8653Q2496O245k833r7572k8481
14693D2462K4428L0694r7007k6076j9106N5812O703M1860J03642K8O9813L9479
14681B72732j95471r3559j283L8797J0777j20610o9115L9530Q4552p754J4260
14670b7144J12175N6481k8502j19431m3624n2456P6060q877K142M5336P3476M7161
$$ plain form
14751 14662 -39946 -26847 -7904 94992 74553 -22462 -70878 -126378 -256203 -288789 -273957
14740 -273957 -244138 -115991 -56253 14832 71793 105245 122599 218505 99006 -22993 -10964
14729 -10964 82884 -19514 -31044 -88329 -162253 -212208 -156860 -162283 -149523 -125043 -110579 -107843
14717 -107843 -112356 -150485 -222696 -259298 -238583 -204743 -134158 -97542 -26798 55542 74064 203023
14705 203023 176225 45886 77915 69010 13668 -6046 82607 165103 171348 168515 70943 42462
14693 42462 66890 97584 577 -25499 -44605 11207 17910 59770 163412 163440 233253 272732
14681 272732 77261 -16298 -17581 21216 31993 -88617 -157732 -118202 -33650 -41404 -27144
14670 -27144 85031 141512 113010 -6421 -50045 -102501 -26441 -35318 -33176 12160 85636 132797
14658A32797J18857M6698Q3027r9887M3299M2588n8020j06854q4745p1740n9164
14647a3144K4878N7100L096k9548r4314n7193o1106k9193P7364J27575R3938L7559
14635A37012K60o8950l5501q3988m0115l003J7752n3588O7652j6816L1655J21584
14623G3954L1729J24483L7182j13690j06290n313N8921P3129L4503n5214o9191
14612H4203M2188k9109m3013n4762n8573m9556N406k381O743P4174Q1720r8490
14600d1450K0438R6107L7322j2849J8534J18344q3954J8811M9281j30969l17189
14589b27574P7933J54885O2801O1144p5866L5923O5565l4937j38654q8906L7479
14578g0207M8209J18676P1684j74861k4000n7484N7031J44438q7192n7974J1931
$$ plain form
14658 132797 251654 298352 381379 281492 324791 367379 309359 202505 117760 46020 -13144
14647 -13144 11734 68834 71930 42382 -51932 -109125 -170231 -199424 -122060 5515 99453 137012
14635 137012 137272 68322 32821 -51167 -91282 -94285 -76533 -130121 -62469 -79285 -47630 73954
14623 73954 105683 230166 267348 153658 47368 42055 100976 174105 208608 153394 84203
14612 84203 126391 97282 54269 -493 -59066 -108622 -103216 -105597 -98854 -24680 57040 -41450
14600 -41450 -21012 75095 112417 99568 118102 236446 152492 171303 220584 89615 -227574
14589 -227574 -149641 5244 68045 129189 53323 89246 154811 119874 -18780 -107686 -70207
14578 -70207 -21998 96678 168362 -6499 -30499 -87983 -30952 113486 26294 -31680 -19749
14567a9749J07053O5060o9716m0952K8066j4284p7726K6524m0669m2989O8382
14556a1000J54520j3730l769O4875k4733k8545L9814N6324J55306j735j69217
14545B18110j01032p5639M8367Q24j49968N4629L4691j6209k9177j5366J468L2043
14533B741L9522K2545K0558O410L4001k7656p7962q622O3377P5442p5835l5686
14521C8835J5804P0713n5338j26004r8703l9715P7605K1400n3032K3702P4857
14510d9876P8478m2824j8072k929K2366L1076R987j7477K7727l5303k058j7023
14498a5928n7546j7747R7563p7258p0962p4420k4235Q4445Q6092J0592P9412P3839
14486I3847O5304r447k7459J05008q5817j20463m9197J38375M51j25264N5410
$$ plain form
14567 -19749 87304 152364 82648 41696 69762 55478 -22248 4276 -36393 -79382 -11000
14556 -11000 143520 129790 126021 190896 166163 137618 177432 233756 389062 387327 218110
14545 218110 117078 41439 89806 90630 -59338 -4709 29982 13773 -15404 -30770 -29302 2741
14533 2741 42263 64808 85366 91776 125777 98121 20159 11537 74914 150356 74521 38835
14521 38835 54639 125352 70014 -55990 -154693 -194408 -116803 -95403 -148435 -124733 -49876
14510 -49876 28602 -14222 -32294 -35223 -12857 18219 28206 10729 38456 3153 1095 -15928
14498 -15928 -73474 -91221 6342 -70916 -141878 -216298 -240533 -156088 -69996 -59404 20008 93847
14486 93847 159151 149704 122245 227253 141436 20973 -28224 110151 110602 -14662 40748
14475D0748J01167n1553q4979k7741l2915l3594R4114p1497q880o9061R8931J45041
14463I9781N7834K1837k9826L4920o8706q0776J1265Q5182n0281o4890l1602o0136
14451g5398J12250J8387q1171n724P373r802M943R0169M4379k0793K5246P3222
14439A83081p2845J2770J4041j25470k2799l7383Q3089R3869j24064P144p5111
14428f3678j1761L5296j6717k8385Q6803P9949N5080K5258J002J5931n6591j17127
14416E060J790o7119k4033O4383M1818O0085r174l1884L5449o4413p7018o6709
14404a31765m5135O9442j0398j9075k9356O4008M7531R8236r528M1361J56320
14393B31641q3062j18874q666K4731r031k1081J68198K1790o1094m773o2161j10541
$$ plain form
14475 40748 141915 90362 5383 -22358 -55273 -88867 5247 -66250 -75130 -144191 -45260 99781
14463 99781 157615 179452 149626 184546 115840 35064 46329 131511 81230 16340 -15262 -75398
14451 -75398 36852 55239 -25932 -31656 -24283 -34085 -29142 61027 105406 84613 109859 183081
14439 183081 110236 123006 137047 11577 -11222 -48605 34484 128353 4289 11433 -63678
14428 -63678 -75439 -40143 -56860 -85245 1558 81507 136587 161845 162847 178778 122187 5060
14416 5060 6850 -60269 -84302 -19919 21899 81984 72810 40926 76375 11962 -65056 -131765
14404 -131765 -176900 -107458 -117856 -136931 -166287 -102279 -54748 43488 33960 75321 231641
14393 231641 148579 29705 21039 45770 36739 15658 183856 205646 144552 139779 77618 -32923
14381c2923k9214l7509Q3365Q1358K490l48J8119l9655k3897K4851l7981j9756
14369a1100o0821K160r4411m3172P3763o7524L5336K4915j69044P0529J63421
14358g5948J14699k5504R086J30381K6582j99982l3877L2196q4674j48438J3747
14347b41732J34568O0762p3375J1733R6127J145j13508L0776P8059k6746K4454
14336a7737j7566M7383k1622j1205K8488M2462J1085m0426p6735k1394L1420N7925
14324A2078l6549J5121r4455j858p1854L9473J22519O1996O9935o5286n8465O4440
14312E7095m4060j02885n1341J08957J39991L4151m5869K4091j17564j64380j1498
14301a73312P4022K3319J62785m0313l9074o8821l5209P4073M1758m1854j6477
$$ plain form
14381 -32923 -62137 -99646 -16281 65077 67567 67219 85338 45683 21786 46637 8656 -11100
14369 -11100 -71921 -69761 -164172 -207344 -133581 -201105 -165769 -140854 -309898 -239369 -75948
14358 -75948 38751 13247 22333 152714 179296 -20686 -54563 -22367 -107041 -255479 -241732
14347 -241732 -107164 -46402 -119777 -108044 -11917 -10772 -124280 -93504 -15445 -42191 -17737
14336 -17737 -35303 12080 -9542 -20747 7741 50203 61288 20862 -55873 -77267 -45847 12078
14324 12078 -24471 -9350 -103805 -105663 -177517 -138044 -15525 46471 116406 51120 -7345 57095
14312 57095 13035 -89850 -141191 -32234 107757 141908 96039 120130 2566 -161814 -173312
14301 -173312 -99290 -75971 86814 46501 7427 -61394 -96603 -22530 19228 -22626 -39103
14290c9103l1757J2992o554Q330n0263j27031O9108J89145N1919r5236k9331K0245
14278b7536j5747P4828p5315q7629k7355m0192k8405L1367K31280O5414K0138
14267A20848p5964l0410n2988q9111j10887N7892J11655J22484m1145j9389k3686
14256c0701K1669O8369j11367j4365J19634K8546j16333O2056J71401L7681j04500
14245A32090j03988M7931J22209K0441K6721r0015p5506l5927j8122r4315j36681
14234b05162K2552R6507L3082r5036j96890r451J07989o3210m529J7185J09338
14223a87625O3181Q6177M566j2343K5382j6712Q375J24649O7299n123o5864L4640
14211A26602N87L7144K8392K7628j0725m5851j59205n7088k5571n469l5424l5895
$$ plain form
14290 -39103 -70860 -57868 -64422 -56092 -106355 -233386 -164278 24867 76786 -18450 -47781 -27536
14278 -27536 -43283 31545 -43770 -131399 -158754 -198946 -227351 -195984 35296 100710 120848
14267 120848 44884 14474 -38514 -127625 -238512 -180620 -68965 53519 12374 -7015 -30701
14256 -30701 -9032 59337 -52030 -66395 53239 81785 -34548 27508 198909 236590 132090
14245 132090 28102 76033 198242 218683 245404 155389 79883 43956 25834 -68481 -205162
14234 -205162 -182610 -86103 -53021 -148057 -344947 -354398 -246409 -309619 -314148 -296963 -187625
14223 -187625 -124444 -38267 -33701 -46044 -20662 -37374 -28999 95650 162949 157826 91962 126602
14211 126602 127189 164333 192725 220353 209628 163777 4572 -52516 -78087 -83556 -118980 -154875
14199a54875J30718K9500j1375k5167K0950L7221N894O7917R9404k5792q018N5554
14187B21931l6903r5041k12958n1279n2897m3104p1486K2497M1909L6043J30322
14176a10966M166K4863K0143J1126Q4087M8476k4486Q1676l8536k6463O133n8094
14164B2125J8323J7763J04921J1728j07547k860M0636o1998o0537J01557m9141
14153C4970j24807P234k7733k2371J01269O2899n7529n1750m649R6246K6217j47174
14141a07178k7463J29421M3060m4493N0442J7061n6499j34472q8638R3402J37867
14130A2510J9585L4293L3166J4099j27733q5108j3357o285o0677j1779J10252
14119h1034J46245m181L3422m8819r4504l6412l0465N9232L1690P6115n7809L0551
$$ plain form
14199 -154875 -24157 5343 -6032 -31199 -10249 26972 32866 100783 200187 174395 166377 221931
14187 221931 185028 89987 -122971 -174250 -227147 -270251 -341737 -319240 -277331 -241288 -110966
14176 -110966 -106800 -81937 -61794 -50668 33419 81895 57409 139085 100549 74086 80219 22125
14164 22125 40448 58211 163132 174860 67313 64453 105089 43091 -17446 84111 34970
14153 34970 -89837 -82603 -110336 -132707 -31438 31461 -26068 -77818 -82467 13779 39996 -107178
14141 -107178 -134641 -5220 37840 -6653 43789 60850 4351 -130121 -218759 -125357 12510
14130 12510 32095 66388 99554 113653 -14080 -99188 -112545 -118830 -179507 -191286 -81034
14119 -81034 65211 61030 94452 45633 -48871 -85283 -115748 -56516 -24826 51289 -6520 24031
14107B4031j7602q7634N9818k9221O9664J41557n8421j15198o1901R0636J9720
14096C5449J41808k8144J1145j4715k11647o0110K4304J16196O6044J8727N5446
14085A54503O5787p2683o5281K7974J00139r8414m1044J8367j6371r5645j06207
14074a28875P4284P8155M445J31575K9246o355k7454p9487L4995J9695j60969
14063c0745j52578k259L5698J30753m4712K524J20731M0725p4191n2109K6258
14052I5R264R2733J2103j02202k3148J7629L966o356m8384M8217q6306j9243L9488
14039f2144j59732o5542J38739N8278k5549O1030J06273O7q3698q2310j04046
14028b18634K5719J14123n2892K9406m6710m074N4466Q0498p9777j5714N7793
$$ plain form
14107 24031 6429 -81205 -21387 -50608 19056 160613 102192 -13006 -74907 15729 35449
14096 35449 177257 149113 160258 145543 -66104 -126214 -101910 14286 80330 99057 154503
14085 154503 220290 147607 82326 110300 210439 112025 70981 89348 72977 -22668 -128875
14074 -128875 -54591 23564 28009 159584 188830 182475 155021 75534 110529 130224 -30745
14063 -30745 -183323 -185582 -149884 -19131 -63843 -61319 59412 100137 25946 -26163 95
14052 95 9359 102092 114195 11993 -11155 6474 10440 4084 -44300 3917 -82389 -101632 -62144
14039 -62144 -221876 -287418 -148679 -90401 -115950 -54920 51353 51420 -32278 -114588 -218634
14028 -218634 -192915 -78792 -131684 -102278 -148988 -153062 -98596 -18098 -97875 -113589 -55796
14017e5796l3722L5707n1731m862M4479N6732K1825N0188j02992p3817k3207k7322
14005a64518r8579K9285R2037Q9173k273j4409j9453P981p5075M2743J20025m9184
13993d2247j25918r1625J01752J60526L434J62527j0119j13846L7846j4529j22390
13982e4589r5107J8746P239R0958J36408R3777q642L7591o1084j19732p6548o3709
13970i4692M8038N2835K833m490p5222m6491j1253O220L0217N6220O2848r0626
13958f3563J3430J21424j7710r7292P0895r7849K1413k8905q082P8680J4780J4687
13946B1908J1695K7595p3036J3585N5887j39434j07738R449m8137R5099J6552
13935a16575n3008q375K6815k822J16832M2505j9851K4149m7732p150N2293R6499
$$ plain form
14017 -55796 -89518 -53811 -105542 -110404 -65925 -9193 12632 62820 -40172 -113989 -137196 -164518
14005 -164518 -263097 -233812 -141775 -52602 -54875 -69284 -88737 -80756 -155831 -113088 6937 -42247
13993 -42247 -168165 -259790 -158038 2488 5922 168449 158330 44484 82330 67801 -54589
13982 -54589 -149696 -130950 -123711 -32753 103655 197432 188790 226381 165297 45565 -30983 -94692
13970 -94692 -46654 6181 9014 4524 -70698 -117189 -128442 -122222 -92005 -35785 27063 -63563
13958 -63563 -50133 71291 53581 -43711 27184 -70665 -49252 -78157 -86239 -7559 7221 21908
13946 21908 33603 61198 -11838 1747 57634 -81800 -189538 -180089 -228226 -133127 -116575
13935 -116575 -169583 -177958 -151143 -153965 -37133 5372 -14479 9670 -38062 -45212 7081 103580
13923A03580J16468j09303n5484k6911j08998l7577M3248O4563m1091O460Q3468
13912C8423Q3791L4896J7859j37830m7260J08257k5093k3038P3869L9589k3259
13901A40204K5769j19926J8632N481j3687J47590O1443j3462M3799n5872q5395
13890A54576M7085r712j27735J4750o668m4757O9568n8354j20001M9125k6074
13879e8197n4233J00697Q4352o5963j1692j896J3215m189J1207Q7968R602J4450
13867A25321J13932j51428j5993L1647R788Q337k4661N1416q7569q5691M0645
13856A5744Q9437K473p8127k6973M2098r6378J02877P0266j77760O1943J17148
13845A22748O742j16077k3765K9247L8710P8241j7287j26465K7127m83l3639k7782
$$ plain form
13923 103580 220048 110745 55261 28350 -80648 -118225 -74977 -10414 -51505 -45045 38423
13912 38423 122214 157110 174969 37139 -10121 98136 73043 50005 123874 163463 140204
13901 140204 165973 46047 64679 70160 56473 204063 265506 252044 295843 239971 154576
13890 154576 201661 191949 64214 78964 72296 27539 97107 38753 -81248 -32123 -58197
13879 -58197 -112430 -11733 72619 6656 -5036 -6932 6283 2094 13301 101269 110871 125321
13867 125321 239253 87825 71832 103479 113267 121604 96943 148359 60790 -24901 15744
13856 15744 105181 107654 29527 2554 44652 -51726 51151 121417 -56343 5600 122748
13845 122748 129490 13413 -10352 18895 57605 135846 118559 -7906 19221 18738 -14901 -42683
13833d2683q9234L0035P6530L0516N505J40J05990K3566Q4611n9412m3642r3561
13821B8361j5916k3642N8896J11680l6864q4004J99022n1189r7476k1149L1771
13810I9490J3517m9801o9611M1570L000j3035N8565n5008o2372l6423O0025Q7203
13798G7120O9251K8312O0426J01964p0586j33002r4806P059q6361q531M1378r631
13786a7407J0756l6987j600K1480k5038j42957r980m7882N1784R4387J8600p8483
13774a63327n5035l7890k3581J47998J13609O5495l7444P4336p0308j0634l8696
13763c5477J5636O0754n7922P2801j7193n8886j9050p2995k5914K2540Q1171J05200
13751G0665J7665K6155P0289p8722j68376L1658J5290n7815q737O0634k3965q9903
$$ plain form
13833 -42683 -131917 -101882 -25352 5164 10669 10809 116799 140365 224976 165564 121922 28361
13821 28361 12445 -11197 47699 159379 122515 38511 237533 186344 88868 67719 99490
13810 99490 113007 63206 -6405 35165 38165 25130 83695 28687 -33685 -70108 -10083 77120
13798 77120 146371 174683 235109 337073 266487 133485 38679 45738 -40623 -49154 -7776 -17407
13786 -17407 -6651 -43638 -45238 -23758 -48796 -191753 -201733 -249615 -197831 -103444 -84844 -163327
13774 -163327 -218362 -256252 -279833 -131835 -18226 47269 9825 84161 13853 3219 -35477
13763 -35477 -19841 40913 -17009 55792 38599 -20287 -39337 -112332 -138246 -115706 -34535 70665
13751 70665 88330 114485 184774 106052 -62324 -30666 -15376 -73191 -81928 -21294 -45259 -135162
13739a35162o2986l6397N2353j5008O5796Q9968p0851J3579K8725N9536P2705
13728F2258o187k7070l9364M0536L537o993n1093K990M8039P7980N782K898j08655
13715D658k3292j1586k1913j8251Q5906k6739n6745J84232k5317o0398n0977O3336
13703D2914J60751J06569j49027j30555r4966k6557q6118J8839J15717J2400J4369
13692a5664j2463n635Q9446P9036r2663j14011N753m5985M1633R6765k5159j32017
13680a30964l0622R7405M521J0712l3024n3738P8296P9337k9187j16606k5442
13669a49312K5381J00349O540l6351q2239J8140J86199J07863P7062k0319q0987
13658A52326M8917r249l2017k7275o3042M3798k7933o9370q7450o4829R636k0439
$$ plain form
13739 -135162 -198148 -234545 -182192 -197200 -131404 -41436 -112287 -98708 -69983 -10447 62258
13728 62258 56071 29001 -10363 30173 33710 26717 -24376 -21386 26653 104633 110415 113313 4658
13715 4658 -18634 -30220 -52133 -70384 15522 -11217 -67962 116270 90953 30555 -20422 42914
13703 42914 203665 310234 161207 30652 -64314 -90871 -176989 -158150 -42433 -30033 -15664
13692 -15664 -28127 -33762 55684 134720 42057 -71954 -66201 -112186 -70553 26212 1053 -130964
13680 -130964 -161586 -64181 -59660 -48948 -81972 -135710 -57414 21923 -7264 -123870 -149312
13669 -149312 -123931 -23582 -17042 -53393 -135632 -117492 68707 176570 253632 233313 152326
13658 152326 201243 191994 159977 132702 69660 113458 85525 16155 -71295 -136124 -126488 -146927
13646a46927O7964J32266p0104P9490R5412m0792j09747k2348q9920j5164P617
13635a12253J2704L0537o0670O0456N5668J9049m6249j7867N1363l2484j41917
13624a81663K6131K5417r3700k0793Q512Q9950M3322L1402N3706O892j8764n1068
13612h0656K3907K1709p4596J18880R4236k5130P8888J5526q2113n4946j7307
13601A8398o9036q438L7727O4015Q8834l5789l9923j19654j70570p959N4823m3016
13589b30588P6010J40735l1055r7744Q5281K5284n9630n582k4909o3472j9598
13578b05268l75J19098J12738J8865q048J01633M7628K9918j21081p4469m0261
13567a9622m7276J23416q040k7734J8741M061L171m2254M9827p2908l900M1146
$$ plain form
13646 -146927 -78963 53303 -16801 62689 158101 117309 7562 -14786 -104706 -119870 -112253
13635 -112253 -99549 -69012 -129682 -69226 -13558 5491 -40758 -58625 -7262 -39746 -181663
13624 -181663 -155532 -130115 -223815 -244608 -236096 -146146 -102824 -71422 -17716 -10824 -29588 -80656
13612 -80656 -56749 -35040 -109636 9244 103480 78350 157238 172764 90651 35705 18398
13601 18398 -50638 -59076 -21349 42666 131500 95711 55788 -63866 -234436 -242395 -187572 -230588
13589 -230588 -154578 -13843 -44898 -142642 -57361 -32077 -91707 -97289 -122198 -185670 -205268
13578 -205268 -205643 -86545 26193 45058 37010 138643 186271 216189 95108 20639 -19622
13567 -19622 -66898 56518 48478 20744 39485 43546 46717 4463 54290 -18618 -22518 18628
13555A8628O484o4127R2151J3278n9541l1360N9502J68091K47n2817P6310J15289
13543C42135R0662K8748Q1894J24695M0328N1454J7806k2314Q462K2126l2674
13532G53322r3069j5438O1179j12279q2154Q168r982j63489k35040m9429J7564
13521G9353O277m1838q7172l1195k6040J35070J02285J9204J16470N3553m9561
13510B76406j7412J2976l0421J6454L4951p5042o6313j15599r8189N2954K2834
13499A3599l8717J6628M3862J4688J6630J4972O9963q2305J5304o0197r8295k6368
13487a00236R9778K8119J0007Q5962R0113j3329k66471q7332N031n4385J03066
13476i9677P2986J9028o494M2605J32280P1937k095n3170o3024p8597j6438P9357
$$ plain form
13555 18628 25112 -39015 53136 66414 6873 -24487 35015 203106 203353 150536 226846 342135
13543 342135 432797 461545 543439 668134 708462 759916 777722 755408 763870 785996 753322
13532 753322 660253 644815 705994 593715 511561 519729 509747 346258 111218 61789 79353
13521 79353 85630 43792 -43380 -74575 -100615 34455 136740 155944 272414 325967 276406
13510 276406 258994 271970 241549 258003 292954 217912 151599 36000 -62189 -9235 13599
13499 13599 -25118 -8490 35372 50060 66690 81662 151625 69320 84624 24427 -73868 -100236
13487 -100236 -458 27661 37668 123630 213743 200414 -66057 -153389 -148358 -202743 -99677
13476 -99677 -26691 -7663 -14157 28448 160728 232665 230570 177400 114376 35779 19341 98698
13464I8698Q3205j36337n6140k8477J01330N6755J4733j9443L3368k8038M5277
13453A64931j81335p2995m2983L8576J09054m3115p2405p3169j1742Q6893J25597
13442B7307K3666l3690j9213r9757k0582J43698L7562m9046L988l3257M6225l389
13430B3512j38683m8074R3064n7609r7211R262J45362p631j2518L9004Q4100K0372
13418E2950J27451Q299J2270n8208n3271j11477k9300J00872o7846j23452L271
13407a38441R9909m7386j4104j7503J11443R5637r9793l8645l2163K9817p706
13396e8935R0066N9478M2806k9435J125n56j5563k1928L8452L9914k5180j35061
13384a4817q6731j4334k924O4140O8934k083j323P6616m0069j26256K9082N2079
$$ plain form
13464 98698 181903 45566 -10574 -39051 62279 119034 133767 114324 147692 119654 164931
13453 164931 -16404 -89399 -132382 -93806 15248 -27867 -100272 -173441 -185183 -98290 27307
13442 27307 50973 17283 -1930 -101687 -122269 21429 58991 9945 13933 -19324 26901 23512
13430 23512 -115171 -163245 -70181 -127790 -225001 -215739 -70377 -78008 -90526 -51522 32578 52950
13418 52950 180401 188700 200970 142762 89491 -21986 -51286 49586 -18260 -141712 -138441
13407 -138441 -38532 -85918 -100022 -117525 -6082 89555 -10238 -48883 -81046 -51229 -58935
13396 -58935 31131 90609 133415 103980 105105 104549 88986 67058 105510 145424 120244 -14817
13384 -14817 -101548 -115882 -118806 -54666 14268 12185 10862 87478 47409 -78847 -49765 2314
13372B314l476j3646j39142l404O263J9041l5537K4726P9761q4437o8332j2741
13360b28610J25445j1956o303O4404Q7140P7061q680L5018l1098m8032q3379O1562
13348C2572K4823l7464p3608j8270J2024R2455M9840J2672J45061J76463l4763
13337C81805L4018k8850k1217k2354J30n4664p4361o9569R9348M6325n9403j87245
13325D3963k9667N3447r2675k4834L8119L6626J19948J5820n1252n8376p2376
13314b1257K1036K505r1947l5785O7433l4155P0753J10948Q4906k0678J1122P4045
13302B38926J28843J34884P4815o6629o9497M5388O840m176o856q8035k4166j77675
13290A92662j96331r7519n2087K17831K7036Q3213l5897p5764R2983J04982Q2471
$$ plain form
13372 2314 -1162 -14808 -153950 -157354 -151091 -132050 -167587 -142861 -63100 -147537 -215869 -228610
13360 -228610 -103165 -115121 -121424 -57020 30120 107181 98501 133519 102421 54389 -28990 32572
13348 32572 57395 19931 -53677 -71947 -59923 32532 82372 95044 240105 416568 381805
13337 381805 415823 386973 365756 343402 343532 288868 214507 144938 244286 290611 231208 43963
13325 43963 14296 67743 -24932 -49766 -11647 24979 144927 160747 109495 51119 -21257
13314 -21257 -221 2284 -89663 -125448 -58015 -92170 -21417 89531 174437 153759 164881 238926
13302 238926 367769 502653 577468 510839 441342 486730 493570 489394 482538 394503 370337 192662
13290 192662 -3669 -101188 -153275 64556 91592 174805 138908 63144 156127 261109 343580
13279C43580J42396R06m3111O7381K9587J9009l8674j46687n6789j22526n254
13268A89818N5080N8836p2775j31976p6331k2805k0398M308R4045R6114K0277
13257A94193r062Q6051j06127o5044r739k0509K7846Q3786O5542J4703j54753
13246A06887m4630N04J20083J3760J0137P4089K07026L8494j9684M1849L2355
13235E80870k926j47152j08587j32672j76058o6618J31067M4005K8520R991J10606
13224B71046M2983j07769J1976m1932j8121k8739k3428M9995q206K9749k3483
13213A54071o074j44529m428J02596M3581k0656j32717n2527p10p5656O3388m7993
13201a21654k6667j1410K4435J9448N5315P3704m780k9777r4117k7020O9975j9920
$$ plain form
13279 343580 485976 486882 443771 511152 540739 559748 521074 374387 317598 195072 189818
13268 189818 244898 303734 230959 98983 22652 -153 -20551 -16243 77802 173916 194193
13257 194193 185131 271182 165055 100011 90272 69763 97609 181395 246937 261640 106887
13246 106887 62257 62761 182844 196604 206741 280830 487856 526350 506666 548515 580870
13235 580870 577944 430792 322205 189533 13475 -53143 77924 121929 150449 160440 271046
13224 271046 314029 206260 218236 176304 158183 129444 106016 156011 147805 177554 154071
13213 154071 147997 3468 -960 101636 145217 124561 -8156 -60683 -61393 -137049 -73661 -121654
13201 -121654 -148321 -159731 -135296 -115848 -60533 13171 8391 -21386 -115503 -142523 -72548 -92468
13189i2468j9019K436O3708J06042p2587k3399J06829P5620m6536m4632J7211
13178G3205p5019o7831K0257k6441L5229m0576j3524P6573l5990J6807L5595M7555
13166D5840p0299r1Q6702j9957j4972r550j37L7062n229j03985P0754L8577l2983
13153B1732L5544q281o3739J640L6495k3019R0367j6118o1948p4603l2314r2000
13141a86244l1752j4045Q2074r0P3761Q9107l1401m261O7156m440r3142J58751
13129A05474R8783J6437p6615j09028m7640r6072o3719N1329O9740j9446J5297
13118e5460j1852j17548j54762M2826J23517R0397J17719k1920r7398K9013L454
13107e2014M2761K7326j32225l4826J30071J63665q3208k5879k0108j4782K0840
$$ plain form
13189 -92468 -111487 -109051 -45343 60699 -11888 -35287 71542 147162 100626 55994 73205
13178 73205 -1814 -69645 -49388 -75829 -40600 -81176 -94700 -18127 -54117 -37310 -1715 45840
13166 45840 -24459 -24550 62152 42195 27223 17673 17536 54598 49369 -54616 16138 54715 21732
13153 21732 57276 48995 -14744 -13104 23391 372 90739 74621 12673 -61930 -94244 -186244
13141 -186244 -217996 -232041 -149967 -150057 -76296 12811 -18590 -22851 44305 39865 -53277 105474
13129 105474 204257 220694 144079 35051 -12589 -108661 -172380 -121051 -51311 -70757 -55460
13118 -55460 -67312 -184860 -339622 -296796 -173279 -82882 34837 12917 -84481 -55468 -52014
13107 -52014 -9253 18073 -114152 -148978 -18907 144758 61550 35671 15563 781 21621
13096B1621K523J06354k1507J5517l8435j3566L5669j3700j59331L6485l8413
13085f6783L0483N346o331n4618K2964j966O2787k0587r6287o822Q9896J77779
13073A35861O5613r1410n2129R1773J2938m7967L2224l8410j48723m4225L1602
13062e2853K6932O9270J8294j1605q2015p9198N5990R2960R3240J04697l7922
13051A97790p8524j2310n7974O3607L8699N9158M2969p3379r4938j99087j10287
13040b24276J45214N3026j19091M0975L5171j1665M5788m9457q8846p828P2391
13029a08598L7362o6762j17096l8200m564j6400J44926J72207K7278j06675O4311
13018a2211O8340m7104r9950M9947j5009J8510M881m5194J5233L7508J14983q6992
$$ plain form
13096 21621 24144 130498 108991 124508 86073 72507 108176 94476 -64855 -28370 -66783
13085 -66783 -36300 -30954 -37285 -91903 -68939 -70905 -8118 -28705 -124992 -131814 -41918 135861
13073 135861 201474 110064 57935 149708 162646 114679 146903 108493 -40230 -84455 -52853
13062 -52853 -25921 43349 61643 50038 -31977 -111175 -55185 37775 131015 235712 197790
13051 197790 119266 106956 48982 112589 151288 210446 253415 180036 85098 -113989 -224276
13040 -224276 -79062 -26036 -145127 -104152 -68981 -80646 -34858 -84315 -173161 -180989 -108598
13029 -108598 -71236 -137998 -255094 -293294 -297858 -314258 -169332 2875 30153 -76522 -12211
13018 -12211 56129 9025 -90925 -40978 -55987 -37477 -32596 -77790 -62557 -25049 89934 2942
13006B942l4175p0858m6855J84842J22668K0018K188o2335o1803k4071J18422
12995A50983j03670r1600J9783N0836K3670l8104r6055l3956K7280J48288K1109
12984G8564j47868r9742J1369J7805P3943O1047j36916m8599J01333R0153L5950
12973C7039n0179K5885j3538j07658L6939J78810J01819n1265k9204m6308j10464
12962b8124j14169j2843J6792Q2367l2933k0609o2458m1739l5133k2085K7804
12951b43130J69269n7826m1601P8442M7275l7302Q3913J18210k5835j30534j64818
12940b03937J6492q6853q5709J95697J55411o407l0808j17273o0378J03623N7194
12929f2948m5252J2877m3266N6141P9253K7395m0368j38179n0704K4273P5757
$$ plain form
13006 2942 -31233 -102091 -148946 35896 158564 178582 180770 118435 56632 32561 150983
12995 150983 47313 -44287 -24504 26332 50002 11898 -84157 -118113 -90833 57455 78564
12984 78564 -69304 -169046 -157677 -139872 -65929 -4882 -141798 -190397 -89064 1089 37039
12973 37039 -13140 12745 -793 -108451 -71512 107298 209117 157852 128648 82340 -28124
12962 -28124 -142293 -155136 -138344 -55977 -88910 -109519 -171977 -213716 -248849 -270934 -243130
12951 -243130 -73861 -131687 -173288 -94846 -47571 -84873 -960 117250 91415 -39119 -203937
12940 -203937 -187445 -274298 -360007 -164310 -8899 -15306 -46114 -163387 -223765 -120142 -62948
12929 -62948 -108200 -95323 -138589 -82448 -3195 24200 -16168 -154347 -205051 -180778 -105021
12918a05021P6670P2572l9588o3367Q693N1743r292K9254L1129q3663j7176Q8445
12906D0399J1677L7388M900M290R442K259K4610p023J4805j08070j10234L726
12894g1831N7944o1906N2493O4359J9466N96O0036N7433o3566l540o9252Q660
12882E0892q0387m1053L4351K7871j242K1011p0641O0241j9374o2031j8106m66
12870i8934J7412M5016L5064O132j25216n4724P0311R3592O356o7191l5851k4592
12858a32625R4167k7133j8832j9512m6394K5869N8943J5321m6654Q7787O3151
12847E4088M8347M0002j6021M197J1276k5418k2109j09848p07J05591p8933r7176
12835h6711j56004l5342l5603q2071L037J00337O1379J34547Q0951Q0328q8548
$$ plain form
12918 -105021 -28351 44221 4633 -58734 -50041 1702 -7590 21664 52793 -30870 -48046 40399
12906 40399 52076 89464 94364 98654 108096 110355 134965 127942 142747 34677 -75557 -71831
12894 -71831 -13887 -75793 -23300 41059 60525 61121 121157 178590 115024 111484 42232 50892
12882 50892 -29495 -70548 -36197 -8326 -9568 11443 -59198 1043 -18331 -80362 -98468 -98934
12870 -98934 -81522 -36506 -1442 4690 -120526 -175250 -104939 -11347 -4991 -72182 -108033 -132625
12858 -132625 -38458 -65591 -84423 -103935 -150329 -124460 -65517 -50196 -96850 -9063 54088
12847 54088 102435 142437 126416 130613 141889 116471 94362 -15486 -16193 89398 10465 -86711
12835 -86711 -242715 -278057 -313660 -395731 -392694 -292357 -230978 -96431 -15480 64848 -23700
12824b3700n5407j5956q4034L4401J64462M3939j62457p7772O1216q5859J3884
12813a87283J6518J5878K9870N6491K2068r2653N7697O6810J2717j08565q6741
12802a97193J70233J10617O1681J4846j97395r9201k2804J0420N9950K795M7557
12791c8494n9821N788O1149J6995J0550q9971L6811P6434l0356k301J36671N675
12779A29130j5997o2917p3175r4020m8926q3726K1977J12465M5235j4979n9654
12768a44587P207J0722j03146j2215P7121o0127r5628N7817K68676Q3192m8930
12757D0102j6836L8119R5074R7339k3487m5282j72626j28552k6325N6231K6933
12746e9310k6008L2500r59l7885M0535J18636L8275m7786l1006p3076J7872M4498
$$ plain form
12824 -23700 -79107 -95063 -179097 -144696 19766 63705 -98752 -176524 -115308 -201167 -187283
12813 -187283 -170765 -154887 -125017 -68526 -46458 -139111 -81414 -14604 -1887 -110452 -197193
12802 -197193 -26960 83657 145338 160184 -37211 -136412 -159216 -148796 -88846 -86051 -38494
12791 -38494 -98315 -92527 -31378 -14383 -3833 -93804 -56993 19441 -10915 -13216 123455 129130
12779 129130 113133 50216 -22959 -116979 -165905 -249631 -227654 -115189 -69954 -84933 -144587
12768 -144587 -137380 -126658 -229804 -242019 -164898 -225025 -320653 -262836 5840 89032 40102
12757 40102 23266 61385 156459 253798 230311 185029 12403 -116149 -142474 -86243 -59310
12746 -59310 -85318 -52818 -53777 -91662 -51127 67509 105784 57998 26992 -46084 -28212 16286
12734A6286m4129k7254P1051J7223j2069L3975M2123o4408P0695O5966k1518Q286
12722A56227M3120j47916j21629l9569K1657Q4440l3724k1305p865k9383j13130
12711b09077k2858O5775L3231M4747M4124K0457J2505P3202m045j06687K7920
12700b0706N941Q9130R4123N5117K0265r6839q6636p4709j10871p0758o9288r1935
12688c57166j1078P8712j9356k8438K1871J19776J56776J24376P9620j04335p0659
12677i901O268L9334J15227n6244n2590M5374m5446m0073M7955j10651n0695L2177
12665g9265Q7662J4530l5321P3015m5671J3850q6538o0498N66P1548q7177L5534
12653i7765R4053J0530j8304j5298o3197k5529J43415l2248L972k7936o3548M3073
$$ plain form
12734 16286 -27843 -55097 15954 33177 21108 55083 97206 32798 103493 169459 147941 156227
12722 156227 199347 51431 -70198 -109767 -88110 -3670 -37394 -58699 -66564 -95947 -209077
12711 -209077 -231935 -166160 -132929 -88182 -44058 -23601 -11096 62106 58061 -48626 -20706
12700 -20706 -14765 74365 168488 223605 243870 147031 60395 -14314 -125185 -195943 -265231 -357166
12688 -357166 -368244 -289532 -308888 -337326 -315455 -195679 -38903 85473 165093 60758 -9901
12677 -9901 -3633 35701 150928 94684 42094 87468 42022 1949 49904 -60747 -111442 -79265
12665 -79265 8397 22927 -12394 60621 14950 28800 -57738 -118236 -117670 -46122 -133299 -97765
12653 -97765 -3712 6818 -11486 -26784 -89981 -115510 27905 -4343 -371 -28307 -91855 -48782
12641d8782N8469k1536p7975o059K3121J26874N2206N1255p3495K101M5201J29123
12629B60503J2899p9952n2912l3750j4735J7143n6901n2314l0075K455l9855o7851
12617a35345K7161J00122P0620o6962j76154l6035j5562j7815N6844J1540Q7219
12606i4367n3964j4388O2124o1909J32096J29649Q3396p4992r9248K0068J6127
12595D4592P577j9140P5623L7516r5614l0198K8862j10662n7276M7525J0651M4921
12583a5623J5834O9458O8200j2442j75877k8047M7816N4913m9277k3580l7473
12572h6098L7187L7496K9773o2114O229O7475J9881P9743n7016n2128n4465R2178
12560E8141l3254q3007J12288Q81j45930j2537J2058Q8419J15363R4059p4134
$$ plain form
12641 -48782 9687 -11849 -89824 -95883 -72762 54112 106318 157573 84078 86179 131380 260503
12629 260503 273402 193450 140538 106788 92053 109196 52295 -19 -30094 -27639 -67494 -135345
12617 -135345 -108184 -8062 62558 -4404 -180558 -216593 -232155 -249970 -193126 -181586 -94367
12606 -94367 -148331 -162719 -100595 -162504 -30408 99241 182637 107645 8397 28465 44592
12595 44592 52169 33029 108652 146168 50554 20356 49218 -61444 -118720 -71195 -60544 -15623
12583 -15623 211 69669 137869 125427 -50450 -78497 -30681 24232 -25045 -48625 -86098
12572 -86098 -48911 -11415 18358 -43756 -37527 29948 49829 129572 72556 20428 -34037 58141
12560 58141 24887 -58120 54168 55049 -90881 -103418 -91360 -2941 112422 206481 132347
12549A32347o5658m5889j21588n0803O2873N2620k2981m5072L5053N6602M9352
12538C6856j15394M0533N6191m1709p9396N4251J5025J31428O5003K2642J8242
12527B03672p9931l1742N178k0504J6562O5364M4245p5646n6922j5625j2365L6463
12515G8749j7126M962L4403j02503J01965J1217l8270q9543k5770J1634O8253
12504C7971j23713l5330l1793j0604J03238J14858m6224J0591j5979o677K773
12493h89J14802J6530O2717L4179j1739j01848j08965j19520L4410N6279k18596
12482b42640p2100O2269L4959J82510Q8193m4420q8640L242J48530m0125j55254
12471a23476J19991R5264K7201q1968j19793J03233R1344o224j6748j50539m7030
$$ plain form
12549 132347 66689 20800 -100788 -151591 -88718 -36098 -59079 -104151 -69098 -12496 36856
12538 36856 -78538 -38005 18186 -23523 -102919 -48668 -33643 97785 162788 185430 203672
12527 203672 123741 91999 97177 76673 93235 158599 202844 127198 70276 54651 42286 78749
12515 78749 61623 66585 100988 -1515 100450 111667 73397 -16146 -41916 -30282 37971
12504 37971 -85742 -121072 -152865 -163469 -60231 54627 8403 18994 3015 -3662 -889
12493 -889 113913 130443 193160 227339 215600 113752 4787 -114733 -80323 -24044 -242640
12482 -242640 -314740 -252471 -217512 -35002 53191 8771 -79869 -76627 71903 31778 -123476
12471 -123476 -3485 91779 118980 37012 -82781 20452 111796 105572 88824 -61715 -108745
12460a08745n599K0936p310K7398R3181m3525n3431j2946l4966j23741R7285N6137
12448i5326N0748J36130k9691j39577m6128O1599m1252r3619N9190n1317L9575
12437a49668l41M4825Q5066R7483Q6428j0585k48649j08072n1791j3186J37087
12426a31403J18681p389j2187k0662p4793Q9268R4808j5883j00926K1992P0693
12415C2199J9161l5985j32486k8974M5991p2954P2111O7170m2955k2052m6540
12404a45314K1002P7477r280n7515p1447J26747R329m9687O7309M8185p3005L9439
12392a6760R1634k3321n4914n1088J010k2839m195r162l1713m8196J29370Q7732
12380D7558Q521Q8492L8022r7070r1752j20413n2626j5362o661J07769K7804M6328
$$ plain form
12460 -108745 -114344 -93408 -100718 -73320 19861 -23664 -77095 -90041 -125007 -248748 -151463 -95326
12448 -95326 -44578 91552 61861 -77716 -123844 -62245 -103497 -197116 -137926 -189243 -149668
12437 -149668 -150009 -105184 -20118 77365 163793 153208 -95441 -203513 -255304 -268490 -131403
12426 -131403 -12722 -20111 -32298 -52960 -127753 -38485 56323 40440 -60486 -38494 32199
12415 32199 51360 15375 -117111 -146085 -100094 -173048 -100937 -33767 -76722 -98774 -145314
12404 -145314 -124312 -46835 -56115 -113630 -185077 -58330 -49001 -98688 -31379 16806 -56199 -16760
12392 -16760 74874 51553 -3361 -54449 -53439 -76278 -80473 -89635 -121348 -169544 -40174 47558
12380 47558 56079 144571 182593 85523 -6229 -126642 -179268 -194630 -201291 -93522 -65718 -19390
12368a9390j8737n1145N0020K6385N0252p462M917q8704l6146Q5205M3884p1222
12356c2143k3736o2997j055M0706J14419j11688M37J9424L583O2742P8030R6964
12344A84686R425r8597j22165l5794k7155K0558Q1670P7389J52407N6888j43928
12333A55384k70318Q09l0588p3076P2376P4184M783j1309N8665m5396l7871L1706
12321g0651L8080p7615l1663J51957J27915J8616j86344o3120L2090k7379j00319
12310a88433k5194P0438R2286P784j7800R3564N9046J0061j6036m337K0522j0297
12298I1604R780j26695R786N0084j28972q871j319P65K7868Q1161J1593N6307
12286G3091j18889j4844M1823L9489j59908o010O0042O0677m4953L028J17303
$$ plain form
12368 -19390 -38127 -89272 -39252 -12867 37385 29923 34840 -53864 -90010 -4805 39079 -32143
12356 -32143 -55879 -118876 -119931 -79225 35194 -76494 -76057 -56633 -53050 9692 87722 184686
12344 184686 194111 95514 -26651 -62445 -89600 -69042 12628 90017 242424 299312 155384
12333 155384 -114934 -114125 -144713 -217789 -145413 -71229 -66446 -77755 -19090 -64486 -102357 -70651
12321 -70651 -32571 -110186 -141849 10108 138023 156639 -29705 -92825 -60735 -88114 -188433
12310 -188433 -213627 -143189 -50903 -43119 -60919 32645 91691 101752 85716 81379 101901 91604
12298 91604 101384 -25311 -15525 34559 -94413 -103284 -104603 -103838 -75970 5191 16784 73091
12286 73091 -45798 -60642 -18819 20670 -139238 -145248 -85206 -24529 -69482 -66454 50849
12275E0849L5911n6922j177K5000p1540o1836K2103L0577M9436J9037j42625R426
12263i1761k7723L8806K1898r643J4172p941J6654j3829N0461J36917k602p2397
12251E3012o6152M1055L6919j9078m4086L5104K6396M7359m3154K0259O4376m9588
12239A02422j72673q6269R1189R0039k1195l545l6032k8498N3996J05454m4865
12228E0023r3455n4357j3246K8586k1920r4076O8852Q5432J03097J48839N1901
12217B59676Q9753m7739j88438j40254n9580M7185O3477L1436q023q94M7133j18830
12205b5098q9284L9833R6827L3976K7230n17r4576L0136M6964J358R8845J04613
12193B70307o9301q0642j9414J9807l5797P068j05314r3441p3304j05565o1878
$$ plain form
12275 50849 86760 29838 28661 53661 -17879 -79715 -57612 -27035 22401 41438 -101187 -91761
12263 -91761 -119484 -80678 -58780 -68423 -54251 -62192 -45538 -59367 -8906 128011 125409 53012
12251 53012 -13140 27915 64834 45756 1670 36774 63170 110529 67375 87634 152010 102422
12239 102422 -70251 -156520 -65331 24708 3513 -32 -36064 -64562 -10566 94888 50023
12228 50023 -43432 -97789 -111035 -82449 -104369 -198445 -129593 -44161 58936 207775 259676
12217 259676 349429 301690 113252 -27002 -86582 -39397 24080 55516 47493 46599 93732 -25098
12205 -25098 -114382 -74549 22278 56254 83484 82967 -11609 18527 65491 66849 165694 270307
12193 270307 201006 120364 100950 120757 84960 92028 -13286 -106727 -180031 -285596 -347474
12182c47474Q3074L6117l767J05070O0956q358M8655J19123K6368K422q0966o9525
12170b8305P9682Q6657R9792j14089r1300n2231L8428o078j33835L549R7998J37146
12158A17414l8146p9343n290J31713p1202l9392K6137k3082p9008n6665J06786
12147a0078l7257N1309k4444L8961K3222K3846j17012j22154o6496k0634m255
12136b64992P3319O9456M0747M7057K3484k6921L4924M1037P7090J04305r7396
12125A22110j34793K784l9575n4821k8705M8923J03598l2728K4771k2246r0481
12114a01163j16306k7970Q9562k9579J17217L5406q1124J58583J49847J01930
12104B96403r6350j35422j03900l6913O2866J17312n1565n1647n6161J03376K7169
$$ plain form
12182 -347474 -264400 -228283 -232050 -126980 -66024 -74382 -25727 93396 119764 122186 41220 -28305
12170 -28305 51377 138034 237826 123737 32437 -19794 18634 12556 -121279 -117730 -19732 117414
12158 117414 79268 -75 -5365 126348 55146 15754 41891 18809 -60199 -116864 -10078
12147 -10078 -47335 3974 -20470 18491 41713 65559 -51453 -173607 -240103 -260737 -264992
12136 -264992 -191673 -122217 -81470 -34413 -10929 -37850 -2926 38111 115201 219506 122110
12125 122110 -12683 -9899 -49474 -104295 -133000 -84077 19521 -13207 11564 -10682 -101163
12114 -101163 -217469 -245439 -155877 -185456 -68239 -32833 -113957 44626 194473 296403
12104 296403 200053 64631 -39269 -76182 -13316 103996 52431 784 -55377 47999 75168
12093G5168l9341j5326m7567L1604J16425J5375o5074p2129L0907O5031K9799
12082A24872j06977r7415q5880L1005K91780O8684q3829j73384m5867j8712l5946
12071a31669J09223O5464p5100k5552k0762j8407m7104O7652J90730J48102p274
12060B55303r6598n7162n6170j1118o5084J41150N4571j4225j9190M6249j4237
12049A63489l7333L8946J5350m6610j09280j17407L2847P6782o850p3321l0916
12038i4303P9073m8543r8619J09704J22737m019j08466N41L3652P0887K9649j23225
12026c0932K376k4505K9599J33193Q6191q4697m3540L7777k2578j2784N8534k0548
12014A08086J3978K9604k125O402j18388j17750j34163l873M2639J15417P4589
$$ plain form
12093 75168 35827 20501 -27066 4538 120963 136338 71264 -865 30042 95073 124872
12082 124872 17895 -79520 -165400 -134395 157385 226069 142240 -31144 -77011 -95723 -131669
12071 -131669 -22446 43018 -32082 -57634 -78396 -96803 -143907 -76255 114475 262577 255303
12060 255303 158705 101543 45373 34255 -30829 110321 164892 150667 131477 177726 163489
12049 163489 126156 165102 180452 133842 24562 -92845 -59998 16784 9934 -63387 -94303
12038 -94303 -15230 -63773 -162392 -52688 70049 66030 -42436 -41895 -8243 62644 92293 -30932
12026 -30932 -28556 -53061 -23462 109731 195922 111225 67685 105462 82884 70100 128634 108086
12014 108086 122064 151668 149543 155945 37557 -80193 -214356 -218229 -175590 -60173 14416
12003A4416J17981J04182j9979j18328J9102m4933r315J6031j8855q8327M938
11992b3087J14282Q6171n3447j16990k4492M3805J29233Q3144q0559q8436q4117
11981a4493p8739K0150J04493n1175l2805k6900j34979K9074M4138L1964M0751
11970f8521k0153j5563O3676M8903L6689r2759L3675P9918m7528j16693j19220
11959b17576K1551J25442K02122l044j28836l3422O6637o7615O899K3449Q835
11948D442M2255j4997n2888p1463j09814J0924Q3836J8186J50j23878J03191R7966
11936a2090O9640J4661R4784J4846j3350p5018l0968o0448q5349P8134M3023r4633
11924e6768n6785Q7997J83230J3946j92372p0155J08090J6740O757M6365M9949
$$ plain form
12003 14416 132397 236579 216600 98272 117374 72441 63126 79157 60302 -28025 -23087
11992 -23087 91195 177366 123919 6929 -17563 26242 155475 238619 158060 69624 -14493
11981 -14493 -93232 -73082 31411 -19764 -52569 -79469 -214448 -185374 -141236 -109272 -68521
11970 -68521 -88674 -104237 -40561 8342 45031 -47728 -14053 65865 18337 -98356 -217576
11959 -217576 -196025 -70583 131539 128495 -341 -33763 32874 -34741 -27842 -4393 4442
11948 4442 46697 31700 -21188 -92651 -202465 -191541 -107705 -89519 -89369 -213247 -110056 -12090
11936 -12090 57550 72211 166995 181841 168491 93473 62505 2057 -83292 -5158 37865 -56768
11924 -56768 -113553 -25556 157674 171620 -20752 -90907 17183 33923 40680 87045 136994
11913A36994R476j26931n5035K9551j1881j9692k8967J12030M287o5856o947k7101
11901e0072k7220M4424p8658M112O5428N6647M7821n3994p5785l264N4107m0625
11889e7079J2866M630o8121j20110n7623q0598k2384J13984L1114L939P3661J71350
11877E629N8324l320O4190j37720q6479l0728Q0361J17060M5299N9409o0054j38192
11865b6221O3225J24111K1902O6189l3987k3496j37488o5281M0125l9679p3053
11854h3653j0769O0086O9939Q4465r9820j56482j8232R0484Q5453K4559m1823
11843D207l224M0755j9440n1053q3482p6854J24620K4724N3592Q685j07642o0744
11831a45856K0661K3704L7873P9674J57731p9602j91066j04881J37595R0844p2160
$$ plain form
11913 136994 146470 19539 -35496 -5945 -17826 -37518 -66485 45545 49832 -16024 -22971 -50072
11901 -50072 -77292 -32868 -111526 -107414 -41986 14661 62482 8488 -67297 -70561 -16454 -57079
11889 -57079 -44213 -39583 -107704 -227814 -285437 -366035 -388419 -274435 -243321 -239382 -165721 5629
11877 5629 63953 60633 124823 -12897 -99376 -130104 -49743 67317 112616 172025 111971 -26221
11865 -26221 37004 161115 183017 249206 215219 191723 54235 -11046 29079 -10600 -83653
11854 -83653 -94422 -34336 35603 120068 20248 -136234 -154466 -63982 21471 46030 4207
11843 4207 983 41738 22298 -28755 -112237 -189091 -64471 -39747 13845 22530 -85112 -145856
11831 -145856 -125195 -101491 -63618 16056 173787 94185 -96881 -201762 -64167 26677 -45483
11820d5483J5926r3491k9333O1266p624K5840J7685l1006N5529L7551K1845j17887
11808h9182L2748J31159J15724l1285K1660m5395J2154n0225o1119j7116L2834
11797E1957k1328n7751N9687J12321n356k0557P7467q1328J5978M2916r6667r5170
11785a7831Q5449P4237q151m2234r3928p1720N7988M1690n5632N9396Q3426O8180
11773A80870M4888p6961K1702j05150n1767J9872J4152k833o1410K9592m9844
11762c6889r3469k2298J89201N852J0456j9859M3094M3178J1756R3528p8810k0923
11750A24817j4973K2489J31691L6679p1062l9314j45905j31919m8406R6666J7672
11739b1565m270O2554M9128L8262m4623r2002L179N948o1170O7867L5645M7555
$$ plain form
11820 -45483 -29557 -123048 -152381 -91115 -98739 -72899 -55214 -86220 -30691 6860 28705 -89182
11808 -89182 -56434 74725 190449 159164 180824 135429 147583 97358 36239 19123 51957
11797 51957 30629 -27122 32565 144886 139530 118973 196440 115112 131090 174006 77339 -17831
11785 -17831 67618 141855 133704 91470 -2458 -74178 -16190 25500 -30132 29264 112690 180870
11773 180870 225758 148797 170499 65349 13582 33454 47606 44773 -16637 12955 -36889
11762 -36889 -130358 -152656 36545 42397 52853 32994 76088 119266 131022 224550 145740 124817
11750 124817 109844 132333 264024 300703 229641 190327 44422 -87497 -135903 -39237 -21565
11739 -21565 -25835 36719 85847 124109 79486 -12516 -9337 -3389 -64559 3308 38953 86508
11727H6508R0414q3302O7830r954j32713Q134J59453J33607O8132J02475J4644
11716E05228K4047l6667o1327J8105p5941j88177p0543k132M7954K1290L0629
11705B12466n2347m3440p5230l7966L0227j7662o5796k8601P1882K31778J61379
11694C86690J4128N3411J91685Q307p641N9253P1484J03911j5819r4034j74532
11683E96843q2272o0686l7788j05721L1224N4479j09599k5982j1958l4505l4765
11672A79270J49301q6431j08113l7165n3641M4657K06997k7163l8483Q5063O2650
11661C76942r5114j12912k9435J9925m0224P3057K15481J99926M1506O5564K5311
11650G40027J25543K1178q5814K6300j00520k49680m1691Q6586r021M4004k9643
$$ plain form
11727 86508 176922 93620 161450 151496 18783 26917 186370 319977 388109 490584 505228
11716 505228 529275 492608 431281 449386 373445 185268 114725 112593 160547 181837 212466
11705 212466 160119 116679 41449 3483 33710 16048 -49748 -78349 -6467 225311 386690
11694 386690 400818 454229 645914 654221 646580 705833 777317 881228 865409 771375 596843
11683 596843 514571 453885 416097 310376 341600 396079 286480 260498 248540 214035 179270
11672 179270 328571 242140 134027 96862 43221 87878 294875 267712 229229 314292 376942
11661 376942 281828 168916 139481 159406 119182 192239 407720 607646 649152 714716 740027
11650 740027 865570 886748 800934 827234 726714 477034 435343 521929 512908 556912 527269
11639E27269q3664J32532K5889k2332J31982Q6492n7580l3054K5880p7221j37170
11628E19023n7686j10267o3385p0491m6513L6540k4836k02887q8344P6169L0575
11617b102J24007j3862n6741Q0044O2862M6347Q757l5691K3154k5605j9736J1349
11605B02783L9983J793o3556m2646j05262l8883R5107J60318J33887r7794j08403
11594A77327o9879K6074Q958J6802O4768j08848n8372K3051J31659R5438n4026
11583B52952l2844P4497R851Q1396J44260P3476K6066N1947J05239l3788j8595
11572G34457J07801P9992j0783j70749q4726n0300j59172j28146o3870r6895j45607
11561A2002j36266Q5050M1830M1132P3736o945n7487l2975r593L2142M2195L863
$$ plain form
11639 527269 443605 576137 602026 579694 711676 798168 740588 707534 733414 656193 519023
11628 519023 461337 351070 287685 217194 170681 207221 182385 -20502 -108846 -32677 -2102
11617 -2102 121905 108043 51302 131346 194208 240555 249312 213621 236775 211170 191434 202783
11605 202783 242766 244559 181003 138357 33095 -5788 89319 249637 383524 285730 177327
11594 177327 107448 133522 142480 159282 224050 115202 56830 79881 211540 306978 252952
11583 252952 220108 294605 304456 385852 530112 603588 629654 681601 786840 753052 734457
11572 734457 842258 922250 911467 740718 655992 605692 446520 318374 254504 157609 12002
11561 12002 -124264 -39214 2616 43748 117484 110539 53052 20077 10484 42626 84821 88684
11549H8684k4063k2603J7068J11893n9089m502J6110l4111K7367J2471q190j92534
11537g1499p2424J3004L4513J14298M5900j02550k3405N223J47627j424j53759
11526f4496p030O8811R4191N6420K9061o3435r5169J08193m9821p3555K6931K3465
11514E3566o9534J26110L7569N3361L3204J0909p819J09594n9509k1663O5456
11503C31244p773j52203n3780p8145j13630j05437O5691J47487O7346j2216J3670
11492A02254k0359r4929q0406k8713O5777l7494p0292j30562l1768J92161J09206
11481b5125K7411P6091l1800J2417P5386m1449j16776R1596J43790Q95n4401L0423
11469A88458j181j35754l9525J01066O5965p4839j84312j19547R5020L0998K4736
$$ plain form
11549 88684 64621 42018 59086 170979 111890 107388 123498 89387 116754 129225 121035 -71499
11537 -71499 -143923 -130919 -96406 17892 63792 -38758 -62163 -56940 90687 89263 -64496
11526 -64496 -71526 -2715 91476 147896 176957 113522 18353 126546 76725 3170 30101 53566
11514 53566 -15968 110142 147711 201072 234276 245185 237366 346960 287451 265788 331244
11503 331244 323471 171268 117488 39343 -74287 -179724 -114033 33454 100800 88584 102254
11492 102254 81895 -13034 -93440 -122153 -56376 -93870 -164162 -294724 -326492 -134331 -25125
11481 -25125 2286 78377 46577 58994 134380 92931 -23845 67751 211541 212436 158035 188458
11469 188458 187277 51523 11998 113064 179029 104190 -80122 -199669 -104649 -73651 -48915
11458d8915R4599R7222Q0087o474o8113Q4036K46536K2492K13402L35531M45025
11447A495428M16587K85405J43308j29864m43691m71173l00375k83102j45106
11438E67417l0562Q992K1520r6843k0782j23421o0713j4779j37679m8169K9847
11427I4828k4239J13525J39961n3244j13351l2131k5654M3953p8159K6574O1972
11416A54035N7124p6959r2685O6093J0351j50988l0321J16998R3741K61J6364
11405A64014O9338j7267j28860j36149j16998J01339J02232r4269q2370k2706
11395a61696j48383N947O3738K6567J11019K01363N8786N819M314L6215p7266
11384A26423M1183o388r0108k1573K1615m1160q9540l724J48595L4934K1052o0870
$$ plain form
11458 -48915 45684 142906 222993 216519 148406 232442 478978 501470 714872 1050403 1495428
11447 1495428 1912015 2197420 2340728 2210864 1767173 1296000 995625 712523 567417
11438 567417 536855 545847 567367 470524 449742 326321 265608 250829 113150 64981 94828
11427 94828 70589 184114 324075 270831 157480 125349 99695 143648 65489 92063 154035
11416 154035 211159 134200 41515 107608 117959 -33029 -63350 53648 147389 147650 164014
11405 164014 233352 216085 87225 -48924 -165922 -64583 37649 -56620 -138990 -161696
11395 -161696 -310079 -304132 -240394 -213827 -102808 98555 157341 163160 167474 203689 126423
11384 126423 167606 161218 71110 49537 71152 29992 -59548 -63272 85323 120257 141309 80439
11372H0439l441o181J4006j11735k2993K2780k7907J17700R6598k13853j29545
11361a84132J16250k2750j20599J20074K0006m4503R2286k5192l7026l882R0135
11350F67K1101N5419m0230k665J6032J6506p6658m1958J5766n5157o771Q3817
11338a4131M5673j2382l8190J9108R9911P6847M4922l3984j06357j9176r5840
11327c3599o9907K1165N6087j9916n0966M7251M5578L9644m4527j4204P2118K4009
11315G2733L387j6349q1209O012J09791O4877k4587J2549O1469p1474J32726K4195
11303B94120k4227p9706l1961k26979r1320L9814J05756k1163M5787N2444Q29
11292F3394R3667K6756R933k3499r0101m0886R4774k9528r5523R450l8214q6488
$$ plain form
11372 80439 76998 70817 84823 -26912 -49905 -27125 -55032 62668 159266 -54587 -184132
11361 -184132 -67882 -90632 -211231 -91157 -71151 -115654 -23368 -48560 -85586 -89468 667
11350 667 21768 77187 36957 34292 50324 66830 -9828 -51786 -36020 -91177 -97948 -14131
11338 -14131 31542 19160 -19030 78 99989 176836 221758 187774 81417 62241 -33599
11327 -33599 -103506 -82341 -26254 -46170 -97136 -49885 -4307 35337 -9190 -23394 48724 72733
11315 72733 76120 59771 -21438 -15426 94365 159242 134655 147204 208673 137199 269925 294120
11303 294120 269893 190187 158226 -68753 -160073 -120259 -14503 -35666 10121 62565 63394
11292 63394 157061 183817 193750 170251 80150 39264 134038 104510 8987 18437 -19777 -106265
11280a06265N8822R1443Q3432k1695J5135Q8284j02447q9979l2083k8906k062
11269d6321O8931o849N8111l5932j55130p1971R1564j3010l1618r0603J22358
11258a10470M1120P0614m8373L4029R2646P2126q6185j3449K1837L8235n5251
11247E6879q3523O2977O4729K807O7242J27475n0718j35718n0461Q4684q8204
11236E8169m2648n6579O6332N1494K0457o4226l4963n0124m3590q0216R1826K4588
11224e9480o3463l451N4566Q0868P941k9765K4093J4418L6981J3427Q7579R4010
11212B57724r4426j30448O9870R4305J5094j05849l0746n3277m1482M8495J44079
11201A73339J5391N612M4730k920O9842n7618p5803n2078L6657j0918r9682n1930
$$ plain form
11280 -106265 -47443 44000 127432 105737 120872 209156 106709 16730 -15353 -44259 -46321
11269 -46321 22610 15761 73872 37940 -117190 -189161 -97597 -110607 -142225 -232828 -110470
11258 -110470 -69350 1264 -47109 -13080 79566 151692 65507 52058 73895 112130 56879
11247 56879 -26644 36333 101062 103869 171111 298586 247868 112150 61689 146373 58169
11236 58169 15521 -41058 25274 76768 97225 32999 -1964 -52088 -95678 -175894 -84068 -59480
11224 -59480 -122943 -126394 -71828 9040 16981 -12784 11309 25727 62708 76135 163714 257724
11212 257724 163298 32850 102720 197025 212119 106270 75524 22247 -19235 29260 173339
11201 173339 188730 194342 239072 236152 305994 248376 172573 120495 157152 146234 46552 -5378
11189e378Q4593J1124N699R2532M9100P2366k2213j95017K944J4006n6440o3112
11177i796n1154L958J56954J29118L4466M1038k2412J5088J8445J03693k5825
11166C93573j58487j27815J33282J6313L855J46569N1262q4855l6248o3187m2127
11155B32135p8444k0792n5349J39054K2186m8551M5338M3863k2489k0417L5682
11144B72216q8950j53332J51359J03047J0934L1257K8608k2771P5032J02254J18804
11133F28458R5554q8316j27951k5318l2269j3448K4438J2223n2140J6823J13927
11122E51981J1100l6325n7419J8837R4724j8972j10301P4765P6913j6420j9313
11111E69570O3155Q8129O4655O2289M8018n9121J3785J10997Q4056N7873L653
$$ plain form
11189 -5378 79215 90339 96038 188570 237670 310036 287823 92806 95750 109756 53316 -9796
11177 -9796 -60950 -56992 99962 229080 263546 304584 282172 297260 315705 419398 393573
11166 393573 235086 107271 240553 256866 260721 407290 458552 373697 337449 274262 232135
11155 232135 153691 132899 77550 216604 238790 190239 235577 279440 256951 236534 272216
11144 272216 183266 29934 181293 284340 295274 326531 355139 332368 407400 509654 628458
11133 628458 724012 635696 507745 482427 450158 436710 461148 473371 421231 438054 551981
11122 551981 563081 526756 469337 488174 582898 563926 453625 528390 605303 588883 569570
11111 569570 632725 720854 785509 847798 895816 836695 850480 961477 1045533 1103406 1107059
11100A107059r0858n9837j2007R8099J17763m1638l8090K1261r4225J2555J37534
11089A157616Q288r0605J33617J29664r894m004R963O7683j087J0879K6037J31737
11077A569894K544J74010Q8576p1283J40370K18379K58653J81420K50976K22805
11067C036344K33418J88960L96838L00008L61342M97570O70610R55101R22438
11058G562629L75374J10035L47699N90031Q25436J060731J241937J731165K358039
11049A6203076L069821M106671N626639P606333J0553820J5040913K1865212L1984435
11041A16056920M3938532N6372671P0399792Q4274833Q5257274L2746877p2165106
11034D16881793r6091460p2380830n9408918m5490249l2509939k2631791j5823953
$$ plain form
11100 1107059 1016201 956364 944357 1042456 1160219 1118581 1080491 1101752 1007527 1020082 1157616
11089 1157616 1165904 1075299 1208916 1338580 1328686 1324682 1334645 1402328 1401241 1412120 1438157 1569894
11077 1569894 1572438 1746448 1835024 1763741 1904111 2122490 2381143 2562563 2813539 3036344
11067 3036344 3269762 3458722 3855560 4155568 4516910 5014480 5685090 6640191 7562629
11058 7562629 7938003 8048038 8395737 8985768 9811204 10871935 12113872 13845037 16203076
11049 16203076 19272897 23379568 29006207 36612540 47166360 62207273 84072485 116056920
11041 116056920 159995452 216368123 286767915 371042748 456300022 489046899 416881793
11034 416881793 320790333 248409503 189000585 143510336 111000397 88368606 72544653
11027G2544653j1139933q205620o149512m819061l933753l038891k232621j463775
11019C1561487j216658q18072m20237Q2093M77549R62394J365142Q66641q93883
11010C1966456k120428k107927j632204j002715n30818j47534N6956Q8867j10408
11001B4460245j92163o44752r83364j228304j192031j319702j203862j157781
10993A6538286j077240q74302p92076p88055p86353o87093l76822l88330m67405
10984A0300610m63193m62854m15942l04466j58760j95329l49989k91049j65700
10975G493328k24769k18175n9393o3476j07172k08283l29683m18270k98838l64473
10965E200796l68079l35717l04443k35220q2600q4312j37236j64283j84294p9485
$$ plain form
11027 72544653 61404720 53199100 47049588 42230527 38296774 35257883 33025262 31561487
11019 31561487 30344829 29526757 29106520 29188613 29666162 30628556 31993698 32860339 31966456
11010 31966456 29846028 27738101 26105897 25103182 24572364 24424830 24481786 24570653 24460245
11001 24460245 24268082 23623330 22639966 21411662 20219631 18899929 17696067 16538286
10993 16538286 15461046 14586744 13794668 13006613 12220260 11533167 11156345 10768015 10300610
10984 10300610 9837417 9374563 8958621 8654155 8495395 8300066 7950077 7659028 7493328
10975 7493328 7268559 7050384 6990991 6927515 6820343 6612060 6282377 5864107 5565269 5200796
10965 5200796 4832717 4497000 4192557 3957337 3874737 3790425 3653189 3488906 3304612 3225127
10955C225127l0617n4957p2956k14225j07946j74134q3954M7060j31673j59753
10945B241972n0098m9917j71948j40575r9783N5263M7305J5824q4064o5239j81519
10934A517221k5328k2863m9319n2837j44812j18342R8304R7988j1155k42072o72
10923A046113l8751j5814p0451p6528k1539m381n0883q075J45100R6239l4740
10912I66290l1367j10017q3123k3075j12621r9937Q1234Q2622p5802r3973o5476
10901D34755j5970j06660M2978M5912n2326J3384L1211J4033M239k7284J60971
10890E45243J12643O872j24279j16730k747o5756j00947L8941Q6737l4232M9424
10879C95169N1736R4936k7216n6270p4062J4657k0400M2566P1157j00850j06334
$$ plain form
10955 3225127 3194510 3139553 3066597 2852372 2744426 2570292 2486338 2533398 2401725 2241972
10945 2241972 2191874 2141957 1970009 1829434 1729651 1784914 1832219 1848043 1763979 1698740 1517221
10934 1517221 1491893 1469030 1419711 1366874 1222062 1103720 1202024 1300012 1288857 1046785 1046113
10923 1046113 1007362 991548 921097 844569 823030 818649 767766 759691 904791 1001030 966290
10912 966290 934923 824906 741783 718708 606087 506150 587384 670006 594204 500231 434755
10901 434755 418785 312125 355103 401015 348689 362073 393284 407317 411556 384272 545243
10890 545243 657886 664758 540479 423749 421002 355246 254299 293240 379977 345745 395169
10879 395169 446905 541841 514625 458355 384293 398950 378550 421116 492273 391423 285089
10868B85089N4428m3321o4648k374K5453O5109J45538J23498K1407m6975l1921
10857E31283N9668O4948m6147L9644m814j69721l1159J10437o9165q9564N4148
10846D49558J13757J0434p2317M8982j10897O06m0220N9986R8865m4814k0179
10835D93761J37164l9803O0324Q6522n8071l6941l3801j39990p407j9077K0528
10824D63209Q7851j14295k7632q397p1505j6058L0685j32850Q8194J04388J69600
10813E73190O3664J2174N9375o535j32770j33209n3833r0456k7478j36349Q1205
10802B08978Q3577k4753j1289n9605M1602M7735P1345J16457l0400K9238j6051
10791D56834P3392N3709l1949l1974P2815J4910j4295j4466L3375m4891Q6511
$$ plain form
10868 285089 339517 296196 231548 229174 254627 319736 465274 588772 610179 563204 531283
10857 531283 590951 655899 609752 649396 644582 474861 443702 554139 484974 395410 449558
10846 449558 563315 573749 501432 550414 439517 440123 399903 459889 558754 513940 493761
10835 493761 630925 591122 651446 737968 679897 642956 609155 469165 461758 442681 463209
10824 463209 551060 436765 409133 400736 329231 313173 343858 211008 299202 403590 573190
10813 573190 636854 649028 708403 701868 569098 435889 382056 291600 264122 127773 208978
10802 208978 292555 267802 256513 196908 238510 286245 357590 474047 443647 472885 456834
10791 456834 530226 583935 551986 520012 592827 607737 593442 578976 612351 567460 653971
10780F53971j69382p2519Q6496r1817k08865l1033O1945O7652J2384l5566K1557
10769B94823j32296r2155O5377r1814R1170P4833P2594k0611m0527p6727n5992
10758H8675O3421m7748l7760L6642J56713J16627P9898n8094j32395L5192O1239
10747C62410J3163l5864M0549K14027O2891R3712R7837q0040j6800o9675k54024
10736D28186j51511J24943Q7546j39148j76969N6933K8106L3931P1237j26390
10726B36864r2972l8179P300J52283R8564n7013l7998m0562L8194J978J1752r0849
10714A89362k8958M6688p1017R9023j1669L4167R55M0514K898M4665Q864L3438
10702C88930L7520M3619J22604J89946J55278R673j6507J97405R8470L4837J859
$$ plain form
10780 653971 484589 412070 498566 406749 197884 166851 228796 296448 308832 273266 294823
10769 294823 162527 70372 135749 43935 135105 209938 282532 261921 221394 144667 88675
10758 88675 152096 104348 66588 103230 259943 376570 456468 398374 265979 301171 362410
10747 362410 375573 339709 380258 594285 657176 750888 848725 768685 751885 682210 428186
10736 428186 276675 401618 489164 350016 173047 229980 258086 292017 363254 236864
10726 236864 143892 105713 113013 265296 363860 306847 268849 228287 266481 268459 280211 189362
10714 189362 160404 207092 136075 235098 223429 257596 258551 299065 301963 346628 355492 388930
10702 388930 426450 470069 592673 782619 937897 947570 931063 1128468 1226938 1261775 1263634
10691A263634k07214j01736j9824r9550j52006q8283j02555j19878r2243M8591
10681C28936J1558j32632K9624O2388r713r8064J5677J07720K6893L4583n8181
10670C18789P453N006P7951K4724p5888Q95L9660j411p1502j13317k9020N6764
10658B40104R9331O1484M8893M5175J29280K19386J04680q7311k7655R126J1891
10647H54384j46514p5880o8119M2020J761j09677j68818M6573L3890j3361m1357
10636C54902K5207N3575k6759n4696m201M1156j9704J95368K16752J30732L06604
10625A218936L59445M80574L59073K83747k71280m96136k54125m49379l36170
10616H94685r5182j05158j49565j84594l6285r7030j1305J56153J00975J59518
$$ plain form
10691 1263634 1056420 954684 934860 835310 683304 595021 492466 372588 280345 328936
10681 328936 340494 207862 237486 299874 290161 192097 207774 315494 342387 376970 318789
10670 318789 326242 331248 409199 433923 358035 358930 398590 397179 325677 212360 183340 240104
10658 240104 339435 400919 449812 494987 624267 843653 948333 861022 833367 842493 854384
10647 854384 707870 631990 563871 605891 607652 497975 329157 375730 409620 396259 354902
10636 354902 380109 433684 406925 352229 348028 389184 369480 564848 781600 912332 1218936
10625 1218936 1578381 2058955 2418028 2701775 2430495 1934359 1680234 1230855 894685
10616 894685 799503 694345 544780 360186 323901 226871 215566 371719 472694 632212
10606F32212M6876p7349J8959R7001j06937j89761J9678n9355j18761n8976M68
10595B04055k2864j312o9750J5918r0241l211N9949K8832p7758j3124J40423Q7168
10583B58085p7720q933p5404k5464r0410J6425M646j1935L6027J51672J32195
10572C09184M5090O526j17322n3720m1039m1179R2555O688l2402M1903Q6657j61978
10560A40963n5358O4023n9727j9316J26635R1323K5102r1377q0169r01J5849j40305
10548A6742m0985J431n8931j08126Q001k4280K7895l4805j2644P5354K17203R6183
10536A63038N6726P087q4890l6681o5909K0821n182R7864j7724M5467n9023n4289
10524F7305K6086O2517J05104q1085j32784J1498L2953j18948p4583k0796p9379
$$ plain form
10606 632212 679088 601739 620698 717699 610762 421001 440679 381324 262563 203587 204055
10595 204055 181191 179879 110129 126047 35806 32595 92544 121376 43618 30494 170917 258085
10583 258085 180365 171432 96028 70564 -19846 -3421 1225 -10710 25317 176989 309184
10572 309184 354274 360800 243478 189758 148719 107540 200095 206783 174381 216284 302941 140963
10560 140963 85605 149628 89901 70585 197220 288543 313645 222268 142099 141198 157047 16742
10548 16742 -24243 -22812 -81743 -189869 -181868 -206148 -178253 -213058 -225702 -150348 66855 163038
10536 163038 219764 226851 141961 105280 39371 60192 55010 152874 135150 180617 121594 67305
10524 67305 93391 155908 261012 179927 47143 58641 91594 -27354 -101937 -122733 -202112
10513b02112J09863R0474n1755j1900P2685Q5424j32325j68026P3334O1765K8540
10502d4033k6205O5287L2121p0466j318L4205P8237M7796r2737Q6649P5754o2486
10490A22804p1607n1542k3920m4211J0708K4920j11842K2388p846q421M8678J36423
10478D6532k753l5510q494M6706K9450j32933j24669O9740J11726L2261K7696
10467E9752j13967N5823M3325O2008j21629o6226J68548L206j2839r62M9092J7501
10455A43632o3232j7983n4945o3396J2563l5269N2644n495n0732P2057R1442j0541
10443G0745o1735j6378n8457K6759J43402M7091m8747p1113r9448m1447j61905
10432b71233P3124K08342J28338L8280j2287n9763n6912J5918Q6722Q3624n4387
$$ plain form
10513 -202112 -92249 -1775 -53530 -65430 7255 92679 -39646 -207672 -134338 -72573 -44033
10502 -44033 -70238 -4951 27170 -43296 -44614 -10409 67828 115624 22887 109536 185290 122804
10490 122804 51197 -345 -24265 -68476 -57768 -32848 -144690 -122302 -130148 -138569 -89891 46532
10478 46532 43779 8269 -225 46481 75931 -57002 -181671 -111931 -205 32056 59752
10467 59752 -54215 1608 44933 106941 -14688 -80914 87634 90840 78001 77039 126131 143632
10455 143632 80400 62417 7472 -55924 -43361 -78630 -25986 -31481 -82213 -10156 81286 70745
10443 70745 9010 -7368 -65825 -39066 104336 151427 102680 31567 -67881 -109328 -271233
10432 -271233 -198109 10233 138571 176851 164564 104801 47889 63807 150529 234153 179766
10421A79766q3455l772m0858P3046P299K3167p0920r7625k0154o9886N6208O9901
10409B2717m9946K5431M6872J03285N956J7399O88m7643o0209Q9177r256J2525
10397A56996n281q7315J6758j3432j01291l9739M2572M0030n5878j0143J08369
10386E1646m4781L4688K5469j14109j11933J5769Q0497N9801j74555l9503J5678
10375b01333l669J3700j1455L2237P8229L8726J66252N7859p3674l9550K6797
10364H4119p998j15741L036N3618q9214k587J04631J00019J5990p0159K9182Q4857
10352A89753J447k0159O2358J21214N5532J40094J71168K18131K11671K76840
10342A428049L21828L05338J26881K45540P3671m2466j28425p8552j56920k49904
$$ plain form
10421 179766 96311 92539 51681 124727 132026 155193 84273 -13352 -33506 -103392 -47184 22717
10409 22717 -27229 -1798 45074 148359 154315 171714 172402 124759 64550 153727 144471 156996
10397 156996 151715 64400 81158 67726 -33565 -73304 -30732 9298 -46580 -56723 51646
10386 51646 6865 41553 67022 -47087 -159020 -143251 -62754 -2953 -177508 -217011 -201333
10375 -201333 -205002 -191302 -202757 -170520 -92291 -53565 112687 170546 96872 57322 84119
10364 84119 76121 -39620 -36584 17034 -72180 -74767 29864 129883 145873 75714 104896 189753
10352 189753 191200 171041 233399 354613 410145 550239 721407 939538 1151209 1428049
10342 1428049 1749877 2055215 2182096 2427636 2501307 2458841 2330416 2251864 2094944 1845040
10332A845040l13655k38029k72787k37036k04796p3504j6591l2816J1763j5430
10322D52159q4423j27441n9795J24103p0018p8560K5549J3685j5868K7613R17
10311B07921m4917J8828O3164j52041q7238L2334R49n187N3118P1505l335J5523
10299A70624r7075j33731p101J05267L2608n9912K1097O7592j359m8308O0467
10288A10169L1253P8744l3076j6918K417K4762p2727M561M6128O3038J09171j8404
10276C29118k5553M1043j78056j81849J04235K6684l9721O1421J5301j9550n0932
10265H2141M7199O6151q759j27385K3125P8249o4368l8013n4725M4026K6419L0814
10253A04874j04958o9806p7587O603j944L629N1247Q3385J22902J046n1355j7340
$$ plain form
10332 1845040 1531385 1293356 1020569 783533 578737 505233 488642 455826 467589 452159
10322 452159 367736 240295 180500 304603 234585 156025 181574 195259 179391 207004 207921
10311 207921 163004 181832 244996 92955 5717 38051 39000 33813 86931 158436 155101 170624
10299 170624 73549 -60182 -67283 37984 70592 10680 31777 99369 98010 49702 110169
10288 110169 141422 220166 187090 170172 172589 197351 124624 129185 175313 238351 347522 329118
10276 329118 303565 344608 166552 -15297 88938 115622 75901 137322 152623 133073 82141
10265 82141 129340 195491 186732 59347 82472 160721 96353 58340 3615 47641 74060 104874
10253 104874 -84 -69890 -147477 -140874 -142818 -139189 -87942 -4557 118345 119391 68036 50696
10241E0696K4040J3620j52800K4774J29286K6869K4889J14318O501j46199j31629
10230a5635k5550o6117m683L1890L5588Q6362j36070p1405O3064j5737p7356K0143
10218a75506J31228O6184L625j18844P8067R453m5276j11638M1470P6066P8181
10207C3010P6112m2702p1661J09671k375n0972N0187k7868O3569m9677j71343
10196h4049j1891L7071P2154L2103K8520M1075M9203o7802j30591P595M1373L2601
10184D7362K0923N29P9115r4362j20143K2993J05329k1818q2323K1435j8570k4644
10172f4174J6699P160l5780r2451M2056R7703p9819m6171L4621L6764k8557j16999
10160b28948K8884J19963P659N5582K9860n0457N7003J29700j2184N1839o7059
$$ plain form
10241 50696 74736 88356 -64444 -39670 89616 116485 141374 255692 262193 115994 -15635
10230 -15635 -41185 -107302 -111985 -80095 -44507 41855 -94215 -165620 -102556 -118293 -195649 -175506
10218 -175506 -44278 21906 25531 -93313 -15246 -5793 -51069 -162707 -121237 -45171 33010
10207 33010 109122 66420 -5241 104430 102055 51083 101270 73402 136971 87294 -84049
10196 -84049 -95940 -58869 13285 45388 73908 114983 164186 96384 -34207 -26612 14761 47362
10184 47362 68285 68814 147929 53567 -66576 -43583 61746 39928 -42395 -20960 -39530 -64174
10172 -64174 -47475 -40315 -76095 -168546 -126490 -28787 -108606 -154777 -120156 -83392 -111949 -228948
10160 -228948 -200064 -80101 -72442 -16860 13000 -37457 19546 149246 137062 188901 121842
10149A21842j11791j30304L9350J06231k5421j14043K7749P6260n8562q6609p5548
10138b30846l6467j5318O5146J71961J10532O5483o3054j44314M405O4454M025
10127c993N5473O5477j40388j97598R6972n98J1096Q393n9458Q4703R5152P2441
10115H7672M1881Q4745N390j15576k1602m0135j32911n4162J25808R4682q8937
10104a3145k9589J37441Q9065o1814j17747j27412j21714j46637J19058J39810
10094a32684p4352P1248J30009L7713n41M5800l6085p1806j9739J1510N2786N5354
10082F9213K4793M8774N8562o28m0913M7357q132q5721j33381M8361L4853J8622
10070H1760L4704n2771j57661K2643J67437K9950j98764q4727J2810J06581J34790
$$ plain form
10149 121842 10051 -120253 -80903 25328 -93 -114136 -86387 -10127 -68689 -155298 -230846
10138 -230846 -267313 -282631 -217485 -45524 65008 130491 67437 -76877 -72472 -8018 -3993
10127 -3993 51480 116957 -23431 -221029 -124057 -124655 -113559 -105166 -164624 -79921 15231 87672
10115 87672 129553 214298 219688 104112 82510 42375 -90536 -144698 -18890 75792 -13145
10104 -13145 -42734 94707 183772 121958 4211 -123201 -244915 -391552 -272494 -132684
10094 -132684 -207036 -135788 -5779 31934 31393 77193 41108 -30698 -50437 -38927 13859 69213
10082 69213 94006 142780 201342 200714 159801 207158 199026 113305 -20076 28285 63138 81760
10070 81760 116464 63693 -93968 -71325 96112 126062 -72702 -157429 -144619 -38038 96752
10059I6752O6011P6507J69260K21072J96483J50022J69839O50235Q69285R28661
10049C594127P10821n59151j112513p94143o20639l20349j82797k19825j22951
10040C72580p6119p5468q6179L8324K1369m8763p4996k9613K9236k8397J1227
10029E3201N3429N8520r2952q3306q1874M267J12099R135k4162L1801P1128L9781
10017A51067j62993p4854J18102J86672L7717j53866j3479j4588j02692M6402
10007A7488M8856M1124n9589r6600j01124p5391n1524O7551J29713N9570J45846
9996A25920L6310r5533j1129P128q7544m1714J6304k4695Q6796J9497q2355Q0737
9984B9722Q9915j28676n7188Q6473K2358m8345k1564o5092q7545K6348L2114J33591
$$ plain form
10059 96752 162763 239270 408530 629602 826085 976107 1145946 1796181 2665466 3594127
10049 3594127 4304948 3745797 2633284 1839141 1218502 898153 715356 495531 372580
10040 372580 296461 220993 134814 173138 194507 145744 70748 41135 70371 41974 53201
10029 53201 106630 165150 72198 -11108 -92982 -88715 23384 32519 8357 40158 111286 151067
10017 151067 -11926 -86780 31322 217994 255711 101845 88366 73778 -28914 17488
10007 17488 66344 107468 47879 -48721 -149845 -225236 -276760 -209209 -79496 -19926 125920
9996 125920 162230 66697 55568 62696 -24848 -66562 -50258 -74953 11843 31340 -51015 29722
9984 29722 119637 -9039 -66227 20246 42604 -5741 -27305 -92397 -179942 -153594 -121480 12111
9972A2111N1636K7379P5567J029l5394q8399J8382J1584N350K3722n3840Q660
9960E7787M7296M3530k6732j76699j63312J117J12333J21921l6950L844p0782
9949h6647l137J8392J6396p9190m0617Q9318J27119j0520M2567Q7742q6242j50077
9937g4896K9774N7231N0227p8938K5347L4540O117L917p9620j59573k5448N5652
9925a55670Q4296J3863j5020k3443j16888o5873J50204O4524J2498j8319j334
9914g1162o1741q9011J230R1147L157k2576n810N0790J11832Q7546j02500j0803
9902a7901J9679n293j0569M9446k523K6246j01605l3849p5664K9142J33491k8019
9890a7419J5744J27760n8200q1914p8285P8272R8155K9203P9267q5170o9535N5383
$$ plain form
9972 12111 63747 91126 166693 167722 132328 43929 62311 73895 79245 102967 49127 57787
9960 57787 105083 148613 121881 -54818 -218130 -217013 -104680 17241 -19709 -15865 -86647
9949 -86647 -89784 -71392 -54996 -134186 -174803 -85485 41634 31114 73681 161423 75181 -74896
9937 -74896 -45122 12109 62336 -16602 8745 43285 49402 53319 -26301 -185874 -211322 -155670
9925 -155670 -71374 -57511 -72531 -95974 -212862 -278735 -128531 -64007 -51509 -69828 -71162
9914 -71162 -132903 -221914 -220684 -129537 -126380 -148956 -154766 -103976 7856 95402 -7098 -17901
9902 -17901 1778 -3515 -14084 35362 32839 59085 -42520 -76369 -152033 -122891 10600 -17419
9890 -17419 -1675 126085 67885 -14029 -92314 -14042 84113 113316 192583 107413 37878 93261
9878I3261N9054j00121J8343q650K362N4184n1368r3481M6840l4140r0516j18720
9866b22952k2873P4424J27737P8698n0491o0502L2187N0973R5716M8374j9599
9855A31692J9670q3696j25742l8899R7499n4610m8977m5826o3379J46602M1103
9844b4563P1465o057j68450p0157R7228K8293L4697p0261M6921k510j03780Q2744
9832h4430R3858p0204l1761O5193j9254K5596J00270J7275k1488j05754k07558
9821b38257N8150Q6221k162L0073J28761k781o549p4274j943Q3084l630R139o9417
9808c585l9381L2592M1783O5776M9440j11660q9930Q6232J19188N3486j75820
9797B8121j23798J26931K7386r0547m7936N2534K3466q0283Q422K3250p5867Q9204
$$ plain form
9878 93261 152315 52194 70537 61887 64249 118433 67065 -26416 20424 -13716 -104232 -222952
9866 -222952 -245825 -171401 -43664 35034 -15457 -75959 -43772 7201 102917 151291 131692
9855 131692 151362 67666 -58076 -96975 524 -54086 -103063 -148889 -212268 -65666 -24563
9844 -24563 46902 40845 -127605 -197762 -100534 -72241 -37544 -107805 -60884 -63394 -167174 -84430
9832 -84430 9428 -60776 -92537 -27344 -46598 -21002 79268 96543 75055 -30699 -238257
9821 -238257 -180107 -93886 -96048 -65975 62786 60005 53456 -20818 -22761 60323 56693 65832 -3585
9808 -3585 -42966 -10374 31409 97185 146625 34965 -54965 31267 150455 203941 28121
9797 28121 -95677 31254 58640 -31907 -79843 -27309 -3843 -84126 -75704 -52454 -128321 -39117
9785c9117m0477j53085l3088J6678K8221Q9697J44478j0136n5210q0168r4202
9774b26409P6420n1594J23418n1725n7857j7754j5189M1696K7777N2438K5922
9763g2857J3828J2137m4367j04842m5989O5387P5454O7596R9710l0539N759j13418
9751g2141m8211J04147O8386p7095p1127P9417R622p8615P3293q899K3964P3353
9739G6094m7855R0577K3600l2026M6362L6296j25611j05060L169P8176k3059j9588
9727A075J1860n9224r433o5620P7349N4074J4341L2596p8503q5681L791P3904
9715b9471m7983O6495J17210M131m7762r9592o6644P3245Q5131J2538j2329K4534
9703G9503J5988j8876j51256J9583K3642K0683P3383l171L2322k923k6500J6811
$$ plain form
9785 -39117 -79594 -232679 -265767 -249089 -220868 -131171 13307 3171 -52039 -132207 -226409
9774 -226409 -149989 -201583 -78165 -129890 -187747 -205501 -220690 -178994 -151217 -98779 -72857
9763 -72857 -59029 -46892 -91259 -196101 -242090 -176703 -101249 -33653 66057 35518 41277 -72141
9751 -72141 -120352 -16205 52181 -24914 -96041 -16624 -7002 -85617 -12324 -21223 2741 76094
9739 76094 28239 118816 142416 110390 156752 193048 67437 -37623 -34454 43722 20663 1075
9727 1075 12935 -46289 -55722 -121342 -43993 10081 24422 57018 -21485 -107166 -103375 -29471
9715 -29471 -77454 -10959 106251 110382 62620 -36972 -103616 -30371 54760 67298 54969 79503
9703 79503 95491 76615 -74641 -55058 -31416 -10733 62650 59479 91801 88878 62378 79189
9691G9189p3303P3833N3790m9957j07302P2060j0060J5196M16K8066K8264k4064
9679H6128j37279r4715n2694J1841M504Q2921J7854K3103L4820j12885m6868J35992
9667d7278M6953m7949m5536j1656P5941K7906Q0085Q3163r6858J7224k1584n2677
9655G734n7709l1727P3899P7257p9292p4454K07918J8564j24074r8593J1103Q2343
9643A2969L6936O3771j0793j81492r4573J26112R8419Q725P3926l1072j3281j5256
9631G4391n2427j48889m8666L1391q1331k1122J48096L0549J4398L101l6873l1530
9619a18912K0292m5687K8084R1807M1093n2620L192L7680L0896j2435Q3611M6796
9607A53797q7812k3839l7809j00712N9552K4160O1198K0393M3619K7268J8416
$$ plain form
9691 79189 5886 79719 133509 83552 -23750 48310 38250 53446 53862 81928 110192 86128
9679 86128 -51151 -145866 -198560 -186719 -182215 -99294 -81440 -58337 -23517 -136402 -183270 -47278
9667 -47278 -325 -48274 -93810 -105466 -29525 -1619 78466 161629 64771 81995 60411 7734
9655 7734 -49975 -81702 -7803 69454 -9838 -84292 123626 142190 18116 -80477 -69374 12969
9643 12969 49905 113676 102883 -78609 -173182 -47070 51349 60074 134000 102928 89647 74391
9631 74391 21964 -126925 -175591 -144200 -225531 -246653 -98557 -68008 -53610 -50509 -87382 -118912
9619 -118912 -98620 -144307 -116223 -24416 16677 -35943 -32751 4929 35825 23390 107001 153797
9607 153797 65985 42146 4337 -96375 -36823 -12663 48535 68928 112547 139815 158231
9596A58231j3944k3251j20187k8940j4884l3737l9905P581M3155N4430K3696j00852
9584h8607J2985J36031J00721m9920o7885J11066O6581j03764j28060n8118P8582
9573I612K6531q706O1782N002p9260j11405j20443O2574J25097o190j3713J16153
9561F7034J0413j8867j2594q2583l5023J04149L1815L0409j2453O333l2801l645
9549E2187N4384j6432m2072p8440o81p6529m7787o6380R9375J45874Q3295R69
9537A07763O0760r593J35497N6963j17337j89692j05358L3154l1304l7724n4706
9526a51577P9250J08771L2872L3148N2814l2485o9615n1360o5731n920J0695J78809
9514A19671J82640m8224r0285P32k99j4459m4152p7684q3308O3779j8517n0188
$$ plain form
9596 158231 144287 121036 849 -28091 -42975 -76712 -116617 -109036 -65881 -11451 12245 -88607
9584 -88607 -75622 60409 161130 111210 43325 154391 220972 117208 -10852 -68970 9612
9573 9612 36143 27437 89219 94221 14961 -96444 -216887 -154313 -29216 -35406 -49119 67034
9561 67034 77447 58580 45986 -36597 -71620 32529 64344 94753 82300 88633 55832 52187
9549 52187 106571 90139 48067 -30373 -31054 -107583 -155370 -221750 -122375 23499 106794 107763
9537 107763 168523 158930 294427 351390 234053 44361 -60997 -27843 -59147 -96871 -151577
9526 -151577 -72327 36444 69316 102464 155278 122793 53178 1818 -63913 -69833 -59138 119671
9514 119671 302311 254087 163802 164534 164235 149776 105624 27940 -55368 8411 -10106 -60294
9502f0294j44103N1965K7464K5889N4439J853k4089N4232o439n4356L8624j0650
9490d5465p1851R1821J11588R3077j8039M6984p4566q1690R4434j25456l5799
9479a4962M8118l3367M5551K725k3842N9938K3246l917k8155L9186o6537K2344
9467G0328M5980o4273p572n9258n6980r7385J49124J99757N4171r1645l3745m0289
9455F8213j5861K8400N3286J00083j1456o4743K6854j37147q0488J01768J4674
9444H3583j6484L1329N4356K5955m9514j03037K3494L0796l1554K2704n1439R0166
9432A10355Q5378k486o2966n7383R69k2776q7158k8125K4668M5593p904l9402
9420d1237Q7074O9717J7064j52601o2533j351l7224K2020M6076o3488J87750J64009
$$ plain form
9502 -60294 -204397 -152432 -124968 -99079 -44640 -42787 -66876 -12644 -19083 -73439 -34815 -45465
9490 -45465 -117316 -25495 86093 179170 161131 208115 133549 51859 146293 20837 -14962
9479 -14962 33156 -211 45340 48065 24223 84161 107407 103490 75335 114521 47984 70328
9467 70328 116308 52035 44463 -14795 -71775 -169160 -20036 179721 233892 142247 108502 68213
9455 68213 52352 80752 134038 234121 222665 157922 184776 47629 -32859 68909 83583
9444 83583 67099 98428 152784 178739 129225 26188 49682 80478 48924 71628 20189 110355
9432 110355 195733 193247 130281 72898 73867 51091 -36067 -64192 -39524 6069 -1835 -41237
9420 -41237 45837 115554 132618 -19983 -82516 -83867 -121091 -99071 -52995 -116483 71267 235276
9408B35276j12744q8908O6763J5135j11358n4846p0085n9050Q7519J66143O4260
9397A38105n6374k0259K4123P9216m5682j02304l2000J28476J40032J369k23327
9386C1375p6837j4430k259k6854J564K2474J07102l9976m3928L8844j3620J00399
9374H3854Q6251j04650j31328L910J43827O1737m1323q3770K8342l221K4142N2052
9362A19823J6966O7153P1308N2105j56732o3497k5087M9458J2707K7981Q1474
9351B53659j06095M6171N7894Q2586J1613o0606j04254j4355l980K8223J0601
9340B01457m5280K8354M7452M6925q858J3084L4716j4856r7806l4647n50j23621
9328D6370r6285l9070J34742J4559m0192J59730J04396k916n6917K5568N643l1226
$$ plain form
9408 235276 122532 33624 100387 115522 4164 -50682 -120767 -179817 -92298 73845 138105
9397 138105 81731 61472 85595 164811 119129 16825 -15175 113301 253333 254702 31375
9386 31375 -45462 -59892 -62151 -89005 -87441 -64967 42135 2159 -41769 -2925 -16545 83854
9374 83854 170105 65455 -65873 -61963 81864 143601 102278 18508 46850 43629 67771 119823
9362 119823 136789 203942 275250 327355 170623 107126 82039 131497 144204 172185 253659
9351 253659 147564 193735 251629 334215 345828 285222 180968 166613 162633 190856 201457
9340 201457 156177 184531 231983 278908 270050 283134 317850 302994 205188 170541 169991 46370
9328 46370 -49915 -88985 45757 60316 20124 179854 284250 281334 224417 249985 255628 224402
9316B24402K5719j23233K9464j50o1405j12894N5316j4486p5034J04162M5240
9305I7101Q481J19416J0710j4353J2757j00783L2808Q1992J00417J04100m2788
9294D09858r3658j07328k832Q2266m2522K8464Q3795n199m3752m1709k0707r199
9282B37477j4654P907P039J14171O0504m6102K380p6040K3732Q9977j16443J6850
9270C06798J35627L9272q9000L471O416O6902j1751M9381j1788k4288j39427j6354
9258C15259K024R1414k5696R1456K1323M7215K8473N0310j958q9187L6743J87237
9246G54613J32545L125j63092p4406L7026N1954M4122r2428j75605R7968M6064
9235F61886J58084O0288o6472K3612j3419P7412j3282l8165M3021P478p1059j23365
$$ plain form
9316 224402 250121 126888 156352 156202 94797 -18097 37219 22733 -52301 51861 97101
9305 97101 105582 224998 235708 221355 234112 133329 166137 248129 348546 452646 409858
9294 409858 316200 208872 206040 288306 245784 274248 358043 352844 309092 267383 246676 237477
9282 237477 222823 230730 237769 351940 412444 366342 368722 292682 316414 406391 289948 306798
9270 306798 442425 481697 392697 396168 402584 469486 457735 507116 495328 471040 331613 315259
9258 315259 317283 408697 383001 474457 495780 542995 571468 621778 619820 530633 567376 754613
9246 754613 887158 890283 727191 652785 689811 741765 785887 693459 517854 615822 661886
9235 661886 819970 880258 813786 837398 823979 901391 888109 849944 892965 900443 829384 706019
9223G06019q7044P7073J09495m5452J03177J01067L0409k6081j3628M0508q0152
9212I15391M0405N8065M7655m6676j33671j1258j4677O3331J65837J9877j4611
9201A089668J33321L6262J3060q420N3200J51092P8013Q3663J00855J7740N0451
9190A798905k3181l68K2044J05180J48788K6068m2191m5O5346P7204K4614K16123
9178B418487Q2251P5924J13804J692J39046J02255K03253J39953O6392M6420P6667
9167C466144R8388J27227J22822J57000J70352J22024J8178J46119L32233K25882
9157D986369L41227L77872K57066K99603L61933K41213J50644K07225L84709L17766
9147G925627M77068M16813L80686M71346M50648M82851M28215L46126L76803N28676
$$ plain form
9223 706019 618975 696048 805543 760091 863268 964335 994744 968663 955035 995543 915391
9212 915391 955796 1013861 1061516 1014840 881169 869911 855234 918565 1084402 1104279 1089668
9201 1089668 1222989 1259251 1272311 1263891 1317091 1468183 1546196 1629859 1730714 1748454 1798905
9190 1798905 1775724 1775356 1797400 1902580 2051368 2077436 2035245 2035200 2100546 2177750 2202364 2418487
9178 2418487 2500738 2576662 2690466 2692158 2831204 2933459 3136712 3276665 3343057 3389477 3466144
9167 3466144 3564532 3691759 3814581 3971581 4141933 4263957 4282135 4428254 4760487 4986369
9157 4986369 5327596 5705468 5962534 6262137 6624070 6865283 7015927 7223152 7607861 7925627
9147 7925627 8402695 8819508 9200194 9671540 10122188 10605039 11033254 11379380 11756183 12284859
9137A2284859N08242L81684M49603N16441L64553J93937J66455J99823J41609
9128A5207206M4518p0883L5624N8430L9565k22512k94188l61071l48962l10815
9118A3776912l71215l38993l78498k95731l96215l90859l70431m03623m29478
9109A0401869l09862l18933l54136l21907k83508l85840k72067k80178l14113
9100G561325l33707j14587k25184k46545k78034k12237j85683k20092j21022r6949
9090E527285k40225k32999j28471j14010L3822n1377k34761j93844j77609r6398
9080D091413k32227j11043p5646j97211p1235q4897l3811j9813o1927q6100q4706
9069C032797j14179q1370j16921n3221j25775q6599k2144J05519k3749r7756j61572
$$ plain form
9137 12284859 12793101 13174785 13624388 14140829 14505382 14699319 14865774 15065597 15207206
9128 15207206 15251724 15180841 15216465 15274895 15314460 15091948 14797760 14436689 14087727 13776912
9118 13776912 13405697 13066704 12688206 12392475 11996260 11605401 11234970 10831347 10401869
9109 10401869 10092007 9773074 9418938 9097031 8813523 8427683 8155616 7875438 7561325
9100 7561325 7227618 7113031 6887847 6641302 6363268 6151031 5965348 5745256 5624234 5527285
9090 5527285 5287060 5054061 4925590 4811580 4845402 4794025 4559264 4365420 4187811 4091413
9080 4091413 3859186 3748143 3672497 3475286 3404051 3319154 3285343 3265530 3203603 3117503 3032797
9069 3032797 2918618 2837248 2720327 2667106 2541331 2454732 2432588 2538107 2514358 2416602 2255030
9058B255030j23530j97571r3253j08400J763m5473n906O9026k1260n487M705J5529
9046A745173M7231j06894r6371q5702l8789o6017n0287m7494j3010K1074N5859
9035A364773j91532j29770N5663J22825o4324j20138O622P645Q7970m2729r0147
9024A006858m7472q76l3415o5641q9073k8033q740n6631M0486L9728j7507m643
9012G35041J9665m4595M8667l5952p172R8633J2831n8620l7349m8752O6996N5442
9000H04835j39100l9804P1018M6875k0304o2599q5696j6577j10881L2903O6647
8989E47317m3281J2981m5781J7930l6619k2201J1277k6354m1813N2248j25829
8978B99875L8392N6326p325K4653K2907L4776O0263J4379M457l3070j59339l9944
$$ plain form
9058 2255030 2131500 1933929 1840676 1732276 1734039 1688566 1682660 1751686 1730426 1724939 1729644 1745173
9046 1745173 1792404 1685510 1589139 1503437 1464648 1398631 1348344 1300850 1287840 1308914 1364773
9035 1364773 1173241 1043471 1099134 1221959 1157635 1037497 1044119 1051764 1139734 1097005 1006858
9024 1006858 959386 958510 925095 859454 770381 742348 733608 676977 717463 757191 739684 735041
9012 735041 754706 710111 758778 722826 715654 814287 827118 768498 731149 682397 749393 804835
9000 804835 665735 625931 696949 743824 723520 660921 575225 558648 447767 480670 547317
8989 547317 504036 517017 471236 489166 452547 430346 441623 415269 373456 425704 299875
8978 299875 338267 394593 387268 411921 434828 469604 529867 544246 548703 515633 356294 316350
8966C16350r9144J2948J72470m7591L619J7452m5220m8146M3621L0339O0644R159
8954D26501l3949o6520q4168m2993k3104P8764J52220M7572j00532n5205K0741
8943C19327q729l4327J9718J2753J75N8224j7328n693J7922J7819L8159k7288
8931C90732j01254K3041M596o9996l397k1697o1173N6581P5789k2320m0839K513
8919B32576o6391K0675L7874k5847j8405K1989n4138O2770O0172o8307l4650n3827
8907A14491K0670O8154L3037k5167J0948L152j8902N0826Q9810L2582j8522r7767
8895B63312n6680J5126j14433J9594J46528J6142M6869M625n872j17325j34389
8884H3497p2035J9374n8072n7111L0598K04721J18280N3443p9788m8902P9294
$$ plain form
8966 316350 217206 230154 402624 355033 358652 376104 330884 282738 326359 356698 417342 426501
8954 426501 392552 326032 241864 198871 175767 254531 406751 454323 353791 298586 319327
8943 319327 310598 276271 295989 308742 308917 367141 349813 344120 362042 379861 418020 390732
8931 390732 289478 312519 317115 247119 243722 222025 160852 217433 293222 270902 230063 232576
8919 232576 166185 186860 224734 198887 180482 202471 148333 211103 271275 202968 168318 114491
8907 114491 135161 203315 236352 211185 222133 225285 206383 257209 347019 379601 361079 263312
8895 263312 206632 221758 107325 126919 273447 289589 336458 341083 335211 217886 83497
8884 83497 11462 30836 -27236 -84347 -53749 150972 269252 322695 242907 194005 273299
8873B73299n1616o1732r7276n1530J08566J10596q6952q8864l945L0765o9984
8862A1327M0945N2302N8704Q0477J01541l4235p1586P8274j7771j64717N1756
8851A87017Q0307j77752p3791L2899l1188J0333Q4196p7777k2880J34086J13168
8840B58618k9701l3084k2710j31872L3726P256k3555p3085J7511o194J2174Q2880
8828I1964J9726j4681K7938o15M076P1727j5209p8986o5113r3995P144M8468n3075
8815e0631m2108O8726M1600J53151o2755o7304k4661j413n0714J93O2454L3719
8803F0257L1846L8721m2339K5910m1177r7011J6904L6033n114J80627Q3725j04166
8791A84216q8472p4737m0159K8196j9439p1028m371m32k3877N0492J06616l2762
$$ plain form
8873 273299 221683 159951 62675 11145 119711 230307 143355 54491 50546 81311 11327
8862 11327 52272 104574 163278 243755 345296 311061 239475 317749 299978 135261 187017
8851 187017 267324 89572 15781 48680 17492 27825 112021 34244 11364 145450 258618
8840 258618 228917 195833 173123 41251 74977 82233 58678 -14407 3104 -3090 9084 91964
8828 91964 111690 97009 124947 124332 128408 200135 184926 105940 40827 -53168 -46024 2444 -50631
8815 -50631 -92739 -24013 17587 170738 107983 40679 16018 14605 -36109 -35916 26538 60257
8803 60257 92103 130824 88485 114395 73218 -23793 -6889 29144 24030 204657 288382 184216
8791 184216 95744 21007 -19152 9044 -10395 -81423 -85794 -86226 -110103 -59611 47005 14243
8779A4243M2016n3381K018J32958j17823k7729L9887o7645L0642R0314K908m679
8767H3729L9248j07149j5433r186o11p8425n3361Q3677P1910r316r5389p958J33293
8754C5029O8943N8029j62392m1798Q734P3342M68J47142N645j09625n3133P7644
8742A08028L3755J3027L9036l4553n0294m4529J4579M8058n9682K4834M7331J9242
8730A58832q574j374k2279P305j25596r0389J17019P9348K2924n4155m0714N6417
8718I8764n7560j18081J02901P1457l178j03330m6554J13887K00072P8017J5472
8707C51867j88156j06140P920M7372j35269n5216J16732J25661j6048J2120n8306
8696A02537j33939r6543N4655L7758O8966M279q487M473j38839M9076K04084K7671
$$ plain form
8779 14243 56259 2878 4896 137854 20031 -7698 32189 -35456 -4814 85500 88408 83729
8767 83729 122977 15828 395 -8791 -9402 -87827 -141188 -57511 14399 5083 -90306 -98264 35029
8754 35029 103972 162001 -391 -42189 -33455 39887 40355 187497 193142 83517 30384 108028
8742 108028 141783 154810 193846 159293 108999 64470 79049 127107 67425 92259 139590 158832
8730 158832 150258 148884 126605 133910 8314 -82075 34944 114292 137216 83061 42347 98764
8718 98764 41204 -76877 26024 97481 94303 -9027 -55581 58306 258378 336395 351867
8707 351867 163711 57571 65491 112863 -22406 -77622 39110 164771 148723 160843 102537
8696 102537 -31402 -127945 -73290 -35532 33434 37713 29226 33699 -105140 -56064 148020 175691
8684A75691r1664j33279o9035r028R1748K9402o2081K1622M2302K550l0693P0952
8672C8487M8537O547Q8995j0746o7791K1348P0120j3980j26008J195O8396P4146
8660A99246k7490q2231j404O6437K368k9682K9762l4240O0536R0867J14115k0237
8648C68047j23495L2401o252q0205r3426j0541k1779J12547R4352l0939J21330
8637C62040j7476p5598m9762k4608O0178q4597l4684n5015N1314o0159m8683P1936
8625I4886J21347p2270k5546J61532o9442j19140r8074L6525j4891o8243J74285
8614A20969k6214M6638o772m3585J24358J62409j18095p742J19408r3183k7887
8603B50304L9945M6786M6186P1910q132L4323m949r7315M0309O6904k6197L36
$$ plain form
8684 175691 84027 -49252 -118287 -127315 -35567 -6165 -68246 -46624 -4322 -1772 -32465 38487
8672 38487 87024 93571 182566 171820 104029 125377 195497 181517 55509 56704 125100 199246
8660 199246 171756 89525 88121 154558 156926 127244 157006 122766 183302 274169 388284 368047
8648 368047 244552 276953 270701 190496 97070 86529 64750 177297 271649 240710 362040
8637 362040 344564 268966 219204 194596 254774 170177 135493 80478 131792 71633 22950 94886
8625 94886 216233 143963 118417 279949 210507 91367 -6707 29818 14927 -53316 120969
8614 120969 94755 141393 134621 91036 215394 377803 259708 251966 371374 278191 250304
8603 250304 290249 337035 383221 455131 446999 481322 476373 379058 419367 486271 460074 460410
8591D60410O8336J2175j03748j33090l2537l6989J2797P9641Q1944p169q7154
8580C14616j5036m2568n5565k0990J09026O4316o9230j10031m5883n0874N2606
8569A30387Q4843n762J20032p9030j3802o667m9490m713K2567M4591j61855j17098
8557c5997M1189o1676J06713J06196P340j1450K4040J9910m9783j89695l2987
8546g6200R0710J11763K5846J04312N4786k2419p9189j9687o238n1325p5229P2159
8534A29289O3735k1160J6437k6370j08124L5814j9901q4124q8935J14180M5700
8523E6541J3762m868K1508n7307p4876q262m3318Q7916J25535r7500q7682R4997
8511B6446K4356J4767K3275K5917L3846R9495k15206q1601j8823N5564q058K9162
$$ plain form
8591 460410 528746 540921 437173 304083 271546 234557 247354 326995 408939 401770 314616
8580 314616 299580 257012 201447 180457 289483 353799 284569 174538 128655 77781 130387
8569 130387 215230 209468 329500 250470 236668 230001 180511 175798 198365 242956 81101 -35997
8557 -35997 5192 -56484 50229 156425 163765 152315 176355 196265 146482 -43213 -76200
8546 -76200 14510 126273 152119 256431 311217 288798 209609 189922 183684 132359 57130 129289
8534 129289 193024 171864 188301 161931 53807 89621 69720 -14404 -103339 10841 56541
8523 56541 70303 65435 86943 29636 -45240 -53502 -96820 -8904 116631 19131 -68551 26446
8511 26446 50802 65569 88844 114761 148607 248102 32896 -48705 -67528 -11964 -20022 9140
8499I140j8105l9348l5656q477R5646N4539o4645j8468L4031m0506j08795l2695
8487a73339N6634O9090j2880M3387O3776j3945m7479k2148Q1157q6653j11741
8476a54141j0796P824K04667J28448m9132L0299K9341j4236O522N9096q2185j26370
8464B9337n8034k0862l3160l3796N657J014J2480l8241M3780Q4973L8933K2132
8452E4213j5834k1217P3114M2351j19656n6591K1474l217N6762J4748J37636P3351
8440B57134k6878q923j95610n0378Q5402M1924q8379J7554o2451l7415J244R0963
8428B4187P6564M624l5330l9864J9901J8787N8231m3461p9723r187o4900l2784
8416a02955J24903M390q3232j27928N3884K5709q7531L2104m2592j262N7418R5206
$$ plain form
8499 9140 -8965 -48313 -83969 -92446 3200 57739 -6906 -25374 8657 -31849 -140644 -173339
8487 -173339 -116705 -47615 -60495 -17108 46668 32723 -14756 -36904 44253 -42400 -154141
8476 -154141 -164937 -157113 47554 176002 126870 157169 186510 172274 178796 237892 155707 29337
8464 29337 -28697 -49559 -82719 -116515 -110858 -109844 -97364 -135605 -91825 -6852 32081 54213
8452 54213 38379 17162 90276 132627 12971 -43620 -22146 -25363 31399 46147 183783 257134
8440 257134 230256 221333 25723 -24655 60747 102671 14292 31846 -30605 -68020 -66776 24187
8428 24187 100751 105375 70045 30181 50082 68869 127100 83639 3916 -5271 -70171 -102955
8416 -102955 21948 26338 -56894 -184822 -130938 -105229 -192760 -160656 -203248 -204510 -147092 -51886
8404e1886J689N8164N2906J19816J7417j31066q7369P0065O8879l9765m842m7946
8392B6062l7120j5417l7184K7010O0023J32971M3P7643K1533n2555J087m2086
8380A62010j39506l9567K2019J1497k2941o638R0719J42600O1248N2817j5321
8369C18937K9031K934l1729j56149m7839K05243R6689j58092r1210P840J30019
8358C05674r384n3162j07732N086Q3132n7244J5132J2868r309k00087p5024K0017
8346g0033Q3718K5015p3301l249O3774K8910M3317k3860N8687k9027l0710P201
8334H0442M8237K4217M6599N2414r15L1283O2047J1185J54941P4874L1708l8012
8322E79020m2246j9572j0963p2534k9099n4380n6507r6227N3670K9535j35105
$$ plain form
8404 -51886 -50197 7967 60873 180689 198106 67040 -20329 49736 118615 78850 74008 26062
8392 26062 -11058 -26475 -63659 -36649 23374 156345 156388 234031 255564 203009 204096 162010
8380 162010 22504 -17063 4956 16453 -6488 -13126 77593 220193 281441 334258 318937
8369 318937 347968 350902 319173 163024 115185 320428 417117 259025 167815 175655 305674
8358 305674 296290 243128 135396 140482 223614 166370 181502 194370 185061 -15026 -90050 -70033
8346 -70033 13685 38700 -34601 -37850 25924 54834 98151 74291 132978 103951 73241 80442
8334 80442 128679 152896 199495 251909 250994 282277 344324 355509 510450 585324 617032 579020
8322 579020 536774 517202 506239 433705 404606 350226 293719 197492 251162 280697 145592
8311A45592r2876j01851m8130O8365J25231L8010j55310l4315M779L0554M6968
8300B7017r706L3196M5650K2418N2716O1359l573L7383k501r6880l9010L507m4936
8287H6640j4026Q0501k124M0483M6770N4037k2325n0244J4069N9004N0881j5632
8275C28034r8698j1419J15267n9078j29126p0630m9849m7981q5101R4128R5608
8264H1155p3395p0305l6399l5639M4012l2649Q4273J46104J466j3675j63685j40964
8252b09701k1652N1977P4753N9371J35111M1133n4730p031P6622q138j48918q497
8240a9700J10402p9916l2987L5829q0981J15388J57080O7966j12881p8818q4240
8229b858L5742P0721q1045n4718J33716K139N1749p3573j6506p0271O0792K890
$$ plain form
8311 145592 52716 -49135 -97265 -28900 96331 134341 -20969 -55284 -50505 -19951 27017
8300 27017 17311 50507 96157 118575 171291 232650 229077 266460 263959 167079 128069 131576 86640
8287 86640 72614 153115 150991 191474 238244 292281 269956 219712 233781 292785 343666 328034
8275 328034 229336 217917 333184 274106 144980 74350 24501 -23480 -108581 -14453 81155
8264 81155 7760 -62545 -98944 -134583 -90571 -123220 -38947 107157 108623 94948 -68737 -209701
8252 -209701 -231353 -179376 -104623 -45252 89859 130992 76262 69231 145853 137715 -11203 -19700
8240 -19700 90702 10786 -22201 13628 -67353 48035 205115 273081 160200 81382 -2858
8229 -2858 32884 103605 22560 -32158 101558 103697 155446 81873 65367 -4904 55888 58778
8217E8778j23071M5813J22059k5475j6106n3307j57594J01400R9553k1446j13978
8206h3374M2519K7015P8652L5977r4101l7385n2862K1240O6128R671j4544k9475
8194c0539J17441M6537O186L6634k9093l6842q8518o889J40213K7974N3330N0160
8182B86594j05988m3294N8253L3724n2387l2350k8932K7075L4532o2412R6638
8171B11453L9768p5115j48499j24314k1497j5251L6232q7242j56026J5211N9408
8160b65872Q9900j2846m048R3231R1559J07837L9222J08928j07198k05813j23503
8149a88603L1631J33603Q71j42418N0237J8188O2181Q2362O0960j2727L0186k288
8137A24183k8460m2838N3843r2826n8413j1497k0875O0210P3084J11359J340o7756
$$ plain form
8217 58778 -64293 -18480 103579 78104 61998 8691 -148903 -47503 52050 30604 -83374
8206 -83374 -40855 -13840 64812 100789 6688 -30697 -83559 -62319 3809 13480 -1064 -30539
8194 -30539 86902 133439 139625 176259 147166 110324 21806 14917 155130 183104 236434 286594
8182 286594 180606 137312 195565 229289 176902 144552 115620 142695 177227 114815 211453
8171 211453 251221 176106 27607 -96707 -118204 -133455 -97223 -184465 -340491 -325280 -265872
8160 -265872 -175972 -188818 -192866 -99635 -8076 99761 138983 247911 140713 -65100 -188603
8149 -188603 -156972 -23369 -22498 -164916 -114679 -96491 -34310 48052 109012 96285 126471 124183
8137 124183 95723 52885 106728 13902 -44511 -56008 -76883 -16673 56411 167770 169110 101354
8125A01354k5127m1848P1938J9461j2449N0008k024O5999j7969p4361n9651P6439
8113A51770J56056n5332j61177r8739j6518K5335J41589k2984q7337j00409p975
8102g5721J44974Q1288o8148k398N1793k5672j92751j22773K9075J69369N9540
8091D8576l4362k4776m2211Q3222n2791o9273J02511O0246p0939j7441L9676N3167
8079G5605k5196K876j20143J1642J52634Q4874j35660n3168o6117R8765J03367
8068A29479j3372o229L2571m5034l2968m9522m5641L5850Q9073j27762q3126J19325
8056B644K6170K6443P5573m6818n4074N4609k6566L4684J35321l2910l1278q0861
8044H2937n1337M9800J72599K0922J03929R8425j16686j5663j22526j61614j9003
$$ plain form
8125 101354 76227 34379 106317 125778 113329 163337 161313 227312 209343 134982 75331 151770
8113 151770 307826 252494 91317 -7422 -23940 1395 142984 120000 32663 -67746 -75721
8102 -75721 69253 150541 82393 79995 131788 106116 -86635 -209408 -180333 -10964 48576
8091 48576 14214 -10562 -52773 30449 -22342 -91615 10896 71142 203 -17238 22438 75605
8079 75605 50409 53285 -66858 -55216 97418 182292 46632 -6536 -72653 26112 129479
8068 129479 116107 109878 142449 97415 64447 14925 -30716 5134 94207 -33555 -116681 2644
8056 2644 28814 55257 130830 84012 29938 84547 57981 92665 227986 195076 163798 82937
8044 82937 31600 81400 253999 274921 378850 477275 360589 344926 222400 60786 41783
8033D1783R4048P7670r9920N531l4779j20182m1610r095J21738M8584m4409k0115
8021A9244l9408o600M9409P3042p055k3254l7069j9179p6988N318J3116J31540
8009H2116O417k8247J0740r93P2925p118n2828j04099p6799J4879J02869P0562
7997I0424N0879N1411m5394j3572M3791M3305l4808M6096n899N526M3468n5918
7985B19309r4793p258J19478N8320o4718p1832p9375J6847J8647m7883k452M3785
7973A08075J7970J7057j18822K9020J41364M6788j38781n6351k3475j0915N3980
7962F5910L9128l3880l1232k4465n367K4530O8021O3512n1077L0223J5271J2979
7950A73553Q3259K6540q6912r4495j73042L1358O3804O2116k9769n7030m1944
$$ plain form
8033 41783 135831 213501 113581 119112 84333 -35849 -77459 -86554 35184 83768 39359 19244
8021 19244 -20164 -26764 22645 95687 88632 65378 28309 9130 -67858 -62540 -49424 82116
8009 82116 88533 60286 71026 70033 142958 135840 83012 -21087 -97886 -83007 19862 90424
7997 90424 141303 192714 147320 133748 177539 220844 186036 232132 226233 231759 275227 219309
7985 219309 124516 117258 236736 295056 230338 158506 79131 95978 114625 66742 64290 108075
7973 108075 126045 143102 24280 53300 194664 241452 102671 46320 22845 11930 65910
7962 65910 105038 71158 39926 15461 10094 34624 102645 166157 115080 145303 160574 173553
7950 173553 256812 283352 196440 101945 -71097 -39739 24065 86181 56412 -618 -42562
7939d2562j0109O1000Q456K3346n3769o0268j01685J22231O7193Q3954l5105N6047
7927A18729R0883k81j6960j1450M553L6666j34617l8457j06009K8263L9937m229
7915G028J59950O2181n3715m4290k8215j04894O6126N006l3965r8451l6057J7257
7903h2039L0265M7534J3984K8072o0626M1833J38450K3383O785K7331l4745m2234
7891A37993m5224q922k4842Q9663q2019L7889R2013k0588J699k2706j67040j42606
7879a54690O2357J6577J7262L6221R598J9863J7448m2053Q1253J94816R4445n7878
7867B95219L1949l3069p7361L8121J17397j927l3695j50100q217l5281L4899J620
7855A79555J954O7870j10164j14772K06470R9631J88081K2306l7712K06631K15307
$$ plain form
7939 -42562 -52671 8329 16785 40131 -13638 -73906 -175591 -53360 13833 97787 62682 118729
7927 118729 209612 209331 192371 180921 185474 222140 87523 49066 -56943 -28680 11257 7028
7915 7028 166978 229159 175444 131154 102939 -1955 64171 69177 35212 -63239 -99296 -82039
7903 -82039 -51774 -4240 9744 37816 -22810 19023 157473 180856 187641 214972 180227 137993
7891 137993 92769 83847 59005 148668 66649 104538 196551 175963 177662 154956 -12084 -154690
7879 -154690 -92333 -75756 -58494 -22273 -12675 7188 24636 -17417 63836 258652 353097 295219
7867 295219 327168 294099 216738 254859 372256 370329 336634 186534 178317 143036 177935 179555
7855 179555 181509 249379 139215 24443 230913 330544 518625 540931 503219 709850 925157
7844I25157J75623N2920J05310J05338K9748o7436j37870j38829o7141j62399
7834H20421j62436k4364l627j37243K564O1309j00966j03216O6666L4537m0897
7823D12748n4138Q2964O8327M3354p6183M3922j21839j05608K1276P967P9972
7812D02762j15050j00352J00332J5200L5J18285Q0459Q8033R4793J60255L41653
7801A186405L99149K88127L22278N29807L38874J01904j23930l55287l93728m57333
7791A836266m62794k75142j64642r2590R765l1924N2276l3043j03029j19805o4149
7780E51189j27723q6564P3693L2727o4011J2809P1363N0353n719k626m534K1334
7768E22291j12398p6948N9561L0500n852o8444O6347L8764P629L9234N4983P5481
$$ plain form
7844 925157 1100780 1153700 1259010 1364348 1394096 1326660 1188790 1049961 982820 820421
7834 820421 657985 633621 629994 492751 495315 556624 455658 352442 419108 453645 412748
7823 412748 358610 441574 509901 553255 477072 520994 399155 293547 314823 322790 402762
7812 402762 287712 187360 287692 302892 302927 421212 501671 589704 684497 844752 1186405
7801 1186405 1585554 1873681 2195959 2725766 3064640 3166544 3042614 2687327 2293599 1836266
7791 1836266 1373472 1098330 933688 841098 850863 818939 871215 838172 735143 615338 551189
7780 551189 423466 336902 410595 443322 379311 392120 463483 513836 508117 505491 500957 522291
7768 522291 409893 332945 392506 423006 417154 348710 415057 453821 461450 500684 555667 631148
7756F31148J97813K49910J33034J21326O8378J09788j5900k03494j77171j47228
7746I67604k65414j70617q8435p6290J3110N7733n2071o3653r351j21672l5893
7735A55051N2647l3409J3989M7529m0194r7393O9050M5761q0388M8253q1406j90168
7723i0678l6711J83498Q2008j31617j43395r2152l5011J89065K08951K831k133
7712A34656j18991k8156Q1178J4767J811l0987j35490j26542P345l6727l0852
7701b67988j6715j9593J01046J63360O2305l6459k670q0089m3242K0332N4088
7690f5625j13316j6330L4866K7075K7923j14047q794J76222J35573L2183k11899
7679i6169j99956R678Q6503K9069R4380l2285L0860M6380p7294k1639L7977K9452
$$ plain form
7756 631148 828961 1078871 1211905 1333231 1401609 1511397 1495497 1292003 1114832 967604
7746 967604 702190 531573 443138 366848 379958 437691 385620 321967 312616 190944 155051
7735 155051 207698 174289 188278 235807 195613 98220 167270 213031 132643 180896 99490 -90678
7723 -90678 -127389 56109 138117 6500 -136895 -229047 -264058 -74993 133958 136789 134656
7712 134656 15665 -12491 68687 83454 85265 54278 -81212 -207754 -200409 -237136 -267988
7701 -267988 -284703 -304296 -203250 -39890 22415 -14044 -16714 -96803 -140045 -119713 -65625
7690 -65625 -178941 -195271 -160405 -133330 -105407 -219454 -228248 -52026 83547 115730 -96169
7679 -96169 -296125 -286447 -199944 -170875 -76495 -108780 -77920 -31540 -108834 -130473 -92496 -63044
7667f3044J585j3879J9716L3402J04814n0082p3794n8280K6013N9561J07866j1138
7655H2740r5569j38854n9580J79833K26783q0264O3469n5282r1056K5437l3002
7644B4655q7207N0119O8485J4016L493q7328o4028P5939N6032j28995o4539O2217
7632g7141L877N7843J26717j1081m1916m6835j71465n4739R536r5607P5447J4252
7620b11112J6332O3062p8518J23913O3629j24687L3194P4426k7353n0890o3185
7609a81189O4670r6139j24996Q6885J05553P1209o0322k8569p7692o4300p4022
7598c78912M4110R0865J12421O6801m9426O5282L4171k7804M2289M5445n6707
7587a1465p4814p3551J3112q4373P712J8824l0348M4246k1843o2528j117Q7141
$$ plain form
7667 -63044 -61459 -75338 -55622 -22220 82594 32512 -41282 -99562 -73549 -13988 93878 82740
7655 82740 -12829 -151683 -211263 -31430 195353 115089 178558 123276 32220 57657 24655
7644 24655 -62552 -12433 56052 70068 73561 -13767 -77795 -1856 54176 -74819 -139358 -77141
7632 -77141 -73264 -15421 111296 100215 58299 11464 -160001 -214740 -205204 -300811 -225364 -211112
7620 -211112 -194780 -131718 -210236 -86323 -22694 -147381 -114187 -39761 -67114 -118004 -181189
7609 -181189 -116519 -212658 -337654 -250769 -145216 -74007 -134329 -162898 -240590 -304890 -378912
7598 -378912 -334802 -243937 -131516 -64715 -114141 -48859 -14688 -42492 -203 45242 -11465
7587 -11465 -86279 -159830 -146718 -231091 -223379 -204555 -234903 -190657 -212500 -275028 -276145 -189004
7575a89004J04055j6247m0065j24971m1714J31345M3058J1294P0144J1930j07221
7564a47396r4333J17387M0284N5373N6379p9688l944O1682K834n4202m5076J6094
7552g4606m4712N0891q6953K16438P9774j08560j35308o816j991M8016J62112
7541I8285N2522m7653l6606L2380Q43n7715n4254j42531j15815O3558P3165L7484
7529i6337J9062p119K9713J5580M6138J615p53P6187m0640L9620n4832p2092o455
7516e0313l5371p7636j16285q77J2518M0051M5128K2531L0416J1701r3661O635
7504b05163J02266N5614N2373m058J0204J5882P361o633q9643N155P8663n8942
7492c6921o1898l9276n865O3420j6864p2085O2842J28276K8589l9346j28502n387
$$ plain form
7575 -189004 -84949 -101196 -141261 -266232 -307946 -176601 -133543 -122249 -52105 -40175 -147396
7564 -147396 -241729 -124342 -84058 -28685 27694 -51994 -55938 5744 8578 -45624 -90700 -74606
7552 -74606 -119318 -68427 -155380 61058 140832 32272 -103036 -109852 -111843 -63827 98285
7541 98285 150807 103154 66548 98928 99771 42056 -12198 -154729 -270544 -206986 -133821 -96337
7529 -96337 -77275 -84394 -54681 -39101 7037 8652 7899 84086 43446 83066 28234 -43858 -50313
7516 -50313 -85684 -163320 -279605 -280482 -267964 -227913 -182785 -160254 -129838 -118137 -211798 -205163
7504 -205163 -102897 -47283 5090 1032 11236 27118 34479 27846 -61797 -56642 22021 -36921
7492 -36921 -98819 -138095 -143960 -80540 -97404 -169489 -106647 21629 50218 10872 -117630 -123017
7480a23017J05158J06492K1701M008K1154j0255K5326q0443j06456J175J05206
7469G0049L0771m6083J14507k788j3834P365J08384q3778l6327q187q5044n2093
7457B942N7156K2949o8966k535o3404M0253l5199l373O6504N1032m4511o1099
7445c8251J88223J77263l7750j96992r2066k999K282N000j1552Q3650R8926q3391
7433I2343l2039M238k5188j10859P1778j7281j32275m1659Q9432N7912J4032o5498
7421i5064m9677l2733L9079J59746k9732q0177M7423k0029j9336L4056n2445j79318
7409b78207R996P0278J16114L5768Q591L454K7100q272l7907P9640P1777o4139
7397C4193r4638j0672J543K139N2340J3300j25610j9462K1357M5283K7832R8806
$$ plain form
7480 -123017 -17859 88633 110334 114342 135496 125241 150567 70124 -36332 -35157 70049
7469 70049 100820 54737 169244 166456 152622 159987 268371 184593 148266 140079 55035 2942
7457 2942 60098 83047 14081 11546 -51858 -11605 -46804 -50177 16327 67359 22848 -38251
7445 -38251 149972 327235 289485 92493 427 -2572 -290 4710 -6842 76808 175734 92343
7433 92343 60304 64542 39354 -71505 273 -17008 -149283 -190942 -101510 -43598 -29566 -95064
7421 -95064 -144741 -177474 -138395 21351 -8381 -88558 -41135 -61164 -80500 -46444 -98889 -278207
7409 -278207 -268211 -197933 -81819 -46051 -37460 -34006 -6906 -15178 -53085 26555 98332 34193
7397 34193 -60445 -71117 -69574 -67435 -15095 -1795 -127405 -146867 -125510 -80227 -52395 46411
7385D6411L4388n2734O9105o7820p0518o7243R9748R0380l8876n9885q1832k1913
7373a20789n8008q1076k9438j9236N2434O7195K9170p569M0474M8773R6850J26788
7361A45568p4622L1909N0412q3297j70390K5874L1324m9904K2624K0295Q4236
7350C4029N5280l7068k1743n5905q57j617j9583J0347l1390m981R9401j8056q0497
7337g2640R7183p8776m7722Q2841m3693l0235o682m4281K8787K8747o229Q9481
7325c219q6117Q8020J19184l1502K2496N1298j06053j26038j60039R986J8911
7314b03073n5464M7846J41732J8490l349q7357l0682M2718J17398n7623r9911
7303a69275m4091J17746L6658n4855m4832L9206l0159K5761R829p9338J26779
$$ plain form
7385 46411 80799 28065 97170 29350 -41168 -108411 -8663 81717 42841 -17044 -98876 -120789
7373 -120789 -178797 -259873 -289311 -308547 -256113 -188918 -159748 -167317 -126843 -78070 18780 145568
7361 145568 70946 102855 153267 69970 -100420 -74546 -43222 -93126 -70502 -50207 34029
7350 34029 89309 52241 30498 -25407 -26264 -27881 -47464 -37117 -68507 -73488 25913 7857 -72640
7337 -72640 24543 -54233 -101955 -19114 -62807 -93042 -99724 -144005 -115218 -86471 -92700 -3219
7325 -3219 -89336 -1316 117868 86366 108862 160160 54107 -71931 -231970 -221984 -203073
7314 -203073 -258537 -210691 -68959 -50469 -53818 -141175 -171857 -129139 -11741 -69364 -169275
7303 -169275 -213366 -95620 -58962 -113817 -158649 -119443 -149602 -123841 -114012 -193350 -66571
7292f6571M4616J06375R381j74923K4346o8599j5123M4845J02746o961j32317
7281a32185j0431j4634O3888L7501M5330p3073p3861K4728m1086p3213J7137P497
7269b22402J0214Q7302J00031K230r3422j3752m5513P3978R3989p4476r9903Q7478
7257i4246J20016J7778M8715l2543r068J2372J1239n4004j5406l4561m9950J51639
7245G1981Q9429j81823n310k539P004O5085J11744n1131m805k6297r2838O2237
7233D2737O9411n3871j30002l5010k5529J10703J54149m9589r4016N7926J494
7222D8403p6013K7573N6114n2026K3873j8643m4782J0086n796j8227j9717R0483
7210B1328P952o3693m7522o5464N0322M0315o4485L2734P1964p9959n5324Q8545
$$ plain form
7292 -66571 -21955 84420 93801 -81122 -56776 -125375 -140498 -95653 7093 132 -132185
7281 -132185 -142616 -157250 -93362 -55861 -10531 -83604 -157465 -132737 -173823 -247036 -229899 -222402
7269 -222402 -212188 -124886 -24855 -22625 -116047 -129799 -175312 -101334 -7345 -81821 -181724 -94246
7257 -94246 25770 43548 92263 59720 50652 63024 74263 20259 4853 -29708 -79658 71981
7245 71981 161410 -20413 -25723 -28262 -21258 43827 155571 104440 99635 73338 -19500 42737
7233 42737 112148 58277 -71725 -106735 -132264 -21561 132588 82999 -11017 46909 48403
7222 48403 -27610 -37 56077 4051 27924 9281 -35501 -25415 -31211 -49438 -69155 21328
7210 21328 29280 -34413 -81935 -147399 -97077 -56762 -121247 -88513 -16549 -96508 -151832 -63287
7198f3287J30851L895k4062j13621p4956J3890O1222J50047P2936o3837q1493
7187A1585l9403o0960j4724N0621o737K9553M2771n9579K1187M8028M7645P4648
7175A44635p9046p3954j51161j21570M726P9601J85659Q8972r9361l5311R0072
7164C3262J16825R263j26967p6201o1532N307M744j8105j0301J56410l5467n8821
7152f1583L4378J859k488l5542M3263m3018N0840o4391M631J8439k1896q8150
7140a63658l3419j1747k3914L7791o1930K6764l4648K9908J3529K12297Q4504
7129G5477o1081M3517O7284m2374K1587P8311l1967m0403O9879o3974p3214J19108
7117A62150j27074j90478K2977r262N7922j30700R076N0273J13962J63278p495
$$ plain form
7198 -63287 67564 71459 47397 -66224 -141180 -127290 -66068 83979 156915 93078 11585
7187 11585 -27818 -88778 -103502 -52881 -59618 -30065 12706 -46873 -25686 22342 69987 144635
7175 144635 65589 -8365 -159526 -281096 -276370 -196769 -11110 77862 -21499 -56810 33262
7164 33262 150087 159350 32383 -43818 -105350 -100043 -95299 -113404 -123705 32705 -2762 -61583
7152 -61583 -27205 -25346 -27834 -63376 -20113 -63131 -12291 -76682 -72051 -53612 -75508 -163658
7140 -163658 -197077 -208824 -232738 -194947 -256877 -230113 -264761 -234853 -221324 -9027 75477
7129 75477 14396 57913 125197 82823 104410 182721 150754 110351 180230 116256 43042 162150
7117 162150 35076 -155402 -132425 -141687 -83765 -214465 -205389 -155116 -41154 122124 114629
7106A14629j39197j4051n3414j2617j3753J8045K6694J9114M3378J3506L9805
7095D2139M9525O1576k1570N3613o2505O3903k3706l2125K8909l2652n3926l1403
7083D1778j6694M7382n073o3837J2971q1550N9204R0860M0473n4785l8453r6781
7071f4505o9771q6109l1075Q5509l4813J26498J71472k849p0678j0572o5791p0951
7059a23635l4332J36505O7013m2019j6004L3745j07501J34854L4635p8373j6801
7048a1913O4971p9495j23274l0921O0956l5381n5574M9480l8058N5933K9950J01579
7036a1747J07273l8049j9075p1047m9360J7658R0140l5017M139k9400J01317r690
7024E7142O821n7371k7349M8371Q0320O8420j60068o8463l0721l1966P4611J62363
$$ plain form
7106 114629 -24568 -38619 -92033 -104650 -118403 -100358 -73664 -54550 -11172 2334 42139
7095 42139 91664 153240 131670 185283 122778 186681 162975 130850 159759 127107 73181 41778
7083 41778 25084 72466 67393 3556 16527 -65023 -5819 85041 125514 70729 32276 -64505
7071 -64505 -134276 -220385 -251460 -165951 -200764 -74266 97206 94357 23679 13107 -52684 -123635
7059 -123635 -157967 -21462 45551 3532 -12472 21273 -86228 48626 83261 4888 -11913
7048 -11913 53058 -26437 -149711 -180632 -119676 -155057 -210631 -161151 -199209 -143276 -113326 -11747
7036 -11747 95526 57477 38402 -32645 -82005 -64347 25793 -9224 -5085 -34485 66832 57142
7024 57142 63963 6592 -20757 27614 107934 176354 16286 -52177 -82898 -114864 -40253 122110
7012A22110J01663M474J46542p4622j03061r151j74624m1485L5031J20476j0142
7001A17211j23116K7588j05109k8962R1391J42556P1188m3077l7754l8075J26774
6990B00615k7762j67490J8929Q5772r4215j02166k5323O1676L3949L3548l6197
6979a8664j34640q2035k0509q4079J58966Q2629j12514l5910P3688M16p6489K1893
6967b27248J61017M0178K9623j03341q7305L133O431P3813j2264L8471m3616q8648
6955b09756k0014k3041p5423J05109K8998K193j9976R3678J19676P6564j5947
6944F2061j44511m9251l2583J1707M1730L8920j05412K4819J2471o8k3323K8119
6932a35321l0725L4640k2312l3458N2496k9883J5419k6388l7821l0169K0743J02671
$$ plain form
7012 122110 223773 228247 374789 300167 197106 187955 13331 -28154 6877 127353 117211
7001 117211 -5905 21683 -83426 -112388 -20997 121559 192747 149670 111916 73841 200615
6990 200615 172853 5363 24292 110064 15849 -86317 -111640 -49964 -16015 17533 -18664
6979 -18664 -153304 -235339 -255848 -339927 -180961 -98332 -210846 -246756 -173068 -172652 -249141 -227248
6967 -227248 -66231 -26053 3570 -99771 -187076 -183943 -177512 -103699 -115963 -77492 -121108 -209756
6955 -209756 -229770 -252811 -328234 -223125 -194127 -191934 -211910 -118232 1444 78008 62061
6944 62061 -82450 -131701 -164284 -152577 -110847 -71927 -177339 -152520 -140049 -140117 -163440 -135321
6932 -135321 -166046 -131406 -153718 -187176 -134680 -164563 -149144 -175532 -213353 -243522 -222779 -120108
6920a20108M965n8077l0694J16617J01538n0919j5184Q9968N2127n2200k5546
6909A2487k7562k1539l5009J06455J24213j11824j20497j8858K9713l762L2636
6898c3547l822r948K316l9458j22934P8342Q0686k4274n1688P2937J86p6734o599
6885a34537k9878J64828J31893r7514m7993J04205q2810q5874l3315J2845n1254
6874a49404J1843Q1309O5027k6621n1457Q5540l3708k4922m1988N2177P6418r386
6862C4828j99167Q1405k0773R56L7031j11876J1634Q2328L8742l0359O3228l1204
6850d3227l3418p9385R0212k0755r701j04792r7569O508m7495J5097O2661n160
6838b67024L8814J07597N3349k2291j15640L7372N7579k2942K3916p2889P3402
$$ plain form
6920 -120108 -115143 -173220 -203914 -87297 14241 -36678 -51862 38106 90233 38033 12487
6909 12487 -15075 -36614 -71623 34832 159045 47221 -73276 -92134 -62421 -66183 -33547
6898 -33547 -37369 -47317 -45001 -84459 -207393 -129051 -48365 -72639 -124327 -51390 -51204 -127938 -134537
6885 -134537 -164415 413 132306 34792 -13201 91004 8194 -77680 -110995 -98150 -149404
6874 -149404 -137561 -56252 8775 -17846 -69303 16237 -17471 -42393 -84381 -32204 44214 34828
6862 34828 -164339 -82934 -103707 -102751 -65720 -177596 -165962 -83634 -44892 -75251 -12023 -43227
6850 -43227 -76645 -156030 -65818 -86573 -96274 -201066 -298635 -292127 -339622 -324525 -261864 -267024
6838 -267024 -228210 -120613 -67264 -89555 -205195 -167823 -110244 -133186 -109270 -182159 -108757
6827a08757J49642j10913J5790j4970L8219R2746J32784k2320j7094j32242p7632
6816e4747L1673N2544J3561N5969l6338q6595q7128j6104L3532J534m0524L4791
6804i7832K9769M418K7154Q595o3515l3244J1584J59998J0044o7098L206q4562
6792i1483R900l7949n377J0307P8932M5314O2602l7034j3222n3269j14575p3894
6780b19748j2055L5331Q8719O285K5625K5551M9136Q028L3790o1996j59070L0605
6768a49799J99565O1687r7973p5499j7161j2562K5827R4437J00205l1593n8830
6757C8304j0941j08464J52539j05153p6516J27760L0037j8450r1928L315M1977
6746a7520J42283M5139O0511N8245j05184q1595P136r6226m7703O8975j8150l1916
$$ plain form
6827 -108757 40885 -70028 -54238 -69208 -30989 61757 194541 172221 155127 22885 -54747
6816 -54747 -23074 29470 43031 99000 62662 -23933 -111061 -127165 -93633 -92099 -132623 -97832
6804 -97832 -68063 -63645 -36491 -27896 -91411 -124655 -113071 46927 56971 -10127 -6921 -91483
6792 -91483 -81583 -119532 -124909 -114602 -35670 9644 72246 35212 21990 -31279 -145854 -219748
6780 -219748 -231803 -196472 -107753 -101468 -75843 -50292 -1156 6872 40662 -21334 -180404 -149799
6768 -149799 49766 111453 13480 -62019 -79180 -91742 -65915 28522 128727 97134 38304
6757 38304 27363 -81101 71438 -33715 -110231 17529 47566 29116 -62812 -59497 -17520
6746 -17520 124763 169902 230413 288658 183474 101879 109015 12789 -34914 34061 15911 -16005
6734a6005l8723J95J03155N2703r639J5558j1133J33567J45913K20556J66539
6723G62686L22636L80045K89967M36575N23743K35428j15986n48446p49718n11409
6713A025521j76228j34866j74218j84109j36910j58425k8167L1539Q5322L7963
6703A87422m8127N2928M8510j1607p2583J3511J4018j31873M4069J14845L0368
6692B41481r2692n5493l6513K27N1210R8304j07258j07191M9804N4842q1736m8082
6680c3097J13447P1573j09355J4662O6900m0695r4330J8366J23943j4905j4312
6669A02197j04789l9613p1416q0474P7934Q5992N4425k8813n2464o264k6657N127
6657h4815m6399m3994Q0578l6587m3938k6819Q6016N0847j133J9150k6858O3454
$$ plain form
6734 -16005 -54728 -54533 48622 101325 91686 107244 96111 229678 375591 596147 762686
6723 762686 1085322 1465367 1755334 2191909 2715652 2951080 2835094 2286648 1536930 1025521
6713 1025521 849293 714427 540209 356100 219190 60765 32598 64137 149459 187422
6703 187422 139295 192223 240733 229126 156543 170054 184072 52199 96268 211113 241481
6692 241481 148789 93296 56783 57010 108220 206524 99266 -7925 41879 96721 14985 -33097
6680 -33097 80350 151923 42568 57230 124130 83435 -10895 7471 131414 116509 102197
6669 102197 -2592 -42205 -113621 -194095 -116161 -30169 24256 -4557 -57021 -63285 -89942 -84815
6657 -84815 -131214 -175208 -94630 -131217 -175155 -201974 -115958 -65111 -66244 -47094 -73952 -10498
6645a0498n558K906L1692k9107j1543m3062J7117J4500o1764j63278K3814J1608
6633b23173O4039M2665p9316j01024N7759N9340j5094j08858o5251J29246J28531
6622a11136N3609L5714q4021j63913J5287J7232L6268K7295o6263m0594J12816
6611a67706l954L0362J3769M6438Q0961n1180j4081N706L3708P7230l8855M4972
6599E7370k8257k785r2048L492Q9102l2298l7668r9516L9632K27864r536l8869
6587G6483n3641J2842p368r0733m5217J59732J1121j09125K426l5736k998q960
6575i1174l1995O0907k5851q2361m343m7077K9713J96045k6402n8096L3698J10551
6563F3615l102M4398j7289P1071M8461J45358k2241j84118j88695o6315O6367
$$ plain form
6645 -10498 -16056 -13150 18542 -10565 -22108 -65170 -48053 -33553 -95317 -258595 -234781 -223173
6633 -223173 -159134 -116469 -195785 -296809 -239050 -179710 -194804 -303662 -368913 -239667 -111136
6622 -111136 -57527 -21813 -105834 -269747 -254460 -237228 -200960 -173665 -239928 -280522 -167706
6611 -167706 -171660 -141298 -127529 -81091 -130 -51310 -65391 -59685 -25977 51253 12398 57370
6599 57370 29113 26328 -65720 -62228 26874 -5424 -43092 -142608 -102976 124888 115352 76483
6587 76483 22842 35684 28316 -62417 -107634 52098 63219 -45906 -43480 -79216 -82214 -91174
6575 -91174 -123169 -62262 -88113 -170474 -174817 -221894 -192181 3864 -22538 -80634 -46936 63615
6563 63615 60513 104911 87622 158693 207154 352512 330271 146153 -42542 -108857 -42490
6552d2490j3773j69268R0544J58416k4330j37795K2846l1885k7865J0421J2758
6541a52421m9249m0990P4121k7167k7657l8853J14969K5554l3159M8495Q1564
6530b4793M1902O9489r5407p4303k7977k2795n1558R7164K3714L5952m4752N5386
6518a7978L8202k140L4139M7251p1073j16245O2567O590j1301M3895k4442n4304
6506f4839o3214j9597J7405L4363J09807m9472o1010k5107l131J96254L8367n6241
6494E3585l8329K2942O9582l7149p3747k7008P2411J9041j01386j6763J35562
6483G8741J40348n9108k9259j0634j36679L0163N0702J3844p0024p3954m1702
6472a07562M6785L3115k244m5202j2887l4684O0902r930l7372J39350O9311M389
$$ plain form
6552 -42490 -56263 -225531 -134987 23429 -901 -138696 -115850 -147735 -175600 -165179 -152421
6541 -152421 -201670 -242660 -168539 -195706 -223363 -262216 -147247 -121693 -154852 -106357 -24793
6530 -24793 17109 86598 -8809 -83112 -111089 -133884 -185442 -88278 -64564 -28612 -73364 -17978
6518 -17978 20224 18084 52223 99474 28401 -87844 -25277 -18687 -29988 13907 -10535 -64839
6506 -64839 -128053 -147650 -130245 -95882 13925 -35547 -96557 -121664 -124795 71459 109826 53585
6494 53585 15256 38198 107780 70631 -3116 -30124 42287 61328 -40058 -56821 78741
6483 78741 219089 159981 130722 120088 -16591 13572 64274 78118 8094 -65860 -107562
6472 -107562 -60777 -27662 -29906 -75108 -87995 -122679 -61777 -71707 -109079 30271 99582 103971
6460A03971l6716N9788k3596j5301J6875J4461m5625L7512L0382j19247l1960
6449i456L3224m4587Q9466O6031m5301p1011m0170k4259L773N135r8884L2139
6437a03900J5920K5543N0244m0478l1063L327J8645p2330j7820r8737j8590J21510
6425a47729J7116m338Q8558J10027m4839r0871m3159Q3106L8544K0811N2876k8895
6413E1207l2587k1107m5189m159M3280k6775M4621N6229M1121j45875j02873p2704
6401b14811O0437R0434Q571o0570Q0186J71311n0964j57525N2028k8540K7594
6390b1849P7130l4296q7671O4936L0790j2261q3998l0042J5136J03969l3785j26657
6378a38598M009P2566j838Q808R9027M2950n9825K5661L2425o1424K4371l9765
$$ plain form
6460 103971 67255 127043 103447 88146 105021 119482 73857 111369 141751 22504 -9456
6449 -9456 23768 -20819 68647 134678 89377 18366 -21804 -46063 -42290 -37155 -136039 -103900
6437 -103900 -87980 -62437 -12193 -52671 -83734 -80407 -61762 -134092 -151912 -250649 -269239 -147729
6425 -147729 -130613 -134951 -46393 63634 18795 -72076 -115235 -32129 6415 27226 80102 51207
6413 51207 18620 -2487 -47676 -51835 -8555 -35330 9291 65520 106641 -39234 -142107 -214811
6401 -214811 -154374 -63940 -55369 -115939 -35753 135558 84594 -72931 -20903 -49443 -21849
6390 -21849 55281 20985 -66686 -1750 29040 16779 -67219 -97261 -82125 21844 -11941 -138598
6378 -138598 -134589 -62023 -63861 -55053 43974 86924 27099 52760 85185 23761 48132 8367
6366H367m5605k7976l2615j3156j6627q9319N642P2848N7640j9514J8925N4355
6354b7035j267j5657Q844p1071K5050N3305n1008L6857j10373P615J37955N6057
6342D9272l4340q6661k1550Q8081k6028q542q1839l3667N0174N4509J32861N470
6330H7740n6532q3604K3594p7590J544J0436n043l7135L5243j1634P3425j16256
6318a55812M3710M0135j07877m0960N2579P1117K2440j28760J26584J79554r5509
6307G201r7443P172K8762J7148L704M3804k1465n9759J02687L9887p1260k6394
6295b5956j855k7608P010J00717O9604q5222o6123o6863n441J6712j5865k8273
6283a29163R2955K21726q8186j18884n332j980M5100n3251K8025M7253j26197
$$ plain form
6366 8367 -37238 -65214 -97829 -110985 -127612 -216931 -211289 -138441 -80801 -100315 -81390 -27035
6354 -27035 -28302 -43959 -35115 -106186 -81136 -27831 -78839 -41982 -152355 -144740 -6785 49272
6342 49272 14932 -71729 -93279 -5198 -31226 -39768 -121607 -155274 -105100 -50591 82270 87740
6330 87740 31208 -52396 -28802 -106392 -104848 -94412 -99455 -136590 -101347 -112981 -39556 -155812
6318 -155812 -112102 -71967 -179844 -220804 -168225 -97108 -74668 -203428 -76844 102710 7201
6307 7201 -90242 -83070 -54308 -37160 -33456 10348 -11117 -70876 31811 71698 438 -25956
6295 -25956 -27811 -55419 -48409 52308 121912 36690 -29433 -96296 -101737 -85025 -100890 -129163
6283 -129163 -36208 185518 97332 -21552 -26884 -28864 16236 -37015 -8990 38263 -87934
6272h7934N0805N9630p1736K0703R0931j2361L6387j598l8704n3732k2336q3608
6260a13553j1400P4275N4651L0918k3200j45270j60691k6479J25348K38431J72240
6249B15270j06769j37620l5544m064M1349J31931L8444j4827n9649o9142k5355
6238b5976j3561l7931l8367P4243L0958J5041l1908l9086j5720J712J41975J08985
6226A70365n1867n1531J16327L1028j12365j85986k097J26439J7043p5178j194
6215a9016j3756r0422l3549J2351J8591J5924p4059p5349j1752J97749J20518
6204D7230n3898j06243k0817l3482o169K7864J7509J07064K5333q5096o8653p0700
6192b20058P0258J27816O0543m0199L9130P4505j5075j18121j02747Q188J34904
$$ plain form
6272 -87934 -37129 22501 -49235 -28532 62399 50038 86425 84827 46123 -7609 -29945 -113553
6260 -113553 -124953 -50678 3973 34891 11691 -133579 -294270 -320749 -195401 43030 215270
6249 215270 108501 -29119 -64663 -68727 -27378 104553 142997 128170 68521 -621 -25976
6238 -25976 -39537 -77468 -115835 -41592 -10634 4407 -27501 -66587 -82307 -80595 61380 170365
6226 170365 118498 66967 183294 214322 101957 -84029 -86126 40313 57356 -17822 -19016
6215 -19016 -32772 -123194 -156743 -144392 -125801 -109877 -183936 -259285 -271037 -73288 47230
6204 47230 -6668 -112911 -133728 -167210 -173379 -145515 -128006 -20942 4391 -80705 -149358 -220058
6192 -220058 -149800 -21984 38559 -1640 37490 111995 96920 -21201 -123948 -115760 19144
6181A9144J14813l6072j53332L4814O4613J19061k9323r6908N0560J2822k3778
6170G6414q6049j00736l6974J88650J04433j59851j81413j43434Q2960J29620
6160a26380J95982P5214m3904j66837p3104O0727N8622m0607K7160k010j24236
6149a59373m0772J19014J00759m9275k7529l5138P2032R6401M813o1228k3649
6138c945p6809O3621J4087j6414m2519J4179l3888p011K3771J3446R3919P9660
6126A22097O980L0044r4467m2723l2083n7243Q260J42725N1701n4731q0274j6894
6114a6608k5262O8191l7769j51080q0128O9931L3913q5418L940Q9649K64119K23742
6102C57220j42088q2586p5803o4023Q6143Q0767k15296j13304J16068p2084o054
$$ plain form
6181 19144 133957 97885 -55447 -20633 43980 163041 133718 36810 87370 100192 76414
6170 76414 -9635 -110371 -147345 41305 145738 -14113 -195526 -338960 -256000 -126380
6160 -126380 69602 144816 100912 -65925 -139029 -78302 -19680 -60287 -33127 -35137 -159373
6149 -159373 -200145 -81131 19628 -29647 -57176 -92314 -20282 76119 80932 19704 -3945
6138 -3945 -80754 -17133 -3046 -19460 -61979 -47800 -81688 -88699 -64928 -51482 42437 122097
6126 122097 129077 159121 64654 21931 -10152 -67395 -59135 83590 135291 80560 286 -16608
6114 -16608 -41870 26321 -11448 -162528 -242656 -172725 -138812 -224230 -220290 -130641 133478 357220
6102 357220 215132 132546 56743 -7280 78863 159630 -55666 -168970 -52902 -124986 -131040
6091a31040J16144o7759P332q2451r1793L6734N8581J64677r5874j29884K4764
6080a90569J89744N2936K3358P722J094K7363J22923n6259k1331n1101q1025L1142
6068E5997n3623j31933j2184Q0608O2483r0326J0465M3978J09690N4759Q520p8620
6056E9814j35830k3055N4516M9599j58214k6393M0538M5494n3863r147M3506J8158
6044i4877P709j8120R3229j7709o9572J00804R0127o7684o8233j00352l7099P624
6032a74153J03407N1208O9829M447l8412j52880n0287k7111L7237P9255N799N5861
6020c5800m4850l2552J24894P3183M870l7577L0O8802j00010j09771N3116L0655
6008e010K4859j11703o230O9801n0630j58913m985R7640J08603n3103j4016j9872
$$ plain form
6091 -131040 -14896 -82655 -75323 -157774 -249567 -212833 -154252 10425 -85449 -215333 -190569
6080 -190569 -825 52111 75469 83191 84285 111648 234571 178312 156981 105880 24855 55997
6068 55997 2374 -129559 -141743 -61135 1348 -88978 -78513 -34535 75155 129914 138434 59814
6056 59814 -76016 -99071 -44555 5044 -153170 -179563 -139025 -93531 -147394 -156541 -113035 -94877
6044 -94877 -87168 -105288 -12059 -29768 -99340 1464 91591 23907 -44326 -144678 -181777 -174153
6032 -174153 -70746 -19538 50291 54738 16326 -136554 -186841 -213952 -176715 -97460 -91661 -35800
6020 -35800 -80650 -113202 11692 84875 89745 52168 52198 121000 20990 -88781 -35665 -5010
6008 -5010 19849 -91854 -98084 -28283 -78913 -237826 -242811 -145171 -36568 -89671 -103687 -123559
5996a23559N4927J32546L7633P6841J5169j124j15594k4071l8084R1474J7778
5985A23936j27238j06258J34694j9981m6311l1124N8478K1811M8729q4569j27072
5974a54905R500m089N3848L3052m9481l0821K3315j9525m8569r2447J1560L2829
5962b35733R6486P8397J2517O7929K0865L0181Q0922j18778L898M0382K4893n8141
5950D3818L4412M4985j09198K733K4116m3471J8277j08060q5370M9452j1699P5519
5938f4486k5429m6418J3360m9930R926M927J58355L1148j19501n260L2174K9836
5926c1298l20K8178j09950j18941R7450J86579n646l9745j9103k8344j57394K7676
5914a70858J7399L7325P507K5959l3319m926K2078P4845Q6660j53261O9549J02051
$$ plain form
5996 -123559 -68632 63914 101547 178388 193557 192433 76839 52768 14684 106158 123936
5985 123936 -3302 -109560 25134 5153 -41158 -72282 -13804 8007 56736 -27833 -154905
5974 -154905 -145405 -149494 -95646 -62594 -112075 -142896 -119581 -139106 -187675 -280122 -268562 -235733
5962 -235733 -139247 -60850 -48333 19596 40461 70642 151564 32786 36684 77066 101959 43818
5950 43818 78230 123215 14017 16750 40866 -2605 15672 -92388 -177758 -128306 -140005 -64486
5938 -64486 -89915 -136333 -122973 -172903 -162977 -158050 305 31453 -88048 -93308 -61134 -31298
5926 -31298 -31618 -3440 -113390 -232331 -134881 51698 46052 6307 -12796 -41140 -198534 -170858
5914 -170858 -153459 -116134 -108627 -82668 -115987 -120913 -98835 -23990 62670 -90591 -21042 81009
5902H1009m4317n2179J16085r0829l3859K5951o1044J5633o4415q4764J0138N8013
5890a24578K4880Q5301p3331R6943L4507m1144l6513n684L6650k6812l6303J2286
5878e3798R2779o1176O662L0918m9744N9089J12360m1566p9393q5318j7129O1482
5866b4834O6141q5144n6753j8244n4592q9156J23402J16195N5293J4991L7029
5855H4328K6892r9625k1303p2225j0312J00283l5781j3446k3169M8883k2625l6254
5843g4354q3747J572R5050P3373M2447O2923R871o5036L395o0760k8915p4968
5831i9149n3842L354k9660L643j2837Q3130K457J4394o7004L6711J29461N5043
5819F5701r2554k9073j37381K4981L3918o7506L7643J07416K4134K7967J32783
$$ plain form
5902 81009 36692 -15487 100598 9769 -24090 1861 -59183 -43550 -107965 -192729 -182591 -124578
5890 -124578 -99698 -14397 -87728 9215 43722 2578 -33935 -39619 -2969 -29781 -66084 -53798
5878 -53798 38981 -22195 -15533 15385 -34359 24730 137090 95524 16131 -69187 -86316 -24834
5866 -24834 41307 -43837 -100590 -118834 -173426 -262582 -139180 -22985 32308 47299 84328
5855 84328 111220 11595 -9708 -81933 -92245 8038 -27743 -41189 -64358 -15475 -38100 -74354
5843 -74354 -158101 -156529 -61479 11894 54341 117264 127135 62099 65494 4734 -24181 -99149
5831 -99149 -152991 -149637 -179297 -175654 -188491 -105361 -102904 -88510 -155514 -118803 10658 65701
5819 65701 -26853 -55926 -193307 -168326 -134408 -201914 -164271 -56855 -32721 -4754 128029
5808A28029J9654l9316o7424j60357m4055J0918j9612M3065K5995j8724O4021
5797e7806r854M2034Q1502J43835P69q1093j23318L6563N1328o18j17851J5702
5785a8807r310o4786J9339j0344m2649k4224O1858L5618J4941M5970J3331p9233
5773e8296j03852p284Q7913R7748O6076k4277P5697O5099r4183j17513M6931J1512
5761D5571p1613j02486j09142n8724J30621K53219Q5697k1432n5873p2136l5627
5750a1925j7770M3872k3336R5004N2739l7678j9021J8657J297o9559M8186n6198
5738B4268p8449R06L8110n5219l1697Q936k9466J5264l4087K8997K8263m347N7682
5725c0839o5307m2438q0289L5174l4522l2289Q5427K5677Q5484R1380N1021Q6859
$$ plain form
5808 128029 147683 108367 40943 -119414 -163469 -152551 -172163 -129098 -103103 -121827 -57806
5797 -57806 -67660 -25626 55876 199711 200480 119387 -3931 32632 83960 83342 -34509 -18807
5785 -18807 -28117 -92903 -73564 -83908 -126557 -150781 -88923 -53305 -38364 7606 20937 -58296
5773 -58296 -162148 -169432 -81519 16229 82305 58028 133725 198824 104641 -12872 34059 45571
5761 45571 -26042 -128528 -237670 -296394 -165773 87446 173143 151711 95838 23702 -11925
5750 -11925 -29695 14177 -9159 85845 138584 100906 81885 100542 101839 32280 80466 24268
5738 24268 -54181 -53275 -15165 -70384 -102081 -93145 -122611 -107347 -141434 -112437 -84174 -88521 -30839
5725 -30839 -96146 -138584 -218873 -183699 -218221 -250510 -165083 -139406 -53922 37458 88479 175338
5713A75338J0364n4424j59995M7883J35465p1841l9793J4999k2012L6550O3963
5702A36497j34657r5544R8933o3184M4493m5810q9430P3801K02653j0734j24623
5691g605q2537k865J62372k5423n2466J1381o3718k4470k1770J30170J41452L0860
5679A95381Q300q9315j24262M3502J2271p9601n1705O4305p686k506J4765m7443
5667f3994r3842r254K0j7530K2734K7142l5457O6450M5180q6187n1304Q6232R9814
5654i996N5192R757K09L6057k4371k8458k157J5713J249R3959P8350j19628N643
5641A11519n601m7352m3028q0241R032K8662M2155j4543p178K2063K5696m7309
5629f125N7237L3361m7843J2989k1459l6217L8995k3021r4357m0656n5387R9016
$$ plain form
5713 175338 185702 131278 -28717 19166 154631 82790 42997 57996 35984 72534 136497
5702 136497 1840 -93704 5229 -57955 -13462 -59272 -148702 -74901 127752 117018 -7605
5691 -7605 -90142 -93007 69365 43942 -8524 2857 -60861 -85331 -107101 23069 164521 195381
5679 195381 203681 114366 -9896 33606 45877 -33724 -85429 -21124 -28810 -31316 -16551 -63994
5667 -63994 -157836 -167090 -167070 -184600 -161866 -134724 -170181 -103731 -58551 -144738 -196042 -109810 -9996
5654 -9996 45196 54953 55162 91219 66848 38390 36233 51946 53195 147154 225504 105876 111519
5641 111519 105918 58566 15538 -64703 -55671 -27009 15146 603 -6575 15488 41184 -6125
5629 -6125 51112 84473 36630 49619 28160 -8057 30938 7917 -86440 -127096 -182483 -83467
5617h3467O311o4763j11o1768L7773J19148m5163K878M1603P2514l1371K4057
5605A7641p5135j4812P2073m0367j6178L6032N9572k9008J3576R5197O8489o6543
5593A20537j58651o3745J1739k0634j4003Q896j6516P4398R0145P81j7858o1513
5581d6424k610r3375n3143P6090R108K7802J80621k5309o6077q0860N6671j2383
5569b9889K7693l9135r0875M0872N8451k5807k8615N7703l8706M1257K5311o0032
5557f1772K2589o620M5150p2929R860Q0067R3464M2706M9569l516K3857m1676
5545A80749p1609l3280n8007m1744J7556j4824J7928K094M5914K6234n3526o2079
5533d4594n8262k4700Q0210k5021l1814J76842N8k7439j4701m8981n864N7787
$$ plain form
5617 -83467 -77156 -141919 -142030 -203798 -166025 -46877 -92040 -89162 -47559 24955 -6416 17641
5605 17641 -57494 -72306 -233 -40600 -56778 -20746 38826 9818 23394 118591 187080 120537
5593 120537 -38114 -101859 -90120 -110754 -124757 -115861 -132377 -57979 32166 32947 15089 -46424
5581 -46424 -49034 -142409 -195552 -119462 -110354 -82552 98069 72760 6683 -74177 -17506 -29889
5569 -29889 -2196 -41331 -132206 -91334 -32883 -58690 -87305 -29602 -68308 -27051 -1740 -61772
5557 -61772 -39183 -45803 -653 -73582 -63722 16345 109809 152515 202084 198568 222425 180749
5545 180749 109140 75860 17853 -23891 -6335 -21159 -3231 -1137 44777 71011 17485 -44594
5533 -44594 -102856 -127556 -47346 -72367 -104181 72661 72719 45280 30579 -18402 -24266 33521
$$ [...]
##END NTUPLES=NMR SPECTRUM
##END=
