##TITLE= c5584yag
##JCAMP-DX= 6.00 $$ JEOL NMR v1.10
##DATA TYPE= NMR SPECTRUM
##DATA CLASS= NTUPLES
##NUM DIM= 1
##ORIGIN= DELTA2_NMR
##OWNER= JEOL
##LONG DATE= 2010/01/27 17:05:10
##SPECTROMETER/DATA SYSTEM= DELTA2_NMR
##.OBSERVE FREQUENCY= 3.99782200121121E+02
##.OBSERVE NUCLEUS= ^1H
##.DELAY= (1.6668E+02,1.6668E+02)
##.ACQUISITION MODE= SIMULTANEOUS
##.ACQUISITION SCHEME= PHASE SENSITIVE
##.PULSE SEQUENCE= single_pulse.ex2
##.SOLVENT NAME= CHLOROFORM-D
##.FIELD= 9.389766
##.FILTER WIDTH= 1.3665350909952
##.ACQUISITION TIME= 2.73186816
##.SPINNING RATE= 10
##.OBSERVE 90= 11
$$ ------------------------
$$ JEOL SPECIFIC PARAMETERS
##$FILENAME= C:\DOCUME~1\YANANG~1\LOCALS~1\Temp/tmpconv_c5584yag_PROTON257637624
43d-1.jdf
##$TITLE= c5584yag
##$AUTHOR= JEOL
##$CREATION= 27-JAN-2010 17:05:10
##$REVISION= 17-FEB-2010 14:23:55
##$CONTENT= Y Gao-reactC12mimBr
##$INSTRUMENT= DELTA2_NMR
##$SITE= York Chemistry
##$NODENAME= itea
##$DIMENSIONS= 1
##$STORAGE= FLOAT
##$X_FORMAT= COMPLEX
##$X_CURR_POINTS= 16384
##$X_START= 12.49643 $$ppm
##$X_STOP= -2.50423 $$ppm
##$X_TITLE= 1H                              
##$X_ZERO_POINT= 0.3333
##$X_FREQ_FLIP= FALSE
##$X_POINTS= 16384
##$X_PRESCANS= 1
##$X_DOMAIN= 1H
##$X_OFFSET= 5 $$ppm
##$X_FREQ= 399.7822 $$MHz
##$X_SWEEP= 5.99736 $$kHz
##$X_RESOLUTION= 0.36605 $$Hz
##$SOLVENT= CHLOROFORM-D
##$TEMP_GET= 21.1 $$dC
##$ACQ_DELAY= 0.16668 $$ms
##$DIGITAL_FILTER= FALSE
##$FILTER_FACTOR= 1
##$FILTER_WIDTH= 3 $$kHz
##$TRANSITION_RATIO= 0.8
##$ORDERS= 2 15 74
##$FACTORS= 2  2
##$LOCK_STRENGTH= 1253
##$LOCK_LEVEL= 180
##$LOCK_GAIN= 24
##$LOCK_OSC_OFFSET= 7.26 $$ppm
##$LOCK_PHASE= 91.4 $$deg
##$LOCK_OSC_STATE= 2H OSC ON
##$X_ANGLE= 45 $$deg
##$X90= 11 $$us
##$X90_HI= 52 $$us
##$X90_LO= 52 $$us
##$X_90_WIDTH= 11 $$us
##$X_PULSE= 5.5 $$us
##$RELAXATION_DELAY= 4 $$s
##$SCANS= 16
##$PROBE_ID= 2756
##$ITERATIONS= 1
##$FIELD_STRENGTH= 9.38977 $$T
##$TEMP_SET= 25 $$dC
##$SPIN_SET= 10 $$Hz
##$SPIN_GET= 10 $$Hz
##$HE_LEVEL= 99 $$%
##$N2_LEVEL= 96 $$%
##$CHANGER_SAMPLE= 49
##$EXPERIMENT= single_pulse.ex2
##$OBS_PWIDTH= 1 $$us
##$IRR_PWIDTH= 52 $$us
##$TRI_PWIDTH= 1 $$us
##$QUA_PWIDTH= 1 $$us
##$IRR_DOMAIN= 1H
##$TRI_DOMAIN= 1H
##$IRR_FREQ= 399.7822 $$MHz
##$TRI_FREQ= 399.7822 $$MHz
##$RECVR_GAIN= 30
##$IRR90= 11 $$us
##$TRI90= 10 $$us
##$QUA90= 10 $$us
##$IRR90_HI= 52 $$us
##$QUA90_HI= 10 $$us
##$IRR90_LO= 52 $$us
##$TRI90_LO= 10 $$us
##$QUA90_LO= 10 $$us
##$IRR_OFFSET= 5 $$ppm
##$MOD_RETURN= 1
##$TOTAL_SCANS= 16
##$TRI_OFFSET= 5 $$ppm
##$X_ACQ_DURATION= 2.73187 $$s
##$AF_VERSION= 1
##$DELAY_OF_START= 2.0 $$s
##$ACTUAL_START_TIME= 633459796
##$CLIPPED= FALSE
##$DC_BALANCED= FALSE
##$QUI90= 10 $$us
##$SEX90= 10 $$us
##$SEP90= 10 $$us
##$OCT90= 10 $$us
##$NON90= 10 $$us
##$DEC90= 10 $$us
##$TRI90_HI= 10 $$us
##$QUI90_HI= 10 $$us
##$SEX90_HI= 10 $$us
##$SEP90_HI= 10 $$us
##$OCT90_HI= 10 $$us
##$NON90_HI= 10 $$us
##$DEC90_HI= 10 $$us
##$QUI90_LO= 10 $$us
##$SEX90_LO= 10 $$us
##$SEP90_LO= 10 $$us
##$OCT90_LO= 10 $$us
##$NON90_LO= 10 $$us
$$ [...]
##$VT_PID_LONG_40_H_HC= 0
##$VT_PID_LONG_40_H_HL= 100
##$SAMPLE_ACTION= LOADED
##$SAMPLE_STATE= LOAD
##$SAMPLE_STATUS= LOADED
##$AUTOSHIM_MODE= Z1 Z2
##$AUTOSHIM_DELAY= 3600 $$s
##$AUTOSHIM_TRACK= AUTOSHIM OFF
##$SHIM_NAMES= SHIM_Z0
##$SHIM_Z0= -25825 $$Hz
##$SHIM_Z1= -64.4 $$Hz
##$SHIM_Z2= 7.87 $$Hz
##$SHIM_Z3= -8.09 $$Hz
##$SHIM_Z4= -33.09 $$Hz
##$SHIM_Z5= 11.03 $$Hz
##$SHIM_Z6= -0.59 $$Hz
##$SHIM_X= 9.3 $$Hz
##$SHIM_XZ= 41.5 $$Hz
##$SHIM_XZ2= -4.5 $$Hz
##$SHIM_XZ3= 0 $$Hz
##$SHIM_X2= -50 $$Hz
##$SHIM_X2Z= -14.5 $$Hz
##$SHIM_X3= 0 $$Hz
##$SHIM_Y= 114.4 $$Hz
##$SHIM_YZ= -42 $$Hz
##$SHIM_YZ2= -29.5 $$Hz
##$SHIM_YZ3= 0 $$Hz
##$SHIM_Y2= 7 $$Hz
##$SHIM_Y2Z= -19 $$Hz
##$SHIM_Y3= 0 $$Hz
##$NUM_SCANS= 1
##$END_TIME= 633459911
##$LOCAL_TIME= 633459910
##$LF_TUNE_DIAL= 2729
##$LF_MATCH_DIAL= 3570
##$HF_TUNE_DIAL= 2463
##$HF_MATCH_DIAL= 5766
##$HA_RF1= HF1
##$HA_RF2= LF1
##$HA_RF3= NONE
##$HA_RF4= NONE
##$SHAPE_NAMES= SQUARE
##$FG_SHAPE_NAMES= SQUARE
##$NOISE_NAMES= CW
##$NON_OBS_OFFSET= 1000000 $$Hz
##$NOMINAL_DDS_SPREAD= 100 $$Hz
##$OBS_AMP= NONE
##$IRR_AMP= NONE
##$TRI_AMP= NONE
##$QUA_AMP= NONE
##$QUI_AMP= NONE
##$SEX_AMP= NONE
##$SEP_AMP= NONE
##$OCT_AMP= NONE
##$NON_AMP= NONE
##$DEC_AMP= NONE
##$OBS_XMTR= 0
##$IRR_XMTR= 0
##$TRI_XMTR= 0
##$QUA_XMTR= 0
##$QUI_XMTR= 0
##$SEX_XMTR= 0
##$SEP_XMTR= 0
##$OCT_XMTR= 0
##$NON_XMTR= 0
##$DEC_XMTR= 0
##$PASS_RIPPLE= 0.01 $$dB
##$STOP_RIPPLE= 60 $$dB
##$PROBE_RECOVERY= 5 $$us
##$AF_DELAY_RATIO= 0
##$RECVR_PHASE= 0 $$deg
##$X_GRADIENT_MAX= 0.1 $$T/m
##$RECVR_GAIN_LIMIT= 80
##$RECVR_GAIN_POINT= 200000 $$Hz
##$VERSION= 4.3.6 [Linux]
##$Y_GRADIENT_MAX= 0.1 $$T/m
##$Z_GRADIENT_MAX= 0.3 $$T/m
##$INST_MODEL_NUMBER= JNM-ECS400
##$INST_SERIAL_NUMBER= NM14400056
##$FAST_AUTOSHIM_STEP_MULT= 50
##$FAST_AUTOSHIM_SETTLE_WAIT= 4 $$s
##$FAST_AUTOSHIM_ITERATIONS= 1
##$FAST_AUTOSHIM_MAX_STEPS= 30
##$SHIM_DELAY= 0 $$s
##$SHIM_DELAY_BEFORE_EXP= 0 $$s
##$SHIM_DELAY_STATE= ON
##$SPIN_PID_P= 10
##$SPIN_PID_I= 5
##$SPIN_PID_D= 0
##$HF1_TUNE_ATN= 20.1 $$dB
##$LF1_TUNE_ATN= 25.7 $$dB
##$X_ACQ_TIME= 2.73187 $$s
##$X_ATN= 1.1 $$dB
##$INITIAL_WAIT= 1 $$s
##$REPETITION_TIME= 6.73187 $$s
##$DANTE_PRESAT= FALSE
##$IRR_MODE= Off
##$TRI_MODE= Off
##$DEAD_TIME= 0 $$us
##$DELAY= 0 $$us
##$X_PROBE_MAP= HF1
##$NORMALIZED= TRUE
$$ END OF JEOL SPECIFIC PARAMETERS
$$ -------------------------------
##NTUPLES= NMR SPECTRUM
##VAR NAME= FREQUENCY,    SPECTRUM/REAL, SPECTRUM/IMAG, PAGE NUMBER
##SYMBOL=   X,            R,             I,             N
##VAR TYPE= INDEPENDENT,  DEPENDENT,     DEPENDENT,     PAGE
##VAR FORM= AFFN,         ASDF,          ASDF,          AFFN
##VAR DIM=  16384, 16384, 16384, 2
##UNITS= PPM,     ARBITRARY UNITS, ARBITRARY UNITS, 
##FIRST=  1.24964260542018E+01, -5.25943156420022E-12, -2.8133189924626E-11, 1
##LAST=  -2.50422957628063, -8.47154824536087E-12, -2.75593132421944E-11, 2
##FACTOR=  9.15623245466794E-04, 3.29293455638811E-09, 3.29293455638811E-09, 1
##PAGE= N=1
##DATA TABLE=(X++(R..R)), XYDATA
$$ [...]
9182 -1029621 -1027030 -1031531 -965582 -1033344 -1022208 -988935 -985735 -1012142 -990545 -1016673 -1113539 -1030710 -1043810
9169 -1043810 -1019445 -1008442 -1037420 -1116358 -959015 -1045520 -1065988 -983850 -1025013 -1155240 -1025163 -996624
9157 -996624 -1041184 -1024202 -1083713 -967856 -1006071 -970680 -1035989 -1062987 -1030092 -997274 -1064730 -967652 -1012305
9144 -1012305 -997123 -1051749 -1089838 -1068574 -1056369 -961680 -948032 -1052076 -979480 -1028998 -1048695 -1061221 -974807
9131 -974807 -1119369 -1131947 -1063493 -977932 -1057891 -985597 -1022917 -984987 -1039224 -1027199 -1030604 -1007976 -1053979
9118 -1053979 -1090030 -966261 -970473 -1066516 -1072613 -990965 -1079994 -982477 -1045625 -992943 -1098716 -1023710 -1138592
9105 -1138592 -1042041 -1063523 -1064564 -1044587 -1030156 -1023832 -1069774 -1081123 -1093578 -1039204 -997239 -968663 -1028119
9092 -1028119 -1041853 -1050899 -1031032 -1024783 -1049605 -1014816 -937678 -1008635 -1026590 -888135 -1066356 -935209 -1016787
9079 -1016787 -1047406 -1025990 -1048965 -935366 -1095674 -1052423 -1158333 -1087646 -991704 -1080967 -1074970 -1033314
9067 -1033314 -1115236 -984815 -927036 -1044818 -1038470 -1046722 -1047541 -1147792 -1092635 -1014572 -986823 -900783 -1021807
9054 -1021807 -1111386 -1123390 -1034311 -1152273 -1116681 -1039098 -1027888 -1048217 -1030817 -1037046 -1110766 -1121532 -1106933
9041 -1106933 -1102907 -1001788 -1083208 -1041848 -961552 -1079637 -997304 -951848 -1052756 -1027022 -939195 -1019893
9029 -1019893 -1120415 -1045595 -1137350 -965711 -1036938 -1019637 -1070419 -1044342 -1025939 -1125817 -1114380 -1072846
9017 -1072846 -1084155 -965625 -988880 -1042324 -1122504 -1172061 -1078369 -1035617 -1050283 -1133270 -1069702 -1102972 -1085923
9004 -1085923 -1077124 -1017550 -1054861 -1090507 -1104238 -1083410 -1065057 -1061715 -1017502 -1083103 -1088935 -1041937 -1076010
8991 -1076010 -1014549 -1092366 -1134522 -1054631 -1110298 -1069610 -1095668 -1039659 -1081624 -1102638 -1080271 -1200740
8979 -1200740 -1070926 -1044447 -1071410 -1046998 -1026785 -1048653 -1075594 -1067960 -1076842 -1064267 -1024650 -992884 -1095894
8966 -1095894 -1046734 -1066636 -1021609 -1060414 -1061309 -1052109 -1033189 -1122748 -1060935 -1111853 -980789 -953474 -1040057
8953 -1040057 -1024772 -1146153 -1060202 -1070698 -1005690 -985250 -1092037 -1062645 -1163744 -1045035 -992204 -973349
8941 -973349 -947593 -1051168 -1042766 -1087008 -1022128 -1086130 -1067168 -950515 -1140760 -1111138 -1116505 -1123387 -1047875
8928 -1047875 -1090405 -1121949 -1179512 -1093160 -1151315 -1044777 -1078717 -1024152 -1079001 -1150282 -976477 -1014995
8916 -1014995 -1054172 -1055930 -1114290 -1066142 -1108743 -1078878 -1074653 -1054788 -1081399 -1127572 -1048718 -1043520 -1119585
8903 -1119585 -1063502 -1118757 -1087767 -1056788 -1177895 -1099004 -1068293 -1051247 -1189525 -1098060 -1200546 -1134913
8891 -1134913 -1087010 -1113002 -1111418 -1038643 -1111148 -1127029 -1045585 -991838 -1071798 -1112879 -1072339 -1022532 -1160197
8878 -1160197 -1119880 -1066086 -1096633 -1090776 -1061381 -1024987 -1130744 -1017758 -1024736 -1168912 -1042942 -1122121
8866 -1122121 -1094839 -1089843 -1047213 -1033541 -992908 -1116341 -1097956 -1010064 -1110466 -1077902 -1139008 -1059555 -1087630
8853 -1087630 -1103867 -1107901 -1157278 -1112381 -1120111 -1081056 -1049792 -1053838 -1063407 -1122507 -1139211 -1144705 -1134007 -1011318
8839 -1011318 -1088926 -1136167 -1057236 -1142368 -1038065 -1072846 -1126573 -1105511 -1136761 -1088088 -1012454 -1133013
8827 -1133013 -1209127 -1046934 -1122543 -1060627 -1128750 -1103166 -1026418 -1088708 -1153220 -1102987 -1110219 -1184922 -1017203
8814 -1017203 -1076239 -1096263 -989507 -1081153 -1194100 -1032390 -1153347 -1111344 -1105086 -1032946 -1086504 -1113262
8802 -1113262 -1111820 -1131992 -1094340 -1128990 -1126426 -1094629 -1014698 -1012054 -1140435 -1088694 -1165358 -1096947 -1004088
8789 -1004088 -1127190 -1131718 -1078301 -1091541 -1056478 -1088729 -1086903 -1017316 -1119679 -1101226 -1127138 -1146424 -1112159
8776 -1112159 -1125474 -1126410 -1049687 -1132696 -1165737 -1150993 -1070836 -1127707 -1165018 -1065440 -1094902 -1180650 -1153251
8763 -1153251 -1146167 -1079779 -1124379 -1086708 -1110976 -1133505 -1187786 -1119418 -1095914 -1142829 -1174245 -1126022 -1163280
8750 -1163280 -1031852 -1080131 -1102463 -1077877 -1021502 -1186926 -1138856 -1052289 -1050686 -1123087 -1034993 -1022938 -1102755
8737 -1102755 -1123215 -1128803 -1109360 -1089419 -1141156 -1075127 -973924 -1091300 -1128516 -993258 -1110509 -1142463
8725 -1142463 -1188834 -1206348 -1146695 -1175275 -1119671 -1111183 -1113055 -1171478 -1099278 -1133665 -1155726 -1142226 -1159069
8712 -1159069 -1158040 -1193173 -1087067 -1180961 -1227891 -1207156 -1159120 -1181752 -1088570 -1054490 -1132105 -1106818 -1145617
8699 -1145617 -1165067 -1114093 -1172262 -1103760 -1064654 -1105391 -1099619 -1077398 -1117336 -1186411 -1109715 -1136087 -1110229
8686 -1110229 -1250721 -1095419 -1121513 -1166015 -1165630 -1103478 -1112925 -1152437 -1199752 -1144904 -1114091 -1172087 -1145165
8673 -1145165 -1156616 -1143256 -1112922 -1111902 -1192464 -1119734 -1156983 -1162548 -1116032 -1175562 -1127665 -1126589 -1178197
8660 -1178197 -1197241 -1206537 -1169491 -1093901 -1112733 -1147172 -1099046 -1095316 -1194928 -1158173 -1145746 -1124171 -1101990
8647 -1101990 -1109431 -1150207 -1191027 -1174809 -1049467 -1206048 -1163805 -1100188 -1151579 -1169604 -1161420 -1123731 -1140458
8634 -1140458 -1173349 -1166229 -1122481 -1166166 -1126660 -1189990 -1128834 -1087155 -1188717 -1217518 -1215570 -1189368 -1131294
8621 -1131294 -1077348 -1278055 -1194240 -1163686 -1211275 -1209159 -1204498 -1162543 -1248318 -1205716 -1138175 -1202725 -1155543
8608 -1155543 -1080275 -1117431 -1204828 -1168772 -1184621 -1171049 -1183190 -1155911 -1149652 -1140481 -1225683 -1204066 -1052689
8595 -1052689 -1186536 -1124101 -1127592 -1115040 -1144027 -1218876 -1088128 -1115131 -1271822 -1158740 -1221750 -1129168
8583 -1129168 -1205906 -1182811 -1146173 -1227447 -1168646 -1065227 -1071557 -1139513 -1176955 -1142027 -1142448 -1182018 -1150586
8570 -1150586 -1224440 -1231019 -1110088 -1163737 -1257971 -1141859 -1195471 -1212476 -1113477 -1191315 -1245864 -1278445
8558 -1278445 -1176871 -1219216 -1063087 -1173133 -1131303 -1038102 -985485 -860401 -609955 -446482 -517957
8547 -517957 -620432 -348629 18667 178529 -151561 -557078 -559082 -372904 -371787 -746701 -992621 -1055511
8535 -1055511 -1144535 -1159471 -1238604 -1210252 -1206935 -1122323 -1260482 -1284367 -1193198 -1186440 -1204844 -1041582 -1117501
8522 -1117501 -1247334 -1297879 -1214073 -1161052 -1217029 -1129449 -1166419 -1212666 -1239823 -1195726 -1218581 -1173984 -1257188
8509 -1257188 -1169015 -1229052 -1233403 -1205357 -1197482 -1158213 -1238084 -1213164 -1280126 -1269267 -1298310 -1261167 -1225593
8496 -1225593 -1220171 -1223560 -1210821 -1347762 -1265053 -1308334 -1302474 -1328519 -1225721 -1241822 -1237127 -1260831 -1292102
8483 -1292102 -1226512 -1267149 -1352087 -1276927 -1229068 -1248222 -1153036 -1179739 -1296217 -1258540 -1288726 -1311464 -1259597
8470 -1259597 -1305420 -1278286 -1396888 -1332019 -1270545 -1335443 -1252177 -1313827 -1239402 -1255959 -1330461 -1293047 -1375388
8457 -1375388 -1365325 -1277785 -1288875 -1316398 -1293235 -1293252 -1275291 -1297358 -1299217 -1267572 -1340876 -1308198 -1258352 -1350719
8443 -1350719 -1362761 -1258928 -1316233 -1304259 -1249333 -1360494 -1324093 -1305446 -1306147 -1407989 -1342487 -1321148 -1373377
8430 -1373377 -1352295 -1336200 -1361803 -1286260 -1274043 -1345000 -1366082 -1353386 -1361958 -1363576 -1266914 -1380417 -1425702
8417 -1425702 -1295372 -1424612 -1302967 -1218228 -1372634 -1330363 -1392483 -1365395 -1337455 -1315710 -1309043 -1414821
8405 -1414821 -1423059 -1373554 -1419377 -1471373 -1480908 -1463696 -1403212 -1438818 -1400115 -1432259 -1466267 -1445055 -1315769
8392 -1315769 -1357586 -1431817 -1436508 -1536352 -1514125 -1483093 -1566033 -1434571 -1423445 -1501229 -1432784 -1408737 -1377692
8379 -1377692 -1449750 -1476529 -1438589 -1439013 -1416936 -1462717 -1514772 -1464167 -1450937 -1381084 -1493026 -1477151 -1547546
8366 -1547546 -1483075 -1469358 -1553537 -1507524 -1575113 -1474562 -1442880 -1542071 -1508144 -1459248 -1440348 -1337479
8354 -1337479 -1229130 -960177 -680355 -953128 -1017527 -781067 -439023 -99046 -377074 -818409 -983853
8343 -983853 -782166 -646742 -949705 -1351570 -1399626 -1588351 -1603689 -1685269 -1664567 -1653200 -1709931 -1581526
8331 -1581526 -1546870 -1480379 -1489537 -1453066 -1530253 -1235160 -1349194 -1424602 -1553177 -1524708 -1529052 -1527081 -1606763
8318 -1606763 -1699360 -1811377 -1738963 -1780551 -1855588 -1855637 -1779289 -1794048 -1787810 -1892466 -1897128 -1732613 -1566819
8305 -1566819 -1013901 517495 1539948 591074 12224 1166219 3797620 4788452 2600156 722220
8295 722220 620602 1914637 2173740 637850 -348220 -560033 -776223 -703128 -284180 320825 483293
8284 483293 -33997 429350 2159619 3685569 5305562 10479253 30614816 93557075 172943251
8275 172943251 150338296 91857036 110560470 224396121 330566316 266210870 140303044
8268 140303044 99238859 146855820 196773760 133024510 55476831 26841983 16044891 10862785
8260 10862785 8959182 8455311 7076686 5278310 4163010 3931321 4006819 3505780 2932503 2746022
8250 2746022 3299097 4358966 4320571 3023734 2851725 3897223 5743049 5420248 3506691 2344855
8240 2344855 2585893 3511490 2934455 1575737 889601 528910 359275 333017 266160 220153 188179
8229 188179 74738 99298 310897 130997 -109083 -151316 87946 154432 -105990 -258471 -327942
8218 -327942 -437971 -297020 -451589 -385290 -433710 -435650 -434030 -530368 -612667 -627634 -533907 -573807 -686896
8205 -686896 -694881 -700199 -679740 -568929 -741357 -740613 -671722 -58802 -49022 -650127 -704655 -851236 -769038
8192 -769038 -808510 -767141 -827896 -944095 -863849 -890859 -862813 -831200 -914970 -895192 -855961 -867197 -829740
8179 -829740 -819298 -894938 -986167 -996228 -928211 -902782 -922902 -977344 -1002345 -1043665 -994395 -1000748 -1045219
8166 -1045219 -1089179 -1089971 -1086973 -1068541 -1047538 -1065870 -1075018 -1051244 -1076240 -1018087 -1031630 -988365 -1051090 -1109825
8152 -1109825 -1168466 -1133698 -1099919 -1148611 -1123714 -1126228 -1164284 -1229313 -1198787 -1168876 -1185860 -1257781 -1257358
8139 -1257358 -1201647 -1270777 -1218029 -1142888 -1028950 -971456 -1085060 -1199232 -1108951 -907859 -926999 -1027546
8127 -1027546 -1081647 -1102707 -1245854 -1192175 -1291486 -1231759 -1270110 -1345129 -1245712 -1396991 -1374649 -1308842
8115 -1308842 -1354257 -1421893 -1379442 -1409250 -1393336 -1272559 -802452 772020 2384653 1492535 392997
8104 392997 935269 3750871 5805948 3683756 1095338 627157 1799772 2943417 1360265
8095 1360265 226672 -104011 -208147 -237067 -4035 903630 1243102 660309 963893 2721629
8085 2721629 4375357 6020926 9735480 24396944 78308121 186289906 179310486 95942939
8077 95942939 91834240 191284494 345719747 307398875 151649306 88834959 116415256 197784593
8069 197784593 157338046 64287853 29997546 17698042 11906967 9557190 9004362 7767015
8061 7767015 5853857 4797317 4567391 4484101 3849481 3270453 3106624 3557884 4760792 5054150
8051 5054150 3551792 2996894 3919030 6079066 6473821 4270511 2735439 2597397 3695083 3723748
8041 3723748 2176736 1389430 1009277 843314 745062 549022 587169 422795 436004 402454 310681
8030 310681 433922 241119 224770 243889 209465 151423 143432 60253 -16255 126481 205494 119740 113241
8017 113241 101387 129925 340715 340017 283808 195055 292918 380101 373849 256321 308552 316784 287439
8004 287439 232289 109484 114888 120718 103236 212244 448655 520395 445209 268118 444244 865934
7992 865934 951754 705689 390043 209595 409393 294444 -5291 -173029 -215452 -194944 -216140
7981 -216140 -316342 -377862 -195834 -243128 -348452 -289326 -306045 -283591 -292755 -273786 -315079 -204663
7969 -204663 67193 -200626 -441565 -166777 22607 150010 350185 -160192 -219509 -78585 -111443
7958 -111443 -417941 -418640 -468504 -502748 -456965 -490238 -683316 -581729 -666972 -762485 -753494 -743662 -743156
7945 -743156 -626621 -648195 -286497 1696622 1259809 -355857 -497714 -522727 -436124 -611643 -808291
7934 -808291 -765730 -786288 -763611 -732284 -663923 -772046 -816508 -806726 -893893 -723807 -613013 -799460
7922 -799460 -1471301 -941639 -208473 -381074 -382708 262461 4587895 61889810 158117821 17043443
7912 17043443 5029094 2775814 1531251 724698 544493 1062343 681068 -46563 -68999 -144060
7902 -144060 -175541 -254228 -200275 -352042 -388286 -448210 -384493 -461961 -377069 -514121 -634415 -692569
7890 -692569 -545665 -429291 71413 2092002 108775 -382059 -556346 -627215 -658323 -608415 -587877
7879 -587877 -581306 -544027 -622853 -613645 -601996 -613984 -638268 -593024 -518132 -611206 -584878 -633564 -659050
7866 -659050 -573960 -658330 -605600 -603107 -666664 -635052 -665377 -651658 -677608 -715762 -727279 -736119 -610253
7853 -610253 -773416 -690822 -668086 -538199 -606309 -626956 -726273 -626387 -601953 -641200 -539760 -481289
7841 -481289 -665511 -730283 -752589 -771752 -701701 -708265 -725754 -757873 -832427 -727798 -824869 -801511 -743132
7828 -743132 -626950 -619903 -620947 -612554 -602712 -741994 -771120 -712822 -797449 -747693 -720527 -800641 -672671
7815 -672671 -856918 -832544 -826634 -836472 -810677 -815817 -757064 -716105 -706687 -682068 -694087 -469042 -28589
7802 -28589 163555 -87368 -195290 209889 684550 689933 286224 -170898 -120613 120924 -56610
7791 -56610 -367529 -549185 -657373 -647878 -739774 -755975 -715258 -785896 -780567 -778671 -753451 -798287 -896215
7778 -896215 -764712 -740767 -829016 -789111 -763598 -718606 -727884 -683465 -574989 -619305 -655172 -753472 -731972
7765 -731972 -694370 -661336 -750359 -743122 -831085 -701899 -785590 -783328 -808819 -773198 -794321 -743448 -754263
7752 -754263 -828297 -732380 -753128 -684670 -727410 -720628 -760393 -774431 -855615 -782782 -750066 -669099 -754325 -754667
7738 -754667 -814456 -762313 -879074 -787868 -810484 -846761 -770750 -787534 -820023 -804816 -833010 -886353 -870018
7725 -870018 -824569 -834759 -856297 -812423 -842121 -819856 -747004 -750573 -887704 -807096 -774664 -799085 -803907
7712 -803907 -752670 -836044 -918369 -879490 -814874 -831835 -893503 -920438 -833743 -894337 -838688 -912323 -824391
7699 -824391 -828165 -857376 -881434 -826910 -872778 -853666 -773973 -849400 -873587 -843403 -829633 -880074 -881230
7686 -881230 -843796 -854221 -826619 -829327 -812167 -864116 -854197 -900807 -849016 -876485 -893167 -939500 -874283
7673 -874283 -918481 -913609 -921395 -856721 -855816 -893411 -944275 -911937 -847082 -860541 -834882 -932540 -869929 -913135
7659 -913135 -752325 -822198 -883786 -839130 -879486 -936737 -960353 -924450 -799929 -893093 -961539 -847322
7647 -847322 -908662 -893101 -813749 -951107 -920322 -954208 -850688 -886726 -864965 -849528 -904944 -869530 -960435
7634 -960435 -963954 -946676 -893042 -936005 -910700 -959180 -1009498 -905948 -645051 -14600 -872977 -915988
7622 -915988 -882194 -976351 -924213 -949852 -956684 -877783 -829597 -905458 -919841 -993317 -889696 -926687 -832892
7609 -832892 -945384 -893453 -897891 -910090 -938929 -862036 -901256 -969345 -1007923 -969478 -1007459 -980350 -938718
7596 -938718 -799619 -935739 -987216 -904622 -981318 -949237 -973663 -867009 -914993 -890404 -939833 -1010209
7584 -1010209 -920580 -905613 -866199 -911928 -879639 -943575 -988312 -1009930 -926602 -1007227 -875817 -852504 -938553
7571 -938553 -973268 -934813 -914778 -865559 -884287 -905000 -892247 -904493 -965315 -941974 -810236 -861940 -911367
7558 -911367 -910985 -848256 -984828 -999990 -977363 -952645 -955316 -937579 -979301 -990788 -901779 -766162 -854719
7545 -854719 -897972 -935817 -887301 -906357 -880560 -960192 -961642 -907245 -858748 -880287 -987796 -895305 -930343
7532 -930343 -919253 -960344 -915555 -900207 -980571 -963123 -952218 -984256 -862047 -942963 -1017238 -944214 -956393
7519 -956393 -854621 -997583 -811615 -975229 -897323 -808204 -928409 -957975 -934260 -929279 -959627 -897269
7507 -897269 -925799 -948825 -892834 -924554 -946394 -947797 -844473 -852395 -876915 -936380 -942843 -995862 -921985
7494 -921985 -981991 -974938 -984739 -951432 -892721 -939980 -994836 -981044 -928701 -987651 -993345 -938772 -954414 -1047121
7480 -1047121 -880099 -903511 -873477 -987463 -965513 -1047224 -1090215 -1026459 -995124 -953796 -911896 -971378
7468 -971378 -939491 -966732 -984655 -963348 -978263 -1006998 -955822 -934035 -1070045 -978194 -1039365 -886158 -901202
7455 -901202 -1056518 -962875 -935275 -989529 -947668 -946296 -974257 -1061684 -1037762 -1024767 -1071066 -1023569 -988324
7442 -988324 -1056416 -956760 -973615 -1003674 -911804 -956204 -1046280 -1030844 -1011054 -1028160 -1048585 -1100127 -1013269
7429 -1013269 -1005979 -1077866 -1002421 -1090633 -992306 -996189 -1011250 -1074460 -984801 -1048123 -1050208 -1042660 -1075601 -1141550
7415 -1141550 -1043045 -1126083 -1032536 -990578 -1040720 -1093991 -1039159 -1083609 -1068149 -1009693 -1064944 -1017931 -1120371
7402 -1120371 -1046398 -1068151 -1075256 -1019527 -1108691 -1140153 -1080279 -1081103 -1021946 -1015463 -1051309 -1148884 -1112435 -1047374
7388 -1047374 -1045667 -993782 -1002686 -1001168 -958660 -1092836 -1014995 -1144768 -1066725 -1134176 -1132962 -1025802 -1104067
7375 -1104067 -1103840 -1060445 -1003406 -1066272 -1074751 -1091386 -1040343 -1087617 -1104230 -1084778 -1082195 -1070211 -1078654 -1088206
7361 -1088206 -1011490 -1067227 -1106233 -1092034 -1137044 -1117426 -1069937 -1036577 -1162514 -1109353 -1115219 -1091470 -1157266
7348 -1157266 -1169229 -1106578 -1084964 -1066280 -1157556 -1165165 -978440 -981923 -1057472 -1096834 -1098777 -916518 -1001805
7335 -1001805 -1073544 -1008450 -721767 -736899 -877402 -1053208 -722972 -571664 -572103 -909906 -916858 -865270
7323 -865270 -704502 -800403 -725963 -761129 -591003 -835818 -897260 -736730 -496958 -534531 -994284 -873515
7311 -873515 -790040 -443580 -927611 -988808 -1029286 -896053 -898225 -1004118 -1172398 -1173292 -1132797 -1169820 -1137809
7298 -1137809 -1134506 -1109934 -1082274 -1152866 -1174882 -1101240 -1113175 -1137864 -1156026 -1140065 -1146160 -1167028 -1181254
7285 -1181254 -1137281 -1080602 -1182632 -1149786 -1105761 -1123112 -1127527 -1180583 -1191478 -1171868 -1215523 -1181604 -1169255
7272 -1169255 -1153241 -1162607 -1134980 -1233480 -1207570 -1161256 -1148766 -1084917 -1183450 -1230622 -1193790 -1245185 -1187063
7259 -1187063 -1138967 -1195245 -1196117 -1205207 -1130027 -1230670 -1287973 -1203427 -1228124 -1172773 -1209497 -1355979 -1303710
7246 -1303710 -1172705 -1170224 -1201595 -1201376 -1129571 -1136628 -1265579 -1190946 -1289067 -1286964 -1283824 -1305005 -1260915 -1322892
7232 -1322892 -1257677 -1295443 -1208989 -1278462 -1143472 -1248764 -1268445 -954177 -939654 -1089906 -1065147 -837636
7220 -837636 -1040477 -857086 -1009105 -1013368 -1125702 -861998 -1015020 -1111177 -908668 -549896 -972492 -976731
7208 -976731 -834062 -595053 -909332 -966780 -1138247 -998144 -823930 -953732 -1291212 -1181418 -1041615
7197 -1041615 -1165128 -1285263 -1359732 -1339747 -1356164 -1350992 -1267399 -1293255 -1455795 -1325613 -1374112 -1450271
7185 -1450271 -1346690 -1305447 -1426509 -1466304 -1401326 -1421891 -1390408 -1325823 -1336536 -1381700 -1434945 -1455290
7173 -1455290 -1471026 -1374971 -1360590 -1463999 -1486202 -1327416 -1229192 -770842 -1275413 -1327122 -1283119 -956873
7161 -956873 -743737 -1255568 -1308063 -1409898 -1476598 -1484375 -1481052 -1488583 -1429223 -1457842 -1639860 -1532153 -1476432
7148 -1476432 -1424624 -1486932 -1495925 -1286478 -1452634 -1590198 -1435257 -1037273 -471189 -1157668 -1365497
7137 -1365497 -656085 564311 -108175 -797952 -586477 56323 -202081 -495038 -140136 -583092
7127 -583092 -1042481 -312172 453427 -316011 95891 907388 1247295 612615 2047041 5131697
7117 5131697 4596672 886102 2952096 10793935 54789516 32417243 10027353 25394238
7109 25394238 84872674 105547128 36613290 43303215 80586746 79597068 44487713 83282752
7101 83282752 53083472 33823370 32893918 93214602 67438246 46713010 91760045 95321755
7093 95321755 68562046 45271748 154281894 88896410 43721160 21526434 63249858 67051140
7085 67051140 13231649 7409672 8136993 10425398 5751691 3286980 3282771 3124226 3230876 1824071
7075 1824071 1673164 1763873 1340092 547691 1072778 1210261 403993 1167747 1070067 992105 351378
7064 351378 1445019 1537461 439564 -62838 162302 754219 -246150 -519398 -510154 -525974 -653268
7053 -653268 -748548 -739542 -608415 -762396 -782880 -810360 -693968 -774183 -818549 -726084 -687331 -798167
7041 -798167 -955405 -876846 -937913 -940613 -999514 -963495 -1109203 -1016016 -979870 -917418 -1033554 -1018830
7029 -1018830 -916298 -989343 -1052882 -1108247 -998497 -568246 222487 -645765 -491168 1177293 1467998
7018 1467998 -294177 352622 1458593 82949 -609079 358084 277115 -627290 -546827 456531
7008 456531 614035 296098 1462760 1959342 1092925 1422294 3278915 3632267 7145549 3381750
6998 3381750 4978544 19814503 78754243 38576067 21066500 82966743 168634717 50812444
6990 50812444 46806841 136133053 97378593 30001713 57957203 100164299 38160246 22796022
6982 22796022 60724481 83767615 39383163 49893963 119898540 64073684 30914657 94245450
6974 94245450 114857140 28291524 18970559 56369436 37724144 11070830 5903845 5247976
6966 5247976 8836000 5545292 3279522 2913756 4381666 3661272 2622290 2009889 2317723 2049497
6956 2049497 2238549 1818330 2650553 2331884 5733711 38452417 142708956 30525075 13247131
6947 13247131 42020860 145997311 29735707 7639726 5526620 3274956 1702956 1858079
6939 1858079 1885486 1517024 727495 1217146 702838 351174 194307 501436 1291431 3744233
6929 3744233 1158924 497182 1212374 3686930 1054163 374331 1953013 1104882 386236 380882
6919 380882 1832974 908098 -174075 85528 126528 422865 1316238 678646 -263541 -418616
6909 -418616 1509159 2053359 1079916 1125856 4444126 21057886 163652117 93762161 17485638
6900 17485638 26531255 161507200 97303302 12849818 7613093 5026606 2437772 1706960 2233513
6891 2233513 1855378 895832 894272 1224346 564787 166317 178732 290002 645809 381695 35190
6880 35190 -92733 245584 647687 208189 1479538 2528400 1350541 1673669 1673437 2429355 530935
6869 530935 352335 85056 -115813 90639 -26028 64829 -317080 -296197 27029 81307 -198291
6858 -198291 -385061 -364674 -222966 -373518 -438345 -441292 -418663 -508036 -492590 -439071 -244315 540754
6846 540754 84591 -356957 -367924 -454420 -508914 -652491 -669595 -623659 -626830 -774252 -617199 -679855
6834 -679855 -525533 -604627 -549885 -671060 -500514 -595679 -745850 -792501 -380501 -634045 -685100 -717816
6822 -717816 -769124 -739914 -710788 -751239 -772379 -701823 -694094 -734651 -763040 -780322 -836655 -766830 -787009
6809 -787009 -746924 -739691 -714706 -769136 -832760 -794806 -839053 -814458 -800221 -588190 -417374 -747067
6797 -747067 -851245 -814561 -841096 -877472 -896680 -851032 -975591 -1009937 -868350 -884009 -896509 -937739
6785 -937739 -967317 -980819 -896518 -943573 -963956 -883464 -872305 -960158 -900261 -940444 -961008 -921136 -984635
6772 -984635 -898651 -935912 -902964 -917088 -944287 -916281 -906913 -961244 -882906 -981660 -826628 -595904 -633940
6759 -633940 -668720 -833588 -719914 -576850 -424863 -759604 -801938 -696630 -345670 -794611 -812161
6748 -812161 -721589 -529250 -807947 -792685 -720029 -698597 -578617 -691941 -722306 -792847 -492633 -863833
6736 -863833 -1046270 -891456 -424916 -892239 -1081650 -1001582 -1077839 -820944 -816132 -1034699 -1085091 -884823
6724 -884823 -590632 -345346 -186480 -358697 -441594 -820832 -991353 -983156 -719532 -433426 -280037
6713 -280037 -255397 -299615 -470959 -636134 -506202 -226870 133461 364057 201998 -127376 -406215
6702 -406215 -523257 -10038 679226 2198023 8043936 21447162 36321620 48598566 49763619
6693 49763619 37988387 24212178 11181995 8553916 17869018 32939375 47303257 53983333
6685 53983333 45832726 34378679 20319562 21186338 36416148 50291666 59283665 51569854
6677 51569854 36438127 20613680 10414893 13891080 28515839 44449608 57004692 56183937
6669 56183937 41843945 26122815 11214390 4913291 2774741 1711675 1950022 2740692 3021759
6660 3021759 3083695 5716619 23192253 147070476 78993111 13424843 6039456 4161888 3398737
6651 3398737 4436583 3434522 2446557 1487738 1240406 1967157 3633431 6992606 9467242 12069102
6641 12069102 10607273 7827173 4660927 2843807 4995064 7036555 8637162 11904658 11600582
6632 11600582 9018161 7453106 14632847 87091835 198521669 51813056 32234872 22870739
6624 22870739 16444274 8614905 6814127 12852841 19072174 24097163 25292243 18564122 13354538
6615 13354538 6009504 3817161 2639547 3140490 8073645 61931930 100446096 16691285
6607 16691285 6617656 4075018 4583461 9402606 14655545 21826724 25676683 23178896 16451051
6598 16451051 10033956 5329453 6925771 11656614 18671877 22034926 22439465 17450472 10760309
6589 10760309 5938122 5867524 8791909 11323658 11162224 9800395 10297346 29545353 140672823
6580 140672823 57747030 15412594 14013738 12853499 11331404 7842030 4896217 2718736
6572 2718736 1348178 759020 461548 527569 489398 679916 413172 482671 363335 308908 92570
6561 92570 32706 166167 154801 -63518 89727 3830 300103 1672524 1324842 292251 280963
6550 280963 91286 115623 -176465 37328 -25678 -154095 -322150 -510412 -474129 -442783 -394667 -344880
6538 -344880 -425001 -306390 -446021 -269668 -445152 -311361 -81189 660461 202851 -242163 -234285
6527 -234285 114036 851678 52005 -283676 -450698 -422229 -411885 -529910 -466383 -499428 -412672 -421206
6515 -421206 -431245 -502278 -489291 -547084 -523445 -589550 -588432 -563467 -490618 -538043 -723307 -540996 -319825
6502 -319825 154418 -499172 -613813 -552036 -257227 -213752 -564583 -731515 -684759 -632452 -725162 -671084
6490 -671084 -679885 -705649 -719566 -695127 -754475 -723172 -731540 -700586 -774106 -740108 -775811 -645425 -679978
6477 -679978 -691392 -760396 -717437 -601737 -603505 -564566 -247717 618433 1681030 2821317 3290215
6466 3290215 3100681 2191816 1109712 626026 1153669 2000567 2976715 3211047 3185218 2307038 1501211
6455 1501211 1270460 2662228 4495018 6077848 6280684 5701685 3994623 2510914 1795659 2960445
6445 2960445 4683127 6174896 6383766 5904470 4176040 2401475 906386 472496 505850 474418
6435 474418 608235 548846 182245 -6437 440368 145908 99919 279497 332082 256659 74150
6424 74150 -177906 -299723 -146428 230846 553012 848595 746486 764839 1164498 3276755 5728248
6413 5728248 8297205 10608525 15651957 29919161 44251168 57528097 59142485 47711078
6405 47711078 32878776 21320656 22581484 37158348 50712377 60927738 58649702 43803808
6397 43803808 27804960 16964589 21219748 35594938 47394904 55807547 49287680 35533631
6389 35533631 22346247 15898687 23759273 38089246 50513534 54514709 45010530 28468850
6381 28468850 14280373 5727580 3540136 2558582 1868131 1517253 1493569 1522745 1634677 1428882
6371 1428882 1084876 645056 476566 319546 477655 808008 957172 727783 400775 193496 29690
6360 29690 19995 305719 530905 667503 1340691 732987 -38502 -291870 -338245 -316009 -469786 -520108
6348 -520108 -569000 -521754 -558034 -532093 -350951 452031 2915315 829111 92024 525485 2992000
6337 2992000 957363 -225457 -331354 517998 -192578 -615335 -440900 528191 -391353 -542299
6327 -542299 -564478 -421886 -421260 -309266 -751327 -1018639 -35631 596270 80652 279639 3110022
6316 3110022 16474886 139577919 111693388 20608414 23755057 137183208 116050306 16329554
6308 16329554 7459341 6440622 3117950 1954650 1279950 1600891 1337238 1024058 197574 108951
6298 108951 116808 320710 569523 1075638 -202295 -109207 890073 1750693 587440 1588247 7502101
6287 7502101 45743444 156902193 33839609 15047107 46438814 158524590 32717808
6280 32717808 7463776 4984671 3193238 1447808 967372 1287320 1293298 478145 319559 136956
6270 136956 237261 86029 316765 484827 524914 37911 -69841 324245 471281 -14830 200342
6259 200342 1841070 902226 138578 341461 1884206 766722 -99532 -158721 -197512 -276850 -328977
6248 -328977 -400033 -327805 -341915 -370184 -406835 -386702 -369437 -400554 -402229 -337901 -452809 -420747 -465030
6235 -465030 -403885 -395386 -476299 -354023 -549449 -554429 -456334 -462913 -479095 -523453 -575298 -408824 -407410
6222 -407410 -567140 -514334 -586791 -510434 -482261 -477924 -482424 -627340 -539589 -478804 -538868 -506056 -604755
6209 -604755 -566646 -602897 -609864 -608745 -640191 -573278 -590963 -553820 -579068 -526867 -611311 -588651 -665160
6196 -665160 -581141 -604575 -631240 -602012 -660765 -604074 -635473 -637128 -595560 -579215 -643592 -528262 -631560
6183 -631560 -637635 -689799 -577887 -634936 -516276 -618113 -632325 -598463 -426197 -348190 -328051 -306105
6171 -306105 -454418 -488686 -607389 -521588 -362122 -377400 -274142 -267274 -496836 -561367 -536255 -481806
6159 -481806 -416921 -396260 -334028 -403922 -469174 -615428 -612265 -580024 -468649 -334624 -369603 -530926
6147 -530926 -445189 -712178 -545244 -671148 -661727 -660103 -774245 -684827 -645242 -692808 -612043 -676081 -723378
6134 -723378 -714754 -722507 -683385 -696357 -835043 -675202 -636505 -661077 -737110 -740185 -697694 -699984 -699970 -671477
6120 -671477 -661378 -693774 -756231 -733622 -713639 -851683 -714371 -675427 -657298 -682323 -651859 -639529 -709505
6107 -709505 -652493 -650256 -678918 -721625 -752107 -735275 -741555 -725374 -724301 -725764 -677381 -705903 -695310 -647011
6093 -647011 -82703 -41986 -621253 -705439 -683670 -461585 254122 -354501 -639181 -734399 -719160 -707239
6081 -707239 -753155 -692627 -724372 -741464 -758497 -728138 -811818 -748885 -746149 -731211 -731784 -798231 -747136 -805224
6067 -805224 -651628 -128798 -132888 -650799 -686495 -696013 -566445 35340 -516731 -727557 -779902 -721944
6055 -721944 -746719 -700951 -740663 -756445 -824940 -742850 -800673 -766823 -778613 -750899 -856793 -752621 -778343
6042 -778343 -782823 -793302 -780236 -780048 -777847 -846478 -703084 -721958 -772651 -765467 -721913 -813859 -832639 -872949
6028 -872949 -803193 -767252 -795720 -761420 -795889 -858239 -822173 -797735 -846445 -914669 -787065 -837286 -828492
6015 -828492 -763908 -878364 -780272 -861481 -811228 -816143 -793140 -777291 -836868 -800983 -783472 -762253 -820310
6002 -820310 -700404 -933971 -784751 -823866 -770357 -806973 -837999 -842884 -788633 -737539 -778922 -812522 -863365
5989 -863365 -827242 -857181 -912399 -833877 -895095 -782424 -779536 -830831 -738954 -706693 -840364 -799556 -751380
5976 -751380 -763873 -808073 -713053 -718531 -787073 -654450 -772584 -790670 -666289 -791183 -759408 -766889 -779915
5963 -779915 -774683 -720457 -764948 -824879 -877349 -776823 -733953 -642979 -573878 -625193 -625734 273437 622014
5950 622014 611487 544517 -269596 101261 1876525 2624808 2427379 1837019 270228 492367 2022584
5939 2022584 1971307 2215348 1178763 2005192 2183575 2561796 1687412 584448 1875622 6034395
5929 6034395 6673555 7140593 4393347 1480107 3911167 8135545 7830978 7657791 2628398 2194538
5919 2194538 3748355 3607453 2316640 1520502 3475152 3614527 3447358 3718536 6766242 8537862
5909 8537862 7134182 4601112 3632453 6259869 7041563 6568088 3749179 1452136 1714160 2458170
5899 2458170 2418032 2051165 691077 1007668 2002826 2231205 1878753 968706 1408718 2344741 2886919
5888 2886919 2267849 946107 213339 660021 783724 808796 284266 -286693 -556494 -513806 -613818
5877 -613818 -483470 -595035 -746979 -700727 -682281 -688944 -599247 -619199 -653778 -731297 -716468 -741718 -769340
5864 -769340 -725195 -683231 -728823 -794542 -716348 -709310 -805052 -818260 -801682 -796128 -784681 -814744 -783163
5851 -783163 -816499 -840459 -809019 -785680 -718782 -803605 -844019 -859127 -877746 -849090 -814662 -836844 -792136
5838 -792136 -864227 -794585 -865166 -787044 -827260 -862403 -806279 -796470 -785103 -853582 -831009 -798251 -756670
5825 -756670 -856538 -771027 -803182 -775007 -810610 -757200 -775746 -746081 -669494 -793258 -767178 -788356 -747143
5812 -747143 -786824 -837776 -848628 -818910 -827218 -784630 -776745 -815953 -824220 -844251 -854558 -808820 -895187
5799 -895187 -793002 -905168 -807707 -885339 -785215 -766238 -856214 -816106 -858705 -889358 -788621 -754714
5787 -754714 -846168 -850961 -860608 -812938 -827283 -719233 -805312 -877308 -807054 -800171 -869603 -933583 -853263
5774 -853263 -797304 -817193 -831860 -846780 -824355 -805019 -882134 -900201 -862906 -855615 -845776 -790833 -850499
5761 -850499 -814629 -891714 -804120 -857849 -889846 -820687 -860834 -816409 -790434 -901325 -791362 -818871 -857128
5748 -857128 -823493 -873245 -894004 -900749 -849973 -823240 -812513 -949540 -820661 -811160 -916966 -852057 -796157
5735 -796157 -841500 -842552 -804413 -847944 -956081 -823050 -869451 -747430 -549705 -451326 -759001 -704414
5723 -704414 -787225 -810672 -828330 -833856 -889987 -753052 -775347 -864453 -767225 -797887 -816909 -911063 -886396
5710 -886396 -716861 -847191 -905656 -900555 -867934 -777919 -740628 -814887 -927737 -851162 -813968 -822576 -896631
5697 -896631 -851684 -869652 -871205 -941642 -839228 -744078 -785831 -779161 -827044 -846659 -795485 -832135 -836570
5684 -836570 -907072 -882911 -893369 -846571 -757015 -756106 -791203 -805895 -884858 -829844 -835635 -837592 -824503 -846400
5670 -846400 -792539 -818162 -738579 -879042 -825345 -866446 -903715 -898755 -870281 -861848 -952549 -803925 -871132
5657 -871132 -934709 -916164 -730289 -903004 -888115 -929426 -891877 -905015 -915641 -949614 -868208 -806613 -869752
5644 -869752 -881335 -930444 -908084 -859297 -915078 -790173 -923680 -821565 -802049 -868731 -808410 -868538
5632 -868538 -918995 -829190 -904849 -860696 -925338 -855136 -922079 -804411 -849501 -895622 -956869 -931312 -897178
5619 -897178 -915593 -788485 -880078 -847065 -848056 -854220 -802884 -721246 -672809 -712993 -605695 -448233 -342337
5606 -342337 -338581 -406471 -457081 -576521 -465752 -543614 -435101 -430077 -385199 -482397 -661340 -763913
5594 -763913 -831109 -873024 -876187 -826829 -870162 -848394 -801360 -867907 -802887 -953399 -888727 -889553 -803414
5581 -803414 -871075 -819093 -865638 -808003 -819872 -782830 -911755 -849152 -795422 -835208 -815085 -763351 -762980
5568 -762980 -880567 -765376 -796797 -900703 -766826 -710502 -652150 -616885 -676004 -709763 -726893 -834175
5556 -834175 -871653 -918074 -828599 -811988 -842889 -887853 -846067 -1030640 -858715 -873907 -808743 -765092 -768969
5543 -768969 -857901 -655969 -775416 -808456 -624154 -741467 -861293 -866590 -863749 -887134 -942759 -891102
5531 -891102 -861833 -747811 -783775 -621468 -594819 -654334 -489882 -547545 -855753 -779600 -820258 -894719
5519 -894719 -934639 -885622 -812033 -813153 -830861 -764728 -606981 -820161 -727684 -838535 -889175 -739141
5507 -739141 -792872 -824755 -875835 -841639 -912759 -860929 -858882 -708819 -856078 -876722 -975168 -761524
5495 -761524 -861894 -887669 -858301 -882541 -913946 -735965 -813971 -954093 -720516 -689726 -772927 -703752
5483 -703752 -730040 -665664 -638102 -573441 -552108 -750519 -568935 -561732 -679887 -685848 -330582 -493504
5471 -493504 -617412 -705193 -533846 -663270 -702225 -515670 -901620 -691647 -558112 -899200 -813197
5460 -813197 -444728 -606623 300640 -753097 -1201213 -741687 -632362 -598437 -800129 -457913 -462500
5449 -462500 -668119 -778584 -655455 -768698 -761494 -859466 -801647 -895817 -876312 -787927 -852838 -809716
5437 -809716 -832902 -808402 -843020 -884173 -898465 -928304 -859341 -972240 -1000814 -806783 -912262 -890894
5425 -890894 -813838 -1042018 -953837 -939520 -941968 -862201 -937432 -846614 -898404 -897124 -928728 -946150 -966420
5412 -966420 -967442 -820557 -849036 -901192 -942207 -905702 -864739 -997568 -924307 -955052 -803852 -855907 -864518
5399 -864518 -870143 -827240 -765641 -837375 -803631 -841436 -790581 -735695 -758418 -707456 -574995 -685042 -694652
5386 -694652 -669303 -684354 -777337 -872902 -715603 -783828 -906334 -834539 -869541 -881240 -893653 -919079
5374 -919079 -808880 -868055 -659219 -635913 -577709 -728537 -638079 -727448 -622224 -768448 -786355 -863838
5362 -863838 -840895 -865022 -821420 -875785 -925020 -892309 -862468 -839199 -874266 -978398 -921751 -828631 -861670
5349 -861670 -903469 -960411 -926908 -956775 -1006992 -940199 -968267 -945512 -936337 -897960 -913406 -1040544 -835995
5336 -835995 -969638 -955379 -909682 -890520 -929775 -831832 -920782 -943607 -968797 -911856 -920461 -968646 -895673
5323 -895673 -887883 -976881 -898549 -814898 -920008 -863345 -946462 -808329 -909011 -950965 -859179 -949476 -991829
5310 -991829 -1002956 -981233 -971258 -995458 -912649 -895507 -863005 -945693 -946993 -954577 -957163 -939984 -842571 -818306
5296 -818306 -910455 -854885 -902845 -883061 -819445 -798331 -892079 -904133 -817805 -951472 -942609 -885085 -888532
5283 -888532 -842649 -824939 -847674 -1022792 -965456 -945815 -910765 -910444 -947855 -905777 -908114 -921280 -954256
5270 -954256 -926601 -887407 -832108 -964954 -970555 -820008 -975332 -1019622 -970653 -1001687 -948852 -869268 -931225
5257 -931225 -836355 -861751 -900810 -923492 -840855 -1013536 -882088 -1014542 -816711 -920633 -933921 -910217
5245 -910217 -965517 -951204 -939521 -924873 -884049 -930767 -899202 -890001 -893665 -920308 -881376 -911540 -889332
5232 -889332 -937812 -850831 -900858 -843232 -919532 -979622 -916506 -957381 -999948 -954105 -929100 -962990 -947324
5219 -947324 -1073351 -1034715 -1001627 -984368 -1056141 -997974 -930172 -890263 -954417 -996492 -971241 -968339 -883499
5206 -883499 -831942 -926126 -883133 -911876 -903262 -961246 -925601 -851839 -907952 -956381 -1012406 -973111 -915790
5193 -915790 -917002 -1042366 -910198 -971972 -1023090 -980643 -949464 -1004631 -1031062 -983450 -1040290 -977698 -949956
5180 -949956 -978642 -985281 -973491 -868836 -1028123 -986665 -952224 -908224 -939181 -1023018 -934857 -925187 -1038798
5167 -1038798 -1000361 -991909 -861352 -970949 -892888 -938839 -968020 -967696 -1012486 -951191 -971243 -1083213 -984694
5154 -984694 -900577 -929876 -936217 -988632 -1024393 -963429 -955703 -1019908 -978811 -982137 -1022990 -1004694 -982089 -908696
5140 -908696 -935517 -1013279 -940789 -1011494 -1042238 -1013543 -1092771 -968556 -840293 -992417 -967886 -947247
5128 -947247 -1047484 -988770 -1000606 -913536 -930605 -974312 -1008410 -1019640 -1005026 -982941 -957912 -978361 -919842
5115 -919842 -1001733 -969624 -947881 -984636 -1042547 -986605 -893630 -953718 -937256 -921197 -914518 -1024867 -952272
5102 -952272 -1004500 -949772 -915853 -903946 -946564 -918392 -962314 -908268 -987337 -925721 -999798 -999321 -977569
5089 -977569 -1007715 -1031254 -1032321 -971041 -907953 -823796 -608372 -703373 -466404 -789096 -622043 -767256
5077 -767256 -765649 -995503 -947220 -999706 -881474 -1005985 -923775 -833052 -862246 -589831 -731644 -394738
5065 -394738 -774926 -600529 -799582 -998132 -978029 -915762 -995671 -974866 -1014988 -988777 -1065226 -919191
5053 -919191 -926269 -952965 -1055886 -916310 -911177 -1082077 -998103 -888458 -1017547 -899856 -989305 -966194
5041 -966194 -955013 -1057453 -879893 -955181 -938070 -886219 -979170 -958677 -1009075 -1064817 -991825 -885347
5029 -885347 -983975 -959072 -985599 -1071068 -1019384 -989552 -1036824 -966685 -939082 -978622 -991146 -912805 -913635
5016 -913635 -963366 -935296 -924854 -984808 -1001918 -963535 -987262 -987949 -970662 -982767 -983857 -1005944 -982922 -1010701
5002 -1010701 -1009478 -1035157 -1015415 -1087374 -943500 -1057765 -990486 -981347 -1028955 -1026829 -1008430 -999618 -923335
4989 -923335 -1040002 -1003916 -1010188 -955631 -996827 -1029164 -978500 -969253 -1056604 -956572 -1101815 -968075 -1027433
4976 -1027433 -954952 -1018831 -1059833 -979405 -1092028 -954202 -967038 -957159 -1018867 -1008076 -951272 -1033464 -1049605
4963 -1049605 -1103384 -1001224 -1032949 -1023534 -994547 -1047653 -965325 -1123715 -919432 -1052645 -984567 -1007682
4951 -1007682 -1050397 -980635 -1100122 -1045024 -1028380 -957533 -1036748 -1049313 -1077796 -1027124 -975393 -1032054 -1020776
4938 -1020776 -954567 -1040690 -1030715 -1036841 -904276 -1052704 -1066159 -968317 -1082923 -1014094 -1021320 -1109297 -1102447
4925 -1102447 -1095974 -1070176 -1058147 -1015204 -1050660 -962759 -1122254 -1038869 -997864 -970463 -933562 -1097994 -1026975
4912 -1026975 -1040244 -1046631 -1054121 -961003 -1080732 -1047629 -941608 -1007205 -1083660 -964073 -1119845 -1037403
4900 -1037403 -1084126 -1055827 -1106214 -1103048 -1034487 -1115078 -987237 -972063 -993086 -1025403 -936766 -1027917 -1015909
4887 -1015909 -1015725 -996557 -1014571 -985519 -1041520 -999908 -976704 -1119850 -1099549 -923649 -1060440 -1059946 -1069135
4874 -1069135 -997234 -1078845 -898768 -1028055 -883538 -915654 -884044 -863291 -843626 -742323 -540803 -397979
4862 -397979 -224521 -179679 -264777 -524396 -677936 -708147 -739868 -905013 -878314 -966188 -941373 -788504
4850 -788504 -763181 -822562 -834616 -588580 -608132 -472746 -140478 18745 330767 403633 216146 110813
4838 110813 -70308 -336890 -572393 -657165 -704653 -789964 -910977 -845687 -924380 -906113 -906832 -864373 -806845
4825 -806845 -787993 -714103 -495542 -213395 -84420 -91341 -336286 -547065 -799427 -864405 -940542 -896063
4813 -896063 -933820 -927093 -945154 -954640 -998090 -1089066 -1072403 -1029509 -1095378 -1100777 -1117650 -1008701 -940624
4800 -940624 -1032737 -1084253 -989710 -1133644 -1050488 -1123703 -1089091 -1059828 -1081985 -1106759 -1048199 -1075243 -1099812
4787 -1099812 -1062258 -1140872 -1212295 -1245879 -1251720 -1149225 -1102311 -1145912 -1039806 -1168224 -1162667 -1060259
4775 -1060259 -1008608 -1082621 -1006458 -815901 -672000 -614795 -642535 -614660 -834103 -1037866 -979290 -1072721
4763 -1072721 -1063138 -1124635 -1124340 -1124645 -1102299 -1092943 -1055106 -1057932 -997564 -854421 -807638 -660727 -479000
4750 -479000 -331465 -305411 -447046 -694145 -737625 -813006 -973304 -1024045 -1103474 -1073970 -1154919 -1052431
4738 -1052431 -1106784 -1114520 -1096093 -1033931 -944291 -779563 -825592 -655984 -497506 -550166 -614365 -695022
4726 -695022 -836897 -727274 -607988 -552365 -621293 -770931 -782518 -885969 -912526 -912935 -886724 -898268
4714 -898268 -1000314 -997453 -1016126 -966114 -954451 -794106 -710539 -601361 -429076 -429227 -423776 -195662 -47381
4701 -47381 54807 259751 830588 1728331 3117195 3997188 3527313 2305127 1382903 931918 681671
4690 681671 590923 516769 484641 669187 1012899 1409647 1793265 2186071 2790339 3805923 5231134
4679 5231134 7272521 9588843 12217707 15484710 19855915 25573180 34204742 50744022 86361964
4670 86361964 148098949 206159405 208718687 153789965 92925760 56983784 39610578 30785560
4662 30785560 25594238 22501532 20728984 20409015 22194902 26362554 33168770 43037526 59475744
4653 59475744 89956532 138364953 196687121 251913086 292432579 301973089 277249037 234058633
4645 234058633 184214059 132365770 91875789 67982270 52907303 40263729 30478173 25122911
4637 25122911 22426919 21597044 23003254 26855543 33044838 43185547 63877265 107858616
4629 107858616 176773534 225140101 205058346 137304225 79007792 48652382 34502122 27010177
4621 27010177 21906417 17701586 13991766 10922064 8582238 6891092 5596378 4694706 3828787
4612 3828787 3219660 2734811 2465520 2358245 2233489 2043744 1923753 1939127 2150578 2560672 3528533
4601 3528533 4365471 4392347 3327452 2265093 1580822 1190428 951475 854945 783880 605608 377819
4590 377819 259709 210822 308498 251890 196025 65184 -167450 -164534 -197822 -341983 -339687 -267251 -312371
4577 -312371 -242598 -265360 -79595 -193870 -156290 -163442 -197719 -199070 -386438 -435056 -558178 -538005 -567474
4564 -567474 -552487 -485687 -490121 -512673 -502571 -485350 -453899 -475626 -396259 -552342 -513685 -429891 -514722
4551 -514722 -514110 -568079 -460865 -547106 -508261 -658431 -753817 -848666 -819479 -736393 -786790 -890150 -1029659
4538 -1029659 -852082 -761694 -616715 -757064 -647930 -546733 -317954 -301057 -274122 -421853 -590276
4527 -590276 -875762 -988284 -826566 -595223 -545690 -551498 -555008 -610726 -568523 -787133 -824641 -724880
4515 -724880 -687198 -879993 -1022194 -1006407 -1017416 -938340 -946399 -682048 -555269 -280398 -88858 557310
4503 557310 1349092 1667468 1019500 140722 -190827 -196647 -250783 -272232 -335031 -544579 -778588 -955078
4491 -955078 -1145617 -939978 -685184 -84452 529925 833221 1461412 2081506 1861432 1277984 790953
4480 790953 1357623 2515508 4942661 13427265 30419705 38457303 33034427 17136668 8966241
4471 8966241 7321208 6010238 4209570 2505773 2051060 2508570 3772304 5224281 6129103 6688114
4461 6688114 7093042 8806818 11771129 15335707 17097062 18147364 26029844 45113269 70769979
4452 70769979 100981908 167116554 402674765 1150997832 1806967642 1762504641 1038343271
4445 1038343271 361410237 170118017 107239470 77165697 59869045 46120213 34104331
4438 34104331 23820344 18035202 15640131 13761299 11932877 9758628 8278681 7899490 8044968
4429 8044968 8222457 7579503 6531312 5314055 4597057 5208237 8538076 18365901 31215909
4420 31215909 33074242 24297292 11532844 6953229 6134638 5507435 5111120 3992102 3235973
4411 3235973 2225293 1623700 1311796 1257529 1468243 1897722 1965322 2105518 1930023 1583263 1216178
4400 1216178 922579 780673 746365 687754 844510 1115264 1441386 1494122 1319112 835238 391229
4389 391229 371952 429780 547440 604604 694605 732233 759921 634342 412497 390616 386290 317592 238671
4376 238671 124486 55650 -62942 -126100 -57041 132875 246249 342085 254481 22748 -99419 -275418
4364 -275418 -339133 -323154 -187790 -96930 54609 -20082 101663 161018 234949 87301 57651 -119510
4352 -119510 -146285 -206078 -96920 -159034 -244197 -201373 -272595 -201897 -189090 -178582 -340805 -299658 -220676
4339 -220676 -213549 -313542 -201233 -262201 -353274 -341547 -241117 -267583 -262259 -195419 -263554 -241970 -364275
4326 -364275 -283270 -388531 -379429 -377329 -288358 -352129 -356148 -252135 -360783 -312013 -250849 -276241 -190237
4313 -190237 -154581 -59095 -56899 -352103 -483902 -484925 -473217 -496143 -377661 -325143 -341958 -464331 -508498
4300 -508498 -484681 -530181 -467392 -446973 -519923 -667507 -533610 -482578 -407510 -411321 -469007 -476280 -450562
4287 -450562 -479778 -472897 -492267 -497973 -522345 -472617 -530144 -453150 -400876 -488282 -347592 -328864 -341843
4274 -341843 -396818 -412660 -501664 -504861 -420114 -433801 -423275 -375203 -476495 -440312 -436905 -474581 -586751
4261 -586751 -587077 -469142 -287385 -278865 -349528 -360592 -259473 -48272 101671 525565 1616565 4864284
4249 4864284 8326824 8410230 5409600 1834820 550010 84195 -95011 -218685 -291098 -291671 -376405
4238 -376405 -424899 -371071 -369013 -356921 -396097 -150212 1752956 10684794 2015148 -157579 -499034
4227 -499034 -522521 -527874 -500529 -389429 -503420 -426672 -405399 -398398 -531843 -617458 -615139 -629428 -604787
4214 -604787 -603324 -587493 -608748 -622532 -580267 -636253 -625311 -628240 -683731 -611909 -468117 -472816 -698193
4201 -698193 -644141 -718037 -627770 -756368 -664631 -661501 -709966 -639256 -668610 -594151 -675768 -664320 -741741
4188 -741741 -694551 -673048 -616449 -512597 -598299 -749730 -723758 -718469 -610234 -681531 -670394 -644952 -736951
4175 -736951 -623177 -704925 -721214 -646150 -577885 -741351 -1045217 -964302 -841003 -831408 -743470 -706180
4163 -706180 -822630 -681456 -799998 -846867 -805846 -723174 -657049 -664316 -672108 -645375 -351442 1780343
4151 1780343 1071487 -544504 -753224 -822967 -712138 -789486 -718751 -777766 -864845 -665090 -818124
4140 -818124 -829354 -714164 -755994 -655996 -732359 -798346 -779864 -618144 -732431 -774063 -902384 -888717
4128 -888717 -910440 -740985 -826265 -885148 -999313 -860146 -774170 -826221 -862533 -796611 -635716 -530743
4116 -530743 -621312 -596515 -525054 -853354 -1001919 -1106089 -870050 -721374 -709815 -618682 -528378 -658472
4104 -658472 -801169 -909563 -1042327 -862278 -618960 -1024054 -1188220 -1077960 -1002390 -883588 -950674
4093 -950674 -810603 -806923 -423646 -855504 -637653 1365381 622637 -729644 -522741 -458206 -624137
4082 -624137 -356067 -30505 4186901 7973299 1177802 -676687 -1047938 -1018853 -687783 -693528 -73098
4071 -73098 -452133 -490648 -856474 -1435899 -1228559 -717406 -772566 -62107 65716 2216867 20501289
4060 20501289 34303586 4240556 1600172 872883 2151651 975656 -1008976 -910279 -496920
4051 -496920 -919363 386520 1308419 1278774 -255459 1178745 134610 2736971 4601472 3970510
4041 3970510 -2517045 -322362 12400613 24223669 15976111 23106922 64909692 428453319
4033 428453319 2147483647 462538289 71600379 35585548 21423270 16889499 15204265
4026 15204265 13796005 12850763 4090516 1887692 2000191 3319497 1704792 2143633 121921
4017 121921 -332079 80808 1524862 992331 997134 1055753 -620639 -925447 1171106 1000006 5120338
4006 5120338 27692522 16060656 2295512 1187052 47407 328260 384424 609058 769685
3997 769685 -27534 -656607 -504556 -723462 -134854 -299486 128268 180887 -219136 116026 -183548
3986 -183548 -449643 -179349 -318034 1021861 7615051 8330292 1383662 818230 566442 636497
3976 636497 -132819 -971934 -622434 -777400 -689161 1355 190906 267259 -54169 549088 87468
3965 87468 983405 1603578 991066 -1153988 43515 3906190 7294730 5806250 9482174 29926540
3955 29926540 215699541 598758612 123057310 23225475 11483956 6706584 5908103 4193688
3947 4193688 4201088 3324224 802524 274306 409653 931142 507451 831292 434321 76938 2153439
3936 2153439 3222584 866234 438564 412828 -402038 -354168 -55105 59611 2162630 8195528
3926 8195528 3322048 -98206 -529234 -320183 -107130 240415 478382 207292 -229559 -868737
3916 -868737 -1076309 -672521 -213712 226690 517595 2263959 15943457 32631492 12126072
3907 12126072 2452198 1348148 1835200 1802561 -321555 -765861 -429135 -574036 408095 1451647
3897 1451647 1663908 399638 780050 616598 2115201 4205683 4521934 -275031 -827564 9138798
3887 9138798 21047547 21592124 24381650 62277883 355179477 1588849276 1077953740 139570869
3879 139570869 52381044 30552361 22359075 19184822 15281138 15554677 8206423 3802911 3350113
3870 3350113 3954443 3268969 2993478 2214133 971509 1017499 2065387 2371196 1837127 1773630
3860 1773630 672001 -288068 899856 1635836 4896479 21153423 23557032 5373177 2253182
3851 2253182 992479 823045 1018691 1119989 1301768 773467 277560 189506 -63753 -35220 159602
3840 159602 420242 761753 613226 647722 284763 102319 96614 40722 209519 851873 7763615
3829 7763615 6759724 1147234 848777 426612 113479 -240493 -36009 44802 -49284 56526 -1087
3818 -1087 134870 200740 -20837 -272161 -265498 42657 -60812 -328930 -231721 -346069 -393587 -392402
3806 -392402 -350009 -286718 52230 111666 8992 -312084 -345748 -383490 -461786 -509062 -307035 -201471
3794 -201471 -305514 -313091 -267364 -126348 -85134 -198695 -276944 -278891 -279280 -226596 -292623 -321008 -351864
3781 -351864 -275766 -279074 -243214 -350069 -351770 -374723 -410732 -312918 -345676 -236147 -274732 -423429 -369859
3768 -369859 -350038 -322112 -400969 -368198 -298070 -199230 -292709 -351779 -353963 -402087 -373265 -398216 -304653
3755 -304653 -368752 -414937 -283744 987798 2558434 192871 -261002 -275758 -204611 -77742 -245686
3744 -245686 -474132 -482428 -439971 -444744 -363390 -457791 -396607 -449232 -485613 -555587 -495876 -417675 -416189
3731 -416189 -379401 -612244 -477923 -451821 -515331 -456122 -463179 -446528 -525149 -425561 -454834 -532204 -397305
3718 -397305 -466098 -553887 -398718 -532308 -482373 -440136 -524611 -460321 -537330 -563866 -540207 -421157
3706 -421157 -328246 -521400 -538288 -469875 -495362 -470973 -543662 -470107 -453769 -52833 663578 -334897
3694 -334897 -462389 -474275 -579206 -596579 -565343 -531618 -510401 -608694 -561069 -482136 -381228 -398710
3682 -398710 -355893 -52759 2110005 8033616 3896503 59988 -348047 -395348 -421678 -423074 -506993
3671 -506993 -430950 -496578 -546596 -484456 111982 370271 -356746 -526760 -546301 -597763 -532291 -510324
3659 -510324 -506252 -581042 -517582 -619049 -545828 -476103 -460906 -386967 -360417 -363905 1433 1161699
3647 1161699 1274061 -127198 -438970 -478242 -511977 -519402 -558545 -617529 -591501 -604399 -508176 -416927
3635 -416927 -457382 -378901 -429738 -332555 -312998 26391 592994 343040 -75335 -257184 -343294 -390946
3623 -390946 -499446 -269912 -247577 -269531 -248454 -281688 -252135 -325865 -274594 -371553 -406872 -490028 -475179
3610 -475179 -541742 -467566 -465271 -651066 -500127 -555161 -562870 -557889 -583610 -606678 -662045 -631640 -667076
3597 -667076 -613352 -576295 -631407 -621133 -617145 -640026 -621266 -582712 -581977 -542492 -683238 -700299 -652333
3584 -652333 -680741 -647712 -603324 -683172 -653615 -665978 -691662 -678785 -653984 -626421 -625023 -609228 -647022
3571 -647022 -634925 -601491 -675525 -706850 -744564 -708533 -681140 -635043 -736969 -638286 -610817 -632030 -621762
3558 -621762 -654264 -640468 -645717 -700328 -697163 -676823 -758652 -673510 -653197 -707948 -720841 -695254 -750168
3545 -750168 -696788 -738101 -716641 -711792 -592248 -664779 -614595 -667737 -684351 -689338 -632890 -566085 -590203
3532 -590203 -728102 -645549 -643526 -663307 -654364 -677700 -538270 -593170 -706428 -584403 -630883 -589309
3520 -589309 -465068 -624112 -597961 -601922 -603440 -672019 -616024 -571983 -571801 -580541 -549250 -521655 -413282
3507 -413282 -629039 -548350 -432042 -603694 -583311 -600553 -508239 -607922 -600679 -550796 -641570 -688338 -649422
3494 -649422 -666323 -622816 -615296 -706299 -695904 -643625 -654356 -584645 -591799 -628042 -597702 -606681 -606993 -477431
3480 -477431 -510071 -522232 -494768 -533994 -325960 -390467 -495462 -575004 -580623 -442265 -298924 -317342
3468 -317342 -460651 -481142 -313261 -203836 -34203 333101 181520 379762 907760 1826426 1333439
3457 1333439 721652 1024417 1960040 2493123 2256940 1884207 1847083 2486410 4184889 4506293
3447 4506293 3170112 2167568 2681617 4531172 4525461 3264495 2399879 2634963 3805637 4741752
3437 4741752 5020999 8578361 11585503 10009059 14476538 19377943 26652860 25132259 29073377
3428 29073377 30052173 36255179 36378857 47503666 45830610 47153134 50100444 59571105 53602279
3419 53602279 57494182 52299325 56968104 48886383 49275590 48237481 47678495 36954111 36149091
3410 36149091 32685773 29533035 27736639 23846785 16295971 13642392 9599735 10758731 5998142
3401 5998142 2326642 1598835 1139302 975853 994098 837296 730439 784881 624444 616138 502966
3390 502966 544061 475796 343866 344403 266006 217594 186330 186651 99269 8330 -55183 -133383 -327841
3377 -327841 -344243 -306862 -301122 -530838 -555081 -418922 -523875 -577434 -501740 -469338 -553313 -518798 -607613
3364 -607613 -598146 -472157 -487216 -498245 -198889 -461621 -391068 -133671 693533 106214 -329724 47557
3352 47557 1265638 555188 -78815 44942 708970 189686 -396934 -480197 -307150 -394927 -470102
3341 -470102 -531116 -384762 -238899 -273992 -458999 -521230 -553805 -653173 -555759 -581250 -573791 -573212 -437304
3328 -437304 -390667 -346665 -394920 -370078 -360879 -439664 -476575 -539496 -496665 -602428 -552894 -511880 -472259
3315 -472259 -379040 -327227 -207040 -185627 -356196 -376885 -464417 -505575 -427905 -374391 -451639 -337789
3303 -337789 -211299 -259741 -277744 -338758 -355637 -370257 -338939 -360392 -262897 -250445 -345332 -349678 -368505
3290 -368505 -486426 -413487 -492096 -471251 -593562 -547770 -514607 -556208 -530134 -563410 -516123 -579894
3278 -579894 -425464 -338973 -155091 -287746 -307009 -278654 -181423 -295948 -163158 -230135 -188419 -75310
3266 -75310 -162932 -231898 -151775 -64867 -158129 -143929 -182556 -84215 30920 84057 233086 1201316
3254 1201316 2820728 4141936 5293346 7964082 10619810 12375504 14914865 14588963 17990867
3245 17990867 17102331 19833615 17914347 21314572 17502476 20672505 16659433 18210522 14139799
3236 14139799 15561238 11394465 11231691 6864906 5827974 4062351 2859680 1062722 375144
3227 375144 62719 -10090 102691 -111454 -21742 59057 31022 13166 334172 856209 1326642 404259
3215 404259 929255 3290501 4610414 1628080 1571638 4615385 6933475 2303311 1418637 3096096
3205 3096096 4879521 1579882 673618 1024626 1814899 996925 1220370 1206683 1501728 2240147
3195 2240147 2388277 1236741 2954755 8885916 25074513 74023458 24014479 26578344 90663917
3186 90663917 248505831 99682212 45106276 124791432 359312151 158965094 47708786
3179 47708786 83170463 241297101 118606489 29595166 29771692 74218572 42489585 36693462
3171 36693462 47168696 35200048 15368332 7260853 4997538 4328619 4374049 6344104 14086000
3162 14086000 32907701 59640333 70714479 53889012 25427974 9396193 6289849 8679469
3154 8679469 8222567 6747318 11413877 25918820 41419832 38726986 24382702 21182479 31749513
3145 31749513 36150584 27340025 16800833 10794361 7572853 5750008 6199449 10564229 23519785
3136 23519785 44919298 63114453 61825407 40356580 19036464 10475496 10054627 11226464
3128 11226464 12949080 18009285 28071756 40632030 44931373 35383721 23953182 18375454 17587338
3119 17587338 18930718 19283621 20355184 22624274 24051177 25315914 27102584 28194366 31465273
3110 31465273 35089604 36810580 37668560 39917174 41503275 46359709 43407471 48002278 48537370
3101 48537370 53044193 54989404 55313680 51970164 53758606 52274594 50032784 48758840 44169696
3092 44169696 42268815 40960108 34474942 31420725 28753830 25356614 24866986 20084073 17788934
3083 17788934 11994014 11607955 7617072 7246263 4925057 4108713 4072288 4196126 4338315 4469283
3073 4469283 4835899 5094524 5284898 5370729 5492958 5717808 6015534 5815261 5921418 5815078 5540708
3062 5540708 5224673 4872318 4663471 4406674 4124928 3722636 3490679 3101906 2558208 2255907 1823838
3051 1823838 1365854 987131 606401 414015 63325 -103552 -178224 -189153 -263769 -198261 -169528 -224794
3039 -224794 -241482 -200755 -200112 -260022 -294401 -256727 -252043 -291229 -314513 -272878 -376747 -276099 -339180
3026 -339180 -463750 -440902 -471657 -412946 -438018 -478434 -495193 -523697 -411229 -378357 -169889 -413726
3014 -413726 -352901 62691 872657 22232 -271057 335824 1542000 158779 -233605 107929 858446
3003 858446 65140 -294362 -315062 -133560 -393748 -345575 -332336 -337474 -362892 -234944 -194719 -164975
2991 -164975 -109311 -78795 -127951 -27319 -24967 -150979 -163398 -94920 -83789 -73015 394016 753191
2979 753191 506690 1447927 2012712 2080768 2185934 2556486 3107447 3221539 2967596 3513113 4909206
2968 4909206 4251332 4330781 5401442 5569481 5023181 5081296 5131936 5331998 4602545 3768610 4283986
2957 4283986 4309276 2982244 2945901 3306139 2842516 2400043 2132999 1790592 1588124 847923 306925
2946 306925 494330 65646 -137264 -116679 127462 230275 1113529 2104440 2072289 912319 191263
2935 191263 -12522 -160736 -264899 -21374 51815 287140 1482306 3558861 3870279 2200412
2925 2200412 537662 95776 -34563 -153430 -104944 87259 102589 483439 1864619 3187276
2915 3187276 3407030 2153046 914975 1437319 2338076 2170748 907950 157195 218685 449047
2905 449047 2038228 3609655 3664684 2250064 2605628 4356300 4299793 2414342 747242 372262
2895 372262 226037 669713 1698670 1882272 1184232 927156 2464001 3693602 3600962 1991555
2885 1991555 429306 67454 -174475 -241525 -305175 -251456 -62920 537956 2249130 3784648 3105312
2874 3105312 1178915 87886 -95906 -238493 -380691 -418536 -338468 -200642 569591 1398124 1477505
2863 1477505 437298 -271339 -398366 -408786 -491024 -580640 -481867 -586060 -541575 -535102 -449622 -485298
2851 -485298 -542558 -514698 -446744 -511388 -553348 -519887 -630723 -590562 -537933 -549218 -585779 -522667 -557485
2838 -557485 -515264 -577942 -556947 -514447 -567213 -559314 -646003 -651703 -576469 -541562 -505531 -335975 865885
2825 865885 2728605 -301539 -410994 -533240 -585433 -523957 -631379 -515993 -569006 -492888 -508121
2814 -508121 -684766 -539363 -482019 -553726 -655444 -542983 -514401 -601946 -554047 -596261 -573335 -677495
2802 -677495 -568710 -629645 -622759 -543528 -438907 -515218 -552892 -619089 -516288 -523509 -532311 -590272 -547250
2789 -547250 -539510 -520846 -480913 -589586 -519634 -456663 -553185 -493105 -532922 -509751 -454943 -551176 -506755
2776 -506755 -496822 -441273 -513782 -571986 -590889 -467665 -460718 -511648 -494259 -565241 -462209 -389391 -467494
2763 -467494 -444388 -517442 -541039 -480210 -426813 -572728 -484965 -554262 -511751 -546173 -475740 -443302 -391214
2750 -391214 -462510 -462875 -491482 -508400 -532918 -401019 -443322 -534036 -396519 -472680 -451934 -449199 -464553
2737 -464553 -548549 -434873 -453037 -402195 -396574 -335581 -389724 -420738 -448784 -472275 -376669 -539583 -429543
2724 -429543 -434658 -478912 -497713 -472487 -389130 -460771 -488413 -389699 -417115 -455958 -471566 -472543 -500120 -404721
2710 -404721 -433618 -476942 -484267 -476032 -473773 -409612 -527026 -464468 -435690 -551604 -466732 -389626 -440273 -439582
2696 -439582 -500951 -475709 -463792 -488449 -393830 -482146 -553050 -500431 -464544 -421339 -489898 -526513 -501914
2683 -501914 -467553 -532614 -569099 -537466 -589388 -475187 -360726 -447860 -454871 -493713 -504704 -493809 -481458
2670 -481458 -478000 -500712 -570325 -501530 -458907 -567787 -521490 -529466 -515244 -535906 -485819 -464444 -510648
2657 -510648 -464578 -464670 -509329 -587139 -488625 -527484 -495946 -552350 -620890 -519434 -495293 -524105 -521306 -554841
2643 -554841 -461030 -580529 -615417 -527268 -484921 -458995 -568755 -562788 -560594 -638167 -532924 -572387 -650483
2630 -650483 -598818 -640161 -582178 -598779 -550768 -549664 -532357 -506979 -521142 -572131 -514116 -583280 -498665
2617 -498665 -568495 -511400 -549200 -597514 -675393 -581907 -555550 -570805 -656175 -610505 -610380 -568222 -601549
2604 -601549 -635825 -511370 -575331 -533596 -531919 -636374 -529171 -564276 -622709 -580474 -565664 -611949
2592 -611949 -498585 -530718 -526101 -535598 -588559 -594476 -516534 -542553 -617734 -505715 -545118 -487279 -560446
2579 -560446 -546860 -552136 -562649 -624851 -528986 -560471 -488202 -581978 -532153 -608557 -556455 -422554 -530899
2566 -530899 -436633 -451108 -587116 -514648 -564493 -555431 -509410 -565534 -582463 -544468 -568337 -429620 -463236
2553 -463236 -489429 -537595 -546334 -549595 -520249 -469384 -494858 -491217 -487290 -447559 -454995 -383085 -436736 -324801
2539 -324801 -421869 -342566 -385909 -480037 -477194 -522442 -434724 -500199 -312133 -434614 -404932 -367526 -355336
2526 -355336 -206182 -307688 -501175 -448144 -449002 -528433 -505182 -451425 -480641 -432929 -374829 -427965 -520852
2513 -520852 -515435 -546698 -527812 -479355 -514476 -448173 -468035 -439512 -480431 -561700 -451726 -422997 -549881
2500 -549881 -433603 -295125 -188113 3607 149585 144072 -10189 -170830 -293659 -412947 -403674 -354751
2488 -354751 -325090 -278097 -329672 -539359 -457478 -459983 -491783 -497274 -464686 -418749 -520611 -464381 -401713
2475 -401713 -432403 -441789 -470602 -399130 -450895 -472461 -461041 -455023 -278156 -169050 -245373 -388013 -377118
2462 -377118 -447573 -363045 -467982 -458230 -481660 -478250 -558981 -494851 -394955 -414247 -446409 -377051 -407603
2449 -407603 -288595 -400666 -379949 -359928 -288316 -368011 -352734 -376986 -393765 -386962 -392954 -318938 -337141
2436 -337141 -329937 -271104 -298696 -342197 -260254 -262418 -282733 -193986 -254864 -231448 -294683 -188954 -165565
2423 -165565 -149938 -181455 -133084 -164922 -154162 -118817 -99706 -190607 -198394 -150469 -79055 -168217 -207077
2410 -207077 -183364 -179661 -58035 24400 132406 81413 60891 73909 69549 57610 93570 67699 11531
2397 11531 126755 204783 270244 354694 306700 283780 418129 398895 481559 444510 508006 517281 694110
2384 694110 959448 1149577 1813131 4495787 8905301 11979801 11275454 7919317 7197441 6902077
2374 6902077 6441205 5618327 4067613 3950510 4558532 6398655 10713790 14272980 15282580 12177410
2364 12177410 9649175 9854463 9776989 7958304 6428003 6464920 6760740 8246048 11135738 12921753
2354 12921753 13802619 15558284 21202685 26030304 25629867 24260426 23458430 27493301 34282506
2345 34282506 38380338 39950636 39882413 38442750 36761142 35027894 33422064 29354357 22291666
2336 22291666 15078227 11700418 9365749 7344531 6099794 5280996 4455125 3889180 3404640 3173423
2326 3173423 2866149 2842095 3443169 3628939 2493307 2148706 2180187 3196133 4938831 4449516
2316 4449516 2547440 1964339 2303434 3756299 4290351 2945865 1443910 1142620 1244485 1888639
2306 1888639 1369549 982298 1933438 1943872 767380 462499 899433 3204169 7307017 3405445
2296 3405445 1100973 986689 2512130 4686809 3378447 1186895 796082 1352662 1533356 635489
2286 635489 205962 59019 13943 26213 -127148 -181747 -136027 -142115 -91807 400161 1452885 1144942
2274 1144942 258990 199659 439043 2354703 4542986 2169319 554477 816223 2366839 3990517
2264 3990517 2477763 604851 489903 1086032 1009429 176927 -160020 -165694 -171500 -298481 -250727 -241600
2252 -241600 -309596 -318220 -228544 -236963 -295059 -336945 -295190 -258900 -347639 -252969 -361391 -322853 -303363
2239 -303363 -254904 -309759 -258187 -375157 -271411 -252372 -249031 -218308 -268613 -249508 -264106 -257682 -162558
2226 -162558 -238173 -163458 2308 27206 -26823 -149278 -212398 -106871 -129860 -99665 -74038 6961
2214 6961 101530 286895 295215 60520 18272 -74342 -62560 -15603 -66990 -56934 72146 34650 153421
2201 153421 117754 53820 100297 180248 298747 238557 213792 220960 361244 387591 534548 515848
2189 515848 253560 359495 356878 270552 111107 84139 189026 162800 298341 371632 205851 136567
2177 136567 40545 48545 94571 65184 85214 146643 261814 132678 19674 -59410 -245 -31763
2165 -31763 188967 109021 -98306 -171586 -154290 -80303 -31266 125269 252035 -7559 66953 43989
2153 43989 -85962 -99571 -150826 -223210 -248517 -247950 -143604 -153979 -257361 -228710 -256260 -234822 -249455
2140 -249455 -201691 -202667 -256412 -334165 -307330 -316528 -190169 -265736 -165683 -205029 -161081 -179759 -231029
2127 -231029 -172162 -220585 -151198 -134006 -127434 -144235 -153020 -199693 -49066 -50053 -31413 -8350 76477 21312
2113 21312 -118182 49 15105 4979 69915 114237 89894 18433 115936 86662 240492 293957 344850
2100 344850 402148 493599 631673 588085 646235 727998 855385 913577 938548 1112818 1139972 1327242
2088 1327242 1409800 1467233 1516191 1537282 1616712 1755245 1882908 2014340 2193374 2397628 2616842
2077 2616842 2932213 3172118 3565540 3972860 4667296 5318322 6032080 6470994 6928201 7615450
2067 7615450 8622460 9399259 10512427 12175185 15441054 20274615 24968195 25609772 23632298
2058 23632298 22044572 21269632 21393305 22122397 23516178 24711117 26554866 28943517 32012792
2049 32012792 35449577 39642891 46432051 59619706 77515712 94419663 96928470 87591914
2041 87591914 83117384 82232022 80305950 77844515 77175457 82139207 92016682 102229422 101684997
2032 101684997 89990321 79631261 74734631 75897559 79288109 81451567 84819864 91228240
2024 91228240 101698650 112190676 120546203 127366098 131135198 136355122 137266745 119321961
2016 119321961 98874644 91110005 91761275 102223963 116244766 117274112 105104378 99422022
2008 99422022 103713635 96437272 82311484 81237669 93036347 108938596 126064368 132556644
2000 132556644 121822512 100834813 82157564 69150715 59257702 50734951 45407272 43515911
1992 43515911 43958539 44496851 43331243 39303810 37369119 48294825 62728318 54647980 38525914
1983 38525914 33345460 33003138 34549316 34068949 32016401 30088655 36957787 48786204 42960376
1974 42960376 26807174 18872785 13645827 9533342 7640437 6707138 6275325 5612168 5083533
1965 5083533 4440160 3752614 3353883 3020169 2767500 2793389 2796172 2607908 2209991 1932176 1864941
1954 1864941 1790410 1697109 1645111 1613415 1701484 1809887 2110379 2472490 2395343 2032070 2363109 2059718
1942 2059718 1735499 1607871 1577508 816899 538748 432705 461999 435486 345806 334182 314030 291755
1930 291755 232631 221214 380570 566321 473848 330586 128923 135188 161317 89291 138811 71055
1918 71055 11606 95857 -4532 -8900 -21603 44859 33980 -53412 -80029 -19175 229104 205471 24387
1905 24387 712 69222 36693 39047 1443 8486 -14576 -57938 -44196 -105722 -3307 20230 -22889
1892 -22889 47956 77293 14766 108519 45487 39782 -12239 111010 149218 121993 116425 28457 44347
1879 44347 136301 117566 144500 158622 179421 134801 146992 184131 213111 179387 172318 338998 283261
1866 283261 337810 291621 424603 482411 568800 544090 671709 558730 546333 519332 389249 416236
1854 416236 426911 398587 444301 614480 779193 750015 601642 514072 482848 650843 747234 702891
1842 702891 682194 573794 644190 549247 423989 423734 461812 491529 686941 538551 452036 543458 575232
1829 575232 593464 718033 704825 620062 735593 831518 780449 557640 540570 542613 551646 653851
1817 653851 546566 469943 343634 258318 259453 297081 178445 316955 224975 279565 290177 315256
1805 315256 358529 290343 518942 573689 462342 258097 304570 162425 189084 207605 202841 169069
1793 169069 355635 360136 404011 157383 203548 182515 224022 291514 250658 63365 144601 202145 188965
1780 188965 175902 250482 248185 253803 272725 287047 257725 239364 176587 207765 245774 194539 237409
1767 237409 146484 170683 126156 118181 162868 193700 212912 145686 268973 196991 322740 328257 370154
1754 370154 289452 318438 309938 334735 331529 286588 219959 193422 271170 233690 342857 312063 204968
1741 204968 264966 306726 272304 327908 415681 439220 671155 1409033 1757399 964047 579522 647204
1729 647204 1033062 2604659 3212960 1709012 893966 1442033 3389362 4055168 2603127 1422311
1719 1422311 1162447 2673443 5602545 4939678 1867381 1104859 1586621 3290511 3989066 2574227
1709 2574227 1234718 1085592 2250860 3219470 1940596 829594 633177 907401 1522402 1552323
1699 1552323 997511 555566 546290 453012 502438 566721 477098 551168 602462 622947 629131 692977 1101613
1686 1101613 1799345 1703599 1073477 980119 1218548 2324376 3276551 2288898 1122909 1076228 2011033
1675 2011033 4169333 4097176 1944926 1386567 2260516 4804476 5282545 2624205 1381388 1699580
1665 1699580 2782114 3925336 3256784 1654229 1191705 1850236 3089125 2605539 1314475 1026417
1655 1026417 1314801 1694420 1383714 1058662 742474 717057 658351 710206 715301 694518 570326 679440
1643 679440 780497 802310 746599 639530 763145 748160 856144 746275 715422 620144 678583 814186
1631 814186 1043231 1083396 842064 939208 891714 946080 937048 961935 924134 846358 746467 780979 835827
1618 835827 814658 794922 959300 1012265 1124434 1136811 1172981 1170567 1291996 1444267 1884339 2537543
1606 2537543 3254149 5137734 7293815 9927547 10389922 11523273 13981972 14503607 17150596
1597 17150596 12162834 11103694 8218105 10166440 7610239 6556480 4388201 3235440 2959414
1588 2959414 2535101 2376995 2784063 2942543 3871477 4457537 7734860 9474078 12874783 11088950
1578 11088950 13636811 16501966 20270271 20408492 18348558 16255606 13689819 14043521 9425424
1569 9425424 7034493 4425314 3889489 3039038 2473136 2199181 2462263 2349601 2267971 2384268 2389130
1558 2389130 2192577 2206322 2107757 2168635 2230832 2251428 2445633 3102961 4679908 5525083 5641709
1547 5641709 4876405 4502684 6854519 8611750 8508024 6737232 4532347 4861641 5731448 5665420
1537 5665420 4927088 3611647 2908458 2785840 2951391 3240861 3354786 3471785 4642520 6344461
1527 6344461 7018780 7164949 6455302 6965069 10034105 11364373 11081478 8667368 6354972 7290403
1517 7290403 7771431 7671326 6335563 4943485 4736221 5353712 7186708 12957278 18924940 16007155
1507 16007155 11421771 13232582 21538401 31596193 33628697 35265140 32118059 25139907 32124175
1498 32124175 51605692 63001304 64111828 54998418 42804340 52483271 47369823 49322525
1490 49322525 41172738 38330514 32876160 28897834 34201657 40937470 47017904 49706102 78878329
1481 78878329 74155286 75788392 85227532 78267538 52229980 47547157 59975217 63308711
1473 63308711 45624079 26318651 20212910 23604427 29164668 25564454 18705119 15488085 21884535
1464 21884535 47304294 44988564 48572197 20190616 11821075 11070180 13274687 24651568 32799516
1455 32799516 33596656 32413320 47063261 53133596 55142702 31518748 15870423 14554073 18110944
1446 18110944 34371057 46435151 46645658 37406726 18672277 16350630 17673970 17984734 18539598
1437 18539598 20646170 22564799 23155821 21721769 21415906 23657753 27452391 31849543 34300804
1428 34300804 34220159 38840584 43921571 40495203 38053718 39765760 37405312 34093089 38398311
1419 38398311 39395157 37615443 42682433 45620497 50728412 50967914 58961245 61432068 59639470
1410 59639470 59290397 59776395 63973183 67626369 68401805 69395807 71155779 74711095 79189515
1401 79189515 83913401 90290962 98572777 107617412 113819074 120752163 130073602 132368754 139102188
1392 139102188 136125400 139396710 147038074 157723412 170980061 179764135 190496157 196473997
1384 196473997 204885196 215708998 226049398 233377705 237085926 237363646 233419567 226113984 218412488
1375 218412488 211758640 206809714 204545086 206696120 213508533 224043245 235819388 244108936
1367 244108936 241505040 228577881 212036002 196574109 184370689 174935341 167285084 161393129
1359 161393129 154378958 146917278 135047903 126940299 120025993 118181266 114007250 112751310 110311847
1350 110311847 110464078 109665929 109713260 109663119 111445328 114382661 118187075 123155409 131006172 139703465
1340 139703465 145928733 146430892 145177647 147671649 154987041 162534776 165411063 171315741 180150763
1331 180150763 185277915 184138088 175104112 172419094 171127201 177711342 171592912 166043851 165054219
1322 165054219 173194841 182312359 188652921 192048837 193261030 195558209 199088247 208774900 221681201
1313 221681201 232972748 241468486 248675260 266194017 276910721 288501313 280866274 278355624
1305 278355624 276063445 282881118 284756860 294414586 311631205 340611460 380884271 432258389
1297 432258389 497620733 574916395 660357926 750076363 841733312 941861280 1058184507
1290 1058184507 1193086662 1346372946 1516782034 1694207616 1826191017 1834387144 1707753693
1283 1707753693 1516431819 1298859647 1061521170 834886367 646903275 502933847 397529792
1276 397529792 320581318 263754145 220671578 187607177 162234439 142211874 125592403 112015505
1268 112015505 101131124 92701737 86214777 81657871 78113131 75429703 73032554 71251644 69846112
1259 69846112 68596120 66112949 61795166 56308054 50660919 44788646 39144134 34240839 30111095
1250 30111095 26697319 23826635 21234409 18945420 17130075 15672045 14479335 13508836 12831083
1241 12831083 12170951 11384676 10489858 9566425 8799871 8203561 7685908 7253939 6826794 6553038
1231 6553038 6203454 6041773 5701777 5253911 4822068 4541243 4242035 4148531 3993474 3802509 3583972
1220 3583972 3377067 3140406 2938924 2926562 2707113 2555807 2535088 2445631 2256681 2041280 1922971
1209 1922971 1794391 1694543 1588839 1601200 1516212 1332081 1240568 1230767 1245925 1316427 1322260 1381598
1197 1381598 1539176 1540566 1687352 1877735 2014397 1809773 1709971 1625622 1545997 1377548 1310929 1151184
1185 1151184 1135960 1069485 1022195 945713 1002148 930753 1005207 1028766 1026774 1132717 1245189 1265604
1173 1265604 1652343 1861110 1414902 1354283 1448183 1319783 1345151 1329726 1234362 1224094 1184469 1185725
1161 1185725 1141070 1188257 1298469 1314130 1385157 1486108 1485660 1662835 1902298 2169684 2204183 2171597
1149 2171597 2322920 2220228 2244950 2207173 2270074 2035605 1899884 1807655 1883928 1934525 1912278 2002937
1137 2002937 2057974 2157403 2104476 2191317 2397815 2541581 2713975 2821287 2996628 3119717 3197794 3217947
1125 3217947 3206738 3092992 3160645 3079958 2994159 2891892 2877756 2871733 2867856 2921196 3012329 2949583 2942295
1112 2942295 2970392 2999156 3037171 3001032 2963115 3047431 2974260 2799395 2659322 2522813 2402651 2259670
1100 2259670 2205413 2169976 2012302 1955508 1967408 1978314 2013964 1834458 1878047 1850655 1809047 1741134
1088 1741134 1701645 1615997 1460597 1334418 1268426 1162045 1119170 1008240 972920 983745 852517 801568
1076 801568 782291 695509 740348 692486 728764 741025 791149 1009255 1286128 1335886 1181923 881987
1064 881987 808338 859810 698551 736486 679667 596171 569214 573075 458529 534352 534815 611517 785911
1051 785911 1738100 3670275 2706128 1146420 548162 361648 176207 47140 81831 141959 56501
1040 56501 68360 97157 15004 42278 47145 15107 133779 275186 596524 826394 709944 373996
1028 373996 80744 -57904 -133493 -228536 -188059 -202049 -94242 -212868 -261478 -410801 -524560 -498710
1016 -498710 -372465 -289297 -354197 -324055 -363148 -425696 -451981 -470259 -417478 -332058 -372100 -335258 -251718
1003 -251718 -334098 -401402 -427304 -390586 -450558 -428678 -399495 -381662 -448263 -363098 -413355 -353388 -293871
990 -293871 -360748 -260988 -246641 -237400 -87317 -110311 -80289 -202704 -217413 -195022 -196803 -230633 -133315
977 -133315 -20029 -22774 102999 112579 82551 133791 286192 322231 412559 438527 507621 512219 404617
964 404617 410564 482379 451853 410836 398113 476613 617291 710586 919787 992082 978343 979329 1003904
951 1003904 1043775 1161697 1216137 1072141 1146888 1302666 1319352 1381237 1465704 1547871 1678475 1868646
939 1868646 2050780 2198973 2766764 3107730 2594746 2666695 2978587 3174808 3526306 4281463 5659620
928 5659620 7536435 7759666 6917935 6463390 6300148 6408348 6454167 6603081 6715585 6800027 7180650
917 7180650 7546035 8108722 8808151 9752905 11208343 12976399 16398510 24536569 34392675 29701344
907 29701344 28167767 31483854 37110079 47289561 68212217 116471878 205669063 252961776
899 252961776 203718524 157280737 129783016 113293172 104377445 96050611 88541142 82714640
891 82714640 79321286 77514606 79381475 85246486 91791419 101451059 123755708 177356574
883 177356574 354197467 831804666 613990734 244361000 139659362 94725633 70647291
876 70647291 58953328 59668829 56917009 48154406 42072261 40148198 41889317 46769946 53131545
867 53131545 61196013 75074264 104313026 169191698 283422132 295241967 172117477 85182586
859 85182586 48580072 33547924 26784059 26575248 33616145 32015981 19682597 13858032 11075261
850 11075261 9630539 8574302 8149215 7721513 7015643 6417122 6208512 5606719 4981110 4950579
840 4950579 5140687 5747844 6619715 7795676 9039532 9641444 7487770 5484902 4426064 3886222
830 3886222 3675672 3711755 3771532 3556144 3294575 2578828 1877142 1582945 1486257 1498044 1390244
819 1390244 1219319 1097976 953374 649780 464640 370499 463214 368778 273178 395505 358445 359986
807 359986 336163 209177 49233 249926 280818 144912 -9049 -22432 -127540 -110098 -79096 -144346
795 -144346 -150993 -150161 -202805 -163250 -21058 -106292 -184208 -405488 -488855 -498182 -488220 -468254 -584303 -665854
781 -665854 -704892 -699940 -724640 -800005 -703074 -683682 -609432 -588027 -663517 -544967 -585408 -576128 -589203
768 -589203 -676325 -652595 -656460 -651355 -693024 -623019 -705322 -703220 -752363 -702852 -829232 -786823 -772580 -692834
754 -692834 -835038 -784666 -774764 -710501 -642912 -757308 -688295 -719243 -612479 -672829 -811008 -763393 -857395
741 -857395 -850343 -794126 -801758 -762498 -690640 -775222 -835226 -659396 -709355 -555615 -493317 -108399 572669
728 572669 528272 147467 -172494 -368387 -507782 -532903 -570987 -542080 -565985 -535207 -535987 -534690 -527544
715 -527544 -566237 -500024 -322362 10814 986658 3525049 2337687 349289 -205165 -533791 -652204
704 -652204 -747505 -758670 -720719 -787177 -852152 -857617 -833468 -817582 -827722 -811610 -790878 -570580 -166709
691 -166709 655597 958046 -80924 -536370 -836742 -883136 -914838 -872867 -955911 -809827 -998045 -1083893
679 -1083893 -1038146 -921063 -961586 -1099422 -1052700 -1056686 -972251 -1021109 -1110243 -1037101 -1083856 -1057870 -1001493
666 -1001493 -1014814 -1047525 -1070557 -1030227 -1075841 -1107844 -1126179 -1099128 -1096640 -1090803 -1108905 -1139954 -1143552
653 -1143552 -1037733 -1038363 -1136454 -1142242 -1044981 -1108184 -1078178 -1088849 -1023186 -1149188 -1149985 -1105646 -1072732
640 -1072732 -1197663 -1074507 -1116518 -1131093 -1140789 -1069221 -1100824 -1099702 -1164057 -1065798 -1051586 -1099001 -1048636
627 -1048636 -1056471 -1071834 -1057790 -1092862 -1172511 -1072847 -1052551 -1094730 -1087419 -1074702 -1117034 -1056515 -1110694
614 -1110694 -1050993 -1153021 -1175543 -1190895 -1154876 -1150603 -1105086 -1239218 -1187496 -1085804 -1147554 -1169364 -1133454
601 -1133454 -1199422 -1171393 -1216462 -1052930 -1152054 -1220589 -1156654 -1162197 -1082642 -1065568 -1085585 -1132728 -1132979 -1130775
587 -1130775 -1228941 -1163489 -1161007 -1082224 -1131531 -1115827 -1188942 -1086278 -1038999 -1084389 -1119578 -1109899 -1192714
574 -1192714 -1166727 -1145297 -1208886 -1161447 -1033797 -1099744 -1027149 -1088797 -1136608 -1164636 -1045157 -1090813
562 -1090813 -1200701 -1146279 -1159986 -1180700 -1089544 -1192054 -1253869 -1152022 -1233155 -1153963 -1205577 -1109604
550 -1109604 -1173771 -1127381 -1092928 -1073349 -1105057 -1116953 -1144254 -1128148 -1084512 -1138322 -1119312 -1095216 -1078961
537 -1078961 -1081234 -1144800 -1142524 -1135452 -1092339 -1090408 -1118126 -1169397 -1066523 -1120432 -1186441 -1147262 -1163089 -1161801
523 -1161801 -1136821 -1094318 -1148376 -1091843 -1186809 -1116776 -1126517 -1145136 -1098706 -1165024 -1104247 -1131143 -1119897
510 -1119897 -1170519 -1053972 -1075132 -1113926 -1066438 -1216892 -1155624 -1153511 -1124507 -1065143 -1081441 -1151846 -1158749
497 -1158749 -1156500 -1230227 -1081228 -1121084 -1084337 -1184859 -1203097 -1166381 -1072123 -1073980 -1095983 -1079628 -1114511
484 -1114511 -1013456 -1151570 -1128646 -1122980 -1075855 -1150144 -1165912 -1087994 -1036943 -1061075 -1082119 -1163035 -1181884
471 -1181884 -1195572 -1142280 -1206245 -1099627 -1097614 -1118785 -1065830 -1061672 -1082164 -1068240 -1081402 -1137822 -1041087
458 -1041087 -1116098 -1061935 -1115523 -1088544 -1029063 -1155219 -1066712 -1070728 -1102367 -1087573 -1021435 -1077001 -1080529
445 -1080529 -1100478 -1073799 -1016435 -1055800 -1085207 -1060149 -1070154 -1030608 -1075997 -1064786 -1036556 -1105489 -1111137
432 -1111137 -1066635 -1142823 -1122579 -1067500 -1062421 -1071570 -1087700 -1113456 -1176074 -1016588 -1105582 -1136889 -1077127 -1077447
418 -1077447 -1070021 -1067451 -1111874 -1029097 -1106639 -1085591 -1111284 -1054695 -1120326 -1001379 -1064467 -1080834 -1001958
405 -1001958 -1038023 -1054741 -1071601 -1064134 -1017425 -1039555 -1098482 -1037941 -1090660 -1053726 -1027936 -1096535 -1075780
392 -1075780 -1102316 -1086473 -1031282 -1013247 -1029714 -1053674 -1054834 -1135946 -1079567 -1119273 -1136420 -1112866 -1090624 -1091360
378 -1091360 -968721 -968728 -1089111 -1027357 -1011888 -1033957 -1078105 -1068235 -1050042 -1062104 -1043518 -1033660 -987292 -1115287
364 -1115287 -1061054 -1150973 -1017108 -1064946 -1020931 -1069853 -1023591 -1077945 -1120469 -1027386 -1140317 -1081496 -1008384
351 -1008384 -1088562 -1027164 -1087605 -1049719 -1050854 -1106672 -1076844 -996682 -1084632 -1023984 -984792 -1082096 -1007775
338 -1007775 -1094562 -1074435 -1113589 -1120417 -1089443 -1168815 -1063496 -1095296 -1118102 -1100012 -1066105 -1016947 -992026
325 -992026 -1058105 -997580 -1059708 -987009 -1132741 -1099004 -1106097 -1044270 -1055799 -1036190 -1044393 -1020173 -1036081
312 -1036081 -1060175 -1046565 -1113991 -1063590 -1106467 -1146184 -1167946 -1122647 -1052506 -994738 -964577 -1088918 -933144
299 -933144 -1082867 -1103038 -1040413 -1010417 -1043428 -882361 -1004396 -988123 -1020077 -1104668 -1035218 -986809 -1035316
286 -1035316 -1054143 -1088455 -1091349 -1033398 -998690 -1001309 -1071141 -1104600 -1039451 -1004195 -972541 -936327 -1021993
273 -1021993 -1049954 -1046116 -998447 -1022123 -964481 -1019638 -969402 -927171 -989531 -1132057 -1003162 -1060595 -986488
260 -986488 -1054393 -1084831 -991259 -1024908 -1045999 -1009873 -1022508 -999617 -922537 -1010750 -965302 -979878 -965567
247 -965567 -948910 -1055903 -1013252 -935199 -1034513 -955331 -944967 -1019646 -1038339 -1040487 -1000176 -998928 -1021892
234 -1021892 -938279 -1018226 -1013530 -869722 -1024565 -1042488 -960635 -1028677 -936639 -1046102 -1029559 -930995 -974513
221 -974513 -905670 -943514 -895576 -992013 -1038864 -991521 -952327 -975481 -960478 -961335 -1035612 -1006833 -927739 -996334
207 -996334 -1029984 -1020140 -929285 -939494 -933940 -961941 -925702 -952345 -995291 -988108 -1011940 -988399 -987291 -986078
193 -986078 -900429 -915227 -975469 -900530 -1015527 -955204 -903417 -982558 -954248 -985917 -1023744 -902667 -907147
180 -907147 -1000092 -972638 -937089 -912424 -909553 -924160 -971094 -956338 -995689 -832371 -915076 -953132 -881833
167 -881833 -831201 -949241 -938446 -899884 -548026 86240 1159333 1477267 691227 -302800 -651727
156 -651727 -833611 -872978 -844988 -916718 -910645 -879713 -890903 -923842 -911743 -887194 -926968 -958858 -963745
143 -963745 -881818 -923983 -872467 -850941 -852425 -948308 -1130246 -930636 -999610 -927378 -923512 -839091 -924010
130 -924010 -919826 -991029 -956775 -820727 -894407 -967431 -937828 -871499 -810677 -827952 -937750 -1007857 -918055
117 -918055 -894269 -917222 -926243 -882846 -915339 -801533 -828004 -892468 -822567 -855624 -785238 -791022 -875169
104 -875169 -853744 -894585 -845960 -837393 -785277 -804064 -759986 -902794 -882682 -765594 -847975 -920247 -1010687
91 -1010687 -931271 -814884 -791195 -768282 -862878 -715403 -619400 -705347 -789000 -667058 -824154 -924364
79 -924364 -936346 -782600 -711379 -708798 -708872 -690222 -511055 -499407 -743750 -776320 -775419 -762454 -762945 -787192
65 -787192 -756792 -696662 -789042 -737774 -661515 -556540 -500582 -435494 -475172 168996 233320 -512808 -591840
52 -591840 -442747 -572761 -578455 -473526 -493335 -429762 -619538 -654594 -674293 -584571 -370741 -381626
40 -381626 -9059 84068 231951 -224133 -449733 -391832 -260850 -182406 393886 761957 1938966
29 1938966 8015098 16373934 4673148 1639683 1332358 1478024 1229840 298705 570476 2188222
19 2188222 5314856 2070871 2232585 2407446 2072965 2918132 3637246 7933076 22833927 15371910
9 15371910 4855438 4473506 9474720 13581392 19979832 33255825 67469486 212015124
1 212015124 794375685 413749452 66782311 26185467 13382071 6392052 3313054 4953281
-7 4953281 6353224 5405756 16112654 13091262 1954879 290870 -79597 -601260 -1121019 -811102
-17 -811102 -253092 -504350 -688134 -801241 -1303736 -1591926 -720969 -31110 2213086 11302070 10426973
-28 10426973 892396 -296782 -873056 -1000669 -951328 -838737 -641081 -915551 -918281 -922199 -1315119
-39 -1315119 -1196463 -1118821 -1035132 -884386 -1098392 -989073 -1019060 -1250868 -1142645 -1294003 -1315979 -1232502
-51 -1232502 -1260557 -1129241 -969396 -923626 -1018297 -1148884 -1353871 -1186359 -1157696 -1254936 -1130241 -1091349
-63 -1091349 -1093467 -1043802 -1066041 -1126416 -1129645 -1076506 -1122460 -1161884 -1100656 -1089744 -1156054 -1284455 -1280342
-76 -1280342 -1159487 -1099447 -1036582 -1006323 -1190407 -1221689 -1133862 -1288949 -1233604 -1170516 -1117265 -1101465
-88 -1101465 -1213579 -1083194 -1151220 -1031629 -1112754 -1103108 -1140557 -1065846 -1111211 -1080144 -1078078 -1098984 -1126639
-101 -1126639 -1120815 -1089779 -1080831 -1128280 -1155985 -1168850 -1135493 -1125052 -989632 -992429 -1091244 -1074485 -1177483
-114 -1177483 -1088447 -1031640 -1060337 -1023621 -1011212 -1035584 -1182921 -1180923 -1060678 -1068463 -1098663 -1083288 -1082675
-127 -1082675 -1041204 -1127591 -1026681 -1062671 -927582 -937494 -1048397 -1011079 -894338 -938206 -1103314 -1088509
-139 -1088509 -1090970 -1076011 -1035306 -1053185 -1016407 -1058227 -1065984 -1002666 -1046989 -1079584 -1031229 -1108811 -1067601
-152 -1067601 -988294 -1019485 -996662 -1062917 -1009284 -995650 -923285 -794813 -275618 619596 1293255 899195
-164 899195 -184930 -853453 -1039261 -961510 -966002 -996916 -1004989 -1055217 -933413 -1086553 -1027885 -1076118
-176 -1076118 -1084352 -1028732 -1005308 -1059228 -1154378 -1076735 -1133038 -1092255 -1030198 -1058026 -1095760 -1030879 -983285
-189 -983285 -1076424 -1028898 -1028680 -928934 -945392 -1065571 -1022761 -1014418 -1020945 -1121407 -1025824 -1122930 -1008350
-202 -1008350 -1124414 -1069676 -1049885 -1174175 -1169357 -1091394 -1146764 -1038327 -1046064 -1024522 -990033 -1021377 -1087351
-215 -1087351 -962901 -1023259 -1046031 -1057542 -994341 -1070908 -1080810 -1082283 -1030227 -1059578 -1171779 -1094759 -1129867
-228 -1129867 -1082808 -1053406 -1116259 -1071136 -1140270 -1128084 -1149619 -1054883 -1118931 -1018906 -1049252 -1085246 -1040594
-241 -1040594 -1037121 -1107670 -1046523 -1035961 -1030966 -1077805 -1065802 -986856 -1072034 -1033199 -1087285 -1021567 -1028747 -1032854
-255 -1032854 -1077453 -1022245 -1090913 -1009672 -1055925 -1113477 -1087615 -1068302 -1088639 -1028131 -997731 -1008755 -1041926
-268 -1041926 -1067641 -1116723 -994284 -989417 -1085106 -1071816 -1065192 -1075192 -1110296 -1110286 -1141090 -1076676 -1117614
-281 -1117614 -978644 -1108591 -1048458 -1056456 -1110938 -1046632 -1003894 -992955 -1020373 -1085220 -991060 -1003701 -1005286
-294 -1005286 -1108687 -1077218 -1069518 -1048561 -1014749 -1086439 -996156 -1038834 -1039427 -995593 -926947 -1075174 -1022469
-307 -1022469 -1051258 -1043589 -1016649 -1065104 -1052887 -984377 -998293 -1021996 -1028910 -985825 -1123367 -1005986 -1117703
-320 -1117703 -1084231 -1020177 -1048575 -1051824 -1031827 -1138837 -1109804 -1108267 -1015871 -1025784 -1025921 -1016437 -1080111 -1056898
-334 -1056898 -975951 -1008016 -1011212 -1070314 -1133399 -991890 -1063049 -988041 -1046257 -1044130 -1083578 -1070236 -1071693
-347 -1071693 -980729 -1047994 -1028654 -1027279 -1039054 -1045976 -1014167 -1078372 -1042729 -1089727 -1033409 -1015512 -1070204
-360 -1070204 -1053364 -993377 -1045921 -1022954 -1047352 -1084468 -1116725 -1083011 -1089097 -1016178 -1023998 -1088194 -1020320
-373 -1020320 -1016899 -1119112 -1034412 -1076470 -1038292 -1060610 -1030154 -985743 -974245 -1052328 -1044871 -1020487 -942789
-386 -942789 -1026577 -1051731 -1069550 -1064770 -978487 -1050206 -1125113 -1040044 -1014478 -1006073 -1010630 -1039718 -1072528 -1086243
-400 -1086243 -1040127 -1057163 -1056309 -1088211 -1045496 -1001202 -998778 -1099368 -1028286 -1030012 -1091288 -1008992 -968532
-413 -968532 -990066 -1026228 -938879 -1036414 -1020844 -965935 -1037782 -1107344 -1007415 -1078689 -1033324 -962486 -1004502
-426 -1004502 -1093933 -983129 -1015146 -1029150 -982561 -943957 -973450 -1037367 -1103889 -1118853 -1076217 -1060060 -968199
-439 -968199 -1073534 -995005 -1105342 -1033776 -1000702 -977000 -1016680 -1002441 -924007 -985846 -1033968 -1019300 -1006905
-452 -1006905 -1028453 -999876 -974986 -1042989 -984056 -1033640 -1095796 -1145422 -982711 -1001264 -980479 -1035802 -1078956
-465 -1078956 -1080317 -1026354 -987226 -1062432 -1019487 -1025753 -976280 -1046938 -992954 -1010317 -978503 -985798 -986599 -1017102
-479 -1017102 -1019292 -1035645 -961804 -986415 -982177 -1018555 -1087151 -1058073 -989570 -1004094 -1013598 -968972 -970860 -1054565
-493 -1054565 -1007011 -1014012 -939814 -968480 -953336 -956114 -989940 -1060424 -989635 -981320 -1009171 -1059231 -1065871 -1008564
-507 -1008564 -1010960 -990563 -991835 -982808 -1077073 -1090481 -976346 -947480 -1016830 -971385 -992212 -997467 -1004990 -974314
-521 -974314 -915689 -1068559 -1039148 -991516 -1002894 -1060789 -1042853 -1045789 -975802 -957248 -940397 -939805 -981971
-534 -981971 -1052827 -1064964 -964331 -948977 -1049644 -1034823 -978728 -989202 -1059217 -1033381 -959663 -937406 -927515
-547 -927515 -923816 -1012633 -1063587 -967339 -1038562 -1024953 -956635 -1068574 -1011565 -962840 -989804 -973888 -978938
-560 -978938 -981644 -946307 -982611 -1041087 -935662 -988339 -949788 -935009 -1046707 -1016317 -1070974 -1005080 -1052369
-573 -1052369 -1071972 -1054196 -977249 -1019172 -941408 -953751 -987869 -962862 -974163 -1057529 -981119 -941983 -1015109
-586 -1015109 -1034794 -991047 -1045792 -940333 -982679 -996229 -1005729 -1013300 -1047797 -907743 -989106 -924185 -959689
-599 -959689 -1064031 -1010330 -1010724 -987381 -1035333 -1006213 -1036987 -1134825 -1009276 -1020722 -1001939 -972769 -972630
-612 -972630 -948662 -860734 -955339 -1036055 -1006323 -956431 -1011024 -968285 -940457 -964198 -988496 -934441 -988411
-625 -988411 -995614 -1016980 -1051211 -960487 -1007786 -1016391 -1021880 -1002043 -1081209 -949575 -973770 -955732 -998777
-638 -998777 -1022437 -974923 -949352 -961024 -1051187 -982111 -1000959 -1020347 -1044805 -1069887 -1024897 -1015095 -935794
-651 -935794 -1117140 -1055425 -929982 -992796 -993310 -1012816 -1025140 -930290 -999524 -992072 -932890 -977277 -1024206
-664 -1024206 -1030371 -1070650 -1074023 -960711 -1019493 -961683 -1011055 -924540 -954852 -981179 -958038 -915495 -998454
-677 -998454 -1040941 -1052856 -932611 -993055 -898889 -911623 -992017 -882382 -972014 -1037139 -1006583 -1014889 -1004612
-690 -1004612 -963238 -1063838 -951064 -895799 -898693 -947571 -1029755 -1031579 -1005491 -1046783 -1024252 -1030318 -934213
-703 -934213 -928950 -1046752 -1014290 -929307 -1031616 -1013377 -978021 -988919 -930855 -1049093 -1030860 -953389 -1002750
-716 -1002750 -960058 -931769 -984289 -1006869 -997293 -901219 -935056 -1020906 -970547 -967172 -1066524 -982296 -1023824
-729 -1023824 -999121 -1074894 -961945 -898788 -1028606 -988075 -1045942 -952124 -1018745 -956867 -977595 -927851
-741 -927851 -996625 -982058 -940066 -982182 -982530 -991159 -996403 -924931 -1015203 -1019050 -982144 -1033362 -1030824 -1030998 -966539
-756 -966539 -1055916 -1012990 -1016171 -974762 -978510 -1012168 -1017504 -1006229 -976802 -972196 -945073 -922590 -930174 -974520
-770 -974520 -983189 -1025427 -1038815 -946159 -1064318 -999937 -976176 -952947 -935286 -965593 -1026108 -1008112 -1039126
-783 -1039126 -962913 -1017729 -1038816 -935811 -1013056 -1155291 -1008159 -966011 -930375 -994234 -1013194 -965857
-795 -965857 -958406 -990922 -933074 -962770 -917123 -905805 -922272 -942804 -960836 -958786 -902153 -938125 -1086715
-808 -1086715 -1017273 -913960 -983486 -994779 -1000477 -1008647 -915667 -989331 -1022555 -1027874 -959697 -975220 -1016897
-821 -1016897 -949876 -987425 -1013426 -983832 -920882 -1013033 -1052366 -928906 -1000511 -930692 -960234 -906233 -977519
-834 -977519 -1007748 -944846 -996856 -989839 -990741 -903261 -958228 -960907 -897152 -928569 -1030492 -1080558 -953499
-847 -953499 -1030419 -915036 -983889 -948506 -1028369 -977504 -981735 -1021060 -1038512 -930107 -949938 -1007362 -1033197
-860 -1033197 -1024251 -972604 -1035138 -1029169 -880953 -995202 -975868 -963871 -920961 -1010330 -1010573 -987883 -975171
-873 -975171 -941177 -833827 -923641 -927356 -991907 -929493 -915445 -999342 -908836 -913146 -1054173 -1025844 -894850
-886 -894850 -934777 -1019482 -986608 -1002398 -982655 -943657 -1035584 -921071 -977901 -946995 -1015884 -1088836 -887019
-899 -887019 -903462 -1006172 -1013980 -997173 -959973 -1018371 -1014166 -965949 -927899 -998398 -971052 -970402 -980838 -937381
-913 -937381 -919368 -959898 -967970 -1005600 -967528 -1002690 -983363 -942115 -959366 -929990 -1001892 -1005341 -1024049
-926 -1024049 -966439 -1001229 -1055620 -1047712 -925548 -870273 -886208 -966187 -894714 -907700 -911578 -990203 -949278
-939 -949278 -923142 -1011693 -982913 -1002676 -841484 -952922 -943577 -960170 -909832 -930566 -1011974 -875934 -927261
-952 -927261 -956574 -895990 -963168 -975244 -963563 -953063 -960923 -939605 -941826 -985447 -971485 -973763 -897650
-965 -897650 -1068846 -925034 -935666 -934502 -990794 -880485 -1027824 -965014 -866077 -938698 -924565 -1023274
-977 -1023274 -930061 -935532 -910407 -945261 -982572 -940169 -976591 -950307 -956705 -1046088 -1012725 -976947 -996366
-990 -996366 -960628 -944191 -990885 -1006399 -982850 -918997 -913484 -939981 -869611 -945196 -1047948 -1035796 -996223
-1003 -996223 -965333 -893781 -978351 -982076 -975173 -1029606 -917693 -938587 -840680 -944467 -965893 -917794 -944775
-1016 -944775 -878786 -943880 -901904 -924667 -972271 -906081 -954223 -1015600 -987418 -954774 -935486 -1000946 -852264
-1029 -852264 -919019 -994382 -965579 -978219 -892916 -901671 -926577 -915669 -837677 -884299 -924139 -967532 -1040704
-1042 -1040704 -998516 -976538 -999437 -914400 -936887 -882552 -951153 -995652 -960141 -911414 -875367 -943480 -953665
-1055 -953665 -922972 -942842 -946117 -959472 -931275 -957463 -891649 -933394 -1002821 -898430 -994380 -910136 -919671
-1068 -919671 -941415 -927964 -941818 -858738 -1026445 -983216 -884332 -933917 -874321 -911842 -900468 -912628 -915334
-1081 -915334 -987785 -928094 -971203 -993731 -972312 -1004682 -983589 -921917 -975598 -960608 -897466 -997626 -1004577
-1094 -1004577 -953393 -960322 -982292 -947326 -929970 -955921 -974796 -962073 -929322 -959323 -875755 -887637 -950567
-1107 -950567 -991336 -930320 -906922 -917332 -972300 -937912 -989621 -951186 -914812 -832634 -929840 -893716 -975262
-1120 -975262 -881218 -916978 -855478 -904732 -911316 -960323 -894678 -901568 -907971 -987939 -1012024 -1006061 -930649 -917998
-1134 -917998 -923440 -995522 -905513 -932185 -886178 -838309 -839338 -884398 -862381 -899829 -909574 -887955 -959159
-1147 -959159 -885633 -919057 -1008245 -877899 -991162 -943089 -941059 -978261 -900080 -903740 -892316 -907222 -959540
-1160 -959540 -895543 -971659 -940144 -1001313 -950236 -969522 -932179 -872936 -1003481 -924213 -918805 -953878 -967716
-1173 -967716 -922776 -887628 -945422 -928718 -997531 -1028867 -915773 -912505 -941093 -1031087 -892073 -890988 -1022581
-1186 -1022581 -1004590 -859658 -903146 -888332 -974941 -1011195 -1022369 -903705 -906153 -909319 -903738 -943151 -887610
-1199 -887610 -988097 -901524 -926060 -881969 -931161 -906206 -897985 -849985 -979800 -881968 -992638 -986531
-1211 -986531 -881904 -948256 -954929 -893978 -874751 -891038 -892885 -905952 -947594 -918059 -906706 -959433 -958284
-1224 -958284 -934098 -944267 -914683 -874126 -922352 -929052 -1048402 -935959 -1038623 -1033143 -861348 -962803
-1236 -962803 -907953 -999910 -900098 -887999 -955144 -955468 -987342 -953267 -941630 -996269 -897437 -935343 -899243
-1249 -899243 -974373 -876027 -961782 -990144 -895017 -939005 -868903 -897751 -942632 -962643 -887217 -979277 -1023296
-1262 -1023296 -992448 -959967 -977828 -940865 -933933 -870330 -886880 -942254 -802884 -920952 -884213 -933267 -933944
-1275 -933944 -941882 -894885 -921574 -957165 -987958 -930911 -936960 -928545 -900367 -822442 -926899 -987413 -878144
-1288 -878144 -868816 -812900 -915799 -956504 -865089 -873684 -909514 -959120 -921186 -940817 -868558 -898934 -1028957
-1301 -1028957 -994439 -875546 -944214 -864154 -879957 -992103 -989434 -992055 -974283 -933443 -952638 -903788 -960180
-1314 -960180 -908179 -834102 -950135 -927052 -937131 -967850 -924919 -943944 -899938 -919833 -882983 -925059 -957870
-1327 -957870 -943039 -905626 -965076 -927148 -902809 -838539 -911172 -1021974 -922004 -964765 -969084 -916511 -893926
-1340 -893926 -864608 -901017 -942740 -973213 -955360 -976008 -937468 -901641 -925996 -891059 -947204 -896177 -877101
-1353 -877101 -903810 -881167 -974557 -980937 -918919 -835651 -921647 -961333 -977309 -955325 -837019 -956077 -956640
-1366 -956640 -875808 -921029 -897786 -950794 -945040 -1002856 -905898 -963991 -915515 -858926 -938265 -863793 -896029
-1379 -896029 -961898 -918426 -927460 -968946 -912983 -827055 -920381 -916817 -924118 -1081190 -995883 -931475 -944140
-1392 -944140 -794807 -977759 -924038 -940294 -858664 -1014116 -913179 -864055 -958554 -892683 -949852 -989041
-1404 -989041 -889764 -858237 -956962 -898995 -874321 -899320 -871067 -878839 -912054 -957378 -890291 -902162 -845975
-1417 -845975 -989728 -1002289 -905793 -833720 -954029 -907284 -925147 -1021173 -941818 -926408 -931837 -942331 -919945
-1430 -919945 -964591 -905803 -908077 -922788 -887553 -904808 -997420 -911348 -928972 -952258 -948958 -919960 -873961
-1443 -873961 -944827 -957729 -961106 -936068 -927072 -903868 -894892 -900046 -873833 -856856 -865236 -920600 -950133 -950519
-1457 -950519 -903854 -915657 -934090 -858897 -922704 -892403 -894285 -877235 -962090 -1006323 -918874 -974402 -1042376
-1470 -1042376 -1013753 -962887 -952088 -897601 -871430 -833235 -863614 -893292 -918109 -886599 -917260 -922838 -909077
-1483 -909077 -869087 -858669 -891204 -841805 -920240 -850473 -865752 -972691 -864721 -910706 -846568 -839081 -893173
-1496 -893173 -929205 -964005 -922506 -786536 -913866 -949577 -911634 -921422 -891052 -865324 -928283 -851432 -915042
-1509 -915042 -928098 -939857 -954933 -1004872 -937346 -962651 -921791 -814229 -885021 -962771 -956387 -843532 -916600
-1522 -916600 -827342 -938345 -851380 -854263 -837786 -940321 -875889 -901957 -890701 -899634 -935099 -886858 -1012952
-1535 -1012952 -891911 -913975 -895719 -854259 -921775 -956704 -896914 -814914 -843727 -837796 -920898 -957414
-1547 -957414 -816006 -832854 -890301 -900562 -974910 -885429 -866962 -867907 -902608 -932379 -834704 -936996 -923295
-1560 -923295 -904314 -933457 -889997 -885483 -865385 -892882 -839473 -877749 -934324 -845541 -902228 -908359 -885904
-1573 -885904 -832199 -900166 -900485 -949656 -943358 -833841 -834044 -952826 -986662 -950639 -995525 -912718 -918677 -909361
-1587 -909361 -963340 -853628 -883562 -971054 -911905 -914046 -879825 -857948 -941987 -910965 -934680 -891112 -886065
-1600 -886065 -809071 -858784 -937625 -971582 -954197 -922957 -932015 -865936 -886599 -868094 -945750 -878541 -912779
-1613 -912779 -844298 -909612 -909893 -911061 -919569 -882619 -861719 -948366 -911175 -911443 -937939 -923094 -924675 -805879
-1627 -805879 -820296 -952628 -897497 -910743 -965392 -911289 -819898 -917247 -924566 -854123 -899998 -860177 -875290
-1640 -875290 -897417 -936954 -843495 -792685 -872720 -894704 -1008463 -942677 -833616 -896266 -888432 -837533 -899296
-1653 -899296 -966670 -850066 -895463 -913471 -766279 -819098 -973187 -899431 -885861 -957128 -981121 -934091
-1665 -934091 -871309 -877840 -944026 -872879 -927880 -909177 -967023 -926752 -874390 -817606 -874792 -947538 -852161
-1678 -852161 -922503 -943171 -878388 -870785 -861001 -792386 -854114 -814768 -960182 -901354 -888064 -825962 -849688
-1691 -849688 -856990 -879575 -874468 -927699 -848959 -869345 -874763 -888175 -842921 -909985 -890739 -972443 -849593
-1704 -849593 -914947 -887875 -800593 -826271 -905650 -883665 -944268 -856300 -925939 -895648 -882601 -905619 -851276
-1717 -851276 -906822 -862298 -847763 -735700 -954143 -949590 -927338 -835163 -842546 -787477 -933563 -866223 -892548
-1730 -892548 -929891 -897877 -741996 -919702 -929685 -907974 -852038 -845954 -860599 -871136 -913791 -882012 -861195
-1743 -861195 -935408 -915394 -913634 -839310 -843121 -889274 -871920 -872262 -815625 -849104 -866521 -872501 -908884 -910775
-1757 -910775 -942650 -889933 -949892 -876123 -829497 -782912 -885964 -861219 -815575 -870850 -907381 -854858 -839211
-1770 -839211 -883236 -912206 -954809 -924698 -813722 -860273 -960401 -900008 -949593 -985385 -923362 -902153
-1782 -902153 -877655 -839775 -959824 -854769 -860885 -887377 -870390 -792768 -841015 -866340 -884761 -879478 -862570
-1795 -862570 -875475 -833428 -752795 -873450 -862068 -794944 -812454 -872634 -824946 -911592 -900349 -936545 -857984
-1808 -857984 -827157 -843669 -917701 -821122 -857641 -880116 -872676 -873861 -894905 -912040 -943953 -848143 -953217
-1821 -953217 -892819 -797806 -904071 -799389 -845947 -886382 -824960 -937306 -879822 -908549 -874506 -854315
-1833 -854315 -824281 -915015 -832667 -906700 -838418 -954214 -951345 -983602 -864064 -862193 -910388 -860888 -853224
-1846 -853224 -886910 -864281 -823570 -917469 -876104 -848229 -957088 -850949 -955505 -881251 -869205 -794177
-1858 -794177 -898682 -870555 -901742 -895741 -928074 -804611 -825716 -892213 -886348 -943666 -878617 -834703 -903830
-1871 -903830 -842055 -880440 -882475 -797030 -851125 -930695 -792091 -831978 -921909 -947359 -836983 -859327 -900809
-1884 -900809 -906071 -858821 -944433 -888412 -909866 -844823 -945616 -821077 -879917 -893486 -867174 -936015
-1896 -936015 -830086 -853352 -876515 -874613 -907802 -850175 -852130 -839586 -888320 -920967 -859701 -919285 -818921
-1909 -818921 -872155 -793797 -903460 -836468 -883482 -861118 -811400 -926321 -858282 -848519 -786259 -806263
-1921 -806263 -906532 -917630 -884865 -849429 -874246 -859485 -818182 -911848 -900255 -910314 -903651 -910058 -846247
-1934 -846247 -906783 -857561 -851797 -846708 -850059 -827805 -799952 -852420 -803175 -862846 -917111 -871088 -881563
-1947 -881563 -913372 -839892 -892527 -896567 -959042 -965263 -940964 -816791 -802079 -779594 -834393 -883652 -936144
-1960 -936144 -894688 -841762 -869113 -848268 -851744 -809693 -912429 -848773 -825450 -848649 -939008 -926826 -855351
-1973 -855351 -839742 -877149 -948174 -805077 -891391 -925951 -976647 -869869 -960641 -888032 -839595 -808360 -803174
-1986 -803174 -867782 -886055 -862105 -921650 -898928 -816046 -809258 -835910 -791226 -858902 -830430 -842189 -909027
-1999 -909027 -901770 -865541 -840615 -929056 -911173 -871232 -895910 -818518 -781923 -828496 -909167 -884476 -778543
-2012 -778543 -855979 -829322 -872151 -808213 -802314 -763758 -833466 -891462 -811476 -919997 -837978 -885311 -948729
-2025 -948729 -859996 -933044 -850348 -858889 -906152 -838016 -867289 -920193 -858719 -874737 -757656 -831600 -888354
-2038 -888354 -859745 -877940 -895777 -889274 -871428 -806531 -911210 -901589 -849292 -883152 -883576 -915041 -848975
-2051 -848975 -906684 -859099 -945424 -896536 -831061 -931181 -891731 -828433 -900162 -892946 -820523 -933217 -844043
-2064 -844043 -914421 -818447 -885257 -868773 -941853 -828047 -822396 -908857 -814554 -818375 -881163 -870269 -861004 -860058
-2078 -860058 -969673 -893386 -916485 -858879 -800261 -835505 -880167 -801858 -876457 -906175 -873287 -814864 -803309
-2091 -803309 -867332 -844308 -835528 -821635 -841835 -806038 -786519 -828419 -805285 -843689 -836566 -929399 -826505
-2104 -826505 -832913 -885945 -902820 -790174 -882511 -879167 -829252 -809017 -869264 -874030 -819116 -852142 -885983
-2117 -885983 -890681 -813609 -816714 -833905 -791549 -816875 -819995 -836072 -855806 -784624 -862120 -802935 -803609 -835940
-2131 -835940 -933057 -873220 -831141 -863477 -824133 -843021 -819302 -851021 -834687 -777148 -799974 -809256 -788097
-2144 -788097 -895932 -804105 -804585 -888220 -882680 -965236 -927118 -835663 -827683 -781348 -882910 -868666 -833141
-2157 -833141 -809008 -820110 -839310 -777643 -813261 -921978 -811124 -826744 -834401 -838295 -728648 -828641 -847793
-2170 -847793 -836633 -792411 -852108 -834876 -783211 -822161 -859183 -819838 -861633 -825555 -872580 -886361 -807288
-2183 -807288 -844504 -842765 -875878 -878357 -786505 -867493 -856519 -776826 -808680 -846515 -845106 -808400 -873320
-2196 -873320 -834155 -878784 -922253 -897240 -880456 -801883 -759187 -753600 -855739 -758265 -784384 -845822 -821987
-2209 -821987 -857135 -761252 -874702 -837911 -895230 -824745 -843588 -814369 -833520 -882593 -866354 -805310
-2221 -805310 -912043 -863733 -858311 -850054 -852903 -915675 -836521 -759559 -835646 -785282 -869355 -884105 -876652
-2234 -876652 -784023 -804805 -823073 -833548 -888056 -829909 -867158 -892175 -860606 -787518 -878841 -780725 -853617
-2247 -853617 -758737 -814463 -802570 -779406 -913131 -826779 -767422 -815485 -822345 -803443 -834996 -829056 -801708
-2260 -801708 -739377 -876385 -851266 -835229 -856971 -909341 -835533 -870233 -845915 -849062 -859534 -794226 -817187
-2273 -817187 -866480 -871479 -765852 -834749 -879472 -854839 -860217 -824022 -903008 -860618 -849301 -825142 -894029
-2286 -894029 -798642 -834915 -839542 -841028 -889569 -888157 -802383 -821776 -835397 -870620 -776213 -842087 -758680
-2299 -758680 -780757 -765596 -771523 -854197 -807030 -807029 -856498 -893755 -796174 -865909 -823334 -821667 -810703 -844247
-2313 -844247 -856150 -802318 -846134 -919614 -878185 -821194 -834093 -807743 -828162 -806583 -865809 -818085 -831597
-2326 -831597 -807982 -771078 -874876 -800976 -844308 -847379 -917490 -790263 -758320 -751594 -725806 -736398 -831925
-2339 -831925 -854397 -953716 -787778 -791010 -715510 -814942 -762779 -801124 -815848 -813583 -863589 -848277 -848579
-2352 -848579 -922542 -883403 -946431 -877108 -857981 -867769 -805291 -820254 -753722 -787144 -883081 -728367 -782791
-2365 -782791 -755723 -854673 -820419 -858314 -728872 -798612 -915104 -757396 -820924 -796640 -848337 -800762
-2377 -800762 -761640 -797242 -813383 -816509 -873774 -850281 -866838 -878525 -870735 -879052 -871992 -813771 -821184 -818504
-2391 -818504 -873260 -832096 -848723 -856320 -780364 -914128 -870607 -812923 -839857 -765404 -741215 -761909 -879491
-2404 -879491 -783344 -857001 -780884 -815442 -804417 -857223 -767514 -856071 -840691 -825427 -800299 -809016 -813347
-2417 -813347 -850554 -857661 -850874 -872112 -824918 -893498 -805611 -789476 -870697 -896729 -819106 -774929 -812754
-2430 -812754 -777758 -860639 -754426 -757522 -738054 -849943 -864111 -816104 -800199 -715873 -783886 -790048 -862340
-2443 -862340 -919042 -764097 -806403 -822194 -691574 -750136 -807048 -866786 -939172 -850441 -787624 -744982
-2455 -744982 -673948 -825065 -847233 -830840 -759604 -809080 -783854 -854405 -822615 -867146 -791532 -836894 -867477
-2468 -867477 -829735 -757460 -806951 -789162 -740474 -802998 -850823 -870586 -847785 -875497 -878467 -859810 -797764
-2481 -797764 -708092 -862091 -838130 -759759 -835517 -869802 -856185 -811143 -825610 -772453 -772942 -783605 -785480
-2494 -785480 -807570 -777239 -688068 -848648 -846313 -822965 -797689 -861749 -804868 -824728 -788367 -761023 -822832
-2507 -822832 -808281 -743185 -778365 -846084 -711257 -807464 -863387 -817428 -800860 -811242 -848258 -801210 -802728
-2520 -802728 -852271 -867695 -787056 -788251 -773201 -751285 -833070 -836853 -793776 -831776 -835496 -767965 -898887
-2533 -898887 -806106 -872796 -860977 -772521 -803227 -823650 -809176 -778712 -871679 -896554 -844978 -772405 -855948
-2546 -855948 -837943 -828549 -759112 -814091 -852316 -798076 -780438 -813829 -845207 -762708 -853963 -844819 -758901
-2559 -758901 -792651 -753011 -808251 -847784 -848583 -852081 -797850 -810880 -860595 -863245 -765312 -738763 -835616 -780240
-2573 -780240 -722664 -851820 -848931 -773331 -791633 -804177 -804279 -784148 -794790 -820252 -751657 -797716 -880256
-2586 -880256 -738889 -731367 -726182 -755980 -790065 -784208 -751529 -836107 -804719 -802952 -767501 -723071 -786445
-2599 -786445 -834393 -804831 -895470 -866689 -763921 -778211 -785763 -745104 -781444 -804458 -760799 -781932 -766990
-2612 -766990 -788033 -765582 -771280 -854351 -764627 -749149 -763294 -830536 -766897 -878485 -767156 -800328 -769494
-2625 -769494 -781487 -799691 -806544 -781870 -689220 -791501 -789519 -842607 -752005 -800135 -789832 -799143 -813026
-2638 -813026 -804218 -835836 -870867 -774040 -783634 -869181 -794593 -905129 -776235 -786881 -767560 -751302 -761762
-2651 -761762 -770939 -868095 -835571 -763194 -794167 -790570 -842524 -827005 -797423 -856608 -792559 -741203 -732184
-2664 -732184 -869708 -801780 -822935 -699494 -685729 -768945 -713480 -802904 -848821 -771376 -843080 -823446
-2676 -823446 -877223 -821146 -820957 -840186 -766823 -733716 -794933 -741575 -813016 -829840 -832912 -815989 -860556
-2689 -860556 -825327 -775123 -809836 -834623 -823434 -813437 -808315 -789057 -821446 -830643 -798886 -843068 -823043
-2702 -823043 -742109 -732282 -785451 -849737 -753126 -756467 -765448 -818186 -839866 -740723 -757253 -807432 -899792
-2715 -899792 -809750 -762394 -730698 -817176 -733141 -825142 -778332 -780436 -811593 -839252 -842701 -799222 -847915
-2728 -847915 -742210 -864381 -772687 -803570 -724771 -721341 -781262
-2735g81262  $$ checkpoint
##PAGE= N=2
##DATA TABLE=(X++(I..I)), XYDATA
13648 -2594495 -2475237 -2533367 -2585804 -2510209 -2561612 -2559517 -2490105 -2593292 -2562215 -2557913 -2445719 -2487983
13636 -2487983 -2521363 -2502294 -2519409 -2488018 -2470014 -2460802 -2528251 -2660077 -2464949 -2410529 -2431605 -2479793 -2469804
13623 -2469804 -2523954 -2517371 -2503182 -2439835 -2478308 -2393298 -2387480 -2550647 -2459183 -2413958 -2422639 -2409525 -2445081
13610 -2445081 -2397967 -2428731 -2447661 -2398534 -2371831 -2343670 -2390489 -2379076 -2441050 -2451988 -2351095 -2433806
13598 -2433806 -2445796 -2418149 -2497313 -2417970 -2315210 -2448752 -2297409 -2333904 -2418420 -2368304 -2405022 -2381044
13586 -2381044 -2361543 -2386624 -2448202 -2437695 -2354441 -2371951 -2345186 -2347031 -2357421 -2345084 -2277796 -2401276 -2364383
13573 -2364383 -2350720 -2344375 -2395397 -2353953 -2459233 -2415545 -2399894 -2360403 -2264040 -2232541 -2371680 -2335837 -2333393
13560 -2333393 -2305252 -2369423 -2360714 -2325819 -2346916 -2372065 -2367615 -2299341 -2324700 -2257215 -2267267 -2244827 -2341770
13547 -2341770 -2366057 -2263336 -2295645 -2241095 -2306322 -2239732 -2253613 -2250769 -2194553 -2253250 -2260443 -2279135 -2258052
13534 -2258052 -2245509 -2214927 -2269793 -2284965 -2318516 -2263122 -2223713 -2241232 -2271018 -2299580 -2295306 -2295096 -2257067
13521 -2257067 -2265967 -2241546 -2263994 -2267018 -2235941 -2202266 -2209605 -2249680 -2221782 -2210002 -2195358 -2165272 -2159611
13508 -2159611 -2141905 -2178108 -2278435 -2152407 -2116646 -2151258 -2218107 -2288640 -2265660 -2095742 -2208408 -2224364
13496 -2224364 -2099773 -2132562 -2156970 -2084970 -2168371 -2237129 -2233949 -2147128 -2150664 -2138546 -2137799 -2089412 -2093019
13483 -2093019 -2047483 -2127490 -2156187 -2129376 -2142494 -2149113 -2107948 -2156917 -2057918 -2142306 -2120759 -2094547 -2077117
13470 -2077117 -2146462 -2183203 -2094812 -2045376 -2136445 -2088838 -2158078 -2099805 -2147678 -1963176 -1984113 -2053340
13458 -2053340 -2109103 -2130671 -2109451 -2149150 -2064646 -2057844 -2096587 -2117673 -2146294 -2094389 -2078984 -2058828 -2113136
13445 -2113136 -1998462 -2058207 -2069773 -2014872 -2029673 -2004043 -2042072 -2089689 -2127119 -2036016 -2066776 -1985549 -1982524
13432 -1982524 -1961281 -1905900 -1974451 -2060293 -1999400 -2035378 -2022837 -1978324 -1966864 -2049905 -1984166 -1970104 -2007836
13419 -2007836 -2030695 -2028735 -2002047 -1999331 -1952055 -2013110 -1934403 -1992113 -2012508 -2004322 -1903316 -1962709 -1908382
13406 -1908382 -1987440 -1999495 -2061088 -1983891 -1965714 -1954084 -1917734 -1996090 -2057828 -1979421 -1970199 -1922442 -1893703
13393 -1893703 -1885736 -1945756 -1982404 -1937329 -1896149 -1965186 -1941750 -1994381 -1986743 -1863887 -1954709 -1911535 -1855030
13380 -1855030 -1910862 -1891319 -1899168 -1872836 -1820023 -1852043 -1917556 -2004913 -1868423 -1942779 -1920252 -1904446 -1858366
13367 -1858366 -1955154 -1878596 -1914672 -1837207 -1886359 -1836529 -1878240 -1838785 -1936768 -1807242 -1845823 -1805940
13355 -1805940 -1828835 -1853294 -1882750 -1810884 -1814322 -1802522 -1844854 -1875562 -1871562 -1844749 -1837437 -1733125 -1848680
13342 -1848680 -1858033 -1823328 -1743535 -1749444 -1808647 -1814998 -1856110 -1817298 -1782306 -1806610 -1832017 -1847769 -1937086
13329 -1937086 -1853552 -1699332 -1776632 -1754669 -1773858 -1779920 -1752859 -1822665 -1791978 -1750987 -1685148 -1823324
13317 -1823324 -1710288 -1756168 -1754309 -1753171 -1815521 -1796462 -1792104 -1768395 -1773796 -1729410 -1656190 -1795924 -1760756
13304 -1760756 -1650292 -1761111 -1790193 -1688091 -1732990 -1580818 -1690309 -1758768 -1801080 -1653962 -1663555 -1723770
13292 -1723770 -1653660 -1698937 -1664602 -1661004 -1722403 -1731852 -1682866 -1728996 -1716154 -1655128 -1569679 -1637864 -1609894
13279 -1609894 -1630236 -1661397 -1639991 -1673267 -1665693 -1738116 -1670094 -1641831 -1651125 -1646356 -1614887 -1643408 -1668315
13266 -1668315 -1674144 -1562105 -1643093 -1634225 -1607244 -1602000 -1661452 -1654003 -1687233 -1681400 -1661753 -1576926 -1616386 -1613695
13252 -1613695 -1653729 -1578292 -1656662 -1673885 -1609536 -1541072 -1599013 -1699489 -1614680 -1602168 -1618939 -1562555
13240 -1562555 -1680060 -1625929 -1612898 -1606938 -1570269 -1613529 -1622704 -1648173 -1643237 -1535197 -1512785 -1583245 -1552929
13227 -1552929 -1527337 -1508998 -1538985 -1584324 -1656721 -1576128 -1469376 -1499028 -1492753 -1548872 -1538217 -1529177 -1559382
13214 -1559382 -1495217 -1482277 -1504163 -1403351 -1493314 -1571372 -1496455 -1529294 -1517283 -1436699 -1504052 -1488969
13202 -1488969 -1588569 -1436972 -1559799 -1498385 -1472843 -1447895 -1544934 -1461900 -1462182 -1539274 -1482980 -1433357 -1407561
13189 -1407561 -1554669 -1473445 -1410367 -1445774 -1454193 -1454607 -1460349 -1530344 -1516488 -1517410 -1490318 -1484138 -1424366 -1485985
13175 -1485985 -1467472 -1397847 -1464637 -1433516 -1428728 -1437987 -1427528 -1491793 -1350670 -1382358 -1380787 -1393255 -1471360
13162 -1471360 -1404387 -1443922 -1371407 -1323979 -1404425 -1435049 -1396042 -1318914 -1346894 -1485707 -1397197 -1481767
13150 -1481767 -1456793 -1375992 -1372774 -1374436 -1367643 -1385126 -1433892 -1366216 -1413263 -1382606 -1437004 -1306952 -1384886
13137 -1384886 -1341663 -1303029 -1388824 -1296222 -1299931 -1274506 -1324238 -1326817 -1386103 -1306501 -1391598 -1331765 -1284372
13124 -1284372 -1301084 -1314950 -1388921 -1364409 -1295151 -1326303 -1440680 -1289112 -1281211 -1357580 -1334722 -1345384
13112 -1345384 -1255718 -1306087 -1377763 -1335279 -1326520 -1381155 -1353841 -1306753 -1325243 -1348112 -1330605 -1341291 -1219199
13099 -1219199 -1233524 -1338583 -1251767 -1266310 -1270762 -1306319 -1247961 -1202292 -1208339 -1338777 -1277067 -1258442 -1286549
13086 -1286549 -1316454 -1217632 -1194048 -1305878 -1186039 -1361584 -1272545 -1205041 -1249873 -1208880 -1179209 -1266722
13074 -1266722 -1219766 -1237135 -1266819 -1272418 -1265065 -1235380 -1254141 -1238972 -1230146 -1182805 -1117849 -1115500 -1242581
13061 -1242581 -1209205 -1211795 -1208686 -1166987 -1202950 -1201542 -1190495 -1159024 -1115143 -1153900 -1198628 -1198744 -1241312 -1179492
13047 -1179492 -1176681 -1139611 -1185583 -1089824 -1135116 -1168299 -1078614 -1111823 -1097379 -1153212 -1110888 -1106661 -1136289
13034 -1136289 -1046717 -1035503 -1125551 -1114742 -1129999 -1219147 -1077321 -1105922 -1157680 -1078981 -1115406 -1134868
13022 -1134868 -1201216 -1049474 -1116596 -1058531 -1073341 -1079806 -1043152 -1020547 -1078411 -1087562 -1132988 -1040204 -1076225
13009 -1076225 -1064593 -1123495 -1097418 -1097626 -1030982 -1129356 -1128126 -1076743 -1046850 -1095929 -988678 -1108750 -1027273
12996 -1027273 -1010269 -1062545 -1035683 -1055520 -1037751 -993552 -1037082 -1166417 -1047827 -1008330 -988695 -987427
12984 -987427 -1001055 -970145 -1102027 -929602 -1043881 -972988 -913043 -927608 -1046265 -928444 -964541 -935407
12972 -935407 -982687 -1026310 -1023976 -891916 -987245 -1001643 -954430 -933471 -1012599 -1024245 -984243 -920270 -929880
12959 -929880 -939774 -970872 -899647 -928766 -960654 -946682 -1021648 -935208 -1035188 -931926 -900299 -878829 -985485
12946 -985485 -901258 -960365 -847850 -936827 -859945 -887818 -940239 -922548 -955821 -1038213 -977133 -984654 -909263
12933 -909263 -894847 -934663 -914319 -879181 -939594 -900254 -900624 -928853 -860564 -943072 -873533 -896204 -884308
12920 -884308 -899723 -897895 -850961 -847727 -846790 -846983 -822754 -894101 -955041 -835477 -880323 -817412 -771002 -873549
12906 -873549 -846195 -918854 -895591 -886832 -834975 -923527 -858350 -747158 -828949 -833783 -901281 -875694 -831913
12893 -831913 -816438 -767225 -872562 -783654 -741674 -780040 -753788 -850721 -860430 -780774 -823118 -815194 -777992
12880 -777992 -782911 -771212 -728420 -836067 -759825 -717006 -869138 -773839 -769467 -736533 -792824 -777176 -682476
12867 -682476 -732847 -679624 -679745 -777480 -752620 -736568 -731700 -821113 -835891 -725021 -762119 -768272 -738218
12854 -738218 -700517 -768934 -695582 -705393 -683466 -725339 -737945 -763545 -773895 -711724 -668072 -709064 -691541
12841 -691541 -712068 -740969 -708230 -745352 -755884 -737485 -661918 -664043 -727685 -663978 -662500 -669875 -678600 -747088
12827 -747088 -738489 -657433 -708308 -694102 -661849 -575795 -627597 -706819 -646414 -692413 -594219 -628686 -648742
12814 -648742 -601672 -645717 -651747 -562409 -578083 -598694 -648652 -691769 -623348 -635569 -650690 -555110 -635337
12801 -635337 -527558 -607420 -644640 -626827 -617402 -599023 -556044 -618286 -597197 -634423 -647345 -711030 -624575
12788 -624575 -639748 -645363 -527757 -581712 -587458 -612266 -553085 -574370 -595652 -540162 -599499 -601545 -549410
12775 -549410 -564408 -515406 -547550 -534074 -611520 -580002 -566890 -636262 -512486 -538051 -504582 -535216 -583365
12762 -583365 -566699 -582918 -548333 -482507 -582338 -516161 -529950 -560155 -467710 -492172 -517615 -462683 -460997
12749 -460997 -502626 -509043 -410910 -477612 -471517 -473174 -521377 -467666 -529771 -421967 -450337 -407558 -612615
12736 -612615 -574159 -522558 -458400 -516085 -466694 -461461 -527312 -564809 -435577 -481310 -425984 -387537 -460644
12723 -460644 -400063 -453255 -528619 -525111 -491762 -458673 -475556 -421324 -465338 -444650 -440643 -386114 -461273
12710 -461273 -414972 -513152 -431193 -344862 -363243 -374792 -383000 -362693 -381863 -434052 -460613 -432131 -462000
12697 -462000 -361018 -411936 -340045 -363018 -365544 -373205 -417538 -426660 -392019 -365709 -460937 -363811 -324429
12684 -324429 -416239 -372681 -434991 -403877 -301400 -339923 -332954 -315556 -333579 -341421 -367587 -378959 -349003
12671 -349003 -311109 -329404 -304249 -389653 -355980 -356791 -359608 -355690 -423774 -320791 -316942 -390529 -297714 -235529
12657 -235529 -282633 -210618 -280352 -333292 -208638 -296700 -299155 -308779 -326481 -330539 -308276 -337678 -211802
12644 -211802 -239510 -262649 -184609 -312588 -374274 -307406 -291172 -254734 -232282 -321742 -287214 -246861 -207601
12631 -207601 -228978 -238439 -273747 -242480 -245467 -238560 -209056 -255384 -268059 -265736 -177586 -204675 -191914 -182778
12617 -182778 -186968 -236672 -317756 -198037 -200661 -229293 -176130 -227415 -263691 -183184 -196644 -64690 -150284
12604 -150284 -108990 -143535 -259772 -168767 -236129 -192082 -181500 -213330 -212103 -149817 -109134 -186073 -180450
12591 -180450 -250706 -191888 -130130 -128718 -180635 -188830 -133195 -221802 -151947 -109383 -77518 -65755 -132302
12578 -132302 -192872 -112988 -54855 -146347 -127213 -148640 -101967 -164592 -110739 -93777 -143966 -166839 -175438
12565 -175438 -56760 -57744 -132541 -121154 -70163 -75276 -81624 -20998 -98308 -62620 -94146 -39895 -60288
12552 -60288 -149087 -75716 43197 -28961 -38284 -114806 -72528 -89253 -60941 -53616 -51279 4150 -17052 -15994
12538 -15994 -54258 -76702 -42969 45334 54317 -43689 -10107 13176 5114 893 -34699 -78829 -125 21613
12524 21613 -26337 -56352 -2494 -45644 90654 10501 24144 70180 -44422 -7126 38443 63202 1714
12511 1714 117532 -27795 -5431 7151 -22079 32971 62444 -16021 27848 14686 76707 6849 1781
12498 1781 70107 101875 34163 40621 110200 81307 97711 53156 87877 166182 95933 54522 36864
12485 36864 89970 59808 111182 23201 50715 -10931 43249 73919 98358 118453 41025 50571 111702
12472 111702 67489 137781 172325 122681 140040 115083 97461 119726 130722 136290 173266 165696 176397
12459 176397 67292 164829 87038 145517 172130 156197 151426 153915 149796 162071 112323 172528 191439
12446 191439 165386 213737 153286 220401 147602 156761 253827 181758 216122 217034 184940 233433 263642
12433 263642 146624 214196 159431 159252 187529 203169 124828 258361 182505 156534 256289 299964 156136
12420 156136 214531 239431 295381 253751 266560 291154 246536 189578 223938 268331 261843 261600 242228
12407 242228 221507 224630 244520 292911 311314 307985 384361 264855 320034 331585 272695 207462 352104
12394 352104 256813 349396 316554 345736 340901 268440 334020 288641 198963 352090 247549 397746
12382 397746 313002 361956 285980 267396 332695 359778 370529 314910 331799 290710 322818 442756 419160
12369 419160 395960 341457 287067 397801 350093 433542 381003 321260 440092 344874 440099 409891
12357 409891 350092 371074 371272 456111 359968 416534 402445 381197 403845 360419 335557 443985 396520
12344 396520 392184 365342 462617 424070 516594 337371 415162 296522 448889 394540 413953 421862 485658
12331 485658 425410 406403 411502 344641 450665 439947 470255 424806 479084 408546 427462 497690 556753
12318 556753 442734 485466 402541 523981 469273 428538 510169 580961 601782 446890 541536 525259
12306 525259 629729 557342 548191 546500 496006 598428 460011 567787 549996 541123 502499 522835 571056
12293 571056 572131 537532 499927 533386 549674 579390 561853 585429 529071 548679 515911 516034 524747 514674
12279 514674 571732 571382 582925 563765 592440 518938 535755 646998 567083 577985 676310 645122 638348
12266 638348 615911 611987 600687 649170 624503 684531 725619 608072 665117 652469 671016 611157 612130
12253 612130 586832 718350 705229 601316 601853 628466 623419 704029 595822 650160 686655 695232 695548
12240 695548 742163 710038 681074 711393 744051 745446 686571 725116 725185 716767 721154 653437 705693 737064
12226 737064 739728 753744 699194 677804 678027 748705 702285 741712 809555 737275 655693 666726 803884
12213 803884 700312 748911 666280 681915 741643 804636 702593 792286 793305 758281 722906 702470 779559
12200 779559 689659 832106 710134 743500 771706 845737 870061 793999 828697 856390 899243 848464
12188 848464 824832 890018 815288 809323 773614 853282 827277 783931 823101 898696 871443 798390 774557
12175 774557 803817 859188 858254 827657 804286 811781 826970 867597 905722 838305 826746 888288 922653
12162 922653 887338 881231 858913 928396 922132 884433 887320 904147 854610 814160 875255 914028 887390 886200
12148 886200 899412 898059 1005993 934949 952293 959283 938944 910701 878435 861486 877067 915814 948995
12135 948995 999795 926639 968657 938477 888201 888582 921110 967035 1040939 944803 941256 973978 863830
12122 863830 1014787 1006996 1022781 1013434 942491 933418 946230 1029472 979811 1057384 1011172 1008822 890078
12109 890078 1056050 1025860 1015100 1132853 1081349 1068682 1002180 1028102 1015798 1052022 1014318 1053849 1046764
12096 1046764 1069286 1054536 1025742 1089052 1110839 1083179 1041536 1078909 1093840 1110222 1034044 1073098 1048357
12083 1048357 1136295 1093324 1043758 1124717 1135981 1114108 1069954 1075642 1116571 1208053 1140568 1181903 1086089
12070 1086089 1094508 1205128 1077965 1092026 1137244 1096706 1167803 1206861 1136826 1206089 1069080 1081270
12058 1081270 1171973 1158543 1170254 1172587 1181255 1161320 1168978 1185266 1230618 1262282 1131284 1100372 1106287
12045 1106287 1280143 1216423 1223524 1243933 1219154 1263607 1261069 1254196 1179044 1234934 1250959 1279747 1220221
12032 1220221 1222398 1186632 1318772 1237457 1239997 1286382 1225028 1297336 1241035 1355342 1297768 1301489 1275423
12019 1275423 1283138 1324087 1271523 1331476 1283172 1250277 1245028 1332996 1293150 1371564 1317885 1263466 1349188
12006 1349188 1337559 1371080 1302566 1327434 1340671 1302811 1351343 1353852 1264952 1312947 1312729 1389134 1328317
11993 1328317 1368535 1341874 1402162 1367876 1362960 1264232 1388163 1348127 1370353 1382116 1367009 1381040 1393507
11980 1393507 1448176 1462959 1391653 1388638 1407088 1348820 1330821 1384528 1413280 1437357 1404186 1420382 1471697
11967 1471697 1492642 1371474 1533785 1445878 1480318 1503288 1440857 1427861 1366993 1469912 1549781 1462983
11955 1462983 1592171 1463997 1499617 1526633 1563499 1523317 1486295 1567101 1495398 1505663 1572550 1576900
11943 1576900 1482257 1528589 1536564 1478212 1575878 1497407 1563858 1545608 1466111 1554711 1543778 1526472 1571758
11930 1571758 1469286 1479966 1515363 1573172 1523125 1600520 1653753 1652884 1669403 1576259 1614935 1650230 1534998
11917 1534998 1605710 1583403 1589744 1608155 1525973 1572963 1639438 1616885 1651686 1567993 1745975 1758750 1673130
11904 1673130 1652471 1690680 1702130 1670123 1753645 1686312 1725839 1700091 1706251 1609178 1648342 1711082 1686874
11891 1686874 1665675 1725091 1693609 1749945 1720756 1755810 1698287 1703199 1703682 1737132 1851933 1805426 1762426
11878 1762426 1790754 1852443 1776682 1685485 1828565 1757820 1737835 1796620 1680791 1801278 1852449 1860878
11866 1860878 1759037 1730093 1695126 1756254 1898275 1871193 1930815 1905639 1840823 1875408 1869594 1900150
11854 1900150 1864111 1859602 1861805 1844489 1928140 1915316 1898460 1885989 1903763 1887203 1826433 1830843 1853444
11841 1853444 1937813 1887000 1926801 1851848 1863836 1855565 1902808 1901635 1936486 1938397 1973567 1976814 1945469
11828 1945469 1997981 1919180 1920060 1974986 1997152 1987391 1954827 2069087 1939243 1999642 1982197 2028814 1991227
11815 1991227 2036689 2005218 1972421 2011069 2061327 2043398 2057040 2022342 2003379 2116349 2139540 2006779
11803 2006779 2027265 2032506 2111273 2009189 2113787 2138848 2038705 2101408 2041206 2130051 2183363 2109103
11791 2109103 2068835 2175503 2210229 2225885 2223356 2176917 2196549 2143444 2071497 2108757 2203877 2075324
11779 2075324 2229828 2274811 2149795 2200582 2096712 2137265 2200234 2236689 2132704 2173089 2155637 2224363
11767 2224363 2167131 2289579 2258437 2235747 2237888 2235679 2302588 2313891 2281057 2236345 2289512 2276064 2275490
11754 2275490 2252104 2176964 2321208 2303665 2298269 2397572 2354228 2342984 2403193 2368325 2356528 2368226 2391603
11741 2391603 2328867 2356968 2428995 2388915 2364732 2402519 2390105 2485387 2394624 2329709 2395225 2445919 2442455
11728 2442455 2492082 2436537 2487367 2458599 2474126 2511084 2371251 2426449 2453213 2502281 2506291 2374088
11716 2374088 2464868 2544047 2567696 2432633 2467615 2548777 2568221 2416354 2532093 2556484 2603547 2609680
11704 2609680 2599150 2625514 2479030 2523813 2662476 2673992 2663716 2672709 2635055 2639960 2691835 2608530 2667438
11691 2667438 2638198 2629311 2639124 2696244 2707999 2692323 2695458 2798320 2704235 2722275 2759525 2796966 2739792
11678 2739792 2713740 2779355 2677210 2693641 2771787 2796196 2831076 2775640 2885693 2875213 2888888 2846546
11666 2846546 2841025 2802024 2906497 2851678 2945187 2901824 2850187 2924581 2979125 2938242 2948650 2914204 2886700
11653 2886700 2923773 2880213 2898634 2915031 2904362 2968457 2958895 3139360 2982797 3007948 3032117 3015384
11641 3015384 3051081 3011511 3076292 3070817 3097172 3100236 3149556 3104538 3206490 3170073 3234115 3209418 3114308
11628 3114308 3233711 3115791 3209951 3168348 3224996 3238479 3399846 3311728 3289389 3273863 3343516 3317849
11616 3317849 3287546 3387292 3476275 3448957 3437647 3438224 3461895 3559252 3503006 3600662 3624986 3708749 3743492
11603 3743492 3819932 3858734 3810170 3766142 3686357 3681210 3490971 3329052 3223847 3060620 3014189 2950871
11591 2950871 2915333 2982338 2931542 2947391 3020110 3079577 3128431 3074003 3238179 3253323 3305372 3291302
11579 3291302 3220364 3338344 3383757 3385163 3382290 3415431 3467245 3423851 3455864 3476039 3470685 3440557 3607935
11566 3607935 3584605 3587523 3534316 3566693 3628616 3589534 3606942 3631970 3687460 3672502 3724966 3678277 3671489
11553 3671489 3736406 3735835 3724310 3735841 3742106 3859054 3763532 3832019 3848710 3893554 3812070 3866169 3866114 3915410
11539 3915410 4003897 3927345 3954533 3937798 4051010 4026619 3998610 4029847 4064901 4057760 4114271 4164697 4124134
11526 4124134 4156648 4221232 4183354 4164605 4233189 4227279 4222308 4247374 4268538 4315806 4301070 4274903 4317916
11513 4317916 4349020 4385684 4286288 4409964 4368389 4402250 4424271 4469935 4518072 4536902 4555683 4564413 4498036
11500 4498036 4538445 4538570 4585454 4674878 4648755 4697793 4689083 4834161 4772972 4748198 4698466 4799125 4828751
11487 4828751 4812506 4827507 4950415 4896327 4873023 4914786 4950377 4984085 4917151 5034843 5049856 5102928
11475 5102928 5114691 5101923 5127762 5132675 5169981 5180750 5193607 5235786 5289929 5257681 5398997 5404967 5375317
11462 5375317 5355485 5454618 5487389 5501838 5483405 5493147 5494515 5517566 5560578 5617323 5778469 5697300 5775596
11449 5775596 5756470 5784542 5808428 5975672 5914597 5903375 5932964 6076079 6226004 6125418 6127940 6128914
11437 6128914 6208315 6215141 6250443 6329060 6317665 6313766 6419624 6477517 6596315 6643310 6546730 6698802
11425 6698802 6667475 6729260 6807657 6726961 6856933 6919990 7026810 7062549 7103576 7122522 7257129 7191290
11413 7191290 7275675 7402773 7320869 7440445 7470395 7489325 7622828 7715310 7756825 7870961 7808604 7962308
11401 7962308 7963921 8094635 8180884 8242283 8318227 8378577 8319419 8464705 8594116 8658974 8709289 8846638
11389 8846638 8914239 8990516 9166264 9242371 9285926 9443660 9646364 9519117 9673611 9786827 9900625
11378 9900625 9975366 10083461 10209118 10277056 10451721 10522382 10668945 10865603 10974246 11070646 11228625
11367 11228625 11405300 11544135 11737436 11886017 12088304 12247028 12485291 12564790 12942547 13103063
11357 13103063 13253218 13500641 13686599 13940044 14042897 14232785 14416784 14585492 14859236 15237560
11347 15237560 15461136 15724092 16078854 16370300 16803824 17240671 17552689 18073564 18562648 18998087
11337 18998087 19567733 20189533 20804133 21505678 22326053 23200101 24004343 24690344 25076600 25528149
11327 25528149 26175703 26780140 26737602 26751190 26855671 27594763 28655602 29661004 30721661 32244003
11317 32244003 34233878 36502915 39045400 41960875 45054667 48668746 52909063 57816394 63816969
11308 63816969 71253985 80952147 94063331 109889326 122936185 125138786 112422264 100814176
11300 100814176 93936341 86368663 55332102 6531960 -43475368 -65641660 -72953412 -85869998
11292 -85869998 -101045602 -113579814 -110000819 -97406398 -83882155 -72762813 -64251137 -57737245
11284 -57737245 -52707526 -48286943 -44441530 -40921055 -37846010 -35140178 -32711876 -30623440 -28814898
11275 -28814898 -27252127 -26037433 -24875168 -23838444 -23171371 -22839626 -22755953 -22470457 -21852327 -21162020
11265 -21162020 -20776899 -20380814 -19978142 -19218880 -18332307 -17688281 -16950628 -16522322 -16051106 -15514120
11255 -15514120 -15031883 -14548824 -14204090 -13936961 -13495110 -13081177 -12778378 -12482973 -12229853 -11915839
11245 -11915839 -11557532 -11248092 -11121128 -10948686 -10679599 -10519090 -10319255 -10097405 -9850089 -9701058
11235 -9701058 -9445632 -9238138 -9016680 -8911071 -8779943 -8630813 -8398813 -8290159 -8137357 -7939321
11225 -7939321 -7775589 -7656182 -7548575 -7408303 -7331149 -7195571 -7113247 -6901043 -6817283 -6730458 -6643669
11214 -6643669 -6477286 -6471861 -6315542 -6195741 -6126173 -6048502 -5920181 -5815167 -5846291 -5801158 -5637028 -5602060
11202 -5602060 -5635049 -5484975 -5363849 -5304836 -5215878 -5225749 -5093610 -5062036 -5020751 -4889943 -4795619 -4689924
11190 -4689924 -4509668 -4566450 -4528965 -4397424 -4276050 -4315324 -4319184 -4246844 -4197271 -4131466 -4032639 -4036401
11178 -4036401 -4007889 -3954019 -3869008 -3900732 -3801742 -3699496 -3725943 -3604198 -3544935 -3545771 -3471353 -3444429 -3367688
11165 -3367688 -3452117 -3304745 -3324370 -3315362 -3128218 -3122950 -3246090 -3152047 -3154519 -3057837 -2973520 -2886264 -2907919
11152 -2907919 -2855017 -2883929 -2843514 -2799609 -2734519 -2770073 -2764536 -2624567 -2662912 -2611234 -2617476 -2528168 -2479154
11139 -2479154 -2458861 -2450278 -2455956 -2381546 -2383272 -2323252 -2325230 -2205583 -2336290 -2214831 -2212779 -2153301 -2143791
11126 -2143791 -2170401 -2154724 -2142359 -2076471 -2068371 -2027548 -1945537 -1926608 -1892076 -1892723 -1936154 -1899408 -1893846 -1887063
11112 -1887063 -1780996 -1748844 -1809646 -1779574 -1631443 -1727540 -1630444 -1736494 -1664285 -1603201 -1594581 -1514609
11100 -1514609 -1580513 -1556542 -1556493 -1492499 -1537661 -1509964 -1489456 -1464982 -1393441 -1469336 -1320964 -1299206 -1296511
11087 -1296511 -1304447 -1302976 -1354066 -1304863 -1208305 -1266565 -1151567 -1158626 -1103296 -1117282 -1138014 -1111307 -1137504
11074 -1137504 -1040467 -1054661 -1019493 -1041601 -972090 -991147 -982690 -1015259 -931880 -912273 -974850 -983873 -887019
11061 -887019 -902480 -796399 -852029 -870090 -793191 -813549 -783050 -876798 -761448 -785746 -762583 -741846 -733708
11048 -733708 -725066 -777480 -719836 -667240 -650942 -613793 -687788 -595281 -570779 -583705 -571911 -622456 -554458
11035 -554458 -522751 -492021 -531240 -524533 -518274 -499971 -427158 -411359 -462583 -382178 -320989 -278975 -331463
11022 -331463 -382292 -326502 -292402 -246983 -229666 -305533 -243833 -235230 -160085 -168440 -176110 -183129 -175609 -116889
11008 -116889 -104660 -65762 2440 -674 158066 83357 180803 235821 376029 343549 369642 365345 277007
10995 277007 230123 245226 179014 -97882 -378054 -517031 -553030 -537853 -604776 -620851 -592181 -688249
10983 -688249 -575410 -539183 -402024 -357481 -373441 -229681 -294621 -184237 -272197 -194508 -209341 -134602
10971 -134602 -136910 -147464 -233174 -86932 -36107 -97155 -117688 -56977 73386 -21160 57836 42644 56904
10958 56904 -24842 4492 43898 -2090 31534 63998 -18366 99847 96150 127443 140674 133307 227992
10945 227992 257536 182842 172698 181575 184411 196672 174723 255328 139399 142898 218324 192213 314270
10932 314270 246137 216077 341803 235315 303760 262661 345672 252468 312805 264112 288403 289472 359149
10919 359149 476193 325504 305636 293538 401868 420926 362594 330965 349370 328329 368412 480690
10907 480690 417571 406886 421548 500853 446630 501592 430678 532883 438543 412614 510237 568744 573424
10894 573424 516212 532464 525441 498630 575189 599763 672261 543186 513339 544759 568125 624235 683864
10881 683864 703289 623328 624282 604629 680805 621088 652256 765404 629996 640199 651188 770218 770522
10868 770522 681621 665487 709372 707677 733607 718938 715665 675514 749987 672147 756585 627070 793518
10855 793518 808469 730634 724193 788756 820350 720185 802886 772181 783595 732272 726997 822124 800914
10842 800914 875089 770816 765546 839312 767160 913198 944365 879599 954727 865076 842579 866661 908071
10829 908071 880542 909376 944977 863617 925718 949960 910832 932644 1006886 920418 809212 901670 901655
10816 901655 935881 964348 1052836 955726 1051138 970454 974070 948750 1036705 1010024 1036101 1049214 1112434
10803 1112434 990685 1090492 1038305 987492 1013818 994520 1044520 1123953 1028134 1014059 1136167 1016084 1015993
10790 1015993 1073918 1080137 1134269 1089599 1086782 1076077 1060515 1092256 1105232 1078052 1083872 1123481 1098283
10777 1098283 1193508 1135857 1185923 1165853 1228011 1159830 1091237 1204545 1167750 1095790 1142312 1209633
10765 1209633 1182908 1141104 1275597 1224273 1133197 1213274 1219149 1239021 1191164 1148785 1155687 1220814 1217976
10752 1217976 1218732 1199597 1197657 1226613 1243140 1274828 1280203 1270600 1314217 1304298 1297013 1332234 1286145 1286123 1348877
10737 1348877 1298840 1356861 1264545 1406416 1359884 1421575 1337978 1320387 1319786 1287590 1384519 1353450 1398822
10724 1398822 1319572 1306223 1307914 1407419 1327379 1378140 1461577 1428428 1410599 1384492 1366555 1332466 1400968
10711 1400968 1451094 1391432 1462495 1403442 1415905 1328881 1424519 1460266 1397363 1369993 1479083 1416110 1414933
10698 1414933 1504773 1441284 1505605 1530638 1453102 1419033 1505954 1484290 1442189 1473505 1490994 1403887 1454105
10685 1454105 1444699 1543350 1508104 1473540 1523227 1472594 1457667 1520131 1474080 1540504 1563186 1569837 1578927
10672 1578927 1570558 1556447 1632778 1594223 1564224 1498739 1539750 1488782 1557168 1616707 1650737 1655959 1599067
10659 1599067 1587547 1647895 1664083 1538736 1551481 1697604 1639253 1703241 1726344 1644683 1586125 1634783
10647 1634783 1633078 1689648 1672464 1627538 1700468 1673721 1650797 1682581 1685428 1696588 1688824 1739491 1743833
10634 1743833 1719669 1714048 1802284 1681202 1719860 1632351 1694803 1711391 1713760 1761191 1713172 1656679 1758637
10621 1758637 1665978 1656637 1768245 1795067 1709037 1657802 1730977 1775279 1747612 1804435 1756737 1698463 1752148
10608 1752148 1766738 1780628 1762021 1796984 1688849 1726529 1786253 1768147 1809044 1761664 1877168 1791521
10596 1791521 1825350 1856267 1811729 1822240 1770729 1861640 1910183 1879147 1887758 1811410 1916641 1869374 1857160
10583 1857160 1895250 1827905 1822620 1785536 1874094 1861410 1863729 1886016 1794960 1892003 1887556 1909131 1918712
10570 1918712 1940659 1986601 1878889 1877951 1808497 1962955 1951702 1944457 1886817 1887167 1848444 1893737 1942771
10557 1942771 1959783 2006566 1916035 1843044 1989608 1906621 1841618 2003669 1979422 1995622 2013105 1997901
10545 1997901 1977604 1985846 1978270 2034870 2006866 1970706 1996845 2033944 2035251 2033471 1982998 1950391 2054474
10532 2054474 2063416 2009155 2078119 1985542 2000838 2113557 2036275 2114319 2043866 2018891 2081000 2071169 1977482
10519 1977482 2120034 2054322 2081662 2112749 2036921 1985332 2074619 2141369 2086828 2097320 2192346 2135099
10507 2135099 2076601 2025871 2055804 2143787 2138176 2120066 2106506 2113549 2141104 2161824 2126649 2102107 2159253
10494 2159253 2018771 2167916 2144979 2198254 2155983 2121370 2159771 2146446 2156488 2177821 2177365 2299545
10482 2299545 2219051 2170789 2063529 2218907 2189632 2185583 2204069 2151649 2189600 2153669 2229784 2201195
10470 2201195 2174728 2274835 2255080 2287382 2258554 2162434 2262850 2261591 2286638 2289297 2224238 2193046 2243063
10457 2243063 2240519 2313060 2206606 2272512 2383872 2268463 2214047 2241532 2315743 2312010 2240488 2258070
10445 2258070 2312095 2359917 2272430 2318813 2325501 2240071 2261402 2420803 2277312 2376326 2292219 2362098
10433 2362098 2340500 2407528 2269846 2357298 2380198 2371557 2308250 2368370 2287651 2300758 2299687 2359331 2437823
10420 2437823 2355130 2364606 2402547 2470142 2359571 2437109 2422248 2428586 2430972 2419687 2400972 2432103 2434385
10407 2434385 2397589 2355834 2431904 2449918 2417302 2401863 2359970 2451179 2379366 2432740 2386924 2427624 2467589
10394 2467589 2471768 2434072 2498061 2419913 2505530 2443802 2459167 2452215 2478955 2574190 2417473 2420899 2418725
10381 2418725 2380813 2509861 2475945 2406789 2455625 2461348 2391979 2493047 2522416 2531943 2539208 2543386 2565447
10368 2565447 2497550 2591324 2595513 2553443 2537287 2649527 2562083 2566293 2590229 2599968 2566963 2540590 2571943
10355 2571943 2491419 2519323 2510203 2653505 2536952 2512851 2570965 2564432 2677267 2655377 2655076 2632266 2710975
10342 2710975 2596739 2684464 2707971 2720965 2709555 2709989 2761005 2758847 2715733 2734536 2685781 2682141 2705823
10329 2705823 2710077 2660744 2611747 2601123 2529159 2452465 2511812 2493369 2457293 2429633 2615226 2583295 2550170
10316 2550170 2496535 2571168 2435393 2548134 2687226 2604921 2565421 2664378 2672187 2660005 2600220 2668896
10304 2668896 2503873 2721419 2697279 2590235 2596014 2662841 2668074 2701661 2707066 2696694 2681706 2716767 2694994
10291 2694994 2755248 2764141 2739580 2715509 2696435 2718831 2677684 2766352 2754757 2671780 2740843 2676173 2770795
10278 2770795 2776505 2667723 2684009 2699681 2738570 2724810 2784297 2781769 2749971 2842334 2762202 2679552 2743683
10265 2743683 2791246 2809645 2746044 2797184 2775144 2763780 2769621 2761128 2771486 2828324 2868831 2755125 2757128
10252 2757128 2869032 2877926 2856318 2825552 2839268 2826687 2955610 2928608 2768295 2847140 2869062 2888161
10240 2888161 2874079 2768225 2865947 2850948 2923577 2843685 2901760 2883260 2904917 2903043 2828998 2879194 2934550
10227 2934550 2842998 2848646 2955768 2945207 2934906 2909126 2899949 2905013 2909244 2916465 2952195 3052436 3007182
10214 3007182 2995563 2925753 2878054 2912343 2937744 2946950 2957168 2925024 2927414 2994235 3014612 2983086 2983182 3055274
10200 3055274 2993083 3058570 3032071 3044171 3037704 3016833 2968172 3019319 3052239 3061888 3109474 3162553 3155430
10187 3155430 3184509 3246792 3251827 3180740 3246635 3146052 3055620 2994614 2929742 3032094 2949966 2857709
10175 2857709 2836397 2765934 2871860 2765763 2710420 2729613 2802437 2849374 2819655 2874782 2866047 2961736
10163 2961736 2874098 2933848 2948194 2903982 2933889 2923376 2942183 3124704 3052026 2920983 3024579 2915684
10151 2915684 2988393 3027990 2948746 3047452 3019081 2937944 3019712 3048895 2935212 3046805 3026248 3100371
10139 3100371 3089699 3096322 2973911 3031156 3036383 3099344 3153190 3098161 3206748 3144977 3043967 3074573
10127 3074573 3157550 3105126 3071251 3046235 3134896 3158602 3201018 3149969 3099443 3119863 3123605 3202519 3220512
10114 3220512 3167669 3195357 3182855 3148529 3161965 3149420 3119328 3070549 3205388 3116568 3138185 3202201
10102 3202201 3220246 3193261 3181796 3132251 3139779 3201688 3213612 3107152 3237604 3234417 3224974 3273853 3214669
10089 3214669 3201878 3186038 3186943 3320096 3193813 3183904 3239313 3247295 3279944 3283566 3278465 3243354 3200959
10076 3200959 3311293 3278478 3176708 3168466 3273634 3283088 3265867 3243038 3283615 3315576 3312126 3302469 3301716
10063 3301716 3272787 3296864 3299613 3262164 3292078 3330137 3303178 3320579 3260466 3271197 3280717 3294103 3319069
10050 3319069 3411921 3329690 3324081 3350721 3332925 3369821 3387314 3323442 3305345 3357193 3356833 3384213 3292099
10037 3292099 3384228 3330052 3377148 3353191 3423415 3353146 3398243 3394878 3409226 3309600 3353105 3407612 3347497
10024 3347497 3370348 3406814 3474087 3396959 3428597 3337091 3342531 3420695 3407223 3331771 3384936 3380450 3403752
10011 3403752 3409765 3348734 3377661 3358329 3364486 3465158 3389393 3420117 3459031 3452841 3438872 3536908 3446738
9998 3446738 3464345 3464024 3480187 3392622 3517914 3520109 3540585 3413500 3446082 3479666 3501521 3471762 3479499
9985 3479499 3513602 3498195 3509454 3517033 3532200 3483963 3510070 3553395 3438926 3585644 3501251 3485941 3501689
9972 3501689 3542613 3483684 3466506 3536445 3447722 3592906 3567800 3571917 3616103 3524127 3526420 3575628 3621488
9959 3621488 3553141 3524983 3539307 3515087 3567179 3521038 3589538 3578697 3529098 3502661 3538568 3651806 3601714
9946 3601714 3595542 3599152 3624371 3637977 3650469 3561986 3634619 3585098 3631129 3585908 3637915 3603275 3641905
9933 3641905 3651547 3570608 3587087 3613745 3715051 3674349 3609493 3610285 3672404 3669602 3647095 3726548 3718049 3706329
9919 3706329 3623570 3686980 3687677 3606092 3682851 3683237 3671346 3614144 3674921 3736634 3756738 3664193 3657501 3794750
9905 3794750 3743967 3725261 3764575 3723521 3690893 3789757 3703660 3739102 3709866 3849039 3748410 3712937
9893 3712937 3745088 3726679 3746863 3762826 3750431 3760801 3677973 3704398 3754295 3737267 3701684 3782465 3795019
9880 3795019 3811928 3800666 3729742 3775442 3701652 3781402 3888294 3770162 3894188 3842872 3818191 3875399
9868 3875399 3769137 3792686 3766061 3872508 3794069 3788347 3748329 3748129 3798205 3778312 3764473 3819428 3886831
9855 3886831 3862292 3905837 3821922 3840072 3869530 3830361 3811095 3911500 3832863 3843133 3865675 3851100 3897133
9842 3897133 3875485 3923566 3853912 3846188 3921892 3953521 3912375 3942202 3931414 3880302 3892571 3750443 3910639
9829 3910639 3895586 3942666 3963123 3895909 3859687 3955531 3900602 3907343 4043289 4000380 3908714 3866417 3986186
9816 3986186 3884038 3884672 3911740 4026899 3910849 4012304 3984111 3986684 3897672 3907176 3932082 3877522 3944347
9803 3944347 4005116 4007971 3980879 4026301 4023649 4049105 4055425 3995685 3984285 4107432 4056001 4012760 4075920
9790 4075920 4045540 4020907 3997536 4069001 4126942 4095030 3999650 4033237 3963031 4064794 4035944 3952194 4032696
9777 4032696 4076708 4073188 4029238 4069819 4057061 4098078 4005808 4086123 4156037 4117685 4090070 4083902 4117726
9764 4117726 4145580 4157871 4147245 4090279 4037560 4111240 4089846 4070080 4054794 4049999 4131597 4124789 4155506
9751 4155506 4097933 4109982 4166779 4213108 4142415 4170026 4153377 4167194 4145316 4120445 4177656 4236392 4140168
9738 4140168 4203807 4177408 4251303 4140877 4033642 4197738 4168912 4152712 4150862 4183105 4237334 4168265
9726 4168265 4246125 4220666 4243410 4234936 4234276 4283474 4192698 4099112 4174405 4242684 4206613 4180376 4223435
9713 4223435 4203741 4224785 4201917 4186884 4220609 4312286 4147646 4189001 4262379 4234592 4187486 4243879 4265815
9700 4265815 4256243 4277679 4178099 4205917 4300706 4312713 4218064 4306634 4303879 4298941 4249647 4173215 4202372
9687 4202372 4280812 4339159 4328022 4256170 4354571 4370452 4361867 4372389 4299532 4236971 4299267 4348715 4332888
9674 4332888 4391613 4348104 4278470 4406000 4322268 4397429 4390423 4393454 4481190 4352606 4375912 4368022 4337780
9661 4337780 4422614 4369707 4329686 4377358 4353623 4339229 4408187 4357225 4386897 4486449 4391646 4374597 4372299
9648 4372299 4441549 4436870 4443461 4464103 4450018 4377155 4382451 4390605 4435009 4476106 4455632 4397595 4380507 4424243
9634 4424243 4478211 4470046 4510036 4441710 4564770 4444396 4401245 4462852 4529536 4480171 4442935 4517625 4504880
9621 4504880 4605583 4614904 4532835 4489961 4494638 4477438 4498895 4482594 4496016 4569208 4592672 4436482 4526476
9608 4526476 4472523 4535054 4663692 4537317 4428562 4537561 4542176 4550729 4513507 4543149 4516745 4569830
9596 4569830 4505053 4474453 4507787 4551184 4555416 4526267 4497604 4527897 4509288 4556138 4557211 4586827 4660686
9583 4660686 4503687 4531374 4628205 4660578 4625009 4622890 4689415 4554096 4572320 4557898 4597314 4674196 4618392
9570 4618392 4742150 4666583 4605824 4645263 4636302 4582594 4643615 4568031 4669103 4635873 4568281 4632083 4679030
9557 4679030 4687885 4738822 4648600 4586336 4623577 4759450 4658401 4649279 4626479 4682875 4720184 4731355 4736141
9544 4736141 4694719 4692346 4700472 4752113 4741540 4686790 4616513 4657154 4776334 4782618 4706451 4796552 4735046
9531 4735046 4658918 4687990 4753772 4784681 4706406 4777627 4827780 4745018 4747297 4840169 4791930 4748252 4817080
9518 4817080 4783988 4806680 4731429 4813227 4808034 4818889 4852235 4814600 4859160 4741470 4781413 4832565 4860480
9505 4860480 4828920 4862277 4792650 4817341 4866594 4775519 4815139 4773730 4793682 4868367 4872578 4874054 4897741
9492 4897741 4958494 4907175 4828422 4874935 4888441 4867588 4849034 4825455 4851671 4913462 4894794 4913161 4860041
9479 4860041 4881614 4963973 4966393 4968697 4940267 4843532 4907573 4978550 4909905 4974800 4938350 4988279 4959220
9466 4959220 4962480 5009327 4912943 4953171 4906449 4985954 4936184 4912866 5012700 4946103 5004497 4982941 4914970
9453 4914970 4957919 5069894 5064588 5043927 4955384 4970937 4951581 4968917 5051955 4966286 5028040 5074956 5038506
9440 5038506 5046144 5130033 5044955 5092070 5029222 4967534 4984021 5048315 5100222 5061202 5024241 5062679 4952222
9427 4952222 4978413 5178629 5073715 4987432 5074464 5162804 5139952 5118658 5062925 5076258 5019363 5077228
9415 5077228 5160733 5129084 5061084 5076617 5211559 5182488 5127592 5126842 5135989 5166615 5124800 5163430 5075483
9402 5075483 5173049 5196443 5169728 5151342 5129676 5167236 5213963 5163499 5243896 5192426 5123385 5220243 5167284
9389 5167284 5160250 5259619 5213521 5271302 5103365 5199894 5085266 5213148 5203119 5238158 5316613 5231390
9377 5231390 5255159 5236713 5264846 5302039 5329403 5283819 5289906 5267360 5206813 5253554 5348897 5297092 5343465
9364 5343465 5335614 5241307 5358553 5384162 5327023 5351183 5368357 5276550 5359346 5392283 5336419 5315054 5400207
9351 5400207 5338563 5305765 5312098 5393963 5333168 5223454 5255476 5438663 5432657 5360628 5396276 5376187 5403306
9338 5403306 5328375 5336794 5291436 5388207 5361926 5305922 5384864 5275136 5362819 5307353 5388967 5390552 5385382
9325 5385382 5459526 5349832 5417274 5406229 5421350 5530136 5434187 5468427 5437444 5491998 5453300 5414468
9313 5414468 5467620 5489885 5509587 5421843 5400997 5398187 5486561 5530377 5568458 5486249 5634515 5501479 5585951
9300 5585951 5508298 5515824 5591627 5542014 5599813 5469739 5470505 5575810 5502567 5552788 5504281 5530461 5558873
9287 5558873 5536556 5531496 5567342 5621906 5536724 5604647 5590360 5529542 5565300 5509960 5506730 5606738 5579196
9274 5579196 5609590 5580817 5550741 5563269 5554411 5549809 5600518 5620974 5607244 5588496 5615371 5630751 5486443
9261 5486443 5563994 5634196 5654889 5659865 5611569 5517741 5605259 5730802 5661334 5691982 5636649 5730392 5687055
9248 5687055 5642315 5710978 5723293 5713546 5711571 5730214 5724043 5734651 5718012 5756592 5690447 5673127 5743671
9235 5743671 5770107 5662569 5773927 5701151 5802282 5759945 5819855 5744104 5791299 5820411 5784167 5769921
9223 5769921 5792127 5809181 5817302 5727575 5816390 5781208 5700878 5805088 5956648 5805486 5776583 5852333
9211 5852333 5839827 5858256 5789927 5809381 5768730 5767421 5812632 5838152 5897841 5850112 5833578 5879916 5874761
9198 5874761 5878521 5835004 5865890 5975681 5936122 5932805 5983181 5910694 5926671 5914348 5895341 5935941 5993532
9185 5993532 5965292 5854580 5894521 5995279 5973497 5935934 5956106 5927639 6002994 5931611 5935301 5921425 5910923
9172 5910923 5961969 5998403 5956648 6034919 5947620 5995351 5983140 6070301 5966338 5984309 6068047 5918131
9160 5918131 6053358 6130862 6012395 6082623 6003586 6135559 6104876 6086413 6026965 5999124 6098414 6102683
9148 6102683 6077219 6090229 6097870 6069596 6105818 6003942 6088260 6112199 6205410 6184887 6051757 6119242 6086324
9135 6086324 6084276 6100713 6144776 6070577 6079027 6184594 6255673 6149085 6198929 6153132 6211751 6116884 6188282
9122 6188282 6181108 6172270 6211951 6120510 6247786 6264835 6154524 6183521 6209831 6270151 6178249 6218843 6231355
9109 6231355 6207553 6182427 6212898 6257857 6285855 6264398 6293442 6253698 6325669 6230585 6276910 6271234 6332054
9096 6332054 6378359 6368991 6311968 6268682 6304812 6340311 6348164 6376475 6298912 6388454 6380146 6280663 6418465
9083 6418465 6320726 6284535 6384532 6251244 6315148 6319894 6401485 6277682 6319457 6307382 6365556 6476971
9071 6476971 6444718 6322922 6431817 6395467 6503454 6514476 6351552 6409305 6385089 6402188 6402980 6418840
9059 6418840 6532689 6539682 6490778 6407181 6360134 6370377 6454771 6452484 6482957 6512853 6594215 6481084 6498477
9046 6498477 6514253 6484210 6460355 6528859 6536535 6641968 6558339 6603676 6627510 6617553 6538587 6624956 6562627
9033 6562627 6495599 6679011 6526925 6473413 6543109 6547539 6679024 6621229 6604645 6600894 6581091 6598865 6573647
9020 6573647 6585640 6675646 6660560 6728583 6648540 6589682 6591203 6570686 6708250 6716725 6707289 6652685 6676883
9007 6676883 6702422 6696685 6757484 6761803 6729029 6691147 6699098 6706286 6810021 6743272 6762759 6746850 6747277 6780203
8993 6780203 6807030 6774189 6705104 6762364 6799595 6798964 6807366 6795525 6856671 6831078 6819100 6828678 6794449 6868924
8979 6868924 6943927 6885006 6885602 6896416 6877431 6884677 6877704 6922642 6892419 6925619 6947668 6886510 6896515 6938387
$$ [...]
-2735b541571  $$ checkpoint
##END NTUPLES=
##END=
