##TITLE=Analysis number 310627
Compound Code cc 40901
Book Reference 413/154
Project Code adrs
Chemist Name stevem
##JCAMPDX= 6.0         $$ Bruker NMR JCAMP-DX V2.0
##DATA TYPE= NMR SPECTRUM
##DATA CLASS= NTUPLES
##ORIGIN= Bruker BioSpin GmbH
##OWNER= NMR
$$ XWIN-NMR		Version 3.5
$$ Tue Jun 21 12:19:29 2005 GMT Daylight Time (UT+1h)  MAYBRIDGE\NMR@NMR_250MHZ
##.OBSERVE FREQUENCY= 250.131544655141
##.OBSERVE NUCLEUS= ^1H
##.ACQUISITION MODE= SIMULTANEOUS (DQD)
##.ACQUISITION SCHEME= undefined
##.AVERAGES= 16
##.DIGITISER RES= 18
##SPECTROMETER/DATA SYSTEM= dpx250
##.PULSE SEQUENCE= zg30
##.SOLVENT NAME= DMSO
##.SHIFT REFERENCE= (INTERNAL, DMSO, 0, 16.522)
##AUDIT TRAIL= $$ (NUMBER, WHEN, WHO, WHERE, WHAT)
$$ ##TITLE= Audit trail, XWIN-NMR		Version 3.5
$$ ##JCAMPDX= 5.01
$$ ##ORIGIN= Bruker BioSpin GmbH
$$ ##OWNER= NMR
$$ C:\u/data/dgb/nmr/ADRS/4430/pdata/1/auditp.txt
$$ ##AUDIT TRAIL=  $$ (NUMBER, WHEN, WHO, WHERE, WHAT)
(   1,<2005-06-21 12:19:06.19 +100>,<MAYBRIDGE\NMR>,<NMR_250MHZ>,
      <created by zg, POWCHK disabled, PULCHK disabled
       configuration hash MD5:
       62 19 C7 07 E1 42 D1 B7 37 6C 3D D0 77 39 F9 E6
       data hash MD5: 64K
       3F 18 72 EA EF 10 7B 89 69 02 4D 1B 81 32 6D 38>)
(   2,<2005-06-21 12:19:19.04 +100>,<MAYBRIDGE\NMR>,<NMR_250MHZ>,
      <Start of raw data processing
       ef LB = 0.3 FT_mod = 6 PKNL = 1 SI = 32K 
       data hash MD5: 32K
       6E 59 9D 9B 3C DA B0 E3 C6 4C 01 C2 31 54 FB D9>)
(   3,<2005-06-21 12:19:21.00 +100>,<MAYBRIDGE\NMR>,<NMR_250MHZ>,
      <apk 
       data hash MD5: 32K
       F8 E4 DB C8 77 6F 3F 64 19 00 6D 53 0F A2 EF C7>)
(   4,<2005-06-21 12:19:21.75 +100>,<MAYBRIDGE\NMR>,<NMR_250MHZ>,
      <abs ABSG = 5 
       data hash MD5: 32K
       AD 77 0E 6B 53 55 92 35 90 AF 86 DA 31 2D D5 16>)
$$ ##END=
$$ 
$$ hash MD5
$$ 2D C8 D7 A9 E7 8F 75 1A 6F DC 71 AF E0 AB F1 94
##$RELAX= 
##$RELAX= 
##$RELAX= 
##$RELAX= 
##$RELAX= 
##$RELAX= 
##$RELAX= 
$$ Bruker specific parameters
$$ --------------------------
##$DU= <C:\u>
##$EXPNO= 4430
##$NAME= <ADRS>
##$PROCNO= 1
##$TYPE= <nmr>
##$USER= <dgb>
##$AMP= (0..31)
100 100 100 100 100 100 100 100 100 100 100 100 100 100 100 100 100 100 
100 100 100 100 100 100 100 100 100 100 100 100 100 100 
##$AQSEQ= 0
##$AQ_mod= 3
##$AUNM= <au_zg>
##$AUTOPOS= <22 >
##$BF1= 250.13
##$BF2= 250.13
##$BF3= 250.13
##$BF4= 250.13
##$BF5= 500.13
##$BF6= 500.13
##$BF7= 500.13
##$BF8= 500.13
##$BYTORDA= 1
##$CFDGTYP= 0
##$CFRGTYP= 5
##$CHEMSTR= <none>
##$CNST= (0..31)
1 1 145 1 1 1 1 1 1 1 1 1 1 1 1 1 1 1 1 1 1 1 1 1 1 1 1 1 1 1 1 1 
##$CPDPRG= <>
##$CPDPRG1= <>
##$CPDPRG2= <>
##$CPDPRG3= <>
##$CPDPRG4= <mlev>
##$CPDPRG5= <mlev>
##$CPDPRG6= <mlev>
##$CPDPRG7= <mlev>
##$CPDPRG8= <mlev>
##$CPDPRGB= <>
##$CPDPRGT= <>
##$D= (0..31)
0 1 0 0 0 0 0 0 0 0.06 0 0 0 0 0 0 0.0002 0 0 0 0 0 0 0 0 0 0 0 0 0 0 
0 
##$DATE= 1119352745
##$DBL= (0..7)
120 120 120 120 120 120 120 120 
##$DBP= (0..7)
150 150 150 150 150 150 150 150 
##$DBP07= 0
##$DBPNAM0= <>
##$DBPNAM1= <>
$$ [...]
##$SUBNAM7= <"">
##$SUBNAM8= <"">
##$SUBNAM9= <"">
##$SW= 20.6930455092707
##$SWIBOX= (0..15)
0 0 3 0 0 0 0 0 0 0 0 0 0 0 0 0 
##$SW_h= 5175.983436853
##$TD= 65536
##$TD0= 1
##$TE= 295.16
##$TE2= 300
##$TE3= 300
##$TEG= 300
##$TL= (0..7)
0 120 120 120 120 120 120 120 
##$TP= (0..7)
150 150 150 150 150 150 150 150 
##$TP07= 0
##$TPNAME0= <>
##$TPNAME1= <>
##$TPNAME2= <>
##$TPNAME3= <>
##$TPNAME4= <>
##$TPNAME5= <>
##$TPNAME6= <>
##$TPNAME7= <>
##$TPOAL= (0..7)
0.5 0.5 0.5 0.5 0.5 0.5 0.5 0.5 
##$TPOFFS= (0..7)
0 0 0 0 0 0 0 0 
##$TUNHIN= 0
##$TUNHOUT= 0
##$TUNXOUT= 0
##$USERA1= <user>
##$USERA2= <user>
##$USERA3= <user>
##$USERA4= <user>
##$USERA5= <user>
##$V9= 5
##$VALIST= <valist>
##$VCLIST= <CCCCCCCCCCCCCCC>
##$VD= 0
##$VDLIST= <DDDDDDDDDDDDDDD>
##$VPLIST= <PPPPPPPPPPPPPPP>
##$VTLIST= <TTTTTTTTTTTTTTT>
##$WBST= 1024
##$WBSW= 4
##$XGAIN= (0..3)
0 0 0 0 
##$XL= 0
##$YL= 0
##$YMAX_a= 264574
##$YMIN_a= -366674
##$ZGOPTNS= <>
##$ZL1= 120
##$ZL2= 120
##$ZL3= 120
##$ZL4= 120
##$ABSF1= 16.522
##$ABSF2= -4.171173
##$ABSG= 5
##$ABSL= 3
##$ALPHA= 0
##$AQORDER= 0
##$ASSFAC= 0
##$ASSFACI= 0
##$ASSFACX= 0
##$ASSWID= 0
##$AUNMP= <proc_1d>
##$AZFE= 0.1
##$AZFW= 0.1
##$BCFW= 0
##$BC_mod= 0
##$BYTORDP= 0
##$COROFFS= 0
##$CY= 12.5
##$DATMOD= 1
##$DC= 0
##$DFILT= <>
##$DTYPP= 0
##$F1P= 14.0000005364418
##$F2P= -0.99999901652339
##$FCOR= 0.5
##$FTSIZE= 32768
##$FT_mod= 6
##$GAMMA= 0
##$GB= 0
##$INTBC= 1
##$INTSCL= 1
##$ISEN= 128
##$LB= 0.3
##$LEV0= 0
##$LPBIN= 0
##$MAXI= 10000
##$MC2= 0
##$MEAN= 0
##$ME_mod= 0
##$MI= 0
##$NCOEF= 0
##$NC_proc= -4
##$NLEV= 6
##$NOISF1= 0
##$NOISF2= 0
##$NSP= 0
##$NTH_PI= 0
##$NZP= 0
##$OFFSET= 16.522
##$PC= 1
##$PHC0= -88.27203
##$PHC1= 13.79026
##$PH_mod= 1
##$PKNL= yes
##$PPARMOD= 0
##$PSCAL= 4
##$PSIGN= 0
##$REVERSE= no
##$SF= 250.13
##$SI= 32768
##$SIGF1= 0
##$SIGF2= 0
##$SINO= 400
##$SIOLD= 32768
##$SREGLST= <1H.DMSO>
##$SSB= 0
##$STSI= 32768
##$STSR= 0
##$SW_p= 5175.98343685301
##$SYMM= 0
##$S_DEV= 0
##$TDeff= 65536
##$TDoff= 0
##$TI= <Analysis number 999999
Compound Code 99
Book Reference 9
Project Code 9>
##$TILT= no
##$TM1= 0
##$TM2= 0
##$TOPLEV= 0
##$USERP1= <user>
##$USERP2= <user>
##$USERP3= <user>
##$USERP4= <user>
##$USERP5= <user>
##$WDW= 1
##$XDIM= 32768
##$YMAX_p= 454357810
##$YMIN_p= -413578
$$ End of Bruker specific parameters
$$ ---------------------------------
##NTUPLES= NMR SPECTRUM
##VAR_NAME=  FREQUENCY,     SPECTRUM/REAL,   SPECTRUM/IMAG
##SYMBOL=    X,             R,               I
##VAR_TYPE=  INDEPENDENT,   DEPENDENT,       DEPENDENT
##VAR_FORM=  AFFN,          ASDF,            ASDF
##VAR_DIM=   32768,         32768,           32768
##UNITS=     HZ,            ARBITRARY UNITS, ARBITRARY UNITS
##FACTOR=    0.157963299565203, 1,           1
##FIRST=     4132.6476996994, 0,             0
##LAST=      -1043.33573715361, 0,           0
##MIN=       -1043.33573715361, -413578,     0
##MAX=       4132.6476996994, 454357810,     0
$$ Real data points
##PAGE= N=1
##DATA TABLE= (X++(R..R)), XYDATA
$$ [...]
$$ plain form
18412 37760 -29568 -19951 13787 59549 183398 323327 232133 170653 184657 281464 260265
18401 260265 199550 166654 255977 285210 207759 126948 128098 219317 308763 273132 305286 378753
18389 378753 417066 396358 360393 270076 249551 257532 133647 100592 193444 274689 293262
18378 293262 240294 209167 110912 90341 52905 2848 49881 115008 186620 279212 334975
18367 334975 358011 389308 378985 315210 296274 353856 328154 363838 386573 380369 328109 253788
18355 253788 201135 205167 203679 176931 258106 284060 302428 292493 249088 231938 275866 200765
18343 200765 226375 235725 322594 396140 468943 459144 420239 472832 483580 477473 457762 514306
18331 514306 562794 600961 638117 735314 800449 742616 685077 576415 553217 447458 385751
$$ packed form
18412C7760o7328R617L3738M5762J23849J39929r1194o1480J4004R6807k1199
18401B60265o0715l2896Q9323K9233p7451q0811J150R1219Q9446l5631L2154P3467
18389C78753L8313k0708l5965r0317k0525P981j23885l3055R2852Q1245J8573
18378B93262n2968l1127r8255k0571l7436n0057M7033O5127P1612R2592N5763
18367C34975K3036L1297j0323o3775j8936N7582k5702L5684K2735o204n2260p4321
18355B53788n2653M032j488k6748Q1175K5954J8368r935m3405j7150M3928p5101
18343B00765K5610R350Q6869P3546P2803r799l8905N2593J0748o107j9711N6544
18331E14306M8488L8167L7156R7197O5135n7833n7539j08662k3198j05759o1707
$$ plain form
18320 385751 457495 427855 371676 389013 365484 415526 493509 526784 406762 320908 288030
18309 288030 205606 167202 179822 136947 176825 221859 278937 251897 231814 174362 2607
18298 2607 -1315 79883 117229 43021 115551 240777 341997 393852 410395 314556 363941 344393
18286 344393 330974 258930 254267 194415 144722 153283 224874 153154 125208 171731 149732 115820
18274 115820 94381 147600 202187 171258 191821 167886 182513 192428 222075 255004 282790 336665
18262 336665 260567 219240 254717 244401 318220 285474 187909 154868 153434 95945 82599 138749
18250 138749 126847 83874 -6093 42873 74730 163612 174264 161945 133289 142533 149281 176023
18238 176023 235209 214308 178436 147056 215102 122047 137004 157322 173880 163807 105449
$$ packed form
18320C85751P1744k9640n6179J7337k3529N0042P7983L3275j20022q5854l2878
18309B88030q2424l8404J2620m2875L9878M5034N7078k7040k0083n7452j71755
18298B607l922Q1198L7346p4208P2530J25226J01220N1855J6543r5839M9385j9548
18286C44393j3419p2044m663n9852m9693Q561P1591p1720k7946M6523k1999l3912
18274A15820k1439N3219N4587l0929K0563k3935J4627R915K9647L2929K7786N3875
18262C36665p6098m1327L5477j0316P3819l2746r7565l3041j434n7489j3346N6150
18250A38749j1902m2973q9967M8966L1857Q8882J0652j2319k8656R244O748K6742
18238A76023N9186k0901l5872l1380O8046r3055J4957K0318J6558j0073n8358
$$ plain form
18227 105449 157560 231738 234498 244834 316845 329016 328548 304688 295210 267558 250566 355753
18215 355753 450922 487098 342879 256940 315518 363412 281900 328236 388314 402776 384856
18204 384856 290770 267129 285943 262983 211131 217702 303281 271491 208356 268683 234215 285038
18192 285038 292266 265586 331255 372083 398612 392349 414291 480460 527550 458616 399649 396703
18180 396703 427214 443677 377657 352362 450901 488537 481014 484605 502584 466074 512861 567199
18168 567199 602102 631359 589799 459720 469062 444201 448035 504292 503957 525422 627768 712091
18156 712091 666384 601745 703578 741753 707791 772192 762724 723275 716284 814937 877657 885358
18144 885358 830968 859278 854881 945796 985986 962126 932970 919599 923873 885860 742583 767579
$$ packed form
18227A05449N2111P4178K760J0336P2011J2171m68k3860r478k7652j6992J05187
18215C55753R5169L6176j44219q5939N8578M7894q1512M6336O0078J4462j7920
18204C84856r4086k3641J8814k2960n1852O571Q5579l1790o3135O0327l4468N0823
18192B85038P228k6680O5669M0828K6529o263K1942O6169M7090o8934n8967k946
18180C96703L0511J6463o6020k5295R8539L7636p523L591J7979l6510M6787N4338
18168E67199L4903K9257m1560j30079R342k4861L834N6257l35K1465J02346Q4323
18156G12091m5707o4639J01833L8175l3962O4401r468l9449o991R8653O2720P701
18144H85358n4390K8310m397R0915M0190k3860k9156j3371M274l8013j43277K4996
$$ plain form
18132 767579 893144 914063 922695 967359 1047040 1122970 1150292 1222243 1258593 1361106 1503429
18121 1503429 1576138 1672145 1834943 1940139 2062584 2192588 2379701 2515552 2604268 2778412
18111 2778412 3009529 3137583 3251453 3543453 3878323 4227212 4758936 5358172 6083849
18102 6083849 7044750 8325115 10066080 12627038 16346296 21604344 28628195 37944663
18094 37944663 48853671 58554774 63199297 63183901 64183532 67149136 67178028 60386337 49334099
18085 49334099 39906925 32830312 27039427 22448561 18919204 16294085 14305752 12707685
18077 12707685 11517407 10855472 10297893 9850816 9631398 9472192 9478359 9716784 10086514
18068 10086514 10696229 11689632 13076216 15049390 17916227 22083783 28036447 35901463
$$ packed form
18132G67579J25565K0919Q632M4664P9681P5930K7322P1951L6350J02513J42323
18121A503429P2709R6007J62798J05196J22445J30004J87113J35851Q8716J74144
18111B778412K31117J28054J13870K92000L34870L48889N31724N99236P25677
18102F083849R60901J280365J740965K560958L719258N258048P023851R316468
18094C7944663J0909008R701103M644523j5396R99631K965604K8892o791691j1052238
18085D9334099r427174p076613n790885m590866l529357k625119j988333j598067
18077A2707685j190278o61935n57579m47077k19418j59206O167K38425L69730
18068A0086514O09715R93403J386584J973174K866837M167556N952664P865016
$$ plain form
18060 35901463 45348909 54069549 58585755 58766474 59537277 62174030 62579271 56803931
18052 56803931 46641525 37740950 31160247 25716659 21212278 17775058 15183989 13217698
18044 13217698 11812302 10631543 9652146 8799858 8046629 7522604 7158129 6820046 6433875
18035 6433875 6164715 6021125 5815054 5547696 5266666 5072725 4868793 4733409 4633409
18026 4633409 4472712 4365464 4373423 4250953 4179098 4170922 4108819 4035458 3948279 3868589 3706187
18015 3706187 3520209 3496776 3582225 3583505 3505417 3441696 3408925 3315248 3197935 3128272 3068481
18004 3068481 2960874 2735064 2576510 2418274 2231299 2170322 2115074 2063258 1953580 1850669
17994 1850669 1715170 1665864 1652986 1582780 1527983 1379536 1342951 1399863 1388652 1390929 1359036
$$ packed form
18060C5901463R447446Q720640M516206J80719P70803K636753M05241n775340
18052E6803931j0162406q900575o580703n443588m504381l437220k591069j966291
18044A3217698j405396j180759r79397q52288p53229n24025l64475l38083l86171
18035F433875k69160j43590k06071k67358k81030j93941k03932j35384j00000
18026D633409j60697j07248P959j22470p1855q176o2103p3361q7179p9690j62402
18015C706187j85978k3433Q5449J280p8088o3721l2771r3677j17313o9663n9791
18004C068481j07607k25810j58554j58236j86975o0977n5248n1816j09678j02911
17994A850669j35499m9306j2878p0206n4797j48447l6585N6912j1211K277l1893
$$ plain form
17983 1359036 1395907 1478569 1412942 1335447 1281726 1220159 1227521 1264384 1292791 1363023 1498594
17972 1498594 1470814 1398660 1390052 1454681 1392174 1236465 1259917 1321315 1271127 1254558 1234197
17961 1234197 1259263 1358754 1412831 1382855 1407655 1566290 1528202 1418695 1533534 1761997
17951 1761997 1863858 1867134 1915586 2039369 2213974 2387823 2700857 3001604 3301167 3685073
17941 3685073 4043043 4386920 4681056 4971661 5336095 5590726 5919716 6430580 7069417
17932 7069417 7991199 9277512 10976492 13286998 16501285 21059215 27609303 36954310
17924 36954310 49775797 66413910 85263862 102145787 112860583 116929829 118293059
17917 118293059 118999375 116104980 105896184 89814408 72882826 58763185 47579022
$$ packed form
17983A359036L6871Q2662o5627p7495n3721o1567P362L6863K8407P0232J35571
17972A498594k7780p2154q608O4629o2507j55709K3452O1398n0188j6569k0361
17961A234197K5066R9491N4077k9976K4800J58635l8088j09507J14839K28463
17951A761997J01861L276M8452J23783J74605J73849L13034L00747K99563L83906
17941C685073L57970L43877K94136K90605L64434K54631L28990N10864O38837
17932G069417R21782J286313J698980K310506L214287M557930O550088R345007
17924C6954310J2821487J6638113J8849952J6881925J0714796M069246J363230
17917A18293059P06316k894395j0208796j6081776j6931582j4119641j1184163
$$ plain form
17910 47579022 38630727 31597449 26176087 21981988 18830963 16429720 14617795 13223776
17902 13223776 12195994 11378867 10814486 10289076 9902184 9541526 9237229 8852537 8498867
17893 8498867 8049462 7686446 7378978 7144568 6999684 6945199 6902913 6744042 6638418 6476108
17883 6476108 6383003 6292207 6123907 5924155 5597872 5177748 4914067 4699304 4499049 4269278
17873 4269278 4069069 3896877 3672670 3461751 3221601 3096252 3028099 2983424 2882040 2658083
17863 2658083 2468028 2392393 2183369 2045278 1902033 1793892 1568811 1390083 1326746 1290338
17853 1290338 1298693 1289427 1303739 1257337 1069091 1036299 1052669 1101397 1070175 945576 922859
17842 922859 884155 734966 770031 819067 779250 663159 591868 584474 598957 667119 612997
$$ packed form
17910D7579022q948295p033278n421362m194099l151025k401243j811925j394019
17902A3223776j027782q17127n64381n25410l86892l60658l04297l84692l53670
17893H498867m49405l63016l07468k34410j44884n4485m2286j58871j05624j62310
17883F476108r3105r0796j68300j99752l26283m20124k63681k14763k00255k29771
17873D269278k00209j72192k24207k10919k40150j25349o8153m4675j01384k23957
17863B658083j90055p5635k09024j38091j43245j08141k25081j78728o3337l6408
17853A290338Q355r266J4312m6402j88246l2792J6370M8728l1222j24599k2717
17842I22859l8704j49189L5065M9036l9817j16091p1291p394J4483O8162n4122
$$ plain form
17831 612997 456114 442774 450166 439477 471373 400136 406049 337295 322397 298672 299356 247842
17819 247842 260553 230204 201074 207453 339093 367153 249150 117505 57269 104928 114668
17808 114668 241741 262324 225457 217788 230394 246150 208336 173680 180590 265281 363376 352298
17796 352298 324456 400979 437700 437901 428558 403836 336082 271122 229889 283883 363172 326074
17784 326074 257712 225013 121853 84484 121902 141975 149701 117333 160077 144690 53971
17773 53971 35403 76026 19687 62271 169638 122401 6814 26385 -51835 -36697 -11285
17762 -11285 115701 166077 165512 148241 200772 184133 100597 142693 209138 263037 306025 334312
17750 334312 277054 257236 233888 230974 252284 183953 114090 118217 82291 182977 281883 326770
$$ packed form
17831F12997j56883j3340P392j0689L1896p1237N913o8754j4898k3725O84n1514
17819B47842J2711l0349k9130O379J31640K8060j18003j31645o0236M7659R740
17808A14668J27073K0583l6867p669J2606J5756l7814l4656O910Q4691R8095j1078
17796C52298k7842P6523L6721K01r343k4722o7754o4960m1233N3994P9289l7098
17784C26074o8362l2699j03160l7369L7418K0073P726l2368M2744j5387r0719
17773E3971j8568M0623n6339M2584J07367m7237j15587J9571p8220J5138K5412
17762a1285J26986N0376n65j7271N2531j6639q3536M2096O6445N3899M2988K8287
17750C34312n7258j9818k3348k914K1310o8331o9863M127l5926J00686R8906M4887
$$ plain form
17738 326770 261033 299291 249592 339626 456243 340551 275897 357810 323920 311660 315915
17727 315915 246152 193414 264810 354349 266312 249181 250572 243468 194315 134702 207369 224081
17715 224081 258021 286631 296707 167415 185270 214686 231901 244220 309903 266775 177064
17704 177064 149771 166895 143838 76374 -20721 -28351 54513 160241 205146 221544 196310
17693 196310 167660 220960 285901 277242 330554 347681 356217 423336 522922 565812 560179 514046
17681 514046 567926 524243 470108 543783 463015 326661 264989 147882 197273 293768 233404
17670 233404 145378 199352 232873 211702 231159 180505 192018 172901 130839 111462 46002
17659 46002 5383 -923 30170 87150 142331 212408 209664 237297 275403 316851 229573 197169
$$ packed form
17738C26770o5737L8258m9699R0034J16617j15692o4654Q1913l3890j2260M255
17727C15915o9763n2738P1396Q9539q8037j7131J391p104m9153n9613P2667J6712
17715B24081L3940K8610J0076j29292J7855K9416J7215J2319O5683m3128q9711
17704A77064k7293J7124k3057o7464r7095p630Q2864J05728M4905J6398k5234
17693A96310k8650N3300O4941q659N3312J7127Q536O7119R9586M2890n633m6133
17681E14046N3880m3683n4135P3675q0768j36354o1672j17107M9391R6495o0364
17670B33404q8026N3974L3521k1171J9457n0654J1513j9117m2062j9377o5460
17659D6002m0619o306L1093N6980N5181P0077k744K7633L8106M1448q7278l2404
$$ plain form
17647 197169 277703 354375 307874 287651 245773 142897 93064 109832 37588 27561 72568
17636 72568 35302 13836 -68783 -193684 -163664 -148344 -59425 -51676 -69255 -149970 -176548 -80444
17624 -80444 62338 54004 73220 162981 199401 153013 34648 30071 23929 -7500 63637 52589
17612 52589 42276 28286 -25031 -98185 -71025 29126 29018 25217 -22826 -108117 -61210 72423
17600 72423 122339 125952 47366 49393 185087 156859 105473 25624 -6121 -45764 -11928 34840
17588 34840 -7030 68161 45629 -36167 -47943 3890 -13642 79702 160704 130334 131758 138951
17576 138951 107367 -10371 -100195 -100740 -13803 8295 177509 240408 204581 145981 92320
17565 92320 72226 60440 85364 36446 -33794 -36550 -20501 65156 64527 70796 76737 66340 168769
$$ packed form
17647A97169Q0534P6672m6501k0223m1878j02876m9833J6768p2244j0027M5007
17636G2568l7266k1466q2619j24901L0020J5320Q8919P749j7579q0715k6578R6104
17624h0444J42782q334J9216Q9761L6420m6388j18365m577o142l1429P1137j1048
17612E2589j0313j3990n3317p3154K7160J00151j08l801m8043q5291M6907J33633
17600G2423M9916L613p8586K027J35694k8228n1386p9849l1745l9643L3836M6768
17588C4840m1870P5191k2532q1796j1776N1833j7532R3344Q1002l0370J424P193
17576A38951l1584j17738q9824n45Q6937K2098J69214O2899l5827n8600n3661
17565I2320k0094j1786K4924m8918p0240k756J6049Q5657o29O269N941j0397J02429
$$ plain form
17552 168769 232376 267452 118399 75028 47582 36106 130557 120988 173298 267279 183342
17541 183342 77503 135045 191974 152073 130791 64918 87336 104447 20974 -25636 74080
17530 74080 172316 88015 56606 178453 166991 28138 -13430 114675 69457 -9806 137459
17519 137459 190852 109938 -17818 -63698 -10880 52802 117296 66026 84022 132169 127914
17508 127914 245729 352879 383909 263598 188916 283707 235338 154717 215852 309429 249721
17497 249721 154382 82493 4787 -80378 200 106438 13264 -14290 85931 177429 109987
17486 109987 77476 90720 -10957 -53617 -48224 19773 51882 -84 83708 142172 87066
17475 87066 1948 23847 -3470 25927 -33012 3015 85599 223183 214672 185244 62948
$$ packed form
17552A68769O3607L5076j49053m3371k7446j1476R4451r569N2310R3981q3937
17541A83342j05839N7542N6929l9901k1282o5873K2418J7111q3473m6610R9716
17530G4080R8236q4301l1409J21847j1462j38853m1568J28105m5218p9263J47265
17519A37459N3393q0914j27756m5880N2818O3682O4494n1270J7996M8147m255
17508A27914J17815J07150L1030j20311p4682R4791m8369q0621O1135R3577n9708
17497B49721r5339p1889p7706q5165Q0578J06238r3174k7554J00221R1498o7442
17486A09987l2511J3244j01677m2660N393O7997L2109n1966Q3792N8464n5106
17475H7066q5118K1899k7317K9397n8939L6027Q2584J37584q511k9428j22296
$$ plain form
17464 62948 4017 -23294 -3294 87438 86425 -39296 -109169 -117728 -110528 -176393 -270031 -178206
17452 -178206 -104733 -60334 47864 152511 110555 35993 -101708 -94181 -63548 -38210 -10886
17441 -10886 2239 22145 33468 80759 86964 -15679 -13702 4965 -26111 -20430 48260 -7185
17429 -7185 -85704 -20208 16916 27784 45799 61749 81508 56723 30755 8470 -5367 7957
17417 7957 9882 39588 157822 57195 61634 126882 143178 46070 -53648 -4040 -64192 -76770
17405 -76770 -32594 -45968 -20324 1256 18073 -124775 -115743 -68921 -49456 -52282 -89956 -54022
17393 -54022 -80696 -153734 -116265 -124623 -112945 -27702 -125578 -94108 -27999 -46507 -19096 -4409
17381 -4409 -28841 -82125 -79826 -135924 -179007 -58620 16478 34738 98598 97055 10395 93552
$$ packed form
17464F2948n8931k7311K0000R0732j013j25721o9873q559P200o5865r3638R1825
17452a78206P3473M4399J08198J04647m1956p4562j37701P527L0633K5338K7324
17441a0886J3125J9906J1323M7291O205j02643J977J8667l1076N681O8690n5445
17429g185p8519O5496L7124J0868J8015J5950J9759k4785k5968k2285j3837J3324
17417G957J925K9706J18234j00627M439O5248J6296r7108r9718M9608o0152j2578
17405g6770M4176j3374K5644K1580J6817j42848R032M6822J9465k826l7674L5934
17393e4022k6674p3038L7469q358J1678Q5243r7876L1470O6109j8508K7411J4687
17381d409k4432n3284K299n6098m3083J20387P5098J8260O3860j543q6660Q3157
$$ plain form
17369 93552 34774 -47462 -73879 -71332 -86291 -50951 -25329 -3185 31442 42411 35034 -20347
17357 -20347 39922 35959 86822 107200 155792 220653 181658 170186 281008 367062 423672 400511
17345 400511 465436 468881 349827 268929 213400 168174 236522 259522 347139 314966 210996
17334 210996 132007 138235 104528 183455 205466 151010 150795 149555 202596 202617 181642 91826 11581
17321 11581 -18673 -125524 -137323 -24821 56405 61777 -33751 -68000 -31762 93995 169354
17310 169354 120002 63235 102382 130900 10920 -66631 22341 185785 200328 155056 103865
17299 103865 37837 -80464 -101491 -97032 -163634 -202812 -146352 -131880 -155566 -210847 -198100
17288 -198100 -86233 -41649 36240 28835 36666 -20033 -129741 -58830 111407 57580 2090
$$ packed form
17369I3552n8778q2236k6417K547j4959L5340K5622K2144L4627J0969p377n5381
17357b0347O0269l963N0863K0378M8592O4861l8995j1472J10822Q6054N6610k3161
17345D00511O4925L445j19054q0898n5529m5226O8348K3000Q7617l2173j03970
17334B10996p8989O228l3707P8927K2011n4456k15j240N3041K1k0975q9816q0245
17321A1581l0254j06851j1799J12502Q1226N372r5528l4249L6238J25757P5359
17310A69354m9352n6767L9147K8518j19980p7551Q8972J63444J4543m5272n1191
17299A03865o6028j18301k1027M459o6602l9178N6460J4472k3686n5281J2747
17288a98100J11867M4584P7889p405P831n6699j09708P0911J70237n3827n5490
$$ plain form
17277 2090 -24739 -4157 -89279 -89400 32797 40374 -15323 57150 67137 -17349 -121177 -217493
17265 -217493 -144886 -163149 -173970 -151265 -137974 -123308 -134322 -111823 -29939 -120418 -221187
17254 -221187 -229805 -193721 -179880 -138983 -79897 -164352 -90836 -57628 -69076 43942 26859
17243 26859 18257 24510 -93378 -80247 9709 14060 -101841 -77469 -95151 -195158 -293017 -300422
17231 -300422 -247196 -182527 -160689 -164839 -49543 43365 27626 26161 -35119 -61081 -49644 -1961
17219 -1961 78361 76940 20871 8778 126369 139660 145233 124466 31394 16046 38560 23057
17207 23057 128301 102382 251 -13977 -12621 -21614 2198 -8614 -76080 -128024 -125428 -143564
17195 -143564 -144024 -45053 -2060 2774 -79809 -120627 -109979 -66032 -136703 -147242 -80272 -12682
$$ packed form
17277B090k6829K0582q5122j21J22197P577n5697P2473R987q4486j03828r6316
17265b17493P2607j8263j0821K2705J3291J4666j1014K2499Q1884r0479j00769
17254b21187q618L6084J3841M0897N9086q4455P3516L3208j1448J13018j7083
17243B6859q602O253j17888J3131Q9956M351j15901K4372j7682j00007r7859p405
17231c00422N3226O4669K1838m150J15296R2908j5739j465o1280k5962J1437M7683
17219a961Q0322j421n6069j2093J17591J3291N573k0767r3072j5348K2514j5503
17207B3057J05244k5919j02131j4228J356q993K3812j0812o7466n1944K596j8136
17195a43564m60R8971M2993M834q2583m0818J0648M3947p0671j0539O6970O7590
$$ plain form
17183 -12682 -43758 -43637 -44535 -91239 -51930 12283 98430 82467 -16539 -65143 -207858 -179335
17171 -179335 -128832 -224665 -311784 -235632 -131130 -120828 -60560 -45493 -40965 -42246 -36961 57124
17159 57124 138736 104599 104856 -23968 -158027 -148489 -152418 -54825 15322 26141 -63003 -58651
17147 -58651 -39579 -149062 -117702 -107355 -80806 -50204 3186 -75193 -120403 -132201 -37277
17136 -37277 107523 173707 92287 5251 -65661 -47946 -17768 -25235 -43074 -88920 -163334 -155940
17124 -155940 -94135 -22462 -42529 -71369 -76183 -26680 -23491 -69673 11723 -27118 13340 1829
17112 1829 -76644 -128983 -215557 -231505 -101823 -89687 -64931 -25095 -46176 -117872 -151420 -87438
17100 -87438 -71847 -88360 -63562 12377 64124 19799 -46226 -56007 -46834 -95736 -207702 -52648
$$ packed form
17183a2682l1076J21q98m6704L9309O4213Q6147j5963r9006m8604j42715K8523
17171a79335N0503r5833q7119P6152J04502J0302O0268J5067M528j281N285R4085
17159E7124Q1612l4137K57j28824j34059R538l929R7593P0147J0819q9144M352
17147e8651J9072j09483L1360J0347K6549L0602N3390p8379m5210j1798R4924
17136c7277J44800O6184q1420q7036p0912J7715L0178p467j7839m5846p4414P394
17124a55940O1805P1673k0067k8840m814M9503L189m6182Q1396l8841M0458j1511
17112A829p8473n2339q6574j5948J29682J2136K4756L9836k1081p1696l3548O3982
17100h7438J5591j6513K4798P5939N1747m4325o6025r781R173m8902j11966J55054
$$ plain form
17088 -52648 37799 12251 -5468 -12736 15062 42300 11239 -92218 -61036 137639 185828
17077 185828 31790 -87464 -95386 -94370 -172721 -137418 -168348 -137698 -93837 6332 -49262
17066 -49262 -69543 -121403 -214690 -279392 -259670 -153852 -58851 -64433 -108924 -36102 -34705 26219
17054 26219 7499 -49533 -138771 -124358 -10219 -26760 -125980 -160636 -91330 -81029 -167893
17043 -167893 -199072 -210703 -173024 -101737 -113123 -138929 -165443 -141650 -156503 -174885 -117261
17032 -117261 -148416 -218031 -213387 -279318 -171301 -99221 -25928 56842 -39620 -223606 -275410
17021 -275410 -229572 -177501 -209847 -184829 -211635 -276347 -141923 -148272 -209039 -202991 -180543 -244146
17009 -244146 -149714 -61515 23888 104222 56067 32425 -191 -37270 -101154 -78694 -128924
$$ packed form
17088e2648R0447k5548j7719p268K7798K7238l1061j03457L1182J98675M8189
17077A85828j54038j19254p922J016p8351L5303l0930L0650M3861J00169n5594
17066d9262k0281n1860r3287o4702J9722J05818R5001n582m4491P2822J397O0924
17054B6219j8720n7032q9238J4413J14139j6541r9220l4656O9306J0301q6864
17043a67893l1179j1631L7679P1287j1386k5806k6514K3793j4853j8382N7624
17032a17261l1155o9615M644o5931J08017P2080P3293Q2770r6462j83986n1804
17021b75410M5838N2071l2346K5018k6806o4712J34424o349o0767O048K2448o3603
17009b44146R4432Q8199Q5403Q0334m8155k3642l2616l7079o3884K2460n0230
$$ plain form
16998 -128924 -129263 -187580 -236326 -188852 -165513 -140796 -80183 -112773 -83542 5675 5095 42176
16986 42176 -36928 4326 4310 60425 70232 -16685 -100751 -158384 -171294 -148809 -44538 56761
16974 56761 26903 -23511 -22289 44553 75935 116880 -21118 -103299 28039 69552 92306
16963 92306 99431 168242 153905 232168 136256 -7126 -33010 -23938 -70509 -82149 -57865 -13090
16951 -13090 138234 207308 160810 74819 32003 104463 68810 28585 -39113 -58032 -112068
16940 -112068 -139399 -94776 -47921 -18924 -53190 -93699 -78178 -58538 -40299 -50385 -111126
16929 -111126 -82555 -49667 -87448 -126916 -86761 -8263 17485 -70552 -178935 -251619 -221666
16918 -221666 -119301 -60790 -21291 -14001 16387 67410 7262 11868 10250 -15237 51897 122327
$$ packed form
16998a28924l39n8317m8746M7474K3339K4717O0613l2590K9231Q9217n80L7081
16986D2176p9104M1254j6N6115R807q6917q4066n7633j2910K2485J04271J01299
16974E6761k9858n0414J222O6842L1382M0945j37998q2181J31338M1513K2754
16963I2306P125O8811j4337P8263r5912j43382k5884R072m6571j1640K4284M4775
16951a3090J51324O9074m6498q5991m2816P2460l5653m0225o7698j8919n4036
16940a12068k7331M4623M6855K8997l4266m0509J5521J9640J8239j0086o0741
16929a11126K8571L2888l7781l9468M0155P8498K5748q8037j08383p2684K9953
16918b21666J02365N8511L9499P290L0388N1023o0148M606j618k5487O7134P0430
$$ plain form
16906 122327 114003 77927 54729 21050 -27623 -37511 23455 95139 61155 63700 104020 178748
16894 178748 165006 75796 17094 35659 23042 -8759 -32602 -32409 -115536 -151032 -96076 53465
16882 53465 123355 135602 118796 28559 -37615 -21008 10448 34281 -28332 -90771 -106794 -24471
16870 -24471 -1215 60356 124287 90983 115390 5940 -140105 -174554 -143328 -64371 -85478
16859 -85478 -22967 149515 142093 44349 58526 53413 27307 -48632 -26560 25684 -6799 28249
16847 28249 71243 58491 20947 31191 -1865 -32564 -48292 -28429 22689 -26179 -83290 -198637
16835 -198637 -156589 -167172 -88578 -81515 -126616 -89677 -3981 67885 98108 63933 -10943 -47521
16823 -47521 -107854 -62330 -133140 -112219 -45067 -6124 -2532 -38751 -109237 -178220 -181492 -181974
$$ packed form
16906A22327q324l6076k3198l3679m8673r888O0966P1684l3984K545M0320P4728
16894A78748j3742q9210n8702J8565j2617l1801k3843J93q3127l5496N4956J49541
16882E3465O9890J2247j6806r0237o6174J6607L1456K3833o2613o2439j6023Q2323
16870b4471K3256O1571O3931l3304K4407j09450j46045l4449L1226P8957k1107
16859h5478O2511J72482p422r7744J4177n113k6106p5939K2072N2244l2483L5048
16847B8249M2994j2752l7544J0244l3056l0699j5728J9863N1118m8868n7111j15347
16835a98637M2048j0583P8594P063m5101L6939Q5696P1866L0223l4175p4876l6578
16823d7521o0333M5524p0810K0921O7152L8943L592l6219p0486o8983l272m82
$$ plain form
16811 -181974 -175972 -113963 -62839 -27886 1014 -86949 -197480 -279795 -275284 -127025 -44134
16800 -44134 -6050 85107 41323 -60689 -10731 -49967 -74206 -78526 -50998 -38396 -58898 -35369
16788 -35369 -29492 -11975 -105707 -136625 -15022 50105 -123750 -241496 -197518 -153953 -101276
16777 -101276 -19044 -28396 -26047 -35521 -3496 24159 53212 125112 106304 23775 -94052 -122795
16765 -122795 -116282 -129371 -90006 -81897 -33032 -83400 -173235 -139845 -95382 53087 50030 -5619
16753 -5619 -109850 -77787 -58964 -100680 -82738 -61671 -102826 -88026 44748 102406 140104
16742 140104 165433 78450 37530 74018 36765 -43779 -100431 -72463 -162449 -108321 -75677
16731 -75677 -2969 92009 86783 48186 31796 50241 -898 -95138 -105493 -161050 -125009 -89896
$$ packed form
16811a81974O002O2009N1124L4953K8900q7963j10531q2315M511J48259Q2891
16800d4134L8084R1157m3784j02012M9958l9236k4239m320K7528J2602k0502K3529
16788c5369N877J7517r3732l0918J21603O5127j73855j17746M3978M3565N2677
16777a01276Q2232r352K349r474L2025K7655K9053P1900j8808q2529j17827k8743
16765a22795O513j3089L9365Q109M8865n0368q9835L3390M4463J48469l057n5649
16753e619j04231L2063J8823m1716J7942K1067m1155J4800J32774N7658L7698
16742A40104K5329q6983m0920L6488l7253q0544n6652K7968q9986N4128L2644
16731g5677P2708R4978n226l8597j6390J8445n1139r4240j0355n5557L6041L5113
$$ plain form
16719 -89896 -3815 40787 -18569 998 23602 -11145 -74717 -129371 -169850 -59394 23514
16708 23514 -83037 -35802 6678 -4975 37376 -16668 -31658 -55347 -110880 -104044 -41403 89388
16696 89388 191923 132481 126957 147978 81888 84422 57848 -7382 -3393 99164 128677 52145
16684 52145 -24816 -65487 -123800 -114125 -104474 -150260 -180112 -203198 -169167 -207715 -212425 -172129
16672 -172129 -78980 -23584 -66790 -148537 -86506 -91623 -35061 5423 -56906 -26579 45712 13825
16660 13825 66666 72650 64693 -5697 -22114 -13802 -105047 -100172 -30540 -37736 -85274 -132780 -74497
16647 -74497 -63835 -114634 -184619 -163827 -97093 -80539 -165902 -58558 149304 152546 93360
16636 93360 45603 -48182 -89494 -174930 -102690 29653 15027 -3816 34753 32818 36558 99141
$$ packed form
16719h9896Q6081M4602n9356J9567K2604l4747o3572n4654m0479J10456Q2908
16708B3514j06551M7235M2480j1653M2351n4044j4990k3689n5533O836O2641J30791
16696H9388J02535n9442n524K1021o6090K534k6574o5230L989J02557K9513p6532
16684E2145p6961m0671n8313R675R651m5786k9852k3086L4031l8548m710M0296
16672a72129R3149N5396m3206q1747O2031n117N6562M0484o2329L0327P2291l1887
16660A3825N2841N984p957p0390j6417Q312r1245M875O9632p196m7538m7506N8283
16647g4497J0662n0799o9985K0792O6734J6554q5363J07344K07862L242n9186
16636I3360m7757r3785m1312q5436P2240J32343j4626j8843L8569j935L740O2583
$$ plain form
16624 99141 78905 72135 11775 49588 91285 156404 129941 50525 -49521 -116125 -199411 -114935
16612 -114935 -31830 20471 77955 72639 87828 80593 54468 -44942 -44513 89494 83536 67799
16600 67799 88981 49631 -84505 -162738 -188156 -170390 -154638 -79161 -31717 -55497 -147821
16589 -147821 -152539 -105262 -39129 -61435 -90781 -96645 -64857 -137896 -89077 -48822 -5770 2100
16577 2100 -74172 -64432 26946 11424 -25877 5386 886 -69856 -89750 -67912 -24797 -43422
16565 -43422 -122628 -160684 -52891 211750 245926 225717 99035 13681 44833 32621 12951
16554 12951 -7839 -90760 -95458 23214 6064 4983 -16009 4160 -96188 -60993 -44133 -153013
16542 -153013 -248861 -286156 -250433 -216198 -94840 -15832 62355 44411 -42718 -31303 33258
$$ packed form
16624I9141k0236o770o0360L7813M1697O5119k6463p9416j00046o6604q3286Q4476
16612a14935Q3105N2301N7484n316J5189p235k6125r9410M29J34007n958j5737
16600F7799K1182l9350j34136p8233k5418J7766J5752P5477M7444k3780r2324
16589a47821m718M7277O6133k2306k9346n864L1788p3039M8819M0255M3052P870
16577B100p6272R740R1378j5522l7301L1263m500p0742j9894K1838M3115j8625
16565d3422p9206l8056J07793K64641L4176k0209j26682q5354L1152j2212j9670
16554A2951k0790q2921m698J18672j7150j081k0992K0169j00348L5195J6860j08880
16542a53013r5848l7295L5723L4235J21358P9008P8187j7944q7129J1415O4561
$$ plain form
16531 33258 4906 -15430 -55177 -147274 -206492 -144198 -133871 -171253 -136998 -89359 -170017 -76200
16519 -76200 102 100784 33388 104775 90794 -33832 -74068 -64105 -77101 -137915 -193792
16508 -193792 -212888 -164254 -151030 -147524 -148948 -116174 -39779 -66826 -106060 -88558 -133461 -186629
16496 -186629 -205368 -195238 -154982 -151240 -111347 -60847 -30120 -4203 68677 113995 141086 113708
16484 113708 26 -51351 -56728 30845 89680 53599 -37301 -70563 19544 43001 59732
16473 59732 95615 106742 70911 97311 85724 151133 53379 24126 68801 81410 115626 205746
16461 205746 190084 66798 87286 36059 -9288 -99649 -93048 -81028 -100826 -45837 11986
16450 11986 51044 39112 20837 -58990 -165689 -95170 -37761 -18608 -71282 -4093 38885
$$ packed form
16531C3258k8352k0336l9747r2097n9218O2294J0327l7382L4255M7639q0658R3817
16519g6200P6302J00682o7396P1387j3981j24626m0236R963j2996o0814n5877
16508a93792j9096M8634J3224L506j424L2774P6395k7047l9234J7502m4903n3168
16496a86629j8739J0130M0256L742L9893N0500L0727K5917P2880M5318K7091k7378
16484A13708j13682n1377n377Q7573N8835l6081r0900l3262R0107K3457J6731
16473E9732L5883J1127l5831K6400j1587O5409r7754k9253M4675J2609L4216R0120
16461B05746j5662j23286K0488n1227m5347r0361O601J2020j9798N4989N7823
16450A1986L9058j1932j8275p9827j06699P0519N7409J9153n2674O7189M2978
$$ plain form
16439 38885 16113 49067 -65391 -147695 -93099 23562 -38339 -190762 -183456 -22485 37481
16428 37481 -44478 -19299 -44794 -90038 -78833 69149 32616 107739 95545 22901 45719
16417 45719 -29729 -16331 -48820 -72655 -39885 11923 -30026 -26042 -94289 -115652 -97140 -109867
16405 -109867 -85531 13282 17588 -56857 -77487 -14187 -57789 -86801 -33241 -31545 -28216 -75218
16393 -75218 -114644 -116833 -86494 -50878 -19420 -1042 28568 1212 -12434 7873 30201 11456
16381 11456 -18444 -58139 4785 -19227 32308 92325 78300 114083 102157 39536 18597 -31405
16369 -31405 -79979 -117314 -130169 -30504 21195 -2627 -21873 -167805 -194946 -130997 -125354 -84634
16357 -84634 -34114 -68859 27796 77556 84893 44168 38850 -1547 -48955 -67689 44252 97580
$$ packed form
16439C8885k2772L2954j14458q2304N4596J16661o1901j52423P306J60971N9966
16428C7481q1959K5179k5495m5244J1205J47982l6533P5123j2194p2644K2818
16417D5719p5448J3398l2489k3835L2770N1808m1949L984o8247k1363J8512j2727
16405a09867K4336R8813M306p4445k0630O3300m3602k9012N3560J696L329m7002
16393g5218l9426k189L0339L5616L1458J8378K9610k7356j3646K0307K2328j8745
16381A1456k9900l9695O2924k4012N1535O0017j4025L5783j1926o2621k0939n0002
16369c1405m8574l7335j2855R9665N1699k3822j9246j45932k7141O3949N643M0720
16357h4634N0520l4745R6655M9760P337m0725n318m0397m7408j8734J11941N3328
$$ plain form
16345 97580 115163 119533 83691 18062 -14974 -48549 -50833 -271 -69965 -110547 -36024 -42662
16333 -42662 -80723 -39893 -37257 -71904 -161496 -153045 -92744 -34843 31526 36951 -53954 -47149
16321 -47149 -6160 -87316 -131284 -24909 -24236 -23410 -22439 -41291 -91943 -27786 -6496 -99247 -54136
16308 -54136 -165974 -270898 -191236 -45976 -56685 -192767 -222745 -225570 -184643 -109135 -17900
16297 -17900 -62311 -104213 -40732 -44577 -33773 -233 -44082 -76647 -57616 -89479 -55730 6351
16285 6351 15486 12764 -96776 -207536 -197812 -155454 -182686 -165361 -121437 -148828 -64058 -69027
16273 -69027 -74187 -107053 -83930 -53411 -9598 62510 15859 -54282 -35173 37185 31007 -37623
16261 -37623 -51249 -69946 -79088 -18831 21640 -49286 -41078 -8913 -33512 -29603 -82000 -73900
$$ packed form
16345I7580J7583M370l5842o5629l3036l3575k284N0562o9694m0582P4523o638
16333d2662l8061M0830K636l4647q9592Q451O0301N7901O6369N425r0905O805
16321d7149M0989q1156m3968J06375O73Q26R71j8852n0652O4157K1290r2751M5111
16308e4136j11838j04924P9662J45260j0709j36082k9978k825M0927P5508R1235
16297a7900m4411m1902O3481l845J0804L3540m3849l2565J9031l1863L3749O2081
16285F351R135k722j09540j10760R724M2358k7232J7325M3924k7391Q4770m969
16273f9027n160l2866K3123L0519M3813P2108m6651p0141J9109P2358o178o8630
16261c7623j3626j8697r142O0257M0471p0926Q208L2165k4599L909n2397Q100
$$ plain form
16249 -73900 -112372 -196104 -160537 -49267 42113 16474 37692 86134 50398 -29340 -120063
16238 -120063 -125578 -145568 -104825 -94440 -69263 -65336 -35457 -59464 -33589 10574 29317 21840
16226 21840 -46206 -17432 76808 51710 -25148 6827 -15486 -25102 -55453 -91601 -111957 -84818
16214 -84818 -10489 -5224 -89020 -65751 -89300 -89285 -19635 -61896 -125927 -95874 -82936 -134759
16202 -134759 -263055 -329284 -232227 -162878 -132136 -118284 -123084 -54146 -27310 -20936 -78053 -91875
16190 -91875 -120046 -34710 -13853 6439 -41034 20740 17838 43963 100029 120311 57534 71489
16178 71489 2213 -30760 21406 47153 -23991 -111078 -140931 -233139 -160728 -135915 -293
16167 -293 21076 -12785 -76008 -52736 -60177 -111425 -150070 -161944 -228045 -186005 -123990 -70419
$$ packed form
16249g3900l8472q3732L5567J11270R1380k5639K1218M8442l5736p9738r0723
16238a20063n515j9990M0743J0385K5177L927K9879k4007K5875M4163J8743p477
16226B1840o8046K8774R4240k5098p6858L1975k2313r616l0351l6148k0356K7139
16214h4818P4329N265q3796K3269k3549J5O9650m2261o4031L0053J2938n1823
16202a34759j28296o6229R7057O9349L0742J3852m800O8938K6836O374n7117j3822
16190i1875k8171Q5336K0857K0292m7473O1774k902K6125N6066K0282o2777J3955
16178G1489o9276l2973N2166K5747p1144q7087k9853r2208P2411K4813J35622
16167b93K1369l3861o3223K3272p441n1248l8645j1874o6101M2040O2015N3571
$$ plain form
16155 -70419 -106422 -94263 -52879 16041 19563 10634 54566 14392 71466 -18310 -152267 -139602
16143 -139602 -77858 -69392 -66263 -18912 -15927 -23431 19 -19502 37064 95193 -17249 -72385
16131 -72385 -86074 -88391 -40104 -9731 58454 46104 52825 43169 98285 120654 60872 9290
16119 9290 8556 32591 28764 -60719 -47890 -32059 -29581 37641 45942 33940 28282 -34142 -902
16106 -902 -25998 -111394 -121140 -106758 -29349 -11859 -11184 -52291 -65052 -4086 46683 -6205 6909
16093 6909 74465 62031 125224 142001 50413 17081 76869 -40751 -190514 -94182 109144
16082 109144 134377 66539 61004 138729 188776 102361 73409 51936 25681 -40108 -103982 -67761
16070 -67761 -125132 -129800 -69872 -149431 -186438 -142664 -26963 -92780 -87321 -67567 18701 16911
$$ packed form
16155g0419l6003J2159M1384O8920L522q929M3932m0174N7074q9776j33957J2665
16143a39602O1744Q466L129M7351K985p504K3450j9521N6566N8129j12442n5136
16131g2385j3689k317M8287L0373O8185j2350O721r656N5116K2369n9782n1582
16119I290p34K4035l827q9483J2829J5831K478O7222Q301j2002n658o2424L3240
16106i02k5096q5396r746J4382P7409J7490O75m1107j2761O0966N0769n2888J3114
16093F909O7556j2434O3193J6777r1588l3332N9788j17620j49763R6332K03326
16082A09144K5233o7838n535P7725N0047q6415k8952k1473k6255o5789o3874L6221
16070f7761n7371m668N9928p9559l7007M3774J15701o5817N459J9754Q6268j790
$$ plain form
16058 16911 46231 60744 35603 -28766 -140954 -184848 -16472 161505 108363 16492 -17179
16047 -17179 36257 9028 -18873 66499 85351 -90568 -129029 -160145 -219138 -230272 -179815
16036 -179815 -88812 -74748 -102762 -73577 -49745 -67460 -130490 -101001 -37818 795 -64276
16025 -64276 -76437 -10360 23090 16195 -44060 -104772 -111172 -29684 -25215 -42180 11498 78535
16013 78535 77781 43516 -71070 -154363 -174420 -190841 -186504 -112552 -73734 -11834 13997 24994
16001 24994 40928 51398 17713 7287 47288 52485 22587 -86642 -163781 -140592 -53546 28644
15989 28644 42083 24437 -98874 -83648 -44684 -64549 -116973 -196402 -244260 -279349 -242191
15978 -242191 -109692 94366 245523 172816 30973 62609 52464 33415 35377 55704 10330
$$ packed form
16058A6911K9320J4513k5141o4369j12188m3894J68376J77977n3142r1871l3671
16047a7179N3436k7229k7901Q5372J8852j75919l8461l1116n8993j1134N0457
16036a79815R1003J4064k8014K9185K3832j7715o3030K9489O3183L8613o5071
16025f4276j2161O6077L3450o895o0255o0712o400Q1488M469j6965N3678O7037
16013G8535p54l4265j14586q3293k0057j6421M337P3952L8818O1900K5831J0997
16001B4994J5934J0470l3685j0426M0001N197k9898j09229p7139K3189Q7046Q2190
15989B8644J3439j7646j23311J5226L8964j9865n2424p9429m7858l5089L7158
15978b42191J32499K04058J51157p2707j41843L1636j0145j9049J962K0327m5374
$$ plain form
15967 10330 -28026 -84812 13087 40405 36470 141977 106871 155992 171545 132503 41904 9452
15955 9452 -58435 -111336 -136372 -8214 49841 14666 -56506 -67720 -114323 -91095 23339
15944 23339 34987 -27879 -24871 -52350 -80665 -33994 32177 545 -5009 24232 10802 47929
15932 47929 122587 115892 20013 -57812 -126957 -133607 -109928 -174749 -180585 -200158 -206631 -158129
15920 -158129 -56147 -92271 -143018 -159347 -177162 -86380 -19714 55939 45891 -26995 -86190
15909 -86190 -2295 -38176 33231 -74794 -59349 -41169 -80881 11537 49116 -818 11031
15898 11031 46028 34941 -26160 -92039 -57611 11158 -31661 -99048 -137818 -118090 -70897 -55784
15886 -55784 -68846 24979 -13115 -35054 4219 130448 134371 32205 12735 38733 -67811
$$ packed form
15967A0330l8356n6786R7899K7318l935J05507l5106M9121J5553l9042r0599l2452
15955I452o7887n2901k5036J28158N8055l5175p1172j1214m6603K3228J14434
15944B3339J1648o2866L008k7479k8315M6671O6171l1632n554K9241j3430L7127
15932D7929P4658o695r5879p7825o9145o650K3679o4821n836j9573o473M8502
15920a58129J01982l6124n0747j6329j7815R0782O6666P5653j0048p2886n9195
15909h6190Q3895l5881P1407j08025J5445J8180l9712R2418L7579m9934J1849
15898A1031L4997j1087o1101o5879L4428O8769m2819o7387l8770J9728M7193J5113
15886e5784j3062R3825l8094k1939L9273J26229L923j02166j9470K5998j06544
$$ plain form
15875 -67811 -70333 -46244 -7283 -120121 -133642 -97938 -73498 -12308 48931 156720 230679
15864 230679 149843 59476 -34631 -51599 -82142 -77289 72377 26553 -133432 -233139 -230714
15853 -230714 -154419 -82525 -108489 -137140 13507 -6805 36021 90464 96779 61328 59709 89125
15841 89125 113967 28751 50735 88345 77701 44962 23332 -8762 -38545 -60503 -77176 -167062
15829 -167062 -158439 -156355 -89732 38001 -42112 -128928 -124507 -10788 59305 -3704 -122039
15818 -122039 -121785 -139921 -114331 -146171 -193240 -178612 -176460 -44980 -20371 -84644 -130737 -133479
15806 -133479 -172674 -118103 -68596 -81914 -59889 -20512 50619 48394 59194 20078 13869 97454
15794 97454 74557 45978 58014 61267 -38787 -86727 -49504 -5968 -11907 -79106 -13345 26352
$$ packed form
15875f7811k522K4089L8961j12838j3521L5704K4440O1190O1239J07789P3959
15864B30679q0836r0367r4107j6968l0543M853J49666m5824j59985r9707K425
15853b30714P6295P1894k5964k8651J50647k0312M2826N4443O315l5451j619K9416
15841H9125K4842q5216K1984L7610j0644l2739k1630l2094k9783k1958j6673q9886
15829a67062Q623K084O6623J27733q0113q6816M421J13719P0093o3009j18335
15818a22039K54j8136K5590l1840m7069J4628K152J31480K4609o4273m6093k742
15806a33479l9195N4571M9507j3318K2025L9377P1131k225J0800l9116o209Q3585
15794I7454k2897k8579J2036L253j00054m7940L7223M3536n939o7199O5761L9697
$$ plain form
15782 26352 -4733 18985 -26399 -102225 -113485 -85920 -199870 -242160 -180002 -115220 -175722
15771 -175722 -262909 -301323 -229106 -42814 40144 47215 -47078 -47464 -90070 -84745 -90322 -108301
15759 -108301 -114359 -36266 45144 77358 46087 34835 -16382 -145856 -162213 -138070 -68084
15748 -68084 15494 78029 79087 50197 37612 26755 51403 73524 15549 26712 107528 90751
15736 90751 24229 13194 43510 50136 36812 40252 -15140 -9730 -16422 -19906 29982 78006 105189
15723 105189 105544 99701 43567 13967 -29835 -49524 -63599 -147242 -133103 -11659 16524 -35850
15711 -35850 4536 31019 107200 97866 30592 64878 -18785 -5390 10538 78836 64103 76094
15699 76094 36455 -35381 1175 87684 103429 47521 42721 38046 45601 95617 179584 124641
$$ packed form
15782B6352l1085K3718m5384p5826j1260K7565j13950m2290O2158O4782o0502
15771a75722q7187l8414P2217J86292Q2958P071r4293l86m2606N325n577j7979
15759a08301o058P8093Q1410L2214l1271j1252n1217j29474j6357K4143O9986
15748f8084Q3578O2535J058k8890j2585j0857K4648K2121n7975J1163Q0816j6777
15736I0751o6522j1035L0316O626j3324L440n5392N410o692l484M9888M8024K7183
15723A05189L55n843n6134k9600m3802j9689j4075q3643J4139J21444K8183n2374
15711c5850M0386K6483P6181r334o7274L4286q3663J3395J5928O8298j4733J1991
15699G6094l9639p1836L6556Q6509J5745n5908m800m675P555N0016Q3967n4943
$$ plain form
15687 124641 175972 187084 88204 23102 26566 222 -103160 -90591 58037 79477 -15496
15676 -15496 6815 29473 -46935 -116576 -63772 -63368 -111020 -15378 42419 91442 78508 96392
15664 96392 64266 86038 -23046 -143889 -162306 35940 54130 77092 136945 99796 21563
15653 21563 35871 41923 47019 70898 73274 97369 83987 42963 33705 -85141 -118100 -123082
15641 -123082 -93862 -146217 -138714 -64411 -84652 -193669 -187494 -98216 4177 107264 88418
15630 88418 17093 -104561 -31801 -11615 -84920 -34813 3046 -11071 -109777 -192086 -124698
15619 -124698 -70629 40535 116060 122183 159386 195030 104758 77556 145692 169373 151032
15608 151032 163118 31378 27493 141012 152859 67151 -29367 -42143 12327 155461 89740
$$ packed form
15687A24641N1331J1112r8880o5102L464k6344j03382J2569J48628K1440r4973
15676a5496K2311K2658p6408o9641N2804M04m7652R5642N7797M9023j2934J7884
15664I6392l2126K1772j09084j20843j8417J98246J8190K2962N9853l7149p8233
15653B1563J4308O052N096K3879K376K4095j3382m1024r258j18846l2959m982
15641a23082K9220n2355P503P4303k0241j09017O175Q9278J02393J03087j8846
15630H8418p1325j21654P2760K0186p3305N0107L7859j4117r8706q2309O7388
15619a24698N4069J11164P5525O123L7203L5644r0272k7202O8136K3681j8341
15608A51032J2086j31740l885J13519J1847q5708r6518j2776N4470J43134o5721
$$ plain form
15597 89740 -85875 -118590 -94684 -209082 -262396 -210751 -109832 -44809 -54904 -184950 -258522
15586 -258522 -277335 -220410 -191189 -221632 -172486 -162099 -148936 -133623 -153093 -108403 -59298
15575 -59298 3100 63744 43760 39327 -14839 -149741 -149321 -37871 27916 19417 -20384 -67908
15563 -67908 -114104 -103330 -45372 -1692 63952 82784 46183 -12109 14481 93957 117175 72480
15551 72480 -75972 -129341 -64877 -85946 -122547 -60503 24484 21068 97577 109580 128191 163329
15539 163329 132002 87776 -23015 -24592 -8229 19403 61462 92202 42781 62671 64695 64316
15527 64316 -31140 -127109 -142399 -67350 6022 -60824 -19470 38196 -58459 -97546 -68004 -85670
15515 -85670 -58269 -54132 -43142 -52112 -76331 -35324 -13972 -60462 -67723 27028 -52516 -49318
$$ packed form
15597H9740j75615l2715K3906j14398n3314N1645J00919O5023j0095j30046p3572
15586b58522j8813N6925K9221l0443M9146J0387J3163J5313j9470M4690M9105
15575e9298O2398O0644j9984m433n4166j34902M20J11450O5787q499l9801m7524
15563f7908m6196J0774N7958M3680O5644J8832l6601n8292K6590P9476K3218m4695
15551G2480j48452n3369O4464k1069l6601O2044Q4987l416P6509J2003J8611L5138
15539A63329l1327m4226j10791j577J6363K7632M2059L0740m9421J9890K024l79
15527F4316r5456r5969j5290P5049P3372o6846M1354N7666r6655l9087K9542j7666
15515h5670K7401M137J0990q970k4219M1007K1352m6490p261R4751p9544L198
$$ plain form
15503 -49318 -8983 5739 6800 -60498 -191646 -189111 -130537 -64575 -54975 57147 104855 89247
15491 89247 74344 57989 109660 64179 -23811 -39445 2248 -59153 -178549 -98455 16373
15480 16373 -19084 -116544 -65510 -21438 -82876 -20034 -72375 -116600 -184559 -153607 -156223 -105538
15468 -105538 -12998 18541 -42252 -117494 -182703 -284595 -279473 -267645 -169032 -131525 -9768
15457 -9768 87830 -17405 -14151 -24151 -50153 -112845 -58036 62532 37041 10046 -36505 -28228
15445 -28228 -10907 113509 120285 43054 122267 52941 24121 9315 79109 22260 -84378
15434 -84378 -73642 -56470 -117 -35809 -139372 -108057 -12328 27049 40624 51622 -21480
15423 -21480 -49027 -55256 -10410 -67902 -63895 -131307 -153586 -109084 -119061 -108498 -102581 -158879
$$ packed form
15503d9318M0335J4722J061o7298j31148K535N8574O5962R600J12122M7708j5608
15491H9247j4903j6355N1671m5481q7990j5634M1693o1401j19396Q0094J14828
15480A6373l5457r7460N1034M4072o1438O2842n2341m4225o7959L0952k616N0685
15468a05538R2540L1539o0793p5242o5209j01892N122J1828R8613L7507J21757
15457i768R7598j05235L254j0000k6002o2692N4809J20568k5491k6995m6551Q277
15445b8228J7321J24416O776p7231P9213o9326k8820j4806O9794n6849j06638
15434h4378J0736J7172N6353l5692j03563L1315R5729L9377J3575J0998p3102
15423b1480k7547o229M4846n7492M007o7412k2279M4502r977J0563N917n6298
$$ plain form
15411 -158879 -102152 -13824 -31452 -10491 -50164 -175257 -261277 -194081 -89891 835 -12154
15400 -12154 434 -88253 -136195 -18683 76528 56558 65768 29261 -30582 4493 48704 11907
15388 11907 13358 19897 6041 -12309 -61967 -70629 1167 68261 49142 40595 4613 -50054
15376 -50054 -95902 -112387 -97740 -79848 -115161 -120042 -180572 -157025 -143917 -190827 -187908 -89416
15364 -89416 -29225 32895 -24004 -34716 -53790 -101579 -259100 -223057 -64245 8416 17795
15353 17795 -16680 -24527 32912 52369 74 -8473 49949 64668 -53958 -204426 -185208 -82532
15341 -82532 -99274 -60159 -26469 -80569 -103265 -202962 -179482 -119491 -19081 86 4757 9122
15329 9122 112189 49244 49406 150283 113543 81755 76070 168592 157280 41028 -80903 -97753
$$ packed form
15411a58879N6727Q8328j7628K0961l9673j25093q6020O7196J04190R0726j2989
15400a2154J2588q8687m7942J17512R5211j9970R210l6507n9843L5075M4211l6797
15388A1907J451O539j3856j8350m9658q662P1796O7094j9119q547l5982n4667
15376e0054m5848j6485J4647J7892l5313m881o0530K3547J3108m6910K919R8492
15364h9416O0191O2120n6899j0712j9074m7789j57521L6043J58812P2661R379
15353A7795l4475p847N7439J9457n2295q547N8422J4719j18626j50468J9218J02676
15341h2532j6742L9115L3690n4100k2696r9697K3480N9991J00410J9167M671M365
15329I122J03067o2945J62J00877l6740l1788n685R2522j1312j16252j21931j6850
$$ plain form
15317 -97753 -45117 60708 61058 97199 116012 145492 215901 155814 145007 106984 36228 -23395
15305 -23395 -22447 -13711 28125 -41750 -118695 -105712 48220 39967 -73898 -78238 -42340 -62873
15293 -62873 34597 104302 94049 -62183 -114298 -114895 -142134 -104125 -80170 -87038 -87140 -123261
15281 -123261 -113488 -70212 -178898 -127494 -64665 -109063 -125405 -52324 136279 140137 93046
15270 93046 29186 -27787 -40402 -41390 -4738 -24629 -41639 -8742 37931 -29847 -82419 -62158
15258 -62158 -39547 44957 138723 183565 177624 168801 140134 62431 72695 -63796 -96017 -24442
15246 -24442 26822 -48195 -54932 -126256 -115661 -124358 -131590 -183544 -201509 -224589 -126030 -88716
15234 -88716 -22341 -22919 -6467 -71277 -152136 -27599 4599 -14890 -70213 -139111 -149358 -109286
$$ packed form
15317i7753N2636J05825L50L6141J8813K9480P0409o0087j0807l8023p0756n9623
15305b3395R48Q736M1836o9875p6945J2983J53932q253j13865m340L5898k0533
15293f2873R7470O9705j0253j56232n2115n97k7239L8009K3955o868j02l6121
15281a23261R773M3276j08686N1404O2829m4398j6342P3081J88603L858m7091
15270I3046o3860n6973j2615r88L6652j9891j7010L2897M6673o7778n2572K0261
15258f2158K2611Q4504R3766M4842n941q823k8667p7703J0264j36491l2221P1575
15246b4442N1264p5017o737p1324J0595q697p232n1954j7965k3080R8559L7314
15234h8716O6375n78J6452o4810q0859J24537L2198j9489n5323o8898j0247M0072
$$ plain form
15222 -109286 -45322 -167564 -157330 -77531 -65603 -83371 -58755 -38200 73811 138998 23739
15211 23739 -35864 -26615 -57637 -88780 -173969 -168860 -117916 -60852 -40300 32087 39046 -47183
15199 -47183 4684 -14333 -109447 -192627 -147536 -88242 -38874 -607 102712 127685 45019
15188 45019 -27940 -45915 -638 30495 -1953 5823 -58310 -134727 -218444 -226714 -187373 -117659
15176 -117659 -127995 -194964 -141611 -165436 -153722 -108037 -79125 -17006 83665 130077 142489
15165 142489 117714 10197 -38628 17332 12257 50038 15896 -36796 25446 -8303 -30925
15154 -30925 45238 33463 18012 12825 11430 75647 152384 130589 86584 140969 97811 48660
15142 48660 46230 52229 3210 -47917 -43506 115464 139468 54829 45800 123510 167173 148847
$$ packed form
15222a09286O3964j22242J0234P9799J1928j7768K4616K0555J12011O5187j15259
15211B3739n9603R249l1022l1143q5189N109N0944N7064K0552P2387O959q6229
15199d7183N1867j9017r5114q3180M5091N9294M9368L8267J03319K4973q2666
15188D5019p2959j7975M5277L1133l2448P776o4133p6417q3717q270L9341O9714
15176a17659j0336o6969N3353k3825J1714M5685K8912O2119J00671M6412J2412
15165A42489k4775j07517m8825N5960n075L7781l4142n2692O2242l3749k2622
15154c0925P6163j1775j5451n187j395O4217P6737k1795m4005N4385m3158m9151
15142D8660k430N999m9019n1127M411J58970K4004q4639r029P7710M3663j8326
$$ plain form
15130 148847 -2247 1162 15105 -14365 50873 49999 -50824 26539 88990 53770 -2331 41706
15118 41706 74589 17488 -44861 -150903 -130544 -87284 -79517 -22870 21749 58840 -97968
15107 -97968 -206310 -135939 -105996 -68105 -70927 -176674 -140431 -96705 -95291 -130226 -132041 -219188
15095 -219188 -187280 -93885 -42475 -36645 -7198 7634 47465 10175 16069 -5317 3445 -102062
15083 -102062 -199976 -170163 -83512 -117744 -103259 -99720 17091 96857 6364 -42727 -97015
15072 -97015 -42266 95543 157700 172727 116619 67282 31469 -2705 -67171 -145787 -133682
15061 -133682 -75096 -52377 40595 -6344 -27055 36462 99422 54881 14856 -39034 -129269
15050 -129269 -161267 -154233 -161049 -79447 1601 -38820 -116828 -178320 -115642 -53034 42636 36336
$$ packed form
15130A48847j51094L409J3943k9470O5238q74j00823P7363O2451l5220n6101M4037
15118D1706L2883n7101o2349j06042K0359M3260P767N6647M4619L7091j56808
15107i7968j08342P0371K9943L7891k822j05747L6243M3726J414l4935j815q7147
15095b19188L1908R3395N1410N830K9447J4832L9831l7290N894k1386Q762j05507
15083a02062r7914K9813Q6651l4232J4485L539J16811P9766r0493m9091n4288
15072i7015N4749J37809O2157J5027n6108m9337l5813l4174o4466p8616J2105
15061a33682N8586K2719R2972m6939k0711O3517O2960m4541m0025n3890r0235
15050a29269l1998P034o816Q1602Q1048m0421p8008o1492O2678O2608R5670o300
$$ plain form
15038 36336 -9408 -6673 77432 108992 10107 -16264 -53140 -42706 -48730 -51820 -71059 -45244
15026 -45244 -16384 -61158 -86519 -41906 22348 44939 64022 119472 79077 24112 15887 -52765
15014 -52765 -88220 -42715 3585 27335 -16266 -721 -24116 60643 -12788 -81197 721 69751
15002 69751 38698 89452 115100 34032 -51890 -64986 -50223 -50869 -40456 -47319 -67098 -22213
14990 -22213 -11825 31751 68994 27912 80016 194532 140928 50842 49588 37698 -18899 -56076
14978 -56076 -118796 -120370 -142439 -251933 -214590 -67935 -21932 -44234 7036 119160 130548
14967 130548 38986 -29885 -87696 -200493 -226541 -152237 -78730 -34190 1686 10602 34014
14956 34014 85645 93099 10014 17045 -12583 -30368 -26710 -43472 -21876 27150 12983 18538
$$ packed form
15038C6336m5744K735Q4105L1560r8885k6371l6876J0434o024l090j9239K5815
15026d5244K8860m4774k5361M4613O4254K2591J9083N5450m0395n4965q225o8652
15014e2765l5455M5505M6300K3750m3601J5545k3395Q4759p3431o8409Q1918O9030
15002F9751l1053N0754K5648q1068q5922j3096J4763o46J0413o863j9779M4885
14990b2213J0388M3576L7243m1082N2104J14516n3604r0086j254j1890n6597l7177
14978e6076o2720j574k2069j09494L7343J46655M6003k2302N1270J12124J1388
14967A30548r1562o8871n7811j12797k6048P4304P3507M4540L5876Q916K3412
14956C4014N1631P454q3085P031k9628j7785L658j6762K1596M9026j4167N555
$$ plain form
14944 18538 93785 41449 -62343 -124618 -199361 -105173 -70761 -187741 -236265 -103762 17350
14933 17350 55287 12008 22556 54156 -70276 -189693 -138304 -121463 -37340 62092 190666
14922 190666 153180 1344 -29093 -15246 765 24312 126823 139508 95993 -74744 -116066
14911 -116066 -153146 -117584 -81578 -104146 -90121 -53483 42394 -2666 36428 129168 201104
14900 201104 234798 144916 71276 57278 -37875 -112304 -119937 -124844 -142212 -163084 -67617 -66934
14888 -66934 -92332 -111682 -129701 -180761 -110775 -123637 -136756 -104904 -22593 46617 7298 -18867
14876 -18867 55967 86401 31865 -2703 -42840 -60753 -42461 -48481 -137083 -79737 30113 60775
14864 60775 4675 -35256 -61981 -157909 -177566 -205694 -154335 -66305 13650 -37263 -84886 -105055
$$ packed form
14944A8538P5247n2336j03792o2275p4743R4188L4412j16980m8524J32503J21112
14933A7350L7937m3279J0548L1600j24432j19417N1389J6841Q4123R9432J28574
14922A90666l7486j51836l0437J3847J6011K3547J02511J2685m3515j70737m1322
14911a16066l7080L5562L6006k2568J4025L6638R5877m5060L9094R2740P1936
14900B01104L3694q9882p3640j3998r5153p4429p633m907j7368k0872R5467O83
14888f6934k5398j9350j8019n1060O9986j2862j3119L1852Q2311O9210l9319k6165
14876a8867P4834L0434n4536l4568m0137j7913J8292o020q8602N7346J09850L0662
14864F0775n6100l9931k6725r5928j9657k8128N1359Q8030P9955n0913m7623k0169
$$ plain form
14852 -105055 -49404 -44267 -107498 -43065 17170 -4574 -43506 -30786 14026 30329 -23298 51954
14840 51954 99135 80139 87084 1580 19002 112253 120472 72856 25162 -127770 -70120 100341
14828 100341 144686 62021 6392 -23204 -68221 36 70865 88619 15300 -71983 -129458
14817 -129458 -232162 -159122 -32496 5898 3795 15176 -38825 -72822 -27314 18226 -27226
14806 -27226 -74376 -26475 -1905 19323 -13338 -65125 -21580 -2999 27186 80059 37979 8542
14794 8542 -23054 18107 103566 42365 -47740 -60023 -13045 510 62131 70563 32564 68875
14782 68875 128469 87307 59558 80906 179640 148644 26458 55850 101240 133386 147302
14771 147302 220809 80237 26902 9639 118773 152994 95720 12455 -13829 111399 151504
$$ packed form
14852a05055N5651N137o3231O4433O0235k1744l8932J2720M4812J6303n3627P5252
14840E1954M7181j8996O945q5504J7422R3251Q219m7616m7694j52932N7650J70461
14828A00341M4345q2665n5629k9596m5017O8257P0829J7754p3319q7283n7475
14817a29458j02704P3040J26626L8394k103J1381n4001l3997M5508M5540m5452
14806b7226m7150M7901K4570K1228l2661n1787M3545J8581L0185N2873m2080k9437
14794H542l1596M1161Q5459o1201r0105j2283M6978J3555O1621Q432l7999L6311
14782F8875N9594m1162k7749K1348R8734l0996j22186K9392M5390L2146J3916
14771A47302P3507j40572n3335j7263J09134L4221n7274q3265k6284J25228M0105
$$ plain form
14760 151504 99457 15995 -20331 -33118 -11566 -8806 58226 102830 33903 38623 112413 98517
14748 98517 216790 194462 30477 55250 48512 59121 159679 139639 57702 31032 -5035
14737 -5035 -143916 -137790 -107251 -37918 16663 16703 20338 -46192 -117634 -148758 -103743 40995
14725 40995 89533 54538 -43125 -99277 -79576 -83393 -92618 -175049 -99034 -48989 -3326 -15081
14713 -15081 -129348 -150413 -104860 -77853 -71577 -67563 -77638 16743 5632 62297 56003 24133
14701 24133 -36282 -65564 -30623 -97103 -128415 -82135 -33214 7745 33787 -40659 -11865 39562
14689 39562 123738 123930 77057 14478 -23234 -32470 -30836 8099 -70962 -5840 -16615 -127899
14677 -127899 -75453 -43140 -75416 -48436 -8651 -63463 -146708 -91515 3344 75960 -75320
$$ packed form
14760A51504n2047q3462l6326j2787K1552K760O7032M4604o8927M720P3790j3896
14748I8517J18273k2328j63985K4773o738J0609J00558k0040q1937k6670l6067
14737e035j38881O126L0539O9333N4581M0L635o6530p1442l1124M5015J44738
14725D0995M8538l4995r7663n6152J9701l817r225q2431P6015N0045M5663j1755
14713a5081j14267k1065M5553K7007O276M014j0075R4381j1111N6665o294l1870
14701B4133o0415k9282L4941o6480l1312M6280M8921M0959K6042p4446K8794N1427
14689C9562Q4176J92m6873o2579l7712r236J634L8935p9061O5122j0775j11284
14677a27899N2446L2313l2276K6980L9785n4812q3245N5193R4859P2616j51280
$$ plain form
14666 -75320 -144912 -124077 -69653 -97641 -116529 -64071 13447 50778 111276 147278 71344 83212
14654 83212 104046 -11559 -93796 -98911 -85980 -60605 -26812 29922 38533 -72374 -162253 -199561
14642 -199561 -134591 -116779 -43909 34926 110240 92846 111407 139044 144363 84590 -3967 -17263
14630 -17263 -38838 -59213 -89967 -82232 -80576 -122106 -26590 42548 101255 112427 92317 38561
14618 38561 16348 35039 87481 46915 29307 21789 47175 96934 9942 -28722 -20968 -41799
14606 -41799 -5135 66332 -7837 -70472 -40657 -4946 22164 -16326 -115728 -171859 -82163 -16004
14594 -16004 -120973 -131756 -110491 -57221 -93982 -198180 -105547 -34785 -16685 16172 69359
14583 69359 47341 82652 43053 49635 113573 83139 104289 127567 167093 109876 736 35002
$$ packed form
14666g5320o9592K0835N4424k7988j8888N2458P7518L7331O0498L6002p5934J1868
14654H3212K0834j15605q2237n115J2931K5375L3793N6734Q611j10907q9879l7308
14642a99561O4970J7812P2870P8835P5314j7394J8561K7637N319n9773q8557j3296
14630a7263k1575k0375l0754P735J656m1530R5516O9138N8707J1172k0110n3756
14618C8561k2213J8691N2442m0566j7608p518K5386M9759q6992l8664P754k0831
14606d1799L6664P1467p4169o2635K9815L5711K7110l8490r9402n6131Q9696O6159
14594a6004j04969j0783K1265N3270l6761j04198R2633P0762J8100L2857N3187
14583F9359k2018L5311l9599O582O3938l0434K1150K3278L9526n7217j09140L4266
$$ plain form
14571 35002 -49469 -55877 -12983 -21788 -116040 -90083 -151304 -189660 -168976 -163810 -199901 -265044
14559 -265044 -224337 -183005 -92791 -3298 103450 -1777 -912 -47057 -12039 -97223 -163437
14548 -163437 -85641 -9149 -1691 67198 52777 -5587 -94381 -108139 -146402 -111223 -132232 -14640
14536 -14640 54817 -12888 5999 -53665 -9094 -8023 88309 120621 167178 80026 -1603 -80203
14524 -80203 -48547 54759 137712 140677 64959 118870 114504 107075 95759 136545 196573 247478
14512 247478 223337 183168 50841 -73950 -43876 35301 60923 -27729 -45838 29478 36504
14501 36504 102431 71279 77366 56454 -36148 -98574 -31977 -50066 -128586 -71376 -38607 -54785
14489 -54785 -48001 -59975 -10277 55473 44605 26216 57618 32704 -5625 11332 29624 97595
$$ packed form
14571C5002q4471o408M2894q805r4252K5957o1221l8356K0684N166l6091o5143
14559b65044M0707M1332R0214Q9493J06748j05227Q65m6145L5018q5184o6214
14548a63437P7796P6492P458O8889j4421n8364q8794j3758l8263L5179k1009J17592
14536a4640O9457o7705J8887n9664M4571J071R6332L2312M6557q7152q1629p8600
14524h0203L1656J03306Q2953K965p5718N3911m366p429j1316M0786O0028N0905
14512B47478k4141m0169j32327j24791L0074P9177K5622q8652j8109P5316P026
14501C6504O5927l1152O087k0912r2602o2426O6597j8089p8520N7210L2769j6178
14489e4785O784j1974M9698O5750j0868j8389L1402k4914l8329J6957J8292O7971
$$ plain form
14477 97595 104024 123076 85360 27534 -16473 -73552 -74574 7598 -50865 -153480 -94538 -117425
14465 -117425 -36688 109764 165707 127174 12033 -90321 -110763 -153269 -195610 -185936 -169303
14454 -169303 -58333 2702 13183 10345 14003 32583 6890 13307 -13716 -29936 67268 10687
14442 10687 -119124 -171518 -145597 -113929 -108282 -9933 -8520 -33830 -20416 4178 -8826 -27479
14430 -27479 19420 -37162 -60443 1243 15652 -11542 -31024 -29193 -10050 -79515 -22330 7399
14418 7399 -80848 -114068 -32384 1315 57063 41780 -14414 -50211 11748 46475 -8746 -27487
14406 -27487 -7221 63044 7832 -52651 -17928 29820 -13034 51718 59388 90508 85446 33766
14394 33766 27562 2929 -17153 -38970 -60977 -138716 -50564 47021 72046 100515 86493 33799
$$ packed form
14477I7595O429J9052l7716n7826m4007n7079j022Q2172n8463j02615N8942k2887
14465a17425Q0737J46452N5943l8533j15141j02354k0442m2506m2341R674J6633
14454a69303J10970O1035J0481k838L658J8580k5693O417k7023j6220R7204n6581
14442A0687j29811n2394K5921L1668N647R8349J413k5310J3414K4594j3004j8653
14430b7479M6899n6582k3281O1686J4409k7194j9482J831J9143o9465N7185K9729
14418G399q8247l3220Q1684L3699N5748j5283n6194l5797O1959L4727n5221j8741
14406b7487K0266P0265n5212o0483L4723M7748m2854O4752P670L1120n062n1680
14394C3766o204k4633k0082k1817k2007p7739Q8152R7585K5025K8469j4022n2694
$$ plain form
14382 33799 -69717 -107160 -13059 65926 30841 -15002 46565 42070 70826 152717 104797 29431
14370 29431 -43045 7726 82513 93604 59483 74058 121519 85790 73600 45505 116679 72318
14358 72318 113379 182750 190691 112319 84502 79378 -12664 3872 108313 19493 -93104 9404
14346 9404 120807 175537 158668 96299 76311 52521 89234 140506 16116 -84518 -27442
14335 -27442 -28794 -13658 64192 27449 -40909 19715 -27634 -110910 -98071 -26927 -11300 -14756
14323 -14756 17594 27119 -16041 -153336 -160308 -9541 13317 -4120 27463 12722 51809 2122
14311 2122 31301 6827 -19441 -25377 8794 4298 5181 806 -161 -71072 -119070 -70702 -48424
14298 -48424 7927 -55 90233 118717 82295 -84175 -175636 -78856 -25433 66259 48318 14674
$$ packed form
14382C3799j03516l7443R4101P8985l5085m5843O1567m495K8756Q1891m7920p5366
14370B9431p2476N0771P4787J1091l4121J4575M7461l5729j2190k8095P1174m4361
14358G2318M1061O9371P941p8372k7817n124r2042J6536J04441q8820j12597J02508
14346I404J11403N4730j6869o2369j9988k3790L6713N1272j24390j00634N7076
14335b7442j352J5136P7850l6743o8358O0624m7349q3276J2839P1144J5627l456
14323a4756L2350R525m3160j37295o972J50767K2858j7437L1583j4741L9087m9687
14311B122K9179k4474k6268n936L4171m496Q83m375r67p0911m7998M8368K2278
14298d8424N6351p982R0288K8484l6422j66470r1461R6780N3423R1692j7941l3644
$$ plain form
14286 14674 -117036 -149881 -76151 -42404 46823 93705 -29557 -96537 66769 126893 82779
14275 82779 37380 30547 19187 92907 74352 100030 204207 231422 142870 13764 -52569
14264 -52569 -18064 20830 31879 87308 142940 171234 192489 173046 7882 -115428 -118813
14253 -118813 -133211 -129244 -32752 72915 3322 41589 59450 75053 51697 45973 47108 85203
14241 85203 72508 102693 63005 16854 -74463 -84237 28277 31467 29025 8194 35522 95959
14229 95959 168815 208203 98954 -23202 -6264 23065 31179 62943 32405 20801 18621 57011
14217 57011 -7440 13150 76069 39306 40468 -80424 -115750 -55615 -83742 -117907 -187406 -159335
14205 -159335 -52761 -41058 6419 -25496 -26584 17841 51018 9268 47546 52288 109875 79274
$$ packed form
14286A4674j31710l2845P3730L3747Q9227M6882j23262o6980J63306O0124m4114
14275H2779m5399o833j1360P3720j8555K5678J04177K7215q8552j29106o6333
14264e2569L4505L8894J1049N5429N5632K8294K1255j9443j65164j23310l385
14253a18813j4398L967R6492J05667o9593L8267J7861J5603k3356n724J135L8095
14241H5203j2695L0185l9688m6151r1317r774J12514L190k442k0831K7328O0437
14229I5959P2856L9388j09249j22156J6938K9329Q114L1764l0538j1604k180L8390
14217E7011o4451K0590O2919l6763J162j20892l5326O0135k8127l4165o9499K8071
14205a59335J06574J1703M7477l1915j088M4425L3177m1750L8278M742N7587l0601
$$ plain form
14193 79274 49753 27083 -83420 -131995 -99868 -86649 -102067 33810 195435 279247 194248
14182 194248 125187 -245 -39299 1735 34791 51780 33901 103848 88273 65809 75041
14171 75041 74890 11523 28573 108744 123808 110557 39934 -7968 40873 72184 -74589 -139424
14159 -139424 -99663 -22145 -27266 27971 122413 170430 97219 -4557 3483 16850 35571 25390
14147 25390 -55170 -110353 -110864 26547 129013 67659 -5084 -28157 -60271 -55722 -71415 -65297
14135 -65297 -59950 -65303 -65007 47362 66698 -29221 -126318 -169779 -183358 -97896 -44522 -44309 37340
14122 37340 121754 212239 156174 115237 49854 75345 157279 170174 42265 -39542 -54384
14111 -54384 57703 23547 -55537 -49706 -19852 -32037 -61586 -32345 44264 68986 94716 33601
$$ packed form
14193G9274k9521k2670j10503m8575L2127J3219j5418J35877J61625Q3812q4999
14182A94248o9061j25432l9054M1034L3056J6989j7879O9947j5575k2464R232
14171G5041j51o3367J7050Q0171J5064j3251p0623m7902M8841L1311j46773o4835
14159a39424L9761P7518n121N5237R4442M8017p3211j01776Q040J3367J8721j0181
14147B5390q0560n5183n11J37411J02466o1354p2743k3073l2114M549j5693O118
14135f5297N347n353K96J12369J9336r5919r7097m3461j3579Q5462N3374K13Q1649
14122C7340Q4414R0485n6065m0937o5383K5491Q1934J2895j27909q1807j4842
14111e4384J12087l4156p9084N831K9854j2185k9549K9241P6609K4722K5730o1115
$$ plain form
14099 33601 54357 -3183 -49968 13054 88256 63782 72893 2597 97229 41928 -73397 -71202
14087 -71202 -44935 -56083 -60180 19323 89904 151049 116470 55065 62493 68952 31714 20917
14075 20917 -14668 25956 41849 146130 81711 -36301 4514 148602 165759 59082 -4953
14064 -4953 34050 23012 915 -19979 28398 127426 142316 70130 23052 -12462 -28903 -46013
14052 -46013 51297 192922 208080 107052 50009 32901 33613 -7186 78106 80004 -9495 -43373
14040 -43373 -53830 14095 16274 -97450 -99421 -14445 -20400 -209889 -146675 -44316 14663 -7380
14028 -7380 -103167 -105183 26296 88225 110890 81797 42740 40926 25934 3553 99878 69233
14016 69233 46841 19318 -14959 280 57919 -15236 -54254 -56241 46429 126747 106763 45253
$$ packed form
14099C3601K0756n7540m6785O3022P5202k4474R111p0296R4632n5301j15325K195
14087g1202K6267j1148m097P9503P0581O1145l4579o1405P428O459l7238j0797
14075B0917l5585M0624J5893J04281o4419j18012M0815J44088J7157j06677o4035
14064d953L9003j1038k2097k0894M8377R9028J4890p2186m7078l5514j6441j7110
14052d6013R7310J41625J5158j01028n7043j7108P12m0799Q5292J898q9499l3878
14040d3373j0457O7925K179j13724j971Q4976n955j89489O3214J02359N8979k2043
14028g380r5787k016J31479O1929K2665k9093l9057j814j4992k2381R6325l0645
14016F9233k2392k7523l4277J5239N7639p3155l9018j987J02670Q0318j9984o1510
$$ plain form
14004 45253 70979 17205 16474 -7386 -4641 -76094 -144788 -64849 -7487 -34679 24536 3456
13992 3456 -419 11028 -22313 -69589 -29146 -3492 -3570 24459 59777 76386 1152 -4872 7972
13979 7972 10631 -14012 -7469 12229 39000 115254 180925 38200 -153068 -135474 -104047 -17551
13967 -17551 128318 107538 -20107 12082 78836 74383 16850 -76846 -67185 -23809 -94934 -64053
13955 -64053 -138286 -159489 -93672 716 86023 74451 970 -26917 -56718 -60349 -59298 -57687
13943 -57687 -139581 -174412 -120476 -35161 -7338 -2163 6304 -15210 -80648 -44204 50911 75237
13931 75237 25493 -18416 -53084 13841 52646 -13484 -113562 -179751 -185985 -118773 -14378
13920 -14378 -33030 -25001 28588 -76400 -131600 -110816 -52639 -56613 -12286 30421 23189 -11430
$$ packed form
14004D5253K5726n3774p31k3860K745p1453o8694P9939N7362k7192N9215k1080
13992C456l875J1447l3341m7276M0443K5654p8K8029L5318J6609p5234o024J2844
13979G972K659k4643O543J9698K6771P6254O5671j42725j91268J7594L1427Q6496
13967a7551J45869k0780j27645L2189O6754m453n7533r3696R661M3376p1125L0881
13955f4053p4233k1203O5817R4388Q5307j1572p3481k7887k9801l631J051J611
13943e7687q1894l4831N3936Q5315K7823N175Q467k1514o5438L6444R5115K4326
13931G5237m9744m3909l4668O6925L8805o6130j00078o6189o234O7212J04395
13920a4378j8652Q029N3589j04988n5200K0784N8177l974M4327M2707p232l4619
$$ plain form
13908 -11430 -42971 77357 57403 1076 -13877 -17394 76414 145456 204884 156368 84216 17353
13896 17353 -63488 -52844 -33893 -83050 -92364 -60970 -9560 33426 123652 155752 34503 12978
13884 12978 81816 36323 -8335 153183 149617 459 -141588 -136116 -108738 -159944 -113283
13873 -113283 -48490 -52727 -97213 -71715 -88080 74529 213776 145662 23142 10868 26078
13862 26078 70577 -2722 -39666 -9135 -117451 -195632 -127604 -87965 -46431 3350 -52372
13851 -52372 -150053 -187703 -148814 -60936 -63624 -88553 -131965 -92248 28119 17998 -57800 -69323
13839 -69323 30159 36635 74716 76858 70297 -17048 -111592 -175131 -82135 -5579 50445 82504
13827 82504 115894 143075 163047 83897 53375 46238 52147 35442 120216 9432 -124522 -80606
$$ packed form
13908a1430l1541J20328j9954n6327j4953l517R3808O9042N9428m8516p2152o6863
13896A7353q0841J0644J8951m9157r314L1394N1410M2986R0226L2100j21249k1525
13884A2978O8838m5493m4658J61518l566j49158j42047N472K7378n1206M6661
13873a13283O4793m237m4486K5498j6365J62609J39247o8114j22520j2274J5210
13862B6078M4499p3299l6944L0531j08316p8181O8028L9639M1534M9781n5722
13851e2372r7681l7650L8889Q7878k688k4929m3412L9717J20367j0121p5798j1523
13839f9323R9482O476L8081K142o561q7345r4544o3539R2996P6556N6024L2059
13827H2504L3390K7181J9972p9150l0522p137N909j6705Q4774j10784j33954M3916
$$ plain form
13815 -80606 -14643 31291 45180 -10063 10109 48050 128985 120118 63779 80317 53286 -4803
13803 -4803 170948 243771 192065 101130 26156 -103793 -31546 12872 55750 103248 139011
13792 139011 100152 75727 108445 86342 56359 65436 21977 29628 62642 54779 -3325 22150
13780 22150 4895 -4869 3355 12461 -89573 -128488 -10246 95520 79581 56105 48579 39816
13768 39816 -7154 -61343 45212 97188 108723 42730 -25117 -134694 -137517 -11065 147877
13757 147877 117475 48679 -9771 4280 57616 90044 158867 142472 70881 70674 -10259 -8760
13745 -8760 51956 92147 232596 234658 167746 8658 -82036 -113373 -145932 -84320 48002
13734 48002 122651 111875 85477 52391 36630 65458 132209 90224 50323 -16691 -37579 10863
$$ packed form
13815h0606O5963M5934J3889n5243K0172L7941Q0935q867n6339J6538k7031n8089
13803d803J75751P2823n1706r0935p4974j29949P2247M4418M2878M7498L5763
13792A39011l8859k4425L2718k2103k9983R077m3459P651L3014p863n8104K5475
13780B2150j7255r764Q224R106j02034l8915J18242J05766j5939k3476p526q763
13768C9816m6970n4189J06555N1976J1535o5993o7847j09577k823J26452J58942
13757A47877l0402o8796n8450J4051N3336L2428O8823j6395p1591k07q0933J499
13745h760O0716M0191J40449K062o6912j59088r0694l1337l2559O1612J32322
13734D8002P4649j0776k6398l3086j5761K8828O6751m1985l9901o7014k0888M8442
$$ plain form
13722 10863 27226 -6187 -40550 -16895 9908 -25569 -27512 -29375 -15372 -14584 19520 -4746
13710 -4746 15207 57358 -67363 -149703 -98490 -88034 -143607 -86425 -14613 -81740 -213077
13699 -213077 -182025 -62297 -17977 -51034 -91101 -65335 16342 -20687 -4418 124671 138392
13688 138392 133470 135566 87899 51881 -5341 -28501 -26442 65023 96448 -17826 -4057 74704
13676 74704 112919 114431 132311 77662 -54511 -89643 -51970 -24733 -7186 -153794 -132975
13665 -132975 -75026 4052 45156 103696 161966 146788 175883 157509 159451 189566 165848 129695
13653 129695 4275 -40935 -252 91019 183838 244494 217850 97146 24018 26418 93462
13642 93462 147409 107022 108096 94892 118675 89737 132044 190531 171286 146517 149438 173575
$$ packed form
13722A0863J6363l3413l4363K3655K6803l5477j943j863J4003P88L4104k4266
13710d746J9953M2151j24721q2340N1213J0456n5573N7182P1812o7127j31337
13699b13077L1052J19728M4320l3057m0067K5766Q1677l7029J6269J29089J3721
13688A38392m922K096m7667l6018n7222k3160K059R1465L1425j14274J3769P8761
13676G4704L8215J512J7880n4649j32173l5132L7673K7237J7547j46608K0819
13665a32975N7949P9078M1104N8540N8270j5178K9095j8374J942L0115k3718l6153
13653A29695j25420m5210M0683R1271R2819O0656k6644j20704p3128K400O7044
13642I3462N3947m0387J074j3204K3783k8938M2307N8487j9245k4769K921K4137
$$ plain form
13630 173575 190885 90025 89532 19143 -1443 -1097 -8939 41544 57556 78850 119950 149701
13618 149701 68756 16913 90014 117628 177330 136311 167723 313141 284704 161965 104502
13607 104502 34693 33316 63105 91941 15884 -39140 -115933 -107232 -72266 37103 -19550 -119773
13595 -119773 -89581 -44297 -53201 -39177 2679 19627 32368 51512 100692 5899 -17339 -39728
13583 -39728 -18713 -37267 315 71856 130862 184556 156733 76614 26777 -48476 -43941 -6113
13571 -6113 92917 103233 53268 111965 90938 41931 66777 2892 -1835 110823 84451 120575
13559 120575 192180 189788 167277 154730 170661 165400 74148 56491 2997 24629 -21019 -27899
13547 -27899 1758 114743 175712 95048 39565 -28087 -68749 -44211 58880 56192 -52005
$$ packed form
13630A73575J7310j00860m93p0389k0586L46p842N0483J6012K1294M1100K9751
13618A49701q0945n1843P3101K7614N9702m1019L1412J45418k8437j22739n7463
13607A04502o9809j377K9789K8836p6057n5024p6793Q701L4966J09369n6653j00223
13595a19773L0192M5284q904J4024M1856J6948J2741J9144M9180r4793k3238k2389
13583c9728K1015j8554L7582P1541N9006N3694k7823q0119m9837p5253M535L7828
13571f113R9030J0316m9965N8697k1027m9007K4846o3885m727J12658k6372L6124
13559A20575P1605k392k2511j2547J5931n261r1252j7657n3494K1632m5648o880
13547b7899K9657J12985O0969q0664n5483o7652m0662K4538J03091k688j08197
$$ plain form
13536 -52005 22638 137981 142792 186733 138734 -67092 -19575 -15893 15763 56125 -30937 -114927
13524 -114927 -19465 69347 169320 213598 201446 121578 115803 167347 202899 312393 331629
13513 331629 320234 299056 302294 259949 237652 133632 114960 102892 129460 175628 225870
13502 225870 240202 136397 85290 153705 248255 191432 132748 118189 90405 79127 76202
13491 76202 176857 253828 275031 304414 398091 230422 146673 146234 229932 229142 167687 107500
13479 107500 149569 208192 197578 154778 142853 114393 84789 135964 227257 351205 417058
13468 417058 357605 306121 242106 198145 185184 170876 179395 131212 139417 143980 151022 121854
13456 121854 84091 85251 191718 236837 173944 124988 80343 108856 126728 135458 141578 26659
$$ packed form
13536e2005P4643J15343M811M3941m7999k05826M7517L682L1656M0362q7062q3990
13524a14927R5462Q8812R9973M4278j2152p9868n775N1544L5552J09494J9236
13513C31629j1395k1178L238m2345k2297j04020j8672j2068K6568M6168N0242
13502B25870J4332j03805n1107O8415R4550n6823n8684j4559k7784j1278k925
13491G6202J00655P6971K1203K9383R3677j67669q3749m39Q3698p90o1455o0187
13479A07500M2069N8623j0614m2800j1925k8460k9604N1175R1293J23948O5853
13468D17058n9453n1484o4015m3961j2961j4308Q519m8183Q205M563P042k9168
13456A21854l7763J160J06467M5119o2893m8956m4645K8513J7872Q730O120j14919
$$ plain form
13444 26659 3530 -38306 -21932 -17317 -26933 -116140 -42713 10524 140985 162310 149456 165644
13432 165644 107650 67531 69133 117804 93110 178126 160440 129794 72858 77236 99575 89095
13420 89095 186809 182925 161400 251927 246331 178736 117283 153994 191009 235535 120156 113157
13408 113157 126187 200605 267305 327466 432749 510131 621148 818410 1027105 1275856
13398 1275856 1720793 2162710 2511780 2395879 2207701 1949314 1752974 1504403 1173780
13389 1173780 906075 718088 711856 681516 624294 537795 462053 472791 425776 401737 340314
13378 340314 365148 374617 314109 367238 429397 449079 325138 162204 193314 286126 316167
13367 316167 331606 356687 270079 175047 166794 147671 175710 146763 112479 104920 103307 224878
$$ packed form
13444B6659k3129m1836J6374M615r616q9207P3427N3237J30461K1325j2854J6188
13432A65644n7994m0119J602M8671k4694Q5016j7686l0646n6936M378K2339j0480
13420H9095R7714l884k1525R0527n596o7595o1453L6711L7015M4526j15379o999
13408A13157J3030P4418O6700O0161J05283P7382J11017J97262K08695K48751
13398A275856M44937M41917L49070j15901j88178k58387j96340k48571l30623
13389A173780k67705j87987o232l0340n7222q6499p5742J0738m7015k4039o1423
13378C40314K4834R469o0508N3129O2159J9682j23941j62934L1110R2812L0041
13367C16167J5439K5081q6608r5032q253j9123K8039k8947l4284p559j613J21571
$$ plain form
13355 224878 244171 286338 296643 351881 334352 301033 317997 280666 265862 239504 208569
13344 208569 127014 111834 119599 112693 228330 233515 173372 147317 133239 64283 12486 43239
13332 43239 147636 220155 210373 91080 73550 147367 152890 87784 3058 73749 231796
13321 231796 291912 276026 217313 192879 200004 190097 232683 300152 359741 303698 205005 107183
13309 107183 92839 103948 48926 35207 98451 144155 86785 121796 21517 69540 69001 -52066
13297 -52066 -93187 -49416 -35451 123567 228747 126228 25081 35329 18360 71358 132880
13286 132880 183530 100101 20479 -12301 72580 117905 124376 222501 251237 245632 252502 180794
13274 180794 64155 51136 99109 131671 121902 110684 173801 259724 323676 286387 235998
$$ packed form
13355B24878J9293M2167J0305N5238j7529l3319J6964l7331j4804k6358l0935
13344B08569q1555j5180P765o906J15637N185o0143k6055j4078o8956n1797L0753
13332D3239J04397P2519r782j19293j7530P3817N523o5106q4726P0691J58047
13321B31796O0116j5886n8713k4434P125r907M2586O7469N9589n6043r8693r7822
13309A07183j4344J1109n5022j3719O3244M5704n7370L5011j00279M8023n39j21067
13297e2066m1121M3771J3965J59018J05180j02519j01147J0248j6969N2998O1522
13286A32880N0650q3429p9622l2780Q4881M5325O471R8125K8736n605O870p1708
13274A80794j16639j3019M7973L2562r769j1218O3117Q5923O3952l7289n0389
$$ plain form
13263 235998 217269 213371 241097 325501 355376 264767 271346 268845 237926 345368 344480 363434
13251 363434 351250 302952 316427 343974 277720 196230 214146 254282 386664 399261 356138
13240 356138 383678 376993 376178 285404 184370 241454 306155 352393 359916 328220 291303 336134
13228 336134 389762 324549 293316 281475 197466 254522 275186 405269 498488 436344 330989
13217 330989 339715 414190 483468 439263 375243 325308 288674 206409 253948 341905 332564 323387
13205 323387 283548 294643 302604 357282 398165 326262 260539 249866 292473 333289 364295 354851
13193 354851 355141 266314 211088 231170 243366 138245 124267 307564 392086 346874 268040
13182 268040 135540 177262 179159 223040 200128 208589 281751 260461 242874 285292 303410 187459
$$ packed form
13263B35998j8729l898K7726Q4404K9875r0609O579k501l0919J07442q88J8954
13251C63434j2184m8298J3475K7547o6254q1490J7916M0136J32382J2597m3123
13240C56138K7540o685q15r0774j01034N7084O4701M6238P523l1696l6917M4831
13228C36134N3628o5213l1233j1841q4009N7056K0664J30083R3219o2144j05355
13217C30989Q726P4475O9278m4205o4020m9935l6634q2265M7539Q7957r341r177
13205C23387l9839J1095P961N4678M0883p1903o5723j0673M2607M0816L1006r444
13193C54851K90q8827n5226K0082J2196j05121j3978J83297Q4522m5212p8834
13182B68040j32500M1722J897M3881k2912Q461P3162k1290j7587M2418J8118j15951
$$ plain form
13170 187459 127405 137036 161043 255683 257433 182681 129481 210581 254708 241640 295899 255869
13158 255869 260956 240809 181838 107222 -28053 13618 47819 89942 135210 133727 174950 124610
13146 124610 126307 107058 31619 61909 85705 156133 143523 114757 115930 94408 102635 82680
13134 82680 170671 124361 65949 57860 137338 163740 179248 163364 199565 158536 161695 195937
13122 195937 109400 50851 44384 95973 149451 142230 166201 206560 279246 301512 371421 518302
13110 518302 481586 377929 316543 293864 290895 256165 299490 244293 250943 312866 378891 405288
13098 405288 387678 430696 412187 378398 461025 417422 389598 452407 466562 455637 460215 440945
13086 440945 419939 384871 394298 344932 352487 424705 442110 419119 438452 447834 392744 405537
$$ packed form
13170A87459o0054R631K4007R4640J750p4752n3200Q1100M4127j3068N4259m0030
13158B55869N087k0147n8971p4616j35275M1671L4201M2123M5268j483M1223n0340
13146A24610J697j9249p5439L0290K3796P0428j2610k8766J173k1522Q227j9955
13134H2680Q7991m6310n8412q089P9478K6402J5508j5884L6201m1029L159L4242
13122A95937q6537n8549o467N1589N3478p221K3971M0359P2686K2266O9909J46881
13110E18302l6716j03657o1386k2679k969l4730M3325n5197O650O1923O6025K6397
13098D05288j7610M3018j8509l3789Q2627m3603k7824O2809J4155j0925M578j9270
13086D40945k1006l5068R427m9366P555P2218J7405k2991J9333R382n5090J2793
$$ plain form
13074 405537 462336 579157 603860 514221 492942 573452 587520 604910 649625 674766 651114
13063 651114 630437 666945 678437 734300 721545 645650 547065 534108 598560 648346 634102
13052 634102 669327 777821 825141 841135 817862 803505 886956 991335 1022716 996260 951841
13041 951841 987325 1066817 1101028 1129058 1156132 1135528 1201014 1211431 1272603 1372265 1391856
13030 1391856 1380466 1444085 1538434 1559707 1559366 1622141 1605604 1641052 1617882 1609934 1634659 1710530
13018 1710530 1881880 1937889 1959139 2014088 2081118 2067693 2042962 2091725 2112647 2123061 2270631
13007 2270631 2440327 2421281 2406911 2407308 2492965 2592397 2630275 2685145 2759319 2889884 2933273
12996 2933273 3110674 3421504 3612303 3638725 3777840 4016312 4184179 4219336 4410678 4678247
$$ packed form
13074D05537N6799J16821K4703q9639k1279Q0510J4068J7390M4715K5141k3652
13063F51114k0677L6508J1492N5863j2755p5895r8585j2957O4452M9786j4244
13052F34102L5225J08494M7320J5994k3273j4357Q3451J04379L1381k6456m4419
13041I51841L5484P9492L4211K8030K7074k0604O5486J0417O1172R9662J9591
13030A391856j1390O3619R4349K1273l41O2775j6537L5448k3170p948K4725P5871
13018A710530J71350N6009K1250N4949O7030j3425k4731M8763K0922J0414J47570
13007B270631J69696j9046j4370L97Q5657R9432L7878N4870P4174J30565M3389
12996B933273J77401L10830J90799K6422J39115K38472J67867L5157J91342K67569
$$ plain form
12986 4678247 4868188 5066680 5371057 5651736 5977457 6346746 6666043 7177020 7700727
12977 7700727 8338948 9209494 10262192 11310304 12560356 14032625 15753719 17867596
12969 17867596 20537465 23886876 27848233 32878833 39313628 47186117 57087328 70215618
12961 70215618 88123548 112817951 147366644 195178504 257958029 333268760 407944979
12954 407944979 454357810 446834754 392517239 326507684 270095183 222997481 183138639
12947 183138639 150933391 125590100 105704244 90107540 77722875 67600775 59358629
12940 59358629 52630828 47331736 43044295 39427908 36540937 34175901 32122794 30289736
12932 30289736 28782859 27559103 26518039 25641792 24893405 24169511 23534699 22997864 22664998
$$ packed form
12986D678247J89941J98492L04377K80679L25721L69289L19297N10977N23707
12977G700727O38221Q70546J052698J048112J250052J472269J721094K113877
12969A7867596K669869L349411L961357N030600O434795P872489R901211J3128290
12961G0215618J7907930K4694403L4548693M7811860O2779525P5310731P4676219
12954D07944979M6412831p523056n4317515o6009555n6412501m7097702l9858842
12947A83138639l2205248k5343291j9885856j5596704j2384665j0122100q242146
12940E9358629o727801n299092m287441l616387k886971k365036k053107j833058
12932C0289736j506877j223756j041064q76247p48387p23894o34812n36835l32866
$$ plain form
12923 22664998 22388376 22364491 22388832 22526440 22469412 21991404 21330078 20416287 19369147 18381905
12913 18381905 17480459 16584249 15709476 14946445 14236720 13474001 12819143 12145018 11524493
12904 11524493 11017362 10545989 9983029 9379844 8866953 8441910 8186776 7901625 7505513
12895 7505513 7093480 6773902 6466417 6215532 6017825 5857574 5573402 5209882 5006035
12886 5006035 4873774 4625264 4494316 4302122 4112828 3941805 3771372 3619099 3498647
12877 3498647 3392752 3297067 3248689 3064503 2858853 2787227 2725125 2580283 2467416 2372390
12867 2372390 2319916 2335177 2241012 2126069 1997860 1930538 1923931 1819386 1689207 1588791
12857 1588791 1559267 1596912 1598889 1607059 1559368 1479761 1480681 1413531 1381824 1311709 1301479 1301133
$$ packed form
12923B2664998k76622k3885K4341J37608n7028m78008o61326r13791j047140r87242
12913A8381905r01446q96210q74773p63031p09725p62719o54858o74125o20525
12904A1524493n07131m71373n62960o03185n12891m25043k55134k85151l96112
12895G505513m12033l19578l07485k50885j97707j60251k84172l63520k03847
12886E006035j32261k48510j30948j92194j89294j71023j70433j52273j20452
12877C498647j05895r5685m8378j84186k05650p1626o2102j44842j12867r5026
12867B372390n2474J5261r4165j14943j28209o7322o607j04545j30179j00416
12857A588791k9524L7645J977Q170m7691p9607R20o7150l1707p0115j0230l46
$$ plain form
12845 1301133 1289063 1378326 1354178 1361159 1343059 1330542 1352070 1249921 1156637 1108036 1089777
12834 1089777 1162670 1246128 1303981 1295799 1259249 1160835 1224695 1258979 1288269 1379075 1354622
12823 1354622 1287946 1198407 1086513 1051529 1022665 1059694 1028369 958409 979125 977928 878942
12812 878942 807744 772209 784181 758678 726146 720892 724778 726312 674219 717336 683309 704600
12800 704600 828517 934926 898438 862090 888455 827328 833813 853626 868139 901700 875062
12789 875062 819013 889856 870123 872756 830634 856485 950964 1057364 1057936 1129977 1166206 1120803
12777 1120803 1136417 1163469 1147182 1217625 1276843 1322516 1251016 1138214 1074065 1054135 1055642
12766 1055642 991757 929224 936193 1099702 1170728 1148883 1084217 903720 871437 905170 975677
$$ packed form
12845A301133j2070Q9263k4148O981j8100j2517K1528j02149r3284m8601j8259
12834A089777P2893Q3458N7853q182l6550r8414O3860L4284K9290R0806k4453
12823A354622o6676q9539j11894l4984k8864L7029l1325o9960K0716j197r8986
12812H78942p1198l5535J1972k5503l2532n254L886J534n2093M3117l4027K1291
12800G04600J23917J06409l6488l6348K6365o1127O485J9813J4513L3561k6638
12789H75062n6049P0843j9733K633m2122K5851R4479J06400N72P2041L6229m5403
12777A120803J5614K7052j6287P0443N9218M5673p1500j12802o4149j9930J507
12766A055642o3885o2533O969J63509P1026k1845o4666j80497l2283L3733P0507
$$ plain form
12755 975677 1016099 935833 811879 766914 738464 798004 871704 703789 676583 712372 677601
12744 677601 661762 785276 808272 662095 578968 535163 570125 628461 623873 663387 640887
12733 640887 569921 552574 493215 478397 508098 569891 516553 509860 622369 673208 643552
12722 643552 745434 739815 645001 672504 676222 607397 527321 633033 591852 539651 566238
12711 566238 580625 632576 682220 661185 756118 750137 670572 746506 706155 650718 600743 572594
12699 572594 570417 549340 515798 516241 525030 544672 438293 409825 471814 466510 527160 590547
12687 590547 454848 506313 639836 658933 596927 508740 337450 402257 416457 476538 543947
12676 543947 617740 602435 544618 581450 555629 562598 471041 391677 428936 368736 310076 332909
$$ packed form
12755I75677M0422q0266j23954m4965k8450N9540P3700j67915k7206L5789l4771
12744F77601j5839J23514K2996j46177q3127m3805L4962N8336m588L9514k2500
12733F40887p0966j7347n9359j4818K9701O1793n3338o693J12509N0839k9656
12722F43552J01882n619r4814K7503L718o8825q0076J05712m1181n2201K6587
12711E66238J4387N1951M9644k1035R4933n981p9565P5934m0351n5437m9975k8149
12699E72594k177k1077l3542M43Q789J9642j06379k8468O1989n304O0650O3387
12687E90547j35699N1465J33523J9097o2006q8187j71290O4807J4200O0081O7409
12676E43947P3793j5305n7817L6832k5821O969r1557p9364L7259o0200n8660K2833
$$ plain form
12664 332909 428084 359372 449402 566566 469868 454154 534852 594622 539702 564363 562719
12653 562719 518036 461999 462119 469908 568347 574113 523582 592482 645211 644841 630954 559364 411172
12640 411172 400837 396948 398681 496615 547702 537650 565132 604667 581138 535102 602300 695506
12628 695506 790115 749129 750528 724903 772492 724255 852927 887605 860513 841929 873632
12617 873632 806260 740812 737631 735398 813755 936030 912473 795934 742281 749957 618299
12606 618299 647541 719268 688702 638898 702456 694901 708717 749288 786113 729617 698291 696363
12594 696363 667233 717396 739847 702618 594848 555104 614056 770170 660784 668930 790547
12583 790547 835053 862627 815303 806379 890450 856701 812933 722593 643208 688473 736789 907179
$$ packed form
12664C32909R5175o8712R0030J17164r6698j5714Q0698N9770n4920K4661j644
12653E62719m4683n6037J20P789R8439N766n0531O8900N2729l70j3887p1590j48192
12640D11172j0335l889J733R7934N1087j0052K7482L9535k3529m6036O7198R3206
12628F95506R4609m0986J399k5625M7589m8237J28672L4678k7092j8584L1703
12617H73632o7372o5448l181k233P8357J22275k3557j16539n3653P676j31658
12606F18299K9242P1727l0566m9804O3558p555J3816M0571L6825n6496l1326j928
12594F96363k9130N0163K2451l7229j07770l9744N8952J56114j09386Q146J21617
12583G90547M4506K7574m7324q924Q4071l3749m3768r0340p9385M5265M8316J70390
$$ plain form
12571 907179 994711 1007768 1216054 1482080 1522342 1429223 1220642 1119586 1117521 1008299 862840
12560 862840 752142 729757 698520 699219 667285 671125 651942 673093 805573 878147 932394 847138
12548 847138 744722 680500 747630 855603 828602 766100 800925 838522 883101 870490 866995
12537 866995 826864 709368 654412 617990 534455 652243 725469 750821 774941 840402 819109
12526 819109 790433 763887 731023 804703 789921 695657 658769 740336 883052 869919 883216
12515 883216 958056 1175724 1318624 1345250 1445386 1577285 1797250 2113291 2478067 2764690
12505 2764690 2985105 2974659 2681938 2399356 2139581 1849790 1693600 1584204 1507947 1481823
12495 1481823 1399742 1278615 1119298 974176 1040609 1127968 1194285 1182030 1169676 1110354 1155084
$$ packed form
12571I07179Q7532J3057K08286K66026M0262r3119k08581j01056k065j09222j45459
12560H62840j10698k2385l1237O99l1934L840j9183K1151J32480P2574N4247q5256
12548H47138j02416o4222O7130J07973k7001o2502L4825L7597M4579j2611l495
12537H66995m0131j17496n4956l6422q3535J17788P3226K5352K4120O5461k1293
12526H19109k8676k6546l2864P3680j4782r4264l6888Q1567J42716j3133J3297
12515H83216P4840K17668J42900K6626J00136J31899K19965L16041L64776K86623
12505B764690K20415j0446k92721k82582k59775k89791j56190j09396p6257k6124
12495A481823q2081j21127j59317j45122O6433Q7359O6317j2255j2354n9322M4730
$$ plain form
12484 1155084 1089343 1068531 1134859 1223394 1221402 1269361 1291425 1254959 1163751 1148828 1115815
12473 1115815 1168096 1172473 1142027 1056636 1026906 1015586 1047903 1069587 958560 948708 1007795
12462 1007795 982850 1012380 1075518 1068603 1074626 1100827 1123744 1107077 1088657 1153374 1125268 1095187
12450 1095187 1150070 1105307 1030790 943346 962562 939292 860687 810615 762285 811515 888973
12439 888973 955632 1054632 1015696 947163 969359 1120475 1068244 1075839 1069092 1061117 1028327 1002695
12427 1002695 1103678 1115276 1030323 1025038 1009893 1100855 1148049 1124622 1213270 1196522 1182740
12416 1182740 1132435 1104104 1072752 1068482 1148479 1161420 1179210 1185706 1152265 1159633 1118503 1151426
12404 1151426 1116874 1181139 1276448 1317470 1290406 1196602 1164965 1215410 1189268 1193622 1181120
$$ packed form
12484A155084o5741k0812O6328Q8535j992M7959K2064l6466r1208j4923l3013
12473A115815N2281M377l0446q5391k9730j1320L2317K1684j11027r852N9087
12462A007795k4945K9530O3138o915O023K6201K2917j6667j8420O4717k8106l0081
12450A095187N4883m4763p4517q7444J9216k3270p8605n0072m8330M9230P7458
12439H88973O6659R9000l8936o8533K2196J51116n2231P595o747p975l2790k5632
12427A002695J00983J1598q4953n285j5145R0962M7194k3427Q8648j6748j3782
12416A182740n0305k8331l1352m270P9997J2941J7790O496l3441P368m1130L2923
12404A151426l4552O4265R5309M1022k7064r3804l1637N0445k6142M354j2502
$$ plain form
12393 1181120 1222554 1333325 1398375 1348517 1382025 1416513 1284713 1178751 1155801 1190875 1218658
12382 1218658 1160214 1115110 1179229 1234002 1204330 1113970 1179208 1232889 1325158 1354096 1233185
12371 1233185 1254636 1287753 1305181 1315322 1330621 1368199 1470754 1573443 1489297 1360558 1351289
12360 1351289 1400163 1382956 1328905 1335947 1332008 1299841 1381213 1493038 1538427 1504733 1462295
12349 1462295 1448977 1425914 1504004 1626469 1608142 1526282 1530816 1512153 1529126 1567871 1528249
12338 1528249 1501684 1527029 1557687 1628777 1603754 1493909 1416450 1410422 1642863 1793551 1630367
12327 1630367 1523286 1583721 1565883 1586733 1589045 1676570 1749823 1799569 1857282 1925834 1814617
12316 1814617 1669145 1699917 1779392 1857230 1837733 1825887 1735153 1715416 1728210 1794849 1851453
$$ packed form
12393A181120M1434J10771O5050m9858L3508L4488j31800j05962k2950L5074K7783
12382A218658n8444m5104O4119N4773k9672r0360O5238N3681R2269K8938j20911
12371A233185K1451L3117J7428J0141J5299L7578J02555J02689q4146j28739r269
12360A351289M8874j7207n4051P042l939l2167Q1372J11825M5389l3694m2438
12349A462295j3318k3063P8090J22465j8327q1860M534j8663J6973L8745l9622
12338A528249k6565K5345L0658P1090k5023j09845p7459o028K32441J50688j63184
12327A630367j07081O0435j7838K0850K312Q7525P3253M9746N7713O8552j11217
12316A814617j45472L0772P9475P7838j9497j1846r0734j9737J2794O6639N6604
$$ plain form
12305 1851453 1849650 1822457 1820974 1796505 1839491 1871125 1945482 1951607 1948869 1980405 2000102 2005936
12293 2005936 1964825 1976205 1903588 1785419 1822603 1957629 2071592 1989139 1924824 1970435 2030952
12282 2030952 2061431 2092785 2087233 2201503 2322708 2352037 2374359 2461569 2442485 2442049 2424305
12271 2424305 2308545 2216128 2211735 2203783 2304722 2299000 2241557 2253504 2309525 2354914 2391972
12260 2391972 2434093 2444915 2456890 2431227 2393378 2386698 2447013 2362737 2302108 2370699 2507768
12249 2507768 2714064 2816546 2760213 2654565 2696776 2646490 2569116 2551851 2697086 2722536
12239 2722536 2739317 2776617 2705435 2724534 2791565 2832163 2791444 2828718 2889163 3048711 3041502
12228 3041502 3073608 3171408 3203178 3206886 3254881 3259693 3295410 3298298 3271505 3269601 3365307 3461201
$$ packed form
12305A851453j803k7193j483k4469M2986L1634P4357O125k738L1536J9697N834
12293B005936m1111J1380p2617j18169L7184J35026J13963q2453o4315M5611O0517
12282B030952L0479L1354n552J14270J21205K9329K2322Q7210j9084m36j7744
12271B424305j15760r2417m393p952J00939n722n7443J1947N6021M5389L7058
12260B391972M2121J0822J1975k5663l7849o680O0315q4276o0629O8591J37069
12249B507768K06296J02482n6333j05648M2211n0286p7374j7265J45235K5450
12239B722536J6781L7300p1182J9099O7031M0598m0719L7274O0445J59548p209
12228C041502L2106R7800L1770L708M7995M812L5717K888k6793j904R5706R5894
$$ plain form
12216 3461201 3564024 3643954 3606145 3429577 3510902 3588282 3521938 3554183 3496829 3593233 3755280
12205 3755280 3778719 3724509 3776574 3817194 3767908 3806683 3860319 3877215 3931965 4068643 4135652
12194 4135652 4092320 4100933 4155673 4263817 4322980 4396869 4433649 4339089 4274981 4326471 4374455
12183 4374455 4399379 4468971 4644742 4648745 4729540 4819421 4800608 4880548 4888421 4871765 4867958 4875849
12171 4875849 5022933 5200655 5251230 5349326 5306501 5295298 5422845 5478356 5406939 5469728 5567308
12160 5567308 5586545 5663463 5659540 5775510 5831707 5915864 5962066 6046100 6236053 6372339 6373622
12149 6373622 6401279 6349982 6359333 6435249 6598292 6646569 6668603 6791413 7009341 7086444 7137273
12138 7137273 7213166 7246472 7433922 7567768 7569722 7661403 7736385 7869978 7973573 8065707 8116845
$$ packed form
12216C461201J02823P9930l7809j76568Q1325P7380o6344L2245n7354R6404J62047
12205C755280K3439n4210N2065M0620m9286L8775N3636J6896N4750J36678O7009
12194D135652m3332Q613N4740J08144N9163P3889L6780r4560o4108N1490M7984
12183D374455K4924O9592J75771M003Q0795Q9881j8813P9940P873j6656l807P891
12171D875849J47084J77722N0575R8096m2825j1203J27547N5511p1417O2789R7580
12160E567308J9237P6918l923J15970N6197Q4157M6202Q4034J89953J36286J283
12149F373622K7657n1297R351P5916J63043M8277K2034J22810K17928P7103N0829
12138G137273P5893L3306J87450J33846J954R1681P4982J33593J03595R2134N1138
$$ plain form
12127 8116845 8170628 8261452 8294068 8400004 8586751 8701853 8871084 8929484 8999544 9028905
12117 9028905 9118578 9289277 9585163 9760519 9873167 9921129 10037047 10161478 10202589 10307192
12107 10307192 10537936 10676053 10856691 10998171 11110881 11271687 11376016 11496308 11722259
12098 11722259 12037562 12312506 12499971 12608191 12737136 12898266 12933372 12961739 13189808 13440181
12088 13440181 13586804 13800173 14023171 14161539 14296068 14512629 14767730 14908659 15041574
12079 15041574 15305036 15652674 15865882 16021414 16257972 16527630 16773573 17002565 17283450
12070 17283450 17495528 17754878 18093868 18388242 18617201 18760555 18949475 19172877 19446089
12061 19446089 19740543 19963540 20159330 20506009 20862042 21129251 21352292 21578396 21867330
$$ packed form
12127H116845N3783R0824L2616J05936J86747J15102J69231N8400P0060K9361
12117I028905Q9673J70699K95886J75356J12648M7962J15918J24431M1111J04603
12107A0307192K30744J38117J80638J41480J12710J60806J04329J20292K25951
12098A1722259L15303K74944J87465J08220J28945J61130L5106K8367K28069K50373
12088A3440181J46623K13369K22998J38368J34529K16561K55101J40929J32915
12079A5041574K63462L47638K13208J55532K36558K69658K45943K28992K80885
12070A7283450K12078K59350L38990K94374K28959J43354J88920K23402K73212
12061A9446089K94454K22997J95790L46679L56033K67209K23041K26104K88934
$$ plain form
12052 21867330 22173379 22573769 22942826 23204275 23405505 23578145 23954324 24153829 24378629
12043 24378629 24625503 24861665 25100227 25368676 25610659 25859398 26135559 26480790 26765581
12034 26765581 27019016 27243997 27420266 27548290 27766518 27994398 28237557 28477706 28689926
12025 28689926 28890473 29121527 29354966 29600164 29732333 29837910 30023599 30164980 30255164
12016 30255164 30388004 30484304 30514336 30554461 30588172 30561112 30665184 30756036 30853337 30924296 30875436
12005 30875436 30766378 30685247 30689662 30549611 30426484 30414931 30341680 30281663 30291727 30307229 30190387
11994 30190387 30079313 29955388 29721616 29510421 29369812 29225845 29006395 28829274 28670992
11985 28670992 28499917 28215606 28034047 27821754 27663683 27560094 27316201 27072448 26774634
$$ packed form
12052B1867330L06049M00390L69057K61449K01230J72640L76179J99505K24800
12043B4378629K46874K36162K38562K68449K41983K48739K76161L45231K84791
12034B6765581K53435K24981J76269J28024K18228K27880K43159K40149K12220
12025B8689926K00547K31054K33439K45198J32169J05577J85689J41381R0184
12016C0255164J32840R6300L0032M0125L3711k7060J04072R0852R7301P0959m8860
12005C0875436j09058q1131M415j40051j23127j1553p3251o0017J0064J5502j16842
11994C0190387j11074j23925k33772k11195j40609j43967k19450j77121j58282
11985B8670992j71075k84311j81559k12293j58071j03589k43893k43753k97814
$$ plain form
11976 26774634 26585849 26293396 25937263 25714534 25461263 25185895 24946702 24711672 24460163
11967 24460163 24220202 23954613 23645077 23418877 23137513 22838089 22409300 22134567 21924256
11958 21924256 21655783 21326030 21121414 20934274 20723813 20475555 20208857 20029004 19805491
11949 19805491 19549515 19387304 19177968 18899562 18625921 18211745 17945881 17723220 17516789
11940 17516789 17323920 17193795 17020374 16762995 16455945 16168610 15924435 15616932 15499112
11931 15499112 15332568 15086944 14879211 14705366 14522723 14417783 14186541 13979324 13800395
11922 13800395 13648211 13455915 13264575 13100710 12937251 12842264 12637834 12397303 12223731
11913 12223731 12017836 11847184 11774740 11657387 11520964 11415173 11230566 11036690 10925636
$$ packed form
11976B6774634j88785k92453l56133k22729k53271k75368k39193k35030k51509
11967B4460163k39961k65589l09536k26200k81364k99424m28789k74733k10311
11958B1924256k68473l29753k04616j87140k10461k48258k66698j79853k23513
11949A9805491k55976j62211k09336k78406k73641m14176k65864k22661k06431
11940A7516789j92869j30125j73421k57379l07050k87335k44175l07503j17820
11931A5499112j66544k45624k07733j73845j82643j04940k31242k07217j78929
11922A3800395j52184j92296j91340j63865j63459r4987k04430k40531j73572
11913A2223731k05895j70652p2444j17353j36423j05791j84607j93876j11054
$$ plain form
11904 10925636 10841475 10679558 10472782 10374897 10295232 10097741 9939703 9833328 9766916 9721162
11894 9721162 9564308 9418746 9223841 9161590 9118426 8977267 8734205 8612048 8618014 8629182
11884 8629182 8552776 8377251 8233500 8135061 8033756 7847742 7724386 7630942 7644087 7599840
11874 7599840 7502049 7380266 7359184 7345059 7258628 7089251 6982401 6862604 6783770 6654121
11864 6654121 6539393 6541726 6559153 6496649 6306974 6210957 6136011 6086827 6000905 5958194 5937119
11853 5937119 5928074 5813152 5706759 5706652 5629274 5490078 5436954 5431537 5367311 5307155 5231989
11842 5231989 5188758 5073963 5047309 5043147 5142919 5083144 4930973 4867049 4840025 4726097 4733548
11831 4733548 4738315 4691932 4659085 4648242 4645658 4555199 4475368 4480057 4424445 4314151 4269992 4218138
$$ packed form
11904A0925636q4161j61917k06776r7885p9665j97491j58038j06375o6412m5754
11894I721162j56854j45562j94905o2251m3164j41159k43062j22157N966J1168
11884H629182p6406j75525j43751r8439j01305j86014j23356r3444J3145m4247
11874G599840r7791j21783k1082j4125q6431j69377j06850j19797p8834j29649
11864F654121j14728K333J7427o2504j89675r6017p4946m9184q5922m2711k1075
11853E937119r045j14922j06393j07p7378j39196n3124n417o4226o0156p5166
11842E231989m3231j14795k6654m162R9772n9775j52171o3924k7024j13928P451
11831D733548M767m6383l2847j0843k584r0459p9831M689n5612j10294m4159n1854
$$ plain form
11819 4218138 4181618 4150394 4115427 4075479 4120914 4147434 4161888 4105146 4015194 3974576 3989626
11808 3989626 4050619 4046941 3938884 3873160 3787515 3700862 3643116 3614436 3639657 3606521 3520789
11797 3520789 3434283 3338536 3202250 3169459 3185444 3205799 3187750 3147533 3081947 3074684 3168043
11786 3168043 3193204 3081660 3014488 2973078 3060176 3142711 3136235 3156825 3133019 3069144 2999144
11775 2999144 2861222 2759929 2795677 2798864 2747448 2804007 2766267 2804284 2694488 2574370 2479600
11764 2479600 2509116 2565093 2543265 2484557 2492392 2527255 2499971 2575773 2647215 2678030 2663121
11753 2663121 2670484 2636360 2479941 2387343 2317674 2344541 2316878 2281424 2175316 2120119 2224542
11742 2224542 2275544 2254133 2233123 2267101 2232402 2195122 2208372 2181387 2126035 2086745 2051360
$$ packed form
11819D218138l6520l1224l4967l9948M5435K6520J4454n6742q9952m0618J5050
11808C989626O0993l678j08057o5724q5645q6653n7746k8680K5221l3136q5732
11797C520789q6506r5747j36286l2791J5985K0355j8049m0217o5586p263R3359
11786C168043K5161j11544o7172m1410Q7098Q2535o476K0590k3806o3875p0000
11775B999144j37922j01293L5748L187n1416N6559l7740L8017j09796j20118r4770
11764B479600K9516N5977k1828n8708P835L4863k7284P5802P1442L0815j4909
11753B663121P363l4124j56419r2598o9669K6867k7663l5454j06108n5197J04423
11742B224542N1002k1411k1010L3978l4699l7280J3250k6985n5352l9290l5385
$$ plain form
11731 2051360 2119498 2174873 2231919 2117959 2131925 2132145 2104469 2025552 2020310 1963164 1922014 1916567
11719 1916567 1842744 1691176 1672752 1725489 1765686 1741977 1668556 1724167 1799059 1768468 1770808
11708 1770808 1843925 1869106 1757297 1695598 1690846 1801853 1829923 1813796 1776606 1808557 1862516
11697 1862516 1754350 1598483 1569420 1536964 1511551 1562966 1608488 1615597 1543169 1524660 1557272
11686 1557272 1572722 1547473 1576030 1601543 1562157 1451750 1487916 1428792 1384598 1393798 1345454
11675 1345454 1430727 1545656 1495325 1379105 1401250 1400801 1376648 1456075 1537912 1582246 1482374
11664 1482374 1412318 1398261 1361849 1287108 1310301 1362976 1348359 1296620 1223243 1249413 1286390
11653 1286390 1216755 1201829 1213700 1220002 1267957 1268882 1273708 1269454 1228627 1091937 1056952 1114298
$$ packed form
11731B051360O8138N5375N7046j13960J3966K20k7676p8917n242n7146m1150n447
11719A916567p3823j51568j8424N2737M0197k3709p3421N5611P4892l0591K340
11708A770808P3117K5181j11809o1699m752J11007K8070j6127l7190L1951N3959
11697A862516j08166j55867k9063l2456k5413N1415M5522P109p2428j8509L2612
11686A557272J5450k5249K8557K5513l9386j10407L6166n9124m4194R200m8344
11675A345454Q5273J14929n0331j16220K2145m49k4153P9427Q1837M4334r9872
11664A482374p0056j4057l6412p4741K3193N2675j4617n1739p3377K6170L6977
11653A286390o9635j4926J1871O302M7955R25M826m254m0827j36690l4985N7346
$$ plain form
11641 1114298 1171899 1233033 1227988 1218636 1211355 1171548 1091838 1082530 1120491 1140988 1203118 1198425
11629 1198425 1086820 1079919 1188998 1165186 1154043 1164081 1254296 1234936 1133296 1094980 1056509
11618 1056509 1044157 1050711 1029248 1005652 1038296 1028374 1014398 1059102 1005750 972968 923679 975469
11606 975469 972609 939347 984160 1045420 995111 964669 926936 927503 970492 957186 915113 950649
11594 950649 893690 910853 983675 982311 900904 878529 989289 936921 906733 860551 893718
11583 893718 929776 962431 953231 1028081 939491 891523 864765 808553 886239 994070 1065783
11572 1065783 990345 864780 831096 807504 912976 1044455 969610 838572 866668 762763
11562 762763 665462 672420 586840 667591 753674 809437 852214 948783 1008848 977030 913977 874652
$$ packed form
11641A114298N7601O1134n045r352p281l9807p9710r308L7961K0497O2130m693
11629A198425j11605o901J09079k3812j1143J0038R0215j9360j01640l8316l8471
11618A056509j2352O554k1463k3596L2644r922j3976M4704n3352l2782m9289N1790
11606I75469k860l3262M4813O1260n0309l0442l7733N67M2989j3306m2073L5536
11594I50649n6959J7163P2822j364q1407k2375J10760n2368l0188m6182L3167
11583H93718L6058L2655r200P4850q8590m7968k6758n6212P7686J07831P1713
11572A065783p5438j25565l3684k3592J05472J31479p4845j31038K8096j03905
11562G62763r7301O958q5580Q0751Q6083N5763M2777R6569O0065l1818o3053l9325
$$ plain form
11550 874652 848933 924872 963976 924563 918731 865688 836286 848112 822940 729566 772103 823117
11538 823117 845515 848802 767978 704828 761127 780532 733279 632664 677935 752091 817400
11527 817400 790378 843812 875614 792882 766750 716896 643264 622836 590647 663888 726443
11516 726443 760164 719869 777551 879481 806302 692912 702169 714367 718465 720016 591681
11505 591681 554390 588550 548559 475612 542423 602830 670084 654179 641191 610612 715651
11494 715651 788890 815147 679300 676405 766788 711529 640012 656042 677280 686606 629670 569540
11482 569540 529043 494176 492482 622311 633724 547560 554769 573975 546392 523298 520666 541883
11470 541883 496028 457938 447165 382296 380609 374034 411763 506784 537715 555989 597337 497347
$$ packed form
11550H74652k5719P5939L9104l9413n832n3043k9402J1826k5172r3374M2537N1014
11538H23117K2398L287q0824o3150N6299J9405m7253j00615M5271P4156O5309
11527H17400k7022N3434L1802q2732k6132m9854p3632k0428l2189P3241O2555
11516G26443L3721m0295N7682J01930p3179j13390R257J2198M098J551j28335
11505E91681l7291L4160l9991p2947O6811O0407O7254j5905j2988l0579J05039
11494G15651P3239K6257j35847k895R0383n5259p1517J6030K1238R326n6936o0130
11482E69540m0497l4867j694J29829J1413q6164P209J9206k7583k3094k632K1217
11470E41883m5855l8090j0773o4869j687o575L7729R5021L0931J8274M1348r9990
$$ plain form
11458 497347 480625 479613 544642 557462 553960 515405 495519 557637 573414 578421 545006 565685
11446 565685 637985 556100 534412 482242 365058 347621 385885 375835 275645 337125 375943
11435 375943 402824 446401 491044 466291 418381 372700 430271 507611 516689 521029 495456 373049
11423 373049 285405 331729 407565 523527 586952 629607 558975 462811 504444 467992 469024
11412 469024 546860 496868 405118 420617 417695 357320 355445 402653 469765 496451 457236 392076
11400 392076 445308 475690 519076 552088 485311 406226 419496 476156 577990 618938 533898
11389 533898 425703 380105 416317 352046 422116 506139 539103 493276 429774 413007 401283
11378 401283 371256 234599 180112 242283 369411 335458 358585 407032 376823 284877 295639
$$ packed form
11458D97347j6722j012O5029J2820l502l8555j9886O2118J5777N007l3415K0679
11446E65685P2300q1885k1688n2170j17184j7437L8264j0050j00190O1480L8818
11435C75943K6881M3577M4643k4753m7910m5681N7571P7340R078M340k5573j22407
11423C73049q7644M6324P5836J15962O3425M2655p0632r6164M1633l6452J032
11412D69024P7836m9992r1750J5499k922o0375j875M7208O7112K6686l9215o5160
11400C92076N3232L0382M3386L3012o6777p9085J3270N6660J01834M0948q5040
11389E33898j08195m5598L6212o4271P0070Q4023L2964m5827o3502j6767j1724
11378D01283l0027j36657n4487O2171J27128l3953K3127M8447l0209r1946J0762
$$ plain form
11367 295639 307971 370358 365173 433488 322811 365868 337002 312757 371384 483080 420170
11356 420170 301198 289042 331834 422056 401734 372034 397909 382797 337798 335491 269790
11345 269790 255994 259664 356435 301503 231420 292980 296884 235395 232607 177191 163961 248741
11333 248741 351227 449811 428703 425194 268767 247762 306509 281617 282257 414759 528146
11322 528146 530202 481559 403866 318228 377366 415698 398514 381021 357297 425425 419450 441957
11310 441957 368095 278527 260033 244265 276250 346742 384482 350091 391407 420272 500775
11299 500775 491513 422843 393621 410953 406961 400155 334972 364169 353295 394390 376272 414327
11287 414327 450648 385083 296302 285575 348626 319580 298974 262192 218151 334881 376686
$$ packed form
11367B95639J2332O2387n185O8315j10677M3057k8866k4245N8627J11696o2910
11356D20170j18972j2156M2792R0222k0322k9700K5875j5112m4999k307o5701
11345B69790j3796L670R6771n4932p0083O1560L904o1489k788n5416j3230Q4780
11333B48741J02486R8584k1108l509j56427k1005N8747k4892O40J32502J13387
11322E28146K056m8643p7693q5638N9138L8332j7184j7493k3724O8128n975K2507
11310D41957p3862q9568j8494j5768L1985P0492L7740l4391M1316K8865Q0503
11299E00775r262o8670k9222J7332l992o806o5183K9197j0874M1095j8118L8055
11287D14327L6321o5565q8781j0727O3051k9046k0606l6782m4041J16730M1805
$$ plain form
11276 376686 247946 279924 300121 377166 418000 341855 298216 275806 238822 304084 343289
11265 343289 368521 286820 202169 289243 381016 323570 327364 346575 360416 359344 328704 301627
11253 301627 171384 164457 216601 194842 188206 257588 336239 362401 326923 269280 204338 215681
11241 215681 257813 275339 162094 112622 198259 301422 320413 261729 246712 269548 319039
11230 319039 442960 422307 291763 242705 251990 262050 242767 261277 231792 156984 133269
11219 133269 231274 339618 242957 178659 104759 -5718 18603 139520 296181 255724 240899
11208 240899 204067 220185 309069 345887 285511 334235 304328 246403 234417 172417 32052
11197 32052 -41231 59103 206412 227965 231262 271683 247403 236879 199660 239308 260782
$$ packed form
11276C76686j28740L1978K0197P7045M0834p6145m3639k2410l6984O5262L9205
11265C43289K5232q1701q4651Q7074R1773n7446L794J9211J3841j072l0640k7077
11253C01627j30243o927N2144k1759o636O9382P8651K6162l5478n7643o4942J1343
11241B15681M2132J7526j13245m9472Q5637J03163J8991n8684j5017K2836M9491
11230C19039J23921k0653j30544m9058R285J0060j9283J8510k9485p4808k3715
11219A33269R8005J08344r6661o4298p3900j10477K4321J20917J56661m0457j4825
11208B40899l6832J6118Q8884L6818o0376M8724k9907n7925j1986o2000j40365
11197C2052p3283J00334J47309K1553L297M0421k4280j0524l7219L9648K1474
$$ plain form
11186 260782 175095 149943 248711 275834 245238 231274 204500 96451 120964 196076 201429
11175 201429 130931 141110 194513 243327 280036 260249 214926 143322 219724 313358 232482
11164 232482 159717 161545 196967 127118 185537 195161 172703 228189 222959 197818 208921 270039
11152 270039 337178 245554 148241 94874 233867 245312 279828 235904 172857 164157 163098 81802
11140 81802 127416 172851 196263 178471 189119 184022 197768 193918 248761 60174 82190 181369
11128 181369 180055 199124 158646 104391 -3870 -33366 32771 105309 37113 49029 134762
11117 134762 184642 109685 89777 54213 110344 147476 186508 215300 172638 123682 188275
11106 188275 285711 353377 323903 279227 226883 154300 159232 191468 175647 133070 65985 150294
$$ packed form
11186B60782q5687k5152R8768K7123l0596j3964k6774j08049K4513P5112N353
11175B01429p0498J0179N3403M8814L6709j9787m5323p1604P6402R3634q0876
11164B32482p2765J828L5422o9849N8419R624k2458N5486n230k5141J1103O1118
11152B70039O7139r1624r7313n3367J38993J1445L4516m3924o3047q700j059q1296
11140H1802M5614M5435K3412j7792J0648n097J3746l850N4843j88587K2016R9179
11128A81369j314J9069m0478n4255j08261k9496O6137P2538o8196J1916Q5733
11117A34762M9880p4957j9908l5564N6131L7132L9032K8792m2662m8956O4593
11106A88275R7436O7666k9474m4676n2344p2583M932L2236j5821m2577o7085Q4309
$$ plain form
11094 150294 180019 159433 245167 302775 248505 225614 204957 151010 107820 85598 51241
11083 51241 82605 149272 192963 52603 71697 127472 120155 66324 43574 4389 28495 113680
11071 113680 199826 190547 192025 152285 135623 147184 177867 284105 301512 248018 201302 270099
11059 270099 277675 228093 261031 232528 177443 220320 228850 196815 183194 288214 396577
11048 396577 391916 429319 449155 456181 420026 453443 455717 402357 451353 390153 457028 524920
11036 524920 550136 619537 686618 685379 673416 725091 799315 831128 749293 600451 512654
11025 512654 614308 780976 877522 851195 767799 777886 821161 840239 828912 743251 673350
11014 673350 558814 594127 648308 712684 746300 769533 770780 771948 797253 723872 698693 628243
$$ packed form
11094A50294K9725k0586Q5734N7608n4270k2891k0657n3947m3190k2222l4357
11083E1241L1364O6667M3691j40360J9094N5775p317n3831k2750l9185K4106Q5185
11071A13680Q6146r279J478l9740j6662J1561L0683J06238J7407n3494m6716O8797
11059B70099P576m9582L2938k8503n5085M2877Q530l2035j3621J05020J08363
11048C96577m661L7403J9836P026l6155L3417K274n3360M8996o1200O6875O7892
11036E24920K5216O9401O7081j239j1963N1675P4224L1813q1835j48842q7797
11025E12654J01654J66668R6546k6327q3396J0087M3275J9078j1327q5661o9901
11014F73350j14536L5313N4181O4376L3616K3233J247J168K5305p3381k5179p0450
$$ plain form
11002 628243 591821 628506 589749 514975 452470 526975 600160 605490 584720 529547 518369 465665
10990 465665 463171 517332 513521 415826 269959 319713 381388 253425 110140 38563 117503
10979 117503 168379 284025 271319 200703 147968 175188 299134 360588 364727 338009 275455
10968 275455 154652 178962 256058 234059 196126 207851 285935 246885 205901 156925 184624
10957 184624 269287 249834 112295 115224 165670 174201 163926 152849 186145 329976 415621
10946 415621 345442 357218 299013 377634 456958 432536 366434 263716 254898 204511 140110
10935 140110 179098 176205 179388 178478 171356 156770 107984 167573 246703 162432 132480 156954
10923 156954 119023 87155 176306 193630 234253 178117 141909 173976 154047 160425 156373 99854
$$ packed form
11002F28243l6422L6685l8757p4774o2505P4505P3185N330k0770n5173j1178n2704
10990D65665k494N4161l811r7695j45867M9754O1675j27963j43285p1577P8940
10979A17503N0876J15646j2706p0616n2735K7220J23946O1454M139k6718o2554
10968B75455j20803K4310P7096k1999l7933J1725P8084l9050m0984m8976K7699
10957A84624Q4663j9453j37539K929N0446Q531j0275j1077L3296J43831Q5645
10946D15621p0179J1776n8205P8621P9324k4422o6102j02718q818n0387o4401
10935A40110L8988k893L183r10p122j4586m8786N9589P9130q4271k9952K4474
10923A56954l7931l1868Q9151J7324M0623n6136l6208L2067j9929O378m052n6519
$$ plain form
10911 99854 152792 127825 66900 -13007 -37312 -44697 -1657 73893 144757 63329 66630 43836
10899 43836 63531 54498 55726 147297 98640 6498 -41877 61771 60729 81977 178529 191511
10887 191511 186134 176916 225645 112328 209165 232368 178850 139317 73309 109017 151153 204553
10875 204553 130376 53298 53338 80869 141503 142809 204870 181068 64679 -10683 24290 88973
10863 88973 71891 54344 79295 208281 212614 255716 287994 302199 353633 317770 362995 327020
10851 327020 247908 260546 285490 275778 321488 258928 224226 245988 212809 200243 236957 269841
10839 269841 306803 375312 349502 258311 237974 231045 245713 125340 181957 232019 301674
10828 301674 232156 244818 229028 261749 279935 235608 221660 311964 182067 141768 279744
$$ packed form
10911I9854N2938k4967o0925p9907k4305p385M3040P5550P0864q1428L301k2794
10899D3836J9695r033J228R1571m8657r2142m8375J03648j042K1248R6552J2982
10887A91511n377r218M8729j13317R6837K3203n3518l9533o6008L5708M2136N3400
10875B04553p4177p7078M0K7531O0634J306O2061k3802j16389p5362L4973O4683
10863H8973j7082j7547K4951J28986M333M3102L2278J4205N1434l5863M5225l5975
10851C27020p9112J2638K4944r712M5710o2560l4702K1762l3179j2566L6714L2884
10839B69841L6962O8509k5810r1191k0337o929J4668j20373N6617N0062O9655
10828C01674o9518J2662j5790L2721J8186m4327j3948R0304j29897m0299J37976
$$ plain form
10817 279744 347567 291052 179207 209346 294672 287107 243736 196969 193949 332387 271490
10806 271490 128198 189639 153673 171927 219027 192042 247817 158917 131350 116386 97633
10795 97633 133907 145207 124287 23265 82287 122542 98667 26555 -23116 -37678 -54852
10784 -54852 4077 9105 -11013 -10804 -67074 -39709 -24306 -90067 -192501 -251597 -269915 -282341
10772 -282341 -200793 -225183 -226571 -127374 -4691 54295 72074 -16715 -25909 6602 -32492 -90931
10760 -90931 -191027 -150971 -71356 -43889 -87375 -89277 46032 71438 22622 -17720 -21515 14553
10748 14553 5986 5858 91802 114632 112506 12879 20493 74948 154254 167639 187825 171062 220307
10735 220307 161031 142080 113261 44443 -24913 -17531 -17560 -48939 7493 68738 190072 204941
$$ packed form
10817B79744O7823n6515j11845L0139Q5326p565m3371m6767l020J38438o0897
10806B71490j43292O1441l5966J8254M7100k6985N5775q8900k7567j4964j8753
10795I7633L6274J1300k0920j01022N9022M0255k3875p2112m9671j4562j7174
10784e4852N8929N028k0118K09n6270K7365J5403o5761j02434n9096j8318j2426
10772b82341Q1548k4390j388R9197J22683N8986J7779q8789r194L2511l9094n8439
10760i0931j00096M0056P9615K7467m3486j902J35309K5406m8816m0342l795L6068
10748A4553q567j28Q5944K2830k126r9627P614N4455P9306J3385K0186j6763M9245
10735B20307n9276j8951k8819o8818o9356P382k9l1379N6432O1245J21334J4869
$$ plain form
10723 204941 276824 321514 186646 95448 92231 193074 285443 255461 199227 201223 276865
10712 276865 277117 217332 212352 198472 103182 143110 190099 220245 262659 206603 299671 277357
10700 277357 97861 77829 150860 277212 220212 213895 210211 150254 183010 245916 241799 249779
10688 249779 211325 284778 360456 446173 455350 329172 159798 185762 271978 289494 334741
10677 334741 417939 407738 399195 380030 416677 470025 549122 636033 678916 681243 643132 667475
10665 667475 691058 777805 774916 831585 920192 917356 884384 850553 890349 965059 957983 966782
10653 966782 1019505 1157062 1226261 1236952 1235014 1261021 1342899 1286402 1259457 1350251 1476172
10642 1476172 1625309 1592067 1685711 1680631 1781571 1878791 1986290 2142869 2338556 2555341
$$ packed form
10723B04941P1883M4690j34868r1198l217J00843R2369k9982n6234J996P5642
10712B76865K52n9785m980j3880r5290L9928M6989L0146M2414n6056R3068k2314
10700B77357j79496k0032P3031J26352n7000o317l684n9957L2756O2906m117P980
10688B49779l8454P3453P5678Q5717R177j26178j69374K5964Q6216J7516M5247
10677C34741Q3198j0201q543j9165L6647N3348P9097Q6911M2883K327l8111K4343
10665F67475K3583Q6747k889N6669Q8607k836l2972l3831L9796P4710p076Q799
10653I66782N2723J37557O9199J0691j938K6007Q1878n6497k6945R0794J25921
10642A476172J49137l3242R3644n080J00940R7220J07499J56579J95687K16785
$$ plain form
10632 2555341 2825046 3225540 3621620 3936452 4243151 4576307 5052985 5698191 6509808
10623 6509808 7477002 8687572 10430278 12636220 15534352 19273592 23660673 28621155
10615 28621155 33750541 38107636 40984146 42332531 42654170 42995973 43973407 46132853
10607 46132853 49970527 55777608 63434204 72514978 81652196 88644739 91645578 90652852
10599 90652852 87605243 84676071 83108567 83638195 86824998 92963021 102038491 112651729
10591 112651729 122571190 128737385 128645373 122633176 113773986 105129016 98189749 93406225
10583 93406225 91276676 91847638 94612699 98563625 102122749 102979189 99603949 92427506
10575 92427506 84011084 76175039 69592796 64576620 61189808 59367503 58674413 58472069
$$ packed form
10632B555341K69705M00494L96080L14832L06699L33156M76678O45206Q11617
10623F509808R67194J210570J742706K205942K898132L739240M387081M960482
10615B8621155N129386M357095K876510J348385L21639L41803R77434K159446
10607D6132853L837674N807081P656596R080774R137218O992543L000839r92726
10599I0652852l047609k929172j567504N29628L186803O138023R075470J0613238
10591A12651729R919461O166195r2012o012197q859190q644970o939267m783524
10583I3406225k129549N70962K765061L950926L559124Q56440l375240p176443
10575I2427506q416422p836045o582243n016176l386812j822305o93090k02344
$$ plain form
10567 58472069 58000077 56412041 53146661 48596335 43481813 38750723 34532975 30908285
10559 30908285 27890550 25296471 23163807 21449325 20113963 18927670 17789232 16707707
10551 16707707 15711430 14871471 14236775 13607049 12927278 12498987 12183876 11827739 11398991
10542 11398991 10838640 10392978 9949166 9514442 9090391 8715082 8373290 8038098 7724237
10533 7724237 7462050 7101304 6718711 6463358 6283345 6038084 5688164 5464318 5295167
10524 5295167 5085344 4808774 4566377 4410075 4259128 4042502 3824375 3685617 3497646
10515 3497646 3289925 3094236 3007713 2875229 2752233 2701473 2559617 2432157 2375841 2306416
10505 2306416 2165095 2049044 2012637 1979092 1901878 1780191 1695663 1654461 1595353 1556176 1531211
$$ packed form
10567E8472069m71992j588036l265380m550326n114522m731090m217748l624690
10559C0908285l017735k594079k132664j714482j335362j186293j138438j081525
10551A6707707r96277q39959o34696o29726o79771m28291l15111l56137m28748
10542A1398991n60351m45662m43812m34724m24051l75309l41792l35192l13861
10533G724237k62187l60746l82593k55353j80013k45261l49920k23846j69151
10524E295167k09823k76570k42397j56302j50947k16626k18127j38758j87971
10515C497646k07721j95689q6523j32484j22996n0760j41856j27460n6316o9425
10505B306416j41321j16051l6407l3545p7214j21687q4528m1202n9108l9177k4965
$$ plain form
10494 1531211 1431128 1308553 1277355 1199208 1152773 1195147 1243287 1239321 1134941 1144139 1113031
10483 1113031 1098337 1057851 1008862 917810 947599 948029 973747 977924 1028106 1047734 1022311 1009140
10471 1009140 921423 973676 970376 901917 878297 838397 800907 810620 784864 785422 774363 778982
10459 778982 733742 806152 806472 704138 705848 735200 719636 741445 748204 719965 685852 766614
10447 766614 788006 829762 806497 834523 827305 759225 684314 700278 659334 592275 620523 563393
10435 563393 515374 485139 480171 587618 547128 463005 497647 568988 552074 559042 502058 528678
10423 528678 567766 622227 683195 716858 782269 845113 843585 661042 564529 500675 470337
10412 470337 590985 561574 494848 555865 578794 628613 649967 637302 537450 469834 547446
$$ packed form
10494A531211j00083j22575l1198p8147m6435M2374M8140l966j04380R198l1108
10483A113031j4694m0486m8989r1052K9789M30K5718M177N0182J9628k5423j3171
10471A009140q7717N2253l300o8459k3620l9900l7490R713k5756N58j1059M619
10459G78982m5240P2410L20j02334J710K9352j5564K1809O759k8239l4113Q0762
10447G66614K1392M1756k3265K8026p218o8080p4911J5964m0944o7059K8248n7130
10435E63393m8019l0235m968J07447m0490q4123L4642P1341j6914O968n6984K6620
10423E28678L9088N4461O0968L3663O5411O2844j528j82543r6513o3854l0338
10412D70337J20648k9411o6726O1017K2929M9819K1354j2665r9852o7616P7612
$$ plain form
10401 547446 663910 581094 526165 546033 651822 634469 585271 593488 596858 520365 508527
10390 508527 592316 630248 711961 688494 600254 551532 503674 396270 292905 298092 426144
10379 426144 476834 374714 373495 379719 438401 342454 293663 351646 396028 473748 512340 374823
10367 374823 338605 247126 309146 330668 298752 371042 337618 173608 127703 130037 104322
10356 104322 209828 249786 296726 375414 360561 328713 361625 391281 394540 399228 419747 353697
10344 353697 300696 268917 241273 237979 286613 328450 241828 190161 248000 298476 359478 304073
10332 304073 303591 376617 347173 239747 110713 119372 122257 77493 133584 30200 -25470 23988
10320 23988 137285 127233 80910 95934 251189 265074 197258 222649 230746 170854 152714
$$ packed form
10401E47446J16464q2816n4929J9868J05789j7353m9198Q217L370p6493j1838
10390E08527Q3789L7932Q1713k3467q8240m8722m7858j07404j03365N187J28052
10379D26144N0690j02120j219O224N8682r5947m8791N7983M4382P7720L8592j37517
10367C74823l6218r1479O2020K1522l1916P2290l3424j64010m5905K334k5715
10356A04322J05506L9958M6940P8688j4853l1848L2912K9656L259M688K0519o6050
10344C53697n3001l1779k7644l294M8634M1837q6622n1667N7839N0476O1002n5405
10332C04073m82P3026k9444j07426j29034Q659K885m4764N6091j03384n5670M9458
10320B3988J13297j0052m6323J5024J55255J3885o7816K5391Q097n9892j8140
$$ plain form
10309 152714 119323 118466 126518 127864 113939 76368 60099 93005 185483 218799 247890 278239
10297 278239 199267 153522 249814 335607 380914 407651 398166 343878 337447 314132 286697 258422
10285 258422 340763 380033 322532 233407 179648 148581 180007 195350 220736 262853 111815
10274 111815 83053 188654 216807 210648 244078 277917 260961 261242 226486 229182 363511 349826
10262 349826 273984 214971 252124 218912 284587 318675 305258 231193 245759 322771 314310 211327
10250 211327 114480 94431 232393 236596 160628 110427 108301 32787 83719 124711 92744 87592
10238 87592 133100 193003 279155 295388 282383 215559 151591 123949 176627 153734 102918 118410
10226 118410 206848 183113 181587 153521 78323 63663 183616 217306 198979 145564 56278
$$ packed form
10309A52714l3391q57Q052J346j3925l7571j6269L2906R2478L3316K9091L0349
10297B78239p8972m5745R6292Q5793M5307K6737r485n4288o431k3315k7435k8275
10285B58422Q2341L9270n7501q9125n3759l1067L1426J5343K5386M2117j51038
10274A11815k8762J05601K8153o159L3430L3839j6956K81l4756K696J34329j3685
10262C49826p5842n9013L7153l3212O5675L4088j3417p4065J4566P7012q461j02983
10250B11327r6847k0049J37962M203p5968n0201k126p5514N0932M0992l1967n152
10238H7592M5508N9903Q6152J6233j3005o6824o3968k7642N2678k2893n0816J5492
10226A18410Q8438k3735j526k8066p5198j4660J19953L3690j8327n3415q9286
$$ plain form
10215 56278 51997 84720 45983 129982 165290 137684 29967 41246 214740 232445 119764
10204 119764 96748 50825 -10984 29407 172003 131364 -2174 -43964 14401 132786 162549
10193 162549 134938 53674 55005 105811 231584 375829 395237 344176 296194 269358 163579
10182 163579 198344 242704 243285 333435 374714 233933 155888 226452 254974 342462 231204
10171 231204 199669 315986 372692 419848 560051 672078 602515 612183 692066 695601 643060
10160 643060 618989 592954 564442 563134 606000 731053 767069 802494 785496 771447 688319
10149 688319 676239 636942 588934 396394 441304 616078 762729 788047 723945 675974 524070
10138 524070 409334 368335 416319 467321 507788 487745 473961 459360 508996 485279 417740
$$ packed form
10215E6278m281L2723l8737Q3999L5308k7606j07717J1279J73494J7705j12681
10204A19764k3016m5923o1809M0391J42596m0639j33538m1790N8365J18385K9763
10193A62549k7611q1264J331N0806J25773J44245J9408n1061m7982k6836j05779
10182A63579L4765M4360N81R0150M1279j40781p8045P0564K8522Q7488j11258
10171B31204l1535J16317N6706M7156J40203J12027o9563R668P9883L535n2541
10160F43060k4071k6035k8512j308M2866J25053L6016L5425j6998j4049q3128
10149F88319j2080l9297m8008j92540M4910J74774J46651K5318o4102m7971j51904
10138E24070j14736m0999M7984N1002M0467k0043j3784j4601M9636k3717o7539
$$ plain form
10127 417740 434923 436597 437312 448630 380665 347210 213178 248836 309786 339773 338868 340508
10115 340508 321997 412746 421835 391732 293791 241347 161320 207032 249201 341103 366967 316656
10103 316656 247134 295279 270523 173938 48199 -45183 6978 36152 94425 111768 87061
10092 87061 5369 14476 110982 153653 140636 178886 67255 2102 50509 80228 159794 152147
10080 152147 153696 203915 214441 221187 182862 161398 84591 63481 124836 119329 114057 109789
10068 109789 135686 144186 209307 179850 186658 161239 176443 226153 233076 122959 99897 86176
10056 86176 93630 91542 93899 157175 156774 124528 92131 68686 46470 142024 85772 120271 109993
10043 109993 59331 57637 -43651 -94922 -112508 -93030 -111581 -76369 -68566 50341 36418
$$ packed form
10127D17740J7183J674P15J1318o7965l3455j34032L5658O0950K9987r05J640
10115C40508j8511R0749R089l0103r7941n2444q0027M5712M2169R1902K5864n0311
10103C16656o9522M8145k4756r6585j25739r3382N2161K9174N8273J7343k4707
10092H7061q1692R107R6506M2671j3017L8250j11631o5153M8407K9719P9566p647
10080A52147J549N0219J0526O746l8325k1464p6807k1110O1355n507n272m268
10068A09789K5897Q500O5121k9457O808k5419J5204M9710O923j10117k3062j3721
10056H6176P454k088K357O3276m01l2246l2397k3445k2216R5554n6252L4499j0278
10043A09993n0662j694j01288n1271j7586J9478j8551L5212P803J18907j3923
$$ plain form
10032 36418 -2972 -40150 -15343 26059 23541 64772 153493 148648 156490 170643 192669 80068
10020 80068 36930 207973 143003 39485 90523 65593 95636 58100 57084 101648 152219
10009 152219 127495 109859 159131 161487 130293 95914 64136 -6042 130656 198109 63831
9998 63831 -23175 90455 100620 55183 54375 -42552 1775 7352 -2887 -28231 28713 -63348
9986 -63348 -91394 -59962 -18662 11009 -20556 100359 144525 103436 106184 155961 149495 55582
9974 55582 6335 431 32775 103841 160389 103827 17733 47726 161153 221641 188001 156019
9962 156019 166514 123536 162941 149078 117262 78920 24791 33477 60012 92660 10032 -90154
9950 -90154 -126415 -6876 78139 159184 178062 145278 99484 111245 125116 160916 46241
$$ packed form
10032C6418l9390l7178K4807M1402k518M1231Q8721m845P842J4153K2026j12601
10020H0068m3138J71043o4970j03518N1038k4930L0043l7536j016M4564N0571
10009A52219k4724j7636M9272K356l1194l4379l1778p0178J36698O7453j34278
9998F3831q7006J13630J0165m5437q08r6927M4327N577j0239k5344N6944r2061
9986f3348k8046L1432M1300K9671l1565J20915M4166m1089K748M9777o466r3913
9974E5582m9247n904L2344P1066N6548n6562q6094K9993J13427O0488l3640l1982
9962A56019J0495m2978L9405j3863l1816l8342n4129Q686K6535L2648q2628j00186
9950i0154l6261J19539Q5015Q1045J8878l2784m5794J1761J3871L5800j14675
$$ plain form
9939 46241 -21624 -1381 20416 52384 95648 140893 229360 331450 370997 417580 449385 379409
9927 379409 439683 459838 387107 322534 259363 225285 235773 176958 155632 157473 74418 35051
9915 35051 -20201 -7409 -9708 2603 -13445 59897 114817 145119 195829 259153 277443 171404
9903 171404 67661 39169 30964 68410 139889 228329 178006 155845 181277 103750 96093 154384
9891 154384 173430 168430 219599 195471 90266 160247 134081 36841 -1892 21468 71584 79673
9879 79673 -15380 -18823 28417 85333 -11162 -127780 -59779 -34309 50625 9146 11939 37489
9867 37489 -8883 3732 153418 140487 18750 44011 104732 50589 -75584 -238960 -158702
9856 -158702 -2949 21600 41862 166693 253312 192880 113162 122792 27737 27238 102540 135531
$$ packed form
9939D6241o7865K0243K1797L1968M3264M5245Q8467J02090L9547M6583L1805o9976
9927C79409O0274K0155p2731o4573o3171l4078J0488n8815k1326J841q3055l9367
9915C5051n5252J2792k299J2311j6048P3342N4920L0302N0710O3324J8290j06039
9903A71404j03743k8492q205L7446P1479Q8440n0323k2161K5432p7527p657N8291
9891A54384J9046n000N1169k4128j05205O9981k6166r7240l8733K3360N0116Q089
9879G9673r5053l443M7240N6916r6495j16618O8001K5470Q4934m1479K793K5550
9867C7489m6372J2615J49686j2931j21737K5261O0721n4143j26173j63376Q0258
9856a58702J55753K4549K0262J24831Q6619o0432p9718R630r5055m99P5302L2991
$$ plain form
9844 135531 71423 -4832 6080 43226 62323 116720 212742 213326 126492 115092 48323 88206
9832 88206 103688 40408 36568 9138 66742 85720 103342 44321 -62577 -145408 -135829 -76872
9820 -76872 -49480 -31433 14963 62660 37387 44734 67926 -36748 2136 20914 -22073 8010
9808 8010 -28003 -21772 -37635 -10200 87520 52338 -11336 58921 116732 137587 47969 5320
9796 5320 25024 48406 41447 -16119 53446 164119 133943 48671 -64120 -199111 -164078 -51114
9784 -51114 -18831 5056 -4491 -54826 -72716 -138269 -101678 -85671 -61394 -24089 -3589 -16483
9772 -16483 17019 78415 81782 57011 144237 105534 26709 -9319 -18906 19033 -10683 35599
9760 35599 66612 69359 129306 120665 170003 95504 39933 56925 48417 23590 -3223 66232
$$ packed form
9844A35531o4108p6255J0912L7146J9097N4397R6022N84q6834j1400o6769L9883
9832H8206J5482o3280l840k7430N7604J8978J7622n9021j06898q2831R579N8957
9820g6872K7392J8047M6396M7697k5273P347K3192j04674L8884J8778m2987L0083
9808H010l6013O231j5863K7435R7720l5182o3674P0257N7811K0855q9618m2649
9796E320J9704K3382o959n7566O9565J10673l0176q5272j12791j34991L5033J12964
9784e1114L2283K3887r547n0335j7890o5553L6591J6007K4277L7305K0500j2894
9772a6483L3502O1396L367k4771Q7226l8703p8825l6028r587L7939k9716M6282
9760C5599L1013K747N9947q641M9338p4499n5571J6992q508k4827k6813O9455
$$ plain form
9748 66232 80273 127217 81191 67751 139564 62033 -16809 16177 60332 96229 67284 64833
9736 64833 26987 36955 64745 46033 56484 51292 49544 -38576 -123656 -146574 25826 66780
9724 66780 -56611 -29473 -15911 51241 32439 8573 18375 120268 183704 191426 123734 32049
9712 32049 13529 32072 32323 62833 93987 54874 155761 136300 70552 78399 68058 -1163
9700 -1163 -10887 -41396 -53310 -33038 -73926 -63805 -59820 -126768 -87639 -26987 16280 22113 75395
9687 75395 -51945 -90714 -39419 10111 -23786 -788 -71963 4426 -36193 -31762 -93815 -103393
9675 -103393 -82327 -57058 -6047 4607 25153 66674 13874 -29006 -125241 -206942 -129929 -24066
9663 -24066 -19657 51600 102118 46236 88050 198456 196204 97490 26549 33770 81018 146183
$$ packed form
9748F6232J4041M6944m6026j3440P1813p7531p8842L2986M4155L5897k8945k451
9736F4833l7846R968K7790j8712J0451n192j748q8120q5080k2918J72400M0954
9724F6780j23391K7138J3562O7152j8802k3866R802J01893O3436P722o7692r1685
9712C2049j8520J8543K51L0510L1154l9113J00887j9461o5748P847j0341o9221
9700a163r724l0509j1914K0272m0888J0121L985o6948L9129O0652M3267N833N3282
9687G5395j27340l8769N1295M9530l3897K2998p1175P6389m0619M431o2053r578
9675a03393K1066K5269N1011J0654K0546M1521n2800m2880r6235q1701P7013J05863
9663b4066M409P1257N0518n5882M1814J10406k252r8714p0941P221M7248O5165
$$ plain form
9651 146183 217363 180084 168803 124817 64536 135303 150968 -575 -12725 33685 10166
9640 10166 59439 171829 122505 46420 93318 95537 64960 137916 138659 88589 77194 57823
9628 57823 62055 2287 40812 126036 65506 129459 227760 132356 145109 79842 24997 53629
9616 53629 67471 66369 115930 98378 -108568 -118198 -22273 67751 89684 18294 65773 44906
9604 44906 -52641 -107889 -109163 -36712 -3941 -73076 -103800 -92438 -110088 -82925 -55153 -65588
9592 -65588 4856 115682 126080 122976 114613 122776 197519 160423 132840 123055 138826 207984
9580 207984 176611 119175 73574 29178 -14991 -25199 18121 40326 -11838 -47162 -53952 -38590
9568 -38590 -16721 -9329 16395 2286 14812 30432 85218 -41146 -111045 -142731 -146953 -99751
$$ packed form
9651A46183P1180l7279j1281m3986o0281P0767J5665j51543j2150M6410k3519
9640A0166M9273J12390m9324p6085M6898K219l0577P2956P43n0070j1395j9371
9628E7823M232n9768L8525Q5224o0530O3953R8301r5404J2753o5267n4845K8632
9616E3629J3842j102M9561j7552k06946r630R5925R0024K1933p1390M7479k0867
9604D4906r7547n5248j274P2451L2771o9135l0724J1362j7650K7163K7772j0435
9592f5588P0444J10826J0398l104q363Q163P4743l7096k7583r785J5771O9158
9580B07984l1373n7436m5601m4396m4169j0208M3320K2205n2164l5324o790J5362
9568c8590K1869P392K5724j4109J2526J5620N4786j26364o9899l1686m222M7202
$$ plain form
9556 -99751 9594 -9467 -41260 -36476 50757 192947 308861 315611 195440 75539 -24159
9545 -24159 -148867 -48285 98467 189776 99960 79805 141881 123139 -1479 -104476 -157999
9534 -157999 30793 84094 25940 93931 118211 171129 227816 246595 234286 207471 181236
9523 181236 139837 137958 136211 171759 99627 91556 45225 107622 225299 183720 86390 -4228
9511 -4228 -22038 -54271 -50449 21393 91541 13610 -98261 -168871 -119229 -86018 -71513 -124283
9499 -124283 -164014 -143644 -120115 -82667 -98014 -136659 -167451 -140118 -65695 -90727 -43285 75398
9487 75398 161322 175717 105197 168069 238436 115911 -11491 -57921 -18502 -20674 -13707 -85219
9475 -85219 -11244 130995 129359 52256 40963 58721 66515 113602 119041 31767 374 5021
$$ packed form
9556i9751J09345j9061l1793M784Q7233J42190J15914O750j20171j19901r9698
9545b4159j24708J00582J46752R1309q9816k0155O2076j8742j24618j02997n3523
9534a57999J88792N3301n8154O7991K4280N2918N6687J8779j2309k6815k6235
9523A81236m1399j879j747L5548p2132q071m6331O2397J17677m1579r7330r0618
9511d228j7810l2233L822P1842P0148p7931j11871p0610M9642L3211J4505n2770
9499a24283l9731K0370K3529L7448j5347l8645l0792K7333P4423k5032M7442J18683
9487G5398Q5924J4395p0520O2872P0367j22525j27402m6430L9419k172O967p1512
9475h5219P3975J42239j636p7103j1293J7758P794M7087N439q7274l1393M647
$$ plain form
9463 5021 101625 85927 -31774 -93663 -71615 -50917 64059 74592 62177 130126 154166 167036
9451 167036 204648 128854 25234 8226 73536 102296 11679 -7561 9023 -32859 -4670
9440 -4670 -33161 -16002 42729 -32835 -26418 66765 24721 -60771 -78697 -65005 -25998 -71319
9428 -71319 -17051 -28613 -65344 -24672 25874 -45576 -9335 138287 248586 213869 156721
9417 156721 156187 136846 111035 126991 88089 140856 133365 122726 145564 45398 -11392 -37122
9405 -37122 -94776 -37328 -18935 53306 129443 113585 64159 12412 -19138 -7295 9944 27414
9393 27414 128218 141045 33473 77520 94362 28531 -3528 -2725 18247 -49090 -130167 -102729
9381 -102729 -92620 -172375 -118000 -135253 -143175 -144207 -139680 -7657 92731 34637 92207 165658
$$ packed form
9463E021R6604j5698j17701o1889K2048K0698J14976J0533j2415O7949K4040J2870
9451A67036L7612p5794j03620j7008O5310K8760r0617j9240J6584m1882K8189
9440d670k8491J7159N8731p5564O417R3183m2044q5492j7926J3692L9007m5321
9428g1319N4268j1562l6731M0672N0546p1450L6241J47622J10299l4717n7148
9417A56721n34j9341k5811J5956l8902N2767p491j0639K2838j00166n6790k5730
9405c7122n7654N7448J8393P2241P6137j5858m9426n1747l1550J1843J7239J7470
9393B7414J00804J2827j07572M4047J6842o5831l2059Q03K0972o7337q1077K7438
9381a02729J0109p9755N4375j7253p922j032M527J32023J00388n8094N7570P3451
$$ plain form
9369 165658 91715 17893 15655 -33989 -65441 -32439 21271 33577 53491 158384 231952 184957
9357 184957 154759 209268 154681 92163 171386 213479 195375 256020 287975 289166 142087 114804
9345 114804 92797 40103 10139 -37180 -80896 -38270 -69848 -63156 1503 68376 117106 68369
9333 68369 89133 190979 212739 189942 222543 204590 122714 85780 54512 11155 -81210 -4930
9321 -4930 48238 111261 114842 159774 134095 82472 118976 126908 57940 104839 84867 992
9309 992 14322 56 733 1390 -3422 70085 77074 3196 59142 50417 75616 22587 18376 -28421
9295 -28421 14024 97900 130222 32020 11687 25163 -32823 -61008 2320 53638 107861 196683
9283 196683 169782 58942 -102996 -138130 -90988 -130687 -62932 90970 170108 236870 185563
$$ packed form
9369A65658p3943p3822k238m9644l1452L3002N3710J2306J9914J04893P3568m6995
9357A84957l0198N4509n4587o2518P9223M2093j8104O0645L1955J191j47079k7283
9345A14804k2007n2694k9964m7319m3716M2626l1578O692O4659O6873M8730m8737
9333F8369K0764J01846K1760k2797L2601j7953q1876l6934l1268m3357r2365P6280
9321d930N3168O3023L581M4932k5679n1623L6504P932o8968M6899j9972q3875
9309I92J3330j4266O77O57m812P3507O989p3878N5946q725K5199n3029m211m6797
9295b8421M2445Q3876L2322r8202k0333J3476n7986k8185O3328N1318N4223Q8822
9283A96683k6901j10840j61938l5134M7142l9699O7755J53902P9138O6762n1307
$$ plain form
9272 185563 102382 127895 16177 10306 7099 -28186 -57425 -58497 33454 13986 -29662 4411
9260 4411 89424 82767 -27973 -101906 -73224 -86821 -75939 -24756 -220 -6112 64706 8407
9248 8407 -67813 -55876 30778 -19516 58995 74163 46632 81940 99514 39388 -47336 -104538
9236 -104538 -93867 -10773 38865 27375 11219 15424 48813 -48961 -196870 -175808 -64811
9225 -64811 38012 86492 116508 88466 -20409 42007 67188 52902 -24090 -79484 -93183
9214 -93183 -40782 -26736 -82627 -79222 -11875 -9432 26228 -37744 -162428 -126033 -55495 -18008
9202 -18008 73654 116282 80344 31357 123288 153855 66501 -22897 -54584 -143529 -116836 1430
9190 1430 59024 -11013 -5720 16388 26784 75145 68299 65824 109440 195259 146215 84771 -21094
$$ packed form
9272A85563q3181K5513j11718n871l207l5285k9239j072R1951j9468m3648L4073
9260D411Q5013o657j10740p3933K8682j3597J0882N1183K4536n892P0818n6299
9248H407p6220J1937Q6654n0294P8511J5168k7531L5308J7574o0126q6724n7202
9236a04538J0671Q3094M9638j1490j6156M205L3389r7774j47909K1062J10997
9225f4811J02823M8480L0016k8042j08875O2416K5181j4286p6992n5394j3699
9214i3183N2401J4046n5891L405O7347K443L5660o3972j24684L6395P0538L7487
9202a8008R1662M2628l5938m8987R1931L0567q7354q9398l1687q8945K6693J18266
9190A430N7594p0037N293K2108J0396M8361o846k475M3616Q5819m9044o1444j05865
$$ plain form
9177 -21094 -66204 -108340 -43469 18832 -15334 -44688 -11643 -30372 -55268 -56684 -53595 -59683
9165 -59683 -8923 7318 10565 61015 122244 98304 115161 36435 -12335 74769 133842 159194
9153 159194 112523 15853 -49872 -53656 68523 219780 232278 86081 23753 84904 135758
9142 135758 24363 30879 42474 60427 93826 -37303 -148007 -110429 -17796 29532 61857
9131 61857 65147 -71471 -42143 69290 171578 171830 94503 47904 6866 -14727 -22238 -157
9119 -157 -70775 -79689 23712 95381 63081 14054 16414 -60495 -67624 -47994 6236 100247 40204
9106 40204 26368 33139 78623 12012 -4511 23409 154180 271723 213568 126324 179546 215037
9094 215037 91490 89806 97049 74581 -7394 18847 75936 -18462 -56354 -63048 -289 -49002
$$ packed form
9177b1094m5110m2136O4871O2301l4166k9354L3045j8729k4896j416L089o088
9165e9683N0760J6241L247N0450O1229k3940J6857p8726m8770Q7104N9073K5352
9153A59194m6671r6670o5725l784J22179J51257J2498j46197o2328O1151N0854
9142A35758j11395O516J1595J7953L3399j31129j10704L7578R2633M7328L2325
9131F1857L290j36618K9328J11433J02288K52p7327m6599m1038k1593p511K2081
9119a57p0618q914J03401P1669l2300m9027K360p6909p129J9630N4230R4011o0043
9106D0204j3836O771M5484o6611j6523K7920J30771J17543n8155q7244N3222L5491
9094B15037j23547j684P243k2468q1975K6241N7089r4398l7892o694O2759m8713
$$ plain form
9082 -49002 -115867 -156849 -123002 -39065 43583 16809 27486 51020 53435 44894 33633 15364
9070 15364 38084 65728 56007 65292 42192 60936 83857 74838 145807 172863 214840 199297
9058 199297 115273 17399 -6620 -52287 62162 46077 -14241 -31448 81681 140039 156337
9047 156337 71524 -4472 -73125 -49443 -9872 49797 136018 196879 217020 90937 44566
9036 44566 -11203 7342 53870 117190 86769 57764 87486 20400 -39012 -59254 -70312 -144101
9024 -144101 -126850 -13955 5583 29831 -22549 -84918 -72577 -36186 -2879 79768 60912
9013 60912 81128 83421 -58049 -88084 -77047 -51005 -53667 -15656 63946 84896 29436 -2988
9001 -2988 20950 96802 93082 8598 13423 -44340 -73497 -82111 36497 47967 26875 60593
$$ packed form
9082d9002o6865m0982L3847Q3937Q2648k6774J0677K3534K415q541j1261j8269
9070A5364K2720K7644r721R285k3100J8744K2921r019P0969K7056M1977j5543
9058A99297q4024r7874k4019m5667J14449j6085o0318j7207J13129N8358J6298
9047A56337q4813p5996o8653K3682L9571N9669Q6221O0861K0141j26083m6371
9036D4566n5769J8545M6528O3320l0421k9005K9722o7086n9412k0242j1058p3789
9024a44101J7251J12895J9538K4248n2380o2369J2341L6391L3307Q2647j8856
9013F0912K0216K293j41470l0035J1037K6042k662L8011P9602K0950n5460l2424
9001b988K3938P5852l720q4484M825n7763k9157q614J18608J1470k1092L3718
$$ plain form
8989 60593 89244 36044 49631 50049 -28935 -115791 -140712 -107055 -39978 26916 -28455 -83481
8977 -83481 -107897 -115824 -69254 -23771 51296 95283 44918 -74005 -128131 -110415 -92912 -29311
8965 -29311 -19958 -37009 -46851 -93002 -19196 29461 -44294 36977 68732 63410 47695 -35899
8953 -35899 -121087 -84189 -14923 55313 -1183 24241 44687 27299 127339 80765 -18875 -9867
8941 -9867 91160 111020 -2123 -31718 55571 54714 61467 71937 44342 46883 78944 52782
8929 52782 65375 112913 58512 -15702 -16163 -70295 -77642 -122547 -121227 -167292 -219735 -160409 -87144
8916 -87144 -38184 -8161 13119 842 -23969 4486 67552 96832 -11655 -142252 -192693
8905 -192693 -173243 -108325 -122695 -23019 12166 48882 80982 -6220 -151777 -160097 -43945
$$ packed form
8989F0593K8651n3200J3587M18p8984q6856k4921L3657O7077O6894n5371n5026
8977h3481k4416p927M6570M5483P5067M3987n0365j18923n4126J7716J7503O3601
8965b9311R353j7051r842m6151P3806M8657p3755Q1271L1755n322j5715q3594
8953c5899q5188L6898O9266P0236n6496K5424K0446j7388J00040m6574r9640R008
8941i867J01027J9860j13143k9595Q7289q57O753J0470k7595K541L2061k6162
8929E2782J2593M7538n4401p4214m61n4132p347m4905J320m6065n2443N9326P3265
8916h7144M8960L0023K1280j2277k4811K8455O3066K9280j08487j30597n0441
8905a92693J9450O4918j4370R9676L5185L6716L2100q7202j45557q320J16152
$$ plain form
8894 -43945 18945 -92803 -80296 -16130 -52677 -42020 -44048 -63788 -39195 -23354 -69219 -129130
8882 -129130 -120600 -126101 -44391 58876 -14318 -89606 -131413 -153574 -118219 -48715 -104577 -144844
8870 -144844 -82515 -12397 78521 50361 -40498 6807 49567 32836 -55917 -135489 -226274 -101422
8858 -101422 -145833 -91630 -66759 -91591 -13670 -4858 -5289 57194 57882 -2092 32762 56656 28000
8845 28000 -141600 -166556 -60922 154250 178503 84449 -19786 -9710 25429 30298 11371
8834 11371 -25528 77190 148007 98384 79171 74346 120293 44707 11945 -16813 68257 -9501
8822 -9501 -74627 -17737 28816 -58711 21361 46625 37166 11246 -6052 -66372 -88585 -68669
8810 -68669 -48841 -45918 48152 95208 40660 8503 10776 61943 -20966 -34249 -56703 96454
$$ packed form
8894d3945O2890j11748J2507O4166l6547J0657k028j9740K4593J5841m5865n9911
8882a29130Q530n501Q1710J03267p3194p5288m1807k2161L5355O9504n5862m0267
8870a44844O2329P0118R0918k8160r0859M7305M2760j6731q8753p9572r0785J24852
8858a01422m4411N4203K4871k4832P7921Q812m31O2483O88n9974L4854K3894k8656
8845B8000j69600k4956J05634K15172K4253r4054j04235J0076L5139M869j8927
8834A1371l6899J02718P0817m9623j9213m825M5947p5586l2762k8758Q5070p7758
8822i501o5126N6890M6553q7527Q0072K5264r459k5920j7298o0320k2213J9916
8810f8669J9828K923R4070M7056n4548l2157K273N1167q2909j3283k2454J53157
$$ plain form
8798 96454 100319 -20002 -25756 -133 -52876 -35292 15037 48040 93695 45179 -43713 10132
8786 10132 99035 100084 6269 -11247 -29121 19196 67850 -6981 -160265 -178073 -79581 -32966
8774 -32966 -106527 -141766 -150827 -149304 -202258 -62791 80872 -51341 -57632 91252 149387 190433
8762 190433 16196 -22983 19596 18180 34450 -51541 -108986 5267 56135 26073 50220
8751 50220 56297 93966 20454 -3311 26514 49935 -5111 -68449 -109748 -108374 -97198 -8825
8739 -8825 -6723 -95094 -74909 36926 -8245 -47678 -130454 -30355 20866 -3209 -18118 -37613
8727 -37613 -128915 -167220 -105264 3712 -14017 -2274 -14197 -4510 -69949 -104390 -16833 -4124
8715 -4124 -8565 20003 7459 -58504 -64384 -44003 36659 87478 75486 55983 52319 -32458 -26117
$$ packed form
8798I6454L865j20321n754K5623n2743J7584N0329L3003M5655m8516q8892N3845
8786A0132Q8903J049r3815j7516j7874M8317M8654p4831j53284j7808R8492M6615
8774c2966p3561l5239r061J523n2954J39467J43663j32213o291J48884N8135M1046
8762A90433j74237l9179M2579j416J6270q5991n7445J14253N0868l0062K4147
8751E0220O077L7669p3512k3765K9825K3421n5046o3338m1299J374J1176Q8373
8739h825K102q8371K0185J11835m5171l9433q2776J00099N1221k4075j4909j9495
8727c7613r1302l8305O1956J08976j7729J1743j1923R687o5439l4441Q7557J2709
8715d124m441K8568j2544o5963n880K0381Q0662N0819j1992j9503l664q4777O341
$$ plain form
8702 -26117 40070 57174 4213 -45498 -17903 -3359 -5384 -32964 -44877 -27001 30471 -36577
8690 -36577 -20170 77256 63832 29285 21124 63525 61643 16791 -35924 150714 185533 145879
8678 145879 153187 91343 77401 77930 58680 84177 66816 113343 120839 120597 166434 168422 150756
8665 150756 71364 34134 29473 98434 139744 233388 249959 196033 174318 159975 85655 102017
8653 102017 161991 64078 60911 47398 -3944 16901 52830 66427 98358 178658 131611 14750
8641 14750 -33939 -120897 -66087 59484 79452 -26928 -68118 -3575 -32421 -129739 -20820
8630 -20820 161663 146255 43801 2484 -46141 14382 148633 111609 29721 59631 29390
8619 29390 -147014 -157496 19601 164746 78545 17458 31247 49862 24592 109063 80150
$$ packed form
8702b6117O6187J7104n2961m9711K7595J4544k025k7580j1913J7876N7472o7048
8690c6577J6407R7426j3424l4547q161M2401j882m4852n2715J86638L4819l9654
8678A45879P308o1844j3942N29j9250K5497j7361M6527P496k42M5837J988j7666
8665A50756p9392l7230m661O8961M1310R3644J6571n3926k1715j4343p4320J6362
8653A02017N9974r7913l167j3513n1342K0845L5929J3597L1931Q0300m7047j16861
8641A4750m8689q6958N4810J25571J9968j06380m1190O4543k8846r7318J08919
8630b0820J82483j5408j02454m1317m8625O0523J34251l7024q1888K9910l0241
8619B9390j76404j0482J77097J45145q6201o1087J3789J8615k5270Q4471k8913
$$ plain form
8608 80150 -22422 11069 -3490 -20549 -42256 -99116 -104642 -33834 30935 35817 20530 39916
8596 39916 72680 83824 46585 103376 143602 202013 208806 212310 168482 195934 163516 89321
8584 89321 45314 105387 169980 167274 174729 148930 207450 274115 348840 382880 356070 270587
8572 270587 254220 253329 143287 71258 64552 89278 37761 20007 -41767 57178 131316 156832
8560 156832 133620 159945 138426 149217 121472 94887 142842 111028 -40593 -64094 -89302
8549 -89302 -143797 -109047 -145654 -85273 9205 119737 255943 209218 152778 122027 105556
8538 105556 77003 131859 140153 205197 269286 234894 84206 32288 1343 23820 29970 102110
8526 102110 89751 24923 71452 -10187 -52253 -67119 -7258 53231 124876 175494 252102 304087
$$ packed form
8608H0150j02572L3491j4559j7059k1707n6860n526P0808O4769M882j5287J9386
8596C9916L2764J1144l7239N6791M0226N8411O793L504m3828K7452l2418p4195
8584H9321m4007O0073O4593k706P455k5799N8520O6665P4725L4040k6810q5483
8572B70587j6367q91j10042p2029o706K4726n1517j7754o1774R8945P4138K5516
8560A56832k3212K6325k1519J0791k7745k6585M7955l1814j51621k3501k5208
8549h9302n4495L4750l6607O0381R4478J10532J36206m6725n6440l0751j6471
8538A05556k8553N4856Q294O5044O4089l4392j50688n1918l0945K2477O150P2140
8526A02110j2359o4828M6529q1639m2066j4866N9861O0489P1645N0618P6608N1985
$$ plain form
8514 304087 269155 182109 61352 -17914 -7252 45464 16086 -45805 -63808 -97846 -112967
8503 -112967 -54028 -100714 -104888 12182 25871 -4563 -89914 -114505 -34167 34297 44433 80893
8491 80893 61400 45302 -20257 -51412 -68561 -112028 -168000 -136450 -171557 -225478 -218159 -90081
8479 -90081 -3545 -82146 -79754 -99311 -110923 -2621 -6449 40554 149701 161917 105532 54367
8467 54367 53522 26512 -45739 -59943 -68238 23130 28556 6687 34163 -11290 19045 -69757 -117611
8454 -117611 -89569 -94462 -65525 -591 45518 -41766 -62517 5282 58711 38847 -4219 -18046
8442 -18046 -6075 -3362 -63239 -64207 -33917 -30583 -21237 -26278 39006 44358 51544 46681 26946 113237
8428 113237 216122 108947 -10124 -53903 -96682 -121939 -123243 -40306 -27015 37894 -106982
$$ packed form
8514C04087l4932q7046j20757p9266J0662N2716k9378o1891j8003l4038j5121
8503a12967N8939m6686m174J17070J3689l0434q5351k4591Q0338O8464J0136L6460
8491H0893j9493j6098o5559l1155j7149m3467n5972L1550l5107n3921P319J28078
8479i0081Q6536p8601K392j9557j1612J08302l828M7003J09147J2216n6385n1165
8467E4367q45k7010p2251j4204q295R1368N426k1869K7476m5453L0335q8802m7854
8454a17611K8042m893K8937O4934M6109q7284k0751O7799N3429j9864m3066j3827
8442a8046J1971K713n9877r68L0290L334R346n041O5284N352P186m863j9735Q6291
8428A13237J02885j07175j19071m3779m2779k5257j304Q2937J3291O4909j44876
$$ plain form
8417 -106982 -143489 -14976 4175 1710 -106395 -120947 -108079 -92585 -89270 -52593 -62096 -58231
8405 -58231 -44725 -27667 -66710 -119073 -110395 -80500 -47294 9837 12430 49402 50036 3018 23607
8392 23607 33254 25352 37186 42901 22682 50709 81697 60310 135294 185241 117877 -5330
8380 -5330 -44679 197 8898 33948 47647 -41477 -46054 3254 -17739 -84925 -123162 -52089
8368 -52089 -29223 55910 88404 33845 -23577 -17782 -16534 -24950 30051 37740 -11969 -55528 -184368
8355 -184368 -129004 -21302 -12725 -54928 90533 215370 248002 175511 166296 140033 238054
8344 238054 192734 61216 36257 137898 228701 230210 213250 128517 -9728 -10951 -16116 60834
8332 60834 28590 -57120 -89697 -98692 -113081 -76207 -33332 -45010 -129966 -4109 56143 29786
$$ packed form
8417a06982l6507J28513J9151k465j08105j4552J2868J5494L315L6677r503L865
8405e8231J3506J7058l9043n2363Q678K9895L3206N7131K593L6972O34m7018K0589
8392B3607R647p902J1834N715k0219K8027L0988k1387P4984M9947o7364j23207
8380e330l9349M4876Q701K5050J3699q9124m577M9308k0993o7186l8237P1073
8368e2089K2866Q5133L2494n4559n7422N795J248q416N5001P689m9709m3559j28840
8355a84368N5364J07702Q577m2203J45461J24837L2632p2491r215k6263R8021
8344B38054m5320j31518k4959J01641R0803J509j6960q4733j38245j223n165P6950
8332F0834l2244q5710l2577q995j4389L6874M2875j1678q4956J25857O0252k6357
$$ plain form
8320 29786 56244 92943 107538 51733 -52286 -36037 -6793 -37490 -121460 -119745 -86893 -3073
8308 -3073 -23320 -53441 -23597 -29227 -29727 -91562 -33318 26278 129035 293004 419984 536607
8296 536607 484757 369370 224785 188612 186174 166349 178093 168718 142086 57767 68630 39500
8284 39500 25214 31997 17033 -37633 -15181 -31413 -151767 -138282 -5327 -47925 -47134 18736
8272 18736 -20880 -92231 -33197 11187 -96034 -195967 -225800 -213483 -140405 -113905 -86365 55974
8260 55974 39227 -44953 -115861 -192001 -121511 58934 185813 273811 296798 250814 170075
8249 170075 58915 -9885 3054 -11157 -66025 -11578 75463 100936 -12560 -30393 6881
8238 6881 -20559 -123178 -109404 -32121 68274 183583 101588 48121 76205 98129 72910
$$ packed form
8320B9786K6458L6699J4595n5805j04019J6249K9244l0697q3970J715L2852Q3820
8308c073k0247l0121K9844n630n00o1835N8244N9596J02757J63969J26980J16623
8296E36607n1850j15387j44585l6173k438j9825J1744r375k6632q4319J0863k9130
8284C9500j4286O783j4964n4666K2452j6232j20354J3485J32955m2598P91O5870
8272A8736l9616p1351N9034M4384j07221r9933k9833J2317P3078K6500K7540J42339
8260E5974j6747q4180p0908p6140P0490J80445J26879Q7998K2987m5984q0739
8249A70075j11160o8800J2939j4211n4868N4447Q7041K5473j13496j7833L7274
8238F881k7440j02619J3774P7283J00395J15309q1995n3467K8084K1924k5219
$$ plain form
8227 72910 29980 31734 82150 94947 131136 95584 116980 181193 91195 87472 58687 79096
8215 79096 160762 84845 -8973 -66150 -69452 -52068 14774 39305 54409 20178 -2416 44576
8203 44576 89736 37134 -12996 -70182 -119570 -147872 -128557 -167574 -192221 -235330 -287658 -218979
8191 -218979 -143783 -63153 -46138 -27437 62720 148602 138915 76893 84511 71895 -42107 -35429
8179 -35429 -41493 -102008 -185045 -80097 -67605 -115470 -192196 -110551 -83298 -24827 -25508 -66930
8167 -66930 -62727 14479 52667 17900 -73535 -122659 -44596 -62781 -74513 -57317 -30905 -79138
8155 -79138 -31744 60688 39867 -24588 -139234 -235028 -199398 13458 7766 25035 70555 43168
8143 43168 -5328 42264 71185 81917 95254 122608 109256 91804 28734 87538 92583 95253
$$ packed form
8227G2910m2930J754N0416J2797L6189l5552K1396O4213q9998l723k8785K0409
8215G9096Q1666p5917r3818n7177l302J7384O6842K4531J5104l4231k2594M6992
8203D4576M5160n2602n0130n7186m9388k8302J9315l9017k4647m3109n2328O8679
8191b18979P5196Q0630J7015J8701R0157Q5882r687o2022P618j2616j14002O678
8179c5429o064o0515q3037J04948J2492m7865p6726Q1645K7253N8471o81m1422
8167f6930M203P7206L8188l4767r1435m9124P8063j8185j1732J7196K6412m8233
8155g9138M7394R2432k0821o4455j14646r5794L5630K12856n692J7269M5520k7387
8143D3168m8496M7592K8921J0732J3337K7354j3352j7452o3070N8804N045K670
$$ plain form
8131 95253 62830 44641 -10280 -145479 -88520 62040 106043 124957 122871 235510 261642
8120 261642 182208 6706 -38442 18958 24661 -15051 -16794 -35573 24029 86332 47843 28433
8108 28433 79076 82945 903 -44876 -91901 -75504 -1417 71382 70704 -20 86314 123634
8096 123634 164014 146408 -2182 -23626 -50135 18672 54670 -52126 -73938 -51449 -48200
8085 -48200 42882 110218 95777 -41292 -58768 -123373 -161234 -188006 -178483 -208635 -249913 -193563
8073 -193563 -93680 22710 70457 44485 37262 -74593 -117064 -57544 -42924 -9997 22591
8062 22591 28187 42344 80747 69060 23759 17446 56263 88203 51656 22907 19654 33732
8050 33732 76980 43427 -23787 -41278 2688 62666 69531 126468 92028 53507 110966 127646
$$ packed form
8131I5253l2423j8189n4921j35199N6959J50560M4003J8914k086J12639K6132
8120B61642p9434j75502m5148N7400N703l9712j743j8779N9602O2303l8489j9410
8108B8433N0643L869q2042m5779m7025J6397P4087P2799o78p0724Q6334L7320
8096A23634M0380j7606j48590k1444k6509O8807L5998j06796k1812K2489L249
8085d8200R1082O7336j4441j37069j7476o4605l7861k6772R523l0152m1278N6350
8073a93563R9883J16390M7747k5972p223j11855m2471N9520J4620L2927L2588
8062B2591N596J4157L8403j1687m5301o313L8817L1940l6547k8749l253J4078
8050C3732M3248l3553o7214j7491M3966N9978O865N6937l4440l8521N7459J6680
$$ plain form
8038 127646 60478 71872 47028 86092 52294 27035 71012 -922 -131922 -162062 -112646
8027 -112646 -72212 -39083 -40840 16529 92651 98837 105865 114570 122943 37177 -19557 -854 81417
8014 81417 52315 -58355 -114028 -84283 5150 68312 68109 93905 94534 50840 51159 128264 63348
8001 63348 -29549 -86216 -24934 52559 6751 -208467 -127598 -78177 -133520 -27956 50817
7990 50817 84777 120765 138116 133046 108608 124335 75578 67774 108853 49952 49692 61342 12361
7977 12361 -107698 -98312 -3305 -13237 -17761 129748 135540 94061 131122 2619 -48183 -18190
7965 -18190 -97270 -127409 -96064 -156974 -143211 -30514 108746 124517 74521 898 -151184
7954 -151184 -147956 -113840 -43230 -38139 10896 85658 127898 148676 117435 110135 146115 59010
$$ packed form
8038A27646o7168J1394k4844L9064l3798k5259M3977p1934j31000l0140M9416
8027a12646M0434L3129j757N7369P6122O186P028Q705Q373q5766n6734J8703Q2271
8014H1417k9102j10670n5673K9745Q9433O3162k03K5796O29m3694L19P7105o4916
8001F3348r2897n6667O1282P7493m5808k15218Q0869M9421n5343J05564P8773
7990E0817L3960L5988J7351n070k4438J5727m8757p804M1079n8901k60J1650m8981
7977A2361j20059R386R5007r932m524J47509N792m1479L7061j28503n0802K9993
7965a8190p9080l0139L1345o0910J3763J12697J39260J5771m9996p3623j52082
7954a51184L228L4116P0610N091M9035P4762M2240K0778l1241p300L5980q7105
$$ plain form
7942 59010 -21520 -66256 6650 46474 125602 50426 73381 193360 184210 82521 -81426
7931 -81426 -142616 -117285 -90010 -103017 -110917 14283 44283 15312 25336 19400 10826 -121438
7919 -121438 -127060 -88381 8925 10388 -22602 -40643 -102013 -110166 505 -21815 35299 78696
7907 78696 69192 42401 136910 49966 -55626 -47770 44765 6791 -53926 -62261 -21516 799
7895 799 64755 81205 12696 -47092 -3572 3926 -66441 -12148 55888 16698 54019 62186 -76169
7882 -76169 -104734 -154177 -87660 -5627 12678 56664 110042 50634 29751 27406 -36331 -14904
7870 -14904 -14320 4184 15501 51260 7669 -12606 -131330 -108945 -127003 -110748 -23050 69910
7858 69910 54457 -77647 -197851 -155172 -59597 38154 105895 71619 18331 13381 -23394 -133735
$$ packed form
7942E9010q0530m4736P2906L9824P9128p5176K2955J19979r150j01689j63947
7931h1426o1190K5331K7275j3007p900J25200L0000k8971J0024n936q574j32264
7919a21438n622L8679R7306J463l2990j8041o1370q153J10671k2320N7114M3397
7907G8696r504k6791R4509q6944j05592P856R2535l7974o0717q335M0745K2315
7895G99O3956J6450o8509n9788M3520P498p0367N4293O8036l9190L7321Q167j38355
7882g6169k8565m9443O6517Q2033J8305M3986N3378n9408k0883k345o3737K1427
7870a4904N84J8504J1317L5759m3591k0275j18724K2385j8058J6255Q7698R2960
7858F9910j5453j32104j20204M2679R5575R7751O7741l4276n3288m950l6775j10341
$$ plain form
7846 -133735 -172356 -147410 -104507 -65230 -81589 -103111 -71005 540 57323 69090 69819 167820
7834 167820 151472 150078 124749 135936 120071 18055 -33855 27256 104663 78740 1512 -76689
7822 -76689 -136606 -108884 -8079 -9867 -22655 -13361 -62596 -136038 -103734 -63408 -30902 56029
7810 56029 117524 230429 227962 104378 39046 -30516 -81039 -113005 -47285 65204 51990
7799 51990 -47447 -6497 59061 124927 16328 -41058 74861 144202 107057 86437 97310
7788 97310 74305 -8119 -8714 -12893 -50564 -22155 70714 206503 150595 123491 42146 39624
7776 39624 -80011 -173998 -94537 -57977 -36305 -14038 -62978 52096 94633 64895 113890
7765 113890 105377 177045 143273 187808 177586 179415 76003 -10402 -72370 -50968 -18283 22488
$$ packed form
7846a33735l8621K4946M2903L9277j6359k1522L2106P1545N6783J1767P29R8001
7834A67820j6348j394k5329J1187j5865j02016n1910O1111P7407k5923p7228p8201
7822g6689n9917K7722J00805j788j2788R294m9235p3442L2304M0326L2506Q6931
7810E6029O1495J12905k467j23584o5332o9562n0523l1966O5720J12489j3214
7799E1990r9437M0950O5558O5866j08599n7386J15919O9341l7145k0620J0873
7788I7310k3005q2424n95m179l7671K8409R2869J35789n5908k7104q1345k522
7776C9624j19635r3987P9461L6560K1672K2267m8940J15074M2537k9738M8995
7765A13890q513P1668l3772M4535j0222J829j03412q6405o1968K1402L2685M0771
$$ plain form
7753 22488 10223 13328 -13346 36275 87787 28294 -33232 -117783 -160540 -192266 -189557 -134170
7741 -134170 -12430 16363 59846 -38760 -39938 -50770 -72147 -101340 -97040 -142 130266 143132
7729 143132 159871 99893 76337 34011 -57319 -124683 -239980 -265023 -277659 -291221 -290256 -184167
7717 -184167 -81162 -62780 -141197 -168816 -118144 -95152 -99522 -122840 -98568 -53752 -13996 84644
7705 84644 -21818 -151396 -44773 28220 5502 -6666 -30213 4081 48570 102217 153396
7694 153396 34013 -44656 -57743 -137880 -202456 -200877 -72421 -24924 -13733 -12368 129735
7683 129735 137964 125048 52425 -105141 -167251 -95736 11318 -1256 -9547 27941 12810 49360
7671 49360 128076 86632 59753 28457 105287 180475 108164 -88164 -201943 -253669 -217454
$$ packed form
7753B2488j2265L105k6674M9621N1512n9493o1526q4551m2757l1726K709N5387
7741a34170J21740K8793M3483r8606j178j0832k1377k9193M300R6898J30408J2866
7729A43132J6739n9978k3556m2326r1330o7364j15297k5043j2636j3562R65J06089
7717a84167J03005J8382p8417k7619N0672K2992m370k3318K4272M4816L9756R8640
7705H4644j06462j29578J06623P2993k2718j2168k3547L4294M4489N3647N1179
7694A53396j19383p8669j3087q0137o4576J579J28456M7497J1191J365J42103
7683A29735Q229j2916p2623j57566o2110P1515J07054j2574q291L7488j5131L6550
7671D9360P8716m1444k6879l1296P6830P5188p2311j96328j13779n1726L6215
$$ plain form
7660 -217454 -99938 -41389 7690 9191 -74339 -61772 14027 70398 50783 -9001 -57650 -127969
7648 -127969 -137247 -14685 81648 51854 32568 27315 -43556 -43827 10791 -9348 -60297 -71987
7636 -71987 -31829 -40543 22831 101287 98186 55759 -5115 1646 45142 36139 399 -61653 -108277
7623 -108277 -102501 -48639 -30410 14593 53772 107689 73711 19702 105584 46704 7261 -88119
7611 -88119 -82780 -66712 -5692 -43044 -42985 19954 -22288 -37326 -19179 -13004 -72200 -113012 -111031
7598 -111031 -82444 -10962 -51110 -153157 -166590 -69276 -29866 -90689 -152624 -81616 -13936
7587 -13936 -51585 -45213 -21302 17761 152505 150356 -34649 -80621 -118118 -175306 -130506 15299
7575 15299 30790 12644 -26876 -15260 9289 43588 3953 -111213 -94243 11324 28620
$$ packed form
7660b17454J17516N8549M9079J501q3530J2567P5799N6371j9615n9784m8649p0319
7648a27969r278J22562R6333k9794j9286n253p0871k71N4618k0139n0949j1690
7636g1987M0158q714O3374P8456l101m2427o0874O761M3496r003l5740o2052m6624
7623a08277N776N3862J8229M5003L9179N3917l3978n4009Q5882n8880l9443r5380
7611h8119N339J6068O1020l7352N9O2939m2242j5038J8147O175n9196m0812J981
7598a11031K8587P1482m0148j02047j3433R7314L9410o0823o1935P1008O7680
7587a3936l7649O372K3911L9063J34744k149j85005m5972l7497n7188M4800J45805
7575A5299J5491j8146l9520J1616K4549L4299l9635j15166J6970J05567J7296
$$ plain form
7564 28620 -90714 -147279 -150935 23467 69088 38376 -49948 -10005 91810 156549 156302 137469
7552 137469 86244 11982 -77038 -98557 -105319 -169697 -142415 -98621 -103718 -67689 -42045 -69077
$$ packed form
7564B8620j19334n6565l656J74402M5621l0712q8324L9943J01815O4739k47j8833
7552A37469n1225p4262q9020k1519o762o4378K7282M3794n097L6029K5644k7032
$$ [...]
##END NTUPLES=NMR SPECTRUM
##END=
