##TITLE=Analysis number 311052
Compound Code cc 40909
Book Reference 413/162
Project Code adrs
Chemist Name stevem
##JCAMPDX= 6.0         $$ Bruker NMR JCAMP-DX V2.0
##DATA TYPE= NMR SPECTRUM
##DATA CLASS= NTUPLES
##ORIGIN= Bruker BioSpin GmbH
##OWNER= NMR
$$ XWIN-NMR		Version 3.5
$$ Thu Jun 30 09:44:29 2005 GMT Daylight Time (UT+1h)  MAYBRIDGE\NMR@NMR_250MHZ
##.OBSERVE FREQUENCY= 250.131544655141
##.OBSERVE NUCLEUS= ^1H
##.ACQUISITION MODE= SIMULTANEOUS (DQD)
##.ACQUISITION SCHEME= undefined
##.AVERAGES= 16
##.DIGITISER RES= 18
##SPECTROMETER/DATA SYSTEM= dpx250
##.PULSE SEQUENCE= zg30
##.SOLVENT NAME= CDCl3
##.SHIFT REFERENCE= (INTERNAL, CDCl3, 0, 16.522)
##AUDIT TRAIL= $$ (NUMBER, WHEN, WHO, WHERE, WHAT)
$$ ##TITLE= Audit trail, XWIN-NMR		Version 3.5
$$ ##JCAMPDX= 5.01
$$ ##ORIGIN= Bruker BioSpin GmbH
$$ ##OWNER= NMR
$$ C:\u/data/dgb/nmr/ADRS/5050/pdata/1/auditp.txt
$$ ##AUDIT TRAIL=  $$ (NUMBER, WHEN, WHO, WHERE, WHAT)
(   1,<2005-06-30 09:43:51.89 +100>,<MAYBRIDGE\NMR>,<NMR_250MHZ>,
      <created by zg, POWCHK disabled, PULCHK disabled
       configuration hash MD5:
       62 19 C7 07 E1 42 D1 B7 37 6C 3D D0 77 39 F9 E6
       data hash MD5: 64K
       0E AB A5 97 F5 0F AF 61 35 F4 CA 2F 7A 5B 8A 8F>)
(   2,<2005-06-30 09:44:09.24 +100>,<MAYBRIDGE\NMR>,<NMR_250MHZ>,
      <Start of raw data processing
       ef LB = 0.3 FT_mod = 6 PKNL = 1 SI = 32K 
       data hash MD5: 32K
       2D DE B4 76 85 36 CB 53 F4 A1 D7 4D 47 D2 6E 6D>)
(   3,<2005-06-30 09:44:15.21 +100>,<MAYBRIDGE\NMR>,<NMR_250MHZ>,
      <apk 
       data hash MD5: 32K
       48 19 E0 8A 18 F2 23 B4 66 BE F0 5D F5 69 61 B1>)
(   4,<2005-06-30 09:44:17.02 +100>,<MAYBRIDGE\NMR>,<NMR_250MHZ>,
      <abs ABSG = 5 
       data hash MD5: 32K
       BD 96 D4 96 CA 4C 60 3E 83 1D 7F 78 6C CF AA 49>)
$$ ##END=
$$ 
$$ hash MD5
$$ 3B 9D EE 68 92 05 A1 53 A2 BC 02 FA 2D 49 A0 2F
##$RELAX= 
##$RELAX= 
##$RELAX= 
##$RELAX= 
##$RELAX= 
##$RELAX= 
##$RELAX= 
$$ Bruker specific parameters
$$ --------------------------
##$DU= <C:\u>
##$EXPNO= 5050
##$NAME= <ADRS>
##$PROCNO= 1
##$TYPE= <nmr>
##$USER= <dgb>
##$AMP= (0..31)
100 100 100 100 100 100 100 100 100 100 100 100 100 100 100 100 100 100 
100 100 100 100 100 100 100 100 100 100 100 100 100 100 
##$AQSEQ= 0
##$AQ_mod= 3
##$AUNM= <au_zg>
##$AUTOPOS= <26 >
##$BF1= 250.13
##$BF2= 250.13
##$BF3= 250.13
##$BF4= 250.13
##$BF5= 500.13
##$BF6= 500.13
##$BF7= 500.13
##$BF8= 500.13
##$BYTORDA= 1
##$CFDGTYP= 0
##$CFRGTYP= 5
##$CHEMSTR= <none>
##$CNST= (0..31)
1 1 145 1 1 1 1 1 1 1 1 1 1 1 1 1 1 1 1 1 1 1 1 1 1 1 1 1 1 1 1 1 
##$CPDPRG= <>
##$CPDPRG1= <>
##$CPDPRG2= <>
##$CPDPRG3= <>
##$CPDPRG4= <mlev>
##$CPDPRG5= <mlev>
##$CPDPRG6= <mlev>
##$CPDPRG7= <mlev>
##$CPDPRG8= <mlev>
##$CPDPRGB= <>
##$CPDPRGT= <>
##$D= (0..31)
0 1 0 0 0 0 0 0 0 0.06 0 0 0 0 0 0 0.0002 0 0 0 0 0 0 0 0 0 0 0 0 0 0 
0 
##$DATE= 1120121029
##$DBL= (0..7)
120 120 120 120 120 120 120 120 
##$DBP= (0..7)
150 150 150 150 150 150 150 150 
##$DBP07= 0
##$DBPNAM0= <>
##$DBPNAM1= <>
$$ [...]
##$SUBNAM7= <"">
##$SUBNAM8= <"">
##$SUBNAM9= <"">
##$SW= 20.6930455092707
##$SWIBOX= (0..15)
0 0 3 0 0 0 0 0 0 0 0 0 0 0 0 0 
##$SW_h= 5175.983436853
##$TD= 65536
##$TD0= 1
##$TE= 295.16
##$TE2= 300
##$TE3= 300
##$TEG= 300
##$TL= (0..7)
0 120 120 120 120 120 120 120 
##$TP= (0..7)
150 150 150 150 150 150 150 150 
##$TP07= 0
##$TPNAME0= <>
##$TPNAME1= <>
##$TPNAME2= <>
##$TPNAME3= <>
##$TPNAME4= <>
##$TPNAME5= <>
##$TPNAME6= <>
##$TPNAME7= <>
##$TPOAL= (0..7)
0.5 0.5 0.5 0.5 0.5 0.5 0.5 0.5 
##$TPOFFS= (0..7)
0 0 0 0 0 0 0 0 
##$TUNHIN= 0
##$TUNHOUT= 0
##$TUNXOUT= 0
##$USERA1= <user>
##$USERA2= <user>
##$USERA3= <user>
##$USERA4= <user>
##$USERA5= <user>
##$V9= 5
##$VALIST= <valist>
##$VCLIST= <CCCCCCCCCCCCCCC>
##$VD= 0
##$VDLIST= <DDDDDDDDDDDDDDD>
##$VPLIST= <PPPPPPPPPPPPPPP>
##$VTLIST= <TTTTTTTTTTTTTTT>
##$WBST= 1024
##$WBSW= 4
##$XGAIN= (0..3)
0 0 0 0 
##$XL= 0
##$YL= 0
##$YMAX_a= 313203
##$YMIN_a= -363147
##$ZGOPTNS= <>
##$ZL1= 120
##$ZL2= 120
##$ZL3= 120
##$ZL4= 120
##$ABSF1= 16.522
##$ABSF2= -4.171173
##$ABSG= 5
##$ABSL= 3
##$ALPHA= 0
##$AQORDER= 0
##$ASSFAC= 0
##$ASSFACI= 0
##$ASSFACX= 0
##$ASSWID= 0
##$AUNMP= <proc_1d>
##$AZFE= 0.1
##$AZFW= 0.1
##$BCFW= 0
##$BC_mod= 0
##$BYTORDP= 0
##$COROFFS= 0
##$CY= 12.5
##$DATMOD= 1
##$DC= 0
##$DFILT= <>
##$DTYPP= 0
##$F1P= 14.0000005364418
##$F2P= -0.99999901652339
##$FCOR= 0.5
##$FTSIZE= 32768
##$FT_mod= 6
##$GAMMA= 0
##$GB= 0
##$INTBC= 1
##$INTSCL= 1
##$ISEN= 128
##$LB= 0.3
##$LEV0= 0
##$LPBIN= 0
##$MAXI= 10000
##$MC2= 0
##$MEAN= 0
##$ME_mod= 0
##$MI= 0
##$NCOEF= 0
##$NC_proc= -4
##$NLEV= 6
##$NOISF1= 0
##$NOISF2= 0
##$NSP= 0
##$NTH_PI= 0
##$NZP= 0
##$OFFSET= 16.522
##$PC= 1
##$PHC0= -81.46337
##$PHC1= 20.88605
##$PH_mod= 1
##$PKNL= yes
##$PPARMOD= 0
##$PSCAL= 4
##$PSIGN= 0
##$REVERSE= no
##$SF= 250.13
##$SI= 32768
##$SIGF1= 0
##$SIGF2= 0
##$SINO= 400
##$SIOLD= 32768
##$SREGLST= <1H.CDCl3>
##$SSB= 0
##$STSI= 32768
##$STSR= 0
##$SW_p= 5175.98343685301
##$SYMM= 0
##$S_DEV= 0
##$TDeff= 65536
##$TDoff= 0
##$TI= <Analysis number 999999
Compound Code 99
Book Reference 9
Project Code 9>
##$TILT= no
##$TM1= 0
##$TM2= 0
##$TOPLEV= 0
##$USERP1= <user>
##$USERP2= <user>
##$USERP3= <user>
##$USERP4= <user>
##$USERP5= <user>
##$WDW= 1
##$XDIM= 32768
##$YMAX_p= 520667438
##$YMIN_p= -305233
$$ End of Bruker specific parameters
$$ ---------------------------------
##NTUPLES= NMR SPECTRUM
##VAR_NAME=  FREQUENCY,     SPECTRUM/REAL,   SPECTRUM/IMAG
##SYMBOL=    X,             R,               I
##VAR_TYPE=  INDEPENDENT,   DEPENDENT,       DEPENDENT
##VAR_FORM=  AFFN,          ASDF,            ASDF
##VAR_DIM=   32768,         32768,           32768
##UNITS=     HZ,            ARBITRARY UNITS, ARBITRARY UNITS
##FACTOR=    0.157963299565203, 1,           1
##FIRST=     4132.6476996994, 0,             0
##LAST=      -1043.33573715361, 0,           0
##MIN=       -1043.33573715361, -305233,     0
##MAX=       4132.6476996994, 520667438,     0
$$ Real data points
##PAGE= N=1
##DATA TABLE= (X++(R..R)), XYDATA
$$ [...]
22220 -70616 9754 87827 169778 163244 86797 -19254 -112157 -98996 -66132 -93465 -91269 -11327
22208 -11327 80123 56944 21181 55824 105493 4470 -66773 -16581 14757 -3012 40061
22197 40061 48621 8565 -23312 -80303 -47947 -17959 10464 46095 83508 101659 52861 4148
22185 4148 50697 4213 -25316 -7433 69691 99079 76552 11987 -14840 1081 37705 105239
22173 105239 42286 -895 18928 -34391 -109288 -147096 -130328 -133700 -60225 -76512 -35065 40912
22161 40912 -33908 -92526 19361 78418 51025 27661 40849 -27624 -80402 -89711 -22405 57409
22149 57409 -13957 -97120 -142181 -97486 -118199 -97964 -81181 -1064 92592 81346 130148 132844
22137 132844 76113 44045 27626 -72764 -1394 55639 141326 82380 78908 67552 34366
22126 34366 3951 -24949 -42445 -50297 -40657 -56135 -36384 60700 165736 103145 41285 95865
22114 95865 16677 -21658 75869 41673 -36312 -88140 -21235 9810 32367 57378 158784
22103 158784 118175 75960 111762 116630 125690 27527 -24975 -44341 -91180 -59460 -57635 -14777
22091 -14777 11294 26817 -3332 57481 32709 -3214 -23038 2930 -45186 -23170 27059 8477
22079 8477 -20889 -125355 -66115 40905 15471 -60742 -74828 23681 -20518 4313 127417
22068 127417 115738 -234 22871 -11536 -90678 -91478 -65699 -10697 -27716 25643 58083 -38865
22056 -38865 -46583 -13057 -7723 59410 89729 54783 -26391 -49129 48895 73291 42339 16936
22044 16936 79710 103928 51609 16013 -62340 -49153 -44280 -72360 9338 92062 45990 85832
22032 85832 34526 -43216 -33558 51479 155924 205003 101970 33036 -60255 -100471 -90370
22021 -90370 -109301 -83063 -49429 -12026 -13420 73153 44470 6772 84915 100248 -9623 -74759
22009 -74759 -106302 -81754 -9366 -54645 -72823 -82777 -92613 -63302 -24428 3056 93465 81960
21997 81960 25235 16110 -18734 -113363 -93309 -10954 31023 38560 10265 -25530 29058 108691
21985 108691 100116 14529 -30830 -65353 -88126 -141957 -80921 -57825 -83740 -37364 -26267 -37580
21973 -37580 38740 34935 -41826 -66198 -49107 8687 36306 16515 -16098 -16826 -424 72464
21961 72464 47716 -28009 31644 78603 55226 25419 -78595 -104691 -87263 -81900 -75344 -81321
21949 -81321 -1180 11650 -19108 1699 16461 10955 29214 9367 7867 49253 98186 27944
21937 27944 -11479 -20073 -18937 67778 170945 170227 82161 96365 17069 -50225 -44453 -43416 -13259
21924 -13259 68697 23204 -90742 -91992 -58383 -131138 -113320 -114128 -104195 -100606 -87109 8111
21912 8111 52533 -13017 -19913 -54309 -75588 -13295 -36017 -107799 -120917 -138645 -68367 -112101
21900 -112101 -145506 -81181 -13723 -44008 -102060 -76784 -42371 7650 30935 33708 -4802 28084
21888 28084 -8334 -13020 244 -55693 -59385 -90545 -32874 -16605 -10139 10138 30219 32853
21876 32853 -28095 -8217 74857 137932 132526 38781 73153 91290 9095 -18741 -95065 -70953
21864 -70953 -124208 -126009 -45900 -9351 -48874 -85281 -74473 -49238 -66640 -126263 -164099 -99765
21852 -99765 -125681 -110622 -31005 -50462 -79422 -84715 -85242 -82824 -58688 -12419 -2643 -68698 -110095
21839 -110095 -115579 -83930 -20761 -65196 -33312 -26392 -23934 -60115 -125299 -94600 -51151 -11544
21827 -11544 -27590 -91509 -77942 -52313 -2648 -47263 -121665 -142781 -51561 43684 38109 -3301
21815 -3301 -55172 -157928 -180878 -79808 35505 60027 60287 58320 59864 -30437 -132228 -72798
21803 -72798 -59252 -9695 -26065 -84246 -36798 75066 92520 107438 83516 30192 35285 67510
21791 67510 102982 76994 -19659 -49059 -19621 -18104 65796 78345 -2578 -1000 -24251 -40785
21779 -40785 -33142 -86387 -16889 61230 18196 -9348 3751 9035 27506 31366 -10103 -35922
21767 -35922 -4442 18664 55517 40673 -29681 -11754 18193 -62466 -126813 -110945 7387
21756 7387 47477 113404 63335 91300 54847 -2958 -80424 -59787 -17152 8382 -10874 -51749
21744 -51749 -81976 -88341 -46368 47573 46958 -14999 -33855 -18132 17352 31920 16945 -12340
21732 -12340 70992 -15098 -82074 -133138 -96914 -56953 -56592 -21631 -2380 -11383 -79096 -85568
21720 -85568 -96210 -6479 14196 -59113 -27398 22608 37508 -27558 -70112 -54118 -52959 -74969
21708 -74969 -60284 -40941 -96053 -140639 -146909 -104731 -82049 -58274 -77655 -100429 -87967 -11615
21696 -11615 27743 44678 138255 89139 106660 161062 105065 29295 72213 127530 87295 841
21684 841 -30829 -84923 -6641 -56061 -123999 -124125 -70831 -471 73446 52462 88279 70596
21672 70596 20352 33011 39148 7696 -100607 -79132 -23706 -37033 -9720 8421 22068 27215
21660 27215 -91704 -115619 -154131 -151795 -94739 -25904 -43452 -42423 7954 98686 161564 119506
21648 119506 39053 6345 -40506 -66325 -137751 -130106 -51497 4490 20432 -12330 -82274 -59261
21636 -59261 -34692 -36619 -54138 -51259 -1590 -16496 -104542 -89155 1572 57785 79737 -9391
21624 -9391 -49689 -158968 -157918 -93910 -76681 -98893 -98392 -81779 -113977 -106291 -40662 -4581
21612 -4581 73411 43047 3833 -96902 -139290 -112101 -43044 -12709 -33606 -140220 -95852
21601 -95852 -31809 -12839 36227 -9253 -47228 -23278 -36103 -28675 25653 69740 105980 44369
21589 44369 -43905 -133243 -151805 -123194 -29505 83763 87790 46376 -1228 34797 93989 140609
21577 140609 91088 35529 -37579 -19945 27870 7587 8446 62155 49278 -8484 -13115 42885
21565 42885 29727 -5595 26626 39636 32926 63520 102058 70131 57022 57193 131176 81307
21553 81307 78290 15278 -21994 -35551 -39032 -91291 -117744 -103999 -49096 4361 -4977 10665
21541 10665 76949 109981 43118 7440 25519 47277 97436 94206 42799 56221 -5009 21303
21529 21303 42498 -43648 -68586 -55070 -31928 35832 -12118 -36597 -46369 -61471 -97452 -89433
21517 -89433 -124593 -152621 -102554 -126577 -162965 -149063 -146309 -146557 -127650 -79572 -87073 -55002
21505 -55002 -31215 -23153 -37597 -69455 -80509 -43107 -110146 -134063 -103749 -42397 -62869 -20836
21493 -20836 -23973 -2537 15499 -25676 -22779 46896 71241 76962 -62503 -116870 -55053 -14342
21481 -14342 -23831 4979 45010 103388 106170 47761 34881 104406 174063 161804 141873 39032
21469 39032 -97711 -37753 -46967 5073 81136 117663 71119 -30432 -21421 -3780 75393 41649
21457 41649 -29263 -8696 -24041 -9564 40654 -12835 -50822 -112299 -53409 40675 43485 -10343
21445 -10343 -45970 -23470 24987 72890 99219 56021 19098 -13959 71037 73966 59344 -38311
21433 -38311 -145572 -185768 -163485 -86353 -35966 -90567 -158301 -120417 -74829 21792 27450 -14369
21421 -14369 -96599 -79130 8681 24427 14105 -97393 -100717 -61008 -8119 -55859 -41429 -10470
21409 -10470 -7293 51041 116967 51753 -42724 -38454 16627 56415 51931 -46338 -37148 606
21397 606 51503 1263 33653 46153 13971 -51762 -21142 -55609 -15317 -64161 -56583 -56336 -96248
21384 -96248 -40228 14183 -30264 -94464 -39113 6076 16866 54134 184369 147911 154172 200326
21372 200326 167875 193438 148965 103655 95454 126131 80136 28682 -16939 -44261 -10062 50546
21360 50546 123166 124912 74311 63860 -8287 -1415 -53128 -134577 -138002 -151954 -60676 -38059
21348 -38059 -36555 -61933 -54978 1810 92887 80974 75281 77722 97704 45398 -11163 -26734
21336 -26734 37161 50094 -13474 -7333 17971 20947 -78018 -58684 -48388 -62819 -90713 -102430
21324 -102430 -88292 -33805 86347 124381 129632 60077 -48070 -74414 -7394 68079 109090
21313 109090 47177 8215 -25436 -37509 -42952 -89690 -127952 -97637 -98522 -43982 24641 33118
21301 33118 106569 110596 24047 -40613 -47680 -19592 -23941 24637 -63557 -181681 -192041 -145561
21289 -145561 -77030 -28779 -82988 -183937 -174927 -129748 -135502 -44176 75712 180828 146915
21278 146915 50434 32577 949 -22185 -43957 -49314 31375 62202 14719 -22760 24262 75379
21266 75379 115416 104508 113210 84685 62767 23804 -3185 48165 41946 -2897 81325 166418
21254 166418 154134 131490 34365 -26521 -46917 4776 48995 19498 -15439 30296 31982 14701
21242 14701 -16295 7478 56606 -12298 -75948 30636 79638 42443 49297 25406 -63299 -65972
21230 -65972 -43334 -5485 -101492 -67486 -67639 -118082 -130110 -76881 -58108 -26436 -56841 -75646
21218 -75646 -45432 -11976 11039 77053 -21175 -123354 -145474 -19168 -40791 -149777 -114928
21207 -114928 -60287 -73075 -53025 -115745 -184548 -131778 -1603 19099 -63981 -41382 28356
21196 28356 91328 55632 5939 -54172 -63145 -38993 -8356 -8543 -14428 -52052 14472 -55238
21184 -55238 -65379 -15860 43107 -46799 -68239 -36463 -23321 -21062 2816 38128 -75045 -92293
21172 -92293 -33549 32143 132639 180661 122704 13261 2191 -2955 65126 124918 37637
21161 37637 -88580 -99517 -2309 8322 5432 -24041 -88143 -127922 -92842 -88573 27779 118044
21149 118044 36308 104643 62599 74855 174529 185845 132459 94174 64137 93968 62417
21138 62417 23427 -38622 -84924 -29435 -7967 38857 31241 -57940 -140125 -96230 -36070 -51685
21126 -51685 -11463 44541 25986 -17211 -35486 -31507 48176 31026 -33035 -239 33268 37972
21114 37972 78529 71851 62724 34846 116762 99872 75185 41807 9252 601 -15324 -34179
21102 -34179 -36621 41419 56396 -28668 -63382 -98444 63298 123336 15764 16576 28894 -43626
21090 -43626 -40955 -23305 88753 61528 -5691 -19107 -39221 -82740 -82173 -61839 -18316 9868
21078 9868 19457 116697 185303 107311 -12960 -79176 11736 15001 -88958 -63898 -26240 13393
21066 13393 56537 -55113 -137080 -90398 -42547 -9748 140780 235125 172176 117008 76333
21055 76333 -5556 15584 26856 29974 14314 -39201 -40043 -25206 -102252 -16818 41817 87285
21043 87285 109955 51432 8533 17377 -18967 -60432 -104920 -51472 21071 -24083 7102 -1802
21031 -1802 -82464 -111925 -15232 23153 58038 73703 -27767 14389 36818 31365 12150 112600
21019 112600 178574 133506 86866 101136 58663 -9426 -62592 -46211 -22488 -46914 -68477
21008 -68477 -29718 86904 79419 2926 -99999 -92554 -8680 -27101 -38989 -37098 -37174 10938
20996 10938 -15142 -4359 56154 75276 58788 24678 49539 33956 -51736 -55364 -54465 -115809
20984 -115809 -116889 -74326 46939 60415 14160 -84030 -146644 -97596 -26402 -19098 -38551 -52136
20972 -52136 -84521 -47667 18238 20029 22611 88878 31005 -781 26059 10464 27762 40655
20960 40655 46721 132293 10335 -37234 -80451 -99797 -35264 -39205 -201 -6797 -18437 -77869
20948 -77869 -132572 -96219 -36385 -90228 -163117 -198428 -149740 -107533 -70805 -71420 -25824 84947
20936 84947 97208 -5831 -51214 -13479 -23969 -10915 9482 23824 79446 75457 30601 -21733
20924 -21733 -71732 -67348 -54526 -52839 22827 -67604 -95244 -89326 -111155 12336 -63816 -177437
20912 -177437 -167571 -44656 -31000 32180 59021 74767 66520 98865 54027 49124 42973 107880
20900 107880 40208 20289 25436 -43775 -57245 -35149 -11169 17736 51153 65835 33287 -13520
20888 -13520 -118836 -97841 -52391 26405 147173 163741 83771 67894 15903 4524 -18776
20877 -18776 -21956 -7536 -13759 45698 118192 95872 87767 96090 5666 -91676 -112143 -109459 -143682
20864 -143682 -149006 -88725 -31619 -18880 -128514 -164870 -144790 -66635 -48473 -93297 -85848 -19966
20852 -19966 39425 47809 9804 3998 -1439 -12043 31150 -5369 -17268 -7203 -241 -36778
20840 -36778 -126198 -126960 -45547 -3295 92832 113536 101885 117967 81410 124212 60121 -17159
20828 -17159 51284 82069 14499 -33367 -28180 -44519 -31651 -10959 34005 -44955 -36424 -12331
20816 -12331 -78808 -97270 -71360 -40880 -15029 -33515 -46607 -60627 17490 39833 -3195 -45039
20804 -45039 10484 59982 49643 -40463 -113513 -99387 -102599 -67115 -6673 17961 44702 35510
20792 35510 -50160 -45529 -31547 -29362 -17242 -22841 10087 30671 135239 209770 227972 129900
20780 129900 69985 41121 46889 20063 47450 2297 -47180 -53874 52 65965 46242 23108
20768 23108 -33994 -1270 -758 -36636 4834 71512 61886 22767 9981 -12717 48273 59236
20756 59236 99414 59176 15463 74024 88602 17776 18235 52390 -5371 -40652 35062 58595
20744 58595 60794 -24449 -69022 32734 157352 217498 227332 177261 184378 127726 106735 122810
20732 122810 58158 51536 119707 91669 103478 57492 54938 46763 12548 26356 28689 36227
20720 36227 -8682 -29313 -17817 -20204 -18622 42931 54889 57881 40586 31768 -23337 -62898
20708 -62898 -84535 -69137 -34507 24018 101879 74362 46507 40388 79350 64656 21886 12228
20696 12228 21429 34480 106044 111919 121660 99907 45708 -14886 -1999 -68424 -68690 -40943 11109
20683 11109 -64344 -110045 -134791 -130205 -102646 -17596 47224 45094 64114 -24197 -60712 -63469
20671 -63469 -11867 -8627 90323 118982 16538 -56276 -17735 -15730 -100092 -30354 -2585 40014
20659 40014 32430 11345 7617 -18356 -24747 -87625 -109326 -16142 -11590 -54630 -48241 -2226 37373
20646 37373 79238 54746 -2225 57538 156514 62763 19308 13956 62133 35731 53289 78398
20634 78398 76117 46265 13806 24593 -20897 -60281 -144332 -149725 -77134 -132843 -103669 -28871
20622 -28871 -32313 -83209 9470 61682 40971 -39795 -60622 -57473 -88488 -123 15418 -40603
20610 -40603 -89576 -144775 -159045 -47178 65234 95934 104951 84251 76426 63020 -33300 -53192
20598 -53192 -78109 -15960 71764 99964 16319 -70873 -144134 -226651 -202605 -149072 -154280 -176818
20586 -176818 -138588 -51933 -64510 -47589 52325 37171 19240 -43939 -88878 -50006 -14628
20575 -14628 -44259 -10574 -9706 24294 28141 5299 -20156 -64305 -4192 48261 17873 52930
20563 52930 -2431 -15925 26221 71311 72154 -9273 -23375 15358 47779 59489 59603 63453 85869
20550 85869 57654 96649 148713 128814 105813 1540 -71350 -44319 -45783 -26218 21923 -49166
20538 -49166 -15725 3662 -43491 -31206 38613 84452 66429 51710 -2331 -17348 -45792 -59901
20526 -59901 -73014 7929 10266 -683 -46918 -36857 -54065 -107065 -101962 -64018 -27604 6870
20514 6870 80025 40820 -5801 -105335 -122583 -123804 -63869 -14317 -132 41018 6146 -44408
20502 -44408 -115827 -142484 -111424 -114551 -73401 -18700 13725 88954 42574 6336 -81759 -111533
20490 -111533 -56562 34802 35314 7437 10878 -14932 -73011 -32375 -60551 -105351 -72383 17832
20478 17832 67096 69338 96726 103287 87679 50997 20378 2893 32715 22020 58753 30414
20466 30414 50618 89077 130252 94056 135450 210554 117507 63869 65771 15663 29384 62910
20454 62910 78554 93528 44037 48135 7914 80663 100870 46279 10050 29582 49482 43870
20442 43870 61675 112630 144926 178336 128336 141775 164505 199353 164871 101334 66224 108569
20430 108569 32783 -31244 -30286 -6683 -7367 -53374 -15044 24128 61129 95221 79025 40469
20418 40469 54623 -15437 -101301 795 81907 110337 101587 10615 -58467 -33615 140960
20407 140960 128273 40752 -45773 9765 133266 120939 68324 67856 47329 42651 -46171 -96577
20395 -96577 -83457 -40480 -57678 -85548 -71824 -36278 -40471 4887 -45036 -17215 17633 -45625
20383 -45625 -51815 -80130 -91462 -15453 30011 1264 31552 28775 -7765 64145 38248 1073
20371 1073 13539 56797 10496 -15797 19646 22729 -28748 -126423 -103556 13045 87331 25273
20359 25273 -4768 607 -10100 -89704 -47222 29584 96536 97191 147888 177754 158961 60857
20347 60857 38771 82188 80167 -7249 -38468 -91752 -74482 -53484 -141710 -62680 16715 2171
20335 2171 -20493 -4001 54868 13246 50968 -19646 -20911 -17879 -51392 -19801 71911 46635
20323 46635 -71141 -82879 -90336 -43114 -10472 35163 62125 44263 21021 4791 73218 141762
20311 141762 145095 117707 102031 56892 -9919 15101 20912 8289 19835 -39918 -23137 22577
20299 22577 71651 -6019 -18560 -20281 21496 38316 -49842 -22251 -28635 -19848 -37053 72661
20287 72661 141456 19308 -29410 -79357 -143168 -99761 -22811 -17955 -48389 -66579 -71231 -142178
20275 -142178 -130409 -22101 26639 35428 -50974 -69394 45552 72691 29703 -66247 -111002
20264 -111002 -78060 -76475 -9153 -16679 -50216 24403 -1893 -16906 5441 -17685 -3477 83519
20252 83519 50543 5560 -40697 -46321 -101999 -109910 -125547 -18993 79202 148149 182154 137603
20240 137603 73957 37799 7835 56419 103747 61185 -38158 -88009 -39779 -3039 19846
20229 19846 66469 129821 84277 27874 -8283 -58211 6137 79535 62637 -29026 -125777 -117359
20217 -117359 -115030 -84604 -13720 923 4696 49268 68247 7137 -15779 24994 132486 129293
20205 129293 103673 67192 28733 41546 -16565 -120285 -182058 -123200 -76614 -99757 -72863
20194 -72863 -4530 32925 30138 10820 -39634 -66821 -99734 -17835 -10697 33834 -16691 -71185
20182 -71185 -30099 38800 64592 33822 74512 113954 125563 102308 42100 -36935 -46549 -94046
20170 -94046 -16773 110561 96051 -31485 -40562 2927 78821 81782 31358 -41508 -69181 -41822
20158 -41822 -4904 19513 20680 -8381 -8584 -66680 -116765 -151856 -80730 -14267 -16417 -16521 7276
20145 7276 -9418 44959 129461 107200 74210 110047 100478 11582 -81345 -84598 -105889 -122123
20133 -122123 -71160 -63311 -127453 -120785 -68571 -54546 -29800 -44193 -20624 -45159 -88671 31359
20121 31359 117110 91132 71977 47680 65508 65262 54900 -43348 -60034 -51284 -42885 -25743
20109 -25743 -40822 -92435 -50481 -8049 -22700 -17584 -1603 14657 -40697 -76681 -54835 -63754
20097 -63754 -88109 -136947 -120458 -218688 -185783 -95453 -98041 -87973 -86982 -106365 -96692 -142754
20085 -142754 -150599 -90035 -37247 32002 91625 49354 -3540 -23688 12725 -6041 -20549 5044
20073 5044 -970 -2086 18861 -16403 -107550 -79454 -38128 -30022 -123539 -119766 -21122 32355 34413
20060 34413 31634 -59226 -82836 -60166 -63325 -30076 57252 44046 -99734 -82753 -112792 -29526
20048 -29526 53419 123226 131495 57469 43333 56891 9419 -17782 25253 31705 3658 -13795
20036 -13795 14502 36536 -16049 20926 286 -46004 -25042 14095 -48758 -7386 28147 34320
20024 34320 -62229 -68945 -110505 -146415 -123554 -72379 -8323 -39241 -33583 16046 7155 -58475
20012 -58475 -68101 -72348 53105 151969 124169 63487 8393 -62763 -127794 -152729 -123855 -44627
20000 -44627 23951 4618 18721 -12240 -18433 23281 5753 -8389 14719 69197 123389 89793
19988 89793 98854 -5429 -24967 -53250 -94971 -113920 -116362 -171034 -168238 -156104 -36593 65943
19976 65943 27109 -24641 43612 52761 -12493 9394 64583 22825 -48171 -14915 24904 102417
19964 102417 133750 146066 139643 108687 -6720 -93909 -118033 -75163 -56845 -107967 -89392
19953 -89392 -55645 -2358 2921 -23137 68821 163067 108935 51070 61712 34932 46224 98929
19941 98929 76378 35865 6429 26956 47688 19147 36119 36053 21886 36350 55770 91289
19929 91289 110604 44327 89741 107526 88820 73125 -24506 -87564 -71689 -42465 -47040 -83209
19917 -83209 -31284 -43806 -42668 -50954 4573 91236 24294 -38543 -73781 -47125 44519 90080
19905 90080 59179 90062 9730 -42509 29755 70510 84263 77167 39091 37067 5571 -54390
19893 -54390 -20379 34725 33584 -42872 -122731 -66278 -37747 -32464 17947 -5492 -55783 13134
19881 13134 36029 -13114 -5645 6870 -13376 -22954 20166 -43196 -66600 -38985 -79374 -89242
19869 -89242 -57067 -62655 46359 49789 58678 57085 62988 57291 107931 96733 72178 105969 82384
19856 82384 29114 77258 114145 103222 60307 35479 76538 117890 143135 54681 -43851 -83124
19844 -83124 -89269 -92198 1402 31644 23620 -79083 -116587 -68071 -73101 -87917 10614 20596
19832 20596 -31949 5760 34758 -17784 -63289 -67955 -83212 -12407 13091 63065 60992 18
19820 18 -8743 100021 192923 112170 -55621 -130854 -63063 -24797 -16060 -51230 -55211 3405
19808 3405 47998 148023 132835 106645 34767 3861 6476 -18685 -100474 -120494 -99191 -78809
19796 -78809 -42238 15129 -5621 37367 77471 116121 116618 64695 1351 -50931 -66570 -56890
19784 -56890 -58352 -93322 -32953 -17380 35069 25158 34949 51920 19267 -24116 44490 57716
19772 57716 52353 49663 56379 88000 103319 94088 50761 1606 -33940 -6450 45459 62737
19760 62737 98575 221632 132673 53419 84510 98408 143252 122877 40342 34109 -26185 3351
19748 3351 68770 106524 108998 155530 159048 153788 84049 -85646 -54535 -2419 42458 3282
19736 3282 76009 146764 135777 78398 31232 22629 -68696 -35066 -9470 -9113 5862 24905
19724 24905 15233 -31124 6776 29618 -17171 -37094 -18222 -8989 27745 50354 31549 -17953
19712 -17953 18821 15500 -19856 -49307 -71903 -21120 59650 -2300 33824 23066 -5403 -37097
19700 -37097 -38963 -21580 -11930 -8489 -17694 31460 258 3021 41113 16135 -76004 -109033 -63790
19687 -63790 -43378 -19494 -74260 -32354 4270 -15551 -22082 49093 86122 24031 -32747 -94880
19675 -94880 -57947 64144 74844 27199 21645 117100 162421 146378 144813 82249 101328 64402
19663 64402 -48572 -121331 -60916 20688 371 29935 85447 25211 -30900 -17466 -24671 25480
19651 25480 48251 2125 18408 88414 105627 113364 69809 42150 65879 55319 103066 54473
19639 54473 -4144 -55448 -76326 -1344 125519 145573 1819 41696 118895 98325 53015
19628 53015 3367 30478 62944 -33215 -70642 -47955 44377 84154 15577 34322 72108 53675
19616 53675 45477 8247 39124 95119 81306 80708 19888 -108267 -85073 -41479 -63765 -70085
19604 -70085 -78641 -13900 -4415 20194 -56716 -64905 -18301 -13588 -28704 -29094 -5925 19925 -14210
19591 -14210 6546 78705 95136 104242 50152 63856 61596 35025 50146 -14346 -88473 -37094
19579 -37094 51276 25322 44669 9630 3149 -71409 -62855 22835 54147 43952 -49159 -122924
19567 -122924 -109548 -78274 -66034 -88453 -20927 -100044 -139497 -73096 37319 38960 55280
19556 55280 -19864 30304 88812 66027 -54429 -93531 -92283 -8476 -15975 -40510 -47694 -55097
19544 -55097 -42300 -80026 -82344 -65663 -39459 -76108 -67414 82639 64619 22306 4535 -12637
19532 -12637 -7038 -10723 -21349 -103486 -216959 -163682 -67700 -32512 -92746 -95892 -86366 -68843
19520 -68843 -47244 -56635 -25106 22972 108277 106075 70219 60965 89057 67499 57194 -33247
19508 -33247 -145035 -130488 24338 112985 4272 39084 115376 86265 31351 154473 85915
19497 85915 39072 74885 46908 11388 17486 -13223 -54401 -53921 -73964 -117915 -24992 55721
19485 55721 35196 -14814 -11274 23061 74226 92929 30989 30685 -37739 -97297 -76235 -115712
19473 -115712 -112750 -111631 -42232 28133 81759 101056 -7600 -57978 -51705 -75175 -110251 -113425
19461 -113425 -113049 -143410 -34221 16866 29268 -46494 -152003 -88469 10554 8458 42138 6644
19449 6644 -36988 -22611 -7818 16046 -28696 14699 86418 99196 85857 87135 53029 -42288
19437 -42288 -87207 -60563 -18549 33922 6938 -5683 11431 10786 78763 116581 90321 37003
19425 37003 3913 -32165 -7226 -14432 27448 82070 2068 17113 -7231 -53744 -87965 -139002
19413 -139002 -156877 -101857 22031 25510 -57415 -105400 -120329 -87274 -33811 -52176 -54277 -31825
19401 -31825 -52678 -98133 -121772 -113205 -66504 37428 84774 33349 5069 28192 84806 21236
19389 21236 -13348 -64752 -62913 39826 104409 -3664 -52169 -70047 -149192 -95912 -69333
19378 -69333 -81582 -27183 28308 1842 -116243 -115842 -44216 70325 61408 -28880 -90290 -75632
19366 -75632 45107 39589 62814 48864 70498 73015 82905 73503 129445 80456 53625 -34604
19354 -34604 -76050 -63500 7539 -23277 -37056 -22983 -3244 -27988 5498 64126 139409 118065
19342 118065 83152 38941 -87662 -154168 -83499 -24438 -30034 -127490 -55232 26831 -6817
19331 -6817 83281 114765 87933 105365 31298 -15143 69807 193680 184178 4231 -62174 -35834
19319 -35834 -15973 44962 63151 74813 47553 70543 36347 40817 54980 47745 32158 40430
19307 40430 28962 86250 -38395 -157865 -68057 -6903 -2958 27784 49418 77728 112145
19296 112145 29299 -51231 -1531 70812 35390 46391 97737 9468 -33855 2690 -38270
19285 -38270 -113575 -71963 74420 104448 11859 -8070 50192 116655 112696 137746 66643 117528
19273 117528 180633 160858 109608 147614 178643 293789 294337 137435 52242 136350 117179
19262 117179 118895 47175 -10305 97631 133025 125275 92536 78643 62641 32021 -52458 -28679
19250 -28679 51471 20390 30712 41401 88647 56317 22330 33810 25517 32122 -12875 -44346
19238 -44346 6652 43080 40166 4100 101104 121045 48356 99183 116666 56781 19806 29274
19226 29274 127295 102305 48970 24978 34846 46541 123515 91799 13948 -22830 -79646 -120262
19214 -120262 -104269 -105607 -47257 -109044 -184717 -68542 33522 129484 186077 140149 90634
19203 90634 56346 -3157 25502 116157 137966 151922 123516 66528 74294 117406 157040 149113
19191 149113 100350 68336 94961 110684 78400 10896 -7933 -36793 -68305 -95554 -49563
19180 -49563 -39918 -80172 -54231 1400 72919 104225 120912 146898 141096 121923 156390 194306
19168 194306 125640 31158 -42359 -80878 -38696 53529 5873 -58811 -75249 -19095 -18770 18860
19156 18860 66172 95981 24888 -8810 36865 77914 90977 24797 -90734 -120674 -73327
19145 -73327 -85146 -55203 -8053 442 4483 -73858 -20649 80709 159332 144263 147316 103975
19133 103975 89275 84165 16722 36933 53204 46950 102345 85239 10365 -25641 21186 38057
19121 38057 -75179 -93463 -84791 -10133 -37422 -86563 -116460 -73291 -29869 -40196 42463 81833
19109 81833 61519 56970 39327 48392 40367 -14565 -13222 15609 -35811 -64371 -42802 -43184 -23793
19096 -23793 66576 92341 106397 146109 161794 82340 77099 42694 -56635 16028 147071 108595
19084 108595 112380 65251 -29025 -76888 -37476 -30865 7834 58722 56084 58006 12225 -30000
19072 -30000 -72936 -3292 -54369 -93404 -117390 -26905 902 -27997 -67172 20980 85187 53398
19060 53398 21994 13839 39623 105199 99177 37737 -32456 -76309 -48171 -69846 -3908 65359
19048 65359 88287 149470 179571 236906 158957 95506 12286 655 24178 -8186 -89822 -100074
19036 -100074 -26498 20696 3437 -16279 -44392 -64984 -53357 35826 -10549 -37152 -764
19025 -764 69553 97278 59264 -33450 -85879 355 48988 93211 153492 112696 13776 -27337
19013 -27337 -68715 -45823 -23668 -71120 -98058 15723 72892 46671 63114 71079 21361 22921
19001 22921 -12582 -8861 82859 21913 -34120 -10824 54387 144278 94173 67306 30482 25498
18989 25498 42441 12585 31133 111646 52753 82252 72806 24325 76381 55815 21789 -22713
18977 -22713 -23687 16211 28044 46903 21282 19096 43939 86377 59282 109779 121274 82843
18965 82843 19591 36038 40666 34001 106221 214331 210897 53523 -53024 -89950 -138071 -88539
18953 -88539 -84612 -149556 -73136 14592 -41352 30753 74643 17680 -16782 -74936 -32556 65793
18941 65793 -14207 34099 50873 49414 91768 56377 36769 18751 -49910 -124014 -96128 -95121
18929 -95121 -123709 -126481 -118227 -118105 -84575 -2751 11891 40568 92553 135967 154443 135649
18917 135649 139441 156626 117796 4481 -32337 -67679 -50679 67086 47341 -76113 -169000
18906 -169000 -115117 -86254 -106609 -158426 -97859 -96336 -3132 66722 82879 44468 19361 21700
18894 21700 60467 89689 60645 100526 191064 207636 188897 99535 88729 50919 124489 125642
18882 125642 136500 153273 51026 82456 160956 189763 122441 104967 78505 71719 155409
18871 155409 212094 169058 133302 87764 -24858 -76396 -24881 35352 70660 79585 53762
18860 53762 77265 96964 116310 66674 -30703 -22629 -9339 16397 14562 39500 38483 33360
18848 33360 61425 32392 -6317 34751 157845 178961 150210 61125 58368 68114 -13131 -3710
18836 -3710 109892 197733 197868 108081 71027 -14056 -66874 -18881 56361 141652 201608 185231
18824 185231 145307 121181 102549 94150 95008 104981 75315 54784 99014 190230 145446 122663
18812 122663 117716 104772 109931 84177 129796 158200 98566 -21513 -49397 17247 71683 116041
18800 116041 178811 182073 168205 270997 235563 165472 53782 -50873 41250 117863 95233
18789 95233 73320 89956 101779 103882 7075 -63884 -51717 26805 135057 158156 123954 136409
18777 136409 71087 76673 127204 168286 198213 194182 179594 147092 158754 296476 400221
18766 400221 442379 392240 344081 268720 165629 111700 82461 119536 141136 145306 178666
18755 178666 166160 187005 129786 35345 13526 2523 44071 29536 52820 98425 141946
18744 141946 266304 291366 306602 283363 177832 60487 42040 28494 160681 214128 200221
18733 200221 205246 145965 36800 70416 146599 141011 24072 39430 112754 174517 166564 112620
18721 112620 84095 137538 167557 153640 90804 17367 -22328 20493 46925 37156 -27628 -9204
18709 -9204 86674 89892 28024 5784 -9268 67412 101327 -2817 -25435 -10110 96886 276914
18697 276914 282942 189145 152781 90008 90861 154368 250296 231658 153471 40180 23763 77284
18685 77284 42488 6595 66750 33155 20477 62202 115086 124664 155758 179911 195181 214966
18673 214966 212631 214949 111339 -694 -4497 40505 15442 23015 14311 -30253 -90827 -90520
18661 -90520 -15982 54539 84293 98663 79341 28965 76364 111840 99260 98894 139540 145595
18649 145595 122134 131281 136018 103288 90388 59869 107866 144453 97147 62839 106088 157492
18637 157492 147399 80825 72474 120231 227512 206184 155244 69655 -50894 -24714 55953
18626 55953 138162 114835 102629 219910 234980 156644 124456 146900 134873 85705 73788
18615 73788 -30873 -95181 -36114 44886 118383 75462 24675 78253 80066 54199 60677 100675
18603 100675 16032 -73489 6541 64357 116686 153592 155081 128029 117701 58224 36361 121005
18591 121005 110297 11683 87738 222467 134632 96559 -17791 -7019 73279 95157 107480
18580 107480 88233 22809 -780 -10027 -55377 -35213 -68182 -13822 -137 65165 112731 116373
18568 116373 80346 90477 171497 127973 70324 64563 89378 92631 155567 252675 225106 222603
18556 222603 223792 176907 98817 129383 181359 260892 287412 239586 148712 141754 166706 144734
18544 144734 113494 111759 209172 238609 128943 -1707 -31160 60907 171228 83895 26075
18533 26075 34240 115131 173743 133482 116775 28816 51970 58485 54050 144358 273813 288930
18521 288930 196555 120546 94046 146296 95457 129826 236187 256691 197577 170062 216847
18510 216847 234196 218229 235613 294039 255795 259674 216892 163751 132717 200673 196264 180864
18498 180864 229069 256129 272142 268020 163848 126977 248749 265568 327242 352122 319039
18487 319039 293990 282676 331940 371460 346564 256552 238573 210190 132955 162099 176169
18476 176169 252617 187373 154625 239565 311238 212633 166708 183731 246512 277900 285773 327513
18464 327513 407432 390639 385392 467364 524582 557408 596300 578320 536314 435980 278951
18453 278951 249674 259631 263532 190444 152216 114251 124040 188459 230789 282425 283209 239232
18441 239232 186366 178356 164052 142971 75095 141251 173414 168472 203702 208382 166011 134772
18429 134772 215510 339292 419140 491543 598689 669167 663993 624791 419661 264632 299337
18418 299337 357135 338968 274125 175985 144824 209791 172922 119851 213702 266510 250163
18407 250163 272748 321185 370113 375475 302824 239883 231142 213053 204058 146979 234963 326003
18395 326003 360756 336925 335834 293252 263974 169532 165581 205473 251939 305524 301976 244133
18383 244133 269628 308041 304675 291274 253745 303350 301913 253854 236914 231772 199825 177424
18371 177424 161951 115190 49305 170365 270667 303784 304245 321634 289878 277748 300247
18360 300247 291378 244181 197231 181402 132663 95292 93111 251300 243791 189068 142277 226223
18348 226223 272355 294027 230852 127034 168157 315811 305253 323672 309956 264103 248385
18337 248385 237742 188887 159215 88488 38238 92370 156601 163310 191526 259422 272437 293546
18325 293546 280596 239930 271959 317452 325582 314240 369316 426654 381962 347070 357680 336193
18313 336193 230870 229455 259358 274767 193981 131295 57365 60952 166547 229873 232118 229582
18301 229582 227765 212163 151318 142643 223105 209939 161161 192668 281494 387693 389530 367371
18289 367371 276728 233775 310122 229559 127458 78446 89927 165069 259045 333762 353312
18278 353312 364445 275678 250867 310308 322634 374042 414089 362530 326607 225658 173069
18267 173069 255212 307209 277270 220543 213008 303457 324754 351934 293975 227962 294501 267616
18255 267616 242896 326738 345315 309470 289482 304486 373527 456660 441116 440360 366164 313906
18243 313906 276338 277564 310714 367885 373565 386043 361247 351204 352228 370978 447561 456545
18231 456545 403125 308862 305217 338937 355342 344682 407530 456133 511182 576973 484605 521087
18219 521087 546388 499573 558277 618633 562131 517322 458890 424811 385013 394871 444562 535454
18207 535454 513351 507797 507616 522027 533215 512981 468607 487528 693016 717555 698026 764106
18195 764106 819116 807194 818197 824491 782585 755031 737269 732348 737497 723414 738074 816096
18183 816096 841977 781445 848327 813043 765678 826642 899684 931560 876676 899466 939084
18172 939084 994566 1047690 1081117 1065290 1055479 1073546 1053311 1102975 1090784 1108987 1226231
18161 1226231 1196654 1177294 1221257 1261766 1368305 1465445 1496186 1545753 1530405 1499892 1539023
18150 1539023 1617388 1757181 1747088 1728607 1877861 2074881 2231154 2278550 2370135 2473566
18140 2473566 2602518 2879928 3221266 3637858 3989265 4392941 4858721 5344779 5885966
18131 5885966 6426162 6965428 7603721 8189282 8747059 9053031 9225711 9178090 8868766 8470415
18121 8470415 8194074 8272857 8730998 9545809 10646131 12242245 14570075 17857377 22497956
18112 22497956 28955404 38266969 52283699 71818915 89521742 87007751 66017530
18105 66017530 47445427 35806200 28636635 24037991 20950639 18734906 17091205 15697979
18097 15697979 14600281 13739830 12974590 12296180 11754992 11265181 10857572 10401558 10029633
18088 10029633 9724484 9387519 9130510 8936188 8780654 8713148 8622472 8575934 8634865 8708388
18078 8708388 8859350 9013052 9127631 9183917 9167262 8852382 8323011 7781731 7354381 6925304
18068 6925304 6505034 6167812 5844682 5513584 5171237 4860499 4560433 4304623 4104000
18059 4104000 3842007 3623035 3479995 3310477 3132294 2918607 2779870 2664429 2523523
18050 2523523 2415775 2341682 2244871 2169190 2084739 1901064 1813674 1767613 1810207 1735251 1606000
18039 1606000 1436926 1399459 1369718 1320507 1290409 1188242 1117213 1116895 1144809 1109121 1092425
18028 1092425 1158415 1127283 1020022 898553 976862 926354 860278 777152 774318 802556 889811
18017 889811 872358 769329 636415 543189 587243 626357 698636 735541 738556 769907 714759
18006 714759 634780 720325 728306 718961 745246 705076 676936 675351 635901 546123 492197 508663
17994 508663 550209 586025 644634 772220 860218 779499 745980 738237 768214 791781 750964
17983 750964 717452 720051 708891 623017 689790 735576 660727 647154 582328 533391 642860
17972 642860 749881 767655 780697 803917 773521 771812 857272 867827 803091 778527 769156 757835
17960 757835 796349 817423 872920 884360 896689 909711 913420 927647 1013594 1026859 1002019 954547
17948 954547 913921 994818 1005844 994330 1015701 1035040 1061969 1124229 1246315 1351636 1391257
17937 1391257 1457555 1478272 1591150 1497525 1500912 1549402 1574600 1579740 1596361 1735637 1806956
17926 1806956 1720100 1724848 1831589 1898338 1930729 1971778 1999974 2105956 2255407 2401714 2517923
17915 2517923 2671827 2882614 2951931 2933639 2982241 3102511 3225854 3312346 3442570 3690410
17905 3690410 3959759 4385002 4776530 5068047 5466135 5893227 6345765 6829989 7423952
17896 7423952 8085055 8526718 8867003 8956570 8937267 8883878 8791873 8863173 9200211 9744079
17886 9744079 10407157 11457438 12980679 15173941 18351129 22854358 28998171 37493037
17878 37493037 49157981 62404415 71398902 69913874 59145635 46331311 36502952
17871 36502952 30243002 26395667 23856746 22125526 21020566 20359165 19941849 19736613
17863 19736613 19822795 19953994 20044308 20024497 19710919 19213448 18633426 18141074 17887297 18036838
17853 18036838 18503514 19508165 21136870 23425329 26815829 31516780 38046871 47420167
17845 47420167 60579466 77106245 91733174 95421433 85167547 68194672 53109176
17838 53109176 42582277 35570909 30617831 27021839 24475375 22528731 20902693 19564063
17830 19564063 18403506 17412774 16617292 15964977 15429674 14910883 14329097 13693702 13048548
17821 13048548 12492557 12115576 11790448 11552619 11413967 11242170 11046066 10994509 11064030 11213196
17811 11213196 11320527 11340223 11176706 10944092 10634703 10156288 9514192 8988039 8483791
17802 8483791 7972180 7500126 7051329 6574985 6138248 5796661 5495075 5194732 4884664
17793 4884664 4572018 4301003 4000508 3724246 3567509 3408193 3215514 3057309 2926156
17784 2926156 2755174 2686363 2532183 2351064 2200376 2035092 1909224 1889241 1849968 1841277
17774 1841277 1743065 1730157 1680889 1582927 1530569 1536897 1506837 1454839 1403657 1422954 1363340
17763 1363340 1259633 1155242 1156405 1115956 974954 859015 776044 800060 959613 940067
17753 940067 849032 816780 791827 818092 823574 791956 740294 637106 548325 518002 578816
17742 578816 564205 562278 522419 483551 594394 645511 618390 624451 581322 512304 557917 579496
17730 579496 483915 474187 492654 584973 561028 567219 561828 521385 603497 671546 698360 597178
17718 597178 624545 740537 829256 825062 773781 697237 618571 607313 637803 606036 558529
17707 558529 520447 523576 598013 620099 656476 784332 815434 821969 856811 847523 858474 814045
17695 814045 832572 856890 821160 719873 658205 702248 714652 709712 692498 755957 917870
17684 917870 1022372 1057027 1058863 1075607 1116158 1096201 1039605 1103105 1174362 1158800 1086066
17673 1086066 1046576 1043213 1039164 1066640 1057223 1079881 1150435 1231959 1247046 1221088 1208776 1203502
17661 1203502 1290698 1316666 1396534 1449885 1481249 1538655 1584243 1616206 1569897 1596439 1622839
17650 1622839 1625188 1575496 1599624 1638832 1739316 1761475 1784288 1850579 1920443 1937748 1950178
17639 1950178 1902602 1953012 1977814 2119214 2228645 2323019 2387260 2534034 2708513 2755712
17629 2755712 2806862 2968782 3178595 3338773 3498257 3766963 4101302 4441491 4824122 5307110
17619 5307110 5766553 6307935 6861838 7500578 8158281 8754374 9392937 9954588 10304515
17610 10304515 10399021 10425976 10436551 10469823 10594164 10957084 11408937 12036570 13267162 15248030
17600 15248030 18007829 21711895 26866014 34486189 45310623 58033254 66354601 65840197
17592 65840197 63751094 65803007 68079306 62509812 50587000 40232147 33456926 29247203
17584 29247203 26581304 24859811 23604112 22673921 22014562 21574553 21081344 20512953 20027683
17575 20027683 19620461 19299963 18978231 18793007 18777794 19002509 19582744 20578034 22265699
17566 22265699 24712619 28083315 33138339 40562562 50292264 59060431 61232566 58843498
17558 58843498 58659792 60858135 59089303 50183885 40145117 32880764 28127424 24736488
17550 24736488 22248806 20439481 18990761 17741373 16687798 15753060 14997056 14335449
17542 14335449 13692210 13187887 12624537 12063304 11714439 11355490 11074085 10768615 10424776
17533 10424776 10113893 9913461 9783525 9696799 9620507 9505720 9455201 9322428 9055789 8708219
17523 8708219 8440176 8127982 7838739 7379158 6890355 6420207 5998982 5680564 5466335
17514 5466335 5129471 4840348 4488409 4208352 3945995 3740009 3579978 3441110 3215545
17505 3215545 2925469 2796841 2659519 2472457 2366292 2194012 2104052 1944465 1887665 1832518
17495 1832518 1730973 1697989 1649085 1574789 1448019 1368847 1272831 1110776 1012166 987822 881208
17484 881208 808996 747683 756911 746614 772046 688615 665758 621772 583680 599872 599922 632242
17472 632242 680778 614833 561331 534386 417604 420723 449918 415932 297874 271449 238866
17461 238866 318222 365726 399300 373132 335025 297400 200458 183605 175797 191163 252143 235458
17449 235458 290609 299413 287033 312154 295006 378840 409085 488921 488366 508589 449768 369590
17437 369590 312379 271653 327618 325481 311103 218210 248029 296992 275992 347789 370235 281677
17425 281677 221595 180117 88370 22494 83264 202625 187424 186253 233170 252100 244537 284177
17413 284177 353764 313251 289247 343644 338300 273486 204483 145051 148325 167566 129347 151167
17401 151167 237171 260144 264272 232956 181040 135477 145362 169300 224568 223806 241288 250893
17389 250893 298614 279966 228562 186789 204259 255025 251483 203327 245962 318982 348660 342444
17377 342444 303199 314456 361526 355508 322365 272934 229585 214126 240954 162323 75462 155760
17365 155760 249998 220413 211666 169145 114408 138150 168317 127981 136062 125027 96442 107821
17353 107821 163896 120114 192323 240804 219084 126966 176517 249823 268749 218173 176327
17342 176327 150484 109488 178369 240038 352421 384843 366931 253958 124503 65123 33259
17331 33259 17623 23652 50608 110216 94160 72336 -42444 -34013 -42989 -102833 -73155 45974
17319 45974 53539 7220 79344 71428 22984 44817 85028 108946 43724 88420 210989 184694
17307 184694 120574 114410 53816 122172 118062 90159 107464 121267 140695 59702 41856 27565
17295 27565 45512 98924 45016 110328 164719 201760 214297 206277 236610 342602 460212
17284 460212 588849 600516 530331 415088 333016 271874 276736 290913 213180 218681 204808
17273 204808 128447 77146 44106 108748 169761 161496 202850 217864 200962 212978 104842
17262 104842 134190 197969 202375 165365 226894 315868 378446 471111 570906 689932 824878
17251 824878 953019 1016837 964750 903496 837672 737893 719893 663448 533877 449567 432064
17240 432064 364194 295055 302937 321794 282640 312815 283923 286689 303542 248709 263677 199379
17228 199379 182283 134974 150397 227440 264132 260139 210730 181545 212640 224240 259648 278034
17216 278034 304773 242224 191398 247185 270346 253119 248677 271348 225784 163225 47088
17205 47088 -49834 7537 80213 89958 103683 58048 115427 75473 33713 3771 62473 72648
17193 72648 46557 61151 170772 127738 125267 107157 59896 19387 -16000 8674 -76690 -178049
17181 -178049 -121588 -38073 4508 -111029 -168308 -130108 -112404 -107078 -92368 -16300 -28563
17170 -28563 -33386 -21757 59210 11794 -106058 -99823 -17338 -23439 -15031 31589 48197 -78414
17158 -78414 -124656 -122310 -4951 21124 10406 67512 102610 161018 162119 108387 80554 1120
17146 1120 -47219 -10333 7809 36933 37103 53233 79423 71596 -1393 -17660 -45056 -86536
17134 -86536 -54400 -7271 7256 -27526 -59541 -99250 -83174 10909 117159 173864 100752
17123 100752 15008 33893 89164 -3705 46016 115453 165325 172794 67072 -50603 13047
17112 13047 52012 -37805 -58441 -48996 -34264 -31132 -37368 -10452 74951 50345 -86100 -156724
17100 -156724 -61531 10676 -1686 -3335 -8795 -11315 61566 116978 133691 55291 1428 -34699
17088 -34699 -42439 -4728 117689 142151 49016 15622 77240 111181 7147 -16298 13202
17077 13202 -35658 -91861 -70583 -17269 -28336 -31750 -2715 -14822 38761 101009 24809 -3657
17065 -3657 42832 93234 43496 -43487 -84365 17184 194604 310987 369604 375329 313401
17054 313401 291372 240407 145259 57742 25668 57894 147107 167737 128267 151492 170614
17043 170614 97711 77420 56796 66581 -39188 -15086 20903 49535 111741 167223 151717
17032 151717 99372 177724 231373 192142 129376 165422 209589 295739 351595 392884 376824
17021 376824 318378 281811 280854 270182 276307 212290 114944 99671 128210 201846 190105 110191
17009 110191 23947 -33508 -11179 -2193 35393 11360 57416 83504 98597 24009 -22591 -24551
16997 -24551 -59784 -55175 -19266 4499 111157 135884 144757 39009 -35900 44420 42719 47160
16985 47160 56130 70201 111370 146449 157951 199776 162977 123957 140274 226936 236475 243848
16973 243848 233415 198955 141220 226956 231732 169802 134182 63137 -77615 -95876 -13587
16962 -13587 7299 -61732 -56055 35656 156216 105930 128537 131858 201604 291336 314478 327430
16950 327430 270838 231274 138408 92079 112995 78560 161512 174930 133862 131120 144104 113543
16938 113543 102527 1537 -39035 12431 3227 84311 156720 150793 118463 78779 29810 66480
16926 66480 47100 -32210 -2898 55290 75582 -634 -43694 -30975 -12640 19733 39352 74169
16914 74169 81505 81063 130411 36227 -44257 -56296 -28237 -42555 -30975 -35477 -239 5283 4152
16901 4152 -11128 -31340 42225 29679 1083 14510 15663 27771 38671 -8332 62646 131632
16889 131632 101436 122603 159868 163513 108475 79969 85431 106912 63629 60889 90077 61586
16877 61586 107116 149897 146051 100265 64683 57941 16068 53713 89324 156194 105538 73737
16865 73737 93479 18621 -16124 28570 154487 145179 200655 299345 235828 196089 276974 286363
16853 286363 289888 252323 234868 203271 138593 108385 133051 152612 147609 178535 152657 94513
16841 94513 81401 85665 110987 129574 170814 157148 166953 241222 271685 185180 197105 268834
16829 268834 386359 349758 351945 316173 314455 274895 260679 226096 233337 204059 267044 308232
16817 308232 319587 288821 302288 385927 273145 252865 300026 268153 272497 285077 336955
16806 336955 350373 351503 446940 403488 391584 441029 522474 497281 418566 430677 439681 441114
16794 441114 452026 455504 465548 539246 644924 642916 635573 659334 615617 609561 691622 749696
16782 749696 699985 707416 777263 782022 787801 810915 849173 917973 993391 1004538 1021599 968640
16770 968640 983201 991186 1011012 1082950 1157648 1233774 1227804 1182457 1203281 1177030 1128337 1053288
16758 1053288 1136210 1245626 1277062 1392346 1546362 1584880 1598437 1591245 1602394 1643642 1651474
16747 1651474 1604917 1644209 1788519 1968827 2162203 2274171 2365385 2475991 2577983 2757965
16737 2757965 2927290 3068656 3274403 3540780 3900936 4276069 4624709 5040623 5594490
16728 5594490 6190657 6970882 7794504 8578441 9449895 10386179 11321711 12306132 13295422
16719 13295422 14188394 14835250 15370294 15745691 16058730 16350220 16746169 17210791 17909665
16710 17909665 19050320 20900416 23742919 27745626 33502262 41449968 51658901 63181906
16702 63181906 75070856 86993108 97216006 103362725 105510509 105149007 101673858 93869136
16694 93869136 83195837 72298495 61878228 52147928 44147939 38295746 34064342 30865006
16686 30865006 28520840 26582525 24963100 23644779 22633214 21721986 20898433 20169346
16678 20169346 19487974 19045392 18611009 18224746 17934474 17784295 17680455 17610850 17547542 17407907
16668 17407907 17297304 17201680 17070146 16812365 16478930 16027483 15399264 14760169 14049292
16659 14049292 13297523 12597463 11852240 11089168 10432524 9744854 9126277 8532623 8007470
16650 8007470 7540149 7048356 6678279 6412447 6087320 5690196 5389004 5044560 4750098
16641 4750098 4526889 4338322 4048663 3736346 3550492 3405662 3248594 3076908 2867875
16632 2867875 2722945 2567938 2419836 2231117 2143842 1994828 1859767 1789879 1670124 1571788
16622 1571788 1471547 1309222 1235716 1199415 1117755 1022392 906045 812821 848356 889725 942856
16611 942856 861948 769745 708810 708517 691421 644750 590955 560832 453050 447454 429788 392890
16599 392890 338157 340888 302255 242351 205481 114068 26662 57424 170896 244320 166244
16588 166244 116786 180749 216691 124661 -17926 -35891 -65230 -73037 1806 -9301 -4257 74264
16576 74264 110007 78864 -3837 -43173 -11665 84873 92372 -18707 -34582 -25818 -71354 -32852
16564 -32852 -57268 -119693 -49742 -898 -50368 -117727 -109271 -61751 -108217 -187091 -185864 -39168
16552 -39168 47549 51897 -4544 -43284 -95248 -112278 -114298 -86166 -49906 20122 153217 157235
16540 157235 65126 99670 128599 129346 125566 142469 122988 158986 134142 60403 121847 132942
16528 132942 99686 171490 197513 210278 230196 143782 120350 183036 192233 188510 185812 249528
16516 249528 275004 187235 138862 114552 91731 9095 -38438 -3986 85644 117602 150013
16505 150013 197102 242336 288924 280307 259329 197978 128340 104561 21248 -21230 58211 108971
16493 108971 59964 -43630 18241 25180 -35713 -3840 1830 -56722 -55783 95002 165906 91592
16481 91592 64886 59718 59074 95947 71917 46317 -30188 -29349 -12375 28750 -18494 20773 8776
16468 8776 48782 -4478 -84225 -73638 -89339 -36694 35534 39515 -30124 -53984 -99986 -109764
16456 -109764 -138353 -109349 -74553 -3294 20852 -30680 -1621 17606 -22666 -4760 2717 -10689
16444 -10689 -24093 -42382 -82964 -130074 -166069 -82885 25096 23717 5840 -29558 -84595 -109971
16432 -109971 -6444 -57725 -72827 -45954 -28894 -39425 -92466 -106178 -110864 -110196 -117748 -65885
16420 -65885 -119630 -190434 -199664 -145555 -80874 -87937 -128567 -105391 -71791 -31048 -80539 -132959
16408 -132959 -110681 -54420 -6293 -43247 -143843 -186465 -166180 -136567 -137794 -125852 -74995
16397 -74995 -176167 -108728 -56315 -85944 -43656 -30115 -110145 -186916 -203017 -217922 -188763
16386 -188763 -159611 -110807 -193435 -177984 -95959 -75114 -119926 -101158 -95983 -63658 -86806 -56127
16374 -56127 -20016 -48896 -45421 -73997 -79203 -32107 -62436 -12128 88670 57412 -29795 -76044
16362 -76044 -11152 3348 55935 123176 63399 113763 96170 -70253 -60957 13381 11538 -96309
16350 -96309 -103816 -119356 -115516 -121815 -76507 19773 6486 -9468 13564 147915 167052 69003
16338 69003 12259 -21826 -18374 -24410 -34096 26549 51448 79694 61136 14210 30913 31128 29238
16325 29238 -63006 -97355 -84789 -58641 -38084 1394 43759 48685 60401 82261 100228 24216
16313 24216 -128609 -192504 -139450 -33019 27810 13569 -28687 -14028 -15804 -5865 -13757 -54876
16301 -54876 -55516 -53289 33246 78882 25408 38998 -4224 -69882 -38118 8374 -26774 -36096
16289 -36096 -36972 -97962 -140407 -176516 -197318 -193124 -192308 -210399 -196005 -127683 -149861 -179966 -189419
16276 -189419 -233424 -260565 -192335 -173881 -188053 -168091 -124059 -99027 -73653 -19525 -30121
16265 -30121 -53516 -68118 -128336 -167504 -109325 -55118 -112953 -148763 -147746 -178019 -133920 -93674
16253 -93674 -92823 -92320 -111740 -112452 -52196 -100986 -88485 -10408 25663 48625 -88125 -115215 -92092
16240 -92092 -122074 -89356 -71439 -80211 -102215 -33450 47294 15344 -48676 -141640 -94316 -98905
16228 -98905 -115141 -76422 -50771 -42644 51241 27240 -56194 -128012 -139006 -103194 -115875 -163482
16216 -163482 -228511 -264563 -190218 -55947 33491 -9739 -101983 -116699 -95677 -169939 -172164
16205 -172164 -62970 -13662 -60739 -104755 -97493 -55980 -76869 -91154 -124661 -54693 -19730
16194 -19730 -25555 -27087 12594 -62652 -99390 -143570 -114503 -93640 -99793 -135379 -206858 -156145
16182 -156145 -120227 -90092 -11757 760 -11650 -38589 -35872 -85663 -87032 -14810 22795 -11054
16170 -11054 -18894 -68797 -109646 -86067 -69191 -43381 -26794 -1141 -1198 -7969 -6268 -10592 -25508
16157 -25508 11322 24365 50501 59147 83003 64849 89284 158457 221609 192364 206677 232551
16145 232551 138105 146109 261206 358268 418364 462103 453890 433418 319662 250402 203407
16134 203407 160656 162848 172665 192459 176210 220532 113483 -88867 -99728 -107367 -119415 -128160
16122 -128160 -115478 -70118 -64729 -42374 -39213 -20647 -18082 3958 -5181 -71141 -80998 -24377
16110 -24377 -114069 -130496 -150939 -158147 -120285 -161283 -39632 67274 83932 41278 50472 6440
16098 6440 -89536 -71792 47189 8200 -69152 -85386 -90163 -175726 -165180 -152581 -61677 36006
16086 36006 4983 -58936 -124253 -104421 -103151 -174061 -207770 -136376 -71433 -13921 -14515 27454
16074 27454 16483 -71672 -104987 -131779 -171513 -146158 -154907 -117877 -96558 -39273 -64486 -182646
16062 -182646 -173449 -81001 -83405 -141507 -111594 -111788 -110385 -90816 -85494 -101418 -119539 -98456 -119952
16049 -119952 -59000 7461 26618 -85003 -31042 59571 27667 -8193 -1816 -41853 -70567
16038 -70567 -53954 -113718 -156615 -140918 -149125 -189115 -205619 -143078 -128408 -144067 -98538 35453
16026 35453 82380 100606 91503 -2268 -45904 -71442 -85016 -110043 -92482 13224 31601 34265
16014 34265 100786 -2095 -167621 -205876 -171915 -103321 -112477 -32032 17749 -11743 -31315
16003 -31315 18164 -53510 -136080 -145378 -130394 -104319 -67468 -62509 -87490 -131495 -94062 -102517
15991 -102517 -97826 -73898 -80509 -64273 -61965 -30218 8908 62297 75541 59317 42825 -39012
15979 -39012 -74860 -70723 -54435 -91992 -75328 -27192 -27231 -41491 -152304 -149093 -130720 -116136
15967 -116136 -144145 -118864 -50624 -62189 -51739 3766 -15269 20098 26252 1106 15420 -18998
15955 -18998 -33310 -14722 -126285 -191732 -167286 -181638 -170012 -156730 -129579 -39310 -4567
15944 -4567 11159 62593 82213 19610 -32391 -46960 -30071 -24999 -1435 -18046 -127051 -145079
15932 -145079 -81293 -30709 -36563 -6684 -46785 -81291 -72968 -91049 -81602 -118506 -97467 -37639
15920 -37639 -35377 -55009 -122595 -107995 -104089 -129718 -143951 -147317 -80600 -40660 -23074 -39835
15908 -39835 -102853 -112545 -67502 -40670 -47345 -4980 35508 5985 -129085 -128388 -87398 -99835
15896 -99835 -139991 -142262 -136033 -234674 -233568 -71115 34201 76090 105458 61952 -47025 11531
15884 11531 32573 -31728 -158528 -173671 -9643 -13693 -100434 -212838 -130134 -54954 -46598
15873 -46598 -74463 -57499 -69535 -161342 -154644 -96317 -101134 -58030 -9604 -39990 -81264 -80847
15861 -80847 -52480 -96302 -72133 -76826 -86366 -104386 -113645 -136765 -151628 -159760 -115823 -55680
15849 -55680 -137227 -56300 -14293 -34406 -112624 -81904 -112236 -146301 -115179 -61724 19851 8871
15837 8871 -81318 -91712 -86195 -139413 -193834 -130801 -150019 -162306 -179227 -171037 -152160 -121877
15825 -121877 -83833 -84444 -132039 -108742 -131824 -131818 -140329 -190155 -207414 -246944 -246204 -173648 -92509
15812 -92509 7507 33369 -98086 -136470 -114653 -138796 -169865 -84105 -20721 -39238 -33551
15801 -33551 -141133 -164083 -79429 11966 -81257 -110820 -74579 7338 8720 -37996 30786 -57398
15789 -57398 -97100 -6903 47642 58365 28112 -24443 -131448 -108255 -98533 -92285 -45244 38613
15777 38613 19544 -86280 -138321 -180252 -190234 -171554 -88941 -41639 -83925 -118629 -121395 -100179
15765 -100179 -86348 -34473 6432 -80795 -101685 -152854 -141855 -84530 31118 10462 -101071
15754 -101071 -68118 -54743 -29637 -10445 -62125 -108590 -142627 -153071 -117126 -87057 -102191
15743 -102191 -51820 -31858 -54172 -93841 -88015 -54444 -94925 -118207 -142531 -123184 -157881 -167929
15731 -167929 -25832 85575 28817 -49781 -141647 -136922 -13761 20732 -40110 -93551 -148444
15720 -148444 -154708 -158728 -114252 -121389 -89949 17512 59749 -34911 -101049 -92230 -106297 -56573
15708 -56573 -19363 29304 26641 -40527 -53036 -59151 -18249 76823 62661 -79935 -177617 -189536
15696 -189536 -129958 -118538 -120208 -155046 -182765 -140766 -103598 -55979 -39219 -81471 -36487 -85835
15684 -85835 -114542 -136034 -155183 -153240 -35380 75214 125280 107600 9478 -30322 -25863 -69692
15672 -69692 -82749 -73457 -71451 -49065 -73800 -147651 -143161 -122815 -43603 -25075 8425 -19631
15660 -19631 -25625 -80793 -62413 18249 9675 -24523 -90500 -83336 -21355 5202 -80050 -121965
15648 -121965 -134608 -64986 -37105 -30830 -45416 -63957 -102427 -116609 -145999 -127901 -63055 5514
15636 5514 34199 -3768 -36826 -91921 -136033 -111077 -62323 -60800 13195 34628 15565 60040
15624 60040 34060 63593 57059 13411 82434 41164 2661 -31820 -94846 -71918 -119216 -111176
15612 -111176 -175633 -183672 -109942 -91684 -128687 -140232 -170969 -179967 -168814 -173142 -202836 -168794
15600 -168794 -187449 -145906 -137733 -100050 -84602 -62996 -97413 -72344 -96024 -102444 -140684 -47599
15588 -47599 -7539 22617 11439 17974 -54453 -102175 -160239 -182327 -108536 -78806 -70115 -80332
15576 -80332 -78209 -35495 -10828 -29574 -56632 -80621 -152059 -103941 -80321 -60114 -95433 -31671
15564 -31671 -15176 -106835 -140956 -131891 -75426 -109639 -123535 -109342 -102780 -91196 -65763 28595
15552 28595 18118 -73863 -118176 -160045 -110557 -126336 -217873 -223275 -141145 -131673 -53644 -87910
15540 -87910 -61264 -78519 -59009 -25922 -29468 -23618 14147 16476 -17097 -43153 -85138 -188452
15528 -188452 -227361 -191724 -212129 -305233 -257228 -204220 -87211 -28248 -23924 -86910 -101663
15517 -101663 -89605 -94395 -123606 -70657 -75260 -148595 -169332 -92823 -33197 -24760 -1427 22390
15505 22390 -16790 -52511 -75976 -64229 38352 40706 -23096 7036 55891 -49843 -76343
15494 -76343 -21056 -23350 -77846 -123279 -207870 -161348 -182595 -72469 -28257 -119882 -177910 -175815
15482 -175815 -141464 -120905 -33007 18199 49927 71872 -16884 -83760 -95818 -110378 -122809
15471 -122809 -199394 -207706 -111555 -93991 -25105 -16995 -110792 -171275 -170357 -153313 -103712 -47169
15459 -47169 -125250 -198400 -174688 -111763 -59166 -19984 31086 16971 23334 -42261 -68374 -16663
15447 -16663 7996 -65269 -67443 -69051 -95819 -118279 -107794 -106944 -113745 -120683 -84786 -71523 -119545
15434 -119545 -103921 -24045 -37122 -38875 -51219 -6892 -48142 -88887 -139813 -83980 -95014 -132142
15422 -132142 -171096 -115778 3206 -19338 -98499 -163598 -148498 -150305 -207366 -137267 -94601
15411 -94601 -65664 -97811 -84809 -111067 -94116 -47561 -16438 29117 39386 59598 -20727 -11572
15399 -11572 -46066 -89200 -124052 -93201 -50208 29901 72958 1425 -120250 -167756 -139232
15388 -139232 -80196 23103 50055 -7022 -67231 -118491 -148020 -165783 -119936 -80957 -97678
15377 -97678 -128192 -85763 -109100 -115222 -124260 -109959 -72576 -34725 -387 17724 -28890 27706
15365 27706 53495 -9316 -82220 -35196 -45509 -116978 -176461 -96405 -84883 -85957 -24789 -34087
15353 -34087 -7941 -33107 -34679 37300 -10995 -72097 -134897 -146935 -128357 -180609 -149102 -90925
15341 -90925 -120723 -107465 -29894 -46036 -122117 -139925 -146494 -46604 5265 -25155 -27084 28714
15329 28714 33450 -3949 -17876 -62445 -68044 -50055 -20179 -42224 -22355 -20300 -38217 -88346
15317 -88346 -136235 -28937 52833 -8223 -133494 -148497 -55347 -18824 50547 4628 -73373
15306 -73373 -82381 -73547 -58823 -48393 -70812 -14081 36412 8302 -98664 -85678 -68362 -102552
15294 -102552 -126118 -155436 -96258 -99482 -104389 -45192 -14431 -87980 -202362 -179700 -183035 -197286
15282 -197286 -129265 -123705 -100161 -11407 39592 -62714 -51447 -8683 -9711 -86750 -70306 -48244
15270 -48244 1485 -74184 -76303 -87557 -98229 -77715 -97972 -166594 -149441 -130851 -128268 -177496
15258 -177496 -208192 -199942 -119967 -106910 -149626 -154754 -140528 -136260 -199410 -174760 -165505 -199860
15246 -199860 -208668 -164048 -131226 -41887 -10088 -40796 -63635 -124534 -72167 -105978 -41270 6454
15234 6454 27313 -45123 -8829 22817 35314 17615 -18864 -104643 -137995 -170595 -168205 -172809
15222 -172809 -157696 -164908 -108163 -91297 -64884 2473 39212 -30146 -84225 -93166 -72129 -32356
15210 -32356 -53493 -47589 -25685 -29038 406 -202 -29576 -104792 -148729 -145984 -144257 -199399 -202129
15197 -202129 -155810 -77690 -64936 -120690 -121177 -55057 17300 36919 13257 2939 -39295 -43649
15185 -43649 1937 28564 35710 53036 58696 63723 13927 -59413 -112472 -155431 -149778 -173934
15173 -173934 -114399 -67753 -136473 -122276 -38932 24240 28525 19655 12626 -39869 15320 21974
15161 21974 2339 -45908 -46801 28163 67650 47075 -32268 -33884 993 30272 -27016 -59216
15149 -59216 -38201 -34972 -52985 -155415 -169739 -119234 -143877 -42961 -91441 -83424 -75599 -75094
15137 -75094 -26764 -23633 117 -43107 -79848 -183455 -196066 -136927 -124256 -135658 -121537 -94310
15125 -94310 -29651 10498 -37405 -45440 -68795 -148254 -187906 -166144 -111700 -63016 38241 13848
15113 13848 -38408 -81959 -53891 -52179 56555 110071 37173 -89434 -86550 -46363 -55772 -58663
15101 -58663 -33751 -137573 -136267 -149975 -174003 -174140 -160004 -135325 -129678 -95155 -127910 -131720
15089 -131720 -125039 -62797 -19255 -47924 -53762 -49481 -114410 -105705 -74959 -89471 -99807 -25396
15077 -25396 -24586 -59601 -144911 -112526 -73303 -45011 -10522 1070 26846 -9943 -55145 -91870
15065 -91870 -65770 -73656 -91415 -47745 16451 49431 -76309 -155565 -73991 -21947 -25154 -42585
15053 -42585 -43744 -20475 4913 38554 26542 38944 8049 -33865 -38578 -28301 -15059 -2716
15041 -2716 -30047 -91106 -54804 -63609 -92228 -103315 -136160 -115579 -77919 -66281 -49306 -28723
15029 -28723 -58210 -21961 116515 204333 144350 130539 45152 15331 29626 16368 -668
15018 -668 -17613 30711 6628 -106365 -141231 -68268 66811 91048 110314 194827 232877 251489
15006 251489 444766 602891 551830 387118 276228 217369 139754 150966 176815 231632 246718
14995 246718 221154 231743 192337 78600 -18775 10509 77365 56567 -59043 -51128 33223
14984 33223 58106 107052 102095 43878 -2821 -50216 14093 100943 74717 82438 125440 131548
14972 131548 76904 39842 80064 161360 164392 40849 -18976 -5605 -27306 -21935 4230 -68190
14960 -68190 -28576 -37622 -73268 -74101 -82265 -153237 -79145 -43845 -96505 -87800 -77634 -113810 -53998
14947 -53998 -64392 -107363 -110026 -179261 -171252 -80488 -43038 29472 -29217 -42805 -30462 4329
14935 4329 -25051 -28151 -29688 12452 42948 -24358 -66393 -21245 73937 51016 -51001 -83269
14923 -83269 -73859 -104520 -40481 -36851 -65071 -76193 -134853 -114905 -127534 -203008 -213469 -190449
14911 -190449 -219968 -234446 -239850 -181451 -152455 -165266 -137634 -163085 -134143 -37002 -2706 -83347
14899 -83347 -124404 -83698 -48434 -19416 -13438 30733 49896 5491 -4531 -63059 -85261 -52297
14887 -52297 794 -42525 -50723 -47673 -35344 -6514 -24075 12975 -76103 -86241 -66572 -72181
14875 -72181 -140841 -55861 -63777 -45174 -64052 -164484 -145316 -23234 30141 53493 -11340
14864 -11340 -72929 -80796 -78911 -18273 -77349 -72610 -79115 -111066 -170082 -111888 -64032 -94690
14852 -94690 -95965 -18377 -21504 -118176 -151702 -144594 -140923 -129041 -5855 88878 47917 -27871
14840 -27871 -86975 -109622 -88054 -39338 -122200 -151036 -67308 -20249 38837 85735 82337 79210
14828 79210 99334 68284 105372 36161 -36423 -76821 -127599 -71306 -82464 -154202 -105704 26120
14816 26120 124488 82442 45809 99588 61882 5721 -85069 -71967 9312 52248 112571 43374
14804 43374 -78522 -145302 -119856 -165038 -177155 -155694 -177867 -141469 -127649 -85225 -89510 -78791
14792 -78791 -130424 -138930 -165475 -103452 4771 -1375 -47430 -85161 -80978 -106747 -128423 -190489
14780 -190489 -196621 -162406 -70694 23247 33168 2461 -21658 42752 -3069 -24365 45827 60519
14768 60519 -3369 11673 68059 44358 -59906 -66191 -351 104238 75131 47533 95750
14757 95750 115552 93993 79363 -7825 -69945 -27971 54076 114990 67185 33061 -56669 -43452
14745 -43452 -62205 -26752 6507 36065 10785 12378 132510 112488 79027 47317 -12767 -28239
14733 -28239 -18941 49618 14478 -33716 642 23639 -30392 -76557 -57693 -19483 -22522 -1756
14721 -1756 26570 49598 27993 -16708 -5137 -40893 -65436 -112710 -131113 -97506 -32327 -35063
14709 -35063 -98898 -89097 -122170 -172474 -165138 -95919 -124929 -177394 -211436 -199603 -123996 -79471
14697 -79471 53836 116314 57020 -40910 -29396 -6120 -66763 -19647 -25953 -108755 -117222 -109360
14685 -109360 -122910 -107781 -66848 -107764 -175331 -98661 -6615 -22360 -64060 13752 14995 -75893
14673 -75893 -108192 -18627 113880 109612 -18420 -71419 -130893 -189120 -191966 -118762 -48440 -143781
14661 -143781 -236576 -188480 -164742 -215449 -181348 -154793 -174646 -187395 -152925 -67191 -52615
14650 -52615 -74408 -38609 -35859 -68530 -165691 -204640 -163048 -109555 -46091 -64151 -154862 -120008
14638 -120008 -90885 -158340 -163442 -131986 -112895 -62179 -57062 -108653 -136138 -134081 -92308 -14231
14626 -14231 -85168 -65279 -36992 -56288 -17162 15435 5579 -18142 -30187 -65918 -49759 -39747
14614 -39747 -97273 -41202 -733 80148 49604 -12860 -6191 47338 58954 20120 33162 47646
14602 47646 27155 -19012 -7026 -11742 8778 -23344 -23238 97813 127450 62424 31976 32225
14590 32225 32786 -9841 -23524 22110 -8785 -28395 45959 129456 153908 115700 166150 233144
14578 233144 145174 100194 110575 151907 156217 179045 192807 116511 22886 34712 62134 66001
14566 66001 54951 59154 -16438 -13785 -11650 -112338 -190227 -246022 -152296 -15041 -31481 -71912
14554 -71912 -11175 6451 37120 114258 170776 194283 108949 117066 208418 167371 100252 22967
14542 22967 32518 119993 200511 219148 141356 138494 131120 103345 164324 185733 212945 280649
14530 280649 331615 332375 320404 441289 564771 551941 435804 392241 355370 417164 478610
14519 478610 479242 508249 526686 618365 714151 773615 741237 728204 659525 704804 744381 604535
14507 604535 532584 604622 677251 598862 541220 508658 392125 242291 198811 172272 188612
14496 188612 219493 226803 265567 264729 279570 307635 303516 339549 364764 255069 168133 74750
14484 74750 55696 118168 108152 79917 76134 11483 27068 77783 99962 40445 48292 129331
14472 129331 97296 65846 66220 144441 90687 127255 189103 149569 134808 133926 50817 109013
14460 109013 166224 192583 145458 124939 125924 74627 57144 1527 -40525 -81104 -28538 -44707
14448 -44707 -28926 15353 603 21955 20964 28662 26068 65314 7063 12457 21601 80637 112936
14435 112936 85543 -21874 -93196 -39611 -42054 -14402 -49629 -43164 -37558 33626 35856 27038
14423 27038 58701 40515 54954 -48262 -57018 -85978 -91171 -17652 12994 -54325 -121275 -64972
14411 -64972 -24199 -15162 -131086 -155048 -105244 17856 158204 133027 -5706 -89627 -55042
14400 -55042 -34828 -61047 -53034 37923 -17414 -32068 -84932 -46812 -42760 -67839 -109777 -68014
14388 -68014 11747 59043 55 -68510 -110668 -27456 -20482 -143995 -230687 -226316 -202602 -78534
14376 -78534 -32028 14197 54132 139655 134776 115847 49138 29784 2617 21240 -28082 -34599
14364 -34599 -14690 76299 72205 18822 -7259 21504 32313 -10521 -57557 -34408 -18848 -21656
14352 -21656 27597 78016 23251 -12534 15193 74751 150011 104004 129544 112800 62462 39598
14340 39598 73839 83321 120373 51353 40128 77858 80727 104278 159666 111766 66528 137114
14328 137114 202454 194974 160620 190646 269244 319160 354753 269594 277824 245232 277313 240423
14316 240423 212047 213991 256766 323533 315331 328771 336425 341582 290633 170642 142392 104438
14304 104438 159576 226787 247334 285597 286299 295078 273064 155537 127051 131214 162632 144490
14292 144490 161490 230259 228853 227955 241662 193341 193042 177165 105478 129620 120485 97418 87319
14279 87319 103142 53409 49646 54880 29483 33944 69854 41944 13346 -70856 -87001 -12881
14267 -12881 26779 22732 52229 122720 151911 233589 339114 372807 319355 312581 195285 119442
14255 119442 83267 88964 147087 108660 21574 36125 111570 123610 54536 63607 123953 124263
14243 124263 148957 173597 87619 47286 39685 24503 89641 153268 230872 242438 267405 282996
14231 282996 180568 181912 179665 128888 109026 140747 244237 277058 251176 218262 186552
14220 186552 202048 204395 215059 283030 297439 334320 247762 160092 155754 163967 178020 249432
14208 249432 317792 367870 402878 422670 446870 433535 462414 424411 379213 375999 427256 441978
14196 441978 549147 515086 487227 448537 449357 518001 483144 516371 512875 499993 527684 542053
14184 542053 521901 518311 567341 551331 566464 547482 594880 650142 630933 597863 655901 673874
14172 673874 670408 692947 743719 723946 679756 713748 783877 895195 1001720 1085290 1118694
14161 1118694 1153343 1187890 1226425 1228787 1220369 1282976 1270314 1228221 1310722 1294076 1252375 1338630
14149 1338630 1490543 1518411 1597662 1711523 1721102 1815231 1870629 1982956 2080895 2203243 2259246
14138 2259246 2248039 2253486 2373717 2469496 2518567 2639644 2785647 2819914 2854578 2980451 3083983
14127 3083983 3290913 3440862 3485993 3537976 3508536 3573088 3750864 3975615 4131807 4306904
14117 4306904 4513298 4750095 4922409 5045625 5231664 5531972 5833126 6129360 6374858
14108 6374858 6697411 7042801 7435005 7823425 8259599 8775620 9252279 9775081 10427175
14099 10427175 11057842 11773034 12518481 13263090 14133632 15140033 16337108 17524896 18743436
14090 18743436 19990136 21407500 23007025 24696862 26404683 28222619 30035658 31932930
14082 31932930 33869287 35986033 38193718 40535000 43048199 45752060 48814146 52189402
14074 52189402 55925464 60055084 64764424 70101786 76070930 82532606 89489287 96793723
14066 96793723 104184483 111297111 117803471 123138248 126955099 128930083 129022257 127233930
14058 127233930 123925113 119256452 113754345 107824525 101775160 95724159 89874668 84525440
14050 84525440 79714921 75300858 71294470 67605913 64063006 60876965 58177259 55739818
14042 55739818 53587347 51508133 49556528 47810396 46265959 44884252 43651214 42507542
14034 42507542 41395596 40390714 39460535 38502689 37586276 36660287 35707438 34668035 33675916
14025 33675916 32610657 31550109 30489242 29436307 28321452 27136828 25985810 24934661
14017 24934661 23895087 22851505 21877020 20905584 19911720 18962287 18074603 17252487 16542367
14008 16542367 15784873 15031531 14296535 13624107 13023050 12389505 11815096 11293143 10832793
13999 10832793 10368060 9760746 9237978 8908410 8600353 8235716 7783959 7432371 7080487
13990 7080487 6819637 6564218 6336254 6120843 5890829 5568982 5286076 5074582 4901853
13981 4901853 4731867 4508841 4266197 4121717 3872074 3719482 3616426 3422428 3343329 3253566
13971 3253566 3068492 2792992 2732139 2688235 2585855 2388590 2239801 2101562 1968283 1874695
13961 1874695 1767744 1692892 1696701 1623611 1545732 1408361 1358209 1286071 1315488 1259788 1241617
13950 1241617 1239095 1211620 1089708 951442 943111 999229 1056444 1097589 1113123 1036759 1001746
13939 1001746 965167 937930 941725 901220 874922 813874 799797 748866 753234 721340 664942 587851
13927 587851 515248 559826 524999 450148 435534 476333 461140 434500 405416 412735 370434 375537
13915 375537 406396 438435 379791 380569 480882 515257 435560 494327 515883 475356 529726 561119
13903 561119 569624 574930 581396 598536 591036 653252 703995 674581 624069 557551 581060 580906 641241
13890 641241 660386 622680 660732 683602 696236 750299 790076 792903 790338 813710 847135 846495
13878 846495 805475 775262 748984 707031 627556 631724 582312 594434 652075 718776 715979 683916
13866 683916 687801 638054 555646 510055 526652 672711 769491 724599 675497 696481 698110 622920
13854 622920 700538 687940 650996 643528 541910 513348 472632 504306 538916 512024 479734
13843 479734 522654 529088 465340 391548 356672 483979 419449 413145 425696 422232 436107 340065
13831 340065 321389 337712 305955 297352 303087 300308 355805 356997 262263 246708 288195 249099
13819 249099 239172 275674 288264 234278 257724 269614 325603 298236 311467 254427 213198 144680
13807 144680 166691 255206 221700 181976 178071 113370 62384 28561 58679 83866 146926 158869
13795 158869 118299 73757 124957 138223 88991 80408 134442 288430 297324 259482 223969 208797
13783 208797 114993 16331 -40216 -9856 110303 166810 98051 100243 91011 110414 23798 -54255
13771 -54255 -32200 39198 69293 38036 112053 151124 61823 78440 136101 90187 101252 131579
13759 131579 101707 84378 101157 182003 102708 73493 100804 117161 167700 181472 83838
13748 83838 -614 2323 98092 95194 105162 130345 216352 284170 308804 272777 190017 201204
13736 201204 105250 62246 67368 93544 102432 157810 182674 204162 231859 303847 302793 253567
13724 253567 280510 266579 326280 381889 298089 211845 213028 160830 161673 168568 168931 179515 122998
13711 122998 100530 126711 113497 116541 37670 29579 69835 148742 136982 118344 92813 33353
13699 33353 8744 5059 86935 49155 9253 13318 -11033 -88663 -62021 15147 41514 64535
13687 64535 71830 42483 86765 151183 180396 230134 175820 181190 156260 147832 158089 174379
13675 174379 129024 146894 116280 45014 80410 174275 181085 201097 182276 123308 111110 128321
13663 128321 81205 24993 28663 68864 93357 38362 -15272 32481 91822 96088 42662 94675
13651 94675 66248 75868 65746 68998 153622 114318 39915 16923 77614 47144 88814 77657
13639 77657 79864 54364 -174 1422 -46583 -68844 5534 118503 177183 171374 101711 112612
13627 112612 220807 246130 193952 262041 239684 183152 229581 215757 265012 302773 244878
13616 244878 169184 187693 240168 266645 307570 452083 548662 563773 525723 557172 474800
13605 474800 507353 627748 704456 709428 648034 568129 512118 483673 521547 515541 509081 457395
13593 457395 441106 460514 459057 477585 462075 419169 443654 420215 354965 279746 275109 284089
13581 284089 260086 261899 215422 264328 378442 301258 199391 242901 296192 326919 282839
13570 282839 287036 258921 218348 146293 168350 208020 224365 167086 192081 180191 234955 281433
13558 281433 198719 180467 171226 179258 300037 291201 220385 192541 185114 173372 141222 11590
13546 11590 -35709 -50443 -51118 -71724 -13910 57780 67867 37747 12457 -23821 -67417 -10130
13534 -10130 7728 39974 128507 158920 75175 23108 -15810 52161 83373 70776 20398 86474
13522 86474 95772 51724 -37401 -43346 -105278 -64203 -6629 -41993 -106895 -116058 -124933 -108865
13510 -108865 -49960 78364 36641 -16186 -58612 -11958 -17277 57240 63136 -62045 -18970
13499 -18970 -33188 -138766 -171329 -137214 -133947 -51057 -26952 -111499 -129691 -126502 -82138 -25589
13487 -25589 7332 -33511 -49146 -37910 10922 13277 -56483 -42199 -36583 -55563 6653 52254
13475 52254 59857 -13712 -86617 -103832 -153061 -188088 -151701 -39303 7206 6504 34951 34457
13463 34457 112951 156324 14608 -92284 -52119 14468 -1168 -5449 -19663 -17159 -12531 22813
13451 22813 -53297 -101965 -118253 -187109 -155476 -69415 -26433 23297 -36355 -103732 -131251 -83981
13439 -83981 -64820 -43908 -39161 -75022 20116 134371 53382 -1764 4886 63751 119526 115876
13427 115876 -11906 -3868 56611 103699 47588 -33323 -42877 -66020 -102936 -41785 43574 39868
13415 39868 26340 -80151 -150704 -121964 -81597 -10095 27658 -10236 -26741 -6107 -44952
13404 -44952 -108587 -97086 -18775 -36981 -114569 -48779 -42758 3722 20965 17418 -15322 -53442
13392 -53442 -40448 -49977 -28456 30281 -24183 -98291 -94072 -39355 -31231 -53598 -58834 2474
13380 2474 17755 121393 144595 112629 34956 1817 60787 107722 59096 36641 -18402 17531
13368 17531 78512 97900 40043 -8136 -90504 -149490 -114081 10761 56085 12619 29692
13357 29692 90870 79755 -22409 -36741 -14357 1155 23059 47634 50478 52289 90984 88724
13345 88724 51878 46759 71244 34408 -109115 -84807 -49927 -85166 -72810 -138833 -149839 -134390
13333 -134390 -108027 -73911 -109626 -104930 -84000 -120561 -139610 -81051 -21299 -42974 -83651 -68429
13321 -68429 -64095 -16563 7455 31974 -30313 -38429 42741 74244 8414 5591 23918 -2625
13309 -2625 -15975 9898 43217 54667 -52387 -149332 -161428 -98087 -93739 -97565 -112299 -133685
13297 -133685 -87938 -9639 21919 -9078 3896 36910 22463 95744 174180 93306 -16518
13286 -16518 53281 51259 124405 118130 112123 78411 61119 1034 -29994 31020 58512 43884
13274 43884 44028 -113180 -192878 -121822 -35566 77234 60708 24124 28627 20037 24669 24266 -3799
13261 -3799 11853 64444 97369 32598 5260 11319 -4719 -7734 35466 75436 107126 30131
13249 30131 2105 -56968 -60391 -59356 64084 133906 106985 44682 69872 119798 69063 9125
13237 9125 21534 -6145 -41927 -14005 -16721 -49199 -56081 4244 11732 21451 -36909 -58527 -12334
13224 -12334 -27641 19657 75551 7226 52846 5300 -34354 -34474 -12227 -34449 60191 91728
13212 91728 93074 22931 -31179 -40052 -16133 -16718 -37233 -65561 -19433 43405 94007 83867
13200 83867 -73398 -179990 -170604 -144446 -52147 24970 -39683 -35264 -88140 -98515 -48824 -44222
13188 -44222 -20372 -5646 15048 73175 124547 109189 -10066 -59353 -43858 -105563 -110090 -89090
13176 -89090 -66320 -42414 -8663 -4340 -22725 -15503 50721 63080 73745 -26072 -66998 680
13164 680 84300 111156 75739 -33478 -97396 -69490 -46115 1347 47564 24791 -71295 -117613
13152 -117613 -43379 -3010 -10354 40665 83522 5188 1316 85325 189396 148393 123167 189585
13140 189585 129142 117045 157340 156321 100366 60572 56638 30624 10166 -29964 84569 67910
13128 67910 55890 22810 -13954 7813 36636 54963 -35758 24069 43213 82969 76354 67215
13116 67215 105979 73882 52282 24939 16438 94009 119154 174830 205156 202456 166730 193899
13104 193899 197312 266000 332274 249829 242673 264842 326344 411846 436695 326191 231832 192558
13092 192558 260301 310195 330958 393614 401574 292734 191786 232278 318140 410499 479254
13081 479254 595900 751897 961523 1187965 1433217 1849905 2346457 2612341 2318694 1738074
13071 1738074 1328562 1108795 927618 770452 711495 709079 667190 651357 633049 539612 570415
13060 570415 484571 381173 370891 333228 368133 438345 362638 233889 171378 226444 344757
13049 344757 356111 275007 219899 261871 387706 442528 350722 402372 350451 283356 282092
13038 282092 127089 153695 190552 200698 234569 231514 289339 286734 307114 326103 286776 251503
13026 251503 248912 229850 202982 199828 246393 280267 261741 191093 141751 144853 189148 109123
13014 109123 17770 -2895 -16352 -20186 12451 17405 74903 116453 50197 53123 77569 58392
13002 58392 72622 125342 102039 125644 110713 85743 108833 44429 53272 112205 41888 46407
12990 46407 128422 115765 109339 63587 40814 8301 39754 42343 8623 -22013 -45176 -18749
12978 -18749 47850 24931 -40654 -12434 -3258 -17375 -8045 41075 76542 137399 68705 48469
12966 48469 93487 159901 175555 155708 120500 82745 5789 -27399 -86940 -112818 -157595 -125951
12954 -125951 12257 29523 -13845 14441 -1938 30417 -19187 -124050 -135743 -82544 -15699
12943 -15699 810 -13890 60521 61753 40269 49104 -7886 -66721 -78337 -128820 -72860 16636
12931 16636 109923 43254 -8789 -69137 -75960 42569 128021 147625 89162 50939 67613 31478
12919 31478 39949 24538 -20324 23029 51728 104167 122182 80810 59344 129454 188704 217488
12907 217488 228692 268534 292065 278052 327199 321114 311312 325210 357571 413623 509455 556529
12895 556529 604158 663224 676025 683680 725780 724673 648720 524790 465981 405708 358518 322819
12883 322819 334776 298905 273829 181601 259901 239306 149688 171524 110238 123082 126826 130171
12871 130171 71908 -2350 -34286 -19561 11240 133550 145200 104404 41468 40740 73663 71015
12859 71015 -29957 -88012 -49999 -54942 -106465 -119321 -178512 -82151 36019 41510 -46944 27871
12847 27871 161239 185395 78880 -42366 -20830 4304 89140 137380 42331 -68407 -84404
12836 -84404 -31690 -34823 72727 133562 90343 91565 120817 111653 180259 211121 163518 96002
12824 96002 85464 189462 134650 28937 10033 26557 75405 53944 117871 121998 136475
12813 136475 150450 159597 135891 201868 322877 350168 309808 234376 147570 125447 159203
12802 159203 173766 296459 306071 227471 268000 190398 55524 33688 81019 107110 88797
12791 88797 121699 158429 153912 113191 95318 91674 115384 178775 210507 222667 233536 313072
12779 313072 330538 330738 401482 441774 510279 509339 485372 431881 502109 531438 517397 534373
12767 534373 562836 496552 546912 619737 604188 581153 464488 410389 355775 294180 274203
12756 274203 289801 436682 561256 500524 415226 363017 375337 358430 350152 436992 622400
12745 622400 667682 752240 758121 710549 721962 745295 820664 843724 839701 843099 905384 968298
12733 968298 985884 1154463 1365596 1490691 1556490 1580513 1612390 1673742 1656522 1718183 1777878
12722 1777878 1800349 1841165 1905954 1960244 2001496 1997967 1985397 1971781 2080805 2193950 2278973
12711 2278973 2328302 2384274 2410082 2469296 2559608 2605071 2693118 2747660 2830499 2831751 2887250
12700 2887250 3082687 3195919 3298514 3425244 3587521 3628012 3625629 3609640 3698111 3676954
12690 3676954 3659879 3747447 3936257 4102393 4318405 4557310 4786634 5022690 5282236 5580637
12680 5580637 5844787 6111615 6530794 6948732 7372449 7881414 8405061 9028567 9794236
12671 9794236 10776201 12107427 13715199 15527328 17557202 19789589 22289968 24861118
12663 24861118 27580806 30436829 33509572 36876826 40387135 43618807 46287381 47825346
12655 47825346 48018218 47148390 45982298 45310064 45873595 48266001 52668037 59136479 67795150
12646 67795150 79526083 96027271 119613160 153088967 200903492 271392815 371279931
12639 371279931 480093840 520667438 446189354 335922499 253918466 201400079 167506618
12632 167506618 144746349 128858235 117123957 107679635 99299819 91899102 85574368
12625 85574368 80240295 75754342 71952475 68756861 65829746 63288864 61134168 59343469
12617 59343469 57852617 56704880 55773146 54964987 54347738 53969389 53832474 54005794 54519904
12608 54519904 55321194 56023703 56499639 56432618 55151467 52807998 50106705 47350636 44609369
12599 44609369 41932437 39577769 37400853 35229211 33204082 31300714 29571199 27925203
12591 27925203 26342386 24946352 23585085 22304077 21086147 19930861 18831977 17817852
12583 17817852 16848720 15860482 15125534 14363529 13715808 13247431 12684391 12069413 11486520
12574 11486520 10839211 10316412 9802213 9359807 9001400 8664828 8172349 7699113 7271067
12565 7271067 7028129 6809559 6573716 6274873 5951149 5536175 5336259 5129413 4865665
12556 4865665 4601878 4353083 4306654 4213307 3970708 3731958 3600578 3417640 3270711 3212473
12546 3212473 3036840 2801419 2641622 2550263 2505054 2454443 2374040 2244440 2165706 2077878
12536 2077878 1918475 1767367 1662219 1649332 1626447 1655338 1591814 1484872 1403373 1385327
12526 1385327 1382649 1336340 1282777 1208689 1198197 1263657 1304302 1340511 1361489 1384389 1463816
12515 1463816 1578305 1609115 1597697 1437503 1326540 1252947 1166365 1080554 1044768 927596
12505 927596 844587 784321 674880 720563 673360 636501 664659 666463 613087 708798 768674
12494 768674 839420 922056 969031 977541 945240 1033321 993848 987141 967823 980340 1020761 1055688
12482 1055688 1145418 1179567 1184121 1249579 1209375 1199628 1187759 1255436 1305525 1327995 1328692 1375298
12470 1375298 1361747 1306514 1360637 1478640 1460739 1433877 1417362 1462883 1515034 1674898 1730495
12459 1730495 1809910 1928918 1934966 1884860 1773815 1841553 1838801 1796955 1808793 1759314 1734016
12448 1734016 1796635 1831499 1815397 1776581 1777990 1751049 1856045 2063440 2174483 2123021 1971745
12437 1971745 1731349 1605341 1583580 1516326 1450156 1468910 1436285 1423935 1378048 1359166 1359075
12426 1359075 1283481 1285655 1253690 1337562 1293492 1232158 1259148 1232830 1185266 1190597 1197919 1179162
12414 1179162 1124816 1041811 956250 912654 920991 882958 861003 833907 847934 940191 931401 887261
12402 887261 797916 680658 695467 737565 819378 828472 837471 848223 838423 842114 762231 643468
12390 643468 606596 703253 739046 749101 826748 845456 814178 760798 680841 611860 573052
12379 573052 533725 530758 469347 456320 485703 502181 517853 516411 521083 495109 457285 397480
12367 397480 389533 342362 330901 362528 379571 336471 286926 222402 228221 254447 295978 342948
12355 342948 359747 502322 495536 446101 354813 344584 278758 288399 357690 396724 434594 436607
12343 436607 529193 624236 740240 722291 660201 560650 537523 575361 572984 549157 504843
12332 504843 435200 428542 497424 574303 563114 521904 404572 396426 378773 454607 485319 523098
12320 523098 507401 478846 461058 412104 451415 495255 483321 481500 467259 462312 481322 468575
12308 468575 466410 412932 346732 386553 441458 466172 494455 595752 652001 513461 383689
12297 383689 385879 364109 331107 411711 414001 383176 406919 359800 369475 419775 360549 329668
12285 329668 376587 412749 484488 461155 357262 339385 277310 284718 313720 274006 314498
12274 314498 297442 375863 347650 312874 222605 242123 302043 345849 359706 336978 233443
12263 233443 260699 266467 198303 194180 224215 235595 274377 196449 297369 354921 344647 373200
12251 373200 411471 398454 369811 295566 340231 324087 349664 368326 381022 347368 309280
12240 309280 314628 256727 226459 234265 245648 217277 210722 153671 184889 218490 221055 150561
12228 150561 120264 145351 225748 194935 250859 263639 278945 228472 208370 213197 240176 267832
12216 267832 286078 325216 405627 397301 390098 387522 425261 511527 532897 503306 515921 542133
12204 542133 554673 700499 805942 920042 1065714 1300878 1756738 2302318 2795332 2742329
12194 2742329 2231739 1691631 1354283 1227006 1057987 926520 818654 756518 739336 661733
12184 661733 618913 571467 592375 608409 506136 394119 462710 519884 556560 520150 511602
12173 511602 548579 592723 551774 500170 506475 495851 483264 428853 447544 539705 527491 454586
12161 454586 453008 491115 531068 524661 435263 418722 349328 254672 256774 332454 403243 397742
12149 397742 319902 213515 180760 182805 186433 217347 199187 214502 212620 288818 381745 471445
12137 471445 410883 315844 386139 395905 307954 254062 191293 157876 225065 196021 85816
12126 85816 94433 100511 83166 112951 146670 122600 202437 245405 226443 152111 65221 96463
12114 96463 181710 252634 157232 90096 77164 112356 153295 156243 44350 81292 226720
12103 226720 158719 97686 130960 87783 146211 160606 176566 196739 142743 102464 220254
12092 220254 249764 215264 184793 137710 138787 96065 42821 -1602 39691 112621 162673 171239
12080 171239 161776 103831 64141 63795 95570 153556 162497 193465 184986 169722 168950 164615 88375
12067 88375 96759 70445 -16434 31058 29500 67406 133409 139396 205178 206110 129077 89072 99071
12054 99071 97352 90215 65549 103795 115308 39451 25980 82264 101210 155681 164934 98528
12042 98528 140294 165788 195636 221532 209145 159080 90341 141687 174809 115617 68128 66820
12030 66820 96730 128380 153034 135078 142345 204323 169486 186750 158047 106639 82883 78819
12018 78819 138179 153986 202498 185666 188782 196678 251654 219310 158550 138257 127538 111287
12006 111287 61447 76077 115131 218046 201583 179651 184356 197317 248919 193306 192451 317770
11994 317770 321580 181677 157086 108143 64864 66396 26507 35146 15689 95477 145925 117630
11982 117630 110768 100019 116389 93751 118655 65422 48633 51216 58112 39355 51257 57113
11970 57113 45539 27868 27690 75674 120199 151743 149519 111727 154961 176705 127062 89314
11958 89314 43683 6503 9714 51679 121683 246939 257989 116556 62458 77620 35917
11947 35917 99189 106340 13055 -12658 49556 56029 28254 30156 29947 -33256 -86843 -27689 107139
11934 107139 181073 173591 105826 127358 190990 176862 189861 199138 134353 162271 152922 128663
11922 128663 33531 1028 22624 98067 116063 116035 68223 -1508 16859 142528 255630 263566
11910 263566 268296 188658 140832 65544 31942 46816 51003 8010 64453 68507 72542 102523
11898 102523 124026 50471 33742 59973 61284 109325 138378 109328 65594 77199 65309 129874
11886 129874 185611 164530 154985 161447 226962 193955 225192 207060 201679 194736 215776 290585
11874 290585 268248 194239 175636 192708 100888 27422 108098 269124 252466 110571 45155
11863 45155 -10278 -26231 3119 21386 -14534 -112622 -136875 -100823 -31903 -60775 -9749 -46175
11851 -46175 -40243 43105 84798 88267 107196 119825 87665 89669 74804 87282 131848 172132
11839 172132 200263 132866 113203 91955 117631 77001 21977 -23773 13628 25589 38145
11828 38145 27159 -62984 -17379 -25782 -53325 28253 124926 139739 137965 170776 139473 95607
11816 95607 115962 102038 136415 78150 15327 -17720 -14333 36664 122043 174594 160639 172267
11804 172267 179482 171388 180659 95161 69658 93546 83024 146246 79954 110908 106719 173062
11792 173062 159633 115528 122065 60998 58216 87629 80377 77832 160263 223336 153487 5102
11780 5102 427 54865 123132 147146 74664 19253 -18943 -9585 66182 127602 141344 160602
11768 160602 148441 145079 77091 55571 26443 -43470 -17768 -26666 -64818 -90426 -90905 -88695
11756 -88695 -59658 -54762 -92437 -97103 -119386 -114248 -13867 36424 26359 20450 85211 69258
11744 69258 111255 123136 178494 198668 157716 -34777 -61067 -114936 -95733 -89454 -86801 -41794
11732 -41794 -30844 -114824 -108341 -81687 -83811 -88320 29644 57975 -27836 -121973 -61331 -23514
11720 -23514 14813 41499 109955 126466 75267 69345 135086 158867 132845 125584 131793 131885 176529
11707 176529 152873 94110 87204 116353 71375 125249 131932 89028 71708 102376 146297 164798
11695 164798 97649 26095 62068 70197 54725 73644 151511 159437 123464 63267 31861 35810
11683 35810 77477 78839 74825 41311 -7275 2238 54116 94199 47948 3912 -89236 -81139
11671 -81139 -45577 -21880 29696 18727 25643 -19948 -24252 19885 51409 -24854 -52927 -4922
11659 -4922 109808 204026 190898 162886 120804 154164 137653 29195 -12126 33867 108866
11648 108866 124026 98871 67398 111826 112077 53871 64062 171722 215909 197132 192033 192235
11636 192235 150024 112182 92580 65122 40545 12594 -67430 -89311 34570 196968 136789
11625 136789 427 -46747 -67186 -28305 -38087 -26829 5593 67652 29954 -604 10718
11614 10718 70073 144910 106720 100304 99439 33354 -57751 -159753 -217563 -173479 -127997 -96495
11602 -96495 -14483 -16479 -48959 -88733 -5324 -20716 -18272 -54835 -17044 -24892 -119111 -98814
11590 -98814 -17319 -25056 -31029 31429 108056 91418 -3922 -22068 -14353 -21142 -20918 -107317 -54900
11577 -54900 1012 -46757 27932 82345 100950 85922 149710 109578 46127 34448 49158 110397
11565 110397 120280 65253 32876 80889 167676 200028 151330 116446 122218 78053 -6892 10588
11553 10588 27125 73392 30329 26663 -27946 -47378 -71854 2684 47690 -12665 19186 83511
11541 83511 128398 54053 -5309 11613 74914 42427 4621 -11543 -55769 -62652 -63678 13403
11529 13403 8134 -14396 20750 15223 35423 74118 86289 110930 98490 55104 74301 101229
11517 101229 111567 77621 100534 -10835 -132205 -87511 -30573 -30588 -38236 -68212 45531 17943
11505 17943 53667 41909 23937 68142 43190 18964 111423 115381 64183 15092 49356 906
11493 906 -26770 -79352 -98951 -51405 -57104 -65808 -58526 34885 -12219 -62625 -91737 -31256 -2795
11480 -2795 -59062 -53018 3596 41546 112780 102999 30876 -3043 24518 -30297 -56310 -34785
11468 -34785 -39055 -14958 -16415 732 103206 109958 47274 -12440 23457 88299 109862 145834
11456 145834 130050 173863 235643 185277 176983 153644 91428 18553 72615 36044 25753 28481
11444 28481 -45360 -19046 32719 16578 31219 71559 -3733 -30191 74737 87031 20301
11433 20301 19504 77910 103964 101416 137138 133706 148176 165375 130512 117788 172068 105794
11421 105794 69269 70447 50518 18374 27632 -13045 -46698 7010 -13648 -38832 85449 74548
11409 74548 15455 -55429 -74729 -66674 -65601 -66414 -19437 -57408 -141452 -160398 -161518 -124846 -96952
11396 -96952 -90202 -10610 -4422 33042 -187 14585 106953 143225 132234 26053 -64555 -87043
11384 -87043 40070 99411 117937 76539 118023 91057 54328 71207 67775 -30095 -75016 -96955
11372 -96955 -42782 -44280 -26169 28336 54704 -18705 -67270 -48355 -43006 -131521 -79637 -16018
11360 -16018 6729 12874 21674 92888 142480 136347 118067 14644 -21850 -110924 -151911 -163556
11348 -163556 -184060 -141883 -53671 -4052 -90243 -85611 -43075 -97345 -53115 -41933 -25266 25722
11336 25722 49164 82102 43659 15930 8447 -1748 20151 4137 -30827 -24217 31336 21596
11324 21596 -4864 -105913 -125565 -58608 -58629 -46590 -33633 -98073 -55544 -33345 -105693 -87414
11312 -87414 -3345 -11376 -35234 -71845 -75014 -119185 -138379 -86369 -80256 -34191 7032 37154
11300 37154 -19352 -110386 -106308 -96488 -108195 -14471 39770 16032 -43667 -25453 -19135 -464
11288 -464 -13493 24102 65838 130884 72515 -34988 -24778 10987 -46364 -102410 -84357 17074
11276 17074 20128 20825 49865 110014 112870 98231 163252 94073 75 -86446 -115383 -72278
11264 -72278 -103925 -34223 28690 -24880 -21475 13187 4111 -29064 -63919 -9771 52544 66658
11252 66658 81701 -544 20288 37274 7747 48525 76417 89932 -21654 -117391 -115960 -95491
11240 -95491 652 14908 6887 -9717 -24368 -16595 -58201 -72698 -12359 -36717 -113790 -119921
11228 -119921 -82902 -73154 -7617 36264 44640 11107 38073 91116 64542 51315 74085 81574
11216 81574 33759 -1756 71587 93754 88755 64968 10222 -60966 -124738 -37808 46586 -3026
11204 -3026 457 23976 65408 68692 22456 -59024 -57224 -6769 71050 14388 -38779 34602
11192 34602 64248 80180 110978 82967 37262 -23539 25156 72515 66165 131562 136901 124767
11180 124767 94960 73485 91886 121816 76742 100773 35398 -81859 -111588 -54213 -40274
11169 -40274 38702 90607 74770 37610 -10980 -24818 -30560 9799 94367 150633 99971 78064
11157 78064 112333 28560 24982 33338 12921 54766 71879 -6754 -11101 52312 33054 -11287
11145 -11287 -54886 -40935 -20321 22204 50002 54482 -3787 12488 32392 -138 -4856 -20304
11133 -20304 -88747 -89448 -93231 -116356 -98502 -23990 24272 52053 33264 65141 40730 37808
11121 37808 21803 -45023 -99414 -141721 -127038 -122807 -156463 -198861 -118931 -17302 5256 -70593
11109 -70593 -65343 -38693 -38786 1980 -35504 -39631 -58423 -31933 47742 25214 -11085 -14815 47477
11096 47477 144748 170696 85248 46479 -19744 -6702 -35544 -56959 -72389 -26888 93092
11085 93092 100636 132311 102488 66729 -15984 20489 204803 226848 278039 250720 120207
11074 120207 89416 80561 29122 -36294 -22145 -55226 -79667 3720 61592 80184 46580 88724
11062 88724 118053 147252 80383 26677 -3504 -26095 -20024 -71624 -20330 -193 -25359 -75866
11050 -75866 -42344 -52404 -84342 -90531 -87173 -51177 10368 -10174 -50934 17569 -16435 -2008
11038 -2008 7198 33023 44798 24594 -5422 -135738 -123894 -54747 -54270 -63571 -63825 -122594 -34982
11025 -34982 9846 -14269 -127899 -100762 -69662 -76590 -61475 -44000 20025 -15712 -58207 31150
11013 31150 62035 33800 -25324 43789 55519 35705 -25939 -28568 1609 35948 -27990 -47090
11001 -47090 16192 -36967 -59592 -63693 8225 28210 -23278 20189 85471 112275 110667 91158
10989 91158 101073 159984 203654 129762 94507 28185 -42069 -31322 28910 -15255 -55590 21945
10977 21945 -7823 -27221 -92480 -78799 -16191 32011 73972 -31485 -84560 -75987 55542
10966 55542 95845 15887 -7732 -2315 9594 72385 165039 170049 45124 -44021 -12029 -18433
10954 -18433 -70381 -102863 -78204 -19473 53527 48456 94581 128079 76271 62922 26608 27349
10942 27349 69896 37631 -35758 -78634 -80914 -68263 -8990 34089 85473 31635 -41294 -56680
10930 -56680 35611 144557 110733 25772 21579 -18358 -20097 -57263 -123774 -43132 26725 64595
10918 64595 56959 24323 41817 64078 119043 36531 10126 -40746 -80270 -123744 -84207 -42574
10906 -42574 -145090 -106196 -103983 -17948 50024 52989 58859 -16086 -77808 -62302 -45472 45665
10894 45665 129985 123929 24425 -14382 -64841 -77361 -29526 -16957 1140 10049 -1343 29795
10882 29795 54134 64933 8039 -22019 -80764 -110394 -67434 -108098 -142884 -119806 -87474 -28808
10870 -28808 30014 30251 18969 26498 71704 62582 -48991 -15418 31813 67505 5082 64383
10858 64383 145165 72828 3316 -38077 -55241 4396 -28734 -39093 -48853 -153635 -146002 -99714
10846 -99714 -58626 -82567 -70581 -40419 -59117 -27830 -19158 -52904 -177524 -166677 -126378 -55426
10834 -55426 -20025 -71988 -45040 29373 43359 -4386 -60384 -20779 103929 153625 100380
10823 100380 48627 30597 -3505 -22562 -82239 -103250 -54840 9072 18012 -43664 -78297 4035
10811 4035 14207 65891 63738 -15365 -36714 23536 19095 43752 47781 49365 55737 78038 62797
10798 62797 64187 70393 57113 5702 -12280 6533 42702 30750 24190 66268 51460 -119187
10786 -119187 -159766 -39386 89366 48479 6891 36337 -3444 12523 -1057 -14162 30366
10775 30366 35930 20541 -36302 -69852 -62063 2568 -28108 -44540 678 47376 23456 -17097
10763 -17097 7339 -3101 -4990 -18153 -32862 18733 81289 87757 18440 -45061 1250 29792
10751 29792 -5908 -18821 -49875 -84544 -65222 -17318 19676 64236 182186 130570 97731
10740 97731 87118 10052 -90109 -126575 -120607 -110035 -63752 22300 74988 106921 51606 47376
10728 47376 -7165 -27571 48774 105099 147530 133091 48317 -7208 -4893 -2553 68861 18529
10716 18529 32249 54012 96914 37590 32547 -14962 -58069 -3750 48817 51502 73503 -26645
10704 -26645 -26059 67320 152481 103398 29309 -83147 -99844 -19892 -48465 -98199 -53604 -61143
10692 -61143 -136337 -129521 -98870 -105388 -128029 -100587 -41318 -24367 -3193 -1026 -11731 -85078
10680 -85078 -77831 -104015 -151919 -145059 -155751 -101515 -12096 66083 54987 47382 56763 114668
10668 114668 125517 145730 111120 33072 43869 12075 96074 120754 4253 -14775 -50795
10657 -50795 -11341 -386 58236 45062 -55287 -114008 -34071 -73 83389 172085 200087
10646 200087 132822 75847 109769 125553 78587 -49889 -44484 -8846 10398 45803 81369
10635 81369 74046 54648 61696 86287 20652 -7235 -38099 -96673 -67883 83172 76322 -15274
10623 -15274 -17455 -53153 -113232 -102183 48573 136118 144184 72937 107058 133567 62245 75463
10611 75463 104297 76058 100818 108660 8981 -62350 -23660 115914 154210 54212 47451 63899
10599 63899 -8506 3401 94498 64195 -90 34584 81394 39727 -56054 -62555 -11621 1452
10587 1452 23305 -33637 16830 122053 83168 42273 -53994 -115534 -143443 -75699 -64514 -89645
10575 -89645 -64271 -46762 29822 24712 43709 56261 56674 81559 34738 67740 125443 106599
10563 106599 117228 12235 -99288 -90664 -77601 -89245 -46735 -45939 -29297 12954 -14389 -9006
10551 -9006 -25478 -81869 -134282 -82325 -53431 112713 242885 255466 65786 19765 34624
10540 34624 30529 66889 172552 247319 205512 198058 289869 350557 235874 100193 24556
10529 24556 16207 57785 112769 121719 115596 113130 140318 48137 -40172 -30060 16067 71432
10517 71432 41087 -61991 14185 36253 19952 -8477 -41241 -50827 -20083 -34777 -24287 70445
10505 70445 79137 53617 61042 90443 62736 6916 -43819 -192661 -226075 -144645 -195329 -160417
10493 -160417 -71234 6444 -15053 -83321 -37519 -100305 -102504 -84727 -61183 -47563 -41372 -16652
10481 -16652 13739 112465 131059 116863 152393 123893 130257 40624 -30600 -159950 -224542 -167560
10469 -167560 -76979 -52700 64033 89842 10359 -28997 -30632 -43868 -47609 -24369 -50099 -74476
10457 -74476 -109313 -38974 38299 -2098 -28887 6736 15106 -43413 -22478 69221 105495 52449
10445 52449 20008 22392 -6055 -85919 -56646 -75353 -83936 -18680 49026 -52558 -62468 -22379
10433 -22379 -9522 -64147 -67579 54526 23864 -9599 -25612 -94987 -104821 -32553 -5310 -5591
10421 -5591 2214 -144 -23561 -36531 -32097 37010 18731 -50934 -85386 -49236 5803 5247 16063
10408 16063 -70804 -31509 20562 128169 136302 78378 69436 -54248 -84434 -83631 -142959 -36067
10396 -36067 26243 -26808 -5759 6099 -15286 -75825 -126308 -181566 -111292 -28668 15115 20754
10384 20754 27325 -2763 -27559 -16942 -53008 673 -9648 1988 40615 -86805 -176120 -147717
10372 -147717 -118038 -84995 -69032 -89358 23488 67672 64557 33275 64977 107445 45334
10361 45334 -5987 39106 19719 -56251 -93756 -36276 -81941 -61055 -12689 -20356 1584 7019
10349 7019 -115720 -115771 -101238 -80530 -63183 -36732 21905 46216 10221 -18523 -48739 -9996
10337 -9996 112233 85859 72107 37549 -18474 -40662 -33017 23194 125798 210448 194224 93738
10325 93738 15162 -4279 -12011 54718 30685 42332 130642 135264 108910 110766 101935 88482
10313 88482 126936 132644 118433 173209 175110 128143 1250 35424 93041 141243 111478 135295
10301 135295 151809 173331 111864 88787 28110 20995 -6017 -3544 73157 73199 41099 39587 61334
10288 61334 71793 117988 126639 78366 24149 15558 19769 22029 58073 119695 85423 42225
10276 42225 33126 18168 -49441 -18493 111087 169168 147524 98454 -14614 19580 324
10265 324 -52251 -12423 22326 54131 26224 644 -6380 -49597 -16632 -50682 -65176 83123
10253 83123 72675 -8901 -34665 30917 5532 -19616 -9701 43877 105844 144949 73189 -8619
10241 -8619 5452 -7962 -39179 25123 37574 36572 5583 -42589 -19493 94703 100945 61125
10229 61125 3660 897 -49909 -2487 58842 20817 -49018 -7657 11338 39280 65247 121130
10217 121130 106522 72125 128033 77102 46304 67107 145467 147326 73121 113340 131193 118828
10205 118828 91548 62430 86106 91370 67442 50738 100511 45103 -34354 -60290 -82056 -63549
10193 -63549 -18490 127713 153540 104645 106979 59969 6057 -45815 -75942 -40355 -50150 -2610
10181 -2610 14844 12846 12078 -7275 -91682 -61567 -33190 14055 70359 41488 -51697 -32853
10169 -32853 2340 47096 64059 146300 119001 -17097 -90518 -65076 17429 74954 71836 22896
10157 22896 -36884 -111512 -87287 -14406 -30313 -40547 15590 75071 85648 81075 119080 50813
10145 50813 -42645 -29311 -9326 34981 63522 20980 37256 30473 51828 70903 53288 1834
10133 1834 -44888 -37372 8035 15995 35108 54484 11113 -81748 -114346 -57845 -17185 -21128
10121 -21128 -25791 -22646 2545 17859 -41413 -85179 -13680 -37422 1452 84071 30833 -47494
10109 -47494 -14350 59653 21264 17591 23327 30290 18586 38598 43043 -30303 -41808 -64598
10097 -64598 -104668 -113709 -162958 -181964 -178586 -136961 -107906 2605 29504 -21591 -34525 59553
10085 59553 64191 118235 59476 -64265 -117455 -220655 -193230 -104400 -62932 -58964 -101569 -131041
10073 -131041 -82223 -66116 -66512 -93607 -112931 -92540 -83619 -42890 -4932 -4572 -31095 -61170
10061 -61170 32156 124368 68692 72565 143478 149524 148689 98641 151147 326115 377745 247620
10049 247620 134248 34426 28762 71307 47914 37191 40296 29969 -14373 -72633 64 47536
10037 47536 53350 -18164 -58137 36031 50346 9774 -17724 -14202 27305 32971 -10877 -3315
10025 -3315 11269 80238 114015 44152 11822 1188 59462 68648 83517 111569 92481 70392
10013 70392 97991 71376 32500 66285 22677 -13636 -18111 -60256 -36039 -55161 -69687 -31905
10001 -31905 -133152 -123823 -66758 -65293 -19612 -24697 -54891 -77148 -102651 -102227 -26439 -10804
9989 -10804 -35144 -120625 -165432 -137330 -82787 6730 81618 72587 52284 -2630 5183 -56361
9977 -56361 -87751 -17751 97227 97333 86548 -1927 -137687 -123780 -51274 -84535 -34791 -86681
9965 -86681 -103092 -66188 -5171 9916 45106 68636 45088 -79037 -110205 -33470 17709 17616
9953 17616 40162 87563 140371 48096 -71812 -50912 -5004 6296 -68583 -49931 -34796 37999
9941 37999 -85303 -75543 -43076 -33229 -18866 -59848 -142957 -114360 -91938 -63862 -66363 -110118
9929 -110118 -11789 -27692 -4483 23797 19578 27473 2507 -7956 23208 40892 64208 39327
9917 39327 58289 101433 87446 23091 23563 100385 162671 147074 100686 125499 148837 150609
9905 150609 115482 16462 -45939 -46679 4546 -24105 -89149 -67798 -3587 -20061 24284 39122
9893 39122 -24673 -54428 -59893 23480 19624 -1742 -10115 15325 1714 -12022 -64769 -21767
9881 -21767 23557 9048 21807 38346 30508 49022 86315 49561 26250 10118 15363 8885
9869 8885 34026 45232 -36004 -69486 -6314 -54910 -112141 263 41079 18708 35686 24685
9857 24685 -9934 46771 53169 21556 50612 62882 -11526 -81428 -40240 6810 -26456 8497
9845 8497 23788 -35971 -59159 -22299 -35542 -100165 -129276 -91211 -98425 -8399 -21093 -16720
9833 -16720 -54302 -65189 -95322 -141898 -68597 -71327 29916 65330 -2173 -42092 -73524 -19459
9821 -19459 40069 -8393 -10833 -1977 -667 66388 54283 -41005 -74594 -107334 -55651 2617
9809 2617 32598 48388 29890 76984 126647 150958 181010 125266 84582 32187 -11840 19955
9797 19955 -21186 -4465 -55567 -43900 4875 49488 97912 76951 16478 -2508 14743 24082
9785 24082 19429 -62681 -79566 -31062 -9512 -33127 20741 45661 61053 79828 167860 68293
9773 68293 -4839 79041 102212 18270 -44371 15674 48459 17602 -60100 -95929 -11427 85242
9761 85242 64016 13463 15324 -29014 -61989 -29007 29510 12580 16133 10832 42033 39087 45193
9748 45193 52430 3661 -8661 20637 72078 77774 -907 47437 84365 145589 180911 199445
9736 199445 209816 108756 107188 81852 42974 102531 80636 26350 -66331 -108625 -131445 -87087
9724 -87087 -65440 -137331 -162638 -53753 -131393 -155721 -135710 -94560 -102426 -89699 -71288 -45717
9712 -45717 15570 118281 185443 165243 185544 122445 29425 30764 38364 81352 49348 24675
9700 24675 13261 75717 90601 30976 -7476 86802 109243 129027 130142 109351 112062 74201
9688 74201 -9142 18849 58668 86081 74400 64125 27477 16877 20159 -72390 -208706 -264192
9676 -264192 -233252 -144129 -94957 -52099 -74258 -135686 -179824 -106992 -45989 -52337 -94462 -81425
9664 -81425 -54138 -59029 16004 68572 13579 -46502 -83076 -81794 -39710 -95469 -127407 -144829
9652 -144829 -125615 -88656 18571 39265 -51768 -89102 3439 -51834 -101036 -147073 -81813
9641 -81813 -3166 45702 55177 31003 -39672 23494 66068 109836 127466 91623 12566 -50421
9629 -50421 22753 58873 49494 -3325 -20066 22114 -18257 22604 93003 84941 85047 63866 96405
9616 96405 17106 -31367 8750 58166 74593 81333 5556 40689 27922 -119516 -163093 -97552
9604 -97552 -92686 -71432 -49860 -64029 -70527 -84015 -109912 -126005 11926 132209 91917 79330
9592 79330 98508 50856 80102 103387 104873 54441 47693 68562 68584 47087 -43413 -51155 -12508
9579 -12508 -32252 90932 121528 93738 41137 22807 33589 42535 42518 52747 -22035 -59515
9567 -59515 -19797 43103 7460 19517 71856 134526 105063 77270 82019 56243 34217 73583
9555 73583 52987 29515 127498 236424 182847 232754 277621 233973 124839 117381 71438 51364
9543 51364 96871 77090 -513 -83109 -79669 -28777 30874 42687 37223 -10797 31290 95186
9531 95186 76826 39695 4281 29207 135 -3401 109869 78971 898 -17090 15731 68118
9519 68118 91986 74555 41343 39422 115886 151436 116455 -23649 -156377 -82314 -10147 -497
9507 -497 16548 84390 61308 23657 5824 13121 41008 -8417 6978 63398 60483 78985 78314
9494 78314 133207 98177 97086 158665 142045 157303 160406 89634 110052 79518 74488 51528
9482 51528 28275 -58925 -91538 -28583 126781 179221 201874 98827 59143 59588 -3578 33264
9470 33264 81320 63150 -25565 -66095 -36323 -4036 89620 35380 -73004 -42097 91860
9459 91860 155755 83056 14844 -4624 65505 85358 23115 40217 86801 3493 -77403 12295
9447 12295 34945 27005 28038 55748 46317 -28448 3078 42832 39912 44760 -15897 -9643 -75942
9434 -75942 -96735 -33664 23655 29874 -31275 -66988 -157670 -95586 -14200 42067 43724 -19487
9422 -19487 -17744 -35855 -50019 -27668 2806 40110 27577 86897 117895 83739 35591 90448
9410 90448 164388 128206 76844 -23290 -51972 -67250 -108817 -166122 -33117 87873 100898
9399 100898 52103 58121 -3858 -35435 77368 140354 137162 39258 -20227 -41213 -43616 2746
9387 2746 81568 133282 131304 127101 86983 22084 -42574 -12745 -4674 42353 23489 -38239 24161
9374 24161 43518 53169 33199 60961 120266 55642 25897 -15524 -2866 8492 28770 110036
9362 110036 169709 179848 122844 130910 112674 101975 67596 117209 133158 138985 139867 131673 81860
9349 81860 30978 80277 89671 144220 191696 192951 150789 119160 115835 49765 -17761 10755
9337 10755 64155 72916 146210 229047 242800 288791 173938 61838 39248 103592 168265 181655
9325 181655 151615 174387 180278 241353 230462 200029 159569 196320 203966 237199 163602 159680
9313 159680 231801 226528 190477 245659 215986 301447 481945 556471 512810 441831 412647 296180
9301 296180 223354 262911 239511 194944 88407 136269 268377 321628 212235 223085 248023
9290 248023 260029 326936 292900 270904 291067 359487 355093 398913 465683 502291 468838 466335
9278 466335 476626 499985 498898 502787 471093 514533 633863 767357 848016 843742 754258 639547
9266 639547 553333 568647 528263 484779 457680 560000 589697 531208 621586 695525 654637
9255 654637 610451 612521 494459 471972 475964 484721 545573 543933 537405 471554 435988 323783
9243 323783 339580 355113 339630 357452 403620 488739 572101 470952 427398 535259 549580
9232 549580 488537 460895 479237 560906 530772 497071 495504 539924 553952 598351 595702 663386
9220 663386 645564 669698 652153 652719 677174 589659 478837 485758 539379 562911 588703 628196
9208 628196 606808 657568 674263 709489 784204 838024 794599 741082 705596 772681 765455 682508
9196 682508 602238 655275 714722 669818 688420 750205 857553 973002 979700 998687 1032141
9185 1032141 1040220 1106104 1173277 1162256 1163448 1159188 1218787 1178930 1204003 1260842 1327316 1348380
9173 1348380 1303536 1288254 1367811 1399136 1409500 1405801 1445007 1513300 1594907 1623012 1607754 1609330
9161 1609330 1693303 1751680 1826412 1840267 1887598 1908148 1828575 1858789 1865859 1957030 2107320
9150 2107320 2133854 2168280 2199480 2252827 2206122 2249270 2309995 2390894 2428589 2477501 2525426
9139 2525426 2587600 2650821 2734392 2780141 2796301 2807688 2824874 2947783 2962223 2963939 2986519
9128 2986519 3082756 3135130 3227891 3323557 3360319 3429569 3475276 3567338 3637297 3608370 3622985
9117 3622985 3594204 3663788 3776946 3803649 3812985 3901766 3944237 3969180 4034975 4017175 4007171
9106 4007171 4110649 4119143 4083780 4174090 4184351 4244028 4299478 4303803 4358437 4365785 4355471 4362000
9094 4362000 4459734 4501384 4495497 4406687 4419020 4504579 4499879 4518578 4484381 4472163 4570143 4679775
9082 4679775 4606658 4544314 4554615 4512102 4589138 4672863 4687566 4655677 4688960 4693547 4672937 4665142
9070 4665142 4648065 4634178 4685627 4712862 4759624 4702073 4690907 4685447 4725404 4773960 4775332 4768267
9058 4768267 4707222 4689552 4749467 4772893 4728085 4741292 4744244 4832341 4845883 4828154 4890781 4868943
9046 4868943 4881090 4889702 4893982 4911862 4910967 4903142 5011614 5048256 5130574 5169657 5197908 5253369
9034 5253369 5333946 5302908 5226246 5219544 5266598 5458612 5559485 5542555 5562307 5695509 5787842
9023 5787842 5877841 6010214 5987961 5947014 5934909 5957340 6010910 6129889 6279032 6331337 6443410
9012 6443410 6510055 6571525 6639214 6675005 6799387 7037643 7224084 7292052 7459366 7614295
9002 7614295 7767483 7937521 7961773 8075625 8264300 8478434 8583867 8772152 8922066 9068757
8992 9068757 9293670 9464636 9646732 9909882 10169057 10358707 10518567 10713086 11119089 11443951
8982 11443951 11671207 11916875 12138019 12376800 12637456 12976122 13308097 13572141 13917554
8973 13917554 14417376 14904533 15203017 15459082 15845580 16349278 16736792 17104607 17494357
8964 17494357 17821338 18162707 18577244 19005827 19451061 20041038 20537078 20926216 21313659
8955 21313659 21726791 22115825 22536831 22995582 23407179 23831165 24133521 24446373 24717475
8946 24717475 24982772 25202788 25316026 25533689 25808106 26087532 26271911 26384134 26444553 26483564
8936 26483564 26505649 26469677 26330350 26237343 26157026 25993941 25819930 25595444 25312781 25118071
8926 25118071 24963002 24673822 24283361 23958722 23671617 23352591 23050626 22821299 22434832
8917 22434832 22058717 21620714 21265901 20917669 20634254 20259690 19850548 19475266 19093273
8908 19093273 18693955 18306549 17878494 17504996 17125094 16829378 16512585 16146350 15867306
8899 15867306 15510082 15140045 14860280 14432053 13992456 13772839 13501711 13179270 12794432
8890 12794432 12493633 12318705 12117192 11948525 11807285 11608413 11243652 10914634 10565260
8881 10565260 10240667 9896478 9608252 9452342 9161367 8864937 8590890 8294489 7988729
8872 7988729 7717306 7576972 7505460 7322740 7211442 7024782 6876757 6674366 6358588 6067144
8862 6067144 5842863 5657404 5559311 5378395 5231852 5194089 5044419 4938999 4860226 4756257
8852 4756257 4696956 4593228 4459249 4306847 4191628 3999345 3928980 3902910 3918064 3868703
8842 3868703 3707343 3560651 3474382 3326826 3274618 3233483 3142733 3041122 2912655 2922598 2855919
8831 2855919 2736402 2616351 2526117 2429502 2418456 2430707 2369953 2338364 2272236 2166829 2166956
8820 2166956 2149887 2136375 2122438 2071245 2020882 1986885 1965009 1878696 1837877 1845568 1848899 1857027
8808 1857027 1781123 1635549 1499782 1502052 1566181 1516463 1442767 1491065 1488613 1551726 1474887
8797 1474887 1483022 1441073 1354109 1388333 1356325 1314315 1282388 1405826 1448609 1320786 1256563
8786 1256563 1191171 1137711 1120380 1130996 1114220 1145430 1200880 1161283 1133697 1132182 1105495 1094333
8774 1094333 1066343 1028589 1114923 1081949 1099787 1158854 1119843 1101277 1016520 1012959 979260 984359
8762 984359 985784 999001 981227 997104 1056954 1091528 1027989 1023510 992338 986765 896153 839095
8750 839095 968758 1112920 1057845 1030608 951680 881730 828907 814946 775159 806653 842642
8739 842642 796151 880792 922697 915746 893091 887869 898624 838747 747314 816246 862643 859462
8727 859462 898229 924511 872466 788476 763140 725044 710313 763571 790700 864780 903580 885767
8715 885767 824334 664909 598958 584461 669071 759640 703927 628659 669885 741631 762993
8704 762993 718688 668353 685605 665044 574940 582382 616012 615740 524840 523704 535536 561363
8692 561363 576398 604050 611133 579434 631328 663510 664194 696791 754152 776837 750528 724353
8680 724353 742239 826825 944411 872447 779576 649651 544725 520356 570335 577916 558487
8669 558487 604642 673694 687245 671682 643238 645199 645317 593857 555828 502804 541924 532582
8657 532582 600687 659230 575184 522916 550922 607956 615522 602714 650043 679299 669254 726770
8645 726770 716558 682629 680895 726235 707344 755349 711990 803930 872709 855406 843922 856331
8633 856331 807840 759759 785334 835087 931535 909668 930060 950623 959649 990781 1074326 1151338
8621 1151338 1131345 1081340 1189598 1260801 1223167 1220488 1310424 1258646 1306243 1321478 1422738
8610 1422738 1490262 1606834 1747375 1789407 1839051 1827666 1795269 1792381 1803574 1779361 1623900
8599 1623900 1457943 1352762 1267158 1220425 1220371 1233740 1249401 1222858 1190068 1062787 949791
8588 949791 1016640 1089482 1009085 963719 995937 1002848 967497 941517 946843 980445 952634 914915
8576 914915 950501 1010732 977289 846253 755759 771914 812162 790600 690222 682204 764106
8565 764106 770286 725901 750029 722544 688992 695974 638642 548634 536840 496791 458369 451023
8553 451023 530085 632977 638325 663682 671554 681412 643868 544111 449588 551580 631256 606258
8541 606258 585051 615432 669545 658341 536942 480895 434765 488684 496346 536787 621184 578384
8529 578384 511183 407470 353377 377026 415603 437893 448298 518340 516035 457427 428885 421725
8517 421725 446567 429579 375205 439026 424274 316296 392684 323409 366979 359999 319643 376321
8505 376321 396251 352358 331243 348248 312241 267247 318497 432635 485149 487700 490075 470616
8493 470616 358319 265647 238579 232347 229317 230575 229909 282814 239295 289236 367075 320364
8481 320364 217082 197933 242450 205181 259233 276760 324637 366971 412970 398077 347952
8470 347952 373030 351228 306529 348830 398724 381977 392044 315457 258932 220770 259958 284644
8458 284644 251732 251291 264657 319544 331945 236001 266669 241152 200083 199954 354237 414232
8446 414232 323580 232867 229423 276424 285456 316519 254827 234847 388781 463917 372660 372264
8434 372264 328478 382154 335914 268118 316826 345455 284210 246033 173719 146305 195870 173404
8422 173404 100244 152184 182126 179116 197095 177019 289524 356456 296400 303918 274284 297179
8410 297179 301959 226625 202611 272799 284244 194190 166768 242068 258804 272807 347282 308598
8398 308598 234624 290101 321636 281332 193635 149673 162482 214899 180629 137357 201422 207494
8386 207494 153249 92112 106519 63250 92044 209802 169349 147758 264550 272662 246145
8375 246145 290150 324760 288719 204161 230153 230626 229109 222262 275291 320112 285997 302090
8363 302090 230981 192354 291316 288910 323409 356583 280777 272184 310087 311896 297309 220392
8351 220392 201132 243369 239486 249396 248669 298165 357610 340144 196035 155051 71417 67035
8339 67035 79968 63474 96697 132081 141636 152513 145587 146375 163505 202849 243565 239223 251826
8326 251826 263632 279838 212530 268498 362911 281694 258718 264129 338900 284609 294918 256058
8314 256058 133840 197559 291332 317683 326135 240987 215956 176059 225444 192747 167066 205593
8302 205593 193024 184530 218418 169753 116871 130850 106281 98964 114071 82639 92943 156384
8290 156384 205922 178222 177514 203357 164060 215437 227223 229985 243932 265457 248718 143079
8278 143079 104482 146334 55267 44830 177096 194662 155255 63669 46396 103468 119695
8267 119695 151873 194374 223475 183606 126672 97240 198887 228639 276012 352461 374373
8256 374373 354598 287815 206982 126462 97503 147790 92692 176871 251637 233802 235396 260528
8244 260528 246753 224117 162574 161096 192121 126135 90550 86856 64851 42384 38415 139166
8232 139166 187302 254727 300664 290205 312813 320970 235374 126313 27546 19958 75880 102008
8220 102008 51644 25463 67819 103142 28271 49409 94493 71583 105252 247940 279967
8209 279967 288395 190484 120983 147823 178895 83191 -2787 54629 108532 81222 82059 96557
8197 96557 60569 80112 154549 173902 170777 174231 191259 163003 196074 128578 132433 202738
8185 202738 219442 247570 302098 240375 181623 213685 177742 129494 200060 233900 180925 167865
8173 167865 194368 151075 70009 126847 110538 69947 73291 144218 130217 162707 214808 178717
8161 178717 154974 65322 29977 46651 67830 59484 97407 173248 254951 190573 112336 94613
8149 94613 144205 143733 129507 101697 124566 158575 197674 160229 154035 258183 248732 206870
8137 206870 138498 64921 161000 297505 334929 304027 242823 166279 156918 192975 188116 164890
8125 164890 181603 188067 185940 137889 101577 112086 104118 102240 65146 57046 76612 154114 171094
8112 171094 156963 201737 212157 252122 168547 120870 134847 143320 152908 138190 165361 188965
8100 188965 142637 141381 195838 206082 159565 111850 115512 185307 115915 129895 172242 172921
8088 172921 140661 128256 157253 145046 168049 226835 207582 146161 171830 258254 233067 195689
8076 195689 127043 157214 211835 216071 170445 142056 176149 224018 261161 235858 215720 276327
8064 276327 300753 309239 226745 239277 213454 211830 216410 224621 233816 263152 268631 236932 190067
8051 190067 116036 178543 242192 236159 207287 207129 182291 213387 230936 181103 99092 161666
8039 161666 158384 144458 179926 194020 213140 175463 180748 253194 347546 359519 343877 301955
8027 301955 262613 310489 339414 361185 397340 367569 312605 247997 239334 324788 414242 447303
8015 447303 518809 536168 477491 549526 595839 505598 411472 414698 368553 327629 421744 488158
8003 488158 522271 552857 446446 366790 381980 423304 371108 317935 311931 295611 267571 300185
7991 300185 265103 302252 364895 374155 306285 337305 345709 312706 295021 316494 372647 460986
7979 460986 535253 498183 475445 541794 623536 619753 606733 512452 426044 492189 481940 480576
7967 480576 539761 543731 521939 436933 529563 573075 581281 557471 606533 604664 637922 490209
7955 490209 376284 386373 378107 417820 398986 341626 327155 350699 380554 396034 356533 286079
7943 286079 252061 323225 398440 385967 323043 258133 290091 404055 523752 473371 374053
7932 374053 356421 374203 442320 487204 565059 559063 517323 489434 397809 359768 369001 298978
7920 298978 320930 311664 376938 428483 369039 335825 357995 358072 301590 238983 279257 296074
7908 296074 198785 134148 107244 234056 269399 180256 138122 100063 112726 198915 291352
7897 291352 274734 125057 108873 237768 215138 112652 70236 169216 200102 150873 228249
7886 228249 236807 118400 13654 70957 145936 166785 200785 125654 102766 92696 103071
7875 103071 150406 182173 165081 142612 188941 198626 183038 213471 256555 240006 298277 350764
7863 350764 322459 270198 146167 82741 112252 163565 159464 80667 30068 71353 144436 61835
7851 61835 8778 61634 93246 118508 108594 84569 67315 -22927 -35820 60370 44009 -35037
7839 -35037 28083 71957 152603 164497 117162 49377 131633 139624 162672 169394 171766 129043
7827 129043 65495 83455 127938 168417 116385 161237 126564 34279 -72427 -58018 7124
7816 7124 28114 -39631 3574 50901 43065 7227 -38537 -12836 -34130 -94163 -63160 80137
7804 80137 89329 8570 -8230 402 30557 169167 187367 94997 73381 121185 195185 123591
7792 123591 111636 111982 104313 95751 79811 48457 71895 87773 125172 102296 121347 106006
7780 106006 103798 71195 32626 29553 51259 79033 128331 113156 91574 76472 73439 88265
7768 88265 147436 135294 10131 -68837 -81305 -82600 -46772 15755 97161 147453 131070 70982
7756 70982 105736 110869 -29966 -102131 -62103 -7441 72280 102860 31729 58969 30250 -33594
7744 -33594 38255 83891 58760 6928 -42728 -67895 -57668 29739 42036 1853 -50498 -67789
7732 -67789 -15032 56185 5079 64350 55159 32164 66166 107279 137686 75565 19043 37133
7720 37133 -129 -9100 -62751 -95310 -85821 -75101 48241 22236 49802 112340 47746 -43555
7708 -43555 -73048 -91876 -152863 -107974 -33494 19051 18529 28907 32051 18789 -24990 -48349
7696 -48349 58524 29607 -108446 -82466 -49990 -33656 16544 36152 8003 35009 12527
7685 12527 -2171 -47918 -25333 -7315 23807 56285 115669 65378 47052 75713 111128 101460
7673 101460 50747 111362 117720 57198 94572 55881 51949 62253 111674 48530 62055 -69548
7661 -69548 -96230 -67384 -47236 3169 35297 41020 21222 69577 150115 206123 157716 49983
7649 49983 -74158 -39217 -28613 -99441 -92765 5611 -20709 51589 34243 42278 12574 -23462
7637 -23462 -20564 -40937 -72267 -93609 -111470 -84232 -30562 -41360 -103967 11377 54492 5308
7625 5308 3842 54118 64577 129662 172657 86590 -25683 3716 54063 28969 34960 20364
7613 20364 89666 114698 76607 46466 -5984 -57696 -16418 -2181 74770 47891 -57185 -69634
7601 -69634 -45917 8965 43088 8562 59783 31683 32620 100233 50800 13211 44679 84392
7589 84392 15428 -3274 -21758 -10567 -2866 -13498 1766 63482 101061 92020 108827 126675
7577 126675 129915 86792 39943 -33440 12980 117734 71097 -46168 -49594 -56045 -97323 -85148
7565 -85148 -94873 -29565 7935 -73775 -60500 -9118 5013 114749 68377 6230 61041 170640
7553 170640 215543 247017 204485 41772 -8137 148975 74819 -40192 -30367 45410 3845
7542 3845 41039 -38309 -31108 23886 66981 52930 5952 11787 39012 86627 58605 14295
7530 14295 108618 224540 244586 155082 9542 14719 91125 99510 45892 42975 -468 -6256
7518 -6256 4780 -23360 292 -83089 -83218 -8448 7469 57581 48816 -2971 7978 -15011 -24185
7505 -24185 41448 107068 70375 53539 51826 161169 167779 165002 131058 55661 -16498 -29308
7493 -29308 83991 121653 103721 77226 51660 31783 90083 117002 132283 107420 39935 -29923
7481 -29923 -922 31146 11704 -39151 4173 -8216 -51300 -90902 -87110 -50661 -13538 -32858
7469 -32858 -109769 -102941 -36553 -18537 -3495 23770 28066 102464 197846 139161 23506 -5738
7457 -5738 -522 -69101 -81074 -124238 -211216 -253184 -169703 -98680 -68718 8647 58418 66469
7445 66469 36855 106573 80661 99212 106511 162176 124290 81971 122602 144475 89332 123076
7433 123076 116080 85558 112908 131949 118393 38790 7211 -25839 18741 9674 -22586 -96533
7421 -96533 -91191 -24705 -60068 -76998 -130005 -160746 -142126 -113587 -134866 -157351 -170802 -141682
7409 -141682 -99416 -122153 -71750 -18619 91068 70552 53583 29985 50129 64026 41281
7398 41281 -46461 -96471 -41754 -14002 -62605 -88225 -93677 15028 5893 -50979 -73214 -71224
7386 -71224 -58587 -48912 -49179 -21816 20890 19190 -35807 -104001 -126648 -75389 -82583 -18131 29328
7373 29328 51234 36376 -100137 -152043 -80387 -17024 -20246 13402 -24350 6220 -30480 -2927
7361 -2927 115994 98179 -45618 -45345 -27740 -3596 -9976 30802 28887 5902 -61115 -105834
7349 -105834 -111814 -100293 -129107 -84219 -54498 -47848 -73484 -82155 17478 69937 76470 79377 30912
7336 30912 10130 2355 -27885 -77238 -194211 -193167 -112627 -105164 -94128 -28997 -9848 2759
7324 2759 4843 -3909 -78211 -120845 -122923 -153131 -159841 -64249 14641 -41303 -16788 -22896 -14533
7311 -14533 -50387 -56488 1042 43687 13257 -66756 -124266 -100275 -83121 -16255 -2314 -37790
7299 -37790 1768 3904 32219 121796 156432 77401 54342 71188 153860 128264 77302 -43006
7287 -43006 -78809 -84474 -70593 -54033 -68418 -86504 -68113 -48614 -25861 -86857 -12683 43754
7275 43754 -15256 28266 43600 4734 -39116 -44280 -68489 -138270 -86876 -34297 -9373 -62625
7263 -62625 -85105 -65683 -47343 996 101744 127901 83700 -30610 -66683 4431 43628
7252 43628 43815 37982 -3321 -36670 -34143 50635 83689 46007 -19829 24825 38720 41644 27056
7239 27056 19546 32872 125237 92959 102471 137561 129632 147177 177445 122827 106621 40851
7227 40851 24704 40021 -45828 -100084 -99402 -66995 29356 97966 7567 -43190 -30787 20885
7215 20885 -10187 -103455 -147848 -85738 -62189 -89378 -33695 41012 40028 64593 72779 42927
7203 42927 42078 32358 68960 28528 -4570 -33038 -59182 -78734 -124149 -124889 -24342 -2095 6130
7190 6130 13264 27673 36642 47219 31708 15831 7483 -19644 -15560 90274 95350 71037 -27870
7177 -27870 -11626 -14235 11207 -28371 -48709 -7712 -22498 49293 24860 11494 -15388 -32735
7165 -32735 -47832 -75782 34736 65692 -4373 -29249 -65587 -95405 -40499 -65988 -137339 -75581
7153 -75581 -47557 -20165 17679 44361 34778 21487 -58322 -152430 -164709 -136449 -95525 -136606
7141 -136606 -114470 -50044 34093 1433 25569 3458 -74801 -35852 16444 -57217 -112380 -103429
7129 -103429 -99244 -75596 5182 21448 -41487 -60671 -61655 -44170 87987 133783 112591 68737
7117 68737 42185 112375 154771 128170 77816 -33890 -69687 -59981 -1546 63134 19424 -53125
7105 -53125 -125171 -80222 -23549 24527 119067 7895 31024 52448 41626 -26483 -42814 -61629
7093 -61629 -34777 -54497 18566 -9197 -14049 40497 49449 32887 -39445 -61377 -36469 -2895
7081 -2895 45484 -6506 -39308 -112987 -164841 -202716 -200393 -145227 -55899 -24615 -55377 32711
7069 32711 52554 7131 42297 133177 129599 121417 99989 61051 71246 40275 66337 14856
7057 14856 -10308 43163 6361 -41786 -77870 -68781 -21449 -79714 -126913 -136033 -3626 -6498
7045 -6498 -7772 -76294 -121135 -62953 -10865 -98063 -150662 -121635 5598 76061 162532 135468
7033 135468 153232 136400 64767 17459 -20570 -28181 36218 73365 76130 91918 100046 67288
7021 67288 63029 6907 56059 31130 -17326 -12286 -46628 -80545 -38390 12415 -30436 -88085
7009 -88085 -125363 -47771 64522 159763 84208 34225 62679 156190 153125 97427 26663 -21080
6997 -21080 41766 109273 65812 -20247 -118494 -151137 -76538 39372 143646 75729 29173
6986 29173 35874 200585 181983 110644 55757 -91684 -120681 -69367 5588 2869 17264 52227
6974 52227 -27228 -116632 -170324 -151463 -76328 40259 11144 -87189 -72114 -5362 -22856 19438
6962 19438 55543 21042 -8924 -22190 56975 25208 -37804 2803 88717 72280 -7867 5944
6950 5944 39433 126685 115970 98120 144012 69536 30207 36968 39635 83544 104331 -8195
6938 -8195 -103855 -131417 -17403 103105 84576 35435 14226 -13988 -37020 -3802 -12857 -85038
6926 -85038 -17710 -3516 37380 42682 52908 47402 12443 -10742 18399 75919 121909 55343
6914 55343 67551 82295 71855 51169 -16643 -61341 -73690 -69846 -24067 22426 84641 108735
6902 108735 137265 201287 202016 76679 88571 93204 22688 -37825 -44112 -67332 -112520 -24751
6890 -24751 52413 6325 64219 12870 -93433 -71805 -297 85716 -56651 -136070 -74492
6879 -74492 -51454 -25544 -11002 40663 130816 129325 202016 160743 192171 297875 344387 270978
6867 270978 195093 123826 90792 25716 821 52994 69375 33657 -42313 -85510 -25945 68900
6855 68900 81487 80215 51525 -13318 -201354 -233519 -161354 -73707 -13040 23486 17626 -42241
6843 -42241 -111577 -30241 46242 33099 8045 72811 121432 135682 80479 -13281 -128595 -156742
6831 -156742 -262226 -302673 -211016 -128846 -62911 -68087 -52268 -49013 -69805 -34684 -8211 -15711
6819 -15711 -12639 -21290 9806 -33450 -37831 617 31509 3177 -36590 -79667 -69802 -88812 -47333
6806 -47333 -53102 -87939 -64548 -6835 8237 -79946 -89053 7384 75916 61519 32962 -19590
6794 -19590 -11679 -24501 -36161 127541 203639 152382 79653 85593 55135 -22298 -41171 -44174
6782 -44174 -10799 78279 23417 -66260 -63064 -32749 1131 50511 51383 55763 -20000 -47499 -6302
6769 -6302 28720 28611 29834 62209 4470 -12792 -50267 -93567 -47298 -3432 2050 28110 43928
6756 43928 59552 37600 18145 -51584 -78254 -58203 -18075 -119285 -183413 -71803 -59026
6745 -59026 -46722 -43024 25720 55670 63371 124584 147104 103705 61090 41829 -18084 887
6733 887 54954 60891 1019 -16993 -36270 -22811 12935 78142 62959 -3214 89420 183825
6721 183825 210527 193782 202045 179735 120967 26136 -64253 -119932 -179939 -133954 -89317 -54861
6709 -54861 20 10845 14398 72675 29330 15682 81384 109021 74286 54456 147753 153799
6697 153799 188734 190091 106011 34257 53985 108171 131441 136091 179826 139832 161314 168056
6685 168056 134460 88221 10420 20228 76963 147414 101829 29265 15435 16199 -21300 -37247
6673 -37247 -26901 -58651 -23652 -71213 -43948 113754 92765 39323 -1085 -45239 -20011 -50128
6661 -50128 -47309 -27884 -33663 -51550 -130763 -92616 -65755 -125315 -54028 29410 19185 -27916
6649 -27916 -53041 -128351 -137662 -171628 -226388 -177536 -124750 -39329 30811 84993 113044 55106
6637 55106 25978 40341 -2449 -130995 -155992 -64525 1491 -99055 -79016 -22627 -4825
6626 -4825 -47564 -30836 33990 104559 141020 112279 55797 30301 -14899 -70821 -59180 -29370
6614 -29370 4726 -16286 -25724 -68998 -97986 4757 44901 50769 8060 -27103 -894 -3575
6602 -3575 18181 86838 50566 60669 44676 4407 -6458 15027 -19070 -88690 -107438 -126918
6590 -126918 -138441 -77371 -29461 -151931 -172975 -41202 -19022 -31915 10124 44759 37687
6579 37687 40686 115993 80067 21717 -39774 -70203 -67044 134 98976 61618 39504 24271
6567 24271 -36772 24423 -625 -64930 -69406 -14400 -2295 76652 100366 115756 85333 38897
6555 38897 42519 93585 121181 110638 128029 97643 4109 -4881 154945 177752 75141 78741
6543 78741 -13310 -119150 -100792 -61228 -109795 -99172 -46226 -62957 -123497 -161326 -118991 -152324
6531 -152324 -71741 40788 -8655 -12731 59886 75733 47492 68393 57489 92877 110497 87931
6519 87931 56911 65089 -41329 -95965 -23820 16200 10594 -45467 -30967 -64766 -82212 -18258
6507 -18258 54562 52057 -24140 -57490 -5705 14052 45201 4492 19523 2183 -58469 -57618
6495 -57618 -121750 -159233 -122517 -73323 -21066 -6162 -25703 -71706 -49555 54018 113020 158423
6483 158423 158080 127211 98944 139718 199864 165945 108179 99081 63624 -20027 -40118 -54297
6471 -54297 -63853 -11735 51252 90340 123394 97065 70980 16095 19086 -105701 -83060 -69057
6459 -69057 -50444 -4861 9039 -37887 -50561 -22096 4717 56657 -4129 -54121 -7630 42135
6447 42135 50516 40135 -28985 -91819 -18975 1085 65985 86229 74441 96244 86956 52298
6435 52298 20071 -56276 -103447 -36478 -35384 -81823 -118209 -56601 -36735 -64438 -70740 -112103
6423 -112103 -136235 -37493 -83673 -95514 -98260 -39586 -14667 -29743 -41825 -40901 -48835 -62731
6411 -62731 -12729 35223 -19624 29853 22192 46164 80316 51195 37535 14863 -25965 -82335
6399 -82335 -93650 -98194 -83388 -72694 -125763 -143366 -121214 22129 48971 11698 -7108 -9117
6387 -9117 -46552 -35608 5880 29091 -23436 -48477 -47180 -21508 9364 99292 118548 86928
6375 86928 51920 -11331 -36677 -130006 -99699 -54146 -29432 -84076 -14128 -31909 -138690 -146815
6363 -146815 -91098 -88325 -63619 -106794 -122870 -81089 -37075 -16618 56684 141881 157124 162860
6351 162860 211844 135169 61610 35696 -348 -28060 -8502 -84885 -95293 -80247 -109221 -99910
6339 -99910 -114133 -86034 -52706 -40549 -25701 -281 -338 70170 142654 92890 -5907 37568
6327 37568 88043 28411 693 23043 76171 69785 77441 38468 7607 10674 90855 89679 47873
6314 47873 7711 -62570 -119830 -87095 -29485 -21150 -55653 -116814 -118993 -78174 -40459 -57026
6302 -57026 -64975 -50634 18591 -27939 71896 65356 117936 113744 52594 -58399 -53865 -63404 944
6289 944 19391 88355 126333 74322 19354 -47247 -32817 -35549 35596 62186 93467 40675
6277 40675 40043 -11300 -93912 -70947 -26374 -60367 -40365 -75476 -96137 -173042 -133452 -41320
6265 -41320 67604 160937 116498 44776 6699 -119753 -112374 -64180 -14444 -9474 -12055 -6624
6253 -6624 55588 33867 8608 -10617 -29063 -51663 -57676 -50218 -66555 -72280 -89521 -83610 -41673
6240 -41673 -21243 -46217 -86632 -77653 -405 44186 83616 90295 71075 34033 57800 63803
6228 63803 28697 -17469 -17253 9413 -30807 12048 43300 64537 -11725 -68539 -28239 34558
6216 34558 65165 68840 39759 -16688 -47040 23450 35471 -3352 24593 96128 163099 90559
6204 90559 4596 -101867 -32716 29646 52936 55736 12563 66433 114270 118708 73089 64298
6192 64298 31871 -22512 -38183 -45156 -129819 -214267 -197648 -150820 -146688 -118585 -132914 -54192
6180 -54192 -39360 -52388 -64893 -114398 -60816 21109 -73028 -133679 -86868 -73260 -89621 -100327
6168 -100327 -44059 27887 22786 81255 137965 147169 49901 -51346 -89302 -15391 53384 -4435
6156 -4435 -30800 -92820 -28259 5548 19987 1788 -75079 -164314 -218632 -132273 -71485 -120651
6144 -120651 -193124 -176081 -163134 -77280 -7835 5611 19267 47645 27577 13924 6977 1244
6132 1244 -74520 -70525 -60720 -5733 8805 10092 -59243 -138004 -118060 -109661 -17520 10851 -25680
6119 -25680 -94741 -77354 -25738 22066 10356 98001 129160 72694 19296 -12329 -27612 -33741
6107 -33741 -6957 -12010 -14522 -5153 -14112 -87109 -124482 -93630 -85210 -69707 -41233 -61711 17986
6094 17986 -19371 -57935 -117659 -50395 -58701 -83498 -64624 -30498 5409 60939 74242 5755
6082 5755 62351 63737 33581 111757 41627 -19476 -25267 9452 18977 -96920 -71662 46181
6070 46181 70380 131079 84965 823 -51966 20212 64490 144396 111430 22717 -36124 -107060
6058 -107060 -131932 -168558 -151067 -61173 -10529 6805 12512 -51851 -136358 -72996 44540 70357
6046 70357 5803 -43096 -112787 -155382 -76339 12313 64937 77845 30174 28323 29740 15946
6034 15946 -39649 -78987 -70459 -25819 41866 46631 34024 -30067 -85718 -148164 -181045 -210107
6022 -210107 -240745 -119227 -103478 -84606 -52534 -104957 -82143 -59440 -79273 -59832 -18029
6011 -18029 15875 -17641 -40734 -50821 -22273 -36019 -73594 -63655 -14907 14115 39468 111284
5999 111284 79908 30752 59704 134327 120283 54325 30920 -30597 -107827 -114016 -121050 -53238
5987 -53238 -70111 -103762 -13098 43564 116237 57692 -41064 -65395 -36735 -26285 -15427 20578
5975 20578 21427 -8045 29724 130807 207790 74193 -18905 -73169 -133145 -116445 -97481 -24817
5963 -24817 23240 -8713 -53352 -1342 -1043 -16251 -24088 -34901 -59711 -44007 -6674 1550 22159
5950 22159 37341 79290 24698 7184 -77358 -105922 -138015 -78035 -107983 -74234 9765 42935
5938 42935 25032 7220 -48630 -116619 -32882 -20604 -64173 -55649 -171305 -189204 -158481 -173862
5926 -173862 -122328 -148172 -83941 -62955 -93726 -14131 8974 -14512 -23522 -84399 -116748 -33145
5914 -33145 14900 -61502 -83023 -47864 -40153 19 93905 70967 -2034 -59467 37298 61054
5902 61054 20356 -42491 -130349 -84539 -59110 -65719 -47938 -21358 -8996 49686 55324 -6200
5890 -6200 -23099 44716 65397 79959 54456 82678 62707 84835 18257 1552 -12914 -41597
5878 -41597 -63999 -132653 -242397 -272848 -145893 -1654 12669 8535 -12025 -38330 -12470
5867 -12470 54182 18512 -28191 -28320 -8302 54599 130943 146871 73603 -42469 -16634 94205
5855 94205 95209 -30796 -25165 -2253 -70660 -103625 -3485 29265 29245 77836 108915 118171 108750
5842 108750 129031 210773 207565 94961 -14162 -78911 -61243 -55619 -47525 -65512 -135400 -43870
5830 -43870 97368 132951 25776 17122 2404 100494 122160 50649 -2923 -81646 -69308 -17517
5818 -17517 90019 152957 153409 22752 842 -42042 -86087 -23080 -38202 31270 52281 88258
5806 88258 140195 117729 63312 102168 106076 -4056 -42564 -54896 -32563 38815 -4429 -48076
5794 -48076 -43894 -22281 -3098 -67348 -73235 -11974 9109 -41225 -46430 9838 -49637 -32800
5782 -32800 7444 40029 -29398 -55149 -106330 -108037 -100295 -110233 -115013 -108194 -73566 -65893 -88324
5769 -88324 -69924 -113046 -133648 -94936 -105564 -134247 -117858 -87769 -60808 -162777 -169820 -137409
5757 -137409 -88772 -52541 -35596 -38631 -25742 -43127 -53341 -44463 -36791 25755 31002 63698
5745 63698 55454 -32548 -61515 -21582 28198 -1010 -78927 -121327 -94506 -50842 -58814 -51427
5733 -51427 -55490 -84069 -79911 -24510 27930 52988 34391 58663 67388 170781 184622 130182
5721 130182 126027 72691 -45818 -102972 -108294 -77601 -25071 -19138 -59511 -73326 -35103 -77496
5709 -77496 -24244 65714 31773 -113572 -149649 -4348 99880 131503 64000 691 -51711
5698 -51711 504 -25194 13633 103121 148400 117772 60163 7310 -70666 -71137 -159397 -173015
5686 -173015 -180713 -125411 -54998 10441 41512 -20775 -10165 -25469 -48507 -33704 936 -19244
5674 -19244 25437 63199 69555 62123 37405 37894 -58985 -116032 -134520 -57647 63379 39417
5662 39417 -30990 -52659 -47314 -53895 -57424 -10308 81344 84613 1822 -70741 -40787 26058 42049
5649 42049 -22176 -6042 6553 21347 -30644 -47493 -20073 7232 46213 27044 47630 -23367
5637 -23367 -51648 -54208 8478 4414 -7895 8972 -25000 -52790 -42637 -71155 -97050 -56731
5625 -56731 -75951 -48360 -6806 4748 20219 102484 103129 86546 74199 130383 83644 -29051
5613 -29051 -10041 75515 132064 113584 42044 -715 -85161 -58994 15090 107516 121053 23925
5601 23925 -15967 26049 42783 12077 29080 -26574 -85704 -66627 -50557 -59997 -47496 -52793
5589 -52793 -125138 -88939 -109695 -128205 -147083 -77196 38407 21352 82287 52013 -44876 -72106
5577 -72106 -20556 -101009 -100176 -43824 21976 -14015 -91349 -79944 2576 21306 18013 60868
5565 60868 -27703 -74156 -94728 -29519 10066 27551 -30126 -76153 -55651 -8658 -1123 -76739
5553 -76739 -70901 1846 59284 41519 -7148 -29315 -29315 -46201 -124481 -110390 -140559 -122761 -166545
5540 -166545 -144061 -91846 -104058 -55834 -40039 9476 49372 -50298 -32304 80918 103677
5529 103677 129002 126486 116970 140198 158027 168733 136968 26763 -65085 -82010 -42119 -18209
5517 -18209 17400 31979 83797 147246 137209 129329 184648 138010 54619 -6219 914 34699
5505 34699 7907 57705 58430 30754 10990 -38832 -30212 56399 125802 74482 52502 25457
5493 25457 -61838 -19460 13493 60744 77381 36135 -39756 -55189 -10297 1825 -49405 -120652
5481 -120652 -106762 -61623 -34287 58641 55359 107 13258 -14197 -80437 -110062 -167921 -140262
5469 -140262 -54249 27912 7024 -35007 -52729 14482 4086 -47987 -21904 26183 61339 38580
5457 38580 -36969 -59564 -13165 -11016 -17833 -49154 -76122 -59794 -82137 -175567 -153035 -95785
5445 -95785 -63525 -7968 -54652 -52194 64993 20454 -70499 -9967 26528 -51495 -45129 -79112
5433 -79112 -122229 -190118 -118786 -45733 20390 -17391 -118238 -139001 -155789 -98539 -77902 -79555
5421 -79555 -26288 -10483 -7843 -81596 -97092 -72384 -94592 -126857 -145128 -146768 -102305 -54389
5409 -54389 -10662 -25235 -83941 -94892 11427 100314 77764 20698 -48475 -80903 -4982 16612
5397 16612 -36070 56500 14473 23100 12664 14048 113476 120859 23175 49532 91765 116191
5385 116191 142168 120828 127482 71374 59999 67140 77438 -5532 -99632 -125620 -74852 -57659
5373 -57659 -50043 -62246 -107958 -127161 -119594 -137786 -171051 -118392 -73224 -12032 -20086 44753
5361 44753 7748 -37119 -98965 -27475 -37880 -21199 20444 -51525 -74403 -103634 -157336 -85092
5349 -85092 -85451 -88023 -113839 -107204 -62835 -93007 -48161 -45090 8360 73966 63304 15952 -115138
5336 -115138 -128676 -124314 -113686 -142831 -75788 -53539 -36072 -78127 -59130 -31538 -21231 -73630
5324 -73630 -57400 52430 40040 -32329 -51941 40353 -6622 -56770 -23799 26468 -17245 -52617
5312 -52617 -71341 -111921 -84866 -99579 -24682 -24982 -10150 7426 29787 64566 28973 -27449
5300 -27449 -62203 -32604 5692 1496 17803 -27319 -27958 -114088 -71860 -50470 -86587 -80773 -17040
5287 -17040 -13180 18826 79396 61097 70873 29204 2872 10790 8920 -7437 -53797 -82417 -138328
5274 -138328 -164521 -117386 -64269 39812 14002 887 -39522 -35492 -56985 -48006 -25427 -15947
5262 -15947 -1246 3618 -54662 4317 2876 -14584 78299 34322 56666 66786 53560 92321
5250 92321 135155 72109 -30454 -81383 -39935 -11238 82819 54124 2545 -70289 -55541 -65880
5238 -65880 -41944 -126699 -99434 -72308 4317 72129 72227 17490 32402 24733 -75515 -62690
5226 -62690 -52883 -26834 29698 60892 9778 -26552 -3406 36476 18447 7355 33429 33853
5214 33853 -6737 -67033 -164014 -156228 -84784 -12209 27906 -4396 52352 32813 65145 -11996
5202 -11996 -54926 -40057 -56316 -20577 -76333 -47119 -58500 -72984 58912 103029 4750 -41362
5190 -41362 -4289 -63321 -57724 -46329 -42636 -29943 -81275 -154358 -81843 7316 33745 1809
5178 1809 -17757 -63085 -4056 17751 -903 -19982 -79205 -104477 -59201 -7449 -49970 7458
5166 7458 64345 109112 132922 99481 36423 18284 51672 90973 23523 -79829 -38457 -46903
5154 -46903 -73679 -17865 44053 76508 74865 19032 -78639 -2409 68226 45302 47497 42425
5142 42425 37185 73763 125004 107486 51280 -10763 -35782 -27900 -17147 -21210 -63784 -119257
5130 -119257 -33563 -52029 -110822 -76970 -28796 -36173 22745 14692 -92498 -123006 -30056 -12254
5118 -12254 -747 -206 31011 -3539 70866 17721 -50336 -18118 12065 34593 -1729 -17149
5106 -17149 -48121 -67493 -41982 1913 -18222 -48708 -28993 23264 76564 15253 -98617 -122638
5094 -122638 -8832 75385 54594 6873 17767 71240 93837 34742 -35307 -38939 -63559 -73506
5082 -73506 -42563 -39165 -19615 26066 -61774 -100786 -10553 -46213 -57930 -33507 -41295 -56682
5070 -56682 -62779 -30594 -29050 -17688 -42488 -54794 -76554 -38362 -34902 -37941 -10002 -20562 -89759
5057 -89759 -86666 -114087 -95379 50613 107297 97862 63621 10671 -34102 -30118 49753 111915
5045 111915 124726 113688 98968 102833 4084 -66726 -67035 -129451 -115965 -76129 -7229 19729
5033 19729 6051 65081 43088 -34132 -74407 -2176 12396 -12348 17478 8000 35521 38761
5021 38761 -53453 -161316 -160356 -23576 14973 27828 39618 72167 50302 -74961 -157379 -97800
5009 -97800 29167 48771 -4773 -10402 -21606 -7456 -4908 2944 -3382 24866 65202 34218
4997 34218 -8003 -25434 -112363 -164170 -224050 -188333 -185576 -145817 -50920 30605 38202 97443
4985 97443 99288 92677 24677 6461 -7282 -45269 -95115 -2778 14639 36356 45054 13395
4973 13395 -27710 3407 -26553 -57043 -67475 -917 20804 -65802 -54349 57922 -11252 -4719
4961 -4719 -44432 -27995 -74653 -156254 -68812 98247 111910 25803 -66704 -35660 -44299 -72071
4949 -72071 -27390 -24093 -47628 -38476 -3046 17804 7316 -11730 -45584 -23390 17986 30383
4937 30383 10816 13843 15342 -5443 -44240 -43652 -42844 -60920 -43173 32446 83513 21718 -70335
4924 -70335 -8790 36588 82948 82744 -36753 -19911 102998 75506 3552 100910 149630 97976
4912 97976 72785 20347 -16715 31206 7649 -53534 -81634 -8 -72311 -123324 -106311 -16121
4900 -16121 -7145 37150 117510 50114 -42840 65391 73465 -9690 -96280 -78278 25735 33304
4888 33304 87727 115218 106158 103099 101944 105652 86662 55396 100274 104716 22475 -18084 -71918
4875 -71918 -69982 -54225 -66312 -46761 -41952 -103093 -85035 -159494 -147588 -12279 28457 13769
4863 13769 27884 -114881 -180762 -151460 -69968 -40441 -58403 -33813 -10975 -5787 28768 53601
4851 53601 -48650 -43707 -39449 -73555 -78475 -89714 -153634 -96016 -46042 -172297 -250774 -283589
4839 -283589 -244357 -220786 -103272 -12861 59842 89645 -7853 -33626 -54431 -41949 -42905 -123466
4827 -123466 -139501 -59211 -3455 -13795 48745 14035 -2186 18399 -89739 -45534 -52041 -58255
4815 -58255 -28627 -21733 -1439 -45114 -106264 -60639 -60591 -60118 -66726 -104310 -148265 -154154 -82532
4802 -82532 -1696 -51708 -136675 -37768 34770 9214 9913 39703 69271 18985 -60296 -82669
4790 -82669 -156783 -205781 -58124 16010 -37103 -73582 -4515 20171 -92314 -213163 -222648
4779 -222648 -161890 -168763 -144923 -135246 -143887 -70440 -31390 -15253 7056 -17397 -21174 -91737
4767 -91737 -116297 -107828 -99436 -178690 -149262 -81863 -126217 -30572 1340 -33141 -38963 -9599
4755 -9599 16901 62981 31770 13654 34725 -54184 -122030 -83876 15450 44064 14079 72362
4743 72362 94002 -50953 -124629 -148339 -127292 -180831 -170000 -130539 -86879 -98973 -95428 -115859
4731 -115859 -37456 -13990 -41424 -61544 -87104 -24172 -5521 -18670 -65386 -76588 -68027 -31147
4719 -31147 -36546 22843 14311 -18367 -85399 -74427 -42156 -99675 -165612 -145859 -57766 -61969
4707 -61969 -88914 -15851 27901 14537 9785 7016 33235 84922 -10038 -68920 -26492 17333
4695 17333 104431 48795 -65556 -108436 -83853 -136509 -137185 -174164 -184604 -127958 -80932 -8947
4683 -8947 -76607 -108121 -99018 -114368 -108372 -68852 -48314 -77863 -129871 -104536 35225 3757
4671 3757 -108445 -157577 -110937 -56582 -101562 -83532 -18061 74290 43261 -12518 19073 20202
4659 20202 50302 73916 -58894 -85880 -40468 -68594 -74273 -149459 -148050 -79849 -32320 27872
4647 27872 50705 63692 35847 30086 27755 -82123 -70896 -72874 -71971 -27059 -83298 -123894 -37211
4634 -37211 -33030 -14728 8976 -47909 -82154 -95488 -85324 -65614 -104619 -55672 16875 11801
4622 11801 44680 -5397 -90432 -69924 -27845 72113 103389 -823 4431 12101 -46546 -45021
4610 -45021 -42500 -133338 -130613 -67345 61189 67626 43606 -947 -56019 -34562 24269 33379
4598 33379 408 -17504 57487 67974 47377 85899 62581 48372 123579 148943 130395 68975
4586 68975 2367 -72334 -124118 -97505 -127689 -105140 -51018 -56203 -48368 -904 -93367 -141859
4574 -141859 -66568 -43477 15465 -13961 -39507 -50439 1099 -11400 -45741 19406 7267 9919
4562 9919 29309 -61191 -68165 -105151 -78849 47052 30221 -416 -17495 -27504 -15929 -62722
4550 -62722 -38277 -39268 -90888 -75601 -55826 -40311 -42944 -70614 59090 16668 22523 -110
4538 -110 58541 65173 38113 -30523 -47980 -51862 35945 31920 -6444 -90497 -19552 59608 55697
4525 55697 44516 89507 44838 -4833 61014 39960 18203 -19819 31021 56788 85858 63756
4513 63756 21992 -27134 -98998 -87769 -52187 -140020 -215791 -187481 -126890 -87155 -91731 -74436
4501 -74436 -15172 -27407 -47591 -63824 -91037 -51748 -43814 -106782 -140522 -126725 -49393 62050
4489 62050 104045 134065 120422 72141 124230 150291 126012 135762 120753 91657 28443 -38897
4477 -38897 -50450 -58634 -91035 10070 48572 86027 107094 183579 81575 27108 12019 -33013
4465 -33013 -28136 23923 20888 -56533 -32555 -66868 -96336 -66156 -51463 -25725 -13402 -29874
4453 -29874 -42750 81490 119204 76602 -60418 -95576 -79741 -78664 -81270 -42407 -79820 -89367
4441 -89367 -77590 -26354 11505 17840 34421 22312 13297 -2943 16944 51431 56368 44212
4429 44212 3773 90570 135462 34414 -14242 -87706 -43507 76698 78939 52694 -37223 -27277
4417 -27277 -49675 -42644 -35297 -76554 -97055 -48598 -23736 -53309 -55333 -66843 -20303 -16436 -45288
4404 -45288 -58556 -62371 -65383 -100521 -99891 -79428 -75078 20486 12884 -76270 -168705 -129828 -90435
4391 -90435 -77815 -100042 -117266 -75649 -27098 2880 -9405 -76726 -63098 7151 -34906 -49114
4379 -49114 2690 1062 -8263 -21734 -14407 -63378 -146195 -126275 -61722 -32631 -63485 6247
4367 6247 66990 36221 -27885 -22895 -46536 2560 30413 -19228 -631 50939 21335 -83917
4355 -83917 -130105 -112946 -96805 -90393 -12451 47165 114539 76478 -47666 -89099 -89560 1054
4343 1054 97108 110325 69282 96990 80707 25313 -8413 67426 74185 20512 -9484 -30275
4331 -30275 -79818 -123565 -22124 17780 23033 9286 -85768 -77530 -17705 -8809 -62066 -108179
4319 -108179 -85696 11581 76443 71156 30882 110682 78065 44909 -39673 -84597 -67679 -91321
4307 -91321 -48053 11998 -82144 -80049 -101000 -68135 -32045 -44255 -67952 -62815 -93348 -31357
4295 -31357 -20031 -84786 -119637 -62096 -12751 -54485 -14017 22660 76721 31688 8003 21044
4283 21044 43528 56481 -41872 -146537 -140720 -148647 -91726 -91787 -16894 39541 45259 45877 140535
4270 140535 168512 92805 33491 43952 2625 -50045 -35321 37484 77726 34251 63842 42839
4258 42839 2189 -3576 -18212 16969 30223 -46282 -142367 -165112 -103939 -31578 -24132 -75667
4246 -75667 -77183 -10240 -26027 16412 21760 5112 -37781 -8073 -39533 -39184 -161167 -112861
4234 -112861 -60566 -149742 -138548 -88764 -57379 -74645 -118534 -108616 -124026 -167784 -100227 -7543
4222 -7543 -45016 -47994 -68242 -54993 -71342 -113470 -91271 -74218 -48902 -20966 -48241 16673
4210 16673 26211 -21224 -35063 -2728 -48681 -75237 -50741 -67971 -66347 -42752 -41506 -58852
4198 -58852 -12603 -43742 -88466 -38679 -21236 54944 79056 88566 33614 -14831 -31100 -50162
4186 -50162 -26184 43456 20845 -33728 -101411 -123082 -64123 -52089 -77314 -8 46473 1623
4174 1623 -53160 -86532 -79178 -37649 6680 -6842 54124 67928 115161 132294 143588 197790
4162 197790 190661 146931 148185 70596 72528 46022 35587 59059 -9079 -75424 -95952 -95675 7553
4149 7553 143830 119925 3812 -62325 -75450 -119794 -109490 -30396 -3378 11019 -10818 -36607
4137 -36607 -86657 -114015 -60356 -81368 -10887 48756 50798 67773 100603 65916 47420 132219
4125 132219 99906 -40124 -126620 -112734 -90828 -160568 -76889 13369 53541 77065 36534
4114 36534 -3123 -114212 -176446 -174645 -84216 -75501 -50616 4695 66090 107586 37625 9972
4102 9972 41132 91587 37983 -2956 -36733 -52163 -58190 -26829 -9881 68340 51916 7064
4090 7064 -40907 -155895 -119632 -28903 15357 25849 5708 11588 4947 10856 31820 100784
4078 100784 151498 146016 86101 43348 91077 158546 259159 255765 194169 91142 21734 69942
4066 69942 56084 -47731 -131442 -78468 -41025 -45660 -34788 -2689 21373 69448 7112 -63380
4054 -63380 -39183 -49891 -45532 34402 32526 54265 67678 100666 66359 15550 -7734 90636
4042 90636 175061 114237 44196 139 30722 127090 100404 69218 42112 -16931 47167 79664
4030 79664 -46555 -151543 -95689 -62294 22946 51306 2925 -77227 52594 62686 66591
4019 66591 92929 136481 143195 165757 149157 128846 106925 105703 8453 3502 94400 86288 8948
4006 8948 104200 128070 66046 45471 -6414 -40683 10690 13936 2684 3838 -7128 -16623 -75574
3993 -75574 -41149 -37182 -19311 4862 -32579 -57607 -127409 -137089 -92552 -119325 -127137 -66281
3981 -66281 -95439 -110720 -99100 -41223 -19912 -13577 -21367 11809 -75328 -129225 -75913 -122074
3969 -122074 -218275 -209369 -191429 -57156 -62798 -60315 -15367 -18237 -48859 28405 49465 -37932
3957 -37932 -115807 -66222 -11766 -25307 -94158 -46466 -83933 -98138 -48583 42181 110693 59303
3945 59303 -26366 -52353 16597 33069 -13958 14427 52224 96768 44007 3804 -12841 61224
3933 61224 97205 87575 44518 -40050 -102200 -81263 -158849 -170043 -154473 -52716 25399 92397
3921 92397 54754 65351 49195 60815 29651 66475 56353 19827 79 -34134 -110578 -105953
3909 -105953 -46034 -1289 36868 -39391 -28837 12937 94445 144188 77950 49733 38862 18085
3897 18085 -4655 52411 103079 170343 130115 86222 15436 3627 6849 -6213 -12232 440
3885 440 4718 -28289 7028 93985 57296 -782 -14470 87571 55796 10822 8992 -10959
3873 -10959 20535 89538 97545 83875 30433 28731 42616 90818 148746 101268 50145 62411
3861 62411 51132 37827 54369 75980 30258 -64622 -53256 -13137 -31911 -78726 -36058 75095
3849 75095 62799 21796 22361 16061 38489 18621 -78860 -130901 -108776 -94002 -77403 -37892
3837 -37892 -15606 9723 58168 47373 60317 19972 -24024 -13873 17181 10105 -23165 -92907
3825 -92907 -76638 26462 77124 85659 135425 72103 21151 8995 83219 148396 122230 111487
3813 111487 67915 49670 51980 12042 12513 73716 74999 97799 99868 88735 59483 -16025 19092
3800 19092 23446 -11550 -45045 -74349 -79117 -37903 -42253 -111345 -142225 -138175 -66954 -9641 -104364
3787 -104364 -146158 -96367 -25698 31244 99069 -12180 -68394 -63153 -104468 -149008 -176491 -154899
3775 -154899 -76794 -11041 -50051 -110677 -79029 -108437 -85018 -45061 -28566 20352 -606 -42659
3763 -42659 68404 89079 16153 70656 83552 12395 4554 95187 160517 70543 -25799 -131183
3751 -131183 -177830 -199101 -194494 -152528 -140007 -175204 -217727 -178602 -132593 -54069 -18703 -63599
3739 -63599 -28610 43935 97162 17084 -51233 -52881 -59774 -22847 14374 85078 139595 102718
3727 102718 52802 35673 55452 51561 5633 2291 34061 51935 -12948 -23553 26928 96079
3715 96079 41631 49127 49060 80173 152191 123265 24844 -74958 -48703 5363 74768 54756 59018
3702 59018 78939 72089 47539 -9745 -71620 -68069 -22375 11248 -96973 -157108 -143914 -105007
3690 -105007 -108547 -162173 -133907 -131986 -111298 -56611 -50294 -71302 -34459 -84007 -96981 -122083
3678 -122083 -93901 -55003 -93108 -181496 -166929 -86153 -84378 -103026 -140473 -106005 -39336 12181
3666 12181 -53154 -101401 -95837 -47523 -7989 80424 75220 27101 -30913 -80919 -132874 -141809
3654 -141809 -157993 -129213 -73013 -177027 -226243 -188572 -156603 -105378 -48233 -77021 -78784 -70760
3642 -70760 -16146 36975 58186 -24254 7710 -32325 -88370 -143613 -61754 26922 87482 81601
3630 81601 172015 172985 207003 193764 60330 -1531 37319 39422 12028 -46372 -92458 -46315
3618 -46315 -71571 -41740 -35268 -17455 -75043 -18067 70176 34575 15738 19527 -30816 -23403
3606 -23403 -84387 -104658 -69401 -8789 -66591 -86923 -113879 -152629 -182030 -169542 -149272 -91871
3594 -91871 -1869 -33979 -109625 -56369 -4186 30114 -36381 -498 11820 37469 -50792 -130557
3582 -130557 -119494 -96720 -120002 -55933 -19602 -5259 209 3324 -55545 -110898 -8487 17129
3570 17129 49918 118225 79715 -39202 5910 23565 -51414 -100252 -160854 -144569 -101331 -84838
3558 -84838 -31400 -11863 -17523 -2507 -2079 -18411 8809 -47152 -172285 -189120 -199704 -217997
3546 -217997 -185304 -53916 22440 36330 11262 -42679 -25632 -47997 -84759 -105471 -118774
3535 -118774 -105723 -88096 -77430 -65101 -8292 53611 81270 54778 -47177 -21018 -20368 11793
3523 11793 51058 79130 3570 -89609 -108615 -84254 -65131 -38660 17546 52630 43824 -31127
3511 -31127 -110945 -120820 -122664 -131653 -33296 21540 80457 90825 43206 67271 83640 53147
3499 53147 54120 89440 109963 46599 28383 -54565 -111913 -169261 -152442 -98565 -18708 50300
3487 50300 24154 48985 21000 2559 -8050 -54196 -30570 2607 21273 35325 60183 155232
3475 155232 115881 150849 94088 -12021 -61022 -68165 4962 -12271 -72685 -99745 -97597 -117400
3463 -117400 -181514 -128729 -55967 -15847 63989 31284 33303 -113512 -183785 -186265 -129826 -103981
3451 -103981 -97667 -136585 -66464 -3355 13962 -31885 -75026 -123957 -152344 -92756 -53255 -64543
3439 -64543 -111916 -138447 -116845 -47762 87066 81197 -8302 6885 3751 77033 188460 144090
3427 144090 108477 97062 77421 116041 47855 -37229 29010 85261 62347 35499 6974 -31296
3415 -31296 -5342 9629 45445 65953 34005 5228 -45232 -9307 43634 -3259 -34305 52303
3403 52303 39683 -57614 -175158 -139039 -79735 -86155 -103046 -45846 -40356 -93341 -79265 -69888
3391 -69888 -102157 -157188 -211289 -210935 -174189 -129515 -75349 35810 122205 191545 124632 118354
3379 118354 166104 122924 70161 44074 31881 7708 39236 114390 77829 67423 65137 48206
3367 48206 -24022 -106532 -140297 -128583 -111725 -104368 -112977 -114769 -16569 41067 78374 70205 24235
3354 24235 -16406 -19664 5778 -54380 -162664 -115798 -20383 5824 -4383 -51863 -14075 70822
3342 70822 98170 112029 76070 -16358 -28138 -31899 -4019 759 -23597 -42965 -30445 48391
3330 48391 77381 26432 68660 77803 80831 56828 35926 -29473 -31072 528 38900 -23051
3318 -23051 -102602 -73464 -97116 -82594 -15679 73098 40462 -10073 23077 75340 53099 3991
3306 3991 70496 68427 20695 5853 47926 76298 14946 5063 11287 67064 58268 5297 82134
3293 82134 127921 54508 6080 82130 28002 48983 84279 88717 126762 198485 192018 130147
3281 130147 96923 62208 7022 -6930 -39186 24063 97357 141422 101332 44635 -27157 -44721
3269 -44721 -102000 -14538 30115 13600 15490 54716 21284 -37656 -32174 -37984 3152 -45903
3257 -45903 -63344 -91958 8349 634 -84869 -98452 -16143 53351 93994 96620 43959 -2471
3245 -2471 -13982 50821 51487 -6926 3308 -22843 -29613 -2465 21317 -12235 -36391 -386 64212
3232 64212 74769 227 -13759 47497 57513 42920 -1454 -7319 37747 4146 78186 66889
3220 66889 102074 63038 26547 53932 86839 42466 -40572 -80253 -120677 -98885 -67335 -76124
3208 -76124 -83067 -73169 -104417 -100432 -99910 -81942 -118508 -177976 -218985 -141592 -108765 -85449 -84840
3195 -84840 -113319 -119989 -132567 -126483 -104235 -28084 72378 -5355 -78605 -157694 -188981 -145964
3183 -145964 -77107 -38184 -22303 -139701 -203839 -209162 -127294 -96099 -105633 -123609 -121796 -61749
3171 -61749 67707 23773 34763 124324 133150 60632 70669 174078 136883 51500 41368 69277
3159 69277 92304 73129 48855 31510 43348 -64421 -114336 -30507 -138486 -154541 -211185
3148 -211185 -177781 -88778 -75152 -112785 -103565 43737 124812 129137 4420 -147575 -219653
3137 -219653 -63026 15735 -23764 -15212 39497 27062 -54228 -151450 -140225 -74292 -1023 -2942
3125 -2942 -47309 -100422 -109102 -20792 63571 49936 2401 -1803 -28468 -85917 -54829 -67325
3113 -67325 -116729 -71305 -65880 -128946 -130834 -60856 24224 78279 11687 -53079 -94829 -71332
3101 -71332 -101223 -84819 3159 3218 -60589 -111828 -36304 4497 -4393 45297 143200 64425 -71407
3088 -71407 -118942 -104437 -82116 -52066 -13439 558 18986 21403 39866 51203 -28485 24847
3076 24847 80096 142359 123235 34304 -38589 -73437 -99232 -2932 34628 33365 7649 -21723
3064 -21723 7828 6979 -1719 53980 -5106 11489 72334 138955 118012 41633 28504 -46880
3052 -46880 -32419 22713 32885 2733 -8246 -8974 -66337 -67237 -105233 -119795 -89082 -22709 -5364
3039 -5364 -37996 28227 -5026 15746 52805 82568 70787 24927 39358 2907 -24789 69716
3027 69716 31301 61769 63923 20309 33258 -15983 15004 98008 112684 30790 -92106 -97949
3015 -97949 -29903 -25839 -39919 -87502 -156683 -183146 -86886 -51776 -54406 5118 73896 74842 -1259
3002 -1259 -48319 -43002 -95306 -86879 -69864 -100783 -97407 -108046 -101675 -47001 -4724 6655 42698
2989 42698 57152 11220 -51205 -26978 -65362 -120170 -81803 7378 18838 -109796 -119138 -77074
2977 -77074 -32081 -122135 -132764 -13287 27356 41433 7230 -110456 -123230 34171 67335
2966 67335 103698 94785 36614 67442 53149 39425 113510 -5217 -76063 -103014 -48019 47418
2954 47418 47747 34323 -52402 -33308 -27374 30529 55862 50491 -33107 -66636 -86875 -68630 -12534
2941 -12534 24138 83031 91423 132267 60775 16620 -14712 -29406 -19024 -40296 -19612 -55115
2929 -55115 19454 111174 93196 59528 38406 638 -2817 -61058 -80844 -49879 -18688 -5557
2917 -5557 -56519 -94270 -45483 33888 44078 2452 13618 -49858 -116611 -128265 -75279 12626
2905 12626 60706 46871 40162 29515 20994 44442 50347 33563 -50075 -42748 -28637 -35413 13061
2892 13061 -25221 -1837 16429 -26453 -64386 -158005 -183937 -76175 -9698 -47009 -39633 -33301
2880 -33301 3929 -48642 -87918 -56732 -83577 -76741 47611 88377 118713 98353 -41509 -79121
2868 -79121 -41356 12818 -3877 12659 -21164 -14449 -1403 -93976 -120943 -45467 25768 29124
2856 29124 59747 27527 -78084 -155153 -114473 -26150 -3837 -83989 -158871 -132506 -76907 24884
2844 24884 115363 201777 217846 168022 45842 -108377 -181934 -168384 -99913 -35560 -33039 -62558
2832 -62558 -146318 -113045 -35200 -27447 -73419 -108186 -68049 24782 84477 43646 1616 -66805
2820 -66805 -25566 -41266 -32833 -29611 -23866 56824 69165 95944 49512 80011 94977 71827
2808 71827 -19499 -85988 -63085 53935 63196 28110 42515 -14394 -3973 62620 20035 -40613
2796 -40613 -25128 60785 123356 33294 -31011 27119 55368 34082 106683 149963 83525 91801
2784 91801 65738 21178 54211 41578 18223 56640 36290 39411 -33208 27876 33978 29285
2772 29285 37000 -11598 4721 39019 84079 77524 87097 130634 162031 129674 68648 -1064
$$ [...]
##END NTUPLES=NMR SPECTRUM
##END=
