##TITLE=Analysis number 307332
Compound Code cc 41439
Book Reference 393/184
Project Code qc-cat
Chemist Name roba
##JCAMPDX= 6.0         $$ Bruker NMR JCAMP-DX V2.0
##DATA TYPE= NMR SPECTRUM
##DATA CLASS= NTUPLES
##ORIGIN= Bruker BioSpin GmbH
##OWNER= NMR
$$ XWIN-NMR		Version 3.5
$$ Thu Apr 28 09:34:10 2005 GMT Daylight Time (UT+1h)  MAYBRIDGE\NMR@NMR_250MHZ
##.OBSERVE FREQUENCY= 250.131544655141
##.OBSERVE NUCLEUS= ^1H
##.ACQUISITION MODE= SIMULTANEOUS (DQD)
##.ACQUISITION SCHEME= undefined
##.AVERAGES= 16
##.DIGITISER RES= 18
##SPECTROMETER/DATA SYSTEM= dpx250
##.PULSE SEQUENCE= zg30
##.SOLVENT NAME= DMSO
##.SHIFT REFERENCE= (INTERNAL, DMSO, 0, 16.522)
##AUDIT TRAIL= $$ (NUMBER, WHEN, WHO, WHERE, WHAT)
$$ ##TITLE= Audit trail, XWIN-NMR		Version 3.5
$$ ##JCAMPDX= 5.01
$$ ##ORIGIN= Bruker BioSpin GmbH
$$ ##OWNER= NMR
$$ C:\u/data/dgb/nmr/ADRS/2340/pdata/1/auditp.txt
$$ ##AUDIT TRAIL=  $$ (NUMBER, WHEN, WHO, WHERE, WHAT)
(   1,<2005-04-28 09:33:48.42 +100>,<MAYBRIDGE\NMR>,<NMR_250MHZ>,
      <created by zg, POWCHK disabled, PULCHK disabled
       configuration hash MD5:
       62 19 C7 07 E1 42 D1 B7 37 6C 3D D0 77 39 F9 E6
       data hash MD5: 64K
       EE B9 51 2B 1B AC B7 EC F9 F5 97 F5 14 75 74 72>)
(   2,<2005-04-28 09:33:59.84 +100>,<MAYBRIDGE\NMR>,<NMR_250MHZ>,
      <Start of raw data processing
       ef LB = 0.3 FT_mod = 6 PKNL = 1 SI = 32K 
       data hash MD5: 32K
       11 9A 6E 5F CC 54 C3 81 9C B1 3A 0F BC 42 51 FD>)
(   3,<2005-04-28 09:34:01.63 +100>,<MAYBRIDGE\NMR>,<NMR_250MHZ>,
      <apk 
       data hash MD5: 32K
       94 B0 77 13 92 D9 CA A1 6F 18 95 C2 8F 03 5A 4A>)
(   4,<2005-04-28 09:34:02.35 +100>,<MAYBRIDGE\NMR>,<NMR_250MHZ>,
      <abs ABSG = 5 
       data hash MD5: 32K
       FD 29 6D 4B 66 01 32 10 DD 0D DC 1A B6 62 A2 B0>)
$$ ##END=
$$ 
$$ hash MD5
$$ 57 5F 6A 2D 77 7C 6B 2E 26 24 4C 9C FF 5D AA B6
##$RELAX= 
##$RELAX= 
##$RELAX= 
##$RELAX= 
##$RELAX= 
##$RELAX= 
##$RELAX= 
$$ Bruker specific parameters
$$ --------------------------
##$DU= <C:\u>
##$EXPNO= 2340
##$NAME= <ADRS>
##$PROCNO= 1
##$TYPE= <nmr>
##$USER= <dgb>
##$AMP= (0..31)
100 100 100 100 100 100 100 100 100 100 100 100 100 100 100 100 100 100 
100 100 100 100 100 100 100 100 100 100 100 100 100 100 
##$AQSEQ= 0
##$AQ_mod= 3
##$AUNM= <au_zg>
##$AUTOPOS= <1 >
##$BF1= 250.13
##$BF2= 250.13
##$BF3= 250.13
##$BF4= 250.13
##$BF5= 500.13
##$BF6= 500.13
##$BF7= 500.13
##$BF8= 500.13
##$BYTORDA= 1
##$CFDGTYP= 0
##$CFRGTYP= 5
##$CHEMSTR= <none>
##$CNST= (0..31)
1 1 145 1 1 1 1 1 1 1 1 1 1 1 1 1 1 1 1 1 1 1 1 1 1 1 1 1 1 1 1 1 
##$CPDPRG= <>
##$CPDPRG1= <>
##$CPDPRG2= <>
##$CPDPRG3= <>
##$CPDPRG4= <mlev>
##$CPDPRG5= <mlev>
##$CPDPRG6= <mlev>
##$CPDPRG7= <mlev>
##$CPDPRG8= <mlev>
##$CPDPRGB= <>
##$CPDPRGT= <>
##$D= (0..31)
0 1 0 0 0 0 0 0 0 0.06 0 0 0 0 0 0 0.0002 0 0 0 0 0 0 0 0 0 0 0 0 0 0 
0 
##$DATE= 1114677227
##$DBL= (0..7)
120 120 120 120 120 120 120 120 
##$DBP= (0..7)
150 150 150 150 150 150 150 150 
##$DBP07= 0
##$DBPNAM0= <>
##$DBPNAM1= <>
$$ [...]
##$SUBNAM7= <"">
##$SUBNAM8= <"">
##$SUBNAM9= <"">
##$SW= 20.6930455092707
##$SWIBOX= (0..15)
0 0 3 0 0 0 0 0 0 0 0 0 0 0 0 0 
##$SW_h= 5175.983436853
##$TD= 65536
##$TD0= 1
##$TE= 295.16
##$TE2= 300
##$TE3= 300
##$TEG= 300
##$TL= (0..7)
0 120 120 120 120 120 120 120 
##$TP= (0..7)
150 150 150 150 150 150 150 150 
##$TP07= 0
##$TPNAME0= <>
##$TPNAME1= <>
##$TPNAME2= <>
##$TPNAME3= <>
##$TPNAME4= <>
##$TPNAME5= <>
##$TPNAME6= <>
##$TPNAME7= <>
##$TPOAL= (0..7)
0.5 0.5 0.5 0.5 0.5 0.5 0.5 0.5 
##$TPOFFS= (0..7)
0 0 0 0 0 0 0 0 
##$TUNHIN= 0
##$TUNHOUT= 0
##$TUNXOUT= 0
##$USERA1= <user>
##$USERA2= <user>
##$USERA3= <user>
##$USERA4= <user>
##$USERA5= <user>
##$V9= 5
##$VALIST= <valist>
##$VCLIST= <CCCCCCCCCCCCCCC>
##$VD= 0
##$VDLIST= <DDDDDDDDDDDDDDD>
##$VPLIST= <PPPPPPPPPPPPPPP>
##$VTLIST= <TTTTTTTTTTTTTTT>
##$WBST= 1024
##$WBSW= 4
##$XGAIN= (0..3)
0 0 0 0 
##$XL= 0
##$YL= 0
##$YMAX_a= 450565
##$YMIN_a= -566370
##$ZGOPTNS= <>
##$ZL1= 120
##$ZL2= 120
##$ZL3= 120
##$ZL4= 120
##$ABSF1= 16.522
##$ABSF2= -4.171173
##$ABSG= 5
##$ABSL= 3
##$ALPHA= 0
##$AQORDER= 0
##$ASSFAC= 0
##$ASSFACI= 0
##$ASSFACX= 0
##$ASSWID= 0
##$AUNMP= <proc_1d>
##$AZFE= 0.1
##$AZFW= 0.1
##$BCFW= 0
##$BC_mod= 0
##$BYTORDP= 0
##$COROFFS= 0
##$CY= 12.5
##$DATMOD= 1
##$DC= 0
##$DFILT= <>
##$DTYPP= 0
##$F1P= 14.0000005364418
##$F2P= -0.99999901652339
##$FCOR= 0.5
##$FTSIZE= 32768
##$FT_mod= 6
##$GAMMA= 0
##$GB= 0
##$INTBC= 1
##$INTSCL= 1
##$ISEN= 128
##$LB= 0.3
##$LEV0= 0
##$LPBIN= 0
##$MAXI= 10000
##$MC2= 0
##$MEAN= 0
##$ME_mod= 0
##$MI= 0
##$NCOEF= 0
##$NC_proc= -2
##$NLEV= 6
##$NOISF1= 0
##$NOISF2= 0
##$NSP= 0
##$NTH_PI= 0
##$NZP= 0
##$OFFSET= 16.522
##$PC= 1
##$PHC0= -86.58111
##$PHC1= 7.230456
##$PH_mod= 1
##$PKNL= yes
##$PPARMOD= 0
##$PSCAL= 4
##$PSIGN= 0
##$REVERSE= no
##$SF= 250.13
##$SI= 32768
##$SIGF1= 0
##$SIGF2= 0
##$SINO= 400
##$SIOLD= 32768
##$SREGLST= <1H.DMSO>
##$SSB= 0
##$STSI= 32768
##$STSR= 0
##$SW_p= 5175.98343685301
##$SYMM= 0
##$S_DEV= 0
##$TDeff= 65536
##$TDoff= 0
##$TI= <Analysis number 999999
Compound Code 99
Book Reference 9
Project Code 9>
##$TILT= no
##$TM1= 0
##$TM2= 0
##$TOPLEV= 0
##$USERP1= <user>
##$USERP2= <user>
##$USERP3= <user>
##$USERP4= <user>
##$USERP5= <user>
##$WDW= 1
##$XDIM= 32768
##$YMAX_p= 284242526
##$YMIN_p= -304637
$$ End of Bruker specific parameters
$$ ---------------------------------
##NTUPLES= NMR SPECTRUM
##VAR_NAME=  FREQUENCY,     SPECTRUM/REAL,   SPECTRUM/IMAG
##SYMBOL=    X,             R,               I
##VAR_TYPE=  INDEPENDENT,   DEPENDENT,       DEPENDENT
##VAR_FORM=  AFFN,          ASDF,            ASDF
##VAR_DIM=   32768,         32768,           32768
##UNITS=     HZ,            ARBITRARY UNITS, ARBITRARY UNITS
##FACTOR=    0.157963299565203, 1,           1
##FIRST=     4132.6476996994, 0,             0
##LAST=      -1043.33573715361, 0,           0
##MIN=       -1043.33573715361, -304637,     0
##MAX=       4132.6476996994, 284242526,     0
$$ Real data points
##PAGE= N=1
##DATA TABLE= (X++(R..R)), XYDATA
$$ [...]
15052A3470j804m156p504J049j437m340J2156O524j4056R396n554n645j217j3402
15038a6520m972n18l726R453J0668J003J712L743l772p82K156J695P380l20M431
15023A1631Q896j2099p853l742l462j0578k726R563M112J2290K016n418j6761
15010a4131o997J09P221N365L892n065K943K912j2233j1724l731r26L92L173J1840
14995a6960O262J70M155k321l401R434P630M845j186j1568M491M833l827p532
14981d975O045O985P259j941k069k975j705L938j0052k048p811q480L425On7M415
14965a0040J7741K287o187M686k528j3876l845p384J356j104r445n3N157M355
14951a8880J7831N505n804o081m681o564K360q289l081J9936J578m453J303N128
$$ plain form
15052 13470 11666 7510 6 1055 -382 -4722 7434 13958 -98 9298 3744 -1901 -3118 -16520
15038 -16520 -21492 -22010 -25736 -16283 -5615 -4612 -2900 843 -2929 -3711 -1555 140 7520 7200 11631
15023 11631 20527 8428 575 -3167 -6629 -17207 -19933 -10370 -6258 6032 8048 2630 -14131
15010 -14131 -21128 -21019 -13798 -8433 -4541 -9606 -6663 -3751 -15984 -27708 -31439 -32365 -31973 -28800 -16960
14995 -16960 -10698 -10528 -6373 -8694 -12095 -2661 4969 9814 8628 -2940 1551 6384 2557 -4975
14981 -4975 1070 8055 15314 13373 11304 8329 6624 10562 510 -1538 -9349 -17829 -14404 -14398 -14455 -10040
14965 -10040 7701 9988 3801 8487 5959 -7917 -11762 -19146 -17790 -18894 -28339 -28392 -23235 -18880
14951 -18880 -1049 4456 -1348 -7429 -12110 -18674 -16314 -24603 -27684 -7748 -6170 -10623 -9320 -4192
14937d192N649k936O135L333J355P91p739o801P401k623j8016n371J527L418P148
14922a0921N425M825Q048p381j7911j337P362K918J3923K520r977j3872P657P230
14908a491k030N520q21r645K966R33L480j1444K38R638l115l564N588K25J579
14893a943l736k755k680j0709q366K766J89P761P319n998j2946kO180J1125Q992
14878d803J2359L521j6740k651R105M09M669m670l277Q558l392o409O975k555
14864A099j0451K56n38J2805Q179k836j2380k748J1749Q256p790q774M616J0173
14850A1616j1641n483M531P342m643O606K245n656j085p639n224k08J291o271
14836a4219k439o52j043J7013m336p342o341L883Q812R990J0121j942Q479j1409
$$ plain form
14937 -4192 1457 -1479 4656 7989 9344 10135 2396 -4405 2996 373 -17643 -23014 -21487 -18069 -10921
14922 -10921 -5496 -671 7377 -4 -17915 -19252 -11890 -8972 4951 7471 -2506 -16378 -8721 -1491
14908 -1491 -3521 1999 1178 -8467 -5501 -4568 -1088 -12532 -12294 -2656 -5771 -9335 -3747 -3522 -1943
14893 -1943 -5679 -8434 -11114 -21823 -30189 -27423 -27234 -19473 -12154 -18152 -31098 -31100 -24920 -13795 -4803
14878 -4803 7556 11077 -5663 -8314 791 1200 5869 1199 -2078 6480 3088 -3321 3654 1099
14864 1099 -9352 -9096 -9634 3171 11350 8514 -3866 -6614 5135 13391 5601 -3173 1443 11616
14850 11616 -25 -5508 -977 6365 1722 8328 10573 4917 3832 -3807 -9031 -9239 -7948 -14219
14836 -14219 -16658 -17310 -18353 -1340 -5676 -13018 -19359 -15476 -6664 3326 13447 11505 19984 8575
14822H575o108o231m9J4354j428j2499j6573j183J2608J7310q48j0317m656M434
14808b611N767n867j628K690J2417p613n644L1l368l507n108M336Q227m599n076
14793a1553J919o127P856R342q660j3155J921k025n866m963m162J6036K4154K811
14779G528q247p098p909j081JM28K3779P16q33L200o27n963k182j560l563m965
14763h376k002J1739k518q46k208p793K975r367K391J0988P344L995K669j490
14749G501p616n270j484Q79J2528N039P612J093J340j0797j0066j256n290J463
14735d324m926l855M656R261M97L828M198m590k806l580m521P480P394L354K819
14720A4885k839j1550j4600n063M137O525L710N846M985P470Q402j18l956k478
$$ plain form
14822 8575 2467 -3764 -3813 10541 9113 -3386 -19959 -21142 -8534 8776 7928 -2389 -7045 -2611
14808 -2611 3156 -2711 -4339 -1649 10768 3155 -2489 -2458 -5826 -9333 -14441 -10105 -1878 -6477 -11553
14793 -11553 -9634 -15761 -7905 1437 -7223 -20378 -18457 -20482 -26348 -31311 -35473 -19437 4717 7528
14779 7528 -719 -7817 -15726 -16807 -16806 -16378 7401 8117 7284 10484 9857 3894 1712 152 -3411 -8376
14763 -8376 -10378 1361 -1157 -2003 -4211 -12004 -9029 -18396 -16005 -5017 2327 6322 8991 7501
14749 7501 -115 -5385 -6869 -5990 6538 11577 19189 20282 21622 10825 759 -497 -5787 -4324
14735 -4324 -9250 -13105 -8449 812 1309 5137 9335 4745 1939 -1641 -6162 1318 8712 12066 14885
14720 14885 12046 496 -14104 -19167 -15030 -8505 -4795 1051 6036 13506 21908 21790 17834 15356
14706A5356j5285n876J1475j574n639q041o559Q732O348M213P455J357l433p004
14692A525k52m955r032l986j986j280K661m258k522M005O50J834K347N974O628
14677b647o156n787Q283J2964m222q770O806J867o022J259R29L853J508l420J583
14662B028q509j6243k901L535J7162Q625J317j540j550k274O5J078K32L421r790
14647e344k268M254J0361k000k415l54k480N227K723n593o798j1701N652J0815
14633G9N868K784p349j1413j318N553k003M837P52O503m485m77m488M956j536
14618a737n487k74k764N355l687K786L501K734L746p016j0298P330N422L533M451
14603G595r532m729J0612K339o621p226q346r689O285J2232l29o742O987Q166
$$ plain form
14706 15356 71 -5805 5670 4096 -1543 -9584 -16143 -7411 -1063 3150 10605 11962 8529 1525
14692 1525 1273 -3682 -12714 -16700 -18686 -19966 -17305 -21563 -24085 -20080 -19430 -17596 -15249 -9275 -2647
14677 -2647 -8803 -14590 -6307 6657 2435 -6335 471 2338 -3684 -2425 -1496 2357 3865 445 2028
14662 2028 -6481 -22724 -25625 -22090 -4928 3697 5014 3474 1924 -350 -285 793 1025 4446 -5344
14647 -5344 -7612 -3358 7003 5003 2588 2234 -246 4981 7704 2111 -4687 -16388 -10736 79
14633 79 5947 8731 1382 -10031 -11349 -5796 -7799 -2962 -2210 4293 -192 -669 -5157 -201 -1737
14618 -1737 -7224 -7498 -10262 -4907 -8594 -5808 -2307 427 4173 -2843 -13141 -5811 -389 3144 7595
14603 7595 -1937 -6666 3946 6285 -336 -7562 -15908 -25597 -19312 -7080 -7409 -14151 -7164 1002
14589A002o104n154Q94J914n432k649L019Q620J956l771K43n144K200K700J4153
14574H447l484l312n420j1157K637J236l221Q833p506j0225J946J3285J138J512
14560e291r58r105M262J4144P213m941J904j781L839k285p820m638J613K108O748
14545E012j309j459k59K029r464K98O077l962q741m853J0147N406q36K128N035
14530E249o251j917k40R374j699M893O479n227q018o710k711K397M252k975o730
14515i834L869L99l738l991r282Q491M206K605M668l815N032J1427Q56Q434r569
14500I758j7154j5111r091J3603J4487K461l376m904Q08P309N051m860k02M286
14486C065o788m077k66K525N489R816l013l718J0482M55l605l78L611l809j680
$$ plain form
14589 1002 -5102 -10256 -9362 -7448 -12880 -15529 -12510 -3890 -1934 -5705 -5462 -10606 -8406 -5706 8447
14574 8447 4963 1651 -3769 -14926 -12289 -11053 -14274 -5441 -12947 -23172 -21226 -7941 -6803 -5291
14560 -5291 -6249 -15354 -11092 3052 10265 5324 7228 5447 9286 7001 -819 -5457 -3844 -1736 5012
14545 5012 3703 2244 1985 4014 -5450 -5152 925 -3037 -11778 -16631 -6484 -1078 -1914 214 5249
14530 5249 -1002 -2919 -3159 6215 4516 9409 15888 10661 2643 -4067 -6778 -4381 -129 -3104 -9834
14515 -9834 -5965 -5566 -9304 -13295 -22577 -14086 -9880 -7275 -2607 -6422 -1390 10037 10893 19327 9758
14500 9758 -7396 -22507 -31598 -17995 -3508 -1047 -4423 -9327 -8519 -1210 3841 -1019 -1221 3065
14486 3065 -3723 -7800 -8066 -5541 -52 9764 6751 3033 13515 13970 10365 9987 13598 9789 8109
14471H109k399j6223o972N968Q416r295P88J3059j757k260K319l746p802K67J1105
14456d23K496J077j8494O502L381j614K507K535l167n927L632M017k186K021j91
14441c834r436P976l774n828p420R148J4241K617r692j3157o777l114J1990P587
14427i473J0585L689J0296N095j2768o962r540j1921J036M948J4101M22j0967
14414a1459K785L215L644J0663O898l767m613kj0000o690L594o568p066k845O104
14399a6107j073O576j992L514M708K98R8N060M753K222q675m534J2393R020j0796
14384E465j1090m566J766l478K860M367J106m860J393L296J0725j915j4675j0595
14370b0201L513L339M102j302l173J1637J2553p120M54N58j2263m654K438N164
$$ plain form
14471 8109 5710 -10513 -17485 -11517 -3101 -12396 -11608 1451 -306 -2566 -247 -3993 -11795 -11528 -423
14456 -423 2073 3150 -15344 -8842 -5461 -7075 -4568 -2033 -5200 -11127 -7495 -3478 -5664 -3643 -3834
14441 -3834 -13270 -5294 -9068 -14896 -22316 -13168 1073 3690 -6002 -19159 -25936 -29050 -17060 -9473
14427 -9473 1112 4801 15097 20192 7424 462 -9078 -20999 -19963 -15015 -914 -492 -11459
14414 -11459 -8674 -5459 -1815 8848 15746 11979 7366 7364 -2636 -9326 -5732 -12300 -19366 -22211 -16107
14399 -16107 -17180 -10604 -12596 -9082 -4374 -4076 -3978 1082 5835 8057 -618 -5152 7241 16261 5465
14384 5465 -5625 -10191 -8425 -11903 -9043 -4676 -3570 -8430 -7037 -3741 6984 5069 -9606 -20201
14370 -20201 -16688 -13349 -9247 -10549 -13722 -2085 10468 3348 3802 4360 -7903 -12557 -10119 -4955
14356d955p201J647J1930k269m754O079J1428J466l201J121q999q948L158k197
14342e695K814J256m955j957J4171l961j4424M636j0580j0473P572P329k84J2202
14328b349J4082n032p579K422M780o420r696p072n457J092P057Q534J370Q482
14314D214Q484n169n837n77R59k564k57P06J1925q32J763m950j1591P162J6116
14299A9552q456j5121j3563n814n458N126N698K145k499N640P99J776J532m239
14285a2882J652m627l37R753q524o153N288M496Q780M735q26q736j571l104l01
14270a2357m446J699P481J439Q040j0039n359L262p19l689k609q0r172Q519J0465
14255g565O46J1093J485j153J391j532j007l872P227j22M546j3663j1717Q61L114
$$ plain form
14356 -4955 -12156 -10509 1421 -848 -5602 477 11905 13371 10170 11291 2292 -6656 -3498 -5695
14342 -5695 -2881 -1625 -6580 -8537 5634 1673 -12751 -8115 -18695 -29168 -21596 -14267 -14551 -2349
14328 -2349 11733 6701 -878 1544 6324 -96 -9792 -16864 -22321 -21229 -14172 -5638 -4268 4214
14314 4214 12698 7529 1692 1115 2074 -490 -747 -41 11884 11052 12815 7865 -3726 3436 19552
14299 19552 11096 -4025 -17588 -23402 -28860 -23734 -18036 -15891 -18390 -12750 -11951 -10175 -8643 -12882
14285 -12882 -11230 -15857 -16194 -6441 -14965 -21118 -15830 -11334 -2554 2181 1355 -7381 -8952 -12056 -12357
14270 -12357 -16803 -15104 -7623 -6184 1856 -8183 -13542 -10280 -10999 -14688 -17297 -17377 -26549 -18030 -7565
14255 -7565 -6919 4174 5659 4506 5897 4365 3358 -514 6713 6591 11137 -2526 -14243 -13382 -10268
14240a0268J602N06r431J998J2368J319M693O75m825j0358m23P801J683j713r304
14225a3677j02L718p542j5323l6J9668J1121k379n684J407N509P524K627K759
14211I590j267p539K218N323j0212o212l951L135p929K504P238L40l182N495Q121
14196C672m700Q344J35j0719j172J4299J0112l673p675j6968q362Q06j65M731
14182a1335p341J50k055O578O831J2062Q044j633j7509m564O516J0259K207r838
14168a628j6327N121J6165M906K444M637M983k283m626j0741k060r613j215J0212
14154b5J929L228n813o494m318r280r543L160J340J348J3495K105N178l647r837
14139a7174k124R981J5050M82m980J751k462k318j0096j4066K31Q583J6777R766
$$ plain form
14240 -10268 -8666 -8160 -17591 -15593 -3225 -1906 2787 3462 -1363 -11721 -12144 -4343 -2660 -4373 -13677
14225 -13677 -13779 -10061 -17603 -32926 -32962 -13294 -2173 -4552 -10236 -8829 -3320 4204 6831 9590
14211 9590 8323 784 3002 8325 -1887 -8099 -12050 -8915 -16844 -14340 -7102 -6762 -9944 -4449 3672
14196 3672 -1028 7316 7451 -3268 -4440 9859 19971 16298 8623 -8345 -16707 -15901 -16066 -11335
14182 -11335 -18676 -18526 -20581 -14003 -7172 4890 12934 11301 -6208 -10772 -4256 6003 8210 -1628
14168 -1628 -17955 -12834 3331 8237 10681 15318 20301 18018 13392 2651 591 -9022 -10237 -25
14154 -25 1904 5132 -681 -7175 -11493 -20773 -30316 -27156 -25816 -24468 -10973 -8868 -3690 -7337 -17174
14139 -17174 -19298 -9317 5733 6215 1235 2986 524 -1794 -11890 -25956 -25725 -17142 -365 9401
14125I401J818q147k723m618q42k248l241N857J0277J702j6754j8844l69J7970
14111a0761J1074R5L246n290L298Q457K291l834q335q161q887L915P494k80o127
14096a1805o25m998K711R317J3019J674p315k811P170k975N64k760j210k969J0442
14081G429O561L674L504J941p746p352n294j4241L565P365o212j5694P2J2165
14067a0263R628j1556j191J6158L50j821J299p324m293M807J2167o372j5085m70
14053a3966k026m226r529J209J0309L717J470k913J0882J5975M950j5683j4531
14040a4362j271O603L196K079L628l456m287j090K114M091o582j6639m542R936
14026b0582O579R075R978J703n713q218k2515k720j973O599O679P509K690K154
$$ plain form
14125 9401 11219 3072 349 -4269 -5111 -7359 -10600 -4743 5534 7236 -9518 -28362 -28731 -10761
14111 -10761 313 408 3654 -1636 1662 10119 12410 8576 241 -7920 -16807 -12892 -5398 -5678 -11805
14096 -11805 -12430 -17428 -14717 -5400 7619 9293 1978 -833 6337 3362 3926 1166 -44 -3013 7429
14081 7429 13990 17664 21168 23109 15363 8011 2717 -11524 -7959 -594 -6806 -22500 -22428 -10263
14067 -10263 -635 -12191 -13382 2776 3126 1305 2604 -4720 -9013 -4206 7961 1589 -13496 -13966
14053 -13966 -15992 -20218 -29747 -28538 -18229 -14512 -13042 -15955 -5073 10902 15852 169 -14362
14040 -14362 -15633 -9030 -5834 -3755 -127 -3583 -7870 -8960 -6846 -2755 -9337 -25976 -30518 -20582
14026 -20582 -14003 -4928 5050 6753 1040 -7178 -29693 -32413 -34386 -27787 -21108 -13599 -10909 -8755
14012h755M632j127J3771L165j839j0526l642J1925K550j0463K725K883J813K972
13998A0084n790m151q999K04o29P279P608q471j7793n826N211K851M925L952M159
13983e386P677j430p496J732P142q078J240J998N956o204K852Q544P593J2848
13969B8988p537j1120J936P601L969j0507j0876M918J830m130k791j423m575K833
13955h84O562O859j6774J7674R766l157j0862m023L187J883o006k980Q24N59j452
13940A176L593P006N847N874q06j189r546L066M004N814K940l605j0046O344N138
13925B5610r569j5409n448l532k439M205m332k515J0292l603l328P83K170K029
13911e086M122m977j1105J025J6142P261K352j1387l643J6471p18O43K355p913
$$ plain form
14012 -8755 -4123 -5250 8521 11686 9847 -679 -4321 7604 10154 -309 2416 5299 7112 10084
13998 10084 4294 143 -8856 -8652 -9281 -2002 5606 -2865 -20658 -26484 -21273 -18422 -13497 -9545 -5386
13983 -5386 2291 861 -6635 -4903 2239 -5839 -4599 -2601 3355 -2849 3 8547 16140 28988
13969 28988 21451 10331 12267 19868 23837 13330 2454 7372 9202 5072 2281 858 -3717 -884
13955 -884 5678 12537 -4237 13437 23203 20046 9184 5161 8348 10231 4225 1245 2069 2628 1176
13940 1176 4769 11775 17622 23496 22690 21501 11955 15021 19025 24839 27779 24174 14128 20472 25610
13925 25610 16041 632 -4816 -8348 -10787 -6582 -10914 -13429 -3137 -6740 -10068 -9285 -7115 -5086
13911 -5086 -964 -5941 -17046 -16021 121 7382 9734 -1653 -5296 11175 10457 11100 13455 5542
13897E542j073K517J60m901K363J0737J396J328l889j4838m23R386n433j0975
13883h103L469J470l487k330J494Q870L410l414m13r244P56l680J682l510J4859
13868A829N387m637j357J2736J1399j0858l985n817o553j438R519o014r430j530
13854a0749Q363J0951M295k280q834Q65R201r43j838R97k775N729o501l730l030
13839b79q92M323l945r72O100L89M890J583l514l386N979k069r707l814k612K264
13823e662n979n836P208J408p106K267J4160J091j402o526p958j2009M134N522
13809a6688M242O379M730L292q37p738l204j3788P560J5587P207k416l363N650
13795F613l798n41l71p620l792r525k552J3327J6359q410j0612P20l24m899J5763
$$ plain form
13897 5542 4469 6986 7146 2245 4608 15345 16741 18069 14180 -658 -1081 8305 2872 -8103
13883 -8103 -4634 -3164 -6651 -8981 -7487 1383 4793 1379 966 -8278 -7522 -11202 -9520 -13030 1829
13868 1829 7216 2579 1222 13958 25357 14499 10514 4697 -1856 -3294 6225 211 -9219 -10749
13854 -10749 -2386 8565 12860 10580 1746 2611 11812 10869 9031 10028 7253 12982 6481 2751 -279
13839 -279 -1171 3152 -793 -1765 4335 4724 9614 11197 7683 4297 10276 8207 -1500 -5314 -7926 -5662
13823 -5662 -11641 -17477 -10269 -8861 -15967 -13700 460 1551 149 -6377 -14335 -26344 -22210 -16688
13809 -16688 -12446 -6067 -1337 1955 1118 -6620 -9824 -23612 -16052 -465 6742 4326 963 6613
13795 6613 2815 2274 1903 -5717 -9509 -19034 -21586 -8259 8100 -310 -10922 -10202 -10526 -15425 338
13780C38J7340q642J0858l850j0892n538n999J561l987N557K529l017p696M357
13766g081M486m469K620K523M41K060M116P332O374K043j6754J0781P616j6211
13752E877q407j213k41o75r599J4843J6077j28o874m971n006j634j0199L543J0195
13737A588J4908j2532j2171j0564L559J2834o37r568q396M233J1325R322K468
13724F369q123J464l255p47n017o161J352O248J0053j835r453l880k996q645J073
13709b3553M649L292P678P796R149k118j0203Q8J655M937k716o549k763L893J4023
13694I258N379l856k556j10P503J2070m078j5256n988p503m153O053O590J667
13680E020k964K018M333o616p577p22P051n036l011j193j454r675n642p518M46
$$ plain form
13780 338 17678 9036 19894 16044 5152 -386 -6385 -4824 -8811 -3254 -725 -3742 -11438 -7081
13766 -7081 -2595 -7064 -4444 -1921 -1480 580 4696 12028 18402 20445 3691 14472 22088 5877
13752 5877 -2530 -3743 -3984 -4659 -14258 585 16662 16534 9660 4689 -317 -1951 -12150 -8607 1588
13737 1588 16496 3964 -8207 -18771 -15212 -2378 -3015 -12583 -20979 -16746 -5421 3901 6369
13724 6369 -1754 -290 -3545 -4292 -9309 -15470 -14118 -7870 2183 348 -9105 -12985 -15981 -24626 -23553
13709 -23553 -18904 -15612 -7934 -138 9011 6893 -3310 -3222 -1567 3370 654 -5895 -8658 -4765 9258
13694 9258 14637 10781 8225 8115 15618 27688 23610 8354 2366 -5137 -9290 -3237 3353 5020
13680 5020 2056 4074 8407 1791 -5786 -6508 543 -4493 -7504 -8697 -10151 -19826 -25468 -32986 -32540
13665c2540P208R307R972k8J453J71l87L814R028Q296L421P07j1665q426L297
13650C628p42K961J496l305O311o489p145o096L416J372r60j765J3481J770L55
13635H288k864n235K081M867j214r688j115O67J2438R058k603J5022j286j5579
13621A2837q200j677J500K766N824p369j812J1889Q169Q423p018j0852k600O564
13607A8444k497j768p966O245j46J263L945J2m14N452J635N707n542o685K351
13592B0036o320L700N117k292J0390J6202J6449J1621O452J9857L9810M6463M3835
13579B31320N6747Q5371J19622J96750K83296L12122J53350m1581k07004l00743
13569H89250k50457j36642p1072m7327l6053l7855j9871k3129k8099j6838k0016
$$ plain form
13665 -32540 -25332 -16025 -6053 -6081 -4628 -4457 -4844 -1030 7998 16294 19715 20422 8757 331 3628
13650 3628 2886 5847 7343 4038 10349 3860 -3285 -9381 -5965 -4593 -5553 -7318 6163 7933 8288
13635 8288 5424 189 2270 7137 5923 -3765 -4880 -4213 8225 17283 14680 29702 28416 12837
13621 12837 4637 2960 4460 7226 13050 5681 3869 15758 23927 32350 25332 14480 11880 18444
13607 18444 15947 14179 6213 12458 12312 13575 17520 17532 17118 22570 24205 29912 24370 17685 20036
13592 20036 13716 17416 22533 20241 30631 46833 63282 74903 81355 101212 141022 187485 231320
13579 231320 288067 373438 493060 689810 973106 1285228 1438578 1396997 1189993 889250
13569 889250 638793 502151 431079 383752 347699 309844 289973 266844 238745 221907 201891
13558B01891q673p431L387N224o18Q090L8674N1090N3322O0078P9128J06046J47456
13545G37664K54654L75491N56311O20608L76109j8009l75948o24356n33808l18188
13535A050528j67831j09490p8650p3205n5598n9283n8647m9704m6999m3595l3081
13524B74445k1585j6075j6027r596M547J7158J9724K1664M0667N8479O6403J13684
13512E53488J76888K74178L35372K24308J1355j86148l40919l02229j67217q8077
13502D90999n7989n8964l8671l3343l8664l2296k0230j7122k4448k3356j5730
13491A30186j9448j3907o912j0698j6155j4400M991n578M97n069o23L34O521q538
13477D1201k0640J92j234J2605J71n206R992p327p328K96L774n116k635j1344
$$ plain form
13558 201891 193218 185787 189174 194398 193780 201870 240544 291634 344956 405034 484162 590208 737664
13545 737664 992318 1367809 1924120 2544728 2920837 2902828 2526880 1902524 1368716 1050528
13535 1050528 882697 773207 694557 621352 565754 506471 447824 398120 351121 307526 274445
13524 274445 252860 236785 220758 211162 215709 232867 252591 274255 314922 373401 439804 553488
13512 553488 730376 1004554 1339926 1564234 1575589 1389441 1048522 746293 579076 490999
13502 490999 433010 374046 335375 302032 263368 231072 210842 193720 169272 145916 130186
13491 130186 110738 96831 89919 79221 63066 48666 53657 48079 48576 43507 42884 43218 49739 41201
13477 41201 20561 20753 19519 32124 32295 27089 37081 29754 22426 22722 26496 21380 18745 7401
13463G401j4259Q707J0989J0603q014m089m118m508r667L0O616O810P51j2858
13449e606o522r400L417J7647J1172N013k167p563J575L218J4445m744l226K705
13435A9964j556q827M130m74P110L969j424l862n256n171R663j073q506M860M446
13420A7993L812J3023M598l475j205K110o634o458M918m924o908K748N912l878
13406B1632l75p03l03l429L186r29j0826L878N196J151P369r7o853P190l020m886
13390A8181k58j5769l545P507N31K141Q108m823n413J516J1346P481n038n711
13376A6254j0606k142M618j097j2239J784p98O453J1812M916K347k3482L87K14
13362a579j587K494M41J619k102k781J5668P182K89j2163j3267m364J0465J463
$$ plain form
13463 7401 -6858 1849 12838 23441 15427 11338 7220 2712 -6955 -6925 -309 6501 7252 -5606
13449 -5606 -12128 -21528 -18111 -464 10708 15721 13554 5991 7566 10784 25229 20485 17259 19964
13435 19964 18408 9581 13711 13237 20347 24316 22892 19030 13774 8603 18266 17193 8687 13547 17993
13420 17993 21805 34828 39426 35951 34746 36856 30222 23764 28682 23758 16850 19598 25510 21632
13406 21632 21257 20554 20251 16822 20008 19079 8253 12131 17327 18478 25847 25750 18897 26087 23067 18181
13390 18181 17923 2154 -1391 6116 6647 8788 16896 12073 6660 8176 19522 27003 21965 16254
13376 16254 5648 3506 8124 7027 -5212 -3428 -4226 2227 14039 18955 21302 -2180 -1793 -1579
13362 -1579 -3166 -672 -231 1388 -714 -3495 12173 19355 19644 7481 -5786 -10150 315 1778
13348A778q300J882J246p918P506J2833q183q598R610J4981M503p093l494M593
13334A5346r555n50k70p304n861J56O527P158o48M44J0165J3422n82j4541j3355
13319E52K911J280J473k022m335o52K075k92k788o379j2547J288p166L662O514
13304a6426M766Q664l151j39m782m247l65Q711J3915j73j2608M259O670j035R633
13289A3692n889r623n300K97k806L687O597L280O626K205M701m205k530q640m428
13274b336r297q79J2097J2648M417k014M641m163o843o656p102o148n218j883
13260a8736J594P120J1406L458J397o151m335r768l526K280J5712J2675j326j1834
13246c4q440J1031l832o560L128k158J0517j1209P452M325j255J237j263P339
$$ plain form
13348 1778 -6522 -4640 -3394 -11312 -3806 9027 844 -7754 1856 16837 21340 14247 10753 15346
13334 15346 5791 5241 4971 -2333 -8194 -8038 -1511 5647 4999 5443 15608 29030 28448 13907 552
13319 552 3463 4743 6216 4194 -141 -793 1282 990 -1798 -8177 -20724 -19436 -26602 -22940 -16426
13304 -16426 -11660 -2996 -6147 -6286 -11068 -15315 -15680 -6969 6946 6773 -5835 -1576 5094 4059 13692
13289 13692 7803 -1820 -7120 -6823 -9629 -5942 655 3935 10561 12766 17467 13262 10732 2092 -2336
13274 -2336 -11633 -12512 -415 12233 16650 14636 19277 15114 8271 1615 -5487 -11635 -16853 -18736
13260 -18736 -17142 -10022 1384 4842 6239 88 -4247 -14015 -17541 -15261 451 13126 11800 -34
13246 -34 -8474 2557 -1275 -7835 -4707 -6865 3652 -7557 -105 4220 2965 4202 2939 10278
13232A0278M105k213j0210K823m787L009L690j054k233K505J0095N115r390p972
13218C761m659Q993P209R644k92O50J409m217r139p764m911j0451m283O277p037
13203a4810p159P710O922l53O318L196Q97l403o442j2645J6926K7326J1902r734
13189B6651j3683j7825o502J787k102Q083L681M350n128M83Q822r958m960j0034
13175a6335k948J0209N018K656J122m236K596J0520L371n384j0737O562Q22R94
13161D230L918m309o577j738J8903O984o209Q219J620n564M267N917O033j3733
13147B1961p873J1183J711q501k21m142J240j195M569J359n662q920p798M469
13133B180P451J382l654L986P042K808K999l275K965k370N055M776q425p925m193
$$ plain form
13232 10278 14383 12170 1960 4783 -4 3005 6695 5641 3408 5913 16008 21123 11733 3761
13218 3761 -898 8095 15304 24948 24656 25306 26715 22498 13359 5595 684 -9767 -14050 -7773 -14810
13203 -14810 -21969 -14259 -7337 -7690 -1372 1824 2721 -682 -7124 -19769 -2843 24483 36385 26651
13189 26651 12968 -4857 -11359 -9572 -11674 -3591 90 4440 -688 -205 8617 -1341 -6301 -16335
13175 -16335 -19283 -9074 -4056 -1400 -278 -4514 -1918 8602 11973 6589 -4148 2414 3236 4230
13161 4230 8148 3839 -2738 -4476 14427 21411 15202 23421 25041 19477 23744 29661 35694 21961
13147 21961 14088 25271 26982 18481 18260 14118 15358 14163 18732 20091 14429 5509 -2289 2180
13133 2180 9631 11013 7359 11345 18387 21195 24194 20919 23884 21514 26569 31345 22920 14995 10802
13118A0802J178L108N272k588j2081r00q56r60k46j928K959O755m162p234M246
13103C365m77k551R728r482m823N192J1759o457m722J1202J883m43M787Q505N370
13088C2836j9861j695r801o804Q593J4440L772n882N741M853k855j0277k495R213
13074A9778L904N105k731L516J3989J3660K2368J0335J2509J0363J8914L2747
13062A64457M0094N6534O6109P1841M3341K023k8417m8064n6901n5852l9348l6413
13050A79404j9560k2276j1938j8578m148q053m745r034o977q614j6426j2012k917
13037C4126r561j1109N839K182O432j0789r664q420L335K554L968R91r565l528
13023c209L003N610l01j2676j5361J0364J4800R750k622J323j6292q194K259l357
$$ plain form
13118 10802 11980 15088 20360 17772 5691 4791 3935 2975 2729 801 3760 10515 6353 -881 3365
13103 3365 2888 337 10065 583 -4240 952 12711 6254 1532 12734 14617 14174 18961 27466 32836
13088 32836 12975 11280 1479 -5325 3268 17708 21480 15598 21339 26192 23337 13060 10565 19778
13074 19778 23682 28787 26056 29572 43561 57221 79589 89924 102433 112796 131710 164457
13062 164457 204551 261085 327194 399035 442376 444399 415982 367918 311017 255165 215817 179404
13050 179404 159844 137568 125630 107052 102904 94851 90106 81072 74095 65481 49055 37043 34126
13037 34126 24565 13456 19295 21477 27909 17120 7456 -964 2371 4925 8893 9884 319 -3209
13023 -3209 -206 5404 5103 -7573 -22934 -12570 2230 11980 9358 10681 -5611 -13805 -11546 -14903
13009a4903p399J3258P941n642o561Q918O114m184r773L241P838j0729P131J6533
12995A1783j906M947k220m46p463l524M661j781p7P94p011j417m13L686p734j455
12979i576N70N706m658k337K203M044o835L420Q683j1653m707Q910Q208j5077
12965a3099n470L263J2691M939o523n48p283k11M836K386j924K790m195l415k966
12950a4729n641M799j980j536l033K060J5580J1467l370j4696o206K314J0474
12937d497R53R148L752l378p261K580J035j0774p072k243K481o942k440M691L14
12922a9653r135L001M352P223J6731O735Q137K9248K7977J2152J9308J559j2671
12909I4964l315m862j3974o881m23J0937O116M006l037l561j329k660m336r462
$$ plain form
13009 -14903 -22302 -9044 -1103 -6745 -13306 -4388 1726 -2458 -12231 -8990 -1152 -11881 -4750 11783
12995 11783 9877 14824 12604 12158 4695 1171 5832 4051 3974 4768 -2243 -3660 -4073 -387 -8121 -9576
12979 -9576 -9006 -3300 -7958 -10295 -8092 -4048 -10883 -7463 1220 -10433 -15140 -6230 1978 -13099
12965 -13099 -18569 -15306 -2615 2324 -4199 -4747 -12030 -12241 -7405 -5019 -6943 -4153 -8348 -11763 -14729
12950 -14729 -20370 -15571 -17551 -19087 -22120 -20060 -4480 6987 3617 -11079 -17285 -14971 -4497
12937 -4497 -3544 5604 9356 5978 -1283 1297 2332 -8442 -15514 -17757 -15276 -22218 -24658 -19967 -19653
12922 -19653 -28788 -25787 -21435 -14212 2519 9254 17391 46639 74616 86768 106076 107635 94964
12909 94964 91649 86787 72813 65932 65509 76446 82562 86568 83531 79970 78641 75981 71645 62183
12895F2183M57Q780J383J9773K9130J9697M1005L5772M6322P0619P5111R5379
12883E05611J51072K35755L30464M44605M04790J98931p5159l26228m27219l46978
12873A095644k06250j40158r6125q1714o6616n2536n3064n1591l1579l7719l6185
12862B42107k6287j7670j9702j7198r616k0889k4475j4637m576m723j3508M321
12850G3147R805n310n967m902n734q254k4327j4944L489K144K713l652J4172L559
12836C5939n450K977L599P330J003o075m046r13n049P825P804J0736p565J22j8763
12821B9474K84J5412J140J0769J3216k453q631n920Q398L175J002m657r589K510
12807E4130K563k318q881l441o034O212Q255J348n330p255p754j605K387J4141
$$ plain form
12895 62183 62640 71420 72803 92576 121706 141403 182408 218180 264502 335121 410232 505611
12883 505611 656683 892438 1222902 1667507 2072297 2271228 2196069 1869841 1442622 1095644
12873 1095644 889394 749236 653111 571397 504781 452245 399181 347590 316011 278292 242107
12862 242107 215820 198150 178448 161250 151634 130745 106270 91633 87057 82334 68826 73147
12850 73147 82952 77642 71675 66773 61039 52785 28458 13514 17003 19147 21860 18208 32380 35939
12836 35939 30489 33466 37065 44395 45398 39323 35277 34364 29315 37140 44944 55680 48115 48237 29474
12821 29474 29758 45170 46310 57079 70295 67842 59211 53291 61689 64864 65866 61209 51620 54130
12807 54130 56693 54375 45494 42053 36019 42231 50486 51834 46504 39249 31495 29890 32277 46418
12793D6418J7045p265p507N53l609l7l236k514Q06J085M418J6264J5511o009r340
12778F2583o748n384J977J0126m711l340L497M503L53p40M011O958P405k518J036
12763G9008n875q053j3282r391j9168q266k666j0545R83q860j1263k2584k2444
12750f2406k7607k6539p613K5618L6710L3756K1848K2962J1674J2060O935K788
12738E0186J4199J1779K0884J9145R072N546N270M870O796Q990J6793O850l72
12725A80008K114L925N326J2684J3239O950m8K769N29R995l77P526n693o253j675
12710B31019k374L75j274j910J4322J163q623L594o597m174L225J746J727J2312
12696B44531J4526J4732P906K286m931j065J0197J5489J4987K916Q06p504J14
$$ plain form
12793 46418 63463 56198 48691 49244 45635 45598 42362 39848 40654 41739 46157 62421 77932 71923 62583
12778 62583 55835 50451 52428 62554 57843 54503 58000 62503 62856 62116 66127 73085 80490 77972 79008
12763 79008 73133 65080 51798 42407 23239 14973 12307 1762 2745 -6115 -17378 -39962 -62406
12750 -62406 -90013 -116552 -124165 -98547 -61837 -28081 -6233 16729 28403 40463 47398 50186
12738 50186 64385 76164 97048 116193 125265 130811 136081 140951 147747 156737 173530 180380 180008
12725 180008 182122 186047 191373 204057 217296 224246 224198 226967 227496 237491 237114 244640 238947 232694 231019
12710 231019 228645 229020 227746 225836 240158 241321 232698 236292 229695 225521 228746 230492 232219 244531
12696 244531 259057 273789 281695 283981 279050 277985 288182 303671 318658 321574 322380 314876 314990
12683C14990J5730J3336J2105O242J1846J9283J4925J3750K501M065P459J4932
12671D51164K8314K1707J7667K7477L1556K4447K7214J2370J6493P893K1211N1790
12659G39303M8657L8201L9846N1079N3449P2833Q8015Q1291R8945J15631J25775
12648A553025J26959J39386J55406J59799J51456J64194K07315K60691L25651
12639C243882L94951M81976O43445Q27434J072525J384363J743556K151099K586565
12630A4529796L141947L953894N186940P015488R513611J2420923J4400815J3157738
12622H3321152P783799l67488q160651j2637901j2882819j0281399p362191n371207
12614C4041295m238722l521069k958226k544424k272511k077884j890707j686688
$$ plain form
12683 314990 330720 344056 356161 362403 374249 393532 408457 422207 424708 428773 436232 451164
12671 451164 479478 501185 518852 546329 577885 602332 629546 641916 658409 666302 687513 739303
12659 739303 787960 826161 866007 917086 970535 1043368 1131383 1212674 1311619 1427250 1553025
12648 1553025 1679984 1819370 1974776 2134575 2286031 2450225 2657540 2918231 3243882
12639 3243882 3638833 4120809 4764254 5591688 6664213 8048576 9792132 11943231 14529796
12630 14529796 17671743 21625637 26812577 33828065 43341676 55762599 70163414 83321152
12622 83321152 91104951 90737463 82576812 69938911 57056092 46774693 39412502 34041295
12614 34041295 29802573 26281504 23323278 20778854 18506343 16428459 14537752 12851064
12606A2851064j468433j274081j097053r63072q39082p17600o24447n45647m79428
12597D842221m40263l90278l31515k96908k74625k36756k22628k07509j99442
12588B242297j64244j51766j48029j25644j01304q4450q0708q1161p0414o7132
12578A167445n5287m6012n5581m3523l6485m4932m5994m3354l4239l4512m1618
12567F85908l3809j8075l3158k7685l9215l7924k5926p278k2456k5612k0619K610
12555C96761p589k7467k8070j6783j6962j0209m648j1633k38o284P229M027j9580
12542B58554q688j2363j2229r131J2665J705j0296j7782k0160n403j009n387j2669
12529A57807j3228n54n472J6083J7178j180j6353k2917j5617N026J0066k621R77
$$ plain form
12606 12851064 11382631 10108550 9011497 8048425 7209343 6491743 5867296 5321649 4842221
12597 4842221 4401958 4011680 3680165 3383257 3108632 2871876 2649248 2441739 2242297
12588 2242297 2078053 1926287 1778258 1652614 1551310 1466860 1386152 1304991 1234577 1167445
12578 1167445 1112158 1066146 1010565 967042 930557 885625 839631 796277 762038 727526 685908
12567 685908 652099 634024 600866 573181 533966 496042 470116 462838 440382 414770 394151 396761
12555 396761 389172 361705 333635 316852 299890 289681 285033 273400 273162 266878 274107 278134 258554
12542 258554 249866 237503 225274 216143 228808 230513 220217 202435 182275 176872 175863 170476 157807
12529 157807 144579 144025 138553 154636 171814 170634 154281 131364 115747 120773 130839 128218 129195
12516A29195R38r65q257q744P480j636P646K257r924q922O222L794n299L120R381
12501A26286J9430K3326K2542M1062M6521L9582K6937J4178R219Q74P614P174
12489C84745R794P471k348k1186k6619k7436j4792j9367j2892j4255j7030j2192
12477B33893k320K105k123N351K66k1401j0913r38j0537j224K103J857q819p252
12463A80048j1376p710J313j608j0573m799j641q647m645l840j1544J888L94N47
12449A17807r728o518k819J217K419m642p099r740p065o683K364R159N159n636
12435G8195j1124n352j1024j0758R681R341l328o438n86J905O077lk011m202r670
12420D0703j1485l167l9M913j820O347R802L009q26r32r01N100o236k73l686q058
$$ plain form
12516 129195 130133 129168 120911 112167 119647 118011 125657 127914 117990 109068 115290 119084 113785 116905 126286
12501 126286 145716 169042 191584 232646 279167 318749 345686 359864 369083 369957 377571 384745
12489 384745 394539 402010 399662 378476 351857 324421 309629 290262 277370 263115 246085 233893
12477 233893 231573 233678 231555 236906 237172 215771 204858 203920 193383 192159 194262 196119 187300 180048
12463 180048 168672 160962 162275 160667 150094 145295 143654 135007 130362 126522 114978 116866 117260 117807
12449 117807 108079 101561 98742 99959 102378 97736 90637 80897 73832 67149 69513 78672 83831 78195
12435 78195 67071 61719 50695 39937 49618 58959 55631 49193 48607 50512 56589 56586 54575 50373 40703
12420 40703 29218 26051 26012 30925 29105 35452 45254 48263 47437 46505 45604 50704 44468 44195 40509 32451
12404C2451J8361Q281r410m431q11l072o088o665k041J707N56N237P699N86l719
12389C8641j5517J596o522M203J764j0055J821J7123J2156k413n455M744Q425
12376E0511L62p218K55O533P376q800j579o916r471j4498j37q218K551J5008O410
12361C2169P321l828j1613l306j363k886J725n241l172o352Q468J205m209J0037
12347A8955J0995K281j45Q24j5668l676p605j4578K919K864m424j9846q697K937
12333c2864q301n952M21J6195K9355L1026K1374P325P07Q79k82k300j224K233
12319E8592k863j0253J767J335n66q048j1602o325O37o349p711K769J8546N556
12305C5485l773J4804J5563O308q226j6420j1246J260J820q80O785k709j2969
$$ plain form
12404 32451 50812 59093 49683 45252 44441 41369 35281 28616 26575 28282 28838 34075 41774 42360 38641
12389 38641 23124 24720 18198 22401 24165 14110 15931 33054 45210 42797 37342 42086 50511
12376 50511 50873 43655 43910 50443 57819 49019 47440 40524 31053 16555 16418 8200 10751 25759 32169
12361 32169 39490 35662 24049 20743 19380 16494 18219 12978 9806 3454 11922 13127 8918 18955
12347 18955 29950 32231 32086 32910 17242 13566 5961 -8617 -5698 -2834 -7258 -27104 -35801 -32864
12333 -32864 -41165 -47117 -46696 -30501 -1146 29880 51254 58579 59286 60165 59883 57583 56359 58592
12319 58592 55729 45476 47243 48578 48012 39964 28362 22037 22674 16325 8614 11383 29929 35485
12305 35485 31712 46516 62079 68387 60161 43741 32495 33755 35575 34695 41480 38771 25802
12292B5802k65m36K007j670o369J0491J2229m289O260k436n956J5985P789J6382
12278G5524K2546J2309l80k245j721j7308j3013j4423J625L093j0566q369p063
12265D0009q327N308l327j5084q342p34Q488l480j0733K225Q564J1519l138n328
12251A7620p677k946K995k253j3240l747L063k39M652J7360L997o071L205R174
12237B5893O286p250m809L565J412j70j099m064q07k505K771Q08n187q08O183
12222B0219N464j195p885p949P458j971j010J3269R438n849j38P566R645jP92
12207D7853J5549J0193j0748j4757j5079P68J6549l060k464j24M49J7092M394
12194F6615O888q4Q361J0346R575J6829J9123J5419J8209L1525M0134N0826O5226
$$ plain form
12292 25802 25537 25101 27108 25438 19069 29560 41789 37500 43760 41324 35368 51353 59142 75524
12278 75524 98070 110379 109999 107754 106033 88725 75712 61289 62914 66007 55441 47072 40009
12265 40009 31682 36990 33663 18579 10237 9503 17991 14511 3778 6003 14567 26086 22948 17620
12251 17620 9943 6997 9992 7739 -5501 -9248 -6185 -6424 -1772 15588 19585 13514 16719 25893
12237 25893 32179 24929 20120 23685 25097 24927 23828 19764 18957 16452 19223 20031 14844 14036 20219
12222 20219 25683 24488 16603 8654 16112 14141 13131 26400 35838 29989 29851 37417 47062 47061 47853
12207 47853 63402 73595 62847 48090 33011 33779 50328 47268 44804 44680 45129 62221 66615
12194 66615 73503 73419 81780 92126 101701 118530 137653 153072 171281 202806 242940 293766 358992
12181C58992O0112N7927L1883j9906l5650l6293m4129l8724j2205j3039j5765
12170B93203k3682p950J9949M3572N5053Q4322J44541J35779N6238m1156j21299
12159F38570j39996j01119o0171m0832m2018m2605k6924m324J068p691m414O263
12147A75807q967k4176k893l898j0694K665J4212J3644J0875K5244K3920L1668
12135B47407M6670Q0314J06010J39774J30366O9210O326n1134q9256o5423O589
12124F26853O1425J13564J66845K75554M00974M26400K43761k9048l05375m63305
12114A517648l94670k40583j19800q7565r0411p0013m7510l9817k5773k5745l1959
12103C43802l0586j7734R43j0780j1697o415P766L0237J8375N2697P8366Q6606
$$ plain form
12181 358992 419104 477031 508914 489008 453358 417065 372936 334212 322007 308968 293203
12170 293203 269521 261571 281520 325092 380145 464467 609008 744787 801025 759869 638570
12159 638570 498574 397455 337284 296452 254434 211829 184905 180581 181649 173958 169544 175807
12147 175807 166840 142664 139771 135873 125179 127844 142056 155700 166575 191819 215739 247407
12135 247407 294077 374391 480401 620175 750541 819751 826077 774943 685687 620264 626853
12124 626853 688278 801842 968687 1244241 1645215 2071615 2315376 2286328 1980953 1517648
12114 1517648 1122978 882395 762595 675030 584619 514606 467096 427279 401506 375761 343802
12103 343802 313216 295482 296425 285645 273948 267533 275299 305536 323911 376608 454974 541580
12091E41580J25801J92217K76664L92266M39821K86698L3541k20785l85755l40858
12081A341190j68593l9003L8682J04517J97393L34072M16797K88769J7775k48885
12071B282714m65431m52881k94012j60445j02766r7389r5829p4018n0019m7698
12061D42226m1540l7671k1367k4471j4933k2616o586k117M800J9764K8706K5407
12049C49602K5422N7499J11239J72667K63492L76636M67505L59178Q9355j69683
12039B102912l99592m07401k51171j22424o1455k0421K3951P3523J06104P4333
12029A118359M486j01604j68716j55864j19356r2229p0043l6233l3057k7872l7719
12018B80152k1648j7133k3103j4558j1633l89n410P37m328j0181o78J0509J4195
$$ plain form
12091 541580 667381 859598 1136262 1528528 1968349 2255047 2288588 2067803 1682048 1341190
12081 1341190 1172597 1133594 1172276 1276793 1474186 1808258 2225055 2513824 2531599 2282714
12071 2282714 1817283 1364402 1070390 909945 807179 709790 613961 539943 489924 442226
12061 442226 400686 363015 341648 317177 302244 279628 273042 270925 275725 295489 324195 349602
12049 349602 375024 432523 543762 716429 979921 1356557 1824062 2183240 2272595 2102912
12039 2102912 1703320 1295919 1044748 922324 860869 840448 864399 937922 1044026 1118359
12029 1118359 1122845 1021241 852525 696661 577305 485076 415033 378800 345743 317871 280152
12018 280152 258504 241371 218268 203710 192077 191688 186278 187015 182687 172506 171828 182337 196532
12005A96532J3034K8125L2864M6414Q7587J12373J39889J34326N3317m3374j32937
11994F68150j53754j06245o6897l0959k1660k5523k5137j7357k330j9222l2100
11983A66966k1238n276O083O504m069j7616q014l400l878k994N731O130N960m746
11969A26143M261k69K223Q594M584J4245K6468J1801L45J1492O045N964N304O281
11955B33481J4231O192J0341J4230J9272K9778L2152L0362K1037K6377M1955N3587
11943E32995N3263N6428N1963O8366P9493R3017J28007J56022K03960K78802L80356
11932B082672M94436O39029P84298R56285J183473J541654K093846K949677M208437
11923A6933807N836355O955263N642527J944035k241482n722250o649881n111207
$$ plain form
12005 196532 209566 237691 270555 316969 404556 516929 656818 791144 844461 801087 668150
11994 668150 514396 408151 341254 310295 288635 263112 237975 220618 218288 199066 166966
11983 166966 145728 140452 146535 153039 148970 131354 123340 119940 116062 113068 118799 124929 130889 126143
11969 126143 130404 130135 132358 140952 145536 159781 186249 198050 198395 209887 215932 221896 227200 233481
11955 233481 247712 253904 264245 278475 297747 327525 359677 390039 411076 437453 479408 532995
11943 532995 586258 642686 694649 763015 842508 935525 1063532 1219554 1423514 1702316 2082672
11932 2082672 2577108 3216137 4000435 4956720 6140193 7681847 9775693 12725370 16933807
11923 16933807 22770162 29725425 35367952 37311987 35070505 29348255 22698374 17587167
11915A7587167l258319k108366j599616j327574j099743r26102p94026p24166
11907E749255o72777n96778n28421m54960m07783l37077k85568k51740k16580
11898A997571j98004j64390j45844j24209j15752r4667p9220o1493m5868l9166
11888I28958m2390m6738k8836k3038k5031j9267k9647m7196l9645l8578l6262
11877E52330l3277m0698l7015j9855k1502k5728k1055k5723k6503l1096l3507
11866B36371p902K735q161j4263j5231j9887p290j6029m831q983q831p628l424
11853A16646J076k10j3389j6177q555n016R63m685p133R339M02l140r320q574
11839E2227p20L541M300J554p475m250N184P148K039j077l855l559r120j0607
$$ plain form
11915 17587167 14328848 12220482 10620866 9293292 8193549 7267447 6473421 5749255
11907 5749255 5076478 4479700 3951279 3496319 3088536 2751459 2465891 2214151 1997571
11898 1997571 1799567 1635177 1489333 1365124 1249372 1154705 1075485 1013992 968124 928958
11888 928958 886568 839830 810994 787956 762925 743658 714011 666815 627170 588592 552330
11877 552330 519053 478355 441340 421485 399983 374255 353200 327477 300974 269878 236371
11866 236371 228469 231204 223043 208780 193549 173662 166372 150343 145512 136529 127698 120070 116646
11853 116646 117722 117512 104123 87946 79391 74375 75338 70653 63520 72859 73261 70121 60801 52227
11839 52227 51507 55048 59348 60902 53427 49177 54361 61509 63548 62471 58616 55057 45937 35330
11825C5330J139P996q691j4958Q27J2189M875o175j2549o058L051J2234R044m003
11811C4251J992M568r925o718p443M393L038l084J7462J1469N271j770j7308K046
11797C8242K0192J8773J168J796Q825J5144k000q827q262m160r848m486M021P863
11783G8441m592j7473K910J1603R343q878j3650j922K914K237K881n024N764Q609
11769G3163j0242o982p904K536j603l905M669J1431j0206p457l880M114m422n186
11755C4126K153K433n81M685Q928o716K577q207j608R828r705J064P680L230j0467
11740C9420p952j6321K008J3398Q770n787r390K590k68l774o174n676l031J2463
11726B0276J0341j4673j1398K865N787M535P972N578r77o867o426J951n612n711
$$ plain form
11825 35330 36469 44465 35774 20816 21643 33832 38707 32532 19983 13925 16976 29210 38254 34251
11811 34251 36243 40811 30886 24168 16725 21118 24156 21072 38534 50003 55274 53504 36196 38242
11797 38242 58434 77207 78375 80171 88996 104140 102140 93313 85051 80891 71043 66557 70578 78441
11783 78441 73849 56376 59286 70889 80232 71354 57704 55782 58696 60933 63814 58790 64554 73163
11769 73163 62921 55939 48035 50571 48968 45063 49732 61163 50957 43500 39620 43734 39312 34126
11755 34126 36279 38712 38131 42816 51744 45028 47605 39398 37790 47618 37913 38977 46657 49887 39420
11740 39420 31468 15147 17155 30553 39323 33536 24146 26736 26468 22694 16520 10844 7813 20276
11726 20276 30617 15944 4546 7411 13198 17733 25705 31283 30306 23439 17013 18964 13352 7641
11712G641m327R25L396N006K603l423j2035j113k934l349O337N728k331P55N352
11697H231K927k695k75J039j379J963O238M180r672K813j212K993M574o531j731
11682A1463k861n014l672J1283K0093J2496q635N847J098p06K671N208O891R480
11668F5642J2046K4811K0007n159k5121k5804k2973r969j17q43J033n915K078
11655B9716k820j4729J633l95O001q70J247o420p167Q768Q514K278N148K918R105
11640D2927l467n240q13J0788Q010J3626J1552O029J077o493j7004p361mL49o85
11625E3291n163r150j1412o6n479m380L483K5M763O5R928q181j4447J6068L96
11610B9741r58k881N703O189l273k4953k903J1950K868N749K395J3293L647q77
$$ plain form
11712 7641 3314 4239 7635 12641 15244 11821 -214 -1327 -4261 -7610 -1273 4455 2124 2879 8231
11697 8231 11158 8463 8188 9227 7848 9811 16049 20229 10557 13370 12158 15151 19725 13194 11463
11682 11463 8602 3588 -84 11199 31292 43788 35153 41000 42098 41392 44063 49271 56162 65642
11668 65642 77688 102499 122506 117347 92226 66422 43449 33480 33363 32520 33553 27638 29716
11655 29716 26896 12167 13800 13405 19406 18536 19783 13363 6196 14964 23478 25756 30904 33822 42927
11640 42927 39460 34220 33407 44195 52205 65831 77383 83412 84489 77996 60992 53631 53627 53976 53291
11625 53291 48128 38978 27566 27500 22021 17641 21124 21149 25912 25977 35905 27724 13277 29345 29741
11610 29741 28783 25902 31605 37794 34521 9568 6665 18615 21483 27232 29627 42920 46567 45690
11596D5690J2950m055j8924r952M444K888j4059M293j664L08Q134K538L516k755
11582C3352o045L314L836K17n907K969J622j09p902j0453M547M450j6786j066
11568F039L006Q213o669m903J0289O54l551k58r760L217l67o484J619R778J7104
11553B7927J0191n222n055J3946O430q624j0662r589r934n602M276J6513J0785
11540C5380j2071j2541r675M525M424J626M343L569l418k854N962J0430j5174
11527A4526j2957q79J6125Q608m617L670O478q665k762K510N929Q189j604j3886
11513B0665j0183l064O747J740M789J405k334J869J373n345r83L983n745N150
11499B0067Q899M825K176k248J461j558p272l58N003N077m994j000j351m483k71
$$ plain form
11596 45690 58640 54585 35661 25709 30153 33041 18982 23275 21611 21919 30053 32591 36107 33352
11582 33352 27307 30621 34457 34674 28767 31736 33358 33249 25347 14894 19441 23891 7105 6039
11568 6039 9045 17258 10589 5686 15975 16629 13078 12820 3060 6277 5910 -574 1045 10823 27927
11553 27927 38118 32896 27841 41787 48217 39593 28931 19342 9408 3806 8082 24595 35380
11540 35380 23309 10768 1093 5618 10042 11668 16011 19580 16162 13308 19270 29700 14526
11527 14526 1569 690 16815 25423 20806 24476 30954 22289 19527 22037 27966 36155 34551 20665
11513 20665 10482 7418 14165 15905 20694 22099 19765 21634 23007 17662 16679 20662 14917 20067
11499 20067 28966 33791 35967 33719 35180 33622 26350 25992 30995 36072 31078 30078 28727 24244 23973
11484B3973J067l147L873j1536l357K824Q899N159j29j0208j068O567n703o593
11470A0621K752j049l629L201j1582N804J1572P611J602o264o121r9j4000K23
11456F42O904k51m73J209p558l429o507J1900R816p391O958K913J0733o785j1828
11441F853o176N02K278P653K022J0723L279k657K144r96K663K125j0990N162p290
11426A7295j4267O28J215M299m185l566K634Q088M23p835M603N016o753l442J983
11411F136r553j982O570O413l860o190j807K299L388j58K514Q113m719p988O834
11396F010J24K2N558k257j4460R661M867q016M749l235o28p971L399R425m367
11381B881L588o546n226N464k908m481J1030K422J3543N614k5347o433K540R420
$$ plain form
11484 23973 25040 21893 25766 14230 10873 13697 22596 27755 27626 17418 16350 22917 17214 10621
11470 10621 13373 12324 8695 11896 314 6118 17690 25301 26903 20639 14518 14419 419 642
11456 642 7546 7295 6822 8031 473 -2956 -9463 2437 12253 4862 11820 14733 25466 18681 6853
11441 6853 677 1179 3457 11110 13132 23855 27134 24477 26621 25625 28288 30413 19423 24585 17295
11426 17295 3028 3656 4871 9170 4985 1419 4053 12141 12564 4729 9332 14348 7595 4153 6136
11411 6136 -3417 -5399 1171 7584 3724 -2466 -4273 -1974 1414 1256 3770 11883 7164 -824 6010
11396 6010 6134 6156 11714 9457 -5003 4658 9525 1509 6258 3023 2395 -5576 -2177 7248 2881
11381 2881 6469 -77 -5303 161 -2747 -7228 3802 6224 19767 25381 34 -6399 -3859 5561
11367E561O91p209r491J00L635L974P133M109K370K523p850o599K0395O631p825
11352A8148l898K108R82k508m639q982j356l180n291K674o98m224P253k549K27
11337e933J222K770J0708N163N079m968o196R075k351j9584K068Q171j000M164
11323H388n365n246K493k71N092J03N62j448M907M708q32l188p21m099J787r195
11307b325o180p73M909M001o315p048M24O122L063j554k71Q805q81k856M365J050
11291D536j0327r078K570J1670J2337k241J611j955o908P76K401O127m066o154
11277A299J67r643j295N139j270R195k604K8N558J129l951q093J964j309J408
11262b278l333l641J3485m173j275L503j418o06O781L5r1m111k165k276K869M362
$$ plain form
11367 5561 6252 -957 -10448 -10348 -6713 -2739 4394 8503 10873 13396 5546 -1053 19342 25973 18148
11352 18148 14250 16358 17340 14832 10193 1211 -145 -3325 -8616 -5942 -6640 -10864 -3611 -6160 -5933
11337 -5933 -4711 -1941 8767 13930 19009 14041 7845 16920 14569 -5015 -2947 5224 4224 8388
11323 8388 3023 -2223 270 -1 5091 5194 5756 4308 9215 13923 13091 9903 9182 5083 6870 -2325
11307 -2325 -8505 -9278 -4369 -368 -6683 -13731 -13307 -7185 -4122 -5676 -5947 2858 1977 -879 3486 4536
11291 4536 -5791 -14869 -12299 -629 11708 9467 11078 9123 2215 2991 5392 11519 7453 1299
11277 1299 1466 -8177 -9472 -4333 -5603 3592 988 1016 6574 7703 3752 -4341 -2377 -3686 -2278
11262 -2278 -5611 -9252 4233 60 -1215 2288 870 264 7045 7080 6989 2878 713 -1563 1306 5668
11246E668j208j276K994l731l564J09n75k332M873n28L021O177R664R35l119q458
11230H650j1907P071P56M693p161q565K618R953o27q16n886j1487m990j3126m548
11215c5372J6661K3373r764k518N338m275r91l232J0399K679m119R159O044M37
11201A3819k034J718j27j2395o873k798L392N961N753o437o644l15j525J030n234
11186a2709q19R766M151j140N942n090j0017M180O904J1304K604r273j5367K094
11172g470O327k868Q58O144l905j5126p840o57q948Q938P397m368j0841L545Q544
11157b0270M525M861J9413Q279L574q727n810n52q581m029N351M458j155P390
11143H727l470M79k149M257l030j7676q67O216J428N545Q664q73n525J367J761
$$ plain form
11246 5668 4460 3184 6178 2447 -1117 -1008 -1583 -3915 958 430 3451 9628 19292 20227 17108 8650
11230 8650 -3257 3814 4570 9263 2102 -6463 -3845 6108 5481 4665 -1221 -12708 -17698 -30824 -35372
11215 -35372 -18711 4662 -5102 -7620 -2282 -6557 -7548 -10780 -381 2298 -1821 7338 13382 13819
11201 13819 11785 13503 13376 981 -5892 -8690 -5298 663 6416 -21 -6665 -6980 -8505 -7475 -12709
11186 -12709 -13528 -3762 389 -751 5191 101 -9916 -5736 1168 12472 15076 5803 -9564 -7470
11172 -7470 -1143 -4011 -3153 2991 -914 -16040 -23880 -24537 -33485 -24547 -17150 -21518 -32359 -28814 -20270
11157 -20270 -15745 -10884 8529 16808 20382 11655 5845 5293 -3288 -7317 -1966 2492 1337 8727
11143 8727 5257 5736 3587 7844 4814 -12862 -13729 -7513 -6085 -540 8124 7251 1726 3093 4854
11128D854R78o244o082M089M174m337o917K864o52q73J0797l549m59K577k734
11113a514J970p40r630j655R195J6509N545j122n162p882O197L878J0091O165
11099C1845O508o699p413p899j5674j103K908P46L708m082l532O934J3112L374
11085B2733l384J3851q56q230n111n897r412n826o254k364J243J288p957N54q61
11070a6483L595N878m431j10j0863n104J93Q834M964N052L386Q3R287J0573k73
11055A4581K371j910P351L217j1010j2685k943j677J551J2142L415M330m474j2131
11041B128n528K773R205K355O274k113p97J526L086J9729J0192K12J2660l349
11027E8353j2611P067M216n128k012J402J8827J2521P010l419j8366q906j048
$$ plain form
11128 4854 5832 -412 -6494 -2405 1769 -2568 -9485 -6621 -7273 -8146 2651 -898 -1357 1220 -1514
11113 -1514 456 -284 -9914 -11569 -2374 14135 19680 18558 13396 5514 11711 15589 25680 31845
11099 31845 38353 31654 24241 16342 668 -435 2473 3219 6927 2845 -687 6247 19359 22733
11085 22733 19349 33200 32344 24114 19003 13106 3694 -2132 -8386 -10750 -9507 -8219 -16176 -15622 -16483
11070 -16483 -12888 -7010 -11441 -11551 -22414 -27518 -27325 -18491 -13527 -8475 -5089 -5006 4281 14854 14581
11055 14581 16952 15042 22393 25610 14600 1915 -1028 -2705 -1154 10988 14403 18733 14259 2128
11041 2128 -3400 -627 8578 10933 17207 15094 14297 15823 18909 38638 48830 49042 61702 58353
11027 58353 45742 52809 57025 51897 49885 51287 70114 82635 89645 86226 67860 58954 57906
11014E7906j2965p576r890j2525J6809J5982K408k056p558m707m863k813n671
11001B2481k916M98p267K13Q800M166q247j6437j4043K573J1449P082K021J870
10987A2243j77p963k318J0004J222r439j2822K106j347j2644n67K3130k380j5162
10973a6114o577J382R273P834m708j360m677r922m85O444J2299k567j1425P192
10959a3411Q228K402N582M64p890j555o68p368P427m906q583N046P708q238n8
10944a5820m828J509o251N132M394j813Q23J4541J772j2133l952n578K692l591
10930b3103J16K982N866N823l934n564J0819R091K664J712q656k568J483L294
10916B5J845R468J369p474n121l009o468k083q557n037O267J08J1853N042J4059
$$ plain form
11014 57906 44941 37365 27475 14950 31759 47741 50149 48093 40535 35828 30965 28152 22481
11001 22481 19565 20063 12796 13009 21809 25975 17728 1291 -12752 -10179 1270 8352 10373 12243
10987 12243 12066 4103 1785 11789 13011 3572 -9250 -7144 -8491 -21135 -21702 1428 -952 -16114
10973 -16114 -22691 -21309 -12036 -4202 -8910 -10270 -14947 -24869 -25354 -18910 -6611 -9178 -20603 -13411
10959 -13411 -5183 -2781 2801 3265 -4625 -6180 -6848 -14216 -6789 -11695 -20278 -15232 -7524 -15762 -15820
10944 -15820 -20648 -19139 -25390 -20258 -15864 -17677 -16854 -2313 -541 -12674 -16626 -22204 -19512 -23103
10930 -23103 -22987 -20005 -14139 -8316 -12250 -17814 -6995 2096 4760 6472 -2184 -4752 -3269 25
10916 25 1870 11338 12707 5233 112 -2897 -9365 -11448 -20005 -25042 -18775 -18667 -6814 -1772 12287
10901A2287R639k866j6593j4179J358J869O261q111K55J0559J0488k584j0108
10888a725r823k73J4641J1622J961j2809M869P243k201j1626P373O432p600k776
10874E308Q000j020j0994L387N585J0554P293r069n178o219l215k063k750n333
10860e714m42J3118L526J936Q980P812J368j7052j5645l907l157P388P089R084
10846A4384R431J305j0534j7377j313J6320P761l804n035j478q711j2980K622
10833i409k686N053J6295j966K752K563m862n726q097j2751L494k071r416K618
10819b4209R839K1752J2215k277j6577q231M09n577j789J4353m04k932K530K115
10805A217j360j0187n097o560J166J430N548J9871J3216j7046k0146j310n313
$$ plain form
10901 12287 21926 19060 2467 -11712 -10354 -8485 -2224 -10335 -10080 479 10967 8383 -1725
10888 -1725 -11548 -11821 2820 14442 16403 3594 8463 15706 13505 1879 9252 15684 8084 5308
10874 5308 13308 12288 1294 4681 10266 20820 28113 19044 13866 7647 4432 2369 -381 -5714
10860 -5714 -6156 6962 10488 12424 21404 29216 30584 13532 -2113 -6020 -9177 -1789 5300 14384
10846 14384 23815 25120 14586 -2791 -4104 12216 19977 16173 11138 9660 949 -12031 -9409
10833 -9409 -12095 -7042 9253 7287 10039 12602 7740 2014 -6083 -18834 -15340 -17411 -26827 -24209
10819 -24209 -14370 7382 19597 17320 743 -7488 -7079 -12656 -14445 -92 -496 -3428 -898 1217
10805 1217 -143 -10330 -15427 -21987 -20821 -19391 -13843 6028 19244 2198 -17948 -19258 -24571
10792b4571P824P255n406R686P291o986j063K705j198Q44M862j233n388j7534
10778b2912n511R331J0340k900r372Q968J8319L603l337m809L101j1141J936M620
10764B36l689q93L814K071j2122P027P636l262Q392r198n221o322m158m141M393
10749a5437J510j154M411q24r98L09Q205J237Q81p248O223m284n682O72P916j2544
10733a6807r769R755j556k544p62p637J0222L319j441K434O426M688J134j5454
10719a7992p423L042n863j620O509R410P185K627M233j3288l442J2411J1493m16
10705F866k882j4566n228M923R297J366n16l941m068J675M548P5P617Q547m20
10690A3293R486L854l33N444J1500Q109N587j9850K609J659o289N591M125m322
$$ plain form
10792 -24571 -16747 -9492 -14898 -5212 2079 -4907 -5970 -3265 -4463 -3619 1243 10 -5378 -22912
10778 -22912 -28423 -19092 -8752 -11652 -21024 -12056 6263 9866 6529 1720 4821 -6320 -4384 236
10764 236 -3453 -4346 -532 1539 -10583 -3556 4080 818 9210 12 -5209 -11531 -15689 -19830 -15437
10749 -15437 -13927 -15081 -10670 -11494 -12492 -12183 -3978 -2741 -1860 -9108 -2885 -7169 -12851 -12179 -4263 -16807
10733 -16807 -26576 -16821 -18377 -20921 -21683 -29320 -19098 -15779 -17220 -14786 -8360 -3672 -2538 -17992
10719 -17992 -25415 -22373 -28236 -29856 -23347 -13937 -6752 -4125 108 -13180 -16622 -4211 7282 6866
10705 6866 3984 -10582 -15810 -10887 -1590 -224 -740 -4681 -8749 -7074 -2526 -2451 5166 13713 13293
10690 13293 22779 26633 26300 31744 43244 51353 56940 37090 39699 41358 35069 40660 44785 40463
10676D0463k877L622J395J1570J992j1117J009J0711M313k535l238M725j716q157
10662E0160p395j938J3575M685k246q920O190N272m5J129K878J0420M553l148
10648G5170k447l888L79j733O403J3894K245J6449N218P474Q154P994J2282J3966
10634A61560K3931K3963K0556L2046J9689K6107L7185L6896N4045N8165P6010
10623E70153J13631J31246J69359K09466K67681L47082M37656N12601N38748N18508
10613C816131L99502K28779P0569l225L9561J58673L07610N10879P42087R41989
10603G212555J048354Q98694N46460J00346k68972m27396l39582p9120K32002
10594H923341N47009Q58658J114614J172804Q98171L12198l61128r03933j107303
$$ plain form
10676 40463 37586 41208 42603 54173 56165 45048 46057 56768 61081 58546 55308 60033 58317 50160
10662 50160 42765 40827 54402 59087 56841 47921 54111 59383 59338 60467 63345 73765 78318 75170
10648 75170 72723 68835 69214 67481 73884 87778 90023 106472 111690 119164 127318 135312 147594 161560
10634 161560 185491 209454 230010 262056 281745 307852 345037 381933 435978 494143 570153
10623 570153 683784 815030 984389 1193855 1461536 1808618 2246274 2758875 3297623 3816131
10613 3816131 4215633 4444412 4514981 4511756 4551317 4709990 5017600 5528479 6270566 7212555
10603 7212555 8260909 9159603 9706063 9806409 9537437 9110041 8770459 8691339 8923341
10594 8923341 9470350 10329008 11443622 12616426 13514597 13826795 13465667 12561734 11454431
10585A1454431r69886o42217l17152j1253K55048M38320M59959K36325j79387
10576A0724188o26971r39276j010541q73215o42626m18417k33536j01848k3708
10567E854050l0362j19283k94692m70827n84614o01568n38732m49319l58380k92764
10557B113509k36637j98233j71876j44932j26919j23253j09375j00914r9924p6106
10547G25340o4628n4405n0756n0980n3785l1822k7724m1205l5903j9783k5506
10536B68843k6948j0308j7732j8261o617r313l840R514j0574j2095k3666j8090
10524A20913r677j5612m836l883m672M735j3154m947L234L385j174r176n101j3443
10510D6592r202p608k317N789N362M972o25p572q569J215O673l647m417L062J216
$$ plain form
10585 11454431 10484545 9842328 9525176 9513923 9768971 10207291 10667250 10903575 10724188
10576 10724188 10097217 9157941 8147400 7274185 6631559 6213142 5979606 5877758 5854050
10567 5854050 5823688 5704405 5409713 4938886 4354272 3752704 3213972 2764653 2406273 2113509
10557 2113509 1876872 1678639 1506763 1361831 1234912 1111659 1002284 901370 801446 725340
10547 725340 660712 606307 555551 504571 450786 418964 391240 350035 314132 294349 268843
10536 268843 241895 231587 213855 195594 188977 179664 175824 185338 174764 162669 139003 120913
10524 120913 111236 95624 90788 86905 82233 86968 73814 68867 72101 75486 74312 65136 60035 46592
10510 46592 37390 29782 27465 33254 38616 43588 42963 35391 26822 28037 34710 31063 26646 29708 30924
10495C0924l359Q60k202N53K183M373K324R905q060k793O433N647j0604q757K399
10480B9826O668k850m327M90n176M081J2638Q151m920j7149J425P457N188N059
10466D6561J1561l802j0849N625K684j713l687l337k910j309j774J626J0870L517
10452E3063J3405l125j2495j14Q858J2018L744o157N580j3560j0310m333P258
10439E3832j3031r162P003R853n70m983l339P955Q059l575j38n009K841K229j093
10424E0872l403K183o990j1797l5j8716j6052k093N291L941m457P967J5047k352
10410A9406P467J4451j05j5907q048K450j0854p531O137J3209M827p706r429J539
10396I906p842m431m593K644N623l91m403n677P602K650L353J7705N705p494L90
$$ plain form
10495 30924 27565 28425 26223 26776 28959 33332 35656 45561 37501 34708 41141 46788 36184 27427 29826
10480 29826 36494 33644 29317 29807 24631 28712 41350 49501 44581 27432 28857 36314 41502 46561
10466 46561 58122 54320 43471 49096 51780 50067 46380 43043 40133 38824 37050 38676 49546 53063
10452 53063 66468 63343 50848 50734 59592 71610 75354 69197 74777 61217 50907 46574 53832
10439 53832 40801 31639 38642 48495 47925 42942 39603 47558 55617 52042 51904 46895 49736 51965 50872
10424 50872 47469 49652 42662 30865 30830 12114 -3938 -6031 -740 3201 -1256 6711 21758 19406
10410 19406 26873 41324 41219 25312 17264 19714 8860 1329 7466 20675 25502 17796 8367 9906
10396 9906 2064 -2367 -6960 -4316 1307 916 -3487 -9164 -1562 1088 4441 22146 27851 20357 20747
10381B0747K612J351j8469k184L28j661P769J2994j2351k807M993j777l445j0552
10367b452l124L641M529J528m183n989J8209J6656J320j5214j6910j638m134J36
10353g625P785K356O427J3001j36k827l168l207N297j2055o55L785j865M957p591
10338D479P066q156n735n490K922O505J480M829m082m805j3619j869L693N711
10324g071k881k8L431k828o026J1067N770p741o134P34P567l778N134N475j3695
10309a1004j1057j260N468k944P146P574Q72j2214Q99Q846J014P040R45j565P272
10294G032J648n421k428J326o040l968m008j462O418J0863L385n862j124m26k862
10279b929M95r686j552P341O275n589n433K622n644L842J228N031L754M740P095
$$ plain form
10381 20747 23359 24710 6241 4057 4385 2724 10493 23487 11136 8329 13322 11545 8100 -2452
10367 -2452 -5576 -1935 2594 4122 -61 -6050 12159 28815 30135 14921 -1989 -3627 -7761 -7625
10353 -7625 160 2516 8943 21944 21808 18981 15813 12606 17903 5848 5193 8978 7113 12070 4479
10338 4479 11545 3389 -2346 -7836 -4914 1591 3071 7900 3818 -987 -14606 -16475 -12782 -7071
10324 -7071 -9952 -9980 -6549 -9377 -15403 -4336 1434 -6307 -12441 -11707 -4140 -7918 -2784 2691 -11004
10309 -11004 -22061 -23321 -17853 -20797 -13651 -6077 -5205 -17419 -16520 -7674 -6660 380 1325 -240 7032
10294 7032 8680 3259 831 2157 -3883 -7851 -11859 -13321 -6903 3960 7345 1483 359 -67 -2929
10279 -2929 -2434 -12120 -13672 -6331 -56 -5645 -11078 -8456 -14100 -10258 -9030 -3999 -245 4495 11590
10264A1590O508p173m092p360L925n06L066J2258n198k153L835l421j0664j877
10250a262N410J0734L004m448j624L716L87m416p079q032O314k1l356O99J086
10235A112j484r35j2992L920K416O661Q884p3J320N939j1022q95o303N086J3811
10220A5445m083k393j1578l8K692K35m623m65M125R356m5m368n41j1477q759J2533
10204c984K1895o935K591J551J779n652p861j1901n610O604P607O739J464M098
10190A2385n271j0392J324p633O525J165M902k254k666N008L600Q187R315l702
10176B0493k130N468M570k073j404M55J215J136R625Q743J0851O323q164q360
10162D6748l182o355l815j481Q302j660k733J967J0499P948j631m467L094m859
$$ plain form
10264 11590 18098 10925 6833 -527 3398 2892 5958 18216 13018 10865 14700 11279 615 -1262
10250 -1262 4148 14882 17886 13438 11814 15530 15917 11501 4422 -3610 2704 2683 -673 26 1112
10235 1112 -372 -1307 -14299 -10379 -7963 -1302 7582 7509 8829 14768 3746 2851 -3452 1634 15445
10220 15445 11362 8969 -2609 -2647 45 280 -4343 -4808 -683 8673 8628 4260 3719 -7758 -16517 -3984
10204 -3984 17911 10976 13567 15118 16897 11245 3384 -8517 -14127 -7523 84 6823 8287 12385
10190 12385 7114 -3278 -1954 -9587 -3062 -1897 3005 751 -1915 3093 6693 14880 24195 20493
10176 20493 18363 23831 28401 26328 24924 25379 26594 27730 37355 46098 56949 63272 55108 46748
10162 46748 43566 37211 33396 31915 40217 38557 35824 37791 48290 56238 54607 50140 53234 48375
10148D8375k877j9697j312L361N855J6262O165m788K115k453p145k4939j5295
10135C627P609J4622j320l367K936m280k845r194j833J1806N524o633m937j5785
10121d070j9412k411M092R393r358q355P265N482K178l81O531K003j237J0343
10107B063m662j0187J671P096N606J517q572m794J966M92j4306l100l54O1L394
10092b2109L480R775q824O076P143m479k789M577J548N333l424j3441M033J0621
10078b480J602n902n799J888l285n391Q484R34m327j0837J0691O626m418n12k248
10063a4974l977l689j1468Q11J8055K828j1412k59M357L432M786J0086N379l697
10049B58r173j4629Q88J9427L357p264K237o429k2527J9070J5154P996k089r992
$$ plain form
10148 48375 45498 25801 24489 27850 33705 49967 56132 51344 53459 51006 43861 18922 3627
10135 3627 11236 25858 24538 21171 24107 19827 16982 7788 5955 17761 23285 16652 11715 -4070
10121 -4070 -23482 -25893 -21801 -12408 -21766 -30121 -22856 -17374 -15196 -15577 -9046 -7043 -8280 2063
10107 2063 -2599 -12786 -11115 -4019 1587 3104 -5468 -10262 -8296 -7804 -22110 -25210 -25564 -25503 -22109
10092 -22109 -18629 -8854 -17678 -11602 -4459 -8938 -11727 -7150 -5602 -269 -3693 -17134 -13101 -2480
10078 -2480 -878 -6780 -12579 -10691 -13976 -19367 -10883 -9949 -14276 -25113 -14422 -7796 -12214 -12726 -14974
10063 -14974 -18951 -22640 -34108 -33297 -15242 -12414 -23826 -24085 -19728 -16296 -11510 -1424 3955 258
10049 258 -8915 -23544 -22656 -3229 128 -7136 -4899 -11328 -33855 -14785 369 8365 6276 -3716
10035c716j8773m994P593k022M749J9917n07p591m208N063K013P204J434n497
10021F65L795n367n178J1126J5640p830j1007k012n296O591J9596k578k2622O288
10007A811n588L347k540K20m218O90Q374n635j0433o500L939N346J5182P034Q50
9992A1879m157P126K140J408n395J422j490J132o547J123l239j82P188L990o372
9977A0026n359n351j572r530L726k514Q073l154l879q871p615l538O77J4802J1016
9962c063m977n046K749J0812l57j975L51n316n549k010k673l225n232K861J3390
9947i260M505p21R35m510K134P564P841P369J876o234r178j0053Q993Q339j3081
9932c481L05L583q588O228R681k043j645p783n699m872j406P650n40J362Q252
$$ plain form
10035 -3716 -22489 -27483 -19890 -21912 -17163 2754 2247 -5344 -9552 -4489 -2476 4728 6162 665
10021 665 4460 -907 -6085 5041 20681 12851 1844 -168 -5464 1127 20723 18145 -4477 1811
10007 1811 -3777 -430 -2970 -2750 -6968 -6278 2096 -3539 -13972 -20472 -16533 -11187 3995 11029 11879
9992 11879 7722 14848 16988 18396 13001 14423 12933 14065 7518 8641 5402 5220 12408 16398 10026
9977 10026 4667 -684 -2256 -11786 -8060 -10574 -2501 -5655 -9534 -18405 -26020 -29558 -28881 -14079 -3063
9962 -3063 -8040 -13086 -10337 475 118 -1857 -1506 -6822 -12371 -14381 -17054 -20279 -25511 -22650 -9260
9947 -9260 -4755 -5476 -4541 -9051 -6917 647 8488 15857 17733 11499 2321 -7732 1261 9600 -3481
9932 -3481 -3176 407 -8181 -1953 7728 5685 4040 -3743 -9442 -14314 -15720 -8070 -8610 -7248 1004
9917A004q701r415N527L684n868m905j1901J875J4756J3214K294M414k374q131
9903d527K156k441m960k716K287m605Q47r0Q300j1135j0956n377R784J2235n769
9888a6967m646J6568k964J621j1434o572Q027L715j041k439P313M864p643j5956
9874b7554k769M717J54J280L061R132P658r18p974K814m847o548J2871j900k867
9859a3690N060K047m147k427o933M470N318k647m765Q48l46J3094l120o445p94
9844a4477Q231M173j545m379l409J0894O680Q941l791l735j306l416r207q423
9830a4769p543M094J1328m531M998N404j2311l164J6618J6389N683q027j3494
9817F75r711k890J782k987n475J3308n714j0650R36J5N883L391O524m013j587
$$ plain form
9917 1004 -7697 -17112 -11585 -7901 -13769 -18674 -30575 -28700 -13944 -730 1564 5978 3604 -4527
9903 -4527 -2371 -4812 -9772 -12488 -10201 -14806 -13959 -14049 -5749 -16884 -27840 -33217 -23433 -11198 -16967
9888 -16967 -21613 -5045 -8009 -6388 -17822 -24394 -16367 -12652 -13693 -16132 -8819 -3955 -11598 -27554
9874 -27554 -30323 -25606 -25452 -24172 -21111 -11979 -4321 -5239 -13213 -10399 -15246 -21794 -8923 -10823 -13690
9859 -13690 -8630 -6583 -10730 -13157 -20090 -15620 -10302 -12949 -17714 -16866 -17212 -4118 -7238 -13683 -14477
9844 -14477 -6246 -2073 -3618 -7997 -11406 -512 6168 15109 11318 7583 6277 2861 -6346 -14769
9830 -14769 -22312 -18218 -6890 -11421 -6423 -1019 -13330 -16494 124 16513 22196 14169 675
9817 675 -9036 -11926 -10144 -13131 -18606 -5298 -11012 -21662 -20726 -20711 -14828 -11437 -4913 -8926 -10513
9802a0513q24J0906j956j7602K333R252j659j53j1495k972p652L244J2442O505
9788a0144k694m35R859N583K565k030k08j73R925Q368L24m625j1393o82m846K312
9772A706k902L738o427q81O835L868j836p096k696r594Q505N992J0841J2250M76
9757B2779o037j888o271o751Q476L537k672m151K131m135p347j5302J475J0568
9743e588O566k957J605n662m14L218j084m371L214j572O081l834J0937J2315R16
9728A9370k280j7559j6231L721P303M959L195Q49j81j1447j2121Q549K492o092
9714a5473l462nM852J3617R41o653p684R303o615r972J685j064M381j030L202
9699a3977J944J041j1464Q47J250P727R067J1196L318j378m032K536n22p927m382
$$ plain form
9802 -10513 -11337 -431 -2387 -19989 -17656 -8404 -10063 -10216 -21711 -24683 -32335 -29091 -16649 -10144
9788 -10144 -12838 -13273 -3414 2169 4734 2704 2496 2323 12248 20616 20940 16315 4922 4240 -606 1706
9772 1706 -1196 2542 -3885 -4766 2069 5937 4101 -2995 -5691 -15285 -6780 -788 10053 22303 22779
9757 22779 16742 14854 8583 1832 10308 13845 11173 7022 9153 5018 -2329 -17631 -16156 -5588
9743 -5588 978 -1979 -374 -6036 -6450 -3232 -4316 -8687 -5473 -7045 -964 -4798 6139 18454 19370
9728 19370 17090 -469 -16700 -12979 -5676 -717 2478 3327 3146 -8301 -20422 -11873 -9381 -15473
9714 -15473 -18935 -18940 -14088 -471 470 -6183 -13867 -4564 -11179 -21151 -19466 -20530 -16149 -17179 -13977
9699 -13977 -12033 -10992 -22456 -21609 -20359 -12632 -3565 7631 10949 9571 5539 8075 7553 -374 -4756
9684d756M729l09q17m468r490j0954l56O435J0535j176o233l269J2240J0831L79
9669C321l654p041Q448O866n144o6m474r186j997J0256N856j780R1J1286O595
9654A9377Q05k267q427j846m999r82J2778K880k965K291m8l454p964P96J035k824
9638D186N134m025j337n714J938m405o825M444q069O19L960q679K570k164M002
9623a4365J501o737Q53p140O368L704m235P213N81J095N356M781O690r832j6639
9608b0806L431K0766N033j4579m389M490J839J168m268k78O511J707o075J2340
9594F890Q552n626o56m77q251n567J668l272P369Q764J40o774j5486m561R582
9579g705K897q520N745J331k203l780j2974P980J1908l72L39N778j0986j348P174
$$ plain form
9684 -4756 -27 -336 -1153 -5621 -15111 -26065 -26421 -19986 -9451 -10627 -16860 -20129 -7889 2942 3321
9669 3321 -333 -7374 1074 7940 2796 2730 -1744 -10930 -12927 -2671 3185 1405 1496 12782 19377
9654 19377 20182 17915 9488 7642 2643 1661 14439 17319 14354 16645 16597 13143 5179 5975 7010 4186
9638 4186 9320 5295 3958 -1756 182 -4223 -11048 -6604 -14673 -14054 -10094 -18773 -16203 -18367 -14365
9623 -14365 -12864 -19601 -18748 -25888 -19520 -15816 -20051 -12838 -12257 -11162 -5806 -1025 5665 -4167 -20806
9608 -20806 -17375 3391 8424 -6155 -10544 -6054 -4215 -3047 -7315 -7593 -1082 625 -5450 6890
9594 6890 15442 9816 9160 8683 432 -5135 -3467 -6739 630 9394 9534 2760 -12726 -17287 -7705
9579 -7705 -4808 -13328 -7583 -6252 -8455 -12235 -25209 -17229 -5321 -5693 -5354 424 -10562 -11910 -4736
9564d736Q33j0309l778k143j311o63K047o623J660j254k808J090J0515Q483P04
9549h293m974k627k960Q779r25m529L292L066J836J396j79L694P303m412r517
9534i050O428p576K13N731K186j5343K922L306L961N66m404p160l805j606R113
9519a4518Q139l243K728O794p621o758j191k513j0687m357K172O652J3837N49
9505a0017j3399r213O913j319L538J5571N926o454k112m703n197J1728P411L675
9491B348R286j4557o868K855p589q55k182q978j085l322L32K16M610Q789m573
9476b1573Q665j29j5276M878J3017J6426m813l268p977k6L924K419O813k18M980
9461G842j632N40J611l091l554n885n267j1525N306N146k078P208k023q901p105
$$ plain form
9564 -4736 -3903 -14212 -17990 -20133 -21444 -22107 -20060 -26683 -25023 -26277 -29085 -27995 -17480 -8997 -8293
9549 -8293 -13267 -15894 -18854 -10075 -11000 -15529 -12237 -9171 -7335 -5939 -6118 -2424 4879 467 -9050
9534 -9050 -2622 -10198 -9985 -4254 -2068 -17411 -14489 -11183 -7222 -6656 -11060 -18220 -22025 -23631 -14518
9519 -14518 -6379 -9622 -6894 -100 -7721 -14479 -15670 -18183 -28870 -33227 -31055 -24403 -10566 -10017
9505 -10017 -23416 -32629 -25716 -27035 -23497 -7926 -2000 -8454 -10566 -15269 -20466 -8738 -1327 2348
9491 2348 11634 -2923 -9791 -6936 -14525 -15380 -17562 -26540 -27625 -30947 -30615 -30399 -25789 -17000 -21573
9476 -21573 -12908 -13037 -28313 -23435 -10418 6008 1195 -2073 -10050 -10076 -6152 -3733 3080 2862 7842
9461 7842 6210 6750 8361 5270 1716 -4169 -9436 -20961 -15655 -10509 -12587 -5379 -7402 -16303 -23408
9446b3408k238J886j0898J086J4587J9635N906k56K301N108p941j1133L410K492
9432E37j869p990l266M523n126l686M49m032n664k753Q993J2912k660o505l546
9417a9683m689P05J0139J1258O528p564p912N142L046k755o62o735M263K647l254
9402i526P621L154r86n610j141O120O023j0691q873J859L88M362r816k141P27
9387a8530J1457L791R489Q632K313j3787j2077l580N7Q114m065L87M497n282K512
9372f072j1360o05r55o8M504J1109J3287j7772k633J4858k105m014p737o734j0329
9357b6626M137K976m467N723N935n235Q64J6179J4081p707p716k612K663J4367
9343A2562j33J04j0543n123K208j678j541L60P474Q716j4414k714J3066q699k975
$$ plain form
9446 -23408 -25646 -23760 -34658 -33572 -18985 650 6556 6300 8601 13709 5768 -5365 -1955 537
9432 537 -1332 -9322 -12588 -8065 -13191 -16877 -16428 -20460 -26124 -28877 -19884 -6972 -9632 -16137 -19683
9417 -19683 -24372 -23667 -13528 -2270 4258 -3306 -11218 -6076 -3030 -5785 -6447 -13182 -8919 -6272 -9526
9402 -9526 -1905 1249 263 -5347 -6488 -368 5655 -5036 -13909 -12050 -11662 -7300 -17116 -19257 -18530
9387 -18530 -7073 -3282 6207 14839 17152 3365 -8712 -12292 -12235 -4121 -8186 -7799 -3302 -8584 -6072
9372 -6072 -17432 -18037 -18992 -19060 -14556 -3447 9840 -7932 -10565 4293 2188 -1826 -9563 -16297 -26626
9357 -26626 -22489 -19513 -23980 -18257 -12322 -17557 -16693 -514 13567 5860 -1856 -4468 -1805 12562
9343 12562 12429 12533 1990 -3133 -925 -2603 -4144 -3784 3690 12406 -2008 -4722 8344 -355 -3330
9328c330R290M870K881j3143j402Q758N491j166m65o462N984m737j3794J668Q622
9313C065j058r561n642o30Q541J170m703J593n53N984N521j0386K003q54J331
9298d179p856r722m23P38r563M031M110M884O984P018k841j1242j6093M143J6550
9283a3461J054l386j083q99L458J1217o687k39N987P800j2598q970K502n947Q598
9268a2654K293K439J456K838O348J2891l543j5343o726M070n9o646m006M837N774
9253f031r194P395M000M178m721N964M35j0962L291M073K874N58n62J865J208
9238D371p486j2310J184L016J770J0654L276l368l27j5182j0159O593P901j919
9224a1986K130q263n827O459K346P197L945j468L562M85K413L807L332j2383k0594
$$ plain form
9328 -3330 5960 10830 13711 568 -834 7924 13415 12249 11784 5322 11306 6569 -7225 -5557 3065
9313 3065 2007 -7554 -13196 -13826 -5285 -4115 -8818 -7225 -7778 -1794 3727 -6659 -4656 -5510 -4179
9298 -4179 -12035 -21757 -22180 -21442 -31005 -26974 -22864 -17980 -10996 -3978 -6819 -18061 -34154 -30011 -13461
9283 -13461 -12407 -15793 -16876 -17775 -14317 -3100 -9787 -10026 -4039 3761 -8837 -17807 -15305 -21252 -12654
9268 -12654 -10361 -7922 -6466 -3628 2720 15611 12068 -3275 -10001 -5931 -5990 -12636 -16642 -11805 -6031
9253 -6031 -15225 -7830 -3830 348 -4373 1591 2026 -8936 -5645 -1572 1302 1860 1298 3163 4371
9238 4371 -3115 -15425 -14241 -11225 -9455 1199 4475 1107 780 -14402 -24561 -17968 -10067 -11986
9224 -11986 -9856 -18119 -23946 -17487 -15141 -7944 -3999 -5467 -1905 -1420 993 4800 8132 -4251 -24845
9209b4845j71k308Q18J0388N567j1559q081k505J6209R700k04o706j230J3254
9195a673P791J037K621m30o116M81M111K880j0356o349M818Q526m685m507O741
9180D890j310n755K225O346l911j0284J0469O386R784N030j1030J547R457M028
9166B7872r945k511m079p869n328j0473J704K811J752L826L373P307J0217M690
9152B3347k476j7692j2614l851M648j889j218M989P268k108O604Q477m374J372
9138A0483l435j455k456Q8J876Q730N205J597O676M972r389n361J7035L780j0463
9123B7883J449k766j934N611j451R622L765l470O967N911L803R364m767m165K702
9108E8524L553l365r213r976J203J4780J7049J6398N758O834K5452K4268J0354
$$ plain form
9209 -24845 -25016 -27324 -26506 -16118 -10551 -22110 -30191 -32696 -16487 -6787 -6991 -13697 -14927 -1673
9195 -1673 6118 7155 9776 9346 3230 3711 7822 10702 346 -6003 -1185 7341 2656 -1851 4890
9180 4890 3580 -2175 50 6396 2485 -7799 2670 9056 18840 23870 12840 14387 23844 27872
9166 27872 17927 15416 11337 3468 -1860 -12333 -10629 -7818 -6066 -2240 1133 8440 18657 23347
9152 23347 20871 3179 -9435 -13286 -8638 -10527 -11745 -6756 512 -1596 5008 13485 9111 10483
9138 10483 7048 5593 3137 3225 5101 13831 19036 20633 27309 32281 22892 17531 34566 38346 27883
9123 27883 29332 26566 24632 30243 28792 38414 42179 38709 45676 51587 55390 64754 59987 55822 58524
9108 58524 62077 58712 49499 39523 40726 55506 72555 88953 94711 101545 126997 151265 161619
9095A61619K6696L0074L8662M6082M9255N4218O2982Q3555Q2459Q4362J03542
9084H23506R2382Q5137P5191N3864J5003k7685n3473o0400o5099p8122q0758n9289
9072G20257o4596o7833o5467n3655l6535k2913l3997l8863l7465l5306j4161k0002
9060B29464q949k9657k7413q783r590j6705j2209j7493j0320M090j1353j2751
9048F8331j5452J493K398l096n465o592q637j164P398J0589n789r937p965j310
9034B4802m099L948l196r474q791N635o691j0569Q661N380O220o536m600P949
9020H639J1655J219M8j1491j1110m556r486N298L027m541m867R765m764q005L932
9005a5237M891L019J3657J719K346k610k173J1673J3485J6811o478k0611j1688
$$ plain form
9095 161619 188315 218389 257051 303133 352388 406606 469588 553143 635602 719964 823506
9084 823506 915888 1001025 1076216 1130080 1145083 1117398 1063925 1003525 938426 860304 779546 720257
9072 720257 655661 587828 522361 468706 432171 409258 375261 336398 298933 263627 249466 229464
9060 229464 220515 190858 163445 154662 145072 128367 116158 98665 88345 92435 81082 68331
9048 68331 52879 54372 56770 53674 48209 41617 32980 31816 39214 49803 44014 34077 26112 24802
9034 24802 20703 24651 21455 11981 3190 8825 2134 -8435 226 5606 11826 5290 690 8639
9020 8639 20294 21513 21561 10070 -1040 -5596 -15082 -9784 -6757 -11298 -16165 -6400 -11164 -19169 -15237
9005 -15237 -10346 -7327 6330 8049 10395 7785 5612 17285 30770 47581 41103 20492 8804
8992H804j7674P74k51j0446j0615j2876l877L18J0989K742L145j43K4371L8187
8978C3448M7555M1911N9564N3848M5739L6047n01m191p736k8315j2064k121n575
8965B57609j004j4001k7417r028m388n554l009j3607p44l910p831J1255J382j144
8951A78609O024J7221M523P817J0951R975K2402K5470Q600J0508J8778J0048N742
8938C36668Q371J5334P609j0930k3761l6785k2508k3944k7119j6203j9823j0228
8926A76681m068m312R302l004j119o969j2780p134k665k695J804o118o650j1532
8912A18741k531M143J1882M944q145q248q214q140p651j524l038M322q479l539
8898H4523J546l956N74J548M472o628M533j6225k0347k188J4284J2413p196k247
$$ plain form
8992 8804 -8870 -8096 -8347 -18793 -29408 -42284 -46161 -45843 -34854 -32112 -28967 -29110 -4739 33448
8978 33448 81003 122914 182478 236326 282065 318112 317611 313420 305684 277369 265305 263184 257609
8965 257609 256605 242604 215187 206159 201771 196217 193208 179601 178857 174947 167116 178371 179753 178609
8951 178609 184633 201854 206377 214194 225145 235120 257522 282992 291592 302100 320878 330926 336668
8938 336668 345039 360373 367982 357052 333291 296506 273998 250054 222935 206732 186909 176681
8926 176681 172613 168301 177603 174599 173480 166511 153731 146597 143932 141237 143041 136923 130273 118741
8912 118741 116210 120353 132235 137179 129034 120786 112572 104432 96781 95257 92219 96541 88062 84523
8898 84523 86069 82113 82687 84235 88707 82079 86612 70387 50040 47852 62136 74549 67353 65106
8884F5106m327J9403K0542N945k840J0022J7036M114M547N029K274o802j6467
8871A23582j8315n27P092J2328j0495j3154M950P896k034n837n258o621N99K520
8857I6726J2683O166k882N032J0456O854J2905J162O591l722M300m100K911k089
8843A52993j0098q075O337Q14j1626k41L514O881Q515m597Q129j643l972J163
8829A48094J0649L830P619M377J09j509j2156j8430j1433k4719l2505l9165l5806
8816a045n1494n4859n3941n6895n7607k6274k522L3872N5526P6462O7223P9177
8804G623Q0293Q4990O4478L0297L9792O3796N0188L3863K7729K5482L9028L2647
8792E80206K6840K6197K4320K5274K8539L0165J5152R233M757J1777J6427K0400
$$ plain form
8884 65106 60779 80182 100724 106669 103829 113851 130887 135001 139548 144577 146851 140049 123582
8871 123582 105267 104740 111832 124160 113665 100511 105461 113357 111323 105486 100228 93607 94206 96726
8857 96726 109409 115575 112693 117725 128181 135035 147940 149102 155693 151971 156271 152171 155082 152993
8843 152993 142895 134820 141157 141971 130345 130104 133618 140499 149014 144417 152546 150903 146931 148094
8829 148094 158743 162573 170192 174569 174678 173169 161013 142583 131150 106431 73926 34761 -1045
8816 -1045 -52539 -107398 -161339 -218234 -275841 -302115 -304637 -270765 -215239 -138777 -71554 7623
8804 7623 87916 172906 237384 267681 307473 371269 421457 455320 483049 508531 547559 580206
8792 580206 607046 633243 657563 682837 711376 741541 756693 765926 770683 782460 798887 819287
8780H19287J3135J0973J0453N542M863J2273j073j2357J8276J8192Q643J6702
8768I24909K1141J7056P393J2911K3875K3560L4616L3422K6078L0212M3572L5966
8756A234711L5505M0759L6344L7882K9977J9251K5155K1210L5927L1963M4200
8745A592884N0201M1557M9603N4899N5776N2563O7291O3165N4167M9244O1613
8734B192963P3143Q8227R2179J06076J10838J29643J57853J63785J70364J73626
8724C458697J80111J93941K22247K40767K64213K92060L05274L29751L81222M21375
8714F289658M78331N29494N77630O29967O89768P54976Q31373R11387J019236
8705A2711820J182891J381404J608231J905018K255882K690892L226880L868927
$$ plain form
8780 819287 832422 843395 853848 859390 864253 876526 875453 863096 881372 899564 908207 924909
8768 924909 946050 963106 970499 983410 1007285 1030845 1065461 1098883 1124961 1155173 1198745 1234711
8756 1234711 1270216 1310975 1347319 1385201 1415178 1434429 1459584 1480794 1516721 1548684 1592884
8745 1592884 1643085 1684642 1734245 1789144 1844920 1897483 1964774 2027939 2082106 2131350 2192963
8734 2192963 2266106 2354333 2446512 2552588 2663426 2793069 2950922 3114707 3285071 3458697
8724 3458697 3638808 3832749 4054996 4295763 4559976 4852036 5157310 5487061 5868283 6289658
8714 6289658 6767989 7297483 7875113 8505080 9194848 9949824 10781197 11692584 12711820
8705 12711820 13894711 15276115 16884346 18789364 21045246 23736138 26963018 30831945
8697C0831945M622788N533016O570209P805942R334023J1268835J3814603J7182020
8689A06963381K1444583K6490275L1576476L4701082L2673314K3096882P296533
8682B84242526j0103437k3864073l0333511k9642345k5165765k0260404j6441918
8675A28431073j3793187j1855884j0352790r155025q180908p370335o705559o081181
8667E4936204n496139m948387m408567l896403l433034l041731k693944k378665
8659B4639334k118735j895342j686940j520419j365147j229656j102359r88181
8651A2732555r06887q25523p49793o86900o26383n74976n06493m65557m24425
8642F965618l86773l57110l29159l03363k85847k50692k19887k21689k29083k03717
$$ plain form
8697 30831945 35454733 40987749 47557958 55363900 64697923 75966758 89781361 106963381
8689 106963381 128407964 154898239 186474715 221175797 253849111 276945993 284242526
8682 284242526 274139089 250275016 219941505 190299160 165133395 144872991 128431073
8675 128431073 114637886 102782002 92429212 83274187 75093279 67722944 61017385 54936204
8667 54936204 49440065 44491678 40083111 36186708 32753674 29711943 27017999 24639334
8659 24639334 22520599 20625257 18938317 17417898 16052751 14823095 13720736 12732555
8651 12732555 11825668 11000145 10250352 9563452 8937069 8362093 7855600 7390043 6965618
8642 6965618 6578845 6221735 5892576 5589213 5303366 5052674 4832787 4611098 4382015 4178298
8632D178298j96862j94462j70285j45432j48900j42573j29255j23849j22834j15132
8622B688714j12303j15460j06867j02533q8816p0580o8779q5739p6766o8632p1243
8611A720996o3003n1576m4730k8365k3464m4385m7665m3576m8697n0117l3572
8600A241846l3800k6989l4521k3579l4310k6934l6477k0218k5375l6127l1528
8589I11988l5133j7368j3737l672m635r218j9649j4462j0184K241l093q862j1664
8576G62552j8841j127k1675k8405j7051j375J911q508L586Q098P793J3642L3837
8563G34437M6717O5923P5688Q6652R0752Q1403O9615M6135J4565k098j4519k2285
8551A272985l2225l2743l6416k3898l3115k1889j0903j6270k2385p599K299o603
$$ plain form
8632 4178298 3981436 3786974 3616689 3471257 3322357 3179784 3050529 2926680 2803846 2688714
8622 2688714 2576411 2460951 2354084 2251551 2162735 2092155 2023376 1937637 1860871 1792239 1720996
8611 1720996 1657993 1606417 1561687 1533322 1509858 1465473 1417808 1374232 1325535 1275418 1241846
8600 1241846 1208046 1181057 1146536 1122957 1088647 1061713 1025236 1005018 979643 943516 911988
8589 911988 876855 859487 845750 842078 837443 828225 808576 794114 783930 786171 783078 774216 762552
8576 762552 743711 742584 720909 692504 675453 674078 675989 667481 671067 679165 686958 700600 734437
8563 734437 781154 847077 922765 1009417 1100169 1181572 1251187 1297322 1311887 1309789 1295270 1272985
8551 1272985 1240760 1208017 1171601 1147703 1114588 1092699 1081796 1065526 1043141 1035542 1037841 1031238
8539A031238k5388k1359j5564m088k179p726j0149j4055j2083j4898j6039j8311
8527H69399k2819j4541j3868k7038j8939l2722k0052j6650n325j8765r190j3810
8515F55680o30q101j1596p421j9536j1725j037o029j0473m623r199j7711j1084
8502E36515n970p427o429p787j1150o073j1823j4013j9095j2340k644k251r708
8489D19805o794n932J874K509l327Q453J0O457q55n573r17J6519R202J1030N463
8474D57924J2333J2421J1645M1147N7484M6117L3349N9493R5686J37434J73709
8463A138742J81696J47850P1457m9734j59687j97291j70808j19060r0161o0079
8453F92925m5953o6593m2069j2929j8472k6654k4842j8694r753k943r172r657
$$ plain form
8539 1031238 1005850 984491 968927 964839 962660 954934 944785 930730 918647 903749 887710 869399
8527 869399 846580 832039 818171 791133 772194 739472 719420 702770 697445 678680 669490 655680
8515 655680 655050 646949 635353 627932 608396 596671 595634 589605 579132 574509 565310 547599 536515
8502 536515 530545 523118 516689 508902 497752 491679 479856 465843 446748 434408 431764 429513 419805
8489 419805 413011 407079 408953 411462 408135 416588 416598 423055 422200 416627 415710 432229 441431 452461 457924
8474 457924 470257 482678 494323 535470 592954 639071 672420 731913 827599 965033 1138742
8463 1138742 1320438 1468288 1539745 1490011 1330324 1133033 962225 843165 753004 692925
8453 692925 646972 580379 538310 525381 506909 480255 455413 436719 426966 424023 414851 405194
8441D05194j5881K230Q16j0503j5809J612n359o097J531k7430j9882K817j606
8428C11633j0001j1093J852j2308j6078q901L143N9n204L883k717p413r989N117
8414B41983M308p128P91j1879o963j3843q078j503m746o297j2704r313j6502n959
8400A42167j9854k2615l3310l7089j6852j3901k870O819K4365M3062O6838N6533
8388A93293L6007K8575J9684O647k309J5212J1593O10P62O988K36j0585j1940
8375B94773M187J2515L484j0339m06J1622L214m431J2036R435J0175J7774K4239
8362C88278L2767K9085K1779M2651N4624P1904R5148J14131J39650J82261K64121
8351A436399M15341O10866Q96449R89239N93143J0171n75068r28074p72087m54161
$$ plain form
8441 405194 389313 391543 392359 381856 366047 367659 362300 356203 357734 330304 310422 313239 311633
8428 311633 301632 290539 292391 280083 264005 255104 258247 258306 253102 256985 254268 246855 236866 241983
8414 241983 246291 239163 239954 228075 221112 207269 199191 197688 192942 186645 173941 164628 148126 142167
8400 142167 122313 99698 66388 29299 12447 -1454 -4324 2495 26860 69922 136760 193293
8388 193293 229300 257875 277559 284206 281897 297109 308702 309312 310074 317062 317298 306713 294773
8375 294773 298960 311475 314959 304620 304214 315836 319050 314619 326655 336090 346265 364039 388278
8362 388278 421045 450130 471909 514560 569184 641088 736236 850367 990017 1172278 1436399
8351 1436399 1851740 2462606 3359055 4348294 4941437 4951608 4376540 3448466 2676379 2222218
8341B222218k14473r8381m6239l878L8603R9729J65027K00168K57420L52197M97550
8330C469941P34860J104529J630789K210498K268153J341665n0168j425220k235268
8321I049779k041644j359173q13588n51268m25977l37577k39406j61046j29675
8312B990425q0562k1217N1522J37734K91071N37672R15126J522756J932222J355130
8302I631879K31527r25117j876942j821290j135395o10884l83086l13519k69259
8293B527914k00451j45620j27239r5572q0051m8957j8906l888Q629K0639N279
8282A841777Q656K449k7960n9909p5015q4474r8554r5463q9962p4044o7081n7555
8270A122865m3974j8759J7893M5106O2823R7584J64092K67153M27371O54696Q99566
$$ plain form
8341 2222218 2007745 1909364 1863125 1859247 1897850 1997579 2162606 2362774 2620194 2972391 3469941
8330 3469941 4204801 5309330 6940119 9150617 11418770 12760435 12710267 11285047 9049779
8321 9049779 7008135 5648962 4835374 4284106 3858129 3520552 3281146 3120100 2990425
8312 2990425 2909863 2888646 2940168 3077902 3368973 3906645 4821771 6344527 8276749 9631879
8302 9631879 9863406 8938289 7061347 5240057 4104662 3493778 3110692 2797173 2527914
8293 2527914 2327463 2181843 2054604 1959032 1878981 1830024 1811118 1807230 1815859 1836498 1841777
8282 1841777 1850433 1852882 1824922 1765013 1689998 1605524 1506970 1411507 1321545 1247501 1180420 1122865
8270 1122865 1078891 1060132 1078025 1123131 1185954 1283538 1447630 1714783 2142154 2796850 3696416
8259C696416P74510K73704k90050p92312r10096o47068l66352k31103j67996j42344
8249A197309j27329j08267r3534q1242o7212o2526n8374n3588l8807m7949m8391
8238D10090k9871k7816j5599k9665k0019j5834q615l708m389j0337m891j447j9973
8225B17926Q05q991r682m294j0731r336J311k799j430l481K178p47l698k1809
8211A45222n302j559N175n239J480R77j0372j9428Q470K095n822K6972K2443J290
8197A66402m499n303j391M280J500l50k0423P51Lj455N239P754j2050j1187j281
8182A27990R081j634M38j16L601K995L643o30N910o69j961m834l739M027j3488
8167A30614m114L689k491n552P546J0429r222K004K941j5962k784J0407j349l891
$$ plain form
8259 3696416 4470926 4744630 4454580 3662268 2752172 2105104 1738752 1507649 1339653 1197309
8249 1197309 1069980 961713 868179 786937 719725 657199 598825 545237 506430 458481 410090
8238 410090 380219 352403 336804 307139 287120 271286 262671 258963 254574 244237 239346 237899 217926
8225 217926 218731 209740 200058 195764 185033 175697 177008 174209 172779 169298 171476 170729 167031 145222
8211 145222 139920 138361 143536 138297 139777 140754 130382 110954 119424 121519 115697 142669 165112 166402
8197 166402 161903 156600 155209 159489 160989 160639 140216 140967 140970 139515 144754 152508 140458 129271 127990
8182 127990 137071 135437 135875 135759 139360 142355 145998 145368 151278 150609 148648 143814 140075 144102 130614
8167 130614 126500 130189 127698 122146 129692 140121 130899 132903 135844 119882 117098 127505 126156 122265
8153A22265r070k842p277K047N556K752o090J725p446l965P777N381O038j045
8139A15806r637J112n975R420n988n258J0394k331j6936N9N987R167K956K421
8125A11197j887m183p926M167l143l240rl535k842p366O52L021M566q0L094R1
8109I2577J66R379K407m138o446l492N153J0120m944j0336J39L189k961o323N777
8094I0267N287j0330l730l62K962p53k509J438j947m785P070M798l305P375j0165
8079H1311q331M352K900O289k991o104L269P273j7701r01P874N053j183J331j587
8064H0854k775M0P349K968r175n368P547J69k915q89l279p097n368q86P137M67
8048F8779M791J304j9138j3641J7176R510j0088r122l956L857L015q762j0220
$$ plain form
8153 122265 113195 110353 103076 105123 110679 113431 107341 109066 101620 97655 105432 110813 116851 115806
8139 115806 106169 107281 101306 110726 104738 99480 109874 107543 90607 90666 96653 105820 108776 111197
8125 111197 109310 105127 97201 101368 98225 94985 94976 91441 88599 81233 81885 84906 89472 89392 92486 92577
8109 92577 92743 102122 104529 100391 93945 90453 95606 105726 100782 90446 90585 93774 90813 84490 90267
8094 90267 95554 85224 81494 81132 84094 83341 80832 82270 80323 75538 82608 87406 84101 91476 81311
8079 81311 72980 77332 80232 86521 83530 77426 80695 87968 70267 69366 77240 82293 81110 82441 80854
8064 80854 78079 78119 85468 88436 79261 73893 81440 81609 78694 77805 74526 67429 62061 61175 68312 68779
8048 68779 73570 74874 55736 42095 59271 68781 58693 49571 45615 49472 52487 43725 33505
8035C3505j3037J3297R552J3119Q030L62o417K757P315n592q927l053J524l563
8021D8872m249l0O586P790l039o351p744j910o90J690J4143J0523j871j1581m87
8006E1652R120J0262J5375J059k0316j2953n270P231k267O8J0720J19p806p982
7992D9012l701J052o95P262Q519J185K978k122p724j2296j5347R387J4522l059
7978D8973M36k170m95J0269J5494m423j5472k095N447m148o968L705Q29J0200
7964E9582K099j038N95j825M141L791m758j6198l713K4171J0745M898O165Q077
7950I6732N849j095P296j4053j7346l500j812r191P268O318J0741j089j7420R447
7936G8145O305k704k658l347J4466J11K190J0448K034R042J0133L206j6105q9
$$ plain form
8035 33505 20468 33765 43317 56436 64466 64828 58411 61168 68483 62891 53964 50911 52435 48872
8021 48872 44623 44593 51179 58969 55930 49579 41835 39925 39235 40925 55068 65591 63720 52139 51652
8006 51652 60772 71034 86409 87468 67152 54199 48929 56160 53893 53961 64681 64800 56994 49012
7992 49012 45311 46363 45668 52930 61449 62634 65612 63490 55766 43470 28123 37510 52032 48973
7978 48973 49409 47239 46744 57013 72507 68084 52612 50517 55964 51816 44848 48553 49382 59582
7964 59582 61681 60643 61238 59413 63554 67345 62587 46389 42676 66847 77592 82490 88655 96732
7950 96732 102581 101486 108782 94729 77383 73883 72071 62880 70148 76466 87207 86118 68698 78145
7936 78145 84450 81746 79088 75741 90207 90318 92508 102956 104990 114032 124165 127371 111266 111177
7922A11177j0732j4951q960o68Q734k859j1859j0071o456K6122J1942j5720r718
7909F5981J0597N662J1546J3564J1878R575Q911j3774j6367q435o789l349n858
7896H3142p587k054j2144o538j1029j418p88j352K158m133R99O858K533l691j1921
7881C3035K229J698j600j939J862N396m649J910K590q08O870k562J3298K540q222
7866E1648K886O776L370J3571P110l332j5233j4137K113q502M02O604L981L412
7852F0669l946j721j1493l619O129J87q492L411Q376k308o714n625M614J6481
7838E5949m893J051r655q97N774o173o704j1026N890M470K098R779O35r928p456
7823B8914J2683p17M998K807p425j208P19j5640O72J024j0214n46P513M551l835
$$ plain form
7922 111177 100445 85494 76534 75866 84600 81741 69882 59811 53355 79477 91419 75699 65981
7909 65981 76578 82240 93786 107350 119228 128803 137714 123940 107573 99138 92349 89000 83142
7896 83142 75555 73501 61357 54819 43790 42372 41584 40232 42390 38257 39256 46114 48647 44956 33035
7881 33035 35264 36962 35362 33423 35285 40681 36032 37942 40532 39724 46594 44032 57330 59870 51648
7866 51648 54534 61310 64680 78251 85361 82029 66796 52659 54772 46270 46672 53276 57257 60669
7852 60669 56723 55002 43509 39890 46019 46206 37714 41125 49501 47193 40479 34854 39468 55949
7838 55949 51056 52107 42452 41555 47329 41156 34452 23426 29316 33786 35884 45663 46298 36370 28914
7823 28914 41597 40880 45878 48685 41260 40052 40771 25131 25803 26827 16613 16067 23580 28131 24296
7808B4296l857R34O545k534j855n336K89K2071J1525m957l591m166p159p424R922
7793C4703j906O31J878P390j2938l520N540J4547J27m894K394L075P279j1448
7779D2858j0198k25m150r50o25n634q45P301O436j292q838M060K55Q147J0785
7764D7085J5j1038q326q308M026J6973L17j3990m209K196L951O6o385L617j059
7749B4931K566L622k93Q336L392n821j371K680j670l33m103k799J0592l316k495
7734C3918p29K51j381N047J059j8073k418J2316P067n335L572j1916j0910R462
7720B1930Q083r54l677L476k925K001R171L668n122L685k16o098J751k31K586
7705C7128p588L541m81R29q25j333j1295p088r8N421k049P572p401j8191L149
$$ plain form
7808 24296 20439 21373 27918 25384 23529 18193 18482 40553 52078 47121 43530 39364 32205 24781 34703
7793 34703 32797 33428 35306 42696 29758 26238 31778 46325 46452 41558 43952 47027 54306 42858
7779 42858 32660 32435 28285 27335 26710 21076 20231 27532 33968 32676 23838 27898 28153 36300 47085
7764 47085 47100 36062 27736 19428 23454 40427 40744 26754 22545 24741 28692 28758 22373 25990 24931
7749 24931 27497 31119 30826 39162 42554 36733 35362 38042 36372 36039 31936 29137 39729 36413 33918
7734 33918 33189 33440 32059 37106 38165 20092 17674 29990 37057 31722 35294 23378 12468 21930
7720 21930 30013 29059 25382 28858 25933 27934 37105 40773 35651 39336 39120 33022 34773 34542 37128
7705 37128 29540 33081 32600 33529 32704 31371 20076 12988 12890 18311 16262 23834 16433 -1758 1391
7690A391J8549P746K013n92j2664M003M772j478N496O724p470j5599r24J1804
7676B3771R626R301l201j6826o10n40m600J0126Q519l999r557q3J311J18K257
7661B5613l86j282N352R002j954j0543o400J098J502j856K104n204L628L862o794
7646A7742P734J0040l163o597k107R94R584K116j911j9212m331Q852J41N955L170
7631B9007m055J460j0248Q087Q882n218k729J218j3095n990k952o248n246J526
7617e601R682o701p940k308J3095R050M093r403p73J231O334R487j996K400j509
7602A9141M155Q830k154m240N386P108r129r261l151j071q78K386o09K904R689
7587B9106L041k266J797n610m72m962o383J0597m291o905P691k054j0363p055
$$ plain form
7690 1391 19940 27686 29699 29107 16443 20446 25218 23740 29236 35960 28490 12891 11967 23771
7676 23771 33397 42698 39497 22671 22061 21521 16921 27047 35566 31567 22010 21927 23238 23356 25613
7661 25613 25227 23945 29297 38299 36345 25802 19402 20500 22002 20146 22250 17046 20674 24536 17742
7646 17742 25476 35516 32353 25756 23649 24643 34227 36343 34432 15220 10889 19741 19882 25837 29007
7631 29007 24952 26412 16164 24251 33133 27915 25186 26404 13309 7319 4367 -1881 -7127 -5601
7617 -5601 4081 -2620 -10560 -12868 227 9277 13370 3967 3194 4425 10759 20246 18250 20650 19141
7602 19141 23296 32126 29972 25732 31118 38226 29097 19836 16685 15614 14736 17122 16513 19417 29106
7587 29106 32147 29881 31678 26068 25596 20634 14251 24848 20557 13652 21343 19289 8926 1871
7573A871M538J1707l172p627J41M690k332n466P772P280J303J3357j11j0199o594
7558A7158m172r799O768Q641o387N516m743p457j113J2231N67r834j999J780P625
7543A4782M402P360J0324K189J697L669n043k953L420j497r335m709q717M382
7529A9971K03J47l370j107k86j708p868k812J1525O35K648K038P002l949p949
7514A5120O858N361j382j846p840m5J491q082j516J3571m701r486Q91l029n59
7499D806R621J4457O601k496O301j1390p413r634j0900k39J3223J4970j11j3218
7485A4578j4982m38M691M072P785j671N13J173m388j0150l237J2025P211m11J966
7470A8737k406j028M816j004j5913p57p494J1359J7086J272k645r804j1295M128
$$ plain form
7573 1871 6409 18116 14944 7317 7458 12148 9816 4350 12122 19402 20705 34062 33951 23752 17158
7558 17158 12986 3187 9955 18596 12209 17725 12982 5525 4412 16643 17210 7376 5377 7157 14782
7543 14782 19184 26544 36868 39057 40754 44423 39380 36427 39847 38350 29015 24306 15589 19971
7529 19971 20174 20321 16951 15844 15558 13850 5982 3170 14695 15330 17978 20016 27018 23069 15120
7514 15120 21978 27339 25957 24111 16271 16226 17717 9635 8119 21690 16989 7503 8394 5365 4806
7499 4806 14427 28884 35485 32989 39290 27900 20487 10853 -47 -286 12937 27907 27796 14578
7485 14578 -404 -842 3849 7921 15706 14035 14548 15721 11333 1183 -2054 9971 17182 16771 18737
7470 18737 16331 15303 20119 19115 3202 2445 -5049 6310 23396 24668 22023 12219 924 5052
7456E052n226j482k196Q44J0050o58j1440J0811N994j418L528J760N133J365l646
7441A8471q637j617p79K30o13m520r086O629J9004O019j0006j0650J33J0280L238
7426A8096J1174k32n974n196o530N556O796M630K300L423r025o248P837j896k157
7411B2554j4248j2155K449n963k4j421J0749O693m695n117l245J0285K259j0340
7397b219O323j324j758n139j0636N151J1626J4674J8139N579j0012q435p025j474
7383A3470Q153K37j0694K393O158M385m32l193O65j0441M9J2119P98r567r46J2118
7367B5272M958m401j0673j0053n519M992L667L814N521J2264J131l831k28L420
7353C0334j5050j9349Q82L741k209R895J6043m988p301p635k358o050Q426J416
$$ plain form
7456 5052 -174 -1656 -3852 -3008 7042 6384 -5056 5755 11749 10331 13859 15619 20752 22117 18471
7441 18471 9834 8217 7438 7668 7055 2535 -6551 78 19082 25101 15095 4445 4578 14858 18096
7426 18096 29270 29038 23064 17868 11338 16894 23690 28320 30620 34043 25018 18770 26607 24711 22554
7411 22554 8306 -3849 -1400 -7363 -7387 -8808 1941 8634 3939 -1178 -4423 5862 8121 -2219
7397 -2219 4104 2780 1022 -4117 -14753 -9602 2024 16698 34837 40416 30404 21969 14944 13470
7383 13470 21623 21860 11166 13559 19717 24102 23670 20477 21142 10701 10750 22869 23667 14100 13154 25272
7367 25272 30230 25829 15156 5103 -416 4576 8243 12057 17578 29842 30973 27142 26914 30334
7353 30334 15284 -4065 -3183 558 -1651 8244 24287 19299 11998 4363 2005 -4045 4381 5797
7339E797m358m97K219K85n744Q635J648q951R243J5409N226J586n825j1686m872
7324H115l640j476J4950J1082k784R573j634j3240m314j1871m284O884J8828k952
7310B3237p637m290k919j152J211k455l735P367Q528l225l970M159P339N121K87
7295B7866k570j6828j997J1483J249K74j0244r071N715oj4287R286N548M810J2741
7280B3969N215n266j3099q938l459P28K655R144m101K908K518m55o321j079m172
7265B47m53O434P190k107j5693j487Q007j6N41N129J3506M577j7289m093K707
7250G200j449r763k402R293Q996J2061o907K251K160o947j0322Q624O200j0882
7236H113n661j786R82R984N315k646N705P19j252K716l72q826n018j443Q17p452
$$ plain form
7339 5797 1439 942 3161 3446 -2298 6337 7985 -966 8277 23686 28912 30498 24673 12987 8115
7324 8115 4475 2999 17949 29031 26247 35820 34186 20946 16632 4761 477 7361 26189 23237
7310 23237 15600 11310 8391 7239 8450 5995 2260 9627 18155 14930 10960 15119 22458 27579 27866
7295 27866 25296 8468 6471 17954 19203 19477 9233 162 5877 5871 -8416 870 6418 11228 23969
7280 23969 29184 23918 10819 1881 -1578 -850 1805 10949 6848 9756 12274 11819 5498 4419 247
7265 247 -206 6228 13418 11311 -4382 -5869 2138 2122 2663 7792 21298 25875 8586 4493 7200
7250 7200 5751 -4012 -6414 2879 11875 23936 17029 19280 21440 14493 4171 12795 18995 8113
7236 8113 2452 666 1648 11632 16947 14301 20006 20725 19473 22189 21817 12991 7973 6530 7347 -105
7220a05q172O847P544j0347P363j788Q128P583o100k701J733N029K370K170n767
7205A3787m995M725j299P574M96R95p662L912l167o203K029k29q29j523j558l71
7189E682k69L90r08P857M01o40L349J3645Q004q940n293L587m472m488l680j1242
7173B983j1036R813O310o684q780P789M056j5544Q821J5639M706n672K490k271
7159A2620J545J135q552m226Q466J915q275k797O740M078J989L716j390p699j2223
7144b958L894O706J4449l344j8046o465R762N198J950K50m863n279J4027R338
7130B4619q534n285J1678L293n956r21n491P3r328p837P373J6338R7j734J1611
7115B9996m809n054Q65j2882n800L709l324n38Q623j483J0686O006q130o858j572
$$ plain form
7220 -105 -8277 -1430 6114 -4233 3130 1342 9470 17053 10953 8252 9985 15014 17384 19554 13787
7205 13787 8792 13517 12218 19792 20288 21283 13621 17533 14366 8163 10192 9963 9134 7611 6053 5682
7189 5682 5413 5803 4895 12752 13153 12513 15862 29507 37511 28571 23278 26865 22393 17905 14225 2983
7173 2983 -8053 1760 8070 1386 -7394 395 4451 -11093 -2272 13367 18073 12401 14891 12620
7159 12620 14165 15300 6748 2522 10988 12903 4628 1831 8571 12649 14638 18354 16964 9265 -2958
7144 -2958 936 7642 22091 18747 701 -5764 3998 9196 11146 11396 6533 1254 15281 24619
7130 24619 16085 10800 22478 25771 19815 18894 13403 13476 4148 -3689 3684 20022 20119 18385 29996
7115 29996 25187 20133 20998 8116 2316 6025 2701 2163 10786 9303 19989 25995 17865 11007 9435
7100I435l055p31p30m644L96J0306o683l067q13j129K394J800p30J4720K622m152
7084A5939p616n833l754J2070N151L697r756j3899j919l649K0757P021m11j4340
7070C458l742J307r73O702J265l901O62j4950J12P154K303n870k928K113m328
7055a1616m313J4785O340n111J375J0091O182n138l483o382j2970q243l975N227
7041a7231J0914J5164J1720k982j3573p701k89N662N218r466Q329J1800J056l934
7027A4687L005m861o818n709Q44J7769j889j0346M908j369j0390J923O513j0500
7013b233j5623P220J4517Q849N518k111r602j3796Q922J0788m656Q960K934q138
6999A1549Jm649O920Q532m897p026K119P787J992j0947o403L829J087o773l101
$$ plain form
7100 9435 6380 5649 4919 275 671 10977 4294 1227 414 -715 1679 3479 2749 17469 20091 15939
7084 15939 8323 2490 -1264 10806 15957 19654 9898 -4001 -5920 -9569 11188 18209 17798 3458
7070 3458 -284 1023 50 6752 8017 4116 4778 -10172 -10060 -2906 -603 -6473 -9401 -7288 -11616
7055 -11616 -15929 -1144 5196 85 1460 11551 17733 12595 9112 2730 -10240 -18483 -22458 -17231
7041 -17231 -6317 8847 20567 17585 4012 -3689 -3978 1684 6902 -2564 5765 17565 18621 14687
7027 14687 17692 12831 6013 304 1148 18917 17028 6682 11590 10221 -169 1754 8267 -2233
7013 -2233 -17856 -10636 3881 12730 18248 16137 6535 -7261 1661 12449 7793 16753 19687 11549
6999 11549 11550 6901 13821 22353 17456 10430 12549 20336 22328 11381 4978 8807 9894 3121 20
6984B0J247K628N897J0945q352r001Q056P99O137R061N8n241k888K949p592n488
6968I235M07L715K051q747k016K878l172j836L749J1901R68r839j3006o18J5270
6953A0940p98R52Q314r473o662j679k35j448L313O168j2813j8727l566J2927N588
6938g199O123P922j1093n675P714j291m478R992Q992P395p176J156j0066k874
6924e58l920R127J670O33O043P37l126O66K823j4778q064O917l319K937R219j044
6908E963L171n018j832O23K207r83o108n02o12K321P852R12j575N373r117q801
6892f126N97Q499o99M703r390p010P891O306l131L52J395J38J220o224j3717L53
6876a4843O190P434L992l529k437N914J7106J1615o595k480o608j7511p408O800
$$ plain form
6984 20 1267 3895 9792 20737 12385 3384 11440 12239 18376 27437 27495 22254 19366 22315 14723 9235
6968 9235 9642 13357 15408 6661 4645 7523 4351 2515 6264 18165 19133 9294 -3712 -4330 10940
6953 10940 10142 11094 19408 9935 3273 1594 1359 -89 3224 9392 -3421 -22148 -25714 -12787 -7199
6938 -7199 -1076 6846 -4247 -9922 -2208 -3499 -7977 2015 11007 18402 11226 12382 2316 -558
6924 -558 -4478 4649 6319 6952 12995 13732 10606 11272 14095 -683 -8747 -1830 -5149 -2212 7007 5963
6908 5963 9134 4116 2284 2907 5114 4131 -1977 -2479 -3091 -770 7082 7994 6419 11792 2675 -6126
6892 -6126 -5529 2970 2271 6974 -2416 -9426 -1535 4771 1640 1992 3387 3525 4745 -1479 -15196 -14843
6876 -14843 -8653 -1219 2773 -756 -3193 2721 19827 31442 24847 22367 15759 -1752 -9160 -2360
6862b360K69m75p384n993J7693J2873p023L32L85K728M393n331R58j723K081L355
6846A4778r99L347R652k253j5079Q175L780M28j5993m150N182r281K660L746R930
6831A3923L537j1701j647J0344K884J077j493p721J290J0864l4q515n289j4957
6817g438L431J5443j494m41q30o202J2669K342K610k30P30m647r91O47M408J461
6801B1468J513J015N193k939m557K106o653L784J48q29k818J471j719j3673o108
6786b598m831J1049P36J415J0784j835j280N130o827k562n091N209P328N524l673
6771A8478J3155p26k263l916j0647O947p980j2117l110J0440J6998q215k3239
6758f195p068n899J6956J0327j2606n041J777J321o995J2068J0236k417o636L312
$$ plain form
6862 -2360 -2091 -2566 -9950 -15943 1750 14623 7600 7932 8317 11045 15438 10107 11065 9342 11423 14778
6846 14778 13779 17126 26778 24525 9446 17621 21401 21829 5836 1686 6868 -2413 247 3993 13923
6831 13923 17460 5759 4112 14456 17340 18417 16924 9203 10493 21357 21323 12808 7519 -7438
6817 -7438 -4007 11436 9942 9501 8671 2469 15138 17480 20090 19860 20590 15943 14952 15599 20007 21468
6801 21468 22981 23996 29189 26250 21693 23799 17146 20930 21078 20249 17431 18902 17183 3510 -2598
6786 -2598 -7429 3620 4356 5771 16555 14720 13440 18570 11743 9181 4090 9299 16627 22151 18478
6771 18478 31633 30907 28644 24728 14081 21028 13048 931 -2179 8261 25259 17044 -6195
6758 -6195 -13263 -19162 -2206 8121 -4485 -9526 -7749 -6428 -13423 -1355 8881 6464 -172 3140
6744C140O522P028L888M237j1701l443n399r016P061N084Q691l42K370q646r353
6729A21p318o680J0719P652K241O244Q198n945j2057k682r237K466J8695R636
6715B2053m266K829p802l848J253J42j1412q784R86K615K971K489K350P548o707
6700B417j1526O37j41m876p357N444R978J7369Q98j3238r385M560J1290J314K098
6685I482M19o518M717J186J6456J844J26J406O885j0674j1961k388j8692q86J975
6670f623J5307Q37r67Q954q93l728r259j3192L005Q105m502J088K567l181m151
6655f633K709M9J1722J6013J339j2360K529l460J224l239l074O79J283n740l251
6640b10l715q807M834J6635N994j1439j3017M838P904J722M132K330Q85J3574
$$ plain form
6744 3140 9662 16690 20578 24815 13114 9671 4272 -4744 2317 7401 16092 15750 18120 9474 121
6729 121 -7197 -13877 -3158 4494 6735 12979 21177 15232 3175 493 -8744 -6278 12417 22053
6715 22053 17787 20616 12814 8966 10219 10361 -1051 -9835 -8849 -6234 -3263 -774 1576 9124 2417
6700 2417 -9109 -8472 -8613 -13489 -20846 -15402 -5424 11945 12843 -395 -9780 -5220 6070 7384 9482
6685 9482 9901 3383 8100 9286 25742 27586 27712 29118 36003 25329 13368 10980 -7712 -8598 -6623
6670 -6623 8684 9521 8554 17508 16615 12887 3628 -9564 -6559 1546 -2956 -1868 699 -2482 -6633
6655 -6633 -3924 -3875 7847 23860 25199 12839 15368 11908 13132 9893 6819 7498 8781 3041 -210
6640 -210 -3925 -12732 -7898 8737 14731 3292 -9725 -4887 3017 4739 8871 11201 12086 25660
6626B5660P196j6092p004K014K751o398l371p926j2902k672J2560O608P828L211
6612A1463m635j293k317J484O452m03K496O58j3595k152O507p49l696K149J432
6597C801l71K057j981N846L722j1130L524k924j291k794L985m419J21l216l236
6582h306J0208r28j083O778J3243K142r157n414k437L279O072Q545Q76r41n131
6567A7746m597k716L463p089k569o550P294R953n91k275m952o30l401K330L522
6552H938J0244K239j0731p594L728k425N954J3k474r060R40N812K817Q454j819
6537A5036J175m363j879r773J108J3356P40l501j0995l113l683K832K962J0292
6523A0194j561n792k662J0217m326J931L765o567k119K357L594J024p918j092
$$ plain form
6626 25660 32856 16764 9760 11774 14525 8127 4756 -3170 -16072 -18744 -6184 424 8252 11463
6612 11463 6828 5535 3218 4702 11154 10751 13247 13905 310 -1842 4665 3916 220 2369 3801
6597 3801 3430 5487 3506 9352 13074 1944 5468 2544 1253 -1541 2444 -1975 -1854 -5070 -8306
6582 -8306 1902 974 -109 6669 19912 22054 12897 7483 5046 8325 14397 22942 23818 22877 17746
6567 17746 13149 10433 13896 6807 4238 -2312 4982 14935 14344 12069 7117 6487 3086 5416 8938
6552 8938 19182 21421 10690 3096 6824 4399 10353 10366 7892 -1168 -228 5584 8401 16855 15036
6537 15036 16211 11848 9969 196 1304 14660 15400 11899 904 -2209 -5892 -3060 -98 10194
6523 10194 8633 2841 179 10396 6070 8001 11766 5199 3080 5437 9031 10055 2137 1045
6509A045M263k095K67M189j358j1320k197L092K015M153j24J798N002k846k391
6494C493L330R591M303J047p734o036n679j2693p524N565o620j2409K517L639
6480b5210J5946R916O70N586j505Q098M158j936j4994k563L633j847p769L403
6466d414N323r694j7837J917K2514L247r655n506P770J939L377K798N665J528
6452H972L789k681O078Q296L464p504l998j6048j874K892n296K857N359Q443J814
6437A4563K332J1264M702o281o019j301r40n42J481P382j2059q574L632J7103
6423B6743o46j3598k374J3470M178m154J984p428r923L853J163O461N793p331
6409A8191j085k367l011r640l749K382N242L800m3n16P352K523O59m713l163n3
$$ plain form
6509 1045 5308 3213 3480 7669 6311 -5009 -7206 -4114 -2099 2054 1930 3728 8730 5884 3493
6494 3493 6823 16414 20717 21764 14030 7994 2315 -10378 -17902 -12337 -18957 -31366 -28849 -25210
6480 -25210 -9264 652 1322 6908 5403 13501 17659 15723 729 -1834 1799 -48 -7817 -4414
6466 -4414 909 -8785 -26622 -24705 -2191 1056 -8599 -14105 -6335 -4396 -1019 1779 7444 8972
6452 8972 12761 10080 16158 24454 27918 20414 16416 368 -1506 1386 -3910 -1053 4306 12749 14563
6437 14563 16895 28159 32861 26580 20561 19260 18320 17778 19259 26641 14582 6008 9640 26743
6423 26743 26097 12499 10125 23595 27773 23619 25603 18175 8252 12105 13268 19729 25522 18191
6409 18191 17106 14739 11728 2088 -1661 721 5963 9763 9720 9204 16556 19079 19738 15025 11862 11809
6393A1809j1753N02O729l449J278O30l274N038K311j648p220l576m159j336N86
6378g532k763J3868R849l5p335J851l593J3954J669O0j719j863j6161m342j06
6363d198N241n103r989M082L793O721N837k079j735o102l108n179L055K565J1077
6348D878j584j2229q061n537P13j753R284J4289J101l978m929K394M200l23j563
6333c098l250j802Q331J4592N917n858o623m080j0539O88K609p789L724l380L810
6318f748O447Q94m861m852j702l513K601j242J835P915k948j0018o819J4262K0675
6303A1926P117l083J471m930j7116o892O848M601o706q610J1075M745m386m57
6289d397M501P567j143m267O484q621m585J1082J1817J693j0655n001j72K651
$$ plain form
6393 11809 56 558 7287 3838 5116 5746 2472 7510 9821 8173 953 -2623 -6782 -8118 -7532
6378 -7532 -10295 3573 13422 13387 6052 7903 4310 18264 19933 19993 18274 16411 250 -4092 -4198
6363 -4198 1043 -4060 -14049 -9967 -6174 547 6384 4305 2570 -3532 -6640 -11819 -8764 -6199 4878
6348 4878 3294 -8935 -16996 -22533 -21820 -23573 -14289 0 1101 -2877 -7806 -5412 -1212 -1535 -3098
6333 -3098 -6348 -8150 181 14773 20690 14832 8209 4129 -6410 -5722 -3113 -10902 -7178 -10558 -6748
6318 -6748 -301 593 -4268 -9120 -10822 -14335 -11734 -12976 -11141 -3226 -6174 -16192 -23011 -8749 11926
6303 11926 19043 15960 17431 12501 -4615 -11507 -4659 -58 -6764 -15374 -4299 446 -3940 -4397
6289 -4397 104 7671 6528 2261 8745 124 -4461 6621 18438 20131 9476 4475 4303 6954
6275F954j8769k303J1755M579m69k846Q023N773J153j816j212L92j711n343j84
6260C976j096l330l861p891K541O104j553L760o046j3242P577J313r558p215Q440
6245b0081J3659L23K023N001Q053M803o130J785O192p026m457o32J792o035j068
6230a798Q309k997Q68L150J812l363r830O059J0659J0557n421n468J0699M427
6216B7663j2087j8456Q772P021r636P55N332o26M142M689P39j2664o190K91j135
6201a390J5837M328r484q602M873m030j2055J5635M995P5Q379k386J559J943K38
6186A9915r042o382r506n994L842O661L008p84j859m878n110j581P822k21l4K028
6170b115j1625L095J4246N459j009j2387N963M428n841k750J0263k492j421O090
$$ plain form
6275 6954 -11815 -14118 -2363 2216 1747 -1099 6924 12697 13850 12034 10822 11214 9503 4160 3976
6260 3976 2880 -450 -4311 -12202 -9661 -3557 -5110 -1350 -7396 -20638 -13061 -11748 -21306 -28521 -20081
6245 -20081 -6422 -6099 -4076 925 8978 13781 7651 9436 15628 8602 4145 3513 5305 -730 -1798
6230 -1798 6511 3514 4382 7532 9344 5981 -3849 2210 12869 23426 18005 12537 23236 27663
6216 27663 15576 -2880 5892 12913 3277 4032 9364 8738 12880 17569 18308 5644 -546 -255 -1390
6201 -1390 14447 18775 9291 689 5562 1532 -10523 5112 10107 10182 18561 16175 17734 19677 19915
6186 19915 10873 4491 -5015 -11009 -7167 -506 2502 1718 -141 -5019 -10129 -11710 -3888 -4109 -4143 -2115
6170 -2115 -13740 -10645 3601 9060 8051 -4336 1627 6055 214 -2536 7727 5235 3814 9904
6156I904j2713r181N098r47J266m545n34k788j751Q346M402j0611k671M081O854
6141e790J2149K835j0441j12k711j0047L805K325M14q84j1331P949Q767R193j1176
6126e055k645P893J6215J1087j1504q510n888m276R02P384J0055L721j3565k562
6112C252Q532J0150L347j5994j328Q322N577j2973k210q00m518n059J1375J652
6098I325l684L177K826o425m561j432n729n960M532J2946J6062N500j4455j5073
6084b951l718j59J0399L794j701k587J346m743j3233r246K124J4277M35J2236
6070F273J8371j1057r147m878n639r791J791J0686K359Q508Q007q18Q19p56l861
6055A0867M174o762J1746O963K201M956o139j7340J669M544k497j6124l958N339
$$ plain form
6156 9904 -2809 -11990 -6892 -7839 -6573 -11118 -11652 -14440 -16191 -7845 -3443 -14054 -16725 -12644 -5790
6141 -5790 6359 9194 -1247 -1359 -4070 -14117 -10312 -7987 -7573 -8457 -19788 -11839 -3072 6121 -5055
6126 -5055 -7700 193 16408 27495 15991 7481 1593 -2683 -1781 5603 15658 19379 5814 3252
6112 3252 11784 21934 25281 9287 7959 16281 21858 8885 6675 5875 1357 -3702 7673 9325
6098 9325 5641 8818 11644 5219 658 -774 -6503 -12463 -7931 5015 21077 26577 12122 -2951
6084 -2951 -6669 -6828 3571 7365 5664 3077 4423 -320 -13553 -22799 -20675 -6398 -5963 6273
6070 6273 24644 13587 4440 -438 -6077 -15868 -14077 -3391 -1032 7476 15483 14665 15484 14728 10867
6055 10867 15041 8279 20025 26988 29189 34145 28006 10666 12335 16879 14382 -1742 -5700 -361
6041c61Q900k408N710j240j6481j4619P450J4848J379N664J1232M418j4366j4444
6027d318j0960o965K2519J2421j5138n805O542o57K451J137J592k685J668O528
6013H330M867j238j3212n539R333O269M400l991j3241p450J958R945l577p513
5999a0659L531J790K644o682k302J3163K514J059O365J1504j121o780l495j9481
5985g950J534J4790K470k899J060k584M280j430j720l601m935J2262m630j0796
5971d149M170Q501L52j1891j4610m556k139K258O332Q497L242p40O798j0830k228
5956a0993L17M212j508o087J0294P401k507K448M692J141p469m709K531N693M547
5941A0003N688k946j2945j0813J229Q653L390J038j6936j0165K642J5642J0314
$$ plain form
6041 -361 8539 6131 11841 10601 -5880 -20499 -13049 1799 3178 8842 20074 24492 10126 -4318
6027 -4318 -15278 -22243 276 12697 -2441 -8246 -1704 -2361 90 1227 2819 134 1802 8330
6013 8330 13197 11959 -1253 -6792 2541 8810 13210 9219 -4022 -11472 -9514 431 -3146 -10659
5999 -10659 -7128 -5338 -2694 -9376 -11678 1485 3999 5058 11423 22927 21806 15026 11531 -7950
5985 -7950 -6416 8374 10844 7945 9005 6421 10701 9271 7551 3950 -985 11277 6647 -4149
5971 -4149 21 8522 8874 -3017 -17627 -22183 -24322 -22064 -15732 -7235 -3993 -4733 2065 -8765 -10993
5956 -10993 -10676 -6464 -7972 -14059 -3765 3636 1129 3577 8269 9410 1941 -2768 -237 5456 10003
5941 10003 15691 12745 -200 -11013 -9784 -1131 2259 3297 -13639 -23804 -21162 -5520 4794
5928D794P596j648m942k041J685j0517R100J393L12o917l023q049q053Q715J1889
5913B94M71j2749M681K155Q339O509k369K240r759P509P882j961P20M30p734n504
5897A154n684q113J917M643M470M324k722l076r54K870J0419M088K307j530L792
5882A7905r432j3651N704j451O602J5187j454j5135k0213J790J3981K384l428
5869a211l143l554O612j488j8860M379J4038K321K62n926M81L907M24o576L225
5854e109R480p647k2102j9398J3684J2094m016R233L772N463q701o973J2012L984
5840d224m601P084N055J444n63j821L673j1058J252J127m81m586l723j279Q205
5825d496J054J0045J5047O255p176K078O832j8093p056N497j268k5j0201j4388
$$ plain form
5928 4794 12390 10742 5800 3759 5444 -5073 4027 5420 5732 -1185 -4208 -12257 -20310 -11595 294
5913 294 765 -11984 -7303 -5148 3191 9700 7331 9571 -188 7321 15203 13242 13962 14392 6658 1154
5897 1154 -4530 -12643 -10726 -6083 -1613 2711 -11 -3087 -4041 -1171 9248 13336 15643 14113 17905
5882 17905 8473 -5178 526 -925 5677 20864 19410 4275 -15938 -14148 -167 2217 -1211
5869 -1211 -4354 -7908 -1296 -2784 -21644 -17265 -3227 -906 -644 -6570 -6089 -2182 -1758 -8334 -5109
5854 -5109 4371 -3276 -25378 -44776 -31092 -18998 -23014 -13781 -10009 -4546 -13247 -20220 -8208 -4224
5840 -4224 -8825 -1741 3314 4758 4195 2374 6047 -5011 -3759 -2632 -3113 -7699 -11422 -12701 -4496
5825 -4496 -3442 6603 21650 27905 20729 22807 29639 11546 4490 9987 8719 8694 -1507 -15895
5811a5895M714L210k243L200L383N560j115o386R022K373o342k071l939Q53R734
5796D058N927m544p373j3831P279J9756Q611q436r227k344l483p497P417J0016
5782F329P932j0967n783L536O604m816j403j2699p216K778R705Q172l918m934
5768f680m383Q782Q350K670l766o731n53K69p672M226P274m308n119n933N943
5753g631J721J1319J0382j160o507p445M944J0051j4036j4125j406J5001N803
5740F911m10P22j38j9110m782Q182O76P79j0083l807J2249J2495L226k408m351
5725A51j3782k205J0095L060o208k41L436J1351q723L81J664k170J0076n908J174
5710B151J3340J985L422o746J324p82o652o836k25n447l148k81P36P343J2061
$$ plain form
5811 -15895 -11181 -7971 -10214 -7014 -3631 1929 814 -5572 3450 5823 -519 -2590 -6529 -5676 4058
5796 4058 9985 5441 -1932 -15763 -8484 11272 19883 11447 2220 -124 -3607 -11104 -3687 6329
5782 6329 14261 3294 -2489 1047 7651 2835 1432 -11267 -18483 -15705 -6000 2172 -1746 -6680
5768 -6680 -11063 -2281 6069 8739 4973 -1758 -2311 -2042 -9714 -5488 1786 -2522 -7641 -13574 -7631
5753 -7631 -5910 5409 15791 14631 8124 679 5623 15674 1638 -12487 -13893 1108 6911
5740 6911 6501 7223 7085 -12025 -16807 -8625 -7949 -7170 -17253 -21060 -8811 3684 6910 4502 151
5725 151 -13631 -15836 -5741 -2681 -8889 -9130 -5694 5657 -3066 -2685 -1021 -3191 6885 977 2151
5710 2151 15491 17476 20898 14152 15476 14694 8042 1206 981 -4466 -7614 -7895 -7159 184 12245
5695A2245p13j4246j5230J3894L885r917k683J4602O371j1219j1803j7689p18
5682c3221P584K248J8200K985K026p948L956k009p653R72M820R954J0383J05j2537
5667a35o307k866M042P064M159p858j209o615j99K459J1742K696L195k023q481
5652c36j456J0465k781q85m819J001n727r921k402k949Q369N573n823J1624J0115
5637A0048M658m759j6789j0569M439m376j386N879l646L531J1813p228m02J5654
5623F867L38Q476O822l703j2234M715K099j3367j2691k000N006J1836J1257R448
5609B2869k724o833p329J2246J4355L902r472j4167p446j480J0754Q089J058n018
5595A8804j414R82p612q328K680L539Q576O384r248p243L768O180j0505j4643
$$ plain form
5695 12245 11532 -2714 -17944 -4050 -165 -10082 -12765 1837 8208 -3011 -14814 -32503 -33221
5682 -33221 -25637 -23389 -5189 -2204 -178 -8126 -4170 -6179 -13832 -12860 -8040 1914 12297 12402 -135
5667 -135 -6442 -9308 -5266 1798 5957 -1901 -3110 -9725 -9924 -7465 4277 6973 10168 8145 -336
5652 -336 -1792 8673 5892 5007 188 1189 -4538 -14459 -16861 -19810 -11441 -5868 -11691 -67 10048
5637 10048 14706 9947 -6842 -17411 -12972 -17348 -18734 -12855 -16501 -12970 -1157 -8385 -8787 6867
5623 6867 7205 15681 22503 18800 6566 11281 13380 13 -12678 -14678 -9672 2164 13421 22869
5609 22869 20145 13312 5983 18229 32584 36486 27014 12847 5401 3921 14675 22764 23822 18804
5595 18804 17390 18372 10760 2432 5112 8651 17227 23611 14363 7120 10888 17068 6563 -8080
5581h080j1382O161J0954J771l387j0610k161J8199Q766m037p891j196J2622R460
5567A9189J654n925k0535k1099J922k70R648M739L971k881L437j221j329l200
5553a1900O270L947K610M610L008K971j0713q711J0737L267J2618m451j1103q004
5539d844q420Q72M926O422m806j995n621j0474m556L471R075N070R161K041j193
5524h71p686M79m91K590M553o312M645J0371J763q102j4454k139P65k920O613
5509a1196J4269P603n419l764J932M61Q965M303P91l759o846o956l416l071m366
5494a0469J721K232M316n304q799L359J0637J872k913n925L415K663L089q886
5480h992M62L37J986L490n988n917r501k704p69L774L63K376J373O050K934P809
$$ plain form
5581 -8080 -19462 -13301 -2347 -576 -3963 -14573 -16734 1465 10231 6194 -1697 -2893 9729 19189
5567 19189 20843 14918 -5617 -26716 -24794 -25064 -15416 -10677 -6706 -9587 -6150 -7371 -8700 -11900
5553 -11900 -5630 -1683 927 5537 8545 11516 803 -7908 2829 6096 18714 14263 3160 -4844
5539 -4844 -13264 -12392 -7466 -1044 -5850 -7845 -13466 -23940 -28496 -25025 -15950 -10880 -1719 322 -871
5524 -871 -8557 -8078 -8569 -5979 -1426 -7738 -3093 7278 9041 939 -13515 -15654 -14889 -17809 -11196
5509 -11196 3073 10676 5257 1493 3425 3886 12851 17154 17945 14186 7340 384 -3032 -6103 -10469
5494 -10469 -8748 -6516 -2200 -7504 -16303 -12944 -2307 -435 -3348 -9273 -5858 -3195 -106 -8992
5480 -8992 -8530 -8193 -6207 -2717 -8705 -14622 -24123 -26827 -27596 -23822 -23459 -21083 -19710 -13660 -10726 -2917
5464b917J3594J3302j8418j3961R93n554J548N727n649n382J3772J225J968L137
5450C385J332P265J777l879p25j131k507j1501j3632J1538O120j145N261O785
5436H943j8705j173J0696L525P308o914L146o283m159L36L689M076j784j262q169
5421f730M79M177L944m21N876J430N63l871p737n745M085J2156M200M699j541
5406A5564j3728o069N085m762p996M878J0470o42L955N047m003p626n09j238J588
5391A4M143L648M303P19r650n914O797l365p082L023j08k039m539J1922J1832
5376A3704m054r486j2530L445N455l045N88p37j056K247m785n806r32J3127m872
5361h737l245q641q314J7833J0006Q14N552j344j3543n628P203J7264P53j285
$$ plain form
5464 -2917 10677 23979 5561 -8400 -7407 -12961 -11413 -5686 -11335 -16717 -2945 -1720 248 3385
5450 3385 4717 11982 13759 9880 9155 8024 5517 -5984 -19616 -8078 -1958 -3103 2158 8943
5436 8943 -9762 -10935 -239 3286 10594 3680 6826 543 -3616 -3280 409 4485 2701 1439 -6730
5421 -6730 -6251 -2074 1870 1449 7325 8755 9318 5447 -2290 -8035 -3950 8206 12406 17105 15564
5406 15564 1836 -4233 852 -3910 -11906 -7028 3442 2800 6755 11802 7799 173 -336 -1574 14
5391 14 4157 7805 12108 12827 3177 -2737 4060 695 -6387 -3364 -3472 -5511 -10050 1872 13704
5376 13704 9650 164 -12366 -8921 -3466 -6511 -5923 -6660 -7716 -5469 -10254 -16060 -16992 -3865 -8737
5361 -8737 -11982 -20623 -28937 -11104 -1098 -284 5268 3924 -9619 -15247 -8044 9220 9973 8688
5347H688j420Q549m422q188K22M872m002k568j4364l362O208j238r27J2793M712
5332E553R005J4970r072p623q402o714P676o80P16K763p336m611K114J0444n436
5317C367k048p332r10J786p498p23J962j24j1522O649J5044N208n298j3332J2280
5302b491J944m45M316m688k228J4090n010j036L958q982K345M262O403N456j1095
5287F799p305n210J0610R353J126m336q388q63k252J587J304n676q958l673N808
5272a0074J767J0288o475m85N151K196j150J089l868j8781j283j440K432J4759
5258e874m354O257N52L116N550j0301j553k808k898M281J1086K557J473L603p583
5243C104o064M791J435l445J085O896K028j3121o608k368L099Q836m175O576N46
$$ plain form
5347 8688 7268 15817 11395 3207 3429 8301 4299 1731 -12633 -15995 -9787 -11025 -11952 841 5553
5332 5553 14558 29528 20456 12833 4431 -2283 5393 4713 5429 8192 856 -3755 -1641 8803 3367
5317 3367 1319 -6013 -6923 -5137 -12635 -13358 -11396 -11520 -23042 -16393 -1349 3859 -1439 -14771 -2491
5302 -2491 -547 -992 3324 -1364 -3592 10498 5488 4452 8410 -572 1773 6035 12438 17894 6799
5287 6799 -506 -5716 4894 14247 15373 11037 2649 1786 -466 1121 2425 -3251 -12209 -15882 -10074
5272 -10074 -8307 1981 -4494 -4979 172 2368 1218 2307 -1561 -20342 -21625 -23065 -20633 -5874
5258 -5874 -10228 -3971 -3419 -303 5247 -5054 -6607 -9415 -12313 -8032 3054 5611 7084 10687 3104
5243 3104 -2960 1831 3266 -179 906 7802 9830 -3291 -9899 -12267 -9168 -332 -4507 2069 2615
5228B615J831r076k122N83n268O471J4504J0646j2863q93j50m979k30r879J126
5213g684k70l518q64R956J523K780O735k783m167M998j54K104M11o57M001o061
5197F350j85k410k27j4040o689l012P048Q741l498M327R269L416k106q244L621
5182B361j89N7J805j64j2188n00K136n610J730P994K0541j741q116j6237p798
5167a5919N530j0119j0183K553R918J5106j273J844O072N355l630j703J0472R952
5153B3975r086j7832q786N965P226j1675N3l73j290Q133J567p355K253j624n508
5138a4357q66Q445K060O772j0869p157M264Q725o580j285R112J325o615j766j611
5123a0403J2695j075j0289p740K107R172L539L062P056J047k30l738N95j047P374
$$ plain form
5228 2615 4446 -4630 -6752 -6169 -11437 -4966 9538 20184 7321 6428 6278 1299 1069 -8810 -7684
5213 -7684 -7954 -11472 -12336 -2380 -857 1923 8658 5875 1708 6706 6552 8656 9067 8410 12411 6350
5197 6350 6165 3755 3528 -10512 -17201 -20213 -13165 -4424 -7922 -3595 5674 9090 6984 -1260 2361
5182 2361 2172 2229 4034 3870 -8318 -8818 -6682 -12292 -10562 -2568 17973 16232 8116 -8121 -15919
5167 -15919 -10389 -20508 -30691 -28138 -18220 -3114 -4387 -2543 3529 8884 5254 3551 14023 23975
5153 23975 14889 -2943 -11729 -5764 1462 -10213 -10160 -10533 -11823 -3690 -2123 -9478 -7225 -8849 -14357
5138 -14357 -15223 -6778 -4718 2054 -8815 -15972 -11708 -2983 -9563 -10848 -1736 -411 -7026 -8792 -10403
5123 -10403 2292 1217 -9072 -16812 -14705 -5533 -1994 1068 8124 9171 8941 5203 5798 4751 12125
5108A2125L299j2847M021J966M56k441o412J0787q382m225J4687o279j2586o333
5094a2164r142k616P402l696K429N579k563k994L615m702K931N74m546L536n633
5079b1990J2943J1629j022M873j1768Q803Q013P55q541j2249N767M74J2063Q740
5065A8490j5844k912m420R855Nj6685K75Q853P453L19j0401L286o391o408m411
5050a8936K193J037q690k766K195M119J5687N173l166K070l669l768J3918N078
5036A0475J3015j064j8274k715O300O468p954J0705K283p190M079j702m502m922
5022E002N495Q914n811k961r814p35k353m800j1937N840K520M289Q498J1038J256
5007A4441q159K512n985n593J067m291R793P605L732o184p115r399K293J4382
$$ plain form
5108 12125 15424 2577 6598 8564 9020 6579 167 10954 2572 -1653 13034 6755 -5831 -12164
5094 -12164 -21306 -23922 -16520 -20216 -17787 -12208 -14771 -17765 -14150 -18852 -15921 -15347 -19893 -16357 -21990
5079 -21990 -9047 2582 1560 6433 -5335 3468 11481 12236 3695 -8554 -2787 -2313 9750 18490
5065 18490 2646 -266 -4686 5169 5174 -11511 -11236 -2383 5070 5389 -5012 -1726 -8117 -14525 -18936
5050 -18936 -16743 -15706 -24396 -27162 -24967 -20848 -5161 12 -3154 -1084 -4753 -8521 5397 10475
5036 10475 23490 22426 4152 1437 7737 14205 6251 16956 19239 12049 16128 14426 9924 5002
5022 5002 10497 19411 13600 10639 825 90 -2263 -7063 -19000 -13160 -10640 -6351 2147 13185 14441
5007 14441 6282 8794 2809 -2784 -1717 -6008 3785 11390 15122 8938 1823 -7576 -5283 9099
4993I099q191l461J2560j891n948n705l742n036J0131M638m098k984r75N667J423
4978A487n360J095O861M786N800J280j882m157j0162N866J825o945k602p94m356
4963g258N283J0276Q17J320o808n641N929m18o579q674M090M755K414k348o53
4948c495j073J048n44j2395j4137k344O495J3951J3940J014k628M59N35N930L173
4933I929l682l701l685j0239k277P14Q619K745l661j5563m253J16Q67P66O661
4918a6644m683J1043R674L039O136m696j4177j4131j396j0683Q262J8394J0350
4905D88O058j937q248l636p84m560Q001o503o964l18r24L38J145N607Q920m399
4889g716m539R604J8110K68j4418k1305p076J5732N616K022r909r63K67o027Q36
$$ plain form
4993 9099 908 -2553 10007 8116 2168 -3537 -7279 -12315 -2184 2454 -1644 -4628 -5603 64 1487
4978 1487 -3873 -2778 4083 8869 14669 15949 14067 9910 -252 5614 7439 494 -2108 -2902 -7258
4963 -7258 -1975 8301 9118 10438 3630 -2011 3918 3500 -3079 -11753 -7663 -2908 -494 -2842 -3495
4948 -3495 -4568 -3520 -4064 -16459 -30596 -32940 -26445 -12494 1446 2460 -168 291 826 6756 9929
4933 9929 6247 2546 -1139 -11378 -13655 -12941 -4322 -1577 -5238 -20801 -25054 -24938 -24071 -23305 -16644
4918 -16644 -21327 -10284 -610 2429 8565 3869 -10308 -24439 -25835 -36518 -28256 -9862 488
4905 488 6546 4609 -3639 -7275 -8059 -12619 -4618 -11121 -18085 -18403 -19327 -18989 -17844 -12237 -3317 -7716
4889 -7716 -12255 -2651 15459 15727 1309 -19996 -27072 -11340 -5724 -3702 -13611 -14574 -14307 -20334 -19498
4874a9498P114J1364Q144p776L983q032P35P130n529j4432j3265Q55J0146M552
4860a4509O048R261J3387P833j0422K456P819l423q727j060k646r177j298M1J309
4845c108P258J6808N797j0388p634j0945j215R196M812j0390j6743M354M658J0537
4831B997m055j720L298k605N890P591o039j297O35o265K454K422l274o76N834
4816E190J0166J90j280n35J147j2997M442K023J147k510o642J572Q528N580J1536
4801B7557j459j3105r531k054L349l425R756l826j4389j322J989p10n828j3348
4787b6346n20j49J2860J4248Q746R633J865n522l797j4478R706J1426m383o204
4773G085j290k365J318P305j331j0888n574m941L309J3292m070q581r396o928
$$ plain form
4874 -19498 -12384 -1020 7124 -652 3331 -4701 -3966 3164 -2365 -16797 -30062 -29207 -19061 -14509
4860 -14509 -8461 800 14187 22020 11598 14054 21873 18450 9723 8663 6017 -3160 -4458 -4417 -3108
4845 -3108 4150 20958 26755 16367 8733 -2212 -3427 5769 10581 191 -16552 -12198 -7540 2997
4831 2997 -1058 -2778 520 -2085 3805 11396 5357 4060 4695 -1570 884 3306 32 -644 5190
4816 5190 15356 15546 14266 13731 14878 1881 6323 8346 9493 6983 341 1913 10441 16021 27557
4801 27557 26098 12993 3462 1408 4757 1332 11088 7262 -7127 -8449 -6460 -7170 -12998 -26346
4787 -26346 -26866 -27015 -14155 93 8839 18472 20337 14815 11018 -3460 6246 17672 13289 7085
4773 7085 5795 3430 4748 12053 10722 -166 -5740 -10681 -7372 5920 1850 -6731 -16127 -23055
4759b3055M610J5161O625l75J0403J969l473q576l997k342Q435L936J7497J0859
4745C7677j16n972j0966k1469j1281K448L035l352J1193L278p44q389k878J71
4731g365J950J628M458k036k677m987o421n697R04l535P998J1130J0309J04O72
4716F435p163l574N523j142j1506J0099R645n886k352l166M501p363P30R694r836
4701e361r649J102P99k578L459o095J0432O920J139l625N922J1461j1188k779
4687d1j915k950j841O253L006o241K038J2782O357q912j1895j995j0610J579Q126
4672f259O070J268j0747k042J5760O965J0284J594K52r267r057M141O554J1304
4658B6820j3351l010O734m720l152n092P082m638j5132J034O717n096n038J1986
$$ plain form
4759 -23055 -18445 -3284 3341 2966 13369 15338 11865 3289 -708 -3050 5385 9321 26818 37677
4745 37677 37561 31589 20623 -846 -12127 -9679 -6644 -9996 1197 4475 3731 -4658 -7536 -7365
4731 -7365 -5415 -3787 671 -1365 -4042 -9029 -15450 -21147 -20243 -23778 -15780 -4650 5659 5763 6435
4716 6435 -728 -4302 1221 79 -11427 -1328 8317 2431 79 -3087 1414 -5949 -5219 4475 -5361
4701 -5361 -15010 -13908 -13109 -15687 -12228 -18323 -7891 -971 168 -3457 2465 13926 2738 -41
4687 -41 -1956 -4906 -6747 -494 2512 -3729 -1691 11091 17448 8536 -3359 -5354 -15964 -14385 -6259
4672 -6259 -189 1079 -9668 -11710 4050 11015 21299 22893 23145 13878 4821 8962 15516 26820
4658 26820 13469 10459 17193 12473 9321 4229 11311 6673 -8459 -7425 -708 -5804 -10842 1144
4644A144N928J574P217j50m830j0097k589o547M023J5853K538n415j739K625j608
4629G927L859p400q056j122R43q328L303R142o230j83P531j0507o283K868O481
4614f055K6J82K25m649R636J5368J75j2707j3187j761M230p21n620M675k610r29
4598a3722N989q327J1041L653q047L703Q738l124L655M468K249o582j0840m436
4584a1582J626K781M474O6m021j312l30m640L547O753R574l712K607J2945J5482
4569C4258l497j1452n003k388j0557l98k450o007j0550R769M732Q68L317K791
4555C433J62K095k926N418O909j3893p226m388k712N211P107R889J440R84L854
4540A5357j5246r089K688K548k744J637l559L202N598J1j090m943n507q440N798
$$ plain form
4644 1144 7072 8646 15863 15713 10883 786 -1803 -8350 -4327 11526 14064 8649 6910 9535 7927
4629 7927 11786 4386 -3670 -4792 -3849 -12177 -8874 268 -5962 -6145 1386 -9121 -15404 -12536 -6055
4614 -6055 -6029 -5847 -5622 -10271 -635 14733 14908 2201 -10986 -12747 -8517 -9238 -14858 -10183 -12793 -13722
4598 -13722 -7733 -16060 -5019 -1366 -9413 -5710 3028 -96 3559 8027 10276 3694 -7146 -11582
4584 -11582 -9956 -7175 -2701 -2635 -6656 -7968 -8298 -12938 -9391 -2638 6936 3224 5831 18776 34258
4569 34258 30761 19309 14306 11918 1361 963 -1487 -7494 -18044 -8275 -3543 -2675 642 3433
4555 3433 3595 5690 2764 8182 15091 1198 -6028 -10416 -13128 -7917 -810 9079 10519 11503 15357
4540 15357 111 -8978 -6290 -3742 -6486 -4849 -8408 -5206 392 403 -687 -5630 -11137 -19577 -13779
4525a3779N706K534o020l102l386J0864K759M020L648O626j904l903n599K09o633
4510g960K714k203p968K472M780j2350n321J2092M895n880O526M034j681O386
4496E36N895M099j4246q561N012N833J747P780j070q746K607J934J140k46j011
4481B703k515r175N389M322l164K241j011o656J052J188K760L693j3266n254m154
4466b1847L970Q922K2225P694j6982j0744M191R185O850p893o700r369L831K149
4452d518j485K59o786k636m446J5217N426m217M091q776Q350j328l560R2l224
4437g541p229k374P743L921r86l362l515p436J152K211N00R542J3231k172m432
4422g47L528l79l69k249l386k66m543n792L196Q185o221j795m021J393J300J439
$$ plain form
4525 -13779 -8073 -5539 -11559 -14661 -18047 -7183 -4424 -404 3244 9870 7966 4063 -1536 -1327 -7960
4510 -7960 -5246 -7449 -15417 -12945 -8165 -20515 -25836 -13744 -8849 -14729 -8203 -4169 -5850 536
4496 536 6431 10530 -3716 -12277 -7265 -1432 315 8095 7025 -1721 886 2820 3960 3714 2703
4481 2703 188 -8987 -3598 724 -2440 -199 -1210 -7866 -6814 -5626 -2866 827 -12439 -17693 -21847
4466 -21847 -17877 -8955 13270 20964 3982 -6762 -2571 6614 13464 5571 -1129 -10498 -6667 -4518
4452 -4518 -6003 -5744 -12530 -15166 -19612 -4395 1031 -3186 905 -7871 479 -849 -4409 -4317 -7541
4437 -7541 -14770 -17144 -9401 -5480 -6466 -9828 -13343 -20779 -19627 -17416 -16916 -7374 5857 3685 -747
4422 -747 2781 2402 2033 -216 -3602 -3868 -8411 -14203 -11007 -2822 -9043 -10838 -14859 -13466 -12166 -10727
4406a0727O04m919R422K04m942N365K9l405J3843l68q821j0563K673J0327J4012
4391A2734k343j6823j459J2835K399j4367o884j462n476K451m127o556O495P713
4377a4870J3018L354Q528n791N211N37r224o264l140J3607J0766k616k61q98p958
4362C999n252O40J1173j42j6037m070K211k600R212L082J34o860j548Q178M907
4347G027l594m446Q211J28K093j982j862j6069j1331M299K550L315o43J64k12
4332a2352o73q816M515J6143J524N744R795p099j1336K092j00Q787M609q723j4544
4317a0434j5618q021R037L932J3575R426Q41m626K788J2764n62j2701Q97M117
4303E415M472m740o892L56J782l793o311Q137J1986j405R08j860j8059l50M165
$$ plain form
4406 -10727 -10123 -15042 -5620 -5416 -10358 -4993 -4964 -8369 5474 5106 -3715 -14278 -11605 -1278 12734
4391 12734 10391 -6432 -7891 4944 7343 -7024 -13908 -15370 -20846 -18395 -22522 -29078 -22583 -14870
4377 -14870 -1852 1502 10030 4239 9450 9987 763 -5501 -8641 4966 15732 13116 12855 11957 3999
4362 3999 -1253 -613 10560 10418 -5619 -9689 -7478 -10078 -866 2216 2350 -4510 -6058 2120 7027
4347 7027 3433 -1013 7198 7326 9419 7437 5575 -10494 -21825 -17526 -14976 -11661 -12304 -12140 -12352
4332 -12352 -13025 -21841 -17326 -1183 341 6085 15880 8781 -2555 -463 -563 8224 12833 4110 -10434
4317 -10434 -26052 -34073 -25036 -21104 -7529 1897 2738 -1888 900 13664 13102 401 1298 5415
4303 5415 9887 5147 -1745 -1389 393 -3400 -9711 -1574 10412 9007 9915 8055 -10004 -10354 -6189
4288f189Q829J317L81j0424l596n877L750O068n166j1874n968K810k32P663J300
4273a7208K439Q511N86M611J1478J327m263l079K0j1620l075J442R713M16L596
4258D894j7339l556k093o35q706J1301J6070n285j1137l180Q698N147q128M678
4244i271P748O082M074K077Q15k51m467n290k271j0984j2799R937P424n830J984
4229a1022K559j462J953o689O613J2537k535j0047K54J269k352j462L522p543
4215a4405k76J0690j123j1102J407M04J031q42j3095n503J6819J3491k69o64M440
4200A003n443j512J3018P009J601k021K567j0287k751k584R82m054n472j977P128
4185b793m598q869P28J0521n773J0789R027l766M191N691k809n75j3918L000O031
$$ plain form
4288 -6189 2640 3957 4338 -6086 -9682 -15559 -11809 -5741 -10907 -22781 -28749 -25939 -26171 -18508 -17208
4273 -17208 -14769 -6258 -5672 -1061 10417 11744 7481 4402 4422 -7198 -10273 -8831 882 1298 4894
4258 4894 -12445 -16001 -18094 -18729 -27435 -16134 -64 -5349 -16486 -19666 -10968 -5821 -13949 -9271
4244 -9271 -1523 4559 8633 10710 11525 11274 6807 1517 -754 -11738 -24537 -14600 -7176 -13006 -11022
4229 -11022 -8463 -9925 -7972 -14661 -8048 4489 1954 -8093 -7839 -6570 -8922 -10384 -6862 -14405
4215 -14405 -14681 -3991 -5114 -16216 -14809 -14405 -13374 -14216 -27311 -32814 -15995 -2504 -2773 -3437 1003
4200 1003 -4440 -5952 7066 14075 15676 13655 16222 5935 3184 600 1582 -2472 -7944 -9921 -2793
4185 -2793 -7391 -16260 -15532 -5011 -10784 5 9032 5266 9457 15148 12339 11764 -2154 846 6877
4170F877o690M318L83m335k916J450l899N346J4636j1636j5262r634L54k878O413
4155a7473J1304m926o851P186J5589r02k065k584j397M261J337j892K413k985
4141A015O338O301p834l725L619M658l8j3775r653J1704N196J3873n79O7P489
4126B4656j2877j4124j97O127M321O427k276m908l397n217j733J1374n581o087
4112c492J1025M292K092M428n226K95m171j620L111J246o381J99N897m519k020
4097E156j560j748l047m402M874l944r019l018M010N454N973O888O502L368m323
4082A1164O25K292j2905j4267L140J0638k432J0731L543q742m585q538l45P74
4068h907L232P318j6518M202p516p522M827J1204j957J170N838n606j59p483j802
$$ plain form
4170 6877 187 4505 4888 553 -2363 -913 -4812 534 15170 3534 -11728 -21362 -21008 -23886 -17473
4155 -17473 -6169 -11095 -17946 -10760 4829 3927 1862 -722 -2119 2142 3479 1587 4000 1015
4141 1015 7353 13654 5820 2095 5714 10372 10334 -3441 -13094 -1390 3806 17679 17100 17167 24656
4126 24656 11779 -2345 -2542 3585 7906 14333 12057 7149 3752 -1465 -3198 8176 2595 -3492
4112 -3492 7533 11825 13917 18345 13119 13414 9243 7623 10734 11980 5599 5798 11695 7176 5156
4097 5156 3596 1848 -1199 -5601 -727 -4671 -13690 -16708 -12698 -7244 -1271 5617 12119 15487 11164
4082 11164 11789 14081 1176 -13091 -9951 687 -1745 8986 12529 3787 -798 -9336 -9681 -8907
4068 -8907 -5675 1643 -14875 -10673 -18189 -25711 -20884 -9680 -11637 -10467 -4629 -10235 -10394 -17877 -19679
4053a9679O149J1629K3685R352j7311k0157J599O008p345j0113n159m227P369
4040a8200l979R55J2703J8355k55j6955n730j511K775M669M16o869o294k228l076
4025b5224O83K003Q842M164Q804O714K872k099l32m315n931j303m250J2975J1698
4010A5301q924j3040m813J591j408j664Q757N524M701J3371j4932j2603M910M162
3996I33o734k3O208J433o311J975J1176J904j0638r602j2258K563Q248O711j390
3981e805m448R459O978K51O858O024k0754m473J3335q191j145M562q63j030q907
3966h149N765Q655k809j3732q162k29M104j228M703J1597O503J2506j011r961
3952H552j0567j2551l141l937J352K883R482R735N89M012J1712J170l788j5132
$$ plain form
4053 -19679 -13530 -1901 21784 31136 13825 -6332 -4733 1275 -6070 -16183 -21342 -25569 -18200
4040 -18200 -22179 -21224 -8521 9834 9579 -7376 -13106 -14617 -11842 -7173 -6757 -13626 -19920 -22148 -25224
4025 -25224 -24541 -22538 -13696 -9532 -728 5986 8858 6759 6427 2112 -3819 -5122 -9372 3603 15301
4010 15301 6377 -6663 -11476 -9885 -11293 -12957 -4200 1324 6025 19396 4464 -8139 -3229 933
3996 933 -5801 -5824 384 1817 -4494 -2519 8657 10561 -77 -9679 -21937 -19374 -11126 -4415 -5805
3981 -5805 -10253 -794 6184 6435 13293 19317 -1437 -5910 7425 -766 -1911 2651 1788 758 -8149
3966 -8149 -2384 6271 3462 -10270 -18432 -18661 -14557 -15785 -11082 515 7018 19524 18513 8552
3952 8552 -2015 -14566 -17707 -21644 -20292 -17409 -7927 1808 2397 6409 18121 19291 15503 371
3938C71O87J0839m28p183l249o198j174R54j401o982j241L90K401L427J0475l65
3922A323K615n004M201J1222r565j3953J5909J6712j0437j2672q440K287k764
3909h566P887N641j1010j3592J00L383O277O578m869L151J0711p839L084J0390
3895A1326l570R094m905j8814J846J5779J2161j901o359m120J4241n589j3870
3882E319P95Q313j2970l633j1107j1322K768J3656M557o261K745R676p025o036
3868a0525L844l91q955O482J4911k831l436J728p873m023P576J972M991R431l076
3853I825Q060n436j7334p663K282k774O172Q575K522n333R03o026M507J1879l441
3838F718l900M834o243o031j697l280n253J3212L741j136m093Q89j0848K756M012
$$ plain form
3938 371 1058 11897 11469 4286 1037 -5161 -6335 -5381 -6782 -13764 -15005 -14615 -12214 -8787 1688 1323
3922 1323 3938 -1066 3135 14357 4792 -9161 6748 23460 13023 351 -8089 -5802 -8566
3909 -8566 -679 4962 -6048 -19640 -19540 -16157 -9880 -3302 -8171 -5020 5691 -2148 936 11326
3895 11326 7756 16850 11945 -6869 -5023 10756 22917 21016 14657 10537 24778 19189 5319
3882 5319 6114 14427 1457 -2176 -13283 -24605 -21837 -8181 -3624 -9885 -7140 2536 -4489 -10525
3868 -10525 -6681 -7072 -16027 -9545 5366 2535 -901 827 -7046 -11069 -3493 -1521 3470 12901 9825
3853 9825 17885 12449 -4885 -12548 -10266 -13040 -6868 1707 4229 -1104 -201 -6227 -1720 10159 6718
3838 6718 2818 7652 1409 -4622 -6319 -9599 -14852 -1640 2101 965 -3128 -2239 -13087 -10331 -6319
3823f319n761p270q861j0412M41O856J1863R474J3958L563k803O428k26k809m110
3808D012q890m897J0788l65k829k405R68Q658n681m636K297R193l158n011L717
3793A761M985Q811r69p882j7457R049J2836J243q549l922N94k012L877M427O969
3778A3761j303p856j1142m569O303n00Q329j966K898R024m671r822n659J241n732
3763a1664p178L408J3043Q92l134l893n088j1668L820P801M398j08K345O24j973
3748h375O377l058o967j168m98N599k155j33K562l632Q37K682J372p2L410L581
3732C62j3967o123Q868r17K312M697P301m54M897j1433o090l286R270P798m400
3717a165n510p663j5036J7733K0966K2330p916o751k255n476N30l438q500k429
$$ plain form
3823 -6319 -12080 -19350 -28211 -38623 -38182 -31326 -19463 -9989 3969 7532 4729 11157 10931 8122 4012
3808 4012 -4878 -9775 1013 648 -2181 -4586 -3618 5040 -641 -5277 -2980 6213 3055 -1956 1761
3793 1761 6746 15557 14588 6706 -10751 -1702 11134 12377 3828 -94 500 -1512 2365 6792 13761
3778 13761 12458 4602 -6540 -11109 -4806 -5306 3023 1057 3955 12979 8308 -1514 -7173 -5932 -11664
3763 -11664 -18842 -15434 -2391 -1499 -4633 -8526 -13614 -25282 -21462 -13661 -9263 -9371 -7026 -6402 -8375
3748 -8375 -1998 -5056 -12023 -13191 -13689 -8090 -10245 -10378 -7816 -11448 -10611 -7929 -6557 -6629 -3219 362
3732 362 -13605 -19728 -10860 -11777 -9465 -4768 2533 2079 6976 -4457 -10547 -13833 -4563 3235 -1165
3717 -1165 -6675 -14338 -29374 -11641 9325 31655 23739 16988 14733 9257 9787 6349 -2151 -4580
3703d580r63N403N851m537j6918k647R687R578K456J829j667J2130P92n7j477
3688A4880r513m732R196M357j782o154p641P547N309q16J4477O023o252j7787
3674G112q702J1679k974k277N735Q43J074j6760n977N557j313j2159O395O887
3660d880Q373n445r606N294O261K062l593l594O167k103r941o925Q36O398J2201
3645A505m517l478q001l958n190J3152M054K386Q461O635L2O95O302r818k373
3630E887J597p721j705m633n438K457j2291l276L339L540P356Q738M01o953K543
3615f159J7868l206j1743M572m854q921L473J5106o401k288O522o91P518N984
3601A6780K79o540l086K957lj833L569q321l93j375P788J2312k782j0183j2311
$$ plain form
3703 -4580 -5543 -140 5711 1174 -15744 -18391 -8704 874 3330 5159 3492 15622 16414 16357 14880
3688 14880 5367 635 9831 14188 12406 6252 -1389 6158 11467 10651 25128 31151 24899 7112
3674 7112 -1590 10089 7115 4838 10573 11416 12490 -4270 -10247 -4690 -6003 -18162 -11767 -4880
3660 -4880 3493 -1952 -11558 -6264 -3 2059 -1534 -5128 1039 -1064 -11005 -17930 -17094 -10696 1505
3645 1505 -3012 -6490 -14491 -18449 -23639 -10487 -6433 -4047 4414 11049 11081 11776 18078 8260 5887
3630 5887 7484 -237 -1942 -6575 -12013 -9556 -21847 -25123 -21784 -18244 -10888 -2150 -1749 -8702 -6159
3615 -6159 11709 8503 -3240 1332 -3522 -12443 -8970 6136 -265 -2553 3969 3278 10796 16780
3601 16780 17059 10519 7433 10390 10387 8554 12123 3802 3409 2034 9822 22134 19352 9169 -3142
3586c142k885K542j313L32o3J3959K209q536j086M372J0589K395K102Q050n174
3571B4351k5455k041K627J4527M004R290j777j4526q626m115L810l591k806J904
3557b424k741j0164l482N946J1303K514p911m273k052p804M380k241j4872l47
3543c4168J5735J7934J1266J638j1517j2909N67R824R423L048j589j5259j8335
3530b4342j901R519J552P256n738n402M916N448P438n914m939O26L913K419m459
3515i608m00k513Q647N791J2339R225j1487q970l488N51J0281L978j5013m701
3501e368n964q42O028j029L964J5681K366q711j2197p411l695J1869J505k027
3487e831j820K774P353J004M167M827K203M738m06r702l981j732o116M912J563
$$ plain form
3586 -3142 -6027 -3485 -4798 -4466 -4529 9430 11639 3103 2017 6389 16978 19373 21475 29525 24351
3571 24351 -1104 -3145 -518 14009 18013 27303 25526 11000 2374 -1741 2069 -1522 -4328 -2424
3557 -2424 -5165 -15329 -18811 -12865 -1562 952 -6959 -11232 -13284 -21088 -16708 -18949 -33821 -34168
3543 -34168 -18433 -499 10767 12405 888 -12021 -11454 -1630 7793 10841 9252 -6007 -24342
3530 -24342 -26243 -16724 -15172 -7916 -13654 -19056 -14140 -8692 -1254 -7168 -12107 -11481 -7568 -5149 -9608
3515 -9608 -10008 -12521 -3874 1917 14256 23481 11994 3024 -464 87 10368 14346 -667 -5368
3501 -5368 -11332 -12174 -6146 -7175 -3211 12470 14836 6125 -6072 -13483 -17178 -5309 -3804 -5831
3487 -5831 -7651 -4877 2476 3480 7647 12474 14677 19415 19009 9307 5326 3594 -2522 2390 3953
3472C953k993m342k401N582j10L627K198j0519O26O565Q05j096J280m818n886
3457g529r659J0117J0906p577n477r36L745M722l381L833n360j4337O232K150
3443a2551K91J0174n382M921j0918l968J0955R618K731j6913Q19K145j0284m045
3429b2407k618o583o817J9783K7193o972j4148k558N85P391L245n031n295M566
3415i666n680k249N007J0444P952n073m765L430K947m885o581O8L115P030K797
3400C891N346R074j6720n177Q194Q201l750j136k272q275j5586J692P066p13N6
3385a0109O647n45O800l462n179j813j635J1312J400o412j345N717o04q265P495
3370BN093j205j1153N80q621Q21J8714L928o804n69M67o611J3770J0679o53n407
$$ plain form
3472 3953 960 -3382 -5783 -201 -311 3316 5514 -5005 -4379 2186 2991 1895 3175 -1643 -7529
3457 -7529 -17188 -7071 3835 -3742 -9219 -10155 -6410 -1688 -5069 -1236 -6596 -20933 -14701 -12551
3443 -12551 -12260 -2086 -7468 -2547 -13465 -17433 -6478 3140 5871 -11042 -10223 -8078 -18362 -22407
3429 -22407 -25025 -31608 -38425 -18642 8551 1579 -12569 -15127 -14542 -7151 -3906 -8937 -14232 -9666
3415 -9666 -15346 -17595 -12588 -2144 5808 735 -4030 -600 2347 -2538 -9119 -9051 -5936 1094 3891
3400 3891 9237 18311 1591 -3586 4608 12809 9059 7923 5651 -2624 -18210 -16518 -9452 -10165 -10109
3385 -10109 -3462 -4007 2793 -669 -5848 -7661 -9296 2016 3416 -2996 -4341 1376 772 -7493 2
3370 2 5095 3890 -7263 -6683 -15304 -14483 4231 8159 1355 786 1253 -5358 8412 19091 18438 13031
3354A3031R378l726q491j250J065k149r130O993Q52Q1r840q554J2219p482n334
3339a2337N190J0584P174J232n43n976j7857k732N782m167J3593J2570r75j3493
3325a955o999j482L371J416k304l126n31n661N407K969m418n606O867J4466J589
3310D003J344J442r095O02N39k432M712L834N40j246M973r5j0751j2963o420K769
3294a8244J7378j369M20O380K695n614J214n290n349J660L547N884N989m745j315
3279C241N327n178o837J29j426N841o557N440K5002L047r972j7204j6965N778
3265a0334j511O16R328J9183n770o996q778L189P572J036J529M67k434R316P986
3250B4399j3563j177K398P723l729l002L872N05j712j7150j9028J0682J6124k826
$$ plain form
3354 13031 22409 18683 10192 8942 10007 7858 -1272 5721 6573 6654 -3186 -11740 479 -7003 -12337
3339 -12337 -7147 3437 10611 11843 11300 5324 -12533 -15265 -9483 -13650 -57 12513 11538 -1955
3325 -1955 -8954 -10436 -7065 -5649 -7953 -11079 -11610 -17271 -11864 -8895 -13313 -18919 -12052 2414 4003
3310 4003 5347 6789 -2306 -1704 -1165 -3597 1115 4949 5489 4243 9216 9121 -1630 -14593 -21013 -18244
3294 -18244 -866 -2235 -1815 4565 7260 1646 2860 -2430 -7779 -6119 -2572 3312 9301 4556 3241
3279 3241 8568 3390 -3447 -3318 -4744 1097 -5460 -20 24982 28029 18057 853 -16112 -10334
3265 -10334 -11845 -11229 -1901 17282 11512 4516 -4262 -1073 6499 7535 9064 9531 7097 16413 24399
3250 24399 10836 9659 12057 19780 16051 13049 16921 17426 15714 -1436 -20464 -9782 6342 3516
3236C516n927O658j582m497j2908m488N608P462o233m078K081J4712j452p318
3222h446M94N94J2352L812K272q144l856J874L634m122m432m095j0210J1J4439
3207c823L189M246l036k2478o91L748J1532m348o215M96J2861J920J384l716J644
3192c287O078P218O806j3169j4814l937j4790o389J4877J9172J787j2236L620
3179i064O355j255m711n69m330m57M263N517n635K868M936k637k044l742L91o576
3163a6690n985Q571N109J1440o592K77Q137k347k054l360R240J8955q920o436
3149I345n194q352j4515M72j807r93R664p49J526J1059k58R453N472l316j0355
3134A452J158r618N643p9K416j58j606m596o765J1407K487q933l570N487R367
$$ plain form
3236 3516 -2411 4247 2665 -1832 -14740 -19228 -13620 -6158 -12391 -16469 -14388 324 -1128 -8446
3222 -8446 -7952 -7358 4994 8806 11078 2934 -922 952 4586 464 -3968 -8063 -18273 -18262 -3823
3207 -3823 -634 3612 576 -21902 -22593 -18845 -7313 -11661 -17876 -17380 -4519 -2599 -1215 -4931 -3287
3192 -3287 2791 10009 16815 3646 -11168 -15105 -29895 -36284 -21407 -2235 -448 -12684 -9064
3179 -9064 -2709 -3964 -8675 -9244 -13574 -14031 -9768 -4251 -9886 -7018 -2082 -4719 -6763 -10505 -10114 -16690
3163 -16690 -22675 -14104 -8995 2445 -4147 -3870 4267 1920 -134 -3494 5746 24701 15781 9345
3149 9345 4151 -4201 -18716 -18244 -20051 -21044 -11380 -12129 -10603 456 198 9651 15123 11807 1452
3134 1452 2610 -7008 -1365 -1444 972 814 -792 -5388 -12153 -746 1741 -7192 -10762 -5275 4092
3119D092m696n959q170m266J3918m201k692R773p071p157N028J4712K686k35q669
3104b907L145J3977M670j4544p64o629j8795P835J0716l271P161N870k923p521
3090c980M306N281l205Q188K171K671L426q994m054l386n444o544J176M554L956
3075A22K64L533l34m990m868o526L274L181J706k121J3594q499L206M85n922L850
3059d5j1171j3140k216K134J3351l196p68j746n173M634O379J374m176L117P25
3044i917P235J6171J1004O584n721j9016j678J7148p401J636L165L592l247j1420
3030H135M57M561J820j0122j1082Q30n763Q04K060l87J205M553P462j2884n450
3015a3801r14M50m864k904P782O139p335m778p60M244J0169J1290L753L560l380
$$ plain form
3119 4092 -604 -6563 -14733 -18999 -5081 -9282 -11974 -2201 -9272 -16429 -11401 3311 5997 5762 -2907
3104 -2907 238 14215 18885 4341 3577 -3052 -21847 -14012 -3296 -6567 594 6464 3541 -3980
3090 -3980 326 5607 2402 10590 12761 15432 18858 9864 5810 2424 -3020 -9564 -8388 -3834 122
3075 122 386 3919 3585 -1405 -6273 -12799 -9525 -6344 -4638 -6759 6835 -1664 1542 2027 -3895 -45
3059 -45 -11216 -24356 -26572 -24438 -11087 -14283 -15051 -16797 -21970 -17336 -10957 -9583 -13759 -10642 -9917
3044 -9917 -2682 13489 24493 31077 25356 6340 4662 21810 14409 16045 19210 22802 19555 8135
3030 8135 8592 13153 14973 4851 -6231 -5401 -11164 -10360 -8300 -8687 -7482 -2929 4533 -8351 -13801
3015 -13801 -14715 -14265 -19129 -22033 -14251 -8112 -15447 -20225 -20985 -16741 -6572 4718 8471 12031 8651
3000H651k623o9l243L222q933r136J362P45R267l333m488J0133R735m677p233
2985f20q473m205J593n60L115P91L377m305o51L673N45j972o784J0061K886l444
2969d973k198K843Q63l469N165M693J394j833l282j1203O472j569q687L41K474
2954a2969R464R235o2O673k232j587l763k881j437O502J801O04K797o112o361
2939c28k383J518Q718L291k758m312n944q584J0882N326o113m262j0732R04J0211
2924d566J600p648j6425M043J3432O104l667j2506O379J1028J489j329L303N75
2910A812j896q169M894n23L934q134q312j0657m148R524J2422J0319M767r59n555
2895f81m76o394L696l51K223N824K902o459j0756o726P555K264J0378K598j1583
$$ plain form
3000 8651 6028 5959 2716 5938 -2995 -12131 -10769 -10024 -757 -4090 -8578 1555 11290 6613 -620
2985 -620 -9093 -13298 -11705 -12265 -9150 -8359 -4982 -9287 -9938 -6265 -5720 -7692 -14476 -4415 -1529 -4973
2969 -4973 -7171 -4328 -3465 -6934 -1769 2924 4318 2485 -797 -12000 -5528 -7097 -15784 -15443 -12969
2954 -12969 -3505 5730 5668 12341 10109 8522 4759 1878 441 6943 8744 9348 12145 6033 -328
2939 -328 -2711 -1193 7525 10816 8058 3746 -2198 -10782 100 5426 -687 -4949 -15681 -14777 -4566
2924 -4566 -2966 -10614 -27039 -22996 -9564 -3460 -7127 -19633 -13254 -2226 -737 -2066 1237 1812
2910 1812 -84 -8253 -3359 -3882 52 -8082 -16394 -27051 -31199 -21675 -9253 1066 5833 4874 -681
2895 -681 -1157 -7551 -3855 -4206 -1983 3841 6743 284 -10472 -17198 -9643 -7379 2999 5597 -5986
2880e986q061n252K148O225o86J3238N872j23n834k510k166l833M7J601J0427
2865E107o438J484P115r694q274o964J016J1288J0193J519k787o303J973M5j8431
2850a9151r305J3263Q078N357L567M041M676j818J357n011m320j804j1694K180
2836a0584r078o741M936N605O273K119m648l274J3943o114l232K302L981l632
2822h144m938j544Q557J1187k048l116n469J945O273l419l414N411k854K956j093
2807B90o130l661J2480L289j251m674j116J420r344K07K478R068O604P11l804
2792F567J34k154J494m434j0248j6119o864l178J396J4994O422R603M707N387
2778G707N856J0683m834j9804q565r38l914M132K464q803O030J0206j036K132
$$ plain form
2880 -5986 -14047 -19299 -17151 -10926 -11612 1626 7498 7375 1541 -969 -3135 -6968 -6921 -5320 5107
2865 5107 -1331 153 7268 -2426 -10700 -17664 -16648 -5360 4833 6352 3565 -2738 -765 -720 -19151
2850 -19151 -28456 -15193 -7115 -1758 1809 5850 10526 8708 10065 5054 734 -1070 -12764 -10584
2836 -10584 -19662 -26403 -21467 -15862 -9589 -7470 -12118 -15392 -1449 -7563 -10795 -8493 -4512 -8144
2822 -8144 -13082 -14626 -6069 5118 3070 -46 -5515 -3570 2703 -716 -4130 1281 -1573 1383 290
2807 290 -5840 -9501 2979 6268 5017 343 -773 647 -8697 -8490 -6012 3056 9660 10371 6567
2792 6567 6701 4547 6041 1607 -8641 -24760 -31624 -34802 -33406 -18412 -11990 -2387 2320 7707
2778 7707 13563 24246 19412 -392 -8957 -9895 -13809 -9677 -7213 -16016 -9986 220 -816 1316
2764A316n969o68M783L966o683L901R898j2472K590L17Q515J002l902m532r936
2749g874M80O519j1358P401P066M041n827N459K851N384j4636j1924k095j344
2735a5857J1877m190j2069j52K649J5246J528p97M422l948M269j156j1752p985
2721a7915R551l437J5998R392j3973J638o387j0810M779N130n789P160k897O907
2707f53J1845k05l464o321o010l682N760K296l545m276M8L484J443J824j0536
2692a1992k168L83Q282P73L052J6240p727k0456j015j096R009O507P078Q365j779
2677A3456j1372l506l951L330J693K518K460L680L731l735p358l683l313j0322
2663a6372n336J507n545o870R126L719K585P878k567N153m941l697M251Q274L424
$$ plain form
2764 1316 -4653 -5321 -538 3428 -3255 646 10544 -1928 662 979 9494 10496 6594 2062 -7874
2749 -7874 -7394 -875 -12233 -4832 2234 6275 448 5907 8758 14142 -494 -12418 -14513 -15857
2735 -15857 -3980 -8170 -20239 -20391 -17742 -2496 -968 -1765 2657 -1291 2978 1822 -9930 -17915
2721 -17915 -8364 -11801 4197 13589 -384 1254 -5133 -15943 -11164 -6034 -11823 -4663 -7560 -653
2707 -653 11192 10987 7523 1202 -4808 -8490 -2730 -434 -3979 -8255 -8207 -4723 -3280 -1456 -11992
2692 -11992 -14160 -13777 -5495 -4722 -1670 14570 6843 -13613 -14628 -15724 -6715 -208 6870 15235 13456
2677 13456 2084 -1422 -5373 -2043 -350 2168 4628 8308 12039 8304 946 -2737 -6050 -16372
2663 -16372 -21708 -20201 -25746 -32616 -23490 -19771 -17186 -9308 -11875 -6722 -11663 -15360 -11109 -2835 589
2648E89J2911k508j2631n133L372O21p98k844J145P941J0017K614p707r701r959
2633a2071Q454Q71j3115k837M322J450J094O42k607M921O842J2941p978p722O187
2618A394M589n517r808M663J528n472K747O866N399p209j1709P247P488R12M796
2603G914k209P037j067m942m606M012q476n885L108N496J0384J3749N168q157
2589B1526p399m831j634q565j651K664P586o254j6803r592m042P232j323J611
2575b1475R453P791R830L417P377o049p955j080p237M516J4829n344p270j0387
2561i584o532Q579L272J723N726M604j2760o811J2741L891j9158n287J1561M248
2547c787R96N579O618N342j0404n137Q781p318j2897MJ1098j874P460j87p935
$$ plain form
2648 589 13500 10992 -1639 -6772 -3400 -2779 -3577 -6421 -5276 2665 12682 15296 7589 -2112 -12071
2633 -12071 -3617 -2746 -15861 -18698 -14376 -12926 -11832 -11190 -13797 -8876 -2034 10907 2929 -4793 1394
2618 1394 5983 466 -9342 -4679 -3151 -8623 -5876 990 6389 -820 -12529 -5282 2206 3118 7914
2603 7914 5705 12742 11675 6733 2127 6139 -2337 -8222 -5114 382 10766 24515 29683 21526
2589 21526 14127 9296 7662 -903 -2554 110 7696 1442 -15361 -24953 -28995 -21763 -23086 -21475
2575 -21475 -12022 -4231 5599 9016 16393 10344 2389 1309 -5928 -1412 13417 8073 803 -9584
2561 -9584 -16116 -7537 -4265 -2542 3184 7788 -4972 -11783 958 4849 -14309 -19596 -8035 -3787
2547 -3787 -2791 2788 9406 14748 4344 -793 7988 670 -12227 -12223 -1125 -2999 4461 4274 -3661
2532c661j2455o922m042K205K807N428J0959L119J7125n613j7706m09P570l50
2518a945o646o388J843R036j035M726K925k209N02n813J317j673P016N257R289
2503A6202j152j604o144j1523j0096l403M221J1200K291m056K350m714k405k231
2489a1064k517O226k108J247j135o018M087N149L480k344L676M548k815p864p17
2474h169R28J2865j645j5836m322p694M930J5919J1749m285k488o298K81m113
2460h178q339j2762R91J1998O282Q323o905j491j256N178l047Q849p74k786n557
2445i474P881Q35k877m568j3854m545J3628J1346J681r095%P329N003R430l473
2430I247p163N737n405l23L679l128K716L889l775k458l72M883M09r329j2774
$$ plain form
2532 -3661 -16116 -23038 -27080 -24875 -22068 -16640 -5681 -2562 14563 8950 -8756 -9165 -1595 -1945
2518 -1945 -8591 -14979 -13136 -4100 -5135 -409 2516 307 809 -5004 -3687 -5360 1656 6913 16202
2503 16202 15050 13446 7302 -4221 -14317 -17720 -13499 -2299 -8 -4064 -1714 -6428 -8833 -11064
2489 -11064 -13581 -7355 -9463 -8216 -9351 -15369 -11282 -6133 -2653 -4997 -1321 3227 412 -7452 -8169
2474 -8169 -7241 5624 3979 -11857 -16179 -23873 -18943 -3024 8725 4440 1952 -4346 -4065 -8178
2460 -8178 -16517 -29279 -28288 -16290 -10008 -1685 -8590 -10081 -11337 -6159 -9206 -357 -1131 -3917 -9474
2445 -9474 -1593 -758 -3635 -8203 -22057 -26602 -12974 -1628 53 -9042 -9042 -1713 3290 12720 9247
2430 9247 2084 7821 2416 2093 5772 2644 5360 9249 5474 3016 2644 7527 7936 -1393 -14167
2415a4167Q34J0715j984K304n058M336r341L822Q765K53J3449J908j654j724r372
2400C086n094J230j2582q470N509K851j423N842K167l751M138r630J338L065O398
2385e326L210N260M06P366r094L40j853n651m818J0867L755m364j105Q240k843
2370D390q328m155j1231J1170K0109j1231k073l282j0448L392K335L844K009l724
2356g223m749Q669l01q845p92N412R213J577K399P650J442k924m910j1201J213
2341c370J455n471R244P959n685j345J517M527j413n928j318m077m201J3839J127
2326F860l991k756k869M132L811J2456q777q042K824R440q573n693N982j2713
2312g909J724J963P481k941q5k732Q834M170k792j4102O359P049m435N363M362
$$ plain form
2415 -14167 -13333 -2618 -4602 -2298 -7356 -3020 -12361 -8539 226 479 13928 15836 14182 12458 3086
2400 3086 -2008 -778 -13360 -21830 -16321 -13470 -14893 -9051 -6884 -10635 -6497 -16127 -14789 -11724 -5326
2385 -5326 -2116 3144 3550 10916 1822 2162 309 -5342 -10160 707 4462 98 -1007 7233 4390
2370 4390 -3938 -8093 -19324 -8154 11955 724 -1349 -4631 -15079 -11687 -9352 -5508 -3499 -7223
2356 -7223 -11972 -3303 -3604 -12449 -13241 -7829 1384 2961 5360 13010 14452 11528 6618 -4583 -3370
2341 -3370 -1915 -7386 1858 9817 4132 2787 4304 8831 7418 1490 172 -3905 -8106 5733 6860
2326 6860 2869 113 -2756 1376 5187 17643 8866 824 3648 13088 4515 -1178 4804 -7909
2312 -7909 -6185 -4222 3259 318 233 -2499 6335 10505 7713 -6389 -30 7019 2584 7947 12309
2297A2309r364n020l786j3278l197K4878J2110j2023J164J0019N782L27J001j9539
2283A383j572O298n640O274n108l461k801m434p189J2415K154j583J50o239k69
2268i622K519Q575n391O140J1102n206q968j0863j3042l35O658O565j423k656
2254a5947N798j1544l944N845Q592R745j5927l556M918l253p24R315R474k999
2240d207R53L905J1589j967q771l442n899n360P632K732j0329o636k527J311N056
2225a5960Q374J1875k175q202j0498P160k596l047J189m727J266p722j479O822
2211a9720J9916j508L883l632O985O65n112j228K310N596o149o455r547p255j735
2196b2986Q291R785J316n38K284N171O398J325j0727j478O175q827j4109j3993
$$ plain form
2297 12309 2945 -2075 -5861 -19139 -22336 2542 14652 2629 3793 13812 19594 19921 20922 1383
2283 1383 -189 6109 469 6743 1635 -1826 -4627 -9061 -16250 -3835 -1681 -3264 -3114 -9353 -9622
2268 -9622 -7103 1472 -3919 2221 13323 8117 -851 -11714 -24756 -25091 -18433 -11868 -13291 -15947
2254 -15947 -10149 -21693 -25637 -19792 -11200 -1455 -17382 -20938 -16020 -19273 -19997 -10682 -1208 -4207
2240 -4207 -3254 651 12240 10273 1502 -1940 -7839 -13199 -5567 -2835 -13164 -19800 -22327 -21016 -15960
2225 -15960 -7586 4289 2114 -6088 -16586 -9426 -12022 -15069 -13880 -18607 -17341 -25063 -26542 -19720
2211 -19720 196 -1312 2571 -1061 5924 6589 1477 249 2559 8155 2006 -4449 -13996 -21251 -22986
2196 -22986 -14695 -4910 -3594 -4132 -1848 3323 9721 11046 319 -1159 5016 -3811 -17920 -31913
2182c1913j0916Q881J7440J2387O618m559o602P603K078k00P193J719L786p226
2168F289L554m062k802J685j0473L409j683n970J937K565q558J1836J7408N733
2154B0868N200L546O20k815j3878j9771m982j4246J913P694J3862J2503J000j336
2140A0178k778j0104q867K041K907K195n207J822O305M661M675O49m232j1274
2126g029q780P111J3055j458Q98P311j0668P01O408M268o867j2161r73j400l359
2111a2943l092J2060N677p048O010m040j0953O20L624J0193l735K643j1648k989
2097a5621L471k690K874J620J3699Q701r8l183k726n49j067J0845k739p322j4312
2082i097k527R63L324n192J852M699k865n261R292M427L710L872K862j216K44
$$ plain form
2182 -31913 -42829 -33948 -16508 -4121 2497 -2062 -8664 -1061 1017 817 8010 9729 13515 6289
2168 6289 9843 5781 2979 4664 -5809 -2400 -4083 -10053 -8116 -5551 -14109 -2273 15135 20868
2154 20868 26068 29614 30234 27419 13541 -6230 -11212 -25458 -23545 -15851 -1989 10514 11514 10178
2140 10178 7400 -2704 -11571 -9530 -6623 -4428 -9635 -7813 -1508 3153 7828 8477 4245 -7029
2126 -7029 -15809 -8698 4357 2899 3797 11108 440 1141 7549 11817 4950 -7211 -8184 -9584 -12943
2111 -12943 -16035 -3975 1702 -5346 664 -3376 -14329 -13709 -10085 108 -3627 -984 -12632 -15621
2097 -15621 -12150 -14840 -11966 -10346 3353 12054 11956 8773 6047 5498 4431 15276 12537 5215 -9097
2082 -9097 -11624 -10661 -7337 -12529 -10677 -5978 -8843 -14104 -4812 -385 3325 7197 10059 8843 9087
2067I087j0681m666j3382l575O98R278K090k271L610N640J2486o241m244J490
2053f81o497r107j4839l215J0083R668j964J821O110N854l444k982N630j3438
2039a7001j1876K178J8678J302l903q108L616J7351P372o372p436l295Q791J0278
2025A1575k602q296P471k318L292r631p895J2783J978O742J0584m048j2004m345
2011C286k679o572l603J727m84O556R38j3721M491J0493n087o02O039J444M361
$$ plain form
2067 9087 -1594 -6260 -19642 -23217 -22519 -13241 -11151 -13422 -9812 -4172 8314 2073 -2171 -681
2053 -681 -7178 -16285 -31124 -34339 -24256 -14588 -16552 -14731 -8621 -2767 -6211 -9193 -3563 -17001
2039 -17001 -28877 -26699 -8021 -6719 -10622 -18730 -15114 2237 9609 3237 -4199 -7494 1297 11575
2025 11575 8973 677 8148 5830 9122 -509 -8404 4379 6357 13099 23683 19635 7631 3286
2011 3286 607 -5965 -9568 -7841 -8325 -1769 -831 -14552 -10061 432 -4655 -5257 782 2226 6587
$$ [...]
##END NTUPLES=NMR SPECTRUM
##END=
