##TITLE=Analysis number 312222
Compound Code cc 41601
Book Reference 433/127/1
Project Code adrs
Chemist Name victoriam
##JCAMPDX= 6.0         $$ Bruker NMR JCAMP-DX V2.0
##DATA TYPE= NMR SPECTRUM
##DATA CLASS= NTUPLES
##ORIGIN= Bruker BioSpin GmbH
##OWNER= NMR
$$ XWIN-NMR		Version 3.5
$$ Thu Jul 28 15:40:25 2005 GMT Daylight Time (UT+1h)  MAYBRIDGE\NMR@NMR_250MHZ
##.OBSERVE FREQUENCY= 250.131544655141
##.OBSERVE NUCLEUS= ^1H
##.ACQUISITION MODE= SIMULTANEOUS (DQD)
##.ACQUISITION SCHEME= undefined
##.AVERAGES= 16
##.DIGITISER RES= 18
##SPECTROMETER/DATA SYSTEM= dpx250
##.PULSE SEQUENCE= zg30
##.SOLVENT NAME= DMSO
##.SHIFT REFERENCE= (INTERNAL, DMSO, 0, 16.522)
##AUDIT TRAIL= $$ (NUMBER, WHEN, WHO, WHERE, WHAT)
$$ ##TITLE= Audit trail, XWIN-NMR		Version 3.5
$$ ##JCAMPDX= 5.01
$$ ##ORIGIN= Bruker BioSpin GmbH
$$ ##OWNER= NMR
$$ C:\u/data/dgb/nmr/ADRS/6800/pdata/1/auditp.txt
$$ ##AUDIT TRAIL=  $$ (NUMBER, WHEN, WHO, WHERE, WHAT)
(   1,<2005-07-28 15:39:48.84 +100>,<MAYBRIDGE\NMR>,<NMR_250MHZ>,
      <created by zg, POWCHK disabled, PULCHK disabled
       configuration hash MD5:
       62 19 C7 07 E1 42 D1 B7 37 6C 3D D0 77 39 F9 E6
       data hash MD5: 64K
       B0 AD 5F 8F 5A 2E 67 7A D0 A6 EB 1E 85 0B B9 94>)
(   2,<2005-07-28 15:40:05.76 +100>,<MAYBRIDGE\NMR>,<NMR_250MHZ>,
      <Start of raw data processing
       ef LB = 0.3 FT_mod = 6 PKNL = 1 SI = 32K 
       data hash MD5: 32K
       07 1E DB E6 0E FD 55 35 18 BE 86 1F C4 7D 85 66>)
(   3,<2005-07-28 15:40:10.79 +100>,<MAYBRIDGE\NMR>,<NMR_250MHZ>,
      <apk 
       data hash MD5: 32K
       DE DB 9F 99 2F 15 75 13 2F D7 0B A5 50 03 B5 41>)
(   4,<2005-07-28 15:40:12.31 +100>,<MAYBRIDGE\NMR>,<NMR_250MHZ>,
      <abs ABSG = 5 
       data hash MD5: 32K
       B4 04 8E 58 2F 4B 56 D2 B4 9D 0C E9 40 70 06 25>)
$$ ##END=
$$ 
$$ hash MD5
$$ 6D 6A 63 24 76 39 66 F0 D3 0C 7C 5E BF 1A 35 08
##$RELAX= 
##$RELAX= 
##$RELAX= 
##$RELAX= 
##$RELAX= 
##$RELAX= 
##$RELAX= 
$$ Bruker specific parameters
$$ --------------------------
##$DU= <C:\u>
##$EXPNO= 6800
##$NAME= <ADRS>
##$PROCNO= 1
##$TYPE= <nmr>
##$USER= <dgb>
##$AMP= (0..31)
100 100 100 100 100 100 100 100 100 100 100 100 100 100 100 100 100 100 
100 100 100 100 100 100 100 100 100 100 100 100 100 100 
##$AQSEQ= 0
##$AQ_mod= 3
##$AUNM= <au_zg>
##$AUTOPOS= <14 >
##$BF1= 250.13
##$BF2= 250.13
##$BF3= 250.13
##$BF4= 250.13
##$BF5= 500.13
##$BF6= 500.13
##$BF7= 500.13
##$BF8= 500.13
##$BYTORDA= 1
##$CFDGTYP= 0
##$CFRGTYP= 5
##$CHEMSTR= <none>
##$CNST= (0..31)
1 1 145 1 1 1 1 1 1 1 1 1 1 1 1 1 1 1 1 1 1 1 1 1 1 1 1 1 1 1 1 1 
##$CPDPRG= <>
##$CPDPRG1= <>
##$CPDPRG2= <>
##$CPDPRG3= <>
##$CPDPRG4= <mlev>
##$CPDPRG5= <mlev>
##$CPDPRG6= <mlev>
##$CPDPRG7= <mlev>
##$CPDPRG8= <mlev>
##$CPDPRGB= <>
##$CPDPRGT= <>
##$D= (0..31)
0 1 0 0 0 0 0 0 0 0.06 0 0 0 0 0 0 0.0002 0 0 0 0 0 0 0 0 0 0 0 0 0 0 
0 
##$DATE= 1122561587
##$DBL= (0..7)
120 120 120 120 120 120 120 120 
##$DBP= (0..7)
150 150 150 150 150 150 150 150 
##$DBP07= 0
##$DBPNAM0= <>
##$DBPNAM1= <>
$$ [...]
##$SUBNAM7= <"">
##$SUBNAM8= <"">
##$SUBNAM9= <"">
##$SW= 20.6930455092707
##$SWIBOX= (0..15)
0 0 3 0 0 0 0 0 0 0 0 0 0 0 0 0 
##$SW_h= 5175.983436853
##$TD= 65536
##$TD0= 1
##$TE= 295.16
##$TE2= 300
##$TE3= 300
##$TEG= 300
##$TL= (0..7)
0 120 120 120 120 120 120 120 
##$TP= (0..7)
150 150 150 150 150 150 150 150 
##$TP07= 0
##$TPNAME0= <>
##$TPNAME1= <>
##$TPNAME2= <>
##$TPNAME3= <>
##$TPNAME4= <>
##$TPNAME5= <>
##$TPNAME6= <>
##$TPNAME7= <>
##$TPOAL= (0..7)
0.5 0.5 0.5 0.5 0.5 0.5 0.5 0.5 
##$TPOFFS= (0..7)
0 0 0 0 0 0 0 0 
##$TUNHIN= 0
##$TUNHOUT= 0
##$TUNXOUT= 0
##$USERA1= <user>
##$USERA2= <user>
##$USERA3= <user>
##$USERA4= <user>
##$USERA5= <user>
##$V9= 5
##$VALIST= <valist>
##$VCLIST= <CCCCCCCCCCCCCCC>
##$VD= 0
##$VDLIST= <DDDDDDDDDDDDDDD>
##$VPLIST= <PPPPPPPPPPPPPPP>
##$VTLIST= <TTTTTTTTTTTTTTT>
##$WBST= 1024
##$WBSW= 4
##$XGAIN= (0..3)
0 0 0 0 
##$XL= 0
##$YL= 0
##$YMAX_a= 352215
##$YMIN_a= -299510
##$ZGOPTNS= <>
##$ZL1= 120
##$ZL2= 120
##$ZL3= 120
##$ZL4= 120
##$ABSF1= 16.522
##$ABSF2= -4.171173
##$ABSG= 5
##$ABSL= 3
##$ALPHA= 0
##$AQORDER= 0
##$ASSFAC= 0
##$ASSFACI= 0
##$ASSFACX= 0
##$ASSWID= 0
##$AUNMP= <proc_1d>
##$AZFE= 0.1
##$AZFW= 0.1
##$BCFW= 0
##$BC_mod= 0
##$BYTORDP= 0
##$COROFFS= 0
##$CY= 12.5
##$DATMOD= 1
##$DC= 0
##$DFILT= <>
##$DTYPP= 0
##$F1P= 14.0000005364418
##$F2P= -0.99999901652339
##$FCOR= 0.5
##$FTSIZE= 32768
##$FT_mod= 6
##$GAMMA= 0
##$GB= 0
##$INTBC= 1
##$INTSCL= 1
##$ISEN= 128
##$LB= 0.3
##$LEV0= 0
##$LPBIN= 0
##$MAXI= 10000
##$MC2= 0
##$MEAN= 0
##$ME_mod= 0
##$MI= 0
##$NCOEF= 0
##$NC_proc= -6
##$NLEV= 6
##$NOISF1= 0
##$NOISF2= 0
##$NSP= 0
##$NTH_PI= 0
##$NZP= 0
##$OFFSET= 16.522
##$PC= 1
##$PHC0= -113.6829
##$PHC1= 72.59971
##$PH_mod= 1
##$PKNL= yes
##$PPARMOD= 0
##$PSCAL= 4
##$PSIGN= 0
##$REVERSE= no
##$SF= 250.13
##$SI= 32768
##$SIGF1= 0
##$SIGF2= 0
##$SINO= 400
##$SIOLD= 32768
##$SREGLST= <1H.DMSO>
##$SSB= 0
##$STSI= 32768
##$STSR= 0
##$SW_p= 5175.98343685301
##$SYMM= 0
##$S_DEV= 0
##$TDeff= 65536
##$TDoff= 0
##$TI= <Analysis number 999999
Compound Code 99
Book Reference 9
Project Code 9>
##$TILT= no
##$TM1= 0
##$TM2= 0
##$TOPLEV= 0
##$USERP1= <user>
##$USERP2= <user>
##$USERP3= <user>
##$USERP4= <user>
##$USERP5= <user>
##$WDW= 1
##$XDIM= 32768
##$YMAX_p= 460827923
##$YMIN_p= -31702893
$$ End of Bruker specific parameters
$$ ---------------------------------
##NTUPLES= NMR SPECTRUM
##VAR_NAME=  FREQUENCY,     SPECTRUM/REAL,   SPECTRUM/IMAG
##SYMBOL=    X,             R,               I
##VAR_TYPE=  INDEPENDENT,   DEPENDENT,       DEPENDENT
##VAR_FORM=  AFFN,          ASDF,            ASDF
##VAR_DIM=   32768,         32768,           32768
##UNITS=     HZ,            ARBITRARY UNITS, ARBITRARY UNITS
##FACTOR=    0.157963299565203, 1,           1
##FIRST=     4132.6476996994, 0,             0
##LAST=      -1043.33573715361, 0,           0
##MIN=       -1043.33573715361, -31702893,   0
##MAX=       4132.6476996994, 460827923,     0
$$ Real data points
##PAGE= N=1
##DATA TABLE= (X++(R..R)), XYDATA
$$ [...]
25312A49630M415Q7835j78045l25810l58322p2764J39277K91501J68935r3484
$$ 149630 154045 241880 63835 -261975 -620297 -693061 -553784 -262283 -93348 -186832
25302a86832n6557j12685j711J73150K27012J39562j67538J88030p2795j65901
$$ -186832 -243389 -356074 -357785 -184635 42377 181939 14401 202431 129636 -36265
25292c6265j57109q0283N709o6657k9945l9836J21229m0312j24351L89961o4522
$$ -36265 -193374 -273657 -267948 -334605 -364550 -404386 -283157 -323469 -447820 -57859 -122381
25281a22381k51834N2122L1329K01332k30694J28685J8751o0600n7576j40J19425
$$ -122381 -374215 -322093 -290764 -89432 -320126 -191441 -172690 -233290 -290866 -291006 -171581
25270a71581p0761K47821j99228o679J82158j25837M4487o7726J98083J37331
$$ -171581 -242342 5479 -193749 -200428 -18270 -144107 -99620 -167346 30737 168068
25260A68068R1327m5007r4221k52048k16170K38647J16312Q4524J90636J22347
$$ 168068 259395 214388 120167 -131881 -348051 -109404 6908 91432 282068 404415
25250D04415K60274j71035m65268J4590K34604J91263Q3461l06823J23935O3607
$$ 404415 664689 493654 28386 42976 277580 468843 552304 245481 369416 433023
25240D33023o0048k51937l30033o2931J69387K70163M1220N8754K8397O7406j6460
$$ 433023 372975 121038 -208995 -271926 -102539 167624 208844 267598 295995 363401 346941
25229C46941j35999P3578J02422R0303k40025o0395j18544J67979J26249J40354
$$ 346941 210942 284520 386942 477245 237220 176825 58281 226260 352509 492863
25219D92863j14230l31555q2152k1230n7044K81995k72332q5904P769O2190N4361
$$ 492863 378633 47078 -35074 -56304 -113348 168647 -103685 -189589 -181820 -119630 -65269
25208f5269m6115n2484l5527J45955j52888J79130j15249j30094K5827K00546
$$ -65269 -111384 -163868 -199395 -53440 -206328 -27198 -142447 -272541 -246714 -46168
25198d6168R6482J51513J5289J27623k93075j5641k336q4512r5745o393J65491
$$ -46168 50314 201827 217116 344739 51664 36023 33687 -50825 -146570 -152963 12528
25187A2528k6854k1073J58874M8706j36346j89841L8916J55824J49185q13j33280
$$ 12528 -14326 -35399 123475 172181 35835 -154006 -115090 40734 189919 189106 55826
25176E5826n50125Q4185N02344l3967J1821o1601k19304L6036J79726k7763k59891
$$ 55826 -494299 -410114 92230 58263 70084 8483 -210821 -174785 4941 -22822 -282713
25165b82713k59437r5166L0634o3785K80591J31669O7834J89677J8265k68952
$$ -282713 -542150 -637316 -606682 -670467 -389876 -258207 -190373 -696 17569 -251383
25155b51383P9925j3884J59875O2174j74314J65640L5341q1757P485K73314q8460
$$ -251383 -171458 -185342 -25467 36707 -137607 28033 63374 -18383 -10898 262416 173956
25144A73956L0116J22844k65447j66908L4555k54707k12840K18509J5596p9955
$$ 173956 204072 326916 61469 -105439 -70884 -325591 -538431 -319922 -304326 -384281
25134c84281J153j1102q6816K15144J24948k7310J05091n6309J17691L86338j61000
$$ -384281 -383128 -394230 -481046 -265902 -140954 -168264 -63173 -119482 -1791 384547 223547
25123B23547J2374l34998k17350l0726j63797Q6184J14980K38318J18740J5706
$$ 223547 235921 -99077 -316427 -347153 -510950 -424766 -309786 -71468 47272 62978
25113F2978K6097J95568k4519k05073p2900K06928m5616J7616k49868O4119L57548
$$ 62978 89075 284643 260124 55051 -17849 189079 143463 161079 -88789 -24670 332878
25102C32878q9388k16152q9902R1812j65635l8208J32064k94234j55900M8566
$$ 332878 243490 27338 -62564 29248 -136387 -174595 -42531 -336765 -492665 -444099
25092d44099K52743L47523j19334r7316K6491R3300K19798l94492k26374K95859
$$ -444099 -191356 156167 36833 -60483 -33992 59308 279106 -115386 -341760 -45901
25082d5901J93029j64276J9344K86727K1005j57833l72150p1524K4190K06196
$$ -45901 147128 -17148 2196 288923 309928 152095 -220055 -291579 -267389 -61193
25072f1193n0983p063O553k75892k05041j9985J8021J33323R9826P0236Q6243
$$ -61193 -112176 -119239 -112686 -388578 -593619 -613604 -595583 -462260 -362434 -292198 -205955
25061b05955L60541j45145l09432K54542l4731J85205K24564k58454p9959J28989
$$ -205955 154586 9441 -299991 -45449 -80180 105025 329589 71135 -8824 120165
25051A20165P9348L9884K65476L0787J24583j1509k26737j9042j72688N1870j6529
$$ 120165 199513 239397 504873 535660 660243 648734 421997 402955 230267 282137 265608
25040B65608j86391K03214K38782O1216l56023k61698N5220P487o6289o7921J23107
$$ 265608 79217 282431 521213 582429 226406 -35292 19928 27415 -38874 -106795 16312
25029A6312J18056K46286j4941k37058J24436j2081j81078J04503n8779m550L2195
$$ 16312 134368 380654 365713 128655 253091 241010 59932 164435 105656 101106 133301
25018A33301k13091N0005j30331J91201L98410L35760o4324m01040k42924l22123
$$ 133301 -79790 -29785 -160116 31085 429495 765255 700931 299891 56967 -265156
25008b65156L2775M78503m758k16896K0020K58429K1923n31101j51494j01694
$$ -265156 -232381 246122 241364 24468 44488 302917 324840 -206261 -357755 -459449
24998d59449n3053Q5289K94296J30033k4786k56428j41145O2268l0742J60921
$$ -459449 -512502 -427213 -132917 -2884 -27670 -284098 -425243 -362975 -393717 -232796
24988b32796n8608O5255j40500O0370q45R1010K19182N9073j47375J05883L18189
$$ -232796 -291404 -226149 -366649 -306279 -307124 -216114 3068 62141 -85234 20649 338838
24977C38838K8016j54135o8201l7036K25617J20923j45555m37197j30062K10408
$$ 338838 366854 212719 144518 107482 333099 454022 308467 -128730 -258792 -48384
24967d8384k03056k35389K43930K13006K55134K56608k85476k77216L92137J10166
$$ -48384 -251440 -486829 -242899 -29893 225241 481849 196373 -80843 311294 421460
24957D21460k14643j60773J29249n6757j95642J94189m9765k57295K0039J12288
$$ 421460 206817 46044 175293 118536 -77106 117083 67318 -189977 -169938 -57650
24947e7650p057K99703K07361j97104j29922m20364q0523j50636K14030j4005
$$ -57650 -64707 234996 442357 245253 115331 -305033 -385556 -536192 -322162 -336167
24937c36167K85587J73330K03360O5777j3957k87389j18090k91316J02816K08949
$$ -336167 -50580 122750 326110 391887 377930 90541 -27549 -318865 -216049 -7100
24927g100l0078j57534r7526J49885K09447J22310n9288J88263K32585J24718
$$ -7100 -37178 -194712 -292238 -142353 67094 189404 130116 318379 550964 675682
24917F75682k40103j47903o0313M37006M68609j45781n60111k71235O3308j92356
$$ 675682 435579 287676 227363 664369 1132978 987197 427086 155851 219159 26803
24907B6803j53953O5402j10500q1319P4190J3289j14903j62892J04982K73386
$$ 26803 -127150 -61748 -172248 -253567 -179377 -166088 -280991 -443883 -338901 -65515
24897f5515o7261j55605K73138K29776J00718k81615O1924K69201L9604K82994
$$ -65515 -132776 -288381 -15243 214533 315251 33636 95560 364761 404365 687359
24887F87359O9746n2991o9485k10039l92856j4678j82649L12712p1076l08227
$$ 687359 757105 704114 634629 424590 31734 17056 -165593 147119 76043 -232184
24877b32184K4320N1444l2378J02384J63066J32770l30969k17874K33235K21137
$$ -232184 -207864 -156420 -188798 -86414 76652 209422 -121547 -339421 -106186 114951
24867A14951p4549j59496r4208L56939M11908K7976j84673j27058K28956J61816
$$ 114951 40402 -119094 -213302 143637 555545 583521 398848 271790 500746 662562
24857F62562j44403j97789j18192Q0997L0892j3358m15637q5458K66852P3184
$$ 662562 518159 320370 202178 283175 314067 300709 -114928 -200386 66466 139650
24847A39650k26383m67061j31869L75681J48764k34183J26596L41466L96807j33813
$$ 139650 -86733 -553794 -685663 -309982 -161218 -395401 -268805 72661 469468 335655
24837C35655k35800j49696R2948O9051j29841n0606j62985J42254j20739m5145
$$ 335655 99855 -49841 43107 112158 -17683 -68289 -231274 -89020 -209759 -254904
24827b54904K7295j275k3752p7120R0403l51199j33042L50099J0591K52479J30034
$$ -254904 -227609 -228884 -252636 -329756 -239353 -590552 -723594 -373495 -362904 -110425 19609
24816A9609j13325J3817K35895n5035j30250o9474J2661o8676M5870k1979j65195
$$ 19609 -93716 -79899 155996 100961 -29289 -98763 -86102 -154778 -108908 -130887 -296082
24805b96082j02076j11313K74239M58597j22042l97477K94364k19909j53479j6199
$$ -296082 -398158 -509471 -235232 223365 101323 -296154 -1790 -221699 -375178 -391377
24795c91377r8630L2579k42444J02461J04830J8951J3077J12173p2030P3845M06739
$$ -391377 -490007 -457428 -699872 -597411 -492581 -473630 -460553 -348380 -420410 -346565 60174
24784F0174K73509k56296p8091j39134R5980L64662m52943m70385j22713J49378
$$ 60174 333683 77387 -704 -139838 -43858 320804 -132139 -602524 -725237 -575859
24774e75859K08438K7168J58476J23795k69347j17105L38894P0776N8271K80505
$$ -575859 -367421 -340253 -181777 -57982 -327329 -444434 -105540 -34764 23507 304012
24764C04012k66980k26082j09154j59802p0477M37856O09309J92079m85231l48244
$$ 304012 37032 -189050 -298204 -458006 -528483 -90627 518682 710761 225530 -122714
24754a22714P2051K83522p6061j55685k24917m555k4777n7054l07032q3428K26716
$$ -122714 -50663 232859 156798 1113 -223804 -228359 -253136 -310190 -617222 -700650 -473934
24743d73934K08899K89042J80887k22062l21288M7514J41536J87877J9376p6442
$$ -473934 -265035 24007 204894 -17168 -338456 -290942 -149406 38471 57847 -18595
24733a8595K13857L88442k07561J16007j39415l41362m2005k5291J31622l7692
$$ -18595 195262 583704 376143 492150 352735 11373 -30632 -55923 75699 38007
24723C8007J48557Q9028J6198J01447J03096n28348K3966P5483J87595p4081k06490
$$ 38007 186564 275592 291790 393237 496333 -32015 -8049 67434 255029 180948 -25542
24712b5542k30142R6118K61443j22588l62958j04096L77621K29599j5924j8652
$$ -25542 -255684 -159566 101877 -20711 -383669 -487765 -110144 119455 103531 84879
24702H4879l0409m3168j09765Q3007J72553J6355k74718N596K14645q1423k18567
$$ 84879 54470 11302 -98463 -15456 157097 173452 -101266 -95670 118975 37552 -181015
24691a81015j45750K79902O8802l8858N6907P9604J14212O3929J1317j21050m11300
$$ -181015 -326765 -46863 21939 -16919 39988 119592 233804 297733 309050 188000 -223300
24680b23300l44567k19576j97310J7556M12096L35323M7921j4096J58899K90962
$$ -223300 -567867 -787443 -984753 -967197 -555101 -219778 -171857 -185953 -27054 263908
24670B63908Q0304R3236R2569j88241l64450l38781q6740N0417R8043P7383O1213
$$ 263908 344212 437448 530017 341776 -22674 -361455 -448195 -397778 -299735 -222352 -161139
24659a61139m1489J42077o5324J32652J37727O3275J17317r0855k54674k4847
$$ -161139 -202628 -60551 -125875 6777 144504 207779 325096 234241 -20433 -45280
24649d5280J82945l18631j2943N1878r6791k59215q7589L5569L47296J63597o6403
$$ -45280 137665 -180966 -193909 -142031 -238822 -498037 -585626 -550057 -202761 -39164 -105567
24638a05567j17022K24921M9474n51m20243R2483M15030P8346j33503q4764J17694
$$ -105567 -222589 2332 51806 51255 -368988 -276505 138525 216871 83368 -1396 116298
24627A16298j78584l72248j50521K51118K76668J66066R8417J24419J45570k67999
$$ 116298 -62286 -434534 -585055 -333937 -57269 108797 207214 331633 477203 209204
24617B09204N1650N3249j81463j7208J06818K41126j78880l20497m8679K66781
$$ 209204 260854 314103 132640 115432 222250 463376 284496 -36001 -84680 182101
24607A82101J06377k8783n2740o503J43008k87035l05493j92340K08124K16296
$$ 182101 288478 259695 206955 200452 343460 56425 -249068 -441408 -233284 -16988
24597a6988k09901k11815J12636K29820K76236K58239k27020J12567p0977l42235
$$ -16988 -226889 -438704 -326068 -96248 179988 438227 211207 323774 252797 -89438
24587h9438J12886O4170j0695k7146K28561P171r1779L805j72412J28650L6996
$$ -89438 23448 87618 76923 49777 278338 285509 193730 197535 25123 153773 190769
24576A90769j23429p3569k01355p3291j4283P5449J62555J28865k49205k75638
$$ 190769 67340 -6229 -207584 -280875 -295158 -219709 -57154 71711 -177494 -453132
24566d53132J08246L46649l54939l92853J46626j20746O9056K53519J15185L34006
$$ -453132 -344886 1763 -353176 -746029 -599403 -720149 -651093 -397574 -282389 51617
24556E1617K05563j71330L9728j987j82107j06658K3791L48030K84551j3747m84993
$$ 51617 257180 85850 125578 123591 -58516 -165174 -141383 206647 491198 477451 -7542
24545g542J62736Q7094J24206K3083K62259l61839j04833k1807J7919k21280J59036
$$ -7542 155194 242288 366494 389577 651836 289997 185164 163357 181276 -40004 119032
24534A19032K40482l07437K18482k4538O3621r3782k02220k76720o9617L06882
$$ 119032 359514 52077 270559 246021 309642 215860 13640 -263080 -332697 -25815
24524b5815L12085k7354j72610K1662J81020o1337k83831o6675J691K43537M22744
$$ -25815 286270 258916 86306 107968 288988 227651 -56180 -122855 -121164 122373 545117
24513E45117j36620j09173R2396k26764l9751k56231k90074q3281R0156K46806
$$ 545117 408497 299324 391720 164956 125205 -131026 -421100 -504381 -414225 -167419
24503a67419m1684K77186K31329K6320j25083k95443M5035M3469J48015J64804
$$ -167419 -209103 68083 299412 325732 200649 -94794 -49759 -6290 141725 306529
24493C06529J24862m41406r7836J27542N33872N0566k89474M5684l34363O4430
$$ 306529 431391 -10015 -107851 19691 553563 604129 314655 360339 25976 90406
24483I0406p1541J7401P0384j04940L62098J60969m07428k19433j29309k12018
$$ 90406 18865 36266 106650 1710 363808 524777 117349 -102084 -231393 -443411
24473d43411K38466L74351j88979l49163m13807K00479Q5712r3481j3290K22252
$$ -443411 -204945 169406 -19573 -368736 -782543 -582064 -496352 -589833 -603123 -380871
24463c80871K19390r3450N6175j06731J95212K11167p2396j13016K10308K23031
$$ -380871 -161481 -254931 -198756 -305487 -110275 100892 28496 -84520 125788 348819
24453C48819r5575r6662k05041p5314J97019K4229O6228n5728K205p1049Q4324
$$ 348819 253244 156582 -48459 -123773 73246 97475 163703 107975 110180 39131 123455
24442A23455o7671J77317j00764n7011j59949q1780r9070o4157L12914k1414j9960
$$ 123455 55784 233101 132337 75326 -84623 -166403 -265473 -329630 -16716 -38130 -58090
24431e8090m4405p2277j07240K06169J74920L1522N3427k18441p2320p3087P544
$$ -58090 -102495 -174772 -282012 -75843 99077 130599 184026 -34415 -106735 -179822 -172278
24420a72278J32679j48175j28919k38822m9504J14183N72853J93007r5243l58897
$$ -172278 -39599 -187774 -316693 -555515 -605019 -490836 82017 275024 179781 -179116
24410a79116n0147j3196j98966j94588O3237o7403K43538O21775K17755m88957
$$ -179116 -229263 -242459 -441425 -636013 -572776 -640179 -396641 225134 442889 -46068
24400d6068l69801j2771K38335K88009J20358k86739Q7417j76332P0624K4555
$$ -46068 -415869 -428640 -190305 97704 218062 -68677 18740 -157592 -86968 -62413
24390f2413j55303K26267P9909k85508K57221L31781k21646J72638l26484l21331
$$ -62413 -217716 8551 88460 -197048 60173 391954 170308 342946 16462 -304869
24380c04869K77869L89921r2032j65145k57054l8259p5834p544J65836k11601
$$ -304869 -27000 362921 270889 105744 -151310 -189569 -265403 -272947 -107111 -318712
24370c18712k16807R6290j6449j2K43145J29328q7607j25051J74215J13652L3405
$$ -318712 -535519 -439229 -455678 -455690 -212545 -83217 -170824 -295875 -121660 -8008 25397
24359B5397n045j50471k2130O2315o8748j10259j9495k35203r8336K8459n1867
$$ 25397 20352 -130119 -152249 -89934 -158682 -268941 -288436 -523639 -621975 -593516 -645383
24348f45383K215K38730K9696J65626M8679K46668k25948j5009j56337j39542
$$ -645383 -643168 -404438 -374742 -209116 -160437 86231 -139717 -154726 -311063 -450605
24338d50605K22355n5528j64452J765M14043j28699j05358j64908J387j5935N437
$$ -450605 -228250 -283778 -448230 -446465 -32422 -161121 -266479 -431387 -430000 -445935 -440498
24327d40498L62258L15060r2374r1909J44858K8871k31180J36084O0400j45080
$$ -440498 -78240 236820 144446 52537 197395 226266 -4914 131170 191570 46490
24317D6490m6537J82371L52663j74633j50148J5838R9654k36614p4366L10683
$$ 46490 -47 182324 534987 360354 210206 226044 325698 89084 14718 325401
24307C25401j50252k68010k27838J94222K33202k36339j71247J25292k55161j57295
$$ 325401 175149 -92861 -320699 -126477 106725 -129614 -300861 -175569 -430730 -588025
24297e88025K19279R5510J69699j35478j68115m67321k21711N23157K4145M610
$$ -588025 -368746 -273236 -103537 -239015 -407130 -874451 -1096162 -573005 -548860 -544250
24287e44250j38818o5456P307K06837O4809R7049K68515K67501j42182j85421
$$ -544250 -683068 -748524 -741217 -534380 -469571 -372522 -104007 163494 21312 -164109
24277a64109k5772K83241R1867m73454j21268p7980J48029R7712j78170k3884
$$ -164109 -189881 93360 185227 -288227 -409495 -487475 -339446 -241734 -419904 -443788
24267d43788L7833J89237L51375j75240j05815L0400j06721j40915j93573m4019
$$ -443788 -405955 -216718 134657 -40583 -146398 -115998 -222719 -363634 -557207 -601226
24257f01226j4840P5405L37176J37920p3595k26266K59339J82448j1749l43493
$$ -601226 -616066 -540661 -203485 -65565 -139160 -365426 -106087 76361 64612 -278881
24247b78881k23456J7315J05883L7942K30210K7959r9000k31726K19094k98782
$$ -278881 -502337 -485022 -379139 -341197 -110987 -83028 -182028 -413754 -194660 -493442
24237d93442L567M62028L380M2040K02298q7084j43194j18993K2872N2410j74298
$$ -493442 -489875 -27847 -24467 17573 219871 132787 -10407 -129400 -106528 -54118 -228416
24226b28416k17821k38130n149K33967L30866P2778l40496l07584j77660M08976
$$ -228416 -446237 -684367 -689516 -455549 -124683 -51905 -392401 -699985 -877645 -468669
24216d68669l129n5802K09426L38090j50042l15758M2533J57630k07930k67077
$$ -468669 -471798 -527600 -318174 19916 -130126 -445884 -403351 -245721 -453651 -720728
24206g20728k8165M9156L41416J60281k86123J82755K47068R4843j54300k26232
$$ -720728 -748893 -699737 -358321 -198040 -484163 -301408 -54340 40503 -113797 -340029
24196c40029O3719M4952L26126o8336q2391l01097k50404K45225K77613j57133
$$ -340029 -276310 -231358 94768 26432 -55959 -357056 -607460 -362235 -84622 -241755
24186b41755j35289N5482K23248K12591L5748J9410J8873l0992j57260n5129n9352
$$ -241755 -377044 -321562 -98314 114277 150025 169435 188308 157316 56 -55073 -114425
24175a14425K00735n177k27229N4207J64780o8761L7750L37364O2237j90965l58379
$$ -114425 86310 81133 -146096 -91889 72891 4130 41880 379244 441481 250516 -107863
24164a07863k82318L96116j06856l26314J1191J69355J34585Q4145L34089K60565
$$ -107863 -390181 5935 -100921 -427235 -416044 -246689 -112104 -27959 306130 566695
24154E66695J14809n4478j62668o5714n9662k07906l87264O1153J3214j20352
$$ 566695 681504 627026 464358 398644 338982 131076 -256188 -195035 -181821 -302173
24144c02173K6634K77047J67821j65850q4506R0169p020l338P8623k24309m3728
$$ -302173 -275539 1508 169329 3479 -81027 9142 2122 -1216 77407 -146902 -190630
24133a90630j09744Q7326k18709k1817R9609Q5236J3221l3406j4438j07048K36930
$$ -190630 -300374 -213048 -431757 -453574 -353965 -268729 -255508 -288914 -303352 -410400 -173470
24122a73470J28503k03545O8903K13578K64544R4552j65662k59449o4249j67359
$$ -173470 -44967 -248512 -179609 33969 298513 393065 227403 -32046 -96295 -263654
24112b63654o7845n5074K96588K45773l3247M5006n6029j0471k14861L5230p1374
$$ -263654 -331499 -386573 -89985 155788 122541 167547 111518 101047 -113814 -78584 -149958
24101a49958O6219m5495k51833p7712J63972K26230L19077Q7603l85674k70982
$$ -149958 -83739 -129234 -381067 -458779 -294807 -68577 250500 338103 -47571 -318553
24091c18553K8098L8516k32820J7197R5358L27046Q5595M0331L7663j87769Q8003
$$ -318553 -290455 -251939 -484759 -467562 -372204 -45158 40437 80768 118431 -69338 18665
24080A8665K57761J5760j05355N9617j18820J64126M8766j13830j26715n9219
$$ 18665 276426 292186 186831 246448 127628 291754 340520 226690 99975 40756
24070D0756J3696l23596j77965j1906q067L1861K25869M08720J62413k46240n54936
$$ 40756 54452 -269144 -447109 -459015 -467082 -435221 -209352 199368 361781 115541 -439395
24059d39395J4005J23239R4091J69262n1911M1272j67246J27359J17934k15934
$$ -439395 -425390 -302151 -208060 -38798 -90709 -49437 -216683 -89324 28610 -187324
24049a87324n0043P3767j5754r5317M7107K33856j94978p9368J62332K3073N1540
$$ -187324 -237367 -163600 -179354 -274671 -227564 6292 -188686 -268054 -105722 -82649 -31109
24038c1109l00646m35306M72784K60489J51067N5546l19038m784k1461N17493
$$ -31109 -331755 -767061 -294277 -33788 117279 172825 -146213 -150997 -172458 345035
24028C45035l4410k09430k31742M574j05793K47422J75548k54322o7739L79536
$$ 345035 310625 101195 -130547 -125973 -231766 15656 191204 -63118 -130857 248679
24018B48679J86592J8162l92540j03037O4171k28218o3204j52702q2867N19560
$$ 248679 435271 453433 60893 -42144 22027 -206191 -269395 -422097 -504964 14596
24008A4596J94792K54751l21608l51135j43005O3528J33724N1637k38598j97127
$$ 14596 209388 464139 142531 -208604 -351609 -288081 -154357 -102720 -341318 -538445
23998e38445Q5790P2378N1792P7166j410J13066J35521Q6688N4629k46212j27690
$$ -538445 -452655 -380277 -328485 -251319 -252729 -139663 -4142 82546 137175 -109037 -236727
23987b36727j34836K54405O9129J68154k88793j78526j87693N6803M52259n765
$$ -236727 -371563 -117158 -48029 120125 -168668 -347194 -534887 -478084 -25825 -31590
23977c1590p2055J96009k15929m11035J91734M88574r7418k29292K7362r7286
$$ -31590 -103645 92364 -123565 -534600 -342866 145708 48290 -181002 -153640 -250926
23967b50926M00538K10994l92722K93644j49861n5533j72575k90667O4127L28063
$$ -250926 149612 360606 -32116 261528 111667 56134 -116441 -407108 -342981 -14918
23957a4918L13306j72282l58491r5259L0879J76545J47934K99545J86707o7310
$$ -14918 298388 126106 -232385 -327644 -296765 -120220 27714 327259 513966 446656
23947D46656R133j33135l02414l72688j59713L38960J03577P4907j51705J67688
$$ 446656 455789 322654 20240 -352448 -512161 -173201 -69624 5283 -146422 21266
23937B1266O492l05889j5225L85580K09171n7014k65011j59550R8655j92362k1435
$$ 21266 27758 -278131 -293356 92224 301395 244381 -20630 -180180 -81525 -273887 -295322
23926b95322J35859o3421J53307q9475j15302O07404O7869m95725k23410o2346
$$ -295322 -159463 -222884 -69577 -159052 -274354 333050 400919 -94806 -318216 -380562
23916c80562j84394r6063J31192j41925l79819K94096K08052K86200l09910j56417
$$ -380562 -564956 -661019 -529827 -671752 -1051571 -757475 -549423 -263223 -573133 -729550
23906g29550J8755K30288n5075J39509J66308J99164J91835M31861J82489k48430
$$ -729550 -710795 -480507 -535582 -396073 -229765 -30601 161234 593095 775584 527154
23896E27154m92867j58805o7007k70699J18826O9206j35987n4925o2523L3811
$$ 527154 34287 -124518 -191525 -462224 -343398 -274192 -410179 -465104 -527627 -493816
23886d93816Q6231j12179J97847L4200n3141N0163L4240m7551K93473j48938N571
$$ -493816 -407585 -519764 -321917 -287717 -340858 -290695 -256455 -304006 -10533 -159471 -153900
23875a53900L35338J28727Q8815j38950n2297l565n4912j43267o7016l89103L7777
$$ -153900 181438 310165 398980 260030 207733 204168 149256 5989 -61027 -450130 -412353
23864d12353N65766J20092j98467l7770k53483j68416P2209l15608j11168K45407
$$ -412353 153413 273505 75038 37268 -216215 -384631 -312422 -628030 -739198 -493791
23854d93791J34845R5971k94916J40911J78380j8854J65630L05484j95931j61580
$$ -493791 -358946 -262975 -557891 -416980 -238600 -257454 -91824 213660 17729 -143851
23844a43851p4875K26650K8532Q6327o949k48137l51644k20785K78420k37552
$$ -143851 -218726 7924 36456 122783 115834 -132303 -483947 -704732 -426312 -663864
23834f63864k16402o025L16063L62762r2222o5964J24185K45378J51039M6342
$$ -663864 -880266 -886291 -570228 -207466 -299688 -365652 -241467 3911 154950 201292
23824B01292l2172r2828J18081r1592k61m2066J92118N2451j70089j44737J44677
$$ 201292 169120 76292 194373 102781 102520 60454 252572 305023 134934 -9803 134874
23813A34874L30034o8075k87519l69388k12653k04597r9990L19570M96728l8238
$$ 134874 464908 396833 109314 -260074 -472727 -677324 -777314 -457744 38984 746
23803G46j7178M7284l9664j82005j15568J52698R5350l03285J53425Q8386p2483
$$ 746 -16432 30852 -8812 -190817 -306385 -153687 -58337 -361622 -208197 -119811 -192294
23792a92294k37494J56789J88717r7320l37828j76169L14824K66287J99029j97868
$$ -192294 -429788 -272999 -84282 -181602 -519430 -695599 -380775 -114488 84541 -113327
23782a13327l87321P9534K56177j5902j35941K1770J02469l08806l44051j00029
$$ -113327 -500648 -421114 -164937 -180839 -316780 -295010 -192541 -501347 -845398 -945427
23772i45427N1498k1391J28407K34377K15648N2116p536k871P7880k85585j24853
$$ -945427 -893929 -915320 -786913 -552536 -336888 -284772 -292308 -295179 -217299 -502884 -627737
23761f27737n6124K11256K76438q2967J0622L05440j34531p839p1197j19219k25300
$$ -627737 -683861 -472605 -196167 -279134 -268512 36928 -97603 -105442 -176639 -295858 -521158
23750e21158K5759Q6784J31049J11968K32905j22856l17333J18233k04448m8219
$$ -521158 -495399 -408615 -277566 -165598 67307 -55549 -372882 -254649 -459097 -507316
23740e07316J62092M29200k87914l50977m1207J04435o4005J7760J8863J1317
$$ -507316 -345224 83976 -203938 -554915 -596122 -491687 -555692 -537932 -519069 -507752
23730e07752M5338L83291N9144n7209l0188L3518P0772L0397K80601J74673j16613
$$ -507752 -462414 -79123 -19979 -77188 -107376 -73858 -3086 27311 307912 482585 365972
23719C65972n6070k54352l07284j16536k60873K61088O5060J05987k08933o9125
$$ 365972 309902 55550 -251734 -368270 -629143 -368055 -302995 -197008 -405941 -475066
23709d75066m6519K73298K11805j25985M9237K7922J27708l3624j08027j69836
$$ -475066 -521585 -248287 -36482 -162467 -113230 -85308 42400 8776 -99251 -269087
23699b69087O5723l3468O8643L4203j05331j75468P0512J89208m7786j288k40343
$$ -269087 -203364 -236832 -168189 -133986 -239317 -414785 -344273 -155065 -202851 -204139 -444482
23688d44482k78357J74999L9964K47268K13574K39227p4667L3116J77745M8058
$$ -444482 -722839 -547840 -507876 -260608 -47034 192193 117526 150642 328387 376445
23678C76445l1269L4837j66296l30955n8724j04286J33269J70646J31545M7704
$$ 376445 345176 380013 213717 -117238 -175962 -280248 -146979 23667 155212 202916
23668B02916j09080J21239k54080r9303p3983O8648J38874J40545K75887j61977
$$ 202916 93836 215075 -39005 -138308 -212291 -143643 -4769 135776 411663 249686
23658B49686j87691j78620k65934j7327J34220K82497j14241k5413M14377O8124
$$ 249686 61995 -116625 -382559 -399886 -265666 16831 -97410 -122823 291554 359678
23648C59678k29885k03604j11416l50198N1573k98480M4964M92584j21882R7196
$$ 359678 129793 -73811 -185227 -535425 -483852 -782332 -737368 -244784 -366666 -269470
23638b69470K71725O6549j63888n1267M7872J63546k862l33632j37471J06224
$$ -269470 2255 68804 -95084 -146351 -98479 65067 62205 -271427 -408898 -302674
23628c02674p1812Q1184m873j88911L23976Q0208J13739K40332N3441k64838J9438
$$ -302674 -374486 -293302 -298175 -487086 -163110 -82902 30837 271169 324610 59772 79210
23617G9210j90246k03088K29731J81880l0060L4715J85419k9838l841p101J85519
$$ 79210 -111036 -314124 -84393 97487 67427 102142 287561 257723 253882 246781 432300
23606D32300K29934k39631l07040J29977l49885n90760j64178q525J89442M02392
$$ 432300 662234 422603 115563 245540 -104345 -695105 -859283 -867808 -678366 -275974
23596b75974J2374J06293o4742p542M2355R3655K12773J32429M61786L19430k60646
$$ -275974 -263600 -157307 -222049 -229591 -187236 -93581 119192 251621 713407 1032837 772191
23585G72191l71579k79787j22721j71144O2615J36964Q5967j61821Q538K75640
$$ 772191 400612 120825 -1896 -173040 -110425 26539 112506 -49315 -40777 234863
23575B34863j26247j46010j18184J0992k5873j110P8549K22071J63379j14186
$$ 234863 108616 -37394 -155578 -144586 -170459 -171569 -93020 129051 292430 178244
23565A78244j51355j37838R7840p5620O0453q9551k25780J20329K11101J23096
$$ 178244 26889 -110949 -13109 -88729 -28276 -117827 -343607 -223278 -12177 110919
23555A10919k53959n1402j58426j87978M7610L58475O56895J21012l66945l83597
$$ 110919 -143040 -194442 -352868 -540846 -493236 -134761 522134 643146 276201 -107396
23545a07396k46757j30117M33531L96420j30200K28675k4311k71304J86555k1308
$$ -107396 -354153 -484270 -50739 345681 215481 444156 419845 148541 335096 313788
23535C13788k48295k33021k4114J98830J25748k78683k31471n2990K16660p818
$$ 313788 65493 -167528 -191642 7188 132936 -145747 -377218 -430208 -213548 -221366
23525b21366m8627J02843N3276j35648P4206Q4497N5143R8987K26168r9581j28511
$$ -221366 -269993 -167150 -113874 -249522 -175316 -90819 -35676 63311 289479 189898 61387
23514F1387l05720l93400q3218N84802J96730l2142q1052o6996J2090K02507J36118
$$ 61387 -244333 -637733 -720951 -136149 60581 28439 -52613 -119609 -107519 94988 231106
23503B31106l53649l17513K0296j28911J21052J80049K35068J73444k13379m1805
$$ 231106 -122543 -440056 -419760 -548671 -427619 -247570 -12502 160942 -52437 -94242
23493i4242m33979l17583m6554R3240R3181J09838L0970j84506n2942J13306J95282
$$ -94242 -528221 -845804 -892358 -799118 -705937 -596099 -565129 -749635 -802577 -689271 -493989
23482d93989L58122R7365j59255R4422J5816m6405n1720J37846L93596p2431k43745
$$ -493989 -135867 -38502 -197757 -103335 -87519 -133924 -185644 -47798 345798 273367 29622
23471B9622k65112P6511k49160k93946j7181K68332J95502N3938m133J85432O4460
$$ 29622 -235490 -158979 -408139 -702085 -719266 -450934 -255432 -201494 -205627 -20195 44265
23460D4265j07534m1984j92252j06394m0104o5000k71230L01336J50926J25022
$$ 44265 -63269 -105253 -297505 -403899 -444003 -509003 -780233 -478897 -327971 -202949
23450b02949M1104j71217L3491J07820L34641N4637L6828j08288l79971n6737
$$ -202949 -161845 -333062 -299571 -191751 142890 197527 234355 126067 -253904 -310641
23440c10641J60650M06411l0065j36979k6667k61664l55575M7941J93747R8986
$$ -310641 -149991 256420 226355 89376 62709 -198955 -554530 -506589 -312842 -213856
23430b13856j13349m16766K13159L54559k38784J46448K39450M8111j01438j32498
$$ -213856 -327205 -743971 -530812 -176253 -415037 -268589 -29139 18972 -82466 -214964
23420b14964O6671j02127j04479j8649J48955n1059J88452O0831j08863j4304
$$ -214964 -148293 -250420 -354899 -373548 -224593 -275652 -87200 -26369 -135232 -149536
23410a49536R9533k20998l74952j46484n3235J17592J83235Q4495j00315M5216
$$ -149536 -50003 -271001 -645953 -792437 -845672 -728080 -544845 -460350 -560665 -515449
23400e15449K67909q2301p170J60948j99806k1688K31840m3636k04240R8540O8628
$$ -515449 -247540 -329841 -337011 -176063 -375869 -397557 -165717 -209353 -413593 -315053 -246425
23389b46425l8017J19008k48012J0711J0992M20880J2412l01877m7504p555K4097
$$ -246425 -284442 -165434 -413446 -402735 -391743 29137 41549 -260328 -307832 -315387 -291290
23378b91290Q606q9398q0881l0742K57648Q1487j24326J27250J33630k34802M978
$$ -291290 -282684 -372082 -452963 -483705 -226057 -144570 -268896 -141646 -8016 -242818 -237840
23367b37840J25745n5745j25903J11321l8304J7713J45896q2593Q3251O4273j56284
$$ -237840 -112095 -167840 -293743 -182422 -220726 -203013 -57117 -139710 -56459 7814 -148470
23356a48470j32487j28453O8963O1059K26460N1037L63271M00025M23383k36405
$$ -148470 -280957 -409410 -340447 -279388 -52928 -1891 361380 761405 1184788 948383
23346I48383k82134j75788m34285k31597k31516j18042M2503K99122O5867L28994
$$ 948383 666249 490461 56176 -175421 -406937 -524979 -482476 -183354 -117487 211507
23336B11507n4300j31860m62670k17515l2671J39293P5904M28882K08287j90170
$$ 211507 157207 25347 -437323 -654838 -687509 -548216 -472312 -43430 164857 -25313
23326b5313r951j7277K09266m7559k04232k1603j93326R404K05116L6393L5727
$$ -25313 -35264 -52541 156725 109166 -95066 -116669 -309995 -300591 -95475 -59082 -23355
23315b3355K12736j46218K77981o5598k7540J59445J18718j46465j75295l52117
$$ -23355 189381 43163 321144 255546 228006 387451 506169 359704 184409 -167708
23305a67708j85993j60286M3197k93564K50051K17998J94721K754P4479j7649
$$ -167708 -353701 -513987 -470790 -764354 -514303 -296305 -101584 -98830 -24351 -42000
23295d2000J15276Q8782j54301j14140O0657n7285q6089n0574j00581J69236P6405
$$ -42000 73276 162058 7757 -106383 -45726 -103011 -189100 -239674 -340255 -171019 -94614
23284i4614j70766l26994R8851M04715L64939r5157l52991k24845J23515n7573
$$ -94614 -265380 -592374 -493523 -88808 276131 180974 -172017 -396862 -273347 -330920
23274c30920j20825k15377J11127L49779M7268j02100m18475j34636K87319K17684
$$ -330920 -451745 -667122 -555995 -206216 -158948 -261048 -679523 -814159 -526840 -309156
23264c09156j70344j05972K48238k6337K48831k6552j32644l3436j50068J08402
$$ -309156 -479500 -585472 -337234 -363571 -114740 -141292 -273936 -307372 -457440 -349038
23254c49038K72078K07599q1867p6764Q6901J91197n04656m57814M7835J73039
$$ -349038 -76960 130639 48772 -27992 58909 250106 -254550 -712364 -664529 -491490
23244d91490L42027K51210k97675j64576j00501K8140K64665K70435J32412J48394
$$ -491490 -149463 101747 -195928 -360504 -461005 -432865 -168200 102235 234647 383041
23234C83041k91726l98492l60668p5933R9537o5340K16051M3060J4012l9976j3843
$$ 383041 91315 -307177 -667845 -743778 -644241 -709581 -493530 -450470 -436458 -476434 -490277
23223d90277J64755k23701k9837M76062J49688k62452k41181j49262l175K73026
$$ -490277 -325522 -549223 -579060 -102998 46690 -215762 -456943 -606205 -609380 -336354
23213c36354J42908k14718l1476J841K25975J94034J9106j10826m299l394j44613
$$ -336354 -193446 -408164 -439640 -437799 -211824 -17790 1316 -109510 -113809 -117203 -261816
23202b61816J44269m4496l18688K78052Q6584r9668j4579j33379j31841Q8407
$$ -261816 -117547 -162043 -480731 -202679 -116095 -215763 -230342 -363721 -495562 -407155
23192d07155R5416J79011L9915q5607j29418j29351R1782M4076q338p9208j75410
$$ -407155 -311739 -132728 -92813 -178420 -307838 -437189 -345407 -301331 -309669 -388877 -564287
23181e64287K07284j48004j10595r9173J00690M27911P9220K32082J1691k38713
$$ -564287 -357003 -505007 -615602 -714775 -614085 -186174 -106954 125128 136819 -101894
23171a01894l65099J90067K06245j67876j27521J4765K69981j55975j29046R9324
$$ -101894 -466993 -276926 -70681 -238557 -366078 -351313 -81332 -237307 -366353 -267029
23161b67029J329n3239M0933J57325L58661n1611J31224k47204m694j068l7465
$$ -267029 -265700 -318939 -278006 -120681 237980 186369 317593 70389 65695 64627 27162
23150B7162J34195L59038j32974l32227j30703K27041o9746o7981R2816O5919
$$ 27162 161357 520395 387421 55194 -75509 151532 81786 13805 106621 172540
23140A72540n4609J31083j34232k89611o5816J31601K64933j98578J13716K35151
$$ 172540 117931 249014 114782 -174829 -240645 -109044 155889 -42689 71027 306178
23130C06178j55035p5331O3870J36381K414k28213o7314J74245j20640o3903K0477
$$ 306178 151143 75812 139682 276063 278477 50264 -17050 157195 36555 -27348 -6871
23119f871k62629K29200j96338j03908J56197M8486j26237j96383k7383m6056
$$ -6871 -269500 -40300 -236638 -340546 -184349 -135863 -262100 -458483 -485866 -531922
23109e31922L94543N1847L776Q0303J1578M189j03129k02738j96290R0464j7658
$$ -531922 -137379 -85532 -81756 -1453 10125 14314 -88815 -291553 -487843 -397379 -415037
23098d15037k05443n4534o3269J17070M14303l6996k734q0395L0308j87619p1696
$$ -415037 -620480 -675014 -738283 -621213 -206910 -243906 -246640 -327035 -296727 -484346 -556042
23087e56042J26866j27746O9732L32495R8902J10580r2640l79747M379J62121
$$ -556042 -429176 -556922 -487190 -154695 -55793 54787 -37853 -417600 -413221 -251100
23077b51100m5567l48317l17390j58529J73840K25548L02479Q7915r7856J17431
$$ -251100 -296667 -644984 -962374 -1120903 -947063 -721515 -419036 -331121 -428977 -311546
23067c11546J89787p921l07389k13237M92434K37446j80626P8388J68215l7041
$$ -311546 -121759 -129680 -437069 -650306 -157872 79574 -101052 -22664 145551 108510
23057A08510L6075k14591r3454J36k48044k13997o2479J46874J35565j21019J12958
$$ 108510 144585 -70006 -163460 -163324 -411368 -625365 -687844 -540970 -405405 -526424 -413466
23046d13466K23086n3707J29378o5551j08628l3364M866j34986L3215J99479j29325
$$ -413466 -190380 -244087 -114709 -180260 -288888 -322252 -317386 -452372 -419157 -219678 -349003
23035c49003J29491J39629l0442j63883N5656J50960k1416k06088M00229K43978
$$ -349003 -219512 -79883 -110325 -274208 -218552 -67592 -89008 -295096 105133 349111
23025C49111j40210m64715j39298L4052k59736p9826J97845J90898P859r7785
$$ 349111 208901 -255814 -395112 -361060 -620796 -700622 -502777 -311879 -304020 -401805
23015d01805K07697J46522L6193j61948K75298J16051l78253j46680k98222L49431
$$ -401805 -194108 -47586 -11393 -173341 101957 218008 -160245 -306925 -605147 -255716
23005b55716J89121K5897j33750l7207L035p759p4974M3807j14860l8977K10516
$$ -255716 -66595 -40698 -174448 -211655 -208620 -216379 -291353 -247546 -362406 -401383 -190867
22994a90867K09669o9492k40626q7431q5749M38776K21370J60850J14019k83000
$$ -190867 18802 -50690 -291316 -378747 -464496 -25720 195650 356500 470519 187519
22984A87519J237j07735j12615N135P6332K3690K14587J29348j58276k20494k04532
$$ 187519 188756 81021 -31594 -26459 49873 73563 288150 417498 259222 38728 -165804
22973a65804K7295J22181J73283k17692r8305R5815N3601J54449K19758r2728
$$ -165804 -138509 -16328 156955 -60737 -159042 -63227 -9626 144823 364581 271853
22963B71853n47469j65924J97058m0316p8201j24631j18428J13544L7414J39305
$$ 271853 -275616 -441540 -244482 -284798 -362999 -487630 -606058 -492514 -455100 -315795
22953c15795K06024N3645M2171K01228j9547J07754j53224J51340P8760J1422
$$ -315795 -109771 -56126 -13955 187273 167726 275480 122256 273596 352356 363778
22943C63778m79199l50263k12012K60584P6564J83559o2213l12663J4135K8418
$$ 363778 -115421 -465684 -677696 -417112 -340548 -156989 -219202 -531865 -517730 -489312
22933d89312j00764L3435Q7788J96298O4467j60671J665M7236K14568j32001j57930
$$ -489312 -590076 -556641 -468853 -272555 -208088 -368759 -367094 -319858 -105290 -237291 -395221
22922c95221M3833K52087J37015o9099k0821l01741j66086K72083J05758q0841
$$ -395221 -351388 -99301 37714 -31385 -52206 -353947 -520033 -247950 -142192 -223033
22912b23033K04778K1388M4181j44602j76287j71290j176J00226m6747R1381K40791
$$ -223033 -18255 3133 47314 -97288 -273575 -444865 -446041 -345815 -392562 -301181 -60390
22901f0390J66297m01870q7123M2828k64972L85593J61673m5973j62816j06724
$$ -60390 105907 -295963 -383086 -340258 -605230 -219637 -57964 -103937 -266753 -373477
22891c73477J7865R1372k0559l12240o2882j07476J74966r2959L725L05535J3084
$$ -373477 -355612 -264240 -284799 -597039 -659921 -767397 -592431 -685390 -681665 -376130 -363046
22880c63046O9136K36197r1999K57334Q3282j9173M54511J22035k49880l75901
$$ -363046 -293910 -57713 -149712 107622 190904 171731 626242 748277 498397 122496
22870A22496m16944O6045K00489K73010L73917j5827j70441l08916n3011k74896
$$ 122496 -294448 -228403 -27914 245096 619013 603186 432745 123829 70818 -204078
22860b04078k66584R4935j39948O9004M32610j31601o0961L2964L4006L90755
$$ -204078 -470662 -375727 -515675 -446671 -14061 -145662 -206623 -173659 -139653 251102
22850B51102Q0417n9749j39127J37414o694k17472l41513l3434L205n1736j0515
$$ 251102 331519 271770 132643 270057 263363 45891 -295622 -329056 -325851 -377587 -388102
22839c88102k2013j56068J05797n7966R7686K26167l5547M7213L2980m5450K23163
$$ -388102 -410115 -566183 -460386 -518352 -420666 -194499 -230046 -182833 -149853 -195303 27860
22828B7860J53579K908j21425J11765M9774l05447p9672R9163P6459o5087K54238
$$ 27860 181439 184347 62922 174687 224461 -80986 -160658 -61495 14964 -50123 204115
22817B04115n4739j86188r5379K6614j28921k11236J37810j98493j52797n6831
$$ 204115 149376 -36812 -132191 -105577 -234498 -445734 -307924 -506417 -659214 -716045
22807g16045M30395L06867m3447p9201o1282j95232l78767j4871L98704J61852
$$ -716045 -285650 21217 -22230 -101431 -162713 -357945 -736712 -751583 -352879 -191027
22797a91027j02242J39212k1632K29875J34125L47958j73954j39035o6699k04970
$$ -191027 -293269 -154057 -175689 54186 188311 536269 362315 223280 156581 -48389
22787d8389j66094l3425k11697n4788Q2168j69790q5177M36661K93424K81906
$$ -48389 -214483 -247908 -459605 -514393 -432225 -602015 -687192 -250531 42893 324799
22777C24799m66855k95864K73793p4105k98576o5520j0284k03697K71814L64700
$$ 324799 -142056 -437920 -164127 -238232 -536808 -602328 -612612 -816309 -544495 -179795
22767a79795Q4092P7277J04909p1311n0064l40427k81346J2405j04177N5336K49792
$$ -179795 -95703 -18426 86483 15172 -34892 -375319 -656665 -644260 -748437 -693101 -443309
22756d43309K60335L7670J37688o014j88653J33938J07181o7l65119q6807k47247
$$ -443309 -182974 -145304 -7616 -13630 -202283 -68345 38836 38769 -326350 -413157 -660404
22745f60404K8656L18747Q7251k41648J83321L6745r1765J21085j60475q0333
$$ -660404 -631748 -313001 -225750 -467398 -284077 -247332 -339097 -218012 -378487 -458820
22735d58820l5237L55213J74661J80569R2653o8828l43184K4696K3388K63800
$$ -458820 -494057 -138844 35817 216386 309039 240211 -102973 -78277 -54889 208911
22725B08911J28299K13389k65044k66954J38995J89800L1106o3384l17965j22547
$$ 208911 337210 550599 285555 18601 157596 347396 378502 315118 -2847 -125394
22715a25394q5332j69360J29737O10474K53099j03346j61144j26803k68525n42695
$$ -125394 -210726 -380086 -250349 360125 613224 509878 348734 221931 -46594 -589289
22705e89289j5624K81824M52508J45935n10853k70185m7711K5235R3262L35270
$$ -589289 -604913 -323089 129419 275354 -235499 -505684 -553395 -528160 -434898 -99628
22695i9628K3512q8124j94608j98896J38323K66922P442p4226K25372j04347k718
$$ -99628 -76116 -164240 -358848 -557744 -419421 -152499 -145057 -219283 6089 -98258 -100976
22684a00976n7884k64342j57615L29605J63714J47082J67569J88746j66421k11480
$$ -100976 -158860 -423202 -580817 -251212 -87498 59584 227153 415899 249478 37998
22674C7998j32922k83410l4048j31966J34046K11720p0934R1805k3058O5194k63837
$$ 37998 -94924 -378334 -412382 -544348 -410302 -198582 -269516 -177711 -200769 -135575 -399412
22663c99412k4893p1102K9433R9835n3599M3259j18405j40925K83574k8625L7244
$$ -399412 -424305 -495407 -465974 -366139 -419738 -376479 -494884 -635809 -352235 -380860 -343616
22652c43616K97248K82744k68391j98437j85792n1469k1561k25660K74948L43546
$$ -343616 -46368 236376 -32015 -230452 -416244 -467713 -489274 -714934 -439986 -96440
22642i6440j96559j99677j13787O8094L59964K12131m3992J02088K28600J1236
$$ -96440 -292999 -492676 -606463 -538369 -178405 33726 -10266 91822 320422 331658
22632C31658l74995k93589L6325K78334N7274o0072o0552k7469M8671O6092k25870
$$ 331658 -43337 -336926 -300601 -22267 35007 -25065 -85617 -113086 -64415 1677 -224193
22621b24193J63457M48843m7612j71274n2156o3538L9525q7065J53098K30277
$$ -224193 -60736 388107 340495 169221 117065 53527 93052 5987 159085 389362
22611C89362l19643j63908j40925P1701R0078J15807p9279j61795j96961Q9869
$$ 389362 69719 -94189 -235114 -163413 -73335 42472 -36807 -198602 -395563 -305694
22601c05694L2345k31473n2565J19168j88581N8320K65901J89664r1800k50218
$$ -305694 -273349 -504822 -557387 -438219 -626800 -568480 -302579 -112915 -204715 -454933
22591d54933l09400J51401L31697J26334k99067k4799L29086K07052j28953k6817
$$ -454933 -764333 -612932 -281235 -154901 -453968 -478767 -149681 57371 -71582 -98399
22581i8399Q0461J0082j59392k52556j44601K35243M11337J26378k84878k12766
$$ -98399 -17938 -7856 -167248 -419804 -564405 -329162 82175 208553 -76325 -289091
22571b89091N8780L50119J4872k67959P7114K06771n2281l811k14563J75265j4337
$$ -289091 -230311 119808 134680 -133279 -56165 150606 98325 94514 -120049 55216 40879
22560D0879o1229j43425r1028N6719n8491j91234m1905J69768K45405K17740j98139
$$ 40879 -20350 -163775 -254803 -198084 -256575 -447809 -489714 -319946 -74541 143199 -54940
22549e4940l54943O6689l7457J04543J10775r4351j54732K9936J54044j44256
$$ -54940 -409883 -343194 -380651 -276108 -165333 -259684 -414416 -384480 -230436 -374692
22539c74692k29982J29172K22080K98280m16893k47714L32053N80578k82479n11904
$$ -374692 -604674 -475502 -253422 44858 -372035 -619749 -287696 292882 10403 -501501
22529e01501L33997O59035n9115m92698q4982r555J27753O20897R1877j94317
$$ -501501 -167504 491531 432416 -60282 -145264 -154819 -27066 593831 685708 491391
22519D91391m77311p1926l922j72433j74584k95795M24203M85003l71479k04970
$$ 491391 14080 -57846 -61768 -234201 -408785 -704580 -280377 204626 -166853 -371823
22509c71823j65020n6173K4549K12382J75923K46707r7270k39536k6382o5437
$$ -371823 -536843 -593016 -568467 -356085 -180162 66545 -30725 -270261 -296643 -362080
22499c62080k8314l37153n9922M4864L48010M50138k05982r0345l4147m55807
$$ -362080 -390394 -727547 -787469 -742605 -394595 55543 -150439 -240784 -274931 -730738
22489g30738J26428J06556L7923R1761L66484n0007j65913R0580r1366k20427
$$ -730738 -604310 -497754 -459831 -368070 -1586 -51593 -217506 -126926 -218292 -438719
22479d38719q7035K85011k5315J08188j0163m8889L55577M9008l0266J62374l16386
$$ -438719 -525754 -240743 -266058 -157870 -168033 -216922 138655 187663 157397 319771 3385
22468C385m8658K63747Q2790k43736l6784o6999j3688k49989L6230L5752M2814
$$ 3385 -45273 218474 301264 57528 20744 -46255 -59943 -309932 -273702 -237950 -195136
22457a95136O2625j11000j19949k11424n7966m6908Q0426N08666J14910k71120
$$ -195136 -132511 -243511 -363460 -574884 -632850 -679758 -599332 -90666 24244 -246876
22447b46876j58173J28067J97563J77890K12969k53590n48786O5428O5118p6150
$$ -246876 -405049 -276982 -79419 98471 311440 57850 -490936 -425508 -360390 -436540
22437d36540Q0995l81925K98807J51369k6233K80125J74190m9498m2862j81695
$$ -436540 -355545 -737470 -438663 -287294 -313527 -33402 140788 91290 48428 -133267
22427a33267j3909P3848O9446j85480Q1136l0811q552j3242j16240l11910J5153
$$ -133267 -147176 -73328 -3882 -189362 -108226 -139037 -147589 -160831 -277071 -588981 -573828
22416e73828J66102J54518r7510j29930J13853K23338M9169j08181l9872j144
$$ -573828 -407726 -253208 -350718 -480648 -366795 -143457 -94288 -202469 -242341 -243485
22406b43485o0127L3821k74788J71491R3157k5978o8591l3307J19052J52151n2667
$$ -243485 -303612 -269791 -544579 -373088 -279931 -305909 -374500 -407807 -288755 -136604 -189271
22395a89271k39201M58201R1734k55924j93378N2035j18271j05366L52487L56677
$$ -189271 -428472 29729 121463 -134461 -327839 -275804 -394075 -499441 -146954 209723
22385B09723l6442l11718r0703N3218L73120J02056L07327L71543k69103l05204
$$ 209723 173281 -138437 -229140 -175922 197198 299254 606581 978124 709021 403817
22375D03817p894J87788j28617O5301n3767j07372N0259l03110j27235k10996
$$ 403817 395923 583711 455094 520395 466628 359256 409515 106405 -20830 -231826
22365b31826j79502o3731J71133J22569J02707j35962r2037K31317K94491j08692
$$ -231826 -411328 -475059 -303926 -181357 -78650 -214612 -306649 -75332 219159 110467
22355A10467j96346r8227R9643j94476k5009L13103J75916k17871l39201j26599
$$ 110467 -85879 -184106 -84463 -278939 -303948 9155 185071 -32800 -372001 -498600
22345d98600J63355n2344J0762J18755L3710j03462j23240n49102R1081R7481
$$ -498600 -335245 -387589 -376827 -258072 -224362 -327824 -451064 -1000166 -909085 -811604
22335h11604Q2124M6655j45380K41710Q3983M3711Q9263K85446k08247j12535
$$ -811604 -729480 -682825 -828205 -586495 -502512 -458801 -369538 -84092 -292339 -404874
22325d04874J14359J51723p5381R9348j05489n5301J31325J82998K3215J80668
$$ -404874 -290515 -138792 -214173 -114825 -220314 -275615 -144290 38708 61923 242591
22315B42591K87410o532L3208m43126p21093j24526P2178N53113L23107j04384
$$ 242591 530001 523469 556677 113551 -607542 -732068 -659890 -106777 216330 111946
22305A11946k50378j83376J4659N1791o5502p9885J760J68339J0811J19579K96683
$$ 111946 -138432 -321808 -307149 -255358 -320860 -400745 -398985 -230646 -219835 -100256 196427
22294A96427M0692j93843J50954R5873l78495k38516k85547r7353N5752K62642
$$ 196427 237119 43276 194230 290103 -88392 -326908 -612455 -709808 -654056 -391414
22284c91414K02934K33207L20028o2906o9376k70145j07483j25765l8372J05519
$$ -391414 -188480 44727 364755 301849 232473 -37672 -145155 -270920 -309292 -203773
22274b03773Q9740L837j5509j20620J24073P0377J20038K97374p7463r3857o2978
$$ -203773 -114033 -110196 -125705 -246325 -122252 -51875 68163 365537 288074 194217 131239
22263A31239l2461N7847n4148j47468K27694k50366k55985L2985J91508J21792
$$ 131239 98778 156625 102477 -44991 182703 -67663 -323648 -290663 -99155 22637
22253B2637j1747M708L87072j01739k35499k16627r1804J02151J44287j51419
$$ 22637 10890 15598 402670 300931 65432 -151195 -242999 -140848 3439 -147980
22243a47980k58654N9623J26748J40315j26171L3494J73062J95713J7340j97000
$$ -147980 -406634 -347011 -220263 -79948 -206119 -172625 437 196150 213490 16490
22233A6490l07880p1314L89596J52810j48638l01359k49336l1683R4919J05549
$$ 16490 -291390 -362704 26892 179702 31064 -270295 -519631 -551314 -456395 -350846
22223c50846P5150J34851q4600k76624K0066P874L52848N11490j64388J01921
$$ -350846 -275696 -140845 -225445 -502069 -482003 -474129 -121281 390209 225821 327742
22213C27742J22514j32731j02666P0582R1187j47613j62193R7984j50959L9891
$$ 327742 450256 317525 214859 285441 376628 229015 66822 164806 13847 53738
22203E3738K01580Q771l31788l65433k18940L67591M06395N7681n3115k42734
$$ 53738 255318 264089 -67699 -433132 -652072 -284481 121914 179595 126480 -116254
22193a16254J37689Q1477j44005k23274k6816j1197K56765L24403J0462k46249
$$ -116254 21435 102912 -41093 -264367 -291183 -302380 -45615 278788 289250 43001
22183D3001j96724O4929o4517q9168J75590j01424P0642M2787L4426K04716k26966
$$ 43001 -153723 -88794 -153311 -242479 -66889 -168313 -97671 -54884 -20458 184258 -42708
22172d2708j31509K78115K31835n2351L5752r429K7297j14612j66653q3680K19765
$$ -42708 -174217 103898 335733 283382 319134 309705 337002 222390 55737 -27943 191822
22161A91822j3566J35433J18727k42386L4289J59597j29054j89571J95316J91226
$$ 191822 178256 313689 432416 190030 224319 383916 254862 65291 260607 451833
22151D51833m16643n41337M7326R8528P7550K7762L8542k3329k8041J16260K42394
$$ 451833 35190 -506147 -458821 -360293 -282743 -254981 -216439 -239768 -267809 -151549 90845
22140I0845L04976j80905l74097J48184K28845M0923R3605K3385q7336j39581
$$ 90845 395821 214916 -159181 -10997 217848 258771 352376 375761 288425 148844
22130A48844j06536N5183N4408l04281k7007J61413k10511n10778Q9293K97746
$$ 148844 42308 97491 151899 -152382 -179389 -17976 -228487 -739265 -649972 -352226
22120c52226j15518J39630J94441L16467J41376J25228l12959k96570o3018J94247
$$ -352226 -467744 -328114 -133673 182794 324170 449398 136439 -160131 -223149 -28902
22110b8902K13201j7270j88530k1569J7801k8333Q3408N9316Q9326j07318n9889
$$ -28902 184299 167029 -21501 -43070 -25269 -53602 29806 89122 178448 71130 11241
22099A1241J9734J78163J90724O4874j13838K0899J07141J95327j84711k51478
$$ 11241 30975 209138 399862 464736 350898 371797 478938 674265 489554 238076
22089B38076p5725l31648O0878P1336j59782k87202M7037L68692l466M47359L78075
$$ 238076 162351 -169297 -108419 -37083 -196865 -484067 -437030 -68338 -71804 375555 753630
22078G53630k40081o7351j66871k24284N6456L53905O6112j79631j63611k2760
$$ 753630 513549 446198 279327 55043 111499 465404 531516 351885 188274 165514
22068A65514R725o1393k64172j00004l5924k3223L16840J10256K6113j10825l74880
$$ 165514 175239 113846 -150326 -250330 -286254 -309477 7363 117619 143732 32907 -341973
22057c41973l08144K95933L72838R1588q1854j86089J3335K26153K46040J64469
$$ -341973 -650117 -354184 18654 110242 28388 -157701 -144366 81787 327827 492296
22047D92296k88398m25507j4644K21833l2617p542n1090j3497M27418K23468j15192
$$ 492296 203898 -221609 -236253 -14420 -47037 -54579 -105669 -119166 308252 531720 416528
22036D16528l47178k99072p5138J14429J77476N5213n05767N2898J68289P0027
$$ 416528 69350 -229722 -304860 -190431 -12955 42258 -463509 -410611 -242322 -172295
22026a72295J58527L76991P1718k0867j79056k7838M7910L2461M5994k88078l6097
$$ -172295 -13768 363223 434941 414074 235018 207180 255090 287551 333545 45467 9370
22015I370J28702j16644k93410J02361K56580j34947k63612q1966J70983J48247
$$ 9370 138072 21428 -271982 -169621 86959 -47988 -311600 -393566 -222583 -74336
22005g4336m7114j76787j66734J04258m4925k7443k1902J11711L2357K1768j80441
$$ -74336 -121450 -298237 -464971 -360713 -405638 -433081 -454983 -343272 -310915 -289147 -469588
21994d69588O0966O4258R806J58043L2278J22082o4771j91809j17997k39240L33935
$$ -469588 -408622 -344364 -334558 -176515 -144237 -22155 -86926 -278735 -396732 -635972 -302037
21983c02037M1975l8458O9796j14734M2187K25997K56296k24667p35625K71897
$$ -302037 -260062 -298520 -228724 -343458 -301271 -75274 181022 -43645 -779270 -507373
21973e07373J21512J42898m2871J03137K18790k50821l13971K150L27827K36461
$$ -507373 -385861 -242963 -285834 -182697 36093 -214728 -528699 -526549 -198722 37739
21963C7739j12678K11408J12589M5635j52925l2475n24290k88308L90486J85186
$$ 37739 -74939 136469 249058 294693 141768 109293 -414997 -703305 -312819 -127633
21953a27633r6698J89110J67372r5871K8148j84879N1687j16816p9448J6104k12635
$$ -127633 -224331 -35221 132151 36280 64428 -120451 -68764 -185580 -265028 -248924 -461559
21942d61559Q4593N1121j43131n0252J32960O3584j40522j77759q090n7407J92946
$$ -461559 -376966 -325845 -468976 -519228 -386268 -322684 -463206 -640965 -649055 -706462 -513516
21931e13516K95717r3068j51070j03707J45872K47732j72137r5089J88828k2424
$$ -513516 -217799 -310867 -461937 -565644 -419772 -172040 -344177 -439266 -250438 -272862
21921b72862L68649K06306k41264j70322J1J33942J71435K81175O5402q9463l89948
$$ -272862 95787 302093 60829 -109493 -109482 24460 195895 477070 542472 453009 63061
21910F3061l37919j06440J71694j62632J36961k9224K81058Q063k49629o7603
$$ 63061 -274858 -381298 -209604 -372236 -235275 -264499 16559 24622 -225007 -292610
21900b92610P5725K11237o9908Q3268N1543J11413j59743J0932K44003J92948
$$ -292610 -216885 -5648 -75556 7712 59255 170668 10925 21857 265860 458808
21890D58808m19955l36465J44098j32528L0779L11464P6730j97136j02726M51531
$$ 458808 38853 -297612 -153514 -286042 -255263 56201 132931 -64205 -166931 284600
21880B84600N4141j79987m19871k51804J95826L87793K09472r078M4003L6002
$$ 284600 338741 158754 -261117 -512921 -317095 70698 280170 271092 315095 351097
21870C51097L04412j78840j95694j22709l4997K4204j38406Q183j64535j40808
$$ 351097 655509 476669 280975 158266 123269 147473 9067 17250 -147285 -288093
21860b88093j32201j87805l5897M81J52815J95220J04190j36805j02743Q4743
$$ -288093 -420294 -608099 -643996 -643515 -490700 -295480 -191290 -328095 -430838 -346095
21850c46095J88880p3198K05132N680N8413J12612k08478j05871p6783P283p4132
$$ -346095 -157215 -230413 -25281 -19601 38812 151424 -57054 -162925 -239708 -232425 -306557
21839c06557K75595K31264J47017j59804k1112P8963J79649m23253l07022K23771
$$ -306557 -30962 200302 347319 187515 166403 245366 425015 1762 -305260 -81489
21829h1489K09310k11319l92975r4224J67835K59261J92405L60969N9073m1651
$$ -81489 127821 -83498 -476473 -570697 -402862 -143601 48804 409773 468846 427195
21819D27195j25264l86376k66638j73271j07726J02010l7840J10315L84166L16658
$$ 427195 301931 -84445 -351083 -524354 -632080 -530070 -567910 -457595 -73429 243229
21809B43229j69608k33539j69212J51014j13339P0597L20296K6023P2575J6364
$$ 243229 73621 -159918 -329130 -178116 -291455 -220858 99438 125461 198036 214400
21799B14400m6418K45195m0371k87735k03902j36972M09597K07384j31525K1544
$$ 214400 167982 413177 372806 85071 -118831 -255803 153794 361178 229653 251197
21789B51197j0579m0895j87818o4299N0871j3640j91280k21016o4416K28766k4380
$$ 251197 240618 199723 11905 -52394 -1523 -15163 -206443 -427459 -491875 -263109 -287489
21778b87489N9789o2477O2113J88062J3149p8943m8331J09466j15376l10251K83074
$$ -287489 -227700 -290177 -228064 -40002 -26853 -105796 -154127 -44661 -160037 -470288 -187214
21767a87214J00970J38540j097M6665n5720m6005Q1041j96004n565O0338l09207
$$ -187214 -86244 52296 51199 97864 42144 -3861 77180 -118824 -124389 -64051 -373258
21756c73258j84884J22917Q6231o3770l60038k84352K02875L76225K48629j10569
$$ -373258 -558142 -435225 -348994 -412764 -772802 -1057154 -854279 -478054 -229425 -339994
21746c39994N4230n9072r2089M2166J61634P3861r6951K99279L36988o4003m9555
$$ -339994 -285764 -344836 -436925 -394759 -233125 -159264 -256215 43064 380052 316049 266494
21735B66494J07715K1404K3930j5879k39953k2456k8191K20728J62308m6249l9299
$$ 266494 374209 395613 419543 403664 163711 141255 113064 333792 496100 449851 410552
21724D10552l51599j30940L66727j55739k86772k37121P2701N3995j47843J4368
$$ 410552 58953 -71987 294740 139001 -147771 -384892 -312191 -258196 -406039 -391671
21714c91671J96158M52473J345l21705l00558j37943J44853J26244N3247r9936
$$ -391671 -195513 256960 258305 -63400 -363958 -501901 -357048 -230804 -177557 -277493
21704b77493j0314P9224j54472l67306J01246K69067J50531Q8769j42647j18517
$$ -277493 -287807 -208583 -363055 -730361 -629115 -360048 -209517 -120748 -263395 -381912
21694c81912j26747J50345J90704K65732K64753R0277o1300k59434j22388K75634
$$ -381912 -508659 -358314 -167610 98122 362875 453152 391852 132418 10030 285664
21684B85664J7127k52028j48612K57853J44816l3055Q8069p6445m80718J0668
$$ 285664 302791 50763 -97849 160004 304820 271765 359834 283389 -197329 -186661
21674a86661q8996r8307L5216j82403q3422j09573J84819K6845M4275J61404L5068
$$ -186661 -275657 -373964 -338748 -521151 -604573 -714146 -529327 -502482 -458207 -296803 -261735
21663b61735P7405N5592K97620J13917J08l94585k83210R701l588N3259K52558
$$ -261735 -184330 -128738 168882 282799 282907 -111678 -394888 -385187 -388775 -335516 -82958
21652h2958q0846N7920j4933J4460k22323l6865O3392M54477J35416k65113o1726
$$ -82958 -163804 -105884 -120817 -106357 -328680 -365545 -302153 152324 287740 22627 -39099
21641c9099L08535J68069K18403q1272m45771o0138O2459l58665m50524K24025
$$ -39099 269436 437505 655908 574636 128865 68727 131186 -227479 -678003 -453978
21631d53978K07271l1899L12658K3509J72407J3862o0249j93002j6320K48683
$$ -453978 -246707 -278606 34052 57561 229968 243830 183581 -9421 -25741 222942
21621B22942L41069l11651k13038k8887j40310p8336P4397J93741j93654j21996
$$ 222942 564011 252360 39322 10435 -129875 -208211 -133814 59927 -133727 -255723
21611b55723k25741j12785K20623L50286O6743K64445l7964k79761K41178L99771
$$ -255723 -481464 -594249 -373626 -23340 43403 307848 269884 -9877 231301 631072
21601F31072K02148m5135k65621n2324j68846l59945k93524J23893J87240L32319
$$ 631072 833220 788085 522464 470140 301294 -58651 -352175 -228282 -41042 291277
21591B91277K25600j43427m27519M6617K1228j55411j66599K29620J30974L2201
$$ 291277 516877 373450 -54069 -7452 13776 -141635 -308234 -78614 52360 84561
21581H4561K24267j65457m26652J52659J03526j34744L11254M80385P6638k3274
$$ 84561 308828 143371 -283281 -130622 -27096 -161840 149414 629799 706437 683163
21571F83163l73342j10310k07661J79759M8917j41450l13499J48138p2332Q3311
$$ 683163 309821 199511 -8150 171609 220526 79076 -234423 -86285 -158617 -75306
21561g5306K55743k3771K1158j85126k42464K8800K58462j96454k86412J25744
$$ -75306 180437 156666 177824 -7302 -249766 -220966 37496 -158958 -445370 -319626
21551c19626K61342J58402M6951j39738j71019j1884r7154k30979k7986K20776
$$ -319626 -58284 100118 147069 7331 -163688 -175572 -272726 -503705 -531691 -310915
21541c10915J51052J87025P1577K69897P5474k27633k02513r4401o0986j54790
$$ -310915 -159863 27162 98739 368636 444110 216477 13964 -80437 -141423 -296213
21531b96213L06341p7971j55050j14258m91168J48489l7196M8440M89629K01974
$$ -296213 10128 -67843 -222893 -337151 -828319 -679830 -717026 -668586 -178957 23017
21521B3017P1760j05015j9369k80117l82780L98325K59335J68893J61391j80282
$$ 23017 94777 -10238 -29607 -309724 -692504 -294179 -34844 134049 295440 115158
21511A15158m12353q5878L12661J1899j18717J12900j19079k76397J34539K56043
$$ 115158 -297195 -383073 -70412 -58513 -177230 -64330 -183409 -459806 -325267 -69224
21501f9224j9781Q6765P5437k52666J34312M76686M37952k56465l65379l03604
$$ -69224 -89005 -2240 73197 -179469 -45157 431529 869481 613016 247637 -55967
21491e5967m75097L33875j6365m01049M4285l7534J25647N03376N2880J19023
$$ -55967 -531064 -197189 -213554 -614603 -570318 -607852 -482205 21171 74051 193074
21481A93074j42118r5438m2496Q6233K24587J75684k6385K7468R0144r9000k85561
$$ 193074 50956 -44482 -86978 -745 223842 399526 373141 400609 490753 391753 106192
21470A06192l06094j07852L58528J00568k45791l1193j51265j59814J04980J23960
$$ 106192 -199902 -307754 50774 151342 -94449 -125642 -276907 -436721 -331741 -207781
21460b07781J09789k03837J1844r5607o0872L67259J09715K9175k2724m3643M2435
$$ -207781 -97992 -301829 -289985 -385592 -446464 -79205 30510 59685 36961 -6682 35753
21449C5753m3052R0897K17924j93103j23876j48723L45644J89988o1232m49127
$$ 35753 -7299 83598 301522 108419 -15457 -164180 181464 371452 310220 -138907
21439a38907j06563K78784l0717P1905L8175K70003K38094m3948k30221j09095
$$ -138907 -245470 33314 2597 74502 112677 382680 620774 576826 346605 237510
21429B37510k66411j14116j20722J37896K29451N39624K21078j7848l85230j83804
$$ 237510 -28901 -143017 -263739 -125843 103608 643232 864310 846462 461232 277428
21419B77428K6878J97808l14350o7982K53110R8462j65278k2565J1232K4594k81560
$$ 277428 304306 502114 187764 119782 372892 471354 306076 283511 294743 319337 37777
21408C7777k52209k00901K26475L67968n7293q7627L3357J5812l35682p6635L28985
$$ 37777 -214432 -415333 -188858 179110 121817 34190 67547 83359 -252323 -328958 27
21397B7r8750j26007K56718R3678L5471o1850j07260q7014k15846K85893K60714
$$ 27 -98723 -224730 31988 125666 161137 99287 -7973 -94987 -310833 -24940 235774
21386B35774l7322k29347r1695o7975M39895p3674p24194k09052P42882J82663
$$ 235774 198452 -30895 -122590 -190565 249330 175656 -548538 -757590 -14708 167955
21376A67955m487K19242k26548J56203k95795J39360M0084O8489k17541r6811
$$ 167955 163468 382710 156162 312365 16570 155930 196014 264503 46962 -49849
21366d9849n2518K6290o3052J5961k55879k41216N6695K30173L01035K68495m380
$$ -49849 -102367 -76077 -139129 -123168 -379047 -620263 -563568 -333395 -32360 236135 231755
21355B31755k03361K56002Q9503k15011j4573M7554l12100J1029P1947M3629L2279
$$ 231755 28394 284396 373899 158888 144315 191869 -120231 -109202 -37255 6374 38653
21344C8653K73505K16841j79792q9536m0645k51423o3366k57405j06036J64909
$$ 38653 312158 528999 349207 259671 219026 -32397 -95763 -353168 -459204 -294295
21334b94295J78636K10647k13920j72354q950p8042k10639n2466J96605N20686
$$ -294295 -115659 94988 -118932 -291286 -300236 -378278 -588917 -641383 -444778 75908
21324G5908J97631k07540j32092o508j46817k6936R6156l5868N2159j60746p0447
$$ 75908 273539 65999 -66093 -72601 -219418 -246354 -150198 -186066 -133907 -294653 -365100
21313c65100K24312J34198j48630p655n7287l3677p0450L8067k2366Q4507L82588
$$ -365100 -140788 -6590 -155220 -162875 -220162 -253839 -324289 -286222 -308588 -224081 158507
21302A58507M10658p926n3629j14451j74513J24462L1631j03839l25676M6982
$$ 158507 569165 561239 507610 393159 218646 343108 374739 270900 -54776 -7794
21292g794J88485J37714o4046J86718l11517m91071J38162K40161K0680o1115
$$ -7794 180691 318405 254359 441077 129560 -361511 -223349 16812 37492 -23623
21282b3623j81169L874J32354P5258R4975J45618J21864K53367j0230l11820L8514
$$ -23623 -204792 -200918 -68564 6694 101669 247287 369151 622518 612288 300468 338982
21271C38982k5833k8019k37573q9456j34592j99365k60911K83523L53557J18051
$$ 338982 313149 285130 47557 -41899 -176491 -375856 -636767 -353244 313 118364
21261A18364o1822j9146L620j88309k12190p7415L75035J73604j83886m9433J938
$$ 118364 56542 37396 41016 -147293 -359483 -436898 -61863 111741 -72145 -121578 -119640
21250a19640k37014J34161J78865k59104K19466j0056J10575l5878j32081l6752
$$ -119640 -356654 -222493 -43628 -302732 -83266 -93322 17253 -18625 -150706 -187458
21240a87458j94025L4094N15043J03467m22341q1902L0860j04213L28229K22638
$$ -187458 -381483 -347389 167654 271121 -151220 -233122 -202262 -306475 21754 244392
21230B44392r9322k33091K6587j04716k0806m9424j55472K21091L29076O8614
$$ 244392 145070 -88021 -61434 -166150 -186956 -236380 -391852 -170761 158315 226929
21220B26929J67103j97687j78817R2164l2856k50681q5312k15351L33600J82569
$$ 226929 394032 196345 17528 109692 76836 -173845 -259157 -474508 -140908 41661
21210D1661k54952n3219P4380J41621k46912Q8129q644Q9928k553j06013J82299
$$ 41661 -213291 -266510 -192130 -50509 -297421 -209292 -217936 -128008 -130561 -236574 -54275
21199e4275j21763J14869K0886j67935n161J46885R8255J39049P5049j27364K76822
$$ -54275 -176038 -61169 -40283 -208218 -213379 -66494 31761 170810 245859 118495 395317
21188C95317j04698k31855J0932l69432N0983j82099o1299K64958K03181M4260
$$ 395317 290619 58764 69696 -299736 -248753 -430852 -492151 -227193 -24012 20248
21178B0248j05164o8063J26547j7361k40596r76J35872J35712l3328j15651o5651
$$ 20248 -84916 -152979 -26432 -43793 -284389 -285365 -149493 -13781 -47109 -162760 -228411
21167b28411K68079P7122l11636p037J30151K47047M20058m7628p2748j61628
$$ -228411 39668 116790 -194846 -201883 -71732 175315 595373 547745 474997 313369
21157C13369J06070k31559j21350J61298K49427J10273k41738j26359j80592j38402
$$ 313369 419439 187880 66530 227828 477255 587528 345790 219431 38839 -99563
21147i9563j08162j27533n5947j05892M96893K88811j15104p6861k18042N3067
$$ -99563 -207725 -335258 -391205 -497097 -204 288607 173503 96642 -121400 -68333
21137f8333L59817j25977k39110j60682m1165J50687K48868L22283J22266k565
$$ -68333 291484 165507 -73603 -234285 -275450 -124763 124105 446388 568654 566089
21127E66089n85928n04095K20590O0412P1232K34337K16981j56748K7141J50365
$$ 566089 -19839 -523934 -303344 -242932 -171700 62637 279618 122870 150011 300376
21117C00376k68236l0166J98632J01682M4615r5833k03133m14185p4912Q3952
$$ 300376 32140 1974 200606 302288 346903 251070 47937 -366248 -441160 -357208
21107c57208K44197k7665j15149R6722l5918Q484J23047j4885l04175J54395K35304
$$ -357208 -113011 -140676 -255825 -159103 -195021 -186537 -63490 -78375 -382550 -228155 7149
21096G149K77776o898j93630j59773J40597K66793J211k19185j65371K6000J14658
$$ 7149 284925 278027 84397 -75376 65221 332014 333225 114040 -51331 -25331 89327
21085H9327K11075R3206J92369j85110m24567j45133k9810j45678J44091L13635
$$ 89327 300402 393608 585977 400867 -23700 -168833 -198643 -344321 -200230 113405
21075A13405R3513P6421j46760j19060r8349N7802j92029k22761K53862L04156
$$ 113405 206918 283339 136579 17519 -80830 -23028 -215057 -437818 -183956 120200
21065A20200j03114J29358k53090j08971j00090K35197K71862L8487l7510k46820
$$ 120200 17086 146444 -106646 -215617 -315707 -80510 191352 229839 192329 -54491
21055e4491n6435K33100K13345k77858O2997R987j14074j39104r7178m98829k89183
$$ -54491 -110926 122174 335519 57661 120658 130645 16571 -122533 -219711 -718540 -1007723
21044a007723J09243o8341L14279M63208M26353K34724k23944J23113R5143l59424
$$ -1007723 -898480 -966821 -652542 -189334 237019 471743 247799 370912 466055 106631
21034A06631l47848j38044n6536K36195J16429O750J71516J44870Q5338Q9136
$$ 106631 -241217 -379261 -435797 -199602 -83173 -76423 95093 239963 325301 414437
21024D14437K19413N8263m22420l8489M47k28800j46767Q7637q8791m7786K65043
$$ 414437 633850 692113 269693 231204 231651 2851 -143916 -56279 -145070 -192856 72187
21013G2187J95990k34861j88834J88546N6269J15057J15207R1350K5192P8600
$$ 72187 268177 33316 -155518 33028 89297 204354 319561 410911 436103 514703
21003E14703J3176m5092L6766J85505K61741m210p0047l23261K16043R7911m04680
$$ 514703 527879 482787 519553 705058 966799 962589 892542 569281 785324 883235 478555
20992D78555K72526P5787j19908N155O01432n5124k60158L89852J25075j3240
$$ 478555 751081 826868 706960 712115 1313547 1258423 998265 1388117 1513192 1499952
20982A499952J51893m26961n34036K0848J25337L12519J29463o04785l77687k1691
$$ 1499952 1651845 1224884 690848 711696 837033 1149552 1279015 674230 296543 274852
20972B74852M92292J91049j38651j07422j66120k22749l55395p8340P8677J22440
$$ 274852 767144 958193 819542 712120 546000 323251 -32144 -110484 -31807 90633
20962I0633M26406J94254P3959L6522J81418q4946M8037m1351J19465k02356l81590
$$ 90633 517039 711293 785252 821774 1003192 918246 966283 924932 1044397 842041 460451
20951D60451K20158K03018j07632o8565r4251K14644n3085L355J45190K65561
$$ 460451 680609 883627 775995 707430 613179 827823 774738 778093 923283 1188844
20941A188844k69302j15776K03652k0685l37370r6636M4793o1546j06743j73983
$$ 1188844 919542 803766 1007418 986733 649363 552727 597520 535974 429231 255248
20931B55248L9813O05607R9736k86244l10164k04286k54602M1765Q5416O4833
$$ 255248 295061 900668 1000404 714160 403996 199710 -54892 -13127 72289 137122
20921A37122K5063k62303J35146j12965q0682J03283J32700J46919j46994j04426
$$ 137122 162185 -100118 35028 -77937 -158619 -55336 77364 224283 77289 -27137
20911b7137j67800k46245L58624K20266k62689J16452j13417K43123J65660k55310
$$ -27137 -194937 -441182 -82558 137708 -124981 -8529 -121946 121177 286837 31527
20901C1527m23390J92992M58090p6685j78333j07796k77169M1703J83218L99145
$$ 31527 -391863 -198871 259219 182534 4201 -103595 -380764 -339061 -155843 243302
20891B43302K99668j60101K46007N73115L31567o9718k74217q0018r4641N24573
$$ 243302 542970 382869 628876 1201991 1533558 1463840 1189623 1109605 1014964 1539537
20881A539537K60981l20493j43229K92295K03040K97208J93878K0926j92952M9469
$$ 1539537 1800518 1480025 1336796 1629091 1832131 2129339 2323217 2344143 2151191 2200660
20871B200660r4257q9808k36147l09765l60013k49754j24604K34865M16113O2720
$$ 2200660 2106403 2016595 1780448 1470683 1110670 860916 736312 971177 1387290 1450010
20861A450010j54833k59276J10927k17690l54167l32152j42077M361M4899k40418
$$ 1450010 1295177 1035901 1146828 929138 574971 242819 100742 105103 150002 -90416
20851i0416K93987K49460l28141l27636q3237K68973p8600J82948k9058k98294
$$ -90416 203571 453031 124890 -202746 -285983 -17010 -95610 87338 58280 -240014
20841b40014J63552K96957K94963J85124m5401M057j92514k80184j28892p4570
$$ -240014 -76462 220495 515458 700582 655181 659238 466724 186540 57648 -16922
20831a6922m7384k02479J20410M07131J83183l1094j86899j67660J17767n8070
$$ -16922 -64306 -266785 -146375 260756 443939 412845 225946 58286 176053 117983
20821A17983j27802j5082K13715O3191l02010k36506o0235J36718N650j4975J40445
$$ 117983 -9819 -24901 188814 252005 -50005 -286511 -346746 -210028 -204378 -219353 -78908
20810g8908m5778J97266K88862j35832j13538J13377K35074j35153k04945N2144
$$ -78908 -124686 72580 361442 225610 112072 225449 460523 325370 120425 172569
20800A72569q8584j45720K63369K22558M5101j96013l52238l28174J43416Q6948
$$ 172569 83985 -61735 201634 424192 469293 273280 -78958 -407132 -263716 -176768
20790a76768L3067K04747K23193j21604R3026L3524j78473k85696P4430K09785
$$ -176768 -143701 61046 284239 162635 255661 289185 110712 -174984 -100554 109231
20780A09231p3188j44000j75427J92817J35234O8430l4739K09493J25997k25405
$$ 109231 36043 -107957 -283384 -90567 44667 113097 78358 287851 413848 188443
20770A88443j0866J5745j49230r7587M01831J07433k37779K7885P6078l30131
$$ 188443 177577 193322 44092 -53495 348336 455769 217990 245875 321953 -8178
20760h178k65795J32168J98488L20174J00834p2901J04639J17742j04577j86128
$$ -8178 -273973 -141805 56683 376857 477691 404790 509429 627171 522594 336466
20750C36466J37562q1068k91031M1242P9985m2867K50375j08370J03950k01550
$$ 336466 474028 392960 101929 143171 223156 180289 430664 322294 426244 224694
20740B24694J83155k2263O2153J20834J78894n77733j46231j02176j03557j29518
$$ 224694 407849 385586 447739 568573 747467 169734 23503 -78673 -182230 -311748
20730c11748l2527K56014p864Q1527J60546l1173K07758J6512j07428l59731P7768
$$ -311748 -344275 -88261 -96125 -14598 145948 114775 322533 339045 231617 -128114 -50346
20719e0346j5732j46362n24841l2348K48303q471J06026L25479O50469n3700m39859
$$ -50346 -66078 -212440 -737281 -769629 -521326 -529797 -423771 -98292 552177 498477 58618
20708E8618j26085q8924J62161J13038m83409j24433K02699K44363K99415J2113
$$ 58618 -67467 -156391 5770 118808 -364601 -489034 -286335 -41972 257443 269556
20698B69556J29904N2872l2193j72425K15467J13272l89023j69122q7920L32867
$$ 269556 399460 452332 420139 247714 463181 576453 187430 18308 -69612 263255
20688B63255O3114k03999l941P8174l044L03850J66760r3552m82774J66152M14565
$$ 263255 326369 122370 118429 196603 193559 497409 664169 570617 87843 253995 668560
20677F68560j04659j19587J9814M3934o6943J31598m0204P0296P8182K97120m14724
$$ 668560 563901 444314 464128 508062 441119 572717 532513 602809 680991 978111 563387
20666E63387j20298o242O7000Q946n7097J07433K51730j22732q8396j54515l23031
$$ 563387 443089 436847 503847 512793 455696 563129 814859 692127 603731 449216 126185
20655A26185p4031R5876L13987K50817J90087l35549l9509K8086q3259k3100L8387
$$ 126185 52154 148030 462017 712834 902921 567372 527863 555949 472690 449590 487977
20644D87977k08768R9151N05510J30897j79702l48868J314J31499J58393m2551
$$ 487977 279209 378360 883870 1014767 835065 486197 487511 619010 777403 734852
20634G34852j83504R691Q5469K10117p2748o0487l69357o3619j20797R0833L77095
$$ 734852 551348 561039 646508 856625 783877 723390 354033 290414 169617 260450 637545
20623F37545n6226j2463k90887j40493l68139Q9214K39275K93173K16337J5837
$$ 637545 581319 568856 277969 137476 -230663 -141449 97826 390999 607336 623173
20613F23173J20977r6438k74199O2755K38818K73100M2332k26953k26297j65036
$$ 623173 744150 647712 373513 436268 675086 948186 990518 763565 537268 372232
20603C72232k56187J94394J91789J61309J91131j10392k07248k125K09864L60237
$$ 372232 116045 310439 502228 663537 854668 744276 537028 534903 744767 1105004
20593A105004L81182j2474p6081k36631m64516l1970m3835n3372K1706j18945
$$ 1105004 1486186 1473712 1397631 1161000 696484 664514 620679 567307 589013 470068
20583D70068N2521J4884J00026j22447o4469l24161L0714L66364K50041n5654
$$ 470068 522589 537473 637499 515052 450583 126422 157136 523500 773541 717887
20573G17887P5655J43979N5220k80585J74403O6250l18143j94682P3453k10832
$$ 717887 793542 937521 992741 712156 886559 952809 634666 439984 513437 302605
20563C02605n8924L21837J39373m202J0464j29270K41713Q1790N8069j44945K8704
$$ 302605 243681 565518 704891 700689 711153 581883 823596 905386 963455 818510 847214
20552H47214K50484J45201J01801N23455J3804j96774m01867j24269K93096J50710
$$ 847214 1097698 1242899 1344700 1868155 1881959 1685185 1283318 1159049 1452145 1602855
20542A602855k03081J27188m0037L34233j85262n00162l3457J11852J82203L54941
$$ 1602855 1399774 1526962 1486925 1821158 1635896 1135734 1102277 1214129 1396332 1751273
20532A751273K58214k50872l90798J03718J56951k40974N36181j13289p1051K10021
$$ 1751273 2009487 1758615 1367817 1471535 1628486 1387512 1923693 1810404 1739353 1949374
20522A949374L4156r0177q9207N8254K1723M135n8692j90438J07757N9725J27354
$$ 1949374 1983530 1893353 1804146 1862400 1884123 1888258 1829566 1639128 1746885 1806610 1933964
20511A933964J37180k63970k95989J52531J70097K98748L19763n2487k16399K46252
$$ 1933964 2071144 1807174 1511185 1663716 1833813 2132561 2452324 2399837 2183438 2429690
20501B429690N35821k75086k88230j11251J5303J26303K40772K18304L03839j18628
$$ 2429690 2965511 2690425 2402195 2290944 2306247 2432550 2673322 2891626 3195465 3076837
20491C076837P6584p0471n9529l9626L39683J39673O0045J32595j37000r3529
$$ 3076837 3153421 3082950 3023421 2983795 3323478 3463151 3523196 3655791 3518791 3425262
20481C425262J34288J29957M31667K15162l0035k22773m36688j30298M03532K82863
$$ 3425262 3559550 3689507 4121174 4336336 4306301 4083528 3646840 3516542 3920074 4202937
20471D202937M48581K56419l49188k32468P2345M51831K80408L83640M09622J06723
$$ 4202937 4651518 4907937 4558749 4326281 4398626 4850457 5130865 5514505 5924127 6030850
20461F030850J59589K79845K24947K93448J53745L38109K22943K63054M65506
$$ 6030850 6190439 6470284 6695231 6988679 7142424 7480533 7703476 7966530 8432036
20452H432036P49072M53277L97243N89666Q00855Q44118Q23013M99195L69868
$$ 8432036 9181108 9634385 10031628 10621294 11422149 12266267 13089280 13588475 13958343
20443A3958343K88117R37586J132875J379291J837292K756262L423761M413850
$$ 13958343 14246460 15184046 16316921 17696212 19533504 22289766 25713527 30127377
20435C0127377N973224Q726110J3196306J9541979K6950356L0443982K3759870
$$ 30127377 36100601 44826711 58023017 77564996 104515352 134959334 158719204
20428A58719204R495189p57107k164090O603705J6221296J4673619K903592o007084
$$ 158719204 168214393 167457286 165293196 171896901 188118197 202791816 205695408 199688324
20420A99688324m862316M404306J0032908K699459r641005j4729051j0339667
$$ 199688324 194826008 199230314 209263222 211962681 202321676 187592625 177252958
20413A77252958O26286P212319J54537j4858904k5678386k8296894k3191874j5030066
$$ 177252958 177879244 185091563 185246100 170387196 144708810 116411916 93220042 78189976
20405G8189976p314101k15926O195796J3802752K3902306L1007510K6647013J2346244
$$ 78189976 70875875 70659949 76855745 90658497 114560803 145568313 172215326 184561570
20397A84561570l14182l808441M388451J6597029J8977495O033166q064925j0181489
$$ 184561570 184247388 180438947 184827398 201424427 220401922 226435088 218370163 208188674
20389B08188674j126121Q670191O914861l719801j1230430r467657l4940R088674
$$ 208188674 207062553 215732744 222647605 218927804 207697374 198229717 198194777 207283451
20381B07283451O898067n804386j6936712j7120956p532964P874588K2014487
$$ 207283451 214181518 208377132 191440420 174319464 166786500 174661088 196675575
20374A96675575K6390444K2316620J7201226J0550243l568030j7740894k0422365
$$ 196675575 223066019 245382639 262583865 273134108 269566078 251825184 231402819
20367B31402819j1244165P705073L1594182N1832485N9191792M9645157L0725964
$$ 231402819 220158654 227863727 259457909 311290394 370482186 420127343 450853307
20360D50853307R974616j3554800l8382883n6324668n8764409m6341184k5122331
$$ 450853307 460827923 447273123 408890240 352565572 293801163 247459979 222337648
20353B22337648j259304J6930151J9391863P227605m647151j2857577k3891612
$$ 222337648 221078344 238008495 257400358 264627963 259980812 247123235 223231623
20346B23231623l5110121l9146656l6087371k8651871k0907095j4446475r890453
$$ 223231623 188121502 148974846 112887475 84235604 63328509 48882034 38991581
20339C8991581o843739n014128m382773l255025k627757k112877j865949j764484
$$ 38991581 32147842 27133714 22750941 19495916 16868159 14755282 12889333 11124849
20331A1124849j421835j231038m65765o98046r39852j155199p30484n23881p9496
$$ 11124849 9703014 8471976 8006211 7308165 6368313 5213114 4482630 3958749 3879253
20322C879253j80194q14204n05462k01630k31513k80623l98140k40564J35687
$$ 3879253 3699059 2884855 2379393 2177763 1946250 1665627 1267487 1026923 1162610
20313A162610j9038l10769k62409j45078J2958O3491m1787k05344O2881k71623
$$ 1162610 1143572 832803 570394 425316 438274 501765 459978 254634 317515 45892
20303D5892j19521k25421l3932n9945j1580J85790K97446j67990l63970p7080
$$ 45892 -73629 -299050 -332982 -392927 -404507 -218717 78729 -89261 -453231 -530311
20293e30311J44843J0798j20879L16802j69574J48895K82430k26369K84972O4297
$$ -530311 -385468 -374670 -495549 -178747 -348321 -199426 83004 -143365 141607 205904
20283B05904j37146k44449J6523L08822j61744q3424Q4750K41762j8223l74672
$$ 205904 68758 -175691 -159168 149654 -12090 -95514 -10764 230998 212775 -161897
20273a61897n3472R2599j18318j24186J25971J17220q3316k00212J92611j10757
$$ -161897 -215369 -122770 -241088 -365274 -239303 -122083 -205399 -405611 -213000 -323757
20263c23757n3783j26402r245L8149m24874Q3968M92447R3131k76176J67381J93122
$$ -323757 -377540 -503942 -513187 -475038 -899912 -815944 -323497 -230366 -506542 -339161 -146039
20252a46039O527j96219P305o5846m1402L74036J63818K46264r2879M9205J49241
$$ -146039 -139512 -335731 -328426 -394272 -435674 -61638 102180 348444 255565 304770 454011
20241D54011J5150k42385k29226k2107K6990J13700j1834K16251O5955n1179K23145
$$ 454011 469161 226776 -2450 -24557 2433 116133 104299 320550 386505 335326 558471
20230E58471j74128j12851O0730O1199k87012j45039l39468k23401M61909Q8052
$$ 558471 384343 271492 332222 393421 106409 -38630 -378098 -601499 -139590 -51538
20220e1538J28273K2568j75521k9662k21780K77341j2308l79021k71568N5176
$$ -51538 76735 99303 -76218 -105880 -327660 -50319 -62627 -441648 -713216 -658040
20210f58040J7171r1910j69271k3843J08955L15135Q9439l35227j78174l4398
$$ -658040 -640869 -732779 -902050 -925893 -816938 -501803 -412364 -747591 -925765 -960163
20200i60163j80385J57340L23040q9724p5423J00357J20794j02004p5619K03830
$$ -960163 -1140548 -983208 -660168 -749892 -825315 -724958 -604164 -706168 -781787 -577957
20190e77957L8534j77480j48797J58078J09762j09771k24370j21608p2835P0797
$$ -577957 -539423 -716903 -865700 -707622 -597860 -707631 -932001 -1053609 -1126444 -1055647
20180a055647J81602j7001j96213j77333l3969K65539K04899J29758o0970J59220
$$ -1055647 -874045 -891046 -1087259 -1264592 -1298561 -1033022 -828123 -698365 -759335 -600115
20170f00115K68863L5916m8377k22904o3861J86241j08603k79404o4990l51388
$$ -600115 -331252 -295336 -343713 -566617 -630478 -444237 -552840 -832244 -897234 -1248622
20160a248622L6589K04207J5071J60941L57319J72324j09600k75311J59253Q8736
$$ -1248622 -1212033 -1007826 -992755 -831814 -474495 -302171 -411771 -687082 -527829 -439093
20150d39093j73537j47854l57338L8982J97054M7114K38106j54022k7438K15290
$$ -439093 -612630 -760484 -1117822 -1078840 -881786 -834672 -596566 -750588 -778026 -562736
20140e62736J08701l93678L60121K82642j29458k81299R0613q2568J74299k3536
$$ -562736 -454035 -847713 -487592 -204950 -334408 -615707 -525094 -607662 -433363 -456899
20130d56899k73508j38111o2746L25689o3019k76658r3085j35266q8260r7839
$$ -456899 -730407 -868518 -931264 -605575 -668594 -945252 -1038337 -1173603 -1261863 -1359702
20120a359702j02057L7031J78033k11335J14997K72287n679N2947K52821j73921
$$ -1359702 -1461759 -1424728 -1246695 -1458030 -1343033 -1070746 -1076425 -1023478 -770657 -944578
20110i44578J5011K26834M4441j51331o7526j26272p7620J17522K10516j44611
$$ -944578 -929567 -702733 -658292 -809623 -877149 -1003421 -1081041 -963519 -753003 -897614
20100h97614k11508J57171J76206O16564J15646m05185l17641l18410J66271K68734
$$ -897614 -1109122 -951951 -775745 -159181 -43535 -448720 -766361 -1084771 -918500 -649766
20090f49766K00721j37354J7313q7531m7394J23855j6642k8622j62780k35792
$$ -649766 -449045 -586399 -569086 -656617 -704011 -580156 -596798 -625420 -788200 -1023992
20080a023992J71266M3791P9204K5482j70785j05059L71683L82180K55321J64678
$$ -1023992 -852726 -808935 -729731 -704249 -875034 -980093 -608410 -226230 29091 193769
20070A93769j81617k20499o0304K15112J63267j57250l6068J46284L97962J08091
$$ 193769 12152 -208347 -268651 -53539 109728 -47522 -83590 62694 460656 568747
20060E68747j81959l36917j36725N5284r152j41883k49541j17804O2362K03416
$$ 568747 386788 49871 -86854 -31570 -40722 -182605 -432146 -549950 -487588 -284172
20050b84172j53435j55607j2432j00119m5718J03724K68062K76953N2468k6851
$$ -284172 -437607 -593214 -605646 -705765 -751483 -647759 -379697 -102744 -50276 -77127
20040g7127j25596R8917Q5904J92589o09313o30074j36256K17244J86149K98575
$$ -77127 -202723 -103806 -17902 174687 -434626 -1064700 -1200956 -983712 -797563 -498988
20030d98988J59634J23677j38142l86969L4270N7524l13974L7799K30962p61l43685
$$ -498988 -339354 -215677 -353819 -740788 -706518 -648994 -962968 -925169 -694207 -694968 -1038653
20019a038653J98282L08368j44563j86850J97489q7813o1133N311M44632K84526
$$ -1038653 -840371 -532003 -676566 -863416 -665927 -753740 -814873 -809562 -364930 -80404
20009h0404j28238j29804j13502j19994J18121J50692K27900P7765l86189o81538
$$ -80404 -208642 -338446 -451948 -571942 -453821 -303129 -75229 2536 -383653 -1065191
19999a065191k34381l1396J71665K65315J28411Q0231o5441n6516K06254R6536
$$ -1065191 -1299572 -1330968 -1159303 -893988 -765577 -685346 -750787 -807303 -601049 -504513
19989e04513l41402m38796K68964J80433R3748l25828J20019J59471k10744n5329
$$ -504513 -845915 -1284711 -1015747 -835314 -741566 -1067394 -947375 -787904 -998648 -1053977
19979a053977J85832N71015K55827l07042k63470j91520j44647l6270K14392J27508
$$ -1053977 -868145 -297130 -41303 -348345 -611815 -803335 -947982 -984252 -769860 -642352
19969f42352q1049M44116J46265k50352k67826N7726n4M54172L90826j40777n46669
$$ -642352 -723401 -279285 -133020 -383372 -651198 -593472 -593526 -139354 251472 110695 -435974
19958d35974l79835J87418J15337N1487J32228K65031n7599O748J87476J44206
$$ -435974 -815809 -628391 -513054 -461567 -329339 -64308 -121907 -115159 72317 216523
19948B16523L77754K29566J67351L18795L95417J131850J126085J086775R54181
$$ 216523 594277 823843 991194 1309989 1705406 2837256 3963341 5050116 6004297
19939F004297O27076M22114O86194O40363N7557O3427N85655M27632M28472O98782
$$ 6004297 6631373 7053487 7739681 8380044 8437601 8501028 9086683 9514315 9942787 10641569
19929A0641569R61573L86349j55704l96277j020355r03669l78072o37759r6392
$$ 10641569 11603142 11989491 11833787 11437510 10417155 9513486 9135414 8497655 8401263
19920H401263p4380o54344p24782m35897m22520j185686j369469r95398o69092
$$ 8401263 8326883 7672539 6947757 6511860 6089340 4903654 3534185 2538787 1869695
19911A869695l34911m1519o6008J41575l41664l08839k25065j26475p5967K95383
$$ 1869695 1534784 1493265 1427257 1568832 1227168 918329 693264 566789 490822 786205
19901G86205K40921k21307j66402r887j75249k57330J04294l6777J81780L14946
$$ 786205 1027126 805819 639417 629530 454281 196951 301245 264468 446248 761194
19891G61194L17572q0130j16825k23377m10413J6819Q3589j99050K05791K49030
$$ 761194 1078766 998636 881811 658434 248021 264840 348429 149379 355170 604200
19881F04200R5083N7003K06263q044J23287m861q5924K25061K7324K6952J82213
$$ 604200 699283 756286 962549 954505 1077792 1072931 987007 1212068 1239392 1266344 1448557
19870A448557P0746l01845j07776r3498o3495J27563K04639j427j84786R7581
$$ 1448557 1519303 1217458 1109682 1016184 952689 1080252 1284891 1283464 1098678 1196259
19860A196259L09105N58064M26585o2287j264M54384N4947m4871r8587J5115K764
$$ 1196259 1505364 2063428 2490013 2427726 2426462 2880846 2935793 2890922 2792335 2807450 2810214
19849B810214J654L95859K37896j4116J36707M47685Q4061k06511l1215k53279
$$ 2810214 2811868 3207727 3445623 3431507 3568214 4015899 4099960 3893449 3862234 3608955
19839C608955m44904m3375j88821O7976K01642K15322K24541J15K08670N7217
$$ 3608955 3164051 3120676 2931855 2999831 3201473 3416795 3641336 3641451 3850121 3907338
19829C907338r9560N4074L43048r5738k89624n44539j08103L73881L58485m0742
$$ 3907338 3807778 3861852 4204900 4109162 3819538 3274999 3166896 3540777 3899262 3858520
19819C858520J44273L52982J44341k04876j50009K85145J17272j94692M5138o335
$$ 3858520 4002793 4355775 4500116 4295240 4145231 4430376 4547648 4352956 4398094 4391759
19809D391759K70358K57053J71851K15438P7766M94386N57055O61149M17310P12400
$$ 4391759 4662117 4919170 5091021 5306459 5384225 5878611 6435666 7096815 7514125 8226525
19799H226525O53800M22702Q46833J466952J352861J587478J774947J831205K668361
$$ 8226525 8880325 9303027 10149860 11616812 12969673 14557151 16332098 18163303 20831664
19790B0831664M188621N805998Q201074J1547400J6865812K2428414K3342252
$$ 20831664 25020285 30826283 39027357 50574757 67440569 89868983 113211235
19783A13211235J7946925Q410525n42042m923758k395712O173809J5307508J8359370
$$ 113211235 131158160 139568685 139026643 134102885 131707173 137880982 153188490 171547860
19775A71547860J4433859P067445J156693k389897n540495r032918j2952805j4905088
$$ 171547860 185981719 193049164 194205857 191815960 186275465 177242547 164289742 149384654
19767A49384654j2280441m193069N154223Q467540L558487o521347j6912390k2666446
$$ 149384654 137104213 132911144 138065367 146532907 150091394 143570047 126657657 103991211
19759A03991211k2354047j8578469j3788995r687096o159837m206459k938522
$$ 103991211 81637164 63058695 49269700 39582604 33422767 29216308 26277786
19752B6277786k021629j648424j212242n25338k61912n43800K26118J125039J093955
$$ 26277786 24256157 22607733 21395491 20870153 20608241 20064441 20290559 21415598 22509553
19743B2509553J277990K089597L285572N173317P526469J0778702J6682966K2716850
$$ 22509553 23787543 25877140 29162712 34336029 41862498 52641200 69324166 92041016
19735I2041016K6443297K4389763J4754439K943418n109825o567943k33596J0018824
$$ 92041016 118484313 142874076 157628515 160571933 155462108 148894165 148660569 158679393
19727A58679393J6579198J5587239J0160252N712234L195156K56420m783255j1784974
$$ 158679393 175258591 190845830 201006082 206718316 209913472 210169892 205386637 193601663
19719A93601663j7822841j7972500j1468201q63004O442406N010980l232802j3754582
$$ 193601663 175778822 157806322 146338121 145475117 151917523 156928503 153695701 139941119
19711A39941119k2130216k4614997k2573591j7488914j2487429q648844n757479
$$ 139941119 117810903 93195906 70622315 53133401 40645972 31997128 26239649
19704B6239649m003217l156026k707536k180817j624341j155330j193528j179576
$$ 26239649 22236432 19080406 16372870 14192053 12567712 11412382 10218854 9039278
19696I039278o62295p29007p18443p45014o68747m71121l84927J49345L32511
$$ 9039278 8376983 7647976 6929533 6184519 5515772 5044651 4659724 4809069 5141580
19687E141580l34001n57029k83423r5844n6510j68875l75945l69504j51531m08102
$$ 5141580 4807579 4250550 3967127 3871283 3814773 3645898 3269953 2900449 2748918 2340816
19677B340816l72659p7534J12611k34120m3635M5399J71693J27474J3424j54063
$$ 2340816 1968157 1890623 2003234 1769114 1725479 1770878 1942571 2070045 2083469 1929406
19667A929406N7510n2186o0227j49120k31065k69866l36935l56342l9682L80992
$$ 1929406 1986916 1934730 1874503 1725383 1494318 1224452 887517 531175 491493 872485
19657H72485j33023N0367K65649J1410k21125K15541N11106L53238K15795J26985
$$ 872485 739462 789829 1055478 1066888 845763 1061304 1572410 1925648 2141443 2268428
19647B268428O73314N43324M77614O87551M43566K91341L27323J2657j57895j2007
$$ 2268428 2941742 3485066 3962680 4650231 5093797 5385138 5712461 5725118 5567223 5555216
19637E555216M98901Q51726P11686M50464P52928Q44940N59121j96055o34728
$$ 5555216 6054117 6905843 7617529 8067993 8820921 9665861 10224982 10028927 9394199
19628I394199o70505j020877q22998n09732l34167K26148N51753L09376k95801
$$ 9394199 8723694 7702817 6879819 6370087 6035920 6262068 6813821 7123197 6827396
19619F827396m76017p86933m69405j050883j001158o22148p37974o76006j93278
$$ 6827396 6351379 5564446 5095041 4044158 3043000 2420852 1682878 1006872 813594
19610H13594O6060J55578N713l60747m69613k28349L1837K00240l11q6853k48433
$$ 813594 879654 1035232 1040945 680198 210585 -17764 14073 214313 214002 127149 -121284
19599a21284q5110r6392O1203j32400k325q6604m4723r5132Q3230K95773j24067
$$ -121284 -206394 -302786 -241583 -373983 -376308 -462912 -507635 -602767 -519537 -223764 -347831
19588c47831k61762j10496j682K01486M17739Q210p1701L65484J06360j26284
$$ -347831 -609593 -720089 -721771 -520285 -102546 -94336 -166037 199447 305807 179523
19578A79523l61465l1399M09583L48296k55716k95262M4787j15917l12455k6199
$$ 179523 -181942 -213341 196242 544538 288822 -6440 38347 -77570 -390025 -416224
19568d16224J2987j07581L43177K32206J32666k06854r2979J93866K92961n9949
$$ -416224 -403237 -510818 -167641 64565 197231 -9623 -102602 91264 384225 324276
19558C24276j51759l53813n47493K65710J99933J87817p2032j64929l91836j3669
$$ 324276 172517 -181296 -728789 -463079 -263146 -75329 -147361 -312290 -704126 -717795
19548g17795K03428Q8873K103K42944J12803j72473l55860j00168J55097N7759
$$ -717795 -514367 -425494 -423391 -180447 -67644 -240117 -595977 -696145 -541048 -483289
19538d83289j22578J82637k03807o60267k92540J63899J8483J19158L05863r3221
$$ -483289 -605867 -423230 -627037 -1287304 -1579844 -1415945 -1397462 -1278304 -972441 -1065662
19528a065662j28035Q9015L72508J34260P3785J84705j89698o3236L6742L80142
$$ -1065662 -1193697 -1104682 -732174 -597914 -524129 -339424 -529122 -592358 -555616 -175474
19518a75474L15241Q4723j59901j25781J52392j83064k32272j00763Q2126k9641
$$ -175474 139767 224490 64589 -61192 91200 -91864 -324136 -424899 -342773 -372414
19508c72414j48134k45596L6718l8282l3462J20992R1123K03113l3861K0846q8903
$$ -372414 -520548 -766144 -729426 -767708 -801170 -680178 -589055 -385942 -419803 -398957 -487860
19497d87860k02938J29586L30806l01568j30449Q3683Q4138o1454J43417j63763
$$ -487860 -690798 -561212 -230406 -531974 -662423 -578740 -494602 -556056 -412639 -576402
19487e76402j97578M35958M73518N1758l89275m51527j84161k85202J15124J85653
$$ -576402 -773980 -338022 135496 187254 -202021 -653548 -837709 -1122911 -1007787 -822134
19477h22134K7106l4883j55997K1651J53401K25096l3384k76863Q3495R2778N4645
$$ -822134 -795028 -829911 -985908 -964257 -810856 -585760 -619144 -896007 -812512 -719734 -665089
19466f65089N4225M31041J22776j88528j65497m2757J48848P8457l3624l2025
$$ -665089 -610864 -179823 -57047 -245575 -411072 -453829 -304981 -226524 -260148 -292173
19456b92173j45098R5249R7635L16362J88941M8672N6229J20807O9016m1290K65431
$$ -292173 -437271 -342022 -244387 71975 260916 309588 365817 486624 555640 514350 779781
19445G79781K86596k6937L5117N12011P98168N55463N67866L98122M94189K98617
$$ 779781 1066377 1039440 1074557 1586568 2384736 2940199 3508065 3906187 4400376 4698993
19435D698993q2507j68643j13952o4179M36545L10012M44092J68099k87883m0797
$$ 4698993 4616486 4447843 4333891 4269712 4706257 5016269 5460361 5628460 5340577 5299780
19425E299780j64904j63761k25046l38558j86942K26528k4313m24658n02688j19965
$$ 5299780 5134876 4971115 4746069 4407511 4220569 4447097 4422784 3998126 3495438 3375473
19415C375473m7854k75803m02508l01737j55292q5116k72812k97414J93382k29953
$$ 3375473 3327619 3051816 2649308 2347571 2192279 2107163 1834351 1536937 1730319 1500366
19405A500366j99463R98K22621J66590K44231P5676j71080j06270K66486L45590
$$ 1500366 1300903 1301901 1524522 1691112 1935343 2011019 1839939 1733669 2000155 2345745
19395B345745K46641J68075J02823M3234J92581K87993O00608L75278K94959K22290
$$ 2345745 2592386 2760461 2863284 2906518 3099099 3387092 3987700 4362978 4657937 4880227
19385D880227K79344R52304Q70268O44837R62251J312598J353181J443123K297533
$$ 4880227 5159571 6111875 6982143 7626980 8589231 9901829 11255010 12698133 14995666
19376A4995666L119814L858268N448506P851552J1436164J6700747K0495665J9707082
$$ 14995666 18115480 21973748 27422254 35273806 46709970 63410717 83906382 103613464
19368A03613464J3994148O292233L617441Q447776J8215490K6172134K4678868
$$ 103613464 117607612 123899845 127517286 135965062 154180552 180352686 205031554
19361B05031554J0895885p240856j8935846k0911221j4064954n245657k190982
$$ 205031554 215927439 208686583 189750737 168839516 154774562 149528905 147337923
19354A47337923p501300j4753938k0020039k0601729j7271909j2920327q479992
$$ 147337923 139836623 125082685 105062646 84460917 67189008 54268681 45788689
19347D5788689n275449l381201j982490n28301Q47556J620458K999670N657077
$$ 45788689 40513240 37132039 35149549 34621248 35468804 37089262 40088932 45746009
19339D5746009R627374J5644688K2446647K7798904K5935758J3273737j418893
$$ 45746009 55373383 71018071 93464718 121263622 147199380 160473117 159054224
19332A59054224q103051n003193N968026K0288962L0486070K8602960J7803691
$$ 159054224 150951173 145947980 151916006 172204968 202691038 231293998 249097689
19325B49097689R149832J719260o552551q043277P46451J7316022L4988816M3542659
$$ 249097689 258247521 259966781 253414230 245370953 246117404 263433426 298422242 341964901
19317C41964901L4217366J1838601p310568p823748Q160288K2501479J8522852
$$ 341964901 376182267 388020868 380710300 372886552 381046840 403548319 422071171
19310D22071171l703363k9468691m3697158m1284263k5853166j0888563q187397
$$ 422071171 418367808 388899117 345201959 303917696 278064530 267175967 258988570
19303B58988570j6666118k8223798l4925219l4009539k7694323j9650724j3425061
$$ 258988570 242322452 214098654 179173435 145163896 117469573 97818849 84393788
19296H4393788q875200n378152l044787j000788J543194M985992J0524525J8547543
$$ 84393788 75518588 70140436 67095649 66094861 67638055 72624047 83148572 101696115
19288A01696115K8356795L4620084K7298673Q139141q869291j3791356p252490
$$ 101696115 130052910 164672994 191971667 200110808 191241517 177450161 170197671
19281A70197671O122282K0555578K7458520K3679378J6236589R121488m522353
$$ 170197671 176319953 196875531 224334051 248013429 264250018 273371506 268849153
19274B68849153k2613247l1804712k9332612j8076478k468152R325932Q880757
$$ 268849153 246235906 214431194 185098582 167022104 164553952 173879884 182760641
19267A82760641m807912k0554597k8655665k8117550k2400591j6195180j0535843
$$ 182760641 177952729 157398132 128742467 100624917 78224326 62029146 51493303
19260E1493303o814465m930699l761625l226137k527735k366687j944125j151709
$$ 51493303 44678838 39748139 35986514 32760377 30232642 27865955 25921830 24770121
19252B4770121j43111N91815O26038M72375k84812j193492j946963j930411j307762
$$ 24770121 24627010 25218825 25844863 26317238 26032426 24838934 22891971 20961560 19653798
19243A9653798m28798J79562R34614J007405K19298l59266m59466m44660k05743
$$ 19653798 19225000 19404562 20339176 21346581 21565879 21206613 20747147 20302487 20096744
19234B0096744l3002M13991K42797K57286K15485K84857K62646J97752K82605
$$ 20096744 20063742 20477733 20720530 20977816 21193301 21478158 21740804 21938556 22221161
19225B2221161M35385R20391Q73288Q95674J297122J139062K005109L181762M238774
$$ 22221161 22656546 23576937 24450225 25345899 26643021 27782083 29787192 32968954 37207728
19216C7207728O301582R592186J5551460K4446283L3678594L5104376K1572608
$$ 37207728 43509310 53101496 68652956 93099239 126777833 161882209 183454817
19209A83454817j200981j9672448k7912347k5407048j6737324p444431K039641
$$ 183454817 182253836 162581388 134669041 109261993 92524669 85080238 87119879
19202H7119879J1541394K2461747L0719866K6600704P940670j3921129k8233704
$$ 87119879 98661273 121123020 151842886 178443590 186384260 172463131 144229427
19195A44229427l2347860k7329580j9637285j2743762q069563m633693k707366
$$ 144229427 111881567 84551987 64914702 52170940 44101377 39467684 36760318
19188C6760318k147746k407103k817957k770673k534521j857891p94513J43618
$$ 36760318 34612572 32205469 29387512 26616839 24082318 22224427 21429914 21573532
19180B1573532P20551J543397J709233J232920R85594R71747J345876J703585
$$ 21573532 22294083 23837480 25546713 26779633 27765227 28736974 30082850 31786435
19172C1786435K079891L247990N433092Q073739J2620917K0318625L0652245M0820962
$$ 31786435 33866326 37114316 42547408 50621147 63242064 83560689 114212934 155033896
19164A55033896M0948158K6674400P703287n771282j3390033j8169722k0137944
$$ 155033896 195982054 222656454 230359741 224588459 211198426 193028704 172890760
19157A72890760j8052067j0596047J434767J6156841K6794091K5325362J2206878
$$ 172890760 154838693 144242646 145677413 161834254 188628345 213953707 226160585
19150B26160585j958428j1812700j8434943k5055895k9212932k9441353k5768715
$$ 226160585 224202157 212389457 193954514 168898619 139685687 110244334 84475619
19143H4475619j9688843j3750331r555106o853822n221060l823696k557536k005034
$$ 84475619 64786776 51036445 41481339 34627517 29406457 25582761 23025225 21020191
19135B1020191j869583j612895j257344q79852o57853l37020l71910n23423o7352
$$ 21020191 19150608 17537713 16280369 15400517 14742664 14405644 14033734 13510311 13442959
19126A3442959J07938O43824M27377K57095Q34680J493814J837893L099368M809541
$$ 13442959 13550897 14194721 14622098 14879193 15713873 17207687 19045580 22144948 26954489
19117B6954489P655630J2504353J8825047K4014492K0563937P106026p904224
$$ 26954489 34610119 47114472 65939519 89954011 110517948 117623974 109719750
19110A09719750j7268370j9517440j5054863q635766k346463L908911R969505
$$ 109719750 92451380 72933940 57879077 49243311 46896848 50805759 60775264
19103F0775264J7495379K0846255J4222058o28086j3636240k0531864k0186288
$$ 60775264 78270643 99116898 113338956 112710870 99074630 78542766 58356478
19096E8356478j5686010j0739872p133705n101811l716476k403306j961349j336095
$$ 58356478 42670468 31930596 24796891 19695080 15978604 13575298 11613949 10277854
19088A0277854j483387j018151r21745n00856k28111o30122l82122Q5584j55390
$$ 10277854 8794467 7776316 6854571 6353715 6125604 5495482 5113360 5198944 5043554
19079E043554l20968m14741m98735j89568l70260k90564r4823k27925l08387k78281
$$ 5043554 4722586 4307845 3809110 3619542 3249282 2958718 2863895 2635970 2327583 2049302
19069B049302N0174r0576j43337m8279j85610j31637J82134K845R0285r5645k4449
$$ 2049302 2099476 2008900 1865563 1817284 1631674 1500037 1682171 1685016 1775301 1679656 1655207
19058A655207R0808r0210r0864j38886j41856K092j13835P1727N26J18854k94737
$$ 1655207 1746015 1655805 1564941 1426055 1284199 1286291 1172456 1244183 1244709 1363563 1068826
19047A068826q1553K43047J62839j33750J96065K78669k48825k24565k45647K91631
$$ 1068826 987273 1230320 1393159 1259409 1455474 1734143 1485318 1260753 1015106 1306737
19037A306737L51811q6573j37420j51323k46020k10522J64626j03462j56815j12963
$$ 1306737 1658548 1571975 1434555 1283232 1037212 826690 991316 887854 731039 618076
19027F18076m4107J63294n3091j87537L21381K42851K92397J12768k20475j17654
$$ 618076 573969 737263 684172 496635 818016 1060867 1353264 1466032 1245557 1127903
19017A127903k0368K35520o0064K38546J22130q4735q6740j01827k03959L217
$$ 1127903 1107535 1343055 1282991 1521537 1643667 1558932 1472192 1370365 1166406 1169623
19007A169623j62240j35285k78680j83428J16148J69357K11051j89011p3095N28443
$$ 1169623 1007383 872098 593418 409990 526138 695495 906546 717535 644440 1172883
18997A172883J46089j65941J52035M46579K15374L14021O86332P8715J01025q4544
$$ 1172883 1318972 1153031 1305066 1751645 1967019 2281040 2967372 3046087 3147112 3062568
18987C062568j32970k31777l2731J14282M6421K98637J52157J82927K10054j55465
$$ 3062568 2929598 2697821 2665090 2779372 2825793 3124430 3276587 3459514 3669568 3514103
18977C514103l83702m53258j91506n07519r1787P5338M47101L46385J83639l8044
$$ 3514103 3130401 2677143 2485637 1978118 1886331 1961669 2408770 2755155 2938794 2900750
18967B900750l77628m4194r7274l09650j52625j89883j46222O4387M2466l31115
$$ 2900750 2523122 2478928 2381654 2072004 1919379 1729496 1583274 1647661 1690127 1359012
18957A359012J62283J96494j6749l33045k34148K78182L67408j10631k59224m57161
$$ 1359012 1521295 1717789 1701040 1367995 1133847 1412029 1779437 1668806 1409582 952421
18947I52421l4922L63536J99653M80981O46517M60401K10952l17597r5731j73213
$$ 952421 917499 1281035 1480688 1961669 2608186 3068587 3279539 2961942 2866211 2692998
18937B692998k18884m6741J1184K93294M31868L73024K11783j31630o4228n52719
$$ 2692998 2474114 2427373 2438557 2731851 3163719 3536743 3748526 3616896 3552668 2999949
18927B999949q55829l81214P4524K2279K13460L58472J02583p4580k16499l46903
$$ 2999949 2144120 1762906 1837430 1859709 2073169 2431641 2534224 2459644 2243145 1896242
18917A896242m01589j95443j76751k94167p40964j22875r6580J93978O4483p405
$$ 1896242 1494653 1299210 1122459 828292 87328 -35547 -132127 61851 126334 118929
18907A18929p3542K1954K1013J17330l37984K14638K1329M10143L58865j458k80909
$$ 118929 45387 67341 88354 205684 -132300 82338 103667 513810 872675 871217 590308
18896E90308J33387K70192k83556Q4824K35291r8098k70245r0891q571N3298J27288
$$ 590308 723695 993887 710331 795155 1030446 932348 662103 571212 562641 615939 743227
18885G43227P7991j7744k51751l40269R6081Q9215j45281j08826O0705l3525L08873
$$ 743227 821218 803474 551723 211454 307535 396750 251469 142643 203348 169823 478696
18874D78696j00480j73481j02520J25316L85928J35096L27914J73477p3403K0985
$$ 478696 378216 204735 102215 227531 613459 748555 1076469 1249946 1176543 1197528
18864A197528K491J78935q9931l21003j59677R0933N9999m8177j63184l49903
$$ 1197528 1200019 1378954 1289023 968020 808343 899276 959275 911098 747914 398011
18854C98011q5213K24502L0432k13314J49018O8809p2669M53461L05403J21813
$$ 398011 312798 537300 567732 354418 503436 572245 499576 953037 1258440 1380253
18844A380253J3677k11098j97224J92132L0807K52165K19592J29839j54318m54322
$$ 1380253 1393930 1182832 985608 1177740 1208547 1460712 1680304 1810143 1655825 1201503
18834A201503k23821o1501k58795l2209k72744J42283J05153J1776k9908k01504
$$ 1201503 977682 916181 657386 625177 352433 494716 599869 611645 581737 380233
18824C80233p3652n1783P3146K77396K82939J35413J31969l8906j12897j43510
$$ 380233 306581 254798 327944 605340 888279 1023692 1155661 1116755 1003858 860348
18814H60348k65701j61689k32337l3845K45275L10893j73305j98538Q0963Q6823
$$ 860348 594647 432958 200621 166776 412051 722944 549639 351101 432064 518887
18804E18887J61898L53002K8541j43297j69047k46176m6285K07227n8108j28740
$$ 518887 680785 1033787 1062328 919031 749984 503808 457523 664750 606642 477902
18794D77902L60942K57754l5948J872K81439K04216K0039l5660o2887q1505P6850
$$ 477902 838844 1096598 1060650 1062522 1343961 1548177 1568216 1532556 1469669 1388164 1465014
18783A465014k05862l5483K75981K42875L06172K6694p7422J30308N61481L03984
$$ 1465014 1259152 1223669 1499650 1742525 2048697 2075391 1997969 2128277 2689758 2993742
18773B993742l6933K21253K39823M78140J63908m16319l94487m27843k49714K66685
$$ 2993742 2956809 3178062 3417885 3896025 4059933 3643614 3249127 2821284 2571570 2838255
18763B838255k3863J91184J75945k99759j82873j06766m22395l52536j05910J32225
$$ 2838255 2814392 3005576 3181521 2881762 2698889 2592123 2169728 1817192 1711282 1843507
18753A843507L8290K68389P3833N1561N02088M97196M34822N27695N32130M04201
$$ 1843507 1881797 2150186 2224019 2275580 2777668 3274864 3709686 4237381 4769511 5173712
18743E173712j7981K76865K88519Q0404j81822M32005R06306R16982J350920J377032
$$ 5173712 5155731 5432596 5721115 5801519 5619697 6051702 6958008 7874990 9225910 10602942
18733A0602942J881765K631886K895384L784526N444213Q114246J1806010J8022870
$$ 10602942 12484707 15116593 18011977 21796503 27240716 35354962 47160972 65183842
18725F5183842K6207452L5024238L9454350L5101992K5458927J3480864j530112
$$ 65183842 91391294 126415532 165869882 200971874 226430801 239911665 238381553
18718B38381553j7231135k9151571l5050243l4795400k9350039k1799443j5545632
$$ 238381553 221150418 191998847 156948604 122153204 92803165 71003722 55458090
18711E5458090j1008740q116127n919830m693714l611690k893919j948419j392162
$$ 55458090 44449350 36333223 30413393 25719679 22107989 19214070 17265651 15873489
18703A5873489j074906p16383o45681j69796M59217J081767P96731P11659M32104
$$ 15873489 14798583 14082200 13436519 13266723 13725940 14807707 15604438 16316097 16748201
18694A6748201l00632m09033m34275l02816l36039j75970L53887R43654J375843
$$ 16748201 16447569 16038536 15604261 15301445 14965406 14789436 15143323 16086977 17462820
18685A7462820J924654K849654L879346M813954O703778R318626J3546203J9780216
$$ 17462820 19387474 22237128 26116474 30930428 37634206 46952832 60499035 80279251
18677H0279251K9774966M4492175O0610327O9911331O4092364M7523657K6451645
$$ 80279251 110054217 154546392 215156719 285068050 349160414 396684071 423135716
18670D23135716N43180k8126258n1324257o3657210o3057076n3086893l9742782
$$ 423135716 423678896 395552638 344228381 280571171 217514095 164427202 124684420
18663A24684420k8132871j9954766j4484771j0820869q763347o934315m754110
$$ 124684420 96551549 76596783 62112012 51291143 42527796 35593481 30839371
18656C0839371l861646k938184k224882j658598j033353l82457J02157R8186K40961
$$ 30839371 26977725 24039541 21814659 20156061 19122708 18740251 18842408 18940594 19181555
18647A9181555k0189m03725o83830j085212j230168j279407j092390p16479j85171
$$ 19181555 19161366 18757641 18073811 16988599 15758431 14479024 13386634 12670155 12484984
18638A2484984N4676K49035P23538J365025J846002J908334K553216M202771O227760
$$ 12484984 12539660 12788695 13512233 14877258 16723260 18631594 21184810 25387581 31615341
18629C1615341Q548814J2932082K0013438K7208125L1020755K8293298K1307502
$$ 31615341 40164155 53096237 73109675 100317800 131338555 159631853 180939355
18622A80939355J2033220N99047j2606215k3577817k9105625k9399544k4899695
$$ 180939355 192972575 193571622 180965407 157387590 128281965 98882421 73982726
18615G3982726j8366289j2702009q872735o366013m653992l475730k618814k089236
$$ 73982726 55616437 42914428 34041693 27675680 23021688 19545958 16927144 14837908
18607A4837908j845379j353126j227508q37177n11091o84844l81841J86518j71707
$$ 14837908 12992529 11639403 10411895 9574718 9063627 8378783 7996942 8183460 8011753
18598H011753l46859j14699j88013k93268p31932o33974k87850j88723l29178
$$ 8011753 7664894 7550195 7362182 7068914 6336982 5703008 5415158 5226435 4897257
18589D897257n26515k81163j24477j73901j20724K4980j25104l69303l53589r8390
$$ 4897257 4370742 4089579 3965102 3791201 3670477 3695457 3570353 3201050 2847461 2749071
18579B749071j40512k4629K9684M21084k03353j71658k80730j14138k3358k00405
$$ 2749071 2608559 2583930 2613614 3034698 2831345 2659687 2378957 2264819 2241461 2041056
18569B041056j77884l00176j32319n4339N6940J49819m5962J54371j89799k48622
$$ 2041056 1863172 1562996 1430677 1376338 1433278 1583097 1537135 1691506 1501707 1253085
18559A253085r7657J51570N83579N8254k74507p7445j25814k2043k48381O1086
$$ 1253085 1155428 1306998 1890577 1948831 1674324 1596879 1471065 1449022 1200641 1261727
18549A261727p9728l43553J8360K89193J43746j96176k83715l18175n8583j38594
$$ 1261727 1181999 838446 856806 1145999 1289745 1093569 809854 491679 433096 294502
18539B94502K01872M23992L86902j4012L92771K08686J62475M60531K15005P72015
$$ 294502 496374 920366 1307268 1293256 1686027 1894713 2057188 2517719 2732724 3504739
18529C504739M03808J8226k57826K02617N83871J54991p52519n23540m33573p03862
$$ 3504739 3908547 3926773 3668947 3871564 4455435 4610426 3857907 3334367 2900794 2196932
18519B196932k58439Q7031J53084O030r9541k38733l45997j33678k57295N1774
$$ 2196932 1938493 2025524 2178608 2184638 2085097 1846364 1500367 1366689 1109394 1161168
18509A161168j69846n34048j12565N4819N24565N55628L18841l74103k57017q8940
$$ 1161168 991322 457274 344709 399528 924093 1479721 1798562 1424459 1167442 1078502
18499A078502L62260K64928k89291k83618n3173p7965l5018j10256K38940M72834
$$ 1078502 1440762 1705690 1416399 1132781 1079608 1001643 966625 856369 1095309 1568143
18489A568143J04835L92760M03358O47155M11972k65788l89923n7327Q3252N41206
$$ 1568143 1672978 2065738 2469096 3116251 3528223 3262435 2872512 2815185 2898437 3439643
18479C439643J018572J002173J85850k30447j3433k84748n99954p22540p07275
$$ 3439643 4458215 5460388 5646238 5415791 5402358 5117610 4517656 3795116 3087841
18470C087841j81521n5060L39045L09524O38750P09365O17038Q38150M31902K70348
$$ 3087841 2906320 2851260 3190305 3499829 4138579 4847944 5464982 6303132 6735034 7005382
18460G005382l62178o65809r77484q06645o41323n46637l35067l77140j96251
$$ 7005382 6643204 5977395 4999911 4193266 3551943 3005306 2670239 2293099 2096848
18451B096848m97894m51610k00709j90253J70956O5050l50437O8670p3033o5741
$$ 2096848 1598954 1147344 946635 756382 927338 992388 641951 710621 637588 571847
18441E71847J08802K33925Q3249K71730k04178p8701L31764K78577N20738O636
$$ 571847 680649 914574 997823 1269553 1065375 986674 1318438 1597015 2117753 2124389
18431B124389N942O3564k93497Q1658L64245p6707p6185J92169n4937K72936P76863
$$ 2124389 2130331 2193895 1900398 1982056 2346301 2269594 2193409 2385578 2330641 2603577 3380440
18420C380440P48610P47817O77161J097403J132307J038658P57202K66333k2178
$$ 3380440 4129050 4876867 5554028 6651431 7783738 8822396 9579598 9845931 9823753
18411I823753o70501j086668j032110j177949j076181j269453n80426j90309k04134
$$ 9823753 9153252 8066584 7034474 5856525 4780344 3510891 2930465 2740156 2536022
18402B536022K19458J38582J3077K1478K09750P0742L61295M89649M25669J18357
$$ 2536022 2755480 2894062 2907139 2928617 3138367 3209109 3570404 4060053 4485722 4604079
18392D604079N95126Q56771J141229J800959K215996K941510L871134O039328
$$ 4604079 5199205 6055976 7197205 8998164 11214160 14155670 18026804 24066132
18384B4066132R275251J4345302K2074496L0201772L1605646K1867181M957437
$$ 24066132 33341383 47686685 69761181 99962953 131568599 153435780 158393217
18377A58393217q832749j2970948o376654O796189J7625794J6494108J744856
$$ 158393217 149560468 136589520 130212866 137009055 154634849 171128957 172873813
18370A72873813j5679830k6691512k8943401k4036309j7431124j2283982q033934
$$ 172873813 157193983 130502471 101559070 77522761 60091637 47807655 39773721
18363C9773721n262762m134038k972678j599218n74261J67382J280760K886526
$$ 39773721 34510959 30376921 27404243 25805025 25230764 25398146 26678906 29565432
18355B9565432M506876P245348J1893853J8362848K5593709K8126111K2543565
$$ 29565432 34072308 41317656 53211509 71574357 97168066 125294177 147837742
18348A47837742R247624m214966j0470860o727130M120221J5152668J7358199
$$ 147837742 157085366 152870400 142399540 135672410 139792631 154945299 172303498
18341A72303498O543560r635897k0638642k2801943j6663813m674226Q131617
$$ 172303498 178847058 169211161 148572519 125770576 109106763 104432537 112564154
18334A12564154J8289706K0397016J1732648j294614j1307915j2840655n962299
$$ 112564154 130853860 151250876 162983524 161688910 150380995 137540340 131578041
18327A31578041M511730J1245811P924241m306740j6689483k3579282k3961563
$$ 131578041 136089771 147335582 155259823 150953083 134263600 110684318 86722755
18320H6722755j9556081j4523250r955691o751714m562997l137862k273069j261083
$$ 86722755 67166674 52643424 42687733 35936019 31373022 28235160 25962091 24701008
18312B4701008n59668k3507Q85036K309094M048644P061268J1429924J7962538
$$ 24701008 24141340 24117833 25002869 27311963 31360607 38421875 49851799 67814337
18304F7814337K5589710K8005305K0489658N724423p122351j2446837p650761
$$ 67814337 93404047 121409352 141899010 147623433 140501082 128054245 120403484
18297A20403484K886155J2202958J2494105J361563j3567979k3395074k5615410
$$ 120403484 123289639 135492597 147986702 149348265 135780286 112385212 86769802
18290H6769802k1965968j5719590j0759753p233366m858105l367483k054156k018165
$$ 86769802 64803834 49084244 38324491 31091125 26233020 22865537 20811381 18793216
18282A8793216j692353j183682j170722j579218j370470r69165j139179q96441
$$ 18793216 17100863 15917181 14746459 13167241 11796771 10827606 9688427 8791986
18274H791986k30176n30737q30484p52602k88719j98379j58660m80634l47337
$$ 8791986 8561810 8031073 7200589 6447987 6159268 5960889 5802229 5321595 4974258
18265D974258j31552j13439j11575l50397k23217j64152J08220k63075K08906
$$ 4974258 4842706 4729267 4617692 4267295 4044078 3879926 3988146 3725071 3933977
18256C933977P0617k17239Q6392K5358j82543k14230K25429J0445j95574J49166
$$ 3933977 4004594 3787355 3873747 3899105 3716562 3502332 3727761 3738206 3542632 3691798
18246C691798K9909j30909P8683j09518M36825L24977M23128N51981M17587M22242
$$ 3691798 3721707 3590798 3669481 3559963 3996788 4321765 4744893 5296874 5714461 6136703
18236F136703N96316L84115K88789k14649m79217n15206o71445o18116j85175
$$ 6136703 6733019 7117134 7405923 7191274 6712057 6196851 5525406 4907290 4722115
18227D722115n55490m90183l42096n04931P533K54802R4399o1090k88498l09631
$$ 4722115 4166625 3676442 3334346 2829415 2836948 3091750 3186149 3125059 2836561 2526930
18217B526930J77234o8148j27967K0722j27026j15111O1334N18669k57111o9242
$$ 2526930 2704164 2636016 2508049 2528771 2401745 2286634 2347968 2866637 2609526 2540284
18207B540284n1389n956L42135k24684P9532K03594k01818j96463m39070l65714
$$ 2540284 2488895 2482939 2825074 2600390 2679922 2883516 2681698 2485235 2046165 1680451
18197A680451M08306N39817J06960k68854k37852j9644O28551P57529K61275K21763
$$ 1680451 2088757 2628574 2735534 2466680 2228828 2209184 2837735 3595264 3856539 4078302
18187D078302K74283j48433m2612k45683j08656l8325o51625p79618m50161n7640
$$ 4078302 4352585 4204152 4161540 3915857 3807201 3768876 3117251 2337633 1887472 1829832
18177A829832K25338r4129o7426j66907j6137J17047q6444l56538J1353k5534
$$ 1829832 2055170 1961041 1893615 1726708 1710571 1827618 1741174 1384636 1395989 1370455
18167A370455o1680L79968J12932L4543m4224L4600K63607M30231L86084O9589
$$ 1370455 1308775 1688743 1801675 1836218 1791994 1826594 2090201 2520432 2906516 2976105
18157B976105j60744N10346L1995m4470M0685k65096k92653k39682L9619m04030
$$ 2976105 2815361 3325707 3357702 3313232 3353917 3088821 2796168 2556486 2596105 2192075
18147B192075n81925m5139J30760p3074M4492l28465p271K83401L2537l7531j47016
$$ 2192075 1610150 1565011 1695771 1622697 1667189 1338724 1331453 1614854 1647391 1609860 1462844
18136A462844l57228q2814J58708k85932L01194J69951j59891l17302n6842J81188
$$ 1462844 1105616 1022802 1181510 895578 1196772 1366723 1206832 889530 832688 1013876
18126A013876J34909p491j95115k85939L56883L91344J92280m32801k50953j61117
$$ 1013876 1148785 1141294 946179 660240 1017123 1408467 1600747 1167946 916993 755876
18116G55876n4703Q8425J72758K02927J58116L36811J23232j63344K85255L16838
$$ 755876 701173 789598 962356 1165283 1323399 1660210 1783442 1620098 1905353 2222191
18106B222191m10055l76533m69955K1825j56829k1689l2947J4395J40474p2628
$$ 2222191 1812136 1435603 965648 987473 830644 808955 776008 790403 930877 858249
18096H58249K96568k9357r1195P1382j78371k31620j31421l516K5413K18539J80786
$$ 858249 1154817 1125460 1034265 1105647 927276 695656 564235 560719 586132 804671 985457
18085I85457l03572p4473m9233l96459J0217P3224Q3658j78161L53045J73901
$$ 985457 681885 607412 558179 161720 171937 245161 328819 150658 503703 677604
18075F77604j32997N9955j42265O9972O6014K47651M9623j98889k52505j86496
$$ 677604 544607 604562 462297 532269 598283 845934 895557 696668 444163 257667
18065B57667K63010L02584l99137j36280N4834J54581K48579J77646j39133j94854
$$ 257667 520677 823261 424124 287844 342678 497259 745838 923484 784351 589497
18055E89497K21801K1431O3698k77400k65872j99330K406K97258R8951q9895l1690
$$ 589497 811298 832729 896427 619027 353155 153825 156231 453489 552440 462545 430855
18044D30855k02783n7044L21858K05320p7729K6316N3290J67138j07708l32533
$$ 430855 228072 171028 492886 698206 620477 646793 700083 867221 759513 426980
18034D26980j92638J17615K1202L9095K84081J51244J63811M579J54584k13190
$$ 426980 234342 351957 373159 412254 696335 847579 1011390 1015969 1170553 957363
18024I57363j75943K95487k19777k6884J41569l52034k96339j40180K9109K46925
$$ 957363 781420 1076907 857130 830246 971815 619781 323442 183262 212371 459296
18014D59296K34210K28754j0393N6985j78301j90290J96062K96923k36790k97876
$$ 459296 693506 922260 911867 968852 790551 600261 796323 1093246 856456 558580
18004E58580j64876k95934K0355K39183n7494l59049L1656J07944j1111k98567
$$ 558580 393704 97770 118125 357308 299814 -59235 -27579 80365 69254 -229313
17994b29313q3816r9360J09542L4711K9407J08241L39382K3196J81867L0211j10197
$$ -229313 -313129 -412489 -302947 -268236 -238829 -130588 208794 231990 413857 444068 333871
17983C33871P8334O7715J41877J18100J77781j30271J9659M4372j40132k75517
$$ 333871 412205 479920 621797 739897 917678 787407 807066 851438 711306 435789
17973D35789k2166j51388P4137K53833Q8476j67667k15439J19715P0944l20923
$$ 435789 413623 262235 336372 590205 678681 511014 295575 415290 486234 165311
17963A65311Q6751J33397L4939k19549o3910M04933M90834k5650k00883m7631
$$ 165311 252062 385459 420398 200849 136939 541872 1032706 1007056 806173 758542
17953G58542j86989k24140j56540J15079O7940n1019K812K03833k96241j82239
$$ 758542 571553 347413 190873 305952 373892 322873 325685 529518 233277 51038
17943E1038P9951J68961J24749J08084m1172k8937j37964j2285J31227P8972R8447
$$ 51038 130989 299950 424699 532783 491611 462674 324710 312425 443652 522624 621071
17932F21071j1686M7751o9495k18596m44840p5295j68067p1084j12954R3388K14599
$$ 621071 609385 657136 587641 369045 -75795 -151090 -319157 -390241 -503195 -409807 -195208
17921a95208K05810J85450j41743j43767j9403L22749o213K17151J23018P0572
$$ -195208 10602 196052 54309 -89458 -108861 213888 207675 424826 547844 618416
17911F18416l22397q8972K51433K43023n9141N4875k52348j41624J31258J16051
$$ 618416 296019 207047 458480 701503 642362 697237 444889 303265 434523 550574
17901E50574n47896j98137l47437L41520K68188L94062J34857q7569Q6357l21274
$$ 550574 2678 -195459 -542896 -201376 66812 460874 595731 508162 594519 273245
17891B73245m81199j21029L34722L44057k78705J03316J99390l23447M797K45933
$$ 273245 -207954 -328983 5739 349796 71091 174407 373797 50350 55147 301080
17881C01080L7611l58549j92187j06386m9326J11764j73527O9735l0450p0087
$$ 301080 338691 -19858 -212045 -318431 -367757 -255993 -429520 -359785 -390235 -460322
17871d60322K95260R6557P704L04963K17428l17202k98938J04124K17568K15341
$$ -460322 -165062 -68505 -60801 244162 461590 144388 -154550 -50426 167142 382483
17861C82483J12182N566J73440N7743N6761j9541O8364j56623n8445k46206N2496
$$ 382483 494665 500231 673671 731414 788175 768634 836998 680375 621930 375724 428220
17850D28220O4643j21792r3970K63302L75046j25139k52206m55312j58910J25239
$$ 428220 492863 371071 277101 540403 915449 790310 538104 82792 -76118 49121
17840D9121J21340J97415L1402k20609j88757m8335m8929L15348j4542j59864
$$ 49121 170461 367876 399278 178669 -10088 -58423 -107352 207996 193454 33590
17830C3590N5737J60855L18052N2854k95929k70852l1222O2027J4696L22661K25434
$$ 33590 89327 250182 568234 621088 325159 54307 23085 85112 99808 422469 647903
17819F47903l8622j40674N2180K33805J56276j98753l09331k43852j29193K0444
$$ 647903 609281 468607 520787 754592 910868 712115 402784 158932 29739 50183
17809E0183j27687J68257J91662J17576L32932N58770k32365k21760M171j69321
$$ 50183 -77504 90753 282415 399991 732923 1291693 1059328 837568 841739 672418
17799F72418J39688M6890k1211L6991J16372j51219j99100j69406J44228Q7181
$$ 672418 812106 858996 837785 874776 991148 839929 640829 471423 615651 702832
17789G02832k82127j28843l50943q4982j16553J40024Q4060P1511L62650N88769
$$ 702832 420705 291862 -59081 -144063 -260616 -120592 -36532 34979 397629 986398
17779I86398j17974m42984k6873L54458j0509j78775l11552o4766L91498j27722
$$ 986398 868424 425440 398567 753025 742516 563741 252189 187423 578921 451199
17769D51199J19358K2740J29618p3412k3393j140K6410m20385l35708J7378m1729
$$ 451199 570557 593297 722915 649503 626110 624970 651380 230995 -104713 -87335 -129064
17758a29064J41037k69308J5269J13845k04382k52112k3465j83361j00415M7851
$$ -129064 11973 -257335 -242066 -128221 -332603 -584715 -608180 -791541 -891956 -844105
17748h44105P346j2188O1569M78222K93197J3437N56138M16214r8805k87538l34518
$$ -844105 -836759 -848947 -787378 -309156 -15959 -2522 553616 969830 871025 583487 248969
17737B48969k51622j40062k74032k254Q9789J2756K23551r1568L61541L2785k17353
$$ 248969 -2653 -142715 -416747 -419001 -329212 -316456 -92905 -184473 177068 209853 -7500
17726g500j9945K96506j00138k00287j6203j24747J35064m6579l3838J28991K42294
$$ -7500 -27445 269061 168923 -31364 -47567 -172314 -37250 -83829 -117667 11324 253618
17715B53618L74097l16428l55760J52324J14209k52473j04256L00823L40700j25007
$$ 253618 627715 311287 -44473 107851 222060 -30413 -134669 166154 506854 381847
17705C81847k15639j86571q0715j27875m58584R1506L27307J12514L4546P7975
$$ 381847 166208 -20363 -101078 -228953 -687537 -596031 -268724 -156210 -121664 -43689
17695d3689J52192J84167l63733j08416J48872n539j79802k4174K23074k4744
$$ -43689 108503 292670 -71063 -179479 -30607 -36146 -215948 -240122 -17048 -41792
17685d1792n8264L28516l0831K2536Q6935n5688k35608l61229K23993K86986J47561
$$ -41792 -100056 228460 197629 220165 307100 251412 15804 -345425 -121432 165554 313115
17674C13115Q3137j13229n6659m21973j96194k1086K59100J51029O5565l1593
$$ 313115 396252 283023 226364 -195609 -391803 -412889 -153789 -2760 62805 31212
17664C1212n1090R7854k2560J86736J15280J39800n0493j16490l37422O7598L2738
$$ 31212 -19878 77976 55416 242152 357432 497232 446739 330249 -7173 60425 93163
17653I3163J08619O5210j25702J56030J05376j1599j16122o3443J0280k46305
$$ 93163 201782 266992 141290 297320 402696 391097 274975 211532 221812 -24493
17643b4493k59370L72859Q9829m0267k0823K7891k80421m9934J72246Q0926j85309
$$ -24493 -283863 88996 178825 138558 117735 145626 -134795 -184729 -12483 68443 -116866
17632a16866k17667o7131K44701K3439J34563K49870l1035k88990j98561k06363
$$ -116866 -334533 -401664 -156963 -133524 1039 250909 219874 -69116 -267677 -474040
17622d74040m2749J48335J02531o8844K42503k85757J80185m3282K57262K59938
$$ -474040 -516789 -368454 -265923 -334767 -92264 -378021 -197836 -241118 16144 276082
17612B76082j10764k32079k0123j45090j25410M096j15268P2099L12599j07392
$$ 276082 165318 -66761 -86884 -231974 -357384 -353288 -468556 -396457 -83858 -191250
17602a91250K21849K98371j62490j61880k31938k28143J72468L36822j17348j80998
$$ -191250 30599 328970 166480 4600 -227338 -455481 -283013 53809 -63539 -244537
17592b44537k8990P4286j18770J28862K0628Q4908J2211K49836K64379K04545
$$ -244537 -273527 -199241 -318011 -189149 -168521 -83613 -71402 178434 442813 647358
17582F47358j35403k1135M103J573J34548k85079n26309P8784J0226J52954P4903
$$ 647358 511955 490820 494923 496496 631044 345965 -180344 -101560 -91334 61620 136523
17571A36523K60666J36223J12120N6213j81409q7m08852p9355l75279j22902j2024
$$ 136523 397189 533412 645532 701745 520336 520249 111397 32042 -343237 -466139 -478163
17560d78163L60581K9942r4581k12251J0489J15830k84500j30816n8044J04642
$$ -478163 -117582 -87640 -182221 -394472 -383983 -268153 -552653 -683469 -741513 -636871
17550f36871M71409J45348k75275p6809K04787J89692j06822m10476n2951J60092
$$ -636871 -165462 -20114 -295389 -372198 -167411 22281 -84541 -495017 -547968 -387876
17540c87876J590N0979R4775n244K14189j62414r9126m4704q3851J94641l40970
$$ -387876 -386286 -335307 -240532 -245776 -31587 -194001 -293127 -337831 -421682 -227041 -568011
17529e68011r5544R3407j48283K43848L84632J03660j0222J4092n5224j88135
$$ -568011 -663555 -570148 -718431 -474583 -89951 13709 3487 17579 -37645 -225780
17519b25780k54300m0715K14087J57672J98734j42663m565k2299J02056J57036
$$ -225780 -480080 -520795 -306708 -149036 49698 -92965 -97530 -119829 -17773 139263
17509A39263K48157j4351Q3628M124j61622l3774K80083P2769k66346k75105K35982
$$ 139263 387420 373069 456697 460821 299199 265425 545508 618277 351931 76826 312808
17498C12808P2488k93841J43461J7551l62236j88890n8146O6158n6641r3368o3156
$$ 312808 385296 91455 234916 252467 -109769 -298659 -356805 -290647 -347288 -440656 -503812
17487e03812L23740k546j46826L2603J69820N7134J944O9233l32291k22282K31418
$$ -503812 -180072 -182618 -329444 -296841 -127021 -69887 -67943 1290 -331001 -553283 -321865
17476c21865q2360J33092R6817M428J7230N3796L6903j38023j13415l3523r5112
$$ -321865 -404225 -271133 -174316 -169888 -152658 -98862 -61959 -199982 -313397 -346920 -442032
17465d42032J04402r498k91136k54729K71572l0157K73882J44777k8139j89321
$$ -442032 -337630 -347128 -638264 -892993 -621421 -651578 -377696 -232919 -261058 -450379
17455d50379j38277J06877J45765q169R7289r1791k13677j34103K77864O5247
$$ -450379 -588656 -481779 -336014 -344183 -246894 -338685 -552362 -686465 -408601 -343354
17445c43354J19908r355M27628Q1370M8941j43025l35147O2394J90033k46859
$$ -343354 -223446 -232801 194827 276197 325138 182113 -153034 -90640 99393 -147466
17435a47466k21505l20797k5170O30987K81273l27841R6333J4209L9258J24219
$$ -147466 -368971 -689768 -714938 -83951 197322 -130519 -34186 -19977 19281 143500
17425A43500K60165k78505o9960Q7355j05755M8976j02996r1813J8504O6956J14347
$$ 143500 403665 125160 55200 142555 36800 85776 -17220 -109033 -90529 -23573 90774
17414I0774j453n8621j37598n26638m243M82161K43779P3400l1679J67859j19163
$$ 90774 89321 30700 -106898 -633536 -637779 -155618 88161 161561 129882 297741 178578
17403A78578N5388l41353K652P0860j89703J19718q0013m4145Q6381J72189P1781
$$ 178578 233966 -107387 -104735 -33875 -223578 -103860 -183873 -228018 -141637 30552 102333
17392A02333K1366n2576l11627n50125k50469M07470O4617K5263Q6876K19285
$$ 102333 123699 71123 -240504 -790629 -1041098 -633628 -569011 -543748 -456872 -237587
17382b37587p33j81966j8826J78577l8892K70107N8541j07423j22337j43402J08256
$$ -237587 -238320 -420286 -439112 -260535 -299427 -29320 29221 -78202 -200539 -343941 -235685
17371b35685J88900J38597O8675k3570k99073k38910k1991J79300p3276Q2285
$$ -235685 -46785 91812 160487 136917 -162156 -401066 -423057 -243757 -317033 -234748
17361b34748L09778K18420J20468k57400l9630j60479l23165r9927J7099J52668
$$ -234748 75030 293450 413918 156518 116888 -43591 -366756 -466683 -449584 -296916
17351b96916j75889o2003P7903j3709M8957O0031M96694K05661J2704k60695k74011
$$ -296916 -472805 -534808 -456905 -470614 -421657 -361626 135068 340729 353433 92738 -181273
17340a81273p0423L01089j6946q7836J49512J57075L2798l09473K2445k43344
$$ -181273 -251696 49393 32447 -55389 94123 251198 283996 -25477 -3032 -246376
17330b46376k3014J8179J86671K71132L62629l13424j52495l58007K97216Q5269
$$ -246376 -269390 -251211 -64540 206592 569221 255797 103302 -254705 42511 127780
17320A27780N6701L79397N1061m67027l5850l7259k86760O5646O3887k56101k60875
$$ 127780 184481 563878 614939 147912 112062 74803 -211957 -146311 -82424 -338525 -599400
17309e99400J59250j08076n9122P5558K95345J27984K0747j98078R3468O0105
$$ -599400 -440150 -548226 -607348 -531790 -236445 -108461 -87714 -285792 -192324 -132219
17299a32219r3838N6197j33777J34692L00246m7844j28543n5854Q9699j19831
$$ -132219 -226057 -169860 -303637 -168945 131301 83457 -45086 -100940 -11241 -131072
17289a31072K48426J52911k04604k48643K44660l1100r6939J40897K12415L1013
$$ -131072 117354 270265 65661 -182982 61678 30578 -66361 74536 286951 317964
17279C17964r8923j01439k70831o1500M91275l3406l17528k86971N701j96719
$$ 317964 219041 117602 -153229 -214729 276546 243140 -74388 -361359 -355658 -552377
17269e52377k0900m8174L8514J25145L29695K85973L35013l3326j32524m51061
$$ -552377 -573277 -621451 -582937 -457792 -128097 157876 492889 459563 327039 -124022
17259a24022r1557K27238j26408j84438k8174M5583J46824J6968j0048k1477J23403
$$ -124022 -215579 11659 -114749 -299187 -327361 -281778 -134954 -117986 -128034 -149511 -26108
17248b6108k39620k47951L97348N48527O2886k79658j14621j55968k33972K38876
$$ -26108 -265728 -513679 -116331 432196 495082 215424 100803 -55165 -289137 -50261
17238e0261K36478N572k60077j21561N930K28683J42450k5302o4731L2687J07810
$$ -50261 186217 191789 -68288 -189849 -183919 44764 187214 161912 97181 129868 237678
17227B37678J03772m76781o6354n7074l3604j29513O8358j48208j5745P4111P6937
$$ 237678 341450 -135331 -201685 -258759 -292363 -421876 -353518 -501726 -517471 -443360 -366423
17216c66423J95613K32271J00992R2580m1763k78272l07931P0898L72613n9667
$$ -366423 -170810 61461 162453 255033 213270 -65002 -372933 -302035 70578 10911
17206A0911k61827q4672m8587K66062J09383k05388N4030L4457l9337l9538n41318
$$ 10911 -250916 -335588 -384175 -118113 -8730 -214118 -160088 -125631 -164968 -204506 -745824
17195g45824L6079K31901n3558K74843M35883j95152j55673J52470N1969k55693
$$ -745824 -709745 -477844 -531402 -256559 179324 -15828 -171501 -19031 32938 -222755
17185b22755M0556J10093Q6378j1395O2763Q7474k78282J8730j89825r2802J70303
$$ -222755 -182199 -72106 14272 2877 65640 153114 -125168 -106438 -296263 -389065 -218762
17174b18762p1964j07120J97727Q6956m2197J20202P6731m13231K24736M9553
$$ -218762 -290726 -397846 -200119 -113163 -155360 -35158 41573 -371658 -146922 -97369
17164i7369k07468m1120L37853q654o5164k15841O6415J0855J2286J86636J93486
$$ -97369 -304837 -345957 -8104 -16758 -81922 -297763 -231348 -220493 -208207 -21571 171915
17153A71915P4361m26332l28910L64840K56964l05119j19910J88723M6706k60278
$$ 171915 246276 -180056 -508966 -144126 112838 -192281 -312191 -123468 -76762 -337040
17143c37040L2950J68663L7183k2589l29612K3960M74243J74r9530J79989R1779
$$ -337040 -304090 -135427 -98244 -120833 -450445 -426485 47758 47932 -51598 128391 220170
17132B20170L0512j32158p0552q9912K30518J45986k0169o3671J47643l06527
$$ 220170 250682 118524 47972 -41940 188578 334564 314395 250724 398367 91840
17122I1840m04946J08968j68567j10978j29401J0661K67683L27239j56114l69222
$$ 91840 -313106 -204138 -372705 -483683 -613084 -602423 -334740 -7501 -163615 -532837
17112e32837J21430j00571j77943L02342J56736K04118n8666k01921J60107J36264
$$ -532837 -411407 -511978 -689921 -387579 -230843 -26725 -85391 -287312 -127205 9059
17102I059J00539m4678n7225J65112J03336k39349j88526L4325o7094k73729m6505
$$ 9059 109598 64920 7695 172807 276143 36794 -151732 -117407 -184501 -458230 -504735
17091e04735K19517O1651n4336N9464J68891J34442J53466l22481j09021K15415
$$ -504735 -285218 -223567 -277903 -218439 -49548 84894 238360 -84121 -193142 22273
17081B2273J88547m0598q2429j35160k7394j98410k37027K57008M8156K66545
$$ 22273 210820 170222 87793 -47367 -74761 -273171 -510198 -253190 -205034 61511
17071F1511p6050m13776j60562q6398j6171K69051K33946M4607Q4423j37393j80154
$$ 61511 -14539 -428315 -588877 -675275 -691446 -422395 -188449 -143842 -59419 -196812 -376966
17060c76966K8018Q9381k04121k7900j2671M1727M8102k29782J72434M84679J45050
$$ -376966 -348948 -259567 -463688 -491588 -504259 -462532 -414430 -644212 -471778 12901 157951
17049A57951J8706K3737k45766j80314L51460j86544k47671J70713k35120j70079
$$ 157951 176657 200394 -45372 -225686 125774 -60770 -308441 -137728 -372848 -542927
17039e42927l133J21448R6075o6916k4717O5869J60975l7962n9818l30219L03871
$$ -542927 -546060 -424612 -328537 -395453 -420170 -354301 -193326 -231288 -291106 -621325 -317454
17028c17454K09164K41165j84832j54499k37566j08069R4524P9892N1151j33455
$$ -317454 -108290 132875 -51957 -206456 -444022 -552091 -457567 -377675 -326524 -459979
17018d59979N140J04969J27513n5003q5361K68357j20934r8933K67910K22063
$$ -459979 -454839 -349870 -222357 -277360 -362721 -94364 -215298 -314231 -46321 175742
17008A75742j28623r5272K28225m3310l22767k78603O8896O2863k16829p7613
$$ 175742 47119 -48153 180072 136762 -186005 -464608 -395712 -332849 -549678 -627291
16998f27291L27115P092K700N0028j36056N7812J69714k53840j93586j49479J91719
$$ -627291 -300176 -293084 -290384 -240356 -376412 -318600 -148886 -402726 -596312 -745791 -554072
16987e54072L00065Q1970Q3493K11257j74481j51251k08653j14576K0930J39297
$$ -554072 -254007 -172037 -88544 122713 -51768 -203019 -411672 -526248 -505318 -366021
16977c66021j47633K05723n8205j8568R1124j40455j68850R5440J84538L00906
$$ -366021 -513654 -307931 -366136 -384704 -293580 -434035 -602885 -507445 -322907 -22001
16967b2001Q2918j98783k28608J34438r2876l15868K48368Q6328j81002J29591
$$ -22001 60917 -137866 -366474 -232036 -324912 -640780 -392412 -306084 -487086 -357495
16957c57495J19375K5677O0910J06252k6876j46766r9258k31771k31111J14380
$$ -357495 -238120 -212443 -151533 -45281 -72157 -218923 -318181 -549952 -781063 -666683
16947f66683J17776m0656N8659j4339M3192j98742j141J08213J74715Q9528k19703
$$ -666683 -548907 -589563 -530904 -545243 -502051 -700793 -701934 -593721 -419006 -329478 -549181
16936e49181r4757K17404O9765j84725n5817m1911K15190K70110K70873k58988
$$ -549181 -643938 -426534 -356769 -541494 -597311 -639222 -424032 -153922 116951 -142037
16926a42037J7551M1716J82951k09856j76702R873J18213r5724j68177k42461
$$ -142037 -124486 -82770 100181 -109675 -286377 -276504 -158291 -254015 -422192 -664653
16916f64653k33962J1848K68206K41910j02081r8880P9853l0042p0536K51399
$$ -664653 -898615 -886767 -618561 -376651 -478732 -577612 -497759 -527801 -598337 -346938
16906c46938K22802M11631p9191O509k36866j22056j93210J5134j1880m13701
$$ -346938 -124136 287495 208304 214813 -22053 -144109 -337319 -322185 -334065 -747766
16896g47766L5881L82797K30054K40328j04141q5365j55499q0831J04141j08132
$$ -747766 -711885 -329088 -99034 141294 37153 -48212 -203711 -284542 -180401 -288533
16886b88533J5148j90930P7275j03133M5906N0827k01057m06098J94808K07731
$$ -288533 -273385 -464315 -387040 -490173 -444267 -393440 -594497 -1000595 -805787 -598056
16876e98056J23092J34817J42177k04387j46149P0590j11378J42465Q761J35379
$$ -598056 -474964 -340147 -197970 -402357 -548506 -477916 -589294 -446829 -438068 -302689
16866c02689o6106r7390J97755K22410n3020K57739J05221K5716q9116o5159k54782
$$ -302689 -368795 -466185 -268430 -46020 -99040 158699 263920 289636 200520 135361 -119421
16855a19421l42637k60758j75625M5061K99196L07950K29758q2984k05447L26524
$$ -119421 -462058 -722816 -898441 -853380 -554184 -246234 -16476 -99460 -304907 21617
16845B1617K67710L05954j18387l55489k03074P738J60925j40607j48931p4334
$$ 21617 289327 595281 476894 121405 -81669 -73931 86994 -53613 -202544 -276878
16835b76878l28821q9924J74254j73931p2946J07252o4972O1374L5733K56786
$$ -276878 -605699 -695623 -521369 -695300 -768246 -660994 -725966 -664592 -628859 -372073
16825c72073N73124K48790k71668K76q69K9521J42645l19424j33810k56888r4937
$$ -372073 201051 449841 178173 178449 177580 207101 349746 30322 -103488 -360376 -455313
16814d55313o1738J20475P7531k07411K63764K71544j65702J72986J66015m62994
$$ -455313 -517051 -396576 -319045 -526456 -262692 8852 -156850 16136 182151 -280843
16804b80843r1954l02929R58J47031K55239J01224q3374J15739J07383k6889j30165
$$ -280843 -372797 -675726 -674768 -527737 -272498 -171274 -254648 -138909 -31526 -58415 -188580
16793a88580o1996k2912l0284K36140l0033J39796K5641j79754j26552J06216
$$ -188580 -250576 -273488 -303772 -67632 -97665 42131 67772 -111982 -238534 -132318
16783a32318J54529o5071j76791J6238J0795l49794j59332N1500J05227J11201
$$ -132318 22211 -42860 -219651 -203413 -192618 -542412 -701744 -650244 -545017 -433816
16773d33816J00240J29764l39758L3645p1476m2158K052K91079K5438P3087J47411
$$ -433816 -333576 -203812 -543570 -509925 -581401 -623559 -621507 -330428 -304990 -231903 -84492
16762h4492R544r2593j74288m2441K69781k13493k73363K471L65719M3800O8388
$$ -84492 -74948 -167541 -341829 -384270 -114489 -327982 -601345 -598874 -233155 -189355 -120967
16751a20967J95183J46940k15238R8177L36527O6904m80701n69877J87626j01464
$$ -120967 74216 221156 5918 104095 440622 507526 26825 -543052 -355426 -456890
16741d56890o577K75202J86137j37722J9979m1539J27623R1626j12145k32235
$$ -456890 -463467 -188265 -2128 -139850 -119871 -161410 -33787 57839 -54306 -286541
16731b86541j01712J70025K11486K7778j79775q0812K41653q663m8374k96264
$$ -286541 -388253 -218228 -6742 21036 -158739 -239551 2102 -6561 -54935 -351199
16721c51199j77788J18172O1330O314q6457j2750K04817R1910j0666k6284j06943
$$ -351199 -528987 -410815 -349485 -343171 -429628 -442378 -237561 -145651 -156317 -182601 -289544
16710b89544K06467j95982m3277j33228j32921J59108J39953J09646K0237q0976
$$ -289544 -83077 -279059 -322336 -455564 -588485 -429377 -289424 -179778 -159541 -240517
16700b40517l8800L5618K45086K35607J40196k68578J55063J03959J10756j65968
$$ -240517 -279317 -243699 1387 236994 377190 108612 263675 367634 478390 312422
16690C12422o9732J71485k94183k52279j1056j61284k55244J25398L07035k41495
$$ 312422 242690 414175 119992 -132287 -143343 -304627 -559871 -434473 -127438 -368933
16680c68933J02767J21984n2568K4265l73130l97837L58324K6197j51886M12188
$$ -368933 -266166 -144182 -196750 -172485 -545615 -943452 -585128 -558931 -710817 -298629
16670b98629J56670q3242q6772q8423O0700r6823j88534L00957N3873j44297J28599
$$ -298629 -141959 -225201 -311973 -400396 -339696 -436519 -625053 -324096 -270223 -414520 -285921
16659b85921K58633K76987K1288K2290j79449P881j58915k49720p6232K91174
$$ -285921 -27288 249699 270987 293277 113828 121709 -37206 -286926 -363158 -71984
16649g1984j66276j37180k3020q0888M43958j45726n09329r665J88950J43350
$$ -71984 -238260 -375440 -398460 -479348 -35390 -181116 -690445 -700110 -511160 -367810
16639c67810m9879j62727j42056Q5775M4129l3142N5857m2674J60388J7596k06445
$$ -367810 -417689 -580416 -722472 -636697 -592568 -625710 -569853 -612527 -452139 -434543 -640988
16628f40988j91859j03088P0256P9795k37258J10395J63199M75426K33607P4007
$$ -640988 -832847 -935935 -865679 -785884 -1023142 -912747 -749548 -274122 -40515 33492
16618C3492j97327J11758J39893p3886l78883k7068K28801l12973j71552N4656
$$ 33492 -163835 -52077 87816 13930 -364953 -392021 -163220 -476193 -647745 -593089
16608e93089M52099p5194P8313l35606k13408M38711R29j35502K05022l1050J2560
$$ -593089 -140990 -216184 -137871 -473477 -686885 -248174 -247245 -382747 -177725 -208775 -196215
16597a96215p8528k46668j37080j26347N5342K33751O0065o7464M94961K838k34828
$$ -196215 -274743 -521411 -658491 -784838 -729496 -495745 -435680 -503144 -8183 -5345 -240173
16586b40173r1211j86054K72887j23638K37377p877O1592J57703K99231J46830
$$ -240173 -331384 -517438 -244551 -368189 -130812 -138689 -77097 80606 379837 526667
16576E26667l0762j49586k62538r8622K40673k2752j82830j99357J32174n5033
$$ 526667 495905 346319 83781 -14841 225832 203080 20250 -179107 -46933 -101966
16566a01966N1610o1862J54994O9143k63079k176M9503N3403j35478m20638j25523
$$ -101966 -50356 -112218 42776 111919 -151160 -153336 -103833 -50430 -185908 -606546 -732069
16555g32069K99844P1393l891K7761j27798K32472J35832N6272J61714J14572
$$ -732069 -432225 -360832 -364723 -336962 -464760 -232288 -96456 -40184 121530 236102
16545B36102j87326r9847m45160j32634K62375J05238k10896j72304j50515K54902
$$ 236102 48776 -51071 -496231 -628865 -366490 -261252 -472148 -644452 -794967 -540065
16535e40065Q1526k768J97432r4959J37509K3091q6669l30677o2505j5310n0206
$$ -540065 -458539 -461307 -263875 -358834 -221325 -198234 -284903 -615580 -678085 -693395 -743601
16524g43601J61453J53631J53910J66338J00464p7881j2296l76019q1501J71039
$$ -743601 -582148 -428517 -274607 -108269 -7805 -85686 -97982 -474001 -555502 -384463
16514c84463K3034J71101L6689j9733L43607Q8348J43485j09147l47605m02450
$$ -384463 -361429 -190328 -153639 -173372 170235 258583 402068 292921 -54684 -457134
16504d57134J86212J35385j5936j63268q0960o7328L3557L855n0638j9956p8470
$$ -457134 -270922 -135537 -151473 -314741 -395701 -463029 -429472 -425617 -476255 -496211 -574681
16493e74681n8695L4267K25918j71953n3995L18755L13977R1188k58997k5227
$$ -574681 -633376 -599109 -373191 -545144 -599139 -280384 33593 124781 -134216 -159443
16483a59443K56556k79222m22809Q6752J48617J83963L72401K4725J961m42284
$$ -159443 97113 -182109 -604918 -518166 -369549 -185586 186815 211540 213501 -228783
16473b28783k62566k82060m8185j14709J67492M20662J56658K55035K45300l26499
$$ -228783 -491349 -773409 -821594 -936303 -768811 -348149 -191491 63544 308844 -17655
16463a7655l15584k9736M72852r6558r6322j70320k80468k23412l05518J41814
$$ -17655 -333239 -362975 109877 13319 -83003 -253323 -533791 -757203 -1062721 -920907
16453i20907N7666K19402n1800k00187P9593M22379M9153K0609j36117j44245
$$ -920907 -863241 -643839 -695639 -895826 -816233 -393854 -344701 -324092 -460209 -604454
16443f04454L97997L30252J57053k80531j96613q57o9593Q9791n9498L6127o7803
$$ -604454 -206457 123795 280848 317 -196296 -197153 -266746 -176955 -236453 -200326 -268129
16432b68129L5504M2131k45763m70953n27918J40879K01031L93586L10645q23
$$ -268129 -232625 -190494 -436257 -907210 -1435128 -1294249 -1093218 -699632 -388987 -389810
16422c89810R3697j6286J18140k62592l08083R0258K16896J5651L7865L28952
$$ -389810 -296113 -312399 -194259 -456851 -764934 -674676 -457780 -442129 -404264 -75312
16412g5312L39352l9933m31331J34743K57123j27130l1409J5578j08531l71648
$$ -75312 264040 224107 -207224 -72481 184642 57512 26103 41681 -66850 -438498
16402d38498j4617P9780L5991o4005L1019K21471J11380k35901N1553J16435n6688
$$ -438498 -453115 -373335 -337344 -401349 -370330 -148859 -37479 -273380 -221827 -105392 -162080
16391a62080j43866M7715m3760L85812K49719j21323j53872P4980K3764j27681
$$ -162080 -305946 -258231 -301991 83821 333540 212217 58345 133325 157089 29408
16381B9408j38J31362l74669l9988J78316L3281q4848k25250k66532J04906N3437
$$ 29408 29270 160632 -214037 -254025 -75709 -42428 -127276 -352526 -619058 -514152 -460715
16370d60715J98420L60843L8287J70115j76476m26769j34897J10131J34785j80009
$$ -460715 -262295 98548 136835 306950 130474 -296295 -431192 -321061 -186276 -366285
16360c66285l9772O2888o3645J3600K02020K09578O7052j13330J46656l22346
$$ -366285 -406057 -343169 -406814 -393214 -191194 18384 85436 -27894 118762 -203584
16350b03584n4339j30495j3099m44820n1253L07934L60182L5789M860J20556l44463
$$ -203584 -257923 -388418 -401517 -846337 -897590 -589656 -229474 -193685 -188825 -68269 -412732
16339d12732k13977k8518j2606k6649j148l1873K98579K06350j609k63772j11616
$$ -412732 -626709 -655227 -667833 -694482 -695630 -727503 -428924 -222574 -224183 -487955 -599571
16328e99571L10589J28627k48746k44658j38566j94196j05509K60666M55696J9971
$$ -599571 -288982 -160355 -409101 -653759 -792325 -986521 -1092030 -831364 -375668 -355697
16318c55697R6300J28425k75728M4089L72404q2123K15209J40566O0858q428m44659
$$ -355697 -259397 -130972 -406700 -362611 9793 -72330 142879 283445 344303 335875 -108784
16307a08784k45846R2800l13546Q5830J05171J83048K20704K381j64159L3736
$$ -108784 -354630 -261830 -575376 -489546 -384375 -201327 19377 21758 -142401 -108665
16297a08665K78995j98845n132n4789l95185K6775j9102K34115L24395j18500
$$ -108665 170330 -28515 -33647 -88436 -483621 -456846 -475948 -241833 82562 -35938
16287c5938l47069j1188M48665J92463j54663k68657r4346o6989J0360K15416
$$ -35938 -383007 -394195 54470 246933 92270 -176387 -270733 -337722 -327362 -111946
16277a11946J9499l240R1363j05727m95481k6903k4248J70532O9380j12492Q0751
$$ -111946 -92447 -95687 -4324 -110051 -605532 -632435 -656683 -486151 -416771 -529263 -448512
16266d48512N7881q8532j87118K96666K71171o769k83279j25332k52804O039K54974
$$ -448512 -390631 -479163 -666281 -369615 -98444 -105213 -388492 -513824 -766628 -760589 -505615
16255e05615L32852Q0860J24548k21591j49436j90398J00276L11582j91842k73032
$$ -505615 -172763 -91903 32645 -188946 -338382 -528780 -428504 -116922 -308764 -581796
16245e81796J84634L30298L90758j52919j76710j93433k61155J7120L29175L59914
$$ -581796 -397162 -66864 323894 170975 -5735 -199168 -460323 -443203 -114028 245886
16235B45886J22138p8459j62500J96681p0615l74796j4833k74955J07124R2557
$$ 245886 368024 289565 127065 323746 253131 -121665 -136498 -411453 -304329 -211772
16225b11772o228j83486L12319J87190j03250j70829k00426o4412N999M41819
$$ -211772 -218000 -401486 -89167 98023 -5227 -176056 -376482 -440894 -434895 6924
16215F924r9412k77572j11840K15228P7232p6521p0585m50122J49036J35312r3903
$$ 6924 -92488 -370060 -481900 -266672 -189440 -265961 -336546 -786668 -637632 -502320 -596223
16204e96223j40788N7367J52478P897J09938L02281O9406l76218J02442q1857
$$ -596223 -737011 -679644 -527166 -519269 -409331 -107050 -37644 -413862 -311420 -393277
16194c93277r8141L46564K44719m06637k0524N1333J41442j67076j38659M2519
$$ -393277 -491418 -144854 99865 -306772 -327296 -275963 -134521 -301597 -440256 -397737
16184c97737p4174Q2596P5030j1961J43150k5493k3189k43626r6003p344J68142
$$ -397737 -471911 -389315 -314285 -326246 -183096 -208589 -231778 -475404 -571407 -578751 -410609
16173d10609N4611j03851J63761L67512J48928j1780l07950k60646M7907j66576
$$ -410609 -355998 -459849 -296088 71424 220352 208572 -99378 -360024 -312117 -478693
16163d78693j29641P5328L30108J65947k1629k91017R9084R2280n0946K40410
$$ -478693 -608334 -533006 -202898 -36951 -58580 -349597 -250513 -158233 -209179 31231
16153C1231j26904k16200J29024J68045J27792j95905J84592n4448l00716J89919
$$ 31231 -95673 -311873 -182849 -14804 112988 -82917 101675 47227 -253489 -63570
16143f3570J78601k66172k15305k28609k6446K36377r8794k01485K97080M8665
$$ -63570 115031 -151141 -366446 -595055 -621501 -385124 -483918 -685403 -388323 -339658
16133c39658k43051K12725r0196N3400L17131J51106K51339j04282k13691k13507
$$ -339658 -582709 -369984 -460180 -406780 -89649 61457 312796 208514 -5177 -218684
16123b18684M743K6681K04984J78281j67921j86197P1299j41765j31360j4229
$$ -218684 -213941 -187260 17724 196005 28084 -158113 -86814 -228579 -359939 -374168
16113c74168p0687l5681j3377Q6365O4765J35344Q0646K24627k2931j62772j39716
$$ -374168 -444855 -480536 -493913 -407548 -342783 -207439 -126793 97834 74903 -87869 -227585
16102b27585j60000K95595R5001O8003k3404j72079o5242Q7283N96827o0001l40242
$$ -227585 -387585 -91990 3011 71014 47610 -124469 -189711 -102428 494399 434398 94156
16091I4156m03338L4613R9894j64116L04520J03155l4252N9455k47581j39236
$$ 94156 -309182 -274569 -174675 -338791 -34271 68884 34632 94087 -153494 -292730
16081b92730j66305j09709L45k40937j23821J07146O8010L6027k72194M4674L88197
$$ -292730 -459035 -568744 -568399 -809336 -933157 -826011 -758001 -721974 -994168 -949494 -561297
16070e61297J84518j69984j55332j65065J6044K66205O6434j03108l1161q8157
$$ -561297 -376779 -546763 -702095 -867160 -851116 -584911 -518477 -621585 -652746 -740903
16060g40903j53173M04412M0447j8248J25903j10839j43872k0480Q6999Q3198
$$ -740903 -894076 -489664 -449217 -467465 -341562 -452401 -596273 -616753 -529754 -446556
16050d46556J16633j71993o0917o9465K19379K40483j24249j32547L5043k27162
$$ -446556 -329923 -501916 -562833 -632298 -412919 -172436 -296685 -429232 -394189 -621351
16040f21351N5784k3175K09414J37045j73518K24491K73269M4013j98340j56908
$$ -621351 -565567 -588742 -379328 -242283 -415801 -191310 81959 125972 -72368 -229276
16030b29276R0575p7329p0527k3660k8739q1510J46625J16620O0159j93474j04997
$$ -229276 -138701 -216030 -286557 -310217 -338956 -420466 -273841 -157221 -97062 -290536 -395533
16019c95533j18856j8741J72016m4593J4190J5632j73658j28073J47549K92153
$$ -395533 -514389 -533130 -361114 -405707 -391517 -375885 -549543 -677616 -530067 -237914
16009b37914J29021l25137l48504o4115J96930P1731L14198L11750p1097j4071
$$ -237914 -108893 -434030 -782534 -846649 -649719 -577988 -263790 47960 -23137 -37208
15999c7208J60462k58626M0569N8604P7164l24766m10848k70480J49084K93551
$$ -37208 123254 -135372 -94803 -36199 40965 -283801 -694649 -965129 -816045 -522494
15989e22494K7430k04833M9737K83832L01032k1491l46376j29473K0905J24621
$$ -522494 -495064 -699897 -650160 -366328 -65296 -86787 -433163 -562636 -541731 -417110
15979d17110K20090K41944K09501k8142l03152o8271k64422o9004L9192p36k42347
$$ -417110 -197020 44924 254425 226283 -76869 -145140 -409562 -478566 -439374 -440110 -682457
15968f82457J79438K50961P1979J73770j35792k70936l72441j8318J54524Q3914
$$ -682457 -503019 -252058 -180079 -6309 -142101 -413037 -785478 -803796 -649272 -565358
15958e65358l9495Q345L20891J18450m37131j77469K03231L4111J60609O1201
$$ -565358 -604853 -596508 -275617 -157167 -594298 -771767 -568536 -534425 -373816 -312615
15948c12615k8928L27067M7451l55644j24736O7182J72994k54708J96546j28022
$$ -312615 -341543 -14476 32975 -322669 -447405 -380223 -207229 -461937 -265391 -393413
15938c93413l83367J35691Q5649q8982L60737J61793J72836J23239r8279n9553
$$ -393413 -776780 -641089 -555440 -644422 -283685 -121892 50944 174183 75904 16351
15928A6351l49827N0025K45623j08988n5638K56617o3189j0868n9646Q4859l06903
$$ 16351 -333476 -283451 -37828 -146816 -202454 54163 -9026 -19894 -79540 5319 -301584
15917c01584k72095J56069j14868K66604O5956k56201j60546J20122l2686M1366
$$ -301584 -573679 -417610 -532478 -265874 -199918 -456119 -616665 -496543 -529229 -487863
15907d87863N553L56293J71109j48093j36975K49787K46969j19185l40167l19753
$$ -487863 -482310 -126017 45092 -103001 -239976 9811 256780 137595 -202572 -522325
15897e22325K61124J06093J43665L8265k3512k08390j1706Q9655p1602m45793
$$ -522325 -261201 -155108 -11443 26822 3310 -205080 -216786 -127131 -198733 -644526
15887f44526j84795K55452L05592J59875P8084N8210J92654O6994k39031K14757
$$ -644526 -829321 -573869 -268277 -108402 -30318 27892 220546 287540 48509 263266
15877B63266M4928r4991r4900r5819j37292J1314J5004J8555K56813l81630l99836
$$ 263266 308194 213203 118303 22484 -114808 -103494 -88490 -69935 186878 -194752 -594588
15866e94588j07379K59039J92560k32284K05897J94256l4412j17679k18138q8943
$$ -594588 -701967 -442928 -250368 -482652 -276755 -82499 -116911 -234590 -452728 -541671
15856e41671N7627M50877R7985k52446k13876K31525P0323n8654k07091L9506
$$ -541671 -484044 -33167 64818 -187628 -401504 -169979 -99656 -158310 -365401 -325895
15846c25895J02093L0774k45418j93122M5084m9688j09095J63305J09681j9246
$$ -325895 -223802 -193028 -438446 -631568 -586484 -636172 -745267 -581962 -472281 -491527
15836d91527R816J19518P3025J0486j15345J77765r0341k12068r0730J93776K75551
$$ -491527 -481711 -362193 -289168 -278682 -394027 -216262 -306603 -518671 -609401 -415625 -140074
15825a40074j30240m18124j57017j58054L14416O94133M03559l681j99783j28670
$$ -140074 -270314 -688438 -845455 -1003509 -689093 5040 408599 404918 205135 76465
15815G6465k28913Q6717l9961m17922j48683M04193L72289l03053m73806p0679
$$ 76465 -152448 -65731 -105692 -523614 -672297 -268104 104185 -198868 -672674 -743353
15805g43353K99704P5422M17329k42571l94697J08696J37439j09880N7747Q0686
$$ -743353 -443649 -368227 49102 -193469 -588166 -479470 -342031 -451911 -394164 -313478
15795c13478o5513k15356M9436M47126R3025m09116k70937n7771K51215K99692
$$ -313478 -378991 -594347 -544911 -97785 -4760 -413876 -684813 -742584 -491369 -191677
15785a91677j65483Q513J78178j23598k26629K93554J53318k36728P87l544J6025
$$ -191677 -357160 -348647 -170469 -294067 -520696 -227142 -73824 -310552 -309765 -313309 -297284
15774b97284K65774M19484l95286m23310J61515N0858l27524j58625K09691K27969
$$ -297284 -31510 387974 -7312 -430622 -269107 -218249 -545773 -704398 -494707 -266738
15764b66738j80231q248M70132N10856q581n10881q5056j32159l13252k73246
$$ -266738 -446969 -455217 14915 525771 517190 6309 -78747 -210906 -524158 -797404
15754g97404O2412M14070J9343j69450M92060P59743Q11360O60127j8325m24584
$$ -797404 -734992 -320922 -301579 -471029 21031 780774 1592134 2252261 2233936 1809352
15744A809352r16643m89441j01104l08484r5820o6647J48800K93991n7910m18196
$$ 1809352 892709 403268 302164 -6320 -102140 -168787 -19987 274004 216094 -202102
15734b02102l48350J25325j11592m3074K22155K2565j5544J96607P9158j19218
$$ -202102 -550452 -425127 -536719 -579793 -357638 -335073 -350617 -154010 -74852 -194070
15724a94070k40446j69046j71539l00124k82078L88419K91986N25696N4044j54751
$$ -194070 -434516 -603562 -775101 -1075225 -1357303 -968884 -676898 -151202 -97158 -251909
15714b51909q0120J97677L74208K15367p947j65923l60510l86416Q3888J86833
$$ -251909 -332029 -134352 239856 455223 447276 281353 -79157 -465573 -381685 -194852
15704a94852j02947J73346k228j23048O7105l15674j25578K97605J08549N3825
$$ -194852 -297799 -124453 -126681 -249729 -182624 -498298 -623876 -326271 -217722 -163897
15694a63897N5562J00222j38822k99563R593J87964J31643j04758p7510k95602
$$ -163897 -108335 -8113 -146935 -446498 -436905 -248941 -117298 -222056 -299566 -595168
15684e95168J04340k01965J5545K57752l4775l75653k66951K9368N94421R2196
$$ -595168 -490828 -692793 -677248 -419496 -454271 -829924 -1096875 -1067507 -473086 -380890
15674c80890j38097k73761J33429J36313K02614K5170k07406N8955j37213J47397
$$ -380890 -518987 -792748 -659319 -523006 -320392 -295222 -502628 -443673 -580886 -433489
15664d33489K66153J80951j81186p5352Q7989M3834l4262k15886j79837k3496
$$ -433489 -167336 13615 -167571 -242923 -154934 -111100 -145362 -361248 -541085 -564581
$$ [...]
##END NTUPLES=NMR SPECTRUM
##END=
