##TITLE=Analysis number 310930
Compound Code cc 41701
Book Reference 433/107/2
Project Code adrs
Chemist Name victoriam
##JCAMPDX= 6.0         $$ Bruker NMR JCAMP-DX V2.0
##DATA TYPE= NMR SPECTRUM
##DATA CLASS= NTUPLES
##ORIGIN= Bruker BioSpin GmbH
##OWNER= NMR
$$ XWIN-NMR		Version 3.5
$$ Mon Jun 27 11:19:43 2005 GMT Daylight Time (UT+1h)  MAYBRIDGE\NMR@NMR_250MHZ
##.OBSERVE FREQUENCY= 250.131544655141
##.OBSERVE NUCLEUS= ^1H
##.ACQUISITION MODE= SIMULTANEOUS (DQD)
##.ACQUISITION SCHEME= undefined
##.AVERAGES= 16
##.DIGITISER RES= 18
##SPECTROMETER/DATA SYSTEM= dpx250
##.PULSE SEQUENCE= zg30
##.SOLVENT NAME= DMSO
##.SHIFT REFERENCE= (INTERNAL, DMSO, 0, 16.522)
##AUDIT TRAIL= $$ (NUMBER, WHEN, WHO, WHERE, WHAT)
$$ ##TITLE= Audit trail, XWIN-NMR		Version 3.5
$$ ##JCAMPDX= 5.01
$$ ##ORIGIN= Bruker BioSpin GmbH
$$ ##OWNER= NMR
$$ C:\u/data/dgb/nmr/ADRS/4860/pdata/1/auditp.txt
$$ ##AUDIT TRAIL=  $$ (NUMBER, WHEN, WHO, WHERE, WHAT)
(   1,<2005-06-27 11:19:24.07 +100>,<MAYBRIDGE\NMR>,<NMR_250MHZ>,
      <created by zg, POWCHK disabled, PULCHK disabled
       configuration hash MD5:
       62 19 C7 07 E1 42 D1 B7 37 6C 3D D0 77 39 F9 E6
       data hash MD5: 64K
       3B 4B 6C 85 CF F6 91 10 9C 82 1D 8F E8 50 FB 06>)
(   2,<2005-06-27 11:19:35.02 +100>,<MAYBRIDGE\NMR>,<NMR_250MHZ>,
      <Start of raw data processing
       ef LB = 0.3 FT_mod = 6 PKNL = 1 SI = 32K 
       data hash MD5: 32K
       EC B6 A6 4B E7 39 60 89 2D 45 CF 8C A7 C2 3A DA>)
(   3,<2005-06-27 11:19:36.82 +100>,<MAYBRIDGE\NMR>,<NMR_250MHZ>,
      <apk 
       data hash MD5: 32K
       3F B8 1C 6F 55 23 FE C6 5A 85 33 9E 1D 82 74 0D>)
(   4,<2005-06-27 11:19:37.57 +100>,<MAYBRIDGE\NMR>,<NMR_250MHZ>,
      <abs ABSG = 5 
       data hash MD5: 32K
       FC 97 98 D5 A8 42 FE 0B 2F 8A BD 37 14 E4 CC A9>)
$$ ##END=
$$ 
$$ hash MD5
$$ 98 5A 7F BC 6E B6 F3 A4 2D C8 35 0A 55 24 B3 56
##$RELAX= 
##$RELAX= 
##$RELAX= 
##$RELAX= 
##$RELAX= 
##$RELAX= 
##$RELAX= 
$$ Bruker specific parameters
$$ --------------------------
##$DU= <C:\u>
##$EXPNO= 4860
##$NAME= <ADRS>
##$PROCNO= 1
##$TYPE= <nmr>
##$USER= <dgb>
##$AMP= (0..31)
100 100 100 100 100 100 100 100 100 100 100 100 100 100 100 100 100 100 
100 100 100 100 100 100 100 100 100 100 100 100 100 100 
##$AQSEQ= 0
##$AQ_mod= 3
##$AUNM= <au_zg>
##$AUTOPOS= <18 >
##$BF1= 250.13
##$BF2= 250.13
##$BF3= 250.13
##$BF4= 250.13
##$BF5= 500.13
##$BF6= 500.13
##$BF7= 500.13
##$BF8= 500.13
##$BYTORDA= 1
##$CFDGTYP= 0
##$CFRGTYP= 5
##$CHEMSTR= <none>
##$CNST= (0..31)
1 1 145 1 1 1 1 1 1 1 1 1 1 1 1 1 1 1 1 1 1 1 1 1 1 1 1 1 1 1 1 1 
##$CPDPRG= <>
##$CPDPRG1= <>
##$CPDPRG2= <>
##$CPDPRG3= <>
##$CPDPRG4= <mlev>
##$CPDPRG5= <mlev>
##$CPDPRG6= <mlev>
##$CPDPRG7= <mlev>
##$CPDPRG8= <mlev>
##$CPDPRGB= <>
##$CPDPRGT= <>
##$D= (0..31)
0 1 0 0 0 0 0 0 0 0.06 0 0 0 0 0 0 0.0002 0 0 0 0 0 0 0 0 0 0 0 0 0 0 
0 
##$DATE= 1119867563
##$DBL= (0..7)
120 120 120 120 120 120 120 120 
##$DBP= (0..7)
150 150 150 150 150 150 150 150 
##$DBP07= 0
##$DBPNAM0= <>
##$DBPNAM1= <>
$$ [...]
##$SUBNAM7= <"">
##$SUBNAM8= <"">
##$SUBNAM9= <"">
##$SW= 20.6930455092707
##$SWIBOX= (0..15)
0 0 3 0 0 0 0 0 0 0 0 0 0 0 0 0 
##$SW_h= 5175.983436853
##$TD= 65536
##$TD0= 1
##$TE= 295.16
##$TE2= 300
##$TE3= 300
##$TEG= 300
##$TL= (0..7)
0 120 120 120 120 120 120 120 
##$TP= (0..7)
150 150 150 150 150 150 150 150 
##$TP07= 0
##$TPNAME0= <>
##$TPNAME1= <>
##$TPNAME2= <>
##$TPNAME3= <>
##$TPNAME4= <>
##$TPNAME5= <>
##$TPNAME6= <>
##$TPNAME7= <>
##$TPOAL= (0..7)
0.5 0.5 0.5 0.5 0.5 0.5 0.5 0.5 
##$TPOFFS= (0..7)
0 0 0 0 0 0 0 0 
##$TUNHIN= 0
##$TUNHOUT= 0
##$TUNXOUT= 0
##$USERA1= <user>
##$USERA2= <user>
##$USERA3= <user>
##$USERA4= <user>
##$USERA5= <user>
##$V9= 5
##$VALIST= <valist>
##$VCLIST= <CCCCCCCCCCCCCCC>
##$VD= 0
##$VDLIST= <DDDDDDDDDDDDDDD>
##$VPLIST= <PPPPPPPPPPPPPPP>
##$VTLIST= <TTTTTTTTTTTTTTT>
##$WBST= 1024
##$WBSW= 4
##$XGAIN= (0..3)
0 0 0 0 
##$XL= 0
##$YL= 0
##$YMAX_a= 356607
##$YMIN_a= -241175
##$ZGOPTNS= <>
##$ZL1= 120
##$ZL2= 120
##$ZL3= 120
##$ZL4= 120
##$ABSF1= 16.522
##$ABSF2= -4.171173
##$ABSG= 5
##$ABSL= 3
##$ALPHA= 0
##$AQORDER= 0
##$ASSFAC= 0
##$ASSFACI= 0
##$ASSFACX= 0
##$ASSWID= 0
##$AUNMP= <proc_1d>
##$AZFE= 0.1
##$AZFW= 0.1
##$BCFW= 0
##$BC_mod= 0
##$BYTORDP= 0
##$COROFFS= 0
##$CY= 12.5
##$DATMOD= 1
##$DC= 0
##$DFILT= <>
##$DTYPP= 0
##$F1P= 14.0000005364418
##$F2P= -0.99999901652339
##$FCOR= 0.5
##$FTSIZE= 32768
##$FT_mod= 6
##$GAMMA= 0
##$GB= 0
##$INTBC= 1
##$INTSCL= 1
##$ISEN= 128
##$LB= 0.3
##$LEV0= 0
##$LPBIN= 0
##$MAXI= 10000
##$MC2= 0
##$MEAN= 0
##$ME_mod= 0
##$MI= 0
##$NCOEF= 0
##$NC_proc= -4
##$NLEV= 6
##$NOISF1= 0
##$NOISF2= 0
##$NSP= 0
##$NTH_PI= 0
##$NZP= 0
##$OFFSET= 16.522
##$PC= 1
##$PHC0= -95.67438
##$PHC1= 25.12965
##$PH_mod= 1
##$PKNL= yes
##$PPARMOD= 0
##$PSCAL= 4
##$PSIGN= 0
##$REVERSE= no
##$SF= 250.13
##$SI= 32768
##$SIGF1= 0
##$SIGF2= 0
##$SINO= 400
##$SIOLD= 32768
##$SREGLST= <1H.DMSO>
##$SSB= 0
##$STSI= 32768
##$STSR= 0
##$SW_p= 5175.98343685301
##$SYMM= 0
##$S_DEV= 0
##$TDeff= 65536
##$TDoff= 0
##$TI= <Analysis number 999999
Compound Code 99
Book Reference 9
Project Code 9>
##$TILT= no
##$TM1= 0
##$TM2= 0
##$TOPLEV= 0
##$USERP1= <user>
##$USERP2= <user>
##$USERP3= <user>
##$USERP4= <user>
##$USERP5= <user>
##$WDW= 1
##$XDIM= 32768
##$YMAX_p= 365353961
##$YMIN_p= -477451
$$ End of Bruker specific parameters
$$ ---------------------------------
##NTUPLES= NMR SPECTRUM
##VAR_NAME=  FREQUENCY,     SPECTRUM/REAL,   SPECTRUM/IMAG
##SYMBOL=    X,             R,               I
##VAR_TYPE=  INDEPENDENT,   DEPENDENT,       DEPENDENT
##VAR_FORM=  AFFN,          ASDF,            ASDF
##VAR_DIM=   32768,         32768,           32768
##UNITS=     HZ,            ARBITRARY UNITS, ARBITRARY UNITS
##FACTOR=    0.157963299565203, 1,           1
##FIRST=     4132.6476996994, 0,             0
##LAST=      -1043.33573715361, 0,           0
##MIN=       -1043.33573715361, -477451,     0
##MAX=       4132.6476996994, 365353961,     0
$$ Real data points
##PAGE= N=1
##DATA TABLE= (X++(R..R)), XYDATA
$$ [...]
26800D21185m097n3823J1828O9005k0741j4954M189K3654Q770M2302K6622j2344
26788E01596n1712m0759O190L641Q396K6189J3368m618k1996k1183O1848q720
26776D72240j7432K8778M4024m6251K7796Q752l5088n9475K281J5026k9886q690
26764D02075R5117M8863l2484p5120r4183j2708L8818L3488m466o0867J011k052
26752C37492k2460o9707M9420M6489J3755o08J2034K9275J9989N4230l8163j4866
26740D16880K5907n2170j3304j2558J5308M7259L2698O148J085j9551l3382o2373
26728C51947k0399L918K8624O5527Q2176L8819k9684o932l0176p137J1389m7019
26716D41053n584R092l7325l217R91j0186n157q354K4734K496K9049l4083l1343
$$ y = [421185, 417088, 363265, 375093, 444098, 423357, 408403, 412592, 436246, 445016, 487318, 513940, 501596, 449884, 409125, 415315, 418956, 427352, 453541, 466909, 462291, 440295, 419112, 480960, 472240, 454808, 483586, 527610, 481359, 509155, 517907, 482819, 423344, 425625, 440651, 410765, 402075, 497192, 546055, 513571, 438451, 344268, 331560, 370378, 403866, 399400, 338533, 339544, 337492, 315032, 245325, 294745, 341234, 354989, 354381, 366415, 395690, 415679, 469909, 431746, 416880, 442787, 390617, 377313, 364755, 380063, 427322, 460020, 466168, 467253, 447702, 414320, 351947, 331548, 335466, 364090, 429617, 511793, 550612, 520928, 513996, 483820, 476683, 488072, 441053, 435469, 444561, 407236, 404019, 405010, 394824, 389667, 381313, 406047, 408543, 437592, 403509, 372166]
26703C72166J356K6805N493j5977j5568L6516k1480M466j8899J309J4168M6398
26691D36753J0721j0789j09996K8819J01897m120l2729j9255M0635k454o3610
26680C75872J02L3803m3454k6737p4601K1144Q9509N0631K4622O552J5524o0042
26668D12925j6396l2913j2924J3513l2886p160J9728J1396M453K1827n5475o2737
26656B63351q456k2431N9642M3005p111l1634r981n545J9397j886K7296Q0802
26644D06449n474j7850l333l0579k9263l8213n0968J08875K2591K6789p5231m3634
26632B70159j3435m5342J2350M9121N7283M215m956J6547k329k478q4057J1149
26620B68227K4041J5411j4132L0331q223m0505J023O8420j156k4375M2361L1759
$$ y = [372166, 373522, 400327, 405820, 389843, 374275, 410791, 389311, 393777, 374878, 376187, 390355, 436753, 447474, 436685, 326689, 355508, 457405, 453285, 420556, 401301, 441936, 439482, 375872, 375974, 409777, 366323, 339586, 264985, 286129, 375638, 426269, 450891, 457443, 472967, 412925, 396529, 363616, 350692, 364205, 331319, 324159, 343887, 355283, 359736, 381563, 326088, 263351, 254895, 232464, 292106, 335111, 328000, 296366, 286385, 280840, 300237, 298351, 325647, 406449, 400975, 383125, 379792, 349213, 319950, 281737, 230769, 339644, 362235, 389024, 313793, 270159, 256724, 211382, 223732, 272853, 330136, 334351, 329395, 345942, 343613, 341135, 257078, 268227, 292268, 307679, 293547, 323878, 315655, 275150, 276173, 344593, 343437, 319062, 361423, 393182]
26608C93182j444p3537M4224K9483J1034m1536n399K3835J1727l0865K2558K6116
26596D09378j4788o9152n4972Q984K6250m619O8442N6283r576j6175o1386m2539
26584B96130J6365J5891J7952J1521o403J3197m4369j7369p7322J6716M1087J3247
26572B96643M452M164J200K6983Q613j5516j7718R157k2131K7892l1031Q180J1807
26559C12695K6475L998l4186Q165M9974j00529m9100J03N8479L3700J2061m6287
26547B75548o1816O810J5347L1119P5011m880l3824K7291m4789k5147M4796L599
26535C09065M6969j2035o5191K4377p541o96l1576K1030J6834k1515k2479q741
26523B48501P0293j887r307K9980K3897K2661k4083n1358o7825l6334m728K4326
$$ y = [393182, 391738, 318201, 362425, 391908, 402942, 361406, 356007, 379842, 391569, 360704, 383262, 409378, 394590, 325438, 270466, 279450, 305700, 301081, 369523, 425806, 416230, 400055, 338669, 296130, 312495, 328386, 346338, 357859, 351456, 364653, 320284, 302915, 225593, 242309, 283396, 296643, 301095, 305259, 306459, 333442, 342055, 326539, 308821, 317978, 295847, 323739, 292708, 300888, 312695, 339170, 343168, 308982, 317147, 367121, 266592, 217492, 217595, 276074, 309774, 321835, 275548, 213732, 220542, 235889, 267008, 342019, 337139, 303315, 330606, 285817, 260670, 305466, 309065, 356034, 343999, 278808, 303185, 295644, 294948, 263372, 284402, 301236, 279721, 257242, 248501, 318794, 316907, 307600, 337580, 361477, 384138, 360055, 308697, 240872, 204538, 199810, 224136]
26511B24136N9952l466j734K5547r033k7600l183p408l2390j28185k176P4441
26499A68901J1695j3221J1150Q7339J3501M7178J7875M3736m9152m4108l4158
26488B60736l3754L1783P181m2189m6112K0426K9590k9071N9463P7225k7844p5805
26476B31629k8778M5623N6249O3228j4554l7822L7464M6124L2156m0049m6969
26465C44301k3428L0006m8401o6645M511J2284K6073N486J1872K1502m8214q5256
26453A84091J7442N1353P1084K0805q1044q4188m857P5226K014m0952n6315K2159
26441A76818L1887L317Q8235K9878K1004j5672j07616n1510L0682M8504J7386
26430B72913O3220k4609m4102M8203k0869o1502l4308j636l3860J7933L8736j6303
$$ y = [224136, 284088, 280622, 278888, 304435, 295402, 267802, 264619, 257211, 224821, 96636, 94460, 168901, 180596, 167375, 178525, 265864, 279365, 326543, 344418, 388154, 339002, 294894, 260736, 226982, 258765, 265946, 223757, 177645, 198071, 227661, 198590, 258053, 335278, 307434, 231629, 202851, 248474, 304723, 367951, 353397, 315575, 353039, 399163, 431319, 391270, 344301, 320873, 350879, 302478, 235833, 240344, 252628, 278701, 284187, 296059, 317561, 269347, 184091, 201533, 252886, 323970, 344775, 263731, 179543, 174686, 249912, 251926, 210974, 154659, 176818, 208705, 212022, 300257, 330135, 351139, 335467, 227851, 176341, 207023, 255527, 272913, 336133, 311524, 267422, 315625, 294756, 233254, 198946, 197310, 163450, 181383, 220119, 203816]
26418B03816j058M8922q3560n8109P5383m332r510L797O598P3692J9600J0911
26406B86150l9832n0015K0663L9409L7221J7919l6489l6464L8472n016p518j05448
26394A59052l6580M3518M437L4556m1856j1145Q9396R910j8288L754j4358L225
26382B25621N975K0378k6855J7697J7714l120Q217j2457j3477L1208Q590l1258
26370B48233k6927k6720j5156N5148P1267m9000n8680K4094P1738J2367k1778
26359B84586k8192j80m8033Q99K3137j3397J707P577q747J6891j6736Q386j8352
26346B09546j1277K8178m170j6694J5656M3664J0246K0306j3115M0485k512l0558
26334B89755m5432l8532k8147K8981M1753l3640j1002n1432m7531j790P3571N7633
$$ y = [203816, 202758, 251680, 168120, 110011, 185394, 181062, 171552, 175349, 181947, 255639, 275239, 286150, 246318, 196303, 216966, 256375, 293596, 311515, 275026, 238562, 277034, 272018, 264500, 159052, 122472, 165990, 170427, 204983, 163127, 151982, 241378, 251288, 233000, 236754, 222396, 225621, 231596, 251974, 225119, 242816, 260530, 257410, 265627, 253170, 239693, 270901, 279491, 248233, 221306, 194586, 179430, 234578, 305845, 256845, 198165, 222259, 293997, 306364, 284586, 256394, 256214, 208181, 209080, 232217, 218820, 220527, 228104, 219357, 236248, 219512, 227898, 209546, 198269, 226447, 222277, 205583, 221239, 264903, 275149, 295455, 282340, 322825, 320313, 289755, 244323, 205791, 177644, 206625, 248378, 214738, 203736, 152304, 104773, 102983, 176554, 234187]
26322B34187J9062l1877k2390J9106L5198j6650j1245J6467n210k7652L4252k7783
26310B15465k4398k0344J9101J7109j6499l4242j4050j490m783J5499l1163L0210
26298A50415M9371J6471M9788R038n4625l9152p73K4045j4312m2847k2987O167
26286A30599N8406K0578o51j6731J7689j2802J0906m9719k7467N3564l9453R454
26274A54373L8652P264p6366p4822L183M9847j5704N2354P9138N1425J0750J7794
26262B97888j3231k5346O219j8341n5486n2520j3840k4108N9992R9854N41R951
26250B71573k2315l0314P0441L1151p7636p5027o841L5591L8360L9998o3895o3455
26238A47631n0835j9980J7308N9419k8994m6667M70K7395l262k0515L6513m8773
$$ y = [234187, 253249, 221372, 198982, 218088, 253286, 236636, 225391, 241858, 236648, 208996, 243248, 215465, 191067, 170723, 189824, 206933, 190434, 156192, 142142, 140652, 135869, 151368, 120205, 150415, 199786, 216257, 266045, 275083, 220458, 181306, 180533, 204578, 190266, 147419, 124432, 130599, 189005, 209583, 208932, 192201, 209890, 197088, 207994, 158275, 130808, 184372, 144919, 154373, 193025, 200289, 123923, 49101, 52284, 102131, 86427, 138781, 217919, 269344, 280094, 297888, 284657, 259311, 265530, 247189, 191703, 139183, 125343, 101235, 161227, 261081, 261622, 271573, 249258, 218944, 289385, 320536, 242900, 167873, 161032, 196623, 234983, 274981, 211086, 147631, 96796, 76816, 94124, 153543, 124549, 77882, 78352, 105747, 102485, 81970, 118483, 69710]
26226F9710K7486P4882K6805L1609k541K8625p7259m3219N7950N0797L735n9081
26214A89499n0525L7088J6277M6166n97n7589k4K3201Q2224L5056l3461l0474
26202B56841q9961l2745P1231l7554p733L6394j0177J674l1893q1321M6089O9052
26190A89897K3868L2507n3852j3088L290m2860k4512L9516M9702K0858j397k3446
26178B00483J5864K3383o8430K60K1956j5334l571J0287N4875J3907J9058Q669
26166B81407o6470m5498k736o0386j5172M8261N075j6600l7855j1839L6679N0816
26154A65682k1625K521J7094P789l2266l3612L847M1278n2877k4048O997j6186
26142F4594K8656j1168o834J9522J7262k6790K5478n2854k2104l0740N022M8248
$$ y = [69710, 97196, 172078, 198883, 230492, 227951, 256576, 179317, 136098, 194048, 244845, 248580, 189499, 138974, 176062, 192339, 238505, 237908, 180319, 180295, 203496, 285720, 320776, 287315, 256841, 166880, 134135, 205366, 167812, 160079, 196473, 186296, 187970, 156077, 74756, 120845, 189897, 213765, 246272, 192420, 179332, 182622, 139762, 115250, 154766, 204468, 225326, 223929, 200483, 216347, 239730, 171300, 171560, 193516, 178182, 174611, 184898, 239773, 253680, 272738, 281407, 214937, 169439, 166703, 106317, 91145, 139406, 144481, 127881, 90026, 78187, 114866, 165682, 144057, 146578, 163672, 171461, 139195, 105583, 109430, 150708, 97831, 73783, 80780, 64594, 93250, 82082, 75248, 94770, 112032, 85242, 110720, 57866, 35762, 5022, 10044, 58292]
26130E8292N7456Q047K7876L3076k1858q0608k0474O8039R522J7577L7991J4869
26118B09805K7480l9086l8901l6963N047k496L5618n2515j6667j2518M3107N8021
26106A79932o6889P363M5535j2088k5018q0043K3217J8037q113L2660j4319J0632
26094A10906K7331n9389j6759J5990O707l1906j5413M5785Q781l1101k8882K818
26082C4868J3668K987J8388M029q662L5345k6176K4536J1927L7758o838n5514
26070H6316r2571n338L2481J2205M3456L2401m2090o0092K5990P9128j6791Q254
26058A03349j0899j5736j8539l7074J9251O9205K6260L669M565o3409L984l3599
26046E1027N8597N0581J0023k4965m5382j1947n4151L6014J03259k278l1052P0911
$$ y = [58292, 115748, 123795, 151671, 184747, 162889, 82281, 61807, 129846, 139368, 156945, 194936, 209805, 237285, 198199, 159298, 122335, 127382, 124886, 160504, 107989, 91322, 78804, 121911, 179932, 113043, 120406, 165941, 153853, 128835, 48792, 72009, 90046, 81933, 114593, 100274, 110906, 138237, 78848, 62089, 78079, 84786, 52880, 37467, 83252, 92033, 60932, 32050, 34868, 48536, 51523, 69911, 73940, 65278, 100623, 74447, 98983, 110910, 148668, 141830, 86316, -6255, -11593, 20888, 33093, 76549, 108950, 66860, 6768, 32758, 111886, 95095, 103349, 92450, 76714, 58175, 21101, 40352, 109557, 135817, 139486, 144051, 80642, 84626, 51027, 109624, 160205, 170228, 145263, 99881, 87934, 33783, 69797, 173056, 170778, 139726, 210637]
26034B10637m3067l1261J3389J6435K7334N5005J4738r138m1720m5067j4120k1495
26022A31670k7625k759J0163m507k3508k3987K3495J351j5960K3102J9804J034
26010A12273m6406R934K0196r496M2413J0018k3104j9439m7613j7219l777N7231
25998H5011Q5824O7657k2258p9121l1464l9226P855K0758M7543j1591l1428p0389
25986B9171M521J2979K810P610k8795j3709M5261j874l2163L0508L6322J275k1283
25973G2633k0533k8901N176K467J6411r28M950L0184J9412l0242q3549n8330j4661
25960h5911L9974R9247N4223L4229M2287n2851p19M5754K748o0925o2975k3234
25948C1847m2979L4281M8467L4871k3038j9849L6578m971q128k9806K8826l0446
$$ y = [210637, 167570, 136309, 149698, 166133, 193467, 248472, 263210, 254072, 212352, 167285, 153165, 131670, 104045, 101286, 111449, 106942, 83434, 59447, 82942, 84293, 68333, 91435, 111239, 112273, 65867, 75801, 95997, 86501, 128914, 138932, 115828, 96389, 48776, 31557, 27780, 85011, 170835, 238492, 216234, 137113, 105649, 66423, 74278, 95036, 142579, 130988, 99560, 29171, 33692, 46671, 49481, 57091, 28296, 14587, 59848, 57974, 25811, 56319, 92641, 93916, 72633, 52100, 23199, 28375, 30842, 47253, 46325, 51275, 81459, 100871, 70629, -12920, -71250, -85911, -45937, 53310, 107533, 141762, 184049, 131198, 130479, 176233, 178981, 118056, 55081, 31847, -11132, 23149, 71616, 106487, 83449, 63600, 100178, 95207, 87079, 57273, 86099, 55653]
25936E5653p619k011M650Q014o5243K3469P7868m160k0621M0345O8135L6045K3700
25923B38225p2146l0306M307p2123K49l963j013K2978M865M554K0198j9158J0004
25910A06671N0219J8306m4917p7120n2857r715Q835P1234j7119m2395J3272k3118
25898A296K5595N8021P821j7998L8386M6772o0283p332r066J1934J0051j0213
25886I4984L0605K4869j2191l3831j6612M7671L2313o5475L3025l677n4309j3423
25874F3949l4014j1484n975J5130L6053l2164n0904k1059M0039N6657j1762j7237
25862B7229L5572K7934r8826Q346Q6626k9688j02942P583M8606K1068k6339r725
25850d556O7967L5978k3603Q6370O8477q8991r4088M2945J5278m1966n1668J1373
$$ y = [55653, 48034, 46023, 50673, 58687, -6556, 16913, 94781, 90621, 70000, 110345, 178480, 214525, 238225, 166079, 135773, 140080, 67957, 68206, 64243, 63230, 86208, 91073, 95627, 115825, 96667, 106671, 156890, 175196, 130279, 53159, 302, -9413, -578, 70656, 53537, 11142, 24414, 1296, 26891, 84912, 92733, 74735, 113121, 159893, 99610, 92278, 83212, 95146, 105197, 94984, 125589, 150458, 138267, 104436, 87824, 135495, 167808, 102333, 135358, 131681, 77372, 63949, 29935, 18451, 12476, 27606, 63659, 31495, -19409, -40468, -429, 56228, 44466, 27229, 62801, 90735, -8091, 255, 86881, 57193, -45749, -38166, 10440, 31508, 5169, -4556, 63411, 99389, 75786, 162156, 230633, 141642, 47554, 90499, 105777, 63811, 12143, 23516]
25838B3516L5935k8920J7934J1500l7431N6990M6799o0367j0128l2534M90k2979
25826H05j7921l74N5323K2873q4221j342j0742J1352j6357j0351k8547K3690k0197
25813g6009K604K0376L5274P5731N9364m147P140n8568N919q898K6002j4480J227
25800G1535N6357J5339k040n5528j6858n2952K4061N9848O193J2888m8164l9159
25788C1520N8193m986M8343k9720n1774Q084K934j5691J757P0232L8042p6825
25776H0109l6647j7633J9181K923O7603K0688k0425K8975J8592k5997J5300L864
25764A56533p0316l4649n310M6508K9476q5462r1823M852L3016K3961K3765j0122
25752B0429k8349M6185L4736m8494M1149M007Q176k6705l6336j8070J2055k7611
$$ y = [23516, 59451, 30531, 48465, 59965, 22534, 79524, 126323, 65956, 55828, 23294, 23784, 805, -17116, -17490, 37833, 60706, -23515, -24857, -35599, -24247, -40604, -50955, -79502, -55812, -76009, -73405, -53029, -17755, 57976, 117340, 113193, 120333, 61765, 67684, 58786, 84788, 70308, 71535, 127892, 143231, 141191, 85663, 68805, 15853, 39914, 99762, 105955, 118843, 70679, 31520, 89713, 84727, 133070, 103350, 51576, 59660, 62594, 46903, 48660, 118892, 156934, 80109, 43462, 25829, 45010, 47933, 115536, 136224, 115799, 144774, 163366, 137369, 152669, 156533, 86217, 51568, 46258, 92766, 122242, 36780, -55043, -50191, -17175, 6786, 30551, 20429, -7920, 38265, 73001, 24507, 65656, 69663, 77839, 51134, 14798, -3272, 8783, -18828]
25740a8828R1198Q5342j1749j14882o5133R0585N0720n9339n1895J2009L6499
25729D4527J7068j8544n5686J2053J9105M2709j4785k8370r1312K6336J01055
25718E4156P99L4615K0773K5140n7710r5133k8630K0159L6827k2663m3467j1855
25706f6989M3128k003J1615n46M3213O240J3307r047n7956K7392M1101K785o302
25693D5938n2704l9395M8511M6826l1062j9885R352p620J3631Q9228K5111M097
25681A32028l5371j5968l0192k3245L6656M157l7229j0386J768q707j0317J1880
25669A5074k7652K8102P651Q44l1139k1843J2213J6107J6204r0784j9161O593
25657h7791K5420o895L7511J5670L6842M228P638k0891j3079Q360j9907k8893
$$ y = [-18828, 72370, 157712, 145963, 31081, -34052, 56533, 107253, 47914, -3981, 8028, 44527, 61595, 43051, -12635, -582, 18523, 61232, 46447, 18077, -73235, -46899, 54156, 54955, 89570, 110343, 135483, 77773, -17360, -45990, -25831, 10996, -11667, -55134, -66989, -23861, -25864, -14249, -14795, 28418, 34658, 47965, 38918, -19038, 8354, 49455, 52240, 45938, -6766, -46161, 2350, 49176, 18114, -1771, 7581, -39, 13592, 102820, 127931, 132028, 96657, 80689, 50497, 27252, 63908, 68065, 30836, 20450, 22218, 13511, 3194, 15074, -12578, 15524, 23175, 24019, -7120, -28963, -16750, -643, 15561, -75223, -94384, -87791, -62371, -69266, -31755, -16085, 20757, 24985, 32623, 11732, -1347, 7013, -12894, -41787]
25645d1787n3257N8994P7395O3519q771k3470L5492k4025l066k9640L0140P311
25633H8835k7146l3005m1528Q692Q3408l327l3545M7339k8857l3601l2904k9914
25621c5553J0287N0102j963O207P669j6671M8089R167L1543O689L202q874l1324
25608G8570K4849m1456k6580R907L175m1161j1583M0653j2337J1208r391L2233
25596E8087L6532J9836K496K0348Q75k8509J4349M7542k8536k6169o0184m4605
25584A2062J4864K5236Q350J0203r4536j6629J2625M8219L2769j1325k8974r63
25572A1901M4431L068K777k2019K5140K8645j6027n83N8173J5481n5406n3238
25560D2343n4185p083k6392k3601J3102P168l4625K0630O2619l2209K74P4838
$$ y = [-41787, -95044, -36050, 41345, 104864, 96093, 72623, 108115, 84090, 81024, 51384, 81524, 88835, 61689, 28684, -12844, -4152, 79256, 75929, 42384, 89723, 60866, 27265, -5639, -35553, -25266, 24836, 22873, 29080, 36749, 20078, 68167, 77334, 108877, 115566, 118768, 109894, 78570, 103419, 61963, 35383, 45290, 48465, 7304, -4279, 36374, 24037, 35245, 25854, 58087, 94619, 114455, 116951, 137299, 138174, 109665, 124014, 171556, 143020, 116851, 56667, 12062, 26926, 52162, 60512, 70715, -23821, -40450, -27825, 20394, 53163, 41838, 12864, 11901, 56332, 59400, 62177, 40158, 65298, 93943, 77916, 77333, 135506, 150987, 95581, 42343, -11842, -18925, -45317, -68918, -55816, -48648, -83273, -62643, -24, -32233, -31959, 42879]
25548D2879O74m1717L0184k7999K1081M9494L547k1547k9352L4549R550l9496
25536C1847k2402o786M3542l7087J3915r471m0695J3366J5719L1508L563J0041
25524D7060J4116m7899l5543p081o6630l990O0077j1459j0275l598N2956L5419
25512B3153m1300O841p846O3738l7892l3166K6222M0204r737j7627L1469j1452
25500C2607o1645j333p846N688N4511N1877k6239P538j8276M917L9071J6724J7587
25487A15181j0436J2842M1433p294q8056p9995m9136J4522K1548N1627M196K5117
25475E1549K316j1975q0504J0337m5803R760M2599M3705j4245J1609n7465N9942
25463B1825L9993p930L9518o284q0787k3776J9813R6625k5230p7191Q61p0056
$$ y = [42879, 43553, 1836, 32020, 4021, 25102, 74596, 78143, 56596, 27244, 61793, 71343, 31847, 9445, 2659, 46201, 9114, 23029, 13558, -27137, -13771, 1948, 33456, 37019, 47060, 61176, 13277, -22266, -29347, -95977, -99967, -39890, -51349, -61624, -65222, -12266, 23153, -18147, -11306, -19152, 44586, 6694, -26472, -250, 39954, 30217, 12590, 44059, 32607, -29038, -30371, -38217, -32529, 21982, 73859, 47620, 55158, 36882, 41799, 80870, 97594, 115181, 104745, 117587, 159020, 151726, 63670, -16325, -65461, -50939, -29391, 22236, 26432, 51549, 53865, 41890, -38614, -28277, -74080, -64320, -21721, 21984, 7739, 19348, -38117, 21825, 61818, 53888, 93406, 87122, 6335, -17441, 2372, 98997, 73767, -3424, -2563, -72619]
25451g2619N0890J02879J1616n112j762J681o5119k3898N1233L5844K7842l9575
25439G3900J6593J6378J3069m7675n6018o8181j0125k4666j1908m0086N1213R5219
25427G713N5911P835j6599k6979J2929K7070m9309j3829Q5027k0371p2152m899
25415g653M2923n532R753j3021r423K3756L7780L5800k182l4901l8129o0493n2081
25402g3403L0855j0027l7666k8663J9622Q1240L5753L9004j8080q272p557l009
25390A9797J1577o0921J186M4186o962K9313k6934p9155p5483L7358K4243J7681
25378f4114K9624j8459J9500L1912J8018n5676P923j8390J6932j0885J3507J024
25366b9084k0322K1244J1338q281P698M5162J6935N3575O3176K089k0460m5066
$$ y = [-72619, -21729, 81150, 92766, 87654, 85892, 87573, 22454, -1444, 49789, 85633, 113475, 73900, 90493, 106871, 119940, 72265, 16247, -51934, -62059, -86725, -98633, -138719, -87506, 7713, 63624, 71459, 54860, 27881, 40810, 67880, 18571, 4742, 89769, 69398, -2754, -7653, 35270, 29738, 39491, 26470, 17047, 40803, 78583, 114383, 112201, 77300, 39171, -21322, -73403, -42548, -52575, -90241, -118904, -99282, -18042, 17711, 56715, 38635, 30363, 22806, 19797, 31374, -29547, -28361, 15825, 8863, 38176, 11242, -67913, -143396, -106038, -81795, -64114, -34490, -52949, -33449, -1537, 16481, -39195, -31272, -49662, -32730, -43615, -30108, -29084, -49406, -28162, -16824, -25105, -17407, 27755, 44690, 98265, 161441, 163530, 143070, 98004]
25354I8004n9410l9021l7895J1341J2928R7833M5140n1897j3894j4572k9786j204
25342A7567J1274k0856m0684j11496o2465M0825J21493J6782M1955Q8544J4826
25331A17765K110L1216r3319n283q676J8519Q191J4135N2793J9346m3312j533
25319A11952n4871k0061m6958j1048K085l3122L3370j3333N1732M4408J4764J5215
25307I4133o1356j848n0719J0865R717k7830Q508j6080l7632k1816M1996J3347
25295c8715M528q74N970k4257j6038L0659K9623L281K6463K8830k1204l3504J797
25282c441n8907J1408j5425K1697K8566m0513R8248j2197q020q557L5525j7822
25270C0562j5716o6137k8470M22j1986N3575m76k3373j8353M2167k1058j5325
$$ y = [98004, 38594, -427, -38322, -26981, -14053, 83780, 128920, 77023, 63129, 48557, 18771, 17567, 28841, 7985, -32699, -144195, -206660, -165835, -44342, -27560, 14395, 102939, 117765, 119875, 151091, 57772, 52489, 43813, 62332, 70523, 84658, 137451, 156797, 113485, 111952, 57081, 37020, -9938, -20986, -18901, -52023, -18653, -31986, 19746, 64154, 78918, 94133, 32777, 30929, -19790, -8925, 792, -27038, -18530, -34610, -72242, -94058, -52062, -38715, -34187, -35061, -29091, -53348, -69386, -38727, -9104, -5823, 20640, 49470, 28266, -5238, -3441, -62348, -50940, -66365, -44668, -16102, -56615, 41633, 29436, 21416, 12859, 48384, 30562, 14846, -51291, -79761, -79339, -91325, -37750, -38226, -61599, -79952, -37785, -58843, -74168]
25258g4168k5948P9397M5220k0890n0619l5228N1851L3142M4905K5819o487L2754
25246I9748m7561j0273l8037j08482k4703Q3424P6737o084n1704P0864j2843L104
25234C4190p803K9661o6456J4308Q1657J490o0264r070J2412j6514k5217j1342
25222b2948k4706L6254J6507J6390J1816q724M8229K0079L9126o5570k3288k1195
25210B1970n4715n1021o9585j1994J13747N1316n0629p83l0599k6295J514O7946
25198c9128J10409J1239o0393n0034j8282J5654K6545L1180k4469o1019m573O2803
25186f8N3544K812l9211j4025O3671M3738m5790k8626l3934J2694j0690k6377
25174b2262q434o1667K4760L3905r061J8753M3035N3724M614j6882j6378n5987
$$ y = [-74168, -100116, -20719, 24501, 3611, -47008, -82236, -30385, 2757, 47662, 73481, 66994, 99748, 52187, 41914, 3877, -104605, -129308, -45884, 30853, 24769, -26935, 43929, 31086, 34190, 26387, 56048, -10408, 3900, 85557, 87047, 26783, 17713, 30125, 13611, -11606, -22948, -47654, -11400, 5107, 21497, 33313, 24589, 72818, 92897, 132023, 66453, 43165, 21970, -32745, -83766, -153351, -165345, -51598, -282, -50911, -51694, -82293, -108588, -107074, -39128, 71281, 82520, 22127, -27907, -46189, -30535, -3990, 27190, 2721, -58298, -62871, -68, 53476, 56288, 17077, 3052, 66723, 110461, 64671, 36045, 2111, 14805, 4115, -22262, -30696, -92363, -67603, -33698, -42759, -24006, 19029, 72753, 77367, 60485, 44107, -11880]
25162a1880l2121N1209m1376M912O6857j7629L5236l5809o7646K0983R0974K5106
25150H8816k9690o3822k8254J2497k5755q803L0119L9473n906K9654k4198j5858
25138a727M8930l9029L4085N1615j0836q2219q3028j530Q9824N9215N0302k5328
25126I0274p6600k5048M9824L6289j2257j2304P076K2779l0955l0217k1742p586
25114a0467K6454j503L3660L1992P1979K4439j05516k5196l1762L2456j0938n7852
25102b2254J2466m2319j1307J07248O3376M341l6345m0012O386m7647j7724j0171
25090c3962M6016Q905J7418J6739l1851K0699n5031p4453K706J0498P0341m105
25078f080n1531J5442K5309o9058l3215J2694Q4985j6477J584M2008l9120n582
$$ y = [-11880, -44001, 7208, -34168, -29256, 37601, 19972, 55208, 19399, -48247, -27264, 63710, 88816, 59126, -4696, -32950, -20453, -46208, -55011, -24892, 14581, 8675, 38329, 14131, -1727, 47203, 8174, 42259, 93874, 83038, 819, -82209, -83739, 6085, 65300, 115602, 90274, 13674, -11374, 38450, 74739, 62482, 50178, 57254, 80033, 49078, 18861, -2881, -10467, 15987, 14484, 48144, 80136, 152115, 176554, 71038, 45842, 14080, 46536, 35598, -22254, -9788, -52107, -63414, 43834, 107210, 111551, 75206, 35194, 41580, -6067, -23791, -33962, 12054, 20959, 38377, 55116, 23265, 43964, -11067, -85520, -82814, -72316, -1975, -6080, -57611, -42169, -16860, -85918, -119133, -106439, -21454, -37931, -36347, 5661, -33459, -39041]
25066c9041k484k1727L8248J8015m389L3892j2633m932k956N0927m1114k3168
25054a1362K3916R723l8629K8723K5140l4300J6041L9282l4951o097m9569l8577
25042g0660M1639j2748j9213q541R7819J1345j422J8930m9295M407N5078L3463
25030A00802n135M1973m1145l4550n2409Q188m6707P1534J7133k4532l4545n0420
25018d9813K5957J6008O956Q647M8440j8239l6122N5732R4580j6853p8095k4869
25006C2329K7311L216R577K127p6770J848k6677P415l6675R551L0374L7996P2325
24993I3947J054l6001j9501m4201M9720Q004j2828k3046m4970J0203M8803l1531
24981c47Q689L5784K9442R970j8849N6975p0905n6522J4574p9463n0056j208k0323
$$ y = [-39041, -41525, -63252, -25004, -6989, -11378, 22514, 9881, 4949, 1993, 52920, 11806, -11362, 12554, 22277, -16352, 12371, 37511, 3211, 19252, 58534, 23583, 17486, -32083, -70660, -29021, -41769, -60982, -69523, 28296, 39641, 38219, 57149, 7854, 12261, 67339, 100802, 95667, 137640, 96495, 61945, 9536, 17724, -28983, 42551, 59684, 35152, 607, -49813, -23856, -7848, -892, 7755, 56195, 37956, 1834, 57566, 152146, 135293, 57198, 32329, 59640, 62856, 72433, 74560, -2210, -362, -27039, -19624, -56299, -46748, -16374, 21622, 93947, 95001, 59000, 39499, -4702, 45018, 53022, 40194, 17148, -27822, -17619, 31184, -347, 8342, 44126, 73568, 83538, 64689, 121664, 50759, -5763, 8811, -70652, -120708, -121916, -142239]
24968a42239OJ0139P7402K1467L9242m1906n2672m3077N5934M8014o044k2492
24956e6226K2791k6065M3418l3807J6398J7031q0237K0474O0553P5792K9508n0795
24944C8835l9131O255o6950j8610M4510J926L1525M7317o2272m2375L7823J7306
24932c841o4307l0134n6049N2214N095L5472k0226j0336N138L6456l3484J7263
24920f6739k2045J0073Q322O733K4040m8091M5471N0130j0704o1506j3795P3183
24908d928k9806n5772k1711N4616K0252L0556j0770k1786J6723j0258K6101K4611
24896A7828k0850J098j6326j2016k7741J5755j3249M0835j2105l997j6445n1446
24884i8659j2184k1936J11090Q0904o4562j11208k1000N7265J15716N4054j7814
$$ y = [-142239, -142233, -132094, -54692, -33225, 6017, -35889, -88561, -131638, -75704, -27690, -33734, -56226, -33435, -59500, -16082, -49889, -33491, -16460, -96697, -76223, -15670, 60122, 89630, 38835, -296, 5959, -60991, -79601, -35091, -33165, -1640, 45677, -16595, -58970, -21147, -3841, -68148, -98282, -154331, -102117, -97022, -61550, -81776, -92112, -86974, -50518, -84002, -66739, -88784, -78711, -70389, -63656, -39616, -87707, -42236, 7894, -2810, -64316, -78111, -4928, -34734, -90506, -112217, -57601, -37349, -6793, -17563, -39349, -22626, -32884, -6783, 17828, -3022, -1924, -18250, -30266, -58007, -42252, -55501, -14666, -26771, -30768, -47213, -98659, -110843, -132779, -21689, 59215, -5347, -116555, -137555, -80290, 35426, 89480, 71666]
24873G1666M689p291m4784N0973p476n3363m5361P522O0989l9574l0885l9466
24861g2361M7969M500R393Q347l6736N3949O006j1196o821j4745l1662K2419N1470
24848C0532L3187R296n7151M6027q25j4006L0847K6382j0996k6571L4168k0245
24836H0645q3945m758N5775J1859L3627k1891r2975o2292m1932J2288j4542P6240
24824e1901K5876j1793J1913m3875l6337O1810M0079l6437j1639J290O8474K962
24812B0422k8759N4840M1023l4814p1066o2122j6515O840N6451R867K4150P0649
24800G0966p414p7355n3804n6651K9414k478K7143N7078o1929O877M8347k0255
24788d0061R785J5153r1894l2968L2082K4869J1461L6734q319M1339N7958K6370
$$ y = [71666, 76355, 69064, 24280, 75253, 67777, 14414, -30947, -23425, 37564, -2010, -32895, -72361, -24392, -19892, -10499, -2152, -38888, 15061, 21067, 9871, 3050, -11695, -43357, -20938, 30532, 63719, 73015, 15864, 61891, 61066, 47060, 77907, 104289, 93293, 66722, 100890, 80645, -3300, -8058, 47717, 59576, 93203, 71312, -21663, -83955, -125887, -113599, -128141, -51901, -26025, -37818, -25905, -69780, -106117, -44307, -4228, -40665, -52304, -51014, 17460, 20422, -8337, 46503, 87526, 52712, -18354, -80476, -96991, -90151, -33700, -23833, 317, 70966, 63552, -13803, -67607, -124258, -94844, -97322, -70179, -13101, -75030, -68153, -19806, -40061, -30276, -15123, -107017, -139985, -107903, -83034, -71573, -34839, -43158, -1819, 56139, 82509]
24776H2509m6718p5088k2133L2302O2046K2283j7447k0908k7205m0989k7201J886
24764g6663J4627n981P3773P87J2214r118L8005j3915m5268R927R9883J1550j8868
24751I0953k4615m2233k732l725J7645R614L0077l809r4986L532O6117k2503m3689
24738b0354k6989K5071p772q2671o082P6422N2834J837o0315j4787n479Q42N0536
24725a6907N23J0251K5808k1896L538l3560j3103N517K9813P6866K0155r091J705
24712G9619k1885R880j1642l1703j030L3321N7800K522o1388J5164p5259r4552
24700i9153j7910O3060L9569L1973P521j0969m5832o0520m31P9282L7640l164
24688B1066O678o0241q309L7619L1246m7534j4730P789J3007L7789K5825M4012
$$ y = [82509, 35791, -39297, -61430, -29128, 32918, 55201, 37754, 16846, -10359, -51348, -78549, -76663, -62036, -68017, 5756, 6543, 18757, 9639, 47644, 33729, -11539, -1612, 98271, 109821, 90953, 66338, 24105, 21373, 17648, 35293, 44907, 74984, 71175, -23811, -20279, 45838, 23335, -20354, -47343, -22272, -30044, -112715, -118797, -42375, 10459, 12296, -48019, -62806, -68285, -67443, -16907, -16384, -6133, 19675, -2221, 1317, -32243, -45346, -39829, -10016, 66850, 87005, 77914, 79619, 57734, 67614, 55972, 24269, 23239, 56560, 114360, 116882, 55494, 70658, -4601, -99153, -117063, -54003, -14434, 17539, 25060, 14091, -31741, -92261, -92692, -13410, 24230, 21066, 27744, -32497, -40806, -3187, 28059, -19475, -34205, -26416, -13409, 24380, 50205, 94217]
24676I4217k3693l8137o8189m1689m470K6455O2659L8494K2126k4883q4458j0617
24664e2185M4442L2270k0237m4994K9908j0221J8550K6528k2389m0292J1474R7338
24652G0192J3831n8951q4989l2692K1276L15l5580K7369N814m5247J227K6674
24640i0761j4188j3732m4765K0562o9670j0194O3312O2379j870N040M4331L213
24628d6343J5970l152k4883j9388r090P4823K1977k9648j6931m9909O02L6625
24616d9347k801L0305K9412m7295J2668K6589M960l3061J4923j0246l8117l7846
24604i9856J8909M5140l2030q486J1840M0193r716m215K1688M044J5165l573N892
24591D995J5758j6809k1070l131n6101N8363O4939l4937n2261J5754k2286j6999
$$ y = [94217, 70524, 32387, -35802, -77491, -81961, -55506, 7153, 45647, 67773, 42890, -41568, -52185, -7743, 24527, 4290, -40704, -10796, -21017, -2467, 24061, 1672, -38620, -27146, 70192, 84023, 25072, -59917, -92609, -71333, -71018, -106598, -79229, -73415, -118662, -117435, -90761, -104949, -118681, -163446, -142884, -212554, -222748, -159436, -97057, -98927, -93887, -49556, -46343, -30373, -33525, -58408, -77796, -86886, -12063, 9914, -19734, -36665, -86574, -85972, -49347, -52148, -21843, 7569, -39726, -27058, -469, 4491, -28570, -13647, -23893, -62010, -99856, -80947, -35807, -67837, -76323, -64483, -24290, -34006, -38221, -16533, -12489, 2676, -897, 4995, 20753, 3944, -17126, -20257, -76358, -17995, 46944, 12007, -40254, -24500, -46786, -63785]
24579f3785k532j3313K402r855j5511m621J9065O7216Q525N807q806k9745K5034
24566b0119o794L1765N7962j3646m3836m8674l3172j3464K9941J6235J6803M0433
24554A3434k8510p6704j6714N2255N2136k5871k9219o5484M8182J47M7909j2980
24542d1419j9920J0970j8402m9840l6224J7366R3448K7315o4253m9103L4119O5598
24530c0345p5548j8758Q2953K4754l4261n9382k9313K2582p412k3108M4922j0073
24518a12989j2898J3495O61Q442Q568n3929K4296Q847K0370L4867N812K5227J9663
24505i568N9700J30m7220l165o054j4462l6832J3695O1508N5996k2185k2117J5462
24492D4888l4116j791J4323l914L605q2808m3159K8046J4953L8820N2786j4083
$$ y = [-63785, -66317, -79630, -77228, -87083, -102594, -107215, -88150, -20934, -12409, -6602, -15408, -45153, -20119, -26913, 4852, 62814, 49168, 5332, -43342, -76514, -89978, -60037, -43802, -26999, 13434, -15076, -91780, -108494, -56239, -4103, -29974, -59193, -124677, -76495, -76348, -28439, -41419, -61339, -50369, -68771, -118611, -154835, -137469, -44021, -16706, -80959, -130062, -95943, -30345, -105893, -124651, -41698, -16944, -51205, -110587, -139900, -117318, -124730, -147838, -102916, -112989, -125887, -112392, -111731, -103289, -94721, -148650, -124354, -115507, -95137, -60270, -54458, -29231, -9568, 50132, 50262, 3042, -123, -6177, -20639, -57471, -43776, 17732, 73728, 51543, 29426, 44888, 10772, 8981, 23304, 19390, 22995, -59813, -102972, -74926, -59973, -21153, 31633, 17550]
24480A7550k4335J1881M6955k2929j8325L9429n4242o7135j8429m1701l2893O165
24468a58009k8329N668O1658L2235K354M0011K6270l751M0954J7502j09353m3265
24456a16055M6306M4706L5496N5216m1147j01538J3838M6930j0268p9128L0010
24445g5634N3974J6344Q818o513J3403l6574M660n8270l1937J8084Q3644j8751
24433b8752j4314o956k9183j7066J7028L4849L440L3326l9043k8260J0541k88
24421f4678j841K9729l2291k4640N644L0070N9147N8118K4744J1736k8775K4545
24409I1508R777m7355K0342N5631n3684q115K0982o4210l1039n0230k226L1348
24397b7271K8023J2249L3842M1682q2525m8925J5864O4879N505K297j9362n14
$$ y = [17550, -6785, 5096, 52051, 29122, 10797, 50226, -4016, -71151, -89580, -131281, -164174, -158009, -186338, -180670, -119012, -86777, -84423, -44412, -18142, -21893, 19061, 36563, -72790, -116055, -69749, -25043, 10453, 65669, 24522, -77016, -63178, -16248, -26516, -105644, -75634, -21660, -5316, 3502, -3011, 10392, -26182, -21522, -79792, -111729, -93645, -10001, -28752, -43066, -50022, -79205, -96271, -79243, -44394, -40954, -7628, -46671, -74931, -64390, -64678, -66519, -36790, -69081, -93721, -88077, -58007, 1140, 59258, 84002, 95738, 66963, 91508, 101285, 53930, 74272, 129903, 76219, 68104, 89086, 24876, -6163, -56393, -58619, -27271, 752, 13001, 46843, 88525, 6000, -42925, -27061, 37818, 43323, 45620, 26258, 25744]
24385B5744l9711o1210K744K7372M8497N2180k6257k2099l4137k5604P7704J2534
24373C7757m7256k5619k3687j5952L8948l9398o573M9183j8959p582k1085O387
24361g3836M7746N6417l4194K2952P9941n9108o7228l1940l4241J7789K9579Q80
24349d5243M5874P602O5157J3425j3626n2858m3288j1114K4828j1318j3443R01
24337c3103O531N2935J5270k5577n1801k4341O2130L8850J8993m6345n8527M17
24325d4568O714m4506r66j6283l4431M6299P5628J1380N7102l1299n4914m2073
24313g1917m2230j8377M5253O7154l56p3322L5818L8471K7877N2255K0218r761
24301G1083k3894j9670l6946j5276O802m133Q656k1447o678k1060n3038m1099
$$ y = [25744, -13967, -75177, -72433, -45061, 3436, 55616, 29359, 7260, -26877, -52481, 25223, 37757, -9499, -35118, -58805, -74757, -35809, -75207, -81780, -32597, -51556, -59138, -80223, -73836, -26090, 30327, -3867, 19085, 99026, 39918, -27310, -59250, -93491, -75702, -46123, -45243, 631, 8233, 73390, 86815, 73189, 20331, -22957, -34071, -9243, -20561, -34004, -33103, -26572, 26363, 41633, 16056, -35745, -60086, 2044, 40894, 59887, 13542, -44985, -44568, -37854, -82360, -83326, -99609, -134040, -87741, -12113, -733, 56369, 25070, -29844, -71917, -114147, -132524, -87271, -20117, -20473, -93795, -57977, -19506, 8371, 60626, 80844, 71083, 47189, 27519, -9427, -24703, -17901, -22034, -13378, -34825, -41503, -62563, -115601, -156700]
24289a56700J0970L9924L5309J9348j9840N2814L4738j0803J1998o1480J2969
24278c0753L1785q348l6710J6807J3906P133k8919k9493k6448k5218j8001M6212
24266h8047P922j0160k0493n3267M778N001O158j8693k7380K7386L6612O0869
24254f9314J8058n789j0435n283K6003k5177K7396M1872P908l8183j8634o2027
24242a13605m7586J643M0389J00904M9378o9976m3080Q3050j3314m7004p3304
24231a32505l4435J0876M7341P0507P2838Q843m5061K3294m0630p2239M8825M9092
24219F746P2544j799m3519m5234m7583R178M6226Q136N661j6140M096j1601j7318
24206c0607k9948O776q145L1399L3084L406O576J515j8608p1375p8517O3799K306
$$ y = [-156700, -145730, -105806, -70497, -51149, -70989, -18175, 16563, 5760, 17758, -43722, -30753, 1032, -7316, -44026, -27219, -13313, -6180, -35099, -64592, -91040, -116258, -134259, -88047, -80125, -90285, -110778, -164045, -159267, -154266, -148108, -166801, -194181, -166795, -130183, -69314, -51256, -57045, -67480, -72763, -46760, -71937, -44541, -2669, 5239, -32944, -51578, -113605, -161191, -159548, -119159, -18255, 31123, -38853, -81933, 1117, -12197, -59201, -132505, -166940, -156064, -108723, -38216, 34622, 43465, -1596, 21698, -18932, -91171, -42346, 6746, 79290, 77491, 33972, -11262, -58845, -49667, -3441, 4695, 10356, -5784, -1688, -13289, -30607, -60555, -53779, -61924, -30525, 2559, 5965, 12541, 14056, -4552, -75927, -154444, -90645, -88339]
24193h8339R792K4779n4293R741M8024M8774k8165m7770o694J4560J8772J393
24181d9426L6349L0694n3703k5675j2927l1245O5543J29121l264j01758l389P710
24169a1970M5333K265n680j7318J5432j276j0493K7591j2831m2213j1254K4680
24157B266j1412o9678j6676O1064N1891M8662N3783N174m5128n7863o2023P6877
24145C6937J03795n386j29615o0416j06643K0518j8465K9839M2577L3266O5174
24134A1581k877k1169L6049L7548n3286k5764J1102K993j2199l4379k3301k238
24122g5940j6802K316P369Q3677O7904j0644l9874m0095k5936L8213J0984j08
24110A064l4213N271k2270o812J3475L2373j4404K5491M0388n1681J031o2487
$$ y = [-88339, -78547, -53768, -108061, -98320, -50296, -1522, -29687, -77457, -84151, -69591, -50819, -49426, -13077, 17617, -36086, -61761, -74688, -105933, -40390, 88731, 85467, -16291, -19680, -11970, 33363, 35628, 29948, 12630, 28062, 26786, 16293, 43884, 31053, -11160, -22414, 2266, -9146, -78824, -95500, -34436, 17455, 66117, 119900, 125074, 79946, 22083, -39940, 36937, 140732, 135346, 5731, -54685, -161328, -140810, -159275, -129436, -86859, -53593, 11581, 8704, -12465, 23584, 61132, 7846, -17918, -6816, -3823, -16022, -50401, -73702, -75940, -92742, -90426, -83057, 620, 68524, 57880, 18006, -22089, -48025, -9812, 1172, 1064, -33149, -27878, -50148, -56960, -43485, -11112, -25516, -25, 40363, -11318, -10287, -72774]
24098g2774j0839m965j1715m7817N1541P371L639R818j0941l3261r242L9839L1812
24085e7534p439l5915J9017J4612j4491N7069k7806q3305j8131O420M9936j6694
24073a14261q275N5703L4214J1276M6894r125j7631j11747p800J6802r653j3327
24061a26930Q012L0164M479j00P2570M6187l8921k2509l0741j0876O288L4139
24049b8238k1177l8926j4364O798l9767M5660O9381j2276m1962m1907K1959K4572
24037g0247N818m4303n7749k7574K8915L4596O0882K3764r894L776L7695K5652
24025A1331j830q247J3081m8387j0950N1390l19m9041m3235j1607k3502K2519
24013i8797M5317J2254m5823k2845j2109J4844L6276J1953l61l0362Q963Q404
$$ y = [-72774, -83613, -88578, -100293, -148110, -96569, -89198, -85559, -75741, -86682, -119943, -129185, -89346, -57534, -64973, -100888, -81871, -67259, -81750, -24681, -52487, -135792, -153923, -147503, -97567, -114261, -122536, -66833, -32619, -21343, 25551, 16426, -1205, -112952, -120752, -103950, -113603, -126930, -118918, -88754, -84275, -84375, -11805, 34382, -4539, -27048, -57789, -68665, -62377, -28238, -49415, -88341, -102705, -95907, -135674, -90014, -20633, -32909, -74871, -116778, -94819, -70247, -64429, -108732, -166481, -194055, -165140, -130544, -69662, -45898, -55792, -52016, -14321, 11331, 9501, 1254, 14335, -34052, -45002, 6388, 6069, -42972, -86207, -97814, -121316, -98797, -53480, -41226, -87049, -109894, -122003, -107159, -70883, -58930, -59291, -89653, -80690, -72286]
24001g2286O349m1587Q9324M1815o3002k8880L4521m9334k6576L865Q2522M2969
23989A9700M860J7985n9373n3145P937j3806L5683m0981m5730r165K337J2292
23977a21406n8868L6878Q3546l1399Q0505J3245K0947m4328l4253M9123j2849
23966a8859l204P66N6398j4466l3601m892J837K781k7019j9983m5000O881L4750
23953f3611J3129M0722M0166r706q3088m3455J3012L0263q0876K0852L098P4371
23941d5123J0810m6631j5217M4185Q7175L2483p2387n8837J4426O5599l3080l7194
23929e3791J8507k2172K053l4892m5576K8288j234j1164j852K3307J7834l3557
23917a14249j5677Q685j0051O808M7241K4315J6319K7848K3544m1759k4845Q613
$$ y = [-72286, -65937, -107524, -18200, 23615, -39387, -68267, -33746, -83080, -109656, -105791, -23269, 19700, 24560, 42545, -16828, -69973, -62036, -75842, -40159, -81140, -126870, -136035, -133698, -121406, -180274, -143396, -59850, -91249, -10744, 2501, 23448, -20880, -55133, -6010, -18859, -22063, -21297, 35101, 20635, -12966, -17858, -16021, -13240, -40259, -60242, -105242, -98361, -63611, -50482, -9760, 30406, 20700, -62388, -105843, -92831, -62568, -143444, -122592, -119494, -45123, -34313, -80944, -96161, -51976, 35199, 67682, -4705, -63542, -49116, 16483, -16597, -53791, -35284, -57456, -55403, -90295, -135871, -107583, -108817, -119981, -121833, -98526, -80692, -114249, -129926, -121241, -131292, -124484, -77243, -52928, -36609, -8761, 14783, -26976, -51821, -43208]
23905d3208o6894l6373K8139K234k7693m0428J0486L8345L7460M8192L5244p4389
23893h8885k6855J163O3353k282K8768R0942N2150l7928r1846k9287O9289N2096
23881H0678P647j2626l1496k7342l5468j8581J3682l1507L2864O1690k4936o6838
23869e2233J6743p189o5023q858J7143r814l4866N6473N6478r097J7201N5038
23857C1996K3258r887l197L3298l5717p6007n4961O3098j4921k8637L4011K6486
23845a1180J1616K6870m6302n6671r589O4437K1808j5261J3039j06385q5879r348
23833b02845K5405k1531O690N5351p774L3681l241J4512J3077k5024M4260P3294
23821E855n2197k029N2423J2157Q933J6192L0504k1520o7374m9755N335M6656
$$ y = [-43208, -110102, -146475, -118336, -116102, -143795, -184223, -173737, -135392, -97932, -49740, -14496, -88885, -115740, -114577, -51224, -53506, -24738, 66204, 118354, 80426, -11420, -40707, 28582, 80678, 88325, 75699, 44203, 16861, -18607, -37188, -23506, -55013, -22149, 39541, 14605, -52233, -35490, -42679, -107702, -116560, -99417, -109231, -144097, -87624, -31146, -40243, -23042, 31996, 55254, 45367, 42170, 75468, 39751, -36256, -91217, -28119, -43040, -71677, -37666, -11180, 436, 27306, -18996, -75667, -85256, -20819, 989, -14272, -1233, -107618, -193497, -202845, -177440, -198971, -192281, -136930, -144704, -111023, -114264, -99752, -86675, -111699, -67439, 5855, -46342, -48371, 4052, 16209, 25142, 41334, 71838, 50318, -17056, -66811, -61476, -14820]
23809a4820L4533j8377K5207j9497Q302j0645j4256l3014m9758o572Q1986j1968
23797b8879m9105l1280R645K3519M182N8659l3204N0627L7849J5643O9233l9081
23785H7808n0169r777m6654j1524M1894k4926Q121K0560L6698J1758l0385l1548
23773A856K6550O978l5216j9584q3649L1498L1782K3066J297q9280l018N6629
23761e1091O8146O971j4413o5536n2466L0880k4648j3915R415r144N3544Q5863
23749B3606l3326o3771L1560q665j1799j6182j9988N7728P7680l4288n9221Q042
23737d8624K7741J2625n3804m0471k2279P477O0145L5413J2449j1357L1547j11631
23725a00769p0179m0389o523P0974M2888N5290K865l2589K698m4286L3312O4166
$$ y = [-14820, 19713, 1336, 26543, 7046, 15348, 4703, -9553, -42567, -92325, -98897, -16911, -28879, -77984, -109264, -99619, -76100, -71918, -13259, -46463, 4164, 42013, 57656, 126889, 87808, 37639, 27862, -18792, -30316, 11578, -13348, -5227, 15333, 52031, 63789, 33404, 1856, 28406, 35384, 168, -19416, -103065, -71567, -39785, -16719, -15422, -104702, -107720, -51091, 17055, 24026, 9613, -55923, -108389, -77509, -102157, -116072, -106657, -115801, -62257, 23606, -9720, -73491, -41931, -50596, -62395, -78577, -98565, -40837, 36843, 2555, -56666, -48624, -20883, -8258, -62062, -102533, -124812, -117335, -57190, -21777, -9328, -20685, 10862, -100769, -170948, -211337, -217860, -146886, -103998, -48708, -45843, -78432, -75734, -120020, -86708, -22542]
23713b2542r799P018J1904J7415m9148L6484P6552j6894m2570k7040p4530q9604
23701a82754R912n252J8883J6336O5797M5992L9349J3498k2874J725K4766o5937
23689d0559j8198N7966N1790K7151k6718o7763n1103L4628k4758l4112j7228J3984
23677i4920N4893L7097L141L7663K5803l1088m8346J4657J6031M221k0508n1961
23665e3317k9648O3907j925q7429q935j7935j117O4639K5690R0060J9384j845
23653F1529J8763K351K9247J9362j12862l1343M1067l0049j9322l6191j3164L6140
23641c4472m177K1965N8700l6038p8750p9680j1564J03730M5220m8068j6848R63
23629g9019M3860l9137K000N960l1229l9172O0186R0510n2810L2409l275K084
$$ y = [-22542, -32341, -25323, -13419, 3996, -45152, -8668, 67884, 50990, 8420, -18620, -93150, -182754, -172842, -178094, -159211, -142875, -77078, -31086, 8263, 21761, -1113, 612, 25378, -40559, -58757, -791, 50999, 78150, 51432, -16331, -67434, -32806, -57564, -91676, -108904, -94920, -40027, -2930, 211, 37874, 63677, 32589, -15757, -1100, 14931, 19152, -1356, -53317, -82965, -19058, -20983, -108412, -117347, -135282, -136399, -71760, -46070, 43990, 63374, 61529, 80292, 82643, 111890, 131252, 18390, -12953, 28114, -1935, -21257, -57448, -70612, -34472, -38649, -16684, 42016, 5978, -72772, -152452, -164016, -60286, -15066, -63134, -79982, -79019, -35159, -74296, -72296, -66336, -97565, -136737, -76551, 13959, -38851, -6442, -9717, -7633]
23617g633L0532L682n6619l4394o7131k1371P0600Q786L6442M0730L8280k0951
23605B0953o7679r280k5511J6167Q825L3700L1618J4733j9818k6238k9259Q5108
23593C3319J9101k0995l4247q297n4575R771M4682l9776k0351m6399j3082k5042
23581a55891J1977r888q226R0752l2418m9174M7435K3669n294N510q091l2076
23569a21715M0323k3542j6068J7609M1057n6125k5287K8415j6120j4055O4605
23558h0903P9959J0426j5954J6593L474M1300j5133l6347K9229m565o1388L63
23546c2946R9740k3282l4393L267j8457P844p634j21922K5339J21686L7516m2967
23534A3791mk7603l5568J8052k0713m4239L4861R0989n4690l7018r329n9026p7225
$$ y = [-7633, 22899, 26581, -30038, -64432, -131563, -152934, -82334, -73548, -37106, 3624, 41904, 20953, -46726, -56006, -81517, -65350, -56525, -22825, 8793, 23526, 3708, -22530, -51789, 33319, 52420, 31425, -2822, -11119, -65694, -55923, -11241, -51017, -71368, -117767, -130849, -155891, -143914, -153802, -162028, -71276, -103694, -152868, -105433, -81764, -87058, -81548, -89639, -121715, -81392, -104934, -121002, -103393, -62336, -118461, -143748, -115333, -131453, -145508, -80903, -944, 9482, -6472, 10121, 13595, 54895, 39762, 3415, 32644, 28079, -33309, -32946, 66794, 43512, 9119, 12386, -6071, 1773, -5861, -127783, -102444, 19242, 56758, 13791, 13787, -13816, -49384, -31332, -52045, -96284, -61423, 29566, -25124, -62142, -71471, -130497, -207722]
23521b07722P9270Q8541J327r162M255k9437j777N152J5337J3065O510l7410j14281
23508a86332l9098K9454N6637N4604O8739l6317j4685R1674j7052l1892L7698
23497A3430P4837l7727j18312j03157j860O6421P1793K2204k4069p1437j8903
23486a26780K3993n2130K1555J6006K3920O6539J7524j190m2808r063k7760q2291
23474a72485M7256L6358k1271j3930J1160N591K644j6328l4022M4974R6129m4694
23462e8618m4503J2404j6258M070N3876k2947j0267P0124m799k9864m532M8556
23450b758k838N830K1370J0721J7548K5095l8292o0368J1822K4430J39J9846k5198
23437G347n7894n465M0562R2844l1484k473M4193J1495j14557k5439m9856l1943
$$ y = [-207722, -128452, -39911, -38584, -47746, -43491, -72928, -74705, -69553, -54216, -41151, -34641, -72051, -186332, -225430, -195976, -139339, -84735, -15996, -52313, -66998, 24676, 7624, -24268, 13430, 88267, 50540, -67772, -170929, -172789, -106368, -34575, -12371, -36440, -107877, -126780, -102787, -154917, -133362, -117356, -93436, -26897, -9373, -10563, -53371, -62434, -90194, -172485, -125229, -88871, -110142, -124072, -112912, -107321, -104677, -121005, -155027, -110053, -13924, -58618, -103121, -90717, -106975, -102905, -49029, -71976, -82243, -12119, -16918, -46782, -51314, -2758, -5596, 234, 21604, 32325, 49873, 74968, 36676, -23692, -11870, 12560, 12699, 32545, 7347, -50547, -56012, -15450, 77394, 45910, 43437, 87630, 99125, -15432, -40871, -90727, -122670]
23425a22670j0246K4431J6811L0474L0957M0436K485M1304l4558l2572L0716j9937
23413b369k474n4743k4706L0487J0215j0453L8461n7146k4220N639j8331k0340
23401a29980M7321N3146L1673N2830K1543o3195o0042J2918J7824N343J9548k9318
23389b0389L1635K3882q631K9474l90r2244j7527J070n6567R797Q9570m3911m0759
23376i4990L6428J5569N4930l1173j2797m3179m37R9516K9962R22k9231o1267
23364c5747k5435M2863k0055M6188J6550p2426k5954J7203l5051L1672K0764n2815
23352i2243k7568O6320q4k5345j2230l2864L0172N7665J7508N542m4089m3741
23340a00957J050K0632M483n0001p9511K5726P8045N0777k8693K8486P0674j4327
$$ y = [-122670, -132916, -108485, -91674, -61200, -30243, 10193, 12678, 53982, 19424, -13148, 17568, -2369, -4843, -59586, -84292, -53805, -43590, -54043, -15582, -72728, -96948, -91309, -109640, -129980, -82659, -29513, 2160, 54990, 76533, 13338, -46704, -33786, -15962, -10619, 8929, -20389, 11246, 35128, 26497, 55971, 55581, -36663, -54190, -53120, -109687, -99890, -10320, -54231, -94990, -58562, -42993, 11937, -19236, -32033, -75212, -75649, 23867, 53829, 54751, 25520, -35747, -61182, -18319, -38374, 7814, 24364, -48062, -74016, -56813, -91864, -60192, -39428, -92243, -119811, -53491, -53575, -78920, -91150, -124014, -93842, -36177, -18669, -13127, -57216, -100957, -99907, -79275, -74792, -124793, -204304, -178578, -100533, -49756, -78449, -49963, 20711, 6384]
23328F384p0652L0270N3109J8906P681o7353l410M779j0871M5602J7630n0958
23316a8883n5527m1131M6717L9869j7173j4694j7035K8049O528L5229L3890j1799
23304A4040k4494M3946k2002k2510J5024L1772k4690m0287k2450k9857o9645M9618
23292a01535j646m9252R8953J6699l8148L9053J2072K9922k08o6698l9883R9M0526
23279f0046M812o300k520j2968m9003K1340Q7736L1032K356R40j9662l4597k9989
23266f6869P9443O1127j7208l3999l4657m6576J6401K9876M7745J1882p1051j1534
23254c5420j6798P964K1770k0855M2323N3023p730K6661m2496J474J5886m3646
23242B156o0625j330o532j6727j3662M0018J2717j596o2918R440J9308K5293p1361
$$ y = [6384, -64268, -33998, 19111, 38017, 45698, -21655, -25065, -20286, -31157, 14445, 32075, -18883, -74410, -115541, -68824, -28955, -46128, -60822, -77857, -49808, -43280, -8051, 25839, 14040, -10454, 33492, 11490, -11020, 4004, 35776, 11086, -29201, -51651, -81508, -151153, -101535, -103181, -152433, -53480, -36781, -74929, -35876, -23804, 6118, 5910, -60788, -100671, -100572, -60046, -55234, -61534, -64054, -77022, -126025, -104685, -16949, 14083, 16439, 17379, -2283, -36880, -66869, 12574, 73701, 56493, 22494, -12163, -58739, -42338, -12462, 35283, 47165, -23886, -35420, -52218, -44254, -22484, -43339, -1016, 52007, 44277, 70938, 28442, 29916, 45802, 2156, -58469, -59799, -66331, -83058, -96720, -56702, -43985, -45581, -108499, -99059, -79751, -54458, -125819]
23229a25819N2283L9529l0600L4829L3245K7717J5380m5091k7789M4115k3937
23218f138J316l6536j7818r115J779L169N5994J0388j738K8397o9833p5721L1604
23205h4252m2325L126o609M4265Q2615N3791l1191l1814N120p485k343J1198J058
23192d846k2684o3681r045K8230L2191J2586l5345K9450J7036J9345l9563M1756
23180E430Q191j1893n5648k0146l2520N585P0519K6918n0585J5777q406l1853
23168g8631L0437N4163q502j9871R368K0380j8097K2487k8136l3241P291K4192
23156a8160K1621l7958p2184o811P530L7521K3907M6653K2109l4183K110l9998
23144d7843k9323P454L2107O8863k723j02337l4997K2243K5720N0710m5031K765
$$ y = [-125819, -73536, -34007, -64607, -29778, 3467, 31184, 46564, 1473, -26316, 17799, -6138, -4822, -41358, -59176, -68291, -66512, -63343, -7349, 3039, 1301, 29698, -40135, -115856, -84252, -126577, -123451, -130060, -85795, -3180, 50611, 19420, -12394, -7274, -14759, -17102, -5904, -4846, -27530, -91211, -100256, -72026, -39835, -27249, -62594, -33144, -16108, 3237, -36326, 5430, 13621, 1728, -53920, -74066, -106586, -101001, -30482, -3564, -54149, -38372, -46778, -78631, -48194, 5969, -2533, -22404, -13036, 7344, -10753, 11734, -16402, -49643, -42352, -18160, 3461, -34497, -106681, -113492, -105962, -68441, -44534, 2119, 24228, -9955, -7845, -47843, -77166, -69712, -37605, 31258, 28535, -73802, -108799, -86556, -60836, -10126, -55157, -52392]
23132e2392L9691Q021J9219m1771n4069K8622K1578q907m4852l2600N0903L954
23120f2603k5581M7751M1000M1451l7232j2719j0220M038j5622k8731j636m4787
23108a04891J0717k3032k138P7607K6575k0466J8910N7530n558m9327l1575J3597
23096c2051j5232k9336P631m7130j0926L9147K9417j5268P194J692J3281j6959
23084f8540l4170N9761Q9711j7248n1544J8610K0735k4479k9233j9776k5969J1401
23072g0741O6685N005l7846j867N2213m249l9759M6100l4746o11m153P3587K5851
23059G5469k0819J7894r88j3969k1491k7330k7039R640P9696o5369p5052m2979
23047a12337Q556O4860N9908m4348m8310k3843N6911J331J0989j952J2683n1831
$$ y = [-52392, -12701, -4680, 14539, -27232, -81301, -52679, -31101, -40008, -84860, -117460, -66557, -62603, -88184, -40433, 567, 42018, 4786, -7933, -18153, -14115, -29737, -58468, -60104, -104891, -94174, -117206, -119344, -41737, -15162, -35628, -16718, 40812, 35254, -14073, -45648, -32051, -47283, -76619, -68988, -116118, -127044, -87897, -58480, -73748, -66554, -64862, -51581, -68540, -102710, -42949, 46762, 29514, -22030, -3420, 17315, -7164, -36397, -56173, -82142, -70741, -4056, 949, -36897, -38764, 13449, 9200, -30559, 15541, -19205, -19816, -23969, 49618, 75469, 54650, 72544, 71556, 57587, 36096, 8766, -18273, -8633, 71063, 5694, -69358, -112337, -103781, -38921, 20987, -23361, -71671, -95514, -38603, -37272, -26283, -28235, -15552, -67383]
23035f7383N2746P2225l3284n0578L1714O1610q366m4977n2030M5789N9742M8602
23023A15810j5340j03035m6582R268L047k2964j9954J349K5682N5694Q31K7923
23011C1729L2267q1068o2314l7521M534J1381J0486N4714P8090j9914N4543O9390
22999A46317m9214l2434l6838l5171J3363n4974m7887M3423K150l2258J2339k693
22987g3877l773L5641k0217K7764j7980p4471j1930J8139L2828M8523Q2423J1038
22975E4108j9461o4510o3007N6927M412K8180K5812M6517m6445j9795L1550N4139
22963H8427K2159n2265l5287l2809j825j2023j134k0642o1586q743j032L705K9824
22950h3231J8324K726J1861P9484L4751r59k6161j9496l7279n1079k2309M5241
$$ y = [-67383, -14637, 57588, 24304, -26274, 5440, 67050, 58684, 13707, -38323, 7466, 67208, 115810, 100470, -2565, -49147, -39879, -36832, -59796, -79750, -78401, -52719, 2975, 3806, 31729, 63996, -17072, -79386, -116907, -112373, -100992, -90506, -35792, 42298, 22384, 76927, 146317, 97103, 64669, 27831, -7340, 6023, -48951, -96838, -53415, -51265, -83523, -71184, -73877, -77650, -42009, -62226, -34462, -52442, -126913, -138843, -120704, -87876, -39353, 43070, 54108, 34647, -29863, -92870, -35943, -31531, -3351, 22461, 68978, 22533, 2738, 34288, 88427, 110586, 58321, 23034, -9775, -11600, -23623, -24757, -45399, -106985, -115728, -116760, -113055, -83231, -64907, -62181, -50320, 29164, 63915, 62956, 36795, 17299, -19980, -71059, -93368, -48127]
22938d8127O5972Q8237l7820j01266k2330j3196K8663r890J614K9209J7387N7884
22926E6337R1292q9775p6645o1592n7743K5567n7286k9531N6183K7244q087k5443
22914a49479m7513n9662K0969O4495R400k9647j6902K32R0815R0645j6374l7446
22902h0467l314l3620M3653j1335J3694N1712m5119n4335L1152Q4j9009N8683
22890d8221L0117o571k1127k7854M9186m1011J5903K2614n8097n2354L1623J4769
22878i1023m8154Q99M7459O908K4931K0293p1620l922O1424j7660n4307l9660
22866a64432O1852M9390o6736k4560k8835J9581M208J1657O0317m4338n5678j8083
22854a95657M9740L5172k9516J5830J9395K6820L2920J2336j6001K5488N9542
$$ y = [-48127, 17845, 106082, 68262, -33004, -55334, -68530, -39867, -49757, -48143, -18934, -1547, 56337, 147629, 57854, -18791, -80383, -138126, -112559, -169845, -199376, -143193, -115949, -124036, -149479, -196992, -256654, -235685, -171190, -161790, -191437, -208339, -208107, -117292, -26647, -43021, -80467, -83781, -117401, -73748, -85083, -71389, -19677, -64796, -119131, -87979, -87895, -106904, -48221, -18104, -24675, -45802, -73656, -24470, -65481, -49578, -26964, -85061, -137415, -105792, -91023, -139177, -138278, -90819, -83911, -58980, -38687, -110307, -114229, -52805, -70465, -124772, -164432, -102580, -53190, -119926, -144486, -173321, -153740, -149532, -137875, -77558, -121896, -177574, -195657, -145917, -110745, -140261, -124431, -105036, -78216, -45296, -32960, -48961, -23473, 36069]
22843C6069J4367M8963J0617o272p5723k6989M3016K74n7464q2710J3693M5458
22831c6701j8606L2176m8270K5734O8354q547n7584p827m6618k5538L0648N1235
22819d1544k6943r0625j6193M3596L0405l4914m7620k0200Q5680J06365j0739
22808b2732J6158N0195n7494j9342l46k4549m6455K343n0698p814J3470P6030
22796g1234Q0693m2074j3774R95j9297K2776O3590k2188m4004l478K3287m5658
22784g0366o9188K9550j6324j5382p950P4463K0939m3098L9786P5376j7418m1503
22772d1115p2899m9286j0613P4403Q7106L8820m3856J0335M5083J2943n0208l2999
22760c2286o075m0849l1652J4707R193r493M5582K807j3123k3644n2895o472J633
$$ y = [36069, 50436, 99399, 110016, 103744, 28021, 1032, 44048, 44322, -13142, -95852, -82159, -36701, -55307, -23131, -71401, -45667, 22687, 14140, -43444, -51271, -97889, -123427, -92779, -41544, -68487, -159112, -175305, -131709, -101304, -136218, -183838, -204038, -118358, -11993, -22732, -6574, 43621, -13873, -33215, -33561, -58110, -104565, -102222, -152920, -160734, -147264, -71234, 9459, -32615, -46389, -45394, -64691, -41915, 21675, -513, -44517, -47995, -24708, -70366, -139554, -110004, -126328, -141710, -149660, -75197, -54258, -97356, -57570, 17806, 388, -41115, -114014, -163300, -173913, -99510, -12404, 26416, -17440, -7105, 37978, 50921, 713, -32286, -38361, -79210, -110862, -96155, -86962, -96455, -50873, -48066, -61189, -84833, -137728, -144200, -142567]
22747a42567L8374m693M8561j0900J6916R548j310J3272Q035M6648n215l7807
22735b1138m2136J7144l5092N138j6845L612R3814M3340k2158J1782m4411l2809
22723c9759J7652J3939k6992n3128Q959Q470R5172j0714j8372P1040L0987k8553
22711F8701n7478j9702M7956N5295o299p1215o2978l3132J8349L9520L4102l7948
22699b4829j3878J9712J823j158m289J7771J0255L1146K4511m2227o0207O9529
22687B8159K5475j928k4195k2543k9063K4594L7993P597l6169q0685N8913P014
22675d838q1583m4620N6838M7473j8698N4880N7397P9007n0647m7632o2857k1969
22663c7249N1636O082j3156r4326o7323N2487k398n1448k6896j1359K6966O2458
$$ y = [-142567, -104193, -108886, -60325, -71225, -54309, -44761, -46071, -32799, -24764, 21884, 16669, -21138, -63274, -46130, -81222, -76084, -92929, -89317, 4497, 47837, 25679, 37461, -6950, -39759, -22107, -8168, -35160, -88288, -79329, -70859, 24313, 13599, -4773, 66267, 97254, 68701, 11223, -8479, 39477, 94772, 88473, 17258, -45720, -78852, -60503, -20983, 13119, -24829, -38707, -18995, -17172, -18330, -22619, -4848, 5407, 36553, 61064, 18837, -41370, 28159, 53634, 51706, 27511, 4968, -24095, 499, 38492, 46089, 9920, -70765, -11852, -4838, -86421, -131041, -74203, -26730, -45428, 9452, 66849, 145856, 95209, 47577, -15280, -37249, 14387, 20469, 7313, -87013, -154336, -101849, -104247, -155695, -182591, -193950, -166984, -104526]
22651a04526l647K3867M6567K0961K2437k2688l8360j1856P3165K1593J9960L5043
22639H2516l7973k0128p394n7163M128k5648m5256m071O8764L3596p0137n3093
22627a31859J5922P7519J4073m6148M9524N3287j4726l4538K2589m2462K634K0103
22615a4082m6124m9359N40l899k3238J4490N270q689l7467Q370J9799K6040M3022
22602f5327Q853M9406N9034j2920o2900J8302r133n3663l6139r109J4472J9597
22590g9527K1322l8281O4561J8350l9401k1355J754L853k0863J5293L0145j4384
22578e8533l9603k4748N836M1817q128j1652M4514L1112j4339J7729l5668K1433
22566c0230L778l4363k3215O5724K5202J2675N211k997n8209n5748K5304O4721
$$ y = [-104526, -108173, -84306, -37739, -16778, 5659, -17029, -55389, -67245, 5920, 27513, 47473, 82516, 44543, 24415, 17021, -40142, -36014, -61662, -106918, -110989, -42225, -8629, -78766, -131859, -115937, -38418, -24345, -70493, -20969, 32318, 17592, -16946, 5643, -36819, -34185, -14082, -60206, -109565, -109025, -112924, -136162, -121672, -116402, -125091, -162558, -154188, -134389, -108349, -65327, -56474, -7068, 51966, 39046, -23854, -5552, -14685, -68348, -104487, -113596, -99124, -79527, -58205, -96486, -31925, -13575, -52976, -74331, -72577, -68724, -89587, -74294, -44149, -58533, -98136, -122884, -117048, -75231, -83359, -95011, -50497, -19385, -33724, -15995, -51663, -30230, -26452, -60815, -84030, -18306, 6896, 19571, 24782, 21785, -36424, -92172, -66868, -2147]
22554b147L9482k7911R994K6288M628l1594o9633r8401K9923N6383N2453J14929
22542A04394n418p7152q0890k832J5004J3688l6055L6529N9364N2770m5667j4006
22530A9729j1168l2061j2109p022r955J3663k7293p668j9238m719j3671J6810
22518i4702K1665K8990M1970n851K8237K3902R25k5994k9196l3864k8262l011
22506g5191K4858M8430l5962j7762l9798k5917j0947J7019P4357J3044k7169l9601
22494i4639N0670K875l0334k191L8711p508K230L1218n3596L56K5566O9915J7778
22481E1051j10157n2450p626r585N1916O9250J9870J5514k0826K6247k1845p1978
22469f0619R847k5198r394j3743K7861N526N6502k4340o3297o3185J0446J23811
$$ y = [-2147, 37335, 9424, 19418, 45706, 50334, 18740, -50893, -149294, -119371, -62988, -10535, 104394, 98976, 21824, -59066, -61898, -46894, -33206, -69261, -32732, 26632, 79402, 33735, 19729, 8561, -23500, -35609, -42631, -52586, -38923, -66216, -73884, -93122, -97841, -111512, -94702, -73037, -44047, -2077, -7928, 20309, 44211, 45136, 19142, -10054, -43918, -72180, -75191, -50333, -1903, -37865, -55627, -95425, -121342, -132289, -115270, -40913, -27869, -55038, -94639, -43969, -41094, -71428, -73619, -34908, -42416, -40186, -8968, -62564, -62208, -36642, 33273, 51051, -59106, -111556, -119182, -128767, -76851, -7601, 12269, 27783, 6957, 33204, 11359, -60619, -50772, -75970, -85364, -99107, -71246, -65720, -9218, -33558, -96855, -160040, -149594, -25783]
22457b5783K5754q6358Q346L5932J3095m2062j4648K5447K3737O5089Q8123o1051
22445E5621p4852K5374k6437M9825k7838n9129J799K4907K896j8549M1196k7176
22433c2363l2089J3230O308J3662j2502q36L3783j8625K8233m328o752j6504j8884
22420d7667k9611R7342J3790l3804r654N740q4080J6176L0439J0775R8838J6375
22408H4659k8278J4639n3582l8219L982L4236j6277l451K8250n3218j230n690
22396c4179j8459p795M2047J2650n7923m2069l8022j3434J7119K4743M1743l894
22384g7473K8442L7598p9144l9489O3087K1333M9887K8290j05498k8723M9149
22373e2541K9955K1499K7388q1616o634J6874o013o712j8305N6515M73L3474n7741
$$ y = [-25783, -29, -86387, -78041, -42109, -29014, -71076, -85724, -60277, -36540, 28549, 116672, 55621, -19231, 6143, -20294, 29531, 1693, -57436, -55637, -30730, -27834, -46383, -5187, -32363, -64452, -51222, -44914, -31252, -43754, -44590, -10807, -29432, -1199, -5527, -12279, -28783, -47667, -77278, 20064, 33854, 50, -9604, -3864, -87944, -71768, -41329, -30554, 68284, 84659, 56381, 71020, 17438, -20781, -16799, 17437, 1160, -2291, 25959, -27259, -28489, -34179, -52638, -60433, -18386, -5736, -63659, -105728, -143750, -157184, -140065, -115322, -73579, -77473, -49031, -11433, -90577, -130066, -66979, -45646, 4241, 32531, -72967, -101690, -52541, -22586, -1087, 26301, -55315, -61949, -45075, -51088, -57800, -76105, -19590, -19117, 14357, -43384]
22360d3384p5889N8183Q85J9742o991L7471n223Q034K3960P233J6088j8062m3825
22347b1778l986J3301j6669N0279O8455o5202n3033K8258k7246k5896P847O302
22335c9368l8003k4210M7336N4748J1338j5476l8433m6848J535O372j2988J8819
22323g5178N2272J6789j7654k9935m5355N2304m5118n5484J4139K6184L830L6026
22311f7180m7576O6376O9517K0514O8076p743m8300m0391O057l0891n1768N1014
22299a2295J1657P4256L4563n7864q8377J0747L6130j8349l8061k7749O5615N433
22287d294j9831j1971m3805k5915M2256K0388M7190N2643J496K5337K2485l6528
22275F9451M5994N5757p1479m2320p6281L3297j0527k2089M4330j0577j05193
$$ y = [-43384, -119273, -61090, -60205, -40463, -47454, -9983, -15206, -7172, 16788, 24021, 40109, 22047, -21778, -25764, -12463, -29132, 21147, 89602, 24400, -28633, -375, -27621, -53517, -45670, -39368, -77371, -101581, -54245, 503, 11841, -3635, -42068, -88916, -87381, -81009, -93997, -75178, -22906, -6117, -23771, -53706, -99061, -46757, -91875, -147359, -133220, -107036, -103206, -67180, -114756, -48380, 21137, 41651, 109727, 101984, 53684, 13293, 19350, -11541, -63309, -12295, -638, 73618, 108181, 50317, -38060, -27313, 8817, -9532, -47593, -75342, -9727, -4294, -24125, -36096, -79901, -105816, -63560, -43172, 4018, 56661, 58157, 83494, 105979, 69451, 115445, 171202, 99723, 57403, -18878, 14419, 3892, -18197, 26133, 15556, -89637]
22264h9637n3882M0422J6988M098J838Q0138L401J1098K332R263q6872K3705M3342
22251F234K314J374k8810k1961l2268J04J7467L6097j7395K8705J3589K8554M7408
22238H1412M7606O367j9775k5973n1247o2662J8345K3977j6142q811k4842N392
22226b6353k4188j5789K0061M7553L2597l9542Q173M6820k6139O956K3825j3023
22214D0951N0468k5057J8951n0930K3088r886m4614P7839l555o3604K950j1265
22202E336K3620j2983l3968P2190J2273j8480L316K9210k3629n4592k0078Q747
22190i038N281J7832m8371l4666M9680n0781m8022L9028K7910K5385k8767N2886
22178a643M3205M0561L3653K9p5712q3516q0523O8881N8799Q074n2893n6061l7552
$$ y = [-89637, -143519, -103097, -86109, -82011, -80173, -35, 3366, 14464, 16796, 26059, -60813, -37108, 6234, 8548, 9922, -18888, -40849, -73117, -73013, -55546, -19449, -36844, -8139, 5450, 34004, 81412, 129018, 135385, 115610, 89637, 38390, -24272, -5927, 18050, 1908, -6903, -31745, -26353, -50541, -66330, -46269, 1284, 33881, -5661, 2512, 49332, 23193, 30149, 53974, 40951, 91419, 66362, 85313, 34383, 57471, 47585, 2971, 80810, 77255, 13651, 16601, 5336, 28956, 15973, -17995, 54195, 66468, 47988, 51304, 80514, 56885, 2293, -17785, -9038, -3757, 14075, -34296, -68962, -19282, -70063, -118085, -79057, -51147, -25762, -54529, -1643, 41562, 82123, 115776, 115805, 40093, -43423, -123946, -55065, 3734, 11808, -41085, -97146, -134698]
22165a34698K1125N4363O1750l6323n2596k2595N4246L0938L41p9043m8692N5019
22153i6165K7931J4422K2556N5428m9401l8141K0709K8521O1501N3077L7565J5045
22141A53048m0901l8867j0230j0475q3O030L5758k5970K4036K8530k5722l4221
22129F0933n2761j1022M0170k1782M8211L3585k7754j7550j4139r751k4525n5413
22117e1798K609L7649M8476k7520l7989k9825j4363J13464M4641o6538m4974j4709
22105d0877L5445M3607r726L5931J8080p665j9608l3569R846l8012p1829M694
22093g3683P2301P2834o130o6192p768L6195l6433J2546J2282k1025k4201J0232
22081a9042K2008n743l2903j7504r348R529l7059l2116O5956p473n9074m0605
$$ y = [-134698, -113573, -59210, 2540, -33783, -86379, -108974, -54728, -23790, -23449, -102492, -151184, -96165, -68234, -53812, -31256, 24172, -25229, -63370, -42661, -14140, 47361, 100438, 138003, 153048, 112147, 73280, 63050, 52575, 52492, 58522, 94280, 68310, 92346, 120876, 95154, 60933, 8172, -2850, 37320, 15538, 63749, 97334, 69580, 52030, 37891, 28140, 3615, -51798, -49189, -11540, 36936, 9416, -28573, -58398, -72761, 40703, 85344, 18806, -26168, -40877, -5432, 38175, 28449, 64380, 82460, 74795, 55187, 21618, 31464, -6548, -78377, -73683, -1382, 71452, 65322, -870, -8638, 27557, -8876, 3670, 15952, -5073, -29274, -19042, 2966, -2777, -35680, -53184, -62532, -53003, -90062, -122178, -56222, -63695, -122769, -163374]
22069a63374K6532O6554J9534n396K030r223j905J3270m8478J1392L1158Q437
22057d9469m6345o8363m0778M6975N9006P8001J4887J124K3647j7621m0415L1536
22045g815Q629o5092K112L0330k5262O114K7071J5736K3408j5294N4555j6319
22033C8173j8686k1265n4459P944m7530k0160P0874M1224L0890J9152k7494j9687
22021a024k0565j3050N558J7302R6j8954l7135n7029L3553J4966O3607O4947n808
22008D6464j0670K8875M0028O865k557M908K3613J4065J5447n4740m7548j7258
21996D7492j8800l1963N4680j6671j5359M0539l4263k3119L5968J6841n4644l6121
21984c5420k0564N622N1528j2184m5642J499N009L9770J2168m3436Q18l5369j2007
$$ y = [-163374, -136842, -70288, -50754, -56150, -54120, -63343, -65248, -51978, -100456, -89064, -57906, -49469, -95814, -164177, -204955, -157980, -98974, -20973, -6086, -4962, 18685, 1064, -39351, -7815, 814, -64278, -62166, -31836, -57098, -50984, -23913, -8177, 15231, -63, 54492, 38173, 19487, -1778, -56237, -48293, -95823, -115983, -45109, -3885, 27005, 46157, 18663, -1024, -21589, -34639, -29081, -11779, -11683, -30637, -67772, -124801, -91248, -76282, -12675, 52272, 46464, 35794, 64669, 104697, 111562, 109005, 113913, 137526, 151591, 167038, 112298, 64750, 47492, 28692, -3271, 51409, 34738, 19379, 59918, 25655, 2536, 38504, 55345, 701, -35420, -55984, -50362, 1166, -11018, -56660, -55161, -50152, -10382, 1786, -41650, -40832, -76201, -88208]
21971h8208Q0944K4583l7364O011m958J5703L4490o427m8817N0361J6741L095
21959D6154l3691q1256n2820L142J5724L0474L1474m098L1034L1924N868L6449
21947F0378n197n7693O427J2989K1555N7642o2778l7799N1257M1881p9317p7653
21935f8308M6484o603Q755K6628L9690N0546n678l4488m1581l0577M9350K6090
21923F0308o3311k6106N490k6504K7230n3175J2425j2798l6041K2886J67L6793
21911e2636J08393N8685K4686n7979k2890P393j3267J4499l369l5359M1825L4728
21899A04709l3232j1055n154Q5322O7382n5713j0373n2506j2676k0495O608Q7177
21887A49994O5768R5508N8384k3969N0745P9121J09862O0903k4736k0207N058
$$ y = [-88208, -7264, 17319, -20045, -14034, -18992, -3289, 31201, 24774, -24043, 26318, 43059, 46154, 12463, -68793, -121613, -118471, -102747, -72273, -40799, -44897, -13863, 18061, 23929, 60378, 55181, -2512, 3915, 16904, 38459, 96101, 33323, -4476, 46781, 88662, 9345, -68308, -21824, -28427, -19672, 6956, 46646, 97192, 91514, 57026, 15445, -15132, 34218, 60308, -3003, -29109, -23619, -50123, -22893, -76068, -63643, -76441, -112482, -89596, -89429, -52636, 55757, 114442, 139128, 81149, 58259, 65652, 52385, 66884, 63515, 28156, 69981, 104709, 71477, 60422, 55268, 140590, 207972, 152259, 141886, 89380, 76704, 56209, 62817, 149994, 215762, 311270, 369654, 345685, 396430, 475551, 585413, 646316, 621580, 601373, 606431]
21876F06431j5050m3798j54700j34001m6371j2847K0573K8809n890m0420q7794
21865A14942k0285P070m9268P5716K9629m491l4876j744o384J0874P263K8644
21853A57090N0478J8683j00278j9022M9093l4540m256M4817l0849n2182q8279
21842i245N466P4934k3077k6192L7616L395m6941L172L918k4847K146L4770O9340
21829A04455M6347o8781n0514L9366L6909m9713o7864J8645O5739J8056j9932
21818G2713l2657k1852j1783L4408l816J2906k573k4827k3216j2637J5956M9796
21806E2418k6317N2444L8819m5392o7473Q6791L4232l8580K5031k3305p2101K3142
21794C9709K651o135O8260O47P1465n2366n8383Q252j8924R0313N0841l83j2746
$$ y = [606431, 591381, 547583, 392883, 258882, 212511, 199664, 220237, 249046, 243156, 202736, 114942, 94657, 101727, 52459, 128175, 157804, 153313, 118437, 116693, 110309, 121183, 128446, 157090, 207568, 226251, 125973, 106951, 156044, 121504, 117248, 162065, 131216, 79034, -9245, -3779, 71155, 48078, 21886, 59502, 62897, 15956, 19128, 23046, -1801, 345, 35115, 104455, 150802, 82021, 31507, 70873, 107782, 58069, -9795, 8850, 74589, 92645, 72713, 40056, 18204, 6421, 40829, 37013, 49919, 47346, 22519, -697, -13334, 2622, 52418, 26101, 78545, 117364, 71972, 4499, 91290, 125522, 86942, 111973, 88668, 16567, 39709, 42360, 36225, 104485, 105132, 176597, 124231, 65848, 74100, 55176, 145489, 196330, 195947, 183201]
21781A83201k1800j26967K5215K5066j9094k5113k0948Q667n8936j5456M5282
21770h83O6647L0050K5824m0292m3689j3798o0647m779J17616J14274M5964M2205
21758B78492k7432j0649N3056L0300P5333P0091J70893J97576R8053n7096j11437
21747G67180j24539l1683J129n6855o1439m0607m5588j9970M7101K3959L0585
21736D89273o410J4676J33521J42492J27835J27149Q9599j20103k01432j44536
21726F52064j38437j24009j1254K1465k2261K0540K647j6355j1885k4119J252
21715C49648j9449j2413M420L965j08082q0584J0640M4684J1352o8336k4803M1160
21703A52202M825K9617j5952j4468M8910k1946j7813p222L4672M7273O4815k0929
$$ y = [183201, 161401, 34434, 59649, 84715, 65621, 40508, 19560, 28227, -30709, -46165, -883, 65764, 95814, 121638, 81346, 37657, 23859, -36788, -41567, 76049, 190323, 236287, 278492, 251060, 240411, 293467, 323767, 399100, 469191, 640084, 837660, 935713, 878617, 767180, 642641, 610958, 612087, 555232, 493793, 453186, 407598, 387628, 434729, 458688, 489273, 482863, 497539, 631060, 773552, 901387, 1028536, 1118135, 998032, 796600, 652064, 513627, 389618, 378364, 399829, 377568, 398108, 400755, 384400, 372515, 348396, 349648, 330199, 317786, 322206, 326171, 218089, 137505, 148145, 192829, 204181, 135845, 111042, 152202, 157027, 186644, 170692, 156224, 205134, 183188, 165375, 158153, 192825, 240098, 304913, 283984]
21691B83984m1948n4236p0770m3381q63L0552p2136R355M6644l3595k7065k501
21679B4040K2479l9857j0514L2089Q0324P6417L6823j8901L6358K3811j6875q2927
21667A63267n4449o033o445J0720M9122l4600j21072J3890N6485m918j5988j6782
21655C3197j3864l3073L0307J6616l929j7590N71k2022N8027k4741k3112N0028
21643E0415L6761j6337l5302j5162p4500J0966N4118l2249r021M3647M4910N0263
21631A08509M6324J8441n7203n6206m560N3278J4033O1125j1038j2372L3674m8035
21619A45970p3007J2815O9012L2032k7357l3830k7228m6923j2382m1312m6016
21608d8226L8337O8616l3782l5982O9899m8532j1479K356k2439K619j4020R459
$$ y = [283984, 242036, 187800, 117030, 73649, 72786, 103338, 31202, 40557, 87201, 53606, 26541, 24040, 46519, 6662, -3852, 28237, 108561, 184978, 221801, 202900, 239258, 263069, 246194, 163267, 108818, 102785, 96340, 107060, 156182, 121582, 510, 14400, 70885, 65967, 49979, 33197, 19333, -13740, 16567, 33183, 29254, 11664, 12235, -9787, 48240, 23499, 387, 50415, 87176, 70839, 35537, 20375, -54125, -43159, 10959, -21290, -30311, 13336, 58246, 108509, 154833, 173274, 116071, 59865, 55305, 108583, 122616, 183741, 172703, 160331, 194005, 145970, 72963, 85778, 154790, 186822, 159465, 125635, 98407, 51484, 39102, -2210, -48226, -9889, 58727, 24945, -11037, 58862, 10330, -1149, 1207, -21232, -18613, -32633, -23174]
21596b3174J8795N832J9024n6801J2292r065Q3610J14426l7019k2205p8788o9315
21584d2388j2236M3846J04364R1264j6704o6464k0447j509m3404L7354l2838Q404
21572D9242J7943l9750m4777K8181N9032K5556J2649l6639l4899n0412k3259K7835
21560i298J7088J7207J07213K8583L2392K873R748K6348J3655M869p286l4815
21548B08577m1139m2283m6245j7079j4459J1515l960R762K7103n4246j8902P9292
21536I7936R325k4219l7235l1109k2394q045Q5208R2668K3838Q0487O560k2713
21524B50307L4679q2897q1953L4866m5370L3512P7235M180p964j1995o9994J2257
21512A46863L9370l321k005L8697O491m1336L1981R153L0244M957l8588M5511
$$ y = [-23174, -4379, 1453, 20477, -36324, -24032, -33097, 50513, 164939, 127920, 105715, 26927, -42388, -54624, -10778, 93586, 184850, 168146, 101682, 81235, 79726, 36322, 73676, 40838, 49242, 67185, 27435, -17342, 10839, 69871, 95427, 108076, 71437, 36538, -13874, -37133, -9298, 7790, 24997, 132210, 160793, 193185, 196058, 205806, 232154, 245809, 250678, 243392, 208577, 167438, 125155, 78910, 61831, 47372, 58887, 54927, 64689, 91792, 37546, 18644, 97936, 107261, 83042, 45807, 14698, -7696, -15741, 69467, 162135, 185973, 266460, 273020, 250307, 284986, 202089, 120136, 155002, 109632, 143144, 220379, 224559, 216595, 204600, 134606, 146863, 186233, 182912, 180907, 219604, 226095, 184759, 216740, 225893, 256137, 261094, 222506, 268017]
21500B68017P9078j5786o9122L5570J34542O257n0199L1590J9448L5955m294P465
21488D78521J4467p3061j6252j7391q6607o9883M4848K4083k6316m322K1510m672
21476B84925k7368l4690k1338M8998m7718k5287k7474l7011M6832O0401k5703
21465A94567K8111j3538l5301j0768K3216m6136m5874J7925O582N180q946p230
21453A07788J4734O7767N8466o5865n4505k0828n250N1658O6876N806R941j0263
21441B26325j9243l1548L9398K6999L0410k2011J9498L5815N3465N4728P8940
21430D92776Q3520P0468L8516n3065r456N0742J5367j399K284P317Q1158J4076
21418G92304k7160k3516m2754j25935j04316j16477p756l3711M695L7077l3908
$$ y = [268017, 347095, 331309, 262187, 297757, 432299, 438556, 388357, 419947, 439395, 475350, 471056, 478521, 492988, 419927, 403675, 386284, 299677, 229794, 274642, 298725, 272409, 268087, 289597, 284925, 257557, 222867, 201529, 250527, 202809, 177522, 150048, 113037, 159869, 220270, 194567, 222678, 209140, 173839, 163071, 186287, 140151, 94277, 112202, 118784, 123964, 115018, 107788, 122522, 190289, 248755, 182890, 128385, 107557, 102307, 153965, 220841, 226647, 236588, 226325, 207082, 175534, 214932, 241931, 272341, 250330, 269828, 305643, 359108, 413836, 492776, 576296, 646764, 685280, 632215, 622759, 673501, 688868, 687469, 689753, 697070, 778228, 792304, 765144, 741628, 698874, 572939, 468623, 352146, 344390, 310679, 315374, 352451, 318543]
21407C18543K9578K8559m1671J1266q454J7317q20K0090K8593J4214q27J6148
21395D32536K4129j3399p9974j12120k5884l8677m7296K7916L1017l9247j9106
21384A39895O4737Q783r033o464K3875O4518P671L4107Q6264J1732P600l192j640
21371D28853K1663j0243O1031r035N132K2071M3682M4615m1695K1349j266l6153
21359E50004K3092L2635k9988m9019o5691k2764k3502K4083m3709k7329K8200
21348C96012K3592O5276M0466Q0588K5118M2246J2954R94m717l8697n4022L1635
21336F21445L6481K9396N632m652L4464L4314j1160Q0402J55170P2480J757l0727
21324A025002k2045J7597o920n6706r3223J7918L6481K5148J6682N3036o1080
$$ y = [318543, 348121, 376680, 335009, 346275, 337821, 355138, 354318, 374408, 403001, 417215, 416388, 432536, 456665, 443266, 363292, 251172, 225288, 186611, 139315, 167231, 198248, 159001, 139895, 204632, 213415, 204382, 197918, 221793, 286311, 293982, 328089, 414353, 426085, 433685, 430493, 428853, 450516, 440273, 501304, 492269, 497401, 519472, 563154, 607769, 566074, 587423, 586157, 550004, 573096, 605731, 575743, 526724, 461033, 438269, 414767, 438850, 395141, 367812, 396012, 419604, 484880, 525346, 605934, 631052, 673298, 686252, 687246, 682529, 643832, 589810, 621445, 657926, 687322, 692954, 688302, 722766, 757080, 745920, 826322, 981492, 1053972, 1055729, 1025002, 1002957, 1020554, 1013634, 956928, 863705, 881623, 918104, 943252, 959934, 1012970, 951890]
21313I51890L3021J11388J15950Q781J8551M1822j3583k6296J07474O5006J7991
21302A431995j15L1581N9711k9594O2735P1217R8970M1884r728P222N2635N7295
21290A875808L9231K9417J2566L8605J2563R6222J42702J04046R8190R7739k3014
21279B524075K1412n341m1298K0689M0110J00708Q0037K03590K44069K17876K16942
21268C622869K63286L60617L69763K87115J00766k3556k7595N6729J14383K28193
21258E352570K99295K95369L96974N34392N63309P00879Q40463J083211J366130
21249A1432592J692409K149161K725730L549124M545091N894458P651054R924139
21241D9563758J3120580J7443338K2342088K5733878K3399621J2258781m617786
$$ y = [951890, 984911, 1096299, 1212249, 1221030, 1239581, 1281403, 1267820, 1241524, 1348998, 1414004, 1431995, 1431880, 1463461, 1523172, 1493578, 1556313, 1627530, 1726500, 1768384, 1758656, 1765878, 1818513, 1875808, 1915039, 1944456, 1957022, 1995627, 2008190, 2104412, 2247114, 2351160, 2449350, 2547089, 2524075, 2545487, 2540146, 2498848, 2519537, 2559647, 2660355, 2740392, 2943982, 3188051, 3405927, 3622869, 3886155, 4246772, 4616535, 4903650, 5004416, 4980860, 4953265, 5009994, 5124377, 5352570, 5651865, 5947234, 6344208, 6878600, 7441909, 8142788, 8983251, 10066462, 11432592, 13125001, 15274162, 17999892, 21549016, 26094107, 31988565, 39639619, 49563758, 62684338, 80127676, 102469764, 128203642, 151603263, 163862044, 159244258]
21234A59244258j8400039k3278000k0875093j6064012j1844497q937796o955142
21227E2889679n468854m372178l485202k863789k322328j991675j735721j413499
21219B9236433j148132r42447q46160p41802n58525m78228l36191k51168n2821
21210B3880959K5225J5090Q2284P0110J63634J42347J24536J768j2263l2078j55742
21199B4305870k23103l20747m31548n70942p06385n57950l71199j85544j6996
21190B0921456M1918R624K872J34550J97029L25061L61719M48763Q10896J223493
21180B4477381J913313K743385L663325M815067O538568Q715157J1333251J4640700
21172G8840147J9186789K5879442L5664529M8708224O1226250O1280056L4568524
$$ y = [159244258, 140844219, 117566219, 96691126, 80627114, 68782617, 59844821, 52889679, 47420825, 43048647, 39563445, 36699656, 34377328, 32385653, 30649932, 29236433, 28088301, 27145854, 26299694, 25557892, 24999367, 24521139, 24184948, 23933780, 23880959, 23906184, 23921274, 24003558, 24073668, 24237302, 24379649, 24504185, 24505953, 24493690, 24461612, 24305870, 24082767, 23762020, 23330472, 22759530, 22053145, 21495195, 21123996, 20938452, 20921456, 20963374, 20972998, 20975870, 21110420, 21307449, 21632510, 21994229, 22442992, 23253888, 24477381, 26390694, 29134079, 32797404, 37612471, 44151039, 52866196, 64199447, 78840147, 98026936, 123906378, 159570907, 208279131, 269505381, 330785437, 365353961]
21165C65353961j1971144m9464101n8648750m7899374l4015887k4063292j7914748
21158A21376665j4020963j1280055r172994p521827o090438n047570m181849l456666
21150F0604303k837312k492104k020057j592791j313528j032870j037933j167788
21142D7109920j187703r81261p96623o69333n77945l37646j11830J53645K76006
21133D2877230J36337l53455q69501j125463j205414j330209j514200j725475
21125C4889850j926460j904066j770376j656927j519118j457801j364067j336404
21117B1954631j291187j185881j101482j024321q88945q38610p86205q42064p88570
21108A3207366o72244o05520o19889o20763n41279m94211m52426m26770m08873
$$ y = [365353961, 353382817, 303918716, 245269966, 197370592, 163354705, 139291413, 121376665, 107355702, 96075647, 86902653, 79380826, 73290388, 68242818, 64060969, 60604303, 57766991, 55274887, 53254830, 51662039, 50348511, 49315641, 48277708, 47109920, 45922217, 44940956, 44144333, 43475000, 42897055, 42559409, 42447579, 42601224, 42877230, 43013567, 42660112, 41790611, 40665148, 39459734, 38129525, 36615325, 34889850, 32963390, 31059324, 29288948, 27632021, 26112903, 24655102, 23291035, 21954631, 20663444, 19477563, 18376081, 17351760, 16462815, 15624205, 14838000, 13995936, 13207366, 12535122, 11929602, 11309713, 10688950, 10147671, 9653460, 9201034, 8774264, 8365391]
21099H365391l44663l39502l53727m03324l65679k59376k63259l82736l41928
21090E311197k59846k29192j94961k00620j81600j96350k07331j56315j79569
21081C505413j24387j72246j48193j19293n8494j61580r5726j33310j36171j46314
21071B209699P726l6167n2765j05805q058k7925r2792j12280q2927q0437m7467
21060A570802o8098n2250l1335n1692p2215j8914q0242p2231k7925J2591n5393
21049A053098n8144K7187j4751K7786O8292M0191M2338R9787R1912j4043n2835
21038A310818r9313n6743n1649q0107k4718l2646o2998N696m0732q5921q0260
21027G01427o0656k3913K1912J14313M5875k0306r462l5492o0819J0942j9973
$$ y = [8365391, 8020728, 7681226, 7327499, 6924175, 6558496, 6299120, 6035861, 5653125, 5311197, 5051351, 4822159, 4627198, 4426578, 4244978, 4048628, 3841297, 3684982, 3505413, 3381026, 3208780, 3060587, 2941294, 2882800, 2721220, 2625494, 2492184, 2356013, 2209699, 2217425, 2181258, 2128493, 2022688, 2014630, 1986705, 1893913, 1781633, 1698706, 1618269, 1570802, 1502704, 1450454, 1419119, 1367427, 1295212, 1276298, 1196056, 1123825, 1095900, 1108491, 1053098, 994954, 1022141, 1007390, 1035176, 1103468, 1143659, 1185997, 1285784, 1377696, 1363653, 1310818, 1211505, 1154762, 1103113, 1023006, 998288, 965642, 902644, 908340, 867608, 781687, 701427, 640771, 616858, 638770, 753083, 798958, 778652, 769190, 733698, 672879, 683821, 663848]
21016F63848K7979K2135Q170p5839m4303j2839l8774k1460k5779k1938M8294R0739
21004F20233j5967J0723J7539J13971L7231K9768j006J3851L3487M5917P0167
20993I75914O781l8305k3757J1150M5198j0227k7510p3213L3858J20161Q971n2772
20981I76249k2508p7414n9160J4014k2792K3799j3363m1898q3980n9938o8184
20970E64825p0585K013L947N210P710L0681L6732J6204M4644L2555J5418m6060
20958F43294j01904m7137j9481m6223n8221n752J6096P3245L8846r230j0380N141
20946D78294l7362l4206j4341j2339P038K6799q3907k0226L1913n2063k9507j0563
20934B49530L233O7963j2704K0424M4662P5316Q4260P6060J23137K00184R2937
$$ y = [663848, 691827, 713962, 722132, 646293, 601990, 589151, 550377, 528917, 503138, 481200, 529494, 620233, 604266, 614989, 632528, 746499, 783730, 813498, 812492, 826343, 859830, 905747, 975914, 982695, 944390, 920633, 931783, 976981, 966754, 939244, 866031, 899889, 1020050, 1029021, 976249, 953741, 876327, 817167, 831181, 808389, 832188, 818825, 776927, 692947, 633009, 564825, 494240, 496253, 500200, 505410, 513120, 543801, 580533, 596737, 641381, 673936, 689354, 643294, 541390, 494253, 474772, 428549, 370328, 364576, 380672, 453917, 492763, 483533, 473153, 478294, 440932, 406726, 392385, 380046, 387084, 413883, 329976, 309750, 341663, 289600, 260093, 249530, 252763, 320726, 308022, 328446, 373108, 448424, 532684, 608744, 731881, 932065, 1025002]
20923A025002n6214p9848r3279o6735p6295m2440M7267k4695p8258p8309p6930
20912C99266m8365k4763K8261n614r7857l7628L5986n3951m6652L223o141N5130
20900B00895P7584K7141k6680o348l4690o2782k2747Q5307j3229P014k5316k9788
20888A76361L1126K3879K9448p0234o6185l9120o190J8377q944j7050K733L3384
20876A07585p981j1189K6370n2265L3073k0137O8152k0728m8278m1370q3035l4245
20864h4048R9924Q1940R134M612L6303k7070j6842l2625j2859l0884o8314k8190
20852f8919Q0630N5563k8450o7463P069M2834J8899j6825k5819J4633L3159M0585
20840H5896J5326L4879l517n0891j3412M3543N2277k7936l4919j6855j213j5448
$$ y = [1025002, 968788, 888940, 795661, 728926, 652631, 610191, 657458, 632763, 554505, 476196, 399266, 350901, 326138, 354399, 348785, 250928, 213300, 249286, 195335, 148683, 151906, 145765, 200895, 278479, 305620, 278940, 272592, 237902, 175120, 152373, 237680, 224451, 231465, 206149, 176361, 207487, 231366, 260814, 190580, 124395, 85275, 79085, 97462, 88518, 71468, 74201, 107585, 99604, 88415, 114785, 62520, 95593, 75456, 143608, 122880, 74602, 33232, -49803, -84048, 15876, 97816, 106950, 111562, 147865, 120795, 103953, 71328, 58469, 27585, -40729, -68919, 11711, 67274, 38824, -28639, -21570, 21264, 40163, 23338, -2481, 12152, 45311, 85896, 101222, 136101, 132584, 81693, 68281, 111824, 164101, 136165, 101246, 84391, 83178, 67730]
20828F7730j7120j5832K9713M7173j5632r78N6346P0902n0017j26543n7645K4299
20816A2396M8948k5977j2044n526P4665J9550j2542o5569k1984P6364L8208j9309
20804A07180j6574l2210l4606p2552N2567N1457M121q1964l3486j4685O264O2426
20792b062M1932O8141J3677k5433n102l479m6326l3403n525q2452k5734L1603
20780g4163J04778J6309n0322q057J6546n1269O676j9874J4538k7097R196K8469
20768c4270k1227L7767K6632l9604o513L0180N441n4577N1840N8421N2583k2221
20756H4452o9413J4637m7532j3878K3374r974L2919J2078k7578J6625k9413k970
20744a6673k9508l1570Q1321K1853n5446M0583K1421p918p8908Q30m0745j7424
$$ y = [67730, 50610, 34778, 64491, 111664, 96032, 95054, 151400, 222302, 172285, 45742, -11903, 12396, 61344, 35367, 23323, 17797, 92462, 112012, 99470, 33901, 11917, 88281, 126489, 107180, 90606, 58396, 23790, -48762, 3805, 55262, 59383, -22581, -56067, -70752, -64488, -2062, 39870, 108011, 121688, 96255, 91153, 87674, 41348, 7945, 2420, -80032, -105766, -74163, 30615, 46924, -3398, -11455, 5091, -46178, -39502, -59376, -44838, -71935, -62739, -34270, -55497, -17730, 8902, -30702, -37215, -7035, -1594, -56171, -4331, 54090, 106673, 84452, 15039, 29676, -17856, -31734, -8360, -18334, 14585, 26663, -915, 15710, -13703, -16673, -46181, -77751, 3570, 25423, -30023, 10560, 31981, 24063, -54845, -54015, -94760, -112184]
20732a12184l8732l1393K8594J6880L5439n3728J0257M5722P092M4822N1781k6479
20720b1929q0268j3442L3219j1260l231j294j8594Q1709K4476k2754M8570n7722
20708d2520j0470Q2865K4373n5385j4055K0927P947l8726N3840O7697j0599j7155
20696F8739n0769m8451L828K5184O4459O0190o8417J7504l7743k5859j6074m5638
20684e3047p2334R462O8367K0382n936K6091l3563j4751K2642n9451r703P0100
20672c1741O8900k7704k416K5784J2160m4848k6137P889m070m4850o919k3057
20660i7009k0650J0867N8952M3628K9963p648j9634l8342L8939Q2098J7421N6706
20648A55291l0232P406k1678p1140Q591J6714N775m4093l8653p1455l0787L8045
$$ y = [-112184, -150916, -182309, -153715, -136835, -101396, -155124, -144867, -99145, -92053, -47231, 4550, -21929, -102197, -115639, -82420, -93680, -96911, -98205, -116799, -35090, -10614, -33368, 15202, -42520, -52990, 29875, 54248, -1137, -15192, 5735, 13682, -25044, 28796, 96493, 85894, 68739, 17970, -30481, -26653, -1469, 62990, 123180, 54763, 72267, 34524, 8665, -7409, -53047, -125381, -115919, -47552, -27170, -33106, -7015, -40578, -55329, -32687, -92138, -101841, -31741, 37159, 9455, 7039, 32823, 44983, 135, -26002, -18113, -22183, -67033, -73952, -97009, -117659, -106792, -47840, -4212, 25751, 18103, -1531, -39873, -934, 81164, 98585, 155291, 125059, 132465, 110787, 39647, 48238, 64952, 70727, 26634, -12019, -83474, -114261, -76216]
20636g6216M3829o2920J9121Q1869k8748j4001n046k2183m6715j9690O3272K8475
20624c8953k5274N5241o2037L6735N9885L9322r391l3502J9099l2494n0310K5613
20612a6066J4561M2839j0213k7180J162J9171O858O7403R0699J01138M6806k4455
20600C12723j3848O2704J43870J36915P4156J93441J30432K1736m3491j05800
20590I12838l9520K3853L2964R110J7757l8588l6179L717l4477m0726J9981J00346
20578I31076L0125M6058K6328P3776K978q7003p9251m6984r2896r6673n5389r865
20566F42280j1740n308p3027o350l7603j10875n5661J6997l2685N0192L4056j6743
20554C93533j02887q8332r3693M8635P5188L4154n0153l9303j4297j6620l0022
$$ y = [-76216, -32387, -95307, -76186, 5683, -23065, -37066, -42112, -64295, -111010, -130700, -67428, -38953, -64227, -8986, -71023, -34288, 25597, 64919, 55528, 22026, 41125, 8631, -41679, -16066, -1505, 41334, 31121, 3941, 5103, 24274, 31132, 98535, 189234, 290372, 337178, 312723, 298875, 361579, 505449, 642364, 716520, 909961, 1040393, 1062129, 1018638, 912838, 873318, 897171, 930135, 939245, 957002, 918414, 882235, 885952, 851475, 810749, 830730, 931076, 961201, 1007259, 1033587, 1107363, 1110341, 1023338, 944087, 897103, 804207, 707534, 652145, 642280, 630540, 625232, 552205, 545855, 508252, 397377, 341716, 358713, 326028, 376220, 410276, 393533, 290646, 202314, 108621, 157256, 232444, 266598, 216445, 177142, 162845, 146225, 116203]
20543A16203j2931N7267j9653m6013L1421J9099l3960j3725l9548L1220M896l3139
20531F1137K406j110o5054j3955M05J1395J9565N2067j2608K5486k4993n2935
20519A806K5660L3101r6630j00844O665K4132l2131R9983J7984n4252N0235j388
20507b5679M3357N7450n1386p1267j4637M877K5814O1423L1735J6609j3014o7923
20495b641n0822l7890M0907l8007n0435j0410k8429j6964J458J6375J768j1757
20483a86847P0451N8958L158j5030k5459O5670J8413m5908J696N736m0154O7129
20471b2187N6714r8682m2562k5150O1832M8542k952n9454o3916J0285O9127L9221
20459b9182J1133R292k9319k5964o854K990j0904l1106N433j2717n333K171m7665
$$ y = [116203, 103272, 160539, 140886, 94873, 126294, 145393, 111433, 97708, 58160, 89380, 94276, 61137, 63543, 62433, -2621, -16576, -16171, -4776, 14789, 66856, 54248, 79734, 54741, 1806, 27466, 60567, -36063, -136907, -130242, -106110, -138241, -38258, -20274, -74526, -24291, -25679, 17678, 75128, 23742, -47525, -62162, -57285, -31471, 29952, 61687, 78296, 65282, -2641, -53463, -91353, -50446, -88453, -138888, -149298, -177727, -194691, -193233, -176858, -175090, -186847, -116396, -57438, -54280, -69310, -94769, -29099, -10686, -56594, -54898, -49162, -89316, -22187, 34527, -64155, -106717, -131867, -70035, -21493, -24445, -83899, -147815, -137530, -68403, -29182, -18049, -8757, -38076, -64040, -70894, -67904, -78808, -109914, -104481, -117198, -122531, -120360, -168025]
20446a68025M5749N1295j2141q0439K410L0609M9819J3997N7495m0516k6524j5262
20434i1533P8093K0308p1007M4564K3570j9717q389K9155l2816j3221q2307r7921
20422b21221Q3579O0431m7528j022r966L0609o415J7689N5512P6225n2851m2745
20410e7703L3971j6391l4591k2506K3979L0443l6854K7186l258q7k526j0474j2623
20397h1434p9158l2504J2038J3917J4288L1196N5778O2242m6501n9406k2140M1734
20385h9950K2049j8687o9041m8456j1418J4661N8997N9315l3213o5097J7916Q4300
20373g8624o389K8148L8317k6719L2811M5180K4453L7307r822o6829q4512n0888
20361a17567O7762m545j03461J8668Q8325j6201J4673j6768l2591K1081J05665
$$ y = [-168025, -122276, -70981, -83122, -163561, -161151, -130542, -80723, -66726, -9231, -49747, -76271, -91533, -13440, 6868, -64139, -19575, 3995, -15722, -24111, 5044, -27772, -40993, -123300, -221221, -137642, -77211, -124739, -125761, -135727, -105118, -111533, -93844, -38332, 37893, -14958, -57703, -23732, -40123, -74714, -97220, -73241, -42798, -79652, -52466, -55724, -55811, -58337, -68811, -81434, -160592, -193096, -181058, -167141, -152853, -121657, -65879, -3637, -50138, -109544, -131684, -89950, -67901, -86588, -155629, -204085, -215503, -200842, -141845, -82530, -115743, -180840, -162924, -78624, -85013, -56865, -18548, -45267, -12456, 32724, 57177, 94484, 84662, 17833, -66679, -117567, -49805, -54350, -157811, -139143, -50818, -67019, -52346, -69114, -101705, -80624, 25041]
20350B5041K3390j16526K1811K9810M6276j4370r6589K9176O215o8922O451l4806
20338a43043l76N2534j5060p1407k372l581k2409j4597M3046Q9920m671O217K2941
20325f2858l4734K4649M6289K5299J8700K1534k2279m0809m5610j618L5179l8592
20313g4850q128P3465J634p561p6475j9314N8101J5775O7914M2528q6461l6385
20301d9757j9399n4485l7992q403R2711Q273n2977j5414L8027M4425J8422k8271
20289f4840r002O9097P4931L0437m1110q3123o6892L8927M6255O370m1419L0350
20277a0019K2168O0126P9850J2398L1972M5736N035r87k9507N6621M9749K1590
20265C44732O8068k4413K0867j0755K5323l1310q6515l318j318m605J3835O179
$$ y = [25041, 48431, -68095, -46284, -16474, 29802, 15432, -81157, -51981, -45766, -114688, -108237, -143043, -143419, -90885, -105945, -177352, -179724, -183305, -205714, -220311, -177265, -87345, -92016, -85799, -62858, -97592, -72943, -26654, -1355, 17345, 38879, 16600, -24209, -69819, -71437, -36258, -74850, -82978, -9513, -7879, -15440, -91915, -111229, -53128, -37353, 30561, 73089, -13372, -49757, -69156, -123641, -161633, -170036, -77325, -69052, -122029, -137443, -99416, -54991, -36569, -64840, -73842, -4745, 70186, 100623, 59513, -23610, -90502, -51575, -5320, 1050, -40369, -10019, 12149, 72275, 152125, 164523, 196495, 242231, 247266, 246279, 216772, 273393, 323142, 344732, 412800, 388387, 409254, 398499, 423822, 392512, 305997, 302679, 301361, 296756, 310591, 316770]
20253C16770K9582m032J656l2046n3020M812L3170l3363p326m6033j09848J401
20241A01723K8963M6128k030l5089m125m5217r009K7301j7647J4962p2094n012
20229B8854L7539J1564l4176r4130M4846M7201n2649j0798k9495r2811L3294K7517
20217h3244O1050K2523o2175L0481O1748J01922K2656j25685q9650n1445K6005
20206h5814L8917j7295m714k2958L1866K5205j9217q030K5906J5971n2203J7971
20194e4395O4147Q59n1512o4344K5414J5214L8448j3516n9719l5688O4407P1133
20182D48l6427l0122J8303K995M881K805K0178q824r848o293J3745M9446J2197
20169C3484m1631o7726J527J10667K3787p2208k635o1331k8520N816l3095K9060
$$ y = [316770, 346352, 342320, 343976, 311930, 258910, 263722, 296892, 263529, 256203, 210170, 100322, 101723, 130686, 176814, 174784, 139695, 135570, 90353, 81344, 108645, 90998, 105960, 33866, 28854, 66393, 77957, 43781, -50349, -5503, 41698, -10951, -21749, -51244, -144055, -110761, -83244, -22194, 329, -61846, -31365, 30383, 132305, 154961, 29276, -60374, -111819, -85814, -46897, -64192, -68906, -91864, -59998, -34793, -54010, -62040, -36134, -20163, -72366, -54395, 9752, 10611, -40901, -105245, -79831, -64617, -26169, -39685, -99404, -135092, -70685, 448, -35979, -66101, -47798, -44803, -39922, -37117, -16939, -25763, -35611, -41904, -28159, 21287, 33484, -8147, -75873, -74346, 36321, 60108, -12100, -14735, -76066, -104586, -98770, -131865, -102805]
20157a02805k5379L0178O9416k8477J2181M0992k9574m4100j6047l7503J3772
20146a17346M2095l3705j2766m8804K4317J7784Q0708n733j8979j0201L5921o095
20134e2804J1185p052K4366p389N876J1196J4200r210m4010Q3015O1970n566n7694
20121B8083k7783p0621q4110m5048J584N0695J08421O4735k2033j2763o0307n0624
20109a19771o5787n2759J7091N1164M745k6799n0831O431k139L3715K1089r21
20097a84772K2408M3060J4583M4948j3610k6995N5050L0733J0803O0995N0757
20086A07960n596j14801p141j5889n675k4950o3205j3755L2261M4075Q4087J7819
20074C5190j5023n2734j6395O0490Q689j0273Q281J1976L3050l7Q442l9313l7745
$$ y = [-102805, -128184, -98006, -28590, -57067, -44886, -3894, -33468, -77568, -93615, -131118, -117346, -75251, -108956, -121722, -170526, -146209, -128425, -47717, -53450, -72429, -82630, -46709, -52804, -41619, -48671, -24305, -31694, -25818, -14622, -422, -9632, -53642, 29373, 91343, 85777, 28083, 300, -70321, -154431, -199479, -197895, -147200, -38779, 25956, 3923, -8840, -69147, -119771, -185558, -238317, -221226, -170062, -165317, -192116, -242947, -236516, -238655, -204940, -183851, -184772, -162364, -119304, -104721, -59773, -73383, -100378, -45328, -14595, -3792, 57203, 107960, 102364, -12437, -19578, -35467, -41142, -66092, -129297, -143052, -110791, -66716, 17371, 35190, 20167, -32567, -48962, 11528, 20217, 9944, 18225, 30201, 63251, 63214, 71656, 32343, -5402]
20061e402q7622l1106L2743K1276R1450r709q484M4933Q641o7701L8935M5174
20049G3128J5153l9116l8207j1001n3602m1138k5378o3241L3809J01021M2193
20038f379l0688o1484m1385Q342P815Q0001k5131R570k9860k3414Q598P9707M9372
20025B5064J5436n3316K983M6881o120k7519R498K1680N0597J4100J8987k97L5940
20012A53914K1796m740K5319L031j5500O0516O4149m5764j33140o7904O444J1899
20000H0020J0832J1101j4379L6770p2643O2P865O661M2737K0610j5587m1887r6737
19987b4575j8039m100L1203N153N207N988N6720K1986j2798p8972l3783m3859
19975h9869l0770M855M5375J2508j5866J9715j5607J8228k6411k8386L1621L3726
$$ y = [-5402, -93024, -124130, -91387, -70111, 21339, 11630, 3146, 48079, 56720, -10981, 27954, 73128, 88281, 49165, 10958, -43, -53645, -94783, -120161, -183402, -149593, -48572, -6379, -37067, -98551, -139936, -131594, -123779, -43778, -68909, -59339, -89199, -112613, -104015, -24308, 25064, 40500, -12816, -9833, 37048, 30928, 3409, 12907, 34587, 85184, 99284, 118271, 117974, 153914, 175710, 170970, 196289, 199320, 183820, 244336, 308485, 262721, 129581, 61677, 68121, 80020, 90852, 101953, 87574, 124344, 51701, 51763, 59628, 66289, 109026, 129636, 114049, 72162, -24575, -42614, -46714, -15511, -10358, -5151, 837, 57557, 79543, 66745, -12227, -46010, -89869, -120639, -115784, -70409, -57901, -73767, -54052, -69659, -51431, -77842, -106228, -74607, -40881]
19963d0881P1847J0493j363m9277K2858J2858o2863L665N8904P2581j0566o1488
19951B6768l1051k2858l3321n2541L4151P1840R8631j8636l2912j7206p730m4830
19939b9695j2347N7594q328K528m801K151O7539J5056q152K4090J8635k042O113
19926A28341L5911J231M75N5888n108Q026M5957p161n7876n330J11836J06047
19914D18237K6324k0147k8154k546M3437p9253k8222J4696L7883M2365k0753o2727
19902C41140m1413l1205m8420M3592P0444L2292l0862n8555r0424Q276N7742L0037
19890B82644n8836n4765k9264j0578O5777L0597K1170l8355k8372M148R608M6037
19878B39811j7928r465J5949M6444l4960M1583k835P0376Q1041O242J2311j3207
$$ y = [-40881, 30966, 41459, 40096, -9181, 13677, 26535, -36328, -32663, 26241, 98822, 88256, 26768, -4283, -27141, -60462, -113003, -78852, -7012, 91619, 72983, 40071, 22865, 15135, -29695, -42042, 15552, 7224, 9752, 4951, 7102, 74641, 89697, 81545, 105635, 124270, 122228, 128341, 164252, 165483, 165958, 221846, 216738, 224764, 270721, 263560, 205684, 200354, 312190, 418237, 444561, 424414, 396260, 393714, 437151, 357898, 329676, 344372, 382255, 424620, 403867, 341140, 299727, 268522, 220102, 263694, 334138, 366430, 335568, 277013, 186589, 194865, 252607, 282644, 223808, 169043, 139779, 129201, 194978, 225575, 246745, 208390, 180018, 184166, 193774, 239811, 221883, 212418, 228367, 274811, 239851, 281434, 278599, 348975, 430016, 436258, 448569, 435362]
19866D35362K7258J05933l6744n638M7532J1163N810L8989n3192m2678K7184k1441
19854E39538O510M2841J5721K6693O7494L2016n6190P09j1294k8426K3075k2491
19842F36196j3281J4021j5368L033K6131M8606Q357j6882j9038k5009M9997L2980
19830G29743J4470K1194r70J6271L110K9998j4897J4385k990o075K7324P3451
19818I05014L7527P8799M9077m9217J6520m5482N1195L481J3630M0354j8697J2927
19806A095128M3367J3453J0588j3869k9244M4293R534J2576m0106J6866P7048
19795A239634L9412K5079l5958N7049J16619J14129R1210N1788O8588R6320J40557
19784B004427J85111K27824J26964K46057K41524L78293M18656M27881M78283
$$ y = [435362, 462620, 568553, 531809, 526171, 573703, 584866, 590676, 629665, 576473, 533795, 560979, 539538, 546048, 588889, 604610, 631303, 698797, 730813, 674623, 675332, 664038, 635612, 658687, 636196, 622915, 636936, 621568, 624601, 650732, 699338, 707695, 690813, 671775, 646766, 696763, 729743, 744213, 765407, 764437, 780708, 783818, 813816, 798919, 813304, 810314, 804239, 831563, 905014, 942541, 1021340, 1070417, 1021200, 1037720, 992238, 1043433, 1046914, 1060544, 1100898, 1082201, 1095128, 1138495, 1151948, 1162536, 1148667, 1119423, 1163716, 1173250, 1185826, 1145720, 1162586, 1239634, 1279046, 1304125, 1268167, 1325216, 1441835, 1555964, 1647174, 1698962, 1767550, 1863870, 2004427, 2189538, 2417362, 2544326, 2790383, 3031907, 3410200, 3828856, 4256737, 4735020]
19775D735020N87443P19219R41221J096430J394844J813848K393692L170544M096533
19766B0948794N106097N733799N364631M299479L328437K537801J184905k52307
19758D8251636j36202J674179M270755O459597P851428P515382O013640L789531
19750H5689946J033129j978927m462419n970168n976583m262253j657214Q46290
19742F3261801K224540J597145m13934k100870k928084l982969n260703n730198
19734D6666728n064676l931782l043478k399446j938916j538629j284092j030637
19726B6435072r76980r56623q90768p45303o60304n42367m51486n55767n01299
19717B0154175m74504m65839n00302n05856m29094n36656n84811o05827n01823
$$ y = [4735020, 5322463, 6041682, 6982903, 8079333, 9474177, 11288025, 13681717, 16852261, 20948794, 26054891, 31788690, 37153321, 41452800, 44781237, 47319038, 48503943, 48251636, 48115434, 49789613, 54060368, 60519965, 68371393, 75886775, 81900415, 85689946, 86723075, 84744148, 80281729, 74311561, 68334978, 64072725, 62415511, 63261801, 65486341, 67083486, 66669552, 64568682, 61640598, 57657629, 52396926, 46666728, 41602052, 37670270, 34626792, 32227346, 30288430, 28749801, 27465709, 26435072, 25458092, 24501469, 23610701, 22865398, 22205094, 21662727, 21211241, 20655474, 20154175, 19679671, 19213832, 18713530, 18207674, 17778580, 17241924, 16657113, 16051286, 15549463]
19708A5549463n37126n57109n88636n59704n22720n61212n09428n09257n76850
19699A0627421n72465n57704m95319m37604m24054m59893m17419m22249l36199
19690F504515k79483l73617l06463l01067l19592l06786j60257k22602k14363
19681D020285j69454j47793k06913j79321j29572j32386j07310j29419j29819
19672B688298r5297r0680n3582m5188j03746r5111p0182j15679j44523j37189
19662A737121o7604n5257p0438j7190j5006o2573j18061l1647r013N88j22914
19651A168006j8391q749k4913j8808J1502R086m3490l5940K8057K8316K0183q771
19639A106088n4456j0640K7556J26044J18262J18541J14959J39937J10734M1745
$$ y = [15549463, 15012337, 14455228, 13866592, 13306888, 12784168, 12222956, 11713528, 11204271, 10627421, 10054956, 9497252, 9001933, 8564329, 8140275, 7680382, 7262963, 6840714, 6504515, 6225032, 5851415, 5544952, 5243885, 4924293, 4617507, 4457250, 4234648, 4020285, 3850831, 3703038, 3496125, 3316804, 3187232, 3054846, 2947536, 2818117, 2688298, 2593001, 2502321, 2448739, 2403551, 2299805, 2204694, 2134512, 2018833, 1874310, 1737121, 1669517, 1614260, 1543822, 1526632, 1511626, 1449053, 1330992, 1299345, 1290332, 1290920, 1168006, 1149615, 1140866, 1115953, 1097145, 1108647, 1117733, 1074243, 1038303, 1066360, 1094676, 1114859, 1106088, 1051632, 1040992, 1068548, 1194592, 1312854, 1431395, 1546354, 1686291, 1797025, 1838770]
19629A838770N7936o662l634N3040J48190J56675J49071J29018R4131R4636J6296
19618B727467l7524q0958p7114p6404j33285m8187J2387L3434L8504Q150q1000
19607B285470j28804j39918j04060j27168r8923m3228p6236j10516j18540l0597
19597A307480j51o0007m2039n036L3720j6025m1401n5515l7167n3494O3843L807
19585A098015k2158L4442l6925m89k8912n7488o5106l6901J4038N0103M6348N4827
19573A049794o6785l2942L433K935p2180k8323m5293n2132r234k6594K0095m4450
19561F98324k9835j9666k1467k849j9908j4041O3375K7618p8898J5321J6384l7419
19549E96939l0069m3197j3425J2384J7904l7924l0543J6707j5131M399M1034j6791
$$ y = [1838770, 1896706, 1890044, 1886410, 1939450, 2087640, 2244315, 2393386, 2522404, 2616535, 2711171, 2727467, 2689943, 2608985, 2531871, 2455467, 2322182, 2273995, 2286382, 2319816, 2358320, 2366470, 2285470, 2156666, 2016748, 1912688, 1785520, 1686597, 1643369, 1567133, 1456617, 1338077, 1307480, 1307329, 1247322, 1205283, 1200247, 1233967, 1217942, 1176541, 1121026, 1083859, 1030365, 1094208, 1098015, 1075857, 1110299, 1073374, 1072885, 1043973, 986485, 921379, 884478, 898516, 948619, 994967, 1049794, 983009, 950067, 953500, 956435, 884255, 855932, 810639, 758507, 749273, 722679, 742774, 698324, 668489, 648823, 627356, 624507, 604599, 590558, 653933, 681551, 602653, 617974, 634358, 596939, 566870, 523673, 510248, 522632, 540536, 502612, 472069, 488776, 473645, 478044, 519078, 502287]
19537E02287o0405k4489m6044K1142J9020K6414L1562m68P5390k1979k1573n205
19525D95652o5439j60079o7384L4197L2004o8434j1804j5761j7547p199N0337
19514A98543J15282L3314J2931j1128l9386J1882L4232J6073k7987m882N3371
19503C92245o433k2485q815L3842K3194J9748n8112L564Q1105L0151J9498O5150
19491E72652N822l7420m4978K4144j7797M1358J01200J9360k2962J6355O053O8224
19479G32011r710l7233J2054M452L4830K89j7869N5682Q2677R3048j4684m0487
19467H95060m4175l2277M9174O4906J8913m4941M3644O9843L5158J4499K5131
19456A094935J1263P5053j4669K1447K4528P6183N1275M4613P6815P4934M9356
$$ y = [502287, 441882, 417393, 371349, 392491, 411511, 437925, 469487, 469019, 544409, 522430, 500857, 495652, 430213, 270134, 202750, 236947, 268951, 200517, 188713, 172952, 155405, 148206, 198543, 313825, 347139, 360070, 348942, 309556, 321438, 355670, 371743, 343756, 338874, 392245, 385812, 363327, 354512, 388354, 411548, 431296, 373184, 376748, 457853, 488004, 507502, 572652, 578474, 541054, 496076, 520220, 502423, 543781, 644981, 664341, 641379, 657734, 663787, 732011, 722301, 685068, 697122, 701574, 736404, 736693, 718824, 774506, 857183, 950231, 935547, 895060, 850885, 818608, 867782, 932688, 951601, 906660, 950304, 1020147, 1055305, 1069804, 1094935, 1106198, 1181251, 1166582, 1188029, 1212557, 1288740, 1340015, 1384628, 1461443, 1536377, 1585733]
19445A585733j4271L2309N3183J02661J33705N3932K9478O2749O8944J50275J38462
19434B397160R4561R6365R6181K00919K92633J75736K12288L16148M24658M37337
19424D743986M60322O53875Q21893J022155J330906J625887K173680K807145L143180
19415A8783029L123444K198499J122111R70455J841818L172412M704159N331557
19407D1247484M086880J524695m38344l37716J142817K466956L077007L628659
19399E6398438M184071L972432K788972J768322J228580J25334j302935j434537
19391F7728677n38388j46898n93307j428342k961640m393876m574572l593214
19383D9498440k230987j054793o50348j118803k180878k886867k674848k020985
$$ y = [1585733, 1571462, 1603771, 1656954, 1759615, 1893320, 1947252, 1976730, 2039479, 2108423, 2258698, 2397160, 2491721, 2588086, 2684267, 2885186, 3177819, 3353555, 3565843, 3881991, 4306649, 4743986, 5204308, 5858183, 6680076, 7702231, 9033137, 10659024, 12832704, 15639849, 18783029, 21906473, 24104972, 25227083, 26197538, 28039356, 31211768, 35915927, 41247484, 45334364, 46859059, 46420715, 46082999, 47225816, 49692772, 52769779, 56398438, 60582509, 64554941, 67343913, 69112235, 70340815, 70466149, 69163214, 67728677, 67190289, 67043391, 66450084, 65021742, 62060102, 57666226, 53091654, 49498440, 47267453, 46212660, 45562312, 44443509, 42262631, 39375764, 36700916, 34679931]
19375C4679931j392591q10817l21315J74211O51773J212144J796150K461308K752958
19366D1203752K268502J322791J221310J968660L384903M831900N617796M515717
19358F6335331J584368j049571j638927n74365O89125J550896K601240M510477
19350G4008574P118777Q745645P628117L308429k198983n988340o752063m948958
19342H0921198k230039q4565J172304J440294M20654k594143n847606p073217
19334F6124880o116222m360959k905375k049285k222314k834798l107049k997175
19326C9531703k575673k169670j823567j582119j313416j060375r64975r06439
19318B7135469q10627p71905o61299p12049p11395o40392n84447o07805o44448
$$ y = [34679931, 33287340, 32476523, 32155208, 32329419, 32981192, 34193336, 35989486, 38450794, 41203752, 43472254, 44795045, 46016355, 47985015, 51369918, 56201818, 61819614, 66335331, 67919699, 66870128, 65231201, 64656836, 65345961, 66896857, 69498097, 74008574, 81127351, 89872996, 97501113, 100809542, 98610559, 92622219, 85870156, 80921198, 78691159, 78606594, 79778898, 81219192, 81639846, 79045703, 73198097, 66124880, 60008658, 55647699, 52742324, 50693039, 48470725, 45635927, 42528878, 39531703, 36956030, 34786360, 32962793, 31380674, 30067258, 29006883, 28041908, 27135469, 26324842, 25552937, 24891638, 24179589, 23468194, 22827802, 22243355, 21635550, 20991102]
19309B0991102o16084o61375n49101n54400n74613o21308o05621n85586o26264
19300A5596750o35956n67575n68067n36639n38676n00387m74720m65732m18831
19291A0890167l76024k97003k81742k73825l35731l60053l56447l41711k36126
19282H031505k06141j88327k05892k15018k17636l10414k87836k22118j76846
19273F001277k09418k80011k27245j86160j06885j53216j96436k36972j18100
19264D286834j58175j15391n8698j32924j70710j65430j48675j35348j50015r5951
19254B955517J1222n8448q7170l4591J6141O6881Q8360N7301j6545L5287J65214
19243C199169K08361J41333J28258L9086N2902M8287R68j4375N359P6907P1106
$$ y = [20991102, 20375018, 19713643, 19164542, 18610142, 18035529, 17414221, 16808600, 16223014, 15596750, 14960794, 14393219, 13825152, 13288513, 12749837, 12249450, 11774730, 11308998, 10890167, 10514143, 10217140, 9935398, 9661573, 9325842, 8965789, 8609342, 8267631, 8031505, 7825364, 7637037, 7431145, 7216127, 6998491, 6688077, 6400241, 6178123, 6001277, 5791859, 5511848, 5284603, 5098443, 4991558, 4838342, 4641906, 4404934, 4286834, 4128659, 4013268, 3954570, 3821646, 3650936, 3485506, 3336831, 3201483, 3051468, 2955517, 2966739, 2908291, 2821121, 2786530, 2802671, 2869552, 2957912, 3015213, 2998668, 3033955, 3199169, 3407530, 3548863, 3677121, 3716207, 3769109, 3817396, 3818364, 3803989, 3809348, 3886255, 3957361]
19232C957361J35561J40279L1342o5604k19795j98601j42869o5874o1259j53481
19222C357060o4295j8217L7922K7261r691j01256j40578j14811j84139j01318
19212B687938o3244j23630j07933o9222j08256l3051m6144k6779j13592o9346
19202A926741m6654m7040n3133k4853l5805k4059o1152l3230m4957l3702l9005
19191A483151K475L5399L367J3667P219j1029k8593k7373n5370L086j9950j8459
19179A387590O495n3303m3376n3212k359j8370k1598j4863P1579J0025j13862
19168A154746k1311l0673k0645J2981J9800j1873m8669K468K6051k9603L5557
19157A088829q658k2912o905k1511n3712o4613o1728J9039l7840J7822L4689m5739
$$ y = [3957361, 4092922, 4233201, 4264543, 4198939, 3979144, 3780543, 3637674, 3571800, 3510541, 3357060, 3292765, 3274548, 3312470, 3339731, 3330040, 3228784, 3088206, 2973395, 2789256, 2687938, 2624694, 2501064, 2393131, 2323909, 2215653, 2182602, 2136458, 2109679, 1996087, 1926741, 1880087, 1833047, 1779914, 1755061, 1719256, 1695197, 1634045, 1600815, 1555858, 1522156, 1483151, 1485626, 1521025, 1524392, 1538059, 1545278, 1534249, 1505656, 1478283, 1422913, 1425999, 1406049, 1387590, 1394085, 1340782, 1297406, 1244194, 1241835, 1223465, 1201867, 1187004, 1258583, 1268608, 1154746, 1133435, 1102762, 1082117, 1095098, 1114898, 1103025, 1054356, 1056824, 1082875, 1053272, 1088829, 1080171, 1057259, 1050354, 1028843, 975131, 910518, 848790, 867829, 829989, 847811, 882500, 836761]
19145H36761n5446r611k480l4305l0784o1731M445M3376m8955p334l5712o0142
19133E38082K9943k3775l5593M1735o0408l9212M7894o8718K3402M0209j7301
19122D76258o5455o1260L9484L8670J4881L8600p2868j07408O033L5711j2455
19111C30191M8647L4564M1568j4272Q790Q071p597j831N2555P326p6791l0864
19099D00357p2408j5788R4250K3161J1418j3613l5979m5530p079r293o94P713
19087C36515O725l6264M6387p428r873p4139J6134P316m0555l4347k984L0328
19075B37815K1690K1875J8088q325O945l4162K0369J2805p4160k4731m839m7919
19063A45451J4365k067N966J1110J0697K0257K2615M3189O5709J177o8098j6199
$$ y = [836761, 781315, 771704, 769224, 734919, 704135, 642404, 646849, 690225, 641270, 633936, 598224, 538082, 568025, 544250, 508657, 550392, 489984, 450772, 498666, 429948, 453350, 493559, 476258, 410803, 349543, 389027, 427697, 442578, 481178, 408310, 300902, 306935, 342646, 330191, 378838, 413402, 454970, 440698, 449488, 457559, 449962, 448131, 500686, 508012, 431221, 400357, 327949, 312161, 406411, 429572, 440990, 427377, 391398, 345868, 338789, 329496, 328802, 336515, 343240, 306976, 353363, 345935, 336062, 261923, 278057, 285373, 244818, 210471, 207487, 237815, 259505, 281380, 299468, 291143, 298088, 263926, 284295, 297100, 222940, 198209, 193370, 145451, 159816, 157749, 163715, 174825, 185522, 205779, 228394, 271583, 337292, 338469, 270371, 254172]
19051B54172l1372N280J4416r108j0826j899o5317N2452P5776o193N055N2993
19039C35429j4434l8135r645r472q42Q592p906k4132j1909Q3152J7644J554l6503
19026B93393K640m856m5895J873L2927N365l128m985p8374k2681M0098K7669Q460
19013B52506k7892J2254m4770o2218l8662J1159L8916l3330M778M5765m891j984
19001A51631m2105l1091k7044N0793L5767M0435M5405L1179k58K8556L2327n8272
18989B57323k3875J340K6906L7701J6654k5838k2099o0592l038l4931r4486k4904
18977E0161K8995L6970K3891L8333O2027q787k1009Q8339J3802j00197p7412k4434
18965A10679M1003K1549n5337J3073K6184l0753K2274J0579m9439l4500J6781
$$ y = [254172, 222800, 228080, 242496, 233388, 222562, 220663, 155346, 207798, 283574, 277381, 282436, 335429, 320995, 282860, 273215, 263743, 262901, 271493, 263587, 239455, 227546, 310698, 328342, 329896, 293393, 296033, 291177, 245282, 247155, 280082, 285447, 282319, 277334, 198960, 176279, 216377, 244046, 252506, 224614, 236868, 192098, 129880, 91218, 102377, 141293, 107963, 112741, 158506, 153615, 151631, 109526, 78435, 51391, 102184, 137951, 178386, 223791, 254970, 254712, 283268, 315595, 257323, 233448, 234788, 261694, 299395, 316049, 290211, 268112, 207520, 204482, 169551, 75065, 50161, 79156, 116126, 140017, 178350, 240377, 231590, 210581, 298920, 312722, 212525, 135113, 110679, 151682, 173231, 117894, 130967, 157151, 126398, 148672, 159251, 109812, 75312, 92093]
18954I2093j8950n18M5386j0598J3475L0614n3914q1843L1037O7576L3077O337
18942A53772l6559l8270k8334N2584L2048N8117R0153O1610o1365p8679n4231
18931A50846j0644j4254j0379K2096P5168O6151l4380n1991k170L947l2136J5114
18919A77368J3321L4367J4667M9127L6525K8201j8089j1484o550K0720m5656j318
18907B91199M5403P6939l4875o55M9919N0264r009m6712q365j5039P5198P586
18895D81853J901Q629L4411K6310k8845L3932J0855N599k9177L128k793K0811
18883E66614N0022M671R815J2752N9170O224k8318m4723N850J3959O1031L7129
18871G54196P8689M3826J7009Q0181K0210k3300L9312R8078P7449R6564J34875
$$ y = [92093, 73143, 72625, 118011, 107413, 120888, 151502, 97588, 15745, 46782, 114358, 147435, 153772, 117213, 78943, 50609, 103193, 135241, 193358, 283511, 345121, 283756, 205077, 150846, 140202, 125948, 115569, 137665, 212833, 278984, 244604, 192613, 190443, 194390, 162254, 177368, 190689, 225056, 239723, 288850, 325375, 353576, 335487, 324003, 317453, 338173, 292517, 291199, 336602, 413541, 378666, 378011, 427930, 478194, 469185, 422473, 414108, 399069, 474267, 481853, 483754, 492383, 526794, 553104, 524259, 558191, 569046, 574645, 545468, 548596, 545803, 566614, 616636, 621307, 631122, 643874, 703044, 709268, 680950, 636227, 642077, 656036, 717067, 754196, 832885, 876711, 893720, 973901, 994111, 970811, 1010123, 1108201, 1185650, 1282214, 1417089]
18860A417089P6814K1714J04880J42101J02902M0015J14950M9886N4763J54489
18850B279603J41997J76275K00457K37415L08161M06704M73526N42887P90302
18841E557327J064844J397477J768879K281103K971247L857802M991090N965075
18833B9854844N985029M494749K268800N33505q63239k942747m779284n087504
18825B9464153m330801l384942k537863j942896j537498j240970r74742p42485
18817A2771956o55921n52837m64516l49298k91444k66418j54377n0534q07o2354
18807I923450j7873p7498q1518m9429j7160P8552J41492J81332K26110L60602
18797A0668060M12202M58936O36200Q56677J097057J485913J970610K643131L444266
$$ y = [1417089, 1493903, 1515617, 1620497, 1762598, 1865500, 1905515, 2020465, 2070351, 2125114, 2279603, 2421600, 2597875, 2798332, 3035747, 3343908, 3750612, 4224138, 4767025, 5557327, 6622171, 8019648, 9788527, 12069630, 15040877, 18898679, 23889769, 29854844, 35839873, 40334622, 42603422, 43136927, 42273688, 39330941, 34551657, 29464153, 25133352, 21748410, 19210547, 17267651, 15730153, 14489183, 13514441, 12771956, 12116035, 11563198, 11098682, 10749384, 10457940, 10191522, 10037145, 9986611, 9985804, 9923450, 9905577, 9828079, 9746561, 9697132, 9679972, 9758524, 9900016, 10081348, 10307458, 10668060, 11080262, 11539198, 12175398, 13032075, 14129132, 15615045, 17585655, 20228786, 23673052]
18788B3673052M651512O155984P935210R231130R116372P236477M409570J120883
18780G3530190j999638m824227p054387q068649p427461o047895m660507l618925
18772B9828501k853285k236804j786636j455132j199616j002672q98474p46746
18764A7649136o51984m34583l00447k36285k16575k24775k51630k13370k53907
18755A4865580l78150m07927k74189j90290j17043p8928q1045J9899M0710P2400
18745A3471017J07477K08443L26250N36609Q09487J090838J561883K192792L052578
18736B3357374L938298M262602L289063J594205K79725o35913k070633l670093
18728C0344628m212639l709886k877281k136320j691555j336937j102112r16045
$$ y = [23673052, 28324564, 34480548, 42415758, 51646888, 60763260, 67999737, 72409307, 73530190, 71530552, 66706325, 59651938, 51583289, 44155828, 38107933, 33447426, 29828501, 26975216, 24738412, 22951776, 21496644, 20297028, 19294356, 18395882, 17649136, 16997152, 16562569, 16262122, 16025837, 15809262, 15584487, 15332857, 15119487, 14865580, 14487430, 14079503, 13805314, 13615024, 13497981, 13419053, 13338008, 13357907, 13398617, 13471017, 13578494, 13786937, 14113187, 14649796, 15459283, 16550121, 18112004, 20304796, 23357374, 27295672, 31558274, 34847337, 36441542, 36721267, 36085354, 34014721, 30344628, 26131989, 22422103, 19544822, 17408502, 15716947, 14380010, 13277898, 12361853]
18720A2361853o78911o69624o11483m21130k22220j49979j62251j10878J0189
18711I345566j9818p2578j12144j91803l04239l69209l98243l05506k09502k23019
18701G139505k05766j22325j78090k32768j55705j14370j96446k04882j87668
18692E541485j87870k01600k79579k63449k21576j82417k31761j56129j87011
18683C630093j83143j81039j23743j10645j15775j11859j42918j23509l8605p2564
18673B426293j03141p6697k4342q2993r3757j7833P8563L1424K382N9300R9506
18662B298705P2898q056l9523o3188j17164q9155j52794j38831n8212j33667p9714
18651A491299j10336o4915m3636m4876k0173N4848j7773p1015q3003r7434k9011
$$ y = [12361853, 11682942, 11013318, 10401835, 9980705, 9758485, 9608506, 9446255, 9335377, 9345566, 9325748, 9253170, 9141026, 8949223, 8644984, 8275775, 7877532, 7572026, 7362524, 7139505, 6933739, 6811414, 6633324, 6400556, 6244851, 6130481, 5934035, 5729153, 5541485, 5353615, 5152015, 4872436, 4608987, 4387411, 4204994, 3973233, 3817104, 3630093, 3446950, 3265911, 3142168, 3031523, 2915748, 2803889, 2660971, 2537462, 2498857, 2426293, 2323152, 2246455, 2222113, 2139120, 2045363, 2027530, 2106093, 2137517, 2139899, 2199199, 2298705, 2371603, 2363547, 2324024, 2260836, 2143672, 2054517, 1901723, 1762892, 1704680, 1571013, 1491299, 1380963, 1316048, 1272412, 1227536, 1207363, 1262211, 1244438, 1173423, 1090420, 992986, 963975]
18640I63975k1805J780k9516o962o1600m692o84l3069l7996r046M469K6372J348
18627G92574o5810k7751M8591R5647k6359m5915r1613o3195l8634K6121J03079
18616G06735O2410n5106j8751j1741p2937l1713J7100P7161Q2869l0017o0150
18605F65860l9005N4277n3166N124N4775n7357q3839k2208l2193k5992m2223M6983
18593D71036k6427O2427O7536O0980L5865m1125m9731m2871l7322k7232J3276
18582D86412K4994n5614m0284o056p6280j191L5195k312l5499Q622K8095P356
18570C73438k767P083k9175r2025K9557O954m2742J00657J3973k8695Q7377k9632
18558C94003k0512L6724q068o603N617k2183k3524K4195N6818k6525m0489j0213
$$ y = [963975, 942170, 943950, 914434, 907472, 845872, 841180, 840496, 807427, 769431, 760385, 764854, 791226, 792574, 726764, 699013, 747604, 843251, 816892, 770977, 679364, 616169, 577535, 603656, 706735, 769145, 714039, 695288, 683547, 610610, 578897, 595997, 673158, 756027, 726010, 665860, 626855, 681132, 627966, 633090, 687865, 630508, 546669, 524461, 492268, 466276, 424053, 471036, 444609, 507036, 574572, 635552, 671417, 630292, 580561, 537690, 500368, 473136, 486412, 511406, 455792, 415508, 409452, 333172, 331981, 367176, 364864, 329365, 337987, 366082, 373438, 370671, 377754, 348579, 256554, 286111, 293065, 250323, 350980, 364953, 336258, 423635, 394003, 373491, 410215, 402147, 395544, 401161, 378978, 355454, 379649, 436467, 409942, 369453, 359240]
18546C59240J9139P6709l1344k5278J7290L2579q938k3788m1443K0783O4234L0428
18534D89611j6458o4623n6130k0625k2295r981J8649l2658O4905R588j8310Q617
18522C50290l1104l6971J788j7338r9063M8081O4559r394l5575P3942O7414l4123
18510C42506l0492n7749q9421P125L5416P6540R4957q9374q6560m4177L7006L7935
18498B33712J9427n6297Q7294P5124J9935K8626o7203o3984L4187N6589P1241
18487D38651r420o4791k2937J7002l1736j14773n3685M3822J5433l0525M79K697
18475A90217K0880J3053m9967N3757J0013n6075k572J256O7242J7096l6030r761
18463B19109p0766M055R451m2964m2229P130J7741K2843m832k867J0440M5822
$$ y = [359240, 378379, 455088, 423744, 398466, 415756, 448335, 439397, 415609, 374166, 394949, 459183, 489611, 473153, 408530, 352400, 331775, 309480, 299499, 318148, 285490, 350395, 359983, 341673, 350290, 319186, 282215, 284003, 266665, 167602, 215683, 280242, 270848, 235273, 309215, 376629, 342506, 312014, 254265, 164844, 171969, 207385, 283925, 378882, 289508, 202948, 158771, 195777, 233712, 253139, 196842, 284136, 359260, 379195, 407821, 340618, 276634, 310821, 367410, 438651, 429231, 364440, 341503, 358505, 326769, 211996, 158311, 202133, 217566, 187041, 187520, 190217, 211097, 224150, 174183, 227940, 237953, 181878, 179306, 180562, 247804, 264900, 228870, 219109, 148343, 152398, 161849, 118885, 76656, 83786, 101527, 124370, 119538, 116671, 127111, 172933]
18451A72933J5958j0324L7547l6464r0982J1461K2107j8537l0108O4060Q7469
18440B25120J9471j0783p636j9929m7985k5279J1986L0516j9311P85O375R062
18428A72392l6148J2093m5359k9794O3078J7717n1109m3825j885k5989L7262O5642
18416A34075o598n4343l563L4088L9127M698m5250k0343L0737N3410k484P476
18404A71030J0174r585l642J7766r8586j09842P1902O7122n9061j9606M0546L4381
18392A12599K7622k444r486k0543j5951p4177o8899M4923N9834m3672L1888L3268
18380G4962R687K9375N6692P57m9518j3831n157j8778k4246J0112N5616M6605
18368A72276J4159m017l5152k6197l9810q04L5096l893n1602k9654L2580l138
$$ y = [172933, 188891, 178567, 216114, 179650, 88668, 100129, 122236, 103699, 73591, 137651, 225120, 244591, 233808, 226172, 206243, 158258, 132979, 144965, 175481, 156170, 156955, 163330, 172392, 136244, 148337, 102978, 73184, 136262, 153979, 102870, 59045, 57160, 31171, 68433, 134075, 127477, 73134, 69571, 103659, 142786, 147484, 102234, 81891, 112628, 166038, 163554, 171030, 181204, 171619, 167977, 185743, 87157, -22685, 49217, 116339, 57278, 37672, 78218, 112599, 140221, 137777, 128291, 107748, 91797, 17620, -51279, -6356, 53478, 9806, 41694, 74962, 84649, 114024, 170716, 171473, 121955, 108124, 102967, 84189, 59943, 70055, 125671, 172276, 186435, 182418, 147266, 121069, 81259, 80455, 115551, 111658, 60056, 30402, 62982, 59844]
18356E9844p2046N524R586M4933o399j3109P5922K3913L4343M1113n8450q1822
18344F3352M017j4631M4589Q0581j19107n1039N3392J2215n6105L7389M678k224
18332E7107N7394J0598j771j131n682M6370k4569l2922k309k7872K7100N1187
18320A53500K6696J371j3163L9399p5551j451J9328j19J0187j62Q2785Q0998m5954
18307B77864k4462o6833k2601j5527k444J9001J9973k3903k1319L6347j155o8059
18295A06882p321j4616L5215L3138o158K6563k888m9167j5965J8554K5909J5354
18283A65500N1807k0465p6248j6167r493n0680l1472O2174O454L0490j3968n8929
18271C9003N611M5004N9714R5749L1628N8617N7347J1080l2849P2144M3979q4130
$$ y = [59844, -12202, -6678, 2908, 47841, 41442, 28333, 104255, 128168, 162511, 203624, 145174, 63352, 67369, 52738, 97327, 177908, 58801, 7762, 61154, 73369, 17264, 54653, 59331, 57107, 114501, 125099, 123328, 122197, 116515, 162885, 138316, 105394, 103085, 75213, 102313, 153500, 180196, 181567, 168404, 207803, 132252, 130801, 150129, 150010, 160197, 160035, 242820, 323818, 277864, 253402, 186569, 163968, 148441, 145997, 164998, 184971, 161068, 139749, 176096, 174941, 106882, 99561, 84945, 120160, 153298, 147140, 173703, 170815, 121648, 105683, 124237, 150146, 165500, 217307, 196842, 120594, 104427, 94934, 44254, 12782, 74956, 81410, 111900, 97932, 39003, 44614, 89618, 149332, 245081, 276709, 335326, 392673, 403753, 370904, 443048, 487027, 402897]
18259D02897J9587R870j8696q1985r2514o9030o320k7295J7604k883J2977J7347
18247A81559P762o1955o1953L8188M6966j3961p9442J7139R5234J8554m006l9215
18235A44870n2076L2772K1407o306L073K8990N6049l3231r650l5107o672l158
18223A40961o5171N2047N5145m5465Q790k4998L4163K4770P287m0462L1393P2241
18211B50701K4345O292j2740k0793o2500j1572k9485n670l461n0794r585M4830
18199A19568P910k3934K6502k4294j2855j1601N0948j5133m2046j2816M3516L0766
18187A36531J4288J7979j1128l7795K5207K7437n0731q2392j1773L0690J4137
18176G2450n3570k9617R775o353n793m1883k5411N8127K5014m754m4295R0925
$$ y = [402897, 422484, 432354, 413658, 331673, 239159, 170129, 163809, 136514, 154118, 151235, 164212, 181559, 189321, 127366, 65413, 103601, 150567, 136606, 57164, 74303, 169537, 188091, 184085, 144870, 92794, 125566, 146973, 140667, 143740, 172730, 228779, 195548, 185898, 150791, 144119, 140961, 75790, 127837, 182982, 137517, 146307, 121309, 155472, 180242, 187529, 147067, 178460, 250701, 275046, 281338, 268598, 247805, 185305, 173733, 144248, 138578, 135117, 84323, 74738, 119568, 127478, 103544, 130046, 105752, 92897, 81296, 132244, 117111, 75065, 62249, 105765, 136531, 150819, 168798, 157670, 119875, 145082, 172519, 121788, 39396, 27623, 58313, 72450, 18880, -10737, -962, -7315, -13108, -54991, -80402, -22275, 2739, -2015, -46310, 44615]
18164D4615N8474J0840k7052k6024n3076m597K3087j7930l6319K9678J1621J4347
18152B7664M0950J6313J2799j6651j1433k3682R633J0001j4668q363M3290M0463
18140A26316R660N750m2343o3267O801M6810l1577J5416k5508j1919k522l9776
18128f159m0682k2779P6851L5340J6366n0513J4315p501o4565k9269Q2097R0601
18116I4102k5665m3761m0578K3821M2876j5133J7421j5636o948M1650R020J1221
18104I2390o3879J803q173k9318j4170K155m8263j629J1031R6838R660J1133n0893
18091H685l865J8376Q532Q464l6292K7404p092n8077O9673M5120Q885J2623k1142
18078H1294o3396r167P1320l6508q0525O5945K4286J7934k7363n3442o6983k120
$$ y = [44615, 103089, 113929, 86877, 60853, 7777, 3180, 26267, 8337, -27982, 1696, 13317, 27664, 68614, 84927, 97726, 81075, 69642, 45960, 55593, 65594, 50926, 42563, 85853, 126316, 135976, 141726, 99383, 36116, 42917, 89727, 58150, 73566, 48058, 36139, 33617, -6159, -46841, -69620, 7231, 42571, 58937, 8424, 22739, 15238, -49327, -78596, 3501, 94102, 68437, 24676, -15902, 7919, 50795, 35662, 53083, 37447, 30499, 72149, 81169, 92390, 28511, 30314, 22141, -7177, -21347, -19192, -67455, -69084, -58053, 38785, 48445, 59578, 8685, 4820, 23196, 31728, 40192, 3900, 31304, 24212, -33865, 35808, 80928, 89813, 102436, 81294, 17898, 8731, 80051, 43543, -36982, 28963, 53249, 71183, 43820, -9622, -76605, -78725]
18066g8725N7561M8813k0677J4539O7086J4188n3723J4129J5657l7613p4660M3688
18054A0263K2860N468n217N7198l0697k6903M2753L9524L296k1287Q814j2006
18042I4066J3220l1m3476l0973j33974j6653L2217M6334Q1261J3693j345K7443
18030H1782J6424n3191N283L2186J3471m3589L2233K8946L819n843m3416L0193
18018I8298k0596m6927j7124l0975m0933J3829m780j7612L1177l5804k8704L9352
18006f0799N5475M4891l2382k7921O8132k2552n9262L4331J1199k0745j454N1487
17994D0400j6249l2279K245j5040r076P1115N120l6713n1366j1632L8287M6956
17982C1768l2845j03526k3567Q747K8391O9249q05m2998N83O5009R91l1913n7872
$$ y = [-78725, -21164, 27649, 6972, 21511, 88597, 102785, 49062, 63191, 78848, 41235, -33425, 10263, 33123, 38591, 33374, 90572, 59875, 32972, 75725, 115249, 118545, 97258, 106072, 94066, 107286, 107255, 63779, 32806, -101168, -117821, -85604, -39270, 41991, 55684, 54339, 81782, 98206, 45015, 50298, 82484, 95955, 52366, 84599, 113545, 117364, 111521, 68105, 98298, 77702, 30775, 13651, -17324, -58257, -44428, -49208, -66820, -35643, -71447, -100151, -60799, -5324, 39567, 7185, -20736, 47396, 24844, -34418, -87, 11112, -9633, -11087, 40400, 24151, -8128, -5883, -20923, -29999, 41116, 46236, 9523, -41843, -53475, -15188, 31768, -1077, -104603, -128170, -119423, -91032, -21783, -22588, -65586, -65003, 6, 997, -30916, -88788]
17969h8788J1291K166N3005J6903k5725M0314K5414L5864l0150n2680M4833J1667
17957D4114L8894J582n6788l0684K810N9572J2172m2372k4713o162j1596j0078
17945b3249M0594J7418p725l1185J0781K6284L200J4581M5417o500k8050k5436
17933C6130k0685k0994k7676k9195J1106j179M0790N2860j831l7973o056k2800
17921b7503k7753p0035j4795N7759M7022O6069j1986m5791N1743p33O725N0879
17909H1601k6234l3451L6722l0311L375j3140n6439n0492J4717P269O8678L5674
17897C7969m9238K1443M2349j092l3057o3024p301m2276O962J1290M4574N042
17885b6359L1406j8982j6255N365m476K9050l1799m7869j1311N715O008k0082
$$ y = [-88788, -77497, -75331, -22326, -5423, -31148, 9166, 34580, 70444, 40294, -12386, 32447, 44114, 83008, 84590, 27802, -2882, -72, 59500, 71672, 29300, 4587, -1575, -13171, -23249, 17345, 34763, 27038, -4147, 6634, 32918, 36118, 50699, 96116, 89616, 61566, 36130, 15445, -5549, -33225, -62420, -51314, -52493, -11703, 41157, 39326, 1353, -4703, -27503, -55256, -125291, -140086, -82327, -35305, 30764, 18778, -27013, 24730, 23997, 30722, 81601, 55367, 21916, 58638, 28327, 31702, 18562, -37877, -88369, -73652, -66383, 2295, 37969, -11269, 10174, 52523, 51431, 18374, -44650, -51951, -94227, -87265, -75975, -31401, -26359, 5047, -13935, -30190, -24825, -29301, -251, -32050, -79919, -91230, -85515, -79507, -99589]
17873i9589N5851P8846n9466m3318N94K9092L9670j7047L3153K9309m0133J0872
17861A7834Q339k7905M8305m821n2619o6230O1149K8161p792m1243k2350l6494
17849i5666J8679l4469K4433j7186M4425O5997L8290J7545k6035o0410l5366L603
17837e6160k24L8792M8409m1686l0203k1798J6322p053O439K3665L2949N7173
17825F6625K235M066n8194l0693k1684L4971L769k583K8800k7451L969q6650o832
17812h9652k1481P170N5101l1301K5911m9699k8569J3870r5935L9959J01821J5773
17800e7032j8238O8237K106K134L0620j7764q9436j8023O1846O2036L141l7712
17788h085l0777j3513k3168j6854N6419L1346k9579j461k0448k0668P2180k1538
$$ y = [-99589, -43738, 35108, -24358, -67676, -67082, -37990, 1680, -15367, 17786, 47095, 6962, 17834, 26173, -1732, 46573, 41752, -10867, -77097, -15948, 12213, 4421, -36822, -59172, -95666, -76987, -111456, -87023, -104209, -59784, 6213, 44503, 62048, 36013, -24397, -59763, -56160, -56384, -17592, 30817, -10869, -41072, -62870, -46548, -53601, -47162, -23497, 9452, 66625, 68860, 72926, 14732, -15961, -37645, -2674, 1095, -1488, 27312, -139, 3830, -82820, -89652, -111133, -103963, -48862, -80163, -54252, -103951, -132520, -118650, -214585, -174626, -72805, -57032, -75270, -7033, -4927, -2793, 27827, 10063, -79373, -97396, -35550, 26486, 29627, -8085, -38862, -52375, -75543, -92397, -35978, -4632, -34211, -35672, -56120, -76788, -4608, -26146]
17776b6146q5229j2437L8918n293P4175o730k6131O363m974k9577J7965J2381
17764d6715j634J1987l5328L7708q242P4362M5978m272j2544q055K799R721j4955
17751E0810m4403n2625j8685P079m7189n967L4274O0759j0709P595M2746m9881
17739b6196r4665m260J01986P3418J0738j21439q6270K696R356O6442Q6582L1480
17727D9868k6323q3524l756P6381M1222k304j7142L0629P3039J7466m9168n5131
17715E1257p031o427k1780N577M7892o1449p3762o726O1113j1240n2217k0734
17703i5527n463j4669Q148r395K433m59K2366R5291j7865m3643M3600J06904J5938
17690A07659J5636m0960j00114o0248Q4022L1351K1899N7395K3426k0435n8303
$$ y = [-26146, -111375, -123812, -84894, -90187, -16012, -22742, -48873, -42510, -47484, -77061, -59096, -46715, -48349, -36362, -71690, -33982, -42224, 32138, 78116, 73844, 61300, 53245, 56044, 65765, 50810, 6407, -46218, -64903, -57824, -105013, -110980, -76706, -15947, -26656, -19061, 23685, -26196, -120861, -125121, -23135, 50283, 61021, -60418, -146688, -143992, -134636, -68194, 18388, 49868, 23545, -59979, -63735, 12646, 53868, 51564, 34422, 65051, 138090, 155556, 106388, 51257, 44226, 37799, 16019, 21596, 69488, 8039, -65723, -72449, -11336, -22576, -74793, -95527, -100990, -115659, -107511, -116906, -114473, -114932, -92566, 2725, -15140, -58783, -15183, 91721, 107659, 123295, 82335, -17779, -78027, 5995, 37346, 59245, 116640, 140066, 119631, 61328]
17679F1328L3220L5298j41464p9776l9190m7620l2603O1102Q9604N266n5090n1350
17667a61275l7299Q1667P8339O5040K9206j7721k4901j4525p500j7689o1823m1291
17655a29772O6875J08382K9897r0287o1268q619K653L6195L1402l1233O9246J9861
17643D3332j5005m9050l4085j3535l036L776k40k1463o8382K2321J1153L3805
17631i0409M5077n2384m4760K622P6739j382j7474L9416r925k0447L040L816R134
17618e6937R603K4520J3032L7889O8833j6485n1875k698O997j7773o0294k6648
17606g1836O4279m1745m9419J5091M2235K4867J0919l1027n0321r4557M636K9758
17594a47120L6972N1330R895j5494J6709j4050n4174j5675M8324J2254O259M1542
$$ y = [61328, 94548, 129846, -11618, -91394, -130584, -178204, -210807, -149705, -60101, -54835, -109925, -161275, -198574, -116907, -38568, 26472, 55678, 37957, 13056, -1469, -8969, -26658, -88481, -129772, -62897, 45485, 75382, -14905, -76173, -84792, -82139, -45944, -14542, -45775, 23471, 43332, 28327, -20723, -54808, -68343, -71379, -67603, -67843, -89306, -157688, -135367, -124214, -90409, -45332, -97716, -142476, -139854, -63115, -64497, -81971, -42555, -52480, -72927, -69887, -66071, -56937, -47334, -22814, -9782, 28107, 96940, 80455, 28580, 25882, 32879, 15106, -45188, -71836, -7557, -49302, -98721, -83630, -41395, -16528, -5609, -36636, -86957, -181514, -176878, -147120, -110148, -58818, -48923, -64417, -47708, -61758, -115932, -131607, -83283, -71029, -64770, -23228]
17582b3228J9157L3803N7067k5237m579j3346J3749p3572p4750k2197N7894N232
17570e0007J1089k2727o8235L9455O3017J840J8929L8599m8390K6775K7309l9673
17558b019j5528J1224l341q880L8664p332m582K927k3481k1551j012m8193r977
17545i3081O85l7517K4431P91K3207M6398J972M3323m6014l1799M1693N0306l2610
17532h215l4950J7188l4927k239J4756L3857J5657j3295j7201L0730k6012k3723
17520d8374l3982K2807P5826N610m869o5566j2996J8585l032k054J5682L5869
17508C506L4959K61m2206l843m3036J8275n2875k6505K2604l9025M5044n463K6113
17495f2191J9334K2519k1427K3149M5836j8762n3745j0327p2212l812j9851M685
$$ y = [-23228, -4071, 29732, 86799, 61562, 56983, 43637, 57386, -16186, -90936, -113133, -55239, -50007, -38918, -61645, -129880, -90425, -27408, -25568, -6639, 31960, -16430, 10345, 37654, -2019, -17547, -6323, -9664, -18544, 20120, 12788, 8206, 11133, -12348, -33899, -34911, -83104, -93081, -92396, -129913, -105482, -104691, -81484, -35086, -33114, 10209, -35805, -67604, -25911, 24395, -8215, -43165, -25977, -60904, -63143, -48387, -14530, 1127, -12168, -29369, 1361, -24651, -48374, -82356, -59549, 16277, 21887, 17018, -48548, -61544, -42959, -45991, -48045, -32363, 3506, 38465, 38726, -3480, -7323, -50359, -32084, -84959, -111464, -88860, -127885, -82841, -88304, -62191, -42857, -20338, -41765, -18616, 27220, 8458, -45287, -55614, -127826, -131638, -151489, -146804]
17483a46804K7296M3071O300L2838l0311o712M8160j320j880k8847N706j2226
17471f4729O84L6036L3481J7464r958l2104L4754l5829k5768N7539Q189k3423
17459c664r645M3539k5000n2661m9475K6179L1315k922n5683k9471p17M0613M8922
17446c8670J8282J987K3971m000l1512j9591N6765l3720j4850o775K4683l3315
17434e6745J0962L3619m7392K312o5933j6557m8305L5102Q7942N0091j4282L1991
17422B805J0635K0057m4393m1781k5345J636N1225K6415o6003l3734Q202L9951
17410e0330j8023K434o65P9923O3469q0095o566J0872K4803k4392m0171J5217
17398b3524J2653p0295j1077n336K5350n4871m6349L147M1375L4715K2849n722
$$ y = [-146804, -119508, -76437, -70137, -37299, -67610, -74322, -26162, -27482, -29362, -58209, -52503, -64729, -64045, -28009, 5472, 22936, 12978, -19126, 15628, -20201, -45969, 11570, 19759, -3664, -13309, 30230, 5230, -47431, -96906, -70727, -39412, -42334, -98017, -127488, -128205, -87592, -38670, -20388, -18401, 5570, 1570, -29942, -49533, 7232, -26488, -41338, -48113, -23430, -56745, -45783, -12164, -59556, -57244, -123177, -139734, -188039, -152937, -64995, -14904, -29186, 2805, 13440, 33497, -10896, -52677, -78022, -76386, -25161, 1254, -64749, -98483, -90281, -50330, -68353, -65919, -66584, 13339, 76808, -3287, -9853, 1019, 25822, 1430, -38741, -23524, -10871, -81166, -92243, -97579, -72229, -127100, -173449, -170302, -128927, -94212, -71363, -77085]
17386g7085j3931M4884l7134l3694L0817L663j868N8382O2585J4607o0838k4477
17374c4089J3773m6103L848L8641L9645j4076n4972l0023L4252l1178N70N9335
17362b0377r2785o110Q610j4176j8808J6593q113J5751K6910J5251N3166j9494
17350d3582L8492k3364o9557M3912N9141K5722j3822R781m870l0707m3677J9889
17338c2642N009J1237J3070M6430k343j899l8355m2451l4593j04276J9706K7371
17326a33736j9574p416R3614O2515n1373L923K6841M9968l1011k8668k8795N460
17314e8252m4122J3875L5844j3171J2078O5237p732m4877m792L3702K4381k57
17302A1914J0280o1349n8623p2093l1426Q7462O3605l95J7367M0268j8475k9987
$$ y = [-77085, -91016, -46132, -83266, -116960, -86143, -82480, -84348, -25966, 36619, 51226, -9612, -34089, -20316, -66419, -62571, -23930, 15715, 1639, -53333, -83356, -49104, -80282, -79712, -20377, -113162, -119272, -110662, -124838, -143646, -127053, -135166, -119415, -92505, -77254, -24088, -43582, -5090, -28454, -98011, -54099, 5042, 30764, 16942, 26723, 21853, -8854, -52531, -32642, -27633, -16396, -3326, 43104, 40761, 38862, 507, -41944, -76537, -180813, -161107, -133736, -153310, -160726, -67112, -4597, -55970, -52047, -25206, 24762, -6249, -34917, -63712, -58252, -102374, -88499, -52655, -65826, -53748, 11489, 3757, -41120, -45912, -12210, 12171, 11914, 22194, -39155, -97778, -169871, -201297, -113835, -50230, -50625, -33258, 7010, -11465, -41452]
17290d1452O5867K7686o8296M3720M780p7808R897j1139J416k8851m3177M6795
17278g0562J07974m95o1598L921K9169m5864o1031L6850K0433J0723O649n2912
17266g6743k820M3035L2878J7517p9994k0820L7938K0931l5032k8774K1644Q818
17254f1422R25m3294k0157L5927O7914O3547j3058N343j128n657J2205p519Q413
17241D2039l5383n6377J3802M470j6799K4552N4138k8372J9336J7955L502n7470
17229a4607n3744l4118n663R369J8129L9935k1448j0667k6188p842J9582l7824
17217a25086j3592M6214M6869L5829J2079p462m6892J7686K8685J9305L6091k4439
17205B5287K527K8596J4360L6610J6911n0046j32450m8582N2762L225l2926J7550
$$ y = [-41452, 24415, 52101, -16195, 27525, 32305, -45503, -35606, -46745, -45329, -74180, -117357, -70562, 37412, 36917, -24681, -20760, 8409, -37455, -98486, -61636, -41203, -30480, -23831, -76743, -79563, -36528, -3650, 13867, -66127, -86947, -49009, -28078, -63110, -91884, -70240, -61422, -60497, -103791, -123948, -88021, -20107, 43440, 30382, 35725, 34597, 28940, 41145, 33626, 42039, 6656, -49721, -35919, -31449, -48248, -23696, 30442, 2070, 21406, 39361, 42863, -14607, -68351, -102469, -108132, -98763, -80634, -40699, -62147, -72814, -99002, -106844, -87262, -125086, -138678, -92464, -45595, -9766, 2313, -5149, -52041, -34355, -5670, 13635, 49726, 25287, 27814, 56410, 70770, 107380, 124291, 74245, -58205, -106787, -54025, -50800, -83726, -66176]
17193f6176N8029n6574J2101L0129o888m7445K5735K2503J9597j5302o0433L9863
17181d4861N6208j3087j180M389O3516m6654q7282Q91J4700k826k8184k7112J2397
17168i9085K024J8548k4151k741M1457K959m5838k2440J3331Q7347l5798j103
17156f5490N4372l5432M2275K124m2166J4186M6630K1524K459o2763m853l539
17144c0673m7983J239K3116n1172K020O9541J8524m0644M788N2972O083j11843
17132a04032j7797N7926l0407K9273L7976j4009k1469J4884j075j7863L4827M7230
17120A5464K8824R438n4974L9671N8649j6560r1444o5441K686O5882J8479m0389
17108b9715K2579K3238j8364J3455q759k8169n004m505j2857o9635k1644M2894
$$ y = [-66176, -8147, -64721, -52620, -22491, -29379, -76824, -51089, -28586, -8989, -24291, -84724, -44861, 11347, -1740, -2920, 1469, 64985, 18331, -68951, -68060, -53360, -56186, -84370, -111482, -99085, -97061, -78513, -102664, -105405, -63948, -60989, -106827, -129267, -115936, -28589, -64387, -65490, -11118, -46550, -4275, -2151, -44317, -30131, 16499, 38023, 40482, -22281, -27134, -30673, -78656, -77417, -54301, -105473, -103453, -33912, -15388, -56032, -51244, 1728, 7811, -104032, -121829, -63903, -94310, -65037, -27061, -41070, -62539, -47655, -48730, -66593, -31766, 15464, 44288, 53726, -1248, 38423, 97072, 80512, -10932, -76373, -73687, -7805, 10674, -29715, -7136, 16102, -2262, 11193, 2434, -25735, -30739, -35244, -48101, -117736, -139380, -96486]
17096i6486J3091J3031N0488K2798o7914k1537N4693J0059n1516m598L879k2110
17084i6122K4475j0833J794N392m9623k293L242n784K0397j4909K4966L1646L1426
17071c6226L6044O4343K4461m837l5403q7261j4982L8234P151o8379j3064Q0599
17059i320j0655j6167O7239M900j4594L913p0617m5021J2102N8776N2876j2256
17047B1176l1276N0368l34l4478L0615J9683r2757k4655O8624J7475J3218m3596
17035e937l4892k2160M5842q558q6446m6419J7278L2339P0379j8232k7412L6990
17023d7228O873M5487m4308n468K3091j4210l7559k1867m393q369q640k2998K6168
17010a13421L9113K277k6452J2368k8243j9045N1192j2851N422l7461L7603O0138
$$ y = [-96486, -83395, -70364, -19876, 2922, -64992, -86529, -31836, -21777, -73293, -77891, -74012, -96122, -71647, -82480, -80686, -75294, -124917, -127210, -123968, -129752, -109355, -124264, -99298, -67652, -36226, -182, 64161, 88622, 83785, 48382, -38879, -53861, -15627, -8476, -76855, -89919, -9320, -19975, -36142, 31097, 35997, 21403, 25316, -45301, -90322, -78220, -19444, 33432, 21176, -10100, 40268, 39934, 5456, 36071, 55754, -37003, -61658, 6966, 24441, 37659, -5937, -40829, -62989, -17147, -25705, -112151, -158570, -141292, -108953, -38574, -56806, -84218, -47228, -40355, 5132, -39176, -44644, -21553, -35763, -73322, -95189, -99582, -107951, -116591, -139589, -113421, -74308, -72031, -98483, -86115, -114358, -133403, -82211, -95062, -89640, -127101, -89498, -29360]
16998b9360m188o5366k9159N2243J3693l3093J9294R4922n242n5383J5685l2782
16986e8736r1704j6843K9882O5992J1507k9011J0979q894J0304J0369J0590j6045
16974g1610Q2643k2875m6259J9290P4042j5904p7423r1473O9164J8211L2773n4110
16962h3531j9752K6127J6640M947r624p942N0362k6201k3049n2071j06368K4053
16950b06409R0811L2696N2204L7626k1106n3595l3361l2538L9806M9232J2870
16939c1764P901J4243M527k2888J1819K0823j6953k3228R69j5803K3483j9413
16927d6284p2147j792M3552k0124M922N949k3158j9787N0176O4009J7424k8588
16915b5848m6950M6939j7478O711k5231j6977P590M5519L2329o1576Q397K3174
$$ y = [-29360, -33548, -98914, -128073, -75830, -62137, -95230, -75936, 18986, 13744, -41639, -25954, -58736, -150440, -167283, -137401, -71409, -59902, -88913, -77934, -86828, -76524, -66155, -55565, -71610, 11033, -11842, -58101, -38811, 35231, 19327, -58096, -149569, -80405, -62194, -29421, -83531, -103283, -77156, -60516, -55569, -65193, -73135, -22773, -48974, -72023, -124094, -230462, -206409, -115598, -82902, -30698, 6928, -14178, -67773, -101134, -133672, -93866, -44634, -31764, -23863, -9620, -5093, -27981, -16162, 4661, -12292, -35520, -34551, -50354, -26871, -46284, -118431, -120223, -76671, -96795, -91873, -85924, -109082, -128869, -78693, -14684, 2740, -25848, -72798, -25859, -43337, -36626, -61857, -78834, -71244, -25725, 6604, -54972, -46575, -23401]
16903b3401J791n9808k6325l5919L9042P1934J2143p3021k9875O603K9808J02988
16891A5960N6434o1344m9126j3427L1516P5225l4107m9289l5427J1039L9099M8899
16879C5452N4902R044n6768J0832j3099p5353J1712L1375o6601J1222R280j097
16867c9099K5460j7098k0528M3232q971K267J1805j1968P6707j2192l4546j9683
16855d614n423j6900j2224K1878P64N4122p3874m5167Q540M696k9138l0645j4918
16842a42903N0395k197j01558K4250Q3062R3792L0651j1992l2194K2122l6165
16831b2737J1662J745l7251n3643L853R6445K6559o794M201J8810R69p5706n5659
16818h7546J9936K3500m7L5721J4122l2109m214N2005l387L7128R055j7061r4152
$$ y = [-23401, -21610, -81418, -107743, -143662, -104620, -32686, -20543, -93564, -123439, -116836, -87028, 15960, 72394, 11050, -38076, -51503, -19987, 55238, 21131, -28158, -63585, -52546, -13447, 35452, 90354, 99398, 42630, 53462, 40363, -34990, -23278, 8097, -58504, -47282, -38002, -39099, -13639, -30737, -51265, -8033, -17004, -14737, -2932, -14900, 61807, 49615, 15069, -4614, -10037, -26937, -39161, -17283, -16519, 37603, -36271, -81438, -72898, -68202, -97340, -127985, -142903, -92508, -94705, -196263, -172013, -88951, 4841, 35492, 23500, -8694, 13428, -22737, -11075, -9330, -46581, -100224, -96371, 74, 26633, 19839, 24040, 42850, 43819, -31887, -87546, -67610, -44110, -44157, -8436, 5686, -26423, -30637, 21368, 17981, 55109, 64164, 47103, -47049]
16805d7049m8854J1198L122L7516M5136Q226R527J2888l9470o0744p4613Q3323
16793e9794O8097N1497l2287o9423n9681J0131K732l2022L0139M8159q438p5166
16781a26056J1070J8325O7758M5745m7916K64J8354L0817Q641k1654j3002m5692
16769e3346J4561M3066l9723m2084j9707J2955n626j3100o561M978K4643k2664
16757a02608L4530K9819K3102k2794n4512m5454r591K4450M5877K9680M9481j0290
16745h310k0013k2829q022K1766J596j4641Q835N6357K6686k3821r2388j7415
16733i2199k4792J8736j9054p575K2883M2154O3226P819J4930J0339o9062l2418
16721f5013K2568K6238J0255N86k1982r354J0767J7708N5101l8740p4500J3635
$$ y = [-47049, -95903, -84705, -81583, -44067, 1069, 9295, 18822, 31710, -7760, -68504, -143117, -59794, 8303, 59800, 27513, -41910, -101591, -91460, -88728, -120750, -90611, -42452, -50890, -126056, -114986, -96661, -28903, 16842, -31074, -30810, -12456, 18361, 27002, 5348, -7654, -53346, -38785, 4281, -35442, -77526, -97233, -84278, -89904, -103004, -109565, -104587, -79944, -102608, -68078, -38259, -15157, -37951, -92463, -137917, -147508, -123058, -77181, -47501, 1980, -8310, -28323, -51152, -59174, -37408, -35812, -50453, -41618, 14739, 41425, 17604, -74784, -92199, -116991, -98255, -117309, -124884, -102001, -59847, 3379, 11198, 26128, 36467, -32595, -65013, -42445, -16207, -5952, -5366, -27348, -36702, -25935, -8227, 46874, 8134, -66366, -52731]
16709e2731N8135R29k4032l9876j1948J2112k5268m432K5623m089O5465L5325
16697C5213j3443l2619l2414N0776P274n9412m3742M9712J7378n2581L4430K63
16685c9165K8786N6653N582j1783j8600j7524l2865P289m3790J8550q51j0613
16673e8331L7341M2697k8574k3947N0796L5581j5520j9032K4654J081m9216J7382
16661A4912O2986l2635q4140j2739o833K6752K8182r590j4889K6458K50P2841
16649G1555R259l4305n5834m2411j3033l7922l2849J6799Q5334P243P8929m994
16637D7771j7884n0216j06089l2325O7456O0709K3970k0331k980k6415j0073r210
16625g5617k3471J6127K4638O8110J4069l8043q378R44p5438n426O8220j1550
$$ y = [-52731, 5404, 6333, -17699, -57575, -69523, -57411, -82679, -87111, -61488, -65577, -112, 35213, 21770, -10849, -43263, 7513, 14787, -44625, -88367, -38655, -21277, -73858, -39428, -39165, -10379, 46274, 51856, 40073, 21473, 3949, -28916, -21627, -65417, -46867, -47718, -58331, -20990, 21707, -6867, -30814, 19982, 55563, 40043, 21011, 45665, 46746, -2470, 14912, 77898, 45263, -38877, -51616, -58449, -31697, -3515, -13105, -27994, -1536, -1286, 71555, 80814, 46509, -9325, -51736, -64769, -102691, -135540, -118741, -33407, -26164, 52765, 47771, 29887, -20329, -126418, -158743, -91287, -30578, -6608, -26939, -29919, -56334, -66407, -75617, -99088, -82961, -58323, 9787, 23856, -14187, -22565, -21621, -97059, -102485, -34265, -45815]
16613d5815l0223k1300P8571l539l4648K8472O6146J2967m195l1588j4418N4424
16601E4854k045q4672o9284q1073L6080M5150O9435l1384K6354J4851J5770j4280
16589b0244o7352j8497P914L5838P030M1146R0303j2652O56K360o5436o5827n3869
16576a18630J0390M6400O1862j3469o4981q736j1483j9103L3934O2829K0477L8750
16564C8240l400m1763j04359m4126j8272k22L0155M273j294N9734O2430M2397
16552B3793p642m2069k328M2116l8106r3487l015j8532n8693j2948K5031O7622
16540a18258j1474q81j0992K7602N0291M6545L9680K1144j34096n0589P2827L4673
16528c3528k068j3801M2308J4065k3231m7811J4958j7025p59M4947N5015N366
$$ y = [-45815, -76038, -97338, -18767, -22306, -56954, -28482, 37664, 50631, 46436, 14848, 430, 54854, 52809, -31863, -101147, -182220, -146140, -100990, -31555, -62939, -36585, -21734, -5964, -20244, -87596, -106093, -98179, -62341, -55311, -14165, 76138, 63486, 64142, 66502, 1066, -64761, -118630, -108240, -61840, 22, -13447, -78428, -87164, -98647, -117750, -83816, -20987, -510, 38240, 34840, -6923, -111282, -155408, -173680, -173902, -143747, -139474, -140768, -81034, -18604, 23793, 16151, -25918, -28246, 13870, -24236, -117723, -120738, -139270, -197963, -210911, -185880, -118258, -129732, -130613, -141605, -114003, -63712, -17167, 22513, 43657, -90439, -141028, -68201, -33528, -35596, -49397, -7089, 6976, -16255, -64066, -49108, -66133, -66892, -21945, 33070, 38436]
16516C8436m9942j4762K0044J54j7366M2684o2023l5689l0622M0972k9856K2200
16504g5770L2079J054O790l124l3516k963O623q372L5151O0776q2092m0292j00
16491a03756j6798K0356L1116j7386K1191j2574K8338K1539l2984N3007N19l7149
16479d4581r969M1658M8975o634p899n5663n2565L683O2146n657L9960K0851n3454
16466a9149l0966J00296l0839J7821l107o5823k2399M7106m9843p9953p217K3444
16454a20629L9230M1715k122L5258J7114J8936m8866q9313l3089K9592M3904m5073
16442a13343K8538L3161M869o9310m3934K8160M7478K9084k8626N274k7077j4073
16430a19799l2383P983P192l3226n9673M0439N9030O1306Q0096J7660J354M8463
$$ y = [38436, -11506, -26268, -6224, -6070, -23436, 19248, -42775, -78464, -109086, -68114, -97970, -75770, -43691, -42637, -35847, -38971, -72487, -75450, -68827, -77199, -42048, 18728, -63364, -103656, -103756, -120554, -100198, -69082, -86468, -65277, -77851, -49513, -27974, -60958, -7951, -7432, -44581, -54550, -12892, 36083, 29449, 21550, -34113, -86678, -82995, -20849, -26506, 13454, 34305, -19149, -50115, 50181, 19342, 37163, 34056, -31767, -54166, -7060, -56903, -136856, -144073, -120629, -81399, -39684, -41806, -6548, 10566, 29502, -19364, -108677, -141766, -112174, -68270, -113343, -84805, -51644, -46775, -116085, -160019, -131859, -84381, -55297, -83923, -78649, -105726, -119799, -152182, -144199, -137007, -170233, -229906, -189467, -130437, -69131, 10965, 28625, 29979, 78442]
16418G8442k5823q8114j3811k535l194k343Q728n5929m0992K1587K7743J8711
16406g7530O3263N4285k6830M6084K5745l9601j4102k7877K4412L6563L5577o1313
16394C8676K6551K1463q4607r1760O641j8226J1800J4234J5652k9139m0825K4596
16382a04944N3819J0621P786k031l4592L715k306K4722M8102n5688l7035J9457
16370f8374L4895J0105k7288p1705R884k9024k737M4550J7185N2441M314J8179
16358g575J3876J5437K8278M6051n0659k5772p295j5310k3340l1786q1733l8051
16346a77879N5763L6478L6668L9035m527q2406p2615L4790R5102O5271J7653j597
16334D1736p3704n8435N5031K7375l9436m0496r041p097J3543j9186l7362J1084
$$ y = [78442, 52619, -35495, -49306, -51841, -55035, -57378, -48650, -104579, -145571, -123984, -96241, -77530, -14267, 40018, 13188, 59272, 85017, 45416, 31314, 3437, 27849, 64412, 99989, 38676, 65227, 86690, 2083, -89677, -83036, -101262, -89462, -75228, -59576, -88715, -129540, -104944, -51125, -40504, -32718, -34749, -69341, -65626, -67932, -43210, 4892, -50796, -87831, -68374, -33479, -23374, -50662, -122367, -112483, -141507, -144244, -99694, -82509, -30068, -25754, -7575, 6301, 21738, 50016, 96067, 45408, 19636, 12341, -2969, -26309, -58095, -139828, -177879, -122116, -85638, -48970, -9935, -14462, -96868, -169483, -134693, -39591, 25680, 43333, 41736, -31968, -90403, -35372, -7997, -47433, -87929, -96970, -104067, -90524, -109710, -147072, -135988]
16322a35988j2722Q6431K435m8394M6496J7008k867Q2444k6682n4195J3482P5413
16310D2861j882r0309j05712k4764K0478N7010J6511K0528J550o159P2426J1013
16298A3551n9512j1852L6628J1685K7789m7267l1512M6515L6042m2492l1852n3893
16286a06170M2138j8904n2313K5152J2817q7123K4725P6335m5799l5509N7830
16275a06821N5093P9911k3690q0035m4482Q4582L7146k3437P500J9390R358o2955
16263d8440k8023o5151r2145M4251Q3865O0773k4510N5964k34m3253J3474O9051
16251B5622M4510q6987k7884M4663J514l0057o3212N06K7256M0617L1071M1290
16239D8909o3257K0150k3546r637n0134j6208L446k1938M199Q7096P3915m6332
$$ y = [-135988, -148710, -62279, -59844, -108238, -61742, -44734, -47601, 34843, 8161, -46034, -32552, 42861, 40979, -49330, -155042, -179806, -159328, -102318, -85807, -65279, -63729, -69888, 2538, 13551, -45961, -57813, -21185, -9500, 18289, -28978, -60490, -13975, 22067, -20425, -52277, -106170, -64032, -82936, -135249, -110097, -97280, -184403, -159678, -83343, -129142, -164651, -106821, -51728, 28183, 4493, -75542, -120024, -35442, 1704, -21733, -14233, 5157, 14515, -48440, -76463, -141614, -233759, -189508, -105643, -44870, -69380, -13416, -13650, -56903, -43429, 25622, 70132, -16855, -44739, -76, 1438, -28619, -91831, -91325, -64069, -23452, 7619, 48909, -14348, 5802, -17744, -27381, -77515, -93723, -90277, -112215, -108016, -20920, 52995, 6663]
16227F663m8780n576j5460n74J9298M9706O625O4889m012j41065l5099O4562N0599
16214A1776J6107o7204L740P5845O8372n4583q8899m9774k3076L8042L4074k6173
16202f1753m432p227L2796P0573o5696m2047k9151j6622J9743K462L8949K2512
16190c9893m202p6118j7989P1597N6045P065j1000l7927m5401K343k1444M8511
16178f8413r29N8274N2271J0780n5959q63K279J4117k3267j7603K9681j9214J8714
16165a32M686j5423o7381l5709L1665N376j7174j7512j4040O3115P8609l5230
16153a9150m5676l1986P3874N1106m36K1466l0976k9727m251L9296K2206n2609
16141f863j2838N4445K1573N174m065n4564l3178o757J5301k2990L4490J1350
$$ y = [6663, -42117, -47693, -63153, -63727, -44429, 5277, 11902, 76791, 72779, -68286, -103385, -38823, 11776, 27883, -39321, -35581, 40264, 108636, 54053, -34846, -84620, -107696, -69654, -35580, -61753, -66185, -73412, -40616, 29957, -35739, -77786, -106937, -123559, -103816, -101354, -62405, -39893, -44095, -120213, -138202, -66605, -10560, -3495, -14495, -52422, -97823, -95480, -116924, -68413, -69342, -11068, 41203, 51983, -3976, -4839, -2560, 11557, -11710, -29313, 368, -18846, -132, 4554, -10869, -78250, -113959, -82294, -76918, -94092, -111604, -125644, -62529, 16080, -19150, -64826, -96812, -22938, 28168, 27732, 49198, 18222, -11505, -15756, 23540, 45746, -6863, -19701, 34744, 56317, 61491, 57426, 2862, -30316, -37073, -21772, -44762, -10272, 1078]
16129A078n1952N078j5933M06K9559P011k4612j5718N6085L7649J1111M0919o6970
16116A3711n4013m1639K3147M7707P819m7385n913Q3380l4744l4303K8822K7432
16104A4021K2450L6873r592j09919l7464K4869k2174l4704j9685o566O6356j4396
16092h9931L3281o709K2987K228R769k3115j0069j705m5104k1969R3958R0671
16080E4292l4519o7106l7883J1362l289l498j5204j6251m3030j1379P2675N4039
16068c9791L8218M4531N378K920j5935k6931K1318r4055o0434k5211K8172O9523
16056e2297N7132K8840k9400k0078j9789p1939J0686N7205P8001o1823p1415l099
16044i7976L7924J3909m2901m8288R989J6738K3897N097J3307K2134J3139l910
$$ y = [1078, -50874, -45796, -61729, -61323, -31764, -24753, -49365, -65083, -8998, 28651, 39762, 80681, 13711, -40302, -81941, -58794, -11087, -3268, -50653, -56566, 26814, -7930, -42233, -13411, 14021, 36471, 73344, 63752, -46167, -83631, -58762, -80936, -115640, -135325, -141891, -75535, -89931, -56650, -63359, -40372, -38144, -28375, -51490, -61559, -63264, -108368, -130337, -36379, 54292, 19773, -47333, -85216, -73854, -77143, -80641, -95845, -112096, -155126, -166505, -93830, -39791, -1573, 42958, 48336, 51256, 35321, 8390, 29708, -64347, -124781, -149992, -121820, -52297, 4835, 33675, 4275, -15803, -35592, -107531, -96845, -39640, 38361, -23462, -94877, -97976, -60052, -46143, -89044, -137332, -127343, -110605, -86708, -81611, -68304, -46170, -33031, -36941]
16032c6941Q234j3526o7428p7208n0735Q5094N8333N0440o5074m9916k4607N1459
16020a31875J5126J2862K397N3256Q1163m1169m2268K7507m7148K1836M0418M280
16008c615q0157K1091k186k0819q783j3156Q761K5116L5549O461j9006K0091J3594
15995a7059m3068j797J8097N934p2771J7281P3340k3903o7070p3601K9678R7078
15983e7861L4453O986M224K9354K0347l0729J1564m7035o0772l4054r763K5911
15971a07375K6977L0836j4948K8966J3407o0763k751J6794J7895J09593K9594
15960H8225k5997K1108l904m5380J4190p0890l0941j1516k8256J304l7027N3213
15948g5871J6238K9724N8679K7389n3353o2716k3692l1675M0202m9983M61N042
$$ y = [-36941, -28707, -42233, -109661, -186869, -237604, -152510, -94177, -43737, -108811, -158727, -183334, -131875, -116749, -103887, -101490, -48234, 32929, -8240, -50508, -23001, -70149, -48313, -7895, -3615, -83772, -62681, -64867, -85686, -94469, -107625, -98864, -73748, -38199, -31738, -50744, -30653, -17059, -60127, -61924, -43827, -37893, -110664, -93383, -20043, -43946, -111016, -184617, -154939, -57861, -23408, -16422, -12198, 17156, 37503, 6774, 18338, -28697, -89469, -123523, -133286, -107375, -80398, -49562, -64510, -35544, -22137, -82900, -85651, -68857, -50962, 58631, 88225, 62228, 83336, 79432, 34052, 48242, -22648, -53589, -65105, -93361, -92057, -129084, -75871, -59633, -29909, 28770, 56159, 2806, -59910, -83602, -115277, -75075, -125058, -124597, -119555]
15936a19555K586P4203R997j1973l6651J8211N7230m1811k3883J5012L648J3645
15924c9341N3322M4057o4077q4210k886o851L0403K7916L3154j216m9385m570
15912f3684O8640r471p487J6287p395P547n7566k6924L7357O5403L966j4481n8784
15899d6592J7403j7007N0213P2912N7202n8402j16432l2316M2857M0881M7536
15888E8255l7243p5729p1103L0963O0294k8183m2303J3976j5305O3562J8450j3304
15876c7670m07p057m2917J3930O0978k6777O522L5410J9831Q169L523j143k3019
15863I373K4692M9459n2671O395n0624j01610n3514R203k374N6044O1055J1623
15851c2949k0747k9864l2405j8989M0921N9570J0167k2928J665K3301j4826N2825
$$ y = [-119555, -116969, -42766, -32769, -44742, -81393, -63182, -5952, -47763, -71646, -56634, -52986, -39341, 13981, 58038, -6039, -90249, -93135, -99986, -69583, -41667, -8513, -9729, -59114, -63684, 4956, -4515, -12002, 4285, -3110, 4437, -53129, -80053, -42696, 22707, 26673, 12192, -46592, -29189, -46196, 4017, 76929, 134131, 75729, -40703, -73019, -30162, 10719, 58255, 21012, -54717, -125820, -94857, -34563, -62746, -105049, -91073, -106378, -42816, -24366, -37670, -38077, -45134, -88051, -74121, -13143, -39920, -33398, 2012, 21843, 30012, 33535, 32392, 9373, 34065, 83524, 30853, 37248, -13376, -114986, -168500, -159297, -161671, -105627, -44572, -32949, -53696, -83560, -115965, -134954, -94033, -34463, -24296, -47224, -45559, -22258, -37084, 15741]
15839A5741J1621j7601j0341n020K0911o1026q9826N5869O4176L4124P974p1371
15827d4769q5760M3482L6291k2863q638J0975M4952k6695l212N3094k1359p6684
15815a01186k8396j2226N124K0325j0792L7813L357m612j1243j9719j6515M2552
15803i5518N2438J15232J4924j03074m2863J7072N6495l0989o3260p9462O9713
15792h9292J36959K0173j4049p712j8026l035K5725L4440o1938j28259N557P1142
15780b8315N9304j6623n3499o113N497n837N0094L0104p6205l1464R6360J1987
15768C5290n2565j7367L7868k9288j30999n3385j1323M9616J23499l2141j9965
15757a00760J8248n2769L5910Q9231J9920p7597L542l7437J3321K2675j6153P0671
$$ y = [15741, 27362, 9761, -580, -5600, 15311, -45715, -135541, -79672, -15496, 18628, 26602, -44769, -130529, -87047, -50756, -73619, -82257, -71282, -26330, -53025, -56237, -3143, -24502, -101186, -129582, -141808, -136684, -116359, -127151, -89338, -85981, -90593, -101836, -121555, -138070, -95518, -43080, 72152, 87076, -15998, -58861, -41789, 14706, -16283, -79543, -159005, -89292, 47667, 67840, 53791, 46079, 28053, 25018, 50743, 85183, 23245, -105014, -99457, -28315, 30989, 14366, -39133, -45246, -39749, -45586, 4508, 34612, -41593, -73057, 23303, 35290, -17275, -34642, 3226, -26062, -157061, -210446, -221769, -172153, -48654, -80795, -100760, -82512, -135281, -99371, -10140, 9780, -67817, -64275, -101712, -88391, -65716, -81869, -11198]
15745a1198l2282m0428K8781l375M784k525K7803L7598J2400p5880k1757J9971
15733e6108L7101j3887o428K117Q1013m543r6901n8549q985p472j6599N744O1457
$$ y = [-11198, -43480, -83908, -55127, -58502, -53718, -56243, -28440, 9158, 21558, -54322, -76079, -56108, -19007, -32894, -39322, -37205, 43808, 39265, -57636, -116185, -125170, -132642, -149241, -143497, -82040]
$$ [...]
##END NTUPLES=NMR SPECTRUM
##END=
