##TITLE=Analysis number 310322
Compound Code cc 41709
Book Reference 419/130/5
Project Code adrs
Chemist Name anns
##JCAMPDX= 6.0         $$ Bruker NMR JCAMP-DX V2.0
##DATA TYPE= NMR SPECTRUM
##DATA CLASS= NTUPLES
##ORIGIN= Bruker BioSpin GmbH
##OWNER= NMR
$$ XWIN-NMR		Version 3.5
$$ Fri Jun 17 10:45:21 2005 GMT Daylight Time (UT+1h)  MAYBRIDGE\NMR@NMR_250MHZ
##.OBSERVE FREQUENCY= 250.131544655141
##.OBSERVE NUCLEUS= ^1H
##.ACQUISITION MODE= SIMULTANEOUS (DQD)
##.ACQUISITION SCHEME= undefined
##.AVERAGES= 16
##.DIGITISER RES= 18
##SPECTROMETER/DATA SYSTEM= dpx250
##.PULSE SEQUENCE= zg30
##.SOLVENT NAME= CDCl3
##.SHIFT REFERENCE= (INTERNAL, CDCl3, 0, 16.522)
##AUDIT TRAIL= $$ (NUMBER, WHEN, WHO, WHERE, WHAT)
$$ ##TITLE= Audit trail, XWIN-NMR		Version 3.5
$$ ##JCAMPDX= 5.01
$$ ##ORIGIN= Bruker BioSpin GmbH
$$ ##OWNER= NMR
$$ C:\u/data/dgb/nmr/ADRS/4180/pdata/1/auditp.txt
$$ ##AUDIT TRAIL=  $$ (NUMBER, WHEN, WHO, WHERE, WHAT)
(   1,<2005-06-17 10:44:38.16 +100>,<MAYBRIDGE\NMR>,<NMR_250MHZ>,
      <created by zg, POWCHK disabled, PULCHK disabled
       configuration hash MD5:
       62 19 C7 07 E1 42 D1 B7 37 6C 3D D0 77 39 F9 E6
       data hash MD5: 64K
       B2 9F CA 4D 30 B7 9F FA F9 14 5F 98 BA 54 22 DF>)
(   2,<2005-06-17 10:44:56.50 +100>,<MAYBRIDGE\NMR>,<NMR_250MHZ>,
      <Start of raw data processing
       ef LB = 0.3 FT_mod = 6 PKNL = 1 SI = 32K 
       data hash MD5: 32K
       9A F6 BD 98 87 85 99 D1 18 10 8D 51 E7 09 55 EE>)
(   3,<2005-06-17 10:45:01.94 +100>,<MAYBRIDGE\NMR>,<NMR_250MHZ>,
      <apk 
       data hash MD5: 32K
       BF B2 FC 54 5D EC 43 A1 C9 5C E8 86 0E D0 C6 52>)
(   4,<2005-06-17 10:45:03.58 +100>,<MAYBRIDGE\NMR>,<NMR_250MHZ>,
      <abs ABSG = 5 
       data hash MD5: 32K
       CC 9F B0 A0 28 73 2B 4C 47 F8 0C AE 29 84 0A F9>)
$$ ##END=
$$ 
$$ hash MD5
$$ 37 75 48 14 96 7B 54 35 12 12 DF BB F0 D9 24 2C
##$RELAX= 
##$RELAX= 
##$RELAX= 
##$RELAX= 
##$RELAX= 
##$RELAX= 
##$RELAX= 
$$ Bruker specific parameters
$$ --------------------------
##$DU= <C:\u>
##$EXPNO= 4180
##$NAME= <ADRS>
##$PROCNO= 1
##$TYPE= <nmr>
##$USER= <dgb>
##$AMP= (0..31)
100 100 100 100 100 100 100 100 100 100 100 100 100 100 100 100 100 100 
100 100 100 100 100 100 100 100 100 100 100 100 100 100 
##$AQSEQ= 0
##$AQ_mod= 3
##$AUNM= <au_zg>
##$AUTOPOS= <14 >
##$BF1= 250.13
##$BF2= 250.13
##$BF3= 250.13
##$BF4= 250.13
##$BF5= 500.13
##$BF6= 500.13
##$BF7= 500.13
##$BF8= 500.13
##$BYTORDA= 1
##$CFDGTYP= 0
##$CFRGTYP= 5
##$CHEMSTR= <none>
##$CNST= (0..31)
1 1 145 1 1 1 1 1 1 1 1 1 1 1 1 1 1 1 1 1 1 1 1 1 1 1 1 1 1 1 1 1 
##$CPDPRG= <>
##$CPDPRG1= <>
##$CPDPRG2= <>
##$CPDPRG3= <>
##$CPDPRG4= <mlev>
##$CPDPRG5= <mlev>
##$CPDPRG6= <mlev>
##$CPDPRG7= <mlev>
##$CPDPRG8= <mlev>
##$CPDPRGB= <>
##$CPDPRGT= <>
##$D= (0..31)
0 1 0 0 0 0 0 0 0 0.06 0 0 0 0 0 0 0.0002 0 0 0 0 0 0 0 0 0 0 0 0 0 0 
0 
##$DATE= 1119001475
##$DBL= (0..7)
120 120 120 120 120 120 120 120 
##$DBP= (0..7)
150 150 150 150 150 150 150 150 
##$DBP07= 0
##$DBPNAM0= <>
##$DBPNAM1= <>
$$ [...]
##$SUBNAM7= <"">
##$SUBNAM8= <"">
##$SUBNAM9= <"">
##$SW= 20.6930455092707
##$SWIBOX= (0..15)
0 0 3 0 0 0 0 0 0 0 0 0 0 0 0 0 
##$SW_h= 5175.983436853
##$TD= 65536
##$TD0= 1
##$TE= 295.16
##$TE2= 300
##$TE3= 300
##$TEG= 300
##$TL= (0..7)
0 120 120 120 120 120 120 120 
##$TP= (0..7)
150 150 150 150 150 150 150 150 
##$TP07= 0
##$TPNAME0= <>
##$TPNAME1= <>
##$TPNAME2= <>
##$TPNAME3= <>
##$TPNAME4= <>
##$TPNAME5= <>
##$TPNAME6= <>
##$TPNAME7= <>
##$TPOAL= (0..7)
0.5 0.5 0.5 0.5 0.5 0.5 0.5 0.5 
##$TPOFFS= (0..7)
0 0 0 0 0 0 0 0 
##$TUNHIN= 0
##$TUNHOUT= 0
##$TUNXOUT= 0
##$USERA1= <user>
##$USERA2= <user>
##$USERA3= <user>
##$USERA4= <user>
##$USERA5= <user>
##$V9= 5
##$VALIST= <valist>
##$VCLIST= <CCCCCCCCCCCCCCC>
##$VD= 0
##$VDLIST= <DDDDDDDDDDDDDDD>
##$VPLIST= <PPPPPPPPPPPPPPP>
##$VTLIST= <TTTTTTTTTTTTTTT>
##$WBST= 1024
##$WBSW= 4
##$XGAIN= (0..3)
0 0 0 0 
##$XL= 0
##$YL= 0
##$YMAX_a= 364512
##$YMIN_a= -279535
##$ZGOPTNS= <>
##$ZL1= 120
##$ZL2= 120
##$ZL3= 120
##$ZL4= 120
##$ABSF1= 16.522
##$ABSF2= -4.171173
##$ABSG= 5
##$ABSL= 3
##$ALPHA= 0
##$AQORDER= 0
##$ASSFAC= 0
##$ASSFACI= 0
##$ASSFACX= 0
##$ASSWID= 0
##$AUNMP= <proc_1d>
##$AZFE= 0.1
##$AZFW= 0.1
##$BCFW= 0
##$BC_mod= 0
##$BYTORDP= 0
##$COROFFS= 0
##$CY= 12.5
##$DATMOD= 1
##$DC= 0
##$DFILT= <>
##$DTYPP= 0
##$F1P= 14.0000005364418
##$F2P= -0.99999901652339
##$FCOR= 0.5
##$FTSIZE= 32768
##$FT_mod= 6
##$GAMMA= 0
##$GB= 0
##$INTBC= 1
##$INTSCL= 1
##$ISEN= 128
##$LB= 0.3
##$LEV0= 0
##$LPBIN= 0
##$MAXI= 10000
##$MC2= 0
##$MEAN= 0
##$ME_mod= 0
##$MI= 0
##$NCOEF= 0
##$NC_proc= -4
##$NLEV= 6
##$NOISF1= 0
##$NOISF2= 0
##$NSP= 0
##$NTH_PI= 0
##$NZP= 0
##$OFFSET= 16.522
##$PC= 1
##$PHC0= -77.6866
##$PHC1= 5.116792
##$PH_mod= 1
##$PKNL= yes
##$PPARMOD= 0
##$PSCAL= 4
##$PSIGN= 0
##$REVERSE= no
##$SF= 250.13
##$SI= 32768
##$SIGF1= 0
##$SIGF2= 0
##$SINO= 400
##$SIOLD= 32768
##$SREGLST= <1H.CDCl3>
##$SSB= 0
##$STSI= 32768
##$STSR= 0
##$SW_p= 5175.98343685301
##$SYMM= 0
##$S_DEV= 0
##$TDeff= 65536
##$TDoff= 0
##$TI= <Analysis number 999999
Compound Code 99
Book Reference 9
Project Code 9>
##$TILT= no
##$TM1= 0
##$TM2= 0
##$TOPLEV= 0
##$USERP1= <user>
##$USERP2= <user>
##$USERP3= <user>
##$USERP4= <user>
##$USERP5= <user>
##$WDW= 1
##$XDIM= 32768
##$YMAX_p= 433995754
##$YMIN_p= -237095
$$ End of Bruker specific parameters
$$ ---------------------------------
##NTUPLES= NMR SPECTRUM
##VAR_NAME=  FREQUENCY,     SPECTRUM/REAL,   SPECTRUM/IMAG
##SYMBOL=    X,             R,               I
##VAR_TYPE=  INDEPENDENT,   DEPENDENT,       DEPENDENT
##VAR_FORM=  AFFN,          ASDF,            ASDF
##VAR_DIM=   32768,         32768,           32768
##UNITS=     HZ,            ARBITRARY UNITS, ARBITRARY UNITS
##FACTOR=    0.157963299565203, 1,           1
##FIRST=     4132.6476996994, 0,             0
##LAST=      -1043.33573715361, 0,           0
##MIN=       -1043.33573715361, -237095,     0
##MAX=       4132.6476996994, 433995754,     0
$$ Real data points
##PAGE= N=1
##DATA TABLE= (X++(R..R)), XYDATA
$$ [...]
30812 -89784 -47165 -36322 15574 91872 135086 83723 -9373 -58408 -36026 -2655 -26117 -54869
30800 -54869 -71146 -52333 -48558 -49176 -41968 946 94621 104443 85248 58625 26720 77903 96230
30787 96230 60280 29365 -8843 -53921 -75241 -82712 -77667 -38575 -11716 -93439 -158662 -171216
30775 -171216 -92188 -54965 -49051 -53204 -48237 -59513 10496 -4892 -62984 -141395 -131153 -156785
30763 -156785 -71755 -3912 11386 41425 11630 -7345 -8196 -25068 -53828 -45031 -17267 7669
30751 7669 -9874 15347 59528 79222 95620 69880 63727 50085 15121 45124 88386 20264
30739 20264 38114 68391 -7175 -7227 44220 79383 35 -33812 -55082 -61359 -55068 -88029 -3477
30726 -3477 15831 -2169 -14017 -69972 -74258 -21167 36420 2869 18242 -21892 -5935 -32633
30714 -32633 -80207 -109699 -141145 -111859 -85424 -66948 27576 112355 110856 96130 14882 -25898
30702 -25898 -938 34228 49838 63931 44058 -23211 -43220 -51781 -9366 46133 54258 27547
30690 27547 6737 19611 114233 180155 114567 63372 71973 45798 74127 57380 23102 14319
30678 14319 104089 95811 101340 116575 50225 -26400 -42942 -3162 85412 67883 -454 -7775
30666 -7775 -13590 3501 -25312 24426 9519 21949 78302 43804 56571 53029 14619 -20369
30654 -20369 -20423 -31649 -36373 -19166 62511 61837 32237 -11098 -77265 -77880 -33356 -35861 -40274 -25629
30640 -25629 58616 88456 57427 39144 -33068 -58980 -89643 -89415 -126970 -54731 -2480 -2728
30628 -2728 59871 60551 28933 18647 21502 -12904 -71574 -3734 48543 -2615 18675 12731 -8109
30615 -8109 -60904 -42427 -57728 -13047 -14452 -66430 -21614 69953 55152 -54559 -20176 82648
30603 82648 81761 67894 -38454 -70810 -58928 -72299 -52238 -22449 -88095 -75010 -42334 -78675
30591 -78675 -97898 -108693 -84780 28572 50722 -17524 53933 73467 71948 84329 33095 20401
30579 20401 -15065 -20013 27819 57788 70036 97148 66781 -2496 -39602 -61541 -63857 -28797
30567 -28797 -121068 -138739 -136868 -79131 6824 -25375 -41615 -41577 -22953 6622 4643 -23264 14147
30554 14147 74472 55617 8551 8143 19458 25186 43132 93835 85413 49426 49321 12634 -57861
30541 -57861 -40546 22520 54987 114260 78952 32096 7263 -21499 35571 -24136 -90241 -72377
30529 -72377 -29558 -40143 -43365 46382 90174 69985 53356 -6529 15027 86080 79555 -21331
30517 -21331 -37377 -37000 -18452 28441 44865 53162 41303 40679 34449 -4335 -75308 -62802 -58201
30504 -58201 15663 21350 20203 45117 42602 48799 75158 122046 107373 124924 92474 1979
30492 1979 -12273 38345 54225 5000 -25811 -52684 -45045 -7677 10904 5912 23985 10532
30480 10532 30935 32453 2951 8035 11305 31458 -18792 -44587 -43808 -1129 1853 -19047 -25557
30467 -25557 47303 24177 16614 36338 66917 47925 23777 -41298 -24278 -34465 -62204 -78724
30455 -78724 -37112 -29061 -27 97793 139013 165503 68005 -7127 -17085 -42896 -48293 -5907
30443 -5907 18770 79428 106250 71411 54270 81652 40713 47319 43907 17034 52664 67000
30431 67000 48529 61715 49436 35299 14947 19367 45915 5502 -37758 -38806 -75562 -65002
30419 -65002 -48369 -50903 -4490 -4073 -3141 80526 149346 129706 95812 12557 -17627 -5619 89511
30406 89511 117009 55347 5771 13820 -26506 -74995 -115542 -69494 21367 7466 -87027 -99363
30394 -99363 -346 42773 9793 -33028 -3760 53489 46826 49246 58735 60134 -10001 -14407 -5891
30381 -5891 -48351 -53155 -26497 -16329 4827 -26636 -13318 -40748 -29837 -6667 -47032 19281
30369 19281 99374 41950 881 35581 -951 -14794 -10920 26192 6394 28907 -34051 2019
30357 2019 72716 72761 47709 43673 40808 77875 24820 -42774 -7158 50056 92961 29078 -6806
30344 -6806 -9660 35731 -1207 -24302 -9325 43277 7873 -67307 -45109 8844 64647 31793
30332 31793 -52403 -112866 -36253 16738 -20572 -11093 36226 28639 63523 39361 31081 40623
30320 40623 -31944 -81567 -69906 -36738 -60482 -63317 -491 28095 16771 8472 21957 51971
30308 51971 41884 20820 -486 -33421 -24033 -37695 -14202 -32820 14897 134112 77253 49184
30296 49184 54786 66757 110194 130681 60303 48533 6261 -26044 -42894 -72192 -167620 -145526
30284 -145526 -38652 39933 82648 39041 23148 28326 55874 59522 25321 -17821 -80494 -54558
30272 -54558 516 4485 25308 34675 49053 55094 87449 107413 72444 29077 43537 64879
30260 64879 83948 83061 75186 -965 -21173 4209 -25961 20295 20728 -18181 48403 77513 25651
30247 25651 28502 42001 20281 43362 50034 50280 94174 86541 -8912 -27747 9799 7765 16887
30234 16887 12506 -52125 -10292 13472 -9682 -4637 18282 21997 -27448 -30236 -22059 -44320 -41762
30221 -41762 -86294 -20234 93513 158700 178871 135322 31239 -65570 -94731 -23190 -22975 1703
30209 1703 -1081 -25742 -9108 9234 18425 40453 61108 36934 52531 146441 121969 90019
30197 90019 80905 62271 68120 97964 -6093 -77168 -31620 -6291 -22747 -20391 -40349 -90741
30185 -90741 -115451 -84518 17863 31331 -10446 -10781 -41346 -69277 -110186 -61444 5767 -47780
30173 -47780 -96243 -121041 -51092 -23226 -43749 -50611 -11142 5806 29910 55202 71248 108384
30161 108384 93045 43365 37427 40469 27082 31725 36159 48849 31501 24920 -18175 -66916
30149 -66916 -11078 24090 5486 6981 50152 95845 130396 152250 174269 97631 53310 9469
30137 9469 -54931 7263 39953 31152 69324 82081 64484 78879 106037 101096 147905 158523
30125 158523 142503 57480 -7105 -51415 -58765 -64284 8037 34962 -4573 12761 46394 8140
30113 8140 11715 76109 74876 61636 125869 120291 56841 34680 86346 41959 -16756 54533
30101 54533 57348 74247 75918 -22238 -68126 -62135 -24706 40707 67873 20855 -9175 -16660
30089 -16660 -11367 -87688 -123632 -50598 36377 136501 120686 18167 -56796 -54788 -55603 -65702
30077 -65702 -14473 32105 60949 36754 3252 -67256 -79044 34441 86225 60865 47672
30066 47672 3526 -60551 -58466 -43855 -91879 -137581 -117975 -115464 -70756 -27861 -10751 33479
30054 33479 15625 70151 160383 101488 -40699 -8526 -11488 -42861 -86545 -104423 -39115 4530
30042 4530 19720 11005 -64622 -92003 -88203 -27100 15274 77283 121263 102030 51940 34227
30030 34227 30840 32930 -11766 -103497 -78823 -39578 -2454 -11461 23924 30008 59356 -5671
30018 -5671 -93756 -82975 -73796 -73035 -79574 -66987 -53308 -72563 -19898 -19139 29388 13209 -635
30005 -635 13518 117 -67477 -98317 -9716 11899 2042 11123 20758 76830 135971 98814 88791
29992 88791 24304 -31730 -53064 -39316 39838 75643 86965 86504 79754 41194 4604 17806
29980 17806 23903 -5963 -43393 -65953 -11056 42448 17534 65809 79910 -3480 12072 89362
29968 89362 60355 -31161 -77313 -127330 -94930 -91801 -90441 -15557 59930 99677 85427 114029
29956 114029 71043 40703 28701 56857 71395 17278 -25266 11775 9992 -13595 -54396 -59908
29944 -59908 -57376 -46610 -131148 -115858 -72664 -102304 -101484 -57697 -73654 -76515 -22240 13719
29932 13719 381 -5420 52052 30537 -21454 32480 68625 27755 58557 67572 45188 -23481
29920 -23481 -75695 -90071 -68384 -44608 -27217 -33857 -3195 -12860 -67705 -115461 -107246 -40119
29908 -40119 -5559 -68286 -80051 -45837 -93618 -73386 -39863 48697 93967 85774 22051 11247
29896 11247 79018 102325 90978 115033 144342 111783 124091 90216 27512 -20102 -57951 -37031
29884 -37031 10046 74590 110947 106748 96480 67324 63418 67051 39521 -4132 -34129 -43172
29872 -43172 -5119 61245 55540 58500 91789 32212 12604 26764 54091 97495 54615 76128
29860 76128 84034 120058 57662 19605 83300 76673 63890 52503 38018 81825 40073 -15459
29848 -15459 -24394 -10616 30931 52990 -4507 -23357 2738 69678 84914 118108 143881 70523
29836 70523 25398 -5881 4251 9800 18906 -1642 -18554 2740 -28106 -33072 15590 73501
29824 73501 106885 18217 -68539 -97806 -70838 -59173 -56155 13846 23787 -17383 -22499 -63198
29812 -63198 -42197 -96110 -138844 -52730 -752 -24742 -21696 -60461 -53777 20021 -16390 -38138
29800 -38138 -5851 5736 1154 44326 58873 89011 38077 53087 97262 138282 109177 23864
29788 23864 51770 6873 -9944 -13562 -3208 -5236 33903 45284 52139 34794 24296 34456
29776 34456 -45944 -101326 -101707 -33045 -22514 -63215 -106895 -91891 27630 36124 1635 72779
29764 72779 67995 41408 106775 18362 15662 87211 23551 -41342 -32466 21578 -11234 -35253
29752 -35253 19116 -26257 -3969 6484 -39649 -57771 -50212 -6570 21594 19015 -19047 -18879
29740 -18879 18501 -13091 -68356 -49098 -33373 18546 75639 68161 70627 106343 81004 45434
29728 45434 84036 141682 160807 112095 75751 40624 74723 61472 10210 -66386 -113732 -117495
29716 -117495 -123205 -124340 -63246 678 108518 87843 59285 58309 9770 -26100 -73630 -68168
29704 -68168 -18970 -4233 -12377 66286 60515 17199 33572 -34766 -11386 30885 -8040 6956
29692 6956 26392 37363 18771 61594 43590 10672 21695 15965 48268 58800 12928 8178
29680 8178 44421 49966 22854 27266 46231 34251 9504 -14394 6557 -25627 -21983 21222
29668 21222 59432 30145 30399 25394 58284 124019 123415 77825 85532 115230 151911 153811 180543
29655 180543 149648 116081 95780 41790 2306 -26761 -85218 -69063 -79415 -87427 -55618 -52181
29643 -52181 -23513 33799 -48938 -153263 -154634 -141732 -134969 -187888 -196556 -150732 -98960 -101731
29631 -101731 -82638 -110321 -115738 -62323 -110451 -92567 -90474 -60268 -68206 -93106 -55421 -3799
29619 -3799 -39947 -25374 -24320 -121594 -105603 -23734 -25144 -71504 -71385 9295 96425 90890 50934
29606 50934 29220 -10006 14551 44378 53763 59139 32498 22024 12295 56699 52466 -5010
29594 -5010 -7854 15323 -33097 -32817 -71067 -49367 -7059 -4810 -24624 -56950 -57641 -20188 -26642
29581 -26642 -48679 -62746 -53182 -62730 -42735 -105773 -188362 -197985 -67201 -1080 -13758 47798
29569 47798 119964 84666 2736 -39455 -56222 -48571 -85917 -107987 -112275 -55455 39781 63230
29557 63230 46007 -1047 -15100 -50162 -59955 -47763 -47923 -50792 -16373 48919 57660 32353 24644
29544 24644 -37858 -102004 -128034 -98404 -50739 -73777 -95327 -70026 -51985 65406 71847 104163
29532 104163 113119 80155 63302 103527 133970 99122 48815 40858 110991 109835 102189 148590
29520 148590 119930 42461 31965 8842 -51354 -110512 -98879 -77866 -141293 -86152 -7473
29509 -7473 14078 47780 21328 8986 26322 27067 -23701 -59991 -53204 -10106 -8154 20850 78314
29496 78314 147095 92471 28675 -6040 77294 133249 86783 40938 50467 14313 24461 -1708
29484 -1708 -54697 -63827 -39093 -37672 -4957 7618 24757 -2395 -47223 5682 26752 716
29472 716 14149 72056 69103 3929 39382 104803 73176 -2396 17585 -16792 -36632 -14029
29460 -14029 -48792 -104006 -58221 9828 63077 104367 49629 -9234 -39108 -98984 -120344 -121121
29448 -121121 -124910 -58596 -17996 -6507 -24172 -29087 -51785 -23147 14996 33335 20061 8940
29436 8940 28809 28588 6588 -52557 -80673 -40651 -2560 -378 -50963 -29876 -64314 -83723
29424 -83723 35469 138755 120430 98131 42484 37533 34603 19684 -11162 -16502 -42189 -35466
29412 -35466 -14382 36307 68503 62406 4778 -5395 27633 38031 9009 -56613 35434 16208
29400 16208 5504 -30577 -61919 -128213 -160233 -36733 32205 39744 40839 56635 51831 32483
29388 32483 -4965 -40706 -20814 -23634 5332 22259 52478 92442 135263 122507 59839 -24296
29376 -24296 -12366 22459 -41595 -38342 -16164 15776 15565 27477 61000 72691 90595 108066
29364 108066 77024 23476 9574 -65462 -81749 -37990 38797 98075 61173 28119 -5368
29353 -5368 -5401 17639 147677 193080 181949 143777 88381 51832 8312 -13930 51220 121016
29341 121016 107741 10532 -4942 -44650 -95350 -86308 -44478 18625 49751 -36954 -80237 -70563
29329 -70563 -51270 -40724 -55136 -65367 -66498 -27969 -15050 -3336 -323 -44370 -16181 7036
29317 7036 -60591 -124558 -91045 -47990 7982 74480 79942 59435 36447 1465 33777 78993
29305 78993 8696 -19332 -6908 -8712 -63478 -70410 -20387 18055 -19782 -8339 76408 102885
29293 102885 83442 74461 104791 113047 11450 -55574 -3000 -5552 38735 69663 18785 17561
29281 17561 48806 38249 2473 -63320 -55479 -90065 -127482 -104559 -63257 154 39392 -16743
29269 -16743 -10967 -4838 -28482 -21670 2909 48257 34090 -9812 -32228 -89638 -82920 -70880
29257 -70880 -63014 -23964 37560 49826 11134 39189 88283 109129 33857 3467 14179 -13004
29245 -13004 5933 -9747 -19168 1626 -6165 -42262 -81628 -27608 -86660 -106037 -18011 29480
29233 29480 -116 -8196 -19319 10150 64488 81441 56978 66229 88606 91495 123911 81620
29221 81620 58998 -9377 -90829 -102871 -89565 -40669 -32235 -51325 -65428 -70390 40978 56542
29209 56542 56151 9410 -25307 -40166 -85921 -168372 -173345 -118909 -153839 -136642 -94595 -103750
29197 -103750 -42583 -26083 -55649 -44312 -14509 2620 -13806 44621 46566 -36475 -67668 27391
29185 27391 87435 73159 28614 -7643 -17678 -21897 54835 62166 -20241 -57501 3779 53618
29173 53618 -36526 -54249 -12436 12576 -16517 -56168 -14431 34149 63623 7944 -47785 4639
29161 4639 20951 -11352 -19938 -35816 -58271 -79942 -47815 -27229 35549 103320 107358 42271
29149 42271 17397 39719 33975 59789 84491 93453 54157 49436 100464 66186 11137 -41636
29137 -41636 -74143 -59807 -16491 23572 40686 43806 7755 7487 -55960 -82843 -83977 -62026
29125 -62026 -18054 -14030 -7567 7673 44275 49652 -16413 -63318 -28792 -39297 -71395 -94908
29113 -94908 -81341 -81191 -126941 -97976 -37281 -10872 -9465 -41360 -1485 31558 7388 6973 -12728
29100 -12728 -14597 -2602 -45196 -32569 -31238 15052 22220 -84727 -110342 -66052 -27043 -8900
29088 -8900 9418 3501 3282 41004 -4924 -63201 -42281 -32524 -18684 -11751 -19167 -41119 -2225
29075 -2225 27301 60576 39624 37591 12329 8094 -7431 28395 111679 89630 24658 4056
29063 4056 -21725 -75871 -81171 -60167 -19255 3006 -14897 -27784 45969 42706 -56090 -53667
29051 -53667 -37201 50297 18024 -64065 -80399 -70501 -45661 26034 68969 45407 -24740 -37248
29039 -37248 15934 10245 -32430 -18513 -44552 -2168 39718 11811 58661 48230 7603 -30475
29027 -30475 -47479 -66038 -76564 -32642 12179 76808 93388 123286 75506 2304 -66162 -91818
29015 -91818 -58396 -58687 -48868 -45592 -66622 -21982 -60802 -50100 59216 66704 55138 75840
29003 75840 103557 53477 35340 26114 18569 14425 24937 34710 -2252 14416 68463 6524
28991 6524 -61927 -75676 -93346 -46809 -22211 -18058 21386 56609 -17159 -51939 -40197 16061
28979 16061 16625 10784 25263 78937 123833 87764 136922 116529 64271 134971 102257 49616
28967 49616 34322 69943 59350 74620 113485 79011 8470 -5959 -8294 22141 69013 15405
28955 15405 -9667 8574 22280 -8305 27166 -9457 55970 143228 114553 34945 21541 57514
28943 57514 74610 81707 117765 132093 100760 55414 28754 13962 4587 -44764 -60741 5987
28931 5987 21690 31909 12433 18421 7785 23554 46060 57653 -2249 -45571 40215 77287
28919 77287 84701 72685 36336 18087 22433 8566 68928 68499 25619 53267 59057 75037 115522
28906 115522 126783 81539 121894 126230 86183 29111 -14386 4418 30963 56799 17797 32690
28894 32690 38227 22202 29891 -16218 -45048 -42079 24228 84062 75475 -11198 1986 -31673
28882 -31673 -45550 -26605 13486 15400 11452 38073 80352 63812 33312 -26964 -30689 2450
28870 2450 -47761 -28153 -27748 -34220 -11786 2654 32856 34683 31517 40007 32903 19089 -43857
28857 -43857 -53532 -39526 -81140 -73692 48037 119776 95115 27512 40496 30800 15623 -944
28845 -944 -15914 -61751 -54009 31900 8122 -43371 -60672 -54095 -42694 -59694 -111069 -104351 -45667
28832 -45667 -38907 -50136 -61729 252 43216 46972 20991 -66081 -113733 -116573 -74836 -69998
28820 -69998 -77266 19897 824 -93659 -98010 -30661 -20396 -6041 57554 74037 56457 88554
28808 88554 86659 54909 100060 136521 127486 41028 35636 36770 27803 72547 67186 27662 5344
28795 5344 3836 38180 59837 9472 -39801 -98481 -95239 -74775 -61289 -31654 -47559 -42588
28783 -42588 60759 69743 -13101 55621 145746 160789 134572 83869 29841 -34126 -113227 -135714
28771 -135714 -157190 -95936 -58287 -34118 -189 57200 73746 57559 54733 64146 91753 76873
28759 76873 55287 39311 74735 50897 1099 17953 64031 112958 106727 26276 -4544 -26111
28747 -26111 -86023 -99186 -93205 -45227 52109 132697 115346 61867 50885 45834 35498 27204
28735 27204 24585 27845 -32226 -13094 55461 72249 41361 -7769 -18483 -38325 -51152 -2729
28723 -2729 52985 56114 43274 79268 31622 8912 28472 21605 11898 57267 100212 81336
28711 81336 62263 41121 58845 -10519 -48610 -17425 -40974 -93654 -92285 -38207 -14013 36674
28699 36674 3747 -81269 -89978 -42592 -14039 25748 -19616 -48160 40782 83578 110659 105354
28687 105354 62052 76635 78151 68999 50606 29497 32027 4020 24167 13503 16856 13896
28675 13896 25691 15479 10286 -4278 -66945 -114126 -103181 -72828 -47640 -32952 -21679 -49515
28663 -49515 -59994 -45779 -12853 3308 20261 -7570 -52783 -72203 -12157 58705 51053 26378
28651 26378 13918 32267 106991 102732 83889 59680 28695 -18755 -85797 -60319 -81337 -58768
28639 -58768 2549 15045 33408 52666 55564 53090 62248 10296 -10637 -38633 -51744 -52149 -14646
28626 -14646 11647 -70735 -172460 -123477 -67212 -12430 25423 -12939 35726 33295 11197 -76295
28614 -76295 -77637 -32593 72973 84037 53327 63719 49229 1109 16498 60350 119426 107205
28602 107205 68450 76293 65543 55119 51495 35169 60097 76437 83985 120486 90137 129533
28590 129533 104396 -36111 -72534 -63100 -23550 -1664 -33509 -72775 -107976 -106637 -103195 -89804
28578 -89804 -59804 23629 49283 94139 130812 117872 52015 19455 19045 -17121 -34684 3607
28566 3607 -1445 -61847 -94072 -24377 12695 -4235 -23544 -24502 -6568 13681 45661 62676
28554 62676 63110 -4550 -16216 67611 81412 69857 61128 67185 31549 32418 57388 57912 82135
28541 82135 78714 69243 21115 -6829 7670 23818 9586 -20508 -35886 -22642 -20864 -30027
28529 -30027 -35835 -804 41580 33684 23359 51635 43273 48870 49633 276 -13357 7430 -8497
28516 -8497 23405 34971 -57778 -82880 -36940 -11638 -69035 -76345 -40641 -22951 -9946 -59913
28504 -59913 -36425 40997 46535 512 -5201 -23083 -26587 11026 17264 66672 54349 4095
28492 4095 28693 65405 23690 48178 70977 31542 14242 -106892 -59329 1548 -20981 -3405
28480 -3405 34910 65184 34344 52091 41005 36706 9587 -5295 44980 59533 -12035 -49984
28468 -49984 -56779 -48388 -4786 68934 85433 92876 30900 -1522 -31837 -16353 64775 55110
28456 55110 -23585 -52228 -38626 -4483 -7103 6587 -16757 -7791 -45065 -55638 -4386 555
28444 555 8806 32952 -1 -10765 -47396 -118460 -131444 -144897 -157614 -180889 -147576 -173208
28432 -173208 -143686 -106400 -71801 -78054 -109426 -99531 -42748 21643 76893 129834 174198 138143
28420 138143 70527 -6484 -58342 -62621 -51144 -44032 -49641 -37240 -29198 24018 -25296 -38223
28408 -38223 -13539 26795 -63864 -43088 49791 70504 75858 78985 62545 75366 125092 105077
28396 105077 88758 44723 -19029 -34373 -93963 -90309 2043 26679 19876 49717 69366 139268
28384 139268 158337 161117 156694 129308 122187 152852 198485 165791 73532 25436 41103 -1802
28372 -1802 -5193 46982 103290 69813 -9557 -32594 -18115 -13719 -4842 8664 2729 -45908 7711
28359 7711 20402 22116 90978 10592 -46912 -23885 -1456 -9484 2861 26510 -11117 -59040
28347 -59040 -15440 49152 27119 -34573 -87415 -40068 23084 38654 -3812 32925 14768 26325
28335 26325 -3799 -13485 48966 70842 23433 25205 50507 51232 26639 -15489 -63384 -12883
28323 -12883 51713 28624 -46927 -85565 -175862 -157125 -48923 -39065 -60124 -28466 7208 51267
28311 51267 -45413 -107220 -38711 27470 -3127 -4420 20448 40573 78854 45025 73121 97738
28299 97738 115234 136999 178028 164814 140328 72479 33166 16310 -3239 -56936 -92455 -58099
28287 -58099 -51568 28371 43217 -16345 -78278 -55566 -67263 -141738 -159956 -117338 -110867 -100796
28275 -100796 -55219 -46538 -6134 33791 62563 82811 41162 97244 96385 77206 52230 2394
28263 2394 -34482 -31312 -30982 -56089 -100236 -99463 -29995 -16744 -21519 -4772 -12032 52780 40231
28250 40231 24327 8382 14092 20398 15276 8803 50462 57259 -3773 -87337 -91676 -104554 -77921
28237 -77921 -76255 -23046 5506 27730 73512 132169 81359 30213 38333 55667 61890 90455
28225 90455 77458 86944 47804 79178 133174 162129 164593 134719 78543 134127 148818 104548
28213 104548 88928 91691 156051 110882 69368 103044 167450 113923 56155 42602 41593 25101
28201 25101 -2940 -51978 -14250 38231 -6522 29990 14462 25417 45109 16433 -3689 -5342
28189 -5342 65496 96307 97125 52645 -17870 -41061 -27180 -5479 19726 -37290 -19177 -16882
28177 -16882 -46049 -28492 -66430 -86554 -137936 -183100 -132738 -58320 -48255 -80342 -115215 -67449
28165 -67449 -7493 -40918 -36428 -99230 -68687 -93850 -137046 -109044 -102147 -94014 7030 32728
28153 32728 17142 47871 50131 7066 -50205 -79856 -100192 -17251 76273 105020 -1284 -28816
28141 -28816 -17248 5729 77680 96371 178397 200679 122048 35172 -62167 -126090 -139171 -62585
28129 -62585 -38335 -67015 -53321 -19190 -7667 12022 58274 62966 2500 43727 11184 33924
28117 33924 27911 34386 19299 37510 16137 -50080 -27332 17328 62723 70844 55837 21325
28105 21325 13325 -53278 -23589 51588 104099 66324 64069 58112 34421 -21679 7435 27446
28093 27446 23349 69277 49731 46421 85898 90347 80935 98934 75832 6105 -7173 2216 -2846
28080 -2846 238 -17265 -25818 -31604 5909 34964 62047 2602 -22604 -38744 -1782 -37263
28068 -37263 -75815 -69128 -70344 -39661 31254 24648 4290 11019 33753 5168 -10199 -28120
28056 -28120 26677 30162 11315 -9736 -46866 29845 50805 61441 68672 71395 47077 50996
28044 50996 32092 26709 3390 4192 -66828 -103900 -65453 -52924 20153 127151 160092 64790
28032 64790 93905 76022 -2910 -60336 -4669 30292 83244 93567 62109 -8205 8327 -8333
28020 -8333 -35210 -16428 69010 121773 123936 72200 30612 -17820 -11522 -16566 19928 616
28008 616 -42966 -58670 -38708 -17045 65054 37164 -9020 23173 23798 9769 60756 -27016
27996 -27016 -54990 15137 50258 31204 56802 84136 88039 71653 28981 4475 -36718 -10667
27984 -10667 -38197 -63302 -36943 57551 103446 151996 216642 203181 152161 100324 77362 36506
27972 36506 21573 36255 63849 33711 -16090 -62729 -10290 78185 22826 14069 92993 53379
27960 53379 -13984 -66984 -34318 42156 38741 -10512 -119446 -125627 -54604 -48802 -115448 -111529
27948 -111529 -63265 -60047 -93816 -107934 -90357 -56029 -79669 -77500 6614 61125 62311 38766
27936 38766 24016 -8498 5659 32286 3010 -1697 -65338 -78968 -60565 -37505 -2865 32789
27924 32789 -42079 -36402 72177 136470 121644 56492 43422 19554 8482 -3612 20007 6797
27912 6797 2510 18842 58118 85241 90657 9336 -50429 36900 65459 107842 60666 -44036
27900 -44036 -87770 -48195 -70634 -26414 48474 66683 41849 7595 54501 61612 13381 15674
27888 15674 22626 16360 26977 -4650 -19761 35063 87116 144586 143438 137330 57752 34663
27876 34663 88579 39753 -1827 -46744 -52794 -44747 -29313 850 -13603 21690 65943 -17210
27864 -17210 -36542 -24585 -4408 30253 455 -16239 11700 91684 97052 22094 13783 93180
27852 93180 83395 101522 108467 57484 58002 35496 3832 -55586 -69491 -96970 -115992 -124331 -67016
27839 -67016 -694 29857 30929 -43230 -78930 -7182 -46351 4088 47309 19348 8229 15710
27827 15710 49260 95834 24644 -72371 -50374 -17252 -56907 -77630 -12005 82205 99123 71025
27815 71025 56985 64090 11212 14840 20203 3515 25979 -24461 -59843 -13509 52091 57482
27803 57482 56946 41274 1207 -26576 -40025 -11305 6727 78078 65658 -8469 -49168 581
27791 581 8764 -31576 -21773 15497 13579 -6409 -37553 17358 23081 27321 21258 41222 2819
27778 2819 -59031 -31316 -53958 -139976 -98659 -39399 43722 40335 25501 18095 6956 22303
27766 22303 85985 54957 73424 141198 139102 99779 83635 80776 44016 -2314 4686 -4983
27754 -4983 -14000 -19321 -25626 -68882 -63199 -48807 -21495 6007 -85969 -64442 -25134 -61013 -42815
27741 -42815 10371 35473 -9093 -43087 -12340 43800 88379 56647 34200 -16143 65589 124798
27729 124798 87078 28622 -71486 -62112 -8895 43537 3383 -5367 -27877 -15125 -28203 -47787
27717 -47787 -55189 -54865 -48777 -70461 -63255 23789 -40557 -76661 -50866 -35509 -95579 -178111 -95032
27704 -95032 52955 35054 2454 9850 87068 60261 44397 4051 -49560 -65466 -7086 -40758
27692 -40758 -3580 20707 -11477 -21636 -28044 -43169 -11762 13233 -14842 -29627 -20531 -15253
27680 -15253 -14908 47387 67854 59903 25959 55213 54666 50607 50670 42700 -5733 -41005 -6708 -18399
27666 -18399 -55958 -30216 13755 4795 18908 87208 100642 90976 42259 20600 43975 136155
27654 136155 121114 68007 71161 44985 -11880 -61154 -145372 -135042 217 642 30104 -34357
27642 -34357 -98035 -37955 4380 -34369 -33269 -21316 8691 23658 1235 -17497 -12175 -15508
27630 -15508 15932 -13648 -53379 -95024 -74863 -19575 -55223 -61450 -3966 -9726 -38193 7641
27618 7641 55736 12211 -59826 -28803 -45515 -10494 38167 4738 -29353 -53264 -12134 4700
27606 4700 40026 50004 98892 53661 37056 10076 -23280 -51522 -48389 -74110 -23233 -69232
27594 -69232 -85923 -37718 -111849 -83384 -65159 -76010 -75608 -72553 -64053 -17293 2131 -17204
27582 -17204 -29172 -9831 26206 -26442 -129088 -122476 -58069 -71682 -168254 -176832 -135465 -95638
27570 -95638 -100045 -107614 -94291 -90122 -121402 -71983 -31121 -33514 50511 67537 27861 21642 38548
27557 38548 46288 65971 30752 49102 46575 17649 40989 51123 80454 112134 89389 19967
27545 19967 -20503 -9049 -82817 -52583 84275 108733 40272 -31126 -80927 -92736 -74760
27534 -74760 -56816 -48062 -31428 -61156 -99828 -138136 -62341 10866 -78814 -31559 -15815 31429
27522 31429 25097 50461 62456 30356 -16679 -59767 -48269 -22032 72608 77231 17029 -22213
27510 -22213 -64 16342 70625 540 -20939 4723 -2718 5758 38215 -16614 -34740 -18412
27498 -18412 -5933 -5635 60135 78195 92434 85819 -13449 -71166 -15210 487 10945 23814
27486 23814 2833 19624 14757 64951 67814 53388 51425 15946 -21449 -23917 -31276 -63052 -101045
27473 -101045 -113670 -102136 -103321 -87635 -73312 -23688 -26322 -42104 -47150 -14656 -19924 -30378
27461 -30378 8863 4524 -52013 -58994 -22487 2936 43758 43771 2325 9339 66301 73296 37842
27448 37842 35082 18439 4207 28648 -13946 -101716 -95111 11206 -24011 -54203 5813 13060
27436 13060 94325 138909 124813 78682 73284 77935 157540 164641 138837 113638 91973 25102
27424 25102 -19204 13441 -199 31854 82395 138690 107598 33123 29286 113667 142552 166655
27412 166655 102701 2351 -16267 73057 42378 -45777 -53175 -5632 -14432 28631 54512 26176
27400 26176 69044 86105 12239 -20799 46617 28653 -39196 -16741 -36890 -48895 -27613 1888
27388 1888 9230 -9543 -14808 28797 5040 -4394 -9563 21706 -12776 -46547 -27422 -61252 -65906
27375 -65906 -80319 -63616 32353 125568 147893 60376 -45853 -27217 15793 68310 113716
27364 113716 130008 87988 -8693 -63259 -58086 -54972 -8878 27547 26579 -8521 -17208 -7725 36405
27351 36405 59801 42884 35095 33140 76117 77801 10202 -10989 48013 120959 31322 -47407
27339 -47407 -32851 10676 15123 24937 -15774 -4176 15583 34497 -58162 -109808 -113446 -100655
27327 -100655 -10068 106412 110742 106874 79159 -21676 -68184 -46430 -14922 11756 -1256
27316 -1256 -25315 -101296 -142614 -75520 -57855 -90816 -158257 -187091 -139185 -134947 -117064 -72581
27304 -72581 -63519 -62925 -40061 10141 14792 28330 12446 17324 96705 112788 84499 -26048
27292 -26048 -3257 -11186 -37413 -18600 -53956 -64598 -38410 -31563 -13669 -10785 16034 8260
27280 8260 51769 66953 18764 49985 39257 26656 91992 72229 -1516 -5611 -9558 1112
27268 1112 39087 38936 50564 105607 93793 -9882 -84986 -76062 732 91525 68537 59360
27256 59360 87024 97181 70678 15045 44276 63011 96414 153327 179986 168558 155223 169989
27244 169989 120171 49943 -38891 -85842 -77906 -74922 -77793 -72453 -551 63272 30775 -4861
27232 -4861 2427 32179 -6639 -79935 -99415 -59686 -41669 -86756 -116710 -97546 -38285 -51824
27220 -51824 -88173 -78455 -76572 -26791 -76298 -17182 66489 113692 84966 51790 83017 38674
27208 38674 66956 40053 12524 -6085 10594 63366 30839 25401 -8009 -60487 4973 32562
27196 32562 -5079 -1544 9564 14538 4850 30903 28253 76789 108022 155236 80919 -12646
27184 -12646 -30452 -38395 -24331 -35756 -47377 7502 44856 14285 -2279 -3594 30555 77597
27172 77597 52135 72438 15260 -30280 -63546 -62901 -4074 69147 82900 43096 37019 17542
27160 17542 9809 -50418 -36781 27060 29937 -34094 -61957 -27412 18904 -6618 -35778 5994
27148 5994 22684 5153 -797 -861 -89196 -96237 -88329 -89643 -50200 9621 55684 87685 40303
27135 40303 -13197 -12385 35873 78469 14181 -6412 47003 89489 64924 -3813 -52002 -999
27123 -999 4429 18978 56768 72389 11828 44784 45048 42954 37657 26617 -13323 4895 23817
27110 23817 41701 18878 -9398 -4713 27133 -12947 -30863 -38189 -28996 43942 118448 105751
27098 105751 54131 31723 40043 51403 23398 -41604 17924 96150 150358 98347 -4324
27087 -4324 -36923 -89775 -52105 20763 -40510 -67611 39077 66840 29748 36352 25508 78535
27075 78535 66949 -4449 726 44151 57458 -11231 -38197 -12332 -683 -57355 -112498 -124670
27063 -124670 -60284 -28672 -52856 -94428 -51570 423 79847 57447 40182 89110 132720
27052 132720 52263 28100 48348 85444 96831 56431 87601 90291 20164 22071 48618 -2401
27040 -2401 -27481 -20334 -27895 -7053 68030 75729 68180 7543 49678 72007 -23908 -6357 24752
27027 24752 15917 -56737 -61958 10758 18448 18508 -20035 -1511 38803 70072 47160 -49770 -32022
27014 -32022 1651 49411 87425 75588 -22213 -57045 -74929 -63080 -3061 41607 108570 24623
27002 24623 -50336 -72295 -74909 -36659 -3469 -15741 -1842 78595 102367 83173 5957 4246
26990 4246 61411 -4745 -22442 30708 73738 54783 71020 113126 -15549 -56671 4216 3266
26978 3266 -9546 5201 1339 64941 146184 130996 75916 -25314 -104968 -106320 -114371 11726
26966 11726 81918 90896 74986 93530 111523 66289 79201 37682 -15999 -6627 25383 -20775
26954 -20775 -81749 -46029 -63429 -42796 -33496 -8741 15139 37374 37658 55057 -9504 -58127
26942 -58127 -21529 26655 37109 58271 -9173 33815 40531 2235 -5749 -24458 -7112 -15868
26930 -15868 -31927 -80145 -99370 -38052 -27670 -14934 -11660 8662 -17348 -77863 -117771 -59131
26918 -59131 -17095 -6936 -41533 -45601 -80999 -104764 -35235 -47974 -96968 -15873 -6197 3722
26906 3722 -3684 -10912 -18756 44652 81391 32971 -1652 -66319 -118842 -130737 -89348 -17763
26894 -17763 -37375 -25838 -55463 -41960 25309 73606 62905 -18930 -31994 11453 106144 56858
26882 56858 16266 929 -18548 -69153 -71598 -38362 -90991 -128623 -57438 -11634 -50932 -46426
26870 -46426 -38101 -17281 8313 22577 46722 -24091 -73945 -104300 -59646 -29719 18266 83108
26858 83108 137996 88738 75041 64617 32563 58902 76440 72356 43837 -28500 -33782 -36614
26846 -36614 -88295 -66127 -36933 35140 24126 -67356 -61875 -27323 -11926 16104 60194 18635
26834 18635 -61230 -28349 -27611 -21097 -54701 -10987 24292 39400 44263 74574 76748 18653 -69760
26821 -69760 -32648 -55931 -84304 -24442 72960 43437 39580 13889 -106448 -91091 -30062 34698
26809 34698 142810 111409 58095 17312 39505 19561 -27663 -74195 -71972 -76354 -68757 -53681
26797 -53681 -73892 -69664 -17708 -9573 5836 57854 56554 -25339 -33079 -14609 20988 46535
26785 46535 93702 125600 44231 33621 35405 5420 3741 -9427 9609 30764 -7198 -85182
26773 -85182 -124415 -88941 -20029 23437 53261 21575 -5403 -53367 -19565 18128 -16037 1759
26761 1759 -47232 -66692 -66532 13151 -7712 12656 56691 36669 9333 35402 72672 75254
26749 75254 -1284 -16177 10084 -7938 19373 38063 73314 29909 29019 -17208 -17161 -52583 -91739
26736 -91739 -71490 -110297 -80268 81986 110747 12684 -16931 -16171 -3041 25373 58098 42102
26724 42102 -62918 -50145 -14855 -67690 -77144 -61041 -5721 -17910 54254 103230 80700 64172
26712 64172 50408 6189 -7919 37677 66307 68500 81285 86670 62963 20095 19202 48668
26700 48668 92754 103257 86739 49234 47788 51908 50437 37998 19986 101675 162596 66418
26688 66418 4765 -29 2423 -9983 87923 78678 53416 16137 -34801 -4642 -19990 -20946 60722
26675 60722 102627 113234 42763 -9987 36471 38602 12982 28752 11560 7895 13182 71988
26663 71988 30725 52472 35820 79703 75162 23993 5177 -17400 17876 54638 46082 44750
26651 44750 -17866 -108572 -56122 -6319 -52372 -66124 14244 94512 93113 69510 128810 85168
26639 85168 139297 160443 110936 59281 28768 -14969 -22613 -67518 -67545 -58425 -29560 -75309 -46141
26626 -46141 -13619 15915 -9994 -20440 -36637 -10202 7120 -7084 -7169 -17112 28053 42139
26614 42139 77005 121280 151081 93050 24631 27984 48813 91437 90642 67414 -8093 -59897
26602 -59897 -5887 -7512 32283 56690 97199 110523 129637 145334 74333 -54917 -122118 -32225
26590 -32225 -91143 -104054 -22317 19011 -1207 17508 55909 86826 31079 -17979 46692 49637
26578 49637 25025 26653 4922 -19817 -94084 -82308 -43438 -711 10688 -16501 -43537 16126
26566 16126 17562 -46070 -92055 -43820 6410 3425 -34490 2319 -10358 -5064 49365 79778
26554 79778 87438 62202 45101 15365 -62872 -85000 -91089 23435 42183 -31670 -72529 -72069
26542 -72069 -19555 -60919 -109629 -66951 -35166 -56866 -89555 -44914 24084 67639 51181 21710
26530 21710 9224 6781 -44399 -56098 -65130 -35015 24965 36555 14144 32945 -12051 -70072
26518 -70072 -66049 -26430 -13518 -6091 -16169 -33745 -59040 -108063 -106413 -41486 -3310 -11013
26506 -11013 -5332 6721 -60139 -109203 -118156 -124897 -78078 -51733 -22196 18884 6983 36785
26494 36785 34618 -3426 -11892 -14881 -11121 -66292 -57598 -56089 17411 78539 83603 95440 72554
26481 72554 99137 115237 102072 74412 38290 12592 38087 60063 96389 72247 73137 55551
26469 55551 35722 31675 83380 138831 149633 50062 22913 34619 66265 28223 -1285 -11315
26457 -11315 2726 29694 41316 109043 127030 142479 20841 -67212 -99375 -83891 -36712
26446 -36712 -28610 -1895 85306 98709 64812 48454 -3602 -46788 -73117 -62011 -46868 -42206
26434 -42206 -132534 -96667 -16423 -1753 50224 9132 -106251 -83330 -43686 22323 -39033
26423 -39033 -54111 -38789 -12616 -23489 -68382 -60060 -11663 42016 67201 70107 91671 67585
26411 67585 -12474 -29111 4941 63624 99333 46709 7338 42235 109741 143249 164589 117966
26399 117966 148307 130608 117423 134472 149058 149592 104256 72203 83378 62752 104190 98725
26387 98725 16876 -14034 -18310 -18692 -40063 22182 60764 60346 -27521 -22874 26358 -31199 -94324
26374 -94324 -105704 -101670 -30348 30765 -15076 -92012 -94376 -75494 -52445 -9218 14542 -14552
26362 -14552 -33239 -61356 -74545 -56793 -91262 -69950 -53217 -28356 -32703 -91348 -83344 -63702
26350 -63702 -37913 -9013 -27012 -64724 -75104 -52858 -59236 -53378 76139 83547 27529 -56236
26338 -56236 -79306 -63845 -93496 -66706 -64429 -108188 -57833 -37804 -58250 3876 -23051 -10430
26326 -10430 -79997 -47803 43029 92917 62083 52006 139839 166052 132365 97460 111061 82402
26314 82402 35880 8080 12751 -6406 -23883 -19611 -2612 17668 23516 10850 50869 52081
26302 52081 22383 -35748 -13304 -46247 -73554 -28683 -29008 7453 37942 46288 17851 22510
26290 22510 32045 2872 60685 46793 29307 84193 86982 73233 81659 25566 -17433 -33499
26278 -33499 -51229 -44570 -425 26051 37001 8052 -14845 -5623 -29187 -60627 -42557 -28133
26266 -28133 774 -15567 -38439 -3135 20133 5230 39579 54409 -41217 -44391 32810 91580
26254 91580 65075 110682 113433 100048 101996 95906 113004 105207 67305 -10908 -21610 447
26242 447 -15951 -10584 -54684 -80566 -68719 -56864 -72443 -12419 -27661 -2852 -34236 -48397
26230 -48397 22618 110450 99448 28320 51086 57804 90371 109180 91090 46385 196 -40956
26218 -40956 -60555 -55116 -78384 -114176 -85453 -39492 33750 98265 82461 101214 63499 -3275
26206 -3275 -16048 1443 82130 28648 -16068 -80021 -69737 -6346 4091 -30821 -42878 -57610
26194 -57610 -15596 96079 54522 -21837 -63224 -34043 -7744 -50353 -8458 -3625 -46664 -92190
26182 -92190 -73183 -40574 -17613 49468 17325 -5453 -20400 -20567 26807 -22635 -46197 -30735
26170 -30735 10863 57827 79930 49093 -14360 -41629 -74108 -112687 -103558 -46949 27512 50515
26158 50515 -11278 -10976 -21026 -77774 -64962 -29628 -37089 -82534 -54764 -84975 -74564 -17209
26146 -17209 -17760 5367 -23581 -3111 -3291 -4752 -41087 -67497 -66668 -73136 -85072 -121216 -22009
26133 -22009 52180 59208 98009 101002 140470 121018 50900 7480 -24320 -33860 20903 54766
26121 54766 44723 55869 77105 34347 67591 32485 22192 8455 15299 1714 -1191 15650
26109 15650 -65206 -114625 -121182 -168253 -108846 7207 871 -31912 -27733 18125 76285 43434
26097 43434 -37072 -11843 50942 69984 45477 41950 2936 -24598 -29693 10156 91276 30620
26085 30620 -15463 9253 -17091 -50804 -65665 -50738 -97644 -81003 -62765 -52757 -78093 -85516
26073 -85516 -62893 -71170 -21922 -29425 -46179 7639 12694 2113 22940 15867 -16417 -60484
26061 -60484 -86830 -35625 46611 18345 23904 -15512 -101418 -153006 -163388 -62405 -21175 42796
26049 42796 37273 -44353 -32969 -48365 -13272 832 20490 -69646 -63302 -17904 -21627 -500
26037 -500 -56422 -114140 -150212 -37736 24163 -32500 -48634 4800 4797 25500 20311 -25228 -107557
26024 -107557 -128948 -59555 -66703 -94672 -68561 22654 81044 30976 -16057 16391 62971 -36704
26012 -36704 -37652 47669 94246 32123 -14844 -72209 -24458 33205 66820 49804 29776 50281
26000 50281 -54172 -61350 -20987 -7854 6880 -24384 -20726 -8017 -5392 -46852 -28350 -32761
25988 -32761 -7938 -7526 16181 -54460 -43871 -58268 -50167 -40552 -19622 -2725 41191 28367
25976 28367 25683 36517 65452 46952 20308 -30551 -12088 -21268 -10950 24735 116869 70969
25964 70969 86692 104334 93891 -12493 -141646 -162341 -66094 -48539 -63720 -41199 37359
25953 37359 90034 47425 69860 75779 58297 11971 -64983 -86795 -81902 -90715 -35417 -49947
25941 -49947 -25835 -21662 -15763 67430 68824 83892 71696 57 -12511 66662 112763 94561
25929 94561 99054 29063 -13270 -73511 -110973 -67878 -36164 15316 -92746 -76980 -68041 -56798
25917 -56798 -5580 -21377 -51505 -37026 -39767 -35447 32977 -7702 12023 46663 45929 41043 -6261
25904 -6261 -30302 -86267 -81720 -58647 -8199 36453 -3131 24535 42394 12175 17304 2926
25892 2926 39073 40568 -47821 -108590 -91325 -53610 -82843 -83498 -25808 60953 144790 172899
25880 172899 154149 36508 17330 67964 28273 33505 75932 58720 41752 98787 106492 36909
25868 36909 -7766 -145582 -146646 -134897 -85142 -62979 -57606 -62745 -21566 29997 19435 58387
25856 58387 75070 35273 -18099 -9335 -73286 -62625 -9151 -75849 -100818 -73927 -59086 -56893
25844 -56893 -72702 -56411 -36748 26524 5226 -83365 -125782 -90545 -74162 -118869 -48795 13690
25832 13690 -13776 1302 19560 51767 39600 19058 39765 45683 -20710 -69803 -59698 -94894
25820 -94894 -79906 -10918 46882 61523 73607 102396 57693 27980 16058 -35704 -71217 -57193
25808 -57193 -12236 19686 46653 65453 30025 26733 2720 -14093 4246 -16611 -29603 8999
25796 8999 83552 64154 2520 -37652 -29338 2649 17424 -33596 -19563 -13251 -95059 -83458
25784 -83458 -45691 -10004 -38681 -94074 -121783 -79074 6947 22799 -35786 -49899 -29360 -40360
25772 -40360 -35116 -47841 -46498 -43906 -7595 16350 10665 15479 -24447 -6147 -24438 -18710 44991
25759 44991 35575 54771 41702 10788 -25948 -64181 -67305 -99272 -76292 -33648 42819 42701
25747 42701 21751 121180 151351 125231 88103 60433 87111 147509 90268 50628 -483 -33755
25735 -33755 -66886 -60679 -43724 -47728 -47818 -77049 -128251 -117107 -127889 -118285 -72037 -20431 -37081
25722 -37081 -10151 -19611 -27802 -44034 -36519 -3353 -78169 -57077 -18372 44161 76905 105873
25710 105873 136147 127737 89284 39299 1021 1959 68302 88520 63707 41274 -10012 -9933 33354
25697 33354 -685 7867 37865 39959 -3881 -29570 -71011 -74847 -44108 -57998 -35002 16916
25685 16916 26217 35786 -15770 24204 31311 16644 -49666 -12628 18198 19798 1091 -21531
25673 -21531 3035 -855 -38296 -349 -6262 7622 41592 43143 42548 63011 113718 114741 36724
25660 36724 -3939 11255 -34409 -62663 -53524 -5483 668 -16048 12119 52325 86396 50745
25648 50745 48441 14030 -19567 -13450 -10188 7124 -35493 -93040 -81967 9370 -15923 -10181
25636 -10181 -9803 -13816 -20799 3638 3979 -71218 -100727 -68392 -31836 -35546 -62939 -94540 -118083
25623 -118083 -125350 -115023 -93135 -90947 -37339 -6062 -35215 29606 64370 55126 15784 -2109
25611 -2109 -34787 5862 65808 74962 40959 -50465 -76622 -79742 -76589 -18316 -30916 -89068
25599 -89068 -113237 -7488 35082 12895 44811 2414 -51060 -41362 -20216 9300 96362 88857
25587 88857 75896 60764 78072 44146 25010 30085 -7824 -62310 -49538 -21095 4568 -52365
25575 -52365 -38078 21224 54019 50162 28517 14006 19698 30176 -771 -36712 -42814 -13489
25563 -13489 -32343 17192 -6020 24709 74227 58478 13870 46284 48943 51439 -27990 -29186
25551 -29186 72490 56565 29050 89590 109849 39230 53017 46398 -9403 -45254 -66339 -94365
25539 -94365 645 60833 74255 81668 81610 60637 -2007 -16567 69286 81289 -48386 -46335
25527 -46335 33528 102962 -27185 -72329 31621 102768 123249 139115 135113 114421 89159
25516 89159 28247 64050 87323 129881 100634 -1134 -34367 27498 38531 -62548 -82990
25505 -82990 -53182 6724 65058 10986 -44709 -85057 -66379 1382 8425 9987 -45312 -38073
25493 -38073 -8722 -26732 -44008 -69206 -79058 -41861 -33232 -116028 -191930 -143226 -105234 -15141
25481 -15141 19783 -19763 -65125 -52092 -33155 26558 55679 50867 24722 -14134 -23880 42594
25469 42594 34533 11654 19227 37708 89590 74256 38936 -49429 -57281 61522 105217 107833
25457 107833 83231 69775 -13642 -39811 -29410 -59864 -41092 46567 52938 81496 98208 26192
25445 26192 -6624 -21489 -40512 -43813 -33560 -32513 17605 32179 81124 37363 -25261 23835
25433 23835 147937 112295 70347 27859 -28703 -78797 -139566 -80884 -12582 5852 -957 -48015
25421 -48015 -45294 -38931 -56311 -13557 30879 52495 53344 59433 -6300 -109154 -194497 -207735
25409 -207735 -161459 -81990 -58234 -111411 -84710 -56238 -97633 -58220 -50485 -43192 -65228 -33257
25397 -33257 37246 83997 73164 11181 -20833 -29435 -18199 10669 -2147 21217 18002 -33814
25385 -33814 -77493 -56035 20045 7586 58584 81420 26543 -3902 -26231 -35231 -24259 -4310
25373 -4310 -74679 -85896 -46521 -6321 43845 64446 35491 5314 -18416 -16490 -41855 -83303
25361 -83303 -69690 -20947 15164 -20324 -68381 -32903 64393 43116 -34002 -110776 -23949 41309
25349 41309 -1216 -15629 -45438 -26354 -17467 -1273 36102 105311 68012 54416 22021 -34455
25337 -34455 -34424 -15730 -30429 -9801 79130 108359 63767 -16443 -35735 -44063 -62790 -23477
25325 -23477 1116 -41110 -6323 29034 24581 76319 55433 49218 53777 105250 66909 11379
25313 11379 -10088 -34068 17378 15608 -53081 -67976 -20854 40132 50342 -11113 -21099 -21389
25301 -21389 11135 3671 -43127 9672 -47268 -90737 -90339 -49986 -60570 -108086 -78639 -29254
25289 -29254 -14753 -4394 -20711 -27164 5059 15256 -1199 -20262 -789 14921 -5272 -17731
25277 -17731 45803 28198 -11298 -64419 -84540 -103004 -122209 -78663 -50673 -34616 -41875 -3602
25265 -3602 -34053 -36920 -1244 30374 31256 30948 37350 21405 17470 -20341 -46937 -86328 -122742
25252 -122742 -46487 -36387 -97959 -117790 -151392 -82943 -35508 -59970 -63813 -71433 -101889 -104508
25240 -104508 -51037 -36287 -96711 -53912 -29845 -27896 -19987 -3213 -35773 -57528 -60157 -76405
25228 -76405 -37905 -7617 -10438 -4253 76550 87676 62219 32365 -18303 -87638 -105735 -73726
25216 -73726 -35705 -90333 -61750 -4769 89294 50471 -2796 -4646 26345 -21919 -21921 39312 85962
25203 85962 76506 59059 83988 143100 157600 136152 127621 95540 114147 118673 82667 42282
25191 42282 61704 62430 46355 52980 42472 92202 14286 -9120 27825 -3481 -27304 27298
25179 27298 -20581 -41515 -57852 -138227 -143321 -116553 -106297 -59766 11383 9251 55681 65592
25167 65592 54212 -78924 -115872 -8529 38114 -3782 8299 9349 -28392 -30428 -51693 -57863
25155 -57863 44389 10780 -26122 20392 38939 48067 80805 42906 -38866 14041 116165
25144 116165 137512 76656 -31263 -124991 -119222 -18765 27888 54696 61687 48989 54911 20865
25132 20865 -32673 -43013 40115 86122 81896 82467 112291 84962 22782 -7345 -23145 -1990
25120 -1990 24041 34452 8453 21305 90532 31543 -27330 -7840 9222 3712 -23953 23435
25108 23435 48008 -8858 -2554 7337 21719 -33565 24688 6844 -43373 -49997 -39212 -34671
25096 -34671 -39530 -42164 -114970 -120336 -114025 -37676 28542 63356 63208 60025 54248 31524 94367
25083 94367 151247 136019 107309 75337 74883 19825 -74442 -48456 4403 60134 67485 -26885
25071 -26885 -94667 -136888 -95630 -34506 8644 -40881 -116078 -157428 -133196 -115906 -105410 -72187
25059 -72187 -101645 -89267 20115 52153 2427 -43162 -57992 -75528 -80403 -41131 -46055 -28204
25047 -28204 -12356 -58135 -18989 11660 -20433 -26984 -72324 32636 105749 36295 11605 44553
25035 44553 14927 -7931 4923 22177 11313 -17115 -53027 -25256 -41586 -47936 19894 101618
25023 101618 95769 59922 22996 12842 -25996 -53795 -87566 -98693 -124306 -113048 -114792 -106276
25011 -106276 -113596 -61500 2791 38938 17964 -37124 -55927 -23472 -65350 -94688 -90309 -17250
24999 -17250 -15020 -25194 11244 26843 35462 46434 75289 88847 65426 -6627 -70864 -93564
24987 -93564 -89795 -10517 55914 92955 52630 -33034 -65773 -101725 -110374 -73385 -5218 21632
24975 21632 -29111 -64394 -60073 -81021 -80972 -57546 -9264 16223 23416 40321 48578 36249 76817
24962 76817 90669 101036 68678 23726 -32706 -22898 -53938 -46082 -42517 -15899 6031 635
24950 635 5782 52293 25176 -48515 -8968 40065 93710 72675 60805 -18426 -42527 -10084
24938 -10084 -47340 -72754 -140340 -79416 -108131 -104397 -82669 -110961 -97008 -115691 -114782 -76475
24926 -76475 -22583 24224 15321 -12797 42932 52340 40607 82026 81986 44924 -5663 -8711 10619
24913 10619 12965 5259 46853 49994 -16840 -89022 -81505 -99471 -114353 -97320 -113070 -24089
24901 -24089 5829 33299 78028 23177 -71378 -60500 21918 15121 -6987 34889 70215 93357
24889 93357 35464 -51167 -110394 -46731 -13590 -55639 -59169 3008 59920 109835 114893 152403
24877 152403 158068 141159 59766 22611 5810 -4382 -16203 -24000 -76548 -53134 -72595 -66901
24865 -66901 -45250 -49667 -41444 -63003 -127833 -112968 -97469 -49537 -28774 -36390 -73307 -117816
24853 -117816 -92126 -44865 -5372 -34502 -50725 -57319 -14596 -6119 -59280 -55687 -72917 -83549
24841 -83549 -64828 -21232 -51499 -118729 -114874 -32709 35394 18549 5141 31791 -18113 -6276
24829 -6276 251 -30287 -1682 48166 37324 -2701 -25545 -74102 -68245 -36163 -37437 -24454
24817 -24454 -28165 8978 -39771 -82798 -45246 -16781 -10383 -23795 -29333 -57514 -75455 -11526
24805 -11526 61695 67043 37500 9491 3335 39723 171086 178769 118645 8744 -29670 -63167
24793 -63167 -41822 -36135 -49022 -89315 -120819 -113887 -111788 -177966 -173363 -95500 -34125 2613
24781 2613 14941 40391 56170 61212 -3144 -57617 1754 20746 -38029 -56622 10836 14301
24769 14301 2689 59332 70088 74371 44421 54462 75120 45940 35589 40829 15995 847
24757 847 -36526 -78256 5681 59334 22519 -6508 -77589 -59885 -31436 2296 9748 -7364
24745 -7364 -71179 -73128 -72143 -32258 -56515 -95279 -77305 -97379 -139193 -139089 -110791 -61896 -26444
24732 -26444 -8981 -16381 20179 28742 95646 67904 54340 95179 69056 -5064 -26720 -89757
24720 -89757 -144408 -93653 -25660 -61708 -103471 -90322 -86328 -47004 -23881 -43616 -63655 -26436
24708 -26436 4510 64270 69891 22563 12433 5971 13676 18986 -10472 -20827 -26183 -32682 -18926
24695 -18926 -13512 -35207 -22756 -56361 -46330 -12698 16097 31221 49452 54395 -3840 -84746
24683 -84746 20647 121659 101934 125268 105586 102323 93908 34610 53289 28366 -27381 -41294
24671 -41294 -52153 -55642 -60112 -82596 -37037 9131 -45714 -118124 -174376 -118231 -35662 -16162
24659 -16162 -72919 -73153 -86271 -27242 -10045 -19552 -24673 -102274 -111478 -99570 -102073 -99062 -46338
24646 -46338 -8671 5067 -7237 -6035 -19971 -85335 -71767 -58306 -133995 -90907 -59591 -72927
24634 -72927 -71082 -80196 -47700 -91962 -124970 -50692 -13301 34120 112956 24084 -10302 19302
24622 19302 7277 5665 14831 45845 55587 78736 26082 -14599 31532 51492 73063 89513
24610 89513 64466 65563 73462 69825 49998 58619 65207 74427 19317 26719 79197 65733 80450
24597 80450 121280 119710 2693 -112347 -62617 -25416 -78494 -31758 40395 7902 -31593
24586 -31593 -45457 -39140 10768 -2425 -73884 -63672 -84494 -76412 -44950 -64303 -85685 -7661
24574 -7661 14723 -30064 -102140 -67277 32509 15144 -58138 -35336 -20711 -12012 -1457 -25247
24562 -25247 -6686 -46554 -72576 -72102 -69677 -77151 -65214 -42837 -32097 4414 63459 22320
24550 22320 -19503 -33394 -2989 24651 64483 82633 53518 6524 47072 79049 55043 41871
24538 41871 -31524 -78853 -105390 -88296 -26691 21355 18298 1924 23468 45881 -24631 -94720
24526 -94720 -47322 -18101 -48580 -128526 -85860 34710 60394 31506 -23268 -17324 -77973 -82207
24514 -82207 -95575 -43023 -32084 3667 -43752 -57325 9833 23291 71938 27228 -50888 -59121
24502 -59121 -15823 11034 57608 116109 131931 12737 9885 6110 20472 16313 -42650 -51352
24490 -51352 -24847 -19452 -40434 -91450 -31949 -26549 -23598 -22607 -19883 -43905 -64543 54703 65162
24477 65162 -18680 -23805 -43752 -18932 -769 -18935 36810 -22328 -69516 32334 64700 4865
24465 4865 -19303 -48492 -48010 30797 19959 2808 -31581 -4863 -23052 -92601 -41828 -42387 32706
24452 32706 84896 39158 45589 766 35204 33402 -16859 -74795 -83214 -61864 -61699 -28713 -28758
24439 -28758 -31014 -26372 -11950 -72677 -82581 -65329 -55605 -28360 2019 125608 104893 41173
24427 41173 70240 47543 -53206 -32137 -11294 -13988 61352 -1245 -23610 -27392 -48321 -5011
24415 -5011 586 -16904 -57361 -115978 -177289 -138909 -80205 -56381 -47867 -14872 -9295 -18612 38048
24402 38048 72080 43485 -5243 -4080 -18006 31533 53963 -21923 -101320 -103144 -80627 -20415
24390 -20415 -56933 -49793 18035 -22999 -27184 -49550 -106939 -124115 -86092 -26590 61451 59847
24378 59847 21522 -12994 -55692 -46863 -22007 3355 11898 76077 67753 39088 30751 67186
24366 67186 59840 47311 9726 8699 -9742 -14365 -2708 35985 47898 29852 -16631 -13320
24354 -13320 3841 -49722 -34638 -1911 -36778 7121 31358 17024 -4955 -49301 11609 -3061
24342 -3061 -13804 -45923 -14125 21096 48597 41198 2051 39222 52695 15555 15737 21811 -58976
24329 -58976 -102917 -66302 -3278 59752 49500 33873 -4709 4337 -3940 7365 -34498 -87946
24317 -87946 -80840 -98942 -109383 -47145 -15601 -4062 -23098 -83727 -33506 24036 -18284 -9661
24305 -9661 49605 80459 -13863 -98134 -106310 -97706 -74087 -100338 -150843 -142526 -108491 -78762
24293 -78762 -110171 -73414 -54464 -22689 41151 97673 66592 63759 62943 38791 90040 88930
24281 88930 83571 29606 31413 -19101 -47260 -69195 -94776 -144912 -79965 9468 67400 64518
24269 64518 15188 -46617 37599 53735 -53326 -61121 -35363 -18394 34301 6313 -71936 -110577
24257 -110577 -152020 -69718 41512 88551 52542 -16754 -40726 3095 -5103 -62627 -30552
24246 -30552 -39554 -27330 -17222 -28554 -49777 -59088 -81152 -86490 -70933 -159695 -172595 -120663
24234 -120663 -91925 -96163 -69698 10932 27363 -5223 -19449 -76653 -103065 -120409 -82608 -27442
24222 -27442 18471 27774 43340 71283 39662 45887 -28416 -54319 -47992 34135 31962 -1456
24210 -1456 42116 67652 38487 29568 28176 16213 -74860 -74858 -30059 -114892 -103341 -101174 -94742
24197 -94742 -65276 11708 -406 -54889 -46057 -44489 -10476 57030 68038 78516 97621 122352
24185 122352 52008 29188 42668 67310 9938 -3817 11175 9373 57204 61162 -10425 -27414
24173 -27414 -23633 -28792 -34880 -54709 -9811 27508 775 1293 4848 -14829 -43956 -72761 -24452
24160 -24452 17736 95459 61417 4033 -50809 -84694 -85650 -78128 -28703 31242 22573 58955
24148 58955 67262 65547 6701 -23240 18217 56608 51986 27621 5878 -34120 -42032 -57447
24136 -57447 -80349 -26520 6109 -311 -20460 -13361 -26706 -57118 -14459 43223 22975 66974
24124 66974 80072 45118 -50299 -115238 -103477 -73327 -55687 -58461 -47993 -7294 37693 85007
24112 85007 56021 28153 21242 33528 30983 52108 36111 -24854 -31265 -89716 -155046 -168665
24100 -168665 -142563 -91924 -57173 -82920 -85312 -39378 -32367 -61024 12070 -8676 -4880 37159
24088 37159 94615 110464 94753 60546 9149 48973 74718 4548 -60459 -29790 92634
24077 92634 108614 68268 7195 -8962 13517 26507 33509 -31653 -24926 18961 37055 49830
24065 49830 3504 -14233 39287 75432 91086 31778 -47334 -32171 -327 132309 151260
24054 151260 28356 -48707 -18804 -35598 -84932 -90417 -117849 -49158 16490 73462 49417
24043 49417 47509 56337 43490 53651 51982 80209 38496 -44462 -43619 56863 79696 66930
24031 66930 62671 2376 -22489 -34332 -12822 42467 10196 -44934 -84835 -45317 -36607 -41923
24019 -41923 -30362 11408 29657 40201 55319 45884 11634 -757 -71139 -103385 -68486 -77915
24007 -77915 -109041 -84274 -56029 40947 99128 45179 28299 55892 59948 -13566 -51456 -25482
23995 -25482 31214 78856 33517 22143 95502 91155 61820 51194 75978 49220 32591 48460
23983 48460 32920 66304 80917 35101 8833 18726 49490 78213 38603 14386 -80673 -57773
23971 -57773 57202 57583 29278 54311 -9644 -40938 41954 12838 2067 41668 60918 69925
23959 69925 24103 -66128 -114827 -152882 -133160 -72065 19806 -4828 -40769 -84971 -51641 -20664
23947 -20664 -72937 -81725 -24961 2901 3549 -17730 -27172 -43783 -72046 -96076 -31375 -14227
23935 -14227 -36844 33190 48356 38614 -6447 5073 64723 15601 -76728 -117990 -143227 -102854
23923 -102854 -64433 -69837 -63566 3953 -2469 -30034 -12160 -90803 -63092 -27375 -72251 -48311
23911 -48311 -44777 -50360 -34153 -50715 -16491 -6897 -76020 -112170 -88744 -35619 -26289 -56924
23899 -56924 -72419 -68991 -51194 -22037 -41255 4066 7370 -20342 -45401 -1419 10365 8490
23887 8490 -71860 -59358 1014 6440 -18272 3601 -47525 -111410 -77037 -64440 -39842 18805
23875 18805 56385 67503 83840 66577 -1825 -30342 -33392 11624 49278 67649 29039 -42865
23863 -42865 -54622 -20094 -52590 -68115 -39994 -2250 -4884 1206 -32870 -75967 -79974 -48004
23851 -48004 -11764 -47031 -42534 62934 64393 48642 71248 77742 48453 4482 -1834 74128
23839 74128 82896 28660 56538 85863 43215 1788 595 17205 -33588 -46771 -37081 -10985
23827 -10985 25911 48883 37935 11108 -46959 -49507 -84610 -109051 -136498 -107916 -49855 -18686
23815 -18686 -31419 21324 -39661 -23303 -1117 44611 14166 40025 62162 153222 106213 7719
23803 7719 1035 -39518 -31356 -25344 -25038 -8658 -55181 -44214 -33828 -71375 -81201 -60649 -91771
23790 -91771 -129001 -69487 -30214 -22248 -39953 -87981 -76966 -58279 -61569 -26750 -5917 -19254
23778 -19254 -6531 6718 -12130 934 37846 10516 23390 61493 18059 -39530 -59626 -10132
23766 -10132 29523 73057 48144 72739 56294 63820 45311 -1045 -4123 6003 15691 -2253
23754 -2253 25996 10042 -46685 -20561 -15492 -53225 -102314 -107201 -52608 -61945 -76974 -52692
23742 -52692 -69149 -31162 29279 -11863 -46191 -13991 87603 100525 86358 80864 32533 494
23730 494 30707 22069 20848 62430 47714 -18564 19904 -14347 -49854 -4659 -48307 -60762
23718 -60762 -22796 -42320 -59709 -24047 788 36034 41923 29257 12026 9790 10365 24227
23706 24227 21604 -36380 3531 28872 -9760 -11699 -37135 -18122 19256 53868 -15663 -71390
23694 -71390 -86367 -76418 -42573 32598 20289 -2043 36550 77357 61713 28362 32475 84310
23682 84310 5090 14847 -37582 -82242 -92325 -20052 -15474 -25753 11815 22851 64708 91649
23670 91649 92146 99040 79010 37331 9384 -52924 -56504 -125209 -134577 -131966 -77814 -71529 -71590 -101649
23656 -101649 -71604 -55015 -17397 -17018 -22172 -18351 7001 -74092 -110333 -86139 -85929 14232
23644 14232 -45022 -90696 -80205 -84234 -57804 -66086 -97867 -72058 -23084 24019 79054 7007
23632 7007 -53784 -69293 -42918 37010 42444 -31363 -35954 -18580 -30028 -5238 23005 71134
23620 71134 46317 -29184 -88604 -47615 -15187 -4019 -19096 10187 -34226 -73447 -25272 26364
23608 26364 21381 37813 77659 45795 22187 -69794 -26832 39559 92717 25429 -43378 -109090
23596 -109090 -162516 -95708 -27840 -46657 -9594 20507 71329 62920 12456 -20377 -75933 -123886
23584 -123886 -99132 -66741 -39121 -32601 24928 -13202 -97706 -102076 -33902 14471 2892 -26289
23572 -26289 31158 81013 23663 33395 45321 15147 -17894 -24139 39228 13340 -1540 38727
23560 38727 3127 -67729 -63055 -36277 -38676 -12840 45612 19692 5885 12908 13974 10858 -21588
23547 -21588 -88992 -65037 -48849 -152736 -181932 -141756 -103037 -31276 -30998 -82634 -36048 5469
23535 5469 71856 54704 28271 19852 32593 -7217 -55232 -92294 -106845 -65629 44448 43004
23523 43004 39132 55126 53534 21964 27276 -3027 -22423 -19730 -16562 -12452 64023 59121 8575
23510 8575 8808 65665 8691 -56100 6051 77468 57086 41053 94610 95500 51170 -27774 -22870
23497 -22870 40679 -38463 -88844 -57467 -16403 -8051 39235 33374 46330 58151 37521 -30068
23485 -30068 1185 -5585 -51790 -25519 -10212 -90166 -115323 -10883 27647 23067 25046 27827
23473 27827 -27882 -15833 10657 -43984 -37603 -3250 52001 47617 -26158 -55344 -55012 -26191
23461 -26191 -26391 6361 6599 4932 40509 -19389 -95147 -108592 -34158 -35197 -25361 22789 -9540
23448 -9540 -55676 -6452 -6881 163 -70213 -89156 -65944 -35578 -17406 -5440 -13783 -2053 -10237
23435 -10237 3597 -83225 -107925 -63464 31501 -43295 -104756 -84570 -30649 -568 62409 87791
23423 87791 91859 85685 57119 63615 51337 -25640 -68112 -56925 -38117 7670 16528 -5164
23411 -5164 71784 95248 -20932 -17580 52752 42612 20150 -11191 7612 21893 10510 2833
23399 2833 -30395 -52306 -92615 -100149 -55133 -10968 11042 39034 61206 114952 88266 6271
23387 6271 -13184 -45733 -17904 19274 10975 -70741 -81873 -111322 -180581 -137734 -134381 -140773
23375 -140773 -66806 -109870 -69957 -32708 21725 136569 140709 100130 76231 -30564 -36336
23364 -36336 45815 97594 64477 28992 -4010 -9230 4729 58036 76575 92979 8916 15663
23352 15663 -29023 -29849 -58890 -79797 -104708 -152588 -199654 -180026 -83892 -18159 46147 51295
23340 51295 -20097 858 49746 62305 -12583 -12640 -59130 -94499 -112297 -66907 -25719 -59342
23328 -59342 -70544 -37751 -74137 -94734 -20995 -27427 -67329 -68074 -34163 -37905 -19930 -28857 -39012
23315 -39012 -47294 -90567 -32701 66519 20155 25935 73378 32048 10435 -3734 -12098 -10987
23303 -10987 -15134 -76449 -63955 49503 52863 29975 10941 14340 -37535 -107752 -72974 25479
23291 25479 48964 11841 17965 -13279 -50311 -70282 -119342 -78655 -77942 -101236 -67376 -20575
23279 -20575 -24949 8882 30341 -39345 -64485 -37032 1194 71171 41322 13341 -22654 -23330
23267 -23330 -24616 6393 48681 57729 52102 50166 40520 27678 -44865 -70460 -30907 -55374 -86785
23254 -86785 -44109 30710 49818 59851 113515 133194 75999 -10711 15036 37568 5525 18252
23242 18252 66235 45085 -50977 -101214 -87403 -77440 -77775 -30676 17316 86678 105662 13483
23230 13483 -83940 -118697 -111883 -151511 -189755 -178057 -126195 -67152 -40230 -21129 21617 1499
23218 1499 -19972 -64595 -84019 -104581 -97388 -41683 93855 76968 15252 -15799 -4120 21835
23206 21835 -33320 -6312 101517 45163 -21877 -43031 -23873 28492 67518 90569 56389
23195 56389 -41123 -89888 -111592 -120862 -103135 -95659 -5494 35035 -17917 -112511 -111547 -49403
23183 -49403 -735 -47835 -56856 -75779 -82809 -93836 -94244 18764 110397 142151 103046 30300
23171 30300 65736 107107 61866 21322 -12914 28077 4588 -46064 -14444 21647 41254 -16983
23159 -16983 -49548 -82479 -30409 43098 -15741 -52994 -57860 -34546 14212 56750 83929 43047
23147 43047 24780 7737 47191 -23802 -96088 -87083 -76570 -89020 -112432 -74566 -67085 -36347
23135 -36347 916 -20631 -58557 -35788 38654 -2446 23047 -21427 51557 142281 125065 108764
23123 108764 64230 27215 114213 173193 127013 126717 67230 1907 27428 14375 -10299 -33604
23111 -33604 -20491 -13671 -46312 18780 64934 55247 4061 31964 31569 18418 21366 46284 90292
23098 90292 88888 4839 5366 22077 58931 59483 -15744 -40473 14841 44706 -57396 -76965
23086 -76965 -32275 -54390 -31766 -19088 -83067 -64472 2359 16928 -31488 -27055 -13222 57467
23074 57467 87336 35397 -3288 -12672 27913 22173 -11264 -34786 -90333 -79923 -32587 -63681
23062 -63681 -88993 -84081 -91532 -105571 -145367 -166579 -98660 -16960 9059 -9954 23550 40099
23050 40099 -5710 -13236 -36649 -19879 -37494 -52386 -64040 -60301 -84837 -45263 15639 26696
23038 26696 -38791 -101266 -75361 -47428 -50085 -53573 24181 31577 6741 21515 60155 51401
23026 51401 8013 -16506 -4456 -34651 -34731 -44295 -31142 11002 -19380 -7343 -20113 -40178
23014 -40178 -70600 -66532 -7887 52919 68130 52768 45644 7199 -56250 -45551 -44098 -63067
23002 -63067 -15950 17581 -30037 33277 75619 90615 56162 43903 13795 36382 45267 -32130
22990 -32130 -57607 -49075 47763 42030 11098 -20842 -54832 -60697 -10029 -55708 -18863 -15834
22978 -15834 -39707 -87454 -112352 -103530 -77815 -112287 -129449 -142492 -166364 -97538 -66900 -76290
22966 -76290 -103015 -48202 -44538 -51914 -33040 -19047 37498 115096 65419 2644 -26481 -3128
22954 -3128 7137 -39110 -73111 -61236 -57740 15195 97955 71373 106861 101986 89470 23336
22942 23336 -51184 -41316 -10919 -46240 -39382 50342 75316 68816 3005 6719 -39139 -6907
22930 -6907 9690 -60683 -78808 -57918 39083 94264 73049 -791 -9827 10631 -5484 16843
22918 16843 45958 -9128 -11876 -46173 -65887 -71978 -30475 10090 42578 12187 7613 5136
22906 5136 -11518 -4425 3576 -30805 -24740 -25931 -20054 33120 -6900 -80782 -60014 -19445 -37068
22893 -37068 -9816 18678 31694 44822 -16792 -64415 -27414 57256 53740 16879 -36466 21165
22881 21165 60599 57886 19913 10320 13442 3015 -60402 -105426 -111549 -90666 -99037 -98442 -59702
22868 -59702 -50638 -15297 1212 19742 48289 106624 20030 -11845 56039 97332 96106 123614
22856 123614 119624 69968 39930 47777 77120 75493 13290 -42243 -74332 -26841 24479 -43649
22844 -43649 -39770 -52876 -87195 -113649 -148936 -178402 -186425 -183107 -164575 -88741 -67533 -86421
22832 -86421 -52051 -3019 -8814 -24247 -44913 -79145 2170 -22748 -60142 -12767 -3224 47630
22820 47630 77040 46279 53454 134246 134233 77776 143308 115187 65190 33409 -20951 -63195
22808 -63195 -87326 -111386 -24835 98849 111847 95780 26201 -18461 52881 9605 -13145
22797 -13145 -2080 26010 50203 -55619 -58178 -15449 -70381 -140545 -176035 -122986 -116015 -62735
22785 -62735 -5928 -45824 -89038 -58136 -36630 -50214 36358 -7917 -42732 -67497 -73722 -20503
22773 -20503 48298 46603 63657 18064 8602 3123 51505 76132 78593 58065 -39078 -17085
22761 -17085 20604 1542 -114600 -167618 -174377 -216505 -116611 -29235 -50599 -66399 -41867 -29020
22749 -29020 26031 -14970 -83 -17883 -10277 -28299 -1457 56865 43654 10964 19850 480
22737 480 14712 20214 57987 124377 100966 68651 40632 6223 -47032 -74443 -27656 4846
22725 4846 36998 -37133 -42677 -22452 -42249 -87440 -82336 -42065 -73317 -93319 -65362 -69451
22713 -69451 -68248 -14030 35422 40531 24006 72602 102681 85367 139144 172094 118347 70160
22701 70160 68625 91476 20316 -17007 -43932 -9006 63337 53537 2917 18870 9777 -26349
22689 -26349 -13622 22283 68486 68829 12967 -15487 -25269 -10149 -5725 -82671 -139463 -156099
22677 -156099 -64086 -40324 -61223 -62499 -49326 -3716 -40818 -114305 -66638 -23490 -20468 17232
22665 17232 79484 96629 41256 26904 14508 -86266 -77255 -1389 40270 51474 96845 39519
22653 39519 24210 -17612 -121186 -111100 -68146 -71435 -99770 -104851 -75159 -48734 -73109 -132975
22641 -132975 -138058 -138419 -90199 -100744 -57992 -7387 -56139 -43679 16367 -32442 -36339 35768
22629 35768 87473 82593 72573 117406 20208 -40812 -68426 -93467 -35869 -27658 -56511 -74906
22617 -74906 -25740 -4399 10363 9649 46134 52633 17797 -66 -45380 -52134 -24051 -5954
22605 -5954 51339 30897 -3971 -86475 -79408 -42410 35750 -5 -33909 -85128 -28730 30889
22593 30889 4216 9108 40957 9854 -51605 -85228 -48832 -48609 -83186 -85500 -97218 -35345
22581 -35345 38729 63489 66144 10585 -7255 -20398 1243 -7489 -31556 -90690 -100292 517
22569 517 55527 59268 62655 79928 54649 39474 -2870 26283 66591 59411 42571 -45185 -30784
22556 -30784 4881 -463 25974 -1823 -68146 -85265 -111977 -48530 -8403 13304 62285 123052
22544 123052 61817 40086 25498 11488 -28466 -72504 -72876 -44988 -13382 1861 -34248 -74366
22532 -74366 -61369 -33995 -14750 -22391 -27666 -19157 -43495 -32647 -68273 -117623 -216350 -192008
22520 -192008 -129419 -82675 -54260 -37833 -46831 -111467 -120194 -26054 -6292 -71086 -117460 -127051
22508 -127051 -183402 -207337 -172652 -66719 22101 125020 95203 15965 -44075 -61316 -30955
22497 -30955 -12750 8415 -65022 -17282 -14552 -2167 32194 -27951 -43796 -70691 -64294 27347
22485 27347 -13941 -16996 42543 86200 82171 -170 -11222 58840 42409 56234 28559 16766
22473 16766 13935 65311 57888 19710 -26165 -34645 -34706 -39784 -2300 -20342 -16417 -63825 -43648
22460 -43648 -20584 55971 54492 -20380 -20872 -14900 -41041 -49759 -61559 -15432 44873 34226 3378
22447 3378 49972 38923 104003 100045 46544 15350 4565 5091 36773 46796 28218 -6795
22435 -6795 -59210 -35968 56075 71975 70599 117930 76410 68251 35250 17223 -12463 10399
22423 10399 24359 27661 30760 -3527 -14413 31706 -11791 -39434 -14123 -11255 -8450 10443
22411 10443 18162 92622 61837 -36964 -26099 -26185 20988 3461 35220 110887 101923 79555 48310
22398 48310 -15825 -10036 -31481 -28856 32734 63869 38628 87622 85960 29046 67240 83724
22386 83724 58988 26423 12949 -8877 -104465 -125893 -112949 -104656 -116282 -11425 23665 86766
22374 86766 196548 158516 94126 33220 -11461 676 57174 92823 122237 106010 139227
22363 139227 48392 16915 47631 43162 -15625 -14369 -39992 -114482 -110568 -92400 -76346 -41208
22351 -41208 -2827 64867 48031 29248 19967 32810 29202 23425 -3499 43971 106108 157681
22339 157681 148049 100980 73917 70388 46179 -11668 -73509 -100957 -67133 -35649 15302 20455
22327 20455 -4900 60164 116766 50214 -12255 -34382 10303 32270 -1271 -22131 -46759 -4766
22315 -4766 46548 72356 131390 146401 110792 65134 79373 132228 114962 64385 82866 122099
22303 122099 154628 138377 60695 4520 -34738 -45963 -17276 6726 56411 62288 60332 86207
22291 86207 46317 38150 24699 -68790 -113662 -99174 -103167 -101813 -51792 -46327 -41159 -51296 -89203
22278 -89203 -97486 -13885 61134 -9273 -101002 -76778 -22795 -27978 -10212 4247 -19056 16122
22266 16122 26701 -9596 -38825 -2242 12535 22179 4321 38556 57765 104052 94140 56769
22254 56769 55890 71367 9112 13745 44118 55963 27663 -38482 -60997 -51012 -9776 21040
22242 21040 3935 -7666 -53703 -73669 -56719 -21569 -35935 -19983 -35928 -35851 11765 27287
22230 27287 -29127 -62873 -41806 41624 50178 9101 -17020 -34505 -80345 -55860 -48972 -34261
22218 -34261 -32460 -64107 3388 17245 -10197 5691 12677 48155 40270 22036 1077 -81772
22206 -81772 -130953 -126546 -155430 -85199 -83299 -110432 -85940 -74972 -78146 -35306 20408 -42200
22194 -42200 -25156 -57839 -33260 27611 43275 -7724 -17021 32532 7964 -70569 -32298 -45660
22182 -45660 28345 20104 35788 27849 84443 134514 104529 102701 15282 -72960 -69639 -18558
22170 -18558 36063 85359 -3945 -46952 -87585 -120824 -81980 -37813 22075 9279 -1547 399
22158 399 3318 59142 40302 -26958 -52555 -18679 -12937 1029 -58990 -51295 -51641 -3069 -17495
22145 -17495 -53856 -50874 -68325 -6218 16640 -7001 -5298 -11408 9005 24166 76580 92529
22133 92529 110322 86057 19374 -39739 3017 -25916 -25393 4473 9574 13596 -11118 -49651
22121 -49651 -130193 -174678 -164401 -82436 -17961 -14204 -46053 -9357 31694 24884 11259 -39403
22109 -39403 -111155 -85542 -36300 -9973 -84282 -85711 -65742 -31802 33750 29042 -17142 -62234
22097 -62234 -55765 -57796 -107967 -130650 -80772 -56297 -58061 -91612 -118977 -148415 -152875 -135852
22085 -135852 -122875 -95189 -15366 -14215 26311 71926 81174 24198 -6089 34966 98529 111744
22073 111744 148545 136148 128999 124496 70741 11926 19910 36563 -9794 -41604 8508 38058
22061 38058 52244 -48264 -122214 -108741 -39651 87902 96818 44953 31362 -1482 -36399
22050 -36399 -71222 -356 -16038 -17252 -53559 -66944 -65939 -32707 5527 57186 51633 75551
22038 75551 61317 10008 -18120 -86997 -118245 -87881 -25874 32091 61725 -14436 -50638 -14094
22026 -14094 354 -43893 -68079 -18891 36994 28860 45946 67464 101764 132867 113396 76743
22014 76743 9124 -40202 -27864 -2171 -58046 -51641 14427 29912 -47150 -4161 20598 -37196
22002 -37196 -60750 -46223 -31791 -117192 -149168 -95253 -52721 -28068 -47147 -51096 -13991 47862
21990 47862 27080 651 -17016 -64350 -21918 -60041 -115433 -181812 -188001 -101852 -28761 13136
21978 13136 36405 111329 76279 65954 42406 77885 72060 65980 31915 14577 27742 45333
21966 45333 34957 64200 65243 57164 4635 -31945 51413 117649 152194 152518 112774 50617
21954 50617 28800 57919 34671 -13768 -40737 -29864 -5359 51578 -6712 -37819 492 19803
21942 19803 13809 -14081 22585 -6463 18008 -1807 -52565 -40226 -22799 -28117 -23736 -67285
21930 -67285 -66995 -11515 1443 3553 44584 4010 16408 75113 100181 90002 48545 -20543
21918 -20543 -109880 -137139 -91958 -22252 -58081 -119861 -131324 -83522 -20401 -10820 20930 51626
21906 51626 -5814 4498 64022 184609 135347 38134 -47272 -63602 -108868 -167320 -107073
21895 -107073 -71581 -5294 2433 7328 -171 83246 91977 83453 72608 115978 144957 103688
21883 103688 17564 -20663 -21904 -113523 -174553 -101989 -60485 769 69627 55375 -7136 30023
21871 30023 119977 111771 12011 -86547 -88671 -24468 -3171 30112 -20558 -8619 5199 -29433
21859 -29433 -36970 -54913 -39540 -15305 7448 -1776 12658 25888 36259 93520 96225 120545
21847 120545 153934 123965 28356 6506 7672 79967 96889 79476 44734 56809 116881 172965
21835 172965 218848 139288 43548 45533 84245 87425 76486 138954 183344 151077 133584 134641
21823 134641 175684 158183 76348 21792 34792 103527 29786 31024 28106 26289 24471 39098
21811 39098 14615 -7982 26926 103912 129539 140920 230757 264561 215750 204238 297473 405621
21799 405621 524614 563242 581607 645461 762300 758541 677187 624263 513544 430566 346854
21788 346854 313380 259107 194670 110829 46076 45470 76668 129922 145923 105921 88852 33940
21776 33940 -23795 -27445 -19435 6211 95512 125827 102410 118063 128421 135673 126138 87232
21764 87232 55057 19462 18043 77649 148372 136057 89944 36702 34620 79553 42924 65522
21752 65522 106887 32124 19034 27736 23256 28055 51107 37181 -5837 -138 16213 2318
21740 2318 -22123 49058 107040 112355 135312 60199 -16372 25270 50076 91707 108870 87889
21728 87889 28626 -17976 2545 -11436 11618 51260 117162 143329 161426 101392 76332 110263
21716 110263 186702 181386 120102 53723 12346 2539 -2411 28621 82877 78167 34171 -4619
21704 -4619 -25949 -52774 -17559 42570 17472 -861 -2944 -36306 -34530 -49428 -72998 -69991
21692 -69991 -53023 -30238 -19401 -26402 -70553 -56430 5420 12512 37053 21969 7144 -868
21680 -868 60017 141505 154953 105517 79303 53971 -48481 -57234 13265 30510 35168 44062
21668 44062 50177 66341 90259 59878 1068 -77890 -53586 -39671 4326 -78155 -75923 27336
21656 27336 10201 25462 51809 15098 22659 -5695 -42518 -71241 -51028 -47085 -70612 -76459
21644 -76459 -22056 -6371 -64096 -124917 -80754 -64728 -24325 -21528 -2336 36117 68466 2886
21632 2886 -49489 -81135 -43353 -17104 -46471 -54952 8282 2342 18513 64655 156933 162741
21620 162741 119452 94564 85404 -14753 -12694 -34625 -45387 12810 30616 56786 38571 -3482
21608 -3482 20494 17757 -12572 -37541 -43625 -73414 4944 51986 1785 -13259 -20547 -15673 1314
21595 1314 4983 -6534 -61393 -47694 -8459 33775 93873 132117 203335 137632 102387 70795
21583 70795 44639 25238 75583 51844 27025 46500 31102 34087 5500 32854 110298 151693
21571 151693 147214 122691 95396 84262 13840 -2928 63972 148615 179666 222264 202980 167377
21559 167377 83858 75426 16087 -4325 60776 49791 34132 33040 44885 57931 65677 121932
21547 121932 121619 70982 59015 16117 7983 -20251 6920 41158 79769 57484 58423 -8363
21535 -8363 -4271 83224 147320 167110 127064 85623 79736 83312 101043 124951 71250 35312
21523 35312 70543 40283 -4149 -29681 -915 54799 84631 84546 122695 160352 146730 56184
21511 56184 42159 59228 20572 -358 -34288 -30183 -92826 -102944 -28440 45548 73703 127182
21499 127182 128428 69863 75666 60082 62989 30785 27288 26781 15950 26710 -6406 5765 51738
21486 51738 127584 114765 40410 23993 92173 98328 99421 149657 123618 100711 66509 106548
21474 106548 109201 21933 -26597 -29299 170 60070 95979 105322 126253 31430 -17301 -10463
21462 -10463 32111 115656 100577 61252 52855 91424 53467 14220 6240 -15551 -19337 7223
21450 7223 78514 73193 109744 116852 37332 18302 -8318 30660 54498 84440 102877 42293
21438 42293 50183 47937 26790 13333 52566 93114 119186 118851 74506 46659 6065 11813 3998
21425 3998 19123 1955 48304 112391 88042 96303 109853 99954 180277 146758 126377 146157
21413 146157 182524 156758 118933 121744 116460 121841 120114 140514 267844 319077 316895 291854
21401 291854 280367 271169 246824 251038 272813 203790 124318 57222 64214 146587 239610 268227
21389 268227 262905 247915 194756 211271 244290 292766 321193 294458 256824 208407 207065 227923
21377 227923 202571 189550 181147 98461 38801 34304 71354 61083 112280 129556 140051 190566
21365 190566 173265 125415 96727 54614 102866 147867 185179 216885 259839 186954 155603
21354 155603 161280 248317 234083 175252 172279 133106 137409 128067 111263 137455 144240 116143
21342 116143 129426 139277 73738 14417 59648 175566 196502 201212 191165 171434 122067 116877
21330 116877 144521 179790 249623 265856 298502 357124 406556 354990 388377 452376 534600
21319 534600 703707 867539 1148635 1296142 1245131 1118562 950043 808104 699542 616555
21309 616555 486873 449135 473204 485655 517452 491851 553080 630947 651370 838687 1068230
21298 1068230 1299133 1414872 1413961 1221460 981403 816774 683200 556787 498836 474749
21288 474749 500632 537637 482977 436816 443325 422506 379479 430260 443037 488892 542945 471821
21276 471821 421270 410842 417237 452101 452229 491628 524544 451619 401980 368779 379478 367671
21264 367671 405977 455090 510839 527619 553517 535482 555227 609322 560031 471368 483502
21253 483502 571313 572166 497192 434201 450081 505225 508233 592221 628806 575474 531048 547244
21241 547244 570514 564301 530950 581788 671957 711621 711168 729942 789443 783152 775688 715299
21229 715299 719996 789385 858385 889306 857580 869443 960042 1094791 1116664 1086880 1023654
21218 1023654 987095 959579 977911 1012132 1047216 1021626 1041479 1137476 1248127 1289982 1332192
21207 1332192 1316664 1363758 1431105 1474462 1588115 1707394 1807252 1898402 1992487 2111810 2276642
21196 2276642 2463918 2577597 2676493 2634580 2626732 2626527 2626737 2685836 2781858 2935917 3093524
21185 3093524 3250020 3548303 3898511 4297746 4734954 5138281 5478346 5668410 5708203 5740313
21175 5740313 5789258 5956881 6180008 6505834 6893009 7402942 7982915 8693174 9507748 10469999
21165 10469999 11695442 13209469 15075466 17493216 20404776 23969603 28570555 34621809
21157 34621809 42653928 53189366 67252036 85864921 108870062 133729397 154702398
21150 154702398 165347857 162509422 148242420 127729984 106268317 86987803 71052358
21143 71052358 58432154 48684076 41240042 35491338 30984297 27485218 24802596 22628106
21135 22628106 20744273 19203841 17859540 16683317 15728380 14935729 14301355 13822015 13465150
21126 13465150 13179920 12909379 12804325 12728065 12605953 12461800 12194263 11838743 11352551
21117 11352551 10981271 10621977 10334323 10073469 9884774 9709576 9508619 9344973 9116927
21108 9116927 8870386 8584390 8324312 8085775 7816186 7409088 6978533 6569525 6175513
21099 6175513 5869916 5507695 5176938 4947413 4699216 4470436 4272179 4032920 3872098
21090 3872098 3721385 3589634 3432858 3215847 3009909 2912308 2811055 2649955 2496678 2421450
21080 2421450 2397302 2321411 2178831 2119037 2099419 2034376 1928567 1828895 1778277 1748991 1704003
21069 1704003 1632264 1544679 1489530 1477058 1424246 1315365 1261828 1258364 1257004 1176538 1057907
21058 1057907 1000312 967940 955195 1022145 1009764 954028 898670 862615 841616 870888 779644
21047 779644 743661 669110 630238 693496 681164 665591 704949 684419 635175 630449 685781 670586
21035 670586 647019 530704 513696 517301 515794 574253 652469 676993 682243 726854 749989 767495
21023 767495 794652 778558 760342 675922 697697 690289 613996 499604 439833 425712 438519
21012 438519 513628 511084 485352 455975 406757 449029 430003 471204 473669 424850 380270 384830
21000 384830 445756 457430 445368 449580 474155 486339 528414 566521 620442 620119 579565 528519
20988 528519 487116 424265 427077 451541 457458 501985 475897 432563 443603 477845 510129 423572
20976 423572 419082 523769 482950 385941 419961 474701 467330 456360 469273 461279 455542 475366
20964 475366 480561 487302 481403 539271 522546 473902 432441 421478 438390 429462 453768 399828
20952 399828 335492 388012 441246 425018 411986 426715 345393 325952 375940 401882 455539
20941 455539 453324 392287 341471 317582 300353 271946 264177 266854 305778 300270 312544 342015
20929 342015 286906 289930 327877 307030 257104 260151 336521 375626 341198 311432 328761 247911
20917 247911 217023 152291 174966 178771 179288 150554 170745 205493 287477 317355 292514 274920
20905 274920 281272 243478 257189 314409 319722 301100 343204 372872 418871 418772 341048 352371
20893 352371 365732 411587 390650 335821 274035 315678 285651 329292 408350 404220 412044 431446
20881 431446 424269 429295 457417 470762 470585 471559 492896 538869 546230 510107 555999 522316 539491
20868 539491 580346 584749 590624 613691 618672 603815 604442 583070 640452 679298 634729 610827
20856 610827 638925 704322 776536 810162 836312 823273 745399 673935 640487 641348 641935 601186
20844 601186 545980 563444 527232 549680 635780 682661 721291 808217 924810 1050843 1134240
20833 1134240 1108505 1075573 1006998 1013352 1011518 1009761 1009877 1021226 1045242 1022471 1080382 1120677
20821 1120677 1104352 1111364 1094006 1144204 1171597 1151469 1246578 1331910 1319507 1344116 1363761
20810 1363761 1449158 1512929 1523695 1599278 1651120 1643536 1646761 1660232 1686281 1724547 1691068 1788841
20798 1788841 1909118 1980768 2055615 2102540 2163705 2285624 2358709 2423371 2517289 2592406 2653088
20787 2653088 2759364 2830578 2905141 3028473 3270238 3451099 3485091 3557641 3614818 3763215
20777 3763215 3906156 4072492 4308693 4762871 5241903 5825738 6452674 6955066 7182804
20768 7182804 7294061 7370563 7481877 7883924 8394103 9127586 9922143 10672521 11459555 12307348
20758 12307348 13271716 14293542 15238721 16104120 17052817 18220385 19809768 22019144 24936207
20749 24936207 28791830 33720448 40140949 48599800 59775508 74742899 95503825 125639461
20741 125639461 171279513 239063326 326100559 404015859 433995754 405182136 341088293
20734 341088293 270650875 208922578 161390043 127116313 102564379 84558160 71193597
20727 71193597 61285988 53793064 48041017 43587397 40006817 36958534 34412525 32459577
20719 32459577 30925637 29921417 29145317 28351993 27362262 26214996 25112220 24089322
20711 24089322 23122294 22282160 21516021 20971480 20690412 20668325 20658179 20504024 20234002 19872531
20701 19872531 19576130 19293358 19072673 18794202 18324124 17700431 16979223 16203197 15421964
20692 15421964 14650977 13781826 12961676 12248936 11636432 11086159 10495944 9862888 9303504
20683 9303504 8834616 8445548 8019175 7631803 7313595 7013913 6718370 6447997 6265819
20674 6265819 6038670 5738384 5484075 5255766 4975991 4719980 4466789 4221388 3943051
20665 3943051 3794542 3704455 3615124 3486419 3425030 3254273 3097957 3031964 2902432 2728927
20655 2728927 2657739 2566958 2524217 2439277 2322111 2266703 2151391 2006551 1887043 1801472
20645 1801472 1723572 1716507 1689503 1613105 1509291 1481750 1435775 1384283 1407497 1479647 1408988
20634 1408988 1369500 1315481 1251085 1168738 1132633 1093708 1067864 998464 924834 894041 904427
20623 904427 909336 867810 847727 875363 899530 838058 844296 866886 881317 1040687 1187407
20612 1187407 1236313 1144957 1091525 1029595 1024481 1031659 1017346 1044586 1097759 1166504 1279146
20601 1279146 1445833 1651916 1769190 1820417 1621114 1384926 1231930 1085995 985974 873882
20591 873882 750453 629885 510558 415428 463753 539057 496067 398076 434106 484046 420230
20580 420230 361698 438563 512617 506548 465355 429925 393386 420330 401637 388210 435114 445769
20568 445769 482282 513826 533270 526296 538735 599407 598718 626715 604557 568839 563331 534392
20556 534392 511522 461075 443544 498207 561235 665377 662843 589349 565926 534515 511333
20545 511333 516176 581543 596886 611369 588921 518947 431429 399318 373676 383879 402966 372279
20533 372279 381402 374348 401609 366266 348414 348112 324501 370470 390278 363149 379990 356145
20521 356145 208191 170162 316457 425224 467713 432979 417294 387233 415750 482725 496080
20510 496080 507802 522110 467222 439282 450002 558847 694369 734071 776908 821162 927672
20499 927672 1029071 1061234 1000661 979490 900089 829885 729579 662799 597707 516899 477028
20488 477028 472274 433172 407429 403817 352467 290713 325574 312443 287085 275666 249893 149945
20476 149945 151129 111869 64290 87714 142690 171287 188701 160477 182636 152711 193016 195665
20464 195665 194486 173056 182395 146382 159100 171911 156898 168787 194671 179095 241858 198268
20452 198268 131842 65907 58633 54660 33958 -38872 -93649 -23472 54336 156118 227820 186393
20440 186393 154286 148859 179954 185685 184936 142368 98167 61268 55597 94925 72357 52764
20428 52764 4804 -36365 13915 31782 59476 103908 149120 169257 173144 167743 139944 199023
20416 199023 276142 313856 307806 267340 251648 193274 131721 98196 99042 139696 151239 90371
20404 90371 16121 26313 59867 52696 59356 101341 84077 71744 52117 -15222 11734 50026
20392 50026 -9018 12330 3189 -44938 12929 59781 34854 52547 60753 90071 118678 215279
20380 215279 200419 110925 18915 118 52686 53510 65930 143829 183766 213160 181318 88857
20368 88857 137628 204053 163920 162258 148331 202688 184407 116900 113761 78853 21396 64671
20356 64671 83755 87163 82245 70661 44322 -1114 -10884 44549 116265 154958 160784 66296
20344 66296 2344 -37243 -47734 38473 42384 51063 49350 4823 -41610 -121561 -125327 -39368
20332 -39368 -20398 -16586 24874 77406 61293 55675 85898 110788 136699 101193 39088 44299
20320 44299 59579 89892 25306 -31482 -59144 -105661 -134120 -75384 -51844 -74268 -108438 -146429
20308 -146429 -119633 -122002 -119967 -95121 -49205 -18778 7944 35998 90443 51737 6412 1572
20296 1572 33344 68494 18134 -44779 -27024 -5832 -40473 5612 47613 100467 97358 25558
20284 25558 14870 12082 -46904 -55647 -33825 -20022 -7493 -32654 -22745 -43986 -27159 -16253
20272 -16253 -21024 -11108 -12358 23452 69498 84098 33781 63855 27162 -14240 12625 47941
20260 47941 96025 160984 220175 178336 155525 143072 104480 84535 51469 -11509 -12926 2459
20248 2459 -45463 -46379 -78679 -87976 -101892 -85722 -17499 25090 -22793 -20839 -8556 -2845 37836
20235 37836 34933 -26216 -47371 -3418 45343 23145 45104 58610 66605 124326 138411 174469
20223 174469 191309 151968 35919 16685 -7222 30769 67946 55978 84835 59369 57511
20212 57511 106585 119106 80677 64250 53032 43366 66584 99341 113176 67087 58973 73454
20200 73454 136547 113412 28467 -28131 -13674 34767 67263 72696 45017 76688 131646 171704
20188 171704 200963 159994 145912 160710 109607 76425 115942 113445 97398 130501 251545
20177 251545 320374 426267 525595 705160 849083 1058537 1190989 1236106 1211434 1132662
20167 1132662 920915 755365 571505 358388 234947 203620 153993 82136 119731 239110
20157 239110 363453 447575 513861 686903 890000 951510 1037024 1089075 980834 825512
20147 825512 736035 567289 472146 465078 460583 390482 288231 251475 234948 172044 168090 169681
20135 169681 216763 230126 179428 119044 135965 138168 235172 246181 192629 161031 201403 268734
20123 268734 254968 102507 -72103 -20413 53279 27130 39369 -68206 -81467 -44005 -53445
20112 -53445 -80136 -67833 -60833 -34942 -30059 3261 38781 70486 66204 112053 132023 76170
20100 76170 65391 67658 69375 64098 59273 -26053 -27220 22079 -49073 -64196 -70461 -90665 -49041
20087 -49041 11485 -8570 -5110 -17144 -61371 -58039 -22448 48124 65329 61769 3228 3787 51917
20074 51917 65734 26699 -47552 -63953 -42910 -34628 -60235 -66455 10394 35755 91664 79663
20062 79663 44963 31047 61931 50616 41481 -17273 -2310 65671 58776 -14094 -7132 80771
20050 80771 58688 8299 -25298 -16259 44521 105239 88020 54830 -5511 -35117 -69498 -62048
20038 -62048 -74 57537 84474 65594 40364 -63010 -123560 -74676 38471 57607 19684
20027 19684 24635 -11742 -79340 -73452 -79320 -38671 33080 87145 108128 168712 70302 -32113
20015 -32113 -102831 -79868 -11393 28605 43015 42207 64225 -10708 -42296 6241 13975 28222
20003 28222 -3736 -58812 -63263 -42456 419 -2243 -17345 -56692 -42650 -11831 -20255 -91833
19991 -91833 -113337 -98525 -71407 -50538 -4565 14514 17776 63042 121424 87454 4113 -68633
19979 -68633 -51911 -41821 -86371 9764 107353 108727 105510 12093 -38263 -3649 14565 -29107
19967 -29107 -108776 -90977 -58318 -36035 -34903 -42442 -14540 -21277 -41483 -34668 14593 -4764
19955 -4764 -98431 -93223 -29804 -19014 -910 -12586 9662 -1688 -13848 -23526 33817 21821
19943 21821 -22471 -4890 22567 76744 41212 35624 -11564 -37903 -8614 14536 -9313 -62864
19931 -62864 -100773 -3490 93485 141491 32173 -55483 13473 63144 24546 -2325 -40601
19920 -40601 -49472 -32013 -25691 32197 87820 47768 -4701 18822 94164 8289 -71679 -96971
19908 -96971 -86798 -89774 -21004 -19766 -68360 11667 35075 44962 62470 105923 128635 177721
19896 177721 109150 -540 -17975 45910 63985 62875 63002 65558 59407 14726 -6314 -27005
19884 -27005 -58615 -97965 -96090 -51815 -35805 -26305 -25156 -5201 9586 -75101 -83653 -81427 18751
19871 18751 101073 101036 54766 2347 -37853 -24431 8298 9404 10102 -8473 -29893 1869 29918
19858 29918 31903 28281 25403 27165 45379 -4359 2805 27072 73611 44253 22108 -1875 -288
19845 -288 -19750 -46232 7230 29329 75954 104653 82901 27147 1768 37495 81869 103743
19833 103743 104534 25078 -19383 23001 100046 124752 115524 62881 -76 4569 72435 81647
19821 81647 72248 82706 96775 107493 93227 79389 75113 42071 46493 1452 -87762 -88984
19809 -88984 -17210 26816 8889 -54459 -86549 -137491 -72961 -3327 21323 228 -63922 -49660
19797 -49660 -50192 -70219 -37315 -4047 -38198 -26265 53089 89701 56796 33470 11115 14712
19785 14712 28137 8809 34431 64641 117107 126338 70654 15433 -66691 -111252 -58436 -15340
19773 -15340 32358 35753 7043 -12795 -49095 -141649 -192118 -113998 -44869 -29650 -76336 -53331
19761 -53331 -22946 -16515 -40032 -61380 -39126 -32062 -63962 -12892 50442 65431 66943 -23
19749 -23 224 23998 31806 14683 -41127 18896 9185 -30041 21003 26311 29451 -20181 -11513 16493
19735 16493 -30528 -76133 -39011 14676 23554 47577 14437 -27171 23641 95946 66584 53676
19723 53676 17789 -47036 -33977 -52848 -45408 -60961 3921 116311 132749 89520 90150 74706
19711 74706 36855 80957 134913 109193 64533 33351 69521 82053 33247 -19719 -58413 -28876
19699 -28876 -90997 -160882 -124759 -101649 -52541 -7827 -17238 8212 -5646 -20573 -8156 -29550
19687 -29550 -38331 14345 42817 9009 6890 -23753 -57964 -14439 2187 26990 52287 9302
19675 9302 -30651 -29050 -2779 -3995 36023 29769 77590 115802 89443 84090 107001 179669 189234
19662 189234 112487 79525 62795 59937 -3629 23995 25509 43752 -20527 -49958 -37831 -30736
19650 -30736 1728 -9101 -2256 -5953 10990 31586 -1292 -64050 -81773 -106065 -143777 -163797
19638 -163797 -82619 -46719 -80520 -41429 1461 -24536 -27147 -29031 -3014 -46300 -1155 110827
19626 110827 139946 43334 -54903 -126722 -111231 -84721 -38982 6808 55969 103096 71740
19615 71740 49439 -16491 -45165 -25187 -70407 -40165 -584 -29853 -72090 -93048 -108235 -41616
19603 -41616 -10551 -6507 -15306 7808 -12743 -21190 -40690 -60101 -92297 -108156 -77221 -329
19591 -329 34683 9400 -53581 -78796 16274 17290 -9855 9002 30842 -4447 -94206 -124226
19579 -124226 -117388 -103696 -91955 -68570 -44744 -33105 4529 -5163 -40461 -74642 -8849 64673
19567 64673 67149 33590 15077 -37002 -55553 -70807 -63155 -59084 -103361 -70542 -14860 -11948
19555 -11948 -4536 -43326 -100491 -72252 -16012 16860 24449 63366 85084 65208 81124 90598
19543 90598 30016 -29014 -24341 -17872 27610 -41360 -53868 -49673 31296 59597 -3789 32858
19531 32858 64813 66869 66530 51522 -36634 -97654 -36795 -8598 -74194 -77327 -32770 -26801 -85402
19518 -85402 -75281 -34652 9676 19318 71243 19122 -53108 -546 11326 87911 98044 19303
19506 19303 13157 -41533 -62761 -43792 -22202 73229 109919 79928 32869 -56168 -57460 20688
19494 20688 18974 33674 122467 113593 31277 -20055 -16498 -58395 -57682 22938 3500 -47494 -12695
19481 -12695 56132 51523 45983 64999 26100 334 -43075 -34510 77320 92576 46027 13920
19469 13920 24467 39476 59651 3750 -23207 82852 94916 47790 3984 46371 23014
19458 23014 -18325 -33504 -45846 -32842 -138619 -189616 -82246 -6288 11356 63723 48264
19447 48264 -6219 -51586 -35401 -38053 -37834 11969 -7082 32595 93404 78161 -16032 -44244
19435 -44244 -29501 -32309 -61737 -31120 -55505 -56018 -38537 -15061 -776 56594 34060 62507
19423 62507 88363 105265 117713 102345 106433 92337 138441 141609 55814 -24122 -2805 48788
19411 48788 78528 64690 53049 -83711 -57763 -35412 -43741 -65855 -45186 7354 7715 51897
19399 51897 20512 27957 13215 104791 97656 135060 140322 120488 101663 84488 43844 13723
19387 13723 59673 47167 42258 79603 81277 16335 58225 30754 8810 33672 -16001 -33325
19375 -33325 -45105 -34924 -18616 22402 94464 75032 76288 23956 -10630 43762 97218 48064
19363 48064 -35339 -56114 -3235 -2114 -70812 -136677 -147000 -146788 -128514 -110960 -58082 -69532
19351 -69532 -38637 -28799 5452 -10394 21477 129190 174591 61768 30750 -16995 -12390 -17208
19339 -17208 -6759 -26923 -17724 32710 27892 46348 -6192 20309 51169 54051 26646 54262
19327 54262 117967 150715 95665 40825 46521 99626 101207 77658 1430 252 15618 -7698
19315 -7698 -72655 -65912 10688 46618 18593 12187 -9152 21797 25535 -56193 -105289 -94412
19303 -94412 -54140 -57082 -162265 -204371 -165617 -71114 -31830 16536 103584 155689 113643 86781
19291 86781 45786 90833 102661 52333 66573 117272 120596 114946 5207 -54761 -51498 -41668
19279 -41668 -83664 -101037 -71888 -78188 -76486 -60616 -28285 -84096 -13438 -39105 -29511 15505
19267 15505 -349 54151 68601 108678 85830 49200 58749 48620 80590 123794 73700 23241
19255 23241 19518 53450 32976 5690 264 42130 11789 52212 116298 136983 180917 173751
19243 173751 121386 67691 26671 1751 80053 95376 167165 224070 257437 242680 171784
19232 171784 167483 172065 145969 118116 110219 100464 105305 73041 15880 -32489 -13237 -12636 -21135
19219 -21135 -31548 -4559 36223 58358 64795 20881 2464 76038 162511 150240 120554 87653
19207 87653 38418 -19990 7878 57265 62331 74350 113702 125463 115375 22658 -36476 -17021
19195 -17021 3758 32002 -27638 -57344 927 49734 77014 87785 10526 -10872 31954 56888
19183 56888 31567 36258 52242 -9096 46014 123670 180266 188670 158175 116578 67812 43725
19171 43725 41533 47899 60547 25724 77035 132044 110289 122122 184533 185952 161673 120038
19159 120038 119627 134844 108784 120836 33196 17195 87459 86565 86950 82831 127345 68498 35435
19146 35435 63076 -16378 1445 75005 166904 228280 198457 200376 277800 315747 346707 399759
19134 399759 476721 465070 464973 438214 425857 436906 512244 603452 577510 478616 471110 492948
19122 492948 515840 492610 434503 388439 316095 276779 281130 307050 258710 169225 256126 263005
19110 263005 200095 218086 262159 230639 153474 76962 12844 90258 109139 134971 84855
19099 84855 136219 168018 116929 137429 207111 167448 130773 231585 258480 212196 109113
19088 109113 29256 47810 98571 149625 143510 80789 53727 118342 166908 197199 184555 157567
19076 157567 134067 106297 72325 86450 46226 -5401 15949 126848 156822 150239 155355 201703
19064 201703 310101 325245 286653 183404 186235 205969 196112 136241 149078 172748 203871
19053 203871 218129 177616 160402 153373 77519 91370 114510 156656 193196 201489 161948 123182
19041 123182 158759 213929 227624 172145 131419 118212 182711 157590 147577 84896 128981
19030 128981 130105 28775 52280 137501 179587 212776 179632 122788 157003 227035 293000
19019 293000 352960 392489 389311 451407 538222 591650 579444 543310 485910 465089 442572 384710
19007 384710 310388 232930 216977 184603 167896 191874 224298 318620 375888 319284 286581
18996 286581 254415 205856 223229 231268 206736 245417 320050 305372 325983 354387 384676 348525
18984 348525 368162 377556 333756 301286 435604 569210 570045 570195 534117 470347 481042 554386
18972 554386 532061 440339 428756 494173 506879 574168 610095 594869 548690 523382 527662 509800
18960 509800 515402 489849 472831 464366 495669 444284 438985 463246 458234 413221 404118 421790
18948 421790 505358 567467 577812 598936 591355 583843 553194 512363 495989 412075 381951 395388
18936 395388 415431 499575 518032 516978 511601 539386 503832 517876 531023 515668 443768 461371
18924 461371 478790 454893 403564 393587 410671 422319 406314 366992 310807 263670 233412 247251
18912 247251 262787 349416 384958 399102 394293 424285 420943 342717 326174 423982 459087 454296
18900 454296 413437 339750 268412 238033 244206 324426 358976 269652 271885 259991 255507 300922
18888 300922 348828 264478 258180 320872 286815 216334 202221 230420 276897 276771 275496 201265
18876 201265 208790 239344 247443 224544 197597 133864 134236 132881 143407 152840 240494 278925 196312
18863 196312 136691 86160 75981 125445 224895 289029 291371 276054 249147 243054 264035 276687
18851 276687 260985 259459 298221 353569 330453 284455 293502 302271 269319 242682 228617 216572
18839 216572 202995 184612 207506 267556 250701 214889 200861 200526 256038 291851 266855 230068
18827 230068 145022 116630 169275 203175 236976 253571 255673 274236 244763 213829 164968 93881
18815 93881 135548 156752 110428 136710 156081 152817 174225 212544 251775 224253 281599 260077
18803 260077 243136 311768 315261 257295 255574 208271 161783 104409 156361 179593 179718 221683
18791 221683 256857 315857 312526 317304 277233 279796 326952 374682 411353 381770 354119 366437
18779 366437 362490 350630 377827 423197 453260 440254 402105 403212 429394 548669 615993 618044
18767 618044 750626 851487 809026 723046 628495 559918 545664 516417 486288 475540 464024
18756 464024 419009 406636 389884 404244 438228 496517 594671 586095 526257 477734 454617 563854
18744 563854 515776 514880 562718 591571 578660 605651 651900 684444 649322 705447 742220 772605
18732 772605 746800 716626 738987 722823 724677 779272 757233 813501 827640 822649 783237 758381
18720 758381 740384 750301 769911 773331 773065 852152 913986 971403 943380 948949 986350 1028570
18708 1028570 1004566 961232 961316 987226 1023532 1066105 1133486 1082314 1058629 1054431 1038537 1108918
18696 1108918 1152706 1169840 1168374 1208995 1272839 1281463 1255159 1267759 1282528 1388577 1417961
18685 1417961 1447872 1475513 1549428 1592252 1600605 1602364 1660999 1744548 1749691 1772995 1914300 2004105
18673 2004105 2076320 2237325 2374158 2508519 2656647 2840406 3094916 3287119 3405166 3689052
18663 3689052 4013164 4358313 4768121 5253629 5775808 6401356 7238698 8186241 9501718
18654 9501718 11302418 13671109 16529453 19437804 22398847 26164340 31032067 35940342
18646 35940342 39304770 41922943 45519454 50240242 54438295 57001166 59291914 62270117
18638 62270117 66208505 70793767 75344641 79184343 82001567 84471629 87297819 89455427
18630 89455427 89220648 86627544 83702483 81027616 77372382 72523575 67067667 62393130
18622 62393130 58975334 56003781 52153260 47311885 42638385 38592523 34856322 31049363
18614 31049363 27350658 24053256 21270175 19083255 17389823 16116574 15090632 14261386
18606 14261386 13599644 13020322 12493189 11983112 11539148 11223179 10924567 10599505 10302328
18597 10302328 10055686 9839210 9629618 9440973 9277351 9072807 8840726 8597958 8450583
18588 8450583 8276166 8095350 7899693 7685538 7487175 7210669 6984702 6808537 6706989
18579 6706989 6614183 6489326 6452258 6568751 6704393 7079376 7666208 8554427 9616468 10599830
18569 10599830 11174785 11541356 11996447 12360728 12302982 11592474 10326348 9015506 7914791
18560 7914791 7186381 6684985 6348226 6282232 6376860 6559152 6671894 6495229 6281822 6145918
18550 6145918 6216786 6433273 6784829 6969761 6916412 6630797 6242106 5929246 5734350 5574117
18540 5574117 5432042 5373388 5493242 5677386 5896718 6185458 6611074 7276409 8067244 9175949
18530 9175949 10511711 11823737 13064453 14868632 17871380 21818256 25188775 26215034
18522 26215034 25482267 24765700 24760723 25050894 24153374 21816432 19094868 16628614 14718694
18513 14718694 13362363 12614963 12268481 12160940 12302367 12657707 13213172 13970077 15056488
18504 15056488 16622514 18833305 22029777 26668561 32693445 38582086 42532621 45262169
18496 45262169 47995966 49643449 49447044 48280419 46870839 45912083 46159775 48008888
18488 48008888 51959423 59105400 70954255 88784109 109577671 123905428 127779944
18481 127779944 127645754 129298963 137310231 153238336 170771910 179711071 178610143 169638127
18473 169638127 155190339 139162561 124648846 114590183 110712620 113597319 122350363
18466 122350363 134096288 144761238 151192483 152387253 147547999 136946097 124917997
18459 124917997 114330717 105673955 99287235 95116874 92561539 92046723 93304235 94105143
18451 94105143 92734242 90060936 87195065 84482136 81804860 78324559 74237300 70328137
18443 70328137 66556151 62729049 59163715 56603517 55516993 55458574 55739681 56078535 56305896
18434 56305896 55582059 53064693 49484622 45854543 42166441 38510892 35338982 32863336
18426 32863336 31135134 29844784 28855821 28347218 27932788 27192018 26238643 25425601 24731026
18417 24731026 24019327 23357245 22847900 22345351 21981041 21968594 22218396 22191325 21966234 21984447
18407 21984447 22405400 22861147 23261502 23478140 23190787 22410554 21540223 20565215 19727499
18398 19727499 19328636 19205204 19340906 19543535 19373323 18558739 17448101 16040558 14360848
18389 14360848 12679307 11240756 10037682 9076245 8332751 7787430 7368532 7011287 6591523
18380 6591523 6261718 6011382 5752116 5520048 5301787 5132399 4952520 4804059 4635880
18371 4635880 4505841 4423625 4370176 4380795 4274413 4136002 4061782 3958808 3876348 3800680
18361 3800680 3761854 3738684 3680414 3527711 3390493 3277583 3170934 3026165 2951192 2892583
18351 2892583 2852475 2789200 2669746 2564237 2451427 2349603 2289506 2214841 2099509 2015597
18341 2015597 2013109 1980085 1889206 1743596 1662212 1523112 1399843 1395000 1406642 1388707 1431361
18330 1431361 1420504 1334751 1297628 1295947 1246909 1231757 1219562 1221901 1233657 1240106 1240354 1235808
18318 1235808 1201393 1132953 1131421 1197925 1183144 1142034 1133376 1176621 1125312 1070968 1114801 1110678
18306 1110678 1126784 1120165 1110994 1088362 1020087 927979 876494 889256 958832 996157 980213 982671
18294 982671 1024362 998108 1035855 1013239 1000913 965507 926522 911934 906121 945431 985653 1030703
18282 1030703 1009842 981310 978683 993588 1058355 1123011 1136353 1081363 1026648 1003840 984866
18271 984866 985457 1011855 995922 990795 1031231 1021199 970077 962698 997088 1011559 1015814 992521
18259 992521 927136 948257 957887 929775 924700 915973 918369 904530 839317 785449 781096 758194
18247 758194 753339 729074 712679 671216 648557 615962 619985 660423 669942 681739 698979 692339
18235 692339 618356 585009 635221 679004 698183 685754 629114 688446 694043 639950 597184 657965
18223 657965 754229 742532 652998 690886 771844 729215 655713 631839 648712 657467 600894 506597
18211 506597 487878 531025 535560 486816 489777 497397 441468 439045 456252 410674 425481 472837
18199 472837 555174 581560 633355 634624 615423 554192 473400 423182 362321 358302 380329 418745
18187 418745 386492 367400 408240 475661 591084 608299 635867 619555 582295 533930 572289
18176 572289 688885 644926 561679 538845 534336 595648 545121 560612 690322 660178 585090
18165 585090 615034 568029 603397 685173 688083 648642 650919 667835 712519 743301 836535 888727
18153 888727 869499 869055 921282 966543 1009938 1072426 1105763 1098451 1147537 1245435 1384245 1450662
18141 1450662 1452050 1486936 1517347 1536187 1584156 1630563 1681510 1718074 1826602 2016673 2111292
18130 2111292 2205798 2294026 2416071 2539735 2710893 2884176 3080612 3353319 3628355 4049471
18120 4049471 4662922 5268839 6083294 7219472 8671766 10743372 13719268 18021635 24545603
18111 24545603 35227469 53222815 79038193 99458073 96428404 79993211 61850191
18104 61850191 45443627 33401223 25276999 19785059 16070200 13439127 11523811 10061944
18096 10061944 8940285 8088555 7510392 6978337 6496986 6050691 5689164 5324024 5029913
18087 5029913 4834838 4650238 4447230 4295141 4121269 4030371 3962037 3875821 3781150 3659958
18077 3659958 3604199 3573075 3552178 3494508 3549520 3612666 3613337 3661693 3743111 3770270 3729059 3534483
18065 3534483 3344585 3168153 3016918 2860309 2765447 2690753 2597073 2428679 2259174 2107922
18055 2107922 2028465 1937362 1918728 1889242 1835775 1709727 1595491 1535987 1542362 1478325 1442274
18044 1442274 1383618 1323550 1305430 1254463 1202053 1102272 1052959 1092865 1064628 1026066 947028
18033 947028 826179 742886 782980 826120 855548 872773 778897 588895 616901 621865 524503
18022 524503 552135 489416 532273 564330 538164 585745 611773 648736 587759 535481 505474
18011 505474 510313 445235 374398 340254 355388 436138 538913 491016 438899 372066 381504 395846
17999 395846 368576 422920 484804 560601 672770 720020 714005 827130 909157 933547 890122
17988 890122 820382 804093 818182 800044 747839 745415 733331 667873 638046 671947 693995 689840
17976 689840 652102 604995 624841 587725 522194 447410 388516 405944 462704 512719 453610
17965 453610 455028 541142 637937 642641 626288 613360 581471 587012 556746 561648 603887 623737
17953 623737 628085 625783 706860 786544 749956 701580 658575 771145 811139 803766 798828 734680
17941 734680 763292 714674 653144 635013 622502 676964 716025 659982 610087 668521 734149
17930 734149 749074 767531 672323 569156 615478 567452 551696 635122 669154 618669 598520
17919 598520 550439 490967 509535 440049 389210 419661 486143 458684 428795 458351 485988
17908 485988 476973 452120 388012 421334 397022 332594 360576 362092 352770 367115 323673 290151
17896 290151 281106 321244 302919 303134 331838 325619 220909 192854 208726 187183 176140 195431
17884 195431 202052 244709 318858 324721 253759 250057 187731 125709 90508 149386 199956 228291
17872 228291 224471 167024 166117 134903 116540 125388 50473 149689 174329 195848 216341 213266
17860 213266 152105 137151 149908 124083 137192 169585 175551 164110 205114 265260 227904 201168
17848 201168 134460 181185 213540 169256 153832 94234 138022 230288 196918 193334 134050 80377
17836 80377 36147 107707 164864 203204 150429 104128 140678 171487 169522 198147 218452 151001
17824 151001 59130 25692 97579 166429 190600 153688 120073 92970 47668 104788 221227
17813 221227 258668 213329 156638 96423 73675 94617 112614 88763 96212 130554 171477 196459
17801 196459 166191 148601 189698 171261 84396 96651 175690 219577 197477 160360 125217
17790 125217 104948 67058 63542 123087 131150 133468 161128 142310 189868 179381 137697 115348
17778 115348 92248 36374 -11977 8245 46225 91483 101556 80658 57304 15210 -48832
17767 -48832 -52425 -2264 60524 16995 10958 48177 86234 57853 16042 8475 19713 33869
17755 33869 40456 32882 45484 37255 17256 -22284 7238 75547 50472 32301 84059 96473
17743 96473 77048 125490 154934 176414 176090 182691 110635 13962 -30375 -4988 84931 47480
17731 47480 19155 93708 -9898 -28569 63266 45695 58663 26351 -692 -7404 29600 -12424
17719 -12424 -26284 22375 -9620 -19963 34815 -24439 -17952 -36865 -58088 18468 -21691 -5185
17707 -5185 13569 -26702 -12793 51626 137919 166305 98198 68243 66457 -11644 -12130 19574
17695 19574 41982 -9446 -53285 -21643 167 19675 94378 81413 38723 21996 -5395 -40147
17683 -40147 -90061 -76529 16251 5449 -22854 15856 -51407 -43218 3169 6063 10375 -16844
17671 -16844 -1511 -9291 7372 24903 45629 29062 27537 -11936 -49133 -42426 -29065 7174
17659 7174 -15204 -27847 -13613 63164 49775 32018 -55918 -82815 -22651 28400 30190 -24268
17647 -24268 -6013 -37545 641 1602 -30476 -71621 -70301 23148 113964 21389 -15835 -53300
17635 -53300 -83171 -99658 -48369 58164 16365 -13374 -108122 -91446 -42325 -12406 60919
17624 60919 66593 75471 48680 19835 11470 -6933 14472 40776 23122 6285 34913 32000
17612 32000 74571 65402 68358 48966 26892 58019 52610 50964 37889 3709 7552 42005 44821
17599 44821 71594 96933 48098 36739 58663 18323 26943 80961 4870 -44199 -9985 15154
17587 15154 62900 109722 106583 68318 61526 67508 133524 145599 151359 116457 150413 141505 153617
17574 153617 133564 101988 125626 108586 124488 113545 39822 -4117 -17096 25740 6891
17563 6891 -37044 -60706 -36474 -31281 -20347 -82756 -127776 -110893 -30556 -40703 -65730 -63535
17551 -63535 -122396 -163856 -111376 -92397 -40727 -33952 -69714 -58847 6707 70518 57610 101481
17539 101481 157906 142473 101439 85177 46080 -57275 -69105 -40845 -21472 -70996 -55340
17528 -55340 -61482 -78540 -90266 -19868 1811 -35068 -61997 17862 107168 148537 123446 91991
17516 91991 63790 -40193 -95538 -102354 -62676 12530 40736 -20340 -56401 -43611 18742 -24462
17504 -24462 -9930 -21219 -50703 -66377 -31658 25201 -9239 -69866 -52710 -9226 55122 10878
17492 10878 2189 50634 7110 -17086 -82703 -30918 -876 1704 7362 -5151 -19295 -19308 -66962
17479 -66962 -61077 -21991 55237 75156 34656 52355 8019 -17666 84377 139745 93605 102400
17467 102400 58972 15116 93844 92381 60697 95848 106725 86219 42904 -20380 -20080 -67545
17455 -67545 -51026 -1581 48592 63825 57387 28316 -23400 2138 38703 85005 202184 300567
17443 300567 377937 520702 525892 492650 360372 226085 175697 154596 101089 93995 80714
17432 80714 63083 35027 35854 16224 11300 11033 30819 45216 123504 162517 109605 93534 94904
17419 94904 59666 120807 122499 95117 125817 70820 83943 78903 42296 22666 63209 84182
17407 84182 93125 87109 77974 85486 124696 114752 136464 119011 97013 70507 27905 47731 -67133
17394 -67133 -101552 13264 40449 4481 23623 -21853 -4302 40184 43954 -12763 -35629 -35938
17382 -35938 -61669 -113268 -96930 -7469 10498 10803 9928 6674 -59652 -80039 -67440 -401 10702
17369 10702 -46858 -42632 -20516 24511 24068 841 58847 65481 9359 -17166 -18584 15849 48121
17356 48121 46919 -1690 -81575 -104338 -67611 -6773 -18469 -4379 -36485 -47966 8740 23249
17344 23249 -12639 -2857 38640 47536 596 -47753 -7602 45222 68407 39760 -29419 -56674
17332 -56674 -42007 -5009 1295 92753 99309 76575 114691 104922 49054 3873 44421 40913
17320 40913 3786 -61039 -40561 5811 38087 20857 -10261 -6137 -35327 -59946 -61547 -46185
17308 -46185 -42716 3207 30436 9728 -6850 -23769 6478 -61972 -58028 -79101 -85922 -37363
17296 -37363 -37489 -49077 -102872 -52597 60666 80368 68086 67136 123273 142916 77964 66688
17284 66688 5285 -53433 -30417 -23302 -23758 -5897 43019 -17186 19629 -11094 -60149 -80822
17272 -80822 -66558 -78070 -64791 -13536 15840 23377 1942 -5475 44658 5803 109 -43920
17260 -43920 -94745 -92843 -54459 -27923 -45390 -84246 -126958 -86316 -31740 57422 83248 54233
17248 54233 2150 54471 140937 103467 66414 16456 56600 56953 78371 176438 228212 219200
17236 219200 177326 120291 19620 6740 11341 3427 -36665 -13913 -23284 -99133 -69231 20421
17224 20421 53234 118522 78554 28981 8477 33326 12441 42731 1435 16241 119159
17213 119159 101792 33436 50610 90866 88026 46163 42356 153356 150063 77087 -11994 -37617
17201 -37617 -43007 -45116 -37038 17697 17091 553 -26422 -45057 -15946 24761 69091 88355 83749
17188 83749 76544 69778 84861 79277 91521 114697 122655 136559 134616 4665 -69579 4540
17176 4540 60006 70386 15372 -10270 27527 10155 -5914 -131794 -97036 -64755 -89995 -39299
17164 -39299 1109 34586 73998 31546 -43184 -63006 -32559 -32934 -90457 -50096 -33150 -76040
17152 -76040 -86719 -49064 21738 116713 92608 54788 25062 -2175 -29782 -53736 -94962 -113883
17140 -113883 -51520 -3404 -58103 -110611 -129392 -68254 -6229 14984 -62282 -77794 -38824
17129 -38824 -60223 -105846 -99476 -22085 -33637 -10430 -9464 -46152 -48166 -16446 -44 -72262
17117 -72262 -123261 -138978 -133175 -57543 -19164 20281 32520 64810 83710 104392 108867 22100
17105 22100 -13061 1968 -15455 28410 36600 91326 24659 -57836 -32318 -40287 -62894 -113468
17093 -113468 -139923 -101981 -15668 40096 56202 57201 6853 -35608 -21091 13024 -13700 -29326
17081 -29326 372 -43538 -13569 46854 51899 -9139 42999 93895 77922 5491 49860 57691
17069 57691 -31855 -40985 -92170 -54469 -5165 -5314 -38123 -46029 -24556 -60648 -63860 -33288 -82293
17056 -82293 -105991 -81258 -103046 -108889 -35267 -9480 -95310 -47983 -7113 -9323 -12978 -67069
17044 -67069 -48386 28375 23680 -18845 -60976 -45837 -36565 -44734 -68818 -105938 -55754 -12211
17032 -12211 -45084 -67287 -92016 -109964 -108367 -115434 -61444 57437 38121 -54450 -90102 -68195
17020 -68195 -66841 -86262 -103138 -151371 -130491 -122813 -99748 -156165 -131125 -60194 -32360 -14089
17008 -14089 -47485 -68625 -72619 -59954 -150271 -158677 -91221 -45778 -43045 30797 17181 -34966
16996 -34966 -45737 -106415 -95830 -105040 -98274 -55444 -65373 -32496 -33837 -13710 14020 29769
16984 29769 -25864 -51495 -33722 -33565 -24667 43597 50430 -22529 -41257 -37803 -38856 21237 21022
16971 21022 -10228 -11264 -9900 -6750 13417 23720 23543 -18419 -63529 -62414 -51614 -33420 -40960
16958 -40960 -63737 -94409 -95358 -74293 -56193 -51597 -31689 -43558 -68267 -36041 61453 22853
16946 22853 -55449 -71350 -58980 -54409 -68665 -42181 -58193 -16278 -16632 -75229 -39095 21203
16934 21203 34724 15171 5715 21748 -54781 -48220 -104571 -83260 -17256 34901 8325 16346
16922 16346 10708 -26607 3666 9449 -15993 -6185 -14664 -43540 -47453 6639 -6288 9084 34619
16909 34619 40319 49409 1346 -30766 -38439 12629 30352 -642 -53017 -59422 -79450 -104717
16897 -104717 -136414 -183483 -71587 -1946 37734 26008 -73400 -68353 -93663 -92505 -52437 -39743
16885 -39743 4174 -13385 -17842 -17884 -53749 -56415 -24762 27577 35269 24293 27369 69599 65683
16872 65683 46756 54749 19611 -17070 -20379 1792 8709 -30478 -116488 -75732 -1260 -43207
16860 -43207 -40996 -77222 -91405 -46921 -23134 -28054 -45465 -33502 30240 52359 -20065 -59015
16848 -59015 131 20389 32871 23652 16907 -8737 -6345 -21434 -35005 -79559 -121413 -83180
16836 -83180 -49424 -55061 -73971 -49565 18852 51794 36671 3062 5257 15060 -74619 -69172
16824 -69172 36830 46764 25540 -49623 -67411 -87570 -19313 -66347 -134692 -122561 -43630 1560
16812 1560 86 24712 7813 -12878 -67839 -75901 -26929 15899 27110 30611 77257 45410
16800 45410 -24246 -77353 -35994 21096 -29900 -24950 -74092 -110496 -118653 -126042 -131249 -89622
16788 -89622 -31873 -62183 -128038 -170981 -119256 -82538 -79191 -56073 1837 -928 18265 50615
16776 50615 19624 -2184 7123 27116 21996 -53785 -94336 -135751 -142021 -105141 -59567 -62959
16764 -62959 -86785 -80162 18225 -32194 -116607 -77873 -43047 -61207 -39984 39150 66407 36500
16752 36500 37677 8851 9719 -38833 -66106 -66088 -60764 -60666 -78943 -59618 -52177 -34009 -21515 -48015
16738 -48015 -45585 -24668 -59442 -23614 -6554 -4788 -7798 -68222 -93801 -152023 -123519 -21439
16726 -21439 -15433 -20816 -15242 -94213 -168094 -85931 15420 11549 -71504 -100878 -95042 -105311
16714 -105311 -56472 -15729 -49609 -13209 14892 -33132 -70335 -88326 -1755 -21744 -24633 -17637
16702 -17637 -23433 -50870 -58806 -31415 6107 -4210 -44124 4861 25747 19322 -17853 64182
16690 64182 143915 175726 120571 75858 49657 -20228 -82496 -118141 -79808 -84601 -34029 48854
16678 48854 8071 -15842 5570 30474 83371 96989 83442 -4018 -59567 -79134 -53915 -79644
16666 -79644 -43358 -15304 -41606 -27963 -102358 -56650 52214 39254 57122 103447 95225 29944
16654 29944 33780 11128 -10679 35977 33515 44957 69103 60311 39566 -35726 -72441 14739
16642 14739 9219 -656 -9334 -708 18334 37308 12565 13854 29174 123142 116993 49757 44598
16629 44598 65972 32638 66250 57904 77672 72071 -24343 -136538 -184703 -90213 -35768 -79768
16617 -79768 -106513 -88542 -1165 51186 20576 34017 47052 2424 -7968 23851 7535 -54145
16605 -54145 -23233 47030 40274 39534 20488 4874 -58253 -31174 43141 38451 -17561 -36789
16593 -36789 31629 48579 53485 52208 -8299 -19546 -22623 25902 9736 26051 49866 37318
16581 37318 10504 -690 42043 57037 34055 -24450 -72031 -88435 -53405 -42524 -82069 -106259
16569 -106259 -93109 -53718 -62857 -71284 -72080 -38570 -53051 -66399 -44492 -42021 2228 -1328 -65121
16556 -65121 -71250 -74103 -59700 -26704 -25360 10445 7052 -14705 14324 1283 33047 27060 -16379
16543 -16379 -11377 86232 22758 -82470 -93190 -48393 -54872 -70218 -53320 -18958 -48627 -8639
16531 -8639 32008 28442 -24765 -32974 -69381 -65257 14803 37699 70113 63901 5570 15354 -23272
16518 -23272 -37841 -43469 -63160 -11897 100498 63021 51122 62556 -19869 14396 23600 1409
16506 1409 27785 -25113 -58493 -128229 -141651 -102817 -92498 -50729 30624 993 -79662 -110047
16494 -110047 -56588 3167 71894 58244 20647 4764 -10973 -20792 16210 100758 122346 67667
16482 67667 26636 -18795 -23826 14243 -7817 -15830 30506 630 38641 63808 122113 63092
16470 63092 97 -19746 -25197 5236 -14864 5517 -4616 -100164 -135750 -84507 -39361 -21469
16458 -21469 -8500 18966 16819 6694 75264 62482 62551 74083 50291 5604 -14017 -11609 14819
16445 14819 -2240 -2750 -33148 -65459 -77154 -16110 29071 39246 -1922 -14462 -42262 -103475
16433 -103475 -106361 -42170 41755 76425 49684 24835 39768 -11124 -91846 -133347 -107381 -98324
16421 -98324 -140999 -158722 -142738 -180939 -135326 -95346 -119233 -84520 -132679 -110721 -70547 -81443
16409 -81443 -157205 -97852 -95456 -130750 -144653 -129698 -92428 -89232 -104421 -119733 -108320 -89372
16397 -89372 -48170 -112561 -44229 -14314 9275 -6432 1270 -6222 -16802 -28006 -17223 -48531
16385 -48531 -36542 -40344 -109 -10954 -33619 -5232 2402 24071 -6788 -58763 -49539 -3810
16373 -3810 -3592 12643 2146 13391 48239 18472 -2119 7239 64645 29407 39 -2690 -32134
16360 -32134 -44678 -58701 -96159 -64249 -61057 40000 71995 6806 -94562 -123463 -157719
16349 -157719 -144376 -99047 -65778 -83020 -83312 -51485 -51001 -97285 -71870 -56170 -80699 -63514
16337 -63514 1257 -12801 -8642 19305 55210 70727 54951 33228 33654 -25519 -93899 -139196
16325 -139196 -94735 -34183 26183 48796 30165 -6731 -18387 1597 11764 47533 19461
16314 19461 -15066 -516 17862 16507 23837 30722 18348 5470 -10402 -22456 11319 62490
16302 62490 84946 142803 130385 7690 -112997 -150406 -121743 -160635 -163785 -111587 -87719
16291 -87719 -100693 -119237 -107814 -119067 -111917 -105373 -67400 -4062 -48825 27035 85316 91297
16279 91297 9210 -34397 -13 -17645 -53171 -2395 38157 38648 58100 11187 -94194 -123960
16267 -123960 -60333 14169 55409 52556 29003 32359 56095 -21097 -53095 -69724 -71126 -60906
16255 -60906 -88619 -55686 -42112 -15421 34514 -18160 -83760 -17503 42448 -26494 -125693 -111781
16243 -111781 -159880 -217492 -173111 -147218 -144779 -148313 -139231 -86021 -119038 -183069 -156227 -94312
16231 -94312 -87374 -103935 -74028 -69775 -73750 -103267 -37997 23918 -19285 -51620 -48971 -32517
16219 -32517 -57730 -28321 -29872 -1629 -21643 10863 26052 -36125 -26039 36448 9140 -48867
16207 -48867 -40492 -81256 -35078 3411 13792 31844 8480 -33413 -42219 -27552 -32812 -56462
16195 -56462 -83950 -73985 -76958 -35023 -12809 -85719 -151047 -61786 -39171 -46000 -134104 -121439
16183 -121439 -94941 -93176 -108399 -80619 -50633 -56773 -69360 -50071 -25960 10759 7590 -2467
16171 -2467 -50668 -47124 -10326 53577 20348 -40342 -60178 30656 22439 -50867 -40966 -91143
16159 -91143 -106317 -56725 -6532 -39135 -162760 -197915 -71992 10071 -16300 -41580 -64457
16148 -64457 -69915 -57822 -33023 -13042 -62682 -58853 -44295 -47728 -39642 -102599 -70517 -59950
16136 -59950 22578 47228 8588 33681 74419 123918 104963 71977 50671 69641 61051 14597
16124 14597 -1547 -77678 -69979 -40157 -30672 12618 21081 14678 -18192 -32340 -20003 -4317
16112 -4317 4898 -9240 -64079 -57606 -23349 52046 39143 4276 69264 63565 -12570 -23571
16100 -23571 -70611 -38451 -21382 21991 40181 46632 79276 99485 71283 68258 34469 26161
16088 26161 -6846 -91311 -69491 18225 51259 55174 53318 21557 -21412 -36210 -60063 -81773
16076 -81773 -60004 -6487 12541 5034 54713 40315 -21757 -42713 -89287 -28981 -12948 -53425
16064 -53425 -100320 -128443 -93414 -51123 -90258 -61415 -81145 -131646 -134349 -47372 19311 39172
16052 39172 19919 -29410 -36866 -71998 -89346 -61402 -119520 -132925 -125568 -60066 -28123 -65352
16040 -65352 -79494 -68668 -57499 -29222 -2794 -13000 -31566 -61029 -62671 -11783 617 -21373
16028 -21373 -18444 60499 84633 110207 87199 30421 -117088 -152001 -125695 -163443 -144858 -137264
16016 -137264 -159026 -132334 -129017 -105705 -99452 -86057 -40152 -8278 29249 50080 52492 27023
16004 27023 35271 50385 -520 38469 40764 2720 9818 19386 5359 -38288 -47811 7431 62217
15991 62217 21203 -67592 -89256 -44233 -24475 -26543 -19069 -19265 -36619 -19988 -155 -22456
15979 -22456 22867 23274 29530 45275 34530 3462 -39975 5039 -17461 69357 86048 8062
15967 8062 -55904 -31616 -12753 780 88423 115055 11918 -66676 -97718 -119091 -91257 -43705
15955 -43705 6325 -10796 -69155 -131795 -128304 -128072 -96810 -26433 -2067 -33419 -69441 -7908
15943 -7908 58377 12286 -42307 -40402 -15725 -30774 -41340 -6629 11042 -6584 -40251 -73656
15931 -73656 -52493 -72236 -81486 -106611 -133069 -76307 -60278 -23481 -8354 9890 13528 -23800
15919 -23800 -39660 -37071 -33836 -118593 -144743 -132345 -55800 18529 27457 -43970 -81068 -48362
15907 -48362 1109 -2326 -48359 -62851 -29062 -18192 -11686 -9446 35736 62585 47184 29096
15895 29096 -31678 -60098 -61428 15926 61067 51570 52050 79105 72644 -7792 -37936 29699 67193
15882 67193 67094 47915 34334 -13112 -49761 -28332 4453 -608 -73700 -130844 -100940 -54732
15870 -54732 -64412 -15395 71732 125859 82113 49552 33669 6534 61551 38853 44400 50082
15858 50082 13515 50011 44879 58523 77468 94849 103058 72527 -8984 -33892 -30570 28599
15846 28599 45694 49784 50772 88247 76653 25878 40945 32377 30706 72099 57846 -24805 -69265
15833 -69265 -36796 -11166 70087 64601 20627 -20510 -2026 32549 47363 66424 81251 35527
15821 35527 43373 47792 52307 38471 41422 26513 10632 44862 28032 -35928 -84463 -85453 -69856
15808 -69856 -54790 -30082 -30729 -40339 -40704 -22636 34723 53825 14230 -2114 -41941 -33851 -21480
15795 -21480 -63911 -37963 47712 37915 -31561 -74095 -121268 -181812 -76101 -5936 -37439 -96905
15783 -96905 -39221 26051 15257 -351 -17123 45529 42202 77808 15325 -5601 1347 10640
15771 10640 -6811 -38675 -55077 -64640 -80962 -115451 -119198 -95582 -29816 58877 56255 -41751
15759 -41751 -115704 -151502 -135127 -82297 -78533 -92057 -58805 -61361 -36492 57645 26035 -33776
15747 -33776 -33702 -53988 -84649 -97321 -7279 29652 -16032 -20921 -13233 -42923 -53875 -76529 -59435
15734 -59435 -68843 -74149 -68377 -81503 -96633 -133418 -181155 -142808 -54987 -4232 35521 61814
15722 61814 53866 77302 23717 -25039 25866 105788 51485 15758 61894 66713 1848 -46775
15710 -46775 -79059 -92502 -51906 -29938 -24275 -971 9068 7570 -27674 16599 9832 33600
15698 33600 36543 22706 -2033 -26958 -52987 -64818 -46718 -82559 -137088 -210695 -165437 -148447
15686 -148447 -130106 -61826 -64234 -46389 -80537 -76365 -84276 -17275 32925 5886 51717 61801
15674 61801 28709 -5982 -28974 10825 8995 54594 50024 43666 35106 -5732 -7616 25590 12551
15661 12551 -2905 22239 48460 -2275 -36570 -45987 18260 52458 4696 -16282 -30557 25669
15649 25669 -10986 -44697 -23636 39361 31737 -27509 -39211 -47996 27789 43516 71363 54954
15637 54954 -18602 -4786 3911 20893 -26464 -58041 -122450 -120359 -80135 -1427 84660 99890
15625 99890 79270 93023 102059 97423 77691 37091 15425 -12895 -39839 -52619 -76201 -98358
15613 -98358 -69194 -42648 -29891 26644 61136 49775 66069 48202 31698 18136 29039 19713
15601 19713 43656 -35613 -62218 -48109 -57932 -64813 -25749 -53802 -54920 3866 -15187 -47014
15589 -47014 -42911 -39353 -89366 -90964 -27599 -26778 -45685 -102713 -106216 -77179 -61301 -55653 -43795
15576 -43795 -44286 -71275 -108408 -76883 -67646 -102633 -119021 -85703 -105105 -62635 -48446 -67499
15564 -67499 -36513 -30823 -22998 -18228 -16938 -66625 -101529 -66768 -8913 17569 33747 -47100
15552 -47100 -26525 -10961 41333 71426 72998 62962 12906 -11972 -23091 -27548 -18780 -37548
15540 -37548 -43161 -9030 -22471 3987 57013 69171 25135 5072 55579 -20560 -94311 -16086
15528 -16086 70163 92993 80790 4381 -53213 -52710 16342 60588 90879 110151 83969 72833
15516 72833 21339 -62057 -117422 -116236 -39931 14929 19411 -54731 -60180 -85684 -108503 -77597
15504 -77597 -14510 3040 -31544 -16651 29032 71329 38886 19098 2916 4256 9105 48506
15492 48506 47589 27964 13136 26839 29327 22817 55452 103326 72110 42428 -13308 -25507
15480 -25507 14581 -203 -47656 -105033 -73285 30981 -3981 -7434 -27122 -15608 10781 47672
15468 47672 58951 40433 22823 7093 -54846 -81845 -111168 -90559 -69328 -25101 -5675 56924
15456 56924 7754 19567 19702 94189 142249 97427 -16277 -59945 -30925 -34501 -97756 -81753
15444 -81753 -92105 -31549 49855 70107 5039 -7129 13804 48883 -12136 -65526 -33116 -45929
15432 -45929 -38348 35216 26110 -16456 -24215 35575 70929 69768 43037 -13222 -26468 -75712
15420 -75712 -111946 -74803 -40377 -81511 -118124 -65416 44631 77808 21542 -21201 -13399 -8953
15408 -8953 -54993 -32223 -35599 -54508 -89734 -56972 -63279 -72012 -89610 -60696 -47609 332
15396 332 11458 -10068 -44057 -30375 -27126 -44082 -65344 -41937 -45102 -34567 -100192 -83172
15384 -83172 -42968 -63637 -72974 -112419 -127022 -87290 -76785 -14685 42862 63601 37810 22053
15372 22053 32678 81909 89646 59698 141037 99134 -13379 -51798 -66359 -44953 -20317 -30914
15360 -30914 -87287 -80670 -68744 -58200 -20994 -25794 -81312 -90163 -81340 -6725 35999 39288 66629
15347 66629 14203 -45197 -49869 -30510 23498 -10905 -2977 -12525 -14439 4288 7656 16229 20375
15334 20375 34409 68033 103870 54431 -1545 28096 -65156 -58955 -58983 -8611 65566 52153
15322 52153 33534 4971 -36418 -28674 -4866 26999 41770 34643 81891 163835 134011 89602
15310 89602 146014 121765 33739 47781 58829 96605 33696 -39910 -44142 50095 58073 3448
15298 3448 -12224 43657 90799 104802 77704 57661 -8203 -60362 -64509 -52990 -63833 -69260
15286 -69260 -36740 -71686 -97926 -116511 -10242 65632 70279 101968 73127 102693 92719 27678
15274 27678 -6846 -69504 -92799 -97483 -74491 -33256 -15564 -59254 -82885 -30067 -88967 -85602
15262 -85602 -30656 -4258 -14555 16089 19668 20273 -35591 -46232 -116581 -208853 -228714 -151373
15250 -151373 -113847 -118062 -105444 -74079 -24742 10015 -57036 -138894 -144562 -127594 -108537 -101028
15238 -101028 -123280 -137155 -119283 -44039 23680 54403 10624 -137818 -172288 -120555 -22173
15227 -22173 56209 42866 -7002 3495 38567 72022 73571 18333 99442 143671 112487 45737
15215 45737 -21429 -8797 53189 19562 -63275 -19146 -28614 -26442 13891 37465 5581 6128
15203 6128 53619 56073 94254 79378 54928 39267 41925 31682 31366 47597 4245 -3768 -77648
15190 -77648 -121411 -96082 -60236 -40642 7837 49811 67398 -6182 16232 102214 127145 97355
15178 97355 52123 34146 69625 73325 32114 -29912 -34452 -18044 11298 -7765 -41818 -29691
15166 -29691 -13549 14798 -33522 -89386 -85980 -81987 -42074 -13284 62917 52972 24128 58404
15154 58404 53422 13049 62720 37737 21639 70145 54419 -33664 -124493 -100989 -58134 53215
15142 53215 54206 24270 -43416 -39743 -50629 -75351 -61136 -45155 -83999 -110100 -64528 -8854
15130 -8854 104869 56774 -6296 -22683 52989 57938 30500 23957 16178 4481 -31810 -63261
15118 -63261 -33685 38856 65121 62438 -19696 47025 43561 41910 65186 86306 32599 23782
15106 23782 16652 46616 4881 32064 35037 76666 31667 -8309 -1725 -5452 9530 42400
15094 42400 49986 44938 70226 82712 83640 73552 72534 67133 48117 55313 -15207 -123606 -105585
15081 -105585 -105615 -52518 -2409 75855 121888 91124 41672 -20370 40938 42977 22708 -45597
15069 -45597 -48132 -93633 -67968 -69404 -106167 -82563 28244 109516 125657 161215 204746 159050
15057 159050 171782 200463 123690 37298 49728 57777 -21470 -7165 -8648 -94353 -81015 -20472
15045 -20472 36816 -5350 -40310 -88983 -101934 -65759 -1207 39429 44157 43983 40152 -1535
15033 -1535 -69686 -42458 63143 79996 -26518 -69426 -4932 28335 55510 48143 -42778 -117903
15021 -117903 -56682 -50085 -4241 30005 90446 120339 131180 53438 53121 98225 101015 55062
15009 55062 6530 -3968 -43243 -74215 -11537 -37504 -83676 -74385 -26299 19883 -9476 -36641
14997 -36641 -60767 -4166 19445 -23459 -85038 -123780 -97084 -60625 -16598 -1054 52883 43119
14985 43119 47891 101130 61307 20060 7569 16371 20050 24203 -10881 26192 87754 112483
14973 112483 155972 92085 2272 49593 62613 28347 -2849 37709 121890 170735 77472
14962 77472 26961 14352 470 -1020 10286 -16752 -9739 39209 7935 24438 64083 64239
14950 64239 31133 39245 47189 34119 30213 -19085 -42134 26869 50720 66427 61976 -55847
14938 -55847 -98658 -117498 -68467 -77741 -55934 10215 35352 141091 103446 -424 -54511
14927 -54511 -10682 109754 92837 11347 77519 108605 40391 31284 27747 -17650 25282 144373
14915 144373 255357 193336 77134 -20721 -48765 -63415 55653 71431 84942 31028 12176
14904 12176 22669 -11924 25160 55143 52857 -15595 -55916 -62523 -85623 -68360 4122 10625
14892 10625 65662 73635 63796 45401 30414 -48762 -62156 -36309 -5551 31737 45488 38839
14880 38839 11694 26328 139160 158643 106651 42045 55251 31667 -21325 -1188 41043
14869 41043 7987 -8603 30434 39318 -27653 -46018 -967 16140 60104 49631 19337 46943
14857 46943 45491 -12574 -6540 17190 -8195 19781 56946 77462 72084 76694 18283 26879 35779
14844 35779 -10767 -24024 -47019 -71187 -27011 3175 -51095 -54210 15860 38355 39804 45912
14832 45912 65129 84552 120609 124910 107010 60988 26313 29971 95813 124581 174492 181349
14820 181349 131123 68673 41551 30351 69552 18931 -41919 -42547 13046 80310 81632 19721
14808 19721 -2230 32062 19112 -24792 -32937 -19052 -32592 -36275 -23481 23563 57245 84883
14796 84883 78616 151844 157405 27303 -5499 24494 53897 68307 26447 59876 62328 70303
14784 70303 38116 53990 5072 88748 118210 17877 17924 94166 163673 164505 136481 163875
14772 163875 188418 147188 143668 157814 174136 147367 148061 67389 -28356 -7350 6302 23786
14760 23786 4330 -34731 -12312 -19886 -92290 -48581 3903 27576 33337 -2679 -34350 -61935
14748 -61935 -60789 -26967 -40417 -55851 -62846 -53926 -2552 40173 73083 81303 24007 -2187
14736 -2187 -7185 19984 70829 49574 59969 38096 23084 111336 129908 108568 64336 67379
14724 67379 85568 138170 163198 138691 59495 24563 148883 198345 155277 128286 76860
14713 76860 59174 61219 106906 31577 13916 107313 216770 231855 140011 132695 154037 149637
14701 149637 122434 123380 170821 182817 197962 247030 271542 341887 344890 314436 297425 308327
14689 308327 322906 340673 376123 442698 496474 534772 594487 624067 581453 611993 671291
14678 671291 705150 755245 772766 835685 931341 937247 934839 951932 1013326 1067095 1058407 1058581
14666 1058581 1074636 1093026 1109597 1165226 1196457 1195255 1262529 1334225 1334496 1239741 1133246 1054226
14654 1054226 992991 916463 827723 785720 734076 682503 670379 642188 595135 500822 491222
14643 491222 446929 412213 357772 354964 390776 391575 375231 339054 358057 386344 329210 293050
14631 293050 235486 267538 309858 309278 326953 338250 330744 319803 199278 199351 207385 217120 289573
14618 289573 364207 412517 438629 419602 414683 423259 462375 470500 466636 427624 427819 436591 361786
14605 361786 262085 222163 148773 119476 139455 106572 84546 124330 170476 212459 181895
14594 181895 244722 265215 264076 261498 203659 113474 66171 136711 160155 145964 154894 126883
14582 126883 77705 102221 127223 107730 104166 158812 259345 217485 168609 226173 154451
14571 154451 115900 198774 193168 135877 116330 116807 129602 127615 66389 23189 49931 117532
14559 117532 108141 97289 66630 71219 95148 135689 152557 166008 131527 167449 227058 229198
14547 229198 232434 176060 113150 84081 147569 153129 101406 96758 162724 173036 178788 190067
14535 190067 195476 157452 120543 102416 115907 138999 119767 62765 68621 14612 6811 29431
14523 29431 113387 142603 104649 126365 133154 136337 110731 134346 207769 192568 115087 100896
14511 100896 109262 94414 56377 99417 86767 90544 128110 114207 128978 95504 90746 166193
14499 166193 104780 52602 50749 106686 160189 133663 154985 201594 212205 247773 289576 373589
14487 373589 355730 357151 380081 342412 320049 300709 237188 209878 225853 276286 345250 421294
14475 421294 337559 336052 342140 342797 366893 343192 291712 282889 235188 190936 172439 193889
14463 193889 201176 144432 129019 140905 105562 140010 154358 111687 142961 231326 280787 239755
14451 239755 207356 205322 206395 212509 226074 204922 132297 139212 165561 218432 209047 191985
14439 191985 210487 201787 170374 144243 192019 223167 262846 209619 182911 186064 161446 195231
14427 195231 292912 331556 280546 270280 212536 174518 160928 182950 184843 203358 229418 277266
14415 277266 332271 329626 262197 185815 197361 250123 251501 213291 252323 226096 231459 231448 215891
14402 215891 219141 258545 188218 215195 293262 281853 234167 232646 237518 220765 226232 280378
14390 280378 228853 266320 236030 223001 243743 216156 241986 229030 231802 197506 251885 267824
14378 267824 269740 307869 310539 341555 335908 356904 423738 417160 394797 365988 358423 366249 391279
14365 391279 455598 458163 483388 490874 526729 540702 528844 542013 576949 530233 537886 554310
14353 554310 605267 678548 664377 600472 600147 599803 579745 581584 617879 577051 636361 657256
14341 657256 679156 746172 737411 763130 775790 726272 707841 751702 739293 733678 729431 718669
14329 718669 742354 831938 915448 947895 1007043 970483 939107 983342 1015854 993398 1009408
14318 1009408 982868 915696 1063374 1180076 1195668 1190820 1228859 1230942 1277775 1364338 1433848
14307 1433848 1494852 1605527 1701113 1739423 1786622 1767032 1819831 1886737 1980713 2092983 2126689
14296 2126689 2137531 2204285 2238286 2300656 2383799 2456690 2536448 2683827 2829952 2927535 3071173
14285 3071173 3198611 3289888 3413008 3526133 3646784 3777120 3898826 4080163 4282605 4475197
14275 4475197 4704946 4833308 4995213 5180710 5457424 5781198 6063858 6310010 6584675
14266 6584675 6889077 7293696 7733551 8153092 8646121 9145699 9679092 10245047 10859688
14257 10859688 11569909 12414758 13263371 14148231 15112011 16211758 17441729 18791749 20325763
14248 20325763 22015486 23876287 25924067 28247085 30907765 33838856 37122271 40760595
14240 40760595 44796111 49416290 54462456 60143281 66574166 73727361 81528353 89932791
14232 89932791 98966416 108506446 118336312 128144756 137473369 146023526 153365013 159106707
14224 159106707 162849099 164568343 164012587 161401034 156922422 150877987 143509850 135249318
14216 135249318 126596187 117802493 109119183 100809506 93002165 85760233 79185068 73253661
14208 73253661 67840142 62932133 58426857 54386927 50724623 47481986 44598418 41975516
14200 41975516 39582675 37464952 35579742 33816502 32174753 30739254 29474686 28242797
14192 28242797 27155797 26189631 25262224 24415444 23619017 22833710 22085373 21301099 20596731
14183 20596731 19890682 19309240 18717520 18041999 17334230 16647643 16038508 15404624 14756905
14174 14756905 14126219 13570033 13036314 12578433 12125430 11586759 11120200 10688777 10180588
14165 10180588 9672207 9279757 8920590 8607993 8311483 8039961 7722127 7434010 7210245
14156 7210245 6966151 6686971 6522279 6341661 6069073 5919999 5754111 5486361 5232752
14147 5232752 4980572 4695795 4494022 4353806 4153872 3984273 3780345 3610788 3427847
14138 3427847 3318960 3191513 3072391 2936215 2804849 2628920 2532101 2550148 2498320 2395510
14128 2395510 2338445 2279646 2160559 2037755 1968737 1854887 1745941 1671836 1665245 1657683 1588653
14117 1588653 1505945 1471091 1389102 1264670 1204723 1197085 1173153 1196341 1236869 1194382 1144161
14106 1144161 1169346 1174968 1178721 1190810 1177544 1147055 1125667 1109942 1029395 981517 948144 946155
14094 946155 946666 949577 951323 919206 842703 823352 840366 831722 879700 872928 812855 754032 697499
14081 697499 649783 606408 616129 615585 596655 604300 596475 585817 573910 540254 544903 435574
14069 435574 383965 427347 367511 364729 378757 364431 378876 412755 385131 447041 493865 543937
14057 543937 564664 589013 598208 533527 553374 524358 499214 555639 573293 505422 483821 532315
14045 532315 569554 596550 607475 630909 563763 480562 431867 440847 564771 662265 648313
14034 648313 613928 580913 517851 518217 485944 523756 517492 484749 490764 518315 516954 540952
14022 540952 529265 458656 469836 491228 526336 530442 493822 398973 424505 396798 400931 364001
14010 364001 278585 364309 470673 472666 459032 416272 406554 450320 378865 259276 173424
13999 173424 209171 286598 290217 197415 195579 122927 140169 202405 203656 196865 183765 170334
13987 170334 244125 282470 287528 240401 208053 162938 176336 233349 240393 203240 259022 244262
13975 244262 179450 202331 228273 188446 203932 191567 226054 281288 252049 231062 317816
13964 317816 293517 255823 206195 223764 175480 124525 88940 54864 58987 109482 138220 109910
13952 109910 104110 118205 76371 80796 138079 134123 166758 203925 145593 30128 -8362 19134
13940 19134 -3190 -50407 -18877 57305 111047 89580 88498 44122 -8494 27889 -12911 871
13928 871 96584 121117 67113 5111 -4367 81699 136362 204334 210954 155405 77547 65489
13916 65489 52917 34554 92089 107493 179929 192851 155575 145580 98805 121453 177527 167721
13904 167721 130914 102563 44415 53417 69754 40660 55791 126093 157682 160994 190411 200457
13892 200457 187932 174702 147448 153707 97567 87817 55464 32153 44575 141439 149636 71971
13880 71971 82990 36457 18696 16766 -30641 -18263 23848 67912 67975 121399 193027 141562
13868 141562 62444 54711 72014 36422 50331 39529 45436 29701 62175 91345 120094 104668
13856 104668 32973 73431 133857 77528 -408 -25149 42802 28252 8296 85525 61717
13845 61717 72300 41899 27137 86393 140238 161622 126754 123969 118950 56815 -20529 -70774
13833 -70774 -23227 37457 87744 44377 91435 31143 -4132 40866 -4275 -24698 -64794 -37786
13821 -37786 2124 -35490 -37665 -13776 30635 99028 157482 161880 136944 125554 114463 23005
13809 23005 22804 36747 1720 -21139 -23085 11280 29881 75034 104508 125645 132261 83034
13797 83034 1268 -1015 67893 103091 136949 125179 86914 85412 75945 115460 79216 40704
13785 40704 90937 160282 226345 340113 417203 410581 389085 438102 547163 671266 741627
13774 741627 759635 821708 883546 882513 916579 917811 889470 844635 836212 836249 806383 685564
13762 685564 626607 611952 594482 561296 499626 453406 412025 396379 407239 446553 443239 406576
13750 406576 333788 263117 242429 261116 340094 373678 327286 261952 236879 253612 205106
13739 205106 179888 175961 191055 182481 117446 44066 36723 102782 203752 192796 99578 156494
13727 156494 226192 205557 171535 97460 91234 125228 126396 109505 82938 64786 73586 131134
13715 131134 108307 85296 86713 70969 45931 31074 28039 -4095 -11658 26389 39661 49847
13703 49847 117088 111423 72833 136711 133497 63906 60824 -8537 -29493 -32990 -4185 20446
13691 20446 -10892 -21310 -35110 -57181 -73737 -31661 -7736 -60110 -28957 -11205 19040 32512
13679 32512 68440 -14935 -55768 4614 40810 77265 16592 -8548 -66738 -46616 -60278 -50376
13667 -50376 18528 116052 137769 151343 114532 119569 113778 67537 -13226 -49652 -64788 -37505
13655 -37505 -28833 -49245 41630 34829 5866 -16619 -12291 25294 75446 906 6459 37465
13643 37465 35523 -6279 -41523 931 49890 38796 -29404 -64192 -7871 35347 19441 -7213
13631 -7213 -68532 -58373 -67024 -35984 27151 76701 123219 148145 50686 28485 10079 82816
13619 82816 142713 88056 45980 -32909 -65532 -8803 1370 -10187 14840 20650 -12635 -27166
13607 -27166 48852 79924 106583 63742 -22065 -73394 -124512 -102250 -32685 2916 41646 47802
13595 47802 11861 -45586 -38194 8551 106383 120634 5020 -39332 -21504 -26721 -26175 -3050
13583 -3050 -60192 -78234 -132819 -148627 -89193 -70982 -5699 52808 46184 105113 53522 -23609
13571 -23609 -52924 -30946 29509 29458 13572 -3254 -250 25799 115842 115716 15391 -43944 -5003
13558 -5003 10402 -25966 -28069 13531 23893 12292 35217 39875 63551 81501 39091 -71613
13546 -71613 -43130 27371 -14967 -13521 3085 -31287 -21046 57561 75731 30224 2728 -11956
13534 -11956 -30788 -89195 -88019 -42309 -10599 -27558 1554 -67852 -112782 -118254 -82210 40352
13522 40352 56831 56153 64384 -2387 -24053 -39150 -8781 -11330 -38393 -42253 -64762 -174930
13510 -174930 -211790 -196242 -127232 14785 81961 85734 45590 34935 12546 -17039 -61779
13499 -61779 -74155 -61664 -88068 -70202 -941 31222 23958 40551 24138 41557 117322 125880
13487 125880 53806 -21360 -58293 -39196 -29319 -5403 44151 -4247 -40180 -1862 -10567 -62956
13475 -62956 -78899 -24202 58549 88594 64785 30298 -4890 -59134 -92264 -148264 -164733 -94407
13463 -94407 -69991 -38582 6129 17750 19101 -21747 -41857 -7619 16840 5699 37916 31748
13451 31748 -19808 -52545 -98342 -109899 -119369 -126836 -96506 -50796 -23284 37734 112733 84147
13439 84147 11590 -26502 13469 30851 -56068 -46683 -50011 -99405 -106210 -67450 -56651 -38047
13427 -38047 -32603 -5359 -65057 3942 34930 61860 -2284 -78018 -99582 -93007 -59833 -71806
13415 -71806 -87109 -89492 -101111 -108798 -150941 -132334 19250 83263 31636 -26313 -66514 -50040
13403 -50040 -43634 -46465 -75554 -27607 -38488 -37440 -48417 -25523 62679 4141 -65795 -102206
13391 -102206 -123577 -85411 -76035 -62903 -20957 2633 -3004 26731 60919 46281 16800 74707
13379 74707 149306 94555 32326 44911 -20736 -47066 -27770 32811 41530 12333 -4016 -30340
13367 -30340 -7692 31695 -83881 -83253 -36329 -28210 -102665 -131814 -93578 -74035 -32821 15635
13355 15635 -8213 -4590 -63071 -92391 -63432 -47254 -43196 -35815 -6668 -15170 10417 85548
13343 85548 37703 -10126 -1359 21455 24126 -59862 -61220 -13458 24720 9239 51933 51022 22020
13330 22020 -1847 -16177 -41604 -59131 -92806 -52445 81590 37546 -62546 -169283 -33719
13319 -33719 58767 62757 36949 -2020 8412 68074 70882 106046 107245 69986 38664 -38538
13307 -38538 -106316 -143992 -133981 -168974 -156293 -133347 -25295 11908 -57064 -112763 -140648
13296 -140648 -61496 -43382 -74039 -74597 -60322 -61364 -51143 -57105 -86270 -53635 -73971 -51726
13284 -51726 -57721 -33768 40885 62227 52778 4642 -21607 -13345 -9362 -1455 -13512 -27454 -36553
13271 -36553 -62492 -86186 -36569 -38711 -26222 -12236 29438 3389 -27497 22047 52124 31814
13259 31814 -3648 -15345 34419 -15443 -54610 -17152 4274 64284 45326 -1380 -44220 -73151
13247 -73151 -95351 -96471 -107454 -56723 -7110 23228 61306 59173 86352 79015 10131 45780
13235 45780 20462 11343 15218 -10413 -47623 -50179 16717 26674 92205 124699 95166 77095
13223 77095 2199 3431 -19192 -43816 11114 26420 59332 56204 24195 20791 35036 59598
13211 59598 40340 18667 30627 8083 -21369 -38573 -45931 -17781 -16442 -34193 -69743 -126836
13199 -126836 -82118 -98678 -82231 -30820 -38330 -67686 -57209 -18498 11554 -1975 47975 65855
13187 65855 49015 13714 -25809 -105549 -118545 -107291 -112933 -57038 -64276 -21359 7397 40054
13175 40054 33039 -37777 -46023 -48723 371 -38689 -70190 -62418 -56390 -43207 20801 15553 -38202
13162 -38202 -53821 -1362 31956 92101 76933 43346 60034 72355 265 -99323 -95751 -83546
13150 -83546 -73055 -66031 -29042 54756 93428 -2492 -27815 26381 -23501 -50708 -59779 -34978
13138 -34978 -42555 -66060 -24015 38733 -4917 -94374 -83618 3705 21550 42828 89709 54300
13126 54300 -23092 -18873 -51216 -31613 -14063 -18930 -48582 -67556 -105254 -101446 -86340 -25239
13114 -25239 14040 13604 -45403 -75907 8449 58833 32667 2111 -22144 10183 30668 -10487
13102 -10487 29733 25042 19199 -34277 -58955 -39604 48539 96041 84112 35193 23115 12919
13090 12919 -4684 20887 687 12286 49872 9523 -26213 -54153 -49124 -70085 -43287 -3698
13078 -3698 -45069 -85536 -83391 -26808 -14216 -63816 -69671 -7729 16383 -57336 -63438 -92900
13066 -92900 -49036 -30247 -106987 -74946 -50666 -31737 -3579 -20932 -32194 -42964 -79908 -92332
13054 -92332 -83472 -72856 -33259 -31166 39144 116413 67356 9130 34837 -13048 -97699 -95577
13042 -95577 -74702 -62380 28371 48725 57110 62832 52520 14145 -2475 3052 -31473 -19867
13030 -19867 -20755 20482 5939 -28643 -43003 -8842 -47000 -61665 -44684 -76979 -103636 -95687
13018 -95687 -155144 -142201 -171209 -169676 -133497 -95371 -108038 -72149 -85092 -45803 23411 84248
13006 84248 97535 70106 3740 -18503 42145 118941 149292 122265 81206 63005 -145 40924
12994 40924 102913 81054 -23235 -34119 -21736 -74068 -83227 17165 51678 -19650 -151975
12983 -151975 -171811 -155055 -54214 -28799 -31658 6435 14140 -30468 -43231 -13065 49218 82789
12971 82789 97705 36332 -15870 -10232 -153 -10685 -17642 42313 64462 77729 73347 116969
12959 116969 124795 75081 47762 90194 122101 84997 24708 -25583 -12048 -22182 6746 -9038
12947 -9038 14270 27036 21040 50904 69534 18460 6072 67890 11528 -29349 -36185 -44391
12935 -44391 -44114 -11606 -6989 -23685 -44814 -44689 -27853 -63917 -97912 -117128 -156792 -129069 -149429
12922 -149429 -83854 -21322 51082 83759 83049 103394 140590 93435 25724 -69310 -93337 -106344
12910 -106344 -84921 -46437 -21061 16496 35503 -10318 -77850 -71761 -12637 -18230 -1639 -25215
12898 -25215 -21418 -92862 -162333 -171267 -134451 -122795 -79126 -74168 -29841 -15944 -26410 -6486
12886 -6486 -11299 56366 47461 -32457 -82095 -69084 -68947 -92839 -88167 -69487 -100267 -138888 -107979
12873 -107979 -53442 -53175 -68587 -140307 -75984 -21964 17963 642 -65020 -71863 -9796 127
12861 127 -41145 -54197 7407 -50288 -108907 -55073 -60662 -108149 -99911 -112207 -61174 -30695
12849 -30695 -83963 -91697 -22939 19419 -34155 -128512 -134718 -102605 -94562 -93926 -132925 -25567
12837 -25567 -54721 -122563 -168801 -225014 -203317 -157688 -161597 -154610 -135084 -130311 -34067 11956
12825 11956 52188 -16545 -46916 -83493 -98669 -69907 -17792 42047 41818 33098 10952 -20647
12813 -20647 -52217 -122846 -104974 -2739 15813 -4505 -53974 -47176 36252 95167 107645 24827
12801 24827 -29564 -29149 -57532 -60107 2152 54289 1820 -46445 -35836 -40713 -124833 -194877
12789 -194877 -190662 -108386 -51162 -17116 22467 -23249 3164 4910 600 15103 11043 -24319
12777 -24319 -93661 -133657 -143760 -131010 -113664 -51034 -61233 -78220 -14452 -1842 -22920 2427
12765 2427 15442 8754 36034 21373 15449 -29896 -82262 -80846 -85504 -89756 -70438 -79343 -23186
12752 -23186 72863 61386 40169 47786 26543 53553 53107 25275 53222 108980 107506 83057
12740 83057 57615 28951 1721 57376 86379 71201 55851 -3248 -20658 8105 -13399 2953
12728 2953 -46125 -49333 -10140 5400 -23344 16636 24143 -3975 36511 125299 112395 -90248
12716 -90248 -170396 -135725 -100909 -55243 -93288 -117518 -121735 -123868 -78783 10580 -36267 -47654
12704 -47654 -32598 -19303 -17122 -13119 -8495 5980 -15088 -49605 -98853 -55932 -88931 -71940
12692 -71940 10234 2517 7113 -1423 -72264 -18495 10449 6634 8824 -22690 -2317 -16681 -23405
12679 -23405 -3489 35623 83405 49699 -10820 -31946 51394 93605 82052 -5664 -46127 10895
12667 10895 97127 116775 112436 98450 50172 61066 79803 52111 54386 22312 -14456 -50900
12655 -50900 -82988 -106655 -100230 -115203 -47073 -59311 -69843 -55104 -8275 26081 21437 -3840
12643 -3840 14366 49620 -22890 -121755 -113671 -67821 -61909 -45363 -39676 -33963 -25431 -50685 -79318
12630 -79318 -52356 -12414 4208 28888 -218 64858 64535 15673 -17104 -17698 17859 17571 22521
12617 22521 68033 103420 124910 126414 50536 18008 27087 17060 6989 -10918 -2788 33059
12605 33059 79764 83084 94258 136700 102259 31369 39559 20268 56637 17299 36880 27787
12593 27787 7065 7969 34971 68965 34911 12002 -3994 -16970 -141571 -115558 -23701 -24532
12581 -24532 -92674 -117423 -69004 -95152 -155639 -175754 -97608 -43148 -60066 7451 56042 72061
12569 72061 -2956 -63707 -76447 -22325 34618 51045 62829 56857 -4808 -35305 4136 7610
12557 7610 -80526 -115469 -108298 -127474 -112045 -38473 37296 82118 93482 64602 -27823 -43801
12545 -43801 -42558 23555 -23274 -22021 11425 -4960 7582 62968 4503 11706 76202 132040
12533 132040 57024 -3619 45964 25293 -56546 -30245 51297 45805 -5139 -4420 -12593 -15755
12521 -15755 -1707 65380 113604 155211 206686 182896 112188 44947 14352 11749 -3991 30490
12509 30490 71149 8134 -41228 626 20819 19218 48271 12726 -57097 -35135 -13914 -18739
12497 -18739 -37161 39418 70734 5215 -51095 -31630 -37344 -98474 -161801 -104277 -33160 -23555
12485 -23555 -92922 -109047 -56085 49146 111477 142471 88314 28298 21636 62630 65628 44707
12473 44707 96228 88555 119099 161537 135703 135845 166803 185389 220047 194685 98258 -4511
12461 -4511 8245 21372 15732 -947 -19170 5048 109169 160260 133364 81053 22473 54779
12449 54779 52066 57945 37464 49262 14412 6669 29409 30714 111577 122613 51881 47441 -10280
12436 -10280 -84120 -36718 38760 126498 133939 152523 152102 106479 53367 51240 22703 -54473
12424 -54473 10886 39612 7585 55433 83702 107444 9144 -7146 -27175 -48721 -6274 -46679
12412 -46679 -89904 -69889 -1395 -31163 -31044 -795 -11754 -102920 -108972 -65366 -61830 -57082 -13590
12399 -13590 23119 55808 83419 41242 37706 65802 48174 -58449 -59675 -17280 38970 -17557
12387 -17557 -108546 -121217 -103799 -58284 -33477 -87483 -46750 -17478 -19012 -22935 -35978 -23748
12375 -23748 -45807 -141871 -180086 -152517 -102708 4842 15967 -80246 -80954 -76552 -50796 11763
12363 11763 -10842 -14004 -33371 -85030 -52979 47377 64002 978 -6108 -58636 -60740 46135
12351 46135 74013 98798 33728 18490 -78267 -132236 -54525 -55306 -139526 -166657 -73592 39593
12339 39593 3405 -97009 -49142 -14909 -29841 -10151 -32659 -18482 18789 63504 54594 -11772
12327 -11772 -8774 29067 11441 78668 46474 11833 49581 47105 22270 -15490 -22530 -42149
12315 -42149 -87790 -52337 31459 89795 44576 -26271 505 29952 -14829 -46564 -19260 35575
12303 35575 61913 51015 48723 12689 5330 33684 4090 -9444 -79803 -84341 -12272 37317
12291 37317 7757 -10841 -6250 -17121 -19203 -15656 -30204 -14572 -4364 -63169 -89389 -110171
12279 -110171 -83962 -63493 -68512 -77036 -55544 -88559 -56148 -26236 19260 34212 86195 67655
12267 67655 49814 30065 40900 69216 43462 1536 -73718 -82648 -49457 9859 -12078 -62816
12255 -62816 -12604 -41230 -66157 -21102 10268 54969 78051 39904 5735 -9307 -51264 -118787
12243 -118787 -94834 -7887 -30359 -28041 65513 46176 28056 34989 74619 62229 33146 17377
12231 17377 -56755 -92342 -95908 -68243 -59654 -43166 -83970 -36157 27458 -5072 -50339 -75230
12219 -75230 -92395 -39744 6535 67 12034 -17613 -29806 -14131 -16768 2225 -1508 33137
12207 33137 64729 -63 -27220 -102536 -85936 -66239 -69186 -62600 7953 2314 -28588 -75185
12195 -75185 -57798 -51042 -68486 -44498 -80423 -37735 55049 7221 -28572 -17303 -25459 55257
12183 55257 102659 49301 23579 50831 50689 38535 62821 160966 102829 64063 45031 44826
12171 44826 35280 2304 -20179 23779 33668 -8727 -73431 -105960 -107864 -58606 -60458 -79195
12159 -79195 -103524 -78427 -70721 -51834 -57040 -10082 55190 56970 28447 -59992 -98849 -113283
12147 -113283 -57021 -61851 -61980 -16566 -13377 -47623 -63940 -55139 -785 -3603 44103 41076 27041
12134 27041 14127 88534 134402 129348 63859 28907 67938 31044 9059 -16444 43766 37931
12122 37931 4733 82874 93969 47995 -3288 16888 -41676 -72913 -16763 107550 113861 39567
12110 39567 -52909 -118121 -99943 -75661 -127747 -161604 -99509 -66502 -69333 -53019 -10602 44518
12098 44518 97081 110899 15303 25207 59667 57951 10191 25285 62634 104324 77577 65532
12086 65532 91793 102752 105820 131452 106411 97707 111407 115740 47573 459 -7622 8015
12074 8015 -66753 -117308 -65272 -29712 -828 -14709 -6053 -49558 -46345 -9295 32297 112438
12062 112438 159020 136295 140384 161054 191027 99176 55664 45879 59993 -16286 -70477 1526
12050 1526 23390 37747 47321 65386 -16382 -51220 -22805 1135 51541 80055 58199 43584
12038 43584 25820 -29626 -94545 -68134 -35778 -49448 -61976 -41797 -31279 12326 85964 119499
12026 119499 37532 36292 46232 -65062 -82815 -57644 -41520 37850 39086 -13589 -29436 -44335
12014 -44335 8351 -20084 -19653 -9708 -20871 15170 -24910 -75942 -59767 -46822 -128291 -160616
12002 -160616 -179841 -117454 -76060 -30779 782 -7254 2824 -2228 -9548 -18576 8628 44956
11990 44956 49737 -33268 -100330 -106788 -138787 -82247 -2652 -32242 -16663 -67623 -89759 -83457
11978 -83457 -104699 -52944 54140 88248 13862 18910 9152 49965 91380 65186 23402 50801
11966 50801 57763 39571 14906 3477 20235 16755 5051 82560 125357 44803 4374 1058
11954 1058 28108 50448 55401 21131 -25381 -87828 -70402 -14543 -40303 54278 99199 19486
11942 19486 -17302 31935 25603 -16865 -101811 -74156 -38214 -19242 1334 9010 12264 45768
11930 45768 23147 -93235 -147031 -188983 -183905 -181226 -153803 -88810 -38458 -50881 -67319 -36949
11918 -36949 -46847 -27141 -74215 -98180 -134739 -152341 -65069 -20162 6375 -23739 -69043 -76013
11906 -76013 -43552 -48110 -76250 -29205 -18028 -29698 5613 -2668 -57011 -20395 25855 32277
11894 32277 77871 123020 70646 6615 25061 -5200 -46420 16586 61471 76634 93454 70806
11882 70806 46848 -7473 -55563 -61414 -92549 -98246 -103832 -105423 -90585 -98220 -78192 -88833 -103621
11869 -103621 -55620 2145 8017 8532 12880 6645 11632 42635 -2182 -6763 -12093 32291 79521
11856 79521 45369 -28702 -73036 -101433 -101791 -116373 -62965 -8868 -8350 -2046 24276 -1560 -37068
11843 -37068 -75679 -64874 -72577 -55766 -74352 -100742 -79677 -17371 31418 38021 3066 -46143
11831 -46143 -41635 21339 23927 8449 37690 8860 -21231 -65704 -83366 -91316 -98204 -59961
11819 -59961 32215 23916 97403 97478 45997 18280 13701 -29895 -56107 -92525 -62096 -55280 -45207
11806 -45207 34117 96928 95960 85734 55634 24876 65796 124095 45789 -37914 -16059 -39344
11794 -39344 -46550 -32370 15112 34731 -8891 -84954 -51192 -9970 -34766 -43461 -5255 -12837
11782 -12837 -61737 -127350 -121812 -115257 -62450 -11788 -13048 -12297 -5770 -60779 -126316 -153087 -200212
11769 -200212 -215194 -200467 -139524 -102409 -88195 -66152 -45435 -90587 -54695 -50060 -90898 -96509
11757 -96509 -94201 -68673 -17864 19612 -37452 -173273 -126617 -30959 -54856 -43703 -13565 -7777
11745 -7777 -15506 13080 31101 46949 33795 2089 23204 65695 87295 35078 -18278 -14993
11733 -14993 11160 7036 36272 58474 22538 -61787 -78941 -41232 6133 61291 111091 110259
11721 110259 56792 -19298 -41620 16622 47954 27591 22705 -15920 -53829 37808 91698 52832
11709 52832 33696 33275 -24610 19086 34573 1313 17609 8197 -33134 -43651 -78883 -78354 -84747
11696 -84747 -94738 -103628 -125111 -133627 -58594 12253 21538 57072 -2191 39532 69866 51510
11684 51510 36958 -30965 -60153 -33112 46821 33384 -7138 37408 37528 101607 92274 -32743
11672 -32743 -18115 32061 55888 59239 52341 1946 -40054 -25540 -17176 -57495 -57536 -48653 -43082
11659 -43082 -76798 -86938 -77906 -100459 -82129 -31034 -20745 8860 -28221 -72050 -47851 -29797
11647 -29797 -69359 -79384 -46662 -40758 -56827 -53980 -64987 -19450 103909 93363 68264 277
11635 277 -9790 5717 -26607 18571 -26420 -91746 -96314 -71925 -33014 42909 85113 32462
11623 32462 -23717 36472 89669 65079 65951 26840 36413 66716 99053 59008 6822 -8280
11611 -8280 -73311 -107510 -105717 -70937 -29519 -35518 -31298 -21002 35876 30033 23251 -65409 -26710
11598 -26710 30280 -104 -27333 -15993 -65457 -48132 12284 72762 41228 -4207 -503 -17320
11586 -17320 -27796 -3181 85597 126430 94911 51424 41424 -8630 -66123 -97958 -41051 -26855
11574 -26855 -55421 -75625 -35292 -77336 -79227 -53704 -67488 -98412 -94454 -64479 -68173 -62663
11562 -62663 -23358 -36871 -34992 -99167 -171495 -202437 -107099 -16913 15322 -54683 -85082 -80268
11550 -80268 -116703 -74158 -70882 -94029 -150061 -101931 -67566 -58762 -42734 31566 27068 15412
11538 15412 212 17941 50534 32959 -48031 -88114 -92064 -64251 -111220 -90273 -97088 -92716
11526 -92716 -48397 -90481 -166621 -166766 -162915 -122973 -114739 -142987 -145105 -125269 -11532 9712
11514 9712 46784 16509 -88395 -123577 -89816 -71678 -72504 -7025 -4210 17438 20021 1400
11502 1400 -31615 23380 33587 44332 10656 -43001 -67237 -91487 -90193 -58918 -36628 -25048
11490 -25048 -43206 -61939 -68503 -22523 -13983 -51578 -124676 -163721 -193061 -141851 -63137 -62623
11478 -62623 -63955 -42577 -63581 -38258 -25198 -71725 -79605 -94399 -154391 -140601 -32347 54295
11466 54295 72461 65872 99694 130033 107839 68294 77591 21441 -42176 -9935 116959 153656
11454 153656 83715 59196 24169 35407 7142 18749 28014 -86353 -114278 -56405 -21464
11443 -21464 -43679 -2743 -5913 4392 -4510 34365 78772 86442 65659 -2754 -21927 35014
11431 35014 21046 15078 -8712 -76148 -76632 -7435 35086 -20993 -24125 -62706 -29333 14620
11419 14620 103868 164576 113620 18179 28372 97681 107959 -6074 -76090 -115166 -92047
11408 -92047 -49993 -3010 -23460 -138401 -126733 -180290 -237095 -229035 -185933 -142375 -149004 -128330
11396 -128330 -82080 11329 36933 -11240 -29964 -40585 -52159 -18260 51945 39896 62436
11385 62436 63607 11874 20649 48341 84184 76701 72522 81482 75900 -51 -78420 -110041 -111669
11372 -111669 -121353 -49897 37489 17668 -109042 -118670 -105830 -96927 -107443 -97026 -74311 -102838
11360 -102838 -78927 -106608 -71388 2792 -19076 -90286 -154419 -112078 -35019 -37439 -92832 4702
11348 4702 13763 -37689 1635 13814 58000 40505 40592 9868 66071 50528 -15147 -100900 -63971
11335 -63971 -7177 -1803 -7462 29780 4215 -2174 45895 57350 40406 -9395 -48483 -81581
11323 -81581 -52199 -74224 -102720 -82928 640 9030 -13339 -15711 -16057 33774 22204 -67879
11311 -67879 -93083 -67941 -109351 -109830 -7253 44241 57194 -3970 -23782 -49223 -22577 3645
11299 3645 -10513 -16022 4 -16535 10147 49094 -3510 -17389 -5498 -52064 -37740 -23218
11287 -23218 101605 144515 48184 49881 43407 18305 306 25646 52913 4820 53965 85036
11275 85036 74660 81012 46298 46427 67853 38882 2145 2837 -75794 -69466 -30640 -9071 -7040
11262 -7040 -22949 -5757 7392 35562 5787 -76891 -58541 -38998 -10686 -30737 -15967 4759
11250 4759 -17687 -39149 17484 94753 89834 82393 136506 92793 27883 32424 91182 61795
11238 61795 52894 55059 16822 63575 9606 1076 -19619 -79273 -77099 -52219 15298 19718 56348
11225 56348 40270 -13403 25093 67938 32591 11519 42688 99159 110380 72699 78952 87294
11213 87294 143591 77307 56804 -10326 42190 102854 79026 52354 48878 7074 -54784 -79771
11201 -79771 -66798 -54047 -46540 -28570 -62979 23918 56244 40184 41622 44423 20758 -21250
11189 -21250 -14640 -7946 -56164 -19229 23669 53104 61132 19010 59191 117306 133858 53546
11177 53546 76127 138460 151800 151357 161854 172529 110971 41234 49179 55276 100350 3991
11165 3991 -9273 -26733 39846 35177 -7945 -30598 -12065 -27071 -92534 -90627 -93856 -132740
11153 -132740 -140598 -145291 -146139 -95450 -122297 -146930 -98106 -64162 -59705 -99354 -33199 -60330
11141 -60330 -126770 -142407 -173509 -151867 -52309 -6611 29898 69199 65996 46048 83898 35815
11129 35815 -34449 -38593 -31017 -31180 7837 47620 108498 120370 76014 348 -7914 -17922 -47409
11116 -47409 -9511 -31977 -16702 -34718 -9552 -388 8253 64832 83583 77184 53024 50978
11104 50978 60790 87768 73774 22185 -61501 -30922 40019 -7870 8358 -27943 -33255 6775
11092 6775 -9414 22633 90078 49987 36980 14723 -721 41973 22685 -16923 -23872 -53604
11080 -53604 -23732 -13791 8621 3350 -24714 -39871 -52208 -63890 9041 101325 -9775 -58391
11068 -58391 -45747 -46345 -79166 -108978 -88067 13878 49438 60687 48997 56653 15001 -16887
11056 -16887 -56708 -30966 55280 26402 -15720 -102059 -122613 -62892 12482 81313 73224 63147
11044 63147 81361 61986 -12187 12587 43286 17824 -27698 30237 39415 19466 -61622 -49972
11032 -49972 -47533 -79246 -43684 25616 56066 21091 50070 39022 13926 57815 94556 63371
11020 63371 -28741 -58338 -36270 13204 32082 25788 -569 -6015 59028 64124 133827 111751
11008 111751 29913 30655 43318 68339 60400 24217 34710 5019 -70881 -4174 113235 107948
10996 107948 36209 15445 -12915 -28882 23366 57156 9662 8825 22738 43672 36878 -8443
10984 -8443 -72058 -70579 -48249 -71211 17666 -1446 -10330 -9166 -19075 -92868 -128937 -100363 -155605
10971 -155605 -131682 -82760 -54125 -42287 16331 5551 -1877 -9407 40431 65479 45501 79679
10959 79679 90001 42414 -21498 -13932 -77351 -72473 -1639 25963 67657 63300 74681 61648
10947 61648 34329 15877 42101 50050 98963 120104 68340 41281 86324 136966 136074 156476
10935 156476 137208 167487 178142 82042 48331 50116 71414 106679 96939 90126 125595 129020
10923 129020 138179 118151 121524 75297 95843 69330 6195 -80645 -136292 -164347 -106778 -79365
10911 -79365 -39160 -62273 -10028 51712 64421 17739 3005 -39163 -15991 7876 45551 45051
10899 45051 22029 -18952 -34276 4843 34258 43870 24126 -58053 -81998 -92450 -55123 -63834
$$ [...]
##END NTUPLES=NMR SPECTRUM
##END=
