##TITLE=Analysis number 311893
Compound Code cc 41714
Book Reference 431/155
Project Code adrs
Chemist Name janea
##JCAMPDX= 6.0         $$ Bruker NMR JCAMP-DX V2.0
##DATA TYPE= NMR SPECTRUM
##DATA CLASS= NTUPLES
##ORIGIN= Bruker BioSpin GmbH
##OWNER= NMR
$$ XWIN-NMR		Version 3.5
$$ Tue Jul 19 11:21:56 2005 GMT Daylight Time (UT+1h)  MAYBRIDGE\NMR@NMR_250MHZ
##.OBSERVE FREQUENCY= 250.131544655141
##.OBSERVE NUCLEUS= ^1H
##.ACQUISITION MODE= SIMULTANEOUS (DQD)
##.ACQUISITION SCHEME= undefined
##.AVERAGES= 16
##.DIGITISER RES= 18
##SPECTROMETER/DATA SYSTEM= dpx250
##.PULSE SEQUENCE= zg30
##.SOLVENT NAME= DMSO
##.SHIFT REFERENCE= (INTERNAL, DMSO, 0, 16.522)
##AUDIT TRAIL= $$ (NUMBER, WHEN, WHO, WHERE, WHAT)
$$ ##TITLE= Audit trail, XWIN-NMR		Version 3.5
$$ ##JCAMPDX= 5.01
$$ ##ORIGIN= Bruker BioSpin GmbH
$$ ##OWNER= NMR
$$ C:\u/data/dgb/nmr/ADRS/6070/pdata/1/auditp.txt
$$ ##AUDIT TRAIL=  $$ (NUMBER, WHEN, WHO, WHERE, WHAT)
(   1,<2005-07-19 11:21:35.93 +100>,<MAYBRIDGE\NMR>,<NMR_250MHZ>,
      <created by zg, POWCHK disabled, PULCHK disabled
       configuration hash MD5:
       62 19 C7 07 E1 42 D1 B7 37 6C 3D D0 77 39 F9 E6
       data hash MD5: 64K
       B2 1C 90 D9 BC BC 92 10 EA D8 76 A6 89 0F 78 EA>)
(   2,<2005-07-19 11:21:46.71 +100>,<MAYBRIDGE\NMR>,<NMR_250MHZ>,
      <Start of raw data processing
       ef LB = 0.3 FT_mod = 6 PKNL = 1 SI = 32K 
       data hash MD5: 32K
       23 9E BA A0 B9 FB 07 D7 1E 43 4F 95 FE 02 E7 23>)
(   3,<2005-07-19 11:21:48.83 +100>,<MAYBRIDGE\NMR>,<NMR_250MHZ>,
      <apk 
       data hash MD5: 32K
       E2 64 F7 CD F8 9E 3D B5 2E 38 CE 51 50 AC 4E 02>)
(   4,<2005-07-19 11:21:49.57 +100>,<MAYBRIDGE\NMR>,<NMR_250MHZ>,
      <abs ABSG = 5 
       data hash MD5: 32K
       38 C0 44 E7 7C C3 D2 9B 11 89 C5 0E 22 3A 35 6F>)
$$ ##END=
$$ 
$$ hash MD5
$$ D7 20 F4 BA B0 FE E3 78 BA FE F7 7E FB F0 DB B1
##$RELAX= 
##$RELAX= 
##$RELAX= 
##$RELAX= 
##$RELAX= 
##$RELAX= 
##$RELAX= 
$$ Bruker specific parameters
$$ --------------------------
##$DU= <C:\u>
##$EXPNO= 6070
##$NAME= <ADRS>
##$PROCNO= 1
##$TYPE= <nmr>
##$USER= <dgb>
##$AMP= (0..31)
100 100 100 100 100 100 100 100 100 100 100 100 100 100 100 100 100 100 
100 100 100 100 100 100 100 100 100 100 100 100 100 100 
##$AQSEQ= 0
##$AQ_mod= 3
##$AUNM= <au_zg>
##$AUTOPOS= <15 >
##$BF1= 250.13
##$BF2= 250.13
##$BF3= 250.13
##$BF4= 250.13
##$BF5= 500.13
##$BF6= 500.13
##$BF7= 500.13
##$BF8= 500.13
##$BYTORDA= 1
##$CFDGTYP= 0
##$CFRGTYP= 5
##$CHEMSTR= <none>
##$CNST= (0..31)
1 1 145 1 1 1 1 1 1 1 1 1 1 1 1 1 1 1 1 1 1 1 1 1 1 1 1 1 1 1 1 1 
##$CPDPRG= <>
##$CPDPRG1= <>
##$CPDPRG2= <>
##$CPDPRG3= <>
##$CPDPRG4= <mlev>
##$CPDPRG5= <mlev>
##$CPDPRG6= <mlev>
##$CPDPRG7= <mlev>
##$CPDPRG8= <mlev>
##$CPDPRGB= <>
##$CPDPRGT= <>
##$D= (0..31)
0 1 0 0 0 0 0 0 0 0.06 0 0 0 0 0 0 0.0002 0 0 0 0 0 0 0 0 0 0 0 0 0 0 
0 
##$DATE= 1121768495
##$DBL= (0..7)
120 120 120 120 120 120 120 120 
##$DBP= (0..7)
150 150 150 150 150 150 150 150 
##$DBP07= 0
##$DBPNAM0= <>
##$DBPNAM1= <>
$$ [...]
##$SUBNAM7= <"">
##$SUBNAM8= <"">
##$SUBNAM9= <"">
##$SW= 20.6930455092707
##$SWIBOX= (0..15)
0 0 3 0 0 0 0 0 0 0 0 0 0 0 0 0 
##$SW_h= 5175.983436853
##$TD= 65536
##$TD0= 1
##$TE= 295.16
##$TE2= 300
##$TE3= 300
##$TEG= 300
##$TL= (0..7)
0 120 120 120 120 120 120 120 
##$TP= (0..7)
150 150 150 150 150 150 150 150 
##$TP07= 0
##$TPNAME0= <>
##$TPNAME1= <>
##$TPNAME2= <>
##$TPNAME3= <>
##$TPNAME4= <>
##$TPNAME5= <>
##$TPNAME6= <>
##$TPNAME7= <>
##$TPOAL= (0..7)
0.5 0.5 0.5 0.5 0.5 0.5 0.5 0.5 
##$TPOFFS= (0..7)
0 0 0 0 0 0 0 0 
##$TUNHIN= 0
##$TUNHOUT= 0
##$TUNXOUT= 0
##$USERA1= <user>
##$USERA2= <user>
##$USERA3= <user>
##$USERA4= <user>
##$USERA5= <user>
##$V9= 5
##$VALIST= <valist>
##$VCLIST= <CCCCCCCCCCCCCCC>
##$VD= 0
##$VDLIST= <DDDDDDDDDDDDDDD>
##$VPLIST= <PPPPPPPPPPPPPPP>
##$VTLIST= <TTTTTTTTTTTTTTT>
##$WBST= 1024
##$WBSW= 4
##$XGAIN= (0..3)
0 0 0 0 
##$XL= 0
##$YL= 0
##$YMAX_a= 297691
##$YMIN_a= -359152
##$ZGOPTNS= <>
##$ZL1= 120
##$ZL2= 120
##$ZL3= 120
##$ZL4= 120
##$ABSF1= 16.522
##$ABSF2= -4.171173
##$ABSG= 5
##$ABSL= 3
##$ALPHA= 0
##$AQORDER= 0
##$ASSFAC= 0
##$ASSFACI= 0
##$ASSFACX= 0
##$ASSWID= 0
##$AUNMP= <proc_1d>
##$AZFE= 0.1
##$AZFW= 0.1
##$BCFW= 0
##$BC_mod= 0
##$BYTORDP= 0
##$COROFFS= 0
##$CY= 12.5
##$DATMOD= 1
##$DC= 0
##$DFILT= <>
##$DTYPP= 0
##$F1P= 14.0000005364418
##$F2P= -0.99999901652339
##$FCOR= 0.5
##$FTSIZE= 32768
##$FT_mod= 6
##$GAMMA= 0
##$GB= 0
##$INTBC= 1
##$INTSCL= 1
##$ISEN= 128
##$LB= 0.3
##$LEV0= 0
##$LPBIN= 0
##$MAXI= 10000
##$MC2= 0
##$MEAN= 0
##$ME_mod= 0
##$MI= 0
##$NCOEF= 0
##$NC_proc= -5
##$NLEV= 6
##$NOISF1= 0
##$NOISF2= 0
##$NSP= 0
##$NTH_PI= 0
##$NZP= 0
##$OFFSET= 16.522
##$PC= 1
##$PHC0= 267.0692
##$PHC1= 25.30963
##$PH_mod= 1
##$PKNL= yes
##$PPARMOD= 0
##$PSCAL= 4
##$PSIGN= 0
##$REVERSE= no
##$SF= 250.13
##$SI= 32768
##$SIGF1= 0
##$SIGF2= 0
##$SINO= 400
##$SIOLD= 32768
##$SREGLST= <1H.DMSO>
##$SSB= 0
##$STSI= 32768
##$STSR= 0
##$SW_p= 5175.98343685301
##$SYMM= 0
##$S_DEV= 0
##$TDeff= 65536
##$TDoff= 0
##$TI= <Analysis number 999999
Compound Code 99
Book Reference 9
Project Code 9>
##$TILT= no
##$TM1= 0
##$TM2= 0
##$TOPLEV= 0
##$USERP1= <user>
##$USERP2= <user>
##$USERP3= <user>
##$USERP4= <user>
##$USERP5= <user>
##$WDW= 1
##$XDIM= 32768
##$YMAX_p= 425595763
##$YMIN_p= -733653
$$ End of Bruker specific parameters
$$ ---------------------------------
##NTUPLES= NMR SPECTRUM
##VAR_NAME=  FREQUENCY,     SPECTRUM/REAL,   SPECTRUM/IMAG
##SYMBOL=    X,             R,               I
##VAR_TYPE=  INDEPENDENT,   DEPENDENT,       DEPENDENT
##VAR_FORM=  AFFN,          ASDF,            ASDF
##VAR_DIM=   32768,         32768,           32768
##UNITS=     HZ,            ARBITRARY UNITS, ARBITRARY UNITS
##FACTOR=    0.157963299565203, 1,           1
##FIRST=     4132.6476996994, 0,             0
##LAST=      -1043.33573715361, 0,           0
##MIN=       -1043.33573715361, -733653,     0
##MAX=       4132.6476996994, 425595763,     0
$$ Real data points
##PAGE= N=1
##DATA TABLE= (X++(R..R)), XYDATA
$$ [...]
26075F1661p2174k5013L1153L1525n5714j33740J1213J34052l6993K74185J12641
26064C32796j51808j00537J2759j07037N1538N6187J25624j26196P4764J0691
26054A78781J0138j1541j11263n6656l8927m8017L5084j45773J44544Q5896j2154
26043C0112K6669j29821j76683k3428J0778K43576J60738L9166k20053k06157
26033b45103O0847J27571O2515J56258N1873j75549k30740J1612O2230P0065N7559
26022I138j46267P559M0898K3053L6551o7825J20311R7841o5066j08352q8961
26011a41120N5622J46045J83976J386k2449j65294j43177O6528K7063O5590j29599
26000e5429L5543M6186K7612j49281m4066L8615r6999J280l4139J8660p7303k9549
$$ plain form
26075 61661 -10513 -35526 -4373 27152 -28562 -162302 -151089 -17037 -54030 220155 332796
26064 332796 180988 80451 93210 -13827 37711 93898 219522 93326 168090 178781
26054 178781 188919 177378 66115 9459 -29468 -77485 -42401 -188174 -43630 42266 30112
26043 30112 56781 -73040 -249723 -273151 -262373 -18797 141941 181107 -38946 -245103
26033 -245103 -184256 -56685 5830 162088 213961 38412 -192328 -180716 -118486 -48421 9138
26022 9138 -137129 -129570 -88672 -65619 -29068 -96893 23418 121259 56193 -52159 -141120
26011 -141120 -85498 60547 244523 245909 223460 58166 -85011 -18483 8580 74170 -55429
26000 -55429 -19886 26300 53912 -95369 -139435 -100820 -197819 -196539 -230678 -212018 -289321 -318870
25988c18870j1743K5781M8739J67682Q2747P433O3279j89317k21903O8887J76867
25977a00418p8252O2847R410J71834J44469j42411j37851n7832K8025l9615J7465
25966a22329R3043J0208k7276K5299J8101j79236L175j32103J46K50008j25472
25955a86436P3038J28806K0303Q9058O2357q9068j30572K9056N3662o8876j19846
25944a38518j4056j55649l25K21048N2170J81699k2749j5081j06545k0776k5735
25933d4517j39548j02064p0244L9252R037K6365p3037j03203K35291P0281L5984
25922a16403P5486K0840J5637L0434o9343m8885p0452R2288k334P1978j36512
25911a37266R8512J11670J6468j8802L8479J06798j0346q480J54442l8415j11576
$$ plain form
25988 -318870 -330613 -304832 -256093 -88411 -5664 1769 65048 -124269 -346172 -277285 -100418
25977 -100418 -178670 -115823 -106413 65421 209890 67479 -70372 -128204 -100179 -139794 -122329
25966 -122329 -29286 -19078 -46354 -21055 -2954 -182190 -179015 -311118 -310972 -60964 -186436
25955 -186436 -113398 15408 35711 124769 187126 98058 -32514 -3458 50204 -18672 -138518
25944 -138518 -152574 -308223 -308548 -87500 -35330 146369 123620 108539 1994 -18782 -44517
25933 -44517 -184065 -286129 -356373 -317121 -308084 -281719 -354756 -457959 -222668 -152387 -116403
25922 -116403 -40917 -20077 -4440 25994 -43349 -92234 -162686 -70398 -72732 -754 -137266
25911 -137266 -38754 72916 89384 70582 109061 215859 205513 197033 351475 313060 201484
25900B01484R396j5555K2951o360M1274j45307j1243P1175p9936k15155j58177
25889b85453j5639J00919O5205J82883M2821n5874J76669N7520M518j46505k9441
25878I7623l4451O2780p6394q077j76150q7391Q164K41495J1571j84526J7385
25867a27971M7502p151J5787J10823q2794j96906k02880P4633J01554J08454J18148
25856d0801o2915o4020N3336j4722Q6357j493O2485j94221p5771J39112J21725
25845I072R0379q6567K3185q4650o2334L0516k8215j03150j31735Q0755L2674
25834b30070k4164J43982p8458J3369L8235m7833Q5472L0251P0558K58456n5573
25823B04225o1263L4021l9640p764N7402M3142n9309j28748K72180n2331j63005
$$ plain form
25900 201484 210880 195325 218276 211916 253190 107883 96640 167815 87879 -127276 -285453
25889 -285453 -301092 -200173 -134968 47915 90736 34862 211531 269051 273569 127064 97623
25878 97623 63172 125952 49558 41481 -134669 -222060 -213896 27599 39170 -145356 -127971
25867 -127971 -80469 -87620 -71833 38990 -43804 -240710 -443590 -368957 -267403 -158949 -40801
25856 -40801 -103716 -167736 -114400 -129122 -42765 -44258 18227 -175994 -251765 -112653 9072
25845 9072 99451 12884 36069 -48581 -110915 -80399 -108614 -211764 -343499 -262744 -230070
25834 -230070 -254234 -110252 -188710 -175341 -137106 -184939 -99467 -69216 1342 259798 204225
25823 204225 142962 176983 137343 129579 186981 230123 170814 42066 314246 261915 98910
25812I8910l037l1847L7466j10991p7639r6546N8780K84381n54j81172j07569
25801a29818M2840n3474O0151P964j5191j22689J88997K13062o7110k97q567o2730
25789E3138p1684L0323J21565P2017o8799M0636k8563l2824N6103j54709n1284
25778c4081R6749n5546k0449J14693k119j9044q9024r1583l2184P0711J66261
25767A04384O833o1723k27392J2261J03899J80417k2863n0548j66179q7825J47166
25756f1570Q9408M2365P3851J0161M8809j30537r1745j45414L3166J13059j66234
25745a84681j62545R6290M0429Q0137J07834P4445l1216L743N6447q5802m930
25734i849M8986J02226k603j0528j20093j03701r4472Q7996J34502L0880j9717
$$ plain form
25812 98910 95873 64026 101492 -9499 -87138 -183684 -124904 159477 158923 -22249 -129818
25801 -129818 -86978 -140452 -80301 -72337 -87528 -210217 -21220 191842 124732 124435 115868 53138
25789 53138 -18546 11777 133342 205359 136560 177196 148633 115809 171912 17203 -34081
25778 -34081 62668 7122 -13327 101366 99247 80203 -8821 -100404 -132588 -61877 104384
25767 104384 111217 49494 -177898 -165637 -61738 118679 95816 45268 -120911 -208736 -61570
25756 -61570 27838 70203 144054 154215 203024 72487 -19258 -164672 -131506 -18447 -184681
25745 -184681 -347226 -250936 -210507 -130370 -22536 51909 20693 24436 80883 -4919 -9849
25734 -9849 39137 141363 138760 128232 8139 -95562 -190034 -102038 32464 63344 43627
25723D3627R4085O383k61169j26087J57024J3422n6797M4034K1266M5390J2158
25712f664J768J26932o0245k25895k9675J90822J55231P5398O7288q4319j12152
25701I8489j12623p8838L3917j967j48063j44168N9503J65839J17710R7955L113
25690I0867J64339m5343j12697j90651n6606j1104J47214R4489l1948R3846o7795
25679G4611L3040l7865J66836P657m3283j02680P7001J50893O2659j07176n3368
25668B28325j23459j10128p7579o5002L3468j0502l570p592J5759N61m893J35004
25656A0392j58025l9692R175j4724m0649J46704R8471l6513R4799J1270o0807
25645B0401q5823k4126L8062N8320k8750P2487R5853J13190M9523j19935j51428
$$ plain form
25723 43627 137712 144095 -117074 -243161 -86137 -72715 -129512 -85478 -64212 -18822 -6664
25712 -6664 -4896 122036 61791 -164104 -193779 -2957 152274 227672 294960 210641 98489
25701 98489 -14134 -92972 -59055 -61022 -209085 -353253 -293750 -127911 -10201 87754 90867
25690 90867 255206 209863 97166 -93485 -150091 -161195 -13981 80508 48560 142406 74611
25679 74611 107651 69786 236622 244279 200996 98316 175317 326210 388869 281693 228325
25668 228325 104866 -5262 -82841 -147843 -114375 -124877 -128447 -136039 -120280 -119719 -124612 10392
25656 10392 -147633 -187325 -178150 -192874 -233523 -86819 11652 -24861 69938 81208 20401
25645 20401 -65422 -89548 -51486 6834 -21916 50571 146424 259614 309137 189202 37774
25634C7774j56524j4332P3508N1376n0999J24726J90493P2675j00011j51766j15393
25623c8473J1125R3281P761j5949J6848n9279J3682J33832N8499j1751J24410
25612C33986k8674j70061j13684j3252J79901m2419l73193k44456J69886K14799
25602h7167J69084k366r8525l7382r7287R0835L01489P7352j71278j17394l9446
25591a2085j5964R5605o3309R547N4499K0721O1881Q025j42073j6908R0475o2379
25579B8035Q7620n4938k2129L3151j3548q0391O7462L2243p2699j19499K09325
25568I4632K00807L267o767j32398n4748j41412j41770K01091J24381P6501j78395
25557D5189j54730r0178P4093R3698J66709J4007O0186r9462j3644K175j19306
$$ plain form
25634 37774 -118750 -133082 -59574 -8198 -59197 65529 256022 328697 228686 76920 -38473
25623 -38473 -27348 65933 73694 57745 74593 15314 28996 162828 221327 209576 333986
25612 333986 305312 135251 21567 8315 188216 145797 -227396 -471852 -301966 -87167
25602 -87167 81917 79551 -18974 -56356 -153643 -62808 238681 316033 144755 27361 -12085
25591 -12085 -28049 67556 4247 13794 68293 89014 150895 158920 16847 -61 90414 28035
25579 28035 115655 60717 38588 71739 58191 -22200 45262 77505 4806 -114693 94632
25568 94632 295439 298706 291939 159541 104793 -36619 -178389 22702 147083 223584 45189
25557 45189 -109541 -199719 -125626 -31928 134781 148788 208974 109512 95868 98043 -21263
25546b1263j4951n3051M1642P5986O7895R0472K2356m9916r9842q3698L7871J32038
25534A45539R238l4842P438l7706j78140J8018M1019K8467N331J04779M3853L1840
25522A84834l5554j02332l6511j41236q3474J01373J77263K79340p7080k02818
25512F3805n8813Q8683n4557o2201J31530J74022q1686p1531L8714K1059j41279
25501D7746r9064K8590p1110k7135J03380K00907o0767J1854O8728k0227j59838
25490B3064J0268q63L1127j00888M6805j20308j34356q651l466p645P8105r472
25478a96280p4848Q9116k0760j9685P8612P225R8329J6431n9680N1789O3613o8440
25466c4578O2701J5524M0597R6032K0370o9760l14791n0001K36743P6673J2909
$$ plain form
25546 -21263 -36214 -89265 -47623 28363 96258 186730 209086 159170 59328 -24370 13501 145539
25534 145539 154777 119935 127373 89667 -88473 -70455 -29436 -969 4362 109141 152994 184834
25522 184834 149280 46948 10437 -130799 -214273 -112900 64363 343703 266623 63805
25512 63805 4992 93675 39118 -23083 108447 282469 200783 129252 167966 189025 47746
25501 47746 -51318 -22728 -93838 -120973 -17593 183314 122547 134401 203129 182902 23064
25490 23064 33332 32469 63596 -37292 9513 -110795 -245151 -253802 -257268 -264913 -186808 -196280
25478 -196280 -271128 -182012 -202772 -222457 -143845 -136620 -38291 -21860 -81540 -29751 33862 -34578
25466 -34578 28123 43647 84244 180276 200646 130886 -183905 -233906 2837 79510 92419
25455I2419J17678j07338r8618j85160O354R9330r6860o3390R0897P1420m4322
25444a17590k00917K9987J02204N3097R6761J7057r4736J05316n5179j03249J87551
25433B0302P0767n801j65981j943j11421j20977k0290J21626J54350J19158q5595
25422b5805l9265j0747l5621P6923m3540j35961Q9172J77133J0696L2488o8557
25411B6916l505J0542M4162N8055j0060l5953k1118J3444J48603L0325M2818k2486
25399B81743j03625O630j3207k01076j28664j03036O78L3930J8814J52227o820
25388f2406P0395N1303J7511Q5485O9672J9529o8249j59906n2901O9478K175j03782
25376f1696L8262o352J18026J5597o3916j45684J5499Q8588p750r9808q3514J42645
$$ plain form
25455 92419 210097 102759 4141 -181019 -174665 -75335 -172195 -235585 -144688 -73268 -117590
25444 -117590 -318507 -288520 -186316 -133219 -36458 -19401 -114137 -8821 -64000 -167249 20302
25433 20302 91069 85268 -80713 -82656 -194077 -315054 -335344 -213718 -59368 59790 -25805
25422 -25805 -65070 -75817 -111438 -34515 -78055 -214016 -124844 52289 62985 95473 26916
25411 26916 23411 33953 78115 136170 126110 90157 69039 82483 231086 261411 304229 281743
25399 281743 178118 184748 171541 -29535 -158199 -261235 -260557 -226627 -207813 -55586 -62406
25388 -62406 7989 59292 76803 162288 231960 251489 183240 23334 -29567 39911 42086 -61696
25376 -61696 -23434 -29786 88240 103837 39921 -105763 -90264 -1676 -9426 -109234 -192748 -50103
25364e0103Q1618J00903j05158p674R317J39729m0529j42371k5156P5902K5317
25353F1795j30798M0416J57832J6293k12254R615J63129k7864r7268j66699l5884
25342b21687q2116L0421P0935K09058Q6050R0791N0520j51210m2001N435J24268
25331A70464j85514o1788N5584l7081Q2983J00212n1487m1818K3304Q2789N0257
25320A87905k21062k55646O6102O8921J15336J83876m074p1094K256k9571M5155
25309H8104J34489l465j27866r6782K80239O6952k46636q6910N2249J5676n2793
25298B3257Q5071L7172p7342J17237j3690j01248m8068j70652m44J94902J54523
25287B00718l4041P8882k3060j80505j84388O8535n3950k51735J19592J65354
$$ plain form
25364 -50103 31515 132418 27260 19586 28903 168632 128103 -14268 -39424 36478 61795
25353 61795 -69003 -28587 129245 145538 -66716 -57101 106028 78164 -19104 -185803 -221687
25342 -221687 -303803 -273382 -202447 6611 92661 183452 233972 82762 40761 46196 170464
25331 170464 -15050 -76838 -21254 -58335 24648 124860 73373 31555 54859 137648 187905
25320 187905 -33157 -288803 -222701 -153780 -38444 145432 141358 70264 72520 42949 88104
25309 88104 222593 219128 91262 -5520 274719 341671 95035 8125 60374 76050 23257
25298 23257 108328 145500 68158 185395 171705 70457 22389 -148263 -148707 46195 200718
25287 200718 166677 245559 222499 41994 -142394 -73859 -127809 -379544 -259952 -94598
25277i4598J20499J5726k934j8020j95347k4680N4117J23742J7495Q858o2759
25266e7901R1026l6449j35934J00305k2603j25416P3742R908r0303p6745o4418
25255c34788N5220L5219N3779R7831l8289M3418K1306j8624Q2914o4552n1733
25244a18299j8386J33907L0550N3515l503q6365L655l2516j5428N1749o9198p9125
25232a49444J79020Q4173P7397m7711l2074q0062o4462r6257J33036J45109J24417
25221B73142k1827r7680r3429q6898m2099O6186J15181k9446j61379K5275o349
25210e9323L4747L8986n8815k6428L8975m1454O6747J67983J06784k6453j05510
25199A36239N1373Q1785O0163j26849P2832r9818K7237r3012l8136j06019O6396
$$ plain form
25277 -94598 25901 41627 38693 20673 -174674 -199354 -145237 -21495 -4000 4858 -57901
25266 -57901 33125 -3324 -139258 -38953 -61556 -186972 -113230 -103322 -193625 -270370 -334788
25255 -334788 -279568 -244349 -190570 -92739 -131028 -87610 -66304 -84928 -2014 -66566 -118299
25244 -118299 -136685 -2778 27772 81287 77784 -8581 -4926 -37442 -52870 -1121 -70319 -149444
25232 -149444 29576 113749 191146 143435 111361 31299 -33163 -129420 3616 148725 273142
25221 273142 251315 153635 60206 -26692 -68791 -2605 112576 83130 -78249 -52974 -59323
25210 -59323 -24576 14410 -44405 -70833 -31858 -73312 -6565 161418 268202 241749 136239
25199 136239 187612 269397 329560 202711 275543 175725 202962 109950 71814 -34205 32191
25188C2191L4103M5075j18873l4833k8008k9685m2661O6277Q395k0419n9905P3403
25176g4940N3515l4978k4187K0290k9446o8197l2825R6633L07454O2262j88247
25165H7334L7217j88677j49155P9988N5132J27828R3969j26332L0524J57570n1921
25154A53477r0478K441O6331J96736l0253j8176k21523j10871n0214K1621p2705
25143a53614N4784j3921R059m7858j20260N6350O2317L3460J11270N7567K5645
25132G4799p1601k2753J62749K06595o8539q3431k15287k7566M9323l3255j7131
25121d6097L989J6503m1648N661J99913L2190r5080m5125P545M9522l8765j24959
25109g6351L74l8265M2881P5672J64542J26919j04435r1654R8032j32966j80091
$$ plain form
25188 32191 66294 111369 -7504 -42337 -70345 -100030 -142691 -76414 -68019 -88438 -148343 -74940
25176 -74940 -21425 -56403 -80590 -60300 -89746 -157943 -190768 -94135 213319 275581 87334
25165 87334 124551 -64126 -213281 -133293 -78161 49667 143636 17304 47828 205398 153477
25154 153477 62999 65440 131771 328507 298254 280078 58555 -52316 -102530 -80909 -153614
25143 -153614 -98830 -112751 -103692 -151550 -271810 -215460 -153143 -119683 -8413 49154 74799
25132 74799 3198 -19555 143194 349789 281250 197819 -17468 -45034 4289 -28966 -46097
25121 -46097 -42108 -25605 -67253 -61592 138321 170511 75431 30306 37851 87373 48608 -76351
25109 -76351 -75977 -114242 -71361 4311 168853 295772 191337 99683 197715 64749 -115342
25098a15342m7964O29P2268Q888J08238K9487l4915j4553q5891r7066M9787J25271
25086a163R4263Q4812j6907m7650p8961k10442M1301J35000p0525J09147O7789
25075A06664P8593P2433R6058L8893j26708j83069L9174O2124k6503J12358k9076
25064B40941j14061M8472q4367j71352n369L5209l2470J60815K93013L5714j96626
25053B09919j31529j07189j56346j39663M3828J58530O0065j22464j3074m623
25043b02546L004J43021j1043l6937K29531J52088P2193j34886j29342R56j4406
25032G1633j18660j7413J04452o7993R3421m0357j31954M0250O7676l0370j45411
25021a74726L0509q2306J1530L013j10671K2697k1850J46702J15176j88025j7040
$$ plain form
25098 -115342 -163306 -162677 -90409 -81521 26717 56204 21289 6736 -79155 -176221 -126434 -1163
25086 -1163 93100 177912 161005 113355 34394 -176048 -134747 253 -70272 38875 106664
25075 106664 185257 257690 353748 392641 265933 82864 122038 184162 157659 270017 240941
25064 240941 126880 175352 90985 -80367 -85736 -50527 -82997 77818 370831 406545 209919
25053 209919 78390 -28799 -185145 -324808 -280980 -122450 -62385 -184849 -197923 -202546
25043 -202546 -199542 -56521 -67564 -104501 125030 277118 349311 214425 85083 86039 71633
25032 71633 -47027 -64440 40012 -27981 65440 25083 -106871 -66621 1055 -29315 -174726
25021 -174726 -144217 -226523 -214993 -211980 -322651 -299954 -321804 -175102 -59926 -247951 -264991
25010b64991j6556J51126J03670n9541j1467K7854J40936j810K4860J15895o8229
24999A41747n2476J50979j2917j96224k23508l2701K3370P6064L6953n7199P5150
24988g0762j3897L3441k9775j30121P630M3531l1152J27852M4374n7824J36062
24977E9359J16164p968r3425j36927k06523P3273j9109r2017J17025J29897J15405
24966E5154k0824p2784j9228O7064J67295K5318L0731M5581l4162q1915j1841
24955A50389J47600k1992Q2542n0670j14787K3861j02700p0632J32973O6400k00634
24944D2350O0635J49094P4600j32870m8588N3143j07116j70745P9841J68599J07402
24933B76345r3500n2916J15853K8920K9493n9359l13811l2467R2334Q6594K4760
$$ plain form
25010 -264991 -281547 -130421 -26751 -86292 -97759 -69905 71031 69221 94081 209976 141747
24999 141747 89271 240250 227333 31109 -192399 -225100 -201730 -125666 -88713 -145912 -70762
24988 -70762 -84659 -51218 -80993 -211114 -203484 -159953 -191105 -63253 -18879 -76703 59359
24977 59359 175523 167555 74130 -62797 -269320 -196047 -215156 -307173 -190148 -60251 55154
24966 55154 34330 -38454 -57682 9382 176677 201995 232726 278307 244145 162230 150389
24955 150389 297989 275997 358539 307869 193082 216943 114243 43611 176584 242984 42350
24944 42350 102985 252079 326679 193809 145221 198364 91248 -79497 344 168943 276345
24933 276345 182845 129929 245782 274702 304195 244836 -68975 -101442 -9108 77486 102246
24922A02246k36350j04741O2767P8404K1550k74103J07600K54075J87957J55883
24912C55288k77528k85534k7927J77638j09171J3165M2573K7138J2697J4877Q1554
24901B4770J54882L6333J04489M2751j46894j40543j4919m5554j47714M7042L00170
24890B14813O6299n3974J236j42228r8680k12441K9395K21657P2557l5768L942
24879F6808O0754k5372J5366j46769j4805N135R6706J4891Q0732L1301J6755j75132
24867B6370P376Q9856q6741M8937q8778J885r9922n368j02653J04540J85792L4310
24855A15604r4678N7915R073O6469J50405j47040k74886p141K37248K2012k9735
24844A05246J6684L9277j08401o7560j7111j01078P3234P5547j22308k1517R3761
$$ plain form
24922 102246 -134104 -238845 -176078 -97674 -76124 -350227 -242627 11448 199405 355288
24912 355288 77760 -207774 -235701 -58063 -167234 -154069 -111496 -84358 -71661 -56784 24770
24901 24770 179652 215985 320474 363225 216331 75788 60869 15315 -132399 -85357 214813
24890 214813 281112 227138 228374 86146 -12534 -224975 -195580 26077 98634 62866 66808
24879 66808 127562 102190 117556 -29213 -44018 -38883 57823 72714 153446 184747 201502 26370
24867 26370 33746 123602 36861 85798 -2980 -1095 -101017 -106385 -209038 -104498 81294 115604
24855 115604 20926 78841 87914 154383 304788 157748 -117138 -124279 112969 134981 105246
24844 105246 121930 161207 52806 -14754 -31865 -132943 -59709 15838 -106470 -127987 -34226
24833c4226J9861M6803J60886P2332j17073l7588J43964Q1461j99161j46049k3008
24822c1798j27563J02250k2275j22327o5931J6825J0537K35026J34655J82187
24812C11586o8360k5967n2197j1306j16620p1584J01013M456J7412k1826J02102
24801A68709o0491p7093O3868O2668k51649m1942M1972m9115P9379K32271P8222
24790B46799J6922q8362j89633n9201k1156m2323J57878P9965p3585r843R1984
24779A09445K2778k48461j61057Q1413K80263J04067j68445k8097K7303K3980
24769D3189O7584l7639Q2041n5418k692j71948N694j05978j9070J82868J56531
24758A45162k1331P6961j35861j92421o165j39879R8570J24051j28616J27699
$$ plain form
24833 -34226 -14365 32438 193324 265656 148583 110995 254959 336420 137259 -8790 -31798
24822 -31798 -159361 -57111 -79386 -201713 -267644 -250819 -240282 -5256 129399 311586
24812 311586 243226 217259 165062 153756 37136 -34448 66565 71021 88433 66607 168709
24801 168709 108218 31125 94993 157661 -93988 -135930 -93958 -143073 -63694 168577 246799
24790 246799 263721 175359 -14274 -73475 -94631 -136954 20924 100889 27304 17461 109445
24779 109445 132223 -116238 -277295 -195882 84381 188448 20003 -8094 19209 43189
24769 43189 110773 73134 155175 99757 97065 -74883 -69189 -175167 -194237 -11369 145162
24758 145162 123831 200792 64931 -127490 -133655 -273534 -174964 -50913 -179529 -51830
24748e1830J71343O9173l9772q4062o7057J079m8693Q392q2401J39935P8398n0859
24736D3646J31655K5910P2341P267j48104j56418O7652J84223J47165m0095k5711
24725C09531p3103L0047n9339k16831j35151k6535J20414J53733N9926k9374L5081
24714A68399Q6564j80415k14121J35868J91430q6166R2441J22506K5383K5043
24704C66932j96400k19253O9069l373P9563K2327j07297j46995J27926L2089j07379
24693h2791j61088J29355j8666Q5033J53132j16547P6174R2285r7213K4342p7971
24682F045p9356J00312q9303n2191j3415M833Q671J78906R9145j18176M2558j29939
24670d1910L9668j63978L3440Q4226O9941j2359o1802j3539P9014k06467m6159
$$ plain form
24748 -51830 119513 188686 148914 64852 -2205 -1126 -49819 -41427 -123828 16107 94505 43646
24736 43646 175301 201211 273552 280819 132715 -23703 43949 228172 375337 335242 309531
24725 309531 236428 266475 207136 -9695 -144846 -171381 -50967 102766 162692 133318 168399
24714 168399 254963 74548 -139573 -3705 187725 101559 194000 316506 341889 366932
24704 366932 170532 -48721 20348 16975 96538 118865 11568 -135427 -7501 24588 -82791
24693 -82791 -243879 -114524 -133190 -48157 104975 -11572 64602 156887 59674 84016 6045
24682 6045 -73311 27001 -62302 -114493 -127908 -123075 -114404 64502 163647 45471 88029 -41910
24670 -41910 -2242 -166220 -132780 -48554 21387 9028 -52774 -66313 12701 -193766 -239925
24659b39925J78325m0128k1700j2492j77269j31856J42679J36668K1221R9810
24649d4667J43916P5529l4008m4575q3730Q257P2836k0040m1523R5671j51493
24638b3827k0718K31686J23090J06172j2648j78888o6613m7540k3837M4837J05458
24627B37172p9960j73053J5850J37200N0304J01341j6415q8975j20602n9619J2853
24616A6096j03862j8389J20934o3309l6881J2992M1369p722k1618j1321J63720
24605I2009k3856k61887j04391Q7581O6459J0495R3108q5096j40559M2401J41401
24594h2335n5669O2614K01132P9328p0972o2450o7000J04832L1914m0109Q4290
24583A85575J42232n7362r9263k04794p2n17k6528J2378l8168k2717Q8596j64018
$$ plain form
24659 -239925 -61600 -101728 -123428 -135920 -313189 -445045 -302366 -165698 -144477 -44667
24649 -44667 99249 174778 140770 96195 12465 20722 93558 73518 31995 127666 -23827
24638 -23827 -44545 187141 310231 416403 403755 224867 158254 110714 86877 131714 237172
24627 237172 157212 -15841 9 137209 187513 288854 272439 183464 62862 3243 16096
24616 16096 -87766 -106155 14779 -48530 -85411 -72419 -31050 -38772 -60390 -71711 92009
24605 92009 68153 -193734 -298125 -210544 -144085 -133590 -40482 -125578 -266137 -223736 -82335
24594 -82335 -138004 -75390 125742 205070 134098 71648 4648 109480 141394 101285 185575
24583 185575 327807 270445 171182 -33612 -33684 -34201 -60729 -48351 -86519 -109236 -20640 -184658
24571a84658j52177J07247N7246J73633j12064j89655J2905P1616M7333J665j9952
24560a86861J32244J45758J5986O8987q0778q251r334j29280j12330J31036J80218
24549A47395l9223j11761r3315j3837L1678J25722m152o5839m981J40817j173
24538A11331j37466M9572k1807r0469M0837J88669J12902j0379m5948J369n8474
24527A40137j07740J19612J12583p9343j49398o1420O6515j31249j8636J03116
24517e823J45081J12782j23896n1836l3651K3450O9933j46564q8486O5374L3553
24506h3j5500Q6721K67769J44798j24801j76075r9175P8537J93332o9721k28109
24495E7693j41727j21559p3418J29755K83055j2670p1148o6070q7469P9449K3947
$$ plain form
24571 -184658 -336835 -229588 -172342 1291 -110773 -300428 -287523 -215907 -168574 -166909 -186861
24560 -186861 -54617 91141 107127 176114 95336 87085 77751 -51529 -163859 -32823 147395
24549 147395 108172 -3589 -96904 -110741 -79063 46659 42507 -23332 -28313 112504 111331
24538 111331 -26135 23437 1630 -88839 -48002 140667 253569 243190 197242 198611 140137
24527 140137 32397 152009 264592 185249 35851 -25569 40946 -90303 -108939 -5823
24517 -5823 139258 252040 128144 76308 42657 66107 136040 -10524 -99010 -33636 -83
24506 -83 -15583 71138 338907 483705 358904 182829 83654 162191 355523 285802 57693
24495 57693 -84034 -205593 -279011 -149256 133799 121129 49981 -16089 -103558 -24109 -162
24484a62j03256p8831R91J22307M700j49505m5086M6319R3833N5846q0641p5812
24472b09297N5309l0725j97496O4289K89800K76636J37100l01473j88335O3612
24462d0580P9129j1615j6070L2425p3032j97784m59J55079J92528N044M0455j13016
24450E2104o4836J23377P196q9887o0133K29779k5291l8120j01686l7123J32934
24439A28314k05418l451O0679j3554N9968j44058j93547k2656O0454M558J03342
24428a65369J33546Q4170l9918j04589j17242n937L7845K537k3729P2914m7380
24417a73152P2904P2196j29723J37396J45203j88710m9520J03139J25337M7299
24407A62369j37763k08664r3523J57165M582P3494R8733O0288j96137k38906R3302
$$ plain form
24484 -162 -103418 -182249 -181258 -58951 -54251 -203756 -248842 -202523 -108690 -52844 -133485 -209297
24472 -209297 -153988 -184713 -382209 -317920 -28120 248516 385616 84143 -104192 -40580
24462 -40580 38549 26934 10864 43289 -29743 -227527 -227986 -72907 119621 124665 165120 52104
24450 52104 -12732 110645 117841 27954 -32179 197600 172309 134189 32503 -4620 128314
24439 128314 -77104 -80555 -19876 -33430 26538 -117520 -311067 -333723 -273269 -268711 -165369
24428 -165369 -31823 52347 12429 -92160 -209402 -215339 -177494 -174957 -198686 -125772 -173152
24417 -173152 -100248 -28052 -157775 -20379 124824 -63886 -113406 -10267 115070 162369
24407 162369 24606 -184058 -277581 -120416 -115834 -42340 56393 116681 -79456 -318362 -225060
24396b25060M4171P3607K31700o2737K5651L6346k9179k5211P1675O5188L5393
24385B41544M510j00940q4938j2727j06889j56952j58032J4351M0723P5485J35548
24374a08317J28173P4937j12985j24438k1561K03966R1383k5773o0377j52433
24364a07425K3508M9655j04388j19583J34578O5174K8945K7814R7274J4559l2944
24353G7167K1094q7832k2801M1681K8042n5451k70197J70076K80850K0278k2771
24342A80136j9947N9717j8542j05224j71536q1443J39463R5510K9359l5784j78271
24331a06562k8091O6401P5799O7007O1062N3285j20738m0004p5210m3022j47945
24320b38018L3122O3181R7324J22565L0170L8953q9309j50472K2735K0219n6646
$$ plain form
24396 -225060 -180889 -107282 124418 61681 87332 123678 94499 69288 140963 206151 241544
24385 241544 246054 145114 60176 47449 -59440 -216392 -374424 -360073 -319350 -243865 -108317
24374 -108317 19856 94793 -18192 -142630 -164191 39775 131158 105385 45008 -107425
24364 -107425 -83917 -34262 -138650 -258233 -123655 -58481 -29536 -1722 95552 110111 77167
24353 77167 98261 10429 -12372 29309 57351 1900 -268297 -98221 182629 202907 180136
24342 180136 160189 219906 201364 96140 -75396 -156839 -17376 78134 107493 71709 -106562
24331 -106562 -134653 -68252 7547 74554 135616 188901 68163 28159 -47051 -90073 -238018
24320 -238018 -204896 -141715 -44391 78174 108344 147297 57988 -92484 -69749 -49530 -106176
24309a06176J03008m9854o0577M8128L2771R626J23048R9975j8074j26368k23622
24298a68115L876P4443j8849j2804J14820J68533m7767k86614r7807j69453M2642
24287c97095K16064J21105r041j07992J5763n542j1748R8612l7424J30512P3966
24276H7180n9053j49157N6075J10313j11123k3208O1243L41M5183O2419K7491
24265A07704J33375J84137j02137k67206j19281J12958K67896L1067j94967q3414
24255G0132q1758p8455J677o8994P771R1121k9199j09606N6840J60868L1663J8019
24243G0079R9350J48580o4503q9311L7230o3568j19184m4087n1540M728J89161
24232A16935O720k27983j69466l4726p4759L5737O7025K55348P3817j9146j49856
$$ plain form
24309 -106176 -3168 -53022 -113599 -65471 -32700 -23074 99974 199949 181875 55507 -168115
24298 -168115 -164239 -89796 -108645 -121449 -6629 161904 114137 -172477 -270284 -439737 -397095
24287 -397095 -181031 -59926 -68967 -176959 -161196 -166738 -178486 -79874 -117298 13214 87180
24276 87180 28127 -121030 -64955 45358 -65765 -88973 -27730 -27389 17794 80213 107704
24265 107704 241079 425216 323079 55873 -63408 49550 317446 348513 153546 70132
24255 70132 -11626 -90081 -88404 -157398 -149627 -58506 -87705 -197311 -140471 20397 52060 70079
24243 70079 169429 318009 253506 164195 201425 137857 18673 -25414 -76954 -72226 116935
24232 116935 123655 -104328 -273794 -308520 -383279 -347542 -280517 -25169 48648 29502 -120354
24221a20354L1216p5680L6384O5418J43080K19997j15645j32276j04405j02676
24211a54941l7897N2536N191J18992J51637J09684j10769o9620R3563N8182O6508
24200B83066k0989N4455m5857k25232N5852k4382o6101j10000q7399n3764Q5296
24189a55055M0233l6438j5882P0826N6305j29394N6453O4334R195K3853o0939
24178g6509K7501k7758K7494j6145l2953J66001N8217J40266o8742j35298K06084
24167B68158P2208j55341j25688l3238p0031n0343j27968Q3396J10548j39632
24157a67931R5490n5184j67669N5332k322K7093K12674K35244n6083m6497m4291
24146H5856j00954l6001m3052o2571p770R8274J788P168Q5441o6670K5282J06145
$$ plain form
24221 -120354 -89138 -164818 -128434 -63016 80064 300061 184416 52140 -52265 -154941
24211 -154941 -192838 -140302 -135111 -16119 135518 245202 134433 64813 158376 216558 283066
24200 283066 262077 316532 270675 45443 101295 76913 10812 -99188 -186587 -240351 -155055
24189 -155055 -114822 -151260 -167142 -96316 -40011 -169405 -112952 -48618 -39423 -15570 -76509
24178 -76509 -49008 -76766 -49272 -65417 -98370 67631 125848 266114 197372 62074 268158
24167 268158 340366 185025 59337 26099 -43932 -94275 -222243 -138847 -28299 -167931
24157 -167931 -72441 -127625 -295294 -239962 -242284 -215191 -2517 232727 176644 130147 85856
24146 85856 -15098 -51099 -94151 -156722 -164492 -66218 -64430 -57262 28179 -38491 -13209 92936
24134I2936p4384o8185N3318n3896j21956l5341O3614J99419n5372p8102J63507
24123H5558J6687j67439j06803j9666J61360P1986R3217J97031l4880j67538j74981
24112d5468J29300j1201n0252m7233k1437l23K1900k40l2120k4417O3160L9125
24100B0794O3818j641l3729J4407j92468p6515l5596K41048J58983l19051j38803
24089b98753j14773J40458J10940K0268M0478m1562M3746q7884O8348J58383J73499
24078B13148j054j56172r6220j57278J14096J2524P2457K13978k9865p1363K2117
24067A36368L3525R27r1189j37984K0132m044j20763Q0882r0931K7705J68769
24056B3397Q3836J74048L9111n1365j92284k4139M2020M3829M836M977O225n4446
$$ plain form
24134 92936 18552 -49633 3685 -50211 -172167 -207508 -143894 55525 153 -77949 85558
24123 85558 102245 -65194 -171997 -191663 -30303 41683 134900 331931 297051 129513 -45468
24112 -45468 83832 72631 22379 -24854 -46291 -46614 -24714 -24954 -57074 -81491 -18331 20794
24100 20794 84612 82971 49242 63649 -128819 -205334 -240930 118 159101 -159950 -298753
24089 -298753 -413526 -273068 -162128 -141860 -101382 -142944 -99198 -187082 -118734 39649 213148
24078 213148 212094 55922 -40298 -197576 -83480 -70956 1501 215479 185614 114251 136368
24067 136368 169893 170820 79631 -58353 -38221 -42265 -163028 -82146 -173077 -145372 23397
24056 23397 107233 281281 320392 269027 76743 52604 94624 138453 143289 148266 154491 100045
24044A00045q6023m7775L2741j33527J16870K42286R8292k4331j11114o4615q3376
24033C9473R7007R5859j11555O9681j5581k0086J33545p2219j25843m1003j03223
24022e3945j47707R0352J0980N9889P778r2636p143N1227O7336N2978o2218l8630
24010f1739Q7573K2949L2060J58823J53483N7214p9560p5975j63942J8319p057
23999A42148K0419m8797M636k3944L0837J1666n9288J11819k8109J6187J66755
23988C44329j04105k16417j71827J18097P9139j29055Q6366J19395J2843J32427
23978B71192O8754k05741j76442j29692j43961J92682K41168j31161J8433N6579
23968F1811Q544p5772n6616M5177j8457p1223R2785J73342r1896j34691M6940
$$ plain form
24044 100045 14022 -33753 -1012 -134539 -17669 224617 322909 298578 187464 122849 39473
24033 39473 136480 232339 120784 190465 174884 154798 288343 216124 90281 49278 -53945
24022 -53945 -201652 -111300 -100320 -40431 -32653 -125289 -132432 -81205 -13869 39109 -23109 -61739
24010 -61739 25834 48783 80843 239666 393149 450363 370803 294828 130886 149205 142148
23999 142148 162567 113770 118406 94462 125299 136965 77677 189496 161387 177574 344329
23988 344329 240224 23807 -148020 -29923 49216 -79839 6527 125922 138765 271192
23978 271192 339946 134205 -42237 -171929 -315890 -123208 117960 -13201 5232 61811
23968 61811 70355 -5417 -62033 -16856 -35313 -106536 -13751 159591 67695 -66996 -20056
23957b0056O2283j07588o9811J6565R207l0329N9092q806j44396j27901J20636
23946b41104J87588J9312p3549j61252p6339L4360M454O2664K436J683n9255J29414
23934a69588J87619J67258j68628k9430p9571m8360N20R36J44651L3636j83481
23923a44438J9245J88286p6131q5479l744q5909J00528J11199J9387N4385l7371
23912E9958M0095J16631j25299O9179O8104l9827q9387j24276k9556O1907m4850
23901c7321J03774J30373L2087o2321J69462N3300l2405J31965j51943q9877m7911
23890A99183k6328j5880r1579q1985K8030J6751K8144J11024n8368j05429M1064
23879D4627P1889m0265o2775j66827M4679K1040M3057o2139O2700K29978J43501
$$ plain form
23957 -20056 42227 -65361 -135172 -118607 -109400 -139729 -80637 -89443 -233839 -361740 -241104
23946 -241104 -53516 -34204 -107753 -269005 -345344 -310984 -306530 -243866 -241430 -239747 -299002 -169588
23934 -169588 18031 185289 16661 -12769 -92340 -140700 -140180 -139244 5407 39043 -144438
23923 -144438 -125193 63093 -13038 -98517 -102261 -188170 -87642 23557 42944 97329 59958
23912 59958 100053 216684 91385 160564 228668 188841 99454 -24822 -54378 7529 -37321
23901 -37321 66453 196826 228913 166592 336054 389354 356949 488914 336971 247094 199183
23890 199183 172855 156975 65396 -16589 11441 28192 56336 167360 108992 3563 44627
23879 44627 116516 76251 13476 -153351 -108672 -87632 -44575 -106714 -44014 185964 329465
23868C29465N734p8006q1266q6915j8463q9652j42217M1220J56512J29729r6075
23857G0066O2445o6681j01081R5706N9832J37937j51895J089N6281J5177j9251
23846A59625K5963p8363j32421J7696J57714o1952Q2417n3943q2460J40194k7879
23835A46591n4837n3873K1437L7976K6369L6051P3440J8661j43677j84051j05823
23824a81736K7574O9419M0862L622J1234J21020R8961m2601r322j57820J3752
23813e035R0840q1544P5779K01322Q3979j16275l5209M5292J08579J62461J7651
23802E47840o6295j52080k01463p8205O1703m8473k844O6827p1185J67952N0091
23791B73868o8290N1295P7922n6688j21241j095m2333o831o0065j77065m5731
$$ plain form
23868 329465 335199 257193 175927 89012 70549 -19103 -161320 -120100 36412 166141 70066
23857 70066 132511 65830 -35251 60455 120287 258224 106329 107418 163699 178876 159625
23846 159625 185588 107225 -25196 -7500 150214 88262 170679 116736 34276 174470 146591
23835 146591 91754 37881 59318 97294 123663 159714 233154 251815 108138 -75913 -181736
23824 -181736 -154162 -84743 -43881 -40259 -29025 91995 190956 148355 139033 -18787 -5035
23813 -5035 85805 4261 80040 281362 365341 249066 213857 259149 367728 530189 547840
23802 547840 481545 329465 128002 49797 111500 63027 60183 127010 55825 223777 273868
23791 273868 205578 256873 334795 278107 156866 155771 113438 106607 46542 -130523 -176254
23780a76254Q3589J27952j0132j33135q293j2025R7319J37754P8304J04877k7069
23769B62887j22274P4011M6199j52985j96432n2443R0978R4658m4953R7665J28042
23758B25353p786k45362r9185J76494Q0635J10708j1524n6593P3034j03643j07844
23747C4287q6686P2150O2961n3529J2794l1046j48403j33013J7889P1532J55156
23736b5908j16009P3795J27315n1862j06452M0016R154M8678k9187j95182J12604
23725a13038K53389M0382o597q4531O3045J72883R0771o1464K5697j2637K3538
23714C91438q5451j39085j9014n7336p5480j34923J53747K16359R0334k9827k66699
23703D4063J6158r1206P1180J06748m3732o0967Q7558q9053o4356O6912Q775r7647
$$ plain form
23780 -176254 -92665 35287 25155 -107980 -116273 -128298 -30979 106775 185079 289956 262887
23769 262887 140613 214624 260823 107838 -88594 -141037 -50059 44599 -354 97311 225353
23758 225353 217567 -27795 -126980 49514 130149 240857 229333 172740 245774 142131 34287
23747 34287 -52399 19751 82712 29183 41977 10931 -137472 -270485 -252596 -181064 -25908
23736 -25908 -141917 -68122 59193 7331 -99121 -59105 -49951 -1273 -30460 -225642 -113038
23725 -113038 140351 180733 174136 89605 152650 325533 416304 354840 380537 367900 391438
23714 391438 305987 166902 147888 90552 15072 -119851 33896 250255 340589 310762 44063
23703 44063 60221 -30985 40195 146943 103211 42244 129802 40749 -23607 43305 52080 -45567
23691d5567N3355K05632L5720n877j10250r5255O5765l6997l5958J51819q0508
23680A01879j16574l6683J47295K13752M0311j35495j36943m2294j09133J01975
23670B8090J66629o3282k6185j22530o688M724J38097j05584K1850K0330l7478
23659A7973k49765N8814J63358r7419J09860M9072j84604J18821L64542M3923
23649C94575j44422l32846k35816J62085K01994P7655r0745J68529J9335n5313
23639A65031P77P3623m1287j20827j1951J55578Q2527o8642Q3006q9001l3352
23628A95482K5402P6462M4068k27171q6853M4112o2989j12889N1510j9341j46114
23617b18321m155J21560R0965K090n6877k5767j25116l9206J20914K5422J61677
$$ plain form
23691 -45567 7788 213420 249140 243263 133013 37758 103523 66526 30568 182387 101879
23680 101879 -14695 -51378 95917 309669 349980 214485 77542 35248 -73885 28090
23670 28090 194719 131437 105252 -17278 -23966 -19242 118855 13271 35121 55451 17973
23659 17973 -231792 -172978 -9620 -107039 2821 51893 -132711 -13890 350652 394575
23649 394575 250153 -82693 -318509 -156424 45570 123225 32480 201009 220344 165031
23639 165031 165808 239431 198144 77317 65366 220944 303471 234829 317835 228834 195482
23628 195482 220884 297346 341414 114243 27390 71502 8513 -104376 -52866 -72207 -218321
23617 -218321 -222476 -100916 -9951 -7861 -64738 -90505 -215621 -254827 -133913 -108491 53186
23606E3186k0816M9423n958k5074m913m4471n0941M1020n675M400n99l2864q4439
23593a27721J21677K3063Q6149M2517j20222j13568R5813r7303K3391Q5281q1557
23582f2480J58928L5616L0905L6554j73362J0586l6974P0497Q2168p3326m3306
23571C5806K7047j5731J9161j07166P518L3821Q2962l7002k8983J05363R2153
23560B14949N9911P0333j63560r4450J15554M1539m7140k19017j64011J20501
23550f5391R8457N998n7192m3602p2094j82716P9033J42143P7526k6133k0757
23539f4728m9761K2542m5200n6396N7294j13430k7453J18141M7631J30463j44916
23528a25813n714L3381J81761R7662o3311l0059m7067p0241R2964J46696j69435
$$ plain form
23606 53186 32370 81793 75835 50761 45848 1377 -49564 -8544 -14219 -9819 -10418 -43282 -127721
23593 -127721 -6044 17019 103168 145685 25463 -88105 7708 -89595 -66204 19077 -62480
23582 -62480 96448 132064 162969 199523 26161 36747 -227 70270 152438 79112 35806
23571 35806 62853 47122 66283 -40883 -33365 456 83418 46416 17433 122796 214949
23560 214949 274860 345193 181633 87183 202737 244276 197136 -21881 -185892 -65391
23550 -65391 33066 39064 -18128 -61730 -133824 -316540 -237507 -95364 -17838 -43971 -64728
23539 -64728 -114489 -91947 -137147 -193543 -136249 -249679 -277132 -158991 -111360 19103 -125813
23528 -125813 -131527 -98146 83615 181277 117966 87907 40840 -29401 63563 210259 40824
23517D0824j84001M0308J92028k4626J367J7945n8117k0732o9811O6049J08036
23506A09270J79953l6580k10996O2052j5623l350L5632L4866j61569j49143Q3330
23495g2158P4072J2922m2263J91382R7424o7081k7670m5624j20765K10819k9711
23484A81347j57762L0966O8126J01094j7338k06651j43057M8727J75023J13747
23474A94222n2233j23017j22897Q4371J576J00487n0549O64L8678K2377m8226
23463D5453K7472k9210j15663n83k8780N1917M6055l6677N3428P7669k440L0244
23451A18885n1435M3030J68295P7495J6008j20309j27429j8222M6240n8220r0438
23440C900j09790j29751n6962J88704N6699l491J64466K26281J7128k8114N363
$$ plain form
23517 40824 -143177 -102869 89159 64533 65900 83845 25728 4996 -64815 1234 109270
23506 109270 289223 252643 41647 103699 88076 84726 120358 155224 -6345 -155488 -72158
23495 -72158 1914 14836 -27427 163955 261379 194298 166628 121004 239 211058 181347
23484 181347 23585 54551 122677 223771 206433 -218 -143275 -94548 80475 194222
23474 194222 141989 18972 -103925 -19554 -17978 82509 31960 32624 71302 93679 45453
23463 45453 72925 43715 -71948 -72531 -101311 -49394 -3339 -40016 13412 91081 88641 118885
23451 118885 67450 110480 278775 356270 372278 251969 124540 106318 152558 94338 3900
23440 3900 -105890 -235641 -292603 -103899 -47200 -50691 113775 340056 357184 329070 334433
23429C34433j22790q6101j41260j57936j771P9688l13O3232L7828m3178J9468
23418a8700P5555O2078J4357R684J09128N4103j85938j60485k6312j5835L1379
23407e0986l6987J9335n6382o4976J29221N3067N9245J56531m8781o0654K4497
23396A23130K4015P5658j43751k0035k1037o4091M4144o523Q1705j2618p0848
23385I749r3989O8204O6049j14434J6163J36885P00K9278p7494k89573k6572K96958
23373B1924K85802j11065j52121j45914p742L8378L3718M9468k8083K3560k5552
23362a7627O8545L561K3718K8053L3721p362k7558K2693n4947p4132M710l4634
23350c1259J12411J41345n2496k2117N3728j32878J93737j18253j01049l7367
$$ plain form
23429 334433 211643 125542 -15718 -173654 -175425 -95737 -96050 -32818 5010 -38168 -18700
23418 -18700 56855 118933 133290 142974 252102 306205 120267 -40218 -66530 -82365 -50986
23407 -50986 -87973 -68638 -125020 -189996 -60775 -7708 51537 208068 159287 98633 123130
23396 123130 147145 222803 79052 59017 37980 -26111 18033 11510 93215 80597 9749
23385 9749 -84240 -16036 50013 -64421 -48258 88627 89327 118605 41111 -248462 -275034 21924
23373 21924 307726 196661 44540 -101374 -109116 -70738 -37020 12448 -15635 7925 -17627
23362 -17627 50918 54479 78197 106250 139971 132609 105051 127744 72797 -1335 3375 -31259
23350 -31259 81152 222497 170001 147884 201612 68734 262471 144218 43169 5802
23340E802Q452L2128J47294M4339j19310k00529j13153R8899K18819M7707k05354
23329c4906j44984J26905J70804k7354j19570K0514J31254O6703J992o9587j70620
23318d8849p2657l5422L0690L5769J151O7756N4716M8147N8591N3217l0929m5590
23306A16590k12820l23437L9255J43527P0175J27309K03893K6911o9855q7695
23296C3853j21164J90722J45935N0021p6378j2690R4060j55991j70459j23950
23286a46041o2915n5705n438M7858K08520o7053j23586J0907l9115O770O9372
23275a56426J36806J88800k2803r5098j11680l22633j0278Q1887k9101K41871
23265i8655J28096k9141L3182j4040r0776l9355j28588j15345J27303n8494Q335
$$ plain form
23340 5802 14254 46382 193676 238015 118705 -81824 -194977 -96078 122741 170448 -34906
23329 -34906 -179890 -52985 117819 90465 -29105 -8591 122663 189366 191358 121771 -48849
23318 -48849 -121506 -156928 -126238 -90469 -89318 -21562 33154 81301 139892 193109 162180 116590
23306 116590 -96230 -419667 -380412 -236885 -166710 -39401 164492 191403 121548 33853
23296 33853 -87311 103411 249346 299367 222989 210299 304359 148368 -22091 -146041
23286 -146041 -208956 -264661 -270099 -222241 -13721 -80774 -204360 -193453 -232568 -225798 -156426
23275 -156426 -19620 169180 146377 51279 -60401 -383034 -393312 -311425 -340526 -98655
23265 -98655 29441 300 33482 19442 -71334 -110689 -239277 -354622 -227319 -285813 -277478
23254b77478J00021L5994J14457J74634J37886j58472j92286l7935L4845J64234
23244I5900N6480m4489l2130l2537k7473m3341O5741N8580Q0107n5349j13407
23233H082J6828r9501L160Q4141O1812O4909Q8104l6981R5940M7942l0113j97055
23221A07268j02922J8892r8867l4097Q2873P4705J47776q0474k24605J09665j2838
23210a2624J28181p138n3359M3025q3628r9450J46946J29234M623q4092Q1808
23199A93526L0241K8930j68268j16383j02066O6290L3364k1058q6016P8446j1907
23188g4901J26932R0817j92354j38610K5941Q7305R5360K2106o8172J0511q9094
23177a04159Q1482k1049m1728q2230N1126K78323o3575o2040J42631L0499K7520
$$ plain form
23254 -277478 -177457 -141463 -27006 147628 285514 127042 -65244 -103179 -68334 95900
23244 95900 152380 107891 75761 43224 15751 -27590 38151 96731 176838 121489 8082
23233 8082 24910 -74591 -71431 12710 74522 139431 227535 190554 286494 334436 304323 107268
23221 107268 4346 23238 -75629 -109726 -26853 47852 195628 115154 -109451 214 -12624
23210 -12624 115557 108419 55060 98085 14457 -84993 61953 191187 195810 111718 193526
23199 193526 223767 252697 84429 -31954 -134020 -67730 -34366 -55424 -141440 -62994 -74901
23188 -74901 52031 142848 -49506 -188116 -162175 -74870 20490 42596 -25576 -15065 -104159
23177 -104159 -22677 -43726 -85454 -167684 -116558 161765 98190 36150 178781 209280 236800
23166B36800J57658m2796o3962l9392m0714r2671j6655Q832j01635j95732J00092
23155i0175k4980j12206Q2312K4195j6631l6997K52751J84443j08811r6042p4385
23144a6526J19664K2527o5581K1036P2682N6188k5558M5222o0178j92782l0342
23133e3648J20821J44470j4661o9750Q2450J93174j16665j54965j37425J7427
23123A1228M9841R8308p4017L1451R3278J67791J7376j21210j81478j79889j2195
23112i9516J14806m5348m3579J28268N7521L9894m1202m4085l8971k3898m4857
23101d0967J18831J08515j73513k6467J40464j9115J9298o5306j25517m7498L8959
23090g2316K12924M8783j95441q3507N5539J4003p5565K1166Q0605R7795M2879
$$ plain form
23166 236800 394458 351662 287700 248308 207594 114923 98268 107100 5465 -190267 -90175
23155 -90175 -115155 -227361 -145049 -120854 -137485 -174482 78269 262712 153901 57859 -16526
23144 -16526 103138 125665 60084 81120 153802 209990 184432 229654 169476 -23306 -53648
23133 -53648 67173 211643 196982 127232 209682 402856 286191 131226 -6199 11228
23123 11228 61069 159377 85360 116811 210089 377880 395256 274046 92568 -87321 -99516
23112 -99516 15290 -30058 -73637 54631 112152 152046 110844 66759 27788 3890 -40967
23101 -40967 77864 186379 12866 -13601 126863 107748 127046 61740 -63777 -111275 -72316
23090 -72316 140608 189391 -6050 -89557 -34018 -20015 -95580 -74414 6191 103986 146865
23079A46865j35988q7835J06521L1260k0672j60618j24423Q9474K22807j38374
23069g0983o6782K0317O8158K3823Q4517J68159j9160j18315J00728Q658j27815
23058G1305j37512M8640J56400P2090K3180j41713j22568k4776J21439k3773o1788
23047a9076P3023K4725O2634l4135q5362K7619O3466N7060j12669j52224o4589
23036a59528m8435N7695l8166p7682K5793O9740L2385M8826O206K3251j22425
23025a82340k7184K0324L5619j35798l2086O3859R2669J34125L3588j1698K7089
23014A8167K782O5376N6514L9527L6716J6869k1387n6628k2907P225k36124q5779
23002a79649l4579J95232N9443J07463O1692j63882j98244J6484n641L9011j9908
$$ plain form
23079 146865 10877 -76958 29563 60823 40151 -120467 -244890 -155416 67391 -70983
23069 -70983 -137765 -117448 -49290 -25467 59050 227209 208049 89734 190462 199120 71305
23058 71305 -66207 -17567 138833 210923 234103 92390 -30178 -54954 66485 42712 -19076
23047 -19076 53947 78672 141306 107171 21809 49428 112894 169954 57285 -94939 -159528
23036 -159528 -207963 -150268 -188434 -266116 -240323 -170583 -138198 -89372 -83166 -59915 -182340
23025 -182340 -209524 -189200 -153581 -289379 -321465 -257606 -164937 -30812 2776 -8922 18167
23014 18167 20949 86325 142839 182366 219082 235951 214564 157936 135029 142254 -93870 -179649
23002 -179649 -214228 -18996 40447 147910 209602 45720 -152524 -136040 -141681 -102670 -122578
22991a22578K5447n7681K3292J44675J40639j28381j40932k7439n976Q9802l3062
22980i2194P6946L2102K1295j11586K3628O5078m1822L7834j26531P4163K2884
22969a8203l4971O1220R0301N561J9913r8653J21016R7221P6269r3621k20040
22958F013j16917Q86J66380J12940J30756l9245k01931j848N8339M2897J40164
22947B98434j08238Q4187L7196m754P3110j69391j43892k37800k31999P2717P9071
22936b51359J05081J63909J8587o7626k40126j07445J87091K27784J03623P209
22926A46728j81243j80669q7140M2378J7786K8158Q5567J22246J77080m4143n5246
22915G1502o5764m2679O3566j3831J09150M5858k3942L239n5396m3794p4031p5469
$$ plain form
22991 -122578 -97131 -154812 -131520 13155 153794 25413 -115519 -142958 -148934 -59132 -92194
22980 -92194 -15248 16854 38149 -73437 -49809 15269 -26553 11281 -115250 -41087 -18203
22969 -18203 -53174 8046 98347 103908 123821 25168 146184 243405 319674 226053 6013
22958 6013 -110904 -110018 56362 169302 300058 260813 58882 57034 115373 158270 298434
22947 298434 190196 274383 311579 306825 379935 210544 66652 -171148 -403147 -330430 -251359
22936 -251359 -146278 17631 36218 -31408 -271534 -378979 -191888 35896 139519 146728
22926 146728 -34515 -215184 -302324 -259946 -242160 -214002 -128435 -6189 170891 126748 71502
22915 71502 5738 -36941 26625 12794 121944 167802 143860 147099 91703 47909 -26122 -101591
22903a01591O5918j3643k00602j01172R665R0692O6876m098K09744J65427R8638
22892B85854O1236j1599j16541j55077j14585j68365J35699N0919L1520L5526
22882C4587R3110N3671k74887k13206J54199J76008k0224L266N0m3157K02207
22871A65624J07885j55559j93632J03088K20062j90902j61422L3340N3017M3125
22861B4626L1076O6004j43799p5984P6666Q4638p461K8359q5271j3451K49836
22850B35239n246q0209k1117N5173j5748K426N1500L480r6730j9602j25895K5278
22838H549j03940j09544k2824P7436K3624N7104j2459l1256m6247J28159J74622
22827A43224j4009j3005p6700O1096J63426N0650k18024n3076N1807p9802J30068
$$ plain form
22903 -101591 -35673 -49316 -249918 -351090 -341425 -250733 -183857 -187955 21789 187216 285854
22892 285854 347090 335491 218950 63873 -50712 -219077 -83378 -32459 -939 34587
22882 34587 127697 181368 -93519 -306725 -152526 23482 3258 6524 6574 -36583 165624
22871 165624 273509 117950 -75682 27406 247468 56566 -104856 -71516 -18499 24626
22861 24626 55702 121706 -22093 -98077 -21411 63227 55766 84125 -1146 -14597 235239
22850 235239 229993 149784 128667 183840 168092 170518 222018 225498 128768 109166 -16729 8549
22838 8549 -95391 -204935 -227759 -150323 -126699 -69595 -82054 -113310 -159557 -31398 143224
22827 143224 129215 116210 39510 100606 264032 314682 96658 43582 95389 15587 145655
22816A45655o3540o348j02170k440J17570n5591P8312J48447j20759m9703J34495
22805B23928J26032j3640j22568j8639J46740n5820M0023J25271j77861j71035
22795A02431r0242R1329R9871O1125p5421j58864N4485M2314m2177p2968J3572
22784B5455M1687j24644j02377r3422k7412J18403N7218N9332N4526j73844O7950
22773i7128j6543O7202K07007N654m0020L8376M0969n020j42295o7709k46M8630
22761C8877J5732k04106J1400J24444o3060J16641K32560l208j72687k22484L6282
22750h9609K7215j25537M0910J34232J92544J63387m7499j71498q1238L5476O985
22739H5368O4790M4039p5518j60684P1883J92082R8124m04j44092J81699L6583
$$ plain form
22816 145655 82115 75767 -26403 -28843 88727 33136 111448 259895 139136 89433 223928
22805 223928 349960 336320 213752 195113 341853 286033 326056 451327 273466 102431
22795 102431 12189 103518 203389 264514 189093 30229 84714 127028 84851 11883 25455
22784 25455 67142 -57502 -159879 -253301 -280713 -162310 -105092 -45760 8766 -165078 -97128
22773 -97128 -113671 -46469 160538 166192 126172 164548 205517 200497 58202 -9507 -9753 38877
22761 38877 54609 -149497 -138097 -13653 -76713 39928 272488 269280 96593 -125891 -89609
22750 -89609 -62394 -187931 -147021 -12789 179755 343142 295643 124145 42907 78383 85368
22739 85368 150158 194197 118679 -42005 29878 221960 320084 319680 175588 357287 393870
22728C93870p2480j0608p1392M218r6096J14895P5626o2218k16397n4042J03102
22717A08478M2034J3038J22966P274N125k325j35702r7258j78159j17197P2972
22706a58754J77781P8849j21407M3885P5529N680M308J37242J928j29223j17905
22695b087M8843r9435m8511j39275j28022J91557L8586K34245K31807o0737j08295
22684A58676M319L9573k52505P482Q3970r1045J69766J21520j1588j37338l6120
22673E6710l5584L6590J14376K807M8274K4489j05338r4685M5457j5618p1356
22662F122Q8235K981l072k10062Q6735K70624j29347r4666l950J89517N4042o0499
22650A96660j42158M5406M6976O249L9562k4870j4435n8866p0850L4587N6892
$$ plain form
22728 393870 321390 310782 239390 243608 147512 262407 338033 275815 59418 5376 108478
22717 108478 150512 163550 286516 293790 298915 296590 160888 63630 -114529 -231726 -158754
22706 -158754 19027 97876 -23531 20354 95883 101563 105871 243113 245041 115818 -2087
22695 -2087 46756 -52679 -101190 -240465 -368487 -176930 -138344 95901 327708 266971 158676
22684 158676 162995 202568 -49937 -42455 41515 -49530 120236 241756 230168 92830 56710
22673 56710 21126 57716 172092 174899 223173 247662 142324 47639 93096 77478 6122
22662 6122 94357 97338 94266 -115796 -29061 241563 112216 17550 13600 203117 257159 196660
22650 196660 54502 99908 146884 153133 192695 167825 153390 94524 23674 58261 115153
22639A15153k2001n1563o0036R7653J03519j46148j91189j847R2783J91112N5301
22628A82737q1392P1084J15579K5006q5406J479r8976r1872J07632J0049j18760
22617C7160k2840L4017k08380n75j17835k3969J90755M0107n4338k2756j855P5640
22605g4869j2337O2616J8927j7522j55820K8441o1793j750R3920K1932p1202q5846
22593b55303J42956L14985P2483J6604j88516j27229J6267O1106m8101k0486j4251
22582b9485l388L5015J3382K05195J3443l8307j10716j22231O9858K7446j0563
22571D9649p9342o5227K56718K14755l1116n0547j91877j93268J1502K4683Q5616
22560C1546m6837j8727l3642n2771j7103J50828Q2422j4324N3841m5876j74787
$$ plain form
22639 115153 93152 41589 -18447 79206 182725 36577 -154612 -156459 -63676 127436 182737
22628 182737 101345 172429 288008 313014 227608 229087 130111 38239 145871 155920 37160
22617 37160 14320 48337 -160043 -160618 -278453 -302422 -111667 -71560 -125898 -148654 -150509 -74869
22605 -74869 -87206 -24590 -5663 -23185 -179005 -150564 -212357 -214107 -120187 -98255 -169457 -255303
22593 -255303 -112347 202638 275121 291725 103209 -24020 -7753 53353 5252 -15234 -29485
22582 -29485 -32873 2142 15524 220719 234162 195855 85139 -37092 32766 60212 49649
22571 49649 -29693 -94920 161798 376553 345437 294890 103013 -90255 -78753 -54070 31546
22560 31546 -15291 -34018 -67660 -120431 -137534 13294 95716 81392 135233 89357 -85430
22549h5430J9454J99028l588J04630n0937l8782n3402R842K8515k114Q5511j92
22537B12535n1104M2882n7270r0638j4625K2079Q1162l4682O346m0297L8463q395
22525A06456k10789o6926O3238J35201Q0267L949L3962P6247p157J05495l2014
22514B87929Q2922q8731L9815r520O9132p7214k20038j30317o478L4920Q155J0171
22502G46k4898o3567J08850l558O4529Q4442J2976j0484m9613k6040m3218L4985
22490H5150n834p361l5872p8752R3801J1616k70815k4300J48257O8368R300j42337
22478a48779L5995j0330L7542J87993R358J6104J616L715m5902l7291O2374l5018
22466G7377j52904m8031J59306J88186m852j82553o3902P2657j206j55724k587
$$ plain form
22549 -85430 -65976 133052 129464 234094 183157 144375 90973 100815 129330 127216 212727 212535
22537 212535 161431 204313 147043 56405 41780 63859 145021 110339 116685 76388 114851 106456
22525 106456 -104333 -171259 -108021 27180 107447 111396 145358 221605 214448 319943 287929
22514 287929 370851 282120 321935 312415 381547 304333 84295 -46022 -52500 -17580 -9425 746
22502 746 -24152 -87719 21131 17573 82102 166544 179520 169036 119423 93383 50165 85150
22490 85150 79316 71955 36083 -42669 51132 62748 -208067 -232367 -84110 -15742 -6442 -148779
22478 -148779 -112784 -123114 -85572 102421 111779 127883 129499 133214 87312 50021 112395 77377
22466 77377 -75527 -123558 35748 223934 219082 36529 -27373 45284 44078 -111646 -114233
22455a14233J02971N3505k8622N3784j38152o4146p9026l6797j77829J56494K26227
22444d5824J11045R923J1334Q7182R1559N8042J15299n981j22601n0327p0300
22433A89351R5745Q942k1538k11349o4735O572p1263N5220K37122R7925P7087
22422C99079l01905j53115L4303J51151J23833k8304m4411k2414J40375J5884
22412C14476O39q736o6371K0843p2301K7739J56833J92570j55650j72886j00145
22401A37011j40814N5160q8896j18943J07975M0622M1291R7770J24927k1813m7467
22390A86823J8310M2109K739l1352q0898r956P7348L9559j19360j64029m2279
22379h0986P4928K63423O7361j36772k95024j94515o1408O2874N2580O1801K34736
$$ plain form
22455 -114233 -11262 42243 13621 67405 -70747 -134893 -213919 -250716 -428545 -272051 -45824
22444 -45824 65221 75144 86478 173660 265219 323261 438560 432579 309978 259651 189351
22433 189351 285096 294038 272500 61151 -3584 2988 -68275 -13055 224067 321992 399079
22422 399079 97174 -55941 -21638 129513 253346 225042 180631 158217 298592 314476
22412 314476 315115 306379 240008 260851 188550 216289 373122 565692 410042 237156 137011
22401 137011 -3803 51357 -37539 -156482 -48507 -7885 33406 131176 256103 234290 186823
22390 186823 205133 247242 249981 218629 137731 127775 205123 244682 125322 -38707 -80986
22379 -80986 -6058 257365 324726 187954 -107070 -301585 -362993 -300119 -247539 -185738 48998
22368D8998N0321j60305p6011P4213P3509j13012k06553k1478J70785R3426K282
22357f3825p6688j18993J61466K31771J9395K9988M3571o1706j02065n6674n9348
22346e3108N8153Q0602r9930o0553J46450m8013J0534k1829o9989J21824K07665
22335B71806n3304J3577l5649n4106j63856O759K096P3664K17791J81574p443
22324D52909p1206j58854j64722n9951M528k6853N39O1889J66062K8132J30886
22313C63359L8714k35437r4774k5714J91125m917q6670O750j3686q3044L1331
22302H7037P6832n7420P0091R8505o4440j90328n9364R0616M5233m7841J06533
22291A55454O2931r397n0319r6001j5834J25663j7469n3109n837J6345J47402
$$ plain form
22368 48998 99319 -60986 -136997 -62784 10725 -102287 -308840 -330318 -159533 -66107 -63825
22357 -63825 -140513 -259506 -98040 133731 153126 183114 226685 164979 62914 6240 -53108
22346 -53108 5045 85647 -14283 -74836 71614 23601 34135 12306 -57683 64141 271806
22335 271806 218502 232079 196430 142324 -21532 -14773 -12677 60987 278778 460352 452909
22324 452909 381703 222849 58127 -1824 2704 -24149 -23610 38279 204341 232473 363359
22313 363359 402073 166636 71862 46148 237273 232356 145686 152436 138750 55706 87037
22302 87037 163869 106449 176540 275045 210605 20277 -39087 51529 96762 48921 155454
22291 155454 218385 208988 158669 62668 46834 172497 155028 101919 96082 112427 259829
22280B59829p0934O5719L5290r010j17242j1522j8299K7944l9387K26607J31849
22269D80844j02102j03406j07157j10749j29487K1013J22297o0582J1482Q63p3072
22258e0056Q8047K71875N4192J825j05938n8499J1174O7815Q6337J43018j12465
22247C97325l35267j05435n5245o5510K0172K4801L582j9247l3566r3304P6006
22236a85688J75711Q4924J75195M5871k92102j38868J18140J30544N7285j6384
22226A54628L6578o020R3541J52773m7948n0917j15009m3244N3780L8541P0587
22215C37290M5363J23299K7357q0984j12886j28273j17766O6298M3646j94434
22205H910k2700J09632Q0026M1082M0891q6964j0671k0072J473J2436M6837J2859
$$ plain form
22280 259829 188895 254614 289904 280894 163652 152130 133831 161775 122388 348995 480844
22269 480844 378742 275336 168179 57430 -72057 -51044 71253 10671 22153 23016 -50056
22258 -50056 37991 309866 364058 365883 259945 201446 212620 280435 366772 509790 397325
22247 397325 62058 -43377 -98622 -164132 -143960 -119159 -115577 -134824 -168390 -261694 -185688
22236 -185688 -9977 74947 250142 296013 3911 -134957 -16817 113727 171012 154628
22226 154628 191206 185186 278727 431500 383552 332635 217626 174382 228162 266703 337290
22215 337290 382653 505952 533309 452325 339439 211166 93400 159698 203344 8910
22205 8910 -13790 95842 175868 216950 257841 170877 160206 140134 141607 154043 200880 213739
22193B13739O6021L5226J33269m5757q1207j03553m6247j39550j77580J39767
22183e872J36233Q9002P8866R9425j19239K8915N9782j89642j65255P4907K25023
22172C12145j65352j39582p2804j8300O6197K00087J25636j2960m5511j2908l3834
22161B02814o6414m5654k6075R4071J39519J1684k0999M3521j2721L6733R8496
22150D54975p5151j05114l0498P7748l4217k06686R905j4134k2883m3663K9544
22139C9826N4031j1387O0567J27038P6313m9926j2253J160L3001O315N0814q9236
22127B86263l7631K2630J65108n5791j04090j30275p5263Q9474J6578r364q8097
22116G9542j56901j03189M0863q2143J3053R0541J16887O4474k8764l1010N6474
$$ plain form
22193 213739 279760 314986 448255 402498 321291 217738 171491 31941 -145639 -5872
22183 -5872 130361 219363 298229 397654 278415 307330 367112 177470 12215 87122 312145
22172 312145 146793 7211 -65593 -83893 -17696 182391 308027 295067 249556 236648 202814
22161 202814 136400 90746 64671 158742 298261 309945 288946 332467 319746 356479 454975
22150 454975 379824 274710 244212 321960 287743 81057 90962 76828 53945 10282 39826
22139 39826 93857 82470 143037 270075 346388 296462 284209 285369 318370 324685 375499 286263
22127 286263 248632 271262 436370 380579 276489 146214 70951 160425 177003 167639 79542
22116 79542 -77359 -180548 -139685 -221828 -208775 -118234 -1347 63127 34363 3353 59827
22105E9827q8321k8559N1719M3908j8795P981M5692O3458N3571m6890m745m6023
22093I2823K1984n1616n4274J46162M3183M7201n250k0961l8639q0520N4328O6828
22081B21249M8342J2496j58645j12751J8230J44043M7800J73020P4045k22899
22071B44930L9344J15211j01925o5425q0171j19177p5098j20104K08515Q4876
22061A30976l8613J00415K06278N1295J30555j21131j51642q6504J9788q1286
22051A60131q8029J64752Q5045j08187J33579K77655m353m1541M1438j81989j55606
22040B82895q2845r553K3019L4385P6120j27151P8223P2300n8314j47553m3062
22029I8464K5539J06429j45565j21425L6940M2109J25103L4018r4348r1523j82111
$$ plain form
22105 59827 -28494 -57053 -5334 38574 19779 27760 73452 136910 190481 143591 138846 92823
22093 92823 114807 63191 8917 155079 198262 245463 240213 219252 180613 100093 154421 221249
22081 221249 269591 282087 123442 10691 28921 172964 220764 393784 467829 244930
22071 244930 284274 399485 297560 232135 151964 32787 -42311 -162415 46100 130976
22061 130976 92363 192778 399056 450351 580906 459775 308133 221629 241417 160131
22051 160131 72102 236854 321899 213712 347291 624946 620593 579052 620490 438501 282895
22040 282895 200050 190497 213516 247901 324021 196870 275093 347393 289079 141526 98464
22029 98464 124003 230432 84867 -36558 382 42491 167594 201612 107264 15741 -166370
22018a66370K51477L78786n0317p0594P0986j20238j7263R2272j0613n5034j7467
22007B85625k3614l8514q0458M1819J3509n3749K3433N7940l7386j8725J04708
21996B74588J6985r2872j31318J85146M0042k9802r3376m7505L2411P9264J47774
21985C81337q1550M8024o3972k2193J6857j47527l1171P2118P4319q6380j1450
21974A48412L9119L2738m4152J64646O8733r4422j15313r7755O6873n0132n8065
21963F0682J40271J05958J16520Q4802j64544j62735K1273J07650J19775J0531
21953D40183J3403o1650k9302j11998j4357m9327j3501P6543j5757O4184K03268
21942E01689p4935q6230n7015j62671N7748J04631J06436j3693l6507K20151N2472
$$ plain form
22018 -166370 85107 463893 413576 342982 413968 293730 276467 368739 358126 303092 285625
22007 285625 262011 223497 143039 184858 198367 144618 168051 225991 188605 169880 274588
21996 274588 291573 198701 67383 252529 292571 262769 169393 121888 154299 233563 381337
21985 381337 299787 347811 283839 261646 278503 130976 99805 171923 246242 159862 148412
21974 148412 187531 220269 176117 340763 409496 315074 199761 102006 168879 118747 60682
21963 60682 200953 306911 423431 508233 343689 180954 202227 309877 429652 440183
21953 440183 453586 391936 362634 250636 236279 186952 173451 249994 234237 298421 501689
21942 501689 426754 340524 283509 120838 178586 283217 389653 375960 339453 559604 612076
21931F12076j09229j60021j29922j04203k6081j85055j6044J56826J03723R0153
21921B32223P7176L100j50029l6458j16010N3710N9282j44467k8536l901J43604
21910H9694K08102O5116P3106j47747r7813R2806J10246L7515k6467n8109r3077
21899B53372k9264r9581j6819L6851K4754J64098K456L2127K9831q8868j76081
21888A32876j0939Q9885L9671p3467M8878o027k9021N2064N1373O079j1996j64574
21876A24802q0406J21273j1206J20022J04337O838j19799j11431L5071Q5429N8206
21865C33136o4190J8580P1018L8743j45196k0795J23025k01328J53815N6578n3619
21854C09767m6388J0589l2598M5774q1737k0980R9153l4587n5941k14117n276
$$ plain form
21931 612076 502847 342826 212904 108701 82620 -102435 -118479 38347 142070 232223
21921 232223 309399 312499 162470 126012 10002 63712 122994 -21473 -50009 -53910 89694
21910 89694 297796 362912 436018 288271 190458 283264 393510 431025 404558 346449 253372
21899 253372 224108 124527 107708 144559 169313 333411 335867 367994 397825 308957 132876
21888 132876 121937 211822 251493 178026 226904 220877 191856 243920 295293 301372 289376 124802
21876 124802 44396 165669 154463 274485 378822 385660 265861 154430 189501 274930 333136
21865 333136 268946 287526 358544 397287 252091 231296 354321 152993 306808 363386 309767
21854 309767 263379 273968 241370 287144 205407 184427 283580 248993 193052 -21065 -26341
21843b6341J35266j09027Q9001N2726k4092l8491R8306Q9676J26216J935m8787
21832C46388j04040K6401j20925j54443Q3137Q0590J8570J75899j2596K2011J67594
21821E28586Q9389j02490l46832n3670r7311P1459J29778N8096m2286j12050n871
21810A16798j45242q1607J02939N2122J11264J00376J55888K0623j16387j20131
21800A96643o8146J0806J41842K17622j1267p9895l2185J54759N4776o4748k301
21789E17906q9300Q1278J968n9764J79817K35413K8082j03081O0271J23864J37549
21778A114003m1329m7484p5206P5437N7662n6259K3963P9053R8349j20342j73685
21767I34162m5679Q8614N9659j03127o0307j5670p8372m3865j38919o9355k5613
$$ plain form
21843 -26341 108925 -102 88899 141625 117533 79042 177348 267024 393240 395175 346388
21832 346388 242348 268749 147824 -6619 76518 157108 175678 351577 338981 360992 528586
21821 528586 617975 515485 168653 114983 17672 89131 218909 277005 234719 122669 116798
21810 116798 -28444 -110051 -7112 45010 156274 256650 412538 433161 316774 196643
21800 196643 128497 139303 281145 498767 487500 407605 375420 530179 584955 520207 517906
21789 517906 428606 509884 511852 452088 631905 867318 895400 792319 852590 976454 1114003
21778 1114003 1072674 1025190 949984 1025421 1083083 1026824 1050787 1129840 1228189 1107847 934162
21767 934162 888483 977097 1036756 933629 873322 857652 779280 735415 596496 527141 501528
21756E01528J18974m108j79578j42753M0014O0916N3194R7833J7366k6256j7853
21745E19277k9623q3355n4658K7270j08655j53356q4693J12299M6739K3001K01102
21734D15348M7782J22383r3225j49290K06203J10583k41730j5136j02814K393
21724C02497M2815Q0554J19540m6958l1946N5578L6912r2073R4994j6708l0670
21713E14535Q5680j19824k36618l0421J57075P1376n9414Q2058R7403L4415K173
21702E98438j23399j22239O4025L3227j5227O2713M9050j71438k31798o8636L6789
21691A11505J5946j8971j2932M5982M085R2583J03977J31355N6221r8690M0668
21680D71729k0133l8818q7233N8232j36828J7681P1491r6104k7400j49376j03853
$$ plain form
21756 501528 620502 616394 436816 294063 334077 394993 448187 546020 563386 537130 519277
21745 519277 489654 406299 351641 378911 270256 116900 32207 144506 191245 214246 415348
21734 415348 463130 585513 492288 342998 549201 659784 418054 402918 300104 302497
21724 302497 345312 425866 545406 498448 466502 522080 558992 466919 561913 545205 514535
21713 514535 600215 480391 243773 213352 370427 441803 382389 464447 561850 596265 598438
21702 598438 475039 352800 416825 450052 434825 497538 546588 375150 143352 74716 111505
21691 111505 127451 108480 95548 141530 145615 238198 342175 473530 529751 431061 471729
21680 471729 451596 412778 325545 383777 246949 264630 336121 240017 212617 63241 -40612
21669d0612Q3780J31648M9695J49713k595r5281K7834K07097l4488j76518k1267
21658B79006P1380J8196J4972o5625N9813J58827L4711j41014m6358L7751L3960
21647D55619Q212k5684m9709J46325J72773p4527j54956k0340j6180k1409M0783
21636D60907K4909r5488Q6679l8825r7725M6660K8612q1560j7323j05678J10508
21625C21676O2216n929q9146P9868P3651K0995j65990N2934M0195O6332J6453
21614D73255l2003P3744m2889l4137K8530k8556L0630J3997l2086n3197M4172
21603D41460J1391O4387j1472o2811K7750J1282m6906n6793K3998j07787P1057
21592C65556J77460K0523q3288O5013l3990j16143Q7794O8961K1537j25075J7946
$$ plain form
21669 -40612 43168 174816 224511 374224 371629 276348 304182 511279 476791 300273 279006
21658 279006 350386 368582 383554 317929 377742 536569 571280 430266 383908 421659 455619
21647 455619 463831 438147 388438 534763 707536 633009 478053 457713 441533 420124 460907
21636 460907 485816 390328 477007 438182 340457 387117 415729 334169 316846 211168 321676
21625 321676 383892 377963 288817 368685 442336 463331 297341 350275 390470 456802 473255
21614 473255 441252 514996 472107 437970 466500 437944 468574 482571 450485 397288 441460
21603 441460 452851 517238 505766 442955 470705 481987 435081 378288 402286 294499 365556
21592 365556 543016 563539 480251 545264 511274 395131 482925 551886 573423 448348 466294
21581D66294j7195q4606l4251J01168r1439n7575M7029j19877L3560m5391O9384
21570B67101M5032n351O2032J22311J8737j31699p3006J03618O2904m9227l3320
21559C89132L4906J46988J04940o8952r4084k6526O6698J68655k6050m759k58655
21548D32293m0621o0544n7723O8608J22896P1803j12851o7798j51348K43364J61214
21537F09293R8517J09587l31621j48756n0235J35291k7659p696R9192J93016K3197
21526G02126j74331j66701o2502K22810J84280l616O087j15195q764P9179Q7795
21515G51168J44645n887j59768r7737L2666Q9972l1714p5170n0683Q2300j09682
21504E70110k9379R6893j77337o0855R9308J29379k3362k589o809r8284Q4346
$$ plain form
21581 466294 449099 364493 330242 431410 339971 282396 329425 209548 243108 197717 267101
21570 267101 312133 306782 368814 491125 509862 378163 305157 408775 471679 422452 389132
21559 389132 424038 571026 675966 607014 512930 486404 553102 721757 695707 690948 432293
21548 432293 391672 331128 273405 342013 464909 536712 423861 356063 204715 448079 609293
21537 609293 707810 817397 485776 337020 286785 422076 394417 386721 485913 678929 702126
21526 702126 527795 361094 298592 521402 705682 702066 708153 592958 584194 663373 751168
21515 751168 895813 889926 730158 632421 665087 755059 723345 648175 597492 679792 570110
21504 570110 540731 637624 460287 399432 498740 628119 604757 602168 595359 497075 581421
21493E81421J3727O4645J21158k536K7707N4335J92720R4606O8144l3242o2112
21482A120573L247J23279K2981J6744R5626J50414R911o9002J82548J26909M7661
21471A830891J8170P5029J17321j83781k36631l2836q5999l2739L3836j07177
21461A396084j03991K0467j0305K57568K11126P5212K41477M4661O3038q1653
21451B113684O0957j61846k97175j82971p3882j72567J05965J39897m6980L3742
21441A518824j23472j27459L1487k64073k46150J25790j5479J8476k9641l6999
21431H51304j62424J37808J24148l7766q982J86009l1300k39718r2387n3199l7368
21420F36125m2535J22112M4623J571K5442R6751J6317l6529j68016j6054O3575
$$ plain form
21493 581421 595148 659793 780951 778415 806122 860457 1053177 1147783 1215927 1182685 1120573
21482 1120573 1123820 1247099 1270080 1286824 1382450 1532864 1542775 1473773 1656321 1783230 1830891
21471 1830891 1849061 1924090 2041411 1857630 1620999 1588163 1502164 1469425 1503261 1396084
21461 1396084 1292093 1312560 1302255 1559823 1770949 1846161 2087638 2132299 2195337 2113684
21451 2113684 2174641 2012795 1715620 1532649 1458767 1286200 1392165 1532062 1485082 1518824
21441 1518824 1395352 1267893 1299380 1035307 789157 914947 899468 917944 888303 851304
21431 851304 688880 826688 950836 913070 904088 1090097 1058797 819079 726692 673493 636125
21420 636125 593590 715702 760325 761896 787338 884089 900406 863877 695861 679807 743382
21409G43382J16964K1188P7602l3583j758J25843k7622j07805M4164Q0303J00727
21398A139405k0581j32808k71824j96752J0398J69552Q2576J1397P481p3311L2868
21387G58401J63317P129P2055j25688k7434m5179j66659M4058J03929O4471J21524
21376I69924J38941K4613j37739q0139R459K8735L7709j45537m3920K21835Q4957
21365A108838K6069L1844j85770K4090L8077j04796j72564J72750l7789k9042
21355H71707k8657J73271J4377O4386J74482O1219j42791p5250p3433L6026R1038
21344A166375J21594l9510q105J19717O1087m7151k1063r5393k75861k0331J85386
21333A146745K09470R3741m8686m2401j08578Q2809L5889L0858P9501o3550j70586
$$ plain form
21409 743382 860346 881534 959136 925553 923795 1049638 1022016 914211 958375 1038678 1139405
21398 1139405 1118824 986016 714192 517440 527838 697390 779966 791363 798844 725533 758401
21387 758401 921718 928847 1000902 875214 847780 802601 635942 680000 783929 848400 969924
21376 969924 1108865 1133478 995739 915600 925059 953794 991503 845966 802046 1023881 1108838
21365 1108838 1134907 1166751 980981 1005071 1043148 938352 765788 938538 900749 871707
21355 871707 843050 1016321 1030698 1095084 1269566 1330785 1187994 1112744 1039311 1075337 1166375
21344 1166375 1287969 1248459 1240354 1360071 1421158 1374007 1352944 1257551 981690 961359 1146745
21333 1146745 1356215 1449956 1401270 1358869 1250291 1333100 1368989 1399847 1479348 1415798 1245212
21322A245212k46967o7193k3777N8067J27236l4639l7926R1790K39904J02524
21312A454231j65682p0739j15636k0306J62551j2669N5083J05329j6444o9055
21302A306663J09377J705j44871o499J4883O533J82666K26771L2287j52671q4090
21291A492754P4255J19695J4478n3159J3623O5111p922j20694q6912p2297N8889
21280A497821o2255R4858J58271j3948j44849p5741M8001O5688R991l9174J27309
21269A665972P5741J0319J22577J07390J30688l1108J05034J55678r0432J5002
21259B266861K49027N5947o3588L3105p0444j10524n8386r1181k682O9766m6459
21248B231442j97939J7367L3635R7190J07060J27591k703n1453r7725q6419q3829
$$ plain form
21322 1245212 998245 931052 907275 965342 1092578 1057939 1020013 1111803 1351707 1454231
21312 1454231 1288549 1217810 1102174 1081868 1244419 1231750 1286833 1392162 1375718 1306663
21302 1306663 1416040 1417745 1272874 1266375 1281258 1287791 1470457 1697228 1729515 1576844 1492754
21291 1492754 1567009 1686704 1701182 1648023 1661646 1726757 1718835 1598141 1511229 1438932 1497821
21280 1497821 1435566 1530424 1688695 1674747 1529898 1454157 1502158 1567846 1577837 1538663 1665972
21269 1665972 1741713 1752032 1874609 1981999 2112687 2081579 2186613 2342291 2251859 2266861
21259 2266861 2515888 2571835 2508247 2541352 2470908 2360384 2301998 2210817 2208135 2277901 2231442
21248 2231442 2033503 2050870 2084505 2181695 2288755 2416346 2413643 2362190 2264465 2178046 2094217
21237B094217j12948l1593o9247k7528Q0527P5322J32932N1422J30829K06990
21227B530923r7579q9032j6172J71899R723K1966L3968l179N0568J45724J28695
21216B887504n9142j1987J6527Q1575K8821K2635L4645m8951O3129K42034J08515
21205C365305M9097K1750R5962Q0463n0594J03488K09721m332m5246J4352M1283
21194C881249J88272J22449m4508J54316J72065J63082j20860O718J53013M01017
21184E076813L12340K08273K18544R4488P3478L77109L83202Q6455J81733K24958
21174G237393K46858J75925R3400K32915M45316M36191K41626Q6152L52149L37304
21164I885229O37556O68954N66006N91041N27154N36263P30993O45601P50022
$$ plain form
21237 2094217 1981269 1949676 1880429 1852901 1933428 2008750 2141682 2193104 2323933 2530923
21227 2530923 2433344 2344312 2328140 2500039 2509762 2531728 2565696 2562517 2613085 2758809 2887504
21216 2887504 2828362 2816375 2832902 2914477 2943298 2965933 3000578 2951627 3014756 3256790 3365305
21205 3365305 3414402 3436152 3532114 3612577 3561983 3665471 3875192 3870860 3825614 3839966 3881249
21194 3881249 4069521 4191970 4147462 4301778 4473843 4636925 4516065 4522783 4675796 5076813
21184 5076813 5389153 5597426 5815970 5910458 5983936 6361045 6744247 6830702 7012435 7237393
21174 7237393 7484251 7660176 7753576 7986491 8431807 8867998 9109624 9195776 9547925 9885229
21164 9885229 10522785 11191739 11757745 12348786 12875940 13412203 14143196 14788797 15538819
21155A5538819P35470P48397Q70662J031634J183314J306720J394158J914762
21147B4723936K386578K592524L097376L536042M019313M864702N800003O579749
21139E7600223P813563R263234J1065875J2894146J4748338J6404180J7270541
21132A47060100J7016905J4757766J0769006N371290j041223p623894j3424166
21125A72885784j7171927j8695683j7990787j6033350j3656111j1254267r341617
21118F8742042p570867o122000n003709m077619l330285k984485k581942k175267
21110C4895868j864198j484293j314788j325787j073057j060283j150200r15989
21102B4707273j001569j277997j209377j070133j084481j225681j266757j115780
$$ plain form
21155 15538819 16274289 17022686 17893348 18924982 20108296 21415016 22809174 24723936
21147 24723936 27110514 29703038 32800414 36336456 40355769 45220471 51020474 57600223
21139 57600223 65413786 74677020 85742895 98637041 113385379 129789559 147060100
21132 147060100 164077005 178834771 189603777 194975067 193933844 186309950 172885784
21125 172885784 155713857 137018174 119027387 102994037 89337926 78083659 68742042
21118 68742042 61171175 55049175 50045466 45967847 42637562 39653077 37071135 34895868
21110 34895868 33031670 31547377 30232589 28906802 27833745 26773462 25623262 24707273
21102 24707273 23705704 22427707 21218330 20148197 19063716 17838035 16571278 15455498
21094A5455498j016241q23975p70907p57855p34833o40044l39366m62029m74938
21085I435310m01821l43620n81700l68435l29829m87566m57935l31961j45194
21076E987249n8283k77638k93009j83722p3306j29517j56042j93770j62553k15279
21066D244130j46662r3442q9242j42568k21689k55228m0525n5726J67510O1571
21056C428129j45554j06300j02015r1455j03555r8047j19n7983M4007p6065j0913
21045B680130J1811o8857j45215n1510o0104L6260K300L6366J8674L532j50064
21034B313323N1391R4494L4457l434q0748J73673O6608q655m0577J13999K77815
21023B992346J07266K73354J41648O2928O3179N2302K2370J45514P4670J8769
$$ plain form
21094 15455498 14439257 13615282 12844375 12086520 11351687 10711643 10372277 9910248 9435310
21085 9435310 9033489 8689869 8108169 7739734 7409905 6922339 6464404 6132443 5987249
21076 5987249 5928966 5651328 5358319 5174597 5101291 4971774 4815732 4621962 4459409 4244130
21066 4244130 4097468 4004026 3914784 3772216 3550527 3295299 3254774 3199048 3366558 3428129
21056 3428129 3282575 3176275 3074260 2982805 2879250 2781203 2781084 2723101 2767108 2691043 2680130
21045 2680130 2691941 2623084 2477869 2426359 2366255 2402515 2404815 2441181 2459855 2463387 2313323
21034 2313323 2364714 2459208 2493665 2490231 2409483 2583156 2649764 2641109 2600532 2714531 2992346
21023 2992346 3099612 3372966 3514614 3577542 3640721 3693023 3715393 3860907 3935577 3954346
21013C954346j6626r3497k54207j24599j73965p2529m7465o6072o5115J21471
21003C161742J91146O2780q4432p2589q3026L9975R8976J15002m0344k9177J28297
20992C488350K12265K19377k2969J00162K73468j6425m7526J16351j45546J21151
20982D298658K23815K33687M4338O6599N1965P327R4500K27871r1390j51508J26776
20971E132638M5725k5976L6004J07062K04758N0808R9117q7741m1870J61817L03694
20960E986036J20818J19008P2657J46189R2278J07581J59607K49366K40651K4033
20950G318224r509J15877K23485L46866J91220K59444L87540K66882Q4423K65332
20940I449784K37243M48004M08197L31628M80108M37538L95785N18804N59697
$$ plain form
21013 3954346 3937720 3844223 3590016 3465417 3291452 3218923 3171458 3105386 3040271 3161742
21003 3161742 3352888 3415668 3331236 3258647 3175621 3215596 3314572 3429574 3389230 3360053 3488350
20992 3488350 3700615 3919992 3897023 3997185 4270653 4254228 4206702 4323053 4177507 4298658
20982 4298658 4522473 4756160 4800498 4867097 4919062 4926389 5020889 5248760 5157370 5005862 5132638
20971 5132638 5178363 5152387 5188391 5295453 5500211 5551019 5650136 5562395 5520525 5682342 5986036
20960 5986036 6106854 6225862 6298519 6444708 6536986 6644567 6804174 7053540 7294191 7318224
20950 7318224 7308715 7424592 7648077 7994943 8186163 8445607 8833147 9100029 9184452 9449784
20940 9449784 9687027 10135031 10543228 10874856 11354964 11792502 12188287 12707091 13266788
20931A3266788M70991N86163O00073Q31006R68608R14731R84181J008151Q78868
20922B0509560J003528J189632J202454J165736J148497J554264J890018K104632
20914C1768321K210578K419972K681440L000869L171780L716413M346706M881576
20906E8197655N768088O709303P950160R487491J1157564J3432697J6182543J9556313
20898A48441814K3566060K7908179L2742023L7404866M0362806M0201990L5709975
20891C86337713K6391144J2866906l072952j9488806l3813592m2818113m4869158
20884B81533142m1350208l5040936k8513015k2937851j8507066j4775718j2021454
20877A08386894r815674q119018o678476n642440m594753l798749l217101k667513
$$ plain form
20931 13266788 13737779 14323942 14924015 15755021 16723629 17638360 18622541 19630692 20509560
20922 20509560 21513088 22702720 23905174 25070910 26219407 27773671 29663689 31768321
20914 31768321 33978899 36398871 39080311 42081180 45252960 48969373 53316079 58197655
20906 58197655 63965743 70675046 78625206 88112697 99270261 112702958 128885501 148441814
20898 148441814 172007874 199916053 232658076 270062942 310425748 350627738 386337713
20891 386337713 412728857 425595763 422522811 403034005 369220413 326402300 281533142
20884 281533142 240182934 205141998 176628983 153691132 135184066 120408348 108386894
20877 108386894 98571220 90452202 83773726 78131286 73536533 69737784 66520683 63853170
20869F3853170k420500k220939k300412k373393k746137k962901k915938k968512
20861D2944438k768401k646647k524708k188034k115551k207147j919194j789574
20853B4785182j700316j537272j450073j437773j389756r16484r10000r21554
20845A4521954p86896q47036r57281p81873n68896n65934n49258n38673n93819
20836H332288n70768m47512n36314m98649l34956l81515j53937j03369k91674
20827E013594j17205k39939l93245o5803j66257j87838k25556k49242k80087l62758
20817B725664l72291j16835j42296j12565j97171j26237p8479K21402L0229j41799
20807A689622k11580n4674m1623j38452q9423j44728M3799J74381j37845j98240
$$ plain form
20869 63853170 61432670 59211731 56911319 54537926 51791789 48828888 45912950 42944438
20861 42944438 40176037 37529390 35004682 32816648 30701097 28493950 26574756 24785182
20853 24785182 23084866 21547594 20097521 18659748 17269992 16353508 15443508 14521954
20845 14521954 13735058 12888022 11930741 11148868 10579972 10014038 9464780 8926107 8332288
20836 8332288 7761520 7314008 6777694 6279045 5944089 5562574 5408637 5305268 5013594
20827 5013594 4896389 4656450 4263205 4197402 4031145 3843307 3617751 3368509 3088422 2725664
20817 2725664 2353373 2236538 2094242 1981677 1784506 1658269 1579790 1801192 1831421 1689622
20807 1689622 1478042 1423368 1381745 1243293 1153870 1009142 1052941 1227322 1089477 891237
20797H91237r4634j7545M5961p2458j41065k6669p9992j96987m9721P7474J8909
20786C54510j79110l648J00518q4927p1347J36920P6280L8594P7550m0663k4209
20775C80468J20378J10113J910J75718K2774k02515k02805k17618j2657r132j512
20764A65122N2318M8087j61668k37607n3720P6229O8608P2484P5517r7485N5809
20753F3694j28392j09043j25676j05104J07291J20586k0485J957m1273O3116k8432
20742b01761K8101L5193o6984K5312L9108K2178M5725N3805P5377l7362j19942
20731a01250p0481Q0123l884K3751J22874k8882j04167r9724p1743m1484L4556
20720b60311o0990l203J24057Q5311j31833P4321O7207O4675q0305J17256J249
$$ plain form
20797 891237 796603 779058 825019 752561 611496 584827 504835 307848 258127 335601 354510
20786 354510 175400 171752 272270 187343 115996 252916 329196 367790 445340 404677 380468
20775 380468 500846 610959 612869 788587 811361 608846 406041 188423 175766 166634 165122
20764 165122 217440 265527 103859 -133748 -187468 -111239 -42631 29853 105370 7885 63694
20753 63694 -64698 -173741 -299417 -404521 -297230 -176644 -197129 -195172 -236445 -173329 -201761
20742 -201761 -173660 -138467 -205451 -180139 -141031 -118853 -73128 -19323 56054 18692 -101250
20731 -101250 -171731 -91608 -95492 -71741 51133 22251 -81916 -181640 -253383 -294867 -260311
20720 -260311 -321301 -324504 -200447 -115136 -246969 -172648 -105441 -40766 -121071 -3815 -2566
20709b566j26087k33328N909N8756J54834O1633M9131j61724r1447K1340J530
20698b62019n7487k2555L7940P9544J4617R7588J6717j37158j76439q2344J6543
20687d75053M3305K16439J27858O6184p7885j41692J01829l7613r8659j39943
20677d15230L2974k4174m0604k0872o8466j08889J10705K2572O9896J1098j42639
20666e73629J4661Q3293K23538J86855j2598j30860j35786j38782L917l929J95143
20655b88177K8386j44986l4458L9722P8408m3504J53083O3760j03062j30118l0808
20644d11754J9424J05341O4933p4666j13291j72254l4736j1736k0877m613Q0600
20633e73629j8510k0758o6271O4258q7196l1547J82153Q0334r2175j41343J26945
$$ plain form
20709 -2566 -128653 -361981 -356072 -297316 -142482 -80849 -31718 -193442 -284889 -263549 -262019
20698 -262019 -319506 -342061 -304121 -224577 -209960 -112372 -95655 -232813 -409252 -491596 -475053
20687 -475053 -431748 -215309 -87451 -21267 -99152 -240844 -139015 -176628 -275287 -415230
20677 -415230 -382256 -406430 -447034 -467906 -536372 -645261 -534556 -511984 -442088 -430990 -573629
20666 -573629 -558968 -475675 -252137 -65282 -77880 -208740 -344526 -483308 -479391 -483320 -288177
20655 -288177 -259791 -404777 -439235 -399513 -321105 -364609 -211526 -147766 -250828 -380946 -411754
20644 -411754 -392330 -286989 -222056 -296722 -410013 -582267 -617003 -628739 -649616 -654229 -573629
20633 -573629 -592139 -612897 -679168 -614910 -702106 -733653 -551500 -471166 -563341 -704684 -577739
20622e77739J52441J56445N3712j51836j65656o8435J17279k4825Q3917N5323
20612c69374N6625Q7047k9727n9785j18093o4842j50120J6308J9264J30484P2779
20601d09434m8742l7806J31251Q003j50184r0234O4607J38519m8971R9834J26479
20590b16678J3014Q7013j1207p6801M9574k4833j47208j35219l2649J01088N2411
20579c41495J14198r9380j08177q8423M0362J3665m7231q1853K08822K70545J76579
20568E7612k460j72557j26652k05209k38129L4771J14934R3296K08726J8040K6135
20557a91493j18849j83192j14035p7623R319J0978N7477j5021Q4658J57329J75250
20546b05202J03288p778P4922q2296J6800r5273k68953j87754r036K49575J59503
$$ plain form
20622 -577739 -425298 -268853 -215141 -366977 -532633 -601068 -483789 -508614 -424697 -369374
20612 -369374 -312749 -225702 -255429 -315214 -433307 -498149 -648269 -631961 -612697 -482213 -409434
20601 -409434 -458176 -495982 -364731 -356728 -506912 -597146 -532539 -394020 -442991 -343157 -216678
20590 -216678 -203664 -116651 -127858 -204659 -155085 -179918 -327126 -462345 -494994 -393906 -341495
20579 -341495 -227297 -326677 -434854 -523277 -482915 -469250 -516481 -598334 -389512 -118967 57612
20568 57612 55152 -117405 -244057 -449266 -687395 -652624 -537690 -444394 -235668 -217628 -191493
20557 -191493 -310342 -493534 -607569 -685192 -675873 -664895 -607418 -622439 -537781 -380452 -205202
20546 -205202 -101914 -109692 -34770 -117066 -100266 -195539 -464492 -652246 -661282 -411707 -252204
20535b52204L4317Q4109J1685j03985m1761Q6904n6795k05949N2306L8710N1900
20524c00763m2564j00295m2671J03103N4243p6885l0364k52766m196L42876J56972
20513a93310k40J5932J6789p9034J8162Q2842o8077j24007r1599Q027j4580j02004
20501e31099m0340J74140J85915m6338P3662l0789J1654P8722J14199J1478j24831
20490a23627q2288J85117L3028O1447J48932O9940M7525J89989P3950o4632J08038
20479F47419l7884j43470p0942j00498l3491j58600P7598l9435J0783K5454j53799
20468B3135p4735j03249J9472R1292J1429M8339l6243M279l9043N5662n2386q9447
20456a41495J9231J33263J58687K5681j7359j86543m2144j06595j37531K7037
$$ plain form
20535 -252204 -217887 -133778 -122093 -226078 -267839 -180935 -237730 -443679 -391373 -352663 -300763
20524 -300763 -343327 -443622 -486293 -383190 -328947 -405832 -436196 -688962 -693158 -350282 -193310
20513 -193310 -193550 -177618 -160829 -239863 -221701 -138859 -206936 -330943 -422542 -414515 -429095 -531099
20501 -531099 -571439 -397299 -211384 -257722 -184060 -214849 -203195 -124473 -10274 1204 -123627
20490 -123627 -205915 -20798 12230 73677 222609 292549 340074 530063 604013 539381 647419
20479 647419 609535 466065 395123 294625 261134 102534 180132 140697 151480 176934 23135
20468 23135 -51600 -154849 -135377 -44085 -32656 15683 -20560 -16281 -55324 338 -52048 -141495
20456 -141495 -122264 10999 169686 195367 178008 -8535 -50679 -157274 -294805 -267768
20446b67768Q5125j611l8086o0016k6750J52344L7005r462L6239R6666M6372m1583
20434H475j30772o3898q9600k5298J6364J24535M1547J02995o6875j59647n642
20423b47816J915M0224R115j1122J9237K39274J39294j22139k25772j30312J56585
20412a31517L8462o1004k0059q3352j44592j4593m026P0575K6005J21130k1276
20401b24247q2051j7071n4032N8539M31Q5224j94680r0126l6133Q4194R2987j13916
20389d90881q1141J37040J73656J8933k2072o4187o9157l837r0511J79558J68417
20378a44182j07739k83051M851L27298N3416r776n53P7861K9949k83795l07560
20367f43281L4271K03923l507J03852K8004N5263K6912n3895l0034l3595k59650
$$ plain form
20446 -267768 -182643 -184254 -222340 -282356 -309106 -156762 -119757 -129219 -92980 3686 50058 8475
20434 8475 -122297 -186195 -275795 -301093 -284729 -160194 -118647 -15652 -82527 -242174 -247816
20423 -247816 -245901 -205677 -196562 -207684 -188447 50827 190121 67982 -157790 -288102 -131517
20412 -131517 -93055 -154059 -174118 -257470 -402062 -416655 -420681 -350106 -324101 -202971 -224247
20401 -224247 -306298 -323369 -377401 -318862 -318431 -233207 -427887 -518013 -554146 -469952 -376965 -490881
20389 -490881 -572022 -434982 -261326 -242393 -264465 -328652 -397809 -401646 -492157 -312599 -144182
20378 -144182 -251921 -534972 -530121 -202823 -149407 -159183 -159736 -81875 -51926 -335721 -643281
20367 -643281 -609010 -405087 -408594 -304742 -276738 -221475 -194563 -248458 -278492 -312087 -571737
20356e71737q6237J59372Q9635m3710p2531J31982J23363j03092n6960J185r285
20345d38015J61003K06142o9457j4996K1944l1660j72075K08238K25689J15878
20335B12691j86614j48298q1945N2426J26081J59688J059J62792M4132j0292K11005
20324E42725J47244M3542K1183J09408M2070q6540J3148J18804k47050p4339j79045
20313D51150n5476J34203Q7240k6642m3962M079J86344Q1048L8592j3589k1933
20302H21054O1890J30274J01895p4629k45379j28779j6593j26873j10073m0971
20292C71816m3562K2819J7677n4017m4424k5664P949n1540r5466r9544J51884
20281A57928P6026K1087N4255p5858j25974j74292j41526K3449L834J5101k882
$$ plain form
20356 -571737 -657974 -498602 -408967 -452677 -525208 -393226 -269863 -372955 -429915 -428730 -438015
20345 -438015 -277012 -70870 -140327 -155323 -133379 -165039 -337114 -128876 96813 212691
20335 212691 26077 -122221 -204166 -151740 -25659 134029 135088 297880 342012 331720 542725
20324 542725 689969 733511 754694 864102 906172 819632 832780 951584 704534 630195 451150
20313 451150 395674 529877 617117 590475 546513 550592 736936 817984 856576 842987 821054
20302 821054 882944 1013218 1115113 1040484 795105 666326 649733 522860 412787 371816
20292 371816 328254 351073 368750 314733 270309 244645 252594 201054 105588 6044 157928
20281 157928 233954 255041 309296 233438 107464 -66828 -208354 -184905 -181071 -165970 -168852
20270a68852l8803J60234k862j03215k3885Q580K3765j841k51098j73599l0508
20259f02084Q9618K2735o3296J36162J99886P4976r1171J03247j0137j30221k6957
20248b97242K22414M0120k05568j35985j9043m4918M1387J32413n2190q9884k1190
20237d29686q6317M7201N8596j56145k8817P9976J39021Q2319J62506K4186o7012
20226a74172k47524j13454J48142J98578L6196J05274J67328o1499j32294j48864
20216b22289q6996J45357P9324j43074n8193J38698M6419m6323k3984l5271J75324
20205c1008K5743j30321q1620o200m5088j39242J15477J55101J17729L6266j40914
20194a24077k834j49755o3666Q3034J44236l9894l662M7645O7208q7787K9906
$$ plain form
20270 -168852 -207655 -47421 -50283 -153498 -177383 -168803 -145038 -146879 -397977 -571576 -602084
20259 -602084 -512466 -489731 -553027 -416865 -216979 -142003 -233174 -129927 -140064 -270285 -297242
20248 -297242 -74828 -34708 -240276 -376261 -395304 -440222 -398835 -266422 -318612 -408496 -429686
20237 -429686 -516003 -468802 -410206 -566351 -595168 -515192 -376171 -293852 -131346 -107160 -174172
20226 -174172 -421696 -535150 -387008 -188430 -152234 -46960 120368 58869 -73425 -222289
20216 -222289 -309285 -163928 -84604 -227678 -285871 -147173 -100754 -147077 -171061 -206332 -31008
20205 -31008 -5265 -135586 -217206 -223406 -268494 -407736 -292259 -137158 -19429 16837 -124077
20194 -124077 -126911 -276666 -340332 -257298 -113062 -152956 -156618 -108973 -41765 -129552 -99646
20183i9646k5130j62216J64312M04068K7419k11060j20848k30992j02439n0201
20173d06733o4039j72695J41760K72031K4558K9982J09308j22442k83128p8156
20163e49554j2159J80778J17586j07201o2167N3819k5408K2992O396R7128n6158
20152c33948L6988J65475j9981j21856O9092N2454j37095p6588n8776j25518o1487
20141f11240Q3733J71011O431q5803n0141J03926M8772J1395J2614j6366q9932
20130d15600R1838J9519j93989M9318R3528l2143K0950J2964J24657J48121R265
20119g1572K4326N7006j19620q4042O7350N1277j45181j9622m1897R1524P1918
20108a18533q2534k05804j13919J48080J14864O475Q3685J9315j8170q5611q857
$$ plain form
20183 -99646 -124776 -286992 -122680 281388 308807 97747 -23101 -254093 -356532 -406733
20173 -406733 -470772 -643467 -501707 -229676 -205118 -175136 -65828 -188270 -471398 -549554
20163 -549554 -561713 -380935 -263349 -370550 -432717 -378898 -404306 -381314 -374918 -277790 -333948
20152 -333948 -296960 -131485 -151466 -273322 -204230 -151776 -288871 -365459 -424235 -549753 -611240
20141 -611240 -527507 -356496 -350065 -435868 -486009 -382083 -333311 -321916 -309302 -325668 -415600
20130 -415600 -323762 -304243 -498232 -448914 -355386 -387529 -366579 -353615 -228958 -80837 -71572
20119 -71572 -47246 9760 -109860 -193902 -126552 -75275 -220456 -240078 -281975 -190451 -118533
20108 -118533 -201067 -406871 -520790 -372710 -257846 -251371 -167686 -148371 -166541 -252152 -261009
20097b61009l036l9053L3741j0899Q455m2097m0224O7394q2903J26220O3748j1937
20085a91600J7328j07908l0978j5493J6261K09969M1752r9264l4536l5458M0851
20074a89076L653L871Q027l2127Q735J00568K9204l9130n3376q9029J9279j49430
20062c78831l8981K24277J81769p621m2647m3538J20705k9265m649J67507k0779
20051A27947l0709J05736o6084q2680k28875j1553j1375R426o7354m1101j5758
20040c12380J37137R203j16823q0974m9593o325l6789N2489K7320J8843R7180
20029b60712L1964q238p081K457l8807L5241n8133N7392o1308l6560L3642L174
20017c06969Q4136J38068r1941N077J8043j74849n0164q3324K9915N1217O3473
$$ plain form
20097 -261009 -264045 -303098 -269357 -280256 -271801 -313898 -354122 -286728 -369631 -243411 -179663 -191600
20085 -191600 -174272 -282180 -313158 -328651 -312390 -102421 -60669 -159933 -194469 -229927 -189076
20074 -189076 -185423 -181552 -173525 -205652 -196917 -96349 -67145 -106275 -159651 -248680 -229401 -378831
20062 -378831 -417812 -193535 -11766 -19387 -62034 -105572 15133 -14132 -18781 148726 127947
20051 127947 97238 202974 136890 54210 -174665 -186218 -197593 -188167 -255521 -296622 -312380
20040 -312380 -175243 -166040 -282863 -363837 -413430 -419755 -456544 -404055 -376735 -357892 -260712
20029 -260712 -228748 -236986 -244067 -241610 -280417 -245176 -303309 -245917 -307225 -343785 -310143 -306969
20017 -306969 -222833 -84765 -176706 -171629 -153586 -328435 -378599 -461923 -432008 -380791 -317318
20006c17318r4553j1383J14776J12814P2223k3700l8507m5899n3849q8430k0093
19995c93919k480q2732l6697O1603N5297J18683j13212o0101m4936P3143J8585
19984d06766p046J28429m8867P3065K37965M8539j05951r6288J68584O8153p1656
19973a1839j54126p1276m7643k0227K0090j01566Q5083Q2840n719P311L2332M2297
19961a42443n012l4756J29432J17612k61421k82039l8367J51045R834R4399J82462
19950g9254J899k06010K7727J23229O9516R8696j15911r7313r5587j0725P9419
19939b04314K1540O8483J06101k7298P900p0349j33894r381J27903P6632n5384
19928i2061j22042k6607J61292p8484j36269k03977k4687K95454J68882q2187
$$ plain form
20006 -317318 -411871 -423254 -308478 -195664 -123441 -147141 -185648 -231547 -285396 -373826 -393919
19995 -393919 -396399 -479131 -515828 -454225 -398928 -280245 -393457 -453558 -498494 -425351 -406766
19984 -406766 -413812 -285383 -334250 -261185 -23220 25319 -80632 -176920 -8336 59817 -11839
19973 -11839 -165965 -237241 -284884 -305111 -285021 -386587 -301504 -218664 -224383 -217072 -184740 -142443
19961 -142443 -147455 -182211 -52779 64833 -196588 -478627 -516994 -365949 -356115 -261716 -79254
19950 -79254 -77355 -283365 -255638 -132409 -62893 35803 -80108 -177421 -273008 -283733 -204314
19939 -204314 -182774 -114291 -8190 -35488 -27588 -97937 -231831 -241212 -113309 -36677 -92061
19928 -92061 -214103 -240710 -79418 -157902 -294171 -498148 -522835 -227381 -58499 -140686
19918a40686p1597J03511q3932M6J5969J35588J51738l2988k24968m8222J34124
19907f1417k5597n5788m3701N8694k4318q5878n2022k475L0734J07319N0417p4372
19895a78404K6777j01012j07646J51452K9888n0894k9925R3715O5061m9352M5065
19884a05275l6033Q8550o4681k15380n3732Q9332p146J92612J92003r5894m6841
19873f2485l1213J7149L7538N3639n1924k0850j31645J07138P5090K9401k30692
19862b08854o5820j9962k5371K705L8811J04143O1193j46485q0141N228l6901
19851c71454j30288J62808o4514j12188k5131P6632R9585K13728j2015j30346
19841b93183O6853J15309l8054O5275o1162j69905m6669J80063O6801m7081N8251
$$ plain form
19918 -140686 -212283 -108772 -192704 -192658 -176689 -41101 110637 77649 -147319 -195541 -61417
19907 -61417 -87014 -142802 -186503 -127809 -152127 -238005 -290027 -292502 -261768 -154449 -104032 -178404
19895 -178404 -151627 -252639 -360285 -208833 -178945 -229839 -259764 -166049 -100988 -150340 -105275
19884 -105275 -141308 -52758 -117439 -332819 -386551 -297219 -304365 -111753 80250 -15644 -62485
19873 -62485 -93698 -76549 -39011 14628 -37296 -58146 -189791 -82653 -7563 21838 -208854
19862 -208854 -274674 -294636 -320007 -317302 -278491 -174348 -113155 -259640 -339781 -334553 -371454
19851 -371454 -501742 -338934 -403448 -515636 -540767 -464135 -364550 -150822 -162837 -293183
19841 -293183 -226330 -111021 -149075 -83800 -144962 -314867 -361536 -181473 -114672 -161753 -103502
19830a03502j48495m0101k6557l4885j0671N7991L5284N4081K8884r7667J85920
19819i9718J34562J9728n7723J4638L8650m7433k77068o1370M0942N8981n1962
19808b87773n0613o3045l0976m1301K9072l6709j05083p9073J30157K30390L1298
19797b73656j19076L2478J08437J86385P6179j14827J05230O5895j53374k4147
19787a10476O7954q511j36814j19808J39223K6423j76965J33910P1292j59238
19777b73010J07096M9736j43479J03367J65189p0360n5475L2946j19723j42659
19767c46372R9994K051j02828m0002J23375P4084q9463J46563J10053j76533p1125
19756b70203N6906J06000J00989p0901q2356j15421J34463J20964O2885k5461
$$ plain form
19830 -103502 -251997 -292098 -318655 -353540 -364211 -306220 -270936 -216855 -187971 -285638 -99718
19819 -99718 34844 54572 -3151 11487 50137 2704 -274364 -335734 -294792 -235811 -287773
19808 -287773 -338386 -401431 -432407 -473708 -444636 -481345 -586428 -665501 -535344 -304954 -273656
19797 -273656 -392732 -360254 -251817 -65432 10747 -104080 1150 67045 -86329 -110476
19787 -110476 -42522 -51033 -187847 -307655 -168432 -142009 -318974 -185064 -113772 -273010
19777 -273010 -165914 -116178 -259657 -156290 8899 -61461 -116936 -83990 -203713 -346372
19767 -346372 -246378 -244327 -347155 -387157 -263782 -189698 -279161 -132598 -22545 -199078 -270203
19756 -270203 -213297 -107297 -6308 -77209 -159565 -274986 -140523 -19559 43326 17865
19746A7865j32936j86857j5063j6239K6359M1043o9028R4385J48014l538k8952
19735a24947J57682r945p7788l3271J29119k1493j11721J08447L2711j58067k01061
19724c10334j567N179k6932l2534J5966Q6386Q5439m465L0606P0762J10860o7938
19712c8572p3848l1953N9173M7858M1140m626k71813r5722M5355O6056J7606l2525
19700b71871j07514r3979l1096M9574O4162O6798q4270Q2821l9749J28058M8447
19689a88619L0680J06870O8563n7205p3149q6632M6202m4218O1774J111m0016
19678a74639M9292J2934M7384L6550J47748N1060m1217j568N8996p9777k2147
19667H4616m4012r6401M3093n1296M6038L3923M3017j08143j67208j23592M4474
$$ plain form
19746 17865 -115071 -301928 -316991 -333230 -306871 -265828 -334856 -240471 -92457 -95995 -124947
19735 -124947 32735 22790 -54998 -88269 40850 19357 -92364 16083 48794 -109273 -310334
19724 -310334 -311901 -306722 -333654 -366188 -350222 -263836 -178397 -182862 -152256 -81494 29366 -38572
19712 -38572 -112420 -144373 -85200 -37342 3798 -828 -272641 -368363 -323008 -256952 -239346 -271871
19700 -271871 -379385 -473364 -504460 -454886 -390724 -323926 -408196 -325375 -365124 -237066 -188619
19689 -188619 -157939 -51069 17494 -39711 -112860 -199492 -153290 -197508 -135734 -134623 -174639
19678 -174639 -125347 -112413 -65029 -28479 119269 170329 129112 127544 186540 106763 84616
19667 84616 40604 -55797 -12704 -64000 -17962 15961 58978 -49165 -216373 -339965 -295491
19656b95491O2507J79744M6375j22569k7905l2233j26462J38603q384q9031J49268
19645a25578k5025K9220Q398q9614J01262J3835o1058r468o670m580p0950R4708
19633a45520J24814J21192n0974j64033n6536l5738J26172J91433r7718J304K5945
19622D0341o3928L0620l890j38299K5492m5564r4949r2702M3752J1327L6233J099
19610b50468L4307Q6344P7303M5710O9331k01082r3743J60399L5801j32931j08834
19599b77863R5188J15907K8996n1921l2846P3306P6422j49604l2557J01463n86
19588e4095j79022l9775P0321j1577J16540J40225J19856J7413j59490J1495m1412
19577i521M5730j15522j56704j27345m1052J8230O5446J10421M0495j9702n5464
$$ plain form
19656 -295491 -232984 -53240 -6865 -129434 -157339 -189572 -316034 -177431 -185815 -274846 -125578
19645 -125578 -150603 -121383 -112985 -202599 -101337 -87502 -148560 -158028 -164698 -169278 -240228 -145520
19633 -145520 -20706 100486 49512 -114521 -171057 -206795 -80623 110810 13092 14396 40341
19622 40341 -23587 7033 3143 -135156 -109664 -155228 -250177 -342879 -299127 -287800 -251567 -250468
19610 -250468 -216161 -129817 -52514 -6804 62527 -138555 -232298 -71899 -36098 -169029 -277863
19599 -277863 -182675 -66768 -37772 -89693 -122539 -49233 27189 -122415 -154972 -53509 -54095
19588 -54095 -233117 -272892 -202571 -214148 -97608 42617 162473 179886 20396 31891 -9521
19577 -9521 36209 -79313 -236017 -363362 -404414 -386184 -320738 -210317 -169822 -189524 -244988
19566b44988R8730J8113j36187O7087J11053P8078q6386j07709L4602M0139j9965
19555a47433j1305j30106r2951J10605J41894l4642j3892j56465J74886J96619
19545C7210j13610k11465k30919Q165J01114J2241P0922q6088M4650P3130m2436
19534c37086o668p9032J34046Q8583m5280j113o4252j50457N1963k2275O1086
19523c70485p4444p792N6099J56606J10170j07348m7328J03927M8811m4986j49490
19512c26260q7067q309M8596N9156l9310m535J14652j3893J234L2680L7604K21390
19500C5938J03366k5456j272N3090j70879j98392k1543J16154J07437j32488j49198
19489b83243J00278k7532j47534P6914K6372n9504k9078N3488J7599K05501J40545
$$ plain form
19566 -244988 -146258 -128145 -264332 -197245 -86192 -8114 -94500 -202209 -167607 -127468 -147433
19555 -147433 -158738 -288844 -381795 -271190 -129296 -163938 -177830 -334295 -159409 37210
19545 37210 -76400 -287865 -518784 -510619 -409505 -397264 -326342 -412430 -367780 -294650 -337086
19534 -337086 -343754 -422786 -288740 -200157 -245437 -246550 -310802 -461259 -409296 -431571 -370485
19523 -370485 -444929 -452721 -396622 -240016 -129846 -237194 -284522 -180595 -131784 -176770 -326260
19512 -326260 -413327 -421636 -373040 -313884 -353194 -357729 -243077 -256970 -255736 -223056 -185452 35938
19500 35938 139304 113848 112576 165666 -5213 -203605 -225148 -108994 -1557 -134045 -283243
19489 -283243 -182965 -210497 -358031 -281117 -254745 -314249 -343327 -289839 -272240 -66739 73806
19478G3806K6507k87393j84224K6548J83163J04070j8294j61398q8525J58831
19468a66909o6566K8561Q3645J7166m4616N8571j47605o9885L4106r1903K9679
19457c35756M5926j01463j24187K1992J6141J66069n003P3218L1058r202J62594
19446e8613J67858M7986j52790p7366j20176m1749O9236n403N7760R7877j04134
19435a19514q9755L4014M4370O4233r4969J19503K40615o4078j23462M1011J79661
19424B31629R9478j61916j7890m2730O9279j128l314j01500k8618N2020m5032
19413E0278j21879Q4501K6817J25l0862J1588p8337J28667r3367k42994J08909
19402a56554R7249j0471j02378p7650j4922J403p515J10369N1136J2427L5827
$$ plain form
19478 73806 100313 -187080 -371304 -344756 -161593 -57523 -75817 -237215 -325740 -166909
19468 -166909 -233475 -204914 -121269 -104103 -148719 -90148 -237753 -307638 -273532 -365435 -335756
19457 -335756 -289830 -391293 -515480 -493488 -477347 -311278 -316281 -243063 -212005 -221207 -58613
19446 -58613 109245 157231 4441 -72925 -193101 -234850 -165614 -171017 -113257 -15380 -119514
19435 -119514 -209269 -175255 -130885 -66652 -161621 -42118 198497 134419 10957 51968 231629
19424 231629 331107 169191 151301 108571 177850 176722 173408 71908 43290 95310 50278
19413 50278 -71601 12900 39717 39842 8980 20568 -57769 70898 -22469 -265463 -156554
19402 -156554 -59305 -69776 -172154 -249804 -264726 -263323 -270838 -160469 -109333 -96906 -61079
19391f1079n3115J21313J45471J06842j16398j09280j42766k8013K9738J9082
19381h8205R3935J7518j54983l2322K52073o8979j32517p5737m0644J20330J62483
19370E2952Q0559j24454j74568m2327j7988N0815P5824M4089R1614o6188p1248
19359a00920j6179K8429j6144K6003M5926l2756j95497j40501j3385j63442q4271
19348f62737J78570J71093K16848M3826J97437j8930m2488j28355j84181K499
19338b26418L2181L6792J8282J11824P1192j10653Q9230J37118l0115n0783J61329
19327B39979j67100j65562N2307M7737m4532l156J4013O2668N6002r5985r1068
19316i4697m4056J12000J98801L6981q1291N3767k4439j36355o6172r0895o0516
$$ plain form
19391 -61079 -114194 7119 152590 259432 143034 33754 -109012 -137025 -107287 -88205
19381 -88205 5730 23248 -131735 -164057 88016 19037 -113480 -189217 -229861 -109531 52952
19370 52952 133511 9057 -165511 -207838 -225826 -175011 -99187 -55098 36516 -29672 -100920
19359 -100920 -117099 -88670 -104814 -78811 -32885 -65641 -261138 -401639 -415024 -578466 -662737
19348 -662737 -484167 -313074 -96226 -52400 145037 126107 83619 -44736 -228917 -226418
19338 -226418 -194237 -157445 -139163 -27339 43853 -66800 22430 159548 129433 78650 239979
19327 239979 72879 -92683 -40376 7361 -37171 -40327 -26314 36354 92356 -3629 -94697
19316 -94697 -138753 -26753 172048 209029 127738 181505 157066 20711 -45461 -136356 -196872
19305a96872J48464J11566N220k84638q3727j4378J38298K2593k40817r0415q798
19294d93504R5399O1479J53595O3277J2050N9350m0061j13053l6048J57891J71889
19283I2264Q2191m573q2631m7524n9453N229o2996P3656J3121J24907J21183l2940
19271B22434j2618j5491n8150j29017q244P9779O0948j19729j63438J94039J28925
19260A79438l8924j15935M9698j36155j28785Q4349J11923K2591k3734q3481n923
19249h4938Q6091n7061j26809J08044M5202k73430R3257J06845J30833K11001
19239B39035j5634k39591l4995O2172J6491P901j44905K9797J25539L9845n4263
19228C1392k23654p356P3059m9950j10668L076J03111J66573J26855j38296k2669
$$ plain form
19305 -196872 -48408 63158 68378 -216260 -299987 -314365 -176067 -153474 -394291 -484706 -493504
19294 -493504 -398105 -336626 -183031 -119754 -107704 -48354 -88415 -201468 -237516 -79625 92264
19283 92264 174455 169882 87251 39727 -19726 -14497 -77493 -3837 9284 134191 255374 222434
19271 222434 209816 194325 136175 7158 -1086 78693 139641 19912 -143526 50513 179438
19260 179438 140514 24579 74277 -61878 -190663 -106314 5609 28200 4466 -79015 -84938
19249 -84938 1153 -55908 -182717 -74673 -29471 -302901 -209644 -102799 28034 239035
19239 239035 223401 -16190 -51185 10987 27478 35379 -109526 -79729 45810 85655 31392
19228 31392 -192262 -199618 -126559 -176509 -287177 -284101 -180990 -14417 112438 -25858 -48527
19217d8527k9339J55034K49m174r1737k6302n3849o923J09828r9577j21989L09645
19205I2339J38304p6710j89078M0977N3928j9762K2052J79650k055k77473q0436
19194a18264m110P57k3667n1632m7992j9679o8991J5377J6064R1386J12462O5874
19182c2415m9042m1327K1666n3717k6420j06091J00043Q9357p8141K5958J02926
19171d7203l5722n6773Q062l0775m1691j6541N3945k023J8031K6739j20079N8188
19159a85842r5622J5894P9813J18436k8289M3387J5983K7165j26077o2393J41212
19148e6333J68961J271m3999P3952o0499j15583j10867n854K768p9322k05071
19137d30576J22137J40032K9232J32080k230j62042K9124J03796J98279Q651j29988
$$ plain form
19217 -48527 -77866 77168 77417 73243 -18494 -44796 -98645 -105568 4260 -95317 -217306 92339
19205 92339 230643 153933 -35145 5832 59760 39998 62050 241700 239645 -37828 -118264
19194 -118264 -122374 -121617 -145284 -196916 -244908 -264587 -333578 -318201 -302137 -210751 -98289 -32415
19182 -32415 -81457 -122784 -101118 -154835 -181255 -287346 -187303 -97946 -176087 -150129 -47203
19171 -47203 -82925 -139698 -131636 -162411 -204102 -220643 -166698 -168721 -150690 -123951 -244030 -185842
19159 -185842 -281464 -265570 -185757 -67321 -95610 -52223 -36240 -9075 -135152 -197545 -56333
19148 -56333 112628 113899 69900 143852 83353 -32230 -143097 -148951 -146183 -225505 -430576
19137 -430576 -308439 -168407 -139175 -7095 -9325 -171367 -142243 -38447 159832 168483 38495
19126C8495q5009K3704K2704J4118o6267m1064m1540l7971n2347R4716J06409
19115b4052J51403l3601j17058N6745N8131J2883O0776j6043l3472n0185p5349
19104i822j76580P53L0426j4095J3604J83040k7675j919J35090K21108j5592L1604
19092C69942J0374j85796k91746J09759L8315M0366L7334r0897o1906p3405O3763
19081c3897K22259J22493k74625k12292J53310M0942j24225j9508j6783Q2066
19071f0260l366L6428J05199j28074j2893J16809j153n783K6040n5785j25003
19060a07841j4181J38065r870m7922n2234M2374j33576N2991J64087j25854N137
19049h8824P550p6756L1562Q2182R759J24399q1548k3445j61810K0977J01604
$$ plain form
19126 38495 -46514 -22810 -106 14012 -52255 -93319 -134859 -172830 -225177 -130461 -24052
19115 -24052 127351 93750 -23308 33437 91568 104451 165227 149184 115712 65527 -9822
19104 -9822 -186402 -185649 -155223 -169318 -155714 27326 -349 -2268 132822 353930 338338 369942
19092 369942 380316 194520 -97226 12533 50848 91214 128548 37651 -24255 -97660 -33897
19081 -33897 188362 310855 36230 -176062 -22752 18190 -106035 -125543 -142326 -60260
19071 -60260 -63626 -27198 78001 -50073 -62966 53843 52690 46907 72947 17162 -107841
19060 -107841 -122022 16043 6173 -41749 -93983 -51609 -185185 -132194 31893 -93961 -88824
19049 -88824 -81274 -158030 -126468 -44286 -34527 89872 8324 -15121 -176931 -155954 -54350
19038e4350j11575J28543Q9565k6107J3657j12439n7827o9984J55190q3126j07395
19027b35848J6097N8357J19748L5105J44225r363l6004R0379r6449M3826p4266
19016E5807K4326J61611Q8987k8413n2467j36883k41261k8360N7281J1072n8951
19005a47251J6764J1274Q9968L39159M8129l01166j74099q0337O9633j9444L4112
18994a13258O4775n5499n7378J95455l667n4678Q4653J10172J1301K3285J32615
18983C37776j6739j19807j01020j08818J13132P3631p3175o691j32264q9354J32303
18972H974J18997n951J06523L3482j37740J35807r8076k84271Q73K8853n5758
18961a48287Q4881k2642P3249N2510K7595j03258L9448O1169l0166J2287M5q246
$$ plain form
19038 -54350 -165925 -37382 52183 26076 39733 -72706 -130533 -200517 -45327 -128453 -235848
19027 -235848 -219751 -161394 -41646 -6541 137684 128321 92317 182696 86247 130073 55807
19016 55807 80133 241744 330731 302318 249851 112968 -128293 -156653 -99372 -88300 -147251
19005 -147251 -130487 -119213 -29245 309914 358043 56877 -117222 -197559 -127926 -147370 -113258
18994 -113258 -48483 -103982 -161360 34095 30428 -24250 60403 170575 181876 205161 337776
18983 337776 321037 201230 100210 -8608 104524 178155 104980 98289 -33975 -123329 8974
18972 8974 127971 122020 228543 262025 124285 260092 162016 -122255 -121382 -92529 -148287
18961 -148287 -63406 -86048 -12799 39711 67306 -35952 3496 64665 34499 46786 46831 38585
18949C8585R6757k3751j36137q6035r5174R976J01981m6077j51473j7279J55769
18938a52858J26522N0204R7405l9259P949J0923m4371J6655p06j35139r2956J43332
18926a2299j871N4475p354J4799j294J8992O2124m4027Q0192K1944r3350j34340
18914d2009K2112m2351k32548p8275K32350Q5275n3485O4117J21301j09971J1600
18903b1884j5724m4389j48244j36039L8505P9636K9900j7820p589R8379J99086
18892E3817J97149J40403o7850k16168j28936o1792J99890J9658j07846j16445
18882h8120Q260J1030R3412m2780M9049l2892J56792K6296M647k2689o3931m8119
18870E0955m6769p1822j75549J30525J00768J47909J65334n7330j27989L7155
$$ plain form
18949 38585 135342 111591 -24546 -110581 -205755 -195779 -93798 -139875 -291348 -308627 -152858
18938 -152858 -26336 23868 121273 82014 89963 100886 56515 73170 72464 -62675 -155631 -12299
18926 -12299 -14170 40305 32951 47750 46456 65448 127572 83545 163737 185681 92331 -42009
18914 -42009 -19897 -62248 -294796 -373071 -140721 -55446 -108931 -44814 76487 -33484 -21884
18903 -21884 -37608 -81997 -230241 -366280 -327775 -248139 -218239 -236059 -243648 -145269 53817
18892 53817 250966 391369 323519 107351 -21585 -83377 116513 136171 28325 -88120
18882 -88120 -79860 -68830 24582 -18198 30851 -2041 154751 181047 185694 163005 99074 50955
18870 50955 4186 -67636 -243185 -112660 -11892 136017 301351 244021 116032 153187
18860A53187j7478J6057Q6885n1407J03786L2348j26198k99828n618O5203O4173
18849B1110J0336Q4339j8959J1029J7079P0785m4523q8845j16586p7427q2563
18838b14225o8237J7640J27810J04197J62196n0957m9368J7051N3193N2423k381
18827A49342N1145l1683n1260j756J14186J00416j48776R3842J01944k6269l4382
18816C16749j52683o8787M0321J64163o458j29924k09408j38936L8347J05400
18806d1216k7512k2211J23409K20315P7411M973o3851j34015Q5647j5320n1916
18795A55714K1728M6904j30208k18279k85781O2936J16849J59996N7844j76115
18785a88412l3352J31618J95921K1523j13115J47696M5845j46233n8764J13802
$$ plain form
18860 153187 135709 151766 238651 187244 291030 323378 197180 -102648 -108266 -43063 21110
18849 21110 31446 115785 96826 107855 124934 195719 151196 62351 -54235 -131662 -214225
18838 -214225 -282462 -264822 -137012 -32815 129381 78424 29056 46107 99300 151723 149342
18827 149342 200487 168804 117544 115788 229974 330390 181614 275456 377400 351131 316749
18816 316749 164066 95279 135600 299763 293305 163381 -46027 -184963 -146616 -41216
18806 -41216 -68728 -90939 32470 252785 330196 335169 271318 137303 222950 207630 155714
18795 155714 177442 224346 94138 -124141 -409922 -346986 -230137 -70141 -12297 -188412
18785 -188412 -221764 -90146 105775 127298 14183 161879 207724 61491 2727 116529
18775A16529J49570r0773j11094j40415n8080M2989m4617O4129J43891j9231n0969
18764A929n3455j19616R9779K2246n3726j3848J40816l2638j41464M0688p657
18753a16946j0444j65407L3673K09334k8301M5698P6721J3419k2553P6728Q9378
18742B01300r8556j79106N2724N9368R9191l6213j73353m9068K9865m2243l0548
18731a66639J31802J8274J08053L1519o7015k48493J05453J17102j8184M1513
18721E3385L8802Q0471m4663j12772j8226L7077M55j56525J9689j8389m4569O9880
18709i5385K4154J15079j06571j18776N8486j0464O8182o6681J4000K1138J27225
18698C0387J44585q4068K8419P4827m2737j17549N4447k1126r8507O7456J25575
$$ plain form
18775 116529 266099 175326 64232 -76183 -134263 -91274 -135891 -71762 72129 52898 1929
18764 1929 -51526 -171142 -71363 -49117 -102843 -116691 24125 -8513 -149977 -109289 -116946
18753 -116946 -127390 -292797 -259124 -49790 -78091 -32393 44328 57747 35194 111922 201300
18742 201300 102744 -76362 -23638 35730 134921 98708 -74645 -123713 -93848 -136091 -166639
18731 -166639 -34837 -16563 91490 123009 55994 -192499 -87046 30056 11872 53385
18721 53385 92187 172658 127995 15223 -3003 34074 34529 -121996 -102307 -120696 -165265 -95385
18709 -95385 -71231 43848 -62723 -181499 -123013 -133477 -65295 -131976 -117976 -96838 30387
18698 30387 174972 90904 119323 194150 151413 33864 88311 67185 -31322 36134 161709
18687A61709N4163P6095O8283j08733q7630r57J42077N6422k04306r2141Q6505
18676A51487p4270L6062J3197k248L3937K9781k8239p4573r9374j62992j20131
18665b97363J10872K2154J07035J17386N8951O2874P5874m2171j40361j6758k8018
18654C0475J49285o524k8388Q7652K362j23016J160m1823j63782o2789J22146
18643c3242J26032K127k7403p6803Q2461R1022r5160j50091K06218j04371r9341
18632g8551Q9086M4307P9088L2337R4891o9024R9594J30532K37519q2287k30566
18621C46926k20638j97264K1179l7066J02191K46936N8010k24270J5818K0733
18611A32555K981m793O3988j854k2528J9802k9015j27924Q8810k847J8575K2866
$$ plain form
18687 161709 215872 291967 360250 251517 163887 162930 305007 361429 157123 64982 151487
18676 151487 77217 113279 126476 124228 158165 187946 159707 85134 -14240 -177232 -297363
18665 -297363 -186491 -164337 -57302 60084 119035 181909 257783 215612 75251 58493 30475
18654 30475 179760 173236 144848 232500 234862 111846 113006 71183 -92599 -155388 -33242
18643 -33242 92790 94917 67514 -9289 73172 164194 69034 -81057 125161 20790 -78551
18632 -78551 10535 54842 133930 166267 261158 192134 291728 422260 659779 577492 346926
18621 346926 126288 -70976 -49797 -86863 15328 262264 320274 96004 111822 132555
18611 132555 135536 130743 194731 192877 170349 190151 161136 33212 122022 119175 137750 160616
18599A60616R336j05230J1157K568p3450O2102l1327l3635P073J50254J57330
18588C16794L2503j04788l5415Q9677J50981j7573j93286j38764o1672p2469J0250
18577b3762Q1884J68269r6426m7511J95496J39154P372j66311r7766m6941q6898
18566B6560q2928J62709J59052M7041r313J6834l3810J43987J45230j07406p4551
18555C93405j44885j90137n9193J8839k8521J555n7933R6927R6901m6040P2548
18544A53466J28564J26520J00826m1812J8853O4753J53936J89255K677j62970
18534G34068k36922k9585J87894J05768j4684L720M959j19086J31086Q3192j460
18523H48950K7939J16459J7658j32089j15433l89662j16775J74171J4396q3749
$$ plain form
18599 160616 169952 64722 75879 78447 4997 67099 35772 2137 9210 159464 316794
18588 316794 349297 244509 209094 298771 449752 432179 238893 100129 38457 -34012 -23762
18577 -23762 58122 226391 129965 82454 277950 417104 424476 258165 160399 113458 26560
18566 26560 -56368 106341 265393 312434 303121 319955 286145 430132 575362 467956 393405
18555 393405 248520 58383 -810 18029 -10492 -8937 -66870 30057 126958 80918 153466
18544 153466 282030 408550 509376 467564 486417 551170 705106 894361 897038 734068
18534 734068 497146 467561 655455 761223 746539 750259 755218 636132 767218 850410 848950
18523 848950 876889 993348 1011006 878917 763484 373822 257047 431218 445614 361865
18513C61865p332R0904l2375P4681N2974o9123l0839J82744p9914j95332j67113
18502A81140n1629J21096J07971O928q5986k5459J42905R31j57241J65146L5799
18491D41601L8864J34028r3615K4169M3291l5918k20246k16349J10839K53789
18481D80453Q6543n6266j34851k3287J14635J47267R1981j35683k697J4758J0545
18470E93398k9568J2497J26220M8253j17439j46070p5413k6694j3251P2513l8751
18459D05695r6701m9786P9402J4836r7924k05237Q78j41796N1794L08619J91223
18448D61003n2467j44276q3271J38116J31768Q2403k4639j55311j00654k45811
18438F861n6786J34229K02522p5207M8524O1123o2218J74603Q8178j01416r8045
$$ plain form
18513 361865 354533 445437 413062 487743 540717 471594 440755 623499 543585 348253 181140
18502 181140 129511 250607 358578 365506 279520 254061 396966 397897 240656 405802 441601
18491 441601 480465 614493 520878 545047 588338 552420 332174 115825 226664 480453
18481 480453 566996 510730 375879 352592 467227 614494 706475 570792 568095 582853 593398
18470 593398 563830 576327 702547 750800 633361 487291 411878 385184 371933 444446 405695
18459 405695 308994 259208 338610 353446 255522 50285 51163 -90633 -38839 269780 461003
18448 461003 408536 264260 180989 319105 450873 533276 508637 353326 252672 6861
18438 6861 -49925 84304 286826 211619 260143 321266 259048 433651 521829 420413 322368
18427C22368l8861q920L7495p29P9268J7038K0494j8011o0832O6566p4478k32015
18415A09383n0635J78217P3844Q859J16035j16466j44470N905J48675p4486j09480
18404A45381P3611J29445j64027k925K8968K24432Q7388Q59K0044R5444r2456
18393E46164j75206p9733J59659J23790k47183j30028P6930R1811j40136r6565
18383A29503L4200L4560J00550l1888L0237Q5928M0292j3902r3331j9171k4204
18372B72774N7525N9029P7692J05264N5059J22597j16147k7090k46651j51969
18362B08083J05889K12007Q3605k17937l8647K4211j01911K18419J28815J04510
18352G27044j58119j83914N5456J45198j44064l3009P958O5380R135K8144J45521
$$ plain form
18427 322368 283507 274587 312082 311353 390621 407659 428153 410142 349310 415876 341398 109383
18415 109383 58748 236965 310809 319668 435703 319237 174767 180672 329347 254861 145381
18404 145381 218992 348437 184410 181485 210453 434885 522273 523132 543176 638620 546164
18393 546164 370958 291225 450884 574674 327491 197463 274393 366204 226068 129503
18383 129503 163703 198263 298813 266925 297162 383090 423382 409480 316149 296978 272774
18372 272774 330299 389328 467020 572284 627343 749940 633793 606703 360052 208083
18362 208083 313972 525979 609584 391647 353000 377211 275300 493719 622534 727044
18352 727044 568925 385011 440467 585665 441601 408592 416550 481930 491065 519209 664730
18341F64730J1390p5962N1882M1308k3739J12997J82109l8590j55313O2114J29281
18330I62207m991N6139J90636J44108L8841j4032j08282j4996m9766j63327L8972
18319A075509L25078J22192l5810J28940k0210L3639J07018K29594J50300K4058
18309B140308J18711J36172Q0662N1348J95088K04309L33223K95212L43094L35687
18299D233814M40036M20382N10594M95668M80328O06312L11727L65833L69342
18290H234036K77963J84991j90272m62890m02910l62427k93758l87455o39628
18281E957650n98785k52751m23482n60634m37202j28686n3281j77379l14495l43295
18271B667660j40178J23697R3341k2947m6065k7750m6991j55005k44122k18353
$$ plain form
18341 664730 676120 600158 652040 693348 669609 782606 964715 926125 770812 832926 962207
18330 962207 957216 1013355 1203991 1348099 1386940 1372908 1264626 1249630 1199864 1036537 1075509
18319 1075509 1400587 1522779 1486969 1615909 1595699 1629338 1736356 1965950 2116250 2140308
18309 2140308 2259019 2395191 2475853 2527201 2722289 2926598 3259821 3555033 3898127 4233814
18299 4233814 4673850 5094232 5604826 6100494 6580822 7187134 7498861 7864694 8234036
18290 8234036 8511999 8696990 8506718 8043828 7640918 7278491 6984733 6597278 5957650
18281 5957650 5358865 5106114 4682632 4121998 3684796 3556110 3502829 3325450 3010955 2667660
18271 2667660 2527482 2651179 2744520 2721573 2675508 2647758 2600767 2445762 2201640 1983287
18261A983287J1214O983o4486N128j22964j67415j65498j52205o4254n8278r2364
18250A119148m3433J1537J31749M701O7043o853J47400L1048r4214j00974O1083
18239A328235o1960k09797Q8302P613o7048q2730k3351J71110J62682j3190L1380
18228A331246k9073j91899P322j18978j43147P2927J4074j36976J0161l406j8578
18217G93673J25907L45349L5018J5914n9524j41708J27587J4276M018J6783J64166
18206A441459J53727p5389m5989n3699o1836j29557m0882o9628j84331M1037J21621
18195A096533R986N3364O8660J82886J45235O1651n5005J44065l8736n4694P214
18184A621159P2046j15383k7598k1333L1167j19835J40387L16521N6354j22034
$$ plain form
18261 1983287 1994501 2001484 1936998 1942126 1819162 1651747 1486249 1334044 1269790 1211512 1119148
18250 1119148 1075715 1087252 1219001 1223702 1290745 1283892 1431292 1462340 1368126 1267152 1328235
18239 1328235 1266275 1056478 1144780 1152393 1085345 1002615 979264 1150374 1313056 1299866 1331246
18228 1331246 1302173 1110274 1117596 998618 855471 928398 942472 805496 815657 812251 793673
18217 793673 919580 1264929 1299947 1315861 1256337 1114629 1242216 1256492 1260510 1277293 1441459
18206 1441459 1595186 1519797 1473808 1420109 1358273 1228716 1187834 1118206 933875 974912 1096533
18195 1096533 1106519 1159883 1228543 1411429 1556664 1618315 1563310 1707375 1668639 1613945 1621159
18184 1621159 1693205 1577822 1550224 1528891 1560058 1440223 1580610 1897131 1953485 1831451
18174A831451j53569k03867J2436J78260q7136j9548j10474j59658J58216J33099
18164A579210J6848o2979M881Q2771J23500o5865m2292K0244J83333J64172j83624
18153A820199j25480J35630Q8730J09230K55075j49835k27037O1984L8870J42272
18143B149638N1444j38836N8278P3421M5736R8406j88884n6829r8659K11106P1500
18132B276321K1648J27795P957j04219P9350K80690K3457j9334J37456K53610
18122C084731N5859k085j20356m8110p9578K25130J15336K81513J41070K08846
18112C862356O4082J2329J35139J93351J57712J86020L10791J73589J28215J59853
18102E383437Q8447J17338L49420L02440L68607L57239L49924N95139N19881M54548
$$ plain form
18174 1831451 1677882 1474015 1486451 1664711 1577575 1558027 1447553 1287895 1446111 1579210
18164 1579210 1596058 1533079 1537960 1620731 1744231 1678366 1636074 1656318 1839651 2003823 1820199
18153 1820199 1694719 1830349 1919079 2028309 2283384 2133549 1906512 1968496 2007366 2149638
18143 2149638 2201082 2062246 2120524 2193945 2239681 2338087 2149203 2092374 1993715 2204821 2276321
18132 2276321 2297969 2425764 2433721 2329502 2408852 2689542 2712999 2693665 2831121 3084731
18122 3084731 3140590 3138505 3018149 2970039 2890461 3115591 3230927 3512440 3653510 3862356
18112 3862356 3926438 3938767 4073906 4267257 4424969 4610989 4921780 5095369 5223584 5383437
18102 5383437 5471884 5589222 5938642 6241082 6609689 6966928 7316852 7911991 8431872 8886420
18092H886420N60038Q94765J165981J169479J406332J631179K001404K311788
18084B0027386K543540L062906L278253L350838L049280K530267J553432O40366
18076D0036268n86099j644606k190533k109514j915837j585366j226555p94777
18068B7982981p20418r63016j185752j469150j642203j537427j262638j185523
18060A8016854q44081n59985n64451l89404j49475J58093L7402l5171J80988L25665
18050A6176435L25294K53405N46904Q32598R90735J076097J407592J777005K079507
18041B5465572K329544K778354L068840L253322L421381L775961L945488M318129
18033E2356591M804924N392224O426227O768181O634034N632740M030169J603983
$$ plain form
18092 8886420 9446458 10341223 11507204 12676683 14083015 15714194 17715598 20027386
18084 20027386 22570926 25633832 28912085 32262923 35312203 37842470 39395902 40036268
18076 40036268 39450169 37805563 35615030 33505516 31589679 30004313 28777758 27982981
18068 27982981 27262563 26299547 25113795 23644645 22002442 20465015 19202377 18016854
18060 18016854 17172773 16612788 16048337 15658933 15509458 15667551 15704953 15669782 15850770 16176435
18050 16176435 16501729 16755134 17302038 18134636 19125371 20201468 21609060 23386065 25465572
18041 25465572 27795116 30573470 33642310 36895632 40317013 44092974 48038462 52356591
18033 52356591 57161515 62553739 68979966 75748147 82382181 88014921 92045090 93649073
18025I3649073j482348m305933o682798p836373p977733p216943o318901n067848
18017D6760196m153813l129167k328783j668833j445466j130445r79344j046265
18009C0878080j129452j009200j013593j097433j021430o97037n74318l67426
18001B3968191m03610k76838j56103J74513N66233M95502N46124O25342O56875
17992B6196229O94612P58363P32979N74516L35611N68369Q00292J173700J737026
17983C3571697K345150L046561L919457M478288N028495M912939M275889L050565
17975F4629041J088993q51598k661930m094737m997628n283906m788024l980858
17967C9059353l382604k882188k638071k296716k132655j925072j742719j530877
$$ plain form
18025 93649073 92166725 87860792 81177994 73341621 65363888 58146945 51828044 46760196
18017 46760196 42606383 39477216 37148433 35479600 34034134 32903689 31924345 30878080
18009 30878080 29748628 28739428 27725835 26628402 25606972 24909935 24335617 23968191
18001 23968191 23564581 23287743 23131640 23306153 23872386 24367888 24914012 25539354 26196229
17992 26196229 26890841 27649204 28382183 28956699 29292310 29860679 30660971 31834671 33571697
17983 33571697 35916847 38963408 42882865 47361153 52389648 57302587 61578476 64629041
17975 64629041 65718034 64866436 62204506 58109769 53112141 47828235 43040211 39059353
17967 39059353 35676749 32794561 30156490 27859774 25727119 23802047 22059328 20528451
17959B0528451j489621j374064j141741r07323q16026p15555m50953m33906m20631
17950A2778631m25302m96420p00824m68515l65745m13529l84356j52601m11892
17941H959447n29563n12883m20995k64861l04105m32338k19067k86334n19971
17932E469330m19629l80168l38767k52934m0810o7577m5862j38142n6806k29380
17922C499255k07134Q3008j62670l39842j99030m2135j15654j5306J81967J20575
17912B803034j54458j22693m7944j36143k68411j75137q6864M8122K6213k435
17902A883284J0511m7960k7403j42338n2567l2334j28838k0165R1708j0967o3097
17891A459834k1733N4901o9386N7081j15091p1808k6628k5383K1689p0611M2602
$$ plain form
17959 20528451 19038830 17664766 16523025 15615702 14799676 14084121 13633168 13199262 12778631
17950 12778631 12353329 11856909 11156085 10687570 10321825 9908296 9523940 9371339 8959447
17941 8959447 8429884 7917001 7496006 7231145 6927040 6494702 6275635 5989301 5469330
17932 5469330 5049701 4669533 4330766 4077832 4037022 3969445 3923583 3785441 3728635 3499255
17922 3499255 3292121 3375129 3212459 2872617 2673587 2631452 2515798 2500492 2682459 2803034
17912 2803034 2648576 2525883 2477939 2341796 2073385 1898248 1811384 1859506 1885719 1883284
17902 1883284 1893795 1845835 1818432 1676094 1623527 1591193 1462355 1442190 1533898 1522931 1459834
17891 1459834 1438101 1493002 1423616 1480697 1365606 1293798 1267170 1241787 1263476 1192865 1235467
17880A235467R2056K9004l7695k2788r719l5839k7860p0535J31892m1385J8759
17869A261357J57472J11553m6035j43430j32495N0777K49702Q279Q805q2834M7644
17858A490795K6193k77575r1439M044O5249k4923K7155m2221n4976n9911J21308
17847A183699m202q177P5765j76967m4706j2226J82055j7722J29459Q9844l9240
17836A357582q4743r9383M2992L9586P4034q6867J09410j36091j4066q2533J04840
17825A224761J02666J834r3772M5368R4527j01907m0337k0647m1321P1445J19415
17814A362032o5723K7349P1479k58125l0661N9892j5031j02612k35J34971P4980
17803A258316m4500M801l3887n8252K8694K8449J08257p076M7169Q354J28665
$$ plain form
17880 1235467 1327523 1356527 1318832 1296044 1286325 1250486 1222626 1152091 1283983 1242598 1261357
17869 1261357 1418829 1530382 1484347 1340917 1208422 1259199 1508901 1517180 1525985 1443151 1490795
17858 1490795 1516988 1239413 1147974 1152018 1217267 1192344 1219499 1177278 1122302 1062391 1183699
17847 1183699 1179497 1171320 1247085 1070118 1025412 1013186 1195241 1177519 1306978 1396822 1357582
17836 1357582 1272839 1173456 1216448 1256034 1330068 1243201 1352611 1216520 1202454 1119921 1224761
17825 1224761 1327427 1329261 1235489 1280857 1375384 1273477 1233140 1212493 1171172 1242617 1362032
17814 1362032 1296309 1323658 1395137 1137012 1106351 1166243 1151212 1048600 1048365 1183336 1258316
17803 1258316 1213816 1218617 1184730 1126478 1155172 1183621 1291878 1284802 1331971 1340325 1468990
17792A468990K24793k9244j58037j06852Q2762P2096M5431p0336n5119n1954K1022
17781A443552O9868J26117j31093m797P8905K0449l9181O8501J14747p79M6551
17770A792840J40915Q4207l5602P1728M9948R5070r2105j18228m8167Q385m0301
17759A908690k2739J21261K30150R614J1394n2623j15106M182J32249J19774J5711
17748B362557j07010J1546P1991P3031J21068p3445m1675N715l2283P1970J72317
17737B635782J84214j44227j58227j4609j17029M6607J25399M724R0263K08102
17727B860999J6186j6636q5336M9209J91622k1154l0969J12957m583j63195k4055
17716B885045J82655R3036K7703Q0287j7900J44876O9130j89730j34849J43917
$$ plain form
17792 1468990 1693783 1664539 1506502 1399650 1482412 1554508 1599939 1529603 1474484 1422530 1443552
17781 1443552 1513420 1639537 1508444 1503647 1582552 1603001 1563820 1632321 1747068 1746289 1792840
17770 1792840 1933755 2017962 1982360 2054088 2104036 2199106 2107001 1988773 1940606 1948991 1908690
17759 1908690 1885951 2007212 2237362 2246976 2258370 2205747 2090641 2094823 2227072 2346846 2362557
17748 2362557 2255547 2267093 2339084 2412115 2533183 2459738 2418063 2423778 2391495 2463465 2635782
17737 2635782 2819996 2675769 2517542 2502933 2385904 2432511 2557910 2562634 2652897 2860999
17727 2860999 2877185 2860549 2775213 2824422 3016044 2994890 2963921 3076878 3072295 2909100 2885045
17716 2885045 3067700 3160736 3188439 3268726 3250826 3395702 3464832 3275102 3140253 3284170
17706C284170J47177R6967K17616K14682Q5239J9771J4926P7768J17195O4710
17696D340221O2313L5320j20552J37782K47163j23589J2567K76196K00224J96881
17686E264526O5506N7471J05987M543J71115K85267K89285J51066K89074O1382
17676F745222l9393K18866K91365J73681L42738K78593K98275K76050J80317L42207
17666I107921M01270K67302M19161O49724N77398O86631N94628N61642O53473
17657A3919150R94313J167451J115857J056079J147354J253185J619994J906898
17649B4180281K018790J888700J929337K181540K300175K668326K795985K815929
17641D2779063L237001L824462M263367M879037N889981P119439Q319948R665048
$$ plain form
17706 3284170 3431347 3528314 3745930 3960612 4045851 4065622 4080548 4158316 4275511 4340221
17696 4340221 4402534 4437854 4317302 4455084 4702247 4578658 4591225 4867421 5067645 5264526
17686 5264526 5330032 5387503 5493490 5498033 5669148 5954415 6243700 6394766 6683840 6745222
17676 6745222 6705829 6924695 7216060 7389741 7732479 8011072 8309347 8585397 8765714 9107921
17666 9107921 9509191 9776493 10195654 10845378 11422776 12109407 12704035 13265677 13919150
17657 13919150 14913463 16080914 17196771 18252850 19400204 20653389 22273383 24180281
17649 24180281 26199071 28087771 30017108 32198648 34498823 37167149 39963134 42779063
17641 42779063 46016064 49840526 54103893 58982930 64872911 71992350 80312298 89977346
17633H9977346J1388532J3253942J4349807J4925047J4627286J2972750J0319750
17626A81814460P261036M026065J036518l48501n48592Q8458J315874K037672
17618A96682990K023608O96032j247099l982850o656209q653269j0294773j1097990
17610A57470440j0518438r454377p619855n769253m151001l173431k735388k904806
17602A11143891l587410m360164m953846n575434n493975n071032m175342l112087
17594G4814601k159561j360277o88853Q6368J177290J693244K269045K628957
17586G8460814K491569K144551J756711J168189O37078O7851o11454p83332j014181
17577H4317796j706282k363699k768335k907460l347797l325686l317773l301300
$$ plain form
17633 89977346 101365878 114619820 128969627 143894674 158521960 171494710 181814460
17626 181814460 189075496 193101561 194138079 193789578 193240986 193329444 194645318 196682990
17618 196682990 198706598 199402630 198155531 194172681 187516472 178863203 168568430 157470440
17610 157470440 146952002 137497625 129877770 124108517 119957516 116784085 114048697 111143891
17602 111143891 107556481 103196317 98242471 92667037 87173062 82102030 77926688 74814601
17594 74814601 72655040 71294763 70605910 70692278 71869568 73562812 75831857 78460814
17586 78460814 80952383 83096934 84853645 86021834 86658912 86726763 86115309 85331977 84317796
17577 84317796 82611514 80247815 77479480 74572020 71224223 67898537 64580764 61279464
17569F1279464l067868k960273k853821k897206l070465l263011l229948l155618
17561C6781254k955986k581038k166810j932672j743482j459891j423033j182104
17553B1336238j089266j021726r65588p50307q74806r08383q65523q63939q01160
17544A3195540p21628p78794o97315n57177m85464m00271m88045l42154k97030
17535H427662l10105m02556m15374k71063o4156k43396l73933l11841j86981j6755
17525E831502j12647k2093J3457j46994p8915n1640m5898m2725r7296J8659j00584
17514E164826j60298q7378j22615j73000j33880O0654k6969J8055j35200k07012
17504D197183k17331k27179k33329j7283J78432R3849k64846m20607j56428j8238
$$ plain form
17569 61279464 58211596 55251323 52397502 49500296 46429831 43166820 39936872 36781254
17561 36781254 33825268 31244230 29077420 27144748 25401266 23941375 22518342 21336238
17553 21336238 20246972 19225246 18259658 17509351 16634545 15726162 14860639 13996700 13195540
17544 13195540 12473912 11695118 10997803 10440626 9955162 9554891 9066846 8724692 8427662
17535 8427662 8117557 7715001 7299627 7028564 6964408 6721012 6347079 6035238 5848257 5831502
17525 5831502 5718855 5696762 5710219 5563225 5484310 5432670 5386772 5344047 5246751 5265410 5164826
17514 5164826 5004528 4917150 4794535 4621535 4487655 4548309 4521340 4539395 4404195 4197183
17504 4197183 3979852 3752673 3519344 3502061 3680493 3774342 3509496 3088889 2932461 2914223
17494B914223j35751j48320j69941k4727P1498p9273q1032r118l6615j33451j30241
17483B037252j18059K08462K6736j06806l0938r7933j0102r9168j0770N8595j8925
17472A838344j07148N1880p090p8241l4567m8514j69260L4069Q5136m4578J0048
17461A530079J25846P7703o7021k7434j56243q7841J8892j16083j16152N3392
17451A235138J33701L0416r7033j87857N9602N6534r2432O5396J1068P3774r0441
17440A197866R8460Q1463m9939r9272r700J6620R9171L6926p6438j3354o6442
17429A215361M0227J39125J2015j25187j26959K552R0794J30986l3508k0618l2469
17418A292319M6060l2294n3256r2745O898J65447p3946j49583J55299J15768L3116
$$ plain form
17494 2914223 2778472 2630152 2460211 2435484 2506982 2427709 2346677 2337559 2300944 2167493 2037252
17483 2037252 1919193 2127655 2154391 2047585 2016647 1918714 1908612 1809444 1798674 1857269 1838344
17472 1838344 1731196 1783076 1775986 1697745 1663178 1614664 1445404 1479473 1564609 1520031 1530079
17461 1530079 1655925 1733628 1666607 1639173 1482930 1395089 1413981 1297898 1181746 1235138
17451 1235138 1368839 1399255 1302222 1114365 1173967 1230501 1138069 1203465 1214533 1288307 1197866
17440 1197866 1296326 1377789 1327850 1228578 1218878 1235498 1334669 1371595 1295157 1281803 1215361
17429 1215361 1255588 1394713 1406728 1281541 1154582 1157134 1247928 1378914 1345406 1324788 1292319
17418 1292319 1338379 1306085 1252829 1160084 1166982 1332429 1258483 1108900 1264199 1379967 1413083
17407A413083N0966l0391j90785p7861o1612P9722J76725k0248n9075o5835j8521
17396A196168K4351L9729j1884n5286N952j38056j63853R3831K43213N6744k16840
17385A074069p7492K94826P4695j8464j17784J9773Q3720N0908O6976P8631k6091
17374A503767K7667j13876J8364N547k9668j35282l1660K07848M5522n1186O6065
17363A513108Q5371M8328K15221M245q964n9999p364j01714J03998J3419j55924
17352A649725L614J41711L5017J04337J11776p1522J01799M7382k6543J9268N1360
17341B167924o4265j7522J01077l7422j20142P4914P4358J46767M5205J72479
17331B543373J74414O5428j1720J26002K65391J82640k5500l5034J09827L20865
$$ plain form
17407 1413083 1464049 1433658 1242873 1165012 1103400 1183122 1359847 1339599 1280524 1214689 1196168
17396 1196168 1220519 1260248 1248364 1193078 1199030 1060974 897121 990952 1234165 1290909 1074069
17385 1074069 996577 1291403 1366098 1347634 1229850 1249623 1333343 1384251 1451227 1529858 1503767
17374 1503767 1531434 1417558 1435922 1441469 1411801 1276519 1244859 1452707 1498229 1447043 1513108
17363 1513108 1598479 1646807 1862028 1866273 1857309 1797310 1789946 1688232 1792230 1805649 1649725
17352 1649725 1653339 1795050 1830067 1934404 2046180 1974658 2076457 2123839 2097296 2116564 2167924
17341 2167924 2103659 2086137 2187214 2149792 2029650 2104564 2178922 2325689 2370894 2543373
17331 2543373 2717787 2783215 2771495 2897497 3162888 3345528 3320028 3284994 3394821 3715686
17321C715686K53850O585J17066J11936K07522K00745L62773K89721L18287K47223
17311E831394K74820M02851L16851M32078O14422M91109N61547O98173Q88017
17302A0511262Q31333Q95601J252064J517621J781861J902275K410383K694902
17294B3797302L123283L467627M123981M315592M287010M125067L678271L359950
17286E4278083K416743J964329J746021J487361J756324J943164K050942J885534
17278F9528501J253063N20297j81671r76015j625895j844262j889363j713838
17270F3070817j576238j506522j665627j982819k333893k826888l384007l614951
17262D4179872l745801l417238k773469k156282k093168j709575j339135j044633
$$ plain form
17321 3715686 3969536 3976121 4093187 4205123 4412645 4613390 4976163 5265884 5584171 5831394
17311 5831394 6106214 6509065 6825916 7257994 7872416 8363525 8925072 9623245 10511262
17302 10511262 11342595 12238196 13490260 15007881 16789742 18692017 21102400 23797302
17294 23797302 26920585 30388212 34512193 38827785 43114795 47239862 50918133 54278083
17286 54278083 56694826 58659155 60405176 61892537 63648861 65592025 67642967 69528501
17278 69528501 70781564 71301861 71120190 70144175 68518280 66674018 64784655 63070817
17270 63070817 61494579 59988057 58322430 56339611 54005718 51178830 47794823 44179872
17262 44179872 40434071 37016833 34243364 32087082 29993914 28284339 26945204 25900571
17254B5900571p60745n29632l58174o4131k7628K48330M44512P73181J101226
17245B6727510J414389J880497K371549K841682L217161L495834L593413L427322
17237D8969357L250981K709466K074257J484827Q72928N31948L89248L14992q3874
17228F0514130j16651j55573k70375k55606j5242l8814k71614o63526j017923
17219E7708806j568590k000609k203766k470487k845932l053691l609061l730654
17211C6226016l703220l351543k759412k528647k020774j542374j549641j414308
17203A7356097r32024q83081r51176q91078q58862o09992m43735m59183o81155
17194A0645811o12690m74023n37591l10134m86366n28163m28123m10314k87312
$$ plain form
17254 25900571 25139826 24610194 24252020 24187889 24160261 24408591 24853103 25626284 26727510
17245 26727510 28141899 30022396 32393945 35235627 38452788 41948622 45542035 48969357
17237 48969357 52220338 54929804 57004061 58488888 59361816 59893764 60283012 60598004 60514130
17228 60514130 60397479 60241906 59971531 59715925 59700683 59661869 59390255 58726729 57708806
17219 57708806 56140216 54139607 51935841 49465354 46619422 43565731 39956670 36226016
17211 36226016 32522796 29171253 26411841 23883194 21862420 20320046 18770405 17356097
17203 17356097 16424073 15540992 14589816 13698738 12839876 12229884 11786149 11326966 10645811
17194 10645811 10033121 9559098 9021507 8711373 8225007 7696844 7268721 6858407 6571095
17185F571095j28469m24302l04080m67393l52181k44230k62164j61884k79122
17176C947270j73142q9022j38959l75467j74133p9961j8185J04352J56930l11417
17166B848266k57629j71569J03709O2634n5290j24538m4136j51361j18639k2470
17156B068977O2177k1737j44263j58686j97598q8351J20579m7034K1275J6036
17146A631375j7067o6925j72205O1535M4315j49988k7495k8129k3865P3825K3748
17135A349124r2979O9178J62693R9318p5477r0765r9652O6372J15231J79897O9442
17124A752382m9459K1822K16161J07585j86816q0557l8358j45869J20610J61473
17114A878974m6586J5280o3802j76703j04118q3975J4945j24253Q291K60038J34279
$$ plain form
17185 6571095 6442626 6018324 5714244 5246851 4894670 4650440 4388276 4226392 3947270
17176 3947270 3774128 3685106 3546147 3170680 2996547 2916586 2898401 3002753 3159683 2848266
17166 2848266 2590637 2419068 2522777 2585411 2530121 2405583 2361447 2210086 2091447 2068977
17156 2068977 2131154 2109417 1965154 1806468 1608870 1520519 1641098 1594064 1615339 1631375
17146 1631375 1614308 1547383 1375178 1436713 1481028 1331040 1303545 1275416 1251551 1325376 1349124
17135 1349124 1256145 1325323 1488016 1587334 1511857 1421092 1321440 1387812 1503043 1682940 1752382
17124 1752382 1702923 1724745 1940906 2048491 1861675 1781118 1742760 1596891 1717501 1878974
17114 1878974 1832388 1847668 1783866 1607163 1503045 1419070 1434015 1309762 1318053 1578091 1712370
17103A712370j41981j75667m0635j0352P6728O80p2438j42905k19895k26303R8032
17092H57634Q5840Q1235J17960r7752l31424p7091J04898j6301O5442J10180j5679
17081H84942K6538j279j54060K04176K53765n2321J4420j6307j74446r7293m9470
17070H38665p106M0603M8390j02969o777O447r3046J71921J53518j59801o4432
17059H25413K07536R5511r4616j81673j15583m0724J10755p42N223O2177j10248
17048G63029l7352J7700m7223k86193j05952J15542L2603l8660L2995m5846j29707
17037B70936o1497J41639J8081m2380J830j16170m8244J36696K58072p392K7917
17026E79488j60320j53442P656r2475J07545J99101p6545K1731P5616j13951r8642
$$ plain form
17103 1712370 1570389 1394722 1354087 1343735 1420463 1421143 1348705 1205800 985905 759602 857634
17092 857634 943474 1024709 1142669 1044917 713493 636402 741300 724999 790441 900621 884942
17081 884942 911480 910201 756141 960317 1214082 1161761 1176181 1159874 985428 888135 838665
17070 838665 831559 872162 920552 817583 810806 817253 724207 896128 1049646 889845 825413
17059 825413 1032949 1128460 1033844 852171 736588 695864 806619 805877 811100 873277 763029
17048 763029 725677 743377 696154 409961 304009 419551 452154 413494 446489 400643 270936
17037 270936 209439 351078 369159 326779 328609 212439 164195 300891 558963 551571 579488
17026 579488 419168 265726 273382 180907 288452 487553 411008 432739 508355 394404 295762
17015B95762o1192k0688L696O4640J03384j5931J4130r7369r5504N1915N1527
17004B94370k4333k01460j48358N798Q4560O9525K17881O0541j39049m0007K0655
16993B00123J15631L5078j3881n8675M8298J5235J21188r7255j40994L0117J7437
16982B72302J35047J26044k4621p4018l9235k2541J05516j94129r6778R0856K5141
16971C03584p2419k35606J02805P8087O2148M3334o3092p5563j0279n4859l4655
16960D3485J10532q5653q5586R5871J7850m7731r6637r7702J15928J47830M0690
16949A58877o3722p2161N590m0720m1621m4823P8496J58384n1839j66085k9523
16938a09147L8685N2048j10533j5959R484O4492J19480J19234L8319j10905N9391
$$ plain form
17015 295762 234570 213882 217578 282218 385602 369671 383801 286432 190928 242843 294370
17004 294370 270037 68577 -79781 -73983 10577 80102 297983 358524 219475 179468 200123
16993 200123 315754 350832 336951 278276 326574 341809 462997 365742 224748 254865 272302
16982 272302 407349 533393 508772 434754 395519 372978 478494 284365 187587 278443 303584
16971 303584 231165 -4441 98364 176451 238599 281933 218841 143278 132999 78140 43485
16960 43485 154017 68364 -17222 78649 96499 48768 -47869 -145571 -29643 118187 158877
16949 158877 95155 22994 28584 -12136 -53757 -98580 -20084 138300 86461 -79624 -109147
16938 -109147 -70462 -18414 -128947 -144906 -135422 -70930 48550 167784 206103 95198 154589
16927A54589N169%K7768q6769Q4276j8716o5325j3117l7258Q1924N6818j59392
16915B9967j19529K2446L52621J84323j95626k38059k8724J02359J15172q3202
16905A41748j0162M8378N7250N0086R6381O0985j65386O7247l1884Q4753m0595
16894C58801n5645N6005L7373j1490n4639L5911R6091k33886m5304Q3641m862
16883B61996K7495J6814j8257l8651J8035j36141j5923P4898M2648M3737l9486
16872B37165l5606k3682r1205K8892J83454K6904p4762p498k9629p537L5572J08095
16860C50163N3226n9991O8779O2537q383j6532j68516p0288j0126P563j16537
16849I1895K7260J29728R2378j01708r5454n1602p7641O5335K13993J34013m5288
$$ plain form
16927 154589 159758 159758 187526 100757 185033 166317 100992 87875 50617 132541 189359 29967
16915 29967 -89562 -67116 285505 469828 274202 36143 7419 109778 224950 141748
16905 141748 131586 179964 237214 287300 383681 444666 279280 346527 314643 399396 358801
16894 358801 303156 359161 396534 385044 330405 366316 462407 228521 183217 266858 261996
16883 261996 289491 306305 288048 249397 267432 131291 115368 190266 232914 276651 237165
16872 237165 201559 177877 86672 115564 299018 325922 251160 243662 214033 206496 242068 350163
16860 350163 403389 343398 412177 474714 466331 449799 281283 210995 200869 208432 91895
16849 91895 119155 248883 341261 239553 144099 92497 14856 80191 294184 428197 382909
16838C82909p5089o6963P6480j7587j38770q4267J47772J75819Q0921m1437m3393
16827C96395M1098l1114j08464m4399k442P3331J9253j09893m8252j50434m3324
16816h245R6799K54718K23934j47568j33557k6569j12010J37867M6648o0763k4032
16805B47222j25629q4962p8166P2371K35481J12948p6033o6528M8782R9955J14288
16794D99729r4669j02332K1545K89351N3672J4683j2000l1738m6264M3821J36699
16783G72497r551p1388j10096K0027N1779j06748j1867j8936N2514R9284J99504
16772H67019J29174j39588l38856q4556J16638o0774j44892K1453J08475J97448
16762F71541J2315n851L6671J31558l1922l1551j05682o3916o1714Q1292n2258
$$ plain form
16838 382909 307820 240857 317337 299750 160980 76713 224485 400304 481225 439788 396395
16827 396395 437493 406379 297915 253516 251074 324405 343658 233765 185513 35079 -8245
16816 -8245 88554 343272 567206 419638 286081 259512 147502 285369 332017 271254 247222
16805 247222 121593 36631 -41535 30836 266317 379265 303232 236704 285486 385441 499729
16794 499729 405060 302728 324273 613624 667296 681979 669979 638241 591977 635798 772497
16783 772497 762946 691558 581462 601489 653268 546520 534653 515717 568231 667515 867019
16772 867019 996193 856605 517749 433193 549831 489057 344165 365618 474093 671541
16762 671541 683856 678005 714676 846234 814312 782761 677079 613163 551449 632741 580483
16751E80483o1706K2675l6120j38743N1696J31534l8764O591l9434j49096O5483
16740C94599J97231L9191M1098j24558j14948o5948j38366M8103J31671R9775
16730E07848J48226K3224r7314K8092J55030p0489j64799L7261P350o1518J60187
16719F73098l0834q3976J0114L3426J63543n9582j52691j39646r5323J68524o8815
16708D17838k9725J20629J85917p1778k24383j78338L5422Q0935J36394j1343
16698D61568l4470J9489o0560J05562l2240l4239J0883J58282r0339k53340R9858
16687C50454O2745M2101N5724l6909j33426j27741j48526j2396J69049J71430
16677C92505N3558k29501j73583N7058J47032J42110Q3488K169j26284Q818J61356
$$ plain form
16751 580483 518777 541452 505332 366589 418285 549819 511055 517646 478212 329116 394599
16740 394599 591830 631021 672119 547561 432613 366665 228299 276402 408073 507848
16730 507848 656074 679298 581984 610076 765106 694617 529818 567079 574429 512911 673098
16719 673098 642264 558288 568402 601828 765371 705789 553098 413452 318129 486653 417838
16708 417838 388113 508742 694659 622881 398498 220160 255582 336517 472911 461568
16698 461568 427098 446587 386027 491589 459349 425110 435993 594275 503936 250596 350454
16687 350454 413199 455300 511024 474115 340689 212948 64422 52026 221075 392505
16677 392505 446063 216562 42979 100037 247069 389179 472667 474836 348552 357370 518726
16666E18726k1100J22554m3645j67665k8994J62161J47953j79241j49309j35735
16656B25705k0582J08686J37636M4075J46509j49497r7869j4870L2015K1339o1195
16645C71952j99589j6271K72693L843j96502M1582N3730J732J0361J14566r7120
16634C60977k2897K9026N0918o6589j96891M3559J26496k1377J10575P0969J749
16623D86515R7584o1365k4501j45283j49005P4351P7420L4140J69623J6360j64745
16612D11094j34973K1190J30920Q5159M6665j4264j07285o5356J8372M7253Q1317
16601E20092q7357q3965l9757O2122K026J25313o2840j24761R1447j8827O5184
16590D48677j0101M723J01104O4283Q0011j50046r6591j70657p3354J04879N2620
$$ plain form
16666 518726 497626 620180 576535 408870 379876 542037 689990 510749 361440 225705
16656 225705 205123 313809 451445 495520 642029 492532 394663 379793 411808 433147 371952
16645 371952 172363 156092 428785 432628 236126 277708 331438 333170 343531 458097 360977
16634 360977 338080 367106 418024 351435 154544 198103 324599 303222 413797 484766 486515
16623 486515 584099 522734 498233 352950 203945 278296 355716 389856 559479 575839 411094
16612 411094 276121 297311 428231 513390 560055 545791 438506 373150 391522 438775 520092
16601 520092 432735 348770 309013 371135 373161 498474 435634 310873 402320 383493 448677
16590 448677 438576 443299 544403 608686 688697 538651 442060 271403 198049 302928 355548
16579C55548l8565k526J26945J21348l5405j48727M2324j6508m9783P2444P8002
16568E05097J33392j1185q4127k5813N3812q0481k16074o7914J17712J28776N5467
16557E08662P5415R4104n2207j98148m0319Q4221m3437j3180M3830J36618L9854
16546F35413l2210o0512j763m1230n2783M710J5378J34455K04467m9717j69794
16535E86414o2006o9522l329n1214n6113J06899P0125k3045m6861J31379J26529
16524G09256j26327o9803K3830O3091N8816q094m4810L3348l1703q6367o887j7805
16512D96545p0327P216Q8348j018j53751O4927K2680j7896J8936P8556R2028m4773
16500E81471L6475N4856Q0393p0704p2676L2744q1305j02609J01529L71181L9176
$$ plain form
16579 355548 316983 314457 441402 562750 527345 378618 420942 404434 354651 427095 505097
16568 505097 638489 627304 543177 517364 571176 490695 274621 206707 324419 453195 508662
16557 508662 584077 678181 625974 427826 387507 471728 428291 415111 458941 595559 635413
16546 635413 603203 542691 540928 499698 446915 451625 467003 601458 805925 756208 586414
16535 586414 524408 454886 451557 400343 344230 451129 521254 498209 451348 582727 709256
16524 709256 582929 513126 536956 600047 658863 650769 605959 639307 607604 521237 514350 496545
16512 496545 426218 433434 521782 520764 367013 431940 454620 436724 455660 534216 626244 581471
16500 581471 617946 672802 753195 682491 609815 642559 561254 458645 560174 931355 970531
16489I70531l5734j91167o1767r7430p0983J6713M9542J2541j98773n1997K07299
16478E48775J48371r0203j02841J55234J73186n6575j81981Q6835J08658K4611
16468H14070L2167m5212r5198j30113j56014o7273k6830P3930J46999Q6024Q5782
16457G18332K6873n6781l7151M0603J22556P2133L1695j18193j39132j49344l3505
16446D78086n36J27535Q5970o230M1928L5465o8367l2317j9684K4255Q6040O6489
16434H18634N4551K1174k08694j75685J58462J31430Q389j07599J4915n8684J24036
16423G80929K4523Q5224p4795o5261Q8635j0022j1098R8073p280m4303Q5430l4429
16411I15626j71106p8727j53770j782K13473r030K7110n8170J5578J35958J3801
$$ plain form
16489 970531 934797 743630 681863 584433 513450 530163 579705 592246 393473 341476 548775
16478 548775 697146 606943 504102 659336 832522 775947 593966 680801 789459 814070
16468 814070 846237 801025 705827 575714 419700 352427 325597 399527 546526 632550 718332
16457 718332 745205 688424 651273 691876 814432 886565 918260 800067 660935 511591 478086
16446 478086 477550 605085 691055 684825 726753 762218 693851 661534 641850 666105 752145 818634
16434 818634 873185 894359 685665 509980 668442 799872 808261 700662 715577 656893 780929
16423 780929 805452 890676 815881 750620 839255 829233 818135 916208 908928 864625 950055 915626
16411 915626 744520 665793 512023 510241 723714 714684 741794 683624 699202 835160 848961
16400H48961J17069n5083o4157l6751J0265O4199l1303p9402m588J49997N7870
16389I77077r2963J7775K344j12698q2342J31459J09762J20892r4029j20497j02615
16378G54165p387L0018P3205M1839k780N0911p072j31512j54811J57436Q5664
16367H89676j3470J529K3372J06378K8846k06944j11477n5929J17937J01814Q9878
16356I71610K3649j8504j00112k01078p7315m0524Q265J91904J36858n1729q5605
16345G57419J79655J11373k03280j33111r8213n3534Q3967j9444J20164J51249
16335H96245R5654j27238j08187O5733J28779P61o1363J39889J0672j99421k5988
16324H15536M9364O2315M2318K249J36862k7402j9886K28134o158j51232p7211
$$ plain form
16400 848961 966030 910947 846790 810039 820304 884503 853200 773798 769210 919207 977077
16389 977077 884114 901889 904233 791535 709193 840652 950414 1071306 977277 856780 754165
16378 754165 746778 776796 850001 891840 889060 939971 932899 801387 646576 804012 889676
16367 889676 876206 877735 901107 1007485 1036331 829387 717910 661981 779918 881732 971610
16356 971610 995259 976755 876643 675565 598250 557726 565991 757895 894753 843024 757419
16345 757419 937074 1048447 845167 712056 613843 560309 644276 624832 744996 896245
16335 896245 991899 864661 756474 822207 950986 951747 890384 1030273 1040945 841524 815536
16324 815536 864900 927215 969533 971782 1108644 1081242 1061356 1289490 1283332 1132100 1054889
16313A054889p0953q974r1028Q7519o5351L7565P7671Q4927Q0669r436m3323p4159
16301A060016q2855J48567l697o6780n0311O4662j56383J20407O887o1326o7658
16290I11529L0553J02259J10494J23472m3045o0300P2719j24729n1307q9338M9125
16279A031432J11975L4329M5669j01190j58906J15836K854k5214K2013j3595L1438
16268A096641j8025q922O9954P266l47286j02399J44085J12470M1999m6546J41099
16257A090336J07244J3162L7556k502P301J10782Q2244N5366q3585k96957j86255
16246I34692J50387K34908J65984j91608j74092M9261j09431M5285P6339o7938
16236A113787J45059K540K5260K3693j0313o1480p4225M4076M18753q9173j51779
$$ plain form
16313 1054889 983936 974962 883934 971453 906102 943667 1021338 1106265 1186934 1177498 1134175 1060016
16301 1060016 977161 1125728 1122031 1055251 1004940 1069602 913219 1033626 1040513 979187 911529
16290 911529 942082 1044341 1154835 1278307 1235262 1174962 1247681 1122952 1071645 982307 1031432
16279 1031432 1143407 1177736 1223405 1122215 963309 1079145 1081999 1056785 1078798 1065203 1096641
16268 1096641 1078616 1069694 1139648 1146914 799628 697229 841314 953784 995783 949237 1090336
16257 1090336 1197580 1210742 1248298 1245796 1253097 1363879 1446123 1501489 1417904 1120947 934692
16246 934692 1085079 1319987 1485971 1294363 1120271 1169532 1060101 1105386 1181725 1113787
16236 1113787 1258846 1261386 1286646 1310339 1300026 1238546 1164321 1208397 1627150 1537977 1386198
16225A386198O595J69373K1448r1413j06451m6491r6679j25355m7511J4165P5744
16214A159623M1768N3982O5196J01946J35195K7325l2643J9214K967j1024P012
16203A570561r7149O3592J44005J03775n1531k04944M8996M3793O8424o7337j45548
16192A476637J07505J5840o7078q4184p5795l7017J49239J4976Q6732J80204J32285
16181A899344p7664m9928j30490R4514J43141j82184j27103J02509j0744j05680
16171A555715n2840R2776P1920o2136J16670J48932Q4215O9417N0565j05541j46160
16160A823533q8346j55556N2958L6554P5475O3600l8992j12162Q743J66096K31767
16149B063670N0279j26014p0105q7501K5306j03269m0266r4780K0598K52536O8795
$$ plain form
16225 1386198 1392793 1562166 1583614 1492201 1385750 1339259 1242580 1117225 1069714 1083879 1159623
16214 1159623 1201391 1255373 1320569 1422515 1557710 1585035 1552392 1571606 1574573 1563549 1570561
16203 1570561 1473412 1537004 1681009 1784784 1733253 1528309 1577305 1621098 1689522 1622185 1476637
16192 1476637 1584142 1599982 1532904 1448720 1372925 1335908 1485147 1500123 1586855 1767059 1899344
16181 1899344 1821680 1771752 1641262 1735776 1878917 1696733 1569630 1672139 1661395 1555715
16171 1555715 1502875 1595651 1667571 1605435 1722105 1871037 1955252 2024669 2075234 1969693 1823533
16160 1823533 1735187 1579631 1632589 1669143 1744618 1808218 1769226 1657064 1665807 1831903 2063670
16149 2063670 2113949 1987935 1917830 1830329 1855635 1752366 1712100 1617320 1637918 1890454 1959249
16138A959249k3860p8656M4912N6295K5481m0058L0457J11921J31998R3477m5861
16127B265355q5869k16371q3896Q3784K1497j51872K560Q2893J01872p2300J42954
16116B090607J40957j2987R566m9228p7576L01730J36946J31304L3536k1572j10384
16105B572899r5176m7665n0345n9104M9525K0986n5514l1672J68271P3974L94
16094B546573m0597r2162Q6659M5014l1399M6261r2287k03361j2961j6957J50896
16083B385679q5848J02386n110J4290j4648Q7350K48769J13365j72991j61253
16073B511989j98591J7203Q8513Q7157O0826j27294m314k1925J00421J71124K7039
16062B712148q5037l9573J09262J138N2663K16112k0761j18041j8206j06272n7723
$$ plain form
16138 1959249 1935389 1856733 1901645 1957940 1983421 1943363 1973820 2085741 2217739 2311216 2265355
16127 2265355 2179486 1963115 1879219 1963003 1984500 1832628 1835188 1918081 2019953 1947653 2090607
16116 2090607 2231564 2218577 2228143 2178915 2101339 2403069 2540015 2671319 2704855 2683283 2572899
16105 2572899 2477723 2430058 2379713 2320609 2370134 2391120 2335606 2303934 2472205 2546179 2546573
16094 2546573 2505976 2413814 2500473 2545487 2514088 2560349 2468062 2264701 2251740 2234783 2385679
16083 2385679 2299831 2402217 2397107 2411397 2396749 2484099 2732868 2846233 2673242 2511989
16073 2511989 2313398 2330601 2419114 2506271 2567097 2439803 2435489 2413564 2513985 2685109 2712148
16062 2712148 2627111 2587538 2696800 2697938 2750601 2966713 2945952 2827911 2809705 2703433 2645710
16051B645710Q485j36821j5K24297J92353J34023l9659r678J26774n3614k48567
16040B843288q354R4915O8526K6980q9355J4232J75663n1840L8441M4146j8481
16029C138161J64049L6781L1350m9568J5518m6051j32260J68205J24045P1143
16019C521373P8930j8230j68759k10592L1444m9246q750N8595J15334J11327l4943
16008C426483J27543J40520k3191j26224P5414N353p5492L9814J16627j02045
15998C604802n6735K36278J80868o2786r7547Q908L7787p2506L1994P3862k1096
15987C863829j42k462L6421q7438N965J33274K22070Q5481j29634j62386J11592
15976D076570P5860j0970j06810Q7994K852M8276J35741K8640L788K3497N3873
$$ plain form
16051 2645710 2654195 2517374 2517359 2741656 2934009 3068032 3028373 3018695 3145469 3091855 2843288
16040 2843288 2834934 2929849 2998375 3025355 2936000 2950232 3125895 3074055 3112496 3156642 3138161
16029 3138161 3302210 3338991 3370341 3320773 3336291 3290240 3157980 3326185 3450230 3521373
16019 3521373 3600303 3582073 3413314 3202722 3234166 3184920 3176170 3234765 3350099 3461426 3426483
16008 3426483 3554026 3694546 3671355 3545131 3620545 3625898 3550406 3590220 3706847 3604802
15998 3604802 3548067 3784345 3965213 3902427 3804880 3813788 3851575 3779069 3811063 3884925 3863829
15987 3863829 3863687 3861225 3897646 3810208 3816173 3949447 4171517 4256998 4127364 3964978 4076570
15976 4076570 4152430 4141460 4034650 4122644 4125496 4173772 4309513 4338153 4341941 4365438 4419311
15965D419311k7045k73254J23639J66699n7773l5853O1274j32555p0797K02371
15955D376017J19781j05282R277Q0283j5286P1871l4788J92904J80786p0390o9257
15944D735916j82321J8475J81723J26731K6234L9131K5362j39632K107n163p9531
15933D749032m6853J89989j0285P7818P3242m630j06015o3526L946J82991R4522
15922E140231m6403P5961K00931O3738n3257p3809O5413J13707n8659o8609j05904
15911E253340j0572N2269q1020P379J58251j09N7532R6311P0489N4265K8821P2183
15899E759139k4094M3535Q7157n9898N4547O8226M0730m3357k3679J53866J02127
15888F158299r1399p7933j8157J29837J10472l9056j31064o1149L1684J65346
$$ plain form
15965 4419311 4392266 4119012 4242651 4409350 4351577 4315724 4376998 4244443 4173646 4376017
15955 4376017 4495798 4390516 4399793 4480076 4464790 4536661 4501873 4694777 4875563 4805173 4735916
15944 4735916 4553595 4572070 4753793 4880524 4906758 4945889 4971251 4831619 4833726 4828563 4749032
15933 4749032 4702179 4892168 4881883 4959701 5032943 5028313 4922298 4858772 4862718 5045709 5140231
15922 5140231 5093828 5169789 5370720 5434458 5381201 5307392 5372805 5486512 5427853 5359244 5253340
15911 5253340 5242768 5295037 5214017 5221396 5379647 5379538 5437070 5533381 5603870 5658135 5686956 5759139
15899 5759139 5735045 5778580 5865737 5805839 5860386 5928612 5969342 5925985 5902306 6056172 6158299
15888 6158299 6066900 5988967 5970810 6100647 6211119 6172063 6040999 5979850 6011534 6176880
15878F176880j9679P3143J47577q9220n5308l3205R4400k5523L6045o0098J66750
15867F411762L9309j4277J16020J06667l6170R2378R7043P4944K9383p2693M5333
15856F889699K0530K7632J81196M2128l3558O0175J25357J5638J7028l6086k7265
15845G282474K2452j0901j093J3001n4649j0277J16895J13340J69516K7597J08636
$$ plain form
15878 6176880 6157201 6230344 6377921 6288701 6233393 6200188 6294588 6269065 6305110 6245012 6411762
15867 6411762 6451071 6436794 6552814 6659481 6623311 6715689 6812732 6887676 6917059 6844366 6889699
15856 6889699 6910229 6937861 7119057 7161185 7127627 7187802 7313159 7328797 7345825 7309739 7282474
15845 7282474 7304926 7294025 7292932 7305933 7251284 7241007 7357902 7471242 7640758 7668355 7776991
$$ [...]
##END NTUPLES=NMR SPECTRUM
##END=
