##TITLE=Analysis number 308213
Compound Code cc 41804
Book Reference 411/196
Project Code adrs
Chemist Name miguelg
##JCAMPDX= 6.0         $$ Bruker NMR JCAMP-DX V2.0
##DATA TYPE= NMR SPECTRUM
##DATA CLASS= NTUPLES
##ORIGIN= Bruker BioSpin GmbH
##OWNER= NMR
$$ XWIN-NMR		Version 3.5
$$ Mon May 23 08:42:37 2005 GMT Daylight Time (UT+1h)  MAYBRIDGE\NMR@NMR_250MHZ
##.OBSERVE FREQUENCY= 250.131544655141
##.OBSERVE NUCLEUS= ^1H
##.ACQUISITION MODE= SIMULTANEOUS (DQD)
##.ACQUISITION SCHEME= undefined
##.AVERAGES= 16
##.DIGITISER RES= 18
##SPECTROMETER/DATA SYSTEM= dpx250
##.PULSE SEQUENCE= zg30
##.SOLVENT NAME= CDCl3
##.SHIFT REFERENCE= (INTERNAL, CDCl3, 0, 16.522)
##AUDIT TRAIL= $$ (NUMBER, WHEN, WHO, WHERE, WHAT)
$$ ##TITLE= Audit trail, XWIN-NMR		Version 3.5
$$ ##JCAMPDX= 5.01
$$ ##ORIGIN= Bruker BioSpin GmbH
$$ ##OWNER= NMR
$$ C:\u/data/dgb/nmr/ADRS/3260/pdata/1/auditp.txt
$$ ##AUDIT TRAIL=  $$ (NUMBER, WHEN, WHO, WHERE, WHAT)
(   1,<2005-05-23 08:41:56.38 +100>,<MAYBRIDGE\NMR>,<NMR_250MHZ>,
      <created by zg, POWCHK disabled, PULCHK disabled
       configuration hash MD5:
       62 19 C7 07 E1 42 D1 B7 37 6C 3D D0 77 39 F9 E6
       data hash MD5: 64K
       93 16 AD AB C3 E7 D6 A7 8B 94 93 BB 1F BC 30 60>)
(   2,<2005-05-23 08:42:13.26 +100>,<MAYBRIDGE\NMR>,<NMR_250MHZ>,
      <Start of raw data processing
       ef LB = 0.3 FT_mod = 6 PKNL = 1 SI = 32K 
       data hash MD5: 32K
       42 2E E2 BF A7 8D 75 BE 0C 77 68 EF 5D 1C 3D DA>)
(   3,<2005-05-23 08:42:15.99 +100>,<MAYBRIDGE\NMR>,<NMR_250MHZ>,
      <apk 
       data hash MD5: 32K
       AB 58 28 59 F2 1D A1 36 24 84 A6 C6 D1 4F B7 98>)
(   4,<2005-05-23 08:42:17.57 +100>,<MAYBRIDGE\NMR>,<NMR_250MHZ>,
      <abs ABSG = 5 
       data hash MD5: 32K
       C1 85 20 4D 23 CC D7 87 65 B3 68 0D 0B A1 9D DB>)
$$ ##END=
$$ 
$$ hash MD5
$$ 5B 31 14 9B 0F 1C 6D 23 65 BA ED 4D B0 A2 B9 6C
##$RELAX= 
##$RELAX= 
##$RELAX= 
##$RELAX= 
##$RELAX= 
##$RELAX= 
##$RELAX= 
$$ Bruker specific parameters
$$ --------------------------
##$DU= <C:\u>
##$EXPNO= 3260
##$NAME= <ADRS>
##$PROCNO= 1
##$TYPE= <nmr>
##$USER= <dgb>
##$AMP= (0..31)
100 100 100 100 100 100 100 100 100 100 100 100 100 100 100 100 100 100 
100 100 100 100 100 100 100 100 100 100 100 100 100 100 
##$AQSEQ= 0
##$AQ_mod= 3
##$AUNM= <au_zg>
##$AUTOPOS= <2 >
##$BF1= 250.13
##$BF2= 250.13
##$BF3= 250.13
##$BF4= 250.13
##$BF5= 500.13
##$BF6= 500.13
##$BF7= 500.13
##$BF8= 500.13
##$BYTORDA= 1
##$CFDGTYP= 0
##$CFRGTYP= 5
##$CHEMSTR= <none>
##$CNST= (0..31)
1 1 145 1 1 1 1 1 1 1 1 1 1 1 1 1 1 1 1 1 1 1 1 1 1 1 1 1 1 1 1 1 
##$CPDPRG= <>
##$CPDPRG1= <>
##$CPDPRG2= <>
##$CPDPRG3= <>
##$CPDPRG4= <mlev>
##$CPDPRG5= <mlev>
##$CPDPRG6= <mlev>
##$CPDPRG7= <mlev>
##$CPDPRG8= <mlev>
##$CPDPRGB= <>
##$CPDPRGT= <>
##$D= (0..31)
0 1 0 0 0 0 0 0 0 0.06 0 0 0 0 0 0 0.0002 0 0 0 0 0 0 0 0 0 0 0 0 0 0 
0 
##$DATE= 1116834114
##$DBL= (0..7)
120 120 120 120 120 120 120 120 
##$DBP= (0..7)
150 150 150 150 150 150 150 150 
##$DBP07= 0
##$DBPNAM0= <>
##$DBPNAM1= <>
$$ [...]
##$SUBNAM7= <"">
##$SUBNAM8= <"">
##$SUBNAM9= <"">
##$SW= 20.6930455092707
##$SWIBOX= (0..15)
0 0 3 0 0 0 0 0 0 0 0 0 0 0 0 0 
##$SW_h= 5175.983436853
##$TD= 65536
##$TD0= 1
##$TE= 294.16
##$TE2= 300
##$TE3= 300
##$TEG= 300
##$TL= (0..7)
0 120 120 120 120 120 120 120 
##$TP= (0..7)
150 150 150 150 150 150 150 150 
##$TP07= 0
##$TPNAME0= <>
##$TPNAME1= <>
##$TPNAME2= <>
##$TPNAME3= <>
##$TPNAME4= <>
##$TPNAME5= <>
##$TPNAME6= <>
##$TPNAME7= <>
##$TPOAL= (0..7)
0.5 0.5 0.5 0.5 0.5 0.5 0.5 0.5 
##$TPOFFS= (0..7)
0 0 0 0 0 0 0 0 
##$TUNHIN= 0
##$TUNHOUT= 0
##$TUNXOUT= 0
##$USERA1= <user>
##$USERA2= <user>
##$USERA3= <user>
##$USERA4= <user>
##$USERA5= <user>
##$V9= 5
##$VALIST= <valist>
##$VCLIST= <CCCCCCCCCCCCCCC>
##$VD= 0
##$VDLIST= <DDDDDDDDDDDDDDD>
##$VPLIST= <PPPPPPPPPPPPPPP>
##$VTLIST= <TTTTTTTTTTTTTTT>
##$WBST= 1024
##$WBSW= 4
##$XGAIN= (0..3)
0 0 0 0 
##$XL= 0
##$YL= 0
##$YMAX_a= 413778
##$YMIN_a= -232717
##$ZGOPTNS= <>
##$ZL1= 120
##$ZL2= 120
##$ZL3= 120
##$ZL4= 120
##$ABSF1= 16.522
##$ABSF2= -4.171173
##$ABSG= 5
##$ABSL= 3
##$ALPHA= 0
##$AQORDER= 0
##$ASSFAC= 0
##$ASSFACI= 0
##$ASSFACX= 0
##$ASSWID= 0
##$AUNMP= <proc_1d>
##$AZFE= 0.1
##$AZFW= 0.1
##$BCFW= 0
##$BC_mod= 0
##$BYTORDP= 0
##$COROFFS= 0
##$CY= 12.5
##$DATMOD= 1
##$DC= 0
##$DFILT= <>
##$DTYPP= 0
##$F1P= 14.0000005364418
##$F2P= -0.99999901652339
##$FCOR= 0.5
##$FTSIZE= 32768
##$FT_mod= 6
##$GAMMA= 0
##$GB= 0
##$INTBC= 1
##$INTSCL= 1
##$ISEN= 128
##$LB= 0.3
##$LEV0= 0
##$LPBIN= 0
##$MAXI= 10000
##$MC2= 0
##$MEAN= 0
##$ME_mod= 0
##$MI= 0
##$NCOEF= 0
##$NC_proc= -5
##$NLEV= 6
##$NOISF1= 0
##$NOISF2= 0
##$NSP= 0
##$NTH_PI= 0
##$NZP= 0
##$OFFSET= 16.522
##$PC= 1
##$PHC0= -69.07494
##$PHC1= 11.96309
##$PH_mod= 1
##$PKNL= yes
##$PPARMOD= 0
##$PSCAL= 4
##$PSIGN= 0
##$REVERSE= no
##$SF= 250.13
##$SI= 32768
##$SIGF1= 0
##$SIGF2= 0
##$SINO= 400
##$SIOLD= 32768
##$SREGLST= <1H.CDCl3>
##$SSB= 0
##$STSI= 32768
##$STSR= 0
##$SW_p= 5175.98343685301
##$SYMM= 0
##$S_DEV= 0
##$TDeff= 65536
##$TDoff= 0
##$TI= <Analysis number 999999
Compound Code 99
Book Reference 9
Project Code 9>
##$TILT= no
##$TM1= 0
##$TM2= 0
##$TOPLEV= 0
##$USERP1= <user>
##$USERP2= <user>
##$USERP3= <user>
##$USERP4= <user>
##$USERP5= <user>
##$WDW= 1
##$XDIM= 32768
##$YMAX_p= 395489794
##$YMIN_p= -652721
$$ End of Bruker specific parameters
$$ ---------------------------------
##NTUPLES= NMR SPECTRUM
##VAR_NAME=  FREQUENCY,     SPECTRUM/REAL,   SPECTRUM/IMAG
##SYMBOL=    X,             R,               I
##VAR_TYPE=  INDEPENDENT,   DEPENDENT,       DEPENDENT
##VAR_FORM=  AFFN,          ASDF,            ASDF
##VAR_DIM=   32768,         32768,           32768
##UNITS=     HZ,            ARBITRARY UNITS, ARBITRARY UNITS
##FACTOR=    0.157963299565203, 1,           1
##FIRST=     4132.6476996994, 0,             0
##LAST=      -1043.33573715361, 0,           0
##MIN=       -1043.33573715361, -652721,     0
##MAX=       4132.6476996994, 395489794,     0
$$ Real data points
##PAGE= N=1
##DATA TABLE= (X++(R..R)), XYDATA
$$ [...]
27709A82333K9636r3969j02546k35573k553J04404O9241l9294Q8613O5473k7125
$$ 182333 211969 118000 15454 -220119 -222672 -118268 -49027 -88321 292 65765 38640
27698C8640j20979P1556J79211J6150m8912o8582k42094J27129J69499R1492q10
$$ 38640 -82339 -10783 168428 184578 135666 67084 -175010 -47881 121618 213110 212300
27687B12300l7985N2893L2892j04634o0077j36357j25613J1091J67128q2143j43102
$$ 212300 174315 227208 260100 155466 95389 -40968 -166581 -155490 11638 -70505 -213607
27676b13607m4901j7916J17380K06880R6023l2778j57281j07351q7053l9478J4149
$$ -213607 -258508 -276424 -159044 47836 143859 111081 -46200 -153551 -240604 -280082 -265933
27665b65933l1876J52737J23917R57R6464J7798p3626o94J35733j11756k95943
$$ -265933 -297809 -145072 -21155 -20198 76266 94064 20438 19744 155477 43721 -252222
27654b52222j03597R2720J89342K12579J28252j5910j20165j38432m5275J13673
$$ -252222 -355819 -263099 -73757 138822 267074 251164 130999 -7433 -52708 60965
27644F0965J881O2516M7189J3497N6200r7340l5214o2900j55499M0993J08832
$$ 60965 62846 125362 172551 186048 242248 144908 109694 46794 -108705 -67712 41120
27633D1120k3378O2333J01183r8195L2400o7106m8574l9736K8419J7630M8586
$$ 41120 17742 80075 181258 83063 115463 48357 -217 -39953 -11534 6096 54682
27622E4682r2103L0706j0755R9430R5728M9120L0844j57431j21690K4697k1387
$$ 54682 -37421 -6715 -17470 81960 177688 226808 257652 100221 -21469 3228 -18159
27611a8159l2505j14343J04471Q9991k42967O421M477p0751p8192P580J30328
$$ -18159 -50664 -165007 -60536 29455 -213512 -207091 -202614 -273365 -351557 -343977 -213649
27600b13649K52560P6423M9481o1198p9632M0971o950j25129J3448J24050o7372
$$ -213649 38911 115334 164815 103617 23985 64956 58006 -67123 -53675 70375 3003
27589C003r8755J02072P6571n2447l2931J5706J6570j07590j29547R6863J1283
$$ 3003 -95752 6320 82891 30444 -2487 13219 29789 -77801 -207348 -110485 -99202
27578i9202q1576j69003k820N9058R1772R2617J72649p881p0200j61905j41569
$$ -99202 -180778 -349781 -352601 -293543 -201771 -109154 63495 55614 -14586 -176491 -318060
27567c18060K5593K373J02284J24104K1734P2825L5418p8339j0725K2206l9139
$$ -318060 -292467 -290094 -187810 -63706 -41972 30853 66271 -12068 -22793 -587 -39726
27556c9726Q3306P2403P7200P1225l3914k0847P8833k91229j44416J28987P3936
$$ -39726 43580 115983 193183 264408 230494 209647 288480 -2749 -147165 -18178 55758
27545E5758q481k4966K1930p2457J1453O0401j89018o0264L03277R6546p3176
$$ 55758 47277 22311 44241 -28216 -16763 43638 -145380 -205644 97633 194179 121003
27534A21003P0148J42760j91745p1397o6887L668R9245n1107j2338j23553J52943
$$ 121003 191151 333911 142166 70769 3882 7550 106795 55688 43350 -80203 72740
27523G2740O948n5732L286q3125j9985Q7836L3818R2633k6296L9740L8760J4869
$$ 72740 79688 23956 27242 -55883 -75868 11968 45786 138419 112123 151863 190623 205492
27511B05492j30334j72804r4460J3816M3618p1860P1978l6080o1570K15712J97094
$$ 205492 75158 -97646 -192106 -178290 -134672 -206532 -134554 -170634 -232204 -16492 180602
27500A80602m0718q5550k31768q8657j26939J48475J09232K5856J26855p2367
$$ 180602 139884 54334 -177434 -266091 -393030 -244555 -135323 -109467 17388 -54979
27490e4979O2129J31847Q3934N4545p499j46451L4081N754j6547n4007q6478R1266
$$ -54979 7150 138997 222931 277476 269977 123526 157607 163361 146814 92807 6329 97595
27478I7595j5439J00418J36741j01649j12490K3467o7573p3832j1789O0013P7194
$$ 97595 82156 182574 319315 217666 105176 128643 61070 -12762 -24551 35462 112656
27467A12656N3511p8212j00885J05322l8550L0503N3936l0359q1960j32430M9852
$$ 112656 166167 87955 -12930 92392 53842 84345 138281 107922 25962 -106468 -56616
27456e6616K6766J21j2315k2979n2187j1637K21229N3592J01135L6753K9792q0596
$$ -56616 -29850 -29729 -42044 -65023 -117210 -128847 92382 145974 247109 283862 313654 233058
27444B33058r8504j26741l069R93J3177O893n8987q9129m2093L0743k7794n2119
$$ 233058 134554 7813 4744 5737 18914 25807 -33180 -122309 -164402 -133659 -161453 -213572
27432b13572p5308n4065K60754J45292j63837L2938j4752R238J01062j75028j03
$$ -213572 -288880 -342945 -82191 63101 -100736 -67798 -82550 -73312 27750 -147278 -147381
27421a47381L16683J19144j41737j42597j74042l6640P619P7288l244j77114N0207
$$ -147381 169302 288446 146709 4112 -169930 -206570 -198951 -121663 -124907 -302021 -251814
27410b51814J86449q250K8447k0307J9759j553N8738N3152P9824P4326J11652
$$ -251814 -65365 -73615 -45168 -65475 -45716 -47269 11469 64621 144445 218771 330423
27399C30423O2521q7762j57753j04270j2813Q2076R2783L7932j19192n8593j31794
$$ 330423 392944 305182 147429 43159 30346 112422 205205 243137 123945 65352 -66442
27388f6442p4290n7383J16204Q1658k9558j41312l302J32778n6014l4466l05691
$$ -66442 -140732 -198115 -81911 -253 -29811 -171123 -174425 -41647 -97661 -132127 -437818
27377d37818j9308K46459J28312J63670L2989j19784r0162L9100j7156J38408
$$ -437818 -457126 -210667 -82355 81315 114304 -5480 -95642 -56542 -73698 64710
27367F4710R049p4490P1613Q5852p9825N5614K2021m6508q3066j21151m5J71497
$$ 64710 73759 -731 70882 156734 76909 132523 154544 108036 24970 -96181 -96226 75271
27355G5271J44992L1864k31998k07159R0541P1779j49228J21691J17240M0834
$$ 75271 220263 252127 20129 -187030 -96489 -24710 -173938 -52247 64993 105827
27345A05827J00793o672j87592k76209J75479J08739j299k7624m1173q7432Q6798
$$ 105827 206620 199948 12356 -263853 -88374 20365 19066 -8558 -49731 -137163 -50365
27334e0365J6004p7306q154p3139p1905m1683K02062J18772o7455n2192k7746
$$ -50365 -34361 -111667 -119821 -192960 -264865 -306548 -104486 14286 -53169 -105361 -133107
27323a33107J31814l0139Q3950n9857N0719J3288L2011P3720o1249k2438n3396
$$ -133107 -1293 -31432 52518 -7339 43380 56668 88679 162399 101150 78712 25316
27312B5316j17090P0894p5344N9804M3662q475j59975j7198J28164l6776j9849
$$ 25316 -91774 -20880 -96224 -36420 7242 -1233 -161208 -178406 -50242 -87018 -106867
27301a06867J7320J7974j1845M1610l9279q532J7830J12460J2022n2347O3511
$$ -106867 -89547 -71573 -83418 -41808 -81087 -89619 -71789 40671 52693 346 63857
27290F3857q657K0017n5578p8682J30439M062j49977J5369J65212J1774j7718
$$ 63857 55200 75217 19639 -59043 71396 75458 -74519 -59150 106062 117836 100118
27279A00118p0250k20220M1886o2057L1623Q1485Q4054j2040j12069j34755o9401
$$ 100118 29868 -190352 -148466 -210523 -178900 -97415 -13361 -25401 -137470 -272225 -341626
27268c41626L4936J19826L4624o5962M0466o7623j75072J70258J97816o8239j23800
$$ -341626 -306690 -186864 -152240 -218202 -177736 -245359 -420431 -250173 -52357 -120596 -244396
27257b44396j11481M9973J25564J90864L6348l1299P2126J4029m3368m4592M5417
$$ -244396 -355877 -305904 -180340 10524 46872 15573 87699 101728 58360 13768 59185
27246E9185J09702O0162j04512n4545o8364k37O1387n4201q6529p1037O6617Q4977
$$ 59185 168887 229049 124537 69992 1628 1391 62778 8577 -77952 -148989 -82372 2605
27234B605R0963n9526j30956o4544R4004P1427j10282l8374J74549J16556K2840
$$ 2605 93568 34042 -96914 -161458 -67454 3973 -106309 -144683 29866 146422 169262
27223A69262k8776q5709k3471j21289j63026O9733O7049R0764j8324M562O7360
$$ 169262 140486 54777 31306 -89983 -253009 -183276 -116227 -25463 -43787 -39225 28135
27212B8135Q3064q673K5618J9559Q0694p6294k22738Q3984q0959j66535K3964
$$ 28135 111199 102526 128144 147703 228397 152103 -70635 13349 -67610 -234145 -210181
27201b10181L16712J25404j44842n3958j901p9667O2964J13250L2270R1481q2665
$$ -210181 106531 231935 87093 33135 31234 -48433 14531 127781 160051 251532 168867
27190A68867o0405j00122K5519N3400l4146o4285k0978q4968n1696J16602J42183
$$ 168867 108462 8340 33859 87259 53113 -11172 -32150 -117118 -168814 -52212 89971
27179H9971J63128J35157j01065o9553j26666m374p735k2508Q9069J27786p0636
$$ 89971 253099 388256 287191 217638 90972 86598 78863 56355 145424 273210 202574
27168B02574r7595L348m6771N5623O5840m39j17207Q708l6338n3094q7222m2909
$$ 202574 104979 108327 61556 117179 183019 182580 65373 74081 37743 -15351 -102573 -145482
27156a45482m650J62027K69212q3318j16640L8210l8724m4206L5758N6868M9721
$$ -145482 -150132 11895 281107 197789 81149 119359 80635 36429 72187 129055 178776
27145A78776o3613k08647q2142j08415j04686r5425K23848J88919l2454l0668
$$ 178776 115163 -93484 -175626 -284041 -388727 -484152 -260304 -71385 -103839 -134507
27135a34507j14212J1962J12088J65513m9269k7142J76457J2266q9440n1882J67549
$$ -134507 -248719 -236757 -124669 40844 -8425 -35567 140890 153156 63716 11834 179383
27124A79383J28547M3003p9154j0397r9359j65616P6314J84559Q1219R114k9652
$$ 179383 307930 350933 271779 261382 162023 -3593 72721 257280 338499 347613 317961
27113C17961m3114j14435q626M3786j48762n1150L7685L0091o183l1110R2006
$$ 317961 274847 160412 151786 195572 46810 -4340 33345 63436 57253 26143 118149
27102A18149o6609r2580J15078K81054K3302j94990q7134P310k3557M1390n2502
$$ 118149 51540 -41040 74038 355092 378394 183404 96270 103580 80023 121413 68911
27091F8911m0621j01275j6607J13688Q3026p349o690J32957J18844Q223j63281
$$ 68911 28290 -72985 -89592 24096 107122 99773 93083 226040 344884 353107 189826
27080A89826k58597p5457m4675l3245J05912J10197K2149k914j29380J32062K09802
$$ 189826 -68771 -144228 -188903 -222148 -116236 -6039 16110 13196 -116184 15878 225680
27069B25680j7015k83Q169N7232m8104j7906P6764l5578j19691j67858M6428o5626
$$ 225680 208665 208382 216551 273783 225679 207773 284537 248959 129268 -38590 7838 -57788
27057e7788n0386K3429R7679j1894m4938O6162M2947L1828j84019o150N0376j48941
$$ -57788 -108174 -84745 12934 1040 -43898 22264 65211 97039 -86980 -93130 -42754 -191695
27045a91695p7109R6890J74927J34947r8591n1613O1235j16473j00093J06000
$$ -191695 -268804 -171914 3013 137960 39369 -12244 48991 -67482 -167575 -61575
27035f1575O8444O4832k071m1721Q1221J73009K5552q0527k28644p5860L5668
$$ -61575 6869 71701 69630 27909 109130 282139 307691 227164 -1480 -77340 -41672
27024d1672p013N2848K681k84085j56004O2920J07697K08600o7798j54287M3792
$$ -41672 -48685 4163 6844 -277241 -433245 -370325 -262628 -54028 -121826 -276113 -232321
27013b32321K3105J48439J93453Q2660j41949k5349p2152p3227j710m9846j28334
$$ -232321 -209216 -60777 132676 215336 73387 48038 -24114 -97341 -99051 -148897 -277231
27002b77231J73514K83202j0071j66459m4313J00454p6101j15510k3498O8985
$$ -277231 -103717 179485 169414 2955 -41358 59096 -17005 -132515 -156013 -87028
26992h7028M8214m6932j8324M4080Q4816N1803m1924o3501M4255P7674N0656j07316
$$ -87028 -38814 -85746 -104070 -59990 24826 76629 34705 -28796 15459 93133 143789 36473
26980C6473j18994j55108j1745K8322R7920K56899q9624r5768R1961k7495l5809
$$ 36473 -82521 -237629 -249374 -221052 -123132 133767 44143 -51625 40336 12841 -22968
26969b2968P6908n3719l661K2391j51186k4353n8086p4470J46506J22451m494
$$ -22968 53940 221 -3440 18951 -132235 -156588 -214674 -289144 -142638 -20187 -24681
26958b4681J77233J22748M0275n4677j82050M6472Q9190j31555r3432J57493o0689
$$ -24681 152552 275300 315575 260898 78848 125320 214510 82955 -10477 147016 86327
26947H6327o0874N181J01979j44923k50488N7906J45009M8656j07574m4933J3431
$$ 86327 25453 30634 132613 -12310 -262798 -204892 -59883 -11227 -118801 -163734 -150303
26936a50303l7923J13620K34382l9159q9663N625J4001n0250r4810n5478l336
$$ -150303 -188226 -74606 159776 120617 30954 36579 50580 330 -94480 -149958 -153294
26925a53294J13203K77414O618r274J52028J0325q4713n6499Q6863k7636j09190
$$ -153294 -40091 237323 243941 234667 386695 397020 312307 255808 342671 315035 205845
26914B05845j929j18607j35555k8778R8288K7067J22645j47656m0756P1870k394
$$ 205845 203916 85309 -50246 -79024 19264 46331 168976 21320 -19436 52434 50040
26903E0040k3858J5086j2012n6300N8932Q9729n8480j06053n736K05235K6698
$$ 50040 26182 41268 29256 -27044 31888 121617 63137 -42916 -48652 156583 183281
26892A83281j02194m1803J032m3439j58004K6066J51974O0911j81626K1573J08118
$$ 183281 81087 39284 40316 -3123 -161127 -135061 16913 77824 -103802 -82229 25889
26881B5889J616N4269J29073N1198o1228J33996L705j30349o1259J3579o9859
$$ 25889 27505 81774 210847 262045 200817 334813 338518 208169 146910 160489 90630
26870I0630p5063L0430r5192L5530J98414r7522j49063J834p4830J6481K9058
$$ 90630 15567 45997 -49195 -13665 184749 87227 -61836 -60002 -134832 -118351 -89293
26859h9293p1197P0629J17025O6128N7292k5961l8394l9684J5196k22321N5504
$$ -89293 -160490 -89861 27164 93292 150584 124623 86229 46545 61741 -160580 -105076
26848a05076J64122r3374P9125J24149J8859l9284k08657J23865M6422o4870j27597
$$ -105076 59046 -34328 44797 168946 187805 148521 -60136 63729 110151 45281 -82316
26837h2316j38602O0926J70679n6288j13094j11218k0718K11528K30492J30354
$$ -82316 -220918 -159992 10687 -45601 -158695 -269913 -290631 -79103 151389 281743
26827B81743j0882j26248j85337m1081K32790J28866j19128k13898O7652J1339
$$ 281743 270861 144613 -40724 -81805 150985 279851 160723 -53175 14477 25816
26817B5816r3215j31984K8177J12403J18558j21275j61708N3941k305n4083K4490
$$ 25816 -67399 -199383 -171206 -58803 59755 -61520 -223228 -169287 -171592 -225675 -201185
26806b01185N7287r1415Q2127P2126O2282j02514j3727O3288l7927j53531J6391
$$ -201185 -143898 -235313 -153186 -81060 -18778 -121292 -135019 -71731 -109658 -263189 -246798
26795b46798K51625K63054n8617k07938j15393M2503p3654p3399l9880p9293J8683
$$ -246798 4827 267881 209264 1326 -114067 -71564 -145218 -218617 -258497 -337790 -319107
26784c19107K06846J33406j09311o0392R1959J08439K3791p3723j8274m4313j02359
$$ -319107 -112261 21145 -88166 -148558 -56599 51840 75631 1908 -16366 -60679 -163038
26773a63038o8446O626J12409J06789L7193L8576J3547j21010J11857K0495q6178
$$ -163038 -231484 -224858 -112449 -5660 31533 70109 83656 -37354 74503 94998 8820
26762H820n2048N6895J02059l6656r4528l3695j6005r4102q7296J35319J76897
$$ 8820 -43228 13667 115726 79070 -15458 -49153 -65158 -159260 -246556 -111237 65660
26751F5660Q2752J63362q1261n5822J01315m824j80949O2130j8418p5536N9192
$$ 65660 148412 311774 230513 174691 276006 271182 90233 152363 133945 58409 117601
26740A17601R3655J65365j63803j93907r4929R8126J29496q3158Q7570J04068
$$ 117601 211256 376621 212818 18911 -76018 22108 151604 68446 156016 260084
26730B60084p4799k07521q0647o0904J01780R6137R4246p5096j6339J22123L6924
$$ 260084 185285 -22236 -102883 -163787 -62007 34130 128376 53280 36941 159064 195988
26719A95988J064q1273q8318O696J66509N8717n5153j91757q0487o6785p4995
$$ 195988 197052 115779 27461 34157 200666 259383 204230 12473 -68014 -134799 -209794
26708b09794K38856N6950J8284M099J69982m1020k16937j50753J9751N2233O1395
$$ -209794 29062 86012 104296 108395 278377 237357 20420 -130333 -110582 -58349 3046
26697C046N4046P5243p000n2233J29796N1923K2160Q3460K4802j25849j65047
$$ 3046 57092 132335 125335 73102 202898 254821 276981 360441 385243 259394 94347
26686I4347j22614O2152L7997r35J28163m3333O3269p8866j7729q6669r2700R7814
$$ 94347 -28267 33885 71882 70947 199110 155777 219046 140180 122451 35782 -56918 40896
26674D0896O7244k26389o0164M1285R9964O0264n4574M3283Q433N3732J06383
$$ 40896 108140 -118249 -178413 -137128 -37164 23100 -31474 11809 20242 73974 180357
26663A80357m4048j93104r8117o6064p198J39816J83852O9680K975o6540k34133
$$ 180357 136309 -56795 -154912 -220976 -228174 -88358 95494 165174 168149 101609 -132524
26652a32524K6006J05027P620k080J70526q9138p0342J11901J12940q014p0322
$$ -132524 -106518 -1491 6129 4049 174575 85437 15095 126996 239936 231922 161600
26641A61600j0126O8405l4643o0884Q0032k8189j18751L1146q064p7914m9492
$$ 161600 151474 219879 185236 124352 204384 176195 57444 88590 80526 2612 -46880
26630d6880l0594K5717P4833J14258m3266q4452j03515k5746L9112J13438J40194
$$ -46880 -77474 -51757 23076 137334 94068 9616 -93899 -119645 -80533 32905 173099
26619A73099O2796j33030q743J923L3126Q9455o8211j45471k19263j4942J88925
$$ 173099 235895 102865 94122 96045 129171 218626 150415 4944 -214319 -229261 -40336
26608d0336Q9432j0207r8143j30714J79914J01013j51819K4703N3157j92156k214
$$ -40336 49096 38889 -59254 -189968 -10054 90959 -60860 -36157 17000 -175156 -177370
26597a77370O5309k8169l8954K26836N9939M4027l8740J4191P8202m207j80986
$$ -177370 -112061 -140230 -179184 47652 107591 151618 112878 127069 205271 201064 20078
26586B0078J521O7139n2695l1731R7908R6229o5882m5690q9417j25564N3439J37517
$$ 20078 21599 88738 36043 4312 102220 198449 132567 86877 -2540 -128104 -74665 62852
26574F2852p2738j24900j23287M3024O9640J7105J99220J356m9481p8977J02764
$$ 62852 -9886 -134786 -258073 -215049 -145409 -128304 70916 72272 22791 -56186 46578
26563D6578j8179m3046R3045M5150k5808Q1362l3929J3515l0532q9073R989j971
$$ 46578 28399 -14647 78398 123548 97740 179102 145173 158688 128156 39083 49072 47101
26551D7101j01026j34627r3932j01670L2522J52706J0070j3356n8778l014O5463
$$ 47101 -53925 -188552 -282484 -384154 -351632 -198926 -188856 -202212 -260990 -264004 -198541
26540a98541O0993N9253R3792m3206n6690L84K9700p1087Q1062J30613j93742
$$ -198541 -137548 -78295 15497 -27709 -84399 -84015 -54315 -125402 -44340 86273 -107469
26529a07469j28013P5975J27598J49214J20843l7659K4785m6129r2702P143Q0491
$$ -107469 -235482 -159507 -31909 117305 238148 200489 225274 179145 86443 93586 174077
26518A74077l4540j9966R0338m4231n7871J15395r6841j09295p5672R9249o8084
$$ 174077 139537 119571 209909 165678 107807 223202 126361 17066 -58606 40643 -27441
26507b7441j21974j30013R0076J71132n4187k8036M0103O3642J02731J40050r3773
$$ -27441 -149415 -279428 -189352 -18220 -72407 -100443 -60340 3302 106033 246083 152310
26496A52310j54078J33719J60740L194j40110l0317k3400j30622n8401n3037j48361
$$ 152310 -1768 131951 292691 295885 155775 125458 102058 -28564 -86965 -140002 -288363
26485b88363Q4905M6801o5894n831J07106q2557J2217J57788J38985P2663j43382
$$ -288363 -203458 -156657 -222551 -228382 -121276 -203833 -191616 -33828 105157 177820 34438
26474C4438o2032L6790l127r1206l3049q9515K5198J96052o5562J2614L4832k6060
$$ 34438 -27594 9196 6069 -85137 -118186 -207701 -182503 13549 -52013 -39399 -4567 -30627
26462c0627p5734n280J07578j1105m8883M7057J19351R185j4862j35646K28425
$$ -30627 -106361 -111641 -4063 -15168 -64051 -16994 102357 111542 96680 -38966 189459
26451A89459N7530o9285o1290j14326k5478M2281l705n4482m9773J04800K7708
$$ 189459 246989 177704 116414 2088 -23390 18891 15186 -39296 -89069 15731 43439
26440D3439M5747j3448q1432J8529O4762o010j1879L3282P2217q0243M6748j08059
$$ 43439 89186 75738 -5694 12835 77597 71587 59708 92990 165207 84964 131712 23653
26428B3653j71129K4883O1548k06852j04636P3858J78027J25452L2077N0088K7472
$$ 23653 -147476 -122593 -61045 -267897 -372533 -298675 -120648 4804 36881 86969 114441
26417A14441J2480q7821j459j42430N1008K77535N5864j27669k20390J4478J17115
$$ 114441 126921 39100 37641 -104789 -53781 223754 279618 151949 -68441 -53963 63152
26406F3152K12740M1798j83657j17833p1942N9947j24605l0821j7241J94802K82887
$$ 63152 275892 317690 134033 16200 -55742 4205 -120400 -151221 -168462 26340 309227
26395C09227M8391m1732q7048l2585Q992N8646j71667l4067Q2591j21660m1193
$$ 309227 357618 315886 228838 196253 205245 263891 92224 58157 140748 19088 -22105
26384b2105j17864K1034Q0706N7826j7797o6497j45354p1023K44343K44617M0005
$$ -22105 -139969 -118935 -38229 19597 1800 -64697 -210051 -281074 -36731 207886 247891
26373B47891O7337j51027j19860l12769j07539J31219o3523n22P9397j05575M7792
$$ 247891 315228 164201 44341 -268428 -375967 -244748 -308271 -308793 -229396 -334971 -287179
26362b87179J07752J82944Q151j74018K32349J39089j58812l5567L4964j4008
$$ -287179 -179427 3517 11668 -162350 69999 209088 50276 14709 49673 35665
26352C5665o4696J007J15484J16740J27245k2984m0520L1469m6085Q2572J20626
$$ 35665 -29031 -28024 87460 204200 331445 308461 267941 299410 253325 335897 456523
26341D56523p4921k99480j00315R733q482n6319j26334J06250O6313m7928M7020
$$ 456523 381602 82122 -18193 -8460 -16942 -73261 -199595 -93345 -27032 -74960 -27940
26330b7940L1692P171J06932j87009j17079k6827J8717Q7323J32257J32252j00471
$$ -27940 3752 10923 117855 -69154 -186233 -213060 -194343 -107020 25237 157489 57018
26319E7018j37654j67425o906N8226J18011J56409n1446j92770O4226R4476N3688
$$ 57018 -80636 -248061 -254967 -196741 -78730 77679 26233 -166537 -102311 -7835 45853
26308D5853m5463R5849N2674p9121m3022j16237q3694o2161K13406J40490n2751
$$ 45853 390 96239 148913 69792 26770 -89467 -173161 -235322 -21916 118574 65823
26297F5823l2309O2649K0493k1765j9584o5208O762K56133j0477k19782j2004
$$ 65823 33514 96163 116656 94891 75307 10099 16861 272994 262517 42735 30731
26286C0731j5108l4984k3756J30847N3497l6417J63136J0634N6043p4185p7251
$$ 30731 15623 -19361 -43117 87730 141227 104810 267946 278580 334623 260438 183187
26275A83187q7648L911J00773N0573J9677j10232p2418l3253L0912Q1348p5176
$$ 183187 95539 99450 200223 250796 270473 160241 87823 54570 85482 166830 91654
26264I1654p6494r1090R7751l5084R798K1679J46689n0639k13641o5290M0579
$$ 91654 15160 -75930 21821 -13263 -3465 18214 164903 114264 -99377 -164667 -124088
26253a24088j9765L3117Q6147K14844M4062k02255q9859j02413k2853K8293J16947
$$ -124088 -143853 -110736 -24589 190255 234317 32062 -57797 -160210 -183063 -154770 -37823
26242c7823K06461r1478q7991J4061J9927l8351o8437J41097P0017n8337j68436
$$ -37823 168638 77160 -10831 3230 23157 -15194 -83631 57466 127483 69146 -99290
26231i9290J73946K69362j41143k2569Q6039P278j33521m0900r8085j35088j58845
$$ -99290 74656 344018 202875 180306 266345 273623 140102 99202 1117 -133971 -292816
26220b92816n5213O3781Q8365K60952K06934Q7447L9578J0408j55149q3863q0975
$$ -292816 -348029 -284248 -195883 65069 272003 359450 399028 409436 254287 170424 89449
26209H9449J225K9993r6567R139k1438r6112j4866P621j03052J05890N0414N7290
$$ 89449 90674 120667 24100 33239 11801 -84311 -99177 -91556 -194608 -88718 -38304 18986
26197A8986M5108J17519p1181m4715l8215Q6716p8504j29070J3446M4706N0306
$$ 18986 64094 181613 110432 65717 27502 114218 35714 -93356 -79910 -35204 15102
26186A5102J91505J51954K4733j53406j64352J6664R9134j05744j26426J5260
$$ 15102 206607 358561 383294 229888 65536 82200 181334 75590 -50836 -35576
26176c5576N5823p4960r8873j17557j17693P0531m9719j43634O0026K56423J39378
$$ -35576 20247 -54713 -153586 -271143 -388836 -318305 -368024 -511658 -451632 -195209 -55831
26165e5831R1924j19077K1229m9090n8143K5131J2731P9185p3466J3798K5717
$$ -55831 36093 -82984 -61755 -110845 -168988 -143857 -131126 -51941 -125407 -111609 -85892
26154h5892J47941n9271j24439K46346J07297j92011k27946q1209n1046J68931
$$ -85892 62049 2778 -121661 124685 231982 39971 -187975 -269184 -320230 -151299
26144a51299O2748M5201M683j8164p4810l6099J05181r980k7428R2874l8611Q0696
$$ -151299 -88551 -43350 -38667 -56831 -131641 -167740 -62559 -72539 -99967 -7093 -45704 34992
26132C4992k32376j61234O2963J6526J58418J05237O6719p5139m5874Q2952M0102
$$ 34992 -197384 -358618 -295655 -279129 -120711 -15474 51245 -23894 -69768 13184 53286
26121E3286q6253N0956R8123j53159J80998J8112j23119j51205n4773r100O9019
$$ 53286 -32967 17989 116112 -37047 143951 162063 38944 -112261 -167034 -176134 -107115
26110a07115l146r2864j65664j9839L2962m472N2746J59028R2546j2090p6323
$$ -107115 -110261 -203125 -368789 -388628 -355666 -360138 -307392 -148364 -55818 -67908 -144231
26099a44231r2594N8089J40641M1498m6789j28889j0636J36567K2476p8912O7971
$$ -144231 -236825 -178736 -38095 3403 -43386 -172275 -182911 -46344 -23868 -102780 -34809
26088c4809N5498k6425R0449k04439J6621M5844J8342P8823J37599k22340p3280
$$ -34809 20689 -5736 84713 -119726 -103105 -57261 -38919 39904 177503 -44837 -118117
26077a18117o1467R1368K44254J34505p5142j18042j95101P5216J30242P4606
$$ -118117 -179584 -88216 156038 290543 215401 97359 -97742 -22526 107716 182322
26067A82322m2375k552j11759j35303J28043Q9236M0090N0343j5337l01878k20191
$$ 182322 139947 137395 25636 -109667 18376 107612 147702 198045 182708 -119170 -339361
26056c39361J3029r5775k2490N7827J02545L9400J18110R5717J99363K9937n8884
$$ -339361 -326332 -422107 -444597 -386770 -284225 -244825 -126715 -30998 168365 198302 139418
26045A39418j09094k76552q5373O8108J00860K48321J45528K7002l9639k73790
$$ 139418 30324 -246228 -331601 -263493 -162633 85688 231216 258218 218579 -55211
26035e5211j03711M9448J28887J09516J4982m2799p8671o5682k2766R8787Q0159
$$ -55211 -158922 -109474 19413 128929 143911 101112 22441 -43241 -66007 32780 112939
26024A12939M3634k10706o4654R6200j12914l136J43609o1873n9816O9021J02167
$$ 112939 156573 -54133 -118787 -22587 -135501 -138637 4972 -56901 -116717 -47696 54471
26013E4471o847n4506q3779J30865p8935n9654K07233N0511j16612p8389J2978
$$ 54471 47624 -6882 -90661 40204 -38731 -98385 108848 159359 42747 -35642 -22664
26002b2664P127j49074K7728J48683Q4792R2510Q9815q7696j59721n9476m7881
$$ -22664 -15537 -164611 -136883 11800 96592 189102 278917 191221 31500 -27976 -75857
25991g5857p4084O6881j08694j06604J29640Q7533L1231j95971j35100J35160
$$ -75857 -149941 -83060 -191754 -298358 -168718 -81185 -49954 -245925 -381025 -245865
25981b45865R5574n5491L3981J00593l3857q0471j06319K49189J49543j18675
$$ -245865 -150291 -205782 -171801 -71208 -105065 -185536 -291855 -42666 106877 -11798
25971a1798p4669Q9366N1447o2009L8608j81257j08128J51474J56847J56844K3808
$$ -11798 -86467 2899 54346 -7663 30945 -150312 -258440 -106966 49881 206725 230533
25960B30533J1614n8498n1509j33743l8560K15210p0530j76446L7049j617j27837
$$ 230533 242147 183649 132140 -1603 -40163 175047 104517 -71929 -34880 -36497 -164334
25949a64334J79431O9344o6154j3259q0337O0666R1481J22810j03323J8257N7856
$$ -164334 15097 84441 18287 5028 -75309 -14643 76838 199648 96325 114582 172438
25938A72438m3451m8723R567j29845J03536N7280k03081j31886n8995J05067l9328
$$ 172438 128987 80264 89831 -40014 63522 120802 -82279 -214165 -273160 -168093 -207421
25927b07421j19457J44438J95717J1094N7557p927k671J06612j1520k26051M5942
$$ -207421 -326878 -182440 13277 24371 81928 74001 71330 177942 166422 -59629 -13687
25916a3687J41354j90687k52815p3047L1097R9314O8352n2224J78617O2110J25878
$$ -13687 127667 -63020 -315835 -388882 -357785 -258471 -190119 -242343 -63726 -1616 124262
25905A24262j03563J8542J00646P7555j32765j58622k9571j29532j38172J55339
$$ 124262 20699 39241 139887 217442 84677 -73945 -103516 -233048 -371220 -215881
25895b15881J06879m8537l1690M7619J9999j24242j5791L7141N9304n2509k0024
$$ -215881 -109002 -157539 -189229 -141610 -121611 -245853 -261644 -224503 -165199 -217708 -237732
25884b37732Q0506N4073M3847J23379J04116j4165K9470o2924K7551L3886K6723
$$ -237732 -157226 -103153 -59306 64073 168189 154024 183494 120570 148121 182007 208730
25873B08730j33317n2778k6590P7823j70692j65294J63452P7933j26813n2048
$$ 208730 75413 22635 -3955 73868 -96824 -262118 -98666 -20733 -147546 -199594
25863a99594J55356K8536l381M6924o617J4369R1286O8363j06811Q39m2677j13384
$$ -199594 -44238 -15702 -19083 27841 21224 35593 126879 195242 88431 89270 46593 -66791
25851f6791j4229o811j0228j9069M2335n3060M7050K32954J23060j19787J3581
$$ -66791 -81020 -87831 -98059 -117128 -74793 -127853 -80803 152151 275211 155424 169005
25840A69005l1116k8555j5439k1878j2299O2732M9223m0573j06878k6593J22142
$$ 169005 137889 109334 93895 72017 59718 122450 171673 131100 24222 -2371 119771
25829A19771m1285p3706l0723n6385r6157p1652p9753o5658M5122J37110P9171
$$ 119771 78486 4780 -25943 -82328 -178485 -250137 -329890 -395548 -350426 -213316 -134145
25818a34145l0033O1712m6273K28810Q5896r2097j21747K8150K7914j01751r8121
$$ -134145 -164178 -102466 -148739 80071 165967 73870 -47877 -19727 8187 -93564 -191685
25807a91685K50983l2254L1162P1134p3118o733Q9567j1073k1396r8132k0592
$$ -191685 59298 27044 58206 129340 56222 49489 139056 127983 106587 8455 -12137
25796a2137J21098m7046n5888r2640M9610L077J13793m3164p722n0375j71393
$$ -12137 108961 61915 6027 -86613 -37003 -33926 79867 36703 28981 -21394 -192787
25785a92787p5549P7780n5236K3146n8009j38088r7589P1292J74628Q0290J08898
$$ -192787 -268336 -190556 -245792 -222646 -280655 -418743 -516332 -445040 -270412 -190122 -81224
25774h1224N1769L0862o9568j41082P6162J1647j5262R271N5670o882m062O0346
$$ -81224 -29455 1407 -68161 -209243 -133081 -121434 -136696 -127425 -71755 -78637 -82699 -22353
25762b2353L7105j30521l8332M5303j1962R96P6588K8740J6268J35788j8948k0683
$$ -22353 14752 -115769 -154101 -108798 -120760 -119764 -43176 -14436 1832 137620 118672 97989
25750I7989J07785j61054m7601j12139j4711L3293L217J57337m9540j4455o6353
$$ 97989 205774 44720 -2881 -115020 -129731 -96438 -93221 64116 14576 121 -66232
25739f6232k09691j6802K32393J54536j36850j25186J1952M9234J96126Q816k27287
$$ -66232 -275923 -292725 -60332 94204 -42646 -167832 -155880 -106646 89480 98296 -128991
25728a28991L8087n2434k08026l1205K16847M5168p8040k7790L8743P2888q932
$$ -128991 -90904 -143338 -351364 -382569 -165722 -120554 -198594 -226384 -187641 -114753 -123685
25717a23685J23913Q697O0511R3990n1979p9075j49480p313Q8477K00260M0052
$$ -123685 228 8925 69436 163426 111447 32372 -117108 -124421 -35944 164316 204368
25706B04368p6817n523O0109n1838r4374P7791m4410m3134j62147K711L5384K5294
$$ 204368 127551 122028 182137 130299 35925 113716 69306 26172 -135975 -133264 -97880 -72586
25694g2586J02974j33530j91404r8502N8787J56450K92016k449O985M4687K47374
$$ -72586 30388 -103142 -294546 -393048 -334261 -177811 114205 111756 118741 163428 410802
25683D10802q4290j18904j60132O3953K9919Q750L4532l8100l8604j17889j88656
$$ 410802 326512 207608 47476 111429 141348 150098 184630 146530 107926 -9963 -198619
25672a98619j46579P7554J26073k2530N9014l9561k21509n4010J88582M9935k4606
$$ -198619 -345198 -267644 -141571 -164101 -105087 -144648 -366157 -420167 -231585 -181650 -206256
25661b06256R8206j13923m5775O4215J30152M9376P091m4605l046k3060N9337
$$ -206256 -108050 -221973 -267748 -203533 -73381 -24005 -16914 -61519 -64565 -87625 -28288
25650b8288O2369j09399k9415k0863p3709K14929K87984k5854m3384o7172k69662
$$ -28288 34081 -75318 -104733 -125596 -199305 15624 303608 277754 234370 167198 -102464
25639a02464p5854k7731O6407J00361R5684Q8961l2114K900j35616p0409q5874
$$ -102464 -178318 -206049 -139642 -39281 56403 145364 113250 116150 -19466 -89875 -175749
25628a75749J09952j9023K6216l423k9N5681m3609P329o0040J36869p5560O9135
$$ -175749 -65797 -84820 -58604 -62027 -62056 -6375 -49984 -42655 -102695 34174 -41386 27749
25616B7749m9678q8803J78409K267k96179j72831J1544J52031M16004J27039L9289
$$ 27749 -21929 -110732 67677 69944 -226235 -399066 -387522 -235491 180513 307552 346841
25605C46841K038j35928k8799j31968k8277o6598J4354J23104j02319o4513n700
$$ 346841 348879 212951 184152 52184 23907 -42691 -28337 94767 -7552 -72065 -77765
25594g7765L2662j0954j34297J01472K05699Q0774P0781r4461k68971p6450Q9477
$$ -77765 -45103 -56057 -190354 -88882 116817 197591 268372 173911 -95060 -171510 -82033
25583h2033J09187M610n1290J4350J16054J16286j71088q7939j7310j44394m6404
$$ -82033 27154 31764 -19526 -5176 110878 227164 56076 -31863 -49173 -193567 -239971
25572b39971o2160N8804K81216J63190q0482j02881m1185Q0689o6751k67076j33899
$$ -239971 -302131 -243327 37889 201079 120597 17716 -23469 57220 -9531 -276607 -410506
25561d10506J13669P4150K554J06784N7036r9981k2950P1972P1569J68672o990
$$ -410506 -296837 -222687 -220133 -113349 -56313 -156294 -179244 -107272 -35703 132969 125979
25550A25979L9927J90501k4389j62595j3117l6351j82758r388J8572N32N8672
$$ 125979 165906 356407 332018 169423 156306 119955 -62803 -72191 -53619 -53087 5585
25539E585N4239r5146o3230j28977m8868J64763q7780J6695J27025J36567m3411
$$ 5585 59824 -35322 -98552 -227529 -276397 -111634 -199414 -182719 -55694 80873 37462
25528C7462k24097j14150l5382Q8177J10044q7626n4876K27870N4998j80283J33529
$$ 37462 -186635 -300785 -336167 -247990 -137946 -225572 -280448 -52578 2420 -177863 -44334
25517d4334N0805k10799J03877j21520n9376o3127J08516l9577k6258J19709L2017
$$ -44334 6471 -204328 -100451 -221971 -281347 -344474 -235958 -275535 -301793 -182084 -150067
25506a50067j5709N9475P0566j7408n3866l1141m1045J22340J21450p8186J32847
$$ -150067 -165776 -106301 -35735 -53143 -107009 -138150 -179195 -56855 64595 -13591 119256
25495A19256N8244j8709j92819n5762J09711O0584q0493l8360O6939R137O0943
$$ 119256 177500 158791 -34028 -89790 19921 80505 12 -38348 28591 37728 98671
25484I8671P1529l17303j91208L7091k691N0148Q7205K0149L0274J01692r3412
$$ 98671 170200 -147103 -338311 -301220 -303911 -253763 -166558 -146409 -116135 -14443 -107855
25473a07855j02953n9578Q0825L3314m0916j9497N6211n697j9982k7750J13820
$$ -107855 -210808 -270386 -189561 -156247 -197163 -216660 -160449 -166146 -186128 -213878 -100058
25462a00058J298n1210J0206L7596n7374N8912L7406j78942J54325K21453m1000
$$ -100058 -98760 -149970 -139764 -102168 -159542 -100630 -63224 -242166 -87841 133612 92612
25451I2612j71457P1222j2765J05556J5618j08407p2031J62429O621l5579p145
$$ 92612 -78845 -7623 -20388 85168 100786 -7621 -79652 82777 89398 53819 46674
25440D6674q517Q973P9542j0054j27528J29761K9891P1927N4170O8371j31239
$$ 46674 38157 47130 126672 116618 -10910 118851 148742 220669 274839 343210 211971
25429B11971q1675j37417J08911J15067Q582J3974j01551j69795L9330J07563
$$ 211971 130296 -7121 101790 216857 225439 239413 137862 -31933 7397 114960
25419A14960J395q7535K834Q6523J4571M5257J1938k0185K2763q4327j69143R5471
$$ 114960 116355 28820 31654 118177 132748 178005 189943 169758 192521 108194 -60949 34522
25407C4522N5749J06216M6434K2621J02662K1781k10789k62475r4025J98639J98308
$$ 34522 90271 196487 242921 265542 368204 389985 179196 -83279 -177304 21335 219643
25396B19643l4993l6645K88k5857j59362l5684J73238k4900j28311r8064P8969
$$ 219643 184650 148005 148293 122436 -36926 -72610 100628 75728 -52583 -150647 -71678
25385g1678j3014o179q1555j64086q537J26060M2820J51813J59071p0863R8921
$$ -71678 -84692 -90871 -172426 -336512 -345049 -218989 -176169 -24356 134715 63852 162773
25374A62773P2502n4557P0186p617j64594M7096j42612j34605K3229l6754N1800
$$ 162773 235275 180718 250904 243287 78693 125789 -16823 -151428 -128199 -164953 -113153
25363a13153M5888j13463o1022n317m1990J13939J92747N1207j75780R834P5294
$$ -113153 -67265 -180728 -241750 -247067 -289057 -175118 17629 68836 -106944 -97110 -21816
25352b1816J46448o3913j14636k7845n3769j02873R6612L0500m5460Q798l612
$$ -21816 124632 60719 -53917 -81762 -135531 -238404 -141792 -111292 -156752 -147954 -151566
25341a51566j91991L8845L2574M2374P0785Q0250K21058M6561m3616j6721j41873
$$ -151566 -343557 -304712 -272138 -229764 -158979 -78729 142329 188890 145274 128553 -13320
25330a3320O0217K2434Q9472J4989k16995r8509N4726J26210r6197J306P5123
$$ -13320 46897 69331 158803 173792 -43203 -141712 -86986 39224 -56973 -55667 19456
25319A9456r9961j31983j6959M2367p9418o1874j24962P3391J26630M8726M1980
$$ 19456 -80505 -212488 -229447 -187080 -266498 -328372 -453334 -379943 -253313 -204587 -162607
25308a62607K51064J3028L1044J606l3476j19717p5064p7974R4148K8531J4366
$$ -162607 88457 101485 132529 134135 100659 -19058 -94122 -172096 -77948 -49417 -35051
25297c5051L7111j22929L1896n4359Q4555R6660j63073l0252J42888k3345n4430
$$ -35051 2060 -120869 -88973 -143332 -58777 37883 -125190 -155442 -12554 -35899 -90329
25286i0329J42101n6482M8216k8725J9188K7470j73026q4554J90028K1956j38344
$$ -90329 51772 -4710 43506 14781 33969 61439 -111587 -196141 -6113 15843 -122501
25275a22501K771L7826N8127o1228l762J3237R1831l9059j04517K7432J760p4617
$$ -122501 -119730 -81904 -23777 -85005 -88767 -75530 16301 -22758 -127275 -99843 -98083 -172700
25263a72700J64836J24320l9309k84548j10437J95858K02902k3953J29721L1193
$$ -172700 -7864 116456 77147 -207401 -317838 -121980 80922 56969 186690 217883
25253B17883j67026l4871K7603J2160J1677N5825O7174n6816n3019J13391J23265
$$ 217883 50857 15986 43589 55749 67426 123251 190425 133609 80590 193981 317246
25242C17246L1878n8327j37055l9508K5505k124q0916j26116L1227N0200P2339
$$ 317246 349124 290797 153742 114234 139739 137615 56699 -69417 -38190 12010 84349
25231H4349K0998J3847n6803P5073K3456m161l0138j00806j5650m2759R8657R5808
$$ 84349 105347 119194 62391 137464 160920 156759 126621 25815 10165 -32594 66063 161871
25219A61871J04616j33571k59360N5047M4901k10411l7784L05982J88103Q0946
$$ 161871 266487 132916 -126444 -71397 -26496 -236907 -274691 31291 219394 300340
25209C00340j31872k64506J26575k8248p6845M4008N4218N3315M2677p9605k8990
$$ 300340 168468 -96038 30537 2289 -74556 -30548 23670 76985 119662 40057 11067
25198A1067k10408O4119J37189J77090Q4805j18495j50432P9586J78563j15148
$$ 11067 -199341 -135222 1967 179057 263862 145367 -5065 74521 253084 137936
25188A37936j05655j26243O5167K5482L0548r648J54603K9527J55299K2877o8686
$$ 137936 32281 -93962 -28795 -3313 27235 17587 172190 201717 357016 379893 311207
25177C11207j62746j5139Q9513L7196K9053k95427j84065J09041K6080J20159
$$ 311207 148461 133322 222835 260031 289084 -6343 -190408 -81367 -55287 64872
25167F4872J32074K1010q8031j39822k82167m262M4785J83184r8148q9238J05138
$$ 64872 196946 217956 129925 -9897 -292064 -296326 -251541 -68357 -166505 -255743 -150605
25156a50605J85575p278j23572P8713J17151j05348J4977J13760j19123j07338
$$ -150605 34970 27692 -95880 -17167 99984 -5364 9613 123373 4250 -103088
25146a03088k56349k96J6695R7805K72891l1096j37781o6549R0280K3739P0677
$$ -103088 -359437 -359733 -343038 -245233 27658 -3438 -141219 -207768 -117488 -93749 -23072
25135b3072J66434J48849j14224k27533r8647N5994J16128R4307k02J8495J32252
$$ -23072 143362 292211 177987 -49546 -148193 -92199 23929 118236 118034 136529 268781
25124B68781n4632j14145r690j23708j03334R559p0711J5829L9810P0335J4368
$$ 268781 214149 100004 90314 -33394 -136728 -127169 -197880 -182051 -142241 -71906 -57538
25113e7538p6304J68087j7322j62752m8811N837J39525P4605R0151M8423j7374
$$ -57538 -133842 34245 16923 -145829 -194640 -188803 -49278 25327 115478 163901 146527
25102A46527J03087k3508j17284k51586q0968R7888J27736j23594l351j320o9146
$$ 146527 249614 226106 108822 -142764 -223732 -125844 1892 -121702 -125053 -126373 -195519
25091a95519J68524J5455j19643j45389j12556J67104J17709J3124l2194N0214
$$ -195519 -26995 -11540 -131183 -276572 -389128 -222024 -104315 -91191 -123385 -73171
25081g3171M7162J25558K96091n7192k34530k11545j12152O9246J29615Q9535
$$ -73171 -26009 99549 395640 338448 103918 -107627 -219779 -150533 -20918 68617
25071F8617n0067j65898p5083j560o215J03992J97723o7598j08260j11186m5805
$$ 68617 18550 -147348 -222431 -223991 -230206 -126214 71509 3911 -104349 -215535 -261340
25060b61340J47604J72546J36787j90096j20978q1108J50603J1597l4979l8241
$$ -261340 -113736 58810 195597 5501 -115477 -196585 -45982 -34385 -69364 -107605
25050a07605M7663J87536M263l17777j18345J70822p011j1788P8387J41030L3180
$$ -107605 -59942 127594 131857 -185920 -304265 -133443 -140454 -152242 -73855 67175 100355
25039A00355q3335K730j47805r0757q5023l0984L4528K9374J84334J38131o2414
$$ 100355 17020 19750 -128055 -218812 -303835 -334819 -300291 -270917 -86583 51548 -10866
25028a0866P2288j27016m5624n7296k43078K9264J25522K98433J34505m4808j00679
$$ -10866 61422 -65594 -111218 -168514 -411592 -382328 -256806 41627 176132 131324 30645
25017C0645M3834j69531j06810J8405M1586J38976J59702l9306M077j9456j0383
$$ 30645 74479 -95052 -201862 -183457 -141871 -2895 156807 117501 121578 102122 91739
25006I1739q5177J2524q7967j70413N3067L2227L5414r9393m2054O1216J32675
$$ 91739 6562 19086 -68881 -239294 -186227 -154000 -118586 -217979 -260033 -198817 -66142
24995f6142J00660J43942m1737j30589Q020J00n5326k3821L0974O6190J32955
$$ -66142 34518 178460 136723 6134 14154 14254 -41072 -64893 -33919 32271 165226
24984A65226l1702j42987n8052J76103m3633j36092J8773r9395l5789J50220M7849
$$ 165226 133524 -9463 -67515 108588 64955 -71137 -52364 -151759 -187548 -37328 10521
24973A0521j08635n1610p5710J18198K39019k18965o1644P1341J0928j05782o0176
$$ 10521 -98114 -149724 -225434 -107236 131783 -87182 -148826 -77485 -66557 -172339 -232515
24962b32515l0777Q6514R977R9389L5663j9555k2002m5508m5320J4481j1675J9858
$$ -232515 -263292 -176778 -166801 -67412 -31749 -51304 -73306 -118814 -164134 -149653 -161328 -141470
24950a41470K2018J282J31662k5441J49152p5912k71853M7993N7064j9682J05498
$$ -141470 -119452 -118170 13492 -11949 137203 61291 -210562 -162569 -105505 -125187 -19689
24939a9689L9062J05792q5943m4974J11262L2165j6728O7140N4880j1895j582
$$ -19689 19373 125165 39222 -5752 105510 137675 120947 188087 242967 231072 229490
24928B29490p2430j41960j43269p7693J67731J67250O6610l967N8067O0096o6223
$$ 229490 157060 15100 -128169 -205862 -38131 129119 195729 191762 249829 309925 243702
24917B43702o2658r3201M5061j04111j73687l8800K54233K8915J4279M609J23855
$$ 243702 181044 87843 132904 28793 -144894 -183694 70539 99454 113733 118342 242197
24906B42197N4256j26286l470j03319j92557P3610J05285K3215j69553l16548
$$ 242197 296453 170167 166697 63378 -129179 -55569 49716 72931 -96622 -413170
24896d13170m1893J74023K92149J26975j02201k29159j03268J03025J1448m3697
$$ -413170 -455063 -281040 11109 138084 35883 -193276 -296544 -193519 -182071 -225768
24886b25768O479O6736J84404J71057J66198j33454k32815M9142J71679r6883
$$ -225768 -219289 -152553 31851 202908 369106 235652 2837 51979 223658 126775
24876A26775l62559j23035J55093J24023k7131p261j7750k09649m2114R9456K38832
$$ 126775 -235784 -358819 -203726 -79703 -106834 -114095 -131845 -341494 -383608 -284152 -45320
24865d5320O4977p6056j97864k00940Q1894J79798N3280N2118J23033P2653l8294
$$ -45320 19657 -56399 -254263 -455203 -373309 -193511 -140231 -88113 34920 107573 69279
24854F9279r6640Q2685N4770J7651k45147n592J26478M8010l9529m038j52333
$$ 69279 -27361 55324 110094 127745 -117402 -122994 3484 51494 11965 7927 -144406
24843a44406j83156J0398k4131M6681L78994L7684r1693k5416R4717N0762m0570
$$ -144406 -327562 -317164 -341295 -294614 84380 122064 30371 4955 99672 150434 109864
24832A09864n2392q8720n3580j19809j39736J49705J71814O5009L3624k3558m2829
$$ 109864 57472 -31248 -84828 -204637 -344373 -194668 -22854 42155 75779 52221 9392
24821I392J8006J441k0085o0833p3930N3801M0418j70794L7142p4551P981j18134
$$ 9392 27398 28839 8754 -52079 -126009 -72208 -31790 -202584 -165442 -239993 -232012 -350146
24809c50146m3936r744l0468O3034L31083J11578M3893J8798J51854M9486m9079
$$ -350146 -394082 -403826 -434294 -371260 -40177 71401 115294 134092 285946 335432 286353
24798B86353j19922j41173K5174J09616K2781j05712K4324n0828j77112L0571
$$ 286353 166431 25258 50432 160048 182829 77117 101441 50613 -126499 -95928
24788i5928p9264J17586J26363k9971J07135n199k14959k5962J90384K1474q8397
$$ -95928 -175192 -57606 68757 38786 145921 140722 -74237 -100199 90185 111659 23262
24777B3262j21927k7866K5291J53077Q1859j15419p0288J83239K2900q3628j01220
$$ 23262 -98665 -126531 -101240 51837 133696 18277 -52011 131228 154128 70500 -30720
24766c0720M3100M4300Q744J88014J15686M212K3469O488l3669k36767r0694k01281
$$ -30720 12380 56680 65424 253438 369124 373336 396805 403293 369624 132857 42163 -159118
24754a59118L4680J73452m053K3916k1748o9730j7624J19639J16281p0222K0781
$$ -159118 -124438 49014 44961 68877 47129 -22601 -40225 79414 195695 125473 146254
24743A46254L9872k10133j65028Q6446J81220J04299l3394N3930j5966j36528
$$ 146254 186126 -24007 -189035 -102589 78631 182930 149536 203466 187500 50972
24733E0972q0133j5631J67798L6181m5305K0383o012o7340j43066j16133K42983
$$ 50972 -29161 -44792 123006 159187 113882 134265 128253 60913 -82153 -198286 44697
24722D4697J09672N0746J01071N4413q1871j29579j15892J25192l9342k419j8904
$$ 44697 154369 205115 306186 360599 278728 149149 33257 158449 119107 116688 97784
24711I7784R0376p7649j49552j31151j07561n2040K09908j911R3247k4452k25545
$$ 97784 188160 110511 -39041 -170192 -277753 -329793 -119885 -121796 -28549 -53001 -278546
24700b78546m9244N6020J50064J09539O4570R085N9481J0211R7503n4873j77312
$$ -278546 -327790 -271770 -121706 -12167 52403 61488 120969 131180 228683 173810 -3502
24689c502k03619J27582n5412j0995K41442L23p1393J44895O1398j0489k7960
$$ -3502 -207121 -79539 -134951 -145946 95496 95819 24426 169321 230719 220230 192270
24678A92270L7742J5575q6603N1293Q9993n5699p6067p5124j9547q1715J08184
$$ 192270 230012 245587 158984 210277 300270 244571 168504 93380 73833 -7882 100302
24667A00302J0495n3996p4626q085O7183J18869L5733j05919k21116L1826K7942
$$ 100302 110797 56801 -17825 -25910 41273 160142 195875 89956 -131160 -99334 -71392
24656g1392m6158m7677j27241Q2938J06825k4339O503J06259J05748j54847l6763
$$ -71392 -117550 -165227 -292468 -209530 -102705 -127044 -120541 -14282 91466 -63381 -100144
24645a00144R2068j0631l0324J73777N2159j85421n4871J35601R1741L2158P2792
$$ -100144 -8076 -18707 -49031 124746 176905 -8516 -63387 72214 163955 196113 268905
24634B68905Q929o7950o262m7655p383j3463j90649L3754o2602k1704K11432J03183
$$ 268905 277834 209884 203622 155967 148584 135121 -55528 -21774 -84376 -106080 105352 208535
24622B08535j58965m3885l5655O9311q6390j58015R4806o4399m0019J55974M854
$$ 208535 49570 5685 -29970 39341 -47049 -205064 -110258 -174657 -214676 -58702 -53848
24611e3848k7086J20102J80350k6418l12582n1599J81396Q3611K7724R276o4003
$$ -53848 -80934 39168 219518 193100 -119482 -171081 10315 93926 121650 130926 66923
24600F6923j83427q3904M5360J18934O553j09412M9824J45149p6231n5916Q8944
$$ 66923 -116504 -200408 -155048 -36114 -29561 -138973 -89149 56000 -20231 -76147 12797
24589A2797Q5584l9286k0384M335m9318o4792j46986j80623J3477J88761J51919
$$ 12797 98381 59095 38711 43046 -6272 -71064 -218050 -398673 -385196 -196435 -44516
24578d4516K4161o4390l5101k8916O4387J86207L6040K1703j9544P435j07660
$$ -44516 -20355 -84745 -119846 -148762 -84375 101832 137872 159575 140031 147466 39806
24567C9806k43205j27462Q3588J09274Q5452J08966j26712j34558o5270N3457
$$ 39806 -203399 -330861 -247273 -137999 -52547 56419 -70293 -204851 -270121 -216664
24557b16664L8908q9306N2364J00580r2107k21388K181N3699J17950J44198Q4893
$$ -216664 -177756 -267062 -214698 -114118 -206225 -427613 -425432 -371733 -253783 -109585 -24692
24546b4692J2010j57708J34761M0677o7090K1165j8652m8783R9759J23418K15150
$$ -24692 -12682 -170390 -35629 5048 -62042 -40877 -59529 -108312 -8553 114865 330015
24535C30015j37247J9305K3300r449m4028K0499L4036k82748j86544P9566R5339
$$ 330015 192768 212073 235373 225924 181896 202395 236431 -46317 -232861 -153295 -57956
24524e7956Q6969J511o3165k10119K9016K8454M434j09851p6139J41786J79210
$$ -57956 29013 30524 -32641 -242760 -213744 -185290 -180856 -290707 -366846 -225060 -45850
24513d5850J16348L0286p1775o4260J83028j7140j5103l3878j23501j78493K988
$$ -45850 70498 100784 29009 -35251 147777 130637 115534 81656 -41845 -220338 -217350
24502b17350J57270J24132q3023K8814N6188m0916l7181Q0014L7477j41769j48198
$$ -217350 -60080 64052 -18971 9843 66031 25115 -12066 67948 105425 -36344 -184542
24491a84542J50445Q8287j5619K1709n8899L7296R3910r2480j02471j61316n6179
$$ -184542 -34097 54190 38571 60280 1381 38677 132587 40107 -62364 -223680 -279859
24480b79859R7183K582J16225J16442l0018n2550m6149J20029m5946r2404P4829
$$ -279859 -182676 -180094 -63869 52573 22555 -29995 -76144 43885 -2061 -94465 -19636
24469a9636p264j01521o7212J31950J72439k6976j10362j09278M4057Q189M4968
$$ -19636 -26900 -128421 -195633 -63683 108756 81780 -28582 -137860 -93803 -85614 -40646
24458d0646K19925o2763m3900q960r1739p2189J28067Q7684J77248l1299j95587
$$ -40646 179279 116516 72616 63656 -28083 -100272 27795 115479 292727 261428 65841
24447F5841k53385m7788K05524J17282j7229J52891M7099o4253o6931o3530p8293
$$ 65841 -187544 -235332 -29808 87474 70245 223136 270235 205982 139051 75521 -2772
24436b772j09166n4515J59010J31638K8041p021J11937j04462m5007O0486j2198
$$ -2772 -111938 -166453 -7443 124195 152236 145215 257152 152690 107683 168169 155971
24425A55971j21937J56745L2887k13538N5968M8109j09437P9478r242J236l0913
$$ 155971 34034 190779 223666 10128 66096 114205 4768 84246 75004 76240 45327
24414D5327N6315j50516k0224J06066j76009q1133O9182l1023Q3955J07398M3473
$$ 45327 101642 -48874 -69098 36968 -139041 -220174 -150992 -182015 -98060 9338 52811
24403E2811q5938j6647J60014M0781k04361O3453J66976N4967r9529p6960P2963
$$ 52811 -33127 -49774 110240 151021 -53340 10113 177089 232056 132527 55567 128530
24392A28530n2844j03510p2449Q6093J67763p7617O9828M6890M832k0364j14064
$$ 128530 75686 -27824 -100273 -14180 153583 75966 145794 192684 197516 177152 63088
24381F3088n9692P468j45120j69553J51754k2962p8132P8444Q0028O8428m6319
$$ 63088 3396 10864 -134256 -303809 -152055 -175017 -253149 -174705 -94677 -26249 -72568
24370g2568k22714J10047o4499M671K83920K38988J878k69686p0481P697n3375
$$ -72568 -295282 -185235 -249734 -245063 38857 277845 279723 10037 -60444 -52747 -106122
24359a06122p0018L8173L8509Q2486M5216O510k605Q5559l28O511j8947k3756
$$ -106122 -176140 -137967 -99458 -16972 28244 34754 32149 117708 117380 123891 104944 81188
24347H1188j42954J12507O2250L6546m6898r0773k3842n0732m385J8647J42369
$$ 81188 -61766 50741 112991 149537 102639 11866 -11976 -62708 -67093 -48446 93923
24336I3923P5321L9061n3658q1212k65091P8158K06882J60740q5473J5240L08285
$$ 93923 169244 208305 154647 73435 -191656 -113498 93384 254124 168651 183891 492176
24325D92176k86813k39168P7807M7570j26289k51108r2148J44870R7129Q7144
$$ 492176 205363 -33805 44002 91572 -34717 -285825 -377973 -233103 -135974 -48830
24315d8830J91887K53344j31508k66133j71146K7523l0834J7059J27900j04618
$$ -48830 143057 396401 264893 -1240 -172386 -144863 -175697 -158638 -30738 -135356
24305a35356l9314j2341j37755j44156k8941K23824N4966N633J19112K8504M4866
$$ -135356 -174670 -187011 -324766 -468922 -497863 -274039 -219073 -213440 -94328 -65824 -20958
24294b0958j3511j467O8519j9216J5554Q926M8693l764p3639l2648J4807j06856
$$ -20958 -34469 -35936 32583 13367 28921 37847 86540 82776 9137 -23511 -8704 -115560
24282a15560Jm2222J47053K69271l1370N7709j16069p5015O9778n3901J85327
$$ -115560 -115559 -157781 -10728 258543 227173 284882 168813 93798 163576 109675 295002
24271B95002j07204o6058m0795J10650p668k9813l7064k4023J7873r4974K4528
$$ 295002 187798 121740 80945 191595 183927 154114 117050 93027 110900 15926 40454
24260D0454o3386K8102M6042O2404k27061M8177J39406J25933J04980p3792j08619
$$ 40454 -22932 5170 51212 113616 -113445 -65268 74138 200071 305051 231259 122640
24249A22640k8590p0612O2415j83676n936k0403M4871M9636p3506m1829j4635
$$ 122640 94050 23438 85853 -97823 -103759 -124162 -79291 -29655 -103161 -144990 -159625
24238a59625N2173O4293p229M4586j55132p7766j01922j8579O9134J86615J83023
$$ -159625 -107452 -43159 -50388 -5802 -160934 -238700 -340622 -359201 -290067 -103452 79571
24227G9571r8183K4603L9723j35667Q0451J18148j90937o0186P7744r6308J5866
$$ 79571 -18612 5991 45714 -89953 -9502 108646 -82291 -142477 -64733 -161041 -145175
24216a45175k1026N9126J53341J20318j16790r6319P2621N1915Q0063J20577j33958
$$ -145175 -166201 -107075 46266 166584 49794 -46525 26096 78011 158074 278651 144693
24205A44693j13878J59678J9701r4516r0748O1726l0582j80792M9441Q0150l5296
$$ 144693 30815 190493 210194 115678 24930 86656 56074 -124718 -75277 4873 -30423
24194c0423j14506J52904n8709q2208K6857N1385o1338j57643J0483J68407Q5586
$$ -30423 -144929 7975 -50734 -132942 -106085 -54700 -116038 -273681 -263198 -94791 -9205
24183i205j49370j37657j37747J03280K46704Q1814j70487k96015J2571L01724
$$ -9205 -158575 -296232 -433979 -330699 -83995 -2181 -172668 -468683 -456112 -154388
24173a54388P7399n926k7609J70276m2965J11734Q0473n2210R5528j3571k3271
$$ -154388 -76989 -82915 -110524 59752 16787 128521 208994 156784 252312 238741 215470
24162B15470N1358j00534N1275L6615n6654j70493J17091K7677L4908j52122p6100
$$ 215470 266828 166294 217569 254184 197530 27037 144128 171805 206713 54591 -21509
24151b1509k15909j4712k2974P3125M714J53526P0406J53006m5721j89310r1185
$$ -21509 -237418 -252130 -275104 -201979 -197265 -43739 26667 179673 133952 -55358 -146543
24140a46543P0643m3675q330j49246J4279J12583K32799J40399j7195K2641K1303
$$ -146543 -75900 -119575 -127905 -277151 -262872 -150289 82510 222909 205714 228355 249658
24129B49658j25808k3253P9137o3099j87386K367k4180j15508r7787N618J70186
$$ 249658 123850 100597 179734 116635 -70751 -68384 -92564 -208072 -305859 -300241 -130055
24118a30055J10506O1151J4596o580m0624q7263N0306n1620j38172O0167q733
$$ -130055 -19549 41602 56198 49618 8994 -78269 -27963 -79583 -217755 -157588 -166321
24107a66321L2079k0782p3339M5533J88508j05329J6059P803m3705o5165l8033
$$ -166321 -134242 -155024 -228363 -182830 5678 -99651 -83592 -75789 -119494 -184659 -222692
24096b22692J79234L5241j7620j08840p5394j3375M0611L3055Q1207J9908N5405
$$ -222692 -43458 -8217 -25837 -134677 -210071 -223446 -182835 -149780 -68573 -48665 6740
24085F740j7556q867j2228j30498l1544l6540P457k2104L1886P8668J13822O8253
$$ 6740 -10816 -19683 -31911 -162409 -193953 -230493 -223036 -245140 -213254 -134586 -20764 47489
24073D7489p4869j54087P4685J05442j16292m1334N9866K29556L5550l7351o9932
$$ 47489 -27380 -181467 -106782 -1340 -117632 -158966 -99100 130456 166006 128655 58723
24062E8723n5095o203j36335K1509J0092p5690J52933K08403q5944J23977m438
$$ 58723 3628 -2575 -138910 -117401 -107309 -182999 -30066 178337 92393 216370 211932
24051B11932o5110j41608j19288P4604J65137J40544n2559j16250j84566j8980
$$ 211932 146822 5214 -114074 -39470 125667 266211 213652 97402 -87164 -106144
24041a06144M745K9803K7063R3362J1876o5698l3429O9435K9016j1615j39274
$$ -106144 -101399 -71596 -44533 48829 60705 -4993 -38422 31013 60029 48414 -90860
24030i0860J9517l2085r0476J35017Q3428L1450K30637M0827k9159j31545n3762
$$ -90860 -71343 -103428 -193904 -58887 24541 55991 286628 327455 298296 166751 112989
24019A12989M0219M3289M2526o1714J13150j6911m155j58215L2669K6183l9734
$$ 112989 153208 196497 239023 177309 290459 273548 269393 111178 143847 170030 130296
24008A30296j16145p3452J18265K4105j28913M5817k4759k04393N3745R2098Q2220
$$ 130296 14151 -59301 58964 83069 -45844 -27 -24786 -229179 -175434 -83336 -1116
23997a116N3329j02862M3828Q1402l545j24535j05571n7037k2615J7534l2548
$$ -1116 52213 -50649 -6821 74581 71036 -53499 -159070 -216107 -238722 -221188 -253736
23986b53736J584K7642J05471l25J66530M8253j16707p2516M7798k6617P6767
$$ -253736 -252152 -224510 -119039 -119364 47166 95419 -21288 -93804 -46006 -72623 4144
23975D144Q2896J48579j02277p8268l6569N5327l8787m7486p7680r0253O1430
$$ 4144 87040 235619 133342 55074 18505 73832 35045 -12441 -90121 -180374 -118944
23964a18944n630J6124k779J12695k35646j2412J01674J49848O7871N5569J1793
$$ -118944 -124574 -108450 -111229 1466 -234180 -246592 -144918 4930 72801 128370 140163
23953A40163r3073q3178J13799q9963o2694k8355j10262R0610R0447q0036J44085
$$ 140163 47090 -36088 77711 -12252 -74946 -103301 -213563 -122953 -32506 -112542 31543
23942C1543K35188r2439k43665J3909Q3761L3279m7516n4979N1503L4110k12110
$$ 31543 266731 174292 -69373 -55464 28297 61576 14060 -40919 10584 44694 -167416
23931a67416k06982j6625K147K78117J03826o465j88259p799L9719j1981P7499
$$ -167416 -374398 -391023 -388876 -110759 -6933 -13398 -201657 -209456 -169737 -181718 -104219
23920a04219J3263m4314k5058R7861P0140j9277M4629j19517M2675Q879k64244
$$ -104219 -90956 -135270 -160328 -62467 7673 -11604 33025 -86492 -43817 -34938 -299182
23909b99182J13775O5488j43606r3737O6963J68951n7624J8801M5979j03393M1911
$$ -299182 -185407 -119919 -263525 -357262 -290299 -121348 -178972 -160171 -114192 -217585 -175674
23898a75674k1197J05997J33604o1598r9878r9998J45428N8069m3825R3070N3529
$$ -175674 -196871 -90874 42730 -18868 -118746 -218744 -73316 -15247 -59072 33998 87527
23887H7527o7585n6080J2848J12165K5198J456k9832k6134J21871J5238o5404
$$ 87527 19942 -36138 -23290 88875 114073 115529 85697 59563 181434 196672 131268
23876A31268J47134k3903k93985r1122q0889n3856M6916p6985N6512R2943m7913
$$ 131268 278402 254499 -39486 -130608 -211497 -265353 -218437 -295422 -238910 -145967 -193880
23865a93880j58169J00016R6576J64045m5102j8990O5291M5973m3017o6144k661
$$ -193880 -352049 -252033 -155457 8588 -36514 -55504 9787 55760 12743 -53401 -56062
23854e6062k9520J91787P4204K6304j36155j90634l4894P7575R2569J3815N1520
$$ -56062 -85582 106205 180409 206713 70558 -120076 -154970 -77395 15174 28989 80509
23843H0509J01478l73L3484M4782l2402n6111k4406o7917j67248j83595j659n5128
$$ 80509 181987 181614 215098 259880 227478 171367 146961 79044 -88204 -271799 -273458 -328586
23831c28586J06724P3117J47019N9103j28708K2306J12350m830j17338J2624J1008
$$ -328586 -221862 -148745 -1726 57377 -71331 -49025 63325 58495 -58843 -46219 -35211
23820c5211J1957N7731j3146N0404l4159R3085P6700n1841r3427m9187k2670N7261
$$ -35211 -23254 34477 21331 71735 37576 130661 207361 155520 62093 12906 -9764 47497
23808D7497O8616k45163k31076P9339R1732k156P7988K12567J22291j90497k09350
$$ 47497 116113 -129050 -360126 -280787 -189055 -191211 -113223 99344 221635 31138 -178212
23797a78212j03607K8593K01151J39440q104n075O0407m8946k02590k9428L3638
$$ -178212 -281819 -253226 -52075 87365 79261 74186 134593 85647 -116943 -146371 -112733
23786a12733o4895l1566J14143l3046j4363J3400j67561J54542K37939J63641
$$ -112733 -177628 -209194 -95051 -128097 -142460 -129060 -296621 -142079 95860 259501
23776B59501N9584p4601M411p6904o7449L3601J6097k5490o018k1980P863M5074
$$ 259501 319085 244484 248895 171991 104542 138143 154240 128750 122732 100752 108615 153689
23764A53689n5968o0894R260J5938j8667J26554J17448J43690r5557l14362l14163
$$ 153689 97721 36827 46087 62025 43358 169912 287360 431050 335493 21131 -293032
23753b93032j26830J02462J80312R3682L4242P2268j4390j87165r2435L8154Q1730
$$ -293032 -419862 -317400 -137088 -43406 -9164 63104 48714 -138451 -230886 -192732 -111002
23742a11002J07665J51421M1139n1151j376l7915k9107j3353M1483r1710j63328
$$ -111002 -3337 148084 189223 138072 136696 98781 69674 56321 97804 6094 -157234
23731a57234J5301J47140j27851j60048N1456K15991N2866l9219o7531j71822
$$ -157234 -141933 5207 -122644 -282692 -231236 -15245 37621 -1598 -69129 -240951
23721b40951k4087J96905L6050M3681J0685j13775l4752P7204R9243J30332m3650
$$ -240951 -265038 -68133 -32083 11598 22283 -91492 -126244 -49040 50203 180535 136885
23710A36885Q5731o6292m3206J08491J6916p4066j51018q2904l9427j1354o2256
$$ 136885 222616 156324 113118 221609 238525 164459 13441 -69463 -108890 -120244 -182500
23699a82500j18534l3173J52854R5259K9095J29035R5445n6235j12916l7860q0323
$$ -182500 -301034 -334207 -181353 -86094 -56999 72036 167481 111246 -1670 -39530 -119853
23688a19853O33j33006k9907L9646K00115P4420K2238R6936n8501j6633O6923
$$ -119853 -119220 -252226 -282133 -242487 -42372 32048 54286 151222 92721 76088 143011
23677A43011j03034m0934J20245L998j21557q979R3163J70651j28261j60697j01340
$$ 143011 39977 -957 119288 123286 1729 -7250 85913 256564 128303 -32394 -133734
23666a33734K4614n5361N5772P7406R5576L8432J8633j0689K689O4991N2106m9864
$$ -133734 -109120 -164481 -108709 -31303 64273 102705 121338 110649 113338 178329 230435 180571
23654A80571j00019q0419l0297n5765J61374R5447k26216L755m976M2632K6346
$$ 180571 80552 133 -30164 -85929 75445 170892 -55324 -51569 -56545 -13913 12433
23643A2433r8057K2166L8469m0085K919j1252K8906O2425p746K0958j9362j57402
$$ 12433 -85624 -63458 -24989 -65074 -62155 -73407 -44501 17924 10178 31136 11774 -145628
23631a45628k0579l3883Q0108J56505j12711L3600m8281k56941m6578K07644J80999
$$ -145628 -166207 -200090 -119982 36523 -76188 -42588 -90869 -347810 -394388 -186744 -5745
23620e745J01126O0055L4960j16654r8382n2703l5128J4371K9341k3607J8798
$$ -5745 95381 155436 190396 73742 -24640 -77343 -112471 -98100 -68759 -92366 -73568
23609g3568J2347J03144L304n813j33451M7846k3090O8118J10481J26728L0942
$$ -73568 -61221 41923 45227 39414 -94037 -46191 -69281 -1163 109318 236046 266988
23598B66988j95256j27921m412M24k8812J1349j46479j5617K65688K0602Q7696
$$ 266988 71732 -56189 -60601 -60177 -88989 -77640 -224119 -239736 25952 46554 134250
23587A34250m1844m6811J36573L8112j90130n6348J62246P3625P347j0299q993
$$ 134250 92406 45595 182168 220280 30150 -26198 136048 209673 217020 206721 197728
23576A97728K8403o6713j06696J791n2298j09846j01619j3734P6372J31094J4726
$$ 197728 226131 159418 52722 54513 2215 -107631 -209250 -222984 -146612 -15518 -792
23565g92J4342r938K851R8722j99854j2033P2220N8875j95556J11510J44496j1603
$$ -792 13550 3612 6463 105185 -94669 -106702 -34482 24393 -171163 -59653 84843 73240
23553G3240j19277n047J873Q9926J39517o2574r4412j00154q3623O5975Q2049
$$ 73240 -46037 -51084 -49211 40715 180232 117658 23246 -76908 -160531 -94556 -12507
23542a2507J9747n7571J09398o4683l0520R8669M4334L2603Q1860l4102k94544
$$ -12507 7240 -50331 59067 -5616 -36136 62533 106867 139470 221330 187228 -107316
23531a07316j23068J29562P2997J62490j0476j16994k1080J34910M0092m0349
$$ -107316 -230384 -100822 -27825 134665 124189 7195 -13885 121025 161117 120768
23521A20768K5455j42033j93165J66221J63388J05637l3158j38407j16749R706
$$ 120768 146223 4190 -188975 -22754 140634 246271 213113 74706 -42043 -32337
23511c2337K1451j33687m0109K9369J12055K10682J22020m7791j11019k62405
$$ -32337 -10886 -144573 -184682 -155313 -43258 167424 289444 241653 130634 -131771
23501a31771p5532Q3129K4868J32022o9108q5454r1179P7027n13J36106J53088
$$ -131771 -207303 -124174 -99306 32716 -36392 -121846 -213025 -135998 -136511 -405 152683
23490A52683j11720q9284P8140J29788K4167j16910j10007N8298J46272p9307
$$ 152683 40963 -48321 29819 159607 183774 66864 -43143 15155 161427 82120
23480H2120j85736j53501K03691P5655n2812j23404O1176K14796K13040r0191
$$ 82120 -103616 -257117 -53426 22229 -30583 -153987 -92811 121985 335025 244834
23470B44834j29053M3063P4860l571k90116k60400n0167L0846J23957K18656N9473
$$ 244834 115781 158844 233704 230133 -59983 -320383 -370550 -339704 -215747 2909 62382
23459F2382O58l8880l3605J94066k423p9948k01459q2260j08105L7296J97377
$$ 62382 63040 24160 -9445 184621 182198 102250 -99209 -181469 -289574 -252278 -54901
23448e4901Q7329L4746O7397l4259p9912m9528j54581J5550J95367L31382p3246
$$ -54901 32428 67174 134571 100312 20400 -29128 -183709 -168159 27208 358590 285344
23437B85344k00149j36645o5895M1481M12446J59010k20895j58924P2916o5177
$$ 285344 85195 -51450 -117345 -75864 336582 495592 274697 115773 188689 123512
23427A23512n2660K256n448j17560k923K0239O190m2209n5081j2483K49663J78587
$$ 123512 70852 73108 67660 -49900 -52823 -32584 -26394 -68603 -123684 -136167 113496 292083
23415B92083j59490o2860O8657J40888k65376k78562o7104k5928J94756K67134
$$ 292083 132593 69733 138390 279278 13902 -264660 -331764 -357692 -162936 104198
23405A04198j6746q3111J8608r989M5230k2551J01471N0147j95634p1892Q2871
$$ 104198 87452 4341 22949 12960 58190 35639 137110 187257 -8377 -80269 2602
23394B602J87415j10754j86732q6632J06739J9442N0737P1332j02293M9019M4349
$$ 2602 190017 79263 -107469 -194101 -87362 -67920 -17183 54149 -48144 875 45224
23383D5224l9063J9915j7515j23846m687P1050Q104j6450J28968r0611J5999J35747
$$ 45224 6161 26076 8561 -115285 -119972 -48922 -40818 -57268 71700 -18911 -2912 132835
23371A32835j44893k29349J41609K58165P4684o6540J45469N6302q1571j32882
$$ 132835 -12058 -241407 -99798 158367 233051 166511 311980 368282 286711 153829
23361A53829o964o3451p9684m1246J45652l6341j29465K7920J92586P5277p7460
$$ 153829 146865 83414 3730 -37516 108136 71795 -57670 -29750 162836 238113 160653
23350A60653J8139k6578l8409j19401R2079k7278r1131p5323n1280j01683O4569
$$ 160653 178792 152214 113805 -5596 86483 59205 -31926 -107249 -158529 -260212 -195643
23339a95643J22494J56914p8888l7178J96244r598j46017l0190P3144m3519l8145
$$ -195643 -73149 83765 4877 -32301 163943 154345 8328 -21862 51282 7763 -30382
23328c0382q5168N0286q3364q0142l4700k3100o839J32535M0921J12352L0911
$$ -30382 -115550 -65264 -148628 -228770 -263470 -286570 -293409 -160874 -119953 -7601 23310
23317B3310J97039o2351j81967q6798J70393J80367L5741j58739r8247j1173j2119
$$ 23310 220349 157998 -23969 -110767 59626 239993 275734 116995 18748 7575 -4544
23306d544L4250Q2923r4001J05120l8259j23868J03404Q3919J20867J5541k34236
$$ -4544 29706 112629 18628 123748 85489 -38379 65025 148944 269811 285352 51116
23295E1116p4935O8967J08116J12267Q8441k4585M3590j98239k85015m0477m8747
$$ 51116 -23819 45148 153264 265531 353972 329387 372977 174738 -110277 -150754 -199501
23284a99501j6518P145R3243J84563K39387j20624m5301o3601r6610j93375O6056
$$ -199501 -216019 -208874 -115631 68932 308319 187695 142394 78793 -17817 -211192 -145136
23273a45136m6840k38754Q9485K01691J1880M4852L6943p1544J82474M4159r6161
$$ -145136 -191976 -430730 -341245 -139554 -127674 -82822 -45879 -117423 65051 109210 13049
23262A3049n9497K04424J19632j19563j70673j4017r5789k8870L7921J72306J9697
$$ 13049 -46448 157976 277608 158045 -12628 -26645 -122434 -151304 -113383 58923 78620
23251G8620N7894O3825J50497P3726j33006k66941M0178N8456m6250j31121j12075
$$ 78620 136514 200339 350836 424562 291556 24615 64793 123249 76999 -54122 -166197
23240a66197L8955J31745o3090M8140o2071n788k8350j22979K4393J64721r313
$$ -166197 -127242 4503 -58587 -10447 -72518 -78306 -106656 -229635 -205242 -40521 -49834
23229d9834K878K6646J63425m3196j63727j71461J44608q691J1120l6957m0783
$$ -49834 -46956 -20310 143115 99919 -63808 -235269 -90661 -99352 -88232 -125189 -165972
23218a65972J03153J4598n3658Q1049R7963L7673J6196n1429Q683L3034p2294
$$ -165972 -62819 -48221 -101879 -20830 77133 114806 131002 79573 88256 121290 48996
23207D8996l0868j97729m9800O4022l7735j44588J17516J30641k1832J45407Q0963
$$ 48996 18128 -179601 -229401 -165379 -203114 -347702 -230186 -99545 -121377 24030 104993
23196A04993P4392k11009k66153r4797K7455J39168J17888J40115q5508n4339
$$ 104993 179385 -31624 -297777 -392574 -365119 -225951 -108063 32052 -53456 -107795
23186a07795J23609r7455r3140j5473J17133J27992r7166O3983k24602p3927K06829
$$ -107795 15814 -81641 -174781 -190254 -73121 54871 -42295 21688 -202914 -276841 -70012
23175g0012K2630j31293m0783K7594J92069O5948j42567j42399m886J76929l3700
$$ -70012 -47382 -178675 -219458 -191864 205 66153 -76414 -218813 -223699 -46770 -80470
23164h0470N9506N4386O014J17601o0771n8881n4887P273j21312j42167J61229
$$ -80470 -20964 33422 39436 157037 96266 37385 -17502 -10229 -131541 -273708 -112479
23153a12479O6287l3817R3393j7848q9754J72143J9165j95916M3657n3503j81370
$$ -112479 -46192 -80009 13384 -4464 -94218 77925 97090 -98826 -55169 -108672 -290042
23142b90042j8901j169N2542K6099Q9443J15209j6806j47959K7724Q5379P7633
$$ -290042 -308943 -310112 -257570 -231471 -142028 -26819 -43625 -191584 -163860 -78481 -848
23131h48Q9946k4968l7515l7421l5284j55369J79145K02251k3717J3918K6790
$$ -848 89098 64130 26615 -10806 -46090 -201459 -22314 179937 156220 170138 196928
23120A96928m3454j03309N7870K8076l2797p6281O2827j3913j791k0238K4948
$$ 196928 153474 50165 108035 136111 103314 27033 89860 75947 74156 53918 78866
23109G8866K9052o6361J9114k1060o3440M3960p6696k2134q1093Q5725J73137
$$ 78866 107918 41557 60671 39611 -23829 20131 -56565 -78699 -159792 -74067 99070
23098I9070R8760j55559o1683n2149J24409J20605j12568k0095J31712K6763l3952
$$ 99070 197830 42271 -19412 -71561 52848 173453 60885 40790 172502 199265 165313
23087A65313j40920J3013N9246K6730J8323j21155k9235K572J6943J59929j3495
$$ 165313 24393 37406 96652 123382 141705 20550 -8685 -6113 10830 170759 157264
23076A57264k40267k3070j34769m0353J54841J27953J01353L4077j2281k0242
$$ 157264 -83003 -106073 -240842 -281195 -126354 1599 102952 137029 124748 104506
23066A04506p3380k2807R2225n5739j21410L4759J96808m8058J84146J9915p5675
$$ 104506 31126 8319 100544 44805 -76605 -41846 154962 106904 291050 310965 235290
23055B35290j2884n9971j22457L6769l6164J831J44493n2329j43723K0223R7996
$$ 235290 222406 162435 39978 76747 40583 42414 186907 134578 -9145 11078 109074
23044A09074j69624n0006K02292J43641j74201k25637j813q4797p8878J83027
$$ 109074 -60550 -110556 91736 235377 61176 -164461 -166274 -251071 -329949 -146922
23034a46922K08918j20295m6466o8767j38406K12234P1853M0305K32959J7288
$$ -146922 61996 -58299 -104765 -173532 -311938 -99704 -27851 12454 245413 262701
23024B62701Q2796j6220N9063m5873j98420r5984M6140J9224M3199j32482l01605
$$ 262701 345497 329277 388340 342467 144047 48063 94203 113427 156626 24144 -277461
23013b77461l1579J13070J0201Q8689J43932P5733N8656j46036j28236j43444
$$ -277461 -309040 -195970 -185769 -97080 46852 122585 181241 35205 -93031 -236475
23003b36475K06345J26054J04551P2647N024p7917p080K1802K4962j31244N4417
$$ -236475 -30130 95924 200475 273122 278146 200229 193149 214951 239913 108669 163086
22992A63086J3468M9099J51202J49055J47897j853M8805L71526N59697L81116
$$ 163086 176554 225653 376855 525910 673807 671954 720759 1092285 1651982 2033098
22982B033098J18632j15317l4923M9160m5325p8620m03317m21184j81228j36347
$$ 2033098 2151730 2036413 2001490 2050650 2005325 1926705 1523388 1102204 920976 784629
22972G84629j83210j34389k5128j15407j50164L4293J32597o7075j45581j33299
$$ 784629 601419 467030 441902 326495 176331 210624 343221 276146 130565 -2734
22962b734m8516K18394Q1973k0178j63237Q0224L1722l4789N1965Q5094j11889
$$ -2734 -51250 167144 249117 228939 65702 145926 177648 142859 194824 279918 168029
22951A68029m6328M6904j59277q7042N3988N6109j2105n9578j29430j23985o627
$$ 168029 121701 168605 9328 -77714 -23726 32383 20278 -39300 -168730 -292715 -299342
22940b99342J52541K64364N6467l1893r2820j40665n4812j71928K2571J74931
$$ -299342 -146801 117563 174030 142137 49317 -91348 -146160 -318088 -295517 -120586
22930a20586j2854M2461J40141n0594m1174N4536P3683Q5582J02032r0347Q9590
$$ -120586 -133440 -90979 49162 -1432 -42606 11930 85613 171195 273227 182880 272470
22919B72470R0053M2939k28690k31365j42900J8897K04257J38791o2591l9294
$$ 272470 362523 405462 176772 -54593 -197493 -178596 25661 164452 101861 62567
22909F2567L3843p5899p6434O7219O6120R7686R3577q1253p3633r2762j02732
$$ 62567 96410 20511 -55923 11296 77416 175102 268679 187426 113793 21031 -81701
22898h1701l4388O1619j00976k381O6256k17979j46748K21191K84619l9021p6245
$$ -81701 -116089 -54470 -155446 -157827 -91571 -309550 -456298 -235107 49512 10491 -65754
22887f5754N1025P527l1396j3648p1088j46035r2218J31537J56165J33547J73178
$$ -65754 -14729 -7202 -38598 -52246 -123334 -269369 -361587 -230050 -73885 59662 232840
22876B32840L6613j5259q3478r3601k4533P4115J58900P5092q2465l36638j89534
$$ 232840 269453 254194 170716 77115 52582 126697 285597 360689 278224 -58414 -247948
22865b47948J77260K45714Q4873k12388k50328N3450K5916K50648P8089k2663
$$ -247948 -70688 175026 259899 47511 -202817 -149367 -123451 127197 205286 182623
22855A82623j73353o4089J5879J54706o7741j50924n5261M8868J32174L6146r3859
$$ 182623 9270 -54819 -38940 115766 48025 -102899 -158160 -109292 22882 59028 -34831
22844c4831j06757P6493J00004k8442L2709m5854j43657J10099R0700J63654j18346
$$ -34831 -141588 -65095 34909 6467 39176 -6678 -150335 -40236 50464 214118 95772
22833I5772j71572m2264J08457R0581Q8510L5868p8660k35828p5492J07771J47404
$$ 95772 -75800 -118064 -9607 80974 169484 205352 126692 -109136 -184628 -76857 70547
22822G0547k1949R3101m8219p9308P0273N8647j2059M7151P014k05504k10427
$$ 70547 48598 141699 93480 14172 84445 143092 131033 178184 185198 -20306 -230733
22811b30733j59236J7077J20602J54356O3846o3282O3233J49255m7732n9581m4103
$$ -230733 -389969 -372892 -252290 -97934 -34088 -97370 -34137 115118 67386 7805 -36298
22800c6298K2543J34213l8366k1707o1658J15550R6765L2832o454m637l9211J32284
$$ -36298 -13755 120458 82092 60385 -1273 114277 211042 243874 237420 232783 193572 325856
22788C25856j16613P311j21091o9438J4730J07483j38110K7050J28942m4501k78428
$$ 325856 209243 216554 95463 26025 40755 148238 10128 37178 166120 121619 -156809
22777a56809k1498O763k654R8851j2840P5850P2909p8536j44607p4429j23483
$$ -156809 -178307 -171544 -174198 -75347 -88187 -12337 60572 -17964 -162571 -237000 -360483
22766c60483j25651n0835N8145J9720O4220J56689J83473J32759R6189J951M1972
$$ -360483 -486134 -536969 -478824 -459104 -394884 -238195 -54722 78037 174226 176177 218149
22755B18149J2825M0886J03428m6018k2018j15865j12809r4649P6817J09051j18968
$$ 218149 230974 271860 375288 329270 307252 191387 78578 -16071 60746 169797 50829
22744E0829j07808o565O8278r7028j17988M7358J11709J7249j58969o3188K02292
$$ 50829 -56979 -63544 4734 -92294 -210282 -162924 -51215 -33966 -192935 -256123 -53831
22733e3831K7451r6472R3728N9012O3466k23194j53978O6275q5587J2075J1104
$$ -53831 -26380 -122852 -29124 29888 93354 -129840 -283818 -217543 -303130 -291055 -279951
22722b79951J54426J13549m5764Q840J16201K9193j17394j28653L3055L9116J50243
$$ -279951 -125525 -11976 -57740 -48900 67301 96494 -20900 -149553 -116498 -77382 72861
22711G2861R4515p6461j57720r3406j34257J48077J93346q2269N3379Q5064J34171
$$ 72861 167376 90915 -66805 -160211 -294468 -146391 46955 -35314 18065 103129 237300
22700B37300K7433j27990k7996o1250n2002J50223o9135l16103Q8254J96644J61782
$$ 237300 264733 136743 108747 47497 -4505 145718 76583 -239520 -151266 45378 207160
22689B07160l5768p9174o0627n5777R4828J5687J1740N9125J45136L8048k8887
$$ 207160 171392 92218 31591 -24186 70642 86329 98069 157194 302330 340378 311491
22678C11491o3597O925J87513Q9672N5424k36505k25573l2731j5896n4846r681
$$ 311491 247894 254819 442332 532004 587428 350923 125350 92619 76723 21877 12196
22667A2196R353j17652j2350j01444O9723J17778J25582j0281J56684Q2084R8157
$$ 12196 21549 -96103 -108453 -209897 -140174 -22396 103186 92905 249589 331673 429830
22656D29830j37554o5205N6069L6814k6508p0366q9803P274Q2804j4891r0013
$$ 429830 292276 227071 283140 319954 293446 223080 133277 140551 223355 208464 118451
22645A18451j37230j17701j00929j4010J19961j0277J06533j20955r2255O408
$$ 118451 -18779 -136480 -237409 -251419 -131458 -141735 -35202 -156157 -248412 -242004
22635b42004K7327j613J15350J45285J32192l6728j04403J90250K3091L7653J04067
$$ -242004 -214677 -216290 -100940 44345 176537 139809 35406 225656 248747 286400 390467
22624C90467K0905j35283k21344m4245k845R8901j1699q4365q0748q4521O6612
$$ 390467 411372 276089 54745 10500 7655 106556 94857 10492 -70256 -154777 -88165
22613h8165m4076P6173j4997J6776N7589O659j3092R6282j01216o6525j8071q6213
$$ -88165 -132241 -56068 -71065 -54289 3300 9959 -3133 93149 -8067 -74592 -92663 -178876
22601a78876m3491K345N777J24288M1531K04174J79386j20150j15684j03218Q4106
$$ -178876 -222367 -220022 -214245 -89957 -48426 155748 335134 214984 99300 -3918 80188
22590H0188j55018N8978R8189N0169R4544M0227k2801j39196N2023J26109l5417
$$ 80188 -74830 -15852 82337 132506 227050 267277 244476 105280 157303 283412 247995
22579B47995q0291J3979j30574J673J30454K578m2958O1154o3829O6682J01249
$$ 247995 167704 181683 51109 52782 183236 185814 142856 204010 140181 206863 308112
22568C08112N4884p3734m9446J55853J19540J8533m426k51104p8754L9731J06394
$$ 308112 362996 289262 239816 395669 515209 533742 529316 278212 199458 239189 345583
22557C45583P6522J26982K04320Q3460O2109Q5456p9149J33384n6074p8063p525
$$ 345583 422105 549087 753407 836867 898976 984432 905283 1038667 982593 904530 897005
22546H97005k52754k34476k41539j55630l7626l1308P226L3948O5489R078l4018
$$ 897005 644251 409775 168236 12606 -25020 -56328 -49102 -15154 50335 59413 25395
22535B5395J5436J5049N6337J34284n0226M155P9171k4619j17951R5798K4632
$$ 25395 40831 55880 112217 246501 196275 200430 279601 254982 137031 232829 257461
22524B57461k7934P1732O5217J60720n2782k12411M3399K37658M2074l0203J5704
$$ 257461 229527 301259 366476 527196 474414 262003 305402 543060 585134 554931 570635
22513E70635k37777n2381J74512k1735m6468J91585J70377Q0245j4548K27679
$$ 570635 332858 280477 454989 433254 386786 578371 748748 828993 814445 1042124
22503A042124J35233L37076N22488M80836L4012r7061p524K40282J70420j09732
$$ 1042124 1177357 1514433 2036921 2517757 2551769 2454708 2447184 2687466 2857886 2748154
22493B748154m02515n31046m73708j67688q0069l2257j29926l8236N4489K1636
$$ 2748154 2345639 1814593 1340885 1173197 1093128 1060871 930945 892709 947198 968834
22483I68834o0144j3890P7042Q3683K11251j00320k11461j04019J01257J46158
$$ 968834 908690 894800 971842 1055525 1266776 1166456 954995 850976 952233 1098391
22473A098391P8055j0518q4954o241P7126N921R1948J5225K8983J82983K36825
$$ 1098391 1176446 1165928 1080974 1074733 1151859 1157780 1249728 1264953 1293936 1476919 1713744
22462A713744J05441K78636J83081J24943M1134K10335L72313K28690J15788K71491
$$ 1713744 1819185 2097821 2280902 2405845 2446979 2657314 3029627 3258317 3374105 3645596
22452C645596K54824J85423K83294M49874L66422M02942N80749O26079P82837
$$ 3645596 3900420 4085843 4369137 4819011 5185433 5588375 6169124 6795203 7578040
22443G578040O54734J003631J235899J259132J660936K149321K749127L474356
$$ 7578040 8232774 9236405 10472304 11731436 13392372 15541693 18290820 21765176
22435B1765176M387000N612188P254143J0428965J6474404K6972683M4984545
$$ 21765176 26152176 31764364 39018507 49447472 65921876 92894559 137879104
22428A37879104O7804008P9682518O4592832K8437769p33647k183332J1578034
$$ 137879104 205683112 285365630 349958462 378396231 377662584 375479252 387057286
22421C87057286Q432508k2567797n9632655p6927759o9540174n0538415l3425044
$$ 387057286 395489794 372921997 313289342 236361583 166821409 116282994 82857950
22414H2857950k2280371j5203557j0405635p346962n148626l923227l167161k504758
$$ 82857950 60577579 45374022 34968387 27621425 22472799 18549572 15382411 12877653
22406A2877653j936882j430946j153997j033537q32830p63889o26664l81141m23661
$$ 12877653 10940771 9509825 8355828 7322291 6489461 5725572 5098908 4717767 4294106
22397D294106m70528m46494k95121k31771k60320k18073j91333K3244n891q3190
$$ 4294106 3823578 3377084 3081963 2850192 2589872 2371799 2180466 2203710 2197819 2114629
22387B114629J403p3197p3606j87358p4049p9005j27245J61609q2642m1601K9901
$$ 2114629 2116032 2042835 1969229 1781871 1707822 1628817 1501572 1663181 1580539 1538938 1568839
22376A568839r6179k36392p5432J16571k8573j95397L1093m9302j72888j13145
$$ 1568839 1472660 1236268 1160836 1277407 1248834 1053437 1084530 1035228 862340 749195
22366G49195m2949J66416K3866p3501J0079P2405M7000K4415n4137P0585o0158
$$ 749195 706246 872662 896528 823027 833106 905511 952511 976926 922789 993374 933216
22355I33216j51758O9105M91965N92588M81671k0176L5266Q2633J41272L3434
$$ 933216 781458 850563 1342528 1935116 2416787 2396611 2431877 2514510 2655782 2689216
22345B689216J04885k61671n73783m86165l24102l07217O709j54706r8864p4328
$$ 2689216 2794101 2532430 1958647 1472482 1148380 841163 847872 693166 594302 519974
22335E19974N3195o4994O1756L3005j54786o2647J45861N9113j19484o5568q6358
$$ 519974 573169 508175 569931 602936 448150 385503 531364 590477 470993 405425 319067
22324C19067j09076O4077K8517l0191p4748r4637j3292Q297J19472j8745n1544
$$ 319067 209991 274068 302585 272394 197646 103009 89717 98014 217486 198741 147197
22313A47197n3338L7169K42003J82168K889O738j16393p2787P1373k0422L511
$$ 147197 93859 131028 373031 555199 558088 564826 448433 375646 447019 426597 430108
22302D30108L8620k0731r8142j3504K8387J58148k67781j83325j67416M7029J63003
$$ 430108 468728 447997 349855 336351 364738 522886 255105 71780 -95636 -48607 114396
22291A14396Q9750j966j81032k0732O5543l1828J0818P1271m4584Q0172n9283
$$ 114396 204146 202180 21148 416 65959 34131 44949 116220 71636 151808 92525
22280I2525j73729p2704J44757l2969j18437M408J45284J73271o8076n4945K9352
$$ 92525 -81204 -153908 -9151 -42120 -160557 -156149 -10865 162406 94330 39385 68737
22269F8737P8579L3106J67814j47855L7367j9623p9152m9522K2058l5621J8854
$$ 68737 147316 180422 348236 200381 237748 218125 138973 89451 111509 75888 94742
22258I4742k86400j76957m4960m387j63762J09301L8668L1873n0877O6588J27868
$$ 94742 -191658 -368615 -413575 -417962 -581724 -472423 -433755 -401882 -452759 -386171 -258303
22247b58303J55004K04336R900q9176l4604L8073O2999Q9566R0010Q4387O0714
$$ -258303 -103299 101037 110937 21761 -12843 25230 88229 177795 267805 352192 412906
22236D12906l6221j00710m9965k3248K8167L563J69401Q6646m8391j78252j40981
$$ 412906 376685 275975 226010 202762 230929 234492 403893 490539 442148 263896 122915
22225A22915L3347N5088j23327Q932R3814L7426P8916j01619q0824L0704j00170
$$ 122915 156262 211350 88023 96955 190769 228195 307111 205492 124668 155372 55202
22214E5202j73931L9975R6811N7036j18396J9528N9129J6481L6419J04105L3990
$$ 55202 -118729 -78754 18057 75093 -43303 -23775 35354 51835 88254 192359 226349
22203B26349k9079p1899j71141j26784Q2171j14103j23649P6764N2732j1378N4342
$$ 226349 197270 125371 -45770 -172554 -90383 -204486 -328135 -251371 -198639 -210017 -155675
22192a55675J65089m0428j53157L1447J41231l5003p6532l6927J67207k9504n3119
$$ -155675 9414 -31014 -184171 -152724 -11493 -46496 -123028 -159955 7252 -22252 -75371
22181g5371J657L5166n9299j19986J35454J50547M8919p7979J54656P597J563
$$ -75371 -73714 -38548 -97847 -217833 -82379 68168 117087 39108 193764 201361 202924
22170B02924n9647p1318j17904J39112N4406j09934j54517Q7440Q5410K8598q2229
$$ 202924 143277 71959 -45945 93167 147573 37639 -116878 -29438 55972 84570 2341
22159B341L8021J14064j21297m8578r460K06874J0160m3308K8608j40267j0717
$$ 2341 40362 154426 33129 -15449 -24909 181965 192125 148817 177425 37158 26441
22148B6441o7765L9865R4345O4429k8468N6563Q2647j11537M2331j43933j46577
$$ 26441 -41324 -1459 92886 157315 128847 185410 268057 156520 198851 54918 -91659
22137i1659r0288J28010J60597o9318l6517o249r7672j24425K460K40072J05661
$$ -91659 -181947 -53937 106660 37342 825 -5424 -103096 -227521 -225061 15011 120672
22126A20672j19338j73297k6058P1027O9524q2830P9871L1347J43817m3864L1558
$$ 120672 1334 -171963 -198021 -126994 -57470 -140300 -60429 -29082 114735 70871 102429
22115A02429j9731j8222j6298o4238l3435J09341l6229N561m4266J8226p2378
$$ 102429 82698 64476 48178 -16060 -49495 59846 23617 29178 -15088 3138 -69240
22104f9240l8688J947J09018J69078j57287J43735K19270j79009j98030M6531
$$ -69240 -107928 -105981 3037 172115 14828 158563 377833 198824 794 47325
22094D7325J86164K6288j29283q2398j02116J53838n7892j0631m3076j60909J2519
$$ 47325 233489 259777 130494 48096 -54020 99818 41926 31295 -11781 -172690 -160171
22083a60171k7566M223J4224r5447K02258J47655o3065j04624r4447O8191k33376
$$ -160171 -187737 -183514 -169290 -264737 -62479 85176 22111 -82513 -176960 -108769 -342145
22072c42145j35285K0837O2218J27988N0754J91744K3282M1425l2800j83996j33931
$$ -342145 -477430 -456593 -394375 -266387 -215633 -23889 -607 40818 8018 -175978 -309909
22061c09909m2015R3569J13455Q2147K389J83032q4442k03329q1137R3227N4434
$$ -309909 -351924 -258355 -144900 -62753 -60364 122668 38226 -165103 -246240 -153013 -98579
22050i8579N1048m4816N7727J6361p2037q6847J11610K08211N7793K6952R762
$$ -98579 -47531 -92347 -34620 -18259 -90296 -177143 -65533 142678 200471 227423 237185
22039B37185O7693o0575j66494n8520J04139J32928J41219J2386j13133P6256
$$ 237185 304878 244303 77809 19289 123428 256356 397575 409961 296828 373084
22029C73084L7079n048j26689p8046p0417j14521n3580L6728n7913j14749K2960
$$ 373084 410163 405115 278426 200380 129963 15442 -38138 -1410 -59323 -174072 -151112
22018a51112R309J10135o3232J7385r7897p3990J53246J96659J91256K2835j49179
$$ -151112 -141803 -31668 -94900 -77515 -175412 -249402 -96156 100503 291759 314594 165415
22007A65415k60415m2902L1294o7183r9664N9563r0319o3346L00981K46791j43590
$$ 165415 -95000 -137902 -106608 -173791 -273455 -213892 -304211 -367557 -66576 180215 36625
21996C6625n4574p3906m0223j33712K6057J24822O9962l7939R0612M3343j93259
$$ 36625 -17949 -91855 -132078 -265790 -239733 -114911 -44949 -82888 7724 51067 -142192
21985a42192j4187J58418J84287p6390j13411m6130J90329P0151J74655j17148
$$ -142192 -156379 2039 186326 109936 -3475 -49605 140724 210875 385530 268382
21975B68382j95146p9854l5636j27313m3780P2075j840O6356J90677N4354p3653
$$ 268382 73236 -6618 -42254 -169567 -213347 -141272 -143112 -76756 113921 168275 94622
21964I4622q103j48818j22619M7786N069O0313k2190m6497j07370K0990J15795
$$ 94622 86519 -62299 -184918 -137132 -132063 -71750 -93940 -140437 -247807 -226817 -111022
21953a11022R7575j7778K0230N3250K7425K2566o1192m0036r8583m6174n4365
$$ -111022 -13447 -31225 -10995 42255 69680 92246 31054 -8982 -107565 -153739 -208104
21942b08104M882J35816m2544n8064J46264M5161r0689p1214J36823j6367j36084
$$ -208104 -203222 -67406 -109950 -168014 -21750 23411 -67278 -138492 -1669 -18036 -154120
21931a54120l8308q4084J61421L0705P1934J06431q5127l4704N2629N1332o1178
$$ -154120 -192428 -276512 -115091 -84386 -12452 93979 8852 -25852 26777 78109 16931
21920A6931P698l4529J9506N1086J824j46140j09888O2497p3505O9163M3992J36890
$$ 16931 24629 -9900 9606 60692 62516 -83624 -193512 -131015 -204520 -135357 -91365 45525
21908D5525K7989k7791P3592j837j56045p3760N3232K24525L2071m6390m6867
$$ 45525 73514 45723 119315 117478 -38567 -112327 -59095 165430 197501 151111 104244
21897A04244J6547l207L7121O5352j36976r9911q621m7681J4887J60Q0808j04615
$$ 104244 120791 117584 154705 220057 83081 -16830 -25451 -73132 -58245 -58085 22723 -81892
21885h1892P4102P6903j28142n0700O6494m6430K1717m537m2340M7024N3935J47173
$$ -81892 -7790 69113 -59029 -109729 -43235 -89665 -67948 -72485 -114825 -67801 -13866 133307
21873A33307K5540O702o769r4583k1258j3312n8569R1031J42061K27473K21440
$$ 133307 158847 165549 158780 64197 42939 29627 -28942 62089 204150 431623 653063
21862F53063K62919L18076L07564L98255J03160R4752l2993J81393R4247j60530
$$ 653063 915982 1234058 1541622 1939877 2043037 2137789 2104796 2286189 2380436 2219906
21852B219906m85104m52554m12017l59420k43925k06778j96154j16342J36670
$$ 2219906 1734802 1282248 870231 510811 266886 60108 -136046 -252388 -115718
21843a15718O8880R2503k03251o4585L9268K9425p2012J05978K89751J18183p8778
$$ -115718 -46838 45665 -157586 -222171 -182903 -153478 -225490 -119512 170239 288422 209644
21832B09644q024j7385j40324k17971j00979R4807J23881J40187J03231O0834
$$ 209644 201620 184235 43911 -174060 -275039 -180232 -56351 83836 187067 247901
21822B47901j50358k8448l8674l567n5098q2556n1792M3701J19413O2167j03152
$$ 247901 97543 69095 30421 26854 -28244 -110800 -162592 -118891 522 62689 -40463
21811d0463j21905j06859O1775l8329J74948Q5535L2614j302M354m3547q1758
$$ -40463 -162368 -269227 -207452 -245781 -70833 14702 47316 46014 50368 6821 -74937
21800g4937m7496j78919L3753o930J6616J25718O8929j55340K1251K568K7840
$$ -74937 -122433 -301352 -267599 -274529 -257913 -132195 -63266 -218606 -197355 -194787 -166947
21789a66947J44949J82146l3627k12126k6782J04984R4770J03786M9585q2016
$$ -166947 -21998 160148 126521 -85605 -112387 -7403 87367 191153 240738 158722
21779A58722j10515p1187P1604J903p4063j6128N1798J04838q7619J2213j11915
$$ 158722 48207 -22980 48624 50527 -23536 -39664 12134 116972 29353 41566 -70349
21768g0349j22472K3530J04738p2989k4174j09830k3760K52553L7984O3215k61925
$$ -70349 -192821 -169291 -64553 -137542 -161716 -271546 -295306 -42753 -4769 58446 -203479
21757b03479j24302J02110K8383J28011M8573k8047n0743r7933L9017R4699l6466
$$ -203479 -327781 -225671 -197288 -69277 -20704 -48751 -99494 -197427 -158410 -63711 -100177
21746a00177Q7947J14724p1239j02114Q8970K9368R2026j9255o1367j5444k2730
$$ -100177 -12230 102494 31255 -70859 18111 47479 139505 120250 58883 43439 20709
21735B0709k4955n0700J46905n7252m09239n6094K81720J94142Q122R8508j34871
$$ 20709 -4246 -54946 91959 34707 -374532 -430626 -148906 45236 53358 151866 16995
21724A6995k5461j73j00675k9058j9696r0491L9770L0974J67727L1498K3227m2506
$$ 16995 -8466 -8639 -109314 -138372 -158068 -248559 -208789 -177815 -10088 21410 44637 2131
21712B131m4352q4487Q2182j07770j48527N3911l9942k3210J89062J96530J2642
$$ 2131 -42221 -126708 -44526 -152296 -300823 -246912 -286854 -310064 -121002 75528 88170
21701H8170j37156p031n2587j36241J22625k9972j2446N0081J10630P7264j00571
$$ 88170 -48986 -56017 -108604 -244845 -122220 -152192 -164638 -114557 -3927 73337 -27234
21690b7234j49471l6822l0841n6511J5627J7356J49744J27726O620k8470r299
$$ -27234 -176705 -213527 -244368 -300879 -285252 -267896 -118152 9574 16194 -12276 -21575
21679b1575j4595r4563j1882O3187K7975N5134j1508m0988m5526O6362J01482
$$ -21575 -36170 -130733 -142615 -79428 -51453 3681 -7827 -48815 -94341 -27979 73503
21668G3503o2708l3152J5819k2052p3534M917N233M459J1821n5663p040M501o23
$$ 73503 10795 -22357 -6538 -28590 -102124 -97207 -91974 -87515 -75694 -131357 -138397 -133896 -134519
21655a34519j2437O1960P9125j58260r3421J3469J12792k9881j23137Q3044J77904
$$ -134519 -146956 -84996 -5871 -164131 -257552 -244083 -131291 -161172 -284309 -201265 -23361
21644b3361K29931K7389k05080J2202J27726n9276n3106p1507r9591J56863j7826
$$ -23361 206570 233959 28879 41081 168807 109531 56425 -15082 -114673 42190 24364
21633B4364r9513q76K5440N5944Q4883J21315K5851q2511P0150O9207k61450j08496
$$ 24364 -75149 -76025 -50585 5359 90242 211557 237408 154897 225047 294254 32804 -75692
21621g5692m9552p0370L5199M4945P6739o004K0896l4118l5677k7402k3269j2908
$$ -75692 -125244 -195614 -160415 -115470 -38731 -44735 -23839 -57957 -93634 -121036 -144305 -157213
21609a57213j43692J23012Q0821n4369O8966K06742r927l0099k11K4100m8650
$$ -157213 -300905 -177893 -97072 -151441 -82475 124267 114340 84241 84030 108130 59480
21598E9480k6864r1501J071M099J80156J57862j47881r7980j43252j82019p6230
$$ 59480 32616 -58885 -57814 -53715 126441 284303 136422 38442 -104810 -286829 -363059
21587c63059K28388J43059j83982J15616J42659K2534q5351k9531k2995N9024
$$ -363059 -134671 8388 -175594 -59978 82681 105215 19864 -9667 -32662 26362
21577B6362m2074r5090J1628j8939n6757J13619M8826l4281J7133p6862j09024
$$ 26362 -15712 -110802 -99174 -118113 -174870 -61251 -12425 -46706 -29573 -106435 -215459
21566b15459L9128N4275K19326Q3027K6705M0721j50611k20065m2133P2563J49756
$$ -215459 -176331 -122056 97270 180297 207002 247723 97112 -122953 -165086 -92523 57233
21555E7233q3338J68026R9933j55419k9675j22498n043J53027l6613j814L2310
$$ 57233 -26105 141921 241854 86435 56760 -65738 -70781 82246 45633 43819 76129
21544G6129j15522j54672j535O3327J10732m3091q7745q151J23446l440q7206
$$ 76129 -39393 -194065 -195600 -132273 -21541 -64632 -152377 -160528 -37082 -40522 -127728
21533a27728q5939R016J0652j3453J12367K11240l9855o1075k39511J19932l379
$$ -127728 -213667 -204651 -193999 -207452 -95085 116155 76300 15225 -224286 -104354 -107733
21522a07733k1653o263o3376J41803m5615j5113p5461J01463o9443j2288R3918
$$ -107733 -129386 -135649 -199025 -57222 -102837 -117950 -193411 -91948 -161391 -173679 -79761
21511g9761j14756p6762K0981J31261J06878p5977m667R5846j30426j45105M913
$$ -79761 -194517 -271279 -250298 -119037 -12159 -88136 -92803 3043 -127383 -272488 -267575
21500b67575o6444j80719j37983J35063J19696J68704J83425L0143k0044j95732
$$ -267575 -334019 -514738 -652721 -517658 -397962 -229258 -45833 -15690 -35734 -231466
21490b31466j56300L8842L7126K6025o6697R4380q0269K6804Q6972R1652M7633
$$ -231466 -387766 -348924 -311798 -285773 -352470 -258090 -338359 -311555 -224583 -132931 -85298
21479h5298O942O6867P7495J61558j09142j26567q4024P8120K23630j2052n1153
$$ -85298 -78356 -11489 66006 227564 118422 -8145 -92169 -14049 209581 197529 146376
21468A46376n9366j89132j06885J41120j72j814j51583K3780P0431K177M8255
$$ 146376 87010 -102122 -209007 -67887 -68059 -69873 -221456 -197676 -127245 -125068 -76813
21457g6813k1506N7624j0109k45133r526j4500j79952J26454K23049N0074j63055
$$ -76813 -98319 -40695 -50804 -295937 -305463 -319963 -499915 -373461 -150412 -100338 -263393
21446b63393l3354r1240l1220J52242J80778j25196j18281Q6671K17884J17973
$$ -263393 -296747 -387987 -419207 -266965 -86187 -211383 -329664 -242993 -25109 92864
21436I2864R1409R4676l9600q0037q7868j78915O0552J0748J83406R1945j42693
$$ 92864 184273 278949 239349 159312 71444 -107471 -46919 -36171 147235 239180 96487
21425I6487o9368q8985j94489O6976J50550P7702n3858j06511R3375M5508q8740
$$ 96487 27119 -61866 -256355 -189379 -38829 38873 -14985 -121496 -28121 17387 -71353
21414g1353J03025N9653J84884m7474j54588l1395K924j46482m3016R9396j6137
$$ -71353 31672 91325 276209 228735 74147 42752 45676 -100806 -143822 -44426 -60563
21403f0563j6957m0686J920N9021l4544J476k6930M0214J87300r6923P6129q6761
$$ -60563 -77520 -118206 -116286 -57265 -91809 -90333 -117263 -77049 110251 13328 89457 2696
21391B696m1503o2054J12032P9415R1321K11084j09746j91457j32016m5959q7400
$$ 2696 -38807 -100861 11171 90586 181907 392991 283245 91788 -40228 -86187 -173587
21380a73587J67688r836j32255R0173P9443O5577k1252l1125j05780j8669j16577
$$ -173587 -5899 -15735 -147990 -57817 21626 87203 65951 34826 -70954 -89623 -206200
21369b06200O5485N9101j7389Q8589R6088j32053r6604k3131K32961J9694r0599
$$ -206200 -140715 -81614 -99003 -10414 85674 -46379 -142983 -166114 66847 86541 -4058
21358d058r1695K13092o8341P789K9006p5679j15875o3771N4730o9556Q0483k5252
$$ -4058 -95753 117339 48998 56787 85793 10114 -105761 -169532 -114802 -184358 -103875 -129127
21346a29127j4431r338q5351k3100K18294J58757k2126K2348J0205N8263J8113
$$ -129127 -143558 -152896 -238247 -261347 -43053 115704 93578 115926 126131 184394 202507
21335B02507n513j05793j17934j16035r3308j0734J5934J21807j7859o9558P68
$$ 202507 196994 91201 -26733 -142768 -236076 -246810 -230876 -109069 -126928 -196486 -195718
21324a95718K1597M8427m8526l5260j4238J30287M3193K0881j40292l0251L5254
$$ -195718 -174121 -125694 -174220 -209480 -223718 -93431 -50238 -29357 -169649 -199900 -164646
21313a64646N5516J23073J21017o4646o6162j15417o6303J89873N7336L6500n9243
$$ -164646 -109130 13943 134960 70314 4152 -111265 -177568 12305 69641 106141 46898
21302D6898j32746R4960p4234r1475j26505K864o617J132n335J03304j8066j8705
$$ 46898 -85848 9112 -65122 -156597 -283102 -280238 -286855 -285723 -291058 -187754 -205820 -224525
21290b24525n8665O2928N781J3104R013J65512m5418n6346p8193L0521P7456j00954
$$ -224525 -283190 -220262 -214481 -201377 -192364 -26852 -72270 -128616 -206809 -176288 -98832 -199786
21278a99786o7223K12455Q4983k51975j36328P7695q5660J57550P0640J39218
$$ -199786 -267009 -54554 30429 -221546 -357874 -280179 -365839 -208289 -137649 1569
21268A569J21582M1530j49342r4367j6993J95970J4575k39750N0264M3690J64039
$$ 1569 123151 164681 15339 -79028 -96021 99949 114524 -125226 -74962 -31272 132767
21257A32767J05686n6942J07653n6831k41984l6199J1841o3688N2621J3325l049
$$ 132767 238453 181511 289164 232333 -9651 -45850 -34009 -97697 -45076 -31751 -34800
21246c4800P9094q6644j17315j1422Q1040J3097l3481Q1720O4300J3672N5196
$$ -34800 44294 -42350 -159665 -171087 -90047 -76950 -110431 -28711 35589 49261 104457
21235A04457j02030M7136o2512J35347P3611Q5101O5020l4202k01573j71345k2731
$$ 104457 2427 49563 -12949 122398 196009 281110 346130 311928 110355 -60990 -83721
21224h3721M7043o1634P3186K08957M4640j05220k25283P2459K756j55416M7789
$$ -83721 -36678 -98312 -25126 183831 228471 123251 -102032 -29573 -26817 -182233 -134444
21213a34444J73935J67810J5882l983j19404k03952k40407J4931J14963P9845
$$ -134444 39491 207301 223183 219200 99796 -104156 -344563 -329632 -214669 -134824
21203a34824P524j8466m577o8240j58697Q8940L6594j24927p9121L2874N5040
$$ -134824 -127300 -145766 -150343 -218583 -377280 -288340 -251746 -376673 -455794 -422920 -367880
21192c67880J23891N102m0972J51304N8812n1732L5988q9183r2726K94821O2007
$$ -367880 -243989 -238887 -279859 -128555 -69743 -121475 -85487 -174670 -267396 27425 89432
21181H9432j03310J4834J58110r3446R200o9581L1324L9857l2821l8615R7733
$$ 89432 -13878 956 159066 65620 74820 5239 36563 76420 43599 4984 102717
21170A02717o7315r2774j08964j69311j25523J34563K51986m073R7086j28203
$$ 102717 35402 -57372 -166336 -335647 -461170 -326607 -74621 -78694 18392 -109811
21160a09811k0267m1964K6309l4895j31025L0450R1716j27118l6096J50961J17993
$$ -109811 -130078 -172042 -145733 -180628 -311653 -281203 -189487 -316605 -352701 -201740 -83747
21149h3747o5433M3206j54n6569P5338Q8951L2451K4073o8653j69672o8195J22093
$$ -83747 -149180 -105974 -106128 -162697 -87359 1592 34043 58116 -10537 -180209 -248404 -126311
21137a26311p9786J1300J4289K081m0279J86247j2575o157j2991n106J01295Q3516
$$ -126311 -206097 -194797 -180508 -178427 -218706 -32459 -45034 -51191 -64182 -69288 32007 115523
21125A15523p2690j2520n9728N2473R2037K1113J57462p8842J28615k8617j07110
$$ 115523 42833 30313 -29415 23058 115095 136208 293670 214828 343443 314826 207716
21114B07716k6189p3063o6843k62578j33801Q0261K61535j3169o0299K6077N119
$$ 207716 181527 108464 41621 -220957 -354758 -274497 -12962 -26131 -86430 -60353 -55234
21103e5234L1555J22226K6354m2050N1851n1234j39874j8766J44926R3364k23465
$$ -55234 -23679 98547 124901 82851 134702 83468 -56406 -75172 69754 163118 -60347
21092f0347K635J70985m9207m9341l3497K4602K4288K0047k3621o0887P6213O5818
$$ -60347 -57712 113273 64066 14725 -18772 5830 30118 50165 26544 -34343 41870 107688
21080A07688n3094O1887m0465R7643J5179k59628p2748L1404J17537R7841L1432
$$ 107688 54594 116481 76016 173659 188838 -70790 -143538 -112134 5403 103244 134676
21069A34676j18677j01717m6291l9276p6366L1677M4695M8369k9843j9981k8391
$$ 134676 15999 -85718 -132009 -171285 -247651 -215974 -171279 -122910 -152753 -172734 -201125
21058b01125p830L8799L5537j39623J2306Q9279M172m3538n9165J43425O7344
$$ -201125 -208955 -170156 -134619 -274242 -261936 -172657 -168485 -212023 -271188 -127763 -60419
21047f0419R172N956n1213r2753P185L3938N2973N5435Q7193n2016p3564J06317
$$ -60419 -51247 -45291 -96504 -189257 -182072 -148134 -95161 -39726 47467 -4549 -78113 28204
21035B8204J44590k02226p1188j15655k5888R181K09605O2316j57602K4322O5353
$$ 28204 172794 -29432 -100620 -216275 -242163 -232982 -23377 38939 -118663 -94341 -28988
21024b8988J52766Q0382k37734k5365R8172m2872j18936j356R7182p0555L4236
$$ -28988 123778 204160 -33574 -58939 39233 -3639 -122575 -123931 -26749 -97304 -63068
21013f3068J4449j06051o762Q6482M799K7259J2866p3516j14328l6500o020n1289
$$ -63068 -48619 -154670 -161432 -74950 -70151 -42892 -30026 -103542 -217870 -254370 -260390 -311679
21001c11679R9534K28869J87128N7309o6559m5185j04440r9005K5581j6878Q6609
$$ -311679 -212145 16724 203852 261161 194602 149417 44977 -54028 -28447 -45325 41284
20990D1284L1696j56523Q9793J49962K15990n9996j7501j50756l1710n5270l2348
$$ 41284 72980 -83543 6250 156212 372202 312206 294705 143949 112239 56969 24621
20979B4621J3585K09011L8926K81866J68176j91034k36442r2055n694Q2839R3450
$$ 24621 38206 247217 286143 568009 736185 545151 308709 216654 210960 293799 387249
20968C87249R2610Q2924J03414q3651j07508o5855j7996j04964p6990p8350r137
$$ 387249 479859 562783 666197 582546 475038 409183 391187 286223 209233 130883 121746
20957A21746k9112o7285K6439K5126K3995q3243M9383J52755J52093J71876j1501
$$ 121746 92634 25349 51788 76914 100909 17666 67049 219804 371897 543773 532272
20946E32272M7305N8198N3894o7307o6147o0376J9690l8693K8108l8126J3858
$$ 532272 579577 637775 691669 624362 558215 497839 517529 478836 506944 468818 482676
20935D82676J24545N1161l3288j54461l9676l5250k0046j78591r6333j42937P4324
$$ 482676 607221 658382 625094 470633 430957 395707 375661 197070 100737 -42200 32124
20924C2124K19401J44548k6663J34487k0250P7055J95165J02168P6735J00233
$$ 32124 251525 396073 369410 503897 483647 560702 755867 858035 934770 1035003
20914A035003J18570O4452j94872j6248j43565j97408j09713l861M7453L8806
$$ 1035003 1153573 1218025 1023153 1006905 863340 665932 556219 552358 599811 638617
20904F38617P5466L03643J27216J8944j36245j2952N986K7954p7861M295l7313
$$ 638617 714083 1017726 1144942 1163886 1027641 1014689 1020675 1048629 970768 975063 937750
20893I37750j91816k17938k42461j76565j92520k051J90120l4706o1205J56157
$$ 937750 745934 527996 285535 108970 -83550 -85601 104519 69813 8608 164765
20883A64765J68705Q6403n0591j66171j30227k11678j82362J05942K01253K18563
$$ 164765 333470 419873 369282 203111 72884 -138794 -321156 -215214 -13961 204602
20873B04602q5432j73506j11777R4397J24433j4217K4686J1571Q4860q2251M610
$$ 204602 119170 -54336 -166113 -71716 52717 38500 63186 74757 159617 77366 81976
20862H1976r114L2124J10071K2808m3834l3555r1394m3792o6403j24452p9992
$$ 81976 72862 104986 215057 237865 194031 160476 69082 25290 -41113 -165565 -245557
20851b45557m3677K13326K17609Q8188j32095j32775J03418o5332q2979l1041
$$ -245557 -289234 -75908 141701 229889 97794 -34981 68437 3105 -79874 -110915
20841a10915m5347j32900J3249J14J24637R2200N0417m5601k6252l3759J58962
$$ -110915 -156262 -289162 -275913 -275799 -151162 -58962 -8545 -54146 -80398 -114157 44805
20830D4805K05238l8402k76828j20673O4174J35632n3187J6066l4945l1425j64308
$$ 44805 250043 211641 -65187 -185860 -121686 13946 -39241 -23175 -58120 -89545 -253853
20819b53853N2926K32068J56984M898n9150N1391O2112j76864K5854M8536K1447
$$ -253853 -200927 31141 188125 193023 133873 185264 247376 70512 96366 144902 166349
20808A66349l9139J30696l6073l0891J45010k60129j53658M8086J86801m7635
$$ 166349 127210 257906 221833 190942 335952 75823 -77835 -29749 157052 109417
20798A09417j8126l8764P2170K0115j71636j40888q1440L40538J99858J92603
$$ 109417 91291 52527 124697 144812 -26824 -167712 -249152 91386 291244 483847
20788D83847q3188l1114k24326j89247p3140m3310J34582J02785J04053L0606
$$ 483847 400659 369545 145219 -44028 -117168 -160478 -25896 76889 180942 211548
20778B11548o063n3192l7469q771j22850P7142k4300K1326q3743J0461K2167q2063
$$ 211548 205485 152293 114824 106053 -16797 60345 36045 57371 -26372 -15911 6256 -75807
20766g5807K00405N0900j37540P5324R836l3513j17978Q5084K5921L078j18946
$$ -75807 124598 175498 37958 113282 123118 89605 -28373 56711 82632 85710 -33236
20755c3236J0113J4586j67500R250J06775K3114k8817Q1723R0627O6666q3327
$$ -33236 -23123 -8537 -176037 -166787 -60012 -36898 -65715 16008 106635 173301 89974
20744H9974L0440j18590o238M3442p1352l902Q3964O1341j74773m9357j6166r8479
$$ 89974 120414 1824 -4414 39028 -32324 -36226 47738 109079 -65694 -115051 -131217 -229696
20732b29696l2681J31424J42083o9033r2944R6132O3733q2597j39631l5119R7010
$$ -229696 -262377 -130953 11130 -57903 -150847 -54715 9018 -73579 -213210 -248329 -151319
20721a51319O096L8269M0329j00147m6335J05097J03330P0406P3681R384j93349
$$ -151319 -145223 -106954 -66625 -166772 -213107 -108010 -4680 65726 139407 148791 -44558
20710d4558n4818J08786J79099M0595N1986q1965J6606j6171k77229j9325P5323
$$ -44558 -99376 9410 188509 229104 281090 199125 215731 199560 -77669 -96994 -21671
20699b1671J39201o7897k65575Q1225R8441M3508k8661L1066m9940J13048M0204
$$ -21671 117530 49633 -215942 -134717 -36276 7232 -21429 9637 -40303 72745 112949
20688A12949N0851j03906j52991j24051R2119o2465m3961j16361j60427J39492
$$ 112949 163800 59894 -93097 -217148 -125029 -187494 -231455 -347816 -508243 -368751
20678c68751K34019J06343m3718N8460o2417j34040o2799J17697K22908P3845
$$ -368751 -134732 -28389 -72107 -13647 -76064 -210104 -272903 -155206 67702 141547
20668A41547N6192P5974J8417q2970r2929j46077j579j15362j13642j02788K16501
$$ 141547 197739 273713 292130 209160 116231 -29846 -31425 -146787 -260429 -363217 -146716
20657a46716K03597J96995q8541J7243R493j10804K5431j14879m9145Q0602k2424
$$ -146716 56881 253876 165335 182578 192071 81267 106698 -8181 -57326 23276 852
20646H52N3044K3314j85702P0546J95366J67551J92260p0613j56135n047j29541
$$ 852 53896 77210 -108492 -37946 157420 324971 517231 446618 290483 285436 155895
20635A55895p5054J29709P5776K8950L1865r3239P4208m33P9656p0159j85692
$$ 155895 80841 210550 286326 315276 347141 253902 328110 327677 407333 337174 151482
20624A51482j76315J43348M8783J0918m4565L498J69354o578j06996j09270o6030
$$ 151482 -24833 118515 167298 178216 133651 137149 306503 299925 192929 83659 17629
20613A7629N3835Q0403Q5172J02422k0766K4798l2190L419o6029j24391o1989
$$ 17629 71464 151867 237039 339461 318695 343493 311303 314722 248693 124302 62313
20602F2313K773o0344J0656L6017J25134J18986m2472j9166N8418j75294q9348
$$ 62313 65086 4742 15398 51415 176549 295535 253063 233897 292315 117021 27673
20591B7673l420J38280j153n5349k1458J76998N3100J56460l6920j60018J28446
$$ 27673 24253 162533 161380 106031 84573 261571 314671 471131 434211 274193 402639
20580D02639j44641n1098j50586j85916o7796l8741Q3939Q9646p776K7289N3054
$$ 402639 257998 206900 56314 -129602 -197398 -236139 -152200 -62554 -70330 -43041 10013
20569A0013n2344l8298m012J34289j0487L4055m0789J7431R8871L6483j08488
$$ 10013 -42331 -80629 -84641 49648 39161 73216 32427 49858 148729 185212 76724
20558G6724J31652q2285j93243M7974J41602O3451K6872j3254J20305o3041j98750
$$ 76724 208376 126091 -67152 -19178 122424 185875 212747 199493 319798 256757 58007
20547E8007Q8485K77339K11140k1910j46227Q0909N747k74446j01333p4838m6234
$$ 58007 146492 423831 634971 613061 466834 547743 553490 279044 177711 102873 56639
20536E6639Q7480Q7853N1456O1180q8379P8903J38693M3295j48976j12168J07241
$$ 56639 144119 231972 283428 344608 256229 335132 473825 517120 368144 255976 363217
20525C63217P4384M1011l074o7113n0406J27125K9157j40974k03366J9508J5703
$$ 363217 437601 478612 475538 408425 358019 485144 514301 373327 169961 189469 205172
20514B05172O3382j022J57387O6329L387J68598M9749m5100L9990j30667j92543
$$ 205172 268554 267532 424919 491248 494635 663233 712982 667882 707872 577205 384662
20503C84662M8478J23195k5446q211j07577n3585J70813Q861j05972j8138K65686
$$ 384662 433140 556335 530889 522678 415101 361516 532329 541190 435218 417080 682766
20492F82766J32507j35399j92398j39138m6817K12726P5781O7944j3008o1874
$$ 682766 815273 679874 487476 348338 301521 514247 590028 657972 644964 583090
20482E83090P5184J01833L5338j0169l4815K0210M6986N0763J02468K34251N0842
$$ 583090 658274 760107 795445 785276 750461 770671 817657 868420 970888 1205139 1255981
20471A255981k21242j777j5002j5899Q07J382N0487J24926K5545L3251R0504J37136
$$ 1255981 1034739 1032962 1017960 1002061 1002868 1004250 1054737 1179663 1205208 1238459 1328963 1466099
20459A466099k9536j2737j4614l5609M640R0896j5789J01993K03372K40688K17501
$$ 1466099 1436563 1423826 1409212 1373603 1378243 1469139 1453350 1555343 1758715 1999403 2216904
20448B216904J24337Q4991J84324Q7656o5022M4293L39931L65050J49829K69104
$$ 2216904 2341241 2426232 2610556 2698212 2633190 2677483 3017414 3382464 3532293 3801397
20438C801397K96170L06775K92597L93171K84201J22321J23441L09557K33002
$$ 3801397 4097567 4404342 4696939 5090110 5374311 5496632 5620073 5929630 6162632
20429F162632J73120J13699N07797Q18507Q07567J104083J116856J112760J504344
$$ 6162632 6335752 6449451 6957248 7775755 8583322 9687405 10804261 11917021 13421365
20420A3421365K098493K592753L501634M872716O992419J0121136J4668292K0069504
$$ 13421365 15519858 18112611 21614245 26486961 33479380 43600516 58268808 78338312
20412G8338312K3187284K0051574R642577l708437j3524397j6147945j2660171
$$ 78338312 101525596 121577170 131219747 127511310 113986913 97838968 85178797
20405H5178797o195610J149194Q997374J6103503J8453886J2550811j54732j2929942
$$ 85178797 78983187 80132381 89129755 105233258 123687144 136237955 136083223 123153281
20397A23153281k0580484k1148228j7257197j2566369q877810o056361l679601
$$ 123153281 102572797 81424569 64167372 51601003 42723193 36666832 32987231
20390C2987231j817932m97150Q53976K449980M174654O740110J0638917J6084666
$$ 32987231 31169299 30672149 31526125 33976105 38150759 44890869 55529786 71614452
20382G1614452K1681087K3952088J8556657O116074p064100j5269151j6094141
$$ 71614452 93295539 117247627 135804284 141920358 134856258 119587107 103492966
20375A03492966j1688086m698141K894788J0940626J7246148J8046611J0379558
$$ 103492966 91804880 87106739 90001527 100942153 118188301 136234912 146614470
20368A46614470l167253j5521639k1330819k0427166j5893350j1146554p292406
$$ 146614470 143447217 127925578 106594759 86167593 70274243 59127689 51835283
20361E1835283m043501j381833J215583M043657P879665J3522438J9993175K5220443
$$ 51835283 47791782 46409949 47625532 51669189 59548854 73071292 93064467 118284910
20353A18284910K5290623J8490196Q550052J649228J393427M738118M287511k788343
$$ 118284910 143575533 162065729 170615781 172265009 173658436 178396554 182684065 179895722
20345A79895722j2691707j8935859j7534213j0563503n60227J0232911J7934302
$$ 179895722 167204015 148268156 130733943 120170440 119610213 129843124 147777426
20338A47777426J8556074J1449242J737552l398935k248624J088644q16289r412795
$$ 147777426 166333500 177782742 179520294 176121359 173872735 174961379 174145090 164732295
20330A64732295j9832024k6021122k5682798k1283019j6032102j1577985q492740
$$ 164732295 144900271 118879149 93196351 71913332 55881230 44303245 35810505
20323C5810505o226569m724438l706465k854511k125221j442579j200198j133074
$$ 35810505 29583936 24859498 21153033 18298522 16173301 14730722 13530524 12397450
20315A2397450q03908n94353o64635o57318n83639n44889m93377m33547n89205
$$ 12397450 11593542 10999189 10334554 9677236 9093597 8548708 8055331 7621784 7032579
20306G032579m91977k51377P370j0495k04874j37060j11686l40557k93220j20123
$$ 7032579 6540602 6289225 6296595 6286100 6081226 5944166 5832480 5491923 5198703 5078580
20296E078580m9643j85770l42168l09213l15096j44056N9877k64986k22859j32931
$$ 5078580 5028937 4843167 4500999 4191786 3876690 3732634 3792511 3527525 3304666 3171735
20286C171735j36686j16813m635J06753Q6075q7124m9370j63607r1294o9313k54931
$$ 3171735 3035049 2918236 2913601 3020354 3106429 3019305 2969935 2806328 2715034 2645721 2390790
20275B390790k32540k49294k57572j92700j34659J96253R4707q8689k06905o3013
$$ 2390790 2158250 1908956 1651384 1458684 1324025 1520278 1614985 1526296 1319391 1256378
20265A256378J60388m8990j91735j47933l7761K50608N6376L8594K8768k11445
$$ 1256378 1416766 1367776 1176041 1028108 990347 1240955 1297331 1335925 1364693 1153248
20255A153248j38924j9765J13990K49813K5920l2753J23981j40029q2652j96337
$$ 1153248 1014324 994559 1108549 1358362 1384282 1351529 1475510 1335481 1252829 1056492
20245A056492p2882m8765K22925J43269j39765l9443J34256Q496j54299p0242
$$ 1056492 983610 934845 1157770 1301039 1161274 1121831 1256087 1264583 1110284 1040042
20235A040042j49264j76706m9350Q4560K5731j13133j63752j9642J33368P0746
$$ 1040042 890778 714072 664722 749282 775013 661880 498128 478486 611854 682600
20225F82600M359M5798l2624k71355o9562l7107l1747J09624L56051P3782j24785
$$ 682600 686959 732757 700133 428778 359216 322109 290362 399986 756037 829819 705034
20214G05034k00N7344P7193k11952r0570j90961j82976r5996j01758p0093L57369
$$ 705034 704834 762178 839371 627419 536849 345888 162912 66916 -34842 -104935 252434
20203B52434J77537k00188j31195m643R1153n116j32488k0899o9739J86320m1539
$$ 252434 429971 229783 98588 93945 185098 179982 47494 26595 -43144 143176 101637
20192A01637p12R7564q2786N8275Q6425J6629K0229r0313J57514K67223o4441
$$ 101637 100925 198489 115703 173978 260403 277032 297261 206948 364462 631685 567244
20181E67244p1078r0090j39286J24110J57829L0117j44043j2604j78507k60585
$$ 567244 496166 406076 266790 390900 548729 578846 434803 422199 243692 -16893
20171a6893P5290J01261J7109n2333j39597l2481R8930N5479k8785J04692P0937
$$ -16893 58397 159658 176767 124434 -15163 -47644 51286 106765 77980 182672 253609
20160B53609p1662j24058O6307J88420K3713j49933m7644Q9586Q4780k5506j862
$$ 253609 181947 57889 124196 312616 336329 186396 138752 228338 313118 287612 285750
20149B85750Q1120N6217N0742L1269P4258l5637p3681n3765j67968K7291m9849
$$ 285750 366870 423087 473829 505098 579356 543719 470038 416273 248305 275596 225747
20138B25747k17587j64041M1305J17718P1729J5283Q8340K9340j75524N0345J00642
$$ 225747 8160 -155881 -114576 3142 74871 90154 178494 207834 32310 82655 183297
20127A83297K5249J34877Q2774p656J01775k6803j91708n2093m016J14814K6984
$$ 183297 208546 343423 426197 418541 520316 493513 301805 249712 245696 360510 387494
20116C87494j07860o0849k4863j64636N5310J58817L5706p0338j19846N8168P5707
$$ 387494 279634 218785 193922 29286 84596 243413 279119 208781 88935 147103 222810
20105B22810J605n4279K3721p2922k6545R1249p3401j45614n2244P1878J50869
$$ 222810 224415 170136 193857 120935 94390 185639 112238 -33376 -85620 -13742 137127
20094A37127O2014O8286J20809j36922j08848R8538r6328n594m2953k4582L149
$$ 137127 199141 267427 388236 251314 142466 241004 144676 139082 96129 71547 74696
20083G4696J46690o5932j47827j62001K09464J38800M7357M3949K8775l2917J0964
$$ 74696 221386 155454 7627 -154374 55090 193890 241247 285196 313971 281054 292018
20072B92018M7620j40362j21903J69291R1334n768J38479j94527k48589j10515
$$ 292018 339638 199276 77373 246664 337998 332230 470709 276182 27593 -82922
20062h2922j03480N0759P6871J39056J22001j14407N4916J34575m6548j66268
$$ -82922 -186402 -135643 -58772 80284 202285 87878 142794 277369 230821 64553
20052F4553m2406Q1320K15755Q2315n1835L3328o9143o6295K6263L330j47990
$$ 64553 22147 103467 319222 401537 349702 383030 313887 247592 273855 277185 129195
20041A29195p9811J39426j3203q1045K9931k5061K03181J58165j87052j88773
$$ 129195 49384 188810 175607 94562 124493 99432 302613 460778 273726 84953
20031H4953n9554R3100J3753j15135l6473J11861K2312q1955o6171j5768J04043
$$ 84953 25399 118499 132252 17117 -19356 92505 114817 32862 -33309 -49077 54966
20020E4966Q4006r5989n1487p8493J09468l5952j08970j56981R1959J47635j6073
$$ 54966 138972 42983 -8504 -86997 22471 -13481 -122451 -279432 -187473 -39838 -55911
20009e5911J5339J87387P0353N9875p4005j42382N1291j06752r3373j8597M8402
$$ -55911 -40572 146815 217168 277043 203038 60656 111947 5195 -88178 -106775 -58373
19998e8373J28436l987k71967l6140K1329K27662J08735P4854j08378j79270L7904
$$ -58373 70063 66076 -205891 -242031 -220702 6960 115695 190549 82171 -97099 -59195
19987e9195L0263n8340P3928J762j04998p4822J1057j1298J31270J55191o6251
$$ -59195 -28932 -87272 -13344 -11582 -116580 -191402 -180345 -191643 -60373 94818 28567
19976B8567p3887L3294q4688m961L7371m1698l9794O7040k6742r6703j84021L1875
$$ 28567 -45320 -12026 -96714 -101675 -64304 -106002 -145796 -78756 -105498 -202201 -386222 -354347
19964c54347N7706J8221J49700Q766j8870J5091n4876r7233m8760O5419K22815
$$ -354347 -296641 -278420 -128720 -119954 -138824 -123733 -178609 -275842 -324602 -259183 -36368
19953c6368M3912k5171m9182n6457j6812J599m2054O8303J24355j11780j5020
$$ -36368 7544 -17627 -66809 -123266 -140078 -138479 -180533 -112230 12125 -99655 -114675
19942a14675j06709K1454J37022J93237J48527J27742L3706J18077J38449O1071
$$ -114675 -221384 -199930 -62908 130329 278856 406598 440304 558381 696830 757901
19932G57901o0330N4081j38043l00079R677J18560J78118p4263j03960Q587N8164
$$ 757901 697571 751652 613609 313530 323207 441767 619885 545622 441662 450249 508413
19921E08413R5966j24297j98671o4125p5320L5210r6975r0081o4570m5885L6074
$$ 508413 604379 480082 281411 217286 141966 177176 80201 -9880 -74450 -120335 -84261
19910h4261j7131L2973J32327P8116p6883p1139j9769M9572M3347M3275L9857
$$ -84261 -101392 -68419 63908 142024 65141 -5998 -25767 23805 67152 110427 150284
19899A50284n0242n5752J1820q7076M6170Q385j9078K40878j29230j1286J1549
$$ 150284 100042 44290 56110 -30966 15204 23589 4511 245389 116159 104873 116422
19888A16422k7198J60983K48577K66521R5241j67446M7536n0026j22683j63367
$$ 116422 89224 250207 498784 765305 860546 693100 740636 690610 567927 404560
19878D04560J03880J87633N4342l8360R7749K4936j19905r6683k24521j81822
$$ 404560 508440 696073 750415 712055 809804 834740 714835 618152 393631 211809
19868B11809r2588K8348K722j50757j20770l5925q71K06960J31969j14193o0004
$$ 211809 119221 147569 150291 -466 -121236 -157161 -158032 48928 180897 66704 6700
19857F700O960M0449Q7939j09267j75008l378J40180m1156P9147J76920M584q5856
$$ 6700 13660 54109 142048 32781 -142227 -145605 -5425 -46581 32566 209486 214070 128214
19845A28214Q023J42753J62143J49075j59822l9311L6455R9081O4999J10252N3418
$$ 128214 136237 278990 441133 590208 430386 391075 427530 526611 591610 701862 755280
19834G55280r2573Q004n9163k28069q4332Q500J29690K75994O6549q6615j10430
$$ 755280 662707 670711 611548 383479 299147 307647 437337 713331 779880 693265 582835
19823E82835j04573m0866j25972L6545j16364j45082j03341R1403R3982r7593
$$ 582835 478262 437396 311424 347969 231605 86523 -16818 74585 168567 70974
19813G0974l1952J54883Q840M5098J53165J12127J93751K31415j19169j66240
$$ 70974 39022 193905 202745 247843 401008 513135 706886 938301 819132 652892
19803F52892j98056k38690J03751J19495J21792J2645m9037J57482J40343o4067
$$ 652892 454836 216146 319897 439392 561184 573829 524792 682274 822617 758550
19793G58550j13072o5421j3194l8521j03343j72054r0761P4248K9876L0462J56791
$$ 758550 645478 580057 566863 528342 424999 252945 162184 236432 266308 296770 453561
19782D53561K43173L8820J92160J40962K0917K8624j98553j16888J56785J66854
$$ 453561 696734 735554 927714 1068676 1089593 1118217 919664 802776 959561 1126415
19772A126415r8135o5436n4752N8743j24977O1865J99991M393N0079j14593p2504
$$ 1126415 1028280 962844 908092 966835 841858 903723 1103714 1108107 1158186 1043593 971089
19761I71089k1511Q968p4931j78676n7195q5566k53478j48658K9443Q6066l0604
$$ 971089 949578 958546 883615 704939 647744 562178 308700 160042 189485 275551 244947
19750B44947j10547O5948j1664O7847j44564l9150R792L4511J14010j0877j03480
$$ 244947 134400 200348 188684 256531 111967 72817 82609 117120 231130 220253 116773
19739A16773r3312J42738j8276o3575J10286j63737n9579p7285j03465j10778
$$ 116773 23461 166199 147923 84348 194634 30897 -28682 -105967 -209432 -320210
19729c20210R9099j1463J83988L3500k8238J44711O241r472j28670k00692O5532
$$ -320210 -221111 -232574 -48586 -15086 -43324 101387 107628 98156 -30514 -231206 -165674
19718a65674R1422J09345N5348j55029j76826L5733O9827Q6830j20450n1431O6350
$$ -165674 -74252 35093 90441 -64588 -241414 -205681 -135854 -49024 -169474 -220905 -154555
19707a54555k08760Q5931p405n8549Q746R0202J17030k3482j70195j12944q2446
$$ -154555 -363315 -277384 -284789 -343338 -334592 -244390 -127360 -150842 -321037 -433981 -516427
19696e16427Q6011J91121J83981J09626J379r8398K5638J70100P5319j06413j08806
$$ -516427 -430416 -239295 -55314 54312 55691 -42707 -17069 153031 228350 121937 13131
19685A3131m9095j13018r9510L0210Q1024J06847N2739k5393J6219o5223L189
$$ 13131 -35964 -148982 -248492 -218282 -137258 -30411 22328 -3065 13154 -52069 -48880
19674d8880m060L8448M5201P4832O9339r5454p9892l2625k39116j28191J52909
$$ -48880 -52940 -14492 30709 105541 174880 79426 -466 -33091 -272207 -400398 -247489
19663b47489K98850P1862p6892J72058r405j65456n184J03683j07030L5135J32739
$$ -247489 51361 123223 46331 218389 208984 43528 38344 142027 34997 70132 202871
19652B02871K3464j60420j5690J02454q1947j39615m373j0841J68427J27525L2492
$$ 202871 226335 65915 50225 152679 70732 -68883 -73256 -84097 84330 211855 244347
19641B44347R7602j7232l4753j48318P8403J770M3993R7769q4052j93865K0648
$$ 244347 341949 324717 289964 141646 220049 221819 265812 363581 279529 85664 106312
19630A06312K7816k1789N3376q5752Q5144Q757j00734l4885J23019K9780R6393
$$ 106312 134128 112339 165715 79963 165107 173864 73130 38245 161264 191044 287437
19619B87437K8400j08769j45990l074L0801o7668j6529J21937O7200k37734p5750
$$ 287437 315837 207068 61078 58004 88805 21137 4608 126545 193745 -43989 -119739
19608a19739J15405n4037j0295l5063N0675r6458m0447l8758q2100k27971J77539
$$ -119739 -4334 -58371 -68666 -103729 -53054 -149512 -189959 -228717 -310817 -538788 -361249
19597c61249L35987j9853n0939Q3422k3212o6183q267K40605L4090k9391o5635
$$ -361249 -25262 -45115 -96054 -12632 -35844 -102027 -110294 130311 164401 135010 69375
19586F9375J675P3603k25696R245M378n4710J7353p325R8624j48317J11830J41766
$$ 69375 71050 144653 -81043 -71798 -67420 -122130 -104777 -112102 -13478 -161795 -49965 91801
19574I1801r6601L0376J2319m941N8117J73428J53755p1127p2117K12202r2937
$$ 91801 -4800 25576 37895 32954 91071 264499 418254 347127 275010 487212 394275
19563C94275k5023q3065k09440j67316j63666J52259K21825j79715q2534Q7636
$$ 394275 369252 286187 76747 -90569 -254235 -101976 119849 -59866 -142400 -54764
19553e4764N2743j08851j13883K79206L10993O0716m8120j69694L4943o71j21263
$$ -54764 -2021 -110872 -224755 54451 365444 426160 378040 208346 243289 242618 121355
19542A21355o8909K8267J41261L4865j94417q4260J45110P834n8226n2369j68632
$$ 121355 52446 80713 221974 256839 62422 -21838 123272 131106 72880 20511 -148121
19531a48121K2616K08099j41777j68J07795N1490J4287L3882l9566P6708J75501
$$ -148121 -125505 82594 -59183 -59351 48444 99934 114221 148103 108537 185245 360746
19520C60746M4421q7607r3544k7572j81450m5433J8352J98592J16841p4395o0320
$$ 360746 405167 317560 224016 196444 14994 -30439 -12087 186505 303346 228951 168631
19509A68631J56296Q9408o3911K35304O32k00413l3208K6638j86523k1426K30438
$$ 168631 324927 414335 350424 585728 586360 385947 352739 379377 192854 171428 401866
19498D01866n8862L0632O3323J0956o5434m1100o7059j19373P7293P7782n7252
$$ 401866 343004 373636 436959 447915 382481 341381 274322 154949 232242 310024 252772
19487B52772M5782l8041j1592N2297P4098m4176n0592j03783J31911O2572K6559
$$ 252772 298554 260513 248921 301218 375316 331140 280548 176765 308676 371248 397807
19476C97807J66333r8766k3894J67517P6180n4520q8444O1059o5714n7484L3158
$$ 397807 564140 465374 441480 608997 685177 630657 542213 603272 537558 480074 513232
19465E13232K5413J9274N9248J18256K1097l0516k0360M5049P7689m4852J13226
$$ 513232 538645 557919 617167 735423 756520 726004 705644 750693 828382 783530 896756
19454H96756K18016J65505O9998L4988K11915J88611K55137K54520J91946K35534
$$ 896756 1114772 1280277 1350275 1385263 1597178 1785789 2040926 2295446 2487392 2722926
19444B722926L41943K71540N928K72116M01430L03199K91153L88512N19876N76462
$$ 2722926 3064869 3336409 3342337 3614453 4015883 4319082 4610235 4998747 5518623 6095085
19434F095085N44880O63855Q48257Q92690J356174K002315K860442M117462O532266
$$ 6095085 6639965 7303820 8152077 9044767 10400941 12403256 15263698 19381160 25913426
19425B5913426J0444010J5394242J9385019J9396196J4961201R098576L486023
$$ 25913426 36357436 51751678 71136697 90532893 105494094 114592670 118078693
19418A18078693k392706p900509r595507n289884L300514R461223R121694M575832
$$ 118078693 115685987 107785478 98189971 92900087 96200601 105661824 114783518 119359350
19410A19359350N18468l391113r005907j5258227j9129502j8425742j4555237
$$ 119359350 119877818 116486705 107480798 92222571 73093069 54667327 40112090
19403D0112090j0031442o831315m588222k896794k138179j467825j065437n87513
$$ 40112090 30080648 23249333 18661111 15764317 13626138 12158313 11092876 10505363
19395A0505363l81098l19223j97563k92470j99981p3685K17406J70470K56406
$$ 10505363 10124265 9805042 9607479 9315009 9115028 9041343 9258749 9429219 9685625
19386I685625O76418O11556M56949O63049R24006J344638K331915L246241M772434
$$ 9685625 10362043 10973599 11430548 12093597 13017603 14362241 16694156 19940397 24712831
19377B4712831P165980J1332389J7204330K2306262K2868924J8474072J1418329
$$ 24712831 31878811 43211200 60415530 82721792 105590716 124064788 135483117
19370A35483117L454572n054220j1409549j2287320o142307M081304J1470384
$$ 135483117 138937689 133883469 122473920 110186600 104044293 108125597 119595981
19363A19595981J1903741P099067J387285n132453j2759797j9911661k2836482
$$ 119595981 131499722 138598789 139986074 134853621 122093824 102182163 79345681
19356G9345681k0784934j5730944j0634984p272760n211070l590422k555009j789458
$$ 79345681 58560747 42829803 32194819 24922059 19710989 16120567 13565558 11776100
19348A1776100j491002j411675r83506p15222n56214l36891m73416m89555l70764
$$ 11776100 10285098 8873423 7889917 7174695 6618481 6281590 5808174 5318619 4947855
19339D947855l03548l62849k00109l27279m50018k61666k7377q0700j55013j66705
$$ 4947855 4644307 4281458 4081349 3754070 3304052 3042386 3015009 2934309 2779296 2612591
19329B612591o9868K5902j69291l24358k5176j033m0176j6878j44478l3465L4749
$$ 2612591 2542723 2568625 2399334 2074976 2049800 2048767 2008591 1991713 1847235 1813770 1848519
19318A848519R6967J81617O1619K62686Q6717k6879j57594j27942l69612k63760
$$ 1848519 1945486 2127103 2188722 2451408 2538125 2511246 2353652 2225710 1856098 1592338
19308A592338q5453J69154O1018P8392L5359j7189j95481j70747k40061j15773
$$ 1592338 1506885 1676039 1737057 1815449 1850808 1833619 1638138 1467391 1227330 1111557
19298A111557j37617k02606q4770N7485l8841j17165j72206o2747k63k1663J00197
$$ 1111557 973940 771334 686564 744049 705208 588043 415837 353090 352827 331164 431361
19287D31361L3868r4758K6356R4232P8562n7748L5045j16141j49749j7982j3728
$$ 431361 465229 370471 396827 491059 569621 511873 546918 430777 281028 263046 249318
19276B49318j24926l138J49524J42532l3515n5445J53586J38846K04779J86900
$$ 249318 124392 121254 270778 413310 379795 324350 477936 616782 821561 1008461
19266A008461K1216J7877j64721j39683J29643J25575m1756j94346R3063l6715
$$ 1008461 1029677 1047554 882833 743150 872793 998368 956612 762266 855329 818614
19256H18614p3664J57559l6352j90752q8096n3590j940J4766j02414j36299j50930
$$ 818614 744950 902509 866157 675405 587309 533719 531779 546545 444131 307832 156902
19245A56902p3627J31962j2556J536M9605J465L7882l3152R8880j2157j34507
$$ 156902 83275 215237 202681 204217 253822 255287 293169 260017 358897 346740 212233
19234B12233j21698l6695R2557L7277q1868l4466Q0045Q1980q7539q8585r0367
$$ 212233 90535 53840 146397 183674 101806 67340 147385 229365 141826 53241 -37126
19223c7126j2040L02430J21664j09173j89778p8530K4686o0429J02909K54172
$$ -37126 -49166 253264 374928 265755 75977 -2553 22133 -38296 64613 318785
19213C18785P8997m5630J1210l754K0817m0650j48737L8612p0773P2355j06351
$$ 318785 397782 352152 363362 359608 380425 339775 191038 229650 158877 231232 124881
19202A24881k03346j1125j0334L6185n533L7187K04684N0473P5678m6318j62292
$$ 124881 -78465 -89590 -99924 -63739 -69272 -32085 172599 223072 298750 252432 90140
19191I0140P6312N9178m9762p6987K7936n8060j62498j7607O6768P2200J86683
$$ 90140 166452 225630 175868 98881 126817 68757 -93741 -111348 -44580 27620 214303
19180B14303J87766Q0494m442Q3283j0411L6308j14084P0734P7783M8806p7133
$$ 214303 402069 482563 478121 561404 550993 587301 473217 543951 621734 670540 593407
19169E93407O2135r2391n6037J10932P030J3183n2159m15874j05713Q0694M6969
$$ 593407 655542 563151 507114 618046 625076 638259 586100 170226 64513 145207 192176
19158A92176J805r1488m0568o5339q0586R1086M0041j6108P7921P3178l3244l4956
$$ 192176 193981 102493 61925 -3414 -84000 7086 47127 31019 108940 182118 148874 113918
19146A13918L6540o122N417k8926K2297K04291n4513k99777M1440Q4662m084L6797
$$ 113918 150458 144336 149753 120827 143124 347415 292902 -6875 34565 119227 115143 151940
19134A51940R1481j0660j14109R7786K48605K24677q0059K108m0582J10938R8664
$$ 151940 243421 232761 118652 216438 465043 689720 609661 611769 571187 682125 780789
19123G80789P0621J00671j55295n621J31287j61451q9933k8568q2166L4071k1898
$$ 780789 851410 952081 796786 791165 922452 761001 671068 642500 560334 594405 572507
19112E72507K778n5319O3289l2052j71364j70599j15556k1809K30930J10293j7342
$$ 572507 575285 519966 583255 551203 379839 209240 93684 71875 302805 413098 395756
19101C95756m0376j29969n5352J21985l8351l3904q5264R7854Q5878j15385j38169
$$ 395756 355380 225411 170059 292044 253693 219789 134525 232379 318257 202872 64703
19090F4703R9988J32444m1511r2025o4368q3579J43296J70925J22958K22773j42906
$$ 64703 164691 297135 255624 163599 99231 15652 158948 329873 452831 675604 532698
19079E32698o084N0146M8235Q8225k6305J55931P9878J0940k6109j31845j41050
$$ 532698 526614 576760 624995 713220 686915 842846 922724 933664 907555 775710 634660
19068F34660n5496P9545P0367q0832n1936j51533r6563n3275n6372R6523p5296
$$ 634660 579164 658709 729076 648244 596308 444775 348212 294937 238565 335088 259792
19057B59792j20049j51204K4315Q0974J5641J0414k2585l2544o7389O6429Q5917
$$ 259792 139743 -11461 12854 93828 109469 119883 97298 64754 -2635 63794 149711
19046A49711l8931O999q5329N8662j57116p4995J67465j047n2889o4917L7970
$$ 149711 110780 117779 32450 91112 -66004 -140999 26466 25419 -27470 -92387 -54417
19035e4417m9879o8097P1867M1947P6115M7989R7021K0413n6916r1269l0209j14617
$$ -54417 -104296 -172393 -100526 -58579 17536 65525 162546 182959 126043 34774 4565 -110052
19023a10052J69696N7630l9759K7303P0049N0448o6332M5947m28J08202K5883
$$ -110052 59644 117274 77515 104818 174867 225315 158983 204930 204502 312704 338587
19012C38587k6878j1007p4556q2213m7399N1432l1358N0663j526o4546j73775
$$ 338587 311709 300702 226146 143933 96534 147966 116608 167271 165745 101199 -72576
19001g2576J9975J55243r4936j47282r1109K3399J81083l9147o9515M0868k264
$$ -72576 -52601 102642 7706 -139576 -230685 -207286 -26203 -65350 -134865 -93997 -96261
18990i6261J02455J63091J43113o8977m8829r7075J37254O2030q6574J51672N377
$$ -96261 6194 169285 312398 243421 194592 97517 234771 296801 210227 361899 367276
18979C67276p0117J21761N5716j76149o0189m4764p1401j2249k4812k02544M0397
$$ 367276 297159 418920 474636 298487 238298 193534 122133 109884 85072 -117472 -77075
18968g7075L2219P2745K16316n5769J13833L4020p1738O4054Q325j98862j45519
$$ -77075 -44856 27889 244205 188436 302269 336289 264551 328605 336930 138068 -7451
18957g451R7795m4546m2023r9815J22523J22744J78765J0319j15562r7610P2157
$$ -7451 90344 45798 3775 -96040 26483 149227 327992 338311 222749 125139 197296
18946A97296Q6769K88344L35373k8211o2500r5364p9377m6115J96917K97408Q8504
$$ 197296 284065 572409 907782 879571 817071 721707 642330 596215 793132 1090540 1179044
18935A179044J01776O9181J03211J16795N721N2480Q6921o1275n5521j13822j16366
$$ 1179044 1280820 1350001 1453212 1570007 1575728 1628208 1715129 1653854 1598333 1484511 1368145
18924A368145q1854j26165J05104J32215K1360M5275P3056q1905j79794k7604
$$ 1368145 1286291 1160126 1265230 1397445 1418805 1464080 1537136 1455231 1275437 1247833
18914A247833q7300j73948j17053p4305J18918O7232j1637J8962K12466M8452
$$ 1247833 1160533 986585 869532 795227 914145 981377 969740 988702 1201168 1249620
18904A249620O6319K4378J70315L32269J15717j99312O6187R3610J59399M33280
$$ 1249620 1315939 1340317 1510632 1842901 1958618 1759306 1825493 1919103 2078502 2511782
18894B511782M41979K20758k6697K1582M01705M57084M02795J69686Q6162K98555
$$ 2511782 2953761 3174519 3147822 3169404 3571109 4028193 4430988 4600674 4686836 4985391
18884D985391M09815P63423P88091N42757N70289N76035M91774P31168Q01876
$$ 4985391 5395206 6158629 6946720 7489477 8059766 8635801 9127575 9858743 10660619
18875A0660619J245687J958963L041400M527865P244393J1387084J5812582J5356754
$$ 10660619 11906306 13865269 16906669 21434534 28678927 40066011 55878593 71235347
18867G1235347P507095l171481j0181653j0577677o670688j540342L966999J1052851
$$ 71235347 78742442 75570961 65389308 54811631 48140943 46600601 50567600 61620451
18859F1620451K0452960K8446000K6794777J4610159J116507n999785q222324
$$ 61620451 82073411 110519411 137314188 151924347 153040854 147041069 138818745
18852A38818745j1060950j4505172j3998317p679695M06114L691824J132260j620845
$$ 138818745 127757795 113252623 99254306 91574611 91980725 95672549 96804809 95183964
18844I5183964j99262K723663M83017p279051j4644851j6846947j4091174r740548
$$ 95183964 94984702 97708365 98191382 90912331 76267480 59420533 45329359 35588811
18836C5588811o469970m367478k957841j795064q39623n14165m30257l07129R0320
$$ 35588811 29118841 24751363 21793522 19998458 19158835 18644670 18214413 17907284 17997604
18827A7997604Q85843J448005K266307L160811M394782P064439J1628635J7700721
$$ 17997604 18883447 20331452 22597759 25758570 30153352 37217791 48846426 66547147
18819F6547147K1258293J6067643M412815o551402j0047530n069724M731262J7862575
$$ 66547147 87805440 103873083 108285898 101734496 91686966 86617242 91348504 109211079
18811A09211079L2807600M2832609L9817418K2292673j248144j6713421j6695108
$$ 109211079 142018679 184851288 224668706 246961379 245713235 228999814 212304706
18804B12304706q013569j569085J253274L213957K832462m169595j6707642k6059298
$$ 212304706 204291137 202722052 203975326 207189283 210021745 205852150 189144508 163085210
18796A63085210k5135903j4798118k573507J944131m237579j4325494k0552842
$$ 163085210 137949307 123151189 120577682 122521813 118284234 103958740 83405898
18789H3405898j9707850j5100983j0092188o755086m837365l724374l070776k269505
$$ 83405898 63698048 48597065 38504877 31749791 26912426 23188052 20117276 17847771
18781A7847771j673908j237220q13467n73232j70341J67870J71475O3862n3014
$$ 17847771 16173863 14936643 14123176 13549944 13379603 13547473 13718948 13782810 13729796
18772A3729796M6894O28297J168083J867632K938176M816676P269518J1557165
$$ 13729796 13776690 14404987 15573070 17440702 20378878 25195554 32465072 44022237
18764D4022237J8169642K4259065K2451423R500520p308547j8063155j8342291
$$ 44022237 62191879 86450944 108902367 118402887 111094340 93031185 74688894
18757G4688894j2333772m916226L086843J1711758J8441558J5840786K813434
$$ 74688894 62355122 57438896 60525739 72237497 90679055 106519841 109333275
18750A09333275j2263671k0700818k0158106j5060958j0413159p159804n212078
$$ 109333275 97069604 76368786 56210680 41149722 30736563 23576759 18364681
18743A8364681l702894k599606j655396j143481j103194n68549m99388n92394
$$ 18364681 14661787 12062181 10406785 9263304 8160110 7591561 7092173 6499779
18735F499779o59569n18048o05265m57554j26974n4670L0318m2709j81476l08924
$$ 6499779 5840210 5322162 4716897 4259343 4132369 4077699 4108017 4065308 3883832 3574908
18725C574908m82623k69274j88342k29398j55944j91583j26596r386j15983j25097
$$ 3574908 3092285 2823011 2634669 2405271 2249327 2057744 1931148 1921762 1805779 1680682
18715A680682P9855j12513j05892j57687l6086M2400J11686N6209J30514K5667
$$ 1680682 1760537 1648024 1542132 1384445 1348359 1390759 1502445 1558654 1689168 1714835
18705A714835j07379K6328r1154j39930J12568L3775N1318j2790j15103K04433
$$ 1714835 1607456 1633784 1542630 1402700 1515268 1549043 1600361 1587571 1472468 1676901
18695A676901O5294l13440R1507L51682K5667K2652J72602J00283L3287J75470
$$ 1676901 1742195 1428755 1520262 1871944 1897611 1920263 2092865 2193148 2226435 2401905
18685B401905L35203L16607J95438J34212J28759L0486J32936J30755J56278J77454
$$ 2401905 2737108 3053715 3249153 3383365 3512124 3542610 3675546 3806301 3962579 4140033
18675D140033J72725K82620L63018N31841O17122P74749J190376J447790J910041
$$ 4140033 4312758 4595378 4958396 5490237 6107359 6882108 8072484 9520274 11430315
18666A1430315K787461L907514O029821R341274J2004398J1277108O771380K302759
$$ 11430315 14217776 18125290 24155111 33496385 45500783 56777891 63549271 65852030
18658F5852030J531176M702107P096927O355342M327131K782237L25104l599356
$$ 65852030 67383206 72085313 79182240 85537582 89864713 92646950 92972054 89372698
18650H9372698o028243m258852p00442j196738o094727j1296033j3208232j1524377
$$ 89372698 83344455 79085603 78385161 77188423 71093696 59797663 46589431 35065054
18642C5065054q392497n670450l729423k683444j962893j254705q22651o02086
$$ 35065054 26672557 21002107 17272684 14589240 12626347 11371642 10548991 9946905
18634I946905n11645m52482k99085r4005J57377J27640J40893K53573K05976M13393
$$ 9946905 9435260 8982778 8683693 8589688 8747065 8874705 9015598 9269171 9475147 9888540
18624I888540O50089O74387R32753J383769J976157K567096M079310O262998R610709
$$ 9888540 10538629 11213016 12145769 13529538 15505695 18072791 22152101 28415099 38025808
18615C8025808J3193857J4875414J3974961J0530657O703200N054819N447231
$$ 38025808 51219665 66095079 80070040 90600697 97303897 102358716 107805947
18608A07805947O810662P514635O236988L323434q48326m950856o995005o538129
$$ 107805947 114616609 122131244 128368232 131691666 130843340 125892484 118897479 112359350
18600A12359350m472052m201021p897493j3609813j6444984j5948083j2445244
$$ 112359350 107887298 103686277 95788784 82178971 65733987 49785904 37340660
18593C7340660q772347o095935m279698l069171k159525j363747r37006j003475
$$ 37340660 28568313 22472378 18192680 15123509 12963984 11600237 10663231 9659756
18585I659756n52397k41027l61481n87354m17639k33832j43340q3760p707N3911
$$ 9659756 9107359 8866332 8504851 7917497 7499858 7266026 7122686 7038926 7031219 7085130
18575G085130n5890K1222K23970M95692Q75457J380027K186405L651411N762224
$$ 7085130 7029240 7050462 7274432 7770124 8645581 10025608 12212013 15863424 21625648
18566B1625648P298618O746068L942550J259181N84351K580595M038999L379065
$$ 21625648 28924266 35670334 39612884 40872065 41456416 44037011 48076010 51455075
18558E1455075J719053J10916j932146l844308m109723k304523m05223j121540
$$ 51455075 53174128 53285044 51352898 47508590 43398867 41094344 40689121 39567581
18550C9567581m265785o572023o865152n584767m119624k765219j816621j240408
$$ 39567581 35301796 28729773 21864621 16279854 12160230 9395011 7578390 6337982
18542F337982q23509m54538m22313l16475m23255l50987k13560j51518j14487
$$ 6337982 5514473 5059935 4637622 4321147 3897892 3546905 3333345 3181827 3067340
18533C067340j4691j20814k11938j71788j52548j86230l84642k07450L3213K8269
$$ 3067340 3052649 2931835 2719897 2548109 2395561 2209331 1824689 1617239 1650452 1678721
18523A678721n7184k99969j32882j37685O1185l5185r5273O4698o8347m3960K04765
$$ 1678721 1621537 1321568 1188686 1051001 1112186 1077001 981728 1046426 978079 934119 1138884
18512A138884K27397l2080k20761M9959p4852k3718K0153K2992J53165P3511L1484
$$ 1138884 1366281 1334201 1113440 1163399 1088547 1064829 1084982 1107974 1261139 1334650 1366134
18501A366134J37404j21313l6407k3366j43070p7165n6328M365K8466J45630J06338
$$ 1366134 1503538 1382225 1345818 1322452 1179382 1102217 1045889 1050254 1078720 1224350 1330688
18490A330688j6407j62087J36012K48488q7745j08908J6454L4986m2040l1860
$$ 1330688 1314281 1152194 1288206 1536694 1448949 1340041 1356495 1391481 1349441 1317581
18480A317581P4645m299l92569k44882K46202N0911q7577J31567l697J584R5996
$$ 1317581 1392226 1387927 995358 750476 996678 1047589 960012 1091579 1087882 1089466 1185462
18469A185462k7486M1777J53602P4938l4381J19393q3506q3857J61701K14415
$$ 1185462 1157976 1199753 1353355 1428293 1393912 1513305 1429799 1345942 1507643 1722058
18459A722058J0912P6396j30o344j26674k33306k12733J70557L69179K81809J4132
$$ 1722058 1732970 1809366 1809236 1802892 1676218 1442912 1230179 1400736 1769915 2051724 2065856
18448B065856j27251J23651O7063J9096R3088j5633K25497M31753M37070M42990
$$ 2065856 1938605 2062256 2129319 2148415 2241503 2225870 2451367 2883120 3320190 3763180
18438C763180M36907M00793M23488M80684N57480M29601M02026P08108O93262
$$ 3763180 4200087 4600880 5024368 5505052 6062532 6492133 6894159 7602267 8295529
18429H295529O37815R05420R35478J090922J350117J485782J722551K268764L017088
$$ 8295529 8933344 9838764 10774242 11865164 13215281 14701063 16423614 18692378 21709466
18420B1709466M233502O112883Q957537J3576468K0841702L0207255L6570022
$$ 21709466 25942968 32055851 41013388 54589856 75431558 105638813 142208835
18413A42208835L7402222L5002318K7876244J2203166n991069j4660164o595926
$$ 142208835 179611057 214613375 242489619 254692785 248701716 234041552 227445626
18406B27445626Q714039J2824129J402696j3799821k4693034l0775061l3588046
$$ 227445626 236159665 248983794 250386490 236586669 211893635 181118574 147530528
18399A47530528l3132655k8255530k0849096j4180667r636589o664361m412034
$$ 147530528 114397873 86142343 65293247 51112580 41475991 34811630 30399596
18392C0399596k969405j703859q19817q9865M06868J222050K299871L992751O478162
$$ 30399596 27430191 25726332 24906515 24816650 25223518 26445568 28745439 32738190 39216352
18383C9216352J0610172J6388013K0382472J7524512P491272j911324l853886
$$ 39216352 49826524 66214537 86597009 104121521 111612793 109701469 105847583
18376A05847583J696841P044718M012049n516311j3799604j4916693r409424j023585
$$ 105847583 107544424 114589142 118601191 113084880 99285276 84368583 74959159 73935574
18368G3935574Q167248J6612207K0656025J9231032J7756057J9691208J9208555
$$ 73935574 82102822 98715029 119371054 138602086 156358143 176049351 195257906
18361A95257906R635359l557728q608059j792651P412184Q437154m014j2723638
$$ 195257906 204893265 201335537 192727478 190934827 198347011 206784165 206780151 194056513
18353A94056513k4170982l0959564l1386369k6936216k0104362j4003804r465105
$$ 194056513 169885531 138925967 107539598 80603382 60499020 46495216 37030111
18346C7030111o556578m520971l045904k001246j203371n81258K4569L40486N07288
$$ 37030111 30473533 25952562 22906658 20905412 19702041 19120783 19145352 19485838 19993126
18337A9993126J029339J997427L802384O492528J0736019J5302621J6031573J0162790
$$ 19993126 21022465 23019892 26822276 33314804 44050823 59353444 75385017 85547807
18329H5547807J215693m356098k322752L242505M455103k072900j0781618j5709187
$$ 85547807 86763500 82407402 80084650 83327155 87782258 85709358 74927740 59218553
18321E9218553j4907124j1200324p735794n480615l979113k645171j826936j454059
$$ 59218553 44311429 33111105 25375311 19894696 15915583 13270412 11443476 9989417
18313I989417j164346q54505o99586o10153m30179k79238l60329l80233l03707
$$ 9989417 8825071 7970566 7270980 6660827 6230648 5951410 5591081 5210848 4907141
18304D907141l52045k58550l44342k45555k80037k41339k36046j94159m12644
$$ 4907141 4555096 4296546 3952204 3706649 3426612 3185273 2949227 2755068 2342424
18295B342424q4167J14639k3347j40551R8694L8793L9571J75716J1157O35O3069
$$ 2342424 2258257 2372896 2349549 2208998 2307692 2346485 2386056 2561772 2572929 2573564 2636633
18284B636633K12326j37417j090k7212r4089j49302N4954J19315J2976k5382j29475
$$ 2636633 2848959 2711542 2710452 2683240 2589151 2439849 2494803 2614118 2627094 2601712 2472237
18273B472237O7033j48278k94511j82955Q3239j12387j78718J1064j13068k14629
$$ 2472237 2539270 2390992 2096481 1913526 1996765 1884378 1705660 1716724 1603656 1389027
18263A389027P4689P2959j80630q1597J51990P1383Q0545J2119m4669n7333N4407
$$ 1389027 1463716 1536675 1356045 1274448 1426438 1497821 1578366 1590485 1545816 1488483 1542890
18252A542890j22854n6951j50204j01915j80266r3700J50778K2627O2750J18164
$$ 1542890 1420036 1363085 1212881 1110966 930700 837000 987778 1010405 1073155 1191319
18242A191319k5904K3920j8654o0105J1915L5332K66289J61468n6901j52217k87842
$$ 1191319 1165415 1189335 1170681 1110576 1122491 1157823 1424112 1585580 1528679 1376462 1088620
18231A088620L7663J0301q6646n218J54701j4562O4972K3998j01183J67385M222
$$ 1088620 1126283 1136584 1049938 1044720 1199421 1184859 1249831 1273829 1172646 1340031 1344253
18220A344253k22433j33126J6288L0919q3094j03113J1481K4823N2393K17844
$$ 1344253 1121820 988694 1004982 1035901 952807 849694 861175 885998 938391 1156235
18210A156235L8290k48120k69082J2774q8162j89380j03869J0011R85J45795M6031
$$ 1156235 1194525 946405 677323 690097 601935 412555 308686 318697 319682 465477 511508
18199E11508j30750K9924K28262N1793L0499q2196q6844J8183P7961j0656j27572
$$ 511508 380758 410682 638944 690737 721236 639040 552196 570379 648340 637684 510112
18188E10112R2645J44125r945j25581j20422R7240J47568K0661j06755j41031
$$ 510112 602757 746882 736937 611356 490934 588174 735742 756403 649648 508617
18178E08617J51381J88902P9031Q6534J98877J29617l8262j07072j8883j3920
$$ 508617 659998 848900 927931 1014465 1213342 1342959 1304697 1197625 1178742 1164822
18168A164822k1478N3448L0580j7486N0413M0799M561j07148N3454L5077j27634
$$ 1164822 1143344 1196792 1227372 1209886 1260299 1301098 1305659 1198511 1251965 1287042 1159408
18157A159408o7005J52057K8249j59134m7843n0789j56867N018N8962N245J24613
$$ 1159408 1092403 1244460 1272709 1113575 1065732 1014943 858076 863094 922056 927301 1051914
18146A051914K67890K27180K32777R1828j02112p1228Q3339m7991J88257J88899
$$ 1051914 1319804 1546984 1779761 1871589 1769477 1698249 1781588 1733597 1921854 2110753
18136B110753K55681K57324K18142M9970K50483L00833K94801L04752K81902j06283
$$ 2110753 2366434 2623758 2841900 2891870 3142353 3443186 3737987 4042739 4324641 4218358
18126D218358J56848M54177M44686O58526Q52773J034840J259741J491260K041751
$$ 4218358 4375206 4829383 5274069 5932595 6785368 7820208 9079949 10571209 12612960
18117A2612960K699272L584033M950766P155577J0981428J7970884L2022988N7242796
$$ 12612960 15312232 18896265 23847031 31002608 41984036 59954920 91977908 149220704
18109A49220704Q3406731P5245134K3292843l8111241p3197960o9806661m8590163
$$ 149220704 232627435 307872569 331165412 293054171 219856211 150049550 101459387
18102A01459387l0507254k0172408j3978258r034470o006323m236995l059969
$$ 101459387 70952133 50779725 36801467 27766997 21760674 17523679 14463710
18095A4463710k421020j980632j263644q29910p30250p03307n28942n13771l89073
$$ 14463710 12042690 10062058 8798414 7968504 7238254 6534947 6006005 5492234 5103161
18086E103161l17773n78426m66451j98443j20744j25891r6210o4288j55983l67323
$$ 5103161 4785388 4206962 3740511 3542068 3421324 3295433 3199223 3134935 2978952 2611629
18076B611629j68544j28119m5690j17565q6601j59624J68924L0393K667L9992
$$ 2611629 2443085 2314966 2269276 2151711 2065110 1905486 2074410 2104803 2107470 2147462
18066B147462p4555o9008K8502R963j33130J0891o5690J850j20809j71030q3877
$$ 2147462 2072907 2003899 2032401 2042364 1909234 1920125 1854435 1856285 1735476 1564446 1480569
18055A480569l99883j32538Q9049N8185L2521Q133R199K526P9300n5555l1089
$$ 1480569 1080686 948148 1037197 1095382 1127903 1136036 1145235 1147761 1227061 1171506 1140417
18044A140417k0456J25421r2482p5488J30601Q395j24749j90078M970R3120M4193
$$ 1140417 1119961 1245382 1152900 1077412 1208013 1216408 1091659 901581 906551 999671 1043864
18033A043864J05577R272l90062k10938j63828r4167m0352L09055J06481j46086
$$ 1043864 1149441 1158713 768651 557713 393885 299718 259366 568421 674902 528816
18023E28816N6092r8271q3970K01952k9655o3924J7037L0958j7530J94253k2780
$$ 528816 584908 486637 402667 604619 574964 511040 528077 559035 541505 735758 712978
18012G12978o8646p7723m8440L6848Q4276Q8353k7853l3076K5918q7566p8588
$$ 712978 644332 566609 518169 555017 639293 727646 699793 666717 692635 605069 526481
18001E26481n7938o6046P4529o2683K3882L5185q331J1111M0411j5482Q368j36976
$$ 526481 468543 402497 477026 414343 438225 473410 465079 476190 516601 501119 509487 372511
17989C72511j12189R1300J74652n8897J24276N3227j12515r2670N959k46363j59381
$$ 372511 260322 351622 526274 467377 591653 644880 532365 439695 445654 199291 39910
17978C9910Q9117P8513j04850Q991K6185o937J14498l3129N0207J08589o1196
$$ 39910 129027 207540 102690 111681 137866 130929 245427 212298 262505 371094 309898
17967C09898j3347k0435q0719j44990q40m691P8068R8643n2554P2774O1588j8426
$$ 309898 296551 276116 195397 50407 49567 44876 122944 221587 169033 241807 303395 284969
17955B84969n8022j02229J87650J84174J00789j61577k32335j25822p9759J72405
$$ 284969 226947 124718 312368 496542 597331 435754 203419 77597 -2162 170243
17945A70243o484k938r8402K6173l3065j09012Q3911R7841j5889l552P3113J43713
$$ 170243 163759 160821 62419 88592 55527 -53485 30426 128267 112378 108826 181939 325652
17933C25652O8925q4457j10878J77959K1593l5754j35563j38382j17006P1994
$$ 325652 394577 310120 199242 377201 398794 363040 227477 89095 -27911 44083
17923D4083K31742Q7118j20483j62522J17210J32987J24040m7358L9016l4601
$$ 44083 275825 362943 242460 79938 197148 330135 454175 406817 445833 411232
17913D11232L2573j09971J6649L6038J34526O7890j6816N4181J6914M954N6007
$$ 411232 443805 333834 350483 386521 521047 588937 572121 626302 643216 648170 704177
17902G04177m20P4495K7415J64088O8048j06670l3906J61046j0256J19191O8611
$$ 704177 703757 778252 805667 969755 1037803 931133 897227 1058273 1048017 1167208 1235819
17891A235819J16800M9731M0014k3137j04739j4179m2488l05263j35564p2853
$$ 1235819 1352619 1402350 1442364 1419227 1314488 1300309 1257821 952558 816994 744141
17881G44141r5874m9846n8174k4000q7643J08874J06627J0391n6061M706k13088
$$ 744141 648267 598421 540247 516247 428604 537478 644105 654496 598435 603141 390053
17870C90053k92374R5657L40756l629k27408j10646j34009Q1762J0042K03055
$$ 390053 97679 193336 534092 530463 303055 192409 58400 140162 150204 353259
17860C53259R4357m4879K26078R6683R7247J73920J48570J74149J86763M6276
$$ 353259 447616 402737 628815 725498 822745 996665 1145235 1319384 1506147 1552423
17850A552423k14840n8216Q1652j16034k17204q1465j1118M1735J12227k827J47793
$$ 1552423 1337583 1279367 1361019 1244985 1027781 946316 935198 976933 1089160 1086333 1234126
17839A234126Q5779m4606j05925q7669k0738j26905j50183K2450Q3280o0955j09009
$$ 1234126 1319905 1275299 1169374 1081705 1060967 934062 783879 806329 889609 828654 719645
17828G19645l52301j06831k84645n5706K1234R884K1509j3085k5131L02098O0219
$$ 719645 367344 260513 -24132 -79838 -58604 -48720 -27211 -40296 -65427 236671 296890
17817B96890J5524O6979k3967K7018K5746k7238J3335P5808J13479L5620Q971
$$ 296890 312414 379393 355426 382444 408190 380952 394287 470095 583574 619194 628165
17806F28165K92662J20380p9919k05859k14314j09749k8042o9475j7201l5178
$$ 628165 920827 1041207 961288 755429 541115 431366 403324 333849 316648 281470
17796B81470P6012K5427j09165R137J07895K8780N7907k47091q4656R9747m1658
$$ 281470 357482 382909 273744 282881 390776 419556 477463 230372 145716 245463 203805
17785B03805k1823j99921l9726p6987J72245J25267J2969j18604j12727o979K85456
$$ 203805 181982 -17939 -57665 -134652 37593 162860 175829 57225 -55502 -62481 222975
17774B22975N3909J93N1956o7989l6011j6310P7522n8288j6798O3287J17492m7664
$$ 222975 276884 277077 329033 261044 225033 208723 286245 227957 211159 274446 391938 344274
17762C44274p8649J38140p2044k56104j35108J49207K16464k2223k36578l2138
$$ 344274 265625 403765 331721 75617 -59491 89716 306180 283957 47379 15241
17752A5241J19987R4818n4138O9299j7879j39359Q6029q5230r7850n5960J3201
$$ 15241 135228 230046 175908 245207 227328 87969 173998 88768 -9082 -65042 -51841
17741e1841M9628K35097j9202l1363n5717Q9345Q0983o9922j16741L2240O409
$$ -51841 -2213 232884 213682 182319 126602 215947 296930 227008 110267 142507 148916
17730A48916j00335k69129n7172J07170J84945n57Q7933J4608l5218M1315M821
$$ 148916 48581 -220548 -277720 -170550 14395 13838 101771 116379 81161 122476 127297
17719A27297L4959L7746J2751L9566J6443r5403r175k62669N826K13186J30749
$$ 127297 162256 200002 212753 252319 268762 173359 164184 -98485 -92659 120527 251276
17708B51276P93m5711j82435j57084N4190M6562J23876J12336r2878R8905J3901
$$ 251276 252069 206358 23923 -133161 -78971 -32409 91467 203803 110925 209830 223731
17697B23731K2267J7075n5954m3834M0762m0220j1661J34615o8813p9128m6339
$$ 223731 245998 263073 207119 163285 204047 163827 152166 286781 217968 138840 92501
17686I2501J9141O1117p5882P0146O9922j94025j21383j5941j37377J8163P7298
$$ 92501 111642 172759 96877 167023 236945 42920 -78463 -94404 -231781 -213618 -136320
17675a36320J63543R4056j2079N8221Q4060m4128j59909j4691j38211m1666J71164
$$ -136320 27223 121279 109200 167421 251481 207353 47444 32753 -105458 -147124 24040
17664B4040k6465M322j68998J0402J18283J18779J28162o5243o1770J0034j54581
$$ 24040 -2425 1897 -167101 -156699 -38416 80363 208525 143282 81512 91546 -63035
17653f3035n5993K88681M4391j93294k17876m3330J65505K2699J08581K22735
$$ -63035 -119028 169653 214044 20750 -197126 -240456 -74951 -52252 56329 279064
17643B79064n4884O2600M851j69495k51615K895J12083J33474K48417j35149o6355
$$ 279064 224180 286780 291631 122136 -129479 -126584 -14501 118973 367390 232241 165886
17632A65886L4487n2924j52232O8187k0353j3813m4877O7640j3313K2550j61346
$$ 165886 200373 147449 -4783 63404 43051 29238 -15639 52001 38688 61238 -100108
17621a00108o5793o6398O2646K011P063r3163J07712J4784j1421J01294L8297
$$ -100108 -165901 -232299 -169653 -167642 -160579 -253742 -146030 -131246 -142667 -41373 -3076
17610c076j92251L3272J67930l8542P8705l8798j5905K4349o314L3982J18326
$$ -3076 -195327 -162055 5875 -32667 46038 7240 -8665 15684 9370 43352 161678
17599A61678K7774n8449o9368l2458J8962J66901L4479j66122K0242k24090p1056
$$ 161678 189452 131003 61635 29177 48139 215040 249519 83397 103639 -120451 -191507
17588a91507k9767N0452K05113J03292o2179m2937Q8391J9339j34127j29684l828
$$ -191507 -221274 -170822 34291 137583 75404 32467 120858 140197 6070 -123614 -127442
17577a27442L5275M6666J6528j85336Q7423K11840n8928k04952j0965P1052O7470
$$ -127442 -92167 -45501 -28973 -214309 -126886 84954 26026 -178926 -189891 -118839 -51369
17566e1369J08954L2215P5208P2830j13383j27306r580p4568n0788M1721J97298
$$ -51369 57585 89800 165008 237838 124455 -2851 -12431 -86999 -137787 -96066 101232
17555A01232K44505m758J5665n0484p5405M1040p5855m6883j00731J17547J01196
$$ 101232 345737 340979 356644 306160 230755 271795 195940 149057 48326 165873 267069
17544B67069j38674j16600q2637j17149P8571J27382J769o3113o4020k06295j20287
$$ 267069 128395 11795 -70842 -187991 -109420 17962 19731 -43382 -107402 -313697 -433984
17533d33984L12204L27779L9661k45255k38551m4202L2494P0896k4885Q7655o3461
$$ -433984 -121780 205999 245660 405 -238146 -282348 -249854 -178958 -203843 -116188 -179649
17522a79649j05795J04199Q7551n0043l3940k8764m9106m5260L5602J62898q629
$$ -179649 -285444 -181245 -93694 -143737 -177677 -206441 -255547 -300807 -265205 -102307 -110936
17511a10936m0571R5187P0081n8144j06142q7711Q407J48524r4859j11207J07030
$$ -110936 -151507 -56320 13761 -44383 -150525 -238236 -229829 -81305 -176164 -287371 -180341
17500a80341p3951K0807J17634N5006q8062p619l1502J41138J20728J70908j11064
$$ -180341 -254292 -233485 -115851 -60845 -148907 -156526 -188028 -46890 73838 244746 133682
17489A33682j54466j49253k6908K87989J50832j8741q3620M7009j21931q2706
$$ 133682 -20784 -170037 -196945 91044 241876 223135 139515 186524 64593 -18113
17479a8113J49642M1609j42451j31203J5316N4542n7365P8563p4600j49953p3271
$$ -18113 131529 173138 30687 -100516 -85200 -30658 -88023 -9460 -84060 -234013 -307284
17468c07284J86884K10907J51899k1548l1920o1895j37971r053k0036J57235m9707
$$ -307284 -120400 90507 242406 220858 188938 127043 -10928 -19981 -40017 117218 67511
17457F7511L143n8694j15692L5111O0510P7669k00459r1558P2792J31954J45462
$$ 67511 70654 11960 -103732 -68621 -8111 69558 -130901 -222459 -149667 -17713 127749
17446A27749J94029J31357L00982N28668M55279L1816k03179k34001l59041j49213
$$ 127749 321778 453135 754117 1282785 1738064 1769880 1566701 1332700 973659 824446
17436H24446p6297l20795j64562j28722O0932R0936l7727K320j15817m560J04900
$$ 824446 748149 427354 262792 134070 195002 285938 248211 250531 134714 130154 235054
17425B35054n6820j01531N1646k30729J31313J5169p436j77812l636K30086J32888
$$ 235054 178234 76703 128349 -102380 28933 44102 36666 -141146 -144782 85304 218192
$$ [...]
##END NTUPLES=NMR SPECTRUM
##END=
