##TITLE= c5620yag
##JCAMP-DX= 6.00 $$ JEOL NMR v1.10
##DATA TYPE= NMR SPECTRUM
##DATA CLASS= NTUPLES
##NUM DIM= 1
##ORIGIN= DELTA2_NMR
##OWNER= JEOL
##LONG DATE= 2010/01/28 14:51:23
##SPECTROMETER/DATA SYSTEM= DELTA2_NMR
##.OBSERVE FREQUENCY= 3.99782213664966E+02
##.OBSERVE NUCLEUS= ^1H
##.DELAY= (1.6668E+02,1.6668E+02)
##.ACQUISITION MODE= SIMULTANEOUS
##.ACQUISITION SCHEME= PHASE SENSITIVE
##.PULSE SEQUENCE= single_pulse.ex2
##.SOLVENT NAME= CHLOROFORM-D
##.FIELD= 9.389766
##.FILTER WIDTH= 1.3665350909952
##.ACQUISITION TIME= 2.73186816
##.SPINNING RATE= 10
##.OBSERVE 90= 11
$$ ------------------------
$$ JEOL SPECIFIC PARAMETERS
##$FILENAME= C:\DOCUME~1\YANANG~1\LOCALS~1\Temp/tmpconv_c5620yag_PROTON257637624
59i-1.jdf
##$TITLE= c5620yag
##$AUTHOR= JEOL
##$CREATION= 28-JAN-2010 14:51:23
##$REVISION= 17-FEB-2010 14:28:16
##$CONTENT= Yanan Gao reactC12mimTf2N 24h
##$INSTRUMENT= DELTA2_NMR
##$SITE= York Chemistry
##$NODENAME= itea
##$DIMENSIONS= 1
##$STORAGE= FLOAT
##$X_FORMAT= COMPLEX
##$X_CURR_POINTS= 16384
##$X_START= 12.46255 $$ppm
##$X_STOP= -2.53811 $$ppm
##$X_TITLE= 1H                              
##$X_ZERO_POINT= 0.3333
##$X_FREQ_FLIP= FALSE
##$X_POINTS= 16384
##$X_PRESCANS= 1
##$X_DOMAIN= 1H
##$X_OFFSET= 5 $$ppm
##$X_FREQ= 399.78221 $$MHz
##$X_SWEEP= 5.99736 $$kHz
##$X_RESOLUTION= 0.36605 $$Hz
##$SOLVENT= CHLOROFORM-D
##$TEMP_GET= 22 $$dC
##$ACQ_DELAY= 0.16668 $$ms
##$DIGITAL_FILTER= FALSE
##$FILTER_FACTOR= 1
##$FILTER_WIDTH= 3 $$kHz
##$TRANSITION_RATIO= 0.8
##$ORDERS= 2 15 74
##$FACTORS= 2  2
##$LOCK_STRENGTH= 1244
##$LOCK_LEVEL= 180
##$LOCK_GAIN= 24
##$LOCK_OSC_OFFSET= 7.26 $$ppm
##$LOCK_PHASE= 91.4 $$deg
##$LOCK_OSC_STATE= 2H OSC ON
##$X_ANGLE= 45 $$deg
##$X90= 11 $$us
##$X90_HI= 52 $$us
##$X90_LO= 52 $$us
##$X_90_WIDTH= 11 $$us
##$X_PULSE= 5.5 $$us
##$RELAXATION_DELAY= 4 $$s
##$SCANS= 16
##$PROBE_ID= 2756
##$ITERATIONS= 1
##$FIELD_STRENGTH= 9.38977 $$T
##$TEMP_SET= 25 $$dC
##$SPIN_SET= 10 $$Hz
##$SPIN_GET= 10 $$Hz
##$HE_LEVEL= 97 $$%
##$N2_LEVEL= 89 $$%
##$CHANGER_SAMPLE= 47
##$EXPERIMENT= single_pulse.ex2
##$OBS_PWIDTH= 1 $$us
##$IRR_PWIDTH= 52 $$us
##$TRI_PWIDTH= 1 $$us
##$QUA_PWIDTH= 1 $$us
##$IRR_DOMAIN= 1H
##$TRI_DOMAIN= 1H
##$IRR_FREQ= 399.7822 $$MHz
##$TRI_FREQ= 399.7822 $$MHz
##$RECVR_GAIN= 26
##$IRR90= 11 $$us
##$TRI90= 10 $$us
##$QUA90= 10 $$us
##$IRR90_HI= 52 $$us
##$QUA90_HI= 10 $$us
##$IRR90_LO= 52 $$us
##$TRI90_LO= 10 $$us
##$QUA90_LO= 10 $$us
##$IRR_OFFSET= 5 $$ppm
##$MOD_RETURN= 1
##$TOTAL_SCANS= 16
##$TRI_OFFSET= 5 $$ppm
##$X_ACQ_DURATION= 2.73187 $$s
##$AF_VERSION= 1
##$DELAY_OF_START= 2.0 $$s
##$ACTUAL_START_TIME= 633538167
##$CLIPPED= FALSE
##$DC_BALANCED= FALSE
##$QUI90= 10 $$us
##$SEX90= 10 $$us
##$SEP90= 10 $$us
##$OCT90= 10 $$us
##$NON90= 10 $$us
##$DEC90= 10 $$us
##$TRI90_HI= 10 $$us
##$QUI90_HI= 10 $$us
##$SEX90_HI= 10 $$us
##$SEP90_HI= 10 $$us
##$OCT90_HI= 10 $$us
##$NON90_HI= 10 $$us
##$DEC90_HI= 10 $$us
##$QUI90_LO= 10 $$us
##$SEX90_LO= 10 $$us
##$SEP90_LO= 10 $$us
##$OCT90_LO= 10 $$us
$$ [...]
##$VT_PID_LONG_40_H_HC= 0
##$VT_PID_LONG_40_H_HL= 100
##$SAMPLE_ACTION= LOADED
##$SAMPLE_STATE= LOAD
##$SAMPLE_STATUS= LOADED
##$AUTOSHIM_MODE= Z1 Z2
##$AUTOSHIM_DELAY= 3600 $$s
##$AUTOSHIM_TRACK= AUTOSHIM OFF
##$SHIM_NAMES= SHIM_Z0
##$SHIM_Z0= -25788 $$Hz
##$SHIM_Z1= -77.4 $$Hz
##$SHIM_Z2= 15.36 $$Hz
##$SHIM_Z3= -19.72 $$Hz
##$SHIM_Z4= -24.05 $$Hz
##$SHIM_Z5= 11.03 $$Hz
##$SHIM_Z6= -0.59 $$Hz
##$SHIM_X= 9.3 $$Hz
##$SHIM_XZ= 41.5 $$Hz
##$SHIM_XZ2= -4.5 $$Hz
##$SHIM_XZ3= 0 $$Hz
##$SHIM_X2= -50 $$Hz
##$SHIM_X2Z= -14.5 $$Hz
##$SHIM_X3= 0 $$Hz
##$SHIM_Y= 114.4 $$Hz
##$SHIM_YZ= -42 $$Hz
##$SHIM_YZ2= -29.5 $$Hz
##$SHIM_YZ3= 0 $$Hz
##$SHIM_Y2= 7 $$Hz
##$SHIM_Y2Z= -19 $$Hz
##$SHIM_Y3= 0 $$Hz
##$NUM_SCANS= 1
##$END_TIME= 633538282
##$LOCAL_TIME= 633538282
##$LF_TUNE_DIAL= 2729
##$LF_MATCH_DIAL= 3568
##$HF_TUNE_DIAL= 2461
##$HF_MATCH_DIAL= 5783
##$HA_RF1= HF1
##$HA_RF2= LF1
##$HA_RF3= NONE
##$HA_RF4= NONE
##$SHAPE_NAMES= SQUARE
##$FG_SHAPE_NAMES= SQUARE
##$NOISE_NAMES= CW
##$NON_OBS_OFFSET= 1000000 $$Hz
##$NOMINAL_DDS_SPREAD= 100 $$Hz
##$OBS_AMP= NONE
##$IRR_AMP= NONE
##$TRI_AMP= NONE
##$QUA_AMP= NONE
##$QUI_AMP= NONE
##$SEX_AMP= NONE
##$SEP_AMP= NONE
##$OCT_AMP= NONE
##$NON_AMP= NONE
##$DEC_AMP= NONE
##$OBS_XMTR= 0
##$IRR_XMTR= 0
##$TRI_XMTR= 0
##$QUA_XMTR= 0
##$QUI_XMTR= 0
##$SEX_XMTR= 0
##$SEP_XMTR= 0
##$OCT_XMTR= 0
##$NON_XMTR= 0
##$DEC_XMTR= 0
##$PASS_RIPPLE= 0.01 $$dB
##$STOP_RIPPLE= 60 $$dB
##$PROBE_RECOVERY= 5 $$us
##$AF_DELAY_RATIO= 0
##$RECVR_PHASE= 0 $$deg
##$X_GRADIENT_MAX= 0.1 $$T/m
##$RECVR_GAIN_LIMIT= 80
##$RECVR_GAIN_POINT= 200000 $$Hz
##$VERSION= 4.3.6 [Linux]
##$Y_GRADIENT_MAX= 0.1 $$T/m
##$Z_GRADIENT_MAX= 0.3 $$T/m
##$INST_MODEL_NUMBER= JNM-ECS400
##$INST_SERIAL_NUMBER= NM14400056
##$FAST_AUTOSHIM_STEP_MULT= 50
##$FAST_AUTOSHIM_SETTLE_WAIT= 4 $$s
##$FAST_AUTOSHIM_ITERATIONS= 1
##$FAST_AUTOSHIM_MAX_STEPS= 30
##$SHIM_DELAY= 0 $$s
##$SHIM_DELAY_BEFORE_EXP= 0 $$s
##$SHIM_DELAY_STATE= ON
##$SPIN_PID_P= 10
##$SPIN_PID_I= 5
##$SPIN_PID_D= 0
##$HF1_TUNE_ATN= 20.1 $$dB
##$LF1_TUNE_ATN= 25.7 $$dB
##$X_ACQ_TIME= 2.73187 $$s
##$X_ATN= 1.1 $$dB
##$INITIAL_WAIT= 1 $$s
##$REPETITION_TIME= 6.73187 $$s
##$DANTE_PRESAT= FALSE
##$IRR_MODE= Off
##$TRI_MODE= Off
##$DEAD_TIME= 0 $$us
##$DELAY= 0 $$us
##$X_PROBE_MAP= HF1
##$NORMALIZED= TRUE
$$ END OF JEOL SPECIFIC PARAMETERS
$$ -------------------------------
##NTUPLES= NMR SPECTRUM
##VAR NAME= FREQUENCY,    SPECTRUM/REAL, SPECTRUM/IMAG, PAGE NUMBER
##SYMBOL=   X,            R,             I,             N
##VAR TYPE= INDEPENDENT,  DEPENDENT,     DEPENDENT,     PAGE
##VAR FORM= AFFN,         ASDF,          ASDF,          AFFN
##VAR DIM=  16384, 16384, 16384, 2
##UNITS= PPM,     ARBITRARY UNITS, ARBITRARY UNITS, 
##FIRST=  1.24625475719062E+01, -4.88314950533716E-12, -3.27085130350253E-11, 1
##LAST=  -2.53810755038315, -1.02225305016686E-11, -3.13110389703117E-11, 2
##FACTOR=  9.15623214447255E-04, 3.4121873439863E-09, 3.4121873439863E-09, 1
##PAGE= N=1
##DATA TABLE=(X++(R..R)), XYDATA
$$ [...]
9181 -856913 -912166 -897302 -852420 -809290 -886342 -914065 -936628 -874161 -854601 -879149 -922604 -943281 -880172
9168 -880172 -909451 -964298 -901320 -886145 -856889 -964692 -912044 -894680 -918560 -883851 -847941 -775845 -738143
9155 -738143 -753407 -629120 -600416 -539638 -417187 -324396 -186931 -135565 -46796 -76554 -9127 -1382 -29548
9142 -29548 -82704 -112520 -290305 -421641 -511875 -599926 -623620 -800980 -814606 -802631 -847506 -901146 -878976
9129 -878976 -894680 -854078 -959589 -998216 -909962 -861879 -938722 -916770 -882611 -919411 -894740 -892685 -937343
9116 -937343 -892061 -945872 -915547 -923910 -935301 -976538 -929588 -974938 -959754 -939967 -940748 -939698 -915159 -975230
9102 -975230 -959420 -917607 -944268 -986487 -990502 -1010150 -967029 -925885 -931518 -998094 -928118 -1000634 -965941
9089 -965941 -942972 -922542 -944209 -963842 -975426 -945099 -940969 -945009 -945839 -958856 -930937 -976597 -913021 -919716
9075 -919716 -911461 -930505 -959237 -934457 -908642 -955201 -990329 -899093 -954148 -923084 -909848 -916885 -1018411
9062 -1018411 -923888 -926290 -955293 -944036 -973299 -956059 -1000376 -906901 -898162 -912174 -994336 -1054327 -949240
9049 -949240 -926654 -947123 -891525 -992376 -965165 -940723 -948065 -931193 -948006 -994127 -952993 -943878 -914442
9036 -914442 -1027535 -1034048 -950262 -1003577 -959546 -936794 -979531 -1004579 -999651 -943466 -967295 -941544 -992470
9023 -992470 -1033286 -851704 -889335 -1013662 -1004199 -966310 -935595 -989876 -998538 -1018775 -970365 -1066238 -962483
9010 -962483 -991699 -916223 -953343 -973244 -1006572 -1001359 -975376 -976796 -939339 -960265 -937347 -914265 -964944
8997 -964944 -1018266 -984312 -989387 -912117 -1005763 -931264 -986305 -1020664 -1021584 -1060419 -1059946 -1007454 -976275 -1058739
8983 -1058739 -1063661 -945669 -1061855 -1041156 -910527 -1029839 -975097 -1014516 -953584 -1012664 -992260 -1058840
8971 -1058840 -955199 -1062393 -983151 -1046559 -991671 -1070422 -978062 -1025393 -1023975 -992718 -999550 -998674 -1023630
8958 -1023630 -1073503 -999385 -989876 -1041015 -980157 -1091896 -1038087 -1020332 -1031324 -1070995 -1017496 -1062635 -1029153
8945 -1029153 -1069600 -991644 -1057134 -996251 -1023184 -975908 -953526 -1031553 -983389 -973456 -1010445 -979086 -1004109
8932 -1004109 -991861 -964196 -957728 -1009823 -987700 -1014145 -1056391 -983631 -955588 -951423 -1036924 -1034463 -1038258 -1095729
8918 -1095729 -1011496 -1023412 -967733 -985632 -1037757 -1002840 -1043947 -968189 -978423 -986272 -1016670 -980578 -978267
8905 -978267 -1003873 -1047538 -977866 -931474 -1036661 -999468 -1027523 -1122207 -1077829 -1032427 -1036898 -1045058 -1034774
8892 -1034774 -1040750 -1036228 -1039218 -1049518 -1059378 -1069734 -1031115 -956298 -1047854 -1035226 -1029121 -1039278 -1025248 -986003
8878 -986003 -1082617 -1036141 -1031302 -1082894 -1084454 -1044103 -1098257 -1008263 -1028288 -1012802 -1048518 -1120529 -1049892
8865 -1049892 -1014151 -993806 -1094177 -1079721 -1012023 -1007500 -1007218 -1043562 -1009494 -1045159 -1027816 -998734 -1048345
8852 -1048345 -997194 -1020091 -1056829 -992628 -983482 -1016800 -1038606 -1023383 -1018989 -1072251 -1036880 -1064697 -1001360
8839 -1001360 -1101469 -1065763 -1047446 -1096672 -1002239 -1101639 -1006064 -1020224 -1087304 -1052233 -1046745 -1032483 -1000146
8826 -1000146 -1040665 -1072501 -1054143 -1063926 -1137093 -1044799 -1000267 -1043847 -1047589 -1093430 -1088800 -1053082 -991858
8813 -991858 -1045940 -1061926 -1098130 -1071666 -1030450 -1041302 -1019868 -1080390 -1068874 -1027461 -1057866 -1010056 -996198
8800 -996198 -1083980 -1015977 -1076327 -1093265 -1096497 -1046539 -1023996 -1051033 -1089520 -1054913 -1055322 -1050838 -1080354 -1050869
8786 -1050869 -1075868 -1085464 -957243 -1010062 -1036904 -1096539 -1076393 -1015374 -1042357 -1016660 -1070616 -1070203 -1028660
8773 -1028660 -1011429 -1109652 -1074522 -1072753 -988376 -936387 -1056171 -1119324 -1090405 -1070880 -1124636 -1017253 -1054261
8760 -1054261 -1167067 -1047284 -1091641 -1097046 -1110990 -1040351 -1056737 -1034911 -1104370 -1048274 -1019485 -1080655 -1020355
8747 -1020355 -1012475 -1056423 -1097038 -1061937 -1066838 -1015928 -1150036 -1047541 -1042297 -1087649 -1107351 -1168724 -1086176
8734 -1086176 -979979 -1115631 -1099404 -1086136 -1151176 -1076273 -1090196 -1075307 -1033672 -1118414 -1117648 -1075185 -1110604
8721 -1110604 -1062034 -1097389 -1101817 -985022 -1114319 -1100105 -1087651 -1083762 -1098919 -1109976 -1012115 -1128315 -1080710
8708 -1080710 -1079941 -1084950 -1089347 -1050958 -1133257 -1018032 -1051926 -1123988 -1060213 -1076136 -1028334 -1023335 -1127155 -1128141
8694 -1128141 -1119706 -1132633 -1063204 -1060870 -1110252 -1120272 -1068531 -1087732 -1062343 -1176774 -1115523 -1118502 -1133428
8681 -1133428 -1085686 -1088100 -1123988 -1095639 -1138805 -1093954 -1138084 -1146440 -1045606 -1092973 -1103581 -1083436 -1037920
8668 -1037920 -1086165 -1148326 -1064379 -1086589 -1057384 -1040443 -1052806 -1069728 -1109374 -1040396 -1037526 -1059989 -1129910
8655 -1129910 -1107980 -1145282 -1153769 -1015242 -1101303 -1164535 -1159147 -1078331 -1115686 -1154658 -1197340 -1099318 -1130930
8642 -1130930 -1121084 -1077508 -1102108 -1162388 -1064542 -1085427 -1126687 -1189092 -1137512 -1082606 -1119648 -1163395 -1128662
8629 -1128662 -1081199 -1037710 -1095233 -1114687 -1126643 -1146121 -1119876 -1137545 -1153468 -1054888 -1067523 -1133693 -1121722
8616 -1121722 -1035848 -1112786 -1127014 -1064418 -1109772 -1130625 -1135427 -1052588 -1111861 -1120739 -1096351 -1057127 -1058849 -1067876
8602 -1067876 -1160800 -1102532 -1065191 -1080502 -1108482 -1093807 -1074232 -1132694 -1073764 -1132368 -1124493 -1149046 -1084897
8589 -1084897 -1129297 -1112744 -1116543 -1141234 -1115685 -1067425 -1117364 -1028179 -1116673 -1128647 -1135226 -1166508 -1106404
8576 -1106404 -1115026 -1159220 -1129995 -1111008 -1109908 -1115342 -1037145 -1074581 -1139328 -1134102 -1132467 -1088052 -1159876 -1146943
8562 -1146943 -1025968 -1003888 -1037576 -1114296 -1120341 -1141222 -1124937 -1155689 -1136586 -1113998 -1176424 -1106915 -1103459
8549 -1103459 -1106183 -1162753 -1147721 -1162232 -1133538 -1127004 -1103648 -1131903 -1097866 -1172136 -1132081 -1105410 -1160715
8536 -1160715 -1082422 -1062899 -1135547 -1150181 -1156401 -1136723 -1135369 -1114544 -1098750 -1155589 -1146345 -1168600 -1169607 -1093323
8522 -1093323 -1100547 -1122490 -1146373 -1110999 -1155760 -1127926 -1126444 -1114868 -1192950 -1126798 -1069256 -1169610 -1146657
8509 -1146657 -1163729 -1111448 -1198305 -1130530 -1202482 -1192109 -1175203 -1124383 -1199830 -1119644 -1171860 -1064610 -1117588
8496 -1117588 -1106834 -1156771 -1171286 -1159477 -1122968 -1202442 -1180921 -1179018 -1152745 -1155909 -1139763 -1202642 -1211833 -1202674
8482 -1202674 -1172669 -1157535 -1117509 -1114246 -1076844 -1080345 -1157031 -1170703 -1205551 -1183225 -1145575 -1144255 -1103378
8469 -1103378 -1166775 -1093705 -1198750 -1237168 -1180662 -1171569 -1078498 -1181749 -1161558 -1132304 -1194876 -1152984 -1214918
8456 -1214918 -1157816 -1206625 -1130984 -1235459 -1158523 -1148567 -1141323 -1244011 -1212679 -1127154 -1224174 -1181600 -1209919
8443 -1209919 -1115524 -1185978 -1232284 -1149219 -1211957 -1173955 -1220024 -1170414 -1173090 -1163986 -1175350 -1147514 -1216568
8430 -1216568 -1203768 -1164498 -1209968 -1236609 -1149595 -1146533 -1184818 -1129573 -1150248 -1135131 -1154744 -1175213 -1095927
8417 -1095927 -1115226 -1109517 -1183346 -1173392 -1151633 -1218293 -1125139 -1186647 -1152716 -1180063 -1207291 -1147680 -1191132
8404 -1191132 -1138472 -1162831 -1160969 -1164819 -1186082 -1101244 -1243272 -1119034 -1197435 -1219140 -1162281 -1133367 -1155809
8391 -1155809 -1190587 -1173479 -1156948 -1229321 -1206531 -1204814 -1194559 -1186935 -1155613 -1195911 -1234733 -1239159 -1143487 -1149558
8377 -1149558 -1220766 -1158980 -1173812 -1242561 -1264311 -1222938 -1230319 -1217705 -1163272 -1215495 -1235431 -1159613 -1269719
8364 -1269719 -1191194 -1158344 -1179196 -1193013 -1182493 -1199014 -1209350 -1222356 -1233185 -1254287 -1182009 -1153599 -1164872
8351 -1164872 -1218109 -1214069 -1186361 -1167879 -1156916 -1127382 -1227311 -1220512 -1162222 -1209138 -1256274 -1195750 -1232270
8338 -1232270 -1189565 -1204143 -1184626 -1202532 -1263008 -1145219 -1138868 -1123121 -1191303 -1280710 -1224786 -1155459 -1162345
8325 -1162345 -1199387 -1200110 -1073000 -1152954 -1150135 -1250418 -1267400 -1292214 -1151680 -1210587 -1240337 -1244883 -1283624
8312 -1283624 -1220506 -1259068 -1242945 -1190805 -1228712 -1256496 -1167940 -1254510 -1210373 -1283912 -1277320 -1236337 -1224717
8299 -1224717 -1202279 -1192734 -1184762 -1278060 -1265635 -1205172 -1213788 -1185081 -1262157 -1283132 -1263478 -1264871 -1234453 -1276044
8285 -1276044 -1237363 -1267737 -1238458 -1237634 -1274677 -1236997 -1241341 -1243351 -1261640 -1300973 -1331863 -1241595 -1277320 -1274470
8271 -1274470 -1200581 -1188829 -1263931 -1257564 -1237408 -1320775 -1275454 -1218809 -1255356 -1306867 -1254871 -1240631 -1258961
8258 -1258961 -1234617 -1221877 -1248927 -1255633 -1214271 -1326203 -1257435 -1250535 -1244022 -1261135 -1295283 -1244557 -1261553
8245 -1261553 -1243430 -1250112 -1217154 -1271052 -1311394 -1259267 -1221572 -1312449 -1309824 -1172809 -1275434 -1207025 -1234831
8232 -1234831 -1199626 -1257659 -1252937 -1226781 -1135691 -1050048 -741276 -471454 -545351 -668905 -571530 -173357
8220 -173357 248530 105902 -300382 -495674 -518378 -385881 -518644 -822134 -1001299 -1140997 -1137041
8209 -1137041 -1176867 -1246485 -1300360 -1253475 -1249852 -1253350 -1240746 -1255841 -1191278 -1140754 -1107535 -809237 -613760
8196 -613760 -570321 -620395 -646527 -234900 58760 150069 -227405 -493539 -565818 -414356 -531038 -771566
8184 -771566 -981002 -1131220 -1260840 -1236656 -1226412 -1287851 -1260116 -1278315 -1278609 -1322202 -1343328 -1306176 -1260761
8171 -1260761 -1255664 -1224748 -1233487 -1317152 -1290985 -1371882 -1326758 -1270053 -1348336 -1343567 -1258813 -1220563 -1050289
8158 -1050289 -901575 -1253785 -1271839 -1232392 -1249047 -1340346 -1404460 -1434492 -1373103 -1393650 -1346305 -1378077
8146 -1378077 -1343116 -1353220 -1369594 -1368153 -1428737 -1346206 -1334676 -1425827 -1398000 -1406168 -1364243 -1416659 -1366421
8133 -1366421 -1340874 -1329543 -1369448 -1428545 -1378933 -1382071 -1396385 -1405351 -1508235 -1414327 -1434755 -1415697 -1395272
8120 -1395272 -1356298 -1423334 -1370002 -1340103 -1446941 -1451609 -1574809 -1436934 -1427220 -1445136 -1447970 -1463398 -1441159
8107 -1441159 -1431969 -1413235 -1473546 -1462805 -1518884 -1491511 -1433325 -1491178 -1494523 -1538512 -1475073 -1534568 -1483170
8094 -1483170 -1445699 -1527414 -1475462 -1481768 -1545671 -1572435 -1546590 -1604736 -1570510 -1621559 -1580164 -1580647 -1626218 -1620013
8080 -1620013 -1523042 -1604951 -1595422 -1628820 -1685753 -1609734 -1599499 -1600896 -1572443 -1567983 -1520600 -1560822 -1539741
8067 -1539741 -1564845 -1557608 -1543625 -1577230 -1538322 -1602274 -1634769 -1679827 -1653948 -1716179 -1777464 -1707501 -1814942
8054 -1814942 -1895991 -1698774 -1679712 -1717200 -1746031 -1719809 -1692676 -1626301 -1680972 -1635791 -1629864 -1649574 -1644857
8041 -1644857 -1757483 -1699943 -1662617 -1720607 -1615780 -1666400 -1737493 -1766988 -1749921 -1765375 -1727998 -1878758
8029 -1878758 -1802680 -1791223 -1797018 -1790029 -1714836 -1886953 -1755848 -1763372 -1827690 -1816119 -1904072 -1905756 -1935581
8016 -1935581 -1874359 -1878179 -2015038 -2141571 -2156599 -2142648 -2068831 -2126814 -2165234 -2132189 -2000228 -1850556
8004 -1850556 -2024575 -2031477 -1964853 -1749711 -1675506 -1772611 -1986492 -1939457 -1817740 -1852289 -1892598 -1969344
7992 -1969344 -2092453 -2213029 -2288019 -2271687 -2213805 -2309212 -2522819 -2599254 -2519837 -2374410 -2362396 -2242324
7980 -2242324 -1704288 -498755 421321 92626 -528364 151681 2070843 3591491 2806053 855139
7970 855139 -50400 624549 1344950 659318 -428140 -1202427 -1722792 -1934803 -1647428 -1119923 -765477
7959 -765477 -872769 -907443 -664308 256793 2354536 7663821 24829583 71784335 133280198
7950 133280198 134291107 92367600 98188934 187973920 307090089 309396268 197571759 124402000
7942 124402000 150034939 215362113 193358410 102717683 45934466 24331654 16317216 13236036
7934 13236036 11762711 10087200 8469895 7357977 7241005 7557117 8545215 11468917 20893837
7925 20893837 51723856 130788576 205499775 180922944 127229631 141491852 247443936 328146417
7917 328146417 271575743 161897441 105663618 125062936 159898904 129217146 71835652
7910 71835652 36077629 21427845 15826914 13385963 11467436 9697762 8615106 8370695 8338019
7901 8338019 6989468 5910371 5206967 5127677 5804773 6774775 6597645 5561872 4914283 5689564
7891 5689564 7193066 7035270 5445552 4085201 3617975 3977353 3866369 2973328 2400161 1827027
7881 1827027 1369558 1440937 1643432 2219397 5784714 25309782 71185662 41661648 9449734
7872 9449734 3539070 2405664 1953359 1836254 1538985 1205230 1287636 1204101 1119031 1009982 954902
7861 954902 1022219 875227 879240 790692 863215 830503 656098 465329 477762 533757 516339 438130
7849 438130 592734 1039172 1134328 501459 325384 236493 202766 122897 231254 317869 318454 234348
7837 234348 181334 150851 99562 -11070 284 -95419 -127755 -127389 -200691 -212031 -201434 -220707 -185158
7824 -185158 -222476 -182313 -169192 -207904 -84677 -85736 -48203 -122246 -137998 -164101 -173839 -262584 -253979
7811 -253979 -178192 -167773 -103214 -246416 -233159 -298536 -260209 -278605 -342436 -402066 -471685 -484783 -465033
7798 -465033 -424772 -487478 -421765 -466888 -478156 -417663 -400667 -381127 -453092 -481888 -401600 -404846 -424922
7785 -424922 -484757 -467264 -445886 -409251 -452412 -394760 -496442 -443923 -468306 -490171 -539388 -559535 -467683
7772 -467683 -527419 -517856 -533468 -477468 -498850 -425409 -398811 -361207 -290628 -320084 -270088 -334380 -423167
7759 -423167 -450352 -464681 -542424 -489648 -486496 -499420 -465219 -534426 -531372 -512567 -512237 -529363 -491616 -476995
7745 -476995 -387572 -424463 -461619 -464017 -484568 -513395 -525150 -570389 -543275 -535589 -496218 -542967 -558795
7732 -558795 -504022 -507995 -555127 -517495 -551655 -548639 -636546 -631433 -678817 -669246 -670122 -730579 -696480 -701494
7718 -701494 -715052 -650354 -653026 -653009 -654049 -622989 -648773 -644208 -634380 -568766 -709001 -635371 -534735 -659503
7704 -659503 -636092 -628958 -630030 -635348 -687495 -653392 -628820 -667317 -667802 -697317 -767651 -689571 -670179 -716735
7690 -716735 -658894 -677123 -645424 -693054 -771877 -663603 -715196 -725943 -771397 -752913 -733495 -693864 -683289
7677 -683289 -729400 -698596 -655871 -532458 -420324 -117853 123291 80371 -74139 136528 527591
7666 527591 821916 576611 132073 -32249 56727 108724 -9882 -382711 -506438 -612331 -668422
7655 -668422 -638827 -651894 -659343 -636220 -704974 -658268 -708979 -619586 -546576 -269038 39283 78015 -19693
7642 -19693 8992 394562 718120 618171 246603 15454 8899 99621 -4496 -248877 -475159 -539912
7630 -539912 -699759 -745403 -733196 -724977 -806435 -774253 -781327 -796618 -778846 -797272 -778117 -825198 -783138
7617 -783138 -766144 -720048 -753914 -765128 -726192 -729584 -786282 -808146 -841318 -743229 -794681 -752393 -836056
7604 -836056 -823228 -889231 -841167 -837661 -809351 -860182 -820140 -787475 -810467 -867991 -787224 -778082 -836892 -843092
7590 -843092 -826756 -801049 -754140 -734051 -499093 -598351 -774933 -813666 -812620 -795986 -815831 -794766 -794898
7577 -794898 -829972 -782535 -846655 -940509 -851207 -738730 -802833 -842010 -812130 -862592 -795657 -817144 -836763
7564 -836763 -799521 -869952 -867309 -812117 -878720 -831647 -758435 -794855 -813727 -871452 -824650 -912135 -814107
7551 -814107 -806276 -852043 -829002 -883335 -864338 -839650 -819353 -827066 -848307 -880860 -862340 -888378 -857331
7538 -857331 -827123 -847962 -855392 -822947 -895641 -829623 -860297 -836153 -781871 -854543 -865322 -834859 -866252
7525 -866252 -890334 -827956 -851066 -844648 -875177 -864149 -840418 -902461 -905732 -884727 -902870 -883050 -784277
7512 -784277 -878961 -911065 -924179 -768276 -854831 -869629 -850000 -868570 -894858 -881431 -969671 -794411 -881658
7499 -881658 -832434 -906069 -927946 -943618 -828838 -863524 -933477 -947936 -870378 -825376 -862156 -909327 -909868
7486 -909868 -865812 -878300 -902416 -865254 -921685 -893851 -942350 -889785 -836780 -918858 -911070 -855156 -917494
7473 -917494 -925137 -944815 -902960 -945987 -859289 -841456 -889193 -889510 -881233 -831267 -970166 -909147 -815753 -802246
7459 -802246 -925453 -918534 -977294 -920129 -984588 -924966 -869731 -915375 -965558 -962686 -921544 -905799 -947064
7446 -947064 -913593 -910934 -973659 -953751 -978589 -853220 -934107 -973935 -967530 -955610 -944460 -918517 -917461 -926838
7432 -926838 -920388 -908045 -990270 -968062 -955795 -970998 -1035208 -1007369 -976613 -932569 -928296 -964463 -938746 -944652
7418 -944652 -885846 -1015303 -953486 -941889 -924823 -989602 -932789 -930075 -941030 -962614 -920325 -992048 -955788
7405 -955788 -974050 -955961 -987310 -963582 -933499 -966038 -1024646 -1026998 -931678 -971369 -966765 -1020448 -1021045 -1045133
7391 -1045133 -928273 -994191 -970962 -928307 -964699 -949173 -924079 -984689 -1040195 -969312 -977282 -942132 -932153
7378 -932153 -933783 -994443 -1033099 -939723 -990120 -963464 -965357 -999277 -974897 -991964 -997805 -971523 -1005048 -966051
7364 -966051 -914294 -982953 -1024439 -876498 -1003890 -1044887 -929030 -953189 -933529 -1061750 -1018724 -1040492
7352 -1040492 -906631 -953224 -1085908 -943673 -1009433 -1053548 -1039886 -1000444 -1054414 -1045357 -956727 -997561
7340 -997561 -972784 -1045754 -1031896 -980910 -977145 -1047414 -1017619 -1022225 -951823 -938267 -1012677 -927648 -1053905
7327 -1053905 -977761 -1021071 -988894 -944592 -993846 -985686 -1055683 -987976 -930049 -1008930 -960977 -1008100 -959567
7314 -959567 -927280 -964859 -1034467 -1016192 -1003640 -947842 -965788 -950713 -945193 -888709 -867982 -746869 -888264
7301 -888264 -950497 -1028956 -1023062 -979524 -1036422 -1012075 -1046758 -1046737 -1004255 -1043521 -1062005 -1040465 -1093082 -1047374
7287 -1047374 -1063154 -1025596 -1032625 -1026122 -1038011 -1068990 -986074 -995930 -1052935 -1075298 -1010956 -1054683 -1043496 -1044420
7273 -1044420 -1087272 -1068970 -1087676 -1069529 -1080998 -1061213 -1053497 -1039347 -955273 -1043478 -1038185 -1036461 -1059107
7260 -1059107 -1047441 -1124479 -990226 -1047056 -1067320 -1073759 -1076559 -1044351 -1093803 -1035849 -1038279 -1036649 -997761
7247 -997761 -1051025 -1070683 -990490 -1011140 -1095832 -1021356 -1051782 -1115598 -1089193 -1070016 -1064968 -1132198 -1133713
7234 -1133713 -1009293 -1109917 -1147607 -1048174 -1107560 -1129197 -1087197 -1123555 -1144142 -1022937 -1046245 -1005467
7222 -1005467 -1042700 -1121101 -1114634 -1018086 -1084744 -1059448 -1114591 -1081107 -1143566 -1094251 -1105379 -1107250 -1055031
7209 -1055031 -1085904 -1080674 -1046609 -1100744 -1069753 -991132 -1059688 -1045350 -1038272 -1030105 -1039868 -1037223 -1077870 -1031017
7195 -1031017 -1083184 -1103275 -1069108 -1112117 -1164979 -1046386 -1094943 -1055096 -1110669 -1135529 -1105961 -1018023 -1063403
7182 -1063403 -1140562 -1115558 -1133716 -1157777 -1123826 -1119010 -1143597 -1111199 -1089856 -1109455 -1177175 -1132351 -1117913
7169 -1117913 -1092230 -1171110 -1095799 -1158095 -1118435 -1151077 -1116128 -1105129 -1081899 -1034420 -1036302 -893155 -762158
7156 -762158 -787619 -795904 -918377 -967690 -866509 -863881 -927049 -1056455 -1112461 -1100271 -1170328 -1097736 -1157608
7143 -1157608 -1069482 -1139330 -1126522 -1152165 -1125462 -1070363 -1156945 -1149334 -1068793 -1160943 -1066164 -1038299 -1135766
7130 -1135766 -1115532 -1079803 -1080759 -1088473 -1126208 -1132257 -1022147 -1045358 -1118576 -1089770 -1115634 -1133010 -1068302
7117 -1068302 -1103699 -1134626 -1064196 -999852 -947784 -910670 -745563 -563287 -551103 -399520 -549235 118739
7105 118739 686421 743704 628002 618024 1612599 1659345 1672446 1389599 1639421 1461724 1567153 1577367
7093 1577367 1527540 1229147 1714606 2074438 1911381 2106032 2207819 2699808 1875633 2300158 2410657
7082 2410657 2167059 1450534 585694 724021 351561 160256 -551898 -685784 -816343 -925935 -981626
7071 -981626 -948079 -971577 -992284 -956138 -1037929 -1032170 -1062930 -1005310 -1030690 -1012318 -1075504 -1058838 -1066715
7058 -1066715 -1089717 -1100180 -1040685 -1133355 -1092312 -1074334 -1091620 -1189232 -1146253 -1166847 -1201939 -1240481 -1099608
7045 -1099608 -1237471 -1106423 -1133524 -1156118 -1233560 -1165251 -1171892 -1121426 -1170985 -1218746 -1236302 -1198822 -1114178
7032 -1114178 -1122359 -1179362 -1164314 -1217736 -1174557 -1229248 -1257038 -1286898 -1300438 -1177409 -1208359 -1137825 -1174808
7019 -1174808 -1185987 -1109559 -1145071 -1219601 -1225202 -1196114 -1147901 -1211888 -1197178 -1178889 -1147632 -1166461 -1266226
7006 -1266226 -1233788 -1232059 -1198740 -1256545 -1257471 -1212449 -1186584 -1164571 -1158170 -1066827 -1096052 -1094279 -940201
6993 -940201 -680503 -482725 -457254 504243 1165433 1191418 1211011 2438175 2631561 2215803 2104963
6982 2104963 2359151 1876046 1234348 1401134 1281526 955605 732965 1233142 1508540 1416009 2072724
6971 2072724 2389436 2041264 2167603 2887552 2173203 1417642 848389 740185 322770 -222800 -911784
6960 -911784 -1111690 -1171544 -1147258 -1293226 -1278588 -1253346 -1269187 -1221228 -1015098 -979728 -1099025 -961654
6948 -961654 -872311 -77239 2909290 9680703 15924189 14096435 28083484 55676468 50754924
6939 50754924 44786571 34261988 49176678 35942857 31967283 10061445 2667090 1343623
6931 1343623 1067040 559903 229830 -15440 -99821 21887 114673 47871 -100426 264448 775306
6920 775306 566821 430218 372921 774116 467324 373552 365292 132798 -131439 -282914 -176119 -179975
6908 -179975 -290181 -429947 -577582 -601868 -460744 -526630 -457190 -423884 213993 3098645 10217586
6897 10217586 21043016 20861534 26947899 67617260 74871423 67440856 47880382 62644767
6889 62644767 57011875 47661860 25524678 6341031 3221582 2220639 1686990 1112182 819706
6880 819706 465098 437174 237908 11718 -180157 -296440 -292492 -409835 -317954 -120531 87480 115818
6868 115818 202089 921358 1103198 740783 294760 280455 351555 -1486 -316014 -630210 -734594
6857 -734594 -680911 -649516 -638280 -714559 -763776 -772871 -841702 -879196 -804374 -758334 -813820 -880975 -882676
6844 -882676 -893117 -754734 -682763 -404241 -345599 -437336 -730849 -900334 -943494 -905403 -953705 -941193
6832 -941193 -958708 -962154 -943063 -913583 -944839 -914696 -915879 -994331 -932278 -916206 -977203 -993471 -859620
6819 -859620 -954695 -960648 -1043378 -1045934 -1021533 -979401 -1041658 -1052453 -1044761 -1081844 -1116619 -1086427 -1124125 -1056872
6805 -1056872 -1045382 -1055791 -1040942 -1088702 -1116686 -1239076 -1130225 -1195673 -1166360 -1110692 -1095616 -1052434
6793 -1052434 -1036582 -982611 -1165496 -1136570 -1201131 -1235832 -1200639 -1230644 -1239246 -1233492 -1238578 -1157722 -1161965
6780 -1161965 -1347175 -1244046 -1183174 -1276037 -1251213 -1273564 -1269092 -1328869 -1289300 -1296950 -1268128 -1292909 -1299594
6767 -1299594 -1302520 -1293438 -1290292 -1287790 -1290945 -1275911 -1287191 -1338844 -1320901 -1365424 -1419038 -1371995 -1314108 -1391037
6753 -1391037 -1355988 -1364450 -1328452 -1331824 -1400623 -1440274 -1384611 -1445119 -1399398 -1328054 -1325783 -1372328 -1337142
6740 -1337142 -1411272 -1426843 -1442175 -1538040 -1397195 -1431661 -1407610 -1400419 -1461247 -1442153 -1401711 -1460650 -1478708
6727 -1478708 -1359841 -1341076 -1319308 -1331011 -1330474 -1335986 -1140811 -855876 -831105 -683424 -639288 -584435 -529339
6714 -529339 -656149 -733183 -901243 -972797 -911343 -839202 -777413 -605685 -512331 -507238 -679757 -650402
6702 -650402 -584073 -460662 -330017 -215262 -237246 -299586 -27456 962600 3687197 8596487 15540950
6691 15540950 25164702 36771264 48138787 56405222 56150834 49592570 39563165 31720819 31155721
6682 31155721 37854275 48242060 58274124 62857648 60915192 54206977 47624573 48144562 54395641
6673 54395641 63647879 67946966 63057961 52916389 41430011 35964617 38925060 48496782
6665 48496782 59612256 66874207 64132794 53253251 36836057 21370919 11486481 6288888
6657 6288888 4381250 5181588 9904690 19622053 24912008 29521955 61482069 54324107 42154172
6648 42154172 14424662 5625467 3894132 3719524 3615934 3566688 4095094 5445627 7990445
6639 7990445 10449668 12579322 12445667 10864431 8405314 6414492 6292641 7996981 10442275
6630 10442275 12342972 12194570 12039437 14797309 23871588 39027002 43983834 73675549 95923817
6621 95923817 77446994 48552852 21289260 16200180 18208712 22584208 26462266 27228044 23586405
6612 23586405 17688830 10971112 6075448 3931763 5538341 10896564 17324676 16792681 35467764
6603 35467764 43612319 36312362 21595208 14344932 17559272 22786889 25463034 25658135 22495752
6594 22495752 17830834 13645231 13028580 15480015 20312702 23426154 24371279 21537382 16988147
6585 16988147 12348667 9964077 10195044 11045450 11518193 12235481 15434609 22670966 25298377
6576 25298377 32809141 61945160 54608925 43811714 19927634 11719186 7934911 4952876
6568 4952876 3027987 1839636 1273667 931203 873744 683282 678467 555180 502415 276266 131747
6557 131747 102153 -22305 71068 5693 13474 22584 80122 107541 153044 511629 488533 261025 -71909
6544 -71909 -259293 -314212 -451859 -529975 -609258 -520896 -528238 -547130 -466773 -521421 -562125 -650910 -620794
6531 -620794 -679766 -675471 -680710 -565278 -541389 -376353 -219308 -314990 -388631 -463644 -191139 -271916
6519 -271916 -424653 -673662 -709460 -759427 -772684 -815734 -749756 -874801 -812453 -758629 -805850 -741088
6507 -741088 -791144 -793266 -885564 -851459 -841117 -881429 -887729 -835730 -804968 -695367 -636033 -627341 -683948
6494 -683948 -757378 -672649 -560471 -638312 -777898 -837843 -882699 -838738 -898157 -924258 -887874 -948624 -898955
6481 -898955 -887808 -859946 -914571 -874676 -886711 -889736 -837760 -930964 -963382 -864318 -947831 -871166 -871536
6468 -871536 -720082 -455548 -49940 467080 1176297 1861143 2371712 2594353 2467463 1985975 1572705
6457 1572705 1522273 1735172 2244529 2709086 2880119 2754024 2585622 2566404 2915690 3809055 4786115
6446 4786115 5505818 5566342 5017900 4236332 3524059 3609698 4240074 5298513 5860626 5722410 5023804
6435 5023804 3757404 2456219 1610810 1083577 971368 765108 717985 614212 436079 247087 222537
6424 222537 220194 267441 127092 149074 65756 -22081 -196041 -242916 -128454 79371 482888 870774
6412 870774 1373949 2101068 3344534 5645895 9774331 16157741 23642606 34025641 46591396
6403 46591396 58764537 68641581 69884640 64288768 54642440 47003243 47848842 55483545 65353945
6394 65353945 72230900 70249539 61853691 50546085 42788052 44340960 51322174 60745373 65271906
6385 65271906 62096446 54099577 44871237 40869627 44836539 52993333 61372994 62752745 55230936
6376 55230936 41187957 25641360 14114581 7736343 4925581 3781431 3189473 2924303 2748545
6367 2748545 2639892 2373840 2020768 1712461 1363349 1156879 1172362 1245255 1267026 1081404 993036
6356 993036 819472 758530 721999 923912 965813 935666 1159351 786388 390204 -100980 -219829
6345 -219829 -364014 -398106 -350053 -248158 -164538 46457 279776 392238 1032069 1058888 983604 501362
6333 501362 737581 606724 366940 -173966 -115650 -226430 -246387 -318596 -226331 -261196 -465126 -638709
6321 -638709 -699546 -667619 -780560 -825078 -822768 -864799 -632233 610932 6117701 17712737 27312397
6310 27312397 48613422 81455104 75292616 51162672 52336109 77697091 58758864 24842249
6302 24842249 7214563 4105214 2962037 2034470 1328291 990238 916361 557507 293738 184345
6292 184345 198149 110913 223816 263517 177505 127997 654813 3337573 10304779 21231103 27323023
6281 27323023 62110669 65716359 56726137 35417848 61119874 57120157 37125207 9732180
6273 9732180 3716586 2306912 1625272 1244486 945738 614904 437511 359616 278133 223342 291184
6262 291184 170957 270560 195925 111870 203674 446480 426984 406872 703674 992419 704303 456114
6250 456114 550064 574822 264790 -73372 -295721 -368794 -307248 -308225 -300248 -332828 -393445 -410967 -455808
6237 -455808 -381514 -481198 -527803 -528155 -525484 -549497 -519560 -540361 -486220 -584590 -509654 -518027 -546561 -495594
6223 -495594 -574003 -544334 -554268 -511023 -557527 -599833 -612589 -563737 -491245 -541591 -526472 -626743 -605084
6210 -605084 -613619 -537512 -618851 -675256 -699931 -728322 -688445 -609277 -706527 -657299 -653636 -763070 -755395
6197 -755395 -631222 -678379 -694851 -649267 -632459 -685456 -654984 -692639 -650366 -734646 -686703 -746106 -733943
6184 -733943 -725615 -698884 -719583 -683464 -665812 -759542 -759309 -571275 -650775 -631801 -667083 -611904 -550248
6171 -550248 -533314 -602980 -403949 -324887 -283588 -322573 -377752 -530330 -532291 -485161 -391602 -339828 -370206
6158 -370206 -319890 -392949 -472814 -520058 -460925 -378391 -279071 -374446 -334528 -484336 -533279 -499095 -412792
6145 -412792 -404405 -373701 -395097 -463031 -563382 -654358 -636096 -737918 -790400 -731019 -676432 -693967 -707525
6132 -707525 -733337 -645634 -756348 -735984 -813339 -779763 -819795 -817585 -737948 -789032 -761835 -824240 -755096
6119 -755096 -720555 -782262 -754797 -720106 -699851 -786334 -805300 -801928 -720379 -801166 -826311 -798346 -744441
6106 -744441 -776638 -794567 -881447 -798075 -763553 -726387 -786679 -830328 -813263 -812672 -817200 -782587 -762770 -729609
6092 -729609 -807249 -816781 -731842 -635536 -593476 -384861 -580515 -667590 -634682 -699590 -591689 -446712
6080 -446712 -547380 -731267 -712984 -874434 -768403 -801269 -836221 -836229 -773330 -879701 -904578 -872759 -867566
6067 -867566 -864920 -933896 -892046 -820305 -776591 -706736 -677131 -446510 -540154 -686930 -713526 -727388 -515414
6054 -515414 -498708 -635884 -808844 -815802 -824267 -882598 -879633 -849280 -828374 -909332 -928257 -897236 -900344
6041 -900344 -873868 -827930 -889259 -860600 -881409 -860100 -849941 -988341 -876621 -941096 -898323 -851521 -892532
6028 -892532 -873245 -841533 -822709 -875642 -952854 -850451 -924891 -926788 -849814 -925659 -908748 -962155 -929180
6015 -929180 -878832 -858922 -868823 -863238 -863547 -861184 -859773 -930585 -872967 -891010 -906438 -832879 -942729 -843850
6001 -843850 -863011 -927937 -932766 -897041 -986562 -903631 -904809 -934084 -891873 -919855 -944733 -918741 -975344
5988 -975344 -956554 -942263 -970575 -988601 -897887 -895113 -919038 -902202 -961404 -993108 -852369 -863707 -879546
5975 -879546 -843425 -806268 -845204 -796791 -869975 -877489 -906837 -807228 -872733 -851995 -878936 -946433 -785578
5962 -785578 -794126 -873673 -886456 -885688 -832765 -865782 -770445 -784042 -779398 -765701 -797759 -718094 -525117 -497430
5948 -497430 -419271 -111244 157528 327623 509492 516895 669103 1167546 1726075 2128750 2080732
5937 2080732 1469436 1226565 1478260 1787659 2279997 1954936 2015142 1959057 2302380 2447770 2591652
5926 2591652 2899118 4334553 5336119 6309902 5915804 4928112 4762628 5776335 6495878 6986760
5916 6986760 5204776 3797382 2980411 3115939 3201028 2551087 2529292 3003150 4101809 4668483
5906 4668483 5027833 6014080 6866367 7328261 6347560 5691086 5582058 5828797 5724023 4626939
5896 4626939 3201346 2364500 2078998 2319904 2256158 1859053 1676322 1762560 2012457 2200742 1936039
5885 1936039 1897683 1979649 2189335 2076137 1568808 934429 691665 468965 592595 302019 -42298
5874 -42298 -427227 -545220 -618777 -583229 -694088 -710105 -735245 -763245 -758648 -709657 -797918 -844448 -712992
5861 -712992 -732226 -803538 -730684 -673644 -780841 -835881 -792833 -773657 -787728 -756772 -799064 -796100 -758713
5848 -758713 -916734 -793840 -841074 -845931 -880462 -885573 -860953 -864375 -865822 -929352 -848807 -873321 -825566
5835 -825566 -869142 -816486 -841615 -834468 -825208 -958943 -973875 -832906 -820831 -921444 -888513 -875029 -833528
5822 -833528 -821828 -866234 -888666 -837026 -909367 -853541 -892932 -999879 -918842 -881654 -924791 -843944 -810313
5809 -810313 -838001 -854921 -932818 -853934 -960790 -929476 -884489 -894301 -820306 -918176 -925833 -923438 -958891
5796 -958891 -906432 -902959 -929348 -943580 -908664 -816813 -869221 -908943 -875241 -900680 -876179 -921799 -882577
5783 -882577 -971548 -965652 -932629 -899229 -977816 -945529 -921699 -918894 -884723 -858780 -916001 -940754 -924986
5770 -924986 -909886 -909130 -975773 -931093 -977458 -905401 -902988 -875726 -876470 -892840 -912898 -929188 -854537 -908634
5756 -908634 -874554 -813069 -889237 -917872 -939218 -916060 -887530 -965236 -945701 -940875 -875116 -859580 -918319
5743 -918319 -1001656 -984430 -934201 -947968 -964291 -982334 -867598 -921009 -910248 -999461 -917743 -928050 -924955
5730 -924955 -839347 -925575 -915565 -869291 -902976 -875330 -937592 -974531 -942918 -987963 -906585 -958817 -867023
5717 -867023 -781888 -744920 -686609 -366663 -331627 -537239 -853427 -865583 -905517 -891386 -845009 -852609 -932516
5704 -932516 -849807 -873857 -896328 -936728 -947583 -870247 -946000 -950486 -927235 -928154 -853036 -871099 -836342 -922921
5690 -922921 -911905 -853505 -889706 -874493 -906081 -873494 -863507 -914290 -928455 -935016 -877881 -860070 -977824
5677 -977824 -917836 -834714 -877516 -869409 -829786 -860912 -866261 -882445 -911127 -848490 -945697 -838294 -951722
5664 -951722 -947792 -857569 -952617 -1028709 -967538 -877654 -939918 -975810 -909803 -944308 -936868 -946419 -931550 -981291
5650 -981291 -940260 -1011965 -985902 -900733 -962855 -1007001 -951129 -929184 -893034 -960175 -990171 -976620 -881642
5637 -881642 -974051 -920123 -926082 -975616 -975582 -980828 -985551 -971223 -964515 -965317 -985011 -920128 -911829 -932312 -902915
5622 -902915 -939633 -976567 -984365 -1000182 -978297 -940398 -956562 -968341 -943108 -932687 -1007448 -987733 -961925
5609 -961925 -910782 -911353 -932886 -901390 -853966 -949161 -948640 -923232 -887190 -921829 -1024826 -929424 -967428 -1000855
5595 -1000855 -1009972 -983599 -953343 -945372 -950129 -936808 -939044 -983410 -975555 -975625 -989418 -983093 -996976 -1000216 -937426
5580 -937426 -935607 -938122 -933382 -964189 -972758 -981459 -919103 -930829 -910941 -969605 -956844 -1013315 -931388 -935656
5566 -935656 -984054 -999443 -953813 -960065 -944965 -984911 -932520 -928929 -873441 -918069 -980609 -905436 -854055
5553 -854055 -938561 -889536 -943842 -1006347 -1004374 -973475 -906879 -950737 -960945 -949238 -947635 -992352 -993801 -987301
5539 -987301 -969829 -945196 -939242 -959306 -993550 -963185 -912144 -916571 -944245 -1001562 -985741 -993513 -884524
5526 -884524 -984963 -960054 -898517 -957211 -950154 -949107 -978990 -959779 -892876 -968283 -983988 -997586 -970558
5513 -970558 -963172 -925502 -941805 -958581 -949254 -914858 -1008840 -1005016 -1000276 -950040 -921743 -989716 -993387 -983197
5499 -983197 -965329 -904674 -939459 -927932 -945474 -963693 -1018953 -1012137 -929273 -977012 -957476 -923709 -998876
5486 -998876 -968079 -908540 -1005722 -986752 -902425 -939708 -952984 -1008219 -901738 -923366 -968578 -975413 -965985
5473 -965985 -1002454 -1004948 -915115 -955390 -913327 -979478 -961981 -1015963 -942680 -1016282 -1006640 -1032909 -1063661
5460 -1063661 -979308 -941726 -914596 -942556 -926561 -923985 -943817 -1153155 -1012125 -1001185 -1145762 -908695
5448 -908695 -983374 -942111 -968255 -1042811 -911540 -1018263 -926980 -1065231 -1096508 -1032323 -1149978 -1057861
5436 -1057861 -967089 -1042112 -882492 -997342 -682095 -761076 -932303 -1077796 -1059048 -1192278 -980463
5425 -980463 -808739 -1128233 -758325 -689387 -801892 -2488842 -743149 -1065821 -1044965 -878918 -1381374
5414 -1381374 -1048689 -978294 -1185908 -956685 -1258780 -907181 -1034564 -919565 -978495 -946019 -1036057
5403 -1036057 -1106923 -957869 -945606 -928095 -919516 -976954 -974229 -934548 -910367 -1030238 -979761 -1050341 -976157
5390 -976157 -1001968 -943524 -1037836 -1026822 -1004182 -946445 -991673 -990844 -915656 -1016162 -986940 -1071447 -939979
5377 -939979 -1014629 -1137598 -1022873 -900641 -1003077 -959344 -1009973 -1025490 -937164 -1020731 -992052 -1033279
5365 -1033279 -980364 -914666 -930989 -959400 -938437 -1012117 -918153 -891014 -1019219 -934239 -1002329 -868365
5353 -868365 -1066709 -1014027 -972257 -1024572 -1141611 -970905 -946693 -1010426 -1031437 -973349 -1021604 -1029921 -937596
5340 -937596 -1004563 -970406 -994489 -1048982 -1037944 -1063524 -982354 -1026014 -1011255 -1047356 -1053382 -1009254 -1065620
5327 -1065620 -991577 -1002131 -994874 -1050099 -992482 -1001987 -1053034 -1080223 -992596 -995272 -1006867 -1059604 -1093629
5314 -1093629 -1028032 -1028578 -969057 -1028612 -991287 -1058496 -1012716 -969771 -1040457 -1027180 -987878 -946911 -999850
5301 -999850 -1053015 -973375 -1050764 -926497 -1022945 -1002964 -1005941 -1052405 -983345 -997518 -990803 -1000279 -1060793
5288 -1060793 -1010517 -1001185 -1017325 -1016101 -959728 -975962 -963886 -995581 -1016390 -1054266 -1037606 -1006616 -984303
5275 -984303 -1003306 -1064578 -1134534 -1021380 -1019231 -977786 -1027476 -1030467 -1032429 -1063731 -1030327 -987435 -1045947
5262 -1045947 -991975 -1010101 -1094977 -1011061 -1017863 -961977 -976761 -974507 -1080180 -1007405 -1072996 -1058146 -1068879
5249 -1068879 -1041623 -1059124 -994875 -1003877 -1014141 -1069483 -942519 -999335 -974549 -979001 -1016551 -984621 -1023239
5236 -1023239 -1076629 -1035152 -1000550 -1080736 -997594 -971448 -1000059 -987097 -950686 -957149 -994914 -1001176 -1018582
5223 -1018582 -1088899 -1043632 -1061064 -1007029 -993503 -1048924 -1074989 -1022881 -962233 -1028875 -942034 -966303 -1050645
5210 -1050645 -1054051 -1087833 -1056846 -1119809 -1024969 -1036511 -1039197 -1040731 -1028652 -1004872 -1027654 -990094 -1082491
5197 -1082491 -1013868 -1054938 -1028581 -1016706 -935102 -990229 -1061200 -1040257 -1035040 -1006643 -1003320 -1084520 -987577
5184 -987577 -1077106 -1043994 -1066567 -1007225 -1072305 -1040032 -1003404 -993275 -1046264 -1048006 -961345 -1044083 -1043003
5171 -1043003 -1026357 -1007544 -995015 -1078284 -1023347 -1071401 -984996 -1002529 -939828 -1003754 -980865 -1066239 -1020126
5158 -1020126 -1008376 -1016790 -1025574 -1035765 -1015373 -1029001 -1003325 -1001502 -1016983 -1019531 -988297 -1030618 -993646 -968923
5144 -968923 -1007677 -1099942 -938530 -1014313 -1057224 -995521 -950293 -1116241 -1013330 -987788 -990620 -1108920
5132 -1108920 -1023542 -1049952 -1052453 -1032847 -1035730 -1019082 -1037115 -1029847 -1014246 -971089 -1036461 -964214 -1011733
5119 -1011733 -965774 -1022112 -992343 -964303 -1000340 -898538 -867178 -955083 -840777 -893260 -869493 -899049
5107 -899049 -995029 -921543 -998405 -983261 -999644 -1079792 -975547 -1032833 -983088 -1012031 -998188 -988459 -1011406
5094 -1011406 -1057921 -1076157 -1106055 -1019185 -1059763 -1028520 -1012026 -947394 -1019385 -1013556 -1069134 -986816 -929722
5081 -929722 -1066862 -1058830 -1027648 -1029141 -1075284 -1050600 -1089230 -974738 -953212 -989237 -1090523 -1028364 -1011321
5068 -1011321 -936407 -1030431 -1099653 -1070023 -1026330 -1048544 -951696 -1074789 -1059500 -1041112 -1044218 -1016488 -1036110
5055 -1036110 -1000654 -997414 -1062260 -994127 -1081981 -1043575 -1037750 -1030125 -1036615 -1058065 -1032546 -1006721 -1042910 -1037630
5041 -1037630 -1039126 -1029801 -963398 -998628 -1049425 -1049123 -1061277 -1021325 -1084884 -975122 -1064740 -1111510 -1084598
5028 -1084598 -1100290 -1072363 -956527 -1068375 -1087806 -1074613 -1019132 -1109273 -1020610 -1014540 -929315 -1048314
5016 -1048314 -980169 -1039651 -1103386 -990698 -1151412 -1145766 -986188 -1025449 -1028184 -1050270 -1089070 -1002208
5004 -1002208 -1157868 -1072428 -1055194 -1001091 -1011606 -1122014 -1028712 -1085140 -1040367 -1036403 -1141454 -1081546
4992 -1081546 -1023106 -1021392 -1056955 -1086522 -1157695 -1109387 -1115934 -1040050 -1031103 -1088122 -1086896 -969544 -1026152
4979 -1026152 -955225 -1059448 -992914 -1054120 -1055273 -1115484 -1004328 -1107956 -1037055 -1063440 -1082007 -1125288
4967 -1125288 -1091247 -1035626 -1035501 -1056803 -1072055 -1013435 -1052015 -1043299 -1046220 -1083612 -1020809 -1126753 -1060816
4954 -1060816 -1040899 -1069430 -1052147 -999773 -1092236 -1088501 -1043272 -1051111 -939093 -917228 -1013040 -944408 -942180
4941 -942180 -1002543 -965427 -1010259 -1015316 -967264 -1002684 -1102638 -966080 -1047038 -996629 -944158 -943274 -1016776
4928 -1016776 -943268 -929095 -955388 -1005775 -1027527 -1114311 -1034280 -1106653 -1063621 -1066249 -997653 -993740 -998589
4915 -998589 -1059325 -1007267 -1104553 -1139250 -1169594 -1101564 -1067002 -1139975 -1116984 -1034773 -1039063 -1071970 -1098419
4902 -1098419 -1022601 -1083816 -1038580 -1022530 -1079174 -1059873 -1064308 -1064890 -1066514 -1100189 -1074478 -1058131 -1129427 -1156311
4888 -1156311 -1128581 -1135106 -1111479 -1102331 -1075863 -1108542 -1112820 -1141160 -1073168 -1051970 -1060373 -984012 -1052057 -1011368
4874 -1011368 -1084670 -988713 -1035744 -1036934 -1027203 -1014434 -1044532 -1076173 -1007947 -1102631 -1070078 -1066473 -1085354
4861 -1085354 -1062984 -1091940 -1150408 -1081076 -965663 -1074760 -1090340 -1111269 -1126143 -1130433 -1056244 -1105216 -1104250
4848 -1104250 -1070778 -1063841 -1080459 -1069266 -1034707 -1002311 -1061473 -1107346 -1009258 -1015342 -1078412 -1074315 -1088417
4835 -1088417 -1074376 -1117579 -1148218 -1203609 -1237614 -1074962 -1052635 -1094349 -990064 -1055875 -1111102 -1150013 -1146056
4822 -1146056 -994635 -1110339 -1105904 -1127350 -1044207 -1119894 -1126044 -1008439 -1146585 -1094309 -1085847 -1083234 -1004506
4809 -1004506 -1039307 -1081339 -1111511 -1094449 -1069660 -1129776 -1120057 -1153439 -1065941 -1085967 -1090864 -1103362 -1105299
4796 -1105299 -1143403 -1117337 -1098335 -1084632 -1033293 -1098725 -1124299 -1133915 -1032208 -1065705 -1033054 -1044493 -1076148
4783 -1076148 -1136781 -1089385 -1128561 -1089072 -1111948 -1179197 -1120970 -1109829 -1092602 -1104058 -1153392 -1049418 -1108025
4770 -1108025 -1102621 -1181281 -1031105 -1128852 -1142290 -1107686 -1143133 -1082049 -1106363 -1135100 -1050560 -1117189 -1105607
4757 -1105607 -1152078 -1065164 -1041845 -1082608 -1089587 -1061113 -1118936 -1133314 -1122727 -1147631 -1019981 -1051368 -1156023
4744 -1156023 -1084165 -1147248 -1210301 -1159416 -1107922 -1112480 -1128250 -1089951 -1140061 -1085038 -1069084 -1141007 -1249633
4731 -1249633 -1164956 -1210004 -1160397 -1120015 -1131264 -1043805 -1078271 -1077717 -1040087 -1131651 -1099196 -1146328 -1126573
4718 -1126573 -1192214 -1184922 -1162608 -1057113 -1096454 -1146759 -1115850 -1089471 -1111878 -1127017 -1145081 -1105214 -1074173
4705 -1074173 -1167391 -1177103 -1153077 -1091000 -1152821 -1147507 -1179137 -1092028 -1014338 -935078 -855931 -818751 -921881
4692 -921881 -1078458 -1154998 -1151356 -1081307 -1082166 -1110044 -1070182 -1107726 -1061095 -1098025 -1003979 -1000135 -971424 -924460
4678 -924460 -832337 -796083 -560845 -277920 -257618 -392918 -424068 -408133 -363706 -314563 -559184 -672788
4666 -672788 -850088 -904265 -961986 -975716 -988085 -981669 -966524 -900883 -762238 -699926 -375940 -308224
4654 -308224 -167907 -187789 -7008 156760 211763 196889 40388 -193473 -321042 -584724 -687925
4643 -687925 -867340 -963731 -972246 -1007440 -1013344 -964367 -966569 -974447 -946191 -775411 -661496 -626523 -495287
4630 -495287 -420685 -325807 -427279 -563140 -776630 -806639 -879643 -862640 -993568 -925957 -1057598 -1057336 -1056523
4617 -1056523 -1092791 -1169631 -1255394 -1231379 -1185257 -1230976 -1195826 -1187305 -1162125 -1146698 -1178819 -1165865 -1138643
4604 -1138643 -1185914 -1133005 -1175979 -1135005 -1135130 -1193835 -1139556 -1179093 -1249508 -1257469 -1225805 -1204355 -1344576
4591 -1344576 -1333829 -1305267 -1214372 -1222058 -1259019 -1214399 -1263428 -1227003 -1174411 -1209658 -1225305 -1242662 -1174338
4578 -1174338 -1158516 -1222194 -1087857 -1167834 -1186681 -1267452 -1183301 -1159106 -1248192 -1213566 -1222247 -1220861 -1266133
4565 -1266133 -1170179 -1194293 -1135410 -1191967 -1208456 -1243487 -1209789 -1147460 -1128763 -1105885 -1109607 -1080800 -1154365
4552 -1154365 -1170141 -1105136 -1081645 -1180817 -1230337 -1239588 -1267501 -1315246 -1396668 -1372748 -1311482 -1267975 -1271242
4539 -1271242 -1133693 -1037863 -1069460 -975224 -926895 -897267 -859515 -784973 -797819 -845771 -958883 -1033857
4527 -1033857 -1022661 -1111254 -1100396 -1085291 -1094870 -1073299 -1117326 -1178530 -1127544 -972168 -994746 -846987
4515 -846987 -744171 -606705 -470253 -341678 -146624 232800 652742 1156047 1710063 2256640 2555477
4504 2555477 2477098 1938116 1232337 567812 193588 60374 77904 31092 341490 505004 879077
4493 879077 1334249 2018711 2765322 3859672 5154687 6790774 8861083 11392269 14896482 20171072
4483 20171072 28911365 43645031 64926614 91669440 123641867 157905183 178280150 167513940
4475 167513940 129266742 85985797 54975895 37988036 29571610 24751901 22336692 21967131
4467 21967131 23716127 28202833 36504025 50192099 70395822 98800182 136438926 180266238
4459 180266238 221707159 253449107 270467944 267300892 244556900 210202765 171126524 130784470
4451 130784470 93617386 64914200 46173739 35286041 28761741 25143161 23811193 24664166
4443 24664166 28232057 36293701 50559752 72119906 98985703 131268493 166029698 186836275
4435 186836275 175740839 135808405 90165671 56717871 38191975 28318427 22060623 17440336
4427 17440336 13852259 11177126 9293574 7683772 6244320 5038128 4160669 3536951 3233106
4418 3233106 2999019 3022336 3278932 3901319 4835001 5780259 7089662 8852788 10240674 10361874
4408 10361874 8761972 6217588 4046646 2970971 2206885 1716110 1245750 859824 780231 590031
4398 590031 518234 420864 352256 409182 476546 333284 365681 373349 321372 268143 244947 221821 312254
4385 312254 274749 90288 56337 -51320 -94895 -160695 -287385 -296798 -374334 -426422 -377241 -346033 -338991
4372 -338991 -399272 -294335 -228921 -310206 -374543 -395650 -546766 -609622 -634235 -680297 -698959 -767755 -770688
4359 -770688 -730842 -758881 -814367 -783733 -917365 -1022569 -1139672 -1124736 -1232485 -1124172 -940155 -858253
4347 -858253 -835928 -851320 -924414 -812720 -808493 -777285 -804335 -809999 -770095 -806702 -844725 -788792 -862927
4334 -862927 -742652 -837332 -800959 -817282 -792779 -897484 -963838 -986529 -1007651 -913008 -909459 -931884 -885091
4321 -885091 -867917 -870785 -823384 -827842 -848052 -853559 -890562 -857722 -836091 -796744 -829030 -784725 -762042 -842194
4307 -842194 -787512 -899828 -982797 -924268 -1052899 -1069487 -1098013 -1086242 -1052497 -971909 -928517 -866398 -843571
4294 -843571 -882378 -924777 -946627 -973042 -925716 -940623 -989283 -976986 -1079044 -1232992 -1467915 -1638780
4282 -1638780 -1754534 -1563819 -1151058 -611039 -459178 -426084 -383929 -234212 -118379 -14863 338724
4271 338724 692773 786037 526016 7500 -440444 -428471 -226382 -17011 215619 395912 523041
4260 523041 650466 618262 689999 624202 498511 445799 385387 347202 458077 893262 2056794
4249 2056794 4533116 8017812 11325810 13359765 16486948 20358225 22569563 20540077 14282182
4240 14282182 8366263 3976495 2168385 1805317 1906887 1904681 2037930 2512724 3408663 4050701
4230 4050701 4622433 5318619 6898336 9583041 13137518 19241798 31117787 52006622 104100476
4221 104100476 210984396 367140923 505973566 670521433 952312592 1202344958 1293920370
4214 1293920370 1034501893 655358254 322629844 147058629 90848765 64950687 47281003
4207 47281003 34539895 26211161 20790077 17441421 14779891 12635120 10809460 9312881 8383401
4198 8383401 7847930 7731573 7842478 8391158 10024504 12445912 14333362 15628493 18332892 21534201
4188 21534201 22608051 19449599 13252783 8034619 4567101 3302667 2770319 2498538 2398934 2261279
4178 2261279 2052237 1817719 1719056 1696203 1595259 1524293 1260503 1107831 883336 679802 557978
4167 557978 742089 1013671 1196781 1167360 1078469 804740 869762 648292 667704 661493 772297 693958
4155 693958 756198 733304 871539 944323 1196926 1608422 2112713 2152131 1990304 2192371 1412443
4144 1412443 783446 54719 -55272 -33169 -107269 -94351 -307891 -324285 -363957 -412458 -295432 -202821
4132 -202821 -141069 -163742 -156252 -299687 -290054 -409531 -482255 -456305 -568943 -653976 -519536 -608720 -618457
4119 -618457 -550715 -572658 -505891 -483784 -568350 -553614 -634717 -622529 -581119 -625204 -577681 -400045 -431498
4106 -431498 -336609 -347849 -417817 -442822 -510060 -568744 -674268 -583960 -709341 -728745 -765004 -787227
4094 -787227 -927156 -1170045 -1235888 -1193409 -906833 -814340 -750304 -846399 -756835 -746734 -540180 -339374
4082 -339374 -259156 327664 593720 490264 494414 728111 1609631 1807485 3940514 5753455 4589740
4071 4589740 2539854 95251 -499222 -709210 -671442 -915182 -829369 -733798 -749185 -795293 -746857
4060 -746857 -624074 38718 1547271 3713499 5611213 4887316 8065783 11554389 7919846 5143299
4050 5143299 584228 -589598 -901137 -1052181 -569509 -457678 -704312 -537976 -337658 -18960
4040 -18960 -355161 -464149 -572930 -649638 -53896 -365293 1766491 3004331 6044088 29886526
4030 29886526 96559498 220162691 253323318 285178687 693019433 596293895 499529688
4023 499529688 167948851 39115072 24333237 21459515 17279837 14233276 12400605 10853114
4015 10853114 10117219 7446113 4896755 3321804 2230793 1883554 1444206 1724350 1764064 1581136
4005 1581136 1558387 1940569 3770903 5199377 6012825 5065732 9488001 10472095 7565515 4287985
3995 4287985 906063 539855 345482 296388 211370 236639 169393 -9901 -178382 -161797 -213094
3984 -213094 -71481 -85668 174629 404488 1190940 2007112 2567588 2920925 5477908 4782569 3484625
3973 3484625 1228604 129571 -78938 -320972 -314362 -91276 -187417 -167812 -120692 -48695 21151
3962 21151 -197062 2359 45347 465322 593223 862702 1611380 1885131 6827979 25810192
3952 25810192 69201984 120931631 122403289 259488361 325516913 251059778 122142726 26961668
3944 26961668 12037622 8726509 6433079 4251443 3006450 2083275 1684715 1500789 995046 1026922
3934 1026922 935988 959250 975378 1666991 2189959 1824632 1173729 425381 659468 1499731 2492802
3923 2492802 2465307 3530615 5113972 3925443 2145196 176171 -178473 -482115 -519627 -333825
3913 -333825 -324459 -316088 -280180 -56872 940186 3269700 6836128 10094270 10463186 15650451 20395549
3902 20395549 15350621 9111351 2153973 -160272 -630355 -745445 -185062 9994 -202181 178083
3892 178083 657635 1138317 899471 768735 656153 730376 1467944 1790928 4970335 7970597
3882 7970597 14484055 51340147 156703446 347723138 449827970 588352167 1124731201
3875 1124731201 1096683981 798174654 307987957 78479940 44695477 35350584 26915420
3868 26915420 18619774 12961737 9740823 8905935 7556584 6152458 5470776 4489349 3716773 2897750
3858 2897750 3299746 3400287 3173308 2908048 3583513 5827296 8614933 10464369 10908929 16990645
3848 16990645 18779610 13985437 7541634 2421903 1403511 1088937 1062618 1053566 1006441 1101352
3838 1101352 884736 555480 665621 626803 701401 646548 555997 263668 81982 -45344 27983
3827 27983 352853 1202154 2121095 2139409 3590774 4341312 3372365 1967960 540900 414595 502687
3816 502687 354885 254193 359297 426150 563904 764354 783831 1067518 1121855 492503 -253543
3805 -253543 -478852 -353329 -332241 -312383 -303518 -176887 -214828 -348139 -343737 -328264 -261918 -279745
3793 -279745 -142025 -90713 -182276 -196568 -180481 -243776 -307194 -325417 -392690 -484214 -584135 -544482 -530774
3780 -530774 -547640 -512628 -420047 -415023 -407260 -461610 -363804 -336724 -435676 -393881 -333243 -314373 -342349 -337698
3766 -337698 -376921 -369065 -366570 -362209 -395467 -507181 -505622 -592219 -557191 -503465 -499777 -465885 -562819 -480475
3752 -480475 -365696 -374967 -281370 -55751 235968 303440 909729 1135136 835522 248595 -125872 -180174
3740 -180174 -69057 74450 -97175 -255748 -465939 -492524 -411428 -525972 -498816 -531692 -615753 -504345
3728 -504345 -498254 -551475 -516065 -550190 -591780 -530938 -588982 -614269 -440944 -561199 -496377 -523677 -526223
3715 -526223 -609731 -591578 -545031 -487043 -581528 -540857 -486638 -576407 -489956 -560100 -563412 -655897 -580061
3702 -580061 -548906 -494272 -527620 -569511 -493222 -551765 -674647 -606280 -530738 -525445 -546392 -557677 -671046
3689 -671046 -624048 -637750 -638458 -630271 -626950 -559230 -605653 -638550 -564336 -575527 -476131 -217396 368862
3676 368862 1334775 1759219 2923470 5557341 5011631 3264081 735968 -261534 -319014 -310007 -200634
3665 -200634 -78602 792 189067 303991 -65387 -432556 -543825 -516359 -527448 -550708 -542416 -599093
3653 -599093 -569233 -606428 -632808 -593186 -510908 -276147 -15102 233192 746493 1310114 1055999 232646
3641 232646 -318928 -459794 -574576 -537373 -543684 -522564 -564736 -614742 -549750 -519361 -446434 -473885
3629 -473885 -368074 -144587 -50487 239117 550533 331558 5872 -259859 -203520 -179613 -186606 -167670
3617 -167670 -274732 -147564 -194430 -187653 -204160 -262774 -333230 -324964 -394291 -517329 -552034 -490593 -460332
3604 -460332 -550213 -567372 -629646 -625619 -654071 -600788 -681758 -654472 -687791 -659360 -738768 -663657 -773285
3591 -773285 -720010 -688398 -695398 -594020 -650415 -684113 -743296 -739006 -722999 -743559 -758314 -729260 -737424
3578 -737424 -726440 -698748 -713686 -653301 -764103 -777893 -746325 -709511 -644463 -693332 -699133 -744336 -720238
3565 -720238 -748421 -752044 -746565 -747427 -734836 -741729 -738937 -787095 -790856 -832194 -808225 -795197 -708033 -747597
3551 -747597 -784769 -728792 -789899 -812656 -786728 -804188 -825862 -826154 -837032 -815988 -740659 -864323 -759372
3538 -759372 -757752 -733376 -747530 -805388 -793019 -809504 -887482 -800636 -780653 -759940 -679977 -712470 -754564
3525 -754564 -821859 -682657 -784190 -733613 -838013 -764495 -729494 -748294 -811877 -714654 -834547 -843539
3513 -843539 -785531 -693573 -832566 -787756 -795695 -779387 -775173 -834142 -819296 -817842 -761507 -766850 -740964 -743805
3499 -743805 -813378 -758024 -810358 -759892 -756376 -819033 -903502 -762839 -798383 -782639 -859364 -838750 -800485
3486 -800485 -833401 -795237 -785865 -755311 -813887 -853223 -844848 -794553 -721646 -757211 -757764 -749727 -706998 -627543
3472 -627543 -582039 -614167 -629986 -694296 -743219 -634986 -623204 -607707 -513495 -429425 -297301 -264704
3460 -264704 -48371 288101 497345 638940 964167 1314412 1489430 1486520 1489322 1982259 2318678
3449 2318678 2495873 2660269 2821399 3195845 3853673 4179938 4054011 3543777 3670692 4141161 4391545
3438 4391545 4066408 3678848 3863766 4939452 6607610 7910919 11509147 14879583 18840449
3429 18840449 22114313 28614004 34287947 39610401 42589063 47595433 51899403 57787683 63424868
3420 63424868 69379462 71994292 76146699 80550102 82624509 81511821 80352892 79008643 75983005
3411 75983005 72125257 68310735 65621885 59465645 54637378 48913474 44347715 38422380 33420877
3402 33420877 26392117 21449140 15827150 13900204 9814168 6614330 3675267 2621716 2254464
3393 2254464 2100348 1872602 1576185 1603941 1490112 1413715 1346181 1203291 1112783 1029026 843743 769525
3381 769525 766422 626542 471551 370328 288646 173048 49839 -57301 -154148 -237311 -254906 -319017
3369 -319017 -410610 -418647 -490249 -478120 -448089 -476157 -467941 -432755 -463103 -435713 -450556 -453775 -457086 -467837
3355 -467837 -438248 -433201 -455775 -454434 -445597 -384227 -388326 -349932 -261237 -360629 -364736 -450373 -465598 -588343
3341 -588343 -553656 -516178 -407504 -353371 -282012 -272224 -321515 -495821 -556668 -671778 -661615 -632474 -619897
3328 -619897 -561041 -554553 -565420 -424988 -493543 -463747 -423479 -353912 -429295 -469509 -544438 -690657 -639129
3315 -639129 -615300 -484414 -427744 -278092 -192960 -136149 -177115 -286451 -351278 -493420 -562298 -455353
3303 -455353 -332722 -269247 -277593 -133356 -229075 -238585 -239637 -270121 -303040 -327574 -227365 -237454 -304834
3290 -304834 -248472 -239290 -290913 -343449 -383632 -351204 -373003 -470281 -517399 -507812 -490915 -545704 -591970
3277 -591970 -546157 -532773 -478951 -347466 -429692 -427891 -386641 -286188 -285403 -269087 -182692 -211930 -222984
3264 -222984 -210285 -160390 -262510 -221911 -277340 -202825 -332688 -315057 -304160 -291603 -146668 110458
3252 110458 597881 1199365 2628273 4204732 6438201 8258909 11284997 13369708 16707688
3243 16707688 18264126 20752494 21999218 23826147 24103445 25040992 24768660 24420467 23828462 22662096
3233 22662096 21464145 19224217 17424633 14962839 12898560 9602218 7313262 5015550 3466667
3224 3466667 1917937 1019619 506172 281581 171743 115880 125055 59659 121005 192730 220688 265503
3212 265503 343257 310614 292572 254260 342448 322798 309615 244626 160028 164340 171687 111593 97104
3199 97104 119839 211590 202086 289226 239606 106209 -238765 -302722 -413346 -317698 -230448 81921
3187 81921 626341 1135616 1402286 1621736 2440897 2506048 2360936 2682844 5246871 6235489 6268128
3176 6268128 5710891 8388007 9253387 9773045 11256325 17907853 26310217 37010735 44035501
3167 44035501 39811120 25903390 13135340 6940468 6316848 9934290 18074829 31085318
3159 31085318 49128471 68492593 77538200 66389497 41780712 20374372 9772103 7241937
3151 7241937 9256371 14082118 21461943 32206866 44599183 50119080 45169020 38727925 39161061
3142 39161061 40450650 34675440 24581273 17321705 14729941 15725910 20482585 29528970 42062345
3133 42062345 57092760 69714468 70880678 56719728 36471125 22005733 16749131 17601906
3125 17601906 21611493 28574144 38178025 47298479 50608487 45231529 34844346 26698666 23347653
3116 23347653 23294927 24644791 26070500 27205669 29216986 31647279 34529746 37339946 40905071
3107 40905071 44464782 49006171 52588234 55571550 58070692 60372419 64711643 67000747 70605691
3098 70605691 73480737 77188519 79539460 81465917 80213772 79325679 77436998 75009118 71689091
3089 71689091 67586289 62759056 59428709 54173037 49270915 44106154 39576777 35561954 30579232
3080 30579232 26391880 20897282 17254491 13246652 10979413 8478483 6893967 5980053 5727197
3071 5727197 5829366 5895552 6096889 6239726 6518158 6578495 6751419 6910601 6960380 6859943 6820310
3060 6820310 6671522 6459404 6134991 5717936 5483980 5125544 4664854 4248126 3773022 3439778 2947458
3049 2947458 2532272 2080137 1640727 1179284 777552 516027 262924 44654 -25540 -163001 -81258
3038 -81258 -42918 -161064 -131241 -53192 -117717 -109541 -239682 -109387 -151936 -175623 -267525 -229394 -301173
3025 -301173 -298419 -334318 -349427 -433030 -464215 -409180 -491713 -480314 -533156 -538207 -582409 -578753 -528370 -527386
3011 -527386 -583793 -605250 -543585 -652349 -585878 -520219 -643791 -571406 -533400 -529031 -517777 -532569 -475968
2998 -475968 -584374 -445015 -506792 -478107 -492274 -430200 -486331 -491480 -498771 -491261 -405130 -395034 -317120
2985 -317120 -337334 -269554 -364633 -487754 -458577 -417402 -352764 -201914 200381 717056 1052679 1416903
2973 1416903 1767429 2063325 2441464 2671505 3104550 3501613 3725059 3955837 4530768 4858219 5100895
2962 5100895 5325244 5549733 5563437 5589578 5416673 5440916 5214817 4604511 4474434 4311171 3893929
2951 3893929 3446435 3298381 3121496 2817364 2237632 1858111 1530985 1018788 583140 375010 220083
2940 220083 148540 276498 372225 675583 1099458 1408061 1226988 574841 -17985 -207219 -229697
2929 -229697 -82711 228058 632806 1182678 2081226 2727595 2500348 1604905 575571 -36366 -328662
2918 -328662 -217767 -120530 195811 653528 1349768 2075868 2695131 2701714 2118495 1664786 1677320
2907 1677320 1790078 1457909 961257 888305 1161246 1715494 2675566 3492934 3647618 3300063 3386512
2896 3386512 3694567 3234846 2101173 1235497 800231 834334 1292706 1760622 1937338 2026555 2176198
2885 2176198 2787862 3048837 2678545 1603224 644957 87170 -66005 -90940 -52775 446706 892188
2874 892188 1535125 2375092 2768005 2139099 992087 114654 -212271 -367441 -285329 -200981 74530
2863 74530 345474 718962 961036 862397 242897 -266096 -477350 -539959 -555648 -648863 -716680 -587971
2851 -587971 -633787 -599574 -625416 -607459 -650732 -715864 -646575 -673852 -629666 -609357 -665891 -644254 -620924
2838 -620924 -709231 -710284 -713002 -706534 -660448 -690315 -691180 -699452 -626314 -728865 -722260 -752397 -681803 -649550
2824 -649550 -713021 -713820 -702284 -685690 -691957 -724471 -665273 -704497 -677819 -669360 -716978 -679619 -637089 -723469
2810 -723469 -667083 -716673 -709890 -724428 -678404 -736241 -658327 -768880 -704955 -694294 -617993 -731107 -770227
2797 -770227 -675812 -673557 -670831 -702835 -647298 -643352 -700130 -643135 -697924 -684294 -711821 -671780 -626273 -685774
2783 -685774 -713372 -727633 -660239 -669128 -705060 -603008 -722264 -610028 -579408 -614471 -632495 -703596 -710993
2770 -710993 -589760 -675257 -624190 -619765 -673866 -695353 -639038 -665957 -637388 -601792 -512627 -592632 -652329
2757 -652329 -638526 -569152 -513420 -592064 -624049 -598883 -645474 -638758 -595877 -644107 -669281 -622870 -578531
2744 -578531 -631120 -609976 -510404 -598998 -595537 -610783 -661947 -593832 -546972 -637605 -572050 -583583 -606104
2731 -606104 -624111 -618931 -592533 -598513 -588749 -628414 -595893 -617160 -580685 -546490 -570759 -559980 -582763 -605676
2717 -605676 -651352 -552719 -556610 -558291 -629383 -559484 -572120 -595397 -557155 -530747 -631594 -606386 -582839
2704 -582839 -587827 -593179 -545186 -600339 -591823 -545750 -541954 -532883 -593493 -586791 -638210 -613322 -567594 -586793
2690 -586793 -645051 -629226 -701001 -627413 -600107 -660334 -610007 -649083 -649240 -633360 -612944 -583266 -635490
2677 -635490 -608822 -578351 -611559 -578767 -648124 -600766 -611180 -516059 -574227 -548454 -519694 -464472 -387325
2664 -387325 -458100 -557012 -610690 -625844 -609409 -590932 -540761 -606165 -650875 -597689 -604510 -590821 -650016
2651 -650016 -645425 -648502 -525361 -531151 -508823 -501791 -367313 -237012 -220948 -308218 -344999 -543977 -659772
2638 -659772 -707868 -682332 -648342 -666886 -671976 -629057 -632955 -709837 -665779 -666692 -597650 -657804 -668112 -629703
2624 -629703 -550234 -442139 -526186 -420042 -364585 -473993 -493153 -634097 -686598 -638749 -705821 -660771
2612 -660771 -752261 -693005 -703701 -697727 -650793 -667079 -733777 -736797 -753993 -641971 -666592 -695809 -732250
2599 -732250 -715326 -742892 -747826 -636846 -661123 -756996 -697461 -673469 -646830 -677427 -695878 -655895 -639948
2586 -639948 -701529 -685461 -721672 -682700 -686286 -598439 -635913 -667568 -696849 -678795 -684032 -686946 -716374 -630556
2572 -630556 -744959 -663053 -686379 -614006 -622269 -645307 -628783 -623595 -621832 -624293 -600176 -534542 -601174 -586200
2558 -586200 -672111 -628872 -624406 -683588 -626474 -628362 -640114 -633017 -621455 -622808 -590730 -676969 -582942 -593852
2544 -593852 -577912 -651355 -642027 -657963 -661659 -625091 -662143 -678433 -646715 -677344 -647216 -607237 -623975
2531 -623975 -601188 -598699 -593156 -595772 -651042 -636707 -592944 -654829 -597019 -636153 -601527 -592345 -702229 -723204
2517 -723204 -664098 -723502 -637570 -660974 -599750 -654962 -706337 -636895 -682775 -687332 -748129 -655420 -658161
2504 -658161 -702152 -610856 -631511 -571924 -662716 -704889 -658306 -643781 -566211 -658866 -447059 -344986
2492 -344986 -170188 -146 166983 300880 158707 60376 -206808 -355037 -468076 -554908 -507701
2481 -507701 -470690 -522252 -522207 -655289 -658453 -680623 -657321 -638622 -728614 -644273 -575927 -570602 -561996 -565607
2467 -565607 -630820 -541064 -557424 -538677 -443013 -421184 -376341 -373972 -526233 -546045 -542080 -588329 -572409
2454 -572409 -623587 -592639 -493885 -586824 -534307 -489823 -439014 -449431 -445639 -498721 -487802 -533762 -482574
2441 -482574 -531201 -525886 -508001 -545842 -545261 -552862 -543986 -539332 -483384 -601097 -575239 -533783 -534875 -481700
2427 -481700 -406546 -428732 -352054 -370223 -376738 -473525 -395028 -403253 -441726 -439655 -461405 -498590 -408480 -492892
2413 -492892 -454267 -458938 -427881 -478959 -487707 -440398 -353649 -309277 -162500 -74255 -77470 -116633 -185362
2400 -185362 -272710 -334700 -409097 -455950 -433084 -445080 -352943 -304197 -228119 -195235 -238793 -218768 -248395
2387 -248395 -274784 -218023 -96966 -51111 6321 223879 662188 1595300 3090980 5219150 8085570
2376 8085570 10687401 11759934 10401200 8472362 6922446 5910078 5008285 4032947 3726794
2367 3726794 4786220 6797653 9906755 13056405 14422072 13179395 10779779 9094071 8186289
2358 8186289 7128013 5676459 4789680 4570262 5176068 6545854 8188589 9646079 10446634 11925744
2348 11925744 13365808 13778803 11698344 8279461 5780506 5325036 6831501 9096407 10345880
2339 10345880 11015563 11484469 12488335 14029750 14804616 12942064 8646073 4329878 2099975
2330 2099975 1554442 1091679 642558 290023 41884 30034 4386 16053 208192 274343 482913
2319 482913 769712 846342 1023326 966790 1077591 1679363 2204107 2126239 1681082 1223439 1455146
2308 1455146 1928658 2076268 1562579 918470 453502 487581 787901 779474 705354 861625 993245
2297 993245 1090360 1205770 1463961 3165752 5882433 8730900 7458520 11474106 18410437 14232060
2287 14232060 9685308 2697294 1309106 1071713 887321 512843 183191 -156796 -165117 -235128 -262715
2276 -262715 -338961 -217507 -80466 21666 260443 645026 756196 781604 799241 1193237 2220353
2265 2220353 2727194 2404749 1732223 1578912 2228162 2565431 2010511 1153588 479488 422231 425811
2254 425811 135412 -190678 -436784 -458488 -478011 -499555 -487391 -496999 -448297 -515365 -504020 -595343 -524324
2241 -524324 -553691 -509005 -456369 -533513 -580934 -485894 -533806 -517302 -441093 -492149 -457075 -522683 -508905
2228 -508905 -534783 -559165 -571548 -570489 -518841 -519825 -456272 -458960 -375581 -323544 -259326 -348235 -465294 -534105
2214 -534105 -467040 -417617 -444311 -408339 -356124 -257475 -220419 -295714 -373389 -487106 -449663 -479515 -610732
2201 -610732 -543559 -505699 -483019 -479428 -397172 -383142 -281244 -331272 -229181 -374003 -402976 -304225 -318905
2188 -318905 -272453 -127272 -177587 -127331 -151137 -164760 -326632 -306581 -323701 -251588 -192260 -107100 -87610
2175 -87610 -255553 -282535 -410799 -380602 -399461 -423970 -435074 -377107 -383727 -352556 -269532 -240162 -130339
2162 -130339 -143042 -19604 -111280 -196522 -227576 -310208 -202040 -38163 219150 798514 991639 1565521
2150 1565521 2856622 2371112 1586167 282161 -122972 -159050 -131538 -107799 -80175 -107885 -25582
2139 -25582 7012 19031 -43477 -10635 -33156 -101382 -38903 -84957 -17946 -95333 -68536 -57482 -28897
2126 -28897 19364 32348 34904 134146 149151 130617 142718 158377 223818 259372 153448 106211 129270
2113 129270 165221 86566 107933 20263 7313 -24054 -63064 -71139 -47169 -101449 -102306 -22727 46610 713
2099 713 3257 -4818 -72032 5530 -6501 -37746 -90806 -108948 -56986 -137128 -166302 -122910 -54995 -119020
2085 -119020 -113452 -141484 -147961 -224071 -217275 -194609 -214169 -144146 -122527 -129800 -171045 -130138 -52852 30119
2071 30119 173911 379712 452252 593958 668749 461547 229029 102003 77695 230490 443501 528184
2059 528184 699085 917252 1057579 946692 724039 726147 850905 815501 861722 918651 1116094 1313672
2047 1313672 1723000 3232428 6187679 11199113 19015529 28039302 37785836 44344882 40867929
2038 40867929 29152713 17038534 10787703 10283419 13799179 20707256 29953805 40689556 48809213
2029 48809213 47438456 37811087 25799724 17793033 12828908 9869882 8243584 8597900 10044588
2020 10044588 12420703 16365977 22255525 28069774 33388405 40724395 43679161 38641006 32370631
2011 32370631 32200200 38621468 51105052 64579314 68666579 62486392 55734049 49918014 40246056
2002 40246056 31948690 30672974 37116990 48056039 59036497 61558692 52924140 40128126
1994 40128126 29383763 22863524 19644043 18761780 20491360 24024573 29390448 36134526 44050918
1985 44050918 51663349 58306011 65498450 66634630 57113380 45375541 38716266 37088736 38757516
1976 38757516 43915082 50826728 58911020 70875135 80140730 79484817 73733109 70729614 72439096
1967 72439096 75437058 77762004 78458627 77726929 75749263 73413492 71218045 69636557 68821253
1958 68821253 68628140 68903169 69930369 71646503 74139259 77163214 80830136 85142102 90036004
1949 90036004 95511151 101115359 106223960 109683320 110344960 107666246 102812486 97442365 92298890
1940 92298890 87516903 83188742 79587722 76784693 74240644 72337360 70776219 70157069 70219647
1931 70219647 70895387 71987496 73525257 75056264 76119733 76390038 75390826 72306271 67201064
1922 67201064 61065595 54803101 49500860 45061538 41739448 38890299 36269015 33780407 31455995
1913 31455995 29580987 28035890 26949636 26194651 25661843 25339444 25069788 24708842 24254983 23515928
1903 23515928 22630442 21212267 20323771 20476891 18356371 15900559 14287170 13144853 11751774
1894 11751774 10580387 9479426 8657144 7979041 7234275 6811938 6395335 6196812 5949675 5998309
1884 5998309 6111314 6144598 5898990 5475375 5090211 4649491 4425137 4080633 3795046 3432701 3048562
1873 3048562 2665095 2176196 1853996 1632835 1478759 1299348 1142420 1037809 950826 940066 796839
1862 796839 738423 683346 782826 732600 753613 841147 782903 698413 575370 448036 391386 379553 333471
1849 333471 448027 345563 470001 535897 496633 359846 277192 282572 282016 230540 213428 249084 228663
1836 228663 260680 226148 248838 259889 343144 295924 372092 224251 186096 284360 218939 411692 457144
1823 457144 511284 444310 384461 270342 324952 249794 248357 353753 456865 533356 518472 426826 410052
1810 410052 258635 260134 352368 267738 276526 196316 247905 314768 362995 400471 470754 521208 601345
1797 601345 490376 458807 502522 460543 509901 519976 593943 634123 679544 766156 685559 629767 546360
1784 546360 526699 435175 463844 493804 485756 525575 534646 548384 594097 608645 625755 732670 707554
1771 707554 753761 781663 755215 712139 690228 661841 650700 595989 580466 567671 489972 557356 518801
1758 518801 501811 512846 458189 505281 523455 617699 556764 644317 719507 715930 654958 736680 653932
1745 653932 692699 593979 461502 455975 487313 415637 324561 333832 348042 398950 485063 517408 764518
1732 764518 939243 1308453 1344612 1145782 1043798 1284049 1572639 2191838 2557191 2307432 2028976
1721 2028976 2230286 2960842 3184112 2873225 2414066 2472933 3282869 4209051 3877567 2836218 2150573
1710 2150573 2210467 2832023 3085640 2646194 2046859 1754822 2088898 2389000 1926552 1234504 973628
1699 973628 1106307 1265747 1332198 1040080 744007 589990 571968 510792 486807 505613 552295 639653
1687 639653 750062 836887 928203 1210966 1569986 1552620 1437224 1462145 1624152 2118779 2570833
1676 2570833 2431542 2149039 2041184 2409103 3144376 3271147 2912094 2586082 3019023 3979392 4171736
1665 4171736 3332583 2525739 2357073 2846142 3266363 3068919 2398164 2065189 2298779 2659315 2514914
1654 2514914 1997919 1526634 1485970 1524050 1324992 1064375 801299 743606 709242 669260 708076 670782
1642 670782 728522 690862 682241 758377 728671 646422 704620 784323 832932 788586 807115 759313 761532
1629 761532 773279 840050 932623 915811 955900 1005561 1027968 1040214 1063040 1054410 1002739 873669 836995
1616 836995 875283 836277 910552 987145 960513 1064519 1108977 1115870 1150298 1204168 1369964 1596648
1604 1596648 1896508 2484766 3536780 4803907 6378646 8338566 10867254 13152556 14561619
1595 14561619 15828768 16294113 17730707 16531389 15590388 12547606 11524644 9563785 8386080
1586 8386080 6224615 4793626 3602228 3351920 3358711 3553398 4193983 4962573 6274240 8080735
1576 8080735 10425701 13692710 15942517 18236807 19759892 21888678 23460792 22670167 21227672
1567 21227672 18069063 16034964 12777674 10126571 6868835 4969307 3628022 3028919 2688607
1558 2688607 2428402 2271314 2183180 2107128 2122865 2132793 2133364 2249865 2355284 2696374 3006091 3492863
1546 3492863 4179272 4945006 5634700 6079531 6101362 6520376 7067293 7744763 7693382 6722423 5749576
1535 5749576 5420081 5436358 5236872 4689602 4157039 3669607 3658130 3911012 4229039 4720269 5321882
1524 5321882 6195863 7163616 8194633 8717297 8893582 9563065 10299534 10951862 10716051 9400309
1514 9400309 8443108 7941062 8127472 8069901 8038997 8895908 10568531 12996335 17126513 21778902
1504 21778902 23795111 24169705 26487867 34098601 42294868 45813514 47414713 46944297 47106959
1495 47106959 49350488 56076071 65751355 68331306 60537116 56231918 60877536 65590150 68733334
1486 68733334 59205089 55497524 54386937 58207352 64526365 66138035 68344226 71578628 85800930
1477 85800930 107795060 121773068 120142739 115246364 106688119 97475350 90054655 86189422
1469 86189422 75085591 58066739 40769181 33631144 32190550 29444046 24212555 20388341
1461 20388341 21570942 24973271 29105489 38582917 45508280 51529233 44770251 35048208 28197468
1452 28197468 26166956 32615462 43986245 52223235 56308918 53787032 55073713 55433085 54800745
1443 54800745 47731813 40998582 35191388 32294972 34099526 35569996 37395266 31323721 24391464
1434 24391464 18278628 16430179 17246429 18765859 19582558 20149943 21043737 23246115 26749485
1425 26749485 28603043 29644442 31723413 32220418 32005676 32184895 32053528 28530753 26515083
1416 26515083 24908795 23647245 22749331 23079903 24593028 25236033 26325932 26028656 25897237 25492251
1406 25492251 24548145 23403333 23417739 24670545 25124763 24854184 24417278 24855447 25829289 26795932
1396 26795932 27867535 29093432 31058867 35065857 38442057 40040137 39990028 38710359 38727311
1387 38727311 41413623 47028383 53393879 59336560 65108951 70250148 76011955 82722444 90211943
1378 90211943 97917416 105749375 113543551 121032552 128048505 135019085 141965441 148962560 156149249
1369 156149249 163596095 171532823 179574797 188074262 197718888 208949293 221876109 236889609
1361 236889609 254316666 274046434 295440915 316776113 335481569 347962570 351466402 344880887
1353 344880887 333046083 318584772 305179386 291716206 280842794 270784124 263563182 257540700
1345 257540700 252974512 248558320 244263795 240222903 237764551 236935944 237190528 238292750 240344212
1336 240344212 244529697 252217629 259794703 267128459 265571691 264566008 260264350 260737538 253345586
1327 253345586 244957142 231137909 223090461 215053271 209861038 204472990 205620748 211573340 220798089
1318 220798089 230189619 239675400 249420503 258708729 266425236 271650264 275764227 279350248 282394844
1309 282394844 287272165 294574566 305395026 316858162 327553349 338294105 351888274 367249714
1301 367249714 380980562 394165612 414374484 445504656 491546967 554997997 640943549
1294 640943549 754583826 900164284 1084450127 1307863072 1558299786 1808961014 2021364993
1287 2021364993 2147483647 2136182303 1967767180 1679268390 1352359460 1056717551 818108049
1280 818108049 634267731 497308831 397529669 324961721 271085373 230407185 198420163
1273 198420163 173056296 152852229 136744630 123987412 113596613 105121964 98201464 92592733
1265 92592733 88498154 85978150 84814626 84711910 84717188 83918750 81138929 75706989 68155365 59840538
1255 59840538 51901772 45080495 39408069 34997417 31445224 28583222 26242957 24212990 22478971
1246 22478971 20904299 19172641 17741588 16340072 14992554 13708571 12749989 12170535 11794988
1237 11794988 11576139 11312269 10902649 10339003 9769580 9003050 8394502 7986161 7550792 7123055
1227 7123055 6941039 6706168 6608411 6462206 6480918 6431914 6350256 6136727 5699610 5088753 4424328
1216 4424328 3676019 3093030 2614086 2333022 2160563 2028180 1857508 1754461 1780977 1770020 1769269 1788173
1204 1788173 1769945 1841717 1913386 1884779 1782959 1625777 1425609 1246445 1189098 1091838 907534 846777
1192 846777 857794 867184 903637 1020815 1046495 1243917 1360220 1470978 1469667 1639763 1735994 1839917
1180 1839917 1904159 1732902 1748893 1624410 1511462 1459712 1380741 1260506 1229283 1176084 1260364 1327838
1168 1327838 1363386 1558358 1739962 1796840 1797919 1728219 1711685 1863584 1942558 2000180 1957319 1966461 2026565
1155 2026565 2090304 2258929 2357795 2561127 2733117 2852626 2965066 3013397 2988199 2939592 2839894 2751220
1143 2751220 2682684 2614824 2570785 2511660 2515105 2481433 2457248 2377648 2543047 2501471 2577161 2663381 2787854
1130 2787854 2977494 3004502 3156461 3209374 3214052 3382022 3390793 3389781 3380691 3267908 3261810 3175582 3102112
1117 3102112 3020053 2970192 3028859 2964067 2954899 2976974 2871657 2857180 2749492 2695286 2682697 2626226 2533624
1104 2533624 2535239 2478799 2371600 2290976 2301238 2106070 2042838 2007721 1854698 1919311 1809035 1756036
1092 1756036 1670414 1510184 1422630 1436677 1444507 1382797 1304158 1242239 1241881 1163461 1065261 1036727 926106
1079 926106 878686 786568 704512 670729 627384 595836 498040 588021 515440 540930 451490 506492 511945
1066 511945 527876 510811 626497 720299 779121 934371 970740 1024922 884529 764251 627180 617221
1054 617221 527997 428755 384586 423237 272939 306537 269707 359275 644651 971532 1303362 1872622
1042 1872622 2342670 1928945 1139789 491393 188287 19675 3838 -111688 -216623 -201262 -216385
1031 -216385 -233444 -296487 -238951 -91520 -110103 -2175 243149 293885 358611 217890 -2882 -195149
1019 -195149 -393351 -387325 -474039 -499225 -398195 -509281 -516839 -634772 -687218 -752980 -673609 -554554
1007 -554554 -504505 -481556 -586656 -474827 -548427 -532074 -557004 -538682 -524898 -525602 -447314 -512273 -554561
994 -554561 -485971 -526661 -528031 -454397 -436862 -441743 -389556 -366361 -290145 -365194 -253250 -211616 -305077
981 -305077 -325639 -264643 -221581 -262581 -321733 -201302 -149034 -102013 -52842 30323 13891 78497 124282
968 124282 139089 195820 199281 307887 257508 204230 80973 5445 -21724 -5299 66323 35015 119537
955 119537 227109 329527 326235 474450 580567 708373 733405 989163 1030221 958238 911528 910705 887285
942 887285 739299 561995 611842 795232 1056795 1144920 1277309 1365485 1515647 1638287 1891293
931 1891293 2188684 2485258 2888495 3083796 3165788 3058732 3325885 3858873 4494831 5218956 5902187
920 5902187 6578451 6769339 6525675 6215152 6093122 6155033 6306464 6581136 7010930 7427774 8060091
909 8060091 8741807 9694232 10896651 12727375 15263676 18287487 21734794 26873047 30471675
900 30471675 32455212 34722036 41195223 55151452 77985460 107793089 145106111 187100931
892 187100931 204022120 189072007 159180812 135267948 120175530 110104466 102172596 95848995
884 95848995 91540026 89837270 91320893 93689756 99294306 118320494 165128677 239794278
876 239794278 306530922 433383674 553221298 471191801 293931929 153741843 101567410
869 101567410 78530104 67681135 61686495 56739961 52466986 50112811 50786899 53802043 59872845
860 59872845 70961828 90995310 120360305 153634159 193918235 230806170 216946078 158912302
852 158912302 95507011 57544566 40144187 32227829 28737456 27635793 24259203 19271017
844 19271017 14321269 11532447 9896266 8893312 8077484 7644702 7435931 7358748 7281012 6970089
834 6970089 6706514 6519586 6515150 6640307 6728654 6992687 7204755 7020525 6128652 4987810 4045936
823 4045936 3272264 2767620 2400118 2058852 1872102 1551258 1310308 1191721 1089524 982197 819749
812 819749 851756 703399 773505 849020 914303 950189 798638 564977 379468 263240 185901 154263
800 154263 144443 85884 -13909 -38400 -76577 -86025 -153870 -189475 -92916 -63913 -23069 -43717 -98721 -197215
786 -197215 -336623 -572520 -705537 -696748 -786724 -902568 -792355 -879423 -813303 -777322 -797635 -738600
774 -738600 -756089 -763241 -725352 -691233 -774666 -713045 -748306 -662211 -715933 -784719 -840536 -821889 -878866
761 -878866 -838734 -822249 -862700 -903041 -859151 -796200 -905146 -873137 -827356 -784593 -803339 -790670 -795946
748 -795946 -776872 -706093 -841948 -871028 -875289 -889052 -851685 -805889 -839512 -812798 -725264 -734407 -798454
735 -798454 -852260 -835922 -919848 -856621 -849897 -875578 -799856 -903369 -801237 -744102 -749429 -551284 -294598
722 -294598 -33660 272636 168892 -10701 -201096 -368842 -433877 -508546 -638711 -664703 -654845 -714110
710 -714110 -688035 -694404 -628518 -518718 -243082 215696 528091 1343386 1875753 1381354 429463 -330742
698 -330742 -694826 -756843 -825330 -870537 -959784 -997213 -1006506 -1029288 -967920 -970878 -862960 -768324 -507598
685 -507598 -337949 -139271 227547 180678 -146471 -642649 -849139 -985869 -1023253 -1031266 -1019838 -1027218
673 -1027218 -1101562 -1149825 -1048173 -1069380 -1113574 -1144657 -1126455 -1176144 -1164581 -1086531 -1150247 -1226959 -1190377
660 -1190377 -1172085 -1164016 -1117554 -1129813 -1096866 -1199124 -1178518 -1113216 -1176318 -1122516 -1122493 -1166516 -1161557 -1227185
646 -1227185 -1154352 -1212451 -1163714 -1226475 -1187359 -1185842 -1248924 -1278791 -1232970 -1269524 -1242711 -1235091 -1205047
633 -1205047 -1219451 -1254505 -1277474 -1205058 -1154123 -1240365 -1271902 -1221130 -1200682 -1224052 -1206609 -1279758 -1232519
620 -1232519 -1284273 -1224621 -1187701 -1292132 -1248861 -1169573 -1227438 -1245633 -1152488 -1265270 -1197965 -1249635 -1330607
607 -1330607 -1264172 -1268523 -1299193 -1319870 -1277605 -1323107 -1331754 -1265611 -1256109 -1298237 -1195040 -1243390 -1220230
594 -1220230 -1280705 -1191472 -1274299 -1288090 -1202021 -1203848 -1231681 -1252484 -1310817 -1225588 -1278914 -1268197 -1252183
581 -1252183 -1295509 -1217198 -1224776 -1257324 -1233328 -1263039 -1291084 -1258383 -1262005 -1235969 -1249146 -1244099 -1247250 -1297472
567 -1297472 -1313190 -1269688 -1298137 -1296037 -1258537 -1256866 -1226170 -1235754 -1268950 -1270302 -1265736 -1309451 -1266519 -1236551
553 -1236551 -1253280 -1231053 -1258027 -1244177 -1285043 -1262602 -1242900 -1201169 -1163136 -1229528 -1254197 -1253789 -1240640
540 -1240640 -1280018 -1194595 -1266948 -1237887 -1248026 -1285440 -1255622 -1217755 -1188905 -1211557 -1177233 -1228016 -1268170
527 -1268170 -1269625 -1213646 -1220746 -1196660 -1225161 -1281267 -1199664 -1254222 -1270605 -1297797 -1247258 -1256643 -1124822
514 -1124822 -1215712 -1212156 -1244569 -1230921 -1190524 -1218916 -1226543 -1268220 -1177905 -1281584 -1224505 -1160048 -1186204
501 -1186204 -1252021 -1224104 -1173888 -1234127 -1182570 -1181007 -1162435 -1126563 -1232595 -1253351 -1204606 -1247512 -1175579
488 -1175579 -1198445 -1214441 -1196852 -1179114 -1210364 -1306800 -1234606 -1214892 -1197783 -1200258 -1180825 -1161975 -1132830
475 -1132830 -1224265 -1261337 -1233048 -1182989 -1211788 -1196541 -1169614 -1256715 -1207083 -1191723 -1211327 -1094952 -1141911
462 -1141911 -1137763 -1222367 -1193374 -1188443 -1131328 -1112830 -1198220 -1223590 -1217821 -1107719 -1219795 -1169808 -1219275
449 -1219275 -1247178 -1133452 -1206113 -1245216 -1226965 -1150545 -1167302 -1230932 -1119945 -1178603 -1218361 -1146368 -1138833
436 -1138833 -1195584 -1164489 -1152994 -1196901 -1165177 -1151882 -1096171 -1135116 -1203998 -1253328 -1202674 -1161733 -1164464
423 -1164464 -1202845 -1161693 -1151650 -1216108 -1205583 -1244656 -1178942 -1096854 -1155017 -1167962 -1114165 -1193459 -1180555
410 -1180555 -1216416 -1073542 -1115924 -1148095 -1199342 -1226131 -1064628 -1175081 -1160384 -1133646 -1215212 -1169873
398 -1169873 -1240050 -1164359 -1256377 -1124824 -1178494 -1157909 -1176473 -1223836 -1169507 -1163772 -1200181 -1125945 -1192719
385 -1192719 -1221867 -1114863 -1183001 -1138139 -1190074 -1088432 -1120956 -1215932 -1193749 -1131275 -1110967 -1201480 -1140832
372 -1140832 -1226799 -1233977 -1121105 -1143311 -1176060 -1093365 -1125438 -1160229 -1159599 -1145334 -1179423 -1144934 -1209226
359 -1209226 -1173537 -1152495 -1120540 -1116218 -1133841 -1185399 -1143922 -1137335 -1087199 -1149586 -1213555 -1141143 -1176608
346 -1176608 -1153931 -1182608 -1194889 -1208760 -1095311 -1188253 -1181921 -1155235 -1156836 -1106170 -1184769 -1155802 -1135845
333 -1135845 -1130858 -1248533 -1212610 -1164103 -1134846 -1164007 -1156978 -1175047 -1126910 -1210803 -1188173 -1139204 -1157909 -1157200
319 -1157200 -1190763 -1207447 -1187059 -1181454 -1193552 -1138633 -1231910 -1167111 -1188525 -1215445 -1217265 -1136060 -1227484
306 -1227484 -1176143 -1107093 -1113642 -1190125 -1180301 -1200989 -1114764 -1147293 -1152653 -1192683 -1193911 -1199473 -1179735 -1129245
292 -1129245 -1128444 -1186453 -1236545 -1247394 -1137057 -1163257 -1135656 -1115231 -1188496 -1158293 -1099890 -1171423 -1156651
279 -1156651 -1049554 -1085771 -1078313 -1105365 -1086421 -1136170 -1079633 -1092942 -1158259 -1168490 -1213786 -1115819 -1170908
266 -1170908 -1145904 -1066470 -1181098 -1134666 -1142965 -1164028 -1135235 -1071897 -1162279 -1122901 -1154119 -1127342 -1122809
253 -1122809 -1097661 -1105516 -1142610 -1149830 -1159033 -1172479 -1101236 -1097243 -1060607 -1109827 -1092155 -1188885 -1100061 -1068759
239 -1068759 -1173790 -1193292 -1092995 -1086982 -1098118 -1162611 -1105412 -1108039 -1162935 -1118716 -1191673 -1131126 -1155686
226 -1155686 -1173505 -1143364 -1138178 -1100907 -1135084 -1160051 -1138467 -1167999 -1110665 -1142539 -1112436 -1206927 -1110654
213 -1110654 -1136042 -1109836 -1096946 -1138454 -1145765 -1086310 -1208837 -1125303 -1142929 -1132189 -1108966 -1097763 -1128490
200 -1128490 -1091017 -1096626 -1117358 -1101584 -1117313 -1127804 -1160027 -1123954 -1146474 -1139379 -1072600 -1124210 -1178422
187 -1178422 -1098232 -1098204 -1169151 -1133329 -1157178 -1191764 -1211222 -1099509 -1025779 -1100617 -1088575 -1105724 -1136261
174 -1136261 -1123963 -1121629 -1120705 -1111264 -1075066 -1085227 -1093908 -1056173 -1092379 -1075938 -922091 -727192 -490622
161 -490622 -222537 -155221 -410396 -704752 -905470 -1035408 -1065898 -1080841 -1037305 -1030340 -1122916 -1050171
149 -1050171 -1006947 -1056477 -1121743 -1137772 -1067511 -1135788 -1088646 -1088923 -1085704 -1128520 -1166121 -1201606 -1199116 -1136512
135 -1136512 -1178035 -1042267 -1083798 -1118900 -1020058 -1126320 -1003636 -1118290 -1124659 -1094669 -1114265 -1104639 -1056880
122 -1056880 -995906 -1049936 -1039920 -1076647 -949177 -970853 -1019437 -1106429 -1123992 -1095847 -1057204 -1071593 -1091413
109 -1091413 -1072608 -1117931 -1024850 -1007964 -1067299 -1021513 -1028632 -1083256 -1070392 -1028607 -1006616 -1037904 -1036733 -1041665
95 -1041665 -1070361 -978562 -982899 -1034540 -1006039 -1043228 -1034267 -1051123 -1054746 -1033166 -1083104 -1035301 -1018486 -1045205
81 -1045205 -1067491 -1013713 -998459 -1037088 -1049845 -1055104 -970020 -963632 -1000140 -984319 -996346 -962135 -1125715
68 -1125715 -1107217 -1104856 -1105894 -1022294 -981092 -1044789 -938612 -1024711 -980319 -910494 -878892 -805984 -687220
55 -687220 -709797 -891276 -927998 -952895 -906076 -922452 -907417 -880676 -800151 -847306 -801946 -907980 -905234
42 -905234 -792600 -853947 -833440 -764262 -766964 -815893 -759943 -659306 -527922 -332659 162052 846546
30 846546 1644590 2719153 3144623 1785626 194271 -429247 -593131 -592967 -462287 -101189 142068
19 142068 698417 1162412 866637 343885 341371 998820 2188489 3528910 5929111 5416512 3343731
8 3343731 2586767 3493871 6919267 17649465 44279762 88239171 139113928 227261438 186461320
-1 186461320 79540663 18883706 7714795 4554269 3363607 2802035 2753283 3492645 5464852
-10 5464852 4826910 2228408 220466 -276557 -469290 -634641 -710817 -554510 -601994 -724362 -779671
-21 -779671 -779824 -576277 -56770 730038 1622160 2835509 2886128 1362646 -379068 -934369 -1017160
-32 -1017160 -1092266 -919192 -969954 -898441 -965742 -966155 -1044081 -1063284 -1037360 -1082486 -1113699 -1092512 -1181291
-45 -1181291 -1263395 -1158789 -1178685 -1186691 -1147398 -1053432 -1041914 -965860 -1064658 -1119346 -1129407 -1103736 -1103209
-58 -1103209 -1077813 -1115303 -1073640 -1165652 -1165369 -1045116 -996403 -932581 -867806 -867091 -1077824 -1209351 -1181216
-71 -1181216 -1188731 -1207290 -1209498 -1126496 -1192157 -1179573 -1221796 -1207180 -1133511 -1107144 -1158290 -1196640 -1107376
-84 -1107376 -1084032 -1107564 -1219959 -1201334 -1186440 -1222299 -1176885 -1197441 -1212657 -1139825 -1107069 -1214914 -1214612
-97 -1214612 -1183414 -1134060 -1161087 -1166765 -1103145 -1159469 -1174866 -1141391 -1190977 -1093154 -1086200 -1082885 -1101597 -1110163
-111 -1110163 -1117287 -1121916 -1136051 -1128306 -1148217 -1132315 -1059135 -1111918 -1125272 -1168726 -1124851 -1151610 -1183509
-124 -1183509 -1136323 -1140968 -1188612 -1124799 -1099675 -1109951 -1085235 -1144636 -1008603 -1086924 -1062800 -1109953 -1048101
-137 -1048101 -1048726 -1098486 -1180809 -1199233 -1153165 -1108040 -1138166 -1116649 -1133698 -1127976 -1123218 -1117365 -1112885 -1086008
-151 -1086008 -1150647 -1120645 -1054106 -1086375 -1118487 -1084550 -1026427 -1017426 -840494 -574549 -264943 -148827
-163 -148827 -303325 -660774 -915658 -1007559 -1091410 -1147747 -1141463 -1141689 -1144318 -1137414 -1119004 -1090221 -1123911
-176 -1123911 -1055012 -1086379 -1117189 -1148195 -1142424 -1095371 -1162279 -1096508 -1137044 -1102729 -1134238 -1165941 -1068776
-189 -1068776 -1055264 -1066217 -1191725 -1154229 -1149073 -1179393 -1157384 -1140032 -1105335 -1130210 -1122949 -1087306 -1096071
-202 -1096071 -1043574 -1083020 -1080703 -1132802 -1087975 -1085774 -1077221 -1065594 -1048691 -1026591 -1058123 -1167356 -1093735
-215 -1093735 -1132855 -1082269 -1086500 -1170621 -1167244 -1080222 -1079319 -1146516 -1162897 -1154127 -1052758 -1107488 -1019744 -1111292
-229 -1111292 -1079781 -1067938 -1063048 -1092519 -1105553 -1134272 -1129811 -1105408 -1134140 -1090192 -1086958 -1072155 -1155670
-242 -1155670 -1115587 -1167934 -1097531 -1133656 -1028905 -1124342 -1076943 -1135700 -1165110 -1161001 -1081748 -1098983 -1097029
-255 -1097029 -1088954 -1078882 -1070230 -1056241 -1071682 -1169633 -1043014 -1091817 -1137858 -1127069 -1135617 -1083795 -1127147
-268 -1127147 -1045210 -1044869 -1158517 -1146701 -1123154 -1127735 -1053231 -1066898 -1064161 -1140275 -1083445 -1135179 -1065149 -1071671
-282 -1071671 -1089953 -1190417 -1139008 -1090904 -1075773 -1162413 -1092308 -1056991 -1070570 -1108310 -1118722 -1099716 -1130075
-295 -1130075 -1134344 -1104661 -1073061 -1093966 -1077352 -1140428 -1157321 -1091468 -1103447 -1083276 -1081491 -1100984 -1052339
-308 -1052339 -1041830 -1103113 -1142050 -1114331 -1096797 -1132301 -1149220 -1076762 -1068396 -1078371 -1142970 -1012198 -1051779
-321 -1051779 -1093787 -1007936 -1077717 -1030236 -1137794 -1160969 -1071194 -1096129 -1078969 -1132436 -1057587 -1079091 -1023680
-334 -1023680 -1024579 -1111918 -1071763 -1057082 -972757 -1062244 -1117011 -1047739 -1032004 -1090748 -1092351 -1092714 -1145291 -1080755
-348 -1080755 -1061397 -1060863 -1067073 -1112834 -1103360 -1058066 -1061673 -1095385 -1055341 -1067560 -1077612 -1081229 -1050037 -1092707
-362 -1092707 -1045601 -1121718 -1062212 -1085232 -1116013 -1078565 -1036085 -1089288 -1159048 -1112797 -1120438 -1081531 -1074556
-375 -1074556 -1105337 -1044315 -1073053 -1092915 -1079236 -1145522 -1040471 -1057552 -1023093 -1127080 -1058472 -1072432
-387 -1072432 -1055194 -1089232 -1108877 -1072688 -1153374 -1052500 -1095723 -1053136 -1131944 -1070964 -1093222 -1175432
-399 -1175432 -1071669 -1036943 -1036763 -1025633 -1139876 -1090220 -1138713 -1094844 -1073915 -1116732 -1115248 -1038015 -1075383
-412 -1075383 -1068185 -1069436 -1066380 -1038975 -1055991 -1049670 -1073363 -1046875 -1039075 -1048326 -986386 -1134619 -1107349 -1095738
-426 -1095738 -1139196 -1057485 -1088928 -1057758 -1086420 -1060672 -1104495 -1119748 -1097025 -1089400 -1149161 -1104187 -1119528
-439 -1119528 -1161798 -1114746 -1122948 -1022313 -1121779 -1047606 -1053032 -1100301 -1089393 -1070339 -1115226 -1106277 -1128194
-452 -1128194 -1046290 -1042904 -1025877 -1092299 -1074612 -981837 -1011670 -951699 -1064268 -1008111 -1084958 -1042884 -1086035
-465 -1086035 -1114226 -1061627 -1054852 -982523 -1092461 -1049256 -1067444 -1035180 -1028989 -1084446 -1112883 -1044284 -1091625
-478 -1091625 -1129482 -1029165 -1031845 -1054004 -1072282 -1123470 -1071285 -1014212 -1067433 -1070709 -1035889 -1021385 -1012462
-491 -1012462 -980183 -1046935 -1138100 -1103138 -1100612 -1043150 -1031898 -1147709 -1108816 -1108685 -1111368 -1057104 -1051852 -1043810
-505 -1043810 -1100187 -1101059 -1079811 -973865 -1085673 -1011306 -1085603 -1034229 -1070342 -1069956 -1119088 -1125247 -1023044
-518 -1023044 -979753 -1069176 -1111486 -1030704 -1066996 -1087239 -1094391 -1044724 -1067106 -1097241 -1067059 -1075722 -1068156
-531 -1068156 -1014447 -1011511 -1067825 -1034368 -1044137 -1112657 -1066165 -1070980 -1014248 -1043369 -1113012 -1086640 -1047933
-544 -1047933 -1081774 -1067172 -1077642 -1098316 -1091902 -1073426 -1080134 -1056658 -1037746 -1067933 -1061512 -1054170 -1096695 -1114297
-558 -1114297 -1041380 -1073351 -1089889 -1055275 -1060267 -1005908 -1045422 -1088843 -1106395 -1071450 -1097743 -982861 -1080597
-571 -1080597 -1097291 -1049425 -1060805 -1004879 -1034413 -1087837 -1011241 -1072611 -1001897 -1101685 -1003114 -1035543 -1012091
-584 -1012091 -1070479 -1044482 -1040070 -1075452 -1104922 -1105017 -1096475 -1122168 -1076511 -1056759 -1079261 -1061270 -1021471 -1018436
-598 -1018436 -1036143 -1028963 -1024499 -1075247 -978402 -1078184 -1048015 -989414 -1088166 -1084869 -1020944 -1017403 -1072955 -1083655
-612 -1083655 -1046350 -1035318 -1020451 -1076445 -1094257 -1017973 -1028138 -1057775 -992302 -1043274 -1042045 -1077934 -1050257
-625 -1050257 -1057979 -1059252 -1075089 -1108752 -1026615 -976721 -987709 -1024509 -1094737 -1097905 -1073122 -1000898 -1021328
-638 -1021328 -1062796 -992897 -1027674 -1010215 -1039898 -1034824 -1043523 -1035617 -1030998 -1007390 -1008147 -1072600 -1093118 -1101828
-652 -1101828 -1034869 -1071461 -1058340 -1105898 -1049800 -1045657 -969356 -956381 -1038479 -1088853 -1051037 -1014920 -1062518
-665 -1062518 -1016363 -1029267 -1047695 -1105613 -1020709 -1035481 -1123221 -1082016 -1118991 -1049312 -1077766 -1016909 -1055240
-678 -1055240 -1014153 -1050238 -1040139 -1034566 -1040267 -985877 -1015432 -975374 -1079595 -1124237 -1035677 -985705 -1010554
-691 -1010554 -1106914 -1090003 -1059136 -1034721 -1064982 -1012446 -1013868 -1039436 -997194 -1053682 -1087051 -1059797 -971971
-704 -971971 -1013956 -1042471 -1089700 -1020671 -1016932 -1052646 -1081933 -1079994 -1016470 -1090948 -1119624 -1076750 -1072203 -1052611
-718 -1052611 -1097207 -1086008 -1041356 -1038791 -1021515 -1048208 -989661 -1047137 -961833 -1036398 -1055585 -1075742 -1116816
-731 -1116816 -1075362 -1014723 -1062771 -1058215 -1091435 -1021922 -1023247 -1035463 -1070661 -1057352 -1038295 -1076719 -1127468
-744 -1127468 -1018890 -1021438 -1030780 -1067925 -1029661 -1020215 -970997 -1016767 -970936 -1060632 -1055943 -1051238 -1068466 -1063932
-758 -1063932 -1051342 -1048649 -1075159 -1083212 -1009263 -1038246 -1036284 -1132147 -1042311 -1084293 -1127105 -1030369 -1016382 -1022404
-772 -1022404 -1059683 -1036096 -1043408 -995639 -1083975 -983911 -1037866 -1035831 -990884 -1012087 -1002638 -1040471 -1053125
-785 -1053125 -1020412 -1015597 -989419 -1062965 -1085979 -1047516 -1031611 -1020748 -1044842 -1021702 -1066516 -1073839 -1025389
-798 -1025389 -1062986 -1128486 -1072400 -1074754 -1059265 -1058269 -1061679 -1075710 -1064157 -1098775 -1091169 -1065703 -981790 -1103574
-812 -1103574 -1081003 -1038084 -1034910 -1016505 -1052769 -1061263 -1016344 -976378 -1011454 -1042832 -1044033 -1035730 -1057195 -990452
-826 -990452 -968851 -1046686 -1044556 -1008090 -1004822 -984983 -994807 -1045312 -1030863 -1031266 -1015095 -1012579 -1106759 -1097455
-840 -1097455 -995307 -1117630 -1022992 -1020454 -1038103 -1022585 -1016148 -1095261 -1055270 -1014431 -1009428 -1014525 -1076108
-853 -1076108 -1059622 -1047511 -1035483 -981276 -1008670 -1015957 -998262 -1050793 -1060924 -1028982 -1035193 -1032641 -1017504
-866 -1017504 -988494 -1014558 -1033507 -1027348 -1022566 -1113546 -1110089 -1096685 -986158 -1071796 -1048821 -1065434 -1055962
-879 -1055962 -990725 -1007757 -998342 -989483 -1003763 -1053315 -973209 -1047755 -971514 -983093 -1055264 -1028549 -1028942 -974581
-893 -974581 -975983 -1025481 -1075984 -991776 -978076 -992643 -1072415 -1012874 -1067049 -939958 -990095 -976078 -1127690
-906 -1127690 -998621 -1049887 -1009014 -993270 -1033048 -986179 -999536 -966664 -1038260 -1117547 -1018555 -1099389 -1111739
-919 -1111739 -1049663 -968606 -1057200 -1013586 -982311 -961334 -1057772 -980067 -1046542 -998456 -1029288 -1033440 -986687
-932 -986687 -973259 -995089 -1007700 -1035126 -991224 -1052832 -1007306 -1001859 -1027157 -1039660 -1026161 -1003951 -977649
-945 -977649 -1074124 -986801 -1052549 -977206 -993924 -1013270 -1049995 -1015233 -1044807 -1048461 -1041401 -1079817 -1092995
-958 -1092995 -1067289 -1005597 -999203 -1041449 -1029036 -995426 -935370 -1007352 -1133820 -981989 -1021725 -1013821 -967754
-971 -967754 -964514 -1027561 -1037436 -1021511 -969980 -935121 -1079830 -1056645 -975567 -1032866 -956665 -1021004 -970043
-984 -970043 -905499 -1012592 -1035057 -1013044 -998880 -984712 -1023713 -1044055 -1026919 -1011223 -1035946 -1008479 -1045548
-997 -1045548 -1076610 -1075241 -1025089 -983657 -1007410 -1041567 -1057803 -994571 -1008410 -1021754 -1025336 -960389 -1031939
-1010 -1031939 -1077380 -1026344 -966071 -1021764 -1005843 -1025686 -1007124 -915210 -1025168 -1044411 -1053819 -1057853 -1018587
-1023 -1018587 -996241 -954028 -1020460 -1016270 -1005034 -969309 -1020681 -979684 -1058325 -1032713 -975375 -1031265 -1016962
-1036 -1016962 -969812 -1065449 -983794 -1064490 -1054858 -1089773 -1102155 -1033140 -995694 -986562 -996669 -1029645 -1040393
-1049 -1040393 -997137 -1007627 -996654 -964200 -1003489 -994400 -995975 -1017677 -974627 -1017487 -1067193 -1029545 -1001096
-1062 -1001096 -1003048 -1054748 -997407 -957746 -945779 -985180 -962070 -1002000 -1081734 -969850 -1064256 -1048882 -1035613
-1075 -1035613 -1007420 -1027068 -1025035 -1049898 -991767 -1039583 -1035486 -1049408 -955723 -971706 -960072 -998930 -1035320
-1088 -1035320 -988022 -1012860 -1052850 -986106 -994006 -985252 -956117 -959076 -1008687 -969697 -961684 -977521 -971599 -1022838
-1102 -1022838 -1030683 -1010329 -1007846 -1021927 -1018329 -1027171 -1037817 -998804 -1042506 -1005022 -971223 -973831 -975514 -963704
-1116 -963704 -956643 -909781 -957360 -993593 -989916 -1000437 -956839 -998639 -1049892 -968357 -1044841 -1022652 -955302
-1129 -955302 -1014287 -1029438 -1043112 -943302 -1019249 -1059223 -1001456 -1002612 -1045213 -1090890 -1011014 -1031920 -1024138
-1142 -1024138 -976019 -989614 -1050043 -966732 -1058696 -1028002 -968114 -963749 -1042365 -1001852 -956766 -1005775 -962020
-1155 -962020 -948338 -1002525 -1001070 -990476 -1016866 -994910 -985172 -980731 -917285 -988966 -1052486 -989745 -1032361
-1168 -1032361 -991300 -1006394 -940581 -1016516 -992293 -1048919 -1016824 -1094198 -968233 -1035580 -991595 -1040418 -1041508
-1181 -1041508 -1012370 -959344 -1006620 -1028220 -951087 -940903 -988944 -973911 -964120 -952679 -977323 -1019443 -935597
-1194 -935597 -950419 -975460 -1005844 -960692 -1025937 -954610 -1003559 -967417 -898406 -979617 -1040775 -996871 -975263
-1207 -975263 -945810 -962300 -967525 -977915 -984194 -1014622 -970651 -1010730 -972687 -1033137 -1032121 -1007128 -954352
-1220 -954352 -1028935 -1029658 -1025515 -985854 -1023734 -953314 -962476 -961283 -1088399 -975504 -951269 -996201 -935872
-1233 -935872 -1001992 -980956 -969785 -973485 -958653 -991979 -995451 -949130 -1015300 -921358 -976983 -1042587 -1029103
-1246 -1029103 -969684 -935974 -1002584 -979024 -979801 -927996 -935221 -1019161 -1027320 -1011789 -931590 -956287 -1034585
-1259 -1034585 -1018777 -941540 -1045199 -917807 -976546 -956894 -945164 -986552 -934901 -969836 -950222 -1061296
-1271 -1061296 -947887 -1014700 -946130 -967730 -964513 -902949 -972569 -868985 -926176 -955960 -914392 -988049
-1283 -988049 -1003403 -923596 -1003939 -999168 -959694 -916452 -1021333 -979354 -933950 -994314 -1047827 -996823 -991804
-1296 -991804 -980446 -978072 -962266 -980842 -1018314 -969231 -977365 -962751 -941297 -1020974 -961475 -1016894 -951452
-1309 -951452 -983751 -959816 -989602 -982121 -943984 -987648 -998917 -996165 -985504 -1043441 -974101 -996447 -1050822
-1322 -1050822 -994847 -969317 -962287 -989285 -951644 -908467 -982316 -954794 -946885 -979650 -1009646 -926956 -985234
-1335 -985234 -938289 -959103 -1017028 -984643 -980298 -983516 -982319 -995972 -981041 -984725 -1000194 -923708 -941997 -1013860
-1349 -1013860 -987695 -927511 -1003244 -990350 -1013785 -1058956 -1055777 -1013653 -937665 -912918 -1033920 -965248 -975395
-1362 -975395 -1016079 -946312 -983421 -1032222 -958000 -982651 -1025252 -1014608 -1057332 -1015643 -1012691 -1045754 -1018639
-1375 -1018639 -964887 -975061 -928587 -966901 -1049528 -966611 -1015395 -1011390 -967280 -938253 -975863 -987103 -955843
-1388 -955843 -989640 -941763 -1069030 -953508 -960756 -980346 -1006073 -981242 -961583 -945249 -971840 -959783 -1014489
-1401 -1014489 -961007 -930154 -992566 -981466 -1059529 -948789 -960839 -997580 -1019522 -878147 -965787 -938582
-1413 -938582 -1054687 -1016394 -937597 -998611 -949042 -914196 -921452 -986329 -985121 -1001435 -943819 -1019364 -959846
-1426 -959846 -964300 -992946 -958210 -950607 -976593 -975527 -968128 -975453 -888655 -960401 -978854 -1048014 -1042809 -979938
-1440 -979938 -1028201 -1000762 -973396 -976733 -939132 -931554 -949361 -947205 -913898 -951808 -987869 -1002499 -977772
-1453 -977772 -998583 -975359 -967239 -1011887 -951914 -926515 -904040 -992041 -1011458 -991759 -936388 -913440 -962143
-1466 -962143 -952731 -1044749 -965838 -1006406 -898425 -941257 -949654 -1049120 -883160 -1058930 -1032975 -1023269 -992914
-1479 -992914 -983651 -981461 -959362 -931013 -984486 -930552 -917226 -980057 -943657 -919939 -1023874 -957455 -975125
-1492 -975125 -973780 -884989 -959520 -937820 -985995 -1006819 -918958 -980046 -909499 -966476 -941735 -896472 -875604
-1505 -875604 -935286 -1038038 -962930 -914763 -994962 -1003983 -884888 -966376 -981942 -957393 -983098 -922673 -907485
-1518 -907485 -936302 -970891 -942433 -932088 -950180 -919234 -984151 -972187 -986082 -971971 -971736 -978144 -937059 -942782
-1532 -942782 -986861 -965686 -1007718 -971345 -959138 -1012180 -958891 -981128 -930554 -966901 -953050 -950548 -988378
-1545 -988378 -952732 -924246 -981814 -978618 -964535 -1010973 -943463 -978100 -1023038 -1010512 -984409 -927606 -931628 -932026
-1559 -932026 -982382 -919462 -967825 -953880 -931055 -969412 -899505 -952961 -961848 -899015 -946132 -992337 -956533
-1572 -956533 -1008967 -1014762 -967816 -1025916 -928647 -974612 -973980 -899592 -943838 -950387 -876562 -964088 -920688 -963865
-1586 -963865 -966453 -988885 -924961 -973204 -970915 -1005127 -973641 -995159 -977102 -962340 -923784 -893804 -924494
-1599 -924494 -881355 -970795 -952463 -959422 -946247 -916572 -943965 -942144 -939860 -892129 -914942 -895794 -975512
-1612 -975512 -991553 -959246 -987061 -988845 -941261 -1012348 -949392 -953992 -918912 -901056 -915386 -988580 -1009089 -1010003
-1626 -1010003 -967014 -969541 -972653 -901950 -919731 -981925 -954916 -1004033 -1001818 -961282 -921851 -910011 -986745
-1639 -986745 -949144 -1018961 -885154 -878824 -986152 -968348 -910810 -1000524 -997788 -994303 -985080 -977484 -996791
-1652 -996791 -1017452 -1013181 -904061 -986006 -963726 -918579 -922796 -986998 -982407 -987365 -956699 -921729 -1034831
-1665 -1034831 -978003 -965292 -931558 -892882 -967316 -962136 -971136 -965340 -886355 -952502 -962464 -975131 -970192 -918860
-1679 -918860 -895537 -917991 -890212 -955547 -987134 -997181 -946799 -995014 -930737 -987667 -913801 -904261 -932353
-1692 -932353 -941464 -962868 -884041 -971114 -945320 -983021 -1048309 -961982 -953250 -959075 -908370 -987408 -924683
-1705 -924683 -892645 -944663 -943159 -938997 -973773 -925025 -973754 -917880 -952293 -915393 -943527 -943042 -961414 -902605
-1719 -902605 -907127 -936553 -877843 -1017415 -939895 -965223 -984007 -995975 -973125 -1002270 -975662 -992681 -951641
-1732 -951641 -934249 -1020901 -983092 -1001206 -967771 -1008616 -919842 -935896 -1007258 -965077 -962732 -977865 -944229
-1745 -944229 -964684 -977885 -959540 -946184 -980341 -940537 -987364 -915472 -900502 -933392 -982070 -859430 -940506
-1758 -940506 -979533 -912990 -927679 -973168 -953365 -979206 -950554 -910872 -881958 -951301 -951981 -912284 -960719 -960424
-1772 -960424 -905397 -908018 -954501 -935472 -924698 -926073 -1001331 -969119 -935025 -960058 -888715 -923597 -946810
-1785 -946810 -997587 -959852 -979975 -961497 -956222 -947892 -942991 -924143 -896909 -926362 -967711 -960340 -923353 -977477
-1799 -977477 -965585 -942447 -921162 -952931 -948670 -976632 -933943 -907213 -942932 -938091 -1020153 -976098 -928245
-1812 -928245 -933362 -972150 -849603 -918571 -966040 -969448 -1016398 -942735 -896116 -935805 -994531 -942235 -940396
-1825 -940396 -980011 -952839 -967797 -977291 -911466 -893026 -937576 -920404 -880219 -919430 -903260 -1006127 -930233
-1838 -930233 -973313 -892636 -995523 -989850 -947611 -935503 -895348 -936657 -957264 -928472 -981685 -898551 -922293
-1851 -922293 -905612 -904697 -958604 -951690 -918214 -851479 -951910 -943915 -895768 -921731 -968460 -964921 -856737
-1864 -856737 -929155 -917992 -931866 -946519 -870459 -921772 -971229 -941077 -965294 -962232 -938707 -963145 -922804
-1877 -922804 -928600 -915082 -930410 -960167 -911027 -908063 -895983 -877316 -955352 -963281 -994786 -942628 -958641 -968005
-1891 -968005 -960594 -855887 -955445 -980872 -1014473 -943287 -937135 -944832 -955905 -929099 -964023 -983707 -1000554
-1904 -1000554 -976973 -919841 -980399 -946119 -942189 -942602 -900908 -912911 -984727 -982795 -971739 -959838 -919713
-1917 -919713 -964919 -913641 -976392 -938442 -962080 -887007 -970153 -849663 -899863 -1008025 -970251 -965423 -921404
-1930 -921404 -960849 -927305 -1000433 -967858 -842494 -991335 -942871 -889664 -879165 -951510 -897834 -888472 -918627
-1943 -918627 -903856 -894868 -926739 -935474 -965227 -989994 -980540 -938510 -950609 -985626 -913009 -953301 -886791
-1956 -886791 -869972 -905341 -946614 -931133 -937193 -903407 -903933 -877887 -943662 -943596 -978403 -936897 -908375 -930557
-1970 -930557 -967942 -960812 -922271 -987988 -949102 -967360 -954927 -945993 -893951 -923565 -915614 -1004509 -1000380 -931694
-1984 -931694 -887364 -927640 -908920 -976720 -882997 -897636 -897985 -892588 -902665 -988674 -924726 -906440 -912441 -938739
-1998 -938739 -982009 -992181 -967733 -898286 -949804 -956084 -959546 -905479 -883106 -1024911 -894846 -872580 -832214
-2011 -832214 -928068 -884285 -902545 -921836 -934916 -959926 -894839 -992313 -976352 -908371 -911756 -908162 -861699
-2024 -861699 -941099 -948770 -923617 -930604 -927861 -951103 -900237 -902872 -976511 -929836 -945336 -892467 -920519 -917396
-2038 -917396 -893552 -917711 -935632 -950208 -952113 -918028 -937960 -809952 -878589 -958130 -867296 -902245 -941476
-2051 -941476 -899103 -967747 -911545 -925238 -871720 -926036 -898738 -941061 -908294 -950861 -988063 -958574 -901906
-2064 -901906 -928036 -895503 -950098 -884476 -892880 -846758 -894986 -905110 -973424 -937527 -908177 -986589 -914519
-2077 -914519 -984367 -861823 -896976 -966016 -953264 -900721 -911274 -938593 -959674 -905025 -879521 -878841 -891444
-2090 -891444 -911442 -947650 -899950 -900378 -846434 -845049 -902924 -897338 -896299 -931760 -876123 -925413 -912360 -876990
-2104 -876990 -935781 -886720 -946775 -891960 -936434 -964970 -909965 -902515 -917455 -861845 -862417 -891324 -897842 -903623
-2118 -903623 -913522 -946379 -983725 -920428 -942137 -894163 -885573 -930340 -914904 -915083 -966225 -925833 -1011745 -922503
-2132 -922503 -850784 -903318 -892712 -915911 -912256 -907673 -911283 -916289 -875127 -934242 -872125 -914638 -903984 -890963
-2146 -890963 -927582 -987165 -900577 -948128 -858922 -871181 -883854 -918518 -935122 -970803 -858155 -888685 -864113
-2159 -864113 -905324 -897460 -946567 -933112 -915717 -834261 -960654 -909778 -876401 -902813 -915756 -934284 -915372
-2172 -915372 -963543 -880826 -817361 -854086 -973490 -861685 -844029 -934631 -916405 -941746 -845587 -920387
-2184 -920387 -971679 -904518 -859410 -921997 -897693 -832508 -975220 -913806 -892586 -910663 -865709 -871598 -836522
-2197 -836522 -928851 -889179 -881671 -887058 -941131 -887327 -874410 -897338 -898972 -966297 -975821 -926185 -877607 -911225
-2211 -911225 -944763 -917781 -917658 -890664 -864143 -918389 -847077 -922709 -904176 -905266 -914917 -947014 -921179 -903950
-2225 -903950 -878150 -975030 -957429 -922105 -900458 -912246 -937410 -894150 -932482 -903496 -873276 -816367 -811648
-2238 -811648 -849981 -872071 -873838 -911998 -881637 -866801 -904385 -919498 -910854 -850778 -892536 -883783 -910013
-2251 -910013 -847199 -878754 -865562 -903737 -966399 -888181 -930010 -950795 -891256 -877579 -891297 -873003 -895853
-2264 -895853 -846610 -908338 -869756 -908861 -919278 -886487 -895310 -888900 -954556 -874930 -917300 -926890 -834690
-2277 -834690 -889054 -915837 -889058 -910863 -860538 -926527 -869922 -929782 -944023 -918558 -847208 -881572 -879150
-2290 -879150 -905889 -828947 -902320 -891269 -852646 -930068 -949041 -951018 -869059 -937970 -902180 -879618 -889577
-2303 -889577 -909170 -945889 -856681 -924330 -881230 -904939 -932936 -867454 -862375 -930845 -935465 -939032 -894773
-2316 -894773 -884517 -837088 -927427 -899646 -894921 -909352 -820155 -853986 -923325 -916814 -880709 -887884 -860783
-2329 -860783 -905509 -898508 -938494 -907431 -951801 -863558 -902408 -877077 -889045 -897288 -896508 -854668 -853366 -897700
-2343 -897700 -901747 -932074 -928526 -939125 -910550 -925393 -915853 -870211 -919463 -910009 -855893 -887849 -886490 -919230
-2357 -919230 -835131 -854363 -842683 -853506 -917676 -881384 -900726 -893629 -879096 -843211 -826423 -849120 -894520
-2370 -894520 -901420 -914379 -833530 -860354 -895417 -874286 -828909 -865975 -839042 -866027 -935669 -932208 -892383
-2383 -892383 -896261 -861358 -950178 -886758 -906590 -919851 -819047 -858073 -877798 -892959 -857999 -926865 -917813
-2396 -917813 -829268 -843722 -879876 -881741 -845078 -896529 -925378 -894880 -805291 -899408 -927195 -821436 -794887
-2409 -794887 -905460 -900801 -843751 -867722 -812423 -812716 -812288 -864364 -925244 -880874 -908704 -888401 -836925 -900820
-2423 -900820 -868750 -901760 -922433 -876259 -879892 -908101 -901970 -824199 -905875 -909901 -879469 -858827 -916998
-2436 -916998 -872642 -844164 -900767 -913523 -847125 -882658 -860855 -927408 -909593 -941239 -910158 -855705 -867853
-2449 -867853 -907125 -876297 -890516 -867502 -857794 -863653 -835218 -932143 -888327 -864780 -930600 -872893 -809402
-2462 -809402 -857905 -906528 -895015 -899779 -888701 -875840 -888978 -882369 -860676 -914673 -848836 -880227 -846929
-2475 -846929 -873113 -893173 -848758 -904503 -850835 -787197 -884484 -896139 -839356 -886702 -862570 -862209 -812834
-2488 -812834 -881325 -885779 -890557 -796881 -840970 -923453 -825621 -861423 -852805 -866792 -873124 -937176 -907106 -894273
-2502 -894273 -860540 -796914 -903994 -907902 -871191 -853984 -920194 -913328 -844660 -838853 -870071 -886066 -885410 -852751
-2516 -852751 -917995 -838953 -841189 -866729 -867936 -892836 -876254 -829590 -871440 -941640 -904630 -915575 -873275
-2529 -873275 -931652 -890368 -905315 -904219 -882895 -861886 -884835 -860030 -869677 -878699 -887473 -853728 -881700 -932707
-2543 -932707 -867710 -890461 -934287 -880030 -931636 -896681 -818457 -866496 -916969 -869759 -811626 -964794 -924272
-2556 -924272 -939966 -908986 -869987 -881408 -865922 -858317 -830575 -811808 -896298 -876579 -851955 -833493 -854716
-2569 -854716 -867840 -871685 -956570 -898115 -944402 -979628 -906071 -892544 -855252 -837549 -850488 -907855 -885777
-2582 -885777 -868846 -883158 -844154 -884446 -862665 -926340 -878003 -863071 -893997 -898014 -902750 -824726 -791741
-2595 -791741 -950579 -864003 -798946 -886786 -895147 -886823 -821052 -885810 -846051 -931921 -889686 -798132 -801860
-2608 -801860 -858022 -888367 -904302 -836936 -854836 -867949 -880751 -832095 -825998 -853250 -831253 -851248 -836037
-2621 -836037 -847691 -882412 -874761 -885624 -901314 -844845 -851963 -843081 -776279 -839419 -859955 -827166 -872660
-2634 -872660 -858715 -865285 -830750 -939491 -860445 -829509 -876357 -892863 -768804 -890114 -854617 -848257
-2646 -848257 -952973 -857175 -828477 -820231 -820577 -875682 -830065 -901515 -882582 -816514 -891409 -877071 -894786
-2659 -894786 -874217 -801221 -848799 -942489 -909751 -874740 -906399 -862451 -848639 -828128 -866609 -943992 -864314
-2672 -864314 -816006 -853987 -875583 -882932 -840420 -878955 -874306 -870524 -867104 -903598 -852404 -896556 -886145 -828322
-2686 -828322 -813380 -900217 -864980 -838426 -832771 -796635 -827312 -803095 -851534 -832317 -821455 -834641 -930838
-2699 -930838 -873991 -930478 -911570 -870377 -843129 -806027 -871503 -908665 -891555 -873550 -856474 -872659 -858652
-2712 -858652 -855787 -833566 -848097 -900462 -862276 -865460 -927275 -877128 -887099 -869825 -890982 -898458 -860025 -851650
-2726 -851650 -782056 -844963 -931458 -859310 -942425 -910911 -881534 -864212 -887994 -867864 -860144 -862091 -880160
-2739 -880160 -897867 -925481 -857887 -832540 -791413 -882862 -903721 -876666 -806143 -838550 -849620 -868909 -796395
-2752 -796395 -928134 -908530 -862744 -835734 -817214 -835783 -816541 -870303 -823266 -825402 -898003 -841276 -847220
-2765 -847220 -830147 -791197 -830294 -851225 -876935 -858042 -877996
-2772h77996  $$ checkpoint
##PAGE= N=2
##DATA TABLE=(X++(I..I)), XYDATA
13611 -2809280 -2730211 -2755726 -2772807 -2793853 -2729201 -2777488 -2826664 -2867864 -2798967 -2762872 -2740704 -2742135 -2704918
13598 -2704918 -2765170 -2784172 -2804940 -2807739 -2732196 -2713037 -2818965 -2677410 -2738407 -2784709 -2725215 -2783935
13586 -2783935 -2721024 -2762796 -2725157 -2758253 -2748359 -2744878 -2683975 -2688847 -2802334 -2748819 -2768607 -2755283 -2697155
13573 -2697155 -2722614 -2705785 -2725491 -2700903 -2676882 -2651513 -2730099 -2694632 -2652654 -2711767 -2726741 -2685828 -2649434
13560 -2649434 -2702484 -2690846 -2615264 -2622908 -2685186 -2666024 -2638400 -2645418 -2653744 -2664062 -2701229 -2665929 -2672474
13547 -2672474 -2659623 -2707840 -2640174 -2626181 -2596744 -2548914 -2637207 -2664359 -2659779 -2594209 -2604292 -2624698 -2616016
13534 -2616016 -2621175 -2628359 -2639898 -2631590 -2660768 -2627576 -2652375 -2604907 -2555714 -2567078 -2573608 -2581970 -2602517 -2604653
13520 -2604653 -2588654 -2634391 -2592974 -2570211 -2549866 -2592172 -2558348 -2579324 -2582054 -2548624 -2566670 -2589922 -2592115
13507 -2592115 -2507916 -2546790 -2553695 -2549091 -2537195 -2585797 -2523550 -2479029 -2529325 -2527863 -2453907 -2566082 -2544198
13494 -2544198 -2539932 -2492837 -2508437 -2472089 -2508602 -2497235 -2459619 -2502042 -2491199 -2473176 -2501790 -2498030 -2455366
13481 -2455366 -2434374 -2444905 -2512658 -2549584 -2499756 -2514895 -2455405 -2523344 -2459718 -2501004 -2474227 -2529356 -2468172
13468 -2468172 -2439279 -2460067 -2474328 -2500841 -2399976 -2394275 -2468369 -2416132 -2456643 -2485888 -2448745 -2448580 -2429489
13455 -2429489 -2433394 -2454975 -2437364 -2462974 -2420454 -2417710 -2439532 -2332727 -2395348 -2421030 -2415796 -2369222 -2449609
13442 -2449609 -2487263 -2422555 -2313692 -2372284 -2450049 -2411692 -2338050 -2354764 -2371628 -2395554 -2398229 -2394051 -2325393
13429 -2325393 -2361850 -2286739 -2315205 -2313419 -2340692 -2417767 -2381954 -2393268 -2379211 -2369736 -2326467 -2291967 -2327389
13416 -2327389 -2324186 -2347362 -2343899 -2314358 -2265087 -2367921 -2328121 -2353126 -2275244 -2353078 -2355159 -2320019 -2336332
13403 -2336332 -2383295 -2267927 -2290845 -2273992 -2334429 -2328223 -2294663 -2246108 -2313329 -2255935 -2248257 -2324492 -2272076
13390 -2272076 -2312138 -2283465 -2315711 -2281985 -2335774 -2261896 -2208990 -2204469 -2282650 -2374551 -2264614 -2287902 -2214477
13377 -2214477 -2113654 -2209802 -2201656 -2274841 -2275898 -2287022 -2220646 -2224589 -2286237 -2278445 -2208752 -2186673 -2177047
13364 -2177047 -2203994 -2210489 -2263104 -2250907 -2186792 -2200563 -2201316 -2215466 -2187370 -2147336 -2218677 -2203196 -2211896
13351 -2211896 -2163137 -2255484 -2172140 -2161579 -2182862 -2208760 -2306710 -2201073 -2220825 -2207712 -2164738 -2218002
13339 -2218002 -2199244 -2213224 -2186918 -2155851 -2166472 -2168673 -2182989 -2208728 -2218767 -2201091 -2140846 -2131047 -2154540
13326 -2154540 -2140822 -2129524 -2145689 -2125650 -2193987 -2142697 -2132382 -2071390 -2082122 -2038233 -2131798 -2144259 -2087531
13313 -2087531 -2056782 -2078386 -2150633 -2142595 -2120375 -2070301 -2113945 -2066762 -2103446 -2084430 -2092248 -2109777 -2083013
13300 -2083013 -2051714 -2076239 -2003496 -2121938 -2076187 -2063245 -2057065 -2096190 -2093332 -2043112 -2055087 -2087487 -2106738
13287 -2106738 -2090599 -2104828 -2045668 -2059110 -2045549 -2073474 -2054794 -1993578 -1948840 -2094772 -2036467 -2004147
13275 -2004147 -2035401 -1987303 -2049974 -1997351 -2013719 -2025988 -2033121 -1956464 -2021676 -1978238 -2035908 -2020701 -1971054
13262 -1971054 -1994653 -1981655 -2033981 -1995888 -1951300 -1989494 -1964816 -1926699 -1963720 -1968228 -1936845 -1914852 -1973362
13249 -1973362 -1983242 -1886337 -1983875 -1953637 -1993569 -1931146 -1950894 -1873473 -1856049 -1987764 -1906651 -1903016 -2018996
13236 -2018996 -1926464 -1958117 -1966421 -1962928 -1944365 -1940417 -1924086 -1916882 -1997557 -1968463 -1929400 -1940375 -1967893
13223 -1967893 -1893216 -1915638 -1920516 -1950548 -1913055 -1788013 -1918531 -1911754 -1875531 -1890382 -1888518 -1841310 -1926984
13210 -1926984 -1917521 -1934974 -1874830 -1890155 -1980329 -1863467 -1860366 -1848842 -1829441 -1859932 -1918716 -1841463 -1854683
13197 -1854683 -1901993 -1866190 -1846418 -1895280 -1799808 -1825897 -1792794 -1840923 -1798908 -1818672 -1840499 -1891137 -1875506
13184 -1875506 -1801177 -1848498 -1772221 -1811270 -1804438 -1795125 -1749116 -1824275 -1810738 -1801176 -1755205 -1833935 -1758310
13171 -1758310 -1826035 -1756358 -1851522 -1816368 -1801750 -1819138 -1809407 -1756191 -1793114 -1779848 -1783294 -1781662 -1748518
13158 -1748518 -1735189 -1767801 -1803616 -1746138 -1755145 -1752815 -1759610 -1729666 -1722492 -1792175 -1817144 -1686963 -1743169
13145 -1743169 -1680902 -1704298 -1782652 -1697681 -1667911 -1788349 -1761013 -1742042 -1776438 -1711617 -1710640 -1702999 -1785671
13132 -1785671 -1696385 -1702555 -1736789 -1665629 -1696185 -1642161 -1728217 -1674760 -1739403 -1698860 -1711695 -1668797 -1672509
13119 -1672509 -1671608 -1665114 -1685267 -1639681 -1667231 -1620848 -1666980 -1687459 -1703747 -1654034 -1697091 -1678014 -1635208
13106 -1635208 -1623183 -1565360 -1647543 -1723870 -1702492 -1633485 -1625575 -1662680 -1553785 -1628455 -1678415 -1662267 -1670193
13093 -1670193 -1665501 -1589813 -1671363 -1651371 -1687777 -1613606 -1619625 -1598763 -1681035 -1650878 -1636668 -1624385 -1624071
13080 -1624071 -1592313 -1564249 -1568091 -1621232 -1603010 -1626184 -1566328 -1666969 -1615235 -1585121 -1585685 -1508686 -1601996
13067 -1601996 -1515939 -1564828 -1637648 -1550357 -1498200 -1561095 -1598981 -1546495 -1557334 -1612269 -1555419 -1483336 -1550078
13054 -1550078 -1553674 -1561389 -1546020 -1480001 -1548708 -1532309 -1522209 -1534745 -1551546 -1558132 -1576308 -1574961 -1546537
13041 -1546537 -1503301 -1550757 -1474735 -1475787 -1512320 -1554434 -1464523 -1490349 -1410940 -1446917 -1494403 -1489590 -1511221
13028 -1511221 -1479936 -1539622 -1580657 -1433328 -1469665 -1524341 -1481868 -1493246 -1456564 -1518990 -1466001 -1458711 -1499045
13015 -1499045 -1465781 -1476859 -1493416 -1475730 -1463272 -1411041 -1433249 -1419550 -1428248 -1438648 -1487107 -1426334 -1431747
13002 -1431747 -1426430 -1449211 -1376135 -1361573 -1433554 -1448717 -1451817 -1465159 -1387860 -1421863 -1435073 -1374445 -1485865
12989 -1485865 -1474206 -1387020 -1416189 -1382083 -1380340 -1363773 -1420574 -1478297 -1425697 -1443969 -1348558 -1410856 -1316874
12976 -1316874 -1362205 -1426037 -1409931 -1404627 -1421513 -1371575 -1403983 -1357067 -1329152 -1342746 -1372608 -1359374 -1366299
12963 -1366299 -1359610 -1358241 -1340158 -1426405 -1391962 -1315941 -1324573 -1339937 -1364472 -1348045 -1309396 -1351878 -1359866
12950 -1359866 -1332161 -1351156 -1264549 -1291803 -1355901 -1352444 -1381330 -1322632 -1201129 -1265587 -1313019 -1319295 -1353968
12937 -1353968 -1304160 -1351219 -1275479 -1308444 -1346732 -1337065 -1280391 -1305599 -1252209 -1297726 -1313908 -1294253 -1248099
12924 -1248099 -1260317 -1295462 -1277636 -1282897 -1287109 -1307187 -1295516 -1305232 -1305349 -1261096 -1277731 -1251102 -1318576 -1273955
12910 -1273955 -1224344 -1264112 -1243433 -1288945 -1262052 -1223893 -1271294 -1295918 -1224727 -1150697 -1190296 -1268310 -1218931
12897 -1218931 -1185641 -1222314 -1274201 -1235043 -1202278 -1220779 -1239609 -1216449 -1245215 -1226670 -1261617 -1243845 -1227577
12884 -1227577 -1189819 -1240333 -1169918 -1143698 -1181271 -1166790 -1185914 -1193456 -1180410 -1203768 -1209834 -1162997 -1177640
12871 -1177640 -1177874 -1201728 -1193816 -1235414 -1223537 -1142815 -1170938 -1184686 -1187013 -1180734 -1163672 -1147964 -1188720 -1185160
12857 -1185160 -1087368 -1163530 -1226674 -1154517 -1103210 -1149587 -1154209 -1105933 -1077237 -1151533 -1115796 -1119299 -1121992
12844 -1121992 -1143434 -1059884 -1087052 -1098406 -1128932 -1003984 -1049499 -1094107 -1078215 -1052262 -1019901 -1092306
12832 -1092306 -1062454 -1101551 -1081039 -1094346 -1091086 -1074298 -1032017 -1009546 -1099931 -1108465 -1132364 -1059991 -1076326
12819 -1076326 -1136440 -1052138 -1049424 -1060894 -1044392 -1099879 -1042722 -1020081 -1054511 -1100388 -1063649 -1052826 -1068135
12806 -1068135 -1011795 -972833 -1015380 -1002041 -1015627 -1057254 -1018246 -1061548 -1035389 -993898 -1018956 -985645 -1018879
12793 -1018879 -995348 -1022209 -1007370 -955512 -989040 -1028537 -1010898 -959615 -939113 -980496 -983331 -1020983 -992203
12780 -992203 -1041132 -1000405 -992920 -984360 -1057618 -978017 -960450 -1006293 -997399 -920886 -972275 -981203 -961527 -955566
12766 -955566 -917865 -966745 -1036263 -948760 -929024 -1000403 -916127 -973678 -929192 -978067 -940054 -944960 -954089
12753 -954089 -905937 -917113 -910606 -937484 -969527 -930035 -977144 -907771 -996772 -1008759 -933210 -897104 -930498
12740 -930498 -940156 -862286 -873462 -926362 -904480 -868318 -878741 -873171 -869545 -934000 -917291 -900177 -833534
12727 -833534 -918108 -878320 -889195 -892425 -853314 -931589 -901022 -884707 -873438 -849720 -873152 -901943 -882702
12714 -882702 -920032 -865067 -785811 -821642 -854514 -811089 -893428 -858550 -834204 -828771 -879349 -820579 -867591
12701 -867591 -840221 -781172 -893369 -816115 -871866 -772830 -808060 -722953 -864701 -799244 -771136 -836152
12689 -836152 -773089 -808569 -787984 -831606 -840710 -764559 -829427 -753531 -814514 -815478 -815814 -833017 -829318 -804780
12675 -804780 -813692 -806478 -820738 -753124 -767416 -780645 -777510 -838508 -766919 -741515 -788165 -842814 -817838
12662 -817838 -805542 -742048 -735623 -771228 -778619 -771382 -763483 -813294 -653842 -689502 -738717 -796927 -762013
12649 -762013 -693615 -728182 -746785 -706112 -744805 -779880 -710430 -756700 -760303 -646814 -714355 -719884 -733401
12636 -733401 -742556 -685709 -721005 -707773 -729495 -674317 -644600 -633894 -725144 -704882 -708894 -740394 -611905
12623 -611905 -709497 -762841 -663933 -745700 -643490 -650360 -710997 -646770 -670102 -716816 -669951 -648609 -651768
12610 -651768 -714154 -633349 -662309 -580755 -664143 -677279 -629148 -676811 -679943 -724770 -605920 -670704 -665965
12597 -665965 -650995 -674538 -675750 -632865 -592231 -659885 -613949 -541350 -587970 -622065 -585308 -608126 -609742
12584 -609742 -578839 -631629 -665067 -623698 -658466 -614367 -615963 -519548 -603213 -641189 -579874 -626614 -515728
12571 -515728 -517204 -579498 -641449 -560750 -534844 -551783 -555541 -539028 -601169 -570640 -552317 -564411 -569321
12558 -569321 -597169 -500252 -583812 -542833 -490175 -533201 -568707 -570707 -583314 -520846 -559816 -592961 -539171
12545 -539171 -629190 -594102 -543728 -584144 -528198 -489635 -549567 -505253 -542808 -529922 -548077 -510174 -532968
12532 -532968 -524124 -469827 -457465 -500152 -548579 -529780 -495652 -494023 -554276 -502014 -478353 -464752 -479013
12519 -479013 -550171 -514264 -490626 -460107 -498828 -477187 -442828 -524706 -492389 -480133 -463335 -379640 -477624
12506 -477624 -447046 -473527 -441028 -485744 -462594 -411866 -460395 -535193 -427597 -472014 -421116 -437255 -376422
12493 -376422 -378998 -431770 -463081 -449204 -405847 -414384 -432374 -408698 -431184 -472312 -381584 -422113 -470328
12480 -470328 -410051 -436835 -452209 -459498 -403142 -392623 -360500 -417199 -421895 -422465 -323263 -362369 -379930 -367942
12466 -367942 -389438 -382118 -436896 -416683 -477710 -458978 -381511 -375570 -344835 -290229 -341622 -331591 -322575
12453 -322575 -356983 -361981 -338455 -346249 -408502 -367530 -347887 -300245 -338385 -324106 -314067 -346367 -360035 -360610
12439 -360610 -254508 -286345 -287349 -337045 -264014 -343928 -331672 -334556 -333432 -268780 -252188 -279564 -267997
12426 -267997 -314545 -246568 -311832 -278977 -283924 -274731 -284006 -376801 -259698 -307436 -311480 -347910 -276248 -276764
12412 -276764 -196697 -264328 -285096 -287868 -208841 -290391 -152016 -222552 -285393 -267223 -272387 -216623 -134283
12399 -134283 -192033 -302338 -245518 -215131 -292589 -281530 -224810 -261953 -236751 -266196 -180217 -303371
12387 -303371 -223931 -202336 -180824 -286274 -193934 -253168 -276138 -222307 -291722 -181824 -273986 -182723
12375 -182723 -172422 -220046 -169952 -214347 -188922 -185999 -291263 -195091 -193420 -180499 -212824 -146779 -99421
12362 -99421 -153271 -178866 -143592 -153916 -151120 -228944 -211034 -142596 -141418 -141446 -148790 -69159 -201427 -164890
12348 -164890 -142155 -169311 -164884 -174843 -157173 -158376 -162316 -183222 -197064 -155450 -144114 -122164 -149959 -91622
12334 -91622 -157415 -207952 -73822 -104421 -177587 -124809 -120731 -115095 -97507 -95779 -63728 -104171 -77249 -80700
12320 -80700 -176054 -116521 -110428 -99964 -97294 -169635 -130697 -69281 -99239 -136062 -58433 -90090 -83539 -71012
12306 -71012 -114082 -88861 -91003 -51624 -61407 -74663 -40759 -75555 -77615 -77858 -7261 -49574 -16498 -32027
12292 -32027 -19222 -83636 -44558 -37175 -39565 -28285 -40735 41664 -55383 -7160 -55807 -40771 -1548 -1822
12278 -1822 -46068 -9547 -31907 -24728 -19985 -18899 15592 -75031 62919 27516 28076 10685 -85510 -19479
12264 -19479 -23235 62874 -15397 -34827 22162 48119 37493 -33027 -53479 14780 -41096 19051 69789
12251 69789 18334 58924 89388 26797 52409 63217 -3602 61146 25949 31784 45320 85029 37046 36966
12237 36966 65002 -3293 44698 23211 26330 37204 11226 104239 65543 51608 116863 36841 93500
12224 93500 64249 63607 14411 59082 94412 108043 93900 66645 76790 42916 99054 91877 68147 158841
12210 158841 166983 127373 118295 100270 110994 127165 110164 76376 66106 151466 95726 79510 120023
12197 120023 78271 113457 90554 85137 146782 76704 38304 107939 126575 108010 153251 164585 151994
12184 151994 113892 125631 158648 136003 175064 158049 188004 170572 151608 223406 198234 190073 172357
12171 172357 137493 224505 152127 89458 212884 243212 210090 143113 225415 212001 180433 217541 248277
12158 248277 210862 230935 190206 188011 185163 224978 216541 215517 228505 281742 233758 203170 204450 222215
12144 222215 212798 161483 256997 224237 224441 232142 244754 323204 239323 234743 241251 248879 262740 235521
12130 235521 296119 244511 258834 285299 259245 288189 245281 314884 291114 252224 299301 249959 271333
12117 271333 280256 265272 242765 361722 349043 334062 310805 278277 245414 276367 291608 228001 283023
12104 283023 240877 251136 267246 304338 351517 332427 318583 312393 263431 271053 254770 356151 354662
12091 354662 312775 307222 289272 396555 301192 330838 360428 319075 347210 301505 340186 428100 348076
12078 348076 362540 372252 367209 272300 301653 381423 286036 361428 344661 359403 320772 339790 371469
12065 371469 392083 400340 290856 418367 353269 392354 426476 333262 378966 372042 401198 363220 458858
12052 458858 358149 337563 389297 381333 393650 396937 461618 447962 372793 420691 406797 412322 420812
12039 420812 491007 436919 439985 392934 398307 471876 459039 372661 390404 428417 439653 465886 495321
12026 495321 402256 439546 469071 485123 449755 435664 521997 511030 495841 455176 427543 459164 463412
12013 463412 385589 437569 515576 502619 451909 453168 444504 477272 482284 495312 466324 468616 489565 454908
11999 454908 542318 468798 508609 486669 526645 496135 482913 461779 609644 528939 525658 565964 513843
11986 513843 531302 578106 555948 506906 595143 591097 589056 493200 518674 489460 603037 537153 546102
11973 546102 489038 534522 593718 520517 545518 540554 543345 516089 538898 589287 578382 561371 629075
11960 629075 590473 597090 508810 556215 562454 634178 631073 599905 637472 614621 572373 615769 576471
11947 576471 638369 663209 660004 616111 613450 612070 648774 582619 524428 614312 570395 564831 584899 590509
11933 590509 576920 573344 610093 621349 661558 618225 562944 617942 596714 628612 719052 630049 714146
11920 714146 664547 679585 657254 641376 597882 636641 680388 608862 639885 686471 653465 665120 625228
11907 625228 639994 661410 651178 640300 690823 653224 625786 679344 714122 666340 678897 719860 706500
11894 706500 702600 736404 709903 682371 705750 705937 728289 748774 747058 718483 735377 689897 658009 706720
11880 706720 710850 647009 716788 739393 761861 705771 738000 706777 705512 753538 740123 768451 735268
11867 735268 752015 747054 726506 733442 825151 777346 769750 767899 759504 731767 748993 781816 843314 869686
11853 869686 855223 753428 791392 787432 787770 788045 790965 802209 739968 763788 729605 827440 829612 808427
11839 808427 768275 750172 781942 863681 754395 788167 849118 812379 804785 766011 785239 805428 826308
11826 826308 815949 861899 764215 804055 839723 827928 786281 807024 858524 811182 859069 858225 844960
11813 844960 790984 877192 833144 825535 797658 884857 878029 938558 908981 857003 841700 944717 910723
11800 910723 816886 837592 840476 865845 896785 859033 876755 881693 845506 946442 911548 859943 960817
11787 960817 911395 895471 932743 845433 907648 873186 930238 883287 917669 907723 910439 865843 857352
11774 857352 834517 906358 921882 932474 990190 920392 941765 940742 964244 994237 894890 930105 923220
11761 923220 943370 880682 920739 955565 939959 939646 911685 946623 935038 970712 953771 1028315 957734
11748 957734 995022 954858 969782 998676 1020164 974039 890769 946173 977046 1020245 1029915 1000466 947504
11735 947504 969963 1012424 1087686 1015751 1001095 1047032 1014714 1007507 967365 978285 935278 1091981 974338
11722 974338 1012713 963197 992745 1069038 1030592 1032803 990595 1041500 1101663 1074429 1017557 1022117 1041895
11709 1041895 1110778 1046691 1082805 1034323 1001296 1026204 1142404 1002473 979273 1089191 1079793 1044984
11697 1044984 1121015 1137742 1036510 1092143 988227 1076707 1060616 1079607 1063774 1064443 1113549 1075948 1138917
11684 1138917 1140299 1056074 1063967 1066413 1054404 1115163 1097940 1150257 1183479 1046615 1157024 1130503 1068965
11671 1068965 1162373 1142457 1133536 1125030 1117818 1169576 1032444 1129650 1134400 1169979 1063871 1061533 1154366
11658 1154366 1107456 1159216 1192139 1162204 1163663 1217836 1108179 1140335 1204031 1114152 1151131 1208033 1150774
11645 1150774 1118650 1120638 1124638 1110433 1113334 1160158 1104472 1173298 1108065 1177550 1139956 1200954 1175567
11632 1175567 1179624 1199500 1174720 1164065 1164605 1212115 1220564 1192887 1198027 1189464 1230753 1178810 1200539 1213688
11618 1213688 1225716 1209061 1213244 1244571 1285271 1270921 1184787 1198462 1245753 1178711 1201972 1235825 1309681
11605 1309681 1262709 1313272 1225940 1204402 1199575 1246068 1254726 1298077 1163452 1286789 1251439 1306372 1269142
11592 1269142 1299995 1210826 1263381 1267778 1283689 1264726 1285407 1250028 1239475 1275217 1261282 1300639 1309023
11579 1309023 1264149 1266097 1259316 1264067 1290318 1311031 1313227 1333030 1223833 1329457 1312141 1362355 1320001
11566 1320001 1317523 1313402 1300267 1307599 1362533 1328853 1305812 1321398 1285363 1259557 1278116 1307018 1287069
11553 1287069 1270914 1382326 1338707 1369226 1321920 1334014 1334941 1362042 1417647 1356188 1432632 1341187 1385849
11540 1385849 1317243 1349219 1382681 1353699 1342755 1324031 1254997 1404792 1423273 1436160 1445442 1308836
11528 1308836 1342292 1363982 1381626 1319279 1371668 1459560 1431031 1400987 1365700 1387084 1357807 1415065 1354727
11515 1354727 1348681 1404407 1416662 1415778 1459027 1359992 1440061 1426699 1465294 1392653 1308896 1393703 1390537
11502 1390537 1521137 1462618 1465719 1440417 1423848 1481402 1346533 1394181 1387208 1524388 1414791 1486520
11490 1486520 1430037 1491180 1451327 1488983 1498970 1462669 1446065 1452985 1455263 1531757 1472117 1496781 1537549
11477 1537549 1555458 1499530 1438897 1472720 1505635 1471769 1544592 1420854 1428344 1389487 1468595 1528097 1477137
11464 1477137 1444309 1530729 1516537 1539619 1540471 1468169 1490795 1563751 1548276 1483444 1535478 1554749 1541551
11451 1541551 1486851 1568762 1487163 1444702 1583680 1539395 1534387 1533568 1546198 1497015 1616637 1503183 1525045
11438 1525045 1539470 1569798 1560777 1570956 1545767 1531374 1552783 1621213 1550509 1655577 1644741 1560036 1564424
11425 1564424 1549283 1575895 1614625 1542165 1553767 1567733 1512667 1626732 1646746 1637208 1601671 1585656 1612219
11412 1612219 1597547 1588069 1585265 1661060 1604936 1584708 1602539 1628316 1690190 1642065 1613520 1642421 1674885
11399 1674885 1633255 1600774 1628591 1720345 1656269 1680083 1725228 1620459 1679834 1619089 1663749 1705259 1711668
11386 1711668 1608730 1640917 1663526 1684449 1744191 1708514 1684382 1684499 1618451 1687289 1659455 1709278 1673071
11373 1673071 1724468 1653839 1760578 1695321 1683123 1666446 1690313 1634100 1691485 1686324 1701459 1710698 1716693
11360 1716693 1730523 1659188 1693413 1665509 1698545 1698345 1709303 1766039 1787082 1731039 1710351 1634170 1636129
11347 1636129 1708603 1814573 1807980 1791385 1783016 1701793 1781010 1748755 1716765 1727409 1753880 1727916 1766511
11334 1766511 1751341 1794945 1779895 1762794 1709381 1753091 1749887 1739322 1819434 1866485 1809727 1802925 1796605
11321 1796605 1818699 1774856 1826680 1786212 1790344 1774477 1836951 1805509 1791501 1777503 1744189 1847570 1812625
11308 1812625 1737739 1812731 1808865 1815423 1836867 1851621 1855198 1833937 1892162 1801968 1846116 1774955 1790764
11295 1790764 1892375 1850179 1920194 1828540 1882736 1819831 1837039 1787223 1831340 1852517 1873863 1835406
11283 1835406 1861873 1865208 1910083 1855454 1875838 1841185 1866344 1897999 1881211 1857068 1910367 1864201 1867670
11270 1867670 1878825 1903005 1881518 1878945 1888501 1893438 1848338 1980375 1931742 1876494 1884820 1871911 1973177
11257 1973177 1915906 1935743 1952243 1896228 1954268 1959029 1931381 1902049 1977275 1924284 1943784 1903138 1924738
11244 1924738 1927107 1951914 1879065 1942762 1906292 2000700 1917123 1946607 1905090 1894277 1983607 1976621 1969221
11231 1969221 1981112 1979699 1971064 1914142 1965187 1966358 1952842 2003059 2020794 1978039 1953300 1941092 1988048
11218 1988048 1935463 1973284 2011353 2014617 1965849 1989687 1960867 1978158 2031231 1964796 1982990 2016079 2006364
11205 2006364 2021228 1993531 1940216 2086785 2028246 2010309 1914348 1984767 2066398 2017703 2063010 2017908
11193 2017908 2037400 2014011 2040976 2043066 2023380 2108941 2019638 2092685 2027202 2060224 2006943 2077256 2025479
11180 2025479 1998693 1991363 2022826 2078753 2060112 2066893 2080182 2090905 2084774 2036701 2095159 2121349 2132836
11167 2132836 2092904 2098118 2101140 2097835 2090329 2156548 2125007 2101609 2081479 2117168 2121065 2138087 2096741 2144451
11153 2144451 2162445 2149871 2071435 2082029 2060461 2082837 2083816 2121851 2113126 2111122 2093664 2151061 2179212
11140 2179212 2151227 2144003 2185414 2134291 2182127 2192218 2135329 2159802 2089401 2162805 2181117 2129539 2170039
11127 2170039 2166913 2165892 2088722 2107761 2161176 2197589 2174630 2157459 2231645 2185158 2212387 2204530 2215667
11114 2215667 2260096 2241553 2178220 2189145 2142702 2126550 2202309 2144307 2181302 2176823 2235145 2243672 2166638
11101 2166638 2147957 2232783 2236425 2244601 2221382 2216506 2310031 2202224 2281236 2286440 2286955 2262322 2246848 2263971
11087 2263971 2249414 2284450 2297395 2252607 2267152 2219739 2267993 2233389 2182782 2213966 2282502 2306272 2270207
11074 2270207 2243296 2273852 2230893 2318896 2267027 2261900 2268812 2292697 2310492 2283169 2322933 2358229 2318365
11061 2318365 2253257 2339728 2307759 2341374 2242771 2256475 2267389 2290317 2300965 2335430 2272920 2294842 2311117
11048 2311117 2290866 2245910 2260068 2333905 2376336 2313611 2329282 2372033 2315107 2341206 2337057 2322428 2345769
11035 2345769 2294708 2301952 2360800 2332163 2327932 2322342 2330101 2318969 2364677 2324416 2391853 2358030 2377297
11022 2377297 2322682 2430935 2307481 2381781 2299744 2344264 2416496 2418812 2358782 2306314 2341778 2393519
11010 2393519 2379622 2427512 2456364 2292841 2359438 2411540 2400406 2397672 2438310 2389643 2411997 2397509 2440798
10997 2440798 2413257 2362725 2360616 2390588 2456533 2383148 2446111 2461484 2471841 2486873 2464382 2484952 2442000
10984 2442000 2479414 2487801 2467594 2367962 2474761 2464568 2467213 2524672 2457492 2495693 2423223 2519817 2453187
10971 2453187 2447742 2423650 2459130 2386931 2483928 2493948 2448579 2485594 2516672 2408826 2510347 2561922
10959 2561922 2470891 2568140 2451135 2492665 2468616 2513847 2497540 2482827 2497964 2501694 2511598 2533579 2568172
10946 2568172 2493558 2530252 2530425 2529820 2518756 2515388 2514581 2577030 2566374 2510533 2567986 2549818 2478275 2568829
10932 2568829 2602961 2601363 2563454 2592342 2513576 2548472 2589646 2561333 2566582 2533202 2513275 2550822 2539763
10919 2539763 2620017 2657079 2624222 2555164 2620455 2600245 2596690 2622919 2652733 2632662 2637083 2640706 2665434
10906 2665434 2611385 2642306 2662440 2577353 2670387 2666223 2571362 2615947 2581447 2712438 2625404 2576699
10894 2576699 2693083 2649119 2639159 2652454 2660960 2701411 2631823 2705358 2659834 2633525 2665226 2620376 2595288
10881 2595288 2661571 2612385 2656890 2665327 2676293 2655204 2692837 2649095 2672989 2684146 2629273 2661592 2670473
10868 2670473 2670767 2618153 2663346 2699691 2680885 2704073 2798457 2708629 2690075 2729586 2667225 2702767 2751953
10855 2751953 2721712 2691234 2716539 2737136 2722474 2781724 2744447 2717416 2694507 2776894 2749152 2760971 2729206
10842 2729206 2737575 2779101 2746016 2803731 2776245 2702622 2726305 2727359 2632394 2761076 2760246 2728360 2744684
10829 2744684 2750110 2819618 2810719 2748581 2788632 2736998 2850205 2811051 2780985 2774137 2791737 2791273 2770586
10816 2770586 2752446 2838305 2816153 2825567 2824317 2824861 2840997 2815153 2781547 2777716 2770218 2781800 2815497 2827801
10802 2827801 2783697 2803479 2826800 2850147 2860761 2886515 2877811 2834417 2889673 2805972 2818476 2905913 2836313
10789 2836313 2805978 2845010 2931659 2862375 2894570 2841190 2890235 2830970 2869897 2876292 2841638 2890027 2850479
10776 2850479 2930479 2868210 2883800 2908269 2897915 2865855 2885383 2891429 2886994 2999638 2901665 2952683 2917835
10763 2917835 2894629 2975476 2944529 2944426 2892088 2970512 2981642 2915949 2877050 2969870 2915377 3028089 3033762
10750 3033762 2991960 2912508 2940250 2982685 2980505 2974197 3007254 2995210 3042912 2943859 2970410 2973461 2945599
10737 2945599 3012499 2960849 3027349 3053804 2980672 2994158 3044298 3037582 3046920 3061397 3013113 3052552 3000879
10724 3000879 2984404 3003189 2944417 3045626 3000860 3007229 2943116 3019235 2979339 2994001 3056183 3026931 2973039
10711 2973039 2991993 3006274 3057981 3087281 3061486 2989559 3103916 3114660 3111837 3075526 3094432 3069883 3041824
10698 3041824 3070247 3136103 3058754 3061635 3119047 3063788 3095176 3103886 3031844 3068795 3117064 3053394 3100892 3100982
10684 3100982 3087377 3083593 3059505 3093446 3098478 3078403 3144814 3152600 3144864 3139101 3181139 3126728 3113745 3156148
10670 3156148 3049111 3053821 3125852 3197178 3126775 3122919 3199246 3176486 3239055 3172894 3126515 3203551 3176493
10657 3176493 3175398 3171010 3148851 3093141 3250217 3147588 3169011 3204604 3192083 3213334 3233648 3212728 3248078
10644 3248078 3293927 3191482 3251326 3190622 3177150 3231517 3173440 3261448 3234755 3239203 3281069 3281430 3208225
10631 3208225 3203890 3226659 3341467 3231332 3230277 3283860 3308938 3303029 3292148 3238612 3208397 3271221 3264999
10618 3264999 3238768 3286745 3206518 3285146 3224633 3213935 3312236 3303258 3272564 3271341 3289465 3261509 3279202
10605 3279202 3321993 3306884 3332094 3279863 3266145 3320184 3284792 3357536 3295598 3343940 3321956 3325658 3323145
10592 3323145 3329632 3343367 3293403 3357523 3368419 3367098 3366052 3426765 3334774 3309829 3357734 3370877 3347714
10579 3347714 3328132 3409605 3374027 3384658 3384014 3380605 3403563 3363131 3447847 3340921 3313918 3327637 3433448
10566 3433448 3387593 3360049 3358281 3416156 3380836 3382114 3458994 3421464 3423294 3363740 3393920 3455947 3498561
10553 3498561 3387307 3410304 3481499 3424975 3452834 3514603 3469572 3463507 3476339 3472271 3517200 3473489 3438130
10540 3438130 3462668 3363019 3471769 3453025 3453392 3488297 3460496 3445495 3484576 3515736 3490791 3474051 3550736
10527 3550736 3470350 3495208 3511778 3527556 3489403 3476732 3590654 3455156 3437590 3524598 3508051 3474095
10515 3474095 3452200 3498963 3505928 3529080 3521332 3499143 3486041 3557220 3519011 3471856 3469934 3642353 3520532
10502 3520532 3559261 3577162 3602522 3592738 3520071 3564007 3545896 3577113 3537608 3557114 3616891 3595802 3580643
10489 3580643 3610633 3639190 3605082 3574041 3569454 3569763 3593909 3592453 3584781 3579055 3641793 3665019 3601517 3562058
10475 3562058 3596018 3578476 3633602 3665582 3579495 3612558 3602659 3603520 3673428 3674596 3634442 3686236 3700545 3694224
10461 3694224 3587278 3671673 3668157 3699128 3680787 3657017 3673511 3608267 3655527 3682827 3710452 3663664 3664104
10448 3664104 3642264 3645680 3687048 3730865 3689740 3652869 3690089 3717614 3728772 3724288 3723071 3725309 3701356
10435 3701356 3810471 3731653 3708908 3768065 3742459 3772588 3741951 3696096 3772034 3740770 3743168 3752247 3777208
10422 3777208 3780146 3780129 3764572 3747062 3823907 3822309 3714723 3732692 3731713 3715950 3808378 3867258 3850515 3790562
10408 3790562 3815044 3803617 3799209 3807842 3772788 3870383 3849591 3795963 3784584 3762145 3775844 3784859 3813161
10395 3813161 3862512 3831776 3885415 3852145 3898260 3868640 3852573 3871457 3792781 3815418 3823465 3824867 3806752
10382 3806752 3855417 3852563 3793471 3813410 3929975 3955079 3866590 3902393 3961035 3953908 3940487 3935112 3911678
10369 3911678 3959770 3904104 3915058 3945341 3926060 3955289 3997105 3956562 3911455 3936002 3971774 3939886 3966619
10356 3966619 3928104 3989885 3925791 3978066 3915791 3979588 3969770 3908092 4003278 3990666 3969136 3937375 3969623
10343 3969623 3966502 3978358 4044929 3958596 3996110 3986272 4016012 3995570 3995759 3975844 4078421 4019713 4055697
10330 4055697 4062574 4051406 4062400 4031107 3975424 3995728 4032845 4045522 4067119 4003342 4020652 3975856 4027026
10317 4027026 4045362 4076633 4030987 4108930 4112732 4080634 4029538 4048530 4044126 4077504 4081693 4105309 4120507
10304 4120507 4102568 4127485 4134615 4106448 4105337 4136812 4076639 4102381 4099992 4182874 4049028 4114267 4125249
10291 4125249 4134323 4094494 4090736 4121577 4153450 4169333 4090945 4054765 4213828 4178608 4211894 4182502 4203677
10278 4203677 4201528 4160096 4198174 4178578 4184768 4168545 4166740 4141729 4191350 4205631 4232176 4274969 4298902
10265 4298902 4244281 4190977 4206999 4209224 4221843 4219654 4272526 4249167 4199728 4265799 4195856 4280404 4335551
10252 4335551 4215478 4223204 4280239 4241379 4233137 4242614 4244649 4228901 4272090 4290177 4256725 4276174 4317852
10239 4317852 4353444 4307403 4303479 4297825 4223323 4322967 4333182 4345809 4308288 4342275 4341510 4312464 4296827
10226 4296827 4347185 4371335 4384922 4311551 4399182 4355487 4368715 4350086 4359351 4386224 4393735 4408087 4366511
10213 4366511 4392455 4356675 4372292 4429607 4436039 4411612 4313350 4370313 4427618 4367082 4359261 4381243 4411127
10200 4411127 4452681 4470148 4440451 4474379 4437383 4453854 4466166 4503064 4485929 4475469 4459241 4467917 4458542
10187 4458542 4515327 4541246 4506675 4490966 4438677 4524292 4525462 4519620 4525710 4452240 4510117 4524235 4537211
10174 4537211 4497572 4499409 4570454 4553644 4529575 4495046 4486032 4587227 4572634 4609544 4547362 4559668 4532625
10161 4532625 4564965 4549319 4611415 4559790 4602117 4550782 4552003 4560795 4618769 4646052 4628566 4636783 4633990
10148 4633990 4574380 4603709 4654343 4580428 4640258 4624550 4619049 4597152 4585020 4644142 4619879 4684073 4636465
10135 4636465 4625256 4660091 4653075 4577956 4679622 4702414 4675151 4649359 4714254 4607420 4748047 4715156
10123 4715156 4704646 4718401 4696401 4707378 4718719 4723613 4778501 4785199 4697749 4777966 4762357 4759507 4720627 4720289
10109 4720289 4748500 4758959 4767581 4788733 4698549 4782723 4737089 4831832 4806948 4775888 4802668 4806389 4775074
10096 4775074 4820731 4817110 4826663 4862676 4800188 4837592 4867171 4893775 4852977 4790838 4878387 4861924 4878300
10083 4878300 4887194 4874890 4848684 4896419 4895726 4928053 4836686 4836443 4910020 4901663 4896080 4935164 4916343 4929052
10069 4929052 4864834 4944937 4873360 4858859 4906986 4957810 4952831 4943292 4923077 4920401 5004447 4976858 4943061
10056 4943061 5020328 4986073 4986945 4993796 5014588 5075829 4948837 4972292 4986162 5104224 5032958 5044208 5024432
10043 5024432 5052673 5035192 4950323 5018280 5021660 5043094 5127843 5038864 5119527 5070708 5040349 5105481 5100600
10030 5100600 4990343 5062048 5104163 5162624 5056624 5038540 5161490 5094479 5138413 5040597 5146818 5143721
10018 5143721 5112517 5172791 5087767 5116966 5154265 5148503 5160751 5237377 5254757 5204815 5173930 5227524 5188397
10005 5188397 5172220 5192090 5188558 5240128 5198870 5232962 5257037 5184272 5203117 5199366 5230268 5179867 5287276
9992 5287276 5242601 5245857 5264533 5230703 5285324 5279713 5223975 5313854 5321226 5310743 5311293 5318125 5354165 5374689
9978 5374689 5341172 5380399 5349925 5356925 5367675 5355284 5424566 5338048 5351785 5388285 5367557 5344003 5436010
9965 5436010 5425117 5417484 5363132 5380300 5416468 5391786 5387518 5364040 5425726 5456548 5418026 5471033 5488876
9952 5488876 5455196 5455358 5494301 5477548 5466132 5518898 5556321 5498959 5554280 5526048 5466351 5517079 5542263
9939 5542263 5458575 5498216 5493614 5585497 5518711 5528184 5527080 5537345 5626577 5578271 5627420 5547130 5646133
9926 5646133 5685315 5570549 5587795 5600051 5659751 5603351 5574703 5651241 5704250 5580085 5663535 5654132 5705057
9913 5705057 5719071 5641463 5659478 5677245 5722788 5696890 5786345 5745116 5703754 5752512 5694585 5686336 5763324
9900 5763324 5793468 5793071 5819686 5798387 5758159 5827320 5771931 5793776 5809447 5804474 5855997 5831171 5863764 5854111
9886 5854111 5862597 5805021 5808305 5869034 5952514 5916159 5859830 5848797 5835498 5982402 5934530 5851636 5911569
9873 5911569 5987796 5990541 6000763 6010179 5904154 6015750 5910982 5982179 5967523 6017610 5997773 6034946 6018395
9860 6018395 6032095 6029325 5955277 5988336 6037550 6044418 6083388 6070881 6041606 6099463 6051828 6105552 6152231
9847 6152231 6113131 6083853 6060596 6104468 6161907 6158449 6158567 6266828 6175253 6231484 6160419 6292044 6219438
9834 6219438 6152418 6304703 6299759 6232747 6260240 6289574 6231776 6280448 6294329 6271160 6328220 6283078 6293388
9821 6293388 6272727 6299518 6380105 6387817 6321709 6384631 6428626 6410145 6496339 6418400 6456470 6476277 6437141
9808 6437141 6439843 6470545 6481550 6477057 6484532 6553979 6558207 6554362 6483367 6509450 6553030 6593292 6558129 6577863
9794 6577863 6533946 6634086 6617131 6681303 6744930 6616179 6650550 6701871 6723961 6797211 6735922 6782089
9782 6782089 6818427 6726402 6782534 6872834 6771597 6822919 6882194 6850200 6906388 6912580 6921560 6933095 6970490
9769 6970490 6888316 6995863 7032610 7051753 7132882 7106420 7198419 7161649 7264070 7270882 7351112 7350316 7369456
9756 7369456 7396971 7411156 7363625 7305976 7272019 7269247 7151245 6983327 6960751 6864990 6701537 6581808
9744 6581808 6567393 6613814 6613212 6551629 6513902 6612681 6596724 6742100 6887448 6866973 6849821 6857144 6868516
9731 6868516 6911245 6947981 6976706 7004718 7035871 7040967 7131805 7034391 7097371 7120015 7137747 7118004 7172389
9718 7172389 7149757 7263565 7264424 7191793 7245478 7229243 7244187 7301097 7363523 7397100 7430872 7388743 7445733
9705 7445733 7433006 7429750 7437123 7530299 7490981 7426049 7484684 7554795 7569359 7618763 7560663 7628311 7579860
9692 7579860 7625072 7694235 7639863 7703139 7753859 7721240 7739131 7723004 7781076 7774128 7778905 7925243 7784710
9679 7784710 7787351 7872855 7900228 7909793 7975430 7985919 7987517 7956656 7996821 8029825 8049577 8123676 8170183
9666 8170183 8072276 8119733 8143036 8195628 8220205 8178695 8210694 8306737 8288538 8277530 8382962 8425059 8417896
9653 8417896 8427007 8429664 8415548 8538539 8511196 8515955 8554856 8589787 8606323 8629195 8669481 8713949 8737307
9640 8737307 8717855 8709007 8719661 8797552 8809849 8877010 8910799 8873528 8864073 8890911 8980326 9026695 9006786
9627 9006786 9091717 9123131 9147942 9141439 9193551 9243194 9303826 9253854 9342709 9302317 9300083 9347597 9450284
9614 9450284 9435849 9495561 9537090 9519049 9506148 9575065 9628214 9769339 9723368 9833339 9743857 9753788 9842521
9601 9842521 9851531 9854591 9930781 9934402 10034355 10106336 10185854 10203174 10216068 10282823 10318471 10297878 10354221
9588 10354221 10396457 10463840 10492266 10581204 10682127 10778584 10777410 10823521 10883338 10943606 10958614 11015618 11068456
9575 11068456 11085784 11200226 11215751 11354439 11344573 11365491 11459049 11483700 11564422 11653075 11693699 11770925
9563 11770925 11836443 11879100 12012482 12070262 12087254 12247247 12227206 12341769 12468877 12488275 12532365 12595379
9551 12595379 12678362 12798761 12824383 12932977 13020703 13132167 13269002 13319310 13474250 13523669 13627136
9540 13627136 13698819 13763801 13912724 14060816 14120004 14244109 14430251 14572130 14681581 14730945 14831545
9529 14831545 14958490 15149528 15219729 15400529 15598565 15723178 15859300 16014963 16199165 16387249 16602575
9518 16602575 16779318 17006468 17223261 17476786 17699497 17971210 18202785 18365673 18635854 18941383
9508 18941383 19100435 19391675 19572070 19851914 20145766 20467581 20713421 21003063 21343519 21648691
9498 21648691 22088920 22508430 23020891 23395010 23925527 24529137 25092687 25616462 26372585 26958372
9488 26958372 27583340 28302561 28942652 29594219 30235397 30807467 31379307 31994108 32570986 33237297
9478 33237297 33859252 34553108 35416531 36451292 37604392 39033803 40831530 42857054 45354899
9469 45354899 48200183 51508687 55465491 60253227 65898191 72227978 78932066 85072818 90548249
9460 90548249 96120780 102129844 108006904 111402857 110092809 103968444 95165299 84147921 69627525
9451 69627525 49122717 23512974 -2186921 -27181178 -50673362 -71677641 -88322432 -96970830
9443 -96970830 -100137410 -100550540 -98157553 -92519032 -83540684 -73807642 -65095340 -58075339 -52377639
9434 -52377639 -47761193 -43932865 -40429723 -37470804 -34903742 -32705942 -30821760 -29237563 -27852081
9425 -27852081 -26576278 -25604309 -24793052 -23982043 -23305869 -22622930 -21969013 -21433079 -20768262 -20069259
9415 -20069259 -19358804 -18633376 -17875331 -17142908 -16479704 -15851782 -15199807 -14657009 -14172686 -13681288
9405 -13681288 -13190407 -12680779 -12343112 -11982650 -11537909 -11204491 -10831700 -10510179 -10243032 -9908123
9395 -9908123 -9652333 -9366288 -9077457 -8851385 -8608912 -8362164 -8148313 -7891183 -7669731 -7576199 -7367899
9384 -7367899 -7188853 -7055236 -6902659 -6694866 -6537290 -6403181 -6209681 -6039428 -5887837 -5801491 -5562748
9373 -5562748 -5379374 -5262674 -5143192 -4970394 -4806073 -4723891 -4557450 -4415673 -4389187 -4216672 -4158599
9362 -4158599 -4018451 -3959031 -3852313 -3736416 -3557210 -3507147 -3411093 -3259162 -3239020 -3127236 -2976898
9351 -2976898 -2932964 -2804336 -2667431 -2631710 -2535340 -2503056 -2359771 -2344965 -2235364 -2143355 -2139672 -2037864
9339 -2037864 -2026669 -1956904 -1869470 -1806202 -1744350 -1611814 -1567464 -1556140 -1426857 -1402926 -1366326 -1292722
9327 -1292722 -1167334 -1136919 -1060766 -1063998 -961787 -895059 -849329 -820022 -820484 -744883 -678276 -613022 -603562
9314 -603562 -564158 -477998 -448733 -496704 -414774 -415512 -346191 -330498 -224282 -227070 -198697 -140752 -114294
9301 -114294 -14449 -8322 -40589 87651 135343 227156 164266 239281 304653 316341 330539 422048 409307
9288 409307 473331 530417 593362 455022 566761 685612 705029 698597 750244 741364 761087 813701 803615
9275 803615 880672 930009 970836 970823 992157 980405 999388 1045747 1082223 1146126 1135211 1132616 1189203 1132677
9261 1132677 1238246 1229297 1343320 1353365 1326174 1398009 1426134 1371807 1394939 1547810 1531990 1499388
9249 1499388 1588337 1565778 1640714 1576440 1638901 1668083 1703851 1757571 1717515 1734560 1734554 1819325 1803588 1822300
9235 1822300 1843013 1860836 1928602 1934304 1945762 1995273 2026085 2035581 2026160 1992924 2060246 2079950 2129081
9222 2129081 2143681 2081643 2154966 2169480 2155336 2192146 2216540 2226467 2230710 2247255 2251017 2283598 2345269
9209 2345269 2294179 2458841 2404531 2368186 2428305 2444221 2536079 2461595 2491582 2522254 2529035 2581752 2563228
9196 2563228 2595806 2633918 2593510 2648773 2619481 2680040 2691616 2676875 2744705 2706785 2784559 2801503 2858144
9183 2858144 2789571 2828685 2817539 2868863 2926508 2880077 2810987 2924081 2938389 3018396 2985561 2968574 2951096
9170 2951096 3058018 3077341 3036124 3124741 3166446 3199676 3135121 3174895 3308205 3281442 3360613 3386272
9158 3386272 3472616 3500528 3471788 3593398 3589771 3629127 3644046 3670871 3631577 3609139 3524861 3399497
9146 3399497 3296315 3271351 3092485 3023924 2898068 2798415 2666382 2659419 2748679 2702490 2723100 2807910
$$ [...]
-2772b689254  $$ checkpoint
##END NTUPLES=
##END=
