##TITLE=Analysis number 307744
Compound Code cc 41914
Book Reference 437/4
Project Code adrs
Chemist Name wendyb
##JCAMPDX= 6.0         $$ Bruker NMR JCAMP-DX V2.0
##DATA TYPE= NMR SPECTRUM
##DATA CLASS= NTUPLES
##ORIGIN= Bruker BioSpin GmbH
##OWNER= NMR
$$ XWIN-NMR		Version 3.5
$$ Thu May 12 08:26:08 2005 GMT Daylight Time (UT+1h)  MAYBRIDGE\NMR@NMR_250MHZ
##.OBSERVE FREQUENCY= 250.131544655141
##.OBSERVE NUCLEUS= ^1H
##.ACQUISITION MODE= SIMULTANEOUS (DQD)
##.ACQUISITION SCHEME= undefined
##.AVERAGES= 16
##.DIGITISER RES= 18
##SPECTROMETER/DATA SYSTEM= dpx250
##.PULSE SEQUENCE= zg30
##.SOLVENT NAME= CDCl3
##.SHIFT REFERENCE= (INTERNAL, CDCl3, 0, 16.522)
##AUDIT TRAIL= $$ (NUMBER, WHEN, WHO, WHERE, WHAT)
$$ ##TITLE= Audit trail, XWIN-NMR		Version 3.5
$$ ##JCAMPDX= 5.01
$$ ##ORIGIN= Bruker BioSpin GmbH
$$ ##OWNER= NMR
$$ C:\u/data/dgb/nmr/ADRS/2810/pdata/1/auditp.txt
$$ ##AUDIT TRAIL=  $$ (NUMBER, WHEN, WHO, WHERE, WHAT)
(   1,<2005-05-12 08:25:40.29 +100>,<MAYBRIDGE\NMR>,<NMR_250MHZ>,
      <created by zg, POWCHK disabled, PULCHK disabled
       configuration hash MD5:
       62 19 C7 07 E1 42 D1 B7 37 6C 3D D0 77 39 F9 E6
       data hash MD5: 64K
       53 87 04 0F 6D CA CD 28 2F 7F E0 9C EC FB 29 CD>)
(   2,<2005-05-12 08:25:54.96 +100>,<MAYBRIDGE\NMR>,<NMR_250MHZ>,
      <Start of raw data processing
       ef LB = 0.3 FT_mod = 6 PKNL = 1 SI = 32K 
       data hash MD5: 32K
       34 E1 4F 63 A4 4D 81 5E A5 89 DE 6E 95 21 DC 5B>)
(   3,<2005-05-12 08:25:56.90 +100>,<MAYBRIDGE\NMR>,<NMR_250MHZ>,
      <apk 
       data hash MD5: 32K
       53 88 99 AF 83 F1 89 1C CF 53 C6 FA 83 E4 1E 34>)
(   4,<2005-05-12 08:25:58.02 +100>,<MAYBRIDGE\NMR>,<NMR_250MHZ>,
      <abs ABSG = 5 
       data hash MD5: 32K
       63 77 99 F5 B7 31 D5 43 2E 35 E3 00 C5 32 5B D4>)
$$ ##END=
$$ 
$$ hash MD5
$$ 35 89 6A 9D B7 AC 38 65 E0 1F C3 4F 10 C8 F7 33
##$RELAX= 
##$RELAX= 
##$RELAX= 
##$RELAX= 
##$RELAX= 
##$RELAX= 
##$RELAX= 
$$ Bruker specific parameters
$$ --------------------------
##$DU= <C:\u>
##$EXPNO= 2810
##$NAME= <ADRS>
##$PROCNO= 1
##$TYPE= <nmr>
##$USER= <dgb>
##$AMP= (0..31)
100 100 100 100 100 100 100 100 100 100 100 100 100 100 100 100 100 100 
100 100 100 100 100 100 100 100 100 100 100 100 100 100 
##$AQSEQ= 0
##$AQ_mod= 3
##$AUNM= <au_zg>
##$AUTOPOS= <1 >
##$BF1= 250.13
##$BF2= 250.13
##$BF3= 250.13
##$BF4= 250.13
##$BF5= 500.13
##$BF6= 500.13
##$BF7= 500.13
##$BF8= 500.13
##$BYTORDA= 1
##$CFDGTYP= 0
##$CFRGTYP= 5
##$CHEMSTR= <none>
##$CNST= (0..31)
1 1 145 1 1 1 1 1 1 1 1 1 1 1 1 1 1 1 1 1 1 1 1 1 1 1 1 1 1 1 1 1 
##$CPDPRG= <>
##$CPDPRG1= <>
##$CPDPRG2= <>
##$CPDPRG3= <>
##$CPDPRG4= <mlev>
##$CPDPRG5= <mlev>
##$CPDPRG6= <mlev>
##$CPDPRG7= <mlev>
##$CPDPRG8= <mlev>
##$CPDPRGB= <>
##$CPDPRGT= <>
##$D= (0..31)
0 1 0 0 0 0 0 0 0 0.06 0 0 0 0 0 0 0.0002 0 0 0 0 0 0 0 0 0 0 0 0 0 0 
0 
##$DATE= 1115882739
##$DBL= (0..7)
120 120 120 120 120 120 120 120 
##$DBP= (0..7)
150 150 150 150 150 150 150 150 
##$DBP07= 0
##$DBPNAM0= <>
##$DBPNAM1= <>
$$ [...]
##$SUBNAM7= <"">
##$SUBNAM8= <"">
##$SUBNAM9= <"">
##$SW= 20.6930455092707
##$SWIBOX= (0..15)
0 0 3 0 0 0 0 0 0 0 0 0 0 0 0 0 
##$SW_h= 5175.983436853
##$TD= 65536
##$TD0= 1
##$TE= 295.16
##$TE2= 300
##$TE3= 300
##$TEG= 300
##$TL= (0..7)
0 120 120 120 120 120 120 120 
##$TP= (0..7)
150 150 150 150 150 150 150 150 
##$TP07= 0
##$TPNAME0= <>
##$TPNAME1= <>
##$TPNAME2= <>
##$TPNAME3= <>
##$TPNAME4= <>
##$TPNAME5= <>
##$TPNAME6= <>
##$TPNAME7= <>
##$TPOAL= (0..7)
0.5 0.5 0.5 0.5 0.5 0.5 0.5 0.5 
##$TPOFFS= (0..7)
0 0 0 0 0 0 0 0 
##$TUNHIN= 0
##$TUNHOUT= 0
##$TUNXOUT= 0
##$USERA1= <user>
##$USERA2= <user>
##$USERA3= <user>
##$USERA4= <user>
##$USERA5= <user>
##$V9= 5
##$VALIST= <valist>
##$VCLIST= <CCCCCCCCCCCCCCC>
##$VD= 0
##$VDLIST= <DDDDDDDDDDDDDDD>
##$VPLIST= <PPPPPPPPPPPPPPP>
##$VTLIST= <TTTTTTTTTTTTTTT>
##$WBST= 1024
##$WBSW= 4
##$XGAIN= (0..3)
0 0 0 0 
##$XL= 0
##$YL= 0
##$YMAX_a= 328289
##$YMIN_a= -458532
##$ZGOPTNS= <>
##$ZL1= 120
##$ZL2= 120
##$ZL3= 120
##$ZL4= 120
##$ABSF1= 16.522
##$ABSF2= -4.171173
##$ABSG= 5
##$ABSL= 3
##$ALPHA= 0
##$AQORDER= 0
##$ASSFAC= 0
##$ASSFACI= 0
##$ASSFACX= 0
##$ASSWID= 0
##$AUNMP= <proc_1d>
##$AZFE= 0.1
##$AZFW= 0.1
##$BCFW= 0
##$BC_mod= 0
##$BYTORDP= 0
##$COROFFS= 0
##$CY= 12.5
##$DATMOD= 1
##$DC= 0
##$DFILT= <>
##$DTYPP= 0
##$F1P= 14.0000005364418
##$F2P= -0.99999901652339
##$FCOR= 0.5
##$FTSIZE= 32768
##$FT_mod= 6
##$GAMMA= 0
##$GB= 0
##$INTBC= 1
##$INTSCL= 1
##$ISEN= 128
##$LB= 0.3
##$LEV0= 0
##$LPBIN= 0
##$MAXI= 10000
##$MC2= 0
##$MEAN= 0
##$ME_mod= 0
##$MI= 0
##$NCOEF= 0
##$NC_proc= -5
##$NLEV= 6
##$NOISF1= 0
##$NOISF2= 0
##$NSP= 0
##$NTH_PI= 0
##$NZP= 0
##$OFFSET= 16.522
##$PC= 1
##$PHC0= -72.36893
##$PHC1= 6.658663
##$PH_mod= 1
##$PKNL= yes
##$PPARMOD= 0
##$PSCAL= 4
##$PSIGN= 0
##$REVERSE= no
##$SF= 250.13
##$SI= 32768
##$SIGF1= 0
##$SIGF2= 0
##$SINO= 400
##$SIOLD= 32768
##$SREGLST= <1H.CDCl3>
##$SSB= 0
##$STSI= 32768
##$STSR= 0
##$SW_p= 5175.98343685301
##$SYMM= 0
##$S_DEV= 0
##$TDeff= 65536
##$TDoff= 0
##$TI= <Analysis number 999999
Compound Code 99
Book Reference 9
Project Code 9>
##$TILT= no
##$TM1= 0
##$TM2= 0
##$TOPLEV= 0
##$USERP1= <user>
##$USERP2= <user>
##$USERP3= <user>
##$USERP4= <user>
##$USERP5= <user>
##$WDW= 1
##$XDIM= 32768
##$YMAX_p= 289730696
##$YMIN_p= -521504
$$ End of Bruker specific parameters
$$ ---------------------------------
##NTUPLES= NMR SPECTRUM
##VAR_NAME=  FREQUENCY,     SPECTRUM/REAL,   SPECTRUM/IMAG
##SYMBOL=    X,             R,               I
##VAR_TYPE=  INDEPENDENT,   DEPENDENT,       DEPENDENT
##VAR_FORM=  AFFN,          ASDF,            ASDF
##VAR_DIM=   32768,         32768,           32768
##UNITS=     HZ,            ARBITRARY UNITS, ARBITRARY UNITS
##FACTOR=    0.157963299565203, 1,           1
##FIRST=     4132.6476996994, 0,             0
##LAST=      -1043.33573715361, 0,           0
##MIN=       -1043.33573715361, -521504,     0
##MAX=       4132.6476996994, 289730696,     0
$$ Real data points
##PAGE= N=1
##DATA TABLE= (X++(R..R)), XYDATA
$$ [...]
$$ plain form
16184 -202610 -180780 -164038 -62588 150715 220011 75628 14235 -13099 -5619 9062 -21344
16173 -21344 -118369 -246000 -195568 -111765 -102555 -15007 2155 62117 172909 101942 1501
16162 1501 -48589 -108126 -238299 -249998 -239592 -284209 -121221 -432 -59987 -28163 15874
16151 15874 115779 98024 -107168 -284500 -233263 -702 157233 7189 -115291 -241748
16141 -241748 -266012 -240357 -177205 -121468 -59992 -49556 -69879 -211557 -243922 -49363 -22151
16130 -22151 -51129 -28191 67526 9176 18318 170089 134643 -20270 -174265 -253972 -231446
16119 -231446 -154530 -100465 -116880 -54059 -17872 106576 6534 -53153 -30077 -86442 -227287
16108 -227287 -259357 -168326 -137033 -192716 -82206 -13255 -10645 -32378 54206 -79923 -233069
$$ packed form
16184b02610K1830J6742J01450K13303O9296j44383o1393k7334P480J4681l0406
16173b1344r7025j27631N0432Q3803R210Q7548J7162N9962J10792p0967j00441
16162A501n0090n9537j30173j1699J0406m4617J62988J20789n9555L1824M4037
16151A5874R9905j7755k05192j77332N1237K32561J57935j50044j22480j26457
16141b41748k4264K5655O3152N5737O1476J0436k0323j41678l2365J94559K7212
16130b2151k8978K2938R5717n8350R142J51771l5446j54913j53995p9707K2526
16119b31446P6916N4065j6415O2821L6187J24448j00042n9687K3076n6365j40845
16108b27287l2070R1031L1293n5683J10510O8951K610k1733Q6584j34129j53146
$$ plain form
16097 -233069 -157491 -112751 -138050 -174842 -145624 -159035 -268165 -283790 -142680 -113840 15156
16086 15156 182180 257373 141457 18621 -2785 -7379 29163 -2839 -102454 -105644 -99472 -195564
16074 -195564 -187172 -171771 -175531 -183055 -183889 -192906 -169027 -187270 -274050 -235573 -243630 -182427 -179092
16061 -179092 -81520 -124463 -159273 -128252 -115305 -190234 -182282 -78773 2428 -51439 -66593
16050 -66593 -7018 16587 -14996 -9606 -82918 -6924 59415 -55105 -51921 155945 250028 166212
16038 166212 84650 89901 40705 -7106 -115565 -60857 -52358 -92551 -26925 -103898 -276095
16027 -276095 -161943 -25088 -45759 -77778 -96575 -209422 -162533 -133035 -89426 -92080 -156078
16016 -156078 -165731 -98176 -150671 -238849 -207622 -67528 -13761 12855 70772 -1496 -79950
$$ packed form
16097b33069P5578M4740k5299l6792K9218j3411j09130j5625J41110K8840J28996
16086A5156J67024P5193j15916j22836k1406m594L6542l2002r9615l190O172r6092
16074a95564Q392J5401l760p524q34r017K3879j8243q6780L8477q057O1203L335
16061a79092R7572m2943l4810L1021J2947p4929P952J03509Q1201n3867j5154
16050f6593N9575K3605l1583N390p3312P5994O6339j14520L184K07866R4083q3816
16038A66212q1562N251m9196m7811j08459N4708Q499m0193O5626p6973j72197
16027b76095J14152J36855k0671l2019j8797j12847M6889K9498M3609k654o3998
16016a56078r653O7555n2495q8178L1227J40094N3767K6616N7917p2268p8454
$$ plain form
16005 -79950 -18448 35574 -54445 -50826 -61776 -159634 -265595 -160457 -162847 -295696 -252839
15994 -252839 -279249 -244514 -120009 -154602 -173687 -131166 -46439 69558 76830 -27880 -30110
15983 -30110 -115335 -235586 -228768 -121020 11012 151712 184936 169534 87404 134434 86323
15972 86323 -1486 -37090 73865 130446 26336 -85997 -111252 46439 104737 43720 -176967
15961 -176967 -236157 -60816 -83529 -110795 -50863 83423 44325 -93014 -110881 -61177 64810
15950 64810 80333 -21289 -102847 -124504 14467 157713 158674 29630 54415 24903 38874
15939 38874 -27941 -153938 -214264 -396783 -472601 -414942 -343870 -316955 -190992 -191878 -221754
15928 -221754 -157894 44622 90901 -77600 -160835 -146317 -93833 -92091 -22576 -35788 8146
$$ packed form
16005g9950O1502N4022r0019L619j0950r7858j05961J05138k390j32849M2857
15994b52839k6410L4735J24505l4593j9085M2521Q4727J15997P272j04710k230
15983c0110q5225j20251O818J07748J32032J40700L3224j5402q2130M7030m8111
15972H6323q7809l5604J10955N6581j04110j12333k5255J57691N8298o1017k20687
15961a76967n9190J75341k2713k7266N9932J34286l9098j37339j7867M9704J25987
15950F4810J5523j01622q1558k1657J38971J43246R61j29044K4785k9512J3971
15939C8874o6815j25997o0326j82519p5818N7659P1072K6915J25963q86k9876
15928b21754O3860K02516M6279j68501q3235J4518N2484J742O9515j3212M3934
$$ plain form
15917 8146 60677 39183 -95025 -186747 -289925 -303563 -195072 -17060 13026 -15774 54493
15906 54493 165125 85821 -45538 -81287 -40848 -55241 22418 201400 166901 87500 42509
15895 42509 51772 16759 -19159 18264 -38023 -113838 -162217 -97550 -72055 20561 -144473 -144985
15883 -144985 75019 125518 -34002 -138482 -222953 -135966 -153646 -199556 -298285 -315270 -157880
15872 -157880 -225408 -212614 -277508 -338972 -294307 -219457 -131667 -93698 -165239 -156300 -222359 -348522
15860 -348522 -462387 -451498 -229104 -141722 -270663 -316407 -235678 -153734 -221136 -321048 -347298
15849 -347298 -277437 -281065 -296116 -235096 -155740 -103044 -100693 -178319 -271699 -276620 -281874 -77745
15837 -77745 -34750 -32030 -55864 38242 42135 -49077 -41553 -172010 -271871 -113558 -15153 -59275
$$ packed form
15917H146N2531k1494j34208r1722j03178j3638J08491J78012L0086k8800P0267
15906E4493J10632p9304j31359l5749M0439j4393P7659J78982l4499p9401m4991
15895D2509R263l5013l5918L7423n6287p5815m8379O4667K5495R2616j65034n12
15883a44985K20004N0499j59520j04480q4471Q6987j7680m5910r8729j6985J57390
15872a57880o7528J2794o4894o1464M4665P4850Q7790L7969p1541Q939o6059j26163
15860c48522j13865J0889K22394Q7382j28941m5744Q0729Q1944o7402r9912k6250
15849c47298O9861l628j5051O1020P9356N2696K351p7626r3380m921n254K04129
15837g7745M2995K720k3834R4106L893r1212P524j30457r9861J58313R8405m4122
$$ plain form
15825 -59275 -36276 36448 -75306 -122202 -151245 -290403 -359478 -337121 -174663 -133542 -116519
15814 -116519 -129220 -222686 -189676 -52929 -132976 -103171 -212950 -350546 -279271 -101837 11134
15803 11134 27917 35838 31384 -143103 -239605 -11274 82727 31570 130063 119124 52000 -35187
15791 -35187 -55911 2316 -88573 -147880 -168291 -68335 -102056 -180800 -182197 -46914 27623 -207313
15779 -207313 -260592 -163762 -89081 -15415 102084 356369 366664 275804 122777 53392 -29098
15768 -29098 -166159 -148625 -134805 -144848 -189686 -186342 -180421 -179617 -232824 -170842 -56299 -83192
15756 -83192 -183416 -105589 40841 125903 166336 115681 -88385 -173144 -95436 -141419 -142427
15745 -142427 -2694 473 -11193 -49371 21080 -4513 -58476 -134191 -150249 -263630 -261129
$$ packed form
15825e9275K2999P2724j11754m6896k9043j39158o9075K2357J62458M1121J7023
15814a16519j2701r3466L3010J36747q0047K9805j09779j37596P1275J77434J12971
15803A1134J6783P921m454j74487r6502K28331R4001n1157R8493j0939o7124q7187
15791c5187k0724N8227r0889n9307k0411R9956l3721p8744j397J35283P4537k34936
15779b07313n3279R6830P4681P3666J17499K54285J0295r0860j53027o9385q2490
15768b9098j37061J7534J3820j0043m4838L344N921Q04n3207O1982J14543k6893
15756h3192j00224P7827J46430Q5062M0433n0655k04066q4759P7708m5983j008
15745a42427J39733L167j1666l8178P0451k5593n3963p5715j6058j13381K501
$$ plain form
15734 -261129 -153055 -88892 -98348 -36594 733 9839 33386 -47842 -46844 -83636 -145982 -123201
15722 -123201 -177974 -231137 -226438 -137172 22254 21441 -95201 -185587 -128085 -113877 -138943 -130049
15710 -130049 -52628 -104131 -118212 -74035 -59098 -37958 41513 -29633 -4553 44021 150375
15699 150375 157048 114733 -117659 -223662 -203677 -83480 3230 38044 -121554 -158141 -150216
15688 -150216 -132220 -50297 -41383 -134083 -148988 -107944 -69144 -189112 -217667 -269380 -257692
15677 -257692 -255829 -259263 -166438 -6888 1222 38023 17602 -63719 -152794 -203695 -318375 -406364
15665 -406364 -331108 -319953 -246573 -277834 -166790 -160692 -112455 -97123 -82615 -134447 -210150
15654 -210150 -108799 -188161 -143622 -30594 -15154 50200 -4410 -17379 -50061 -23224 -166942
$$ packed form
15734b61129J08074O4163r456O1754L7327R106K3547q1228R98l6792o2346K2781
15722a23201n4773n3163M699Q9266J59426q13j16642r0386N7502J4208k5066Q894
15710a30049P7421n1503j4081M4177J4937K1140P9471p1146K5080M8574J06354
15699A50375O673m2315k32392j06003J9985J20197Q6710L4814j59598l6587P925
15688a50216J7996Q1923Q914r2700j4905M1044L8800j19968k8555n1713J1688
15677b57692J863l434R2825J59550Q110L6801k0421q1321q9075n0901j14680q7989
15665d06364P5256J1155P3380l1261J11044O098M8237J5332J4508n1832p5703
15654b10150J01351p9362M4539J13028J5440O5354n4610j2969l2682K6837j43718
$$ plain form
15643 -166942 -217960 -176834 -117025 -80824 -76357 -142243 -148417 -201167 -238505 -168013 -59991 -68162
15631 -68162 -183954 -223271 -113002 110767 63540 34459 4265 -84204 -107423 -90688 55621
15620 55621 92474 -55154 -65989 34459 4340 -146293 -189389 -169252 58 80367 224454
15609 224454 295396 156049 -14623 -60722 -80872 -127001 -141219 -108983 -164660 -150944 20724
15598 20724 178957 217463 140229 168756 207411 56436 -73908 -161295 -160800 -34917 -103395
15587 -103395 -55999 55145 13146 -15889 -16546 -6529 102248 17817 -21360 -147535 -133970
15576 -133970 14808 74655 4021 10583 -87215 -197633 -184137 -147725 -43278 -39348 -17197
15565 -17197 -109614 -240525 -194722 -113453 -172257 -66384 -10245 -97599 -157552 -99624 -148373
$$ packed form
15643a66942n1018M1126N9809L6201M467o5886o174n2750l7338P0492J08022q171
15631f8162j15792l9317J10269K23769m7227k9081l0194q8469k3219J6735J46309
15620E5621L6853j47628j0835J00448l0119j50633m3096K0137J69310Q0309J44087
15609B24454P0942j39347j70672m6099k0150m6129j4218L2236n5677J3716J71668
15598B0724J58233L8506p7234K8527L8655j50975j30344q7387M95J25883o8478
15587a03395M7396J11144m1999k9035o57J0017J08777q4431l9177j26175J3565
15576a33970J48778N9847p0634O562r7798j10418J3496L6412J04447L930K2151
15565a7197r2417j30911M5803Q1269n8804J05873N6139q7354n9953N7928m8749
$$ plain form
15554 -148373 -132171 7045 181113 291333 156383 78586 7963 24551 16546 -63670 -69211
15543 -69211 -321583 -221523 -113369 -19385 35651 18808 -125157 -154723 15268 49170 30141
15532 30141 -41627 -167009 -127798 -207175 -61732 -33876 -5162 -5245 -74069 -65189 -171818 -94177
15520 -94177 -34568 1447 103263 33496 39829 -50376 -8762 -8888 -109394 -157997 -11917 -25093
15508 -25093 -7284 -93080 -143884 -102314 -82076 -113816 -143950 -103117 -84134 14709 41388 -29037
15496 -29037 -58012 -45785 -104844 -95659 -163989 -133065 -44963 26652 75234 9041 -139259 -89341
15484 -89341 -100876 -140496 -137823 -117377 -75824 76177 -2966 -48934 -21266 22122 35829 79301
15472 79301 -93169 -186908 -171736 -57626 -30928 -42041 -30476 43896 56449 5056 -42995
$$ packed form
15554a48373J6202J39216J74068J10220j34950p7797p0623J6588q005q0216n541
15543f9211k52372J00060J08154R3984N5036j6843j43965k9566J69991L3902j9029
15532C0141p1768j25382L9211p9377J45443K7856K8714q3o8824Q880j06629P7641
15520i4177N9609L6015J01816o9767O333r0205M1614j26j00506m8603J46080j3176
15508b5093J7809q5796n0804M1570K0238l1740l0134M0833J8983R8843K6679p0425
15496b9037k8975J2227n9059R185o8330L0924Q8102P1615M8582o6193j48300M9918
15484h9341j1535l9620K673K0446M1553J52001p9143m5968K7668M3388J3707M3472
15472G9301j72470r3739J5172J14110K6698j1113J1565P4372J2553n1393m8051
$$ plain form
15461 -42995 -150604 -217614 -220387 -149484 -133928 6571 -9496 35540 63371 70843 -8436 64822
15449 64822 192388 224804 158650 100021 117177 132355 85860 -13022 -71531 -83714 -48495
15438 -48495 -132889 -65976 -16350 71602 168259 211044 100204 87628 166688 223235 171657
15427 171657 -5325 -47487 62013 31684 23907 -130460 -157797 -107503 -91048 -49868 -13100
15416 -13100 6751 -60799 -76553 -67468 14188 116604 171289 114264 92322 115449 117559 108033
15404 108033 77826 46413 77835 186012 193015 86315 53639 82623 135896 31157 -7439
15393 -7439 38398 46757 30100 72316 111930 -12335 -66451 45568 76449 -96078 -198532
15382 -198532 -154729 -191614 -180228 -103641 -37571 -181532 -287981 -327062 -167656 -133061 -195007
$$ packed form
15461d2995j07609o7010k773P0903J5556J40499j6067M5036K7831P472p9279P3258
15449F4822J27566L2416o6154n8629J7156J5178m6495r8882n8509j2183L5219
15438d8495q4394O6913M9626Q7952R6657M2785j10840j2576P9060N6547n1578
15427A71657j76982m2162J09500l0329p777j54367k7337N0294J6455M1180L6768
15416a3100J9851o7550j5754R085Q1656J02416N4685n7025k1942K3127K110r526
15404A08033l0207l1413L1422J08177P003j06700l2676K8984N3273j04739l8596
15393g439M5837Q359j6657M2216L9614j24265n4116J12019L0881j72527j02454
15382a98532M3803l6885J1386P6587O6070j43961j06449l9081J59406L4595o1946
$$ plain form
15371 -195007 -336872 -235065 -154637 -156178 -45925 -55622 -146603 -223481 -170171 -46239 105242
15360 105242 151442 75433 -60939 -153418 -103515 -59855 16884 131580 128515 -94274 -145484
15349 -145484 -115688 -73017 -29659 59138 -47841 -113740 -83612 -40669 -52683 11695 127648
15338 127648 33706 -18977 -51516 -43623 -50139 -96517 -50415 -185132 -189090 -124036 -156029 -157221
15326 -157221 -224471 -255943 -156294 -86335 -77885 -228660 -98323 34758 -59767 -84283 -61491
15315 -61491 -20884 11156 -29370 -30296 -161559 -217179 -211590 -140356 -192977 -249902 -321450 -222112
15303 -222112 -134259 -7592 -63350 -104252 2587 7783 -42001 -110266 -5063 -8604 -33899
15292 -33899 -92611 -155457 -30464 20270 58215 -162608 -255711 -206380 -85454 -35475 -134191
$$ packed form
15371a95007j41865J01807Q0428j541J10253r697r0981p6878N3310J23932J51481
15360A05242M6200p6009j36372r2479M9903M3660P6739J14696l065k22789n1210
15349a45484K9796M2671M3358Q8797j06979o5899L0128M2943j2014O4378J15953
15338A27648r3942n2683l2539P893o516m6378M6102j34717l958O5054l1993j192
15326a57221o7250l1472R9649O9959Q450j50775J30337J33081r4525k4516K2792
15315f1491M0607L2040m0526r26j31263n5620N589P1234n2621n6925p1548R9338
15303b22112Q7853J26667n5758m0902J06839N196m9784o8265J05203l541k5295
15292c3899n8712o2846J24993N0734L7945k20823r3103M9331J20926M9979r8716
$$ plain form
15281 -134191 -232405 -124825 -18506 110978 211007 136572 -70807 -99436 -90592 104987
15271 104987 190809 172343 73311 19347 -16104 -78305 -90887 -57789 15744 36456 48272
15260 48272 -99911 -47562 -88796 -71915 7670 131822 125971 134439 83139 1708 -209881
15249 -209881 -196943 -63944 -88641 -126069 -258591 -195498 -342693 -377892 -263786 -242411 -142588
15238 -142588 -58240 -10797 -53020 -114283 -103943 -160 -46249 26779 -19119 -23153 65749
15227 65749 18 -60992 -65396 94069 138129 78798 -8753 38188 35780 -43024 -5315 -86909
15215 -86909 -114714 -208415 -290222 -253562 -204970 -188301 -162620 -64465 -42057 -63710 -16355 -50294
15203 -50294 8527 -63271 -91504 -114029 -145025 -260940 -360085 -368075 -324025 -378552 -333288 -246912
$$ packed form
15281a34191r8214J07580J06319J29484J00029p4435k07379k8629Q844J95579
15271A04987Q5822j8466r9032n3964l5451o2201j2582L3098P3533K0712J1816
15260D8272j48183N2349m1234J6881P9585J24152n851Q468n1300q1431k11589
15249b09881J2938J32999k4697l7428j32522O3093j47195l5199J14106K1375R9823
15238a42588Q4348M7443m2223o1263J0340J03783m6089P3028m5898m034Q8902
15227F5749o5731o1010m404J59465M4060n9331q7551M6941k408p8804L7709q1594
15215h6909k7805r3701q1807L6660M8592J6669K5681R8155K2408k1653M7355l3939
15203e0294N8821p1798k8233k2525l0996j15915r9145p990M4050n4527M5264Q6376
$$ plain form
15191 -246912 -84905 11471 50887 25624 -42919 -212082 -229055 -190573 -81118 -32215 -117117
15180 -117117 -57887 46719 201280 255618 171938 168115 79835 91634 277893 208974 74818
15169 74818 7965 -21650 -24366 -150782 -279182 -266189 -180156 -102786 23922 149953 269114
15158 269114 252127 135878 92295 -66678 29085 113282 65204 37033 147342 133938 50098
15147 50098 14370 -77836 -112652 -135390 -137781 -53287 -55158 -167776 -155429 -12498 -24774 13816
15135 13816 -79468 -180345 -280764 -304209 -178725 -37956 67057 141483 148073 -65964 -217820
15124 -217820 -99551 -71489 -131316 -232913 -122892 -33690 -34186 -133136 -79216 31749 62714
15113 62714 160726 281522 280842 171293 46054 52235 127842 255624 219693 111263 142820
$$ packed form
15191b46912J62007R6376L9416k5263o8543j69163j6973L8482J09455M8903q4902
15180a17117N9230J04606J54561N4338q3680l823q8280J1799J86259o8919j34156
15169G4818o6853k9615k716j26416j28400J2993Q6033P7370J26708J26031J19161
15158B69114j6987j16249m3583j58973R5763Q4197m8078k8171J10309j3404q3840
15147E0098l5728r2206l4816k2738k391Q4494j871j12618J2347J42931j2276L8590
15135A3816r3284j00877j00419k3445J25484J40769J05013P4426O590k14037j51856
15124b17820J18269K8062n9827j01597J10021Q9202m96r8950N3920J10965L0965
15113F2714R8012J20796o80j09549j25239O181P5607J27782l5931j08430L1557
$$ plain form
15102 142820 104223 82361 22166 -37756 32160 154667 115152 210685 84991 -78053 -113151
15091 -113151 -119397 -96181 -40130 -77943 -83191 -93749 -151921 -77205 -77623 -105122 -211359 -189582
15079 -189582 -35503 -4901 -40472 -100516 -92189 -3895 -62283 -150913 -242022 -175257 -53235
15068 -53235 28749 119531 84633 24878 140037 105318 127611 147120 168853 201182 179016
15057 179016 58368 -47873 -62047 3548 15840 -36775 -15815 67374 16089 -85313 -178311
15046 -178311 -58563 -30035 -102097 -130132 -129394 -124923 -176194 -123042 -9456 98929 15422
15035 15422 -115018 -257663 -186603 -115012 -115133 35979 -46142 -78141 16612 87317 62078
15024 62078 12419 12539 -12832 -42354 42004 64197 133171 150385 141053 75255 -29965 -68792
$$ packed form
15102A42820l8597k1862o0195n9922O9916J22507l9515R5533j25694j63044l5098
15091a13151o246K3216N6051l7813n248j0558n8172P4716m18k7499j06237K1777
15079a89582J54079L0602l5571o0044Q327Q8294n8388q8630r1109O6765J22022
15068e3235Q1984R0782l4898n9755J15159l4719K2293J9509K1733L2329k2166
15057A79016j20648j06241j4174O5595J2292n2615K0960Q3189n1285j01402r2998
15046a78311J19748K8528p2062k8035P38M471n1271N3152J13586J08385q3507
15035A5422j30440j42645P1060P1591j21J51112q2121l1999R4753P0705k5239
15024F2078m9659J20k5371k9522Q4358K2193O8974J7214r332o5798j05220l8827
$$ plain form
15012 -68792 -212375 -132320 30826 130523 150142 64770 89431 -3591 44211 76619 32188
15001 32188 -85777 -66200 -3659 -152915 -79362 -25920 -117518 -206948 -226565 -135599 -144116
14990 -144116 -169685 -199105 -120051 -38419 -16937 -50636 51902 164534 81129 66580 77421
14979 77421 -36324 -10833 -76311 -70170 -87238 -139974 -98949 -100056 -124425 -56361 -15901 65882
14967 65882 70983 -70874 -224079 -249442 -88113 -10944 66421 206491 113609 -16237 -42985
14956 -42985 -7482 26138 -58089 -21673 -67421 -104296 -115959 -176659 -134037 -164645 -115368 -100413
14944 -100413 -55484 31402 12362 15480 11025 46189 -71823 -28817 -24502 -159160 -144475 -121203
14932 -121203 -65290 7496 -47687 -62010 -6481 140545 192333 181670 84701 -55113 -156946
$$ packed form
15012f8792j43583Q0055J63146R9697J9619q5372K4661r3022M7802L2408m4431
15001C2188j17965J9577O2541j49256P3553N3442r1598q9430j9617R0966q517
14990a44116k5569k9420P9054Q1632K1482l3699J02538J12632q3405j4549J0841
14979G7421j13745K5491o5478O141j7068n2736M1025j107k4369O8064M0460Q1783
14967F5882N101j41857j53205k5363J61329P7169P7365J40070r2882j29846k6748
14956d2985L5503L3620q4227L6416m5748l6875j1663o0700M2622l0608M9277J4955
14944a00413M4929Q6886j9040L118m455L5164j18012M3006M315j34658J4685K3272
14932a21203N5913P2786n5183j4323N5529J47026N1788j0663r6969j39814j01833
$$ plain form
14921 -156946 18790 75597 -38590 -51358 -11864 37184 99252 85224 60408 69022 192485
14910 192485 41351 -139065 -117121 -25187 96669 62067 -66349 -187923 -230612 -186753
14900 -186753 -84167 10811 50535 68124 6953 -104882 -247 205809 264128 182475 -34742
14889 -34742 -146505 -30293 64028 65082 56875 119011 160745 164282 65340 72784 52196 81227
14877 81227 37658 101168 181123 23714 29697 120147 142560 247374 276682 123459 7059
14866 7059 89461 51124 -50479 -44899 -123488 -103616 -69892 -20202 -135531 67309 221020
14855 221020 199843 199055 -15603 -90090 -57650 -79036 129005 377446 375532 256096 187498
14844 187498 115841 46470 73379 54700 86783 18257 -49750 23267 139712 148474 41433
$$ packed form
14921a56946J75736N6807j14187j2768L9494M9048O2068j4028k4816Q614J23463
14910A92485j51134j80416K1944R1934J21856l4602j28416j21574m2689M3859
14900a86753J02586R4978L9724J7589o1171j11835J04635K06056N8319q1653k17217
14889c4742j11763J16212R4321J054q207O2136M1734L537r8942P444k0588K9031
14877H1227m3569O3510P9955j57409N983R0450K2413J04814K9308j53223j16400
14866G059Q2402l8337j01603N580p8589J9872L3724M9690j15329K02840J53711
14855B21020k1177p88k14658p4487L2440k1386K08041K48441j914j19436o8598
14844A87498p1657o9371K6909j8679L2083o8526o8007P3017J16445Q762j07041
$$ plain form
14833 41433 -58467 -147424 -81809 -128280 -62082 -49879 -84944 -140075 -120299 -22411 -45678 -74644
14821 -74644 77276 102698 -41841 -165848 -92739 -12747 -41763 -178302 -225843 -138952 -147231
14810 -147231 -21471 -60417 -45846 -62846 13603 194310 188255 14277 -32185 -56941 -142845
14799 -142845 -39626 78287 138229 140800 154542 124544 -30033 -176609 -114080 -34621 117416
14788 117416 234335 239094 214719 118419 35707 4455 -32230 -126659 -67636 53544 40389
14777 40389 10408 23076 -13481 5915 12453 97064 214966 182077 224323 123243 -41720
14766 -41720 31558 -8946 13578 41215 23491 15933 89502 28146 6973 24933 -62319 -59177
14754 -59177 -5628 86282 22490 -106919 -86538 -18406 22804 91349 -20549 -123152 -72728
$$ packed form
14833D1433r9900q8957O5615m6471O6198J2203l5065n5131J9776R7888k3267k8966
14821g4644J51920K5422j44539j24007P3109P9992k9016j36539m7541Q6891q279
14810a47231J25760l8946J4571j7000P6449J80707o055j73978m6462k4756q5904
14799a42845J03219J17913N9942K571J3742k9998j54577j46576O2529P9459J52037
14788A17416J16919M759k4375r6300q2712l1252l6685r4429N9023J21180j3155
14777D0389k9981J2668l6557J9396O538Q4611J17902l2889M2246j01080j64963
14766d1720P3278m0504K2524K7637j7724p558P3569o1356k1173J7960q7252L142
14754e9177N3549R1910o3792j29409K0381O8132M1210O8545j11898j02603N0424
$$ plain form
14743 -72728 -51542 -106037 -78458 -152144 -173937 -112750 107129 51113 -88479 -7369 93474
14732 93474 -40758 -165736 -205555 -228327 -129642 -43089 -56720 -101225 -141787 -20421 -26033
14721 -26033 -163004 -126043 -45377 918 -23166 -87630 -104023 -67676 -70981 15330 -21274 -96216
14709 -96216 -65289 -59134 18772 7276 -745 -19975 40624 98042 19302 -45312 50483 185470
14697 185470 203857 152016 79375 17904 105548 20222 -57158 -83993 12908 16355 30263 17948
14685 17948 53017 70444 -74116 -26334 65782 97718 -93251 -83671 -9989 -73397 -37314
14674 -37314 -24263 32530 45298 122901 205392 208015 245203 163778 17027 -84178 36441
14663 36441 229899 219715 10816 88836 219429 208800 181537 195237 125132 29850 -18103
$$ packed form
14743g2728K1186n4495K7579p3686k1793O1187K19879n6016j39592Q1110J00843
14732I3474j34232j24978l9819k2772R8685Q6553j3631m4505m0562J21366n612
14721b6033j36971L6961Q0666M6295k4084o4464j6393L6347l305Q6311l6604p4942
14709i6216L0927O155P7906j1496q021j9230O0599N7418p8740o4614R5795J34987
14697A85470J8387n1841p2641o1471Q7644q5326p7380k6835R6901L447J3908j2315
14685A7948L5069J7427j44560M7782R2116L1936j90969R580P3682o3408L6083
14674c7314J3051N6793J2768P7603Q2491K623L7188q1425j46751j01205J20619
14663C6441J93458j0184k08899P8020J30593j0629k7263J3700p0105r5282m7953
$$ plain form
14652 -18103 152386 266327 132029 111928 -89909 -227568 -186701 -39854 -1233 36545
14642 36545 -77442 -78699 -140171 -132205 -89039 -62024 46409 30570 -150291 -287183 -288829
14631 -288829 -111251 -13448 110134 105060 7090 -180860 -119834 -6509 114532 29091 -23182
14620 -23182 1409 -32192 103544 58282 -30230 -112080 -88695 -32686 -12359 -18263 5176 -1767
14608 -1767 3611 172179 239378 130229 -26130 3388 15729 -1116 64401 136854 104010
14597 104010 124220 65134 122650 108963 112649 206653 108473 -10472 32119 60515 22645
14586 22645 46424 177841 175130 79759 -38063 4152 23932 -4949 -97889 -153469 -128750
14575 -128750 11894 44440 -73696 -37629 -15022 3713 -119264 -210567 -156805 -8424 39298
$$ packed form
14652a8103J70489J13941j34298k0101k01837j37659M0867J46847L8621L7778
14642C6545j13987j257o1472P966M3166K7015J08433j5839j80861j36892j646
14631b88829J77578R7803J23582n074r7970j87950O1026J13325J21041q5441n2273
14620b3182K4591l3601J35736m5262q8512q1850K3385N6009K0327n904K3439o943
14608a767N378J68568O7199j09149j56359K9518J2341j6845O5517P2453l2844
14597A04010K0210n9086N7516j3687L686R4004r8180j18945M2591K8396l7870
14586B2645K3779J31417k711r5371j17822M2215J9780k8881r2940n5580K4719
14575a28750J40644L2546j18136L6067K2607J8735j22977r1303N3762J48381M7722
$$ plain form
14564 39298 -24899 -21627 74558 57366 14933 41268 -53166 -14386 52544 35968 77607 133052
14552 133052 86133 87895 154535 73958 13370 66671 144806 122792 27974 45937 35105 8165
14540 8165 -44348 -4743 -35207 -105753 -3380 58265 -69121 -47639 33838 -48776 4825
14529 4825 73957 40072 -2181 -84090 -183648 -102719 50042 123352 18358 -25299 37213
14518 37213 121549 -46689 -105922 -72430 -13668 -11046 42023 137407 -1548 -65400 -108391
14507 -108391 -126668 -105100 49716 1327 62274 95878 -19042 -91742 -99087 43378 61880
14496 61880 59395 92373 77233 121412 -17625 -25750 89267 106826 -56420 31258 33806 -75449
14484 -75449 -118418 -93489 -31090 38991 170560 126022 24611 -48077 16272 56728 9116
$$ packed form
14564C9298o4197L272R6185j7192m2433K6335r4434L8780O6930j6576M1639N5445
14552A33052m6919J762O6640q0577o0588N3301P8135k2014r4818J7963j0832k6940
14540H165n2513L9605l0464p0546J02373O1645j27386K1482Q1477q2614N3601
14529D825O9132l3885m2253q1909r9558Q0929J52761P3310j04994m3657O2512
14518C7213Q4336j68238n9233L3492N8762K622N3069R5384j38955o3852m2991
14507a08391j8277K1568J54816m8389O0947L3604j14920p2700p345J42465J8502
14496F1880k485L2978j5140M4179j39037q125J15017J7559j63246Q7678K548j09255
14484g5449m2969K4929O2399P0081J31569m4538j01411p2688O4349M0456m7612
$$ plain form
14473 9116 8107 -125218 -169384 -220947 -227016 -158443 -83801 31059 135975 182570 193503 187460
14461 187460 216799 164779 92573 2775 -64489 -136004 -207741 -264489 -126733 26282 112143
14450 112143 -17179 -73251 796 179172 237247 163669 -16369 -15232 58170 174942 258815
14439 258815 226543 68200 73851 81922 -9786 -14555 47225 166445 46468 -159232 -154923
14428 -154923 -18329 -9465 -39116 -130163 -88403 -32721 -44661 -49671 26839 35301 30262 134166
14416 134166 155980 181027 24470 -215276 -165396 7899 -99042 -55178 200032 107853
14406 107853 28871 53984 133450 210602 194569 125673 64925 123361 107621 17897 -94608
14395 -94608 -46577 -131990 -128622 -78709 -57399 -41524 -61636 -53092 -50648 -69425 -46773 -157578
$$ packed form
14473I116j009j33325m4166n1563o069O8573P4642J14860J04916M6595J0933o043
14461A87460K9339n2020p2206q9798o7264p1515p1737n6748J37756J53015Q5861
14450A12143j29322n6072P4047J78376N8075p3578j80038J137P3402J16772Q3873
14439B58815l2272j58343N651Q071r1708m769O1780J19220j19977k05700M309
14428a54923J36594Q864k9651r1047M1760N5682j1940n010P6510Q462n039J03904
14416A34166K1814K5047j56557k39746M9880J73295j06941M3864K55210r2179
14406A07853p8982K5113P9466P7152j6033o8896o0748N8436j5740q9724j12505
14395i4608M8031q5413L368M9913K1310J5875k0112Q544K444j8777K2652j10805
$$ plain form
14383 -157578 -112866 -21021 30245 -12707 -121771 -249679 -144087 -94446 56494 203276
14373 203276 206784 61012 94731 244378 173395 -81793 -145383 16152 67065 4823 -99419
14362 -99419 -62385 3613 72666 108315 81852 78664 62873 164201 268243 285981 211451
14351 211451 183659 280685 284554 173767 105994 83226 110401 256048 212181 109178 56505
14340 56505 48905 18738 -7824 103108 211227 277055 246285 206277 111921 80207 84237 153654
14328 153654 79700 90611 306996 371169 227655 101889 116525 129386 221182 241008 73149
14317 73149 -107306 11683 274236 179511 17473 150290 151523 125276 230578 348804
14307 348804 289785 201604 53657 -27344 -41803 113401 57322 131 82803 200700 241011
$$ packed form
14383a57578M4712R1845N1266m2952j09064j27908J05592M9641J50940J46782
14373B03276L508j45772L3719J49647p0983k55188o3590J61535N0913o2242j04242
14362i9419L7034O5998O9053L5649k6463l188j5791J01328J04042J7738p4530
14351B11451k7792R7026L869j10787o7773k2768K7175J45647m3867j03003n2673
14340E6505p600l0167k6562J10932J08119O5828l0770m0008r4356l1714M030O9417
14328A53654p3954J0911K16385O4173j43514j25766J4636J2861R1796J9826j67859
14317G3149j80455J18989K62553r4725j62038J32817J233k6247J05302J18226
14307C48804n9019q8181j47947q1001j4459J55204n6079n7191Q2672J17897M0311
$$ plain form
14296 241011 205181 149425 73072 25185 -116062 -156107 -68181 34093 48028 -44126 30192
14285 30192 -6446 -29237 -14321 66358 -20124 3586 124 97596 107903 178427 143053 135579
14273 135579 144676 101140 5906 -82832 -118425 11102 136499 150364 190150 304028 344765
14262 344765 181477 17885 -15208 -32278 78513 90518 116704 76726 66285 85960 93312
14251 93312 95127 94318 107743 81338 49472 92692 215628 122125 18854 -14503 -75566 -150024
14239 -150024 -323427 -306130 -77301 -2865 -12180 195627 281533 227497 73832 114291 271887
14228 271887 307608 203153 79262 4585 -21394 -37201 -72819 40328 104073 47917 39595
14217 39595 132527 171578 220443 210719 257898 299140 329512 311157 212930 234893 217402 223187
$$ packed form
14296B41011l5830n5756p6353m7887j41247m0045Q7926J02274J3935r2154P4318
14285C0192l6638k2791J4916Q0679q6482K3710l462R7472J0307P0524l5374p474
14273A35579R097m3536r5234q8738l5593J29527J25397J3865L9786J13878M0737
14262C44765j63288j63592l3093j7070J10791J2005K6186l9978j0441J9675P352
14251I3312J815q09J3425k6405l1866M3220J22936r3503j03271l3357o1063p4458
14239a50024j73403J7297K28829P4436r315K07807Q5906n4036j53665M0459J57596
14228B71887L5721j04455j23891p4677k5979j5807l5618J13147O3745n6156q322
14217C9595R2932L9051M8865r724M7179M1242L0372j8355r8227K1963j7491N785
$$ plain form
14205 223187 97445 88979 62632 33675 79603 7857 -132484 -182887 -74975 47479 -6480
14194 -6480 -21510 104564 138970 142181 102290 -3986 115835 51309 2046 164732 132381
14183 132381 175256 154436 66215 40579 90305 58442 99744 249130 312536 398166 277473
14172 277473 278533 382566 285392 205336 228696 210316 236517 245074 278782 263639 205383 199172
14160 199172 191234 225820 148407 43305 -2633 -71983 69454 105803 74284 264578 345889
14149 345889 343278 256359 110696 129334 -5088 -43164 -71198 -60465 33195 113236 221149
14138 221149 123553 98041 69306 -37281 -94471 -103196 -75665 104267 332145 265244 57698
14127 57698 -163199 -134067 -66709 117712 128561 24120 65445 190345 196622 155659 129395
$$ packed form
14205B23187j25742q466k6347k8957M5928p1746j40341n0403J07912J22454n3959
14194f480j5030J26074L4406L211l9891j06276J19821o4526m9263J62686l2351
14183A32381M2875k0820q8221k5636M9726l1863M1302J49386O3406Q5630j20693
14172B77473J060J04033r7174q0056K3360j8380K6201Q557L3708j5143n8256o211
14160A99172p938L4586p7413j05102m5938o9350J41437L6349l1519J90294Q1311
14149C45889k611q6919j45663J8638j34422l8076k8034J0733R3660Q0041J07913
14138B21149r7596k5512k8735j06587n7190q725K7531J79932K27878o6901k07546
14127E7698k20897K9132O7358J84421J0849j04441M1325J24900O277m0963k6264
$$ plain form
14116 129395 55492 93227 171145 187145 146243 384 39701 151763 248682 122605 64837
14105 64837 -9124 193575 320405 131722 -122176 -155520 -29952 -64854 2060 116346
14095 116346 -61614 -172133 -67091 -2547 76964 125139 208479 255293 178214 188023 287974
14084 287974 177310 89164 23840 -73584 -56379 -3330 220357 301052 287727 287128 306720
14073 306720 120890 57071 132709 247431 315662 373116 220017 158108 193458 196302 304555
14062 304555 326817 338277 301286 174578 198568 245006 198821 148170 142805 150717 120765 163235
14050 163235 232799 165363 -4056 200663 283643 263346 286277 249375 88005 90652 169134
14039 169134 146972 158328 289744 245489 253424 298633 244096 266628 142380 74370 -58909
$$ packed form
14116A29395p3903L7735P7918J6000m0902j45859L9317J12062R6919j26077n7768
14105F4837p3961K02699J26830j88683k53898l3344J25568l4902O6914J14286
14095A16346j77960j10519J05042O4544P9511M8175Q3340M6814p7079R809R9951
14084B87974j10664q8146o5324r7424J7205N3049K23687Q0695j3325n99J9592
14073C06720j85830o3819P5638J14722O8231N7454j53099o1909L5350K844J08253
14062C04555K2262J1460l6991j26708K3990M6438m6185n0651n365P912k9952M2470
14050A63235O9564o7436j69419K04719Q2980k0297K2931l6902j61370K647P8482
14039A69134k2162J1356J31416m4255P935M5209n4537K2532j24248o8010j33279
$$ plain form
14028 -58909 -76746 20070 158267 105409 153409 42304 -48178 -13288 91680 124836 113343
14017 113343 190257 282684 216056 250073 361907 295393 253385 239826 19446 57603 1021
14006 1021 -114820 -215011 -111501 37751 108785 -4903 -17480 55884 114549 90601 134078
13995 134078 232878 178112 118383 -99367 -221878 -159769 -36559 7005 -49893 -117177 -128994
13984 -128994 -229578 -252870 -77044 -13721 -46954 -72780 -126533 -144635 -95834 -112543 -65593
13973 -65593 -40757 33753 8237 -64881 -90728 -19032 102743 188111 169796 135563 101248
13962 101248 60713 57682 -13599 64965 237924 314824 195885 -11856 -18157 127287 109555
13951 109555 28563 111727 143127 81383 58054 83875 83396 252307 285888 115970 106889 292122
$$ packed form
14028e8909j7837R6816J38197n2858M8000j11105r0482L4890J04968L3156j1493
14017A13343P6914R2427o6628L4017J11834o6514m2008j3559k20380L8157n6582
14006A021j15841j00191J03510J49252P1034j13688j2577P3364N8665k3948M3477
13995A34078R8800n4766n9729k17750j22511O2109J23210M3564n6898o7284j1817
13984a28994j00584k3292J75826O3323l3233k5826n3753j8102M8801j6709M6950
13973f5593K4836P4510k5516p3118k5847P1696J21775Q5368j8315l4233l4315
13962A01248m0535l031p1281P8564J72959P6900j18939k07741o301J45444j7732
13951A09555q0992Q3164L1400o1744k3329K5821m79J68911L3581j69918r081J85233
$$ plain form
13939 292122 299074 133338 120798 135821 135457 66902 104283 180547 186446 149020 41237 47710
13927 47710 -58129 -28699 54194 148254 246443 290338 395466 319909 196929 127446 148938
13916 148938 146699 193856 289450 288989 174595 110075 131879 155027 206868 51056 -60040
13905 -60040 32343 135651 180252 272923 297972 334783 343924 342249 289200 306523 277838 114288
13893 114288 165576 93174 -22818 51528 95318 88047 218615 348767 343702 328682 384214
13882 384214 401069 358004 333395 330982 262624 321869 256425 204387 98268 22094 66670
13871 66670 104282 297045 374700 332926 240760 190143 25416 -49244 -61952 45004 -17393
13860 -17393 38757 123151 699 -70236 -122374 -52044 124813 189686 266080 355825 303990
$$ packed form
13939B92122O952j65736j2540J5023l64o8555L7381P6264N899l7426j07783O473
13927D7710j05839K9430Q2893R4060R8189M3895J05128p5557j22980o9483K1492
13916A48938k239M7157R5594m61j14394o4520K1804K3148N1841j55812j11096
13905f0040R2383J03308M4601R2671K5049L6811R141j675n3049J7323k8685j63550
13893A14288N1288p2402j15992P4346M3790p271J30568J30152n065j5020N5532
13882C84214J6855m3065k4609k413o8358N9245o5444n2038j06119p6174M4576
13871F6670L7612J92763P7655m1774r2166n0617j64727p4660j2708J06956o2397
13860a7393N6150Q4394j22452p0935n2138P0330J76857O4873P6394Q9745n1835
$$ plain form
13849 303990 204587 208783 213081 252945 212773 309341 336296 247595 173790 130957 200835 290648
13837 290648 284204 224954 125073 67433 32068 120056 139839 171793 154543 161864 225940 233285
13825 233285 300480 339238 196419 42336 105423 182229 44163 165728 176985 71696
13815 71696 159913 203664 177687 151906 104532 21454 1454 -12137 61769 85481 189094
13804 189094 187222 59438 90530 59336 10073 11033 64041 -25958 7062 86652 114532 186360
13792 186360 202642 117282 223019 111246 103674 170234 282837 211997 138404 103586 138198
13781 138198 237034 277743 257516 257414 366988 209832 334 13193 144981 140790 132544
13770 132544 305424 438672 388988 313957 302446 415748 341788 106580 156215 267513
$$ packed form
13849C03990r9403M196M298L9864m0172R6568K6955q8701p3805m2833O9878Q9813
13837B90648o444n9250r9881n7640l5365Q7988J9783L1954j7250P321O4076P345
13825B33285O7195L8758j42819j54083O3087P6806j38066J21565J1257j05289
13815G1696Q8217M3751k5977k5781m7374q3078k0000j3591P3906K3712J03613
13804A89094j872j27784L1092l1194m9263R60N3008q9999L3020P9590K7880P1828
13792A86360J6282q5360J05737j11773p572O6560J12603p0840p3593l4818L4612
13781A38198R8836M0709k0227j02J09574j57156k09498J2859J31788m191q246
13770A32544J72880J33248m9684p5031j1511J13302p3960k35208M9635J11298
$$ plain form
13760 267513 263103 278376 313154 193081 201957 140850 177387 125885 76578 81493 -51991 53143
13748 53143 153122 192861 270009 209913 96449 71279 350963 363677 270071 116453 52628
13737 52628 29235 35212 74544 156305 265857 366381 408691 247460 209998 390148 454907
13726 454907 303304 307237 310328 317984 378600 247470 231412 327659 488685 467780 383203
13715 383203 442616 314872 160800 81959 86864 78033 77633 149365 177907 252927 245540 329122
13703 329122 302073 347712 401819 364797 283827 324542 440608 493874 521066 562538 510806
13692 510806 458799 408574 439651 467743 408230 337455 293659 306475 257814 354745 588821
13681 588821 607035 475629 388344 415386 360322 256050 361067 313368 404605 473293 438770
$$ packed form
13760B67513m410J5273L4778j20073Q876o1107L6537n1502m9307M915j33484J05134
13748E3143R9979L9739P7148o0096j13464k5170K79684J2714r3606j53618o3825
13737E2628k3393N977L9332Q1761J09552J00524M2310j61231l7462J80150O4759
13726D54907j51603L933L091P656O0616j31130j6058R6247J61026k0905q4577
13715C83203N9413j27744j54072p8841M905q831m00P1732K8542P5020p387Q3582
13703C29122k7049M5639N4107l7022q0970M0715J16066N3266K7192M1472n1732
13692E10806n2007n0225L1077K8092n9513p0775m3796J2816m8661R6931K34076
13681E88821J8214j31406q7285K7042n5064j04272J05017m7699R1237O8688l4523
$$ plain form
13670 438770 389970 467282 477821 411022 383184 394607 414236 368768 314521 196198 304821
13659 304821 389240 450947 480206 452357 386661 411658 379855 262700 356709 511598 481719
13648 481719 395655 495603 629098 564692 566013 660361 664743 813017 894885 1001935 938022
13637 938022 658658 527101 539421 697190 685101 528707 504675 556290 527019 356369
13627 356369 256851 323483 326327 356144 404608 506508 547223 498320 519199 564053 655782
13616 655782 619457 512776 580080 681377 590981 511562 533057 685002 880315 948312 1210211
13605 1210211 1642343 1750920 1703662 1502527 1198199 1106943 1024636 868089 822733 931753
13595 931753 757419 480973 278935 354676 481853 527504 625176 572131 473493 514026 517388
$$ packed form
13670D38770m8800P7312J0539o6799k7838J1423J9629m5468n4247j18323J08623
13659C04821Q4419O1707K9259k7849o5696K4997l1803j17155R4009J54889k9879
13648D81719q6064R9948J33495o4406J321R4348M382J48274Q1868J07050o3913
13637I38022k79364j31557J2320J57769j2089j56394k4032N1615k9271j70650
13627C56369r9518O6632K844K9817M8464J01900M0715m8903K0879M4854R1729
13616F55782l6325j06681O7304J01297r0396p9419K1495J51945J95313O7997K61899
13605A210211M32132J08577m7258k01135l04328r1256q2307j56547m5356J09020
13595I31753j74334k76446k02038P5741J27177M5651R7672n3045r8638M0533L362
$$ plain form
13584 517388 550789 589827 590373 501650 507405 560111 610955 647151 554652 614468 590859 557362
13572 557362 603677 749092 754794 1037481 1113767 1104362 960706 836100 864010 771596 646275
13561 646275 650312 621759 578521 468312 434216 520757 482547 392768 342091 345711 336148 401839
13549 401839 506276 479334 424663 458653 410462 428193 456968 463665 305939 186679 238080
13538 238080 232809 390836 435789 421965 364376 413140 431718 453603 479141 537304 526818
13527 526818 481268 411259 209992 163136 180895 86507 128740 211960 234158 248357 313507
13516 313507 307260 457833 512897 520790 456196 393190 440322 442687 492165 556442 574498 552141
13504 552141 533861 588102 529617 524665 372040 488882 547893 625343 658929 486689 434243
$$ packed form
13584E17388L3401L9038N46q8723N755N2706N0844L6196r2499N9816k3609l3497
13572E57362M6315J45415N702K82687P6286r405j43656j24606K7910r2414j25321
13561F46275M037k8553m3238j10209l4096Q6541l8210q9779n0677L620r563O5691
13549D01839J04437k6942n4671L3990m8191J7731K8775O697j57726j19260N1401
13538B38080n271J58027M4953j3824n7589M8764J8578K1885K5538N8163j0486
13527E26818m5550p0009k01267m6856J7759r4388M2233Q3220K2198J4199O5150
13516C13507o247J50573N5064P893o4594o3006M7132K365M9478O4277J8056k2357
13504E52141j8280N4241n8485m952j52625J16842N9011P7450L3586j72240n2446
$$ plain form
13493 434243 416382 348186 318546 370679 329412 270052 312497 335103 373373 427616 327356
13482 327356 409584 483495 502173 544547 569160 440797 275648 248516 294765 336555 378729
13471 378729 381977 502399 536967 497448 537204 489384 448662 503268 529141 526737 612910 491235
13459 491235 272123 217476 329514 492584 682314 695796 599569 656809 749790 709219 631993
13448 631993 687840 704450 892177 933775 743024 611880 723279 744633 702990 746176 699704
13437 699704 740861 858700 692599 644710 686344 666655 800862 868077 903980 898531 780284
13426 780284 699634 594517 523831 488792 501558 604796 638207 568087 644347 704052 851310
13415 851310 799429 759053 809334 841978 906570 824993 857640 727186 735207 829463 994841
$$ packed form
13493D34243j7861o8196k9640N2133m1267n9360M2445K2606L8270N4243j00260
13482C27356Q2228P3911J8678M2374K4613j28363j65149k7132M6249M1790M2174
13471C78729L248J20422L4568l9519L9756m7820m0722N4606K5873k404Q6173j21675
13459D91235k19112n4647J12038J63070J89730J3482r6227N7240R2981m0571p7226
13448F31993N5847J6610J87727M1598j90751j31144J11399K1354m1643M3186m6472
13437F99704M1157J17839j66101m7889M1634j9689J34207O7215L5903n449j18247
13426G80284q0650j05117p0686l5039J2766J03238L3411p0120P6260N9705J47258
13415H51310n1881m0376N0281L2644O4592q1577L2647j30454Q021R4256J65378
$$ plain form
13404 994841 1149252 1219390 1105568 963519 979114 1047859 974157 778516 650564 621734
13394 621734 737212 789030 804592 856300 758599 776629 748305 789099 826784 777244 728210
13383 728210 806319 716026 831084 923545 852691 787027 856130 885518 887091 946428 944261 965079
13371 965079 1030209 1001912 960779 825796 923677 1083330 1051015 946300 920164 840165 742738
13360 742738 644742 634076 662298 629720 791655 1066352 1050686 917042 911307 902696 884290
13349 884290 912851 956832 910745 1023996 1202828 1275947 1228072 1268945 1199861 1098585 958007
13338 958007 873290 888327 999170 1072276 965266 777435 732640 888448 952238 1085254
13328 1085254 1154052 1184979 1260767 1313211 1368526 1264639 1188406 1129631 1162267 1124228 1158165
$$ packed form
13404I94841J54411P0138j13822j42049J5595O8745p3702j95641j27952k8830
13394F21734J15478N1818J5562N1708r7701J8030k8324M0794L7685m9540m9034
13383G28210P8109r0293J15058R2461p0854o5664O9103K9388J573N9337k167K0818
13371I65079O5130k8297m1133j34983R7881J59653l2315j04715k6136p9999r7427
13360G42738r7996j0666K8222l2578J61935K74697j5666j33644n735q611j8406
13349H84290K8561M3981m6087J13251J78832P3119m7875M0873o9084j01276j40578
13338I58007q4717J5037J10843P3106j07010j87831m4795J55808O3790J33016
13328A085254O8798L0927P5788N2444N5315j03887p6233n8775L2636l8039L3937
$$ plain form
13317 1158165 1155435 1062474 926124 1010218 1058211 1095343 1221327 1196268 1193171 1121719 1069858
13306 1069858 1210690 1376660 1475212 1454446 1436414 1355390 1231267 1242073 1160179 1006355
13296 1006355 1025490 1156031 1144323 1063413 1174107 1199928 1226697 1344761 1309175 1350892 1537937
13285 1537937 1529241 1502424 1496733 1529916 1504051 1377544 1258818 1146148 1049182 1058484 1073865
13274 1073865 1141399 1145052 1104259 1145704 1161044 1105958 1252676 1317900 1274659 1322475 1506154
13263 1506154 1474060 1401817 1352016 1221900 1228246 1429296 1450990 1396354 1516342 1692243 1573987
13252 1573987 1539162 1744283 1824794 1829855 1965382 2052697 2088300 2116212 2121606 2224983 2139098
13241 2139098 1978318 1961091 1899572 1927099 2001703 2018951 2153954 2329369 2308088 2359554 2529482
$$ packed form
13317A158165k730r2961j36350Q4094M7993L7132J25984k5059l097p1452n1861
13306A069858J40832J65970R8552k0766j8032q1024j24123J0806q1894j53824
13296A006355J9135J30541j1708q0910J10694K5821K6769J18064l5586M1717J87045
13285A537937q696k6817n691L3183k5865j26507j18726j12670r6966R302J5381
13274A073865O7534L653m0793M1445J5340n5086J46718O5224m3241M7816J83679
13263A506154l2094p2243m9801j30116O346K01050K1694n4636J19988J75901j18256
13252A573987l4825K05121Q0511N061J35527Q7315L5603K7912N394J03377q5885
13241B139098j60780j7227o1519K7527P4604J7248J35003J75415k1281N1466J69928
$$ plain form
13230 2529482 2524933 2552141 2704145 2753847 2900601 3100425 3278855 3368380 3423327 3506463 3499680
13219 3499680 3604799 3789748 3916119 4153271 4417810 4613452 4858742 5263447 5570437
13210 5570437 5790345 6194993 6626009 7170485 7876458 8560324 9506107 10592352 11937517
13201 11937517 13627939 15631665 18219183 21492399 25757297 31454115 39593402 50945600
13193 50945600 66619870 86893738 109694346 130528153 143384343 143338801 130604871
13186 130604871 110118942 88038600 68885054 54066654 43297076 35695388 30298226
13179 30298226 26514270 24065105 22476860 21635919 21290803 21167337 21193724 20997244 20851518
13170 20851518 20762708 21185448 22226912 23725321 25890724 28830525 32621082 37580963
$$ packed form
13230B529482m549K7208J52004M9702J46754J99824J78430Q9525N4947Q3136o783
13219C499680J05119J84949J26371K37152K64539J95642K45290M04705L06990
13210E570437K19908M04648M31016N44476P05973O83866R45783J086245J345165
13201A1937517J690422K003726K587518L273216M264898N696818Q139287J1352198
13193E0945600J5674270K0273868K2800608K0833807J2856190m5542j2733930
13186A30604871k0485929k2080342j9153546j4818400j0769578p601688n397162
13179C0298226l783956k449165j588245q40941l45116j23466K6387j96480j45726
13170B0851518q8810M22740J041464J498409K165403K939801L790557M959881
$$ plain form
13162 37580963 44161534 52832601 64496531 80868213 104199959 136666615 178136503
13155 178136503 224449252 265663185 289730696 288196567 261123545 218161828 171504912
13148 171504912 130600899 99128079 76381520 60469554 49174810 40896806 34567572
13141 34567572 29848550 26340153 23746120 21903390 20794207 20211854 20117472 20197690 20577763
13132 20577763 21105483 21676422 22210479 22870571 24225716 26274255 29248543 33373230 39289896
13123 39289896 47702855 59671325 76281068 97446162 121038305 142054265 153744402
13116 153744402 151631968 136140081 112545810 88102986 67141384 50999680 39496011
13109 39496011 31343013 25398576 20896438 17561163 15007435 12783528 10973052 9673812
$$ packed form
13162C7580963O580571Q671067J1663930J6371682K3331746L2466656M1469888
13155A78136503M6312749M1213933K4067511j534129k7073022m2961717m6656916
13148A71504912m0904013l1472820k2746559j5911966j1294744q278004o329234
13141C4567572m719022l508397k594033j842730j109183n82353r4382Q0218L80073
13132B0577763N27720N70939N34057O60092J355145K048539K974288M124687N916666
13123C9289896Q412959J1968470J6609743K1165094K3592143K1015960J1690137
13116A53744402k112434j5491887k3594271k4442824k0961602j6141704j1503669
13109C9496011q152998n944437m502138l335275k553728k223907j810476j299240
$$ plain form
13101 9673812 8886839 8188060 7491784 6857974 6222559 5855762 5644061 5312038 5071339
13092 5071339 4789406 4478179 4391703 4317956 4309478 4099498 4020457 4134482 4171618 4051233
13082 4051233 3927510 3882181 3861108 3729630 3649917 3510134 3360439 3341412 3289724 3343528
13072 3343528 3239066 3226274 3180118 3183775 3224343 3335592 3399763 3304994 3274609 3265688 3193473
13061 3193473 3006654 3039179 2946407 2857511 2864806 2858827 2900211 2922281 2907851 2869109 2841911
13050 2841911 2844331 2811714 3048869 3066157 3182311 3149441 3047143 2989524 3052038 3012203 2946580
13039 2946580 2882457 2927035 2978747 3061999 3121996 3171798 3222228 3215615 3212342 3085193 3287054
13028 3287054 3496114 3486888 3541897 3443348 3215252 3202161 3318185 3377039 3342720 3413493 3567868
$$ packed form
13101I673812p86973o98779o96276o33810o35415l66797k11701l32023k40699
13092E071339k81933l11227q6476p3747q478k09980p9041J14025L7136j20385
13082D051233j23723m5329k1073j31478p9713j39783j49695j9027n1688N3804
13072C343528j04462j2792m6156L657M0568J11249O4171r4769l0385q921p2215
13061C193473j86819L2525r2772q8896P295n979M1384K2070j4430l8742k7198
13050B841911K420l2617K37155J7288J16154l2870j02298n7619O2514l9835o5623
13039B946580o4123M4578N1712Q3252N9997M9802N0430o613l273j27149K01861
13028C287054K09060r226N5009r8549k28096j3091J16024N8854l4319P0773J54375
$$ plain form
13017 3567868 3709198 3714578 3662906 3692117 3750386 3808469 3875481 3982629 4024242 4133637 4325649
13006 4325649 4503915 4591563 4729748 4808600 4872874 4917353 4841656 4759616 4686182 4626920 4763271
12995 4763271 4745829 4579267 4449127 4605122 4670130 4697708 4683078 4718478 4782710 4840840 4895718
12984 4895718 4920175 5100287 5159459 5241313 5417080 5539710 5517204 5578144 5705213 5880757
12974 5880757 5909265 5975320 6108557 6065394 6107648 6189648 6097322 6002987 5994372 6005581 5861280
12963 5861280 5842075 5809455 5752734 5733222 5843012 6003922 5948212 5924505 6053620 6225770
12953 6225770 6369089 6363862 6447874 6548660 6707376 6757078 6758111 6856564 7076474 7272230 7565616
12942 7565616 7854826 7893035 7737411 7660468 7634207 7629187 7421300 7313099 7403599 7398392 7466634
$$ packed form
13017C567868J41330N380n1672K9211N8269N8083O7012J07148M1613J09395J92012
13006D325649J78266Q7648J38185P8852O4274M4479p5697q2040p3434n9262J36351
12995D763271j7442j66562j30140J55995O5008K7578j4630L5400O4232N8130N4878
12984D895718K4457J80112N9172Q1854J75767J22630k2506O0940J27069J75544
12974E880757K8508O6055J33237m3163M2254Q2000r2326r4335q615J1209j44301
12963E861280j9205l2620n6721j9512J09790J60910n5710k3707J29115J72150
12953F225770J43319n227Q4012J00786J58716M9702J033R8453K19910J95756K93386
12942G565616K89210L8209j55624p6943k6261n020k07887j08201R0500n207O8242
$$ plain form
12931 7466634 7525396 7563572 7525388 7622041 7765059 7984436 8090348 8119753 8398937 8560020
12921 8560020 8667702 8794421 8913298 8927196 9068489 9242316 9322269 9340595 9384144 9454652
12911 9454652 9659290 9883289 10050263 10229137 10386097 10554046 10693313 10847543 11003939
12902 11003939 11163968 11335948 11403632 11552875 11758600 12069723 12387817 12602918 12882585
12893 12882585 13077645 13308989 13580486 13692444 13814849 14036105 14230951 14410404 14676324
12884 14676324 15001179 15122277 15274395 15509078 15814358 16173650 16496002 16705729 16861852
12875 16861852 17210706 17668654 18079241 18340488 18633206 18944647 19431052 19698606 19910400
12866 19910400 20307888 20702621 21053958 21244177 21598452 22095664 22577010 23072095 23570254
$$ packed form
12931G466634N8762L8176l8184R6653J43018K19377J05912K9405K79184J61083
12921H560020J07682J26719J18877J3898J41293J73827P9953J8326M3549P0508
12911I454652K04638K23999J66974J78874J56960J67949J39267J54230J56396
12902A1003939J60029J71980O7684J49243K05725L11123L18094K15101K79667
12893A2882585J95060K31344K71497J11958J22405K21256J94846J79453K65920
12884A4676324L24855J21098J52118K34683L05280L59292L22352K09727J56123
12875A6861852L48854M57948M10587K61247K92718L11441M86405K67554K11794
12866A9910400L97488L94733L51337J90219L54275M97212M81346M95085M98159
$$ plain form
12857 23570254 24000304 24453137 24770582 25071269 25636315 26201863 26561127 26938159 27300836
12848 27300836 27583199 27989776 28683795 29192156 29659177 30134735 30660777 31155275 31572846
12839 31572846 32013913 32518254 32929553 33347101 33765893 34139860 34445936 34791818 35297216
12830 35297216 35757776 36132365 36489678 36831210 37213606 37618591 37815246 38117660 38501301
12821 38501301 38773348 39041596 39361113 39635021 39922598 40168580 40376803 40471488 40445149 40485608
12811 40485608 40467298 40435626 40519135 40465721 40360240 40264196 40170782 40058186 39922642 39702828
12801 39702828 39462477 39256704 38998891 38638665 38396763 38157059 37952443 37702116 37332126
12792 37332126 36829540 36408392 35959527 35574413 35069588 34514448 34100986 33752477 33348258
$$ packed form
12857B3570254M30050M52833L17445L00687N65046N65548L59264L77032L62677
12848B7300836K82363M06577O94019N08361M67021M75558N26042M94498M17571
12839C1572846M41067N04341M11299M17548M18792L73967L06076L45882N05398
12830C5297216M60560L74589L57313L41532L82396M04985J96655L02414L83641
12821C8501301K72047K68248L19517K73908K87577K45982K08223R4685k6339M0459
12811D0485608j8310l1672Q3509n3414j05481r6044r3414j12596j35544k19814
12801C9702828k40351k05773k57813l60226k41902k39704k04616k50327l69990
12792C7332126n02586m21148m48865l85114n04825n55140m13462l48509m04219
$$ plain form
12783 33348258 33002877 32648547 32128883 31732863 31257290 30808689 30418999 29946698 29646521
12774 29646521 29277031 28823912 28270976 27717304 27287964 26949586 26415433 25876081 25462304
12765 25462304 25035568 24556011 24252344 23827299 23425636 22933394 22463737 21940019 21479552
12756 21479552 21199205 20874513 20640758 20379445 20039670 19757521 19312858 18937093 18787763
12747 18787763 18538402 18278940 17954740 17598057 17344433 17133975 17009277 16687029 16229966
12738 16229966 15874229 15650028 15387034 15283093 15244491 15135072 14955200 14861236 14550078 14245729
12728 14245729 14051863 13809648 13306079 12927272 12798301 12618415 12358716 12075636 11900554
12719 11900554 11781848 11602438 11496513 11409102 11222741 11086612 10941973 10775040 10473412
$$ packed form
12783C3348258l45381l54330n19664l96020m75573m48601l89690m72301l00177
12774B9646521l69490m53119n52936n53672m29340l38378n34153n39352m13777
12765B5462304m26736m79557l03667m25045m01663m92242m69657n23718m60467
12756B1479552k80347l24692k33755k61313l39775k82149m44663l75765j49330
12747A8787763k49361k59462l24200l56683k53624k10458j24698l22248m57063
12738A6229966l55737k24201k62994j03941l8602j09419j79872r3964l11158l04349
12728A4245729j93866k42215n03569l78807j28971j79886k59699k83080j75082
12719A1900554j18706j79410j05925q7411j86361j36129j44639j66933l01628
$$ plain form
12710 10473412 10276915 10327321 10268364 10151345 10150915 10101578 9993619 9938030 9754666 9659541 9558868
12699 9558868 9686016 9863310 9920958 10006226 9993619 9886063 9768053 9374394 9032731 8990623
12689 8990623 8781399 8673529 8449375 8313597 8292138 8210066 8063655 7936524 7846409 7709195
12679 7709195 7593805 7468128 7439206 7334083 7278416 7258432 7308190 7157038 6977335 6954560
12669 6954560 7045557 7084214 6947072 6855350 6830311 6988443 7043729 6979585 6998663 7042504 6985426
12658 6985426 7012130 6921601 6691488 6462265 6226030 6034882 6122611 6225159 6007325 5908421
12648 5908421 5932053 5963340 5873427 5797611 5682247 5677287 5611936 5481999 5406783 5341762 5264146
12637 5264146 5205953 5243014 5153283 5131445 5191368 5154626 5128587 5098817 5062185 5029386 5154815
$$ packed form
12710A0473412j96497N0406n8957j17019m30m9337j07959n5589j83364r5125j00673
12699I558868J27148J77294N7648Q5268j2607j07556j18010l93659l41663m2108
12689H990623k09224j07870k24154j35778k1459q2072j46411j27131r0115j37214
12679G709195j15390j25677k8922j05123n5667j9984M9758j51152j79703k2775
12669F954560R0997L8657j37142r1722k5039J58132N5286o4144J9078M3841n7078
12658F985426K6704r0529k30113k29223k36235j91148Q7729J02548k17834r8904
12648E908421K3632L1287q9913p5816j15364m960o5351j29937p5216o5021p7616
12637E264146n8193L7061q9731k1838N9923l6742k6039k9770l6632l2799J25429
$$ plain form
12626 5154815 5427006 5456095 5406449 5346198 5233872 5168095 5195854 5213471 5184365 5208766 5087237
12615 5087237 4974668 4964282 5048136 5142686 5189375 5243136 5142528 5152510 5299616 5289752 5379137
12604 5379137 5539477 5547000 5568074 5680451 5823324 6040744 6031164 6093270 6306192 6356453 6410136
12593 6410136 6571378 6621266 6685057 6685351 6755061 7131781 7657418 8102299 8382169 8419779 8727709
12582 8727709 9106980 9432247 9918814 10390572 10927494 11599712 12249876 12965444 13862032
12573 13862032 14824755 16010095 17265182 18710478 20466949 22487377 24789718 27477652
12565 27477652 30564873 34442773 39324156 45345457 52988599 62855321 76268368 94001647
12557 94001647 116806895 145023562 177327628 209941814 236704902 251005487 248881977
$$ packed form
12626E154815K72191K9089m9646o0251j12326o5777K7759J7617k9106K4401j21529
12615E087237j12569j0386Q3854R4550M6689N3761j00608R982J47106r864Q9385
12604E379137J60340P523K1074J12377J42873K17420r580O2106K12922N0261N3683
12593F410136J61242M9888O3791K94O9710L76720N25637M44881K79870L7610L07930
12582H727709L79271L25267M86567M71758N36922O72218O50164P15568Q96588
12573A3862032R62723J185340J255087J445296J756471K020428K302341K687934
12565B7477652L087221L877900M881383O021301P643142R866722J3413047J7733279
12557I4001647K2805248K8216667L2304066L2614186K6763088J4300585k123510
$$ plain form
12550 248881977 231705073 205264817 176470571 150195780 128793138 112694430 101474335
12543 101474335 94508388 91147381 90760506 92884112 97484179 104035368 112413052 122346118
12535 122346118 133196314 144635170 156233042 167920265 179883409 191669076 203645263
12528 203645263 215807056 227586645 238499420 247605487 254425477 258135379 258237403 254580093
12520 254580093 247844621 238852601 228095001 216647053 205107863 193794065 183021547
12513 183021547 172765511 162740947 152791279 142878064 133102461 123765152 115223257 107681243
12505 107681243 101632274 97535195 95631783 96279499 100064742 107322820 119117021 136061806
12497 136061806 158311100 185338760 214226509 239750630 255859667 257441554 242850097
$$ packed form
12550B48881977j7176904k6440256k8794246k6274791k1402642j6098708j1220095
12543A01474335o965947l361007l86875K123606M600067O551189Q377684R933066
12535A22346118J0850196J1438856J1597872J1687223J1963144J1785667J1976187
12528B03645263J2161793J1779589J0912775R106067O819990L709902J02024l657310
12520B54580093o735472q992020j0757600j1447948j1539190j1313798j0772518
12513A83021547j0256036j0024564r949668r913215r775603r337309q541895p542014
12505A07681243o048969m097079j903412O47716L785243P258078J1794201J6944785
12497A36061806K2249294K7027660K8887749K5524121J6109037J581887j4591457
$$ plain form
12490 242850097 215590421 182277025 149177800 120175527 96590930 78057549 63780144
12483 63780144 52840483 44371985 37776939 32795931 28812930 25617143 22865664 20591235
12475 20591235 18671602 16947154 15366123 13906434 12719839 11858360 11268188 10577224
12467 10577224 9839088 9153966 8517700 7942515 7467171 7206660 7094162 6825452 6462082
12458 6462082 6098394 5914609 5763599 5541147 5457343 5369540 5117632 4919623 4780230 4581253
12448 4581253 4410096 4329217 4163490 4134658 4119660 4050095 3858410 3799169 3748329 3655217 3405086
12437 3405086 3340091 3232081 3133027 3035722 3041681 3013171 2952840 3035827 2862915 2748986 2783623
12426 2783623 2692687 2446684 2391175 2512651 2552673 2465763 2362594 2402895 2381435 2221634
$$ packed form
12490B42850097k7259676l3313396l3099225k9002273k3584597j8533381j4277405
12483F3780144j0939661q468498o595046m981008l983001l195787k751479k274429
12475B0591235j919633j724448j581031j459689j186595q61479n90172o90964
12467A0577224p38136o85122o36266n75185m75344k60511j12498k68710l63370
12458F462082l63688j83785j51010k22452q3804q7803k51908j98009j39393j98977
12448D581253j71157q0879j65727k8832j4998o9565j91685n9241n0840r3112k50131
12437C405086o4995j08010r9054r7305N959k8510o0331Q2987j72912j13929L4637
12426B783623r0936k46003n5509J21476M0022q6910j03169M0301k1460j59801
$$ plain form
12416 2221634 2282638 2376870 2399749 2397874 2310090 2268006 2226426 2303508 2327472 2231566 2252089
12405 2252089 2319121 2330128 2209288 2007176 1946475 1946801 1980399 1911254 1852641 1932133 1987199
12394 1987199 1911085 1896874 1929609 2068059 1974366 1827332 1758434 1744017 1681699 1596180 1654043
12383 1654043 1809909 1757744 1671118 1692221 1660980 1649732 1722399 1808820 1840561 1842031 1772519
12372 1772519 1699996 1632240 1570719 1542413 1487900 1484437 1208167 1099182 957876 911699 959323
12361 959323 1077365 1199442 1150324 1182481 1098964 896541 838350 817521 903542 970275 1036748
12350 1036748 1022929 983446 960313 970517 974458 936084 953965 799988 691415 676568 713232
12339 713232 715439 581557 573430 627319 587911 664609 539811 469705 532923 632648 528997
$$ packed form
12416B221634O1004R4232K2879j875q7784m2084m1580P7082K3964r5906K0523
12405B252089O7032J1007j20840k02112o0701L26L3598o9145n8613P9492N5066
12394A987199p6114j4211L2735J38450r3693j47034o8898j4417o2318q5519N7863
12383A654043J55866n2165q6626K1103l1241j1248P2667Q6421L1741J470o9512
12372A772519p2523o7756o1521k8306n4513l463k76270j08985j41306m6177M7624
12361I59323J18042J22077m9118L2157q3517k02423n8191k0829Q6021O6733O6473
12350A036748j3819l9483k3133J0204L941l8374J7881j53977j08573j4847L6664
12339G13232K207j33882q127N3889l9408P6698j24798p0106O3218R9725j03651
$$ plain form
12328 528997 443144 618131 739720 702714 628722 643470 695081 647592 499245 660985 754561
12317 754561 814566 855857 862318 800292 661013 574845 578902 694637 743027 537883 538790 538918
12305 538918 547949 593872 631848 502721 396191 498857 485043 371337 369939 433690 581401
12294 581401 526643 360031 307915 474887 474065 576627 590751 539720 396597 428145 429756
12283 429756 476880 492841 401579 365510 529700 495896 488739 457152 544127 601613 682219
12272 682219 640471 435278 355533 389859 330457 273891 321821 240822 262394 401668 517001
12261 517001 547555 479229 305764 285317 234349 212286 203795 332337 434421 583938 533564
12250 533564 512561 388043 416595 545018 486829 408464 379216 404640 401939 351107 279174
$$ packed form
12328E28997q5853J74987J21589l7006p3992J4748N1611m7489j48347J61740R3576
12317G54561O0005M1291O461o2026j39279q6168M057J15735M8390k05144R07J28
12305E38918R031M5923L7976j29127j06530J02666j3814j13706j398O3751J47711
12294E81401n4758j66612n2116J66972q22J02562J4124n1031j43123L1548J611
12283D29756M7124J5961r1262l6069J64190l3804p157l1587Q6975N7486Q0606
12272F82219m1748k05193p9745L4326n9402n6566M7930q0999K1572J39274J15333
12261E17001L0554o8326j73465k0447n0968k2063q491J28542J02084J49517n0374
12250E33564k1003j24518K8552J28423n8189p8365k9248K5424k701n0832p1933
$$ plain form
12239 279174 183660 213800 274885 333407 435526 439810 381512 244072 261992 252895 269717
12228 269717 352304 327367 365284 419676 428442 499633 455569 408182 394638 443314 300880
12217 300880 150005 110091 166557 216627 244493 284503 375221 464999 500378 519551 458945
12206 458945 525189 514743 521947 521679 537965 532157 534074 519341 433481 389556 296186 303461 406753
12193 406753 401106 245252 193458 185361 368658 314751 275993 334615 371771 322016 236415
12182 236415 246982 275499 423657 417514 393465 363406 300439 346294 421056 400112 316258
12171 316258 303914 251142 269777 284425 308352 308076 265828 313220 307181 342796 352728 406503
12159 406503 423432 407253 375708 261252 67171 87351 264944 292295 234210 200728 191876
$$ packed form
12239B79174r5514L0140O1085N8522J02119M284n8298j37440J7920r097J6822
12228B69717Q2587k4937L7917N4392Q766P1191m4064m7387j3544M8676j42434
12217C00880j50875l9914N6466N0070K7866M0010R0718Q9778L5379J9173o0606
12206D58945O6244j0446P204k68J6286n808J917j4733q5860m3925r3370P275J03292
12193D06753n647j55854n1794q097J83297n3907l8758N8622L7156m9755q5601
12182B36415J0567K8517J48158o143k4049l0059o2967M5855P4762k0944q3854
12171C16258j2344n2772J8635J4648K3927k76m2248M7392o039L5615R932N3775
12159D06503J6929j6179l1545j14456j94081K0180J77593K7351n8085l3482q852
$$ plain form
12148 191876 216993 266891 317416 363452 444187 473336 436965 307811 217346 341882 438327
12137 438327 371669 426367 531127 530025 403137 320407 292521 349075 405811 410684 374835
12126 374835 415673 534114 480342 490112 537263 459182 526467 547871 481505 440898 477508
12115 477508 343265 269767 327424 415231 465897 494714 386095 447796 605198 719181 757070
12104 757070 720613 914011 1063088 1157330 1342466 1477020 1573069 1649170 1627179 1534090 1493466
12093 1493466 1338326 1163450 1035878 942036 864190 813594 675422 559352 610069 717514
12083 717514 833463 919494 805953 819197 900955 1036910 1129326 1066357 1236738 1390096
12073 1390096 1424032 1370989 1418521 1348418 1456610 1597544 1633717 1607796 1464019 1200790
$$ packed form
12148A91876K5117M9898N0525M6036Q0735K9149l6371j29154r0465J24536R6445
12137D38327o6658N4698J04760j102j26888q2730k7886N6554N6736M873l5849
12126C74835M0838J18441n3772R770M7151p8081O7285K1404o6366m0607L6610
12115D77508j34243p3498N7657Q7807N0666K8817j08619O1701J57402J13983L7889
12104G57070l6457J93398J49077R4242J85136J34554R6049P6101k1991r3089m0624
12093A493466j55140j74876j27572r3842p7846n0596j38172j16070N0717J07445
12083G17514J15949Q6031j13541J3244Q1758J35955R2416o2969J70381J53358
12073A390096L3936n3043M7532p0103J08192J40934L6173k5921j43777k63229
$$ plain form
12063 1200790 1223319 1226281 1181313 1127851 1194808 1202092 1074532 956362 877356 1010051 1035895
12052 1035895 936079 817321 720620 596424 590846 632265 701067 791296 836772 832287 801854
12041 801854 846422 916990 1066764 1209938 1372971 1436111 1298957 1228781 1182376 1073346
12031 1073346 937931 784863 616026 565575 475199 307820 206151 150941 141300 311165
12021 311165 434353 227337 100678 96841 136556 118109 204807 392462 359675 236720 199249
12010 199249 185360 110321 140677 203993 305364 329333 319001 377343 331625 279406 250879
11999 250879 251786 326695 268582 95393 -38373 -27384 97036 47456 123015 158179 173703
11988 173703 143069 -17545 39604 256844 384430 385550 389821 373920 447258 587721 506827
$$ packed form
12063A200790K2529K962m4968n3462O6957P284j27560j18170p9006J32695K5844
12052A035895r9816j18758r6701j24196n578M1419O8802R0229M5476m485l0433
12041H01854M4568P0568J49774J43174J63033O3140j37154p0176m6405j09030
12031A073346j35415j53068j68837n0451r0376j67379j01669n5210r641J69865
12021C11165J23188k07016j26659l837L9715j8447Q6698J87655l2787j22955l7471
12010A99249j3889p5039L0356O3316J01371K3969j0332N8342m5718n2219k8527
11999B50879R07P4909n8113j73189j33766J0989J24420m9580P5559L5164J5524
11988A73703l0634j60614N7149K17240J27586J120M271j5901P3338J40463q0894
$$ plain form
11977 506827 413847 373993 328776 362592 254103 187195 154093 87898 22628 119611 156688
11966 156688 226486 259849 351392 289596 303711 288807 225348 151919 172739 188325 258417
11955 258417 293987 242231 296287 342842 178033 55225 15174 -42567 -17345 95079 136154
11944 136154 -22082 100044 149569 68792 60772 70931 69467 65570 122439 189565 271323 211869
11932 211869 133149 224551 291029 236297 229037 332372 306714 319622 292906 160972 82468
11921 82468 110793 72477 109349 137998 163542 154650 242441 185008 208253 300783 242311 109782
11909 109782 80468 164408 271258 232489 108250 31134 147375 77873 134550 74717 481
11898 481 94647 143360 105835 172249 180153 140031 88074 53602 9832 119603 283258 379962
$$ packed form
11977E06827r2980l9854m5217L3816j08489o6908l3102o6195o5270R6983L7077
11966A56688O9798L3363R1543o1796J4115j4904o3459p3429K0820J5586P0092
11955B58417L5570n1756N4056M6555j64809j22808m0051n7741K5222J12424M1075
11944A36154j58236J22126M9525q0777q020J0159j464l897N6869O7126Q1758n9454
11932B11869p8720R1402O6478n4732p260J03335k5658J2908k6716j31934p8504
11921H2468K8325l8316L6872K8649K5544q892Q7791n7433K3245R2530n8472j32529
11909A09782k9314Q3940J06850l8769j24239p7116J16241o9502N6677n9833p4236
11898D81R4166M8713l7525O6414P904m0122n1957l4472m3770J09771J63655R6704
$$ plain form
11886 379962 117316 -40655 -20542 -6879 -34799 98120 83807 128423 178662 182866 146884
11875 146884 201137 121234 -41986 108473 268136 194651 120541 130595 211994 267926 178567
11864 178567 182080 148825 148735 150375 105952 66881 152184 86401 -3903 -73864 -112497 -141882
11852 -141882 -37513 150756 10004 -87228 45414 12631 -23590 17509 -25304 -59172 38927
11841 38927 112734 122540 210807 262489 67168 32066 99275 62490 151006 160913 173793 221696
11829 221696 197930 325899 381887 328972 172591 96492 218487 156875 93345 75402 94980
11818 94980 155176 171969 -8192 24570 7459 38557 179978 17807 -68779 15291 18220
11807 18220 -9941 -36129 67535 -50100 -115874 4903 -12341 72291 39173 32611 79670
$$ packed form
11886C79962k62646j57971K0113J3663k7920J32919j4313M4616N0239M204l5982
11875A46884N4253p9903j63220J50459J59663p3485p4110J0054Q1399N5932q9359
11864A78567L513l3255r0J640m4423l9071Q5303o5783r0304o9961l8633k9385
11852a41882J04369J88269j40752r7232J32642l2783l6221M1099m2813l3868R8099
11841C8927P3807R806Q8267N1682j95321l5102O7209l6785Q8516R907J2880M7903
11829B21696k3766J27969N5988n2915j56381p6099J21995o1612o3530j7943J9578
11818I4980O0196J6793j80161L2762j7111L1098J41421j62171q6586Q4070K929
11807A8220k8161k6188J03664j17635o5774J20777j7244Q4632l3118o562M7059
$$ plain form
11796 79670 20258 -106426 -217122 -178755 -103769 -154233 -170801 -150397 -92112 12760 -11624
11785 -11624 -26052 53290 67036 19417 117291 72169 -47706 -54565 -21291 -23066 -58911 -41914
11773 -41914 -77910 -34915 19240 108830 133928 -21745 -64042 5524 3115 -28689 -8888 197784
11761 197784 328245 307326 112131 71774 308757 356299 287594 137304 -15573 -90956
11751 -90956 -31472 90385 148620 143480 195586 202698 278356 229225 231612 293523 261528 345722
11739 345722 318103 195633 206458 264769 126760 153584 106569 138298 160461 111784 36378
11728 36378 -111515 -134722 -147174 -153261 -134460 -116689 -88709 20723 101585 -18947 -187099
11717 -187099 -143763 -67689 -101645 39284 102922 115420 49115 76288 -29001 -27802 150738
$$ packed form
11796G9670n9412j26684j10696L8367P4986n0464j6568K0404N8285J04872k4384
11785a1624j4428P9342J3746m7619R7874m5122j19875o859L3274j775l5845J6997
11773d1914l5996M2995N4155Q9590K5098j55673m2297O9566k409l1804J9801K06672
11761A97784J30461k0919j95195m0357K36983M7542o8705j50290j52877p5383
11751i0956N9484J21857N8235n140N2106P112P5658m9131K387O1911l1995Q4194
11739C45722k7619j22470J0825N8311j38009K6824m7015L1729K2163m8677p5406
11728C6378j47893k3207j2452o087J8801J7771K7980J09432Q0862j20532j68152
11717a87099M3336P6074l3956J40929O3638J2498o6305K7173j05289J199J78540
$$ plain form
11706 150738 254927 198100 83525 113723 102813 -84777 -58204 132077 205431 234596 221087
11695 221087 201652 119400 128435 297785 239696 -3032 -38953 -68997 17434 133138 214699
11684 214699 283762 162818 127006 205662 131662 31106 67283 203160 95790 -70900
11674 -70900 -45879 -68322 -128480 -50836 -559 231021 328931 406165 306953 96898 143655
11663 143655 109635 4848 -5792 14032 41170 21795 130203 247812 276011 152790 101189
11652 101189 310776 339646 380089 490601 398916 251139 160162 108070 -65081 -60347 -90221
11641 -90221 -93879 -21494 24249 32486 21912 -44646 104703 184785 87185 5148 61586 150167
11629 150167 55484 84494 115679 144200 260322 343006 384644 300911 314461 234034 -51613
$$ packed form
11706A50738J04189n6827j14575L0198j0910j87590K6573J90281P3354K9165j3509
11695B21087j9435q2252R035J69350n8089k42728l5921l0044Q6431J15704Q1561
11684B14699O9063j20944l5812P8656p4000j00556L6177J35877j07370j66690
11674g0900K5021k2443o0158P7644N0277K31580R7910P7234r9212k10055M6757
11663A43655l4020j04787j0640J9824K7138j9375J08408J17609K8199j23221n1601
11652A01189K09587K8870M0443J10512r1685j47777r0977n2092j73151M734k9874
11641i0221l658P2385M5743Q237j0574o6558J49349Q0082r7600q2037N6438Q8581
11629A50167r4683K9010L1185K8521J16122Q2684M1638q3733J3550q0427k85647
$$ plain form
11618 -51613 -57251 103111 48119 41114 236244 255534 188072 185020 106816 140144 232872 264207
11606 264207 185705 94675 192395 182010 125813 31829 122859 108339 26236 110118 148009
11595 148009 176839 23244 -50508 45355 33073 -32809 -95861 -88219 57913 195346 223829
11584 223829 156962 228199 206631 198142 215074 234230 245323 124777 94182 128204 113936
11573 113936 303653 340621 274998 364215 315038 213633 335831 443466 307690 148145
11563 148145 109523 14467 24807 132621 140181 187547 111662 60624 45512 176932 209011
11552 209011 178488 120094 253142 288094 150130 115150 86524 29316 31896 118196 165602
11541 165602 -54150 -151243 -39246 30775 -20391 38240 95476 70232 68255 215836 149941
$$ packed form
11618e1613n638J60362n4992p005J95130J9290o7462l052p8204L3328R2728L1335
11606B64207p8502r1030R7720j0385n6197r3984R1030j4520q2103Q3882L7891
11595A48009K8830j53595p3752R5863j2282o5882o3052P642J46132J37433K8483
11584B23829o6867P1237k1568q489J6932J9156J1093j20546l0595L4022j4268
11573A13936J89717L6968o5623Q9217m9177j01405J22198J07635j35776j59545
11563A48145l8622r5056J0340J07814P560M7366p5885n1038j5112J31420L2079
11552B09011l0523n8394J33048L4952j37964l4980k8626n7208K580Q6300M7406
11541A65602k19752r7093J11997P0021n1166N8631N7236k5244j977J47581o5895
$$ plain form
11530 149941 135470 216440 190093 36906 -51569 59858 101909 -31674 -98319 -128490 -21381
11519 -21381 121968 55962 -52288 -61097 92769 247500 313387 344054 352798 250952 266358
11508 266358 338590 488751 634252 725327 647302 611132 579407 842169 949906 851741 809534
11497 809534 735920 547343 446494 409943 373775 265181 242025 309094 366233 262787 130816
11486 130816 92646 222237 273566 359910 296980 271475 305531 286695 292072 237810 271348
11475 271348 241551 239913 197244 260941 531837 680411 685011 914954 1053842 1061485 1263150
11464 1263150 1481998 1471530 1430642 1228781 973256 724933 589421 414333 402202 370834
11454 370834 362261 240930 166003 227518 191828 190392 222676 319534 339477 323882 298716 406361
$$ packed form
11530A49941j4471Q0970k6347j53187q8475J11427M2051j33583o6645l0171J07109
11519b1381J43349o6006j08250q809J53866J54731O5887L0667Q744j01846J5406
11508B66358P2232J50161J45501R1075p8025l6170l1725K62762J07737r8165m2207
11497H09534p3614j88577j00849l6551l6168j08594k3156O7069N7139j03446j31971
11486A30816l8170J29591N1329Q6344o2930k5505L4056j8836N377n4262L3538
11475B71348k9797j638m2669O3697K70896J48574M600K29943J38888P643K01665
11464A263150K18848j0468m0888k01861k55525k48323j35512j75088j2131l1368
11454C70834q573j21331p4927O1515l5690j436L2284R6858J9943j5595k5166J07645
$$ plain form
11442 406361 362023 370590 411036 458828 522225 496745 490907 511934 414026 403562 442306 529445
11430 529445 605210 796878 845849 777115 700018 592984 480355 322968 327047 238248 170878
11419 170878 165922 283132 350218 243710 200864 197805 -9200 -166053 -57372 61082 316064
11408 316064 524898 422845 371949 437176 390786 287458 226799 264106 274548 283547 387833
11397 387833 409981 145181 54105 59461 212735 242538 184647 64005 43879 91468 67976
11386 67976 -121721 -49849 74193 220374 272772 252382 263271 291032 254703 354985 354917
11375 354917 371069 303145 270279 256773 244502 230661 309508 372037 356963 359191 303732 185049
11363 185049 171853 253614 343602 254764 120835 183556 309676 268774 216478 165266 145789
$$ packed form
11442D06361m4338Q567M0446M7792O3397k5480n838K1027r7908j0464L8744Q7139
11430E29445P5765J91668M8971o8734p7097j07034j12629j57387M079q8799o7370
11419A70878m956J17210O7086j06508m2846l059k07005j56853J08681J18454K54982
11408C16064K08834j02053n0896O5227m6390j03328o0659L7307J0442Q999J04286
11397C87833K2148k64800r1076N356J53274K9803n7891j20642k0126M7589k3492
11386F7976j89697P1872J24042J46181N2398k0390J0889K7761l6329J00282o8
11375C54917J6152o7924l2866j3506j2271j3841P8847O2529j5074K228n5459j18683
11363A85049j3196Q1761Q9988q8838j33929O2721J26120m0902n2296n1212j9477
$$ plain form
11352 145789 229275 257249 248006 279028 297953 245501 191923 236813 300475 245041 197933 193548
11340 193548 309456 529313 618073 475659 323401 401399 489008 550447 597899 440861
11330 440861 316630 429156 516530 612790 473452 348759 419586 361471 367793 429801 489527
11319 489527 491717 382117 195045 176728 312695 295495 149013 113015 212729 350261 363533
11308 363533 429452 515754 643835 722077 621900 591333 573603 638763 642406 640704 524519
11297 524519 401188 362779 364025 316946 266366 266089 189162 220987 326588 428004 439473
11286 439473 359901 454868 481028 487396 494625 443355 419297 355051 363857 483937 596492 605379
11274 605379 496875 311109 316339 372794 402128 444562 452523 413123 447982 561718 496189
$$ packed form
11352A45789Q3486K7974r243L1022J8925n2452n3578M4890O3662n5434m7108m385
11340A93548J15908K19857Q8760j42414j52258P7998Q7609O1439M7452j57038
11330D40861j24231J12526Q7374R6260j39338j24693P0827n8115O322O2008N9726
11319D89527K190j09600j87072j8317J35967j7200j46482l5998R9714J37532J3272
11308C63533O5919Q6302J28081P8242j00177l0567j7730O5160L643j702j16185
11297E24519j23331l8409J246m7079n0580k77p6927L1825J05601J01416J1469
11286D39473p9572R4967K6160O368P229n1270k4058o4246Q806J20080J12555Q887
11274F05379j08504j85766N230N6455K9334M2434P961l9400L4859J13736o5529
$$ plain form
11263 496189 422264 366449 335619 246113 321493 335215 178944 202634 334746 250334 241463
11252 241463 305859 323434 340258 340179 235988 356950 615558 718984 712582 615685 587127
11241 587127 762099 824177 756071 499585 381012 264856 282383 433858 602631 637256
11231 637256 606195 595585 591478 569450 601061 619689 545645 498067 586741 576451 542907 408907
11219 408907 245570 129001 277873 357262 370211 385777 399436 552546 549347 577697 619276
11208 619276 567636 595387 725992 713472 575958 567304 740083 866610 908186 961065 1222710
11197 1222710 1196196 1036622 993216 1016566 913118 706393 741165 745191 712919 838068 855588
11186 855588 694750 819995 904764 966331 1089971 1064967 959552 1001231 1053310 1043696 989743
$$ packed form
11263D96189p3925n5815l0830q9506P5380J3722j56271K3690J32112q4412q871
11252B41463O4396J7575J6824p9j04191J20962K58608J03426o402r6897k8558
11241E87127J74972O2078o8106k56486j18573j16156J7527J51475J68773L4625
11231F37256l1061j0610m107k2028L1611J8628p4044m7578Q8674j0290l3544j34000
11219D08907j63337j16569J48872P9389J2949J5566J3659J53110l199K8350M1579
11208F19276n1640K7751J30605j2520j37514q654J72779J26527M1576N2879K61645
11197A222710k6514j59574m3406K3350j03448k06725L4772M026l2272J25149J7520
11186H55588j60838J25245Q4769O1567J23640k5004j05415M1679N2079r614n3953
$$ plain form
11175 989743 988367 1057912 1048486 929476 796948 859509 871176 1006722 1244523 1249896 1147946
11164 1147946 1162149 1242033 1152425 1144686 1187202 1361638 1537130 1770318 1837864 1716428 1877824
11153 1877824 2107158 2270822 2406431 2421775 2285385 2203878 2094022 2063061 2031965 2038802
11143 2038802 2053081 2070340 2100922 2024325 2019293 2094470 2201891 2358791 2417414 2490735 2561074
11132 2561074 2520863 2574257 2485251 2412736 2543712 2673615 2965485 3204787 3297005 3334847
11122 3334847 3449600 3543968 3761924 3933944 3952292 3916400 4018716 4187970 4310202 4450429
11112 4450429 4615630 4718565 5025576 5377423 5650462 5838284 6227268 6610703 7095174
11103 7095174 7790474 8729219 9859933 11015129 12246448 13600974 15026627 16529987
$$ packed form
11175I89743j376O9545r426j19010j32528O2561J1667J35546K37801N373j01950
11164A147946J4203P9884q9608p739M2516J74436J75492K33188O7546j21436J61396
11153A877824K29334J63664J35609J5344j36390q1507j09856l0961l1096O837
11143B038802J4279J7259L0582p6597n032P5177J07421J56900N8623P3321P0339
11132B561074m0211N3394q9006p2515J30976J29903K91870K39302R2218L7842
11122C334847J14753R4368K17956J72020J8348l5892J02316J69254J22232J40227
11112D450429J65201J02935L07011L51847K73039J87822L88984L83435M84471
11103G095174O95300R38745J130714J155196J231319J354526J425653J503360
$$ plain form
11095 16529987 18546650 21374759 24992287 29735229 36114378 45186830 57991581 75597773
11087 75597773 97773616 121614969 141581094 150802330 145238433 127398093 104158246
11080 104158246 81910970 63891626 50636987 41174413 34455792 29903609 26864621
11073 26864621 24958493 24066478 23776743 23792219 23871198 23522577 23163108 23235875 23683993 24514826
11063 24514826 25800107 27698542 29943325 32546927 36033149 40654570 46942013 55669448
11055 55669448 68107689 86199041 111946657 146735735 189219688 233610891 269128814
11048 269128814 283639249 271038666 235859574 190576956 147109524 111781227 85460406
11041 85460406 66778904 53685862 44460635 38004512 33379185 29935064 27428271 25626996
$$ packed form
11095A6529987K016663K828109L617528M742942O379149R072452J2804751J7606192
11087G5597773K2175843K3841353J9966125R221236n563897j7840340k3239847
11080A04158246k2247276j8019344j3254639r462574o718621m552183l038988
11073B6864621j906128q92015k89735J5476P8979l48621l59469P2767M48118Q30833
11063B4514826J285281J898435K244783K603602L486222M621421O287443Q727435
11055E5669448J2438241J8091352K5747616L4789078M2483953M4391203L5517923
11048B69128814J4510435j2600583l5179092m5282618m3467432l5328297k6320821
11041H5460406j8681502j3093042r225227o456123m625327l444121k506793j801275
$$ plain form
11033 25626996 24207529 23233853 22693050 22610230 22598949 22754084 22901602 22854004 22940568 23287684
11023 23287684 24321734 26173431 28727873 32708545 38577653 47037965 58870288 74948994
11015 74948994 94950451 116143335 133134748 139940201 133005220 114908169 92333607
11008 92333607 71114000 53963851 41404298 32368733 25874970 21226932 17915411 15441814
11000 15441814 13554129 12060910 10868667 10015073 9195440 8391290 7373035 6363860
10992 6363860 5812231 5392668 4901412 4494805 4163929 3980053 3765682 3622423 3402752
10983 3402752 3102561 2848053 2810468 2808414 2719029 2678574 2739311 2722095 2570344 2386783 2381053
10972 2381053 2237991 2108685 2197932 2157858 1991916 1990444 1977579 2107265 2011600 1928114 2012171
$$ packed form
11033B5626996j419467r73676n40803q2820j1281J55135J47518m7598Q6564L47116
11023B3287684J034050J851697K554442L980672N869108Q460312J1832323J6078706
11015G4948994K0001457K1192884J6991413O805453o934981j8097051k2574562
11008I2333607k1219607j7150149j2559553r035565o493763m648038l311521k473597
11000A5441814j887685j493219j192243q53594q19633q04150j018255j009175
10992F363860n51629m19563m91256m06607l30876j83876k14371j43259k19671
10983C402752l00191k54508l7585k054q9385m0455O0737j7216j51751j83561n730
10972B381053j43062j29306Q9247m0074j65942j472j2865J29686r5665q3486Q4057
$$ plain form
10961 2012171 2232383 2143144 2064967 2090921 2072420 2006900 1904085 1759329 1672809 1689564 1678422
10950 1678422 1697823 1565978 1656004 1532481 1476552 1387858 1344023 1332382 1305851 1259091 1290554
10939 1290554 1210392 1302038 1258763 1292339 1328794 1278533 1282051 1292177 1266781 1168496 1192597
10928 1192597 1283232 1343599 1290962 1367958 1391987 1370106 1395409 1406150 1414681 1341304 1180121
10917 1180121 1184310 1193487 1208622 1146813 1213695 1309082 1188476 1195955 1240481 1279721 1137053
10906 1137053 1070223 962061 950749 936780 974981 1003468 939421 919007 1033078 1043723 1009911
10895 1009911 959703 1001607 976909 882799 920665 1098838 1238696 1278532 1322800 1340063 1269759
10884 1269759 1256107 1149999 1002945 1024530 1149221 1158120 1145491 1281617 1314893 1155710
$$ packed form
10961B012171K20212q9239p8177K5954j8501o5520j02815j44756q6520J6755j1142
10950A678422J9401j31845R0026j23523n5929q8694m3835j1641k6531m6760L1463
10939A290554q0162R1646m3275L3576L6455n0261L518J0126k5396r8285K4101
10928A192597R0635O0367n2637P6996K4029k1881K5303J0741Q531p3377j61183
10917A180121M189R177J5135o1809O6882R5387j20606P479M4526L9240j42668
10906A137053o6830j08162j1312j3969L8201K8487o4047k0414J14071J0645l3812
10895A009911n0208M1904k4698r4110L7866J78173J39858L9836M4268J7263p0304
10884A269759j3652j06108j47054K1585J24691Q899j2629J36126L3276j59183
$$ plain form
10874 1155710 1158114 1289136 1330658 1275234 1383582 1425983 1346604 1400400 1664871 1603458 1522159
10863 1522159 1742973 1687802 1574499 1583615 1540262 1574807 1676129 1662843 1646341 1605000 1660947
10852 1660947 1901736 1954599 2059602 2244856 2322601 2364761 2380622 2306137 2146089 2041455
10842 2041455 1911794 1904441 1873396 1869313 1831987 1968959 2033353 2056773 2044237 2050872 2058862 2057917
10830 2057917 1982518 2023038 2014193 1952929 1963813 2110297 2109831 2079136 2045933 1944652 1943197 2000084
10818 2000084 1995796 2093916 2212969 2394178 2544155 2459722 2521739 2653456 2630143 2561394 2608347
10807 2608347 2633963 2761633 2762657 2820823 2823475 2921023 2988797 3053443 3159614 3341649 3438465
10796 3438465 3465280 3474079 3387367 3384246 3385918 3505250 3505475 3606965 3893785 4026997 4139989
$$ packed form
10874A155710K404J31022M1522n5424J08348M2401p9379N3796K64471o1413q1299
10863A522159K20814n5171j13303R116m3353L4545J01322j3286j6502m1341N5947
10852A660947K40789N2863J05003J85254P7745M2160J5861p4485j60048j04634
10842B041455j29661p353l1045m083l7326J36972O4394K3420j2536O635P990r45
10830B057917p5399M0520q845o1264J0884J46484m66l0695l3203j01281j455N6887
10818B000084m288R8120J19053J81209J49977q4433O2017J31717k3313o8749M6953
10807B608347K5616J27670J024N8166K652R7548O7774O4646J06171J82035R6816
10796C438465K6815Q799q6712l121J672J19332K25J01490K86820J33212J12992
$$ plain form
10785 4139989 4349238 4554920 4787918 4873670 4843430 4946807 5196657 5566550 5752850 5942317
10775 5942317 6172452 6422003 6640371 7063536 7447080 7717318 8024224 8461183 8958402
10766 8958402 9400288 9853391 10313245 10782825 11274132 11992389 12651215 13368311 14300334
10757 14300334 15274433 16499840 17694484 19056286 20487920 22252269 24388344 26819325
10749 26819325 29515632 32553488 36109191 40337196 45256342 51071897 58218150 66731054
10741 66731054 77290779 89921727 104975918 122544618 141921713 161949077 180510054
10734 180510054 195271475 203769907 204748585 198570705 186848211 172187238 156956259
10727 156956259 142829102 131046444 122240305 116411373 113501366 113390257 115595357 120125104
$$ packed form
10785D139989K09249K05682K32998Q5752l0240J03377K49850L69893J86300J89467
10775E942317K30135K49551K18368M23165L83544K70238L06906M36959M97219
10766H958402M41886M53103M59854M69580M91307P18257O58826P17096R32023
10757A4300334R74099J225407J194644J361802J431634J764349K136075K430981
10749B6819325K696307L037856L555703M228005M919146N815555P146253Q512904
10741F6731054J0559725J2630948J5054191J7568700J9377095K0027364J8560977
10734A80510054J4761421Q498432R78678o177880j1722494j4660973j5230979
10727A56956259j4127157j1782658q806139n828932k910007j11109K205100M529747
$$ plain form
10719 120125104 126714647 134321185 141920707 148869546 154354524 158284859 161157043 163313520
10711 163313520 166242160 170949550 177806430 186901704 197761827 209379676 220195764
10704 220195764 228121371 231772637 230474517 224495036 214742019 203196530 191737181 181463762
10696 181463762 173031821 166831671 162459026 158931837 155164790 150642917 144777180 137819091
10688 137819091 130145593 122754362 116381757 111622062 108796057 108138896 109918639 114280673
10680 114280673 121096486 130349646 141482592 153511738 165265606 174975653 180713598
10673 180713598 181170687 175530289 164207196 149361920 132644199 115798197 100227543
10666 100227543 86617883 74882314 64863189 56694994 49969105 44186301 39207904
$$ packed form
10719A20125104O589543P606538P599522O948839N484978L930335K872184K156477
10711A63313520K928640M707390O856880R095274J0860123J1617849J0816088
10704B20195764P925607L651266j298120n979481r753017j1545489j1459349j0273419
10696A81463762q431941o200150m372645l527189l767047m521873n865737o958089
10688A37819091p673498p391231o372605m759695k826005o57161J779743M362034
10680A14280673O815813R253160J1132946J2029146J1753868R710047N737945
10673A80713598M57089n640398j1323093j4845276j6717721j6846002j5570654
10666A00227543j3609660j1735569j0019125q168195o725889n782804m978397
$$ plain form
10659 39207904 35094461 31512048 28243275 25490079 23249961 21130095 19380994 17874120
10651 17874120 16514876 15451501 14460737 13577695 12623162 11926357 11411533 10732931 10014804
10642 10014804 9471127 8962650 8464339 8097592 7909363 7658952 7290457 7060458 6901103
10633 6901103 6764266 6548142 6482002 6420953 6461230 6467347 6376007 6359463 6329217 6121098 5885169
10622 5885169 5631318 5228493 4820971 4535518 4506794 4401225 4172752 3914390 3939881 3929680
10612 3929680 3712223 3512751 3565573 3456430 3304893 3155855 3001367 2921739 2936311 3015331
10602 3015331 2867157 2648986 2735498 2841140 2870360 2961967 2851386 2854653 2990602 2989231 3017518
10591 3017518 2930358 3070955 3100153 2861345 2510527 2440397 2498149 2356215 2228530 2291715
$$ packed form
10659C9207904m113443l582413l268773k753196k240118k119866j749101j506874
10651A7874120j359244j063375r90764q83042r54533o96805n14824o78602p18127
10642A0014804n43677n08477m98311l66747j88229k50411l68495k29999j59355
10633F901103j36837k16124o6140o1049M0277O117r1340j6544l0246k08119k35929
10622E885169k53851m02825m07522k85453k8724j05569k28473k58362K5491j0201
10612C929680k17457j99472N2822j09143j51537j49038j54488p9628J4572P9020
10602C015331j48174k18171Q6512J05642K9220R1607j10581L267J35949j371K8287
10591C017518q7160J40597K9198k38808l50818p0130N7752j41934j27685O3185
$$ plain form
10581 2291715 2156806 1949120 1862291 1781603 1702321 1594992 1600285 1606634 1621324 1610763 1596980
10570 1596980 1587862 1537667 1546417 1726142 1847588 1714538 1579323 1603060 1644635 1592082 1516083
10559 1516083 1541510 1438211 1415189 1302107 1099135 991633 974156 988936 1010789 1049413
10549 1049413 1045112 998070 930754 916368 768296 695534 650923 572675 559180 608038 703894
10538 703894 764036 668397 682961 634391 602732 660789 654067 567863 396326 226744 242091
10527 242091 365499 300688 352275 413068 445835 453913 327909 318434 328846 377931 223553
10516 223553 40155 75097 192178 251420 415584 444091 398714 334456 326319 466157 351291
10505 351291 240891 226419 85930 94071 243539 280984 122985 -12226 68518 70707 110425
$$ packed form
10581B291715j34909k07686q6829q0688p9282j07329N293O349J4690j0561j3783
10570A596980r118n0195Q750J79725J21446j33050j35215K3737M1575n2553p5999
10559A516083K5427j03299k3022j13082k02972j07502j7477J4780K1853L8624
10549A049413m301m7042o7316j4386j48072p2762m4611p8248j3495M8858R5856
10538G03894O0142r5639J4564m8570l1659N8057o722q6204j71537j69582J5347
10527B42091J23408o4811N1587O0793L2767Q078j26004r475J0412M9085j54378
10516B23553j83398L4942J17081N9242J64164K8507m5377o4258q137J39838j14866
10505C51291j10400j4472j40489Q141J49468L7445j57999j35211Q0744K189L9718
$$ plain form
10494 110425 201714 307526 217356 60463 71715 192965 242389 191016 180159 105070 54762
10483 54762 66983 66147 175067 119749 55559 150589 179742 99321 132546 209520 256275 221351
10471 221351 152371 165109 194006 177172 36170 99902 93557 -12526 -105754 -40246 51586
10460 51586 70761 136786 -14175 -31035 -68051 -136584 -46453 8421 67523 -12459 -2177
10449 -2177 -37611 5692 101643 22390 57073 211458 317205 285855 226349 204775 264403
10438 264403 139399 89819 -24052 -51610 50997 131464 122208 24998 47709 34052 50333
10427 50333 69311 54939 99664 136535 216701 217623 133214 -15148 -23313 -84309 -60057 -85113
10415 -85113 -137397 -185529 -113210 -23927 24449 8310 23197 28337 61805 37588 111470 229679
$$ packed form
10494A10425R1289J05812r0170j56893J1252J21250M9424n1373j0857p5089n0308
10483E4762J2221q36J08920n5318o4190R5030K9153q0421L3225P6974M6755l4924
10471B21351o8980J2738K8897j6834j41002O3732o345j06083r3228O5508R1832
10460E1586J9175O6025j50961j6860l7016o8533R0131N4874N9102p9982J0282
10449b177l5434M3303R5951p9253L4683J54385J05747l1350n9506k1574N9628
10438B64403j25004m9580j13871k7558J02607Q0467r256r7210K2711j3657J6281
10427E0333J8978j4372M4725L6871Q0166R22q4409j48362q165o0996K4252k5056
10415h5113n2284m8132P2319Q9283M8376j6139J4887N140L3468k4217P3882J18209
$$ plain form
10403 229679 171468 49057 22793 -37635 -92412 60118 88644 39978 12282 42637 68109
10392 68109 -23456 -118543 37358 -31253 -24089 -57733 71616 32653 -87916 -134944 -81094
10381 -81094 -150057 -196988 -245679 -211467 -65766 -60264 -82630 3510 23199 -96028 -76834
10370 -76834 10819 74454 116694 24495 -23554 55601 118264 35965 -24101 -31124 -8862 133408
10358 133408 147055 122643 89277 -69259 -101615 -84032 -37021 28027 -15045 -20876 63052
10347 63052 14667 -3854 40236 108219 195133 195287 143943 195209 158678 -7649 29313 51735
10335 51735 60984 81675 196836 151007 133798 76224 113622 179812 221269 252227 322939 302915
10323 302915 307398 382862 442351 435597 452744 547360 678794 624511 554545 645366 711167 807586
$$ packed form
10403B29679n8211j22411k6264o0428n4777J52530K8526m8666k7696L0355K5472
10392F8109r1565r5087J55901o8611P164l3644J29349l8963j20569m7028N3850
10381h1094o8963m6931m8691L4212J45701N502k2366Q6140J9689j19227J9194
10370g6834Q7653O3635M2240r2199m8049P9155O2663q2299o0066p023K2262J42270
10358A33408J3647k4412l3366j58536l2356J7583M7011O5048m3072n831Q3928
10347F3052m8385j8521M4090O7983Q6914J54n1344N1266l6531j66327L6962K2422
10335E1735R249K0691J15161m5829j7209n7574L7398O6190M1457L0958P0712k0024
10323C02915M483P5464N9489o754J7147R4616J31434n4283o9966R0821O5801R6419
$$ plain form
10311 807586 884571 995821 1065772 982689 1000711 943788 873827 787722 764243 734861 607573
10300 607573 555227 792380 965671 888735 761834 752354 732520 648870 681315 887644 867270
10289 867270 910216 995637 1012393 959754 984410 834962 860184 1014202 1068966 1064769 1124051
10278 1124051 1138680 1060620 1155711 1179184 1142158 999956 792207 817751 792558 848420 827575
10267 827575 758009 755395 722060 745434 787768 802341 852825 684491 586202 535802 500675
10256 500675 486272 529822 605548 647414 640452 785902 917177 938129 853084 927273 871210
10245 871210 761386 529965 488728 511124 460555 454358 352070 190528 132239 330741 408101
10234 408101 239965 165262 107474 7352 -184629 -221029 -107153 93493 137451 220219
$$ packed form
10311H07586P6985J11250O9951q3083J8022n6923o9961q6105k3479k9382j27288
10300F07573n2346K37153J73291p6936j26901r480j9834q3650L2445K06329k0374
10289H67270M2946Q5421J6756n2639K4656j49448K5222J54018N4764m197N9282
10278A124051J4629p8060R5091K3473l7026j42202k07749K5544k5193N5862k0845
10267H27575o9566k614l3335K3374M2334J4573N0484j68334r8289n0400l5127
10256E00675j4403M3550P5726M1866o962J45450J31275K0952q5045P4189n6063
10245H71210j09824k31421m1237K2396n0569o197j02288j61542n8289J98502P7360
10234D08101j68136p4703n7788j00122j91981l6400J13876K00646M3958Q2768
$$ plain form
10224 220219 194092 94062 108510 86270 184296 130466 -45497 -13408 102530 133625 80110
10213 80110 140352 156074 132255 62366 64338 5663 37838 4391 -44402 -159435 -127076 -28487
10201 -28487 2025 34340 -35667 -172632 -89175 -72998 -125130 -122845 -153119 -308332 -298958 -315250
10189 -315250 -271060 -130867 -46975 -138460 -117211 -10061 -91747 -116598 -71019 -24556 -31069
10178 -31069 43472 153782 247694 254885 60708 -139346 -36130 46903 193741 218317 122812
10167 122812 60934 118323 930 -146173 -168246 -101103 -157096 -16691 82916 14181 5332
10156 5332 152816 110365 -26805 105248 268988 252848 -29518 -92664 -46204 -90851 -84197
10145 -84197 -50119 -158363 -166633 -52886 42904 -7629 -30348 -164637 -238295 -129015 42086
$$ packed form
10224B20219k6127j00030J4448k2240R8026n3830j75963L2089J15938L1095n3515
10213H0110O0242J5722k3819o9889J972n8675L2175l3447m8793j15033L2359R8589
10201b8487L0512L2315p0007j36965Q3457J6177n2132K285l0274j55213R374j6292
10189c15250M4190J40193Q3892r1485K1249J07150q1686k4851M5579M6463o513
10178c1069P4541J10310R3912P191j94177k00054J03216Q3033J46838K4576r5505
10167A22812o1878N7389j17393j47103k2073O7143n5993J40405R9607o8735q849
10156E332J47484m2451j37170J32053J63740j6140k82366o3146M6460m4647O654
10145h4197L4078j08244q270J13747R5790n0533k2719j34289p3658J09280J71101
$$ plain form
10134 42086 -19464 -77676 -80057 -125153 -157410 -109399 12286 78544 153653 83034 87418 67450
10122 67450 69855 23927 -15576 7737 -14316 -2043 -77168 -97444 -100900 -6805 -9488 -84576
10110 -84576 -71811 54897 -88699 -185092 -203700 -24283 -11894 -67341 -67424 -254547 -129231
10099 -129231 -85944 -79053 -2683 41949 32270 -46648 -116654 -195406 -149212 -76553 -155543 -140217
10087 -140217 -55455 4371 123244 210999 161447 51537 144371 6588 -203450 -273016 -2272
10076 -2272 91071 137134 233889 237575 173039 160191 126401 101191 142620 49115 86821 101169
10064 101169 -36869 15293 -21675 -46695 -71434 -15036 19232 434 -82156 78567 122331
10053 122331 148285 146697 154930 228852 183226 87900 -58620 45055 146774 109432 -155554
$$ packed form
10134D2086o1550n8212k381m5096l2257M8011J21685O6258P5109p0619M384j9968
10122F7450K405m5928l9503K3313k2053J2273p5125k0276l456R4095k683p5088
10110h4576J2765J26708j43596r6393j8608J79417J2389n5447q3j87123J25316
10099a29231M3287O891P6370M4632r679p8918p0006p8752M6194P2659p8990J5326
10087a40217Q4762N9826J18873Q7755m9552j09910R2834j37783k10038o9566K70744
10076b272R3343M6063R6755L686o4536j2848l3790k5210M1429r3505L7706J4348
10064A01169j38038N2162l6968k5020k4739N6398L4268j8798q2590J60723M3764
10053A22331K5954j588Q233P3922m5626r5326j46520J03675J01719l7342k64986
$$ plain form
10042 -155554 -308081 -355840 -311180 -269866 -236577 -220364 -103726 -10086 -137216 -44412 -19184
10031 -19184 -49839 -70015 -154225 -80257 -3261 -25674 -50187 -120436 -29898 -49096 -85404 -158872
10019 -158872 -249965 -205445 -281061 -179472 58713 191997 119311 -46958 -107561 -125905 -222799
10008 -222799 -239835 -228610 -172081 -216495 -225379 -159106 -36980 -158765 -123096 -35505 -169377
9997 -169377 -141595 -21750 -107518 -242667 -157622 -94680 -87044 -203579 -238458 -112795 -216590
9986 -216590 -144804 -42007 78537 85687 -22714 -40534 2663 18327 45183 -2210 -120325
9975 -120325 -131374 -194341 -165600 -60422 52148 109880 106844 180139 244436 206747 164681
9964 164681 98692 2746 35976 146327 205670 214046 129588 84462 130223 125321 273525 235897
$$ packed form
10042a55554j52527m7759M4660M1314L3289J6213J16638R3640j27130R2804K5228
10031a9184l0655k0176q4210P3968P6996k2413k4513p0249R0538j9198l6308p3468
10019a58872r1093M4520p5616J01589K38185J33284p2686j66269o0603j8344r6894
10008b22799j7036J1225N6529m4414q884O6273J22126j21785L5669Q7591j33872
9997a69377K7782J19845q5768j35149Q5045O2942P636j16535l4879J25663j03795
9986b16590P1786J02797J20544P150j08401j7820M3197J5664K6856m7393j18115
9975a20325j1049o2967K8741J05178J12570N7732l036P3295O4297l7689m2066
9964A64681o5989r5946L3230J10351N9343Q376q4458m5126M5761m902J48204l7628
$$ plain form
9952 235897 194315 3754 -61143 -50561 -60535 -130785 -171237 -97120 -48327 -8940 70723 6313
9940 6313 55188 157791 164270 259821 220031 187605 164721 85373 12044 102862 80776 20792
9928 20792 69431 72408 88658 123999 173199 213144 268933 287910 3013 -40117 -171474 -315495
9916 -315495 -157908 45429 69492 67390 159498 251033 152071 169282 14601 21136 -16549
9905 -16549 22087 136485 147021 121012 135079 165925 175661 167993 142893 219687 330087 277022
9893 277022 221580 177675 87162 -59998 -66826 -185156 -258536 -268658 -267418 -157543 -89009
9882 -89009 -125418 -111303 -85275 -39536 23930 -124937 -103170 -11722 122492 92133 139869
9871 139869 85849 128919 144964 292175 273858 260297 276338 290608 95989 35449 107293
$$ packed form
9952B35897m1582j90561o4897J0582r974p0250m0452P4117M8793L9387P9663o4410
9940F313M8875J02603O479R5551l9790l2426k2884p9348p3329R0818k2086n9984
9928B0792M8639K977J6250L5341M9200L9945N5789J8977k84897m3130j31357j44021
9916c15495J57587K03337K4063k102R2108R1535r8962J7211j54681O535l7685
9905a6549L8636J14398J0536k6009J4067L0846R736p668k5100P6794J10400n3065
9893B77022n5442m3905r0513j47160o828j18330p3380j0122J240J09875O8534
9882h9009l6409J4115K6028M5739O3466j48867K1767R1448J34214l0359M7736
9871A39869n4020M3070J6045J47211j8317j3561J6041J4270j94619o0540P1844
$$ plain form
9860 107293 134046 118904 270068 327121 290438 238086 125110 -88584 -64228 -86433 -130438
9849 -130438 -153354 -103210 168292 203762 3043 -64252 -72525 -18967 -30857 9134 19393
9838 19393 78503 137437 185492 202500 113047 73234 66500 89475 162579 183805 159704 269316
9826 269316 383305 348617 276113 300538 277757 308726 288209 205434 145461 5671 9625
9815 9625 84046 64905 133905 191588 123295 56920 -48991 -159258 -106836 -100378 -47067 76246
9803 76246 90528 -21073 -69011 64531 204846 206903 195850 146369 209645 151541 70867
9792 70867 97509 92097 -18250 5605 150200 272240 310603 242381 169269 43937 42053
9781 42053 52921 -86247 -194409 -95497 -66702 -60406 -10624 -41933 84158 -17895 24602
$$ packed form
9860A07293K6753j5142J51164N7053l6683n2352j12976k13694K4356k2205m4005
9849a30438k2916N0144K71502L5470k00719o7295q273N3558j1890L9991J0259
9838A9393N9110N8934M8055J7008q9453l9813o734K2975P3104K1226k4101J09612
9826B69316J13989l4688p2504K4425k2781L0969k0517q2775n9973j39790L954
9815I625P4421j9141O9000N7683o8293o6375j05911j10267N2422O458N3311J23313
9803G6246J4282j11601m7938J33542J40315K057j1053m9481O3276n8104q0674
9792G0867K6642n412j10347K3855J44595J22040L8363o8222p3112j25332j884
9781D2053J0868j39168j08162R8912K8795O296M9782l1309J26091j02053M2497
$$ plain form
9770 24602 152730 251643 309407 296116 218728 113913 -88031 -54765 82893 189777 267551
9759 267551 154148 59313 107029 57190 -116779 -131959 12253 122631 29172 -61569 -87073
9748 -87073 -32208 104542 125291 124565 156985 76996 84387 104314 107878 172842 188548 154600
9736 154600 163910 229149 285598 169626 187476 152148 135740 161174 60535 -77904 28307
9725 28307 206306 288254 257433 130648 58649 -42857 105071 243456 213530 211453 183529
9714 183529 155147 243189 178701 -83338 -1938 261998 220002 155859 184325 270074 355503
9703 355503 348919 313491 230964 138214 199849 229358 171144 93661 110693 144761 156696 199969
9691 199969 321169 435662 467473 422571 352815 249734 196846 162220 156516 118765 72814
$$ packed form
9770B4602J28128R8913N7764j3291p7388j04815k01944L3266J37658J06884P7774
9759B67551j13403r4835M7716m9839j73969j5180J44212J10378r3459r0741k5504
9748h7073N4865J36750K0749p26L2420p9989P391J9927L564O4964J5706l3948
9736A54600R310O5239N6449j15972J7850l5328j6408K5434j00639j38439J06211
9725B8307J77999Q1948l0821j26785p1999j01506J47928J38385k9926k077k7924
9714A83529k8382Q8042o4488k62039Q1400K63936m1996o4143K8466Q5749Q5429
9703C55503o584l5428q2527r2750O1635K9509n8214p7483J7032L4068J1935M3273
9691A99969J21200J14493L1811m4902o9756j03081n2888l4626n704l7751m5951
$$ plain form
9680 72814 118511 187897 118596 149549 191771 330552 310560 224473 223378 336256 392181 286967
9668 286967 172359 276743 203765 230279 188804 182633 245182 314895 272804 281781 409019
9657 409019 525817 484906 373953 271839 183088 81348 134867 226204 201058 97427 103472
9646 103472 217151 255803 225431 239484 227249 263285 244979 227408 169870 48114 -8710
9635 -8710 11464 59110 161142 266788 234671 288496 380995 435029 351246 161822 88750
9624 88750 74811 1604 -25133 -75670 -21909 115624 102465 107938 212228 268166 233764 206391
9612 206391 151105 183780 304319 282058 184658 149667 213511 293266 375404 324375 402813
9601 402813 312111 212199 150169 133191 46439 -116794 32260 135493 199965 225585 127917
$$ packed form
9680G2814M5697O9386o9301L0953M2222J38781j9992q6087j095J12878N5925j05214
9668B86967j14608J04384p2978K6514m1475o171O2549O9713m2091Q977J27238
9657D09019J16798m0911j10953j02114q8751j01740N3519R1337k5146j03631O045
9646A03472J13679L8652l0372J4053j2235L6036j8306j7571n7538j21756n6824
9635h710K0174M7646J02032J05646l2117N3825R2499N4034q3783j89424p3072
9624H8750j3939p3207k6737n0537N3761J37533j3159N473J04290N5938l4402k7373
9612B06391n5286L2675J20539k2261r7400l4991O3844P9755Q2138n1029P8438
9601D02813r0702r9912o2030j6978q6752j63233J49054J03233O4472K5620r7668
$$ plain form
9590 127917 51295 97746 65229 135264 187514 153818 107600 100755 239697 359637 358055 284183
9578 284183 262990 159931 183170 213445 247608 156258 178362 308715 280086 234557 71136
9567 71136 -18442 44282 30218 46243 214302 281334 222057 83542 15585 101837 194468
9556 194468 255294 172359 152417 261737 253578 332085 489828 465109 367480 237646 261020
9545 261020 177031 189763 309376 181674 209980 236793 251148 256737 170444 258609 250391 44201
9533 44201 44268 210234 161703 115953 180394 136419 181674 221794 275343 303103 302550 319693 335059
9520 335059 259543 181734 279380 330339 302667 193152 174853 158013 242557 236982 203351 241234
9508 241234 301171 305451 265348 283550 317272 319447 219423 191296 304944 310922 432393 398143
$$ packed form
9590A27917p6622M6451l2517P0035N2250l3696m6218o845J38942J19940j582p3872
9578B84183k1193j03059K3239L0275L4163r1350K2104J30353k8629m5529j63421
9567G1136q9578O2724j4064J6025J68059O7032n9277j38515o7957Q6252R2631
9556A94468O0826q2935j9942J09320q159P8507J57743k4719r7629j29834K3374
9545B61020q3989J2732J19613j27702K8306K6813J4355N589q6293Q8165q218k06190
9533D4201O7J65966m8531m5750O4441m3975M5255M0120N3549K7760n53J7143J5366
9520C35059p5516p7809R7646N0959k7672j09515j8299j6840Q4544n575l3631L7883
9508B41234N9937M280m0103J8202L3722K175j00024k8127J13648N978J21471l4250
$$ plain form
9496 398143 374063 409723 411352 402441 266990 302082 319985 302680 335054 387034 249937 145706
9484 145706 185926 237407 306557 228535 175245 140733 162425 142671 158254 112221 193979 264066
9472 264066 273652 269030 253714 176255 204803 277004 290135 373683 337793 294602 221025 291764
9460 291764 280701 332984 196430 154389 153264 143647 124971 190835 277801 351463 341544 345418
9448 345418 460448 482958 405733 498898 449171 158517 2216 30717 239627 341415 291130
9437 291130 341066 310296 317638 478947 588577 435020 413390 472886 420690 331997 342612
9426 342612 323906 425024 409878 376350 444015 355776 318289 325151 458165 473706 452526
9415 452526 416140 417207 341951 287703 354002 334826 295835 254991 190721 260416 273612 194813
$$ packed form
9496C98143k4080L5660J629q911j35451L5092J7903j7305L2374N1980j37097j04231
9484A45706M0220N1481O9150p8022n3290l4512K1692j9754J5583m6033Q1758P0087
9472B64066R586m622j5316p7459K8548P2201J3131Q3548l5890m3191p3577P0739
9460B91764j1063N2283j36554m2041j125r617j8676O5864Q6966P3662r919L874
9448C45418J15030K2510p7225R3165m9727k90654j56301K8501K08910J01788n0285
9437B91130M9936l0770P342J61309J09630j53557k1630N9496n2196q8693J0615
9426C42612j8706J01118j5146l3528O7665q8239l7487O862J33014J5541k1180
9415D52526l6386J067p5256n4248O6299j9176l8991m0844o4270O9695J3196p8799
$$ plain form
9403 194813 186233 179754 145445 176247 211268 108977 266543 388379 342937 406478 459657
9392 459657 521872 597285 397264 159440 180822 354499 373797 429093 348155 293429 269822
9381 269822 266745 215261 237507 340304 409245 392294 410981 400090 349183 383646 347915 212886
9369 212886 13031 157982 284957 301730 184172 152741 108136 62006 186293 334325
9359 334325 408803 336130 117224 113961 157555 147689 26174 167803 346800 410217 328873
9348 328873 274046 166951 188465 243508 237034 281412 173353 189990 331141 390731 394486
9337 394486 391368 312343 222850 68181 162426 266475 318174 389641 363436 336768 239477
9326 239477 177782 89011 170052 271470 266674 248289 269011 269824 222697 357805 224646 107758
$$ packed form
9403A94813q580o479l4309L0802L5021j02291J57566J21836m5442O3541N3179
9392D59657O2215P5413k00021k37824K1382J73677J9298N5296q0938n4726k3607
9381B69822l077n1484K2246J02797O8941j6951J8687j0891n0907L4463l5731j35029
9369B12886j99855J44951J26975J6773j17558l1431m4605m6130J24287J48032
9359C34325P4478p2673k18906l263M3594r866j21515J41629J78997O3417q1344
9348C28873n4827j07095K1514N5043o474M4378j08059J6637J41151N9590L755
9337C94486l118p9025q9493j54669R4245J04049N1699P1467k6205k6668r7291
9326B39477o1695q8771Q1041J01418m796j8385K0722Q13m7127J35108j33159j16888
$$ plain form
9314 107758 157484 106342 30406 124773 215895 31627 -23034 71500 188881 188240 230166 368909
9302 368909 323427 277692 244147 249816 104641 -45744 -17558 67082 153475 201435 115663
9291 115663 137825 162556 240083 194389 164550 200457 272368 335381 275050 306904 332756 375041
9279 375041 388651 265092 110291 94631 57331 160672 197184 267467 247854 157765 128352
9268 128352 72865 29267 -26404 106351 242355 279655 284178 286197 182243 160055 162969 161031
9256 161031 228839 287754 393851 302008 131212 -3368 135226 311611 252298 220096 156403
9245 156403 185812 188304 197449 310126 316936 305759 266813 484836 502763 395543 301846 216449
9233 216449 275825 286057 200958 110206 206484 179104 246041 293577 253236 95805 -16104
$$ packed form
9314A07758M9726n1142p5936R4367R1122j84268n4661R4534J17381o41M1926J38743
9302C68909m5482m5735l3545N669j45175j50385K8186Q4640Q6393M7960q5772
9291A15663K2162K4731P7527m5694k9839L5907P1911O3013o0331L1854K5852M2285
9279C75041J3610j23559j54801j5660l7300J03341L6512P0283j9613r0089k9413
9268A28352n5487m3598n5671J32755J36004L7300M523K019j03954k2188K914j938
9256A61031O7808N8915J06097r1843j70796j34580J38594J76385n9313l2202o3693
9245A56403K9409K492R145J12677O810j1177l8946K18023J7927j07220r3697q5397
9233B16449N9376J0232q5099r0752R6278k7380O6937M7536m0341j57431j11909
$$ plain form
9222 -16104 7275 155759 281293 342371 291433 197577 123690 156772 189054 306074 268592
9211 268592 148410 207746 194244 222724 305617 289954 258798 269689 125411 119742 112114 6258
9199 6258 45271 49153 192390 178952 237435 260008 300542 274989 159405 102005 81881 104761
9187 104761 -79158 -70866 -128816 17278 93376 135583 187614 141722 186748 243440 212771
9176 212771 126268 170514 305687 438168 450853 444549 480381 395117 323712 262143 11731
9165 11731 116322 206305 79590 -61197 -219532 -139015 59513 116274 65053 112037 249232
9154 249232 273124 128880 28166 -88091 -40311 75852 137883 92841 71228 -5425 32569
9143 32569 62640 59898 109238 55627 -12055 21142 -14426 -59666 -2340 -8650 -47391 -18048
$$ packed form
9222a6104K3379J48484J25534O1078n0938r3856p3887L3082L2282J17020l7482
9211B68592j20182N9336j3502K8480Q2893j5663l1156J0891j44278n669p628j05856
9199F258L9013L882J43237j3438N8483K2573M0534k5553j15584n7400k0124K2880
9187A04761j83919Q292n7950J46094P6098M2207N2031m5892M5026N6692l0669
9176B12771q6503M4246J35173J32481J2685o304L5832q5264p1405o1569k50412
9165A1731J04591Q9983j26715j40787j58335Q0517J98528N6761n1221M6984J37195
9154B49232K3892j44244j00714j16257M7780J16163O2031m5042k1613p6653L7994
9143C2569L0071k742M9340n3611o7682L3197l5568m5240N7326o310l8741K9343
$$ plain form
9131 -18048 105819 128893 25317 41741 48709 2824 -92962 -66850 -4781 309186 307999 270441
9119 270441 414572 390497 288667 291813 202901 58704 -55457 -24955 31694 129540 139864
9108 139864 171326 160267 -5623 -104005 -125877 -64031 -20508 118310 144099 153537 119986
9097 119986 135808 190198 212886 178679 258010 203185 59746 103331 44077 2040 -9142
9086 -9142 47573 203845 185113 174448 82881 -7919 65573 67880 27142 149359 272486 301810
9074 301810 150314 78893 158648 200834 183525 205478 263191 226167 224373 128816 -12598
9063 -12598 47838 116807 155094 155371 148906 37713 -66087 48798 207002 120975 -6712
9052 -6712 -28824 68707 64955 -708 -29169 2505 60182 28820 -55005 -136261 -282990 -190413
$$ packed form
9131a8048J23867K3074j03576J6424O968m5885r5786K6112O2069L13967j187l7558
9119B70441J44131k4075j01830L146q8912j44197j14161L0502N6649R7846J0324
9108A39864L1462j1059j65890r8382k1872O1846M3523J38818K5789R438l3551
9097A19986J5822N4390K2688l4207P9331n4825j43439M3585n9254m2037j1182
9086i142N6715J56272j8732j0665r1567r0800P3492K307m0738J22217J23127K9324
9074C01810j51496p1421P9755M2186j7309K1953N7713l7024j794r5557j41414
9063a2598O0436O8969L8287K77o465j11193j03800J14885J58204q6027j27687
9052f712k2112R7531l752o5663k8461L1674N7677l1362q3825q1256j46729R2577
$$ plain form
9040 -190413 -251073 -195260 -76516 2049 110204 177246 173122 114633 5344 -99 -17516
9029 -17516 31917 -52011 -10112 28435 37432 64938 172968 227515 165921 -9092 -137903
9018 -137903 -113108 25965 18725 54989 88347 43870 -47849 -75081 -139260 -46207 -76450 -143261
9006 -143261 -140589 -30523 162568 202640 196983 226884 241236 244137 194490 236631 257565 273935
8994 273935 315458 168551 57870 181293 291062 177533 127769 163584 283304 314024
8984 314024 231077 146000 192174 207201 220475 172583 146447 277236 251079 325399 308744
8973 308744 217432 231000 149683 59889 74753 138781 239023 149511 15515 -92600 -40703
8962 -40703 -30090 30237 145849 133845 205665 256167 271117 179902 128599 187420 93774 123075
$$ packed form
9040a90413o0660N5813J18744P8565J08155O7042m124n8489j09289n443j7417
9029a7516M9433q3928M1899L8547Q997K7506J08030N4547o1594j75013j28811
9018a37903K4795J39073p240L6264L3358m4477r1719k7232o4179R3053l0243o6811
9006a43261K672J10066J93091M0072n657K9901J4352K901m9647M2141K0934J6370
8994B73935M1523j46907j10681J23423J09769j13529m9764L5815J19720L0720
8984C14024q2947q5077M6174J5027J3274m7892k6136J30789k6157P4320j6655
8973C08744r1312J3568q1317q9794J4864O4028J00242q9512j33996j08115N1897
8962d0703J0613O0327J15612j2004P1820N0502J4950r1215n1303N8821r3646K9301
$$ plain form
8950 123075 28554 -21639 -3966 129862 227627 229317 181619 229814 211193 129178 -80822
8939 -80822 -217281 -209274 -124389 31032 31917 143278 184440 113565 55709 70631 141954 103115
8927 103115 102564 133071 62124 113644 199689 153855 30711 204455 224612 191621 253673 134533
8915 134533 125871 129908 39429 -19490 -25492 -58356 -112058 -54728 123541 124638 184214 218060
8903 218060 271324 326495 226166 115532 47297 -11122 34047 51468 111857 96170 213772
8892 213772 301751 192141 -23938 6612 12652 77895 160922 151532 97767 200855 129436
8881 129436 82359 -48397 -96481 68469 149755 133151 29024 30365 19749 4449 129379
8870 129379 22646 -148639 -152372 -118659 -61903 40569 33849 114569 132789 45935 79323
$$ packed form
8950A23075r4521n0193J7673J33828R7765J690m7698M8195j8621q2015k10000
8939h0822j36459Q007Q4885J55421Q85J11361M1162p0875n7856J4922P1323l8839
8927A03115n51L0507p0947N1520Q6045m5834j23144J73744K0157l2991O2052j19140
8915A34533q662M037r0479n8919o002l2864n3702N7330J78269J097N9576L3846
8903B18060N3264N5171j00329j10634o8235n8419M5169J7421O0389j5687J17602
8892B13772Q7979j09610k16079L0550O040O5243Q3027r390n3765J03088p1419
8881A29436m7077j30756m8084J64950Q1286j6604j04127J341j0616j5300J24930
8870A29379j06733j71285l733L3713N6756J02472o720Q0720J8220q6854L3388
$$ plain form
8859 79323 107142 8980 -144936 -124430 35486 -129556 -211304 -158586 -79420 -44299 -71554
8848 -71554 -84222 -78923 -87219 -84021 -1429 27532 -89508 -131236 -157413 -289126 -152902 6128
8836 6128 -3464 -9436 -22354 -128840 -87851 -21180 6104 41491 31135 26766 -72528 -62786 -52398
8823 -52398 -137053 -160905 -85949 -113330 -97005 -28598 -50975 -91341 -52547 70457 176147
8812 176147 122718 100249 82911 69222 -58485 -85563 -109699 -171112 -87155 33843 190110
8801 190110 172867 113259 128444 199830 247379 88206 -5783 -111271 -124808 -119929 -126488 -32281
8789 -32281 91391 132251 84659 -88883 -137914 -179871 -214056 -276946 -80557 -79750 -17656 716
8777 716 -74023 -83602 -162186 -194948 -185389 -139942 -23389 -72061 -65421 298 60169 97089 -13149
$$ packed form
8859G9323K7819r8162j53916K0506J59916j65042q1748N2718P9166L5121k7255
8848g1554j2668N299q296L198Q2592K8961j17040m1728k6177j31713J36224J59030
8836F128r592n972j2918j06486M0989O6671K7284L5387j0356m369r9294R742J0388
8823e2398q4655k3852P4956k7381J6325O8407k2377m0366L8794J23004J05690
8812A76147n3429k2469j7338j3689j27707k7078k4136o1413Q3957J20998J56267
8801A90110j7243n9608J5185P1386M7549j59173r3989j05488j3537M879o559R4207
8789c2281J23672M0860m7592j73542m9031m1957l4185o2890J96389Q07O2094J8372
8777G16p4739r579p8584l2762R559M5447J16553m8672O640O5719N9871L6920j10238
$$ plain form
8764 -13149 -134641 -82604 28770 -22237 70616 39610 69835 129915 59998 25235 53192
8753 53192 72532 138062 171963 99957 17917 -155366 -62643 76624 131671 245790 208455
8742 208455 89076 107 -63884 85048 141422 168230 106583 27836 -60461 21623 117445
8731 117445 132921 35325 17849 57642 10282 29116 -64747 -148993 -153149 -156237 -282006 -186968
8719 -186968 -89690 -75758 -84114 -53758 -48946 7583 125369 254088 86318 -51836 15832
8708 15832 -25793 31995 49510 40581 -28988 -46742 -51369 -70867 -128838 -80945 72287 128339
8696 128339 64784 53962 133657 49278 26392 46361 19242 -32757 -1053 53257 230118
8685 230118 216328 282986 299562 142582 94964 127863 159125 118327 210144 179544 57517
$$ packed form
8764a3149j21492N2037J11374n1007R2853l1006L0225O0080o9917l4763K7957
8753E3192J9340O5530L3901p2006q2040j73283R2723J39267N5047J14119l7335
8742B08455j19379q8969o3991J48932N6374K6808o1647p8747q8297Q2084R5822
8731A17445J5476r7596j7476L9793m7360J8834r3863q4246m156l088j25769R5038
8719a86968R7278J3932q356L0356M812N6529J17786J28719j67770j38154O7668
8708A5832m1625N7788J7515q929o9569j7754m627j9498n7971M7893J53232N6052
8696A28339o3555j0822P9695q4379k2886J9969k7119n1999L1704N4310J76861
8685B30118j3790O6658J6576j56980m7618L2899L1262m0798R1817l0600j22027
$$ plain form
8674 57517 -77407 -60622 -52265 -78590 -117813 -47300 -30602 -176817 -89250 -23113 1416 25858
8662 25858 -74818 -195709 -56959 -46102 -196234 -210790 -269583 -391801 -265222 -156166
8652 -156166 -146252 -54357 40410 24483 17274 94111 91823 153690 218684 312202 328108 479451
8640 479451 690333 609210 386462 323665 119019 -123999 -230490 -253025 -161958 -67790 89593
8629 89593 76954 213165 416530 441826 452448 373961 325061 272109 388963 561126 558267
8618 558267 528991 416079 336779 437342 311832 135210 42609 75727 -3561 57177 203195
8607 203195 123078 99269 204036 209952 119060 -46929 -98790 -2172 -24470 62603 277426
8596 277426 403732 479267 524475 405665 273079 319501 367914 333485 360848 328095 171123
$$ packed form
8674E7517j34924J6785Q357k6325l9223P0513J6698j46215Q7567O6137K4529K4442
8662B5858j00676j20891J38750J0857j50132j4556n8793j22218J26579J09056
8652a56166R914R1895R4767j5927p209P6837k288O1867O4994R3518J5906J51343
8640D79451K10882q1123k22748o2797k04646k43018j06491k2535R1067R4168J57383
8629H9593j2639J36211K03365K5296J0622p8487m8900n2952J16854J72163k859
8618E58267k9276j12912p9300J00563j25510j76622r2601L3118p9288O0738J46018
8607B03195q0117k3809J04767N916r0892j65989n1861R6618k2298Q7073K14823
8596B77426J26306P5535M5208j18810j32586M6422M8413l4429K7363l2753j56972
$$ plain form
8585 171123 197117 155180 244964 204284 219397 374232 421316 520520 726637 1093822 1141086
8574 1141086 911206 713331 527082 342264 328147 236393 94015 196446 95217 69801
8564 69801 175382 55972 34699 37819 25450 116091 203390 236114 202239 103655 39749 101984
8552 101984 -54580 -82590 72058 158429 204487 90578 58007 -6612 -218076 -307696 -206986
8541 -206986 45213 189464 188061 110735 109327 57549 76930 223717 390625 439333 486304
8530 486304 518604 605362 273856 60297 11229 85265 120090 36457 12598 -85109 -172081
8519 -172081 -199910 -223287 -17544 -24699 -148119 -256201 -289310 -311010 -285919 -203490 -109549
8508 -109549 -55501 158570 116007 -98673 -49289 40488 -89847 -192341 -110937 -171048 -126370
$$ packed form
8585A71123K5994m1937Q9784m0680J5113J54835M7084R9204K06117L67185M7264
8574A141086k29880j97875j86249j84818j4117r1754j42378J02431j01229k5416
8564F9801J05581j19410k1273L120j2369R0641Q7299L2724l3875r8584o3906O2235
8552A01984j56564k8010J54648Q6371M6058j13909l2571o4619k11464q9620J00710
8541b06986K52199J44251j403p7326j408n1778J9381J46787J66908M8708M6971
8530D86304L2300Q6758l31506k13559m9068P4036L4825q3633k3859r7707q6972
8519a72081k7829k3377K05743p155j23420j08082l3109k1700K5091Q2429R3941
8508a09549N4048K14071m2563k14680M9384Q9777j30335j02494Q1404o0111M4678
$$ plain form
8497 -126370 50110 6060 -42202 -29354 124717 49678 37714 28909 -24926 -127799 -161380
8486 -161380 -189904 -144426 -832 43419 100552 132526 124858 5580 -27256 -3101 -60348
8475 -60348 46059 29134 -60965 -21054 28902 14628 -38142 -59914 -3441 -22273 -50578 -131289
8463 -131289 -142734 -157065 -140144 -91221 -205109 -179483 -75919 38590 83032 92701 -41419
8452 -41419 -131309 -101021 -70037 -10293 323 -103503 -221846 -136001 22574 -15293 -163362
8441 -163362 -165844 -56710 -143055 -49381 -21844 -129073 -268765 -274824 -318067 -170560 -153631
8430 -153631 -254089 -308615 -354847 -310140 -355399 -273550 -242451 -123942 -28926 -146342 -206345
8419 -206345 -239357 -304292 -251764 -62449 34280 54908 -107054 -69439 34547 -29620 17434
$$ packed form
8497a26370J76480m4050m8262J2848J54071p5039j1964q805n3835j02873l3581
8486a61380k8524M5478J43594M4251N7133L1974p668j19278l2836K4155n7247
8475f0348J06407j6925r0099L9911M9956j4274n2770k1772N6473j8832k8305q0711
8463a31289j1445j4331J6921M8923j13888K5626J03564J14509M4442R669j34120
8452d1419q9890L0288L0984N9744J0616j03826j18343Q5845J58575l7867j48069
8441a63362k482J09134q6345R3674K7537j07229j39692o059m3243J47507J6929
8430a53631j00458n4526m6232M4707m5259Q1849L1099J18509R5016j17416o0003
8419b06345l3012o4935N2528J89315R6729K0628j61962L7615J03986o4167M7054
$$ plain form
8408 17434 40377 25785 42191 61516 29145 48804 42490 -94055 -210233 -148078 -119221 -172757
8396 -172757 -140115 -209959 -225235 -158767 -148281 -139230 94832 221133 105655 102161 207252
8385 207252 115026 35835 84514 82109 -31611 -20562 130257 157866 128409 73335 66466 -48415
8373 -48415 -157669 -162957 -152883 -191214 -154836 -120500 -50952 132837 244258 252525 174555 149792
8361 149792 19440 65752 138987 119260 98310 -23258 -50349 -98312 -52136 44986 188691
8350 188691 218712 218050 141641 -9893 18370 167997 130714 38199 52141 83647 83328 -20772
8338 -20772 -37718 31232 3440 -80818 -88238 83991 190258 128652 124593 61000 -39272 89
8326 89 41340 58372 16315 -34097 -80951 -178682 -101765 -99713 3380 75313 71752 -10433 50758
$$ packed form
8408A7434K2943j4592J6406J9325l2371J9659o314j36545j16178O2155K8857n3536
8396a72757L2642o9844j5276O6468J0486R051K34062J26301j15478l494J05091
8385B07252r2226p9191M8679k405j13720J1049J50819K7609k9457n5074o869j14881
8373d8415j09254n288J0074l8331L6378L4336O9548J83789J11421Q267p7970k4763
8361A49792j30352M6312P3235j9727k0950j21568k7091m7963M6176R7122J43705
8350A88691L0021o62p6409j51534K8263J49627l7283r2515J3942L1506l19j04100
8338b0772j6946O8950k7792q4258p420J72229J06267o1606m059o3593j00272L9361
8326H9M1251J7032m2057n0412m6854r7731P6917K052J03093P1933l561q2185O1191
$$ plain form
8313 50758 -3761 -142345 -60612 -2326 -48062 4158 77614 -85024 -46636 12527 32695
8302 32695 -156794 -258063 -166912 -9791 180642 222194 140715 8938 -108990 -164414 -122695
8291 -122695 85009 14862 -29810 -83331 -57436 10400 31881 -93935 -130132 -99250 129708
8280 129708 309354 314215 170324 188665 146425 113394 -12105 62205 88701 43264 26711
8269 26711 -15940 -126561 -153826 -149476 -77743 -63019 -45122 -28894 -29154 111159 115764 76741
8257 76741 45162 -23962 -160286 -208694 -204437 -77785 92275 192446 246140 66281 48111
8246 48111 51742 6284 -99966 -11558 119925 79173 61069 56700 -116123 -187744 -96873 -106631
8234 -106631 -107536 -41646 -153572 -174292 -162790 101579 178703 129684 -76003 -141947 -136896 -122716
$$ packed form
8313E0758n4519j38584Q1733N8286m5736N2220P3456j62638L8388N9163K0168
8302C2695j89489j01269R1151J57121J90433M1552q1479j31777j17928n5424M1719
8291a22695K07704p0147m4672n3521K5895O7836K1481j25816l6197L0882K28958
8280A29708J79646M861j43891J8341m2240l3031j25499P4310K6496m5437j6553
8269B6711m2651j10621k7265M350P1733J4724J7897J6228k60J40313M605l9023
8257G6741l1579o9124j36324m8408M257J26652J70060J00171N3694j79859j8170
8246D8111L631m5458j06250Q8408J31483m0752j8104m369j72823p1621R0871r758
8234a06631r05O5890j11926k0720J1502K64369P7124m9019k05687o5944N051J4180
$$ plain form
8222 -122716 -104434 -105087 -135520 -176717 -191234 -172164 16956 -123669 -277876 -223647 -176860
8211 -176860 -155188 -195347 -255313 -194793 -136281 -74385 4928 19700 24022 155705 218131 212362
8199 212362 25720 -126074 -71364 12560 19686 -38457 -88831 -240344 -291915 -302685 -60246
8188 -60246 24057 -92306 -175449 -183711 39143 77461 46561 120077 117019 -15821 -125403
8177 -125403 -118085 -170454 -195189 -95504 -102479 -71321 -115000 -49181 11595 10557 102659 96788
8165 96788 71363 13452 118381 145230 107193 5485 -120961 -128384 -6408 78393 90963
8154 90963 -29967 -93118 -68764 -44030 -4266 -30740 -155128 -271465 -252754 -110064 -69281
8143 -69281 -32628 39862 94076 -6886 -170666 -186569 -144622 -167109 -225944 -279361 -187986
$$ packed form
8222a22716J8282o53l0433m1197j4517J9070J89120j40625j54207N4229M6787
8211a76860K1672m0159n9966O0520N8512O1896P9313J4772M322J31683O2426n769
8199B12362j86642j51794N4710Q3924P126n8143n0374j51513n1571j0770K42439
8188f0246Q4303j16363q3143q262K22854L8318l0900P3516l058j32840j09582
8177a25403P318n2369k4735R9685o975L1158m3679O5819O0776j038R2102n871
8165I6788k5425n7911J04929K6849l8037j01708j26446p423J21976Q4801J2570
8154I0963j20930o3151K4354K4734L9764k6474j24388j16337J8711J42690M0783
8143f9281L6653P2490N4214j00962j63780j5903M1947k2487n8835n3417R1375
$$ plain form
8132 -187986 -140926 -198058 -173890 -118055 -186269 -333124 -376459 -440663 -354787 -308843 -208745
8121 -208745 -72597 -25749 -60592 -111272 -281103 -250642 -227425 -48774 -42821 -56042 28456
8110 28456 146246 209749 274000 311789 217849 2390 -118663 -73138 -108340 -243796 -229360
8099 -229360 -158873 31737 36791 -30343 65163 120904 209320 171136 106672 143528 143837 -49313
8087 -49313 -35829 53443 20124 38555 75536 151593 247351 181729 110463 106229 95449 -28379
8075 -28379 -86296 -16932 -6295 -46259 -129402 -312516 -292035 -192367 -29722 13399 -47376
8064 -47376 -54451 -100420 -53258 -76691 -57519 9812 -9401 -44466 -234150 -334201 -278959 -130852
8052 -130852 -27392 843 34090 -78395 -114411 -147213 -212515 -86987 -24671 71144 6761
$$ packed form
8132a87986M7060n7132K4168N5835o8214j46855m3335o4204Q5876M5944J00098
8121b08745J36148M6848l4843n0680j69831L0461K3217J78651N953j3221Q4498
8110B8456J17790O3503O4251L7789r3940k15459j21053M5525l5202j35456J4436
8099b29360P0487J90610N054o7134R5506N5741Q8416l8184o4464L6856L09j93150
8087d9313J3484Q9272l3319J8431L6981P6057R5758o5622p1266m234j0780j23828
8075b8379n7917O9364J0637l9964q3143j83114K0481R9668J62645M3121o0775
8064d7376p075m5969M7162k3433J9172O7331j9213l5065j89684j00051N5242J48107
8052a30852J03460K8235L3247j12485l6016l2802o5302J25528O2316R5815o4383
$$ plain form
8041 6761 47008 -108318 -110597 -126353 -105418 -15862 -124079 -2486 -60394 -176958 -206693
8030 -206693 -172764 -29736 46014 72577 1592 -64945 -228073 -156904 -9859 109598 124549
8019 124549 90328 79666 18321 -117711 -211591 -190530 -10423 126151 227000 268967 73135
8008 73135 36301 -42029 -20960 -24602 -191460 -192549 -165450 -121199 -58273 -60268 -24618 68407
7996 68407 -10160 -46548 -70671 -59431 67609 45811 -78616 -107586 -92346 -149067 -107992
7985 -107992 -43986 -118848 -77638 -152937 -129309 -155959 -274140 -304457 -271329 -138638 -67136
7974 -67136 100775 137708 137162 -98293 -83442 -49353 -11664 -868 -213769 -240292 -346460
7963 -346460 -350382 -294162 -174152 48519 76570 -71849 39555 184452 129269 186898 264543
$$ packed form
8041F761M0247j55326k279j5756K0935Q9556j08217J21593n7908j16564k9735
8030b06693L3929J43028P5750K6563p0985o6537j63128P1169J47045J19457J4951
8019A24549l4221j0662o1345j36032r3880K1061J80107J36574J00849M1967j95832
8008G3135l6834p8330K1069l642j66858j089K7099M4251O2926j995L5650R3025
7996F8407p8567l6388k4123J1240J27040k1798j24427k8970J5240n6721M1075
7985a07992O4006p4862M1210p5299K3628k6650j18181l0317L3128J32691P1502
7974f7136J67911L6933n46k35455J4851L4089L7689J0796k12901k6523j06168
7963c46460l922N6220J20010K22671K8051j48419J11404J44897n5183N7629P7645
$$ plain form
7952 264543 296720 282656 257434 136872 58844 34637 -51372 -250156 -273927 -81455 7588
7941 7588 88367 49387 28902 48528 94260 -93490 -125051 -211295 -190445 -192348 -88484 -71304
7929 -71304 18031 -30673 51671 86286 76193 23984 3550 -79066 -121499 -148160 -237755 -407612
7917 -407612 -353658 -293386 -171320 -102323 -39904 -93002 -205445 -166433 -75952 36329 -72221
7906 -72221 -24963 69914 -85982 -48276 67089 60887 -18984 2043 64575 39038 -33917 -141208
7894 -141208 -198978 -135744 -39969 -87245 -76325 -91203 -102704 -125929 -93281 19819 133686
7883 133686 162611 85435 5260 -49954 -44667 40967 26769 -120605 -63222 37333 -9353
7872 -9353 -31037 -53428 -117917 -237802 -101291 -134028 -38673 5242 -26472 -41909 -26234 26486
$$ packed form
7952B64543L2177j4064k5222j20562p8028k4207q6009j98784k3771J92472Q9043
7941G588Q0779l8980k0485J9626M5732j87750l1561q6244K0850j903J03864J7180
7929g1304Q9335m8704Q2344L4615j0093n2209k0434q2616m2433k6661q9595j69857
7917d07612N3954O0272J22066O8997O2419n3098j12443L9012R0481J12281j08550
7906g2221M7258R4877j55896L7706J15365o202p9871K1027O2532k5537p2955j07291
7894a41208n7770O3234R5775m7276J0920j4878j1501k3225L2648J13100J13867
7883A33686K8925p7176q0175n5214N287Q5634j4198j47374N7383J00555m6686
7872i353k1684k2391o4489j19885J36511l2737R5355M3915l1714j5437J5675N2720
$$ plain form
7860 26486 68071 66306 44434 109885 -42001 32412 24806 109565 142468 116120 60928 838
7848 838 -21480 -11349 -69878 -125750 -129107 -69412 -31248 -19192 351 65817 122262 74826
7836 74826 -37820 -18658 -108979 -167709 -134521 -108490 -109311 -136247 -92709 -23660 -28744 78911
7824 78911 34161 -84218 -127037 -140448 -225123 -284250 -223846 -106230 -50769 -95470 -158655
7813 -158655 -62833 40765 29604 -107982 -164202 -191051 -281439 -156293 33037 62002 -25561
7802 -25561 -76034 -13353 -73977 -88099 -176460 -206379 -147657 -209670 -278358 -196810 -169814 -219021
7790 -219021 -227491 -154645 -90696 -41047 -51407 -26914 5428 -127708 -268003 -242261 -165773
7779 -165773 -129149 -107373 47847 186468 230704 246087 303560 308681 209500 107070 -23616
$$ packed form
7860B6486M1585j765k1872O5451j51886P4413p606Q4759L2903k6348n5192o0090
7848H38k2318J0131n8529n5872l357N9695L8164J2056J9543O5466N6445m7436
7836G4826j12646J9162r0321n8730L3188K6031q21k6936M3538O9049n084J07655
7824G8911m4750j18379m2819j3411q4675n9127O0404J17616N5461m4701o3185
7813a58655R5822J03598j1161j37586n6220k6849r0388J25146J89330K8965q7563
7802b5561n0473O2681o0624j4122q8361k9919N8722o2013o8688Q1548K6996m9207
7790b19021q470P2846O3949M9649j0360K4493L2342j33136j40295K5742P6488
7779a65773L6624K1776J55220J38621M4236J5383N7473N121r9181j02430j30686
$$ plain form
7768 -23616 -128695 -110732 -180576 -200872 -211687 -117437 -183772 -144681 -193785 -225181 -194281 -133290
7756 -133290 -106226 -44545 43644 64325 145119 -9939 -53900 -247929 -192567 -69519 -59909
7745 -59909 -159102 -255435 -283648 -389136 -344214 -204847 -110369 -97290 -24799 40088 37692 4006
7733 4006 -37350 4510 6751 -59520 -108001 -112083 -165627 -182528 -158246 -200268 -112768 -9484
7721 -9484 59015 109808 60257 -30647 -40831 -71463 -151246 -193248 -240717 -264092 -285679 -217734
7709 -217734 -179772 -123453 2746 87234 -10496 -85452 -178114 -148302 -29994 -6578 -57948
7698 -57948 -64615 17363 15569 2527 -47991 -167060 -303035 -177876 -29087 3925 30297
7687 30297 -15 -64061 -35582 -14819 14649 -41209 -51967 -77391 -76329 -97161 -141508 -120332
$$ packed form
7768b3616j05079J7963o9844k0296j0815R4250o6335L9091m9104l1396L0900O0991
7756a33290K7064O1681Q8189K0681Q0794j55058m3961j94029N5362J23048R610
7745e9909r9193r6333k8213j05488M4922J39367R4478J3079P2491O4887k396l3686
7733D006m1356M1860K241o6271m8481m082n3544j6901K4282m2022Q7500J03284
7721i484O8499N0793m9551r0904j0184l0632p9783m2002m7469k3375k1587O7945
7709b17734L7962N6319J26199Q4488r7730p4956r2662K9812J18308K3416n1370
7698e7948o667Q1978j794j3042n0518j19069j35975J25159J48789L3012K6372
7687C0297l0312o4046K8479K0763K9468n5858j0758k5424J062k0832m4347K1176
$$ plain form
7675 -120332 -85846 -58155 -126693 -190548 -79490 48616 38676 36454 97073 114869 -54907
7664 -54907 -166284 -137671 -106978 -102736 -93603 7706 41769 -94166 -180183 -91443 -7047 -92571
7652 -92571 -128714 -51760 12925 17257 -119884 -198659 -240912 -219943 -140413 -146136 -205345 -106998
7640 -106998 -108147 -23309 -41112 -66474 -58151 -87817 -157425 -126175 -38006 -4395 -46152 17078
7628 17078 44104 85306 124769 123748 189075 113488 14181 -134121 -75711 -47085 -109656 -58530
7616 -58530 -138785 -112310 -45643 -7297 -63194 -7587 112555 33619 34231 122029 107054 -78371
7604 -78371 -137981 -92622 -264994 -321635 -198873 -69039 59983 177176 108460 62679 10451
7593 10451 -96858 -38965 22805 -81845 -101427 -48233 -128516 -237682 -276264 -236670 -210049
$$ packed form
7675a20332L4486K7691o8538o3855J11058J28106r940k222O0619J7796j69776
7664e4907j11377K8613L0693M242R133J01309L4063j35935q6017Q8740Q4396q5524
7652i2571l6143P6954O4685M332j37141p8775m2253K0969P9530n723n9209R8347
7640a06998j149Q4838j7803k5362Q323k9666o9608L1250Q8169L3611m1757O3230
7628A7078K7026M1202L9463j021O5327p5587r9307j48302N8410K8626o2571N1126
7616e8530q0255K6475O6667L8346n5897N5607J20142p8936O12Q7798j4975j85425
7604g8371n9610M5359j72372n6641J22762J29834J29022J17193o8716m5781n2228
7593A0451j07309N7893O1770j04650j9582N3194q0283j09166l8582L9594K6621
$$ plain form
7582 -210049 -161415 -164687 -16166 4136 -25384 -48049 -44250 21968 111303 42706 55671 19616
7570 19616 -129694 -55432 -55689 -120623 -128366 -44863 36964 27655 -27878 77632 38394 -55741
7558 -55741 -64424 10206 -5154 -21710 -85437 4621 140800 158788 173572 180545 88598 54461
7546 54461 87120 22177 -42609 -66399 -86705 -208119 -258578 -301062 -220716 -87628 25457
7535 25457 144788 239726 212424 177672 184862 281152 299091 184172 86287 87032 62445 -1914
7523 -1914 -91368 -103821 -69335 -63860 77698 25279 51167 178568 218922 204122 40961 -137177
7511 -137177 -233133 -213537 -237158 -170880 -178907 -83283 17447 -118412 -111947 1804 -6176 -29823
7499 -29823 136801 150428 96393 102300 98248 -124547 -318118 -273829 -324941 -170773 -217044
$$ packed form
7582b10049M8634l272J48521K0302k9520k2665L799O6218Q9335o8597J2965l6055
7570A9616j49310P4262k57o4934p743Q3503Q1827r309n5533J05510l9238r4135
7558e5741q683P4630j5360j6556o3727R0058J36179J7988J4784O973r1947l4137
7546E4461L2659o4943o4786k3790k0306j21414n0459m2484Q0346J33088J13085
7535B5457J19331R4938k7302l4752P190R6290J7939j14919r7885P45k4587o4359
7523a914q9454j2453L4486N475J41558n2419K5888J27401M0354j4800j63161j78138
7511a37177r5956J9596k3621O6278q027R5624J00730j35859O465J13751p980k3647
7499b9823J66624J3627n4035N907m052k22795j93571M4289n1112J54168m6271
$$ plain form
7488 -217044 -339132 -281949 -247926 -106819 -116990 -156268 -184294 -195791 -166646 -70797 7349
7477 7349 82772 61730 57807 50059 24327 -45875 -54219 -241412 -252950 -222159 -212966 -320758
7465 -320758 -313788 -261095 -255930 -183986 -78592 -49550 -3765 83532 45838 16209 5283 75318
7453 75318 26435 10093 -115320 -256138 -236789 -143602 -90146 -112928 4847 86528 -53186
7442 -53186 -94638 -194619 -173603 -103922 -89056 -86035 -225423 -196015 -68422 -2364 3036 -73502
7430 -73502 -25925 76248 55572 -21996 797 -76768 -266191 -269546 -227425 -134684 -190529 -206465
7418 -206465 -89526 -140351 -145565 -95268 -48917 -98079 -145266 -159835 -175892 -203277 -281173 -284461
7406 -284461 -177692 -118997 -69592 -130343 -206039 -55680 -2355 -58874 -57739 -90602 -108743
$$ packed form
7488b17044j22088N7183L4023J41107j0171l9278k8026j1497K9145R5849P8146
7477G349P5423k1042l923p748k5732p0202q344j87193j1538L0791R193j07792
7465c20758O970N2693N165P1944J05394K9042M5785Q7297l7694k9629j0926P0035
7453G5318m8883j6342j25413j40818J9349R3187N3456k2782J17775Q1681j39714
7442e3186m1452r9981K1016O9681J4866L021j39388K9408J27593O6058N400p6538
7430g3502M7577J02173k0676p7568K2793p7565j89423l355M2121R2741n5845j5936
7418b06465J16939n0825n214N0297M6351m9162m7187j4569j6057k7385p7896l288
7406b84461J06769N8695M9405o0751p5696J50359N3325n6519J135l2863j8141
$$ plain form
7395 -108743 -59372 -49981 -119068 -52564 57264 13800 -65894 -103327 -117240 -30639 -35262 -78538
7383 -78538 -132728 -73231 86006 135599 24419 88693 133233 67808 41706 -36001 -117999
7372 -117999 -91320 -23319 35663 22874 -3946 -25566 5547 48804 18860 -21361 -42035 -91274
7360 -91274 8335 -1408 105743 162733 167869 22996 -164462 -100148 -115947 -296790 -364134
7349 -364134 -335777 -256921 -220566 -128819 -22527 49708 76484 41275 30979 3221 -18050
7338 -18050 -50965 -107528 -203501 -247487 -130368 -136188 -247801 -224267 -250577 -176717 -104194 -211312
7326 -211312 -154356 -49691 -13429 -35339 -53405 -41775 204760 189624 128716 20368 -75468
7315 -75468 -38304 10247 -10136 8054 89008 -44565 -102588 -198875 -188929 -174060 -148248 -198153
$$ packed form
7395a08743M9371R391o9087O6504J09828m3464p9694l7433j3913Q6601m623m3276
7383g8538n4190N9497J59237M9593j11180O4274M4540o5425k6102p7707q1998
7372a17999K6679O8001N8982j2789k6820k1620L1113M3257k9944m0221k0674m9239
7360i1274R9609r743J07151N6990N136j44873j87458O4314j5799j80843o7344
7349c64134K8357P8856L6355R1747J06292P2235K6776l5209j0296k7758k1271
7338a8050l2915n6563r5973m3986J17119n820j11613K3534k6310P3860P2523j07118
7326b11312N6956J04665L6262k1910j8066J1630K46535j5136o0908j08348r5836
7315g5468L7164M8551k0383J8190Q0954j33573n8023r6287R946J4869K5812m9905
$$ plain form
7303 -198153 -311490 -284078 -307438 -265911 -275723 -285576 -170329 -22016 -50149 -49539 -69115 7466
7291 7466 146347 145495 75982 40434 11060 -51652 -185685 -168594 -115181 -44659 -11008 -2195
7279 -2195 -35527 -53447 -118615 14290 9536 -7570 -39964 -44289 -39944 -105452 -243370 -267661
7267 -267661 -137964 -111396 56014 86413 -33497 -73048 -175330 -121945 -49685 -34619 -138917
7256 -138917 -86097 -137494 -125371 -41960 -7066 83353 125711 82960 70515 -501 -139162
7245 -139162 -191892 -265705 -272082 -216932 -263029 -209620 -25092 -82814 -159500 -195370 -194226 -158448
7233 -158448 -151076 -61342 -59664 -18270 -46401 26827 -12781 -77920 -145792 -175901 -215789 -173987
7221 -173987 -122600 -22256 -51442 51303 134888 146864 210356 24503 -23897 62732 60307
$$ packed form
7303a98153j13337K7412k3360M1527r812r853J15247J48313k8133O10j9576P6581
7291G466J38881q52o9513l5548k9374o2712j34033J7091N3413P0522L3651Q813
7279b195l3332j7920o5168J32905m754j7106l2394m325M345o5508j37918k4291
7267b67661J29697K6568J67410L0399j19910l9551j02282N3385P2260J5066j04298
7256a38917N2820n1397J2123Q3411L4894R0419M2358m2751j2445p1016j38661
7245a39162n2730p3813o377N5150m6097N3409J84528n7722p6686l5870J144L5778
7233a58448P372Q9734J678M1394k8131P3228l9608o5139o7872l0109l9888M1802
7221a73987N1387J00344k9186J02745Q3585J1976O3492j85853m8400Q6629k425
$$ plain form
7210 60307 -42718 -37602 13526 28664 95429 128356 90064 116652 106468 152173 111969 66470
7198 66470 139419 220696 119230 -42129 36698 33667 -8571 -77835 -99379 -22198 15697 99619
7186 99619 44191 27519 110482 4034 -100008 -123668 -135120 -63226 102574 71395 33161
7175 33161 37466 194040 217188 127517 131501 242446 121353 -12844 -87992 -170540 -95844
7164 -95844 -136945 -200423 -180051 -56080 -10917 112945 44427 -91583 -181999 -162272 -130661
7153 -130661 -119479 -25567 -102391 -165859 -149036 -117608 -115459 -136407 -239994 -154763 -90768 -122037
7141 -122037 -182786 -89961 -137608 -171499 -103686 40383 254244 345920 114788 -24309 -24364
7130 -24364 -179301 -187639 -111287 -35067 -53516 -158648 -236583 -203519 -107578 -15856 72512 167190
$$ packed form
7210F0307j03025N116N1128J5138O6765L2927l8292K6588j0184M5705m0204m5499
7198F6470P2949Q1277j01466j61359P8827l031m2238o9264k1544P7181L7895Q3922
7186I9619n5428j6672Q2963j06448j04042k3660j1452P1894J65800l1179l8234
7175C3161M305J56574K3148q9671L984J10945j21093j34197p5148q2548P4696
7164i5844m1101o3478K0372J23971M5163J23862o8518j36010r0416J9727L1611
7153a30661J1182R3912p6824o3468J6823L1428K149k0948j03587Q5231O3995l1269
7141a22037o0749R2825m7647l3891O7813J44069K13861R1676k31132j39097n5
7130b4364j54937q338P6352P6220j8449j05132p7935L3064R5941R1722Q8368R4678
$$ plain form
7118 167190 143824 43973 -47152 -76265 -76618 57627 47163 40572 16577 12010 -5133 -25229
7106 -25229 -35782 8160 70303 -38492 -69595 -176017 -108028 71902 9327 5630 46899
7095 46899 67110 -66887 -164106 -29905 113300 111701 179696 118940 -32213 -106248 -9890
7084 -9890 139114 60222 53862 122749 55073 -102568 -73445 -46049 -133584 -185374 -140743 -156113
7072 -156113 -127118 -83848 -125347 -199783 -84298 59304 20242 -179844 -130313 -192497 -189824
7061 -189824 -127471 -198430 -195747 -93629 -30024 -23157 67328 -68923 -163311 -111156 83138
7050 83138 119775 121616 18532 -7664 35941 56241 41811 -30156 -80980 58840 202995
7039 202995 301607 425476 294890 162835 100472 23076 -121901 -261325 -270686 -195295 -34520
$$ packed form
7118A67190k3366r9851r1125k9113l53J34245j0464o591k3995m567j7143k0096
7106b5229j0553M3942O2143j08795l1103j06422O7989J79930o2575l697M1269
7095D6899K0211j33997r7219J34201J43205j599O7995o0756j51153p4035R6358
7084i890J49004p8892o360O8887o7676j57641K9123K7396q7535n1790M4631j5370
7072a56113K8995M3270m1499p4436J15485J43602l9062k00086M9531o2184K673
7061a89824O2353p0959K683J02118O3605O867R0485j36251r4388N2155J94294
7050H3138L6637J841j03084k6196M3605K0300j4430p1967n0824J39820J44155
7039B02995R8612J23869j30586j32055o2363p7396j44977j39424r361P5391J60775
$$ plain form
7028 -34520 -102263 -23995 31810 7743 -41955 -116410 -158753 -213902 -41075 88084 -12731
7017 -12731 -125534 -270556 -295388 -214736 -80110 -56167 -107339 -85643 -41486 -68084 -145011
7006 -145011 -262167 -240531 -94748 3613 18906 50130 78400 -15442 -138319 -134311 -138914
6995 -138914 -46497 -26720 -15602 -75986 -14077 102904 49673 27548 58808 -30559 44521
6984 44521 -59172 -168616 -180600 -91706 -89361 -85205 -112099 94790 134661 9069 -78147
6973 -78147 40488 -29851 -61905 18621 33513 -77175 -148646 -57148 -215856 -281875 -263191
6962 -263191 -198606 -157399 -134044 -25999 -52530 -100180 -93238 -81173 -132263 -138511 30811 2561
6950 2561 -185747 -123166 -125921 -122597 -14471 182222 291021 140177 82602 23896 60102
$$ packed form
7028c4520o7743P8268N5805k4067m9698p4455m2343n5149J72827J29159j00815
7017a2731j12803j45022k4832Q0652J34626K3943n1172K1696M4157k6598p6927
7006a45011j17156K1636J45783R8361J5293L1224K8270r3842j22877M008m603
6995a38914R2417J9777J1118o0384O1909J16981n3231k2125L1260q9367P5080
6984D4521j03693j09444j1984Q8894K345M156k6894K06889L9871j25592q7216
6973g8147J18635p0339l2054Q0526J4892j10688p1471R1498j58708o6019J8684
6962b63191O4585M1207K3355J08045k6531m7650O942J2065n1090o248J69322k8250
6950B561j88308O2581k755L324J08126J96693J08799j50844n7575n8706L6206
$$ plain form
6939 60102 41149 -119494 -103245 56951 120742 28771 -21230 -89245 -131797 -365581 -297355
6928 -297355 -51665 144464 276669 193026 133733 277729 298895 104851 49238 15367 -31695
6917 -31695 -43491 12369 -26296 -207837 -288577 -220030 -125809 -57246 -117043 -92467 -262387
6906 -262387 -243106 -217092 -231344 -251541 -154949 -1492 155732 311103 232027 -115792 -55583
6895 -55583 32702 -19947 -51041 -65427 -156679 -189448 -115543 -37528 -7995 58039 -21542 -142301
6883 -142301 -148073 -167107 -249070 -200995 -80463 -174404 -138572 -98157 -107344 -99739 -114865 -2401
6871 -2401 -25286 -141622 -115018 -19087 -1547 -10462 -44264 -131819 -73328 -19234 -64806 -10940
6859 -10940 -21596 -47110 -130769 -44956 55430 38688 17120 -153307 -343389 -328330 -233540
$$ packed form
6939F0102j8953j60643J6249J60196O3791r1971n0001o8015m2552k33784O8226
6928b97355K45690J96129J32205q3643n9293J43996K1166j94044n5613l3871m7062
6917c1695j1796N5860l8665j81541q0740O8547R4221O8563n9797K4576j69920
6906b62387J9281K6014j4252k0197R6592J53457J57224J55371p9076l47819O0209
6895e5583Q8285n2649l1094j4386r1252l2769P3905P8015K9533O6034p9581j20759
6883a42301n772j9034q1963M8075J20532r3941L5832M0415r187P605j5126J12464
6871b401k2885j16336K6604R5931J7540q915l3802q7555N8491N4094m5572N3866
6859a0940j0656k5514q3659Q5813J00386j6742k1568j70427j90082J5059R4790
$$ plain form
6848 -233540 -186844 -248245 -228448 -149274 -133122 -177421 -250774 -222096 -171243 -154278 -207101 -81792
6836 -81792 -48755 -30307 -52013 -153947 -210269 -180783 -145603 -70606 -125982 -55364 -82328 -144509
6824 -144509 -158046 -122001 -105333 -106751 -35032 -139051 -126527 -131076 -38283 109712 129930 83925
6812 83925 51010 19458 132228 149822 91537 17557 19173 -72194 -147580 -169957 -90482 -38199
6800 -38199 -61904 -155046 -65123 -118938 -157216 -90624 -38589 -3875 -101965 -170218 -143173 -135501
6788 -135501 -234059 -188964 -117830 31897 -16670 -128754 -143485 -79845 -84572 -31379 31503
6777 31503 35599 5939 -78522 -76049 -190252 -333240 -226970 -95065 -72284 -21752 93794
6766 93794 175835 190682 67687 -10446 -136854 -251265 -213141 -91041 3102 72238 33148
$$ packed form
6848b33540M6696o1401J9797P9174J6152m4299p3353K8678N0853J6965n2823J25309
6836h1792L3037J8448k1706j01934n6322K9486L5180P4997n5376P0618k6964o2181
6824a44509j3537L6045J6668j418P1719j04019J2524m549R2793J47995K0218m6005
6812H3925l2915l1552J12770J7594n8285p3980J616r1367p5386k2377P9475N2283
6800c8199k3705r3142Q9923n3815l8278O6592N2035L4714r8090o8253K7045P672
6788a35501r8558M5095P1134J49727m8567j12084j4731O3640m727N3193O2882
6777C1503M096k9660q4461K473j14203j42988J06270J31905K2781N0532J15546
6766I3794Q2041J4847j22995p8133j26408j14411L8124J22100R4143O9136l9090
$$ plain form
6755 33148 -60002 -67651 -48478 -119532 -118732 -184185 -183201 -81425 -80944 -98331 -194387 -99382 -50551
6742 -50551 -123175 -170965 -27526 110628 157064 -25482 -30200 100598 -62082 -63438 63014
6731 63014 112465 56921 109807 98592 99092 150086 282399 115577 -50601 -71789 -6840 109583
6719 109583 90037 37385 -9385 21207 112584 -54157 -153564 -18053 -72979 -89619 -19149
6708 -19149 -25815 -133592 -182415 -239963 -191254 -128683 -217533 -297786 -354106 -366707 -277662 -150903
6696 -150903 55830 97652 47609 31939 -40957 -20071 92339 82270 88135 238186 279906
6685 279906 218605 76064 130490 60878 -77393 -23308 -37099 -60822 -15404 43278 8033
6674 8033 191959 145853 110537 56997 -61103 -285582 -313359 -150871 -122091 -196855 -207979
$$ packed form
6755C3148r3150p649J9173p1054Q00o5453R84J01776M81j7387r6056R5005M8831
6742e0551p2624m7790J43439J38154M6436j82546m718J30798j62680j356J26452
6731F3014M9451n5544N2886j1215N00N0994J32313j66822j66178k1188O4949J16423
6719A09583j9546n2652m6770L0592R1377j66741r9407J35511n4926j6640P0470
6708a9149o666j07777m8823n7548M8709O2571q8850q0253n6320j2601Q9045J26759
6696a50903K06733M1822n0043j5670p2896K0886J12410j0069N865J50051M1720
6685B79906o1301j42541N4426o9612j38271N4085j3791k3723M5418N8682l5245
6674H033J83926m6106l5316n3540j18100k24479k7777J62488K8780p4764j1124
$$ plain form
6663 -207979 -71507 17279 55901 87468 135940 48645 -48421 -139717 -132752 -106504 -216415
6652 -216415 -3857 267019 232410 133533 106085 23645 118793 160702 161602 167488 55931 -17508
6640 -17508 -72503 -180945 -140279 -132328 -191829 -115422 -60479 -199192 -227554 -181712 -164146 -105378
6628 -105378 3808 -21924 -54241 -41120 -111021 -191241 -220556 -157069 -123410 -175021 -135199
6617 -135199 -62986 -1828 155 109402 138189 -48913 -134580 -114133 -84194 -130153 -259644
6606 -259644 -386106 -400684 -319496 -248185 -169897 -129558 -177052 -306368 -266451 -172553 -101385
6595 -101385 -163193 -113236 -87556 -35043 5950 72797 163252 210480 127232 129880 136448 172344
6583 172344 110127 159962 93617 -82008 -218672 -194970 -76274 -137201 -137192 -130392 -45681 -100015
$$ packed form
6663b07979J36472Q8786L8622L1567M8472q7295r7066r1296O965K6248j09911
6652b16415K12558K70876l4609r8877k7448q2440R5148M1909R00N886j11557p3439
6640a7508n4995j08442M0666P951n9501P6407N4943j38713k8362M5842J7566N8768
6628a05378J09186k5732l2317J3121o9901q0220k9315O3487L3659n1611L9822
6617a35199P2213O1158J983J09247K8787j87102q5667K0447K9939m5959j29491
6606b59644j26462j4578Q1188P1311P8288M0339m7494j29316L9917R3898P1168
6595a01385o1808M9957K5680N2513M0993O6847R0455M7228q3248K648O568L5896
6583A72344o2217M9835o6345j75625j36664K3702J18696o0927RO800Q4711n4334
$$ plain form
6571 -100015 -92690 -61652 -51308 -132374 -38103 -112191 -199296 -190493 -71391 -73842 -187664 -162680
6559 -162680 -143304 -145557 -76720 15171 -12277 -108851 -107948 -102552 -49206 16584 -23251 23835
6547 23835 111346 107322 33166 -42341 -5235 72143 88409 40793 4544 -2077 11405 33555
6535 33555 -56055 -59019 -7940 -93382 -53678 1459 78242 138440 94443 -73557 -124822 -130157
6523 -130157 -49263 -27386 201951 177550 89131 20793 26086 66595 20241 -59872 -32189 63562
6511 63562 -12439 -117463 -165030 -145419 -142153 -44658 -132152 -227792 -41825 35220 -26971 47744
6499 47744 154405 189350 217395 127098 44735 24292 -12189 -45694 -122641 -143744 -94973 -70670
6487 -70670 38377 41399 28861 131669 127420 167456 279140 268728 201613 -10730 -165207
$$ packed form
6571a00015P325L1038J0344q1066R4271p4088q7105Q803J19102k451j13822K4984
6559a62680J9376k253O8837R1891k7448r6574R03N396N3346O5790l9835M7086
6547B3835Q7511m024p4156p5507L7106P7378J6266m7616l6249o621J3482K2150
6535C3555q9610k964N1079q5442L9704N5137P6783O0198m3997j68000n1265n335
6523a30157Q0894K1877K29337k4401q8419o8338N293M0509m6354q0113K7683R5751
6511F3562p6001j05024m7567J9611L266R7495q7494r5640J85967P7045o2191P4715
6499D7744J06661L4945K8045r0297q2363k0443l6481l3505p6947k1103M8771K4303
6487g0670J09047L022j2538J02808m249M0036J11684j0412o7115k12343j54477
$$ plain form
6476 -165207 -153088 -260161 -318928 -151506 -113864 -142261 -119762 -121286 -115681 -109789 -119042 -133942
6464 -133942 10450 201543 103439 5946 -47582 48876 158114 56211 -38359 -145428 -65423
6453 -65423 -9210 70775 91501 15872 -38960 1290 -31299 -94983 -138442 -228828 -364876 -484774
6441 -484774 -388867 -331520 -324518 -298715 -387445 -243590 -190378 -101689 -158959 -96252 77924
6430 77924 135884 113607 88069 70 13682 -589 53231 -39216 -79473 106124 55123 97529
6418 97529 116147 71296 52193 80821 128048 20820 -135593 -255020 -244599 -209411 -146209
6407 -146209 9405 76036 20661 8022 124199 -63203 -50898 26139 -61681 -48333 73005
6396 73005 25979 -22590 11863 -80137 -71033 -84581 -163804 -48112 36190 -16914 -47137 75008
$$ packed form
6476a65207J2119j07073n8767J67422L7642k8397K2499j524N605N892r253j4900
6464a33942J44392J91093r8104r7493n3528R6458J09238j01903r4570j07069Q0005
6453f5423N6213P9985K0726p5629n4832M0250l2589o3684m3459r0386j36048j19898
6441d84774R5907N7347P002K5803q8730J43855N3212Q8689n7270O2707J74176
6430G7924N7960k2277k5538q7999J3612j4271N3820r2447m0257J85597n1001M2406
6418I7529J8618m4851j9103K8628M7227j07228j56413j19427J0421L5188O3202
6407a46209J55614O6631n5375j2639J16177j87402J2305P7037q7820J3348J21338
6396G3005m7026m8569L4453r2000R104j3548p9223J15692Q4302n3104l0223J22145
$$ plain form
6384 75008 129242 192690 122158 -11923 5060 29417 53569 -12993 -34952 119352 243800
6373 243800 153925 115284 93714 57926 -77211 -100919 -82753 -155997 -130267 -22753 -40697
6362 -40697 -119176 -118891 -58002 -61655 107869 183877 125405 102122 109665 186776 168578 84046
6350 84046 -90125 -141140 -129749 -75692 13376 11044 16972 94952 40039 2793 -217355 -242726
6338 -242726 -190494 -176138 -71792 66079 34498 -94281 -120537 -90377 21519 57114 -60008
6327 -60008 -131788 -112788 -81753 -9804 -56339 -176916 -279676 -138011 -53595 -88175 -87166
6316 -87166 -143391 -1813 -70588 -77155 -86998 -61804 -14810 38848 33091 -23692 -19307 -20490 52007
6303 52007 -42092 -49769 -817 -113581 -203482 -296914 -290095 -342730 -289909 -316009 -175244 -60324
$$ packed form
6384G5008N4234O3448p0532j34081J6983K4357K4152o6562k1959J54304J24448
6373B43800q9875l8641k1570l5788j35137k3708J8166p3244K5730J07514j7944
6362d0697p8479K85O0889l653J69524P6008n8472k3283P543P7111j8198q4532
6350H4046j74171n1015J1391N4057Q9068k332N928P7980n4913l7246k20148k5371
6338b42726N2232J4356J04346J37871l1581j28779k6256L0160J11896L5595j17122
6327f0008p1780J9000L1035P1949m6535j20577j02760J41665Q4416l4580J009
6316h7166n6225J41578o8775o567r843K5194M6994N3658n757n6783M385j183P2497
6303E2007r4099p677M8952j12764q9901r3432O819n2635N2821k6100J40765J14920
$$ plain form
6291 -60324 -41432 -88906 -115134 -53362 -17632 -73744 -116137 -36476 -5014 -139535 -205166 -94356
6279 -94356 -87186 -90264 -95141 -75698 -25536 20155 82651 61396 33009 82223 -124957 -277171
6267 -277171 -70301 49191 199287 183490 -37107 -16227 75531 19692 -66573 -52696 -110658
6256 -110658 -249549 -285130 -308371 -280870 -180069 -28833 -13753 -67688 -57863 9100 115489
6245 115489 141160 147146 47671 -14048 -6706 -31972 -138190 -49818 90362 13206 86533 91949
6233 91949 158823 194624 203767 171584 133296 136276 59232 143674 131641 115045 78095 43270
6221 43270 59230 -23728 -22463 -65861 -44020 -63091 -83703 -208000 -146896 -149490 -121473 -86166
6209 -86166 -82134 -80105 -92635 -69330 -23497 -16619 34595 184106 226343 139989 138229 84458
$$ packed form
6291f0324J8892m7474k6228O1772L5730n6112m2393P9661L1462j34521o5631J10810
6279i4356P170l078m877J9443N0162M5691O2496k1255k8387M9214k07180j52214
6267b77171K06870J19492J50096j5797k20597K0880R1758n5839q6265J3877n7962
6256a10658j38891l5581k3241K7501J00801J51236J5080n3935R825O6963J06389
6245A15489K5671N986r9475o1719P342k5266j06218Q8372J40180p7156P3327N416
6233I1949O6874L5801R143l2183l8288K980p7044Q4442j2033j6596l6950l4825
6221D3270J5960q2958J265m3398K1841j9071k0612j24297O1104k594K8017L5307
6209h6166M032K029j2530K3305M5833O878N1214J49511M2237q6354j760n3771
$$ plain form
6197 84458 -31538 85346 120579 115674 182486 225946 118994 845 5386 -104057 -33474
6186 -33474 98254 165051 108741 67492 128656 107441 161852 100125 29115 61376 153770 146593
6174 146593 127798 118447 240740 259437 180230 148506 7045 -28223 179555 85855 -49508
6163 -49508 37361 167445 233010 137832 -17370 -168007 -61073 -105104 -184693 -115106 -83084
6152 -83084 -51631 -141981 -129534 -69998 47618 -28876 -176647 -214364 -220639 -9725 -35758
6141 -35758 -106818 -150940 -39928 63842 -2510 -31015 128716 180114 23826 -61292 -35183
6130 -35183 108057 124527 225451 202342 48315 -62054 -40102 -151041 -146000 -161628 -188908
6119 -188908 -195072 -168786 -106268 -213230 -239811 -67261 -45816 -14973 -25538 -54033 9508
$$ packed form
6197H4458j15996J16884L5233m905O6812M3460j06952j18149M541j09443P0583
6186c3474J31728O6797n6310m1249O1164k1215N4411o1727p1010L2261R2394p177
6174A46593j8795r351J22293J8697p9207l1724j41461l5268K07778r3700j35363
6163d9508Q6869J30084O5565r5178j55202j50637J06934m4031p9589O9587L2022
6152h3084L1453r0350J2447N9536J17616p6494j47771l7717o275K10914k6033
6141c5758p1060m4122J11012J03770o6352k8505J59731N1398j56288q5118K6109
6130c5183J43240J6470J00924k3109j54027j10369K1952j10939N041j5628k7280
6119a88908o164K6286O2518j06962k6581J72550K1445L0843j0565k8495O3541
$$ plain form
6108 9508 4739 7252 -60623 -182156 -156953 -108589 -117296 2406 37143 -21616 -24526 -38448
6096 -38448 -81953 -18298 -19495 -182775 -232876 -214117 -185594 -211901 -197916 -83568 -10513 -72658
6084 -72658 44605 230719 174058 137050 168077 51823 58671 122789 104997 -569 48946
6073 48946 163305 253110 145814 112914 -67323 -150073 -196743 -146833 -335282 -292321 -244416
6062 -244416 -200542 -55771 17943 -109576 -39961 -28352 -2824 29746 -20425 45136 120749
6051 120749 66366 -1618 -87694 -98290 22713 -27882 -52720 72137 162284 198794 188884
6040 188884 229878 70895 -173098 -172431 -221234 -261110 -156750 -115976 -62315 102670 11638
6029 11638 5016 17264 -72253 -53632 -85961 -111703 -10090 -20834 -113006 -97574 -31945 -60111
$$ packed form
6108I508m769K513o7875j21533K5203M8364q707J19702L4737n8759k910j3922
6096c8448m3505O3655j197j63280n0101J8759K8523k6307J3985J14348P3055o2145
6084g2658J17263J86114n6661l7008L1027j16254O848O4118j7792j05566M9515
6073D8946J14359Q9805j07296l2900j80237q2750m6670M9910j88449M2961M7905
6062b44416M3874J44771P3714j27519O9615J1609K5528L2570n0171O5561P5613
6051A20749n4383o7984q6076j0596J21003n0595k4838J24857R0147L6510r910
6040A88884M0994j58983k43993O67m8803l9876J04360M0774N3661J64985r1032
6029A1638o622J2248q9517J8621l2329k5742J01613j0744r2172J5432O5629k8166
$$ plain form
6017 -60111 -144384 -53439 -58011 -153239 -167076 -137118 -89056 -95520 -54170 -108280 -153418 -84133
6005 -84133 -20868 52689 3940 -165667 -261645 -274278 -236425 -143470 -144693 -195700 33209 61882
5993 61882 -56265 -136522 -158055 -232273 -305232 -257237 -185879 -244993 -363526 -404297 -441111
5982 -441111 -304694 -185941 -124719 -21933 -65607 92972 155107 -3653 -17660 65024 92786
5971 92786 58436 48666 -23078 -196484 -221884 -196082 -103153 -49103 -173799 -204210 -57640
5960 -57640 -70953 -114042 72311 27341 -6377 -85802 -123940 -85885 -27527 -26116 -146746 -207061
5948 -207061 -158951 -267725 -255874 -136536 -153391 -117785 -32853 -19777 -27327 73329 121040
5937 121040 130419 79787 -72045 -177262 -136148 -42768 -114796 -58571 -40861 135587 164805
$$ packed form
6017f0111q4273R0945m572r5228j3837K9958M8062o464M1350n4110m5138O9285
6005h4133O3265P3557m8749j69607r5978j2633L7853R2955j223n1007K28909K8673
5993F1882j18147q0257k1533p4218p2959M7995P1358n9114j18533m0771l6814
5982d41111J36417J18753O1222J02786m3674J58579O2135j58760j4007Q2684K7762
5971I2786l4350r770p1744j73406k5400K5802R2929N4050j24696l0411J46570
5960e7640j3313m3089J86353m4970l3718p9425l8138L8055N8358J411j20630o0315
5948b07061M8110j08774J1851J19338j6855L5606Q4932J3076p550J00656M7711
5937A21040R379n0632j51832j05217M1114R3380p2028N6225J7710J76448K9218
$$ plain form
5926 164805 165862 98248 92334 98092 54436 65939 95817 5444 81411 57008 -132893 -143041
5914 -143041 -4388 85751 58366 21206 31621 4729 -39931 -132379 -239311 -220747 -243968
5903 -243968 -233911 -291243 -170944 -118209 -153332 -139951 -93488 17356 74741 74602 130615 270501
5891 270501 280955 121109 111684 58088 54747 72468 24370 -18842 78450 40250 -234284 -247097
5879 -247097 -256458 -149999 36726 112085 241730 175380 89760 71507 44057 -14886 -67117
5868 -67117 -123335 -22891 88911 136069 128622 -18843 -29501 81035 166223 176327 222310
5857 222310 137974 25922 3851 -102501 -56907 -146952 -212224 -258508 -174193 -175711 -196975
5846 -196975 -217457 -150149 -43501 -3252 -81931 -173747 -39835 -20404 -61657 -131069 -103605
$$ packed form
5926A64805J057o7614n914N758m3656J1503K9878r0373P5967k4403j89901j0148
5914a43041J38653R0139k7385l7160J0415k6892m4660r2448j06932J8564k3221
5903b43968J0057n7332J20299N2735l5123J3381M6463J10844N7385j39N6013J39886
5891B70501J0454j59846r425n3596l341J7721m8098m3212R7292l8200k74534j2813
5879b47097r361J06459J86725P5359J29645o6350q5620j8253k7450n8943n2231
5868f7117n6218J00444J11802M7158p447j47465j0658J10536Q5188J0104M5983
5857B22310q4336j12052k2071j06352M5594r0045o5272m6284Q4315j518k1264
5846a96975k0482O7308J06648M0249p8679r1816J33912J9431m1253o9412K7464
$$ plain form
5835 -103605 5432 28474 -77692 -151219 -93959 -136753 -114369 -93698 -99867 -25477 -91518
5824 -91518 -36934 -2041 29893 -13254 -130125 -17025 136389 -16225 -95394 -35068 -75206
5813 -75206 -86056 -68973 1554 65903 -46084 20056 -105021 -53218 71352 163461 113880
5802 113880 12295 -32578 -117094 -213295 -242334 -131802 -22146 36628 14485 11873 -59497
5791 -59497 -177569 -90431 -59345 -8413 146474 10039 -163001 -72914 -34053 -153424 -147379
5780 -147379 -107303 -46085 -86731 -173037 -178176 -29004 143784 110429 -113690 -106964 -58417
5769 -58417 -140962 -304651 -206737 -149149 2673 131946 -29289 -172319 -78937 25502 38958
5758 38958 27118 57122 -85138 -123473 -125080 -137663 -210937 -227746 -305338 -261540 -184738 -130410
$$ packed form
5835a03605J09037K3042j06166p3527N7260m2794K2384K0671o169P4390o6041
5824i1518N4584L4893L1934m3147j16871J13100J53414j52614p9169O0326m0138
5813g5206j0850J7083P0527O4349j11987O6140j25077N1803J24570R2109m9581
5802A13880j01585m4873q4516r6201k9039J10532J09656N8774k2143k612p1370
5791e9497j18072Q7138L1086N0932J54887j36435j73040R0087L8861j19371O045
5780a47379M0076O1218m0646q6306n139J49172J72788l3355k24119O726M8547
5769e8417q2545j63689R7914N7588J51822J29273j61235j43030R3382J04439J3456
5758C8958j1840L0004j42260l8335j607j2583p3274j6809p7592M3798P6802N4328
$$ plain form
5746 -130410 -54532 -44438 -67914 -56316 36335 53321 -13239 -18573 69276 -43483 -216757
5735 -216757 -122605 -76876 -125879 -35610 -15387 -109591 -176454 -292710 -319473 -260541 -261066 -140191
5723 -140191 -92066 -150694 -183099 -89423 -107493 -108134 68253 125733 19903 29571 -49895 -249155
5711 -249155 -272251 -271256 -165506 -103649 -88803 -82476 -117199 -165387 -73274 -91220 -190639 -124407
5699 -124407 -114313 -134007 -109794 -85296 5245 65311 90755 95888 107044 199395 45162 -121257
$$ packed form
5746a30410P5878J0094k3476J1598R2651J6986o6560n334Q7849j12759j73274
5735b16757R4152M5729m9003R0269K0223r4204o6863j16256k6763N8932n25J20875
5723a40191M8125n8628l2405R3676j8070o41J76387N7480j05830R668p9466j99260
5711b49155k3096R95J05750O1857J4846O327l4723m8188R2113j7946r9419O6232
5699a24407J0094j9694K4213K4498R0541O0066K5444N133J1156R2351j54233j66419
$$ [...]
##END NTUPLES=NMR SPECTRUM
##END=
