##TITLE=Analysis number 313115
Compound Code cc 41916
Book Reference 437/11
Project Code adrs
Chemist Name wendyb
##JCAMPDX= 6.0         $$ Bruker NMR JCAMP-DX V2.0
##DATA TYPE= NMR SPECTRUM
##DATA CLASS= NTUPLES
##ORIGIN= Bruker BioSpin GmbH
##OWNER= NMR
$$ XWIN-NMR		Version 3.5
$$ Wed Aug 24 14:36:12 2005 GMT Daylight Time (UT+1h)  MAYBRIDGE\NMR@NMR_250MHZ
##.OBSERVE FREQUENCY= 250.131544655141
##.OBSERVE NUCLEUS= ^1H
##.ACQUISITION MODE= SIMULTANEOUS (DQD)
##.ACQUISITION SCHEME= undefined
##.AVERAGES= 16
##.DIGITISER RES= 18
##SPECTROMETER/DATA SYSTEM= dpx250
##.PULSE SEQUENCE= zg30
##.SOLVENT NAME= CDCl3
##.SHIFT REFERENCE= (INTERNAL, CDCl3, 0, 16.522)
##AUDIT TRAIL= $$ (NUMBER, WHEN, WHO, WHERE, WHAT)
$$ ##TITLE= Audit trail, XWIN-NMR		Version 3.5
$$ ##JCAMPDX= 5.01
$$ ##ORIGIN= Bruker BioSpin GmbH
$$ ##OWNER= NMR
$$ C:\u/data/dgb/nmr/ADRS/8550/pdata/1/auditp.txt
$$ ##AUDIT TRAIL=  $$ (NUMBER, WHEN, WHO, WHERE, WHAT)
(   1,<2005-08-24 14:35:56.16 +100>,<MAYBRIDGE\NMR>,<NMR_250MHZ>,
      <created by zg, POWCHK disabled, PULCHK disabled
       configuration hash MD5:
       62 19 C7 07 E1 42 D1 B7 37 6C 3D D0 77 39 F9 E6
       data hash MD5: 64K
       1D 55 06 62 AF 7A 47 B4 55 AF 46 39 F9 A2 D5 C3>)
(   2,<2005-08-24 14:36:04.91 +100>,<MAYBRIDGE\NMR>,<NMR_250MHZ>,
      <Start of raw data processing
       ef LB = 0.3 FT_mod = 6 PKNL = 1 SI = 32K 
       data hash MD5: 32K
       D2 E0 44 B3 28 24 21 5D 8B F3 11 2E B3 DC 86 56>)
(   3,<2005-08-24 14:36:06.74 +100>,<MAYBRIDGE\NMR>,<NMR_250MHZ>,
      <apk 
       data hash MD5: 32K
       A9 A8 89 56 53 B5 77 66 22 43 C9 FB 24 E5 0A C9>)
(   4,<2005-08-24 14:36:07.53 +100>,<MAYBRIDGE\NMR>,<NMR_250MHZ>,
      <abs ABSG = 5 
       data hash MD5: 32K
       16 A0 EC 1C 38 7C 58 29 EB FD 73 2D 89 9A B9 FF>)
$$ ##END=
$$ 
$$ hash MD5
$$ 04 09 EC 06 7C E7 EB 0D FD C8 0C 99 FA 11 B4 E4
##$RELAX= 
##$RELAX= 
##$RELAX= 
##$RELAX= 
##$RELAX= 
##$RELAX= 
##$RELAX= 
$$ Bruker specific parameters
$$ --------------------------
##$DU= <C:\u>
##$EXPNO= 8550
##$NAME= <ADRS>
##$PROCNO= 1
##$TYPE= <nmr>
##$USER= <dgb>
##$AMP= (0..31)
100 100 100 100 100 100 100 100 100 100 100 100 100 100 100 100 100 100 
100 100 100 100 100 100 100 100 100 100 100 100 100 100 
##$AQSEQ= 0
##$AQ_mod= 3
##$AUNM= <au_zg>
##$AUTOPOS= <42 >
##$BF1= 250.13
##$BF2= 250.13
##$BF3= 250.13
##$BF4= 250.13
##$BF5= 500.13
##$BF6= 500.13
##$BF7= 500.13
##$BF8= 500.13
##$BYTORDA= 1
##$CFDGTYP= 0
##$CFRGTYP= 5
##$CHEMSTR= <none>
##$CNST= (0..31)
1 1 145 1 1 1 1 1 1 1 1 1 1 1 1 1 1 1 1 1 1 1 1 1 1 1 1 1 1 1 1 1 
##$CPDPRG= <>
##$CPDPRG1= <>
##$CPDPRG2= <>
##$CPDPRG3= <>
##$CPDPRG4= <mlev>
##$CPDPRG5= <mlev>
##$CPDPRG6= <mlev>
##$CPDPRG7= <mlev>
##$CPDPRG8= <mlev>
##$CPDPRGB= <>
##$CPDPRGT= <>
##$D= (0..31)
0 1 0 0 0 0 0 0 0 0.06 0 0 0 0 0 0 0.0002 0 0 0 0 0 0 0 0 0 0 0 0 0 0 
0 
##$DATE= 1124890555
##$DBL= (0..7)
120 120 120 120 120 120 120 120 
##$DBP= (0..7)
150 150 150 150 150 150 150 150 
##$DBP07= 0
##$DBPNAM0= <>
##$DBPNAM1= <>
$$ [...]
##$SUBNAM7= <"">
##$SUBNAM8= <"">
##$SUBNAM9= <"">
##$SW= 20.6930455092707
##$SWIBOX= (0..15)
0 0 3 0 0 0 0 0 0 0 0 0 0 0 0 0 
##$SW_h= 5175.983436853
##$TD= 65536
##$TD0= 1
##$TE= 295.16
##$TE2= 300
##$TE3= 300
##$TEG= 300
##$TL= (0..7)
0 120 120 120 120 120 120 120 
##$TP= (0..7)
150 150 150 150 150 150 150 150 
##$TP07= 0
##$TPNAME0= <>
##$TPNAME1= <>
##$TPNAME2= <>
##$TPNAME3= <>
##$TPNAME4= <>
##$TPNAME5= <>
##$TPNAME6= <>
##$TPNAME7= <>
##$TPOAL= (0..7)
0.5 0.5 0.5 0.5 0.5 0.5 0.5 0.5 
##$TPOFFS= (0..7)
0 0 0 0 0 0 0 0 
##$TUNHIN= 0
##$TUNHOUT= 0
##$TUNXOUT= 0
##$USERA1= <user>
##$USERA2= <user>
##$USERA3= <user>
##$USERA4= <user>
##$USERA5= <user>
##$V9= 5
##$VALIST= <valist>
##$VCLIST= <CCCCCCCCCCCCCCC>
##$VD= 0
##$VDLIST= <DDDDDDDDDDDDDDD>
##$VPLIST= <PPPPPPPPPPPPPPP>
##$VTLIST= <TTTTTTTTTTTTTTT>
##$WBST= 1024
##$WBSW= 4
##$XGAIN= (0..3)
0 0 0 0 
##$XL= 0
##$YL= 0
##$YMAX_a= 332381
##$YMIN_a= -514791
##$ZGOPTNS= <>
##$ZL1= 120
##$ZL2= 120
##$ZL3= 120
##$ZL4= 120
##$ABSF1= 16.522
##$ABSF2= -4.171173
##$ABSG= 5
##$ABSL= 3
##$ALPHA= 0
##$AQORDER= 0
##$ASSFAC= 0
##$ASSFACI= 0
##$ASSFACX= 0
##$ASSWID= 0
##$AUNMP= <proc_1d>
##$AZFE= 0.1
##$AZFW= 0.1
##$BCFW= 0
##$BC_mod= 0
##$BYTORDP= 0
##$COROFFS= 0
##$CY= 12.5
##$DATMOD= 1
##$DC= 0
##$DFILT= <>
##$DTYPP= 0
##$F1P= 14.0000005364418
##$F2P= -0.99999901652339
##$FCOR= 0.5
##$FTSIZE= 32768
##$FT_mod= 6
##$GAMMA= 0
##$GB= 0
##$INTBC= 1
##$INTSCL= 1
##$ISEN= 128
##$LB= 0.3
##$LEV0= 0
##$LPBIN= 0
##$MAXI= 10000
##$MC2= 0
##$MEAN= 0
##$ME_mod= 0
##$MI= 0
##$NCOEF= 0
##$NC_proc= -5
##$NLEV= 6
##$NOISF1= 0
##$NOISF2= 0
##$NSP= 0
##$NTH_PI= 0
##$NZP= 0
##$OFFSET= 16.522
##$PC= 1
##$PHC0= -80.58009
##$PHC1= 6.725393
##$PH_mod= 1
##$PKNL= yes
##$PPARMOD= 0
##$PSCAL= 4
##$PSIGN= 0
##$REVERSE= no
##$SF= 250.13
##$SI= 32768
##$SIGF1= 0
##$SIGF2= 0
##$SINO= 400
##$SIOLD= 32768
##$SREGLST= <1H.CDCl3>
##$SSB= 0
##$STSI= 32768
##$STSR= 0
##$SW_p= 5175.98343685301
##$SYMM= 0
##$S_DEV= 0
##$TDeff= 65536
##$TDoff= 0
##$TI= <Analysis number 999999
Compound Code 99
Book Reference 9
Project Code 9>
##$TILT= no
##$TM1= 0
##$TM2= 0
##$TOPLEV= 0
##$USERP1= <user>
##$USERP2= <user>
##$USERP3= <user>
##$USERP4= <user>
##$USERP5= <user>
##$WDW= 1
##$XDIM= 32768
##$YMAX_p= 296674961
##$YMIN_p= -216758
$$ End of Bruker specific parameters
$$ ---------------------------------
##NTUPLES= NMR SPECTRUM
##VAR_NAME=  FREQUENCY,     SPECTRUM/REAL,   SPECTRUM/IMAG
##SYMBOL=    X,             R,               I
##VAR_TYPE=  INDEPENDENT,   DEPENDENT,       DEPENDENT
##VAR_FORM=  AFFN,          ASDF,            ASDF
##VAR_DIM=   32768,         32768,           32768
##UNITS=     HZ,            ARBITRARY UNITS, ARBITRARY UNITS
##FACTOR=    0.157963299565203, 1,           1
##FIRST=     4132.6476996994, 0,             0
##LAST=      -1043.33573715361, 0,           0
##MIN=       -1043.33573715361, -216758,     0
##MAX=       4132.6476996994, 296674961,     0
$$ Real data points
##PAGE= N=1
##DATA TABLE= (X++(R..R)), XYDATA
$$ [...]
16638A52628o6518R526L2153k6217j5666Q268j0545K192K3861l700l1294R436
16626H4124j3310m5763k0240j1562L539K4016J02569j2071j6680K7210R654K8133
16614A59619o0877l7030J154K6036O0203Q089M7532O5815l441K3727j1148o1396
16602B18283L9751l5131M4670J3128J3166j5490O2534N8616n8157l6885l5783
16591B68702l6267l3146L821j048k3414k1734K1687j481l3016m2231l9668K0234
16579H2439J3208j6666J2614o726j1406j6363P565L1800n3048j2599K6907k2913
16567C4812l6465M0930M7641K7803k579j7061j03927N822P1182j2958K2595M6923
16555A24718N683P7166N1320j9380o069o4528n9973o2048k4668O0141j229j5374
$$ y = [152628, 86110, 95636, 127789, 101572, 85906, 94174, 83629, 85821, 109682, 105982, 74688, 84124, 70814, 25051, 4811, -6751, -3212, 20804, 123373, 111302, 94622, 121832, 131486, 159619, 98742, 61712, 62866, 88902, 149105, 157194, 204726, 270541, 267100, 290827, 279679, 218283, 258034, 222903, 267573, 280701, 293867, 278377, 340911, 399527, 341370, 304485, 268702, 232435, 199289, 203110, 202062, 178648, 156914, 178601, 177120, 144104, 101873, 62205, 82439, 95647, 78981, 91595, 84869, 73463, 57100, 64665, 96465, 43417, 30818, 57725, 34812, -1653, 39277, 86918, 114721, 112142, 95081, -8846, -3024, 68158, 55200, 77795, 124718, 130401, 207567, 258887, 239507, 233438, 168910, 108937, 46889, 22221, 82362, 81133, 65759]
16543F5759K9743M9443k2764q2498o067j1566K6266N4603K3554k9776J3339k4951
16531H5085o5942j7980m7807J4530K1511K4829n6486l3904N575j0212m567M7066
16519c8302N383J0194K8520L2989n492O906k3304p9153j1898O490L2764M3976
16507I073L1768mj4522J4154N2840J5478J41l4765p5431j7666K757N217M1333
16494C0373q327p2759n0374K2581J7026N2835J979l1352j0967k1654O277R890
16482e4472K200q9404k7605P5617L5757p4232L1878L6019K809L8176n429o2896
16470i1582m4703L8152O1973J3460j1374j8475l5625M142L724k514l2338j9018
16458a34178l906M3012L2925k6992j8994N2683K2624q127L2095r515n5813r640
$$ y = [65759, 95502, 144945, 122181, 39683, 33616, 22050, 48316, 102919, 126473, 96697, 110036, 85085, 19143, 1163, -46644, -32114, -10603, 14226, -42260, -76164, -70589, -80801, -85368, -38302, -32919, -22725, 5795, 38784, 33292, 40198, 16894, -62259, -74157, -67667, -34903, 9073, 40841, 40837, 26315, 40469, 93309, 108787, 108928, 74163, -1268, -18934, -16177, -10960, 30373, 22046, -50713, -101087, -78506, -61480, -8645, -6666, -38018, -48985, -70639, -64362, -54472, -52272, -141676, -169281, -93664, -57907, -132139, -100261, -64242, -61433, -23257, -28686, -91582, -136285, -98133, -36160, -22700, -34074, -52549, -88174, -84032, -80308, -82822, -115160, -134178, -138084, -95072, -62147, -89139, -108133, -55450, -32826, -40953, -8858, -18373, -74186, -83826]
16446h3826K2310M1112K7209p0225M4034K036K0033J7916L4122m6854k4459O1827
16434D5235K2705j01283p2680M759M9621L7645M509p708j9780K2635J8030M2844
16422D6532l8013k8967J929l986Q339o6361m1189K9113R9610k9737l2508l5985
16410i1223K3102N866j7003j8490M5775P7351J0205q5230M0j5311k68J0736p639
16397f2089k3448k9280o1300M0214Q4778N7037O930K7943n9639m6515K2544K4926
16385a7899r36Q850k4484j381n3158k7442O2074M8193J7767k0119p7364r874M3012
16372e2761J3052K1793k1403J8121k1312k5790l6509J746K6780K138O466J2160
16360e5519N743L1241l8339l7003j8058P139L7108M4203O887k2934k1190k0304
$$ y = [-83826, -61516, -20404, 6805, -63420, -19386, -17350, 2683, 20599, 54721, 7867, -16592, 45235, 67940, -33343, -106023, -101264, -51643, -13998, -9489, -17197, -36977, -14342, 3688, 46532, 8519, -20448, -18519, -22505, -14166, -80527, -121716, -92603, 7007, -22730, -55238, -91223, -68121, -62255, -79258, -97748, -51973, 25378, 35583, -49647, -49607, -64918, -65186, -54450, -62089, -85537, -114817, -176117, -135903, -51125, 5912, 12842, 40785, -18854, -65369, -42825, -17899, -18835, -9985, -34469, -35850, -89008, -116450, -54376, -6183, 11584, -8535, -85899, -95773, -52761, -39709, -17916, -39319, -21198, -42510, -68300, -104809, -103063, -76283, -74145, -67679, -55519, -49776, -18535, -56874, -93877, -111935, -104796, -67688, -23485, -16598, -39532, -60722, -81026]
16348h1026m038L1897J6696k347n437J0839j7183l7639n8196K0192K6339J714
16336i8189J8050K5047J9971N090j4030j1635K4102p4380q568J1370l6084L2949
16324a06307O459j0261l684M1995K2430N8508J9279o2711k0406L5931k504k8728
16312d9999N069K9629k3358k7778p856l1159o206O24p764O2932K594N75P821r825
16298e4701J745J4619p421k8063N494j8573K6051M7543R425j2183k4211N0669
16286A0394K7661L7601l5817j3100o98J3767Q872J7664J1173l0887l2711k5820
16274a1901k0453k5962r399q002n432J9989K8994k7752l0794N3943K0489m8480
16262f4760m7021l970L8290l240m0246l874M1566J6773M2285N5708j5914m4212
$$ y = [-81026, -85064, -53167, -36471, -38818, -44255, -33416, -50599, -88238, -146434, -126242, -99903, -98189, -80139, -55092, -35121, -30031, -44061, -55696, -31594, -105974, -114542, -103172, -139256, -106307, -99848, -110109, -113793, -71798, -49368, 9140, 28419, -34292, -54698, -18767, -21271, -49999, -44930, -15301, -38659, -66437, -74293, -105452, -111658, -111034, -118798, -55866, -53272, -52697, -44876, -54701, -52956, -38337, -45758, -73821, -68327, -86900, -60849, -13306, -3881, -16064, -40275, 10394, 38055, 75656, 39839, 26739, 26041, 39808, 48680, 66344, 77517, 46630, 13919, -11901, -32354, -58316, -67715, -75717, -81149, -61160, -32166, -59918, -90712, -36769, -16280, -64760, -111781, -115751, -77461, -80701, -120947, -124821, -83255, -66482, -24197, 31511, 15597, -28615]
16250b8615m6849O030l499J4215J0198N35j8839k1354j7258P007K6666L5283K2601
16237a3879n4217m2186O5035J2031k5769j5319L9227M7478N952m7474L677M1754
16225A6310J81Q018K1624L2890m1712k9950m8808R832K5846j6247j9m6999m2257
16212a11291l622L759Q6294J9306n2956k4721J5613O2184J869l4667m5496L9390
16200d4338J6057K6779k2024O84J3917k626L1354j4075o0232l6234J7973R482
16188f3283n692o29L0533J4433j9748k5497N1736L9369J6044L7596j3261l4567
16176B7034P102R00k185l0522n2086o072J0339P450j2278o499K2034N62P109j7786
16162d4898k5362lK0243L7544n136k6809l9350j1923m3722J4401N6091N7448K1898
$$ y = [-28615, -75464, -69434, -72933, -58718, -48520, -47985, -66824, -88178, -105436, -98429, -71763, -36480, -13879, -68096, -110282, -45247, -33216, -58985, -74304, -35077, 12401, 18353, -29121, -25444, 16310, 16491, 24509, 46133, 79023, 37311, 7361, -41447, -31615, -5769, -22016, -22035, -69034, -111291, -114913, -111154, -24860, -5554, -58510, -83231, -67618, -5434, -3565, -38232, -83728, -44338, -28281, -1502, -23526, -22842, -8925, -11551, 19803, 5728, -54504, -90738, -72765, -63283, -68975, -69604, -39071, -24638, -44386, -69883, -18147, 21222, 37266, 74862, 61601, 27034, 34136, 35036, 32851, 2329, -49757, -55829, -45490, -38040, -50318, -56817, -34783, -34221, -27112, -44898, -70260, -70263, -50020, -12476, -17612, -44421, -83771, -95694, -139416, -125015, -68924, -11476, 10422]
16149A0422l3102j9599K8051K4105j4770k0530k0885k9741K0562K3209L9278j6577
16137i577j7392J2320j1678r033N3171l3677p3410P244N3040M4403P653k5466
16125b402r890n824k796k2509m7755j4080K3390K7345P292m8344o729N663J3147
16112h3492O1844j9428m9599q128j2945L7254J7553j872n691M0394j5026M033
16100c5103j2046l4007K9060K6021m0502m1161K486J5460O803K2006P135K0876
16088c2972q090O660r848o629O0781k4485l7681k8659P5626K0724n8914l5930
16076g9417J082L6648J2945J5688J9885l530j6282O4799k203j9344M0777p0277
16064G71n7425q452P4058N8365o3731l9464p641m3078j2748J179m314l4238J9302
$$ y = [10422, -22680, -42279, -14228, 9877, -4893, -25423, -46308, -76049, -55487, -32278, 7000, -9577, -26969, -14649, -26327, -35360, 17811, -15866, -89276, -82032, -28992, 15411, 23064, -2402, -12292, -18116, -20912, -43421, -91176, -105256, -81866, -54521, -47229, -95573, -102302, -96639, -83492, -21648, -41076, -90675, -98803, -111748, -74494, -56941, -58813, -64504, -24110, -39136, -35103, -47149, -81156, -52096, -26075, -66577, -107738, -105252, -89792, -82989, -60983, -53848, -32972, -41062, -34402, -44250, -50879, 9902, -14583, -52264, -80923, -5297, 15427, -43487, -79417, -78335, -41687, -28742, -13054, 6831, 3301, -12981, 51818, 49615, 30271, 71048, 771, -56654, -65106, 8952, 67317, 3586, -35878, -43519, -86597, -99345, -98166, -102480, -136718, -117416]
16051a17416K1123P0506K0060N4p533o7625k6643j3420k1994M1175P7397J0765
16039a3551l2357o4150J4227L6493K4026K7088K7448K2804k4583n674n015r34
16027E822l0743K5078O7069K7495n1248p2495r06J6777K6863N672k6730J1925
16015D579J3783R72k4512p7185L5560m678o5459N2393j4575Q726O1239K0696J4152
16002B5691J8929j5465j9366M3830P3368Q537o4249o2063M7016L1173o168l3831
15990D7402L8809O1366M737m4774l0062L7706K2557L4920m7810l4254O010R086
15978A05693M8089L860l6852n7191K9866P9425P719j9121j4611j790N466O040
15966A56593k3768q8521J3417L4901L4678m606P181K3447m8369n109J8956k9289
$$ y = [-117416, -96293, -25787, -5727, -5673, -13206, -80831, -107474, -120894, -142888, -101713, -24316, -13551, -45908, -110058, -95831, -59338, -35312, -8224, 19224, 42028, 17445, 11771, 6756, 5822, -24921, 157, 67226, 94721, 43473, -29022, -29928, -13151, 13712, 19384, -7346, 4579, 18362, 19334, -5178, -82363, -46803, -51481, -116940, -64547, -79122, -70396, -9157, 11539, 25691, 44620, 29155, 9789, 53619, 126987, 135524, 71275, 9212, 56228, 87401, 81233, 47402, 86211, 147577, 152314, 107540, 77478, 115184, 137741, 172661, 124851, 90597, 96607, 105693, 153782, 157642, 120790, 63599, 93465, 172890, 180609, 161488, 146877, 145087, 150553, 156593, 132825, 44304, 57721, 92622, 127300, 122694, 129875, 153322, 104953, 99844, 118800, 89511]
15954H9511j8909J6800R114L3549K7949k071o522n6535N868l142R675K9199m515
15941A29971k5821L2605J3233o2385k8994J2036M5733N0421R73p950L657m0783
15929A22696k9662j4923N661j8408M2286L3391o223j4377K9321r9674n8914K1962
15917A3136J3119q788M0468l618l424M3970L2921K1470m322K8012j7280k6197
15905A29467k9871o4197j2305P4690N3011o585m9767k6281J7331M8424l4516o0630
15893C8771l2751P153K3709o0808O136M4388l321L3262N464k2755n5532l960K1192
15880I48J1220J7319k2869k5469K2972P043J4245l470k3078J4499K5712k3034
15868A6038o1037m1999M6225K9096J2103K7189j964L782Q466n64n306n4354J1328
$$ y = [89511, 70602, 87402, 96516, 130065, 158014, 155943, 149421, 92886, 98754, 95612, 105287, 134486, 129971, 104150, 136755, 149988, 87603, 58609, 70645, 116378, 166799, 167772, 159822, 163479, 122696, 93034, 78111, 83772, 65364, 107650, 141041, 134818, 120441, 149762, 50088, -8826, 13136, 26255, 17467, 57935, 54317, 50893, 94863, 127784, 149254, 144932, 172944, 155664, 129467, 99596, 35399, 23094, 97784, 150795, 144210, 94443, 68162, 85493, 133917, 99401, 38771, 6020, 13173, 36882, -23926, -17790, 26598, 23277, 56539, 62003, 39248, -16284, -20244, 948, 12168, 29487, 6618, -18851, 4121, 11164, 25409, 21939, -1139, 13360, 39072, 16038, -44999, -86998, -40773, -11677, 426, 27615, 25651, 29433, 37899, 37335, 32029, -22325, -10997]
15855a0997l7569m2300M9127L9836J2955l4145P92K4719J3463J988J5797r446
15843B4220l084k1483J528l6957o4328K5590Q2392M8061N4860l2087p5449L5364
15831C8627j4021n8834j835J3474J7843k1473k4137p76K9616K2193l9182K0846
15819a7659j6421k7757l7085l1141L3795J2515K9026K7695J5892k2786Q006J9046
15807f874K9695p4586k0021j6398N9283Q9965j5257J5611J1520J2294l5665L9386
15795H8953o0229l7361J6320j0692J5269R6595M6588n5481o2326n198J7220K79
15783D9937J2506J0324P066q363K130k0227J2644K7158Q380K8142K6738K9827
15771A86262j7717m5605j786M890K7774J6392K7794j01l8557q5416P639N9351
$$ y = [-10997, -48566, -90866, -41739, -1903, 11052, -23093, -22301, 2418, 15881, 17869, 33666, 24220, 21136, -347, 1181, -35776, -100104, -74514, 7878, 55939, 110799, 78712, 3263, 38627, 24606, -34228, -36063, -22589, -4746, -26219, -50356, -51132, -21516, 677, -38505, -17659, -34080, -61837, -98922, -130063, -96268, -83753, -54727, -27032, -11140, -33926, -25920, -6874, 22821, -51765, -71786, -88184, -28901, 61064, 45807, 61418, 72938, 85232, 49567, 88953, 28724, -8637, 7683, -3009, 12260, 108855, 155443, 99962, 37636, 32438, 49658, 49937, 62443, 72767, 79833, 71470, 73600, 53373, 66017, 93175, 101555, 129697, 156435, 186262, 168545, 122940, 121154, 126044, 153818, 170210, 198004, 197903, 159346, 73930, 81569, 140920]
15759A40920k529J6076p732l0618l5530l5191j4184L4349J7165N0228l6209m3469
15747E3276j5848J3681J2529J7453M333r784l0028K7910J5247j0556l2699K3809
15735F9323N005j6741k4223l6406J2584M9572k2377j5652O923q924k4279L5611
15723C0416o930n585k7760M0204R3005L7634n1768l5924l5297l6533m3961J8661
15711b3838M4295J6703K1275l1083J695k8009l0684m904J0191M8722L5555K338
15699F2256l4046q72Q588j7105o1587n6058Q3125N1396j5315J8403k9462L6586
15687D5909O799m1560L9503J02587k166j4821N9498M0921k876n6508k474k667
15675A72145M445j2387j9495p123J3530m1997j5201k139L1744r616K8941K0154
$$ y = [140920, 138391, 154467, 146735, 116117, 80587, 45396, 31212, 65561, 82726, 132954, 96745, 53276, 37428, 51109, 63638, 81091, 85424, 75640, 45612, 73522, 88769, 78213, 45514, 69323, 74328, 57587, 33364, -3042, 9542, 59114, 36737, 21085, 28008, 19084, -5195, 30416, 23486, 17901, -9859, 30345, 123350, 160984, 109216, 73292, 37995, 1462, -42499, -23838, 20457, 37160, 58435, 27352, 29047, 1038, -29646, -34550, -24359, 24363, 59918, 62256, 28210, 27338, 35926, 18821, -42766, -98824, -15699, 35697, 20382, 38785, 9323, 45909, 52708, 11148, 50651, 153238, 151072, 136251, 195749, 236670, 233794, 177286, 174812, 172145, 176590, 164203, 144708, 137585, 151115, 109118, 93917, 91778, 123522, 113906, 142847, 163001]
15663A63001m7348l1033l6764m2952M1417N5233J1362J6298j3479l6695j720J4596
15651I1916N1961k824k2755j8386l1028j1537R0m775o9436k078P3965J2515m095
15638F3533L4016k4385K3189n6248J1163l9939m2898k6981M1815r80k6785M6575
15626B075L8650q891j641j8375m8401m2159J1187M067M7419l7347j383K2418n482
15613c7863k6764O405L2333J6333n262j9522K2981j5196k1352l1175L3822L415
15601d1845j9571j3464j1341N0782J6421l6431o3312l0531M3563J9251K8228J1901
15589d6349m485m187O905l3653J8356j3000m241O649K1950L0263q793k582n468
15576c8635o27O5174k1701L1903L1476k7978n8811k284M3130l1934j0705M893
$$ y = [163001, 115653, 84620, 47856, 4904, 46321, 101554, 112916, 129214, 115735, 79040, 77320, 91916, 143877, 141053, 118298, 99912, 68884, 57347, 57437, 52662, -16774, -18852, 55113, 67628, 63533, 97549, 73164, 96353, 40105, 51268, 11329, -31569, -58550, -16735, -17715, -44500, 2075, 40725, 31834, 30193, 11818, -36583, -78742, -67555, -63488, -16069, -53416, -54799, -32381, -37863, -64627, -58222, -25889, -9556, -14818, -34340, -11359, -26555, -47907, -79082, -45260, -41845, -61416, -74880, -86221, -35439, -19018, -55449, -118761, -149292, -105729, -86478, -58250, -46349, -50834, -55021, -48116, -81769, -63413, -76413, -80654, -74005, -52055, -21792, -30585, -33167, -38635, -39262, 25912, 4211, 36114, 67590, 39612, -19199, -21483, 21647, -10287, -20992, -16099]
15564a6099m6531p1892P985L8717k0628l5944M9660K8042k2206L7385M6315j9510
15552b4706k4266L7229q52m0422J5692L612l0806N3007M6062k0374m743k3818
15540a4385j9275O4083M5318l9118k8878m941O953l698R46J2884k1643j2988l1831
15527d6573l673L815p634P1956J4699J9179k8068m9391K2774N6803Q343p0975
15515h745R01J3511Q932r272m4648o2756L9053L1235m6728J6557l1159j0332K6587
15502g6864J8528q840M36L9978O3172J6883l0652n9905r420l0495K6604L6046
15490a4529L7437j2933M81M706k835j3194J4309m861l1074O308P5951J7471o4409
15477A2828j4038o345m787n275K0224j3821j2757O3003k5270k6716j5861k0461
$$ y = [-16099, -62630, -134522, -126537, -87820, -108448, -144392, -94732, -66690, -88896, -51511, -5196, -24706, -48972, -11743, -12595, -53017, -37325, -33713, -64519, -11512, 34550, 14176, 9433, -14385, -33660, 30423, 75741, 36623, 7745, 2804, 9757, 6059, 7005, 19889, -1754, -14742, -46573, -50246, -46431, -54065, 17891, 32590, 51769, 23701, -25690, -2916, 53887, 62230, -8745, -7844, 5667, 14599, 5327, -39321, -102077, -63024, -31789, -78517, -61960, -93119, -103451, -76864, -58336, -67176, -66740, -26762, 36410, 53293, 22641, -37264, -46684, -77179, -50575, -14529, 22908, 9975, 10456, 15162, 12327, -867, 13442, 8581, -22493, -16185, 59766, 77237, 12828, -1210, -7555, -12342, -17617, 2607, -11214, -23971, 39032, 13762, -12954, -28815, -49276]
15465d9276R100K7608p971j4274n0398q911K507M261L275O886L2275M4264K4332
15452B3678J6468j7877p3049Q901L0230J3523L8700K3729k2537j3237m7547j9835
15440c8853j5882j0443J5827J3561N209M0552n7192m0234k0450M0368O6179K8777
15428B7419l1480l2637o4873j534P1776J5386K8918m4001Q006K7327L961K1552
15416B9820j2541L2450j5114j6186l5563j6303O6822L501j9995l575N8749J9692
15404I1757j8245p568j3552j7647l0261j8653n0616k0573m3368K4491J5140K1499
15392f7596J65k7509P754M5309K8405J4427J1801l9958j8237L526j7610J8344
15380d1179P837j1262j1966P863L2681M0575J2583p5254m9191L4357Q898j4907
$$ y = [-49276, -40176, -12568, -20539, -34813, -85211, -94122, -91615, -87354, -84079, -77193, -44918, -654, 23678, 40146, 22269, -50780, -41879, -11649, 1874, 40574, 64303, 41766, 28529, -19018, -38853, -54735, -65178, -49351, -35790, -30581, 9971, -47221, -87455, -107905, -67537, -1358, 27419, -4061, -36698, -101571, -103105, -31329, -15943, 12975, -31026, -23020, 4307, 8268, 29820, 17279, 49729, 34615, 18429, -17134, -33437, 33385, 36886, 16891, 13316, 72065, 91757, 73512, 65944, 52392, 34745, 4484, -14169, -64785, -85358, -128726, -104235, -89095, -67596, -67431, -94940, -87186, -41877, -13472, 955, 12756, -27202, -45439, -41913, -59523, -41179, -33342, -44604, -56570, -48707, -16026, 24549, 37132, -38122, -87313, -52956, -44058, -58965]
15368e8965J2785j3102k7963K9908j4138M0958k5793k4732K5787K0662K8215l748
15356a0126J2174J5237k993R428k312l1612k091n4577L4295M8076p77m7297m8754
15343h1329K9563L0990R602j5434R614J5320j616K9159J6362o8823p244n140K8328
15330a0648m8294L7916L2024m9727l2429l564M7019l4932m7262K3234J0314r811
15318h6160L2205M4056J3673j1451K1816q468k1542l3180k4969k2495L1495J3634
15306e1386M8759l6515j5915N6461l68k267k3092K6124L003p701K0310l7332n9171
15293g9090L8320m502l4224L1199L1594J4727J7128m52k9343O338O3718l1761
15281B3652j6634n372K1017j3545l979j6846K4598O063k6847k3634K3930j3232
$$ y = [-58965, -46180, -59282, -87245, -57337, -71475, -30517, -56310, -81042, -55255, -34593, -6378, -10126, 2048, 17285, 14292, 23720, 21408, -10204, -12295, -66872, -32577, 15499, 14722, -32575, -81329, -51766, -20776, -11174, -26608, -16994, -1674, -3290, 25869, 42231, -26592, -33836, -38976, -10648, -58942, -21026, 10998, -38729, -71158, -74722, -27703, -62635, -109897, -86663, -76349, -86160, -53955, -9899, 3774, -7677, 14139, 5671, -15871, -49051, -74020, -96515, -65020, -51386, -2627, -39142, -55057, 1404, 1036, -1231, -24323, 1801, 4804, -2897, 17413, -19919, -79090, -40770, -45272, -79496, -48297, -16703, -1976, 15152, 14700, -14643, -8305, 55413, 23652, 7018, 1646, 22663, 9118, 5139, -11707, 12891, 18954, -7893, -31527, -7597, -20829]
15269b0829K7745l6824q875n156M439l1022k6575J3950M868N75M151K2469L5980
15256a5104J7993J979j7896m2593m77N5601J5551j6295o234N88j233K3991K5668
15243D1539J3672j521j3014m9072j8806M384j1128j1197k7948j2780K2018o447
15231g0300k3245j5246j3028K3869K2260j877j0989r72K7130K7621K3080l4604
15219d6301n4538O922L1668Q123j2205j0191N0780M1197l7475j3797J2944k1090
15207d3963k3851J9206L0911N7004K2060N98m4148j5430k6595m7316k261K8940
15195d4845j6476r178M5429k4895n3161J0167J3982J7421M0432L7427K3026r06
15183C8423m7201n5243n734K3135K3248J6875J4102k345P3k6806l7525m933l8334
$$ y = [-20829, 6916, -29908, -38783, -43939, -39500, -70522, -97097, -83147, -78279, -77704, -73553, -51084, -15104, 2889, 4868, -13028, -55621, -56098, -497, 15054, -1241, -7475, -6887, -8120, 15871, 41539, 55211, 53690, 40676, -8396, -27202, -22818, -33946, -45143, -73091, -85871, -63853, -70300, -93545, -108791, -121819, -97950, -75690, -77567, -88556, -89528, -62398, -34777, -11697, -46301, -100839, -93917, -62249, -54126, -66331, -76522, -25742, 15455, -22020, -35817, -22873, -43963, -67814, -48608, -17697, 39307, 61367, 61965, 17817, 2387, -24208, -71524, -73785, -44845, -61321, -70499, -25070, -49965, -103126, -92959, -78977, -61556, -21124, 16303, 39329, 38423, -8778, -64021, -69755, -46620, -23372, -6497, 7605, 5260, 5333, -21473, -58998, -63931, -102265]
15170a02265m2882M3854K0164P860M0013m190k9397j7051L0696K7878k949k8454
15158e6723J2758O866M4413M1837N980L1000j5936l6419k0334l0543L5003L4518
15146E2420J6598K3787o573o6841m0503o136L1884M046J0713k3718j0346K2389
15134G720K932k9267k5023l94J3022M6882j9789L617j2074K3260M015M137O009
15121B5047j380J8064K3374L7129k5421p0387k2338K9027J0158N1838j8159k0652
15109C6300k0170J7054J0868J002p785j6368l3925n7268L569k9621J2025Q0222
15097d097O048K6149J6030k4613o1798k5638k0807K6881l6123j9226O4208J9140
15085c3846J5402k8053k5650J3341k1981O2914M1583m0374n5234l4257K9394P1031
$$ y = [-102265, -145147, -101293, -81129, -73269, -33256, -37446, -66843, -83894, -53198, -25320, -28269, -56723, -43965, -37099, 7314, 49151, 55131, 86131, 70195, 33776, 13442, -17101, 17902, 52420, 69018, 92805, 86232, 19391, -21112, -27248, 4636, 8682, 19395, -4323, -14669, 7720, 10652, -18615, -43638, -44032, -31010, 15872, -3917, -300, -12374, 10886, 14901, 19038, 25047, 23667, 41731, 65105, 102234, 76813, 6426, -15912, 13115, 23273, 75111, 56952, 36300, 16130, 33184, 44052, 45054, 37269, 20901, -13024, -70292, -66723, -96344, -84319, -4097, 1951, 28100, 44130, 19517, -42281, -67919, -88726, -61845, -97968, -117194, -52986, -33846, -18444, -46497, -72147, -58806, -80787, -17873, 23710, -16664, -71898, -106155, -76761, -5730]
15073e730N2670K8737l5743m1909k3132m1370l4782K3377o11j1634p493K7302
15061g0318l9380j5896J0815J1702M080j0005J9131M5633O0466M040K4208m8988
15049d512J99P810k2164L8291k954j3551N3107O967k3873K4845j4660q9975l0633
15036g1103L0193j7527k3637L1486o483J4287K9852M2112L921p603K586J4691
15024D2775j8376K9185n0755n7795M140N5040K848n6606k1134L7573P9142k6858
15012A9179m1443M360M093J6365M2520K6413J1671N313P83k968O572M8473l5425
14999A05906p8230m7439k3781P2752J5131j9048O1180K4838o545o2442r52l0748
14987A0622o6022K0215J5589N3660p389o6198J4886J6255j5482L507J7444K1441
$$ y = [-5730, 46940, 75677, 39934, -1975, -25107, -66477, -101259, -77882, -78493, -90127, -97620, -70318, -109698, -125594, -114779, -103077, -98997, -109002, -89871, -44238, 16228, 20268, 44476, -4512, -4313, 3497, -18667, 19624, 16670, 3119, 56226, 63193, 39320, 64165, 49505, -40470, -71103, -40910, -58437, -82074, -50588, -57071, -42784, -12932, 29180, 33101, 25498, 28084, 42775, 24399, 53584, 2829, -54966, -50826, 4214, 7062, -49544, -70678, -33105, 46037, 19179, -22264, -17904, -13811, 2554, 45074, 71487, 83158, 88471, 89254, 86286, 92858, 141331, 105906, 27676, -19763, -43544, 29208, 44339, 25291, 86471, 111309, 104764, 42322, 41370, 10622, -55400, -35185, -19596, 34064, 26675, -39523, -24637, -8382, -23864, -20357, -2913, 18528]
14975A8528l4676n321k161l5461Q867M4183J298J9142K6027j3559J4442j1021
14963C0288l9880n6146l245K5321K4660N9187j4962o9757j5242o991K1740N189
14951c9838R776K4473r564L3581l958j8363r628M3727O435m9109L9973J2120n7382
14938a7757l4304o230K1137K8778l8824j0161J2501J2803J5939P148J6422j3361
14926e909k6913p334J8074k4421l3728N574l051k540k2665P7935O5388J8367m8898
14913I879k5593O709k8624J342P613P3573P5529m3895p4237O841K3897p5579J9806
14900b2739L3146p578k6774j8518n137J4194k468q1m974J5065M2062k137p194
14887F867M5249K7079r008o8967m4011j232j4715Q177k323L1723j1411l0610J0573
$$ y = [18528, -16148, -21469, -23630, -59091, -50224, -6041, -4743, 14399, 40426, 26867, 41309, 30288, -9592, -65738, -68983, -43662, -19002, 40185, 25223, -44534, -59776, -66767, -45027, -39838, -30062, -5589, -15153, 18428, 14470, -3893, -13521, 30206, 36641, -12468, 27505, 39625, -17757, -52061, -58291, -37154, -8376, -47200, -57361, -44860, -32057, -16118, -8970, 7452, -5909, -32822, -40156, -22082, -46503, -80231, -74657, -77708, -80248, -102913, -24978, 40410, 58777, 9879, -15714, -9005, -37629, -36287, -28674, 44899, 120428, 76533, 2296, 9137, 33034, -42545, -22739, 10407, 2829, -23945, -42463, -47600, -33406, -35874, -35955, -40929, -25864, 16198, 14061, 6867, 52116, 79195, 70187, 1220, -42791, -44023, -58738, -50561, -52884, -21161, -32572, -63182, -52609]
14874e2609K204J7550L2724J5089k0601m3964o520K7510J0947M6551L5426n2565
14862A1742m244K8408J144k1643m1034o0006K6124K5758L6567M306l1082n986
14850b9946k8405r941K9212J6487K634j4359l41r713m1594K8779Q818O590K3845
14837a7934J4252r377k5706k7053K5337M1715R6377l209r9598o5396k9300K1568
14825g8324N9415J2766M0895J8700M23L5608k4757o9967j6555J2215k7785m6800
14813h4166m7837L5466M9881L1596M0032P166j7072L771j1184Q838K456j7459
14801A488l2810K0484O137o4418k5165K3758P3463M6509J0700j7407n6259n5776
14789f9296K515k7567N1537K3264K4262o395K0953L0957N3283j3665O825l307
$$ y = [-52609, -50405, -32855, -131, 14958, -5643, -49607, -56127, -28617, -17670, 28881, 64307, 11742, 7498, 35906, 37050, 15407, -25627, -85633, -59509, -33751, 2816, 7122, -23960, -29946, -58351, -68292, -39080, -22593, -19959, -34318, -34659, -44372, -85966, -57187, -48369, -41779, -17934, -3682, -13059, -38765, -65818, -40481, 1234, 97611, 94402, -5196, -70592, -99892, -78324, -18909, -6143, 34752, 53452, 53875, 89483, 64726, -5241, -21796, -9581, -37366, -84166, -132003, -96537, -46656, -15060, 24972, 32138, 15066, 18837, 7653, 16491, 18947, 1488, -31322, -10838, -4701, -69119, -94284, -70526, 2937, 49446, 60146, 42739, -13520, -69296, -66781, -94348, -42811, -19547, 4715, -1680, 19273, 50230, 103513, 89848, 96673, 93366]
14777I3366p786K0814N200Q907l8769l7026l5290M6084N8678P283l1448o1144
14765B8869l1740n1194n495L4501P338R587R321j8271L4220j214N2340K0392o8039
14752B0615j3459L5955k5628r535k1292O5739J5867j7157M5624l9804p2586N235
14740a0426k1143L7688k6962m9388K0597Q9070M8691N153l6740l4674k4372K1458
14728A8952j2704O33K5320J7228l9605n4100K897K0913j0264k1265J28j1050m4777
14715a07694j660R029N2213N64L6777M0669k3140J0665J3150K181J5394J09P614
14702E5871l2127m2319q329l164K3750K8673N524j2838k1683K3261N656n2277
14690c0002l4264K6027l4483K4664K2862j0203k1495O9702J2444n602m7458n0198
$$ y = [93366, 85580, 106394, 111594, 120501, 81732, 44706, 9416, 55500, 114178, 121461, 90013, 28869, -2871, -54065, -59560, -25059, -17721, -8134, 1187, -17084, 17136, 15922, 68262, 88654, 20615, 7156, 43111, 17483, 7948, -13344, 52395, 68262, 51105, 96729, 56925, -15661, -10426, -31569, 6119, -20843, -70231, -49634, 39436, 88127, 93280, 56540, 21866, -2506, 18952, 6248, 6881, 32201, 49429, 9824, -44276, -41379, -20466, -30730, -51995, -51867, -62917, -107694, -109354, -100325, -48112, -47548, -10771, 29898, 6758, 17423, 30573, 32754, 48148, 48257, 55871, 23744, -18575, -26904, -30068, -6318, 22355, 27879, 15041, -6642, 16619, 22275, -30002, -64266, -38239, -72722, -48058, -25196, -35399, -56894, 12808, 25252, 19650, -27808, -78006]
14678g8006n0549l9111M2766N8284L0164L6664L2195J6412k5409l8981m0226j7875
14666g3672J8342k2343K3385j7410p333L4383N2945J941l3236j4501L0778J5239
14654H518L6675L8367J8520n3399J28j405j1154m2847K2132M2614k3404m4587
14642i842j526r334l2970J2871L059Q102J528j7823K5952J3824L546J4639M8520
14629F0546J3868J9356k4989M1248j6502K3438K5647n2087l473q049r534M393
14617G3862R633n8783m2377o8125k261L3195O5082k6235l3439K0126n4558l2527
14605a16407R7529R453k9058n4522J0874Q0992K2201m6621l5012L3294q283N2816
14593A7256K6095L4385k5219k4077k6080K4254o700J3189L2471k6957o1107k7291
$$ y = [-78006, -128555, -167666, -124900, -66616, -36452, 212, 32407, 48819, 23410, -15571, -55797, -73672, -55330, -77673, -54288, -71698, -79031, -44648, 8297, 10238, -22998, -37499, -6721, 8518, 45193, 83560, 102080, 48681, 48809, 47404, 36250, -6597, 15535, 58149, 34745, -9842, -11368, -20702, -53672, -40801, -37742, -29640, -28112, -45935, -19983, -6159, -2613, 12026, 60546, 74414, 93770, 68781, 110029, 93527, 116965, 142612, 90525, 87052, 79003, 69469, 73862, 83495, 24712, -17665, -85790, -88051, -54856, 10226, -16009, -49448, -29322, -83880, -116407, -18878, -9425, -38483, -93005, -82131, -1139, 21062, -25559, -60571, -27277, -35560, 17256, 43351, 77736, 52517, 28440, 2360, 26614, 19914, 33103, 65574, 38617, -22490, -49781]
14581d9781L8683K7136j2519J5457J6334j2477M578K4922o4675o3405r726L0336
14569e5137J3294M3237j1427m3921K881N7652J6365O3336K5664l2565p8695q213
14557g529O184o211J7479M940k8908M725K0412L0132O581l9504L925J1455m269
14544A9412L97L511j7886k3558p880j4878N151o845k4402j1206O6132N5941p888
14531C6001l5783J6674Q867J4871n701l0458J0364j108j3118m1943m1859M9242
14519c3951k7827j7821P4894n289m7574k3951n0591L4594K4410Q029J3512R4645
14507D3080k153j6285L7466M138j203l3821m4348k3231o8228J107M4096J1360
14495d8022N4284k5800k4709J2543j1966Q100O9205k407n1311K97n871L3715M4368
$$ y = [-49781, -11098, 16038, 3519, 18976, 35310, 22833, 27411, 52333, -12342, -75747, -85473, -55137, -41843, 1394, -10033, -53954, -51073, 6579, 22944, 86280, 111944, 79379, 684, -7529, -1345, -7556, 9923, 14863, -14045, -9320, 11092, 41224, 47805, 8301, 12226, 23681, 19412, 19809, 23320, 5434, -18124, -26004, -40882, -35731, -42576, -66978, -78184, -12052, 43889, 36001, 218, 16892, 25759, 40630, 34929, 4471, 14835, 13727, 609, -41334, -83193, -33951, -61778, -79599, -4705, -9994, -57568, -81519, -132110, -97516, -73106, -65077, -51565, 43080, 40927, 24642, 62108, 66246, 65043, 31222, -13126, -36357, -104585, -103478, -59382, -48022, 6262, -19538, -44247, -31704, -43670, -35570, 33635, 31228, -20083, -19786, -25657, 8058, 52426]
14482E2426r576o543n1048P06N2153n142l9730L8920K5144j2089p695R395J9713
14469F6634j7514n1305l2280l9069l7873L5180O280M3309M7603K0580m071J1120
14457D8594K894Q641P481l1722M0198l9995l2277K4464J8310K2835P502m1345
14445C5580l1280M769M7837n872J7280L3817j326n3579p3029j0670L2298M7246
14433D3071o177J1589k0004L3449K6940L743p7301m1039l9943r314L079K2816
14421d9091K650M2490n43o5987K9296q086M677L1906j4044p2383k9368M1260M9268
14408c7955l3624o471N6451K9071m9326n7271J8849O1004j5785K5910L3113J247
14396B5213J0687j7119j4575k6628r418J2547j9255k1437Q66K4552k6010p723
$$ y = [52426, 42850, 36307, -14741, -14035, 38118, 32976, -6754, 32166, 57310, 45221, 37526, 46921, 66634, 49120, -2185, -34465, -73534, -111407, -76227, -69947, -26638, 20965, 41545, 37474, 48594, 51488, 60129, 67610, 35888, 76086, 36091, 3814, 28278, 46588, 69423, 76925, 35580, 4300, 9069, 56906, 51034, 68314, 102131, 100805, 47226, -25803, -36473, -4175, 43071, 36894, 48483, 28479, 61928, 88868, 92611, 15310, -25729, -65672, -74986, -71907, -49091, -46441, -3951, -4494, -70481, -41185, -49271, -44594, -12688, -26732, -99115, -128483, -87223, -37955, -71579, -78050, -21599, 7472, -41854, -99125, -80276, -19272, -35057, -9147, 23966, 25213, 35900, 18781, 4206, -22422, -31840, -19293, -38548, -59985, -59119, -34567, -60577, -68300]
14384f8300M9705Q800J217M5458J2335M1495N6512l1686l3772q3006k7248N772
14372b2718K5238m9661j5109N5075K8049j2184j4402R548J2123R751l6874m1711
14360e2875J5671q264Q0664K3322k8395k0178n1616R30J4241k7411l1180L0658
14348e4433J1985j6432K6605O7292l9585l8394k348M8474L4353J5560p181J1405
14336E7301l1311o2235l349L9493L7718q199q154J3986Q492K2485l9104k106L2248
14323E7265m2394k5195q135l9150L6783q743L611j4202J8135J3753m9049j253
14311e8574N0478N303q051J3730m65p107J6784j2483n5848P586M3570J8895m6028
14298c2210m3084K1086N8528k1660N408Q053L6336m313J6701J1500l9701o288
$$ y = [-68300, -18595, -9795, -8578, 36880, 49215, 90710, 147222, 115536, 81764, -1242, -28490, -22718, 2520, -47141, -62250, -7175, 20874, 8690, -5712, 3836, 15959, 25710, -11164, -52875, -37204, -45468, 35196, 58518, 30123, 9945, -41671, -40741, -26500, -53911, -85091, -54433, -42448, -58880, -32275, 35017, -4568, -42962, -45310, 3164, 37517, 53077, 45896, 57301, 25990, -36245, -39594, -101, 37617, 29418, 21264, 35250, 43742, 66227, 27123, 25017, 57265, 14871, -10324, -18459, -57609, -20826, -29569, -25958, -40160, -22025, -8272, -57321, -58574, -8096, -2793, -10844, 2886, 2421, -4686, 12098, -385, -56233, -48647, -5077, 13818, -32210, -75294, -54208, 4320, -17340, -11932, -3879, 32457, 28144, 44845, 56345, 16644, 10356]
14286A0356O2100m874k0318K933m9609m5333J1879M4284R977j9115m2323M2852
14274B809J9282j4925k73N702K027N6477N0818L8809l4454l6406l785l0941k5694
14261B9446M219M0065K0970k954J494P969j2157l4120M1254Q853l5576L576J5919
14248H8958J9249r452k8361N9333K2620p8041k5343J1075m839K0349o93N2967
14236A27822J5194r163r526j0145K2689P3406P938J020K845J2818j3875J5911
14224B36934J0862j9960j8826o2956P335Q6483J6265o8763o1789k3575K1819M9413
14212A73242K6709Q592j2977L6953J5853j6059J3711K2657l9788l3253K5396l3596
14200A87440m0359L8202k0735m8360P0679N1274r163J9129m1525k4409K7827J0291
$$ y = [10356, 72456, 67582, 47264, 50197, 588, -44745, -32866, 11418, 21395, 2280, -40043, 2809, 22091, 7166, 6893, 12595, 14622, 71099, 121917, 160726, 126272, 89866, 86081, 55140, 29446, 33665, 73730, 94700, 91746, 93240, 101209, 89052, 54932, 96186, 105039, 69463, 73039, 88958, 108207, 98755, 70394, 129727, 152347, 74306, 48963, 60038, 55199, 75548, 74855, 127822, 143016, 133853, 124327, 114182, 136871, 210277, 218215, 219235, 222080, 234898, 221023, 236934, 247796, 227836, 209010, 146054, 153389, 239872, 256137, 187374, 125585, 102010, 123829, 173242, 199951, 208543, 195566, 232519, 248372, 232313, 246024, 268681, 228893, 195640, 221036, 187440, 147081, 185283, 164548, 116188, 186867, 238141, 228978, 248107, 206582, 182173, 210000, 220291]
14188B20291l0749l1275k1795k003J348m2866o7344M2163N7022k4613J8863q03
14176A18239m1354j0928M1361Q4345q937O79l5739k7484k2414k9379k296K5067
14164I1160N9068K0793j7272l1409p486P947l6253O946j4040O843n034K844K6184
14151A10291P165m864m2688k7793j5255j4789M0823j4003l5520j736p83j9633
14139a8785O4413M6766J6659p070o3848n207j3436j8749j6121J7753K3589L1427
14127E7391m8008l0742J5289L8805J7175j1455k5402j1357J5640J8078k7070r942
14115a598J9254K0445J3310M4834M448k40q859l8575p1863k133J2110n9603K8251
14102d0219j2481Q523R503j094J3133N0823m440K0034M537m9077n6187N3846J7400
$$ y = [220291, 189542, 158267, 136472, 134469, 135817, 92951, 25607, 67770, 124792, 100179, 119042, 118239, 76885, 65957, 107318, 191663, 182726, 183405, 147666, 120182, 97768, 68389, 66093, 91160, 150228, 171021, 153749, 122340, 114854, 122801, 86548, 93494, 79454, 86297, 81263, 84107, 110291, 117456, 112592, 69904, 42111, 26856, 12067, 52890, 38887, 3367, 1631, 848, -18785, 45628, 92394, 109053, 101983, 38135, 32928, 19492, 743, -15378, 2375, 25964, 57391, 9383, -21359, -6070, 32735, 49910, 38455, 13053, 1696, 17336, 35414, 8344, -1598, 17656, 38101, 51411, 96245, 100693, 100453, 91594, 53019, -18844, -20977, -8867, -68470, -40219, -52700, -44177, -34674, -35768, -22635, 28188, 23748, 43782, 48319, -758, -56945, -3099, 14301]
14089A4301J1129l1984l2580J1514O145j3407N5567k6788j0479J5221N8626J6581
14077G3846k5316J3698K6836J9634m4847p1716K1023L9003K413L5988j292l4364
14065E4906j069K4213L0090O733J1736j7240j8246m0886j6063K3438L6093n9244
14053C4461l0459l937K8564j8965M601m63J5802P4088q335j9574j3461j9229k012
14040D1081j0096J841M0977l9510m1574l782K5799J9792K144K2269L217N1487
14028A13645P6426N4053n3689j4999M015j857K3449L3271k4611k7519N044j3240
14016A73988k9894J2030j3561r207m624l330L1567r267N491N561j5631K206J6268
14003A61597j2068O2209L8474l8685r668O7661l5547k4354k3882J8761j8000J6322
$$ y = [14301, 25430, -6554, -39134, -27620, -21475, -34882, 20685, -6103, -16582, -1361, 57265, 73846, 48530, 62228, 89064, 108698, 63851, -7865, 13158, 52161, 54574, 90562, 89270, 54906, 53837, 78050, 108140, 114873, 126609, 109369, 91123, 50237, 34174, 57612, 93705, 34461, 4002, 65, 28629, 9664, 14265, 13802, 29604, 103692, 95357, 75783, 62322, 43093, 41081, 30985, 32826, 73803, 34293, -7281, -11063, 14736, 34528, 36672, 58941, 62158, 113645, 190071, 244124, 190435, 175436, 179451, 177594, 201043, 234314, 209703, 182184, 187228, 173988, 144094, 156124, 142563, 133356, 128732, 125402, 156969, 147702, 153193, 158754, 143123, 145329, 161597, 149529, 211738, 250212, 211527, 201859, 269520, 233973, 209619, 185737, 204498, 186498, 202820]
13991B02820P1360N2046k3261k1267o0993m1166k6779J7921K8342l1295M5318
13980B13046Q506m9816k7254L88J832M0652K9170K2576k9773j8788k2586j8292
13968A49661P672r633j2615n3448J7788K9469N606l3268N0388K8069k1311K5424
13956A83802k5707m4477m198k4073k8575m4576K8819L1071j9733k1467P2360K5364
13944A28610n899M509m5218K2157L8525j2230k5071k0110k8546J8986K6676J6775
13932A19164J4021j5960j4684N443K7171k9103o0495K8982M510k4290o5951n366
13920a6558J11281N2795L3192K7980m4749l0648j1889J4527J7737J6619K201k1617
13908A50871L211N325k0624j7569n6786j8326k4185J688K7944M592K3352K7190
$$ y = [202820, 274180, 326226, 302965, 281698, 220705, 179539, 152760, 170681, 199023, 167728, 213046, 221552, 171736, 144482, 144870, 146702, 187354, 216524, 239100, 209327, 190539, 167953, 149661, 157333, 147700, 135085, 81637, 99425, 128894, 134500, 101232, 151620, 179689, 158378, 183802, 158095, 113618, 109420, 85347, 56772, 12196, 41015, 72086, 52353, 30886, 103246, 128610, 122711, 127220, 82002, 104159, 142684, 130454, 105383, 85273, 56727, 75713, 102389, 119164, 133185, 117225, 102541, 107984, 135155, 106052, 45557, 74539, 79049, 54759, -11192, -16558, 94723, 147518, 180710, 208690, 163941, 133293, 121404, 135931, 153668, 170287, 172488, 150871, 154082, 159407, 138783, 121214, 64428, 46102, 21917, 23605, 51549, 56141, 79493, 106683]
13896A06683L863Q702K0860R71N524k0017J2440m226n9703l9902L4251M5997o882
13883A08561J7017p144r197j9972n8745l9222K8544J7109J3530j1061K8835J1619
13871G9874j8039M0970N0400K6860m6060l1847M2315m1912k9055m4354l7161j2569
13859b0578L3826J7918k5073p4803L6510L6946L1127M6606K7414J3456q079Kn3703
13846F1569k1180l1878M6077L0590q491j5103n3179K9427l3331L824K4190L4060
13834F6575M6997J0373j7638Q69m6649l8049j3161L2092N892M4860L1669n7033
13822F6797k5162j2754p972K6747l799K1276n0648l4265j5617k135J7729L3410
13810A3607k6294k4626k6333j0066j3101N1688O3825j233p194L0362m79J3121
$$ y = [106683, 110546, 119248, 140108, 141079, 146603, 126586, 139026, 134800, 75097, 35195, 69446, 115443, 108561, 125578, 118434, 109237, 89265, 30520, -8702, 19842, 36951, 50481, 39420, 68255, 79874, 61835, 102805, 153205, 180065, 134005, 102158, 144473, 102561, 73506, 29152, -8009, -20578, 13248, 31166, 6093, -68710, -32200, 4746, 35873, 82479, 109893, 123349, 115270, 115272, 61569, 40389, 8511, 54588, 85178, 76687, 61584, 8405, 37832, 4501, 8325, 32515, 66575, 113572, 123945, 106307, 107176, 60527, 22478, 9317, 41409, 47301, 92161, 123830, 66797, 41635, 28881, 20909, 47656, 43857, 65133, 14485, -19780, -35397, -37532, -19803, 13607, -12687, -37313, -63646, -73712, -86813, -35125, 28700, 27467, 20273, 50635, 50156, 63277]
13798F3277L4452K9692M0500J8250m2021K0575J123Q103R46o4886o205j0031m0573
13785E3202M0558K3315N8599N6009K0674J903K0118j449J1962M5363M3830L3304
13773D07388K0461L1239M9960J07360O7213j1804q7683r0932o3180o5461k6658
13762C37903k6810o3068j1396j1M071j0022l5168K572J8773n173K1186L3162M0539
13749C06558O6793P0992k33o2721N560J69K2274L7816R0786N9223N1679P8271
13737G27167J32957J62199K01452J51318J1857j4264q4720j50265j98266j75953
13727G63482j04793r2314j02456k7939m9116l6875k8867n4655J1496L1016l291
13716C05688q183K907k3187j4626K1302K3809N2226K6486m4740k2318J4319K5008
$$ y = [63277, 97729, 127421, 167921, 186171, 144150, 164725, 165848, 173951, 174897, 110011, 103806, 93775, 53202, 93760, 117075, 175674, 231683, 252357, 254260, 274378, 272929, 284891, 330254, 374084, 407388, 427849, 459088, 509048, 616408, 683621, 671817, 584134, 493202, 430022, 364561, 337903, 311093, 248025, 236629, 236618, 240689, 230667, 195499, 198071, 216844, 211671, 232857, 266019, 306558, 373351, 444343, 444110, 381389, 386949, 387118, 409392, 447208, 537994, 597217, 648896, 727167, 860124, 1022323, 1223775, 1375093, 1386950, 1372686, 1287966, 1137701, 939435, 763482, 658689, 566375, 463919, 435980, 386864, 349989, 321122, 266467, 277963, 308979, 305688, 297505, 300412, 277225, 262599, 283901, 307710, 359936, 386422, 341682, 319364, 333683, 358691]
13704C58691N9065Q7702M1103P7815R3392Q5109J1804m372m4814j04049p1185
13693E90261j00154j8853l8235k2491J9240k981o3888p1100j05696n3226J3173
13682A46050L7515M6555R897l7678j2414K2589R645l2119k4350K0981L0873l73
13670B17171l9219R829Q372m9184l6062J5156Q1520J4716m7889p6657m4867j4085
13658C8801J2550N1596M37m653M4089L3272k6242n6228r45m3225n335M1954j0130
13645G5941K0188k2419r204O1580O4070P905m3084q996j8250J5344J5912J5823
13633A74810j9164k2940J1561K1153K3760m1200k0475J1669N546j7348M3941K450
13621A73763J0964J1515j0019j6196l3999J8688K5339K8217O672m5043Q5o0910
$$ y = [358691, 417756, 505458, 546561, 624376, 717768, 802877, 814681, 810309, 765495, 661446, 590261, 490107, 471254, 433019, 410528, 429768, 426787, 362899, 291799, 186103, 132877, 146050, 183565, 230120, 240017, 202339, 189925, 212514, 222159, 190040, 165690, 186671, 217544, 217171, 177952, 187781, 196153, 146969, 110907, 126063, 207583, 222299, 174410, 97753, 52886, 38801, 51351, 102947, 103384, 98731, 142820, 176092, 149850, 93622, 92677, 49452, 44117, 86071, 75941, 96129, 73710, 64506, 126086, 190156, 198061, 154977, 145981, 127731, 143075, 158987, 174810, 155646, 132706, 144267, 165420, 189180, 147980, 127505, 139174, 144720, 127372, 171313, 173763, 184727, 196242, 186223, 170027, 136028, 154716, 180055, 208272, 214944, 169901, 169986, 109076]
13609A09076j6558P420P2681N9326l4706k4607j289K0634L1241j8170J8228k8125
13597A95151k6546J271l3282J8927l6108M92K2673J8869J7493m0970n5522j225
13585H1223J7288l2383K7358K0887K1357k5434J5440q071l5815J0304P3638M8631
13573B14423L1066j4927l2584K2993r100k2634k1558M5225M1889L3420n6880j0578
13561B20755O7499L4139j3687J3568j0965k0652j5155J2009L6030r602n1891m3906
13549B18142m4219k8553q473J0220O337O0787R8782O4787n7961o1381j722R169
13537B65915J6447J5078K5958j6280r105m8j4690L5600j2011q188K3985M847m2724
13524B84784M124O4614l528m6636o9431j1195n219j3180M903P5027K8079n542
$$ y = [109076, 92518, 99938, 172619, 231945, 197239, 172632, 171343, 191977, 223218, 205048, 223276, 195151, 168605, 169876, 136594, 155521, 119413, 119905, 142578, 161447, 178940, 137970, 82448, 81223, 98511, 66128, 93486, 114373, 135730, 110296, 125736, 117665, 81850, 92154, 165792, 214423, 245489, 230562, 197978, 220971, 211871, 189237, 167679, 212904, 254793, 288213, 231333, 220755, 288254, 322393, 308706, 322274, 311309, 290657, 275502, 287511, 323541, 313939, 262048, 218142, 173923, 145370, 136897, 147117, 153454, 214241, 313023, 377810, 319849, 258468, 256746, 265915, 282362, 297440, 323398, 307118, 298013, 297965, 283275, 318875, 306864, 298676, 322661, 327508, 284784, 288908, 353522, 349994, 303358, 233927, 222732, 217513, 204333, 209236, 284263, 312342, 306800]
13512C06800K2641L5153J3382q2291k259r481l3629k6743K7933N6748L7691j8080
13500C27865n353l810o2927p1215m1620j9222l4044j0649L4403N0466L0316N758
13488A99968M44n01J0694K5426l085n557M9625j4478j18438k7306M6168L427p479
13475A58908k2631k0763N0310M2190N0035J994K908L5963K0129R286j9803l3938
13463B74588M9981Q6989J3703o3m6641L8154K3225k8205o6402j6899P690m2385
13451B93735j0257J6032M3531K226l8302q390R467O479L1926j2896j6904J9683
13439C36330M5013Q0810N4347P6491O3500Q1494R0796R9318L8895p054l4364m1919
13427H83657o9830P336L4531L885k9949O15K595R281k7253J8365J0746k1738N9356
$$ y = [306800, 329441, 364594, 377976, 295685, 293426, 283945, 250316, 223573, 251506, 308254, 345945, 327865, 322512, 318702, 255775, 184560, 142940, 123718, 89674, 79025, 113428, 163894, 194210, 199968, 200412, 199911, 210605, 236031, 232946, 227389, 277014, 262536, 144098, 116792, 162960, 166387, 158908, 136277, 115514, 165824, 208014, 258049, 260043, 262951, 298914, 319043, 328329, 308526, 274588, 324569, 411558, 425261, 425198, 378557, 416711, 439936, 411731, 345329, 328430, 336120, 293735, 283478, 299510, 343041, 345267, 306965, 298575, 308042, 314521, 346447, 333551, 316647, 336330, 381343, 462153, 516500, 592991, 656491, 737985, 828781, 928099, 966994, 959940, 925576, 883657, 813827, 821163, 855694, 859579, 829630, 830245, 832840, 842121, 814868, 833233, 843979, 822241, 881597]
13414H81597L4794K0612M7811J8849k4241k4149r938J9073Q3057J04774P4632
13403A226871O9668L2460L5583P5251P0591N5146J8855k5797K3923K1594n2745
13392A551400o9345l9383p949p172j5678l0320K2044N5353L5031L3273L4232P0366
13380A631852R4982L1912J4797M6700N2193L0209Q3539j0599Q677M9115M8370
13369B081747J11352J26975P1438j689P0251O2492M5978M1618N1802L8661L270
13358B703895L0088J8450M6544O8390J07449J20621P2465P2575J10405J26587
13348C477469Q9831R3843J58160K14768K40391K06436K66051K88868L79302M51119
13338E866238M81227N96884O57930P90397R03195J090561J228714J390128J619949
$$ y = [881597, 916391, 937003, 984814, 1003663, 979422, 955273, 945335, 964408, 1047465, 1152239, 1226871, 1296539, 1328999, 1364582, 1439833, 1510424, 1565570, 1584425, 1558628, 1582551, 1604145, 1551400, 1482055, 1442672, 1434723, 1427551, 1411873, 1381553, 1403597, 1458950, 1493981, 1527254, 1561486, 1631852, 1726834, 1758746, 1773543, 1820243, 1872436, 1902645, 1986184, 1975585, 1984262, 2033377, 2081747, 2193099, 2320074, 2391512, 2389823, 2460074, 2522566, 2568544, 2610162, 2661964, 2700625, 2703895, 2733983, 2752433, 2798977, 2867367, 2974816, 3095437, 3167902, 3240477, 3350882, 3477469, 3567300, 3661143, 3819303, 4034071, 4274462, 4480898, 4746949, 5035817, 5415119, 5866238, 6347465, 6944349, 7602279, 8392676, 9295871, 10386432, 11615146, 13005274, 14625223]
13329A4625223J917708K273418K742105L408418M093929N008992O330882P933313
13321D8333988R934449J2306944J4685767J6391524J6334735J3203703O089428
13314A37280538l913561j3486956j9302495j9871757j6359262j1669295p905652
13307D4771560n242311l507802k401262j749195j337418q47424n04993j62564
13299B9018591M21045Q95299J443711J965364K502893L082872L818139M664436
13291D7812350N705301O905496Q467556J0451658J3114642J6598621K1092586
13284A30148210K6184651L1082008L4010712L2293687K3520670O493450j5102380
13277B68631008l3742579m3555968m2466789l3899411k3763667j5937092j0857636
$$ y = [14625223, 16542931, 18816349, 21558454, 24966872, 29060801, 34069793, 40400675, 48333988, 58268437, 70575381, 85261148, 101652672, 117987407, 131191110, 137280538, 133366977, 119880021, 100577526, 80705769, 64346507, 52677212, 44771560, 39529249, 36021447, 33620185, 31870990, 30533572, 29686148, 29181155, 29018591, 29439636, 30334935, 31778646, 33744010, 36246903, 39329775, 43147914, 47812350, 53517651, 60423147, 68890703, 79342361, 92457003, 109055624, 130148210, 156332861, 187414869, 221425581, 253719268, 277239938, 283733388, 268631008, 234888429, 191332461, 148865672, 114966261, 91202594, 75265502, 64407866]
13270F4407866p705702n652672m368962l311793k475747j814783j237883p10217
13262C7130107k41333K96636P63969J164576J586199K187483K752426L209622
13254D8849685L694404M212805M977238O096842P936716J0318704J2883399J5141433
13246A14111226J6036345J4310555Q714736q54464j1760359j9926398k3131047
13239I7500594k1053906j6046206j1245565p776232n563266m153320l330374k654544
13231B5677181k167447j754501j439619j169707j026017q41306o99850n54419
13223A6024315m18037m10325l22130l18328l11109l88951m58536n40266n52769
13214A2303864o17967o46889o36304o13746n72218n20065n03590m86425m39129
$$ y = [64407866, 56702164, 51049492, 46680530, 43368737, 40892990, 39078207, 37840324, 37130107, 36888774, 37185410, 37949379, 39113955, 40700154, 42887637, 45640063, 48849685, 52544089, 56756894, 61734132, 67830974, 75767690, 86086394, 98969793, 114111226, 130147571, 144458126, 153172862, 152318398, 140558039, 120631641, 97500594, 76446688, 60400482, 49154917, 41378685, 35815419, 31662099, 28331725, 25677181, 23509734, 21755233, 20315614, 19145907, 18119890, 17278584, 16578734, 16024315, 15606278, 15195953, 14873823, 14555495, 14244386, 13855435, 13396899, 12856633, 12303864, 11685897, 11039008, 10402704, 9788958, 9216740, 8696675, 8193085, 7706660, 7267531]
13205G267531l88498l28428l44690l11690l51165l24952k75593k18731k46186
13196D477598k88955k22454j47595j57300j42674j00420j24960q9487k3696p2806
13186C107251j24095j29886j87158j10358o0864r7412n7473j20776j48022p3420
13176A997787l0691o5602k6190o7830j00647m7615l6753r6850j17796o6072o1349
13165A280392j22206r8018J6713j1914q3985j2808N2395O8822N6577K8455R445
13154A183868k2143J8333l7326l0434p595k0478p3772k0277q224n0181j03353
13143H28418l6239J7988n7884k5099q352M895O9784j2811p8189l3803N0458r564
13131G09602p4654q7130p2133J7095N2962k3636O213K8443Q6613O3934Q4512J4954
$$ y = [7267531, 6879033, 6550605, 6205915, 5894225, 5543060, 5218108, 4942515, 4723784, 4477598, 4188643, 3966189, 3818594, 3661294, 3518620, 3418200, 3293240, 3203753, 3180057, 3107251, 2983156, 2853270, 2666112, 2555754, 2494890, 2397478, 2340005, 2219229, 2071207, 1997787, 1967096, 1901494, 1875304, 1807474, 1706827, 1659212, 1622459, 1525609, 1407813, 1341741, 1280392, 1158186, 1060168, 1076881, 1064967, 980982, 968174, 1020569, 1089391, 1145968, 1174423, 1183868, 1161725, 1180058, 1142732, 1112298, 1104703, 1084225, 1010453, 990176, 981952, 931771, 828418, 792179, 810167, 752283, 727184, 718832, 723727, 793511, 780700, 702511, 668708, 719166, 709602, 634948, 547818, 475685, 492780, 545742, 522106, 528319, 556762, 643375, 707309, 791821, 806775]
13119H06775J1562K1893n229R489k6066K6296k7397o1507n8134n435R213q481
13107F92979k5698k5293l9221n9521M6919O5408P181n7738q826J4609O979J0556
13095F28334J8709j2235L264P302K1255j171m284m317J5013O3970P6973K2769
13083H35582K1765p2478l6656M3272k484q617m8093L268k482M403J9029K9458
13071G85967k3711l3982k3313n4289l0139L2880K9435L4371K7413L698J2219L0339
13059G90888L2220J5180J2776j6447l7687N8026O1417K3538k3599k6961j551L1748
13047I19548k4923k0425o3509J3349P1697J604m3578p1104Q700K2297j6057o911
13035G90688j2136m5909j1135o2675n5926M4236L0863M7546J3903k6858l9461
$$ y = [806775, 818337, 840230, 835001, 844490, 818424, 844720, 817323, 755816, 697682, 692247, 701460, 692979, 667281, 641988, 602767, 543246, 590165, 655573, 662754, 605016, 596190, 610799, 617778, 628334, 647043, 634808, 638072, 645374, 666629, 665458, 661174, 656857, 671870, 735840, 812813, 835582, 857347, 784869, 748213, 791485, 789001, 780384, 732291, 735559, 733077, 737480, 756509, 785967, 762256, 728274, 704961, 650672, 620533, 653413, 682848, 717219, 744632, 748330, 760549, 790888, 823108, 838288, 851064, 834617, 796930, 854956, 916373, 939911, 916312, 889351, 887800, 919548, 894625, 874200, 810691, 824040, 895737, 897341, 853763, 782659, 791359, 813656, 797599, 790688, 778552, 732643, 721508, 658833, 602907, 647143, 678006, 725552, 739455, 712597, 673136]
13024F73136L5524j2870j6237M4386M7177j9853m1699J5539j9552n2332k3684
13013F29535J7139k6727o6498k2061K9266J0720L2663J9017O708l3129j9641K7547
13001F04539M6835k8678k7292L5738k4310P347J4792M4029N5088J2096J6681O7972
12989H24837M5826M1258J9180o80N9041O5215Q9351O8311O1069N0573P3044J06361
12977A503386M2526J44570K19904J13384R1401O2186N9949k4401p6882j11125
12967B024898j18382p0453m5152q3638N338O8981Q5495O7059O6092Q0319R7197
12956B177754P3828Q2728O8650r016k0935K8722L2088J7346Q9337J25464J18611
12945B784577M8440P1090N6953m4086p5346p4576j11658p5771n1030j40344j32330
$$ y = [673136, 708660, 695790, 679553, 723939, 771116, 751263, 709564, 725103, 705551, 653219, 629535, 646674, 619947, 553449, 531388, 560654, 571374, 604037, 623054, 629762, 596633, 576992, 604539, 651374, 622696, 595404, 631142, 606832, 614179, 628971, 673000, 728088, 740184, 756865, 824837, 870663, 911921, 931101, 930421, 989462, 1054677, 1144028, 1212339, 1273408, 1323981, 1397025, 1503386, 1545912, 1690482, 1910386, 2023770, 2115171, 2177357, 2237306, 2212905, 2136023, 2024898, 1906516, 1836063, 1790911, 1707273, 1712611, 1781592, 1867087, 1934146, 2000238, 2080557, 2177754, 2251582, 2334310, 2402960, 2393944, 2373009, 2401731, 2433819, 2451165, 2540502, 2665966, 2784577, 2833017, 2904107, 2961060, 2916974, 2841628, 2767052, 2655394, 2579623, 2528593, 2388249, 2255919]
12934B255919n6189p9837k7952L7092o7718m8879k4709J2899n7969n4718l0021
12923A857918k6347l2380P7261J28996J13967R7986Q0385M5622N0249P2748N3647
12912B520052n3868k4179r3972j40910j68547j35356j35783j11713n3445n7080
12902A545199o1620k6087k0427p8482k3301k4284L8597n2671n8948p4895l7547
12891A125534r418K2197k3798k0211L4673m3840r4486k768K8753k3124q6788m1978
12879H64746k2677k8946j2467M5483M6347k5439J7419K77m8604J4161K7883j492
12867H76691k8751L5684j1172l3181O0836N5943R642L2260O4190Q3389O8251R9320
12855A313102O2407N1424k2022p7554j49825j14765n0095m2624m7125r9861p6349
$$ y = [2255919, 2199730, 2119893, 2091941, 2129033, 2061315, 2012436, 1987727, 2000626, 1942657, 1887939, 1857918, 1831571, 1799191, 1876452, 2005448, 2119415, 2217401, 2297786, 2343408, 2393657, 2466405, 2520052, 2466184, 2442005, 2348033, 2207123, 2038576, 1903220, 1767437, 1655724, 1602279, 1545199, 1483579, 1457492, 1437065, 1358583, 1335282, 1310998, 1349595, 1296924, 1237976, 1163081, 1125534, 1116116, 1138313, 1114515, 1094304, 1128977, 1085137, 990651, 987883, 1016636, 993512, 906724, 864746, 842069, 813123, 800656, 846139, 892486, 867047, 884466, 884743, 836139, 850300, 878183, 876691, 847940, 883624, 872452, 839271, 900107, 956050, 965692, 997952, 1062142, 1145531, 1213782, 1313102, 1375509, 1426933, 1404911, 1327357, 1177532, 1062767, 1012672, 970048, 922923, 823062, 746713]
12844G46713p431j7302j9076J6810k1055l0476Q009K2587K1676L515o440M2428
12832G59958J8670Q157R163K8712N0957L8046L1890R7360J13318J01254J23339
12821A380824J10908J51891J13199m690j4300p3284j69371j91964j95079j60020
12811I48114j30976p2083l6771j3651m6073n5940L6501O3003l8459n5632m7207
12800E50826l8965o448Q2224P6478K1940J2023N4350M3310L9054k0768M5317P7138
12788I36479O0093P4012J11932R0019Q6275O5005M0423n1010j30807q8216j40284
12777A053921j18291p0453k0917l1891M2985k5419m760R128K8645m2212n1986
12766G68750J7027J9534k6560m214J6374j3977m1192n4081k6054L2177L3554q339
$$ y = [746713, 739282, 721980, 702904, 719714, 698659, 668183, 676192, 698779, 720455, 723970, 717530, 759958, 778628, 786785, 795948, 824660, 875617, 913663, 945553, 1042913, 1156231, 1257485, 1380824, 1491732, 1643623, 1756822, 1752132, 1737832, 1664548, 1495177, 1303213, 1108134, 948114, 817138, 745055, 708284, 694633, 648560, 592620, 629121, 692124, 653665, 598033, 550826, 511861, 505413, 587637, 664115, 686055, 698078, 752428, 795738, 834792, 814024, 859341, 936479, 996572, 1070584, 1182516, 1272535, 1358810, 1423815, 1464238, 1413228, 1282421, 1194205, 1053921, 935630, 865177, 844260, 812369, 855354, 829935, 825175, 834303, 862948, 820736, 768750, 785777, 805311, 778751, 774537, 790911, 776934, 735742, 681661, 655607, 687784, 721338, 712999]
12754G12999l7173L7489j573k6337m279k905K841l369M518J1244q285l3275k6441
12741F25454O016L9389m1170m1917J4148K1219J1911k7265j5504q112o269L6564
12729F14464L1130M4835J5898p5159L1284K4044l3363n175M507j1214k7957k447
12717F10847Q259K9458L3305o5313n0766j7789P901M6435j7278n7645k9995M223
12705E01642M0701N5158R49o1575J0254r455N611l6640o1185n560j5784R164N871
12692D39151k7933o1724o9594k0269k0799P177r73N3187K4939J9243L7119K990
12680C82514L4551O8252O5708M4820R354l809N3047q445j6538K9817L601L1439
12668F94311K6154k2157n1920j5504j3461L7260j2241J7350P4720L4796J1691
$$ y = [712999, 675826, 713315, 711742, 685405, 681126, 678221, 681062, 677693, 682211, 693455, 685170, 651895, 625454, 631470, 670859, 629689, 587772, 601920, 623139, 635050, 607785, 592281, 584169, 577900, 614464, 645594, 690429, 706327, 631168, 662452, 686496, 653133, 647958, 652465, 641251, 613294, 610847, 619106, 648564, 681869, 616556, 565790, 548001, 555902, 602337, 585059, 527414, 497419, 501642, 542343, 597501, 598450, 536875, 547129, 537674, 543285, 506645, 445460, 439900, 424116, 433280, 439151, 411218, 349494, 279900, 259631, 238832, 246009, 245036, 298223, 323162, 342405, 379524, 382514, 417065, 485317, 551025, 595845, 605199, 601390, 654437, 645992, 629454, 659271, 662872, 694311, 720465, 698308, 646388, 630884, 617423, 654683, 642442, 659792, 734512, 769308, 780999]
12657G80999K480J4994l3127N0454M5081J36748P0475M881N7495Q0989J14369
12646A325838J15719J08746J42531N9439r467P1865J15103L5813n8240j17894
12636A789453q7266l6956k1819m1829Q746J012k6588N9318M2215J214M2095K5689
12624A755284L4328O4083O9081P2394P3333R8992O6378J19346J36480M3156N7782
12613B590637j5467l2975L468P7582O6349J739k7529l0535m9133K7938O5264N5755
12601B733093J07295R341j9809M0156N0543O7885M7634K1327J1900P4665Q3432
12590C227462R3652M0635P4555P9997P5921J50452J57697L4532L1314L2108J15131
12579D113456P1755N3473O8509J9816N2204O6102Q8509R9319J37846J33759Q3634
$$ y = [780999, 783479, 798473, 765346, 815800, 860881, 997629, 1068104, 1072985, 1130480, 1211469, 1325838, 1441557, 1550303, 1692834, 1752273, 1742806, 1814671, 1929774, 1965587, 1907347, 1789453, 1702187, 1665231, 1643412, 1601583, 1610329, 1611341, 1584753, 1644071, 1686286, 1687500, 1729595, 1755284, 1789612, 1853695, 1922776, 1995170, 2068503, 2167495, 2233873, 2353219, 2489699, 2532855, 2590637, 2575170, 2542195, 2545663, 2623245, 2689594, 2691333, 2663804, 2633269, 2584136, 2612074, 2677338, 2733093, 2840388, 2849729, 2829920, 2870076, 2920619, 2988504, 3036138, 3057465, 3069365, 3144030, 3227462, 3321114, 3361749, 3436304, 3516301, 3592222, 3742674, 3900371, 3934903, 3966217, 3998325, 4113456, 4185211, 4238684, 4307193, 4327009, 4379213, 4445315, 4533824, 4633143, 4770989, 4904748, 4988382]
12568D988382J45802J71142J37347J66994J81917K00170J66511K28954K61656
12559F648875K58526K37895K86502L18580L11382L75231M35908M05703N27587
12550I806189O61890P86210Q26338Q96615J054866J340008J486168J661678J920507
12541B0440469K257324K542279K882581L316656L762217M403486N259137O337515
12533E1201664P630194R416595J1697721J4453778J7738857K1470465K5123589
12526A58732863K7721899K7857385K4150285J5528095K094520j3354256k4998957
12519B17731834k8962583k6272517k0482646j4205846q765015m354468p73139
12512A13915620K196436M701605O851485Q777682J0285819J1258878J1695952
$$ y = [4988382, 5134184, 5305326, 5442673, 5609667, 5791584, 5991754, 6158265, 6387219, 6648875, 6907401, 7145296, 7431798, 7750378, 8061760, 8436991, 8872899, 9278602, 9806189, 10468079, 11254289, 12080627, 12977242, 14032108, 15372116, 16858284, 18519962, 20440469, 22697793, 25240072, 28122653, 31439309, 35201526, 39605012, 44864149, 51201664, 58831858, 68248453, 79946174, 94399952, 112138809, 133609274, 158732863, 186454762, 214312147, 238462432, 253990527, 256085047, 242730791, 217731834, 188769251, 162496734, 142014088, 127808242, 119043227, 114688759, 113915620, 116112056, 120813661, 127665146, 136442828, 146728647, 157987525, 169683477]
12505A69683477J1534208J0996747J0303417J0010077J0213684J0667196J1324502
12498B44733308J1666773J1429930J0213224P772792M117527k63013m756492q657990
12490B76256059j1322301j2564268j2520760j1476680r989805q563370p273009
12483B02545866o502635o314624o614893p158789p542351p628330p161652n884904
12475A47737688l913321j444177J369624M464061P897604J1665474J5670532J9492320
12467B02939805K2494849K3457052K1139554J4201581K545824j2109899k5965216
12460B48703550l4177979l4867781l0268461k4006740j8365923j3936943j0674032
12453H2405691q387070o756164n601327m704155l934903l360454k786180k390342
$$ y = [169683477, 181217685, 192214432, 202517849, 212527926, 222741610, 233408806, 244733308, 256400081, 267830011, 278043235, 285816027, 289933554, 289670541, 284914049, 276256059, 264933758, 252369490, 239848730, 228372050, 218382245, 209818875, 202545866, 196043231, 189728607, 183113714, 175954925, 168412574, 160784244, 153622592, 147737688, 143824367, 142380190, 143749814, 148213875, 156111479, 167776953, 183447485, 202939805, 225434654, 248891706, 270031260, 284232841, 286778665, 274668766, 248703550, 214525571, 179657790, 149389329, 125382589, 107016666, 93079723, 82405691, 74018621, 67262457, 61661130, 56956975, 53022072, 49661618, 46875438, 44485096]
12445D4485096k120755j818046j626941j455435j288065j125867j061359j150449
12437C2838179j203873j287174j422171j438442j378908j374985j363830j268019
12429B2100777j141308j058501r92566r64141q78427p71112q16535p82132p10240
12420A3985815o74618n86956m90176m61934m18635l91504l71365l96139m48803
12411I745685m44980m17284m07695l87822m23181l73414l93142l24892k86548
12402F286727k80392j70391r8151r464j8420j1868M7417O1864P549r8310j75149
12391E541412l30068l23947k80564j97332j07662q7743r8233j27724j10106q2521
12381C795512j28780q4292r6947j44745j41980j04108o9817L4121K9481O0421
$$ y = [44485096, 42364341, 40546295, 38919354, 37463919, 36175854, 35049987, 33988628, 32838179, 31634306, 30347132, 28924961, 27486519, 26107611, 24732626, 23368796, 22100777, 20959469, 19900968, 18908402, 17944261, 17065834, 16294722, 15478187, 14696055, 13985815, 13311197, 12724241, 12234065, 11772131, 11353496, 10961992, 10590627, 10194488, 9745685, 9300705, 8883421, 8475726, 8087904, 7664723, 7291309, 6898167, 6573275, 6286727, 6006335, 5835944, 5737793, 5728329, 5709909, 5698041, 5745458, 5807322, 5814871, 5716561, 5541412, 5211344, 4887397, 4606833, 4409501, 4301839, 4214096, 4115863, 3988139, 3878033, 3795512, 3666732, 3582440, 3485493, 3340748, 3198768, 3094660, 3024843, 3058964, 3088445, 3148866]
12371C148866M4912O1591J9971k7833J1521J7852m4241p9551o4480o6057j02807
12360B919744o1664J2119j4486k0900n5583k2307L3034m970j0446q318n0097k8750
12348B687376K1621j7453o2870n8980j9430N944L6093k7784P614J27901P9613
12337B779645J18411N3789J839m8512j00288j36228j83165j38438j22160j72260
12327B052633j54858m5205k6121n7550j5831K568k8362n4924q2478o1192k2135
12316A506545n5003o0833m3778r299P324k321L373k0826M6362P0800P6477R7606
12304A616427J59078J03575N008o0673q5334j28948p5845j00064q0875m2101j6706
12293A293542l4805q8350m4240L023K0579o4360k840j3814m252l2808L5336K7081
$$ y = [3148866, 3193778, 3255369, 3275340, 3247507, 3259028, 3276880, 3232639, 3153088, 3088608, 3022551, 2919744, 2858080, 2870199, 2855713, 2834813, 2779230, 2756923, 2789957, 2784987, 2774541, 2766223, 2716126, 2687376, 2708997, 2691544, 2628674, 2569694, 2550264, 2556208, 2592301, 2564517, 2572131, 2700032, 2779645, 2898056, 2951845, 2953684, 2905172, 2804884, 2668656, 2485491, 2347053, 2224893, 2052633, 1897775, 1852570, 1826449, 1768899, 1753068, 1755636, 1727274, 1672350, 1589872, 1528680, 1506545, 1451542, 1390709, 1346931, 1337632, 1344956, 1342635, 1346008, 1325182, 1371544, 1442344, 1518821, 1616427, 1775505, 1879080, 1884088, 1823415, 1738081, 1609133, 1533288, 1433224, 1352349, 1310248, 1293542, 1258737, 1170387, 1126147, 1129170, 1149749, 1085389, 1082549, 1068735, 1064483, 1031675, 1067011, 1094092]
12281A094092L5920R884K0241L1102J5817n543o3959n9443l7540n7721q2656p9853
12269H20341q5472J7179L4896p3254p0739j2032K4797J0012k5492p1822q914J3848
12257E73348j7494L4563K6847L295k760k3016k7385j9374j5763j1840N374r572
12245E16223K0078L8912m7954p5066j4230N0738M1063l5620j1907O7799N9808
12234F09844r75j7914k890r582k753p8601o0785r2770n7528L4604k6630j7316
12222B76704M996K0518K5341K0031p4680J0336M3669O2158K5831j6807J619l235
12210C96481k7789q3448m2405k2327L8626N8591N122n4356K4500K2437J2920l1268
12198B97084Q837J9311J6785Q437k0247n7914O972N473j7352k937M1046r261k7449
$$ y = [1094092, 1130012, 1139896, 1160137, 1191239, 1207056, 1201513, 1137554, 1078111, 1040571, 982850, 900194, 820341, 734869, 752048, 786944, 713690, 642951, 630919, 655716, 665728, 640236, 568414, 559500, 573348, 555854, 590417, 617264, 620559, 617799, 594783, 567398, 548024, 532261, 520421, 525795, 516223, 536301, 575213, 527259, 452193, 437963, 488701, 529764, 494144, 482237, 550036, 609844, 608869, 590955, 588065, 578483, 575730, 497129, 436344, 343574, 286046, 320650, 294020, 276704, 281700, 302218, 327559, 347590, 272910, 283246, 326915, 389073, 414904, 398097, 399716, 396481, 368692, 285244, 242839, 220512, 259138, 317729, 322851, 268495, 292995, 315432, 328352, 297084, 305921, 325232, 342017, 350454, 330207, 272293, 279265, 284738, 267386, 264449, 305495, 296234, 268785]
12185B68785L140J2402M009j3214k1585Q464J8250O2174J3209l3001K117J2178
12173C36928o293K8011Q378o2796l481M873l4536q16J8811J381P9828J7389j3318
12160C74359o4905j783k3805j7410r954k641K8209q552j5797p898K3737M9530
12148C23090k7723k8599l7l8872N4157K1553J3528l075J3816J7491p3629o2147
12136B09553j0898K7583K7438k3845o076k5200p3257j4222M1768N040N8460O0717
12124B77061o604n2795j8766L0265m6481l7738M5203N4736m8548k1428N6299k2009
12112B09195m7174j7351R556M0j0956J2493L3541l1172J5712K6038j441K1112
12100B19593j5872k3203j0850J7721l0878L8158q1704k4717M5918K4496R009L9847
$$ y = [268785, 271925, 284327, 288336, 275122, 253537, 262001, 280251, 342425, 355634, 322633, 324750, 336928, 330635, 358646, 367024, 304228, 300747, 305620, 271084, 270268, 289079, 290460, 370288, 387677, 374359, 309454, 307671, 283866, 266456, 256502, 253861, 282070, 273518, 257721, 249823, 273560, 323090, 295367, 266768, 266731, 227859, 282016, 303569, 317097, 314022, 327838, 345329, 271700, 209553, 198655, 226238, 253676, 229831, 223755, 198555, 125298, 111076, 152844, 157884, 216344, 277061, 270457, 217662, 198896, 229161, 182680, 144942, 190145, 244881, 196333, 174905, 231204, 209195, 162021, 144670, 154226, 154266, 143310, 155803, 189344, 158172, 173884, 199922, 198481, 219593, 203721, 180518, 169668, 187389, 156511, 194669, 112965, 88248, 134166, 158662, 167671, 207518]
12088B07518k057o013L0608o053l0410L3759O0326L6051M4183P1680L3236j3210
12076D59618L1364P2069J7601L0659J33101J43844J08710J16540J09249Q1961
12066A304716K1071r2738q6705j39820j20119r4224k6845M8407k2658m5539j8949
12055G26597R635J08043N2690M2747P4000K7016N7509N7933O7090N8425M7560
12044A329245P0899M5006M3774M7400J2082O8120J8972r186l3989p2769r1489
12033A428065r7918p7652P497O1677q8293j10614l5380n9898r426O4626m6684
12022A036000k7834N0516J3117R05p9171j098O9272P9071K2770k907K2245J14014
12010A296900J16617J22727J12049j092o6293r9493j26064j61545j66794j73011
$$ y = [207518, 205461, 199448, 230056, 224003, 193593, 227352, 287678, 323729, 367912, 439592, 472828, 459618, 490982, 563051, 580652, 611311, 744412, 888256, 996966, 1113506, 1222755, 1304716, 1325787, 1233049, 1146344, 1006524, 886405, 792181, 765336, 813743, 791085, 745546, 726597, 736232, 844275, 896965, 939712, 1013712, 1040728, 1098237, 1156170, 1223260, 1281685, 1329245, 1400144, 1445150, 1488924, 1536324, 1548406, 1616526, 1635498, 1626312, 1592323, 1519554, 1428065, 1330147, 1252495, 1259992, 1321669, 1233376, 1122762, 1087382, 1027484, 1018058, 1082684, 1036000, 1008166, 1058682, 1071799, 1072704, 993533, 992435, 1061707, 1140778, 1163548, 1160641, 1182886, 1296900, 1413517, 1536244, 1648293, 1647201, 1580908, 1481415, 1355351, 1193806, 1027012, 854001]
12000H54001j19570r5740n9306q9133l0882L1868l5644n5199n0548k9303j5770
11989C04774j5975P104L258R662K1303n5518P718P3385J8744j9744n6430q8091
11977B10190m5711O1275O7705r285m4923Q326N421p220j01615j4049o4R494k705
11964A36839j509n2396k7040j0806J1072k219N2948K9672K2104N1286M7956o192
11952B51715m3721L2881K1250J3173k3546o0475n478o3872P388l5586J0973N375
11940A10077k5060O417M3973L3092k5633p915Q465j699l620L1931n883m2930k403
11927A18812O1688l3194o9621K9394n546p8848n7315N7444M8998J5343j8939J9335
11915H7551L4156N6949J6303l2382k9791p973L2818K8274q9601m5246j6707n1789
$$ y = [854001, 734431, 638691, 579385, 490252, 459370, 491238, 455594, 400395, 349847, 320544, 304774, 288799, 295903, 299161, 308823, 330126, 274608, 282326, 355711, 374455, 354711, 298281, 210190, 164479, 225754, 293459, 284174, 239251, 247577, 252998, 245778, 144163, 130114, 130050, 139544, 136839, 135330, 82934, 55894, 45088, 56160, 53941, 106889, 136561, 158665, 209951, 257907, 251715, 207994, 240875, 262125, 275298, 251752, 191277, 185799, 121927, 129315, 93729, 104702, 110077, 85017, 91434, 135407, 168499, 142866, 134951, 143416, 141717, 138097, 170028, 164145, 121215, 118812, 180500, 147306, 77685, 107079, 101533, 22685, -34630, 22814, 71812, 87155, 68216, 87551, 121707, 178656, 194959, 162577, 132786, 124813, 157631, 185905, 96304, 51058, 34351, -17438]
11903a7438q824M899q775O0185O415m0903j067M6116M4365q38n788o2492M763
11890B0618J8131j6016m2662n9504M9707M8829P786M815p244K6744L3767J450
11878H6421j6029l294J2052K484p281k2934l592k5698L3449m914q4149o905N8322
11865A7932K1731M5622l2636m814J903l6584m329K382P71n242K5065J2965n754
11852C9012j2157L235N0192L2611r502l9514K215K8017L1433l0782k9145k1902
11840D3713K3973O5687O40k7454k3477k2402q1522p600Q4578L2478l882n137K6712
11827A06307j4787m2688K2908m5845R298j2161j6261o805K0187L3036L8085m8656
11815D2618J4294J0762k7279j547L542O083L6868J1798j2240Q621j3612K8922
$$ y = [-17438, -26262, -21363, -30138, 30047, 36462, -4441, -5508, 40608, 84973, 84135, 78347, 15855, 20618, 38749, 22733, -19929, -79433, -29726, 19103, 26889, 31704, 24460, 51204, 84971, 86421, 70392, 67098, 79150, 81634, 74353, 51419, 47827, 22129, 55578, 50664, -33485, -40390, 17932, 39663, 85285, 52649, 47835, 49738, 13154, 8825, 11207, 11978, 6736, 31801, 44766, 39012, 26855, 30090, 80282, 112893, 103391, 63877, 66092, 94109, 125542, 94760, 65615, 43713, 67686, 133373, 134013, 106559, 83082, 60680, -20842, -28442, 56136, 88614, 84732, 79595, 106307, 91520, 48832, 71740, 25895, 35193, 23032, 6771, -34, 20153, 53189, 91274, 42618, 56912, 67674, 40395, 38848, 42390, 48473, 85341, 97139, 84899, 93520, 79908, 108830]
11803A08830L1261m2960k9238L6672P447J4221l007j8183k1167k0517N577k7628
11791D1308k8998M6740L5124J0343l1268l5171J0317N2587l8175l6689K9252j6409
11779C8961l2148K4191N8355j1464m1344j0438J6128K2900j0104K7027N1843L233
11767A37140l4448p3659j3119r08n426J3556O028O623J0280R885l2606j2694J9030
11754B9682K4472k8359k9648J3335k8428j4426j1240Q819J9109K7562N7192n601
11742F2469m9144J2206N5947r069K6695o974L198K2136N400n5241M229J7608l381
11729H6079n2415m4307R429M1738n3496m3605L9845R7125r315R916r86J068k7138
11716E3938J7046k6502n0422K9566M6031L2087j0554M696J505J2382k24l8415
$$ y = [108830, 140091, 97131, 67893, 104565, 112012, 126233, 123226, 105043, 83876, 63359, 68936, 41308, 12310, 59050, 94174, 104517, 73249, 38078, 48395, 100982, 62807, 26118, 55370, 38961, 6813, 31004, 89359, 77895, 36551, 26113, 42241, 65141, 55037, 82064, 133907, 137140, 102692, 29033, 15914, 15006, 9580, 23136, 29164, 35787, 46067, 55952, 23346, 10652, 29682, 54154, 25795, -3853, 9482, -18946, -33372, -44612, -35793, -16684, 10878, 68070, 62469, 13325, 25531, 81478, 72409, 99104, 92130, 95328, 117464, 122864, 67623, 71852, 89460, 86079, 33664, -10643, -1214, 40524, -12972, -56577, -16732, 80393, 71078, 80994, 80008, 81076, 53938, 70984, 44482, -5940, 23626, 69657, 101744, 91190, 95886, 97391, 109773, 109549, 71134]
11704G1134k1918L1155q809n330J4832o0110q2107o0010L4840O5289J6495r274
11692a3813N7919l1590n070M7567P1525L4559L1454L1170J0238l1910o3202l4643
11680A04204L7433m441m3221K3611M0609m2239j13089n282j651J2643J0958j4620
11668D915j7168K6423L8006P1534K8039j0074j3374J4082m0099m8189J8211J7156
11656H9462k4985K9645R802k6544j946J1648n8705J7029J7016O350j3654m6508
11644H610M1734M6268Q908m2511N100N3119J2506j0477P326k9686k7297K5660
11632I9260k8816q3220l6166M3058L6087J5310M6369M8428p618n9058L9824k1264
11620I2194M1821N5764m505J6242J0691j6810J36546Q3228J4504K1591R4790J24840
$$ y = [71134, 49216, 80371, 71562, 66232, 81064, 20954, -61153, -121163, -86323, -21034, -4539, -13813, 44106, 12516, 7446, 55013, 126538, 161097, 192551, 223721, 233959, 202049, 138847, 104204, 141637, 137196, 93975, 117586, 158195, 115956, 2867, -2415, -4066, 8577, 19535, 4915, -12253, 14170, 52176, 123710, 151749, 141675, 128301, 142383, 102284, 54095, 72306, 89462, 64477, 94122, 103924, 77380, 75434, 87082, 28377, 45406, 62422, 68772, 55118, 8610, 50344, 96612, 105520, 63009, 68109, 121228, 133734, 123257, 130583, 100897, 73600, 99260, 70444, -12776, -48942, -5884, 30203, 45513, 91882, 140310, 132692, 73634, 113458, 92194, 134015, 189779, 185274, 201516, 212207, 195397, 331943, 415171, 429675, 451266, 546056, 670896]
11608F70896J12603M5211n3884r4311q0265j09898j27225n6361j462m6504l2119
11597B26681L0929K634j6568j0217R275O2982M6762p742k2171k7951j8786O0837
11585C36665O8060K1235k6903n267M7030O5758M1293R9510J76949J59557J59480
11574A143367J17488Q2939J57404R4827K431j71944k27516k41314j59196j68261
11564F30225q3918o7540q3121l3634M0281N199J695k3013p7476j6413K3290K6188
11552C41763J6736M4545K1703j1390P940R323K8021J4925M4448j0553J9451P8239
11540F05151O2853O9876J18078L2987M8347K6749j3747j11729j79789j43069p6940
11529D38767o2638p8834K0117J0755n2450j9086L084L5698J2316k5468l3700j5114
$$ y = [670896, 783499, 828710, 774826, 680515, 600250, 490352, 363127, 306766, 305304, 258800, 226681, 257610, 260244, 243676, 233459, 242734, 305716, 352478, 344736, 322565, 294614, 275828, 336665, 404725, 425960, 399057, 393790, 440820, 506578, 547871, 647381, 824330, 983887, 1143367, 1260855, 1343794, 1501198, 1596025, 1598456, 1426512, 1198996, 957682, 798486, 630225, 546307, 478767, 395646, 362012, 402293, 407492, 409187, 386174, 308698, 292285, 315575, 341763, 358499, 403044, 424747, 413357, 421297, 430620, 458641, 473566, 518014, 507461, 526912, 605151, 668004, 737880, 855958, 888945, 937292, 964041, 950294, 838565, 658776, 515707, 438767, 376129, 297295, 317412, 328167, 275717, 256631, 259715, 295413, 307729, 282261, 248561, 233447]
11517B33447J2962m0943J1051j3766k490k0527o359k609K8656J504K0692j0742
11505B10876j253O2265l4838j4476J7166J4989p5108m1725N4218K0741n522K8935
11493B36268m1338j1806n1746j0638M5901l4539k6910M5772K4215j1930o6462
11482I6787l690L4633K3311K080J65L914j8203j6865n6099L288L8823O1860L6505
11469B06509r615M780l6656l9149L538J4765k4064J1224L7047J8484o2244m01
11457A24218O7069L4465k0128l4055K6876N6525L2458j8091J1140Q4888M5997
11446D11362r426j01638m1308j2883M8918K2131j5581K7434j8666k7573K264O1292
11434C46326J5131k2800m614J6270Q8072J2489k8740o9986o1168j8063K7982L2936
$$ y = [233447, 246409, 205466, 216517, 202751, 200261, 179734, 173375, 170766, 199422, 200926, 221618, 210876, 209623, 271888, 237050, 222574, 239740, 254729, 179621, 137896, 192114, 212855, 207333, 236268, 194930, 183124, 131378, 120740, 166641, 132102, 105192, 150964, 175179, 163249, 96787, 93097, 127730, 151041, 153121, 153286, 157200, 138997, 122132, 66033, 69321, 108144, 170004, 206509, 196894, 201674, 165018, 125869, 129407, 144172, 120108, 131332, 168379, 186863, 124619, 124218, 191287, 225752, 205624, 171569, 198445, 254970, 287428, 269337, 280477, 365365, 411362, 401936, 300298, 258990, 246107, 295025, 317156, 301575, 329009, 310343, 282770, 285034, 346326, 361457, 338657, 334043, 350313, 438385, 450874, 422134, 352148, 290980, 272917, 300899, 333835]
11422C33835M6341K4m0118l2679l9710j5005M1815K8806M6598L9314j5000M7892
11410D42113J8630L393N5704J9778n6468k7995Q5432j0145m1919l6328M4282m4872
11398D51605l993L2736m705m5942L3386M3313k3360k7473K3615n239l716k6731
11386D43496j6531k5982j8363m2219n7311L4655R193q364j7978L439m808L0791
11374C30018M3904O5201K0393K5966L0211Q681j2240k9823q2701o7567K315L9919
11362C74277O3135n999n4207l0670L37j5609o7849J4297N2204K1231J2293l9685
11350C23755n4915j5403N4838l2161m867k2711O4377R4783K5269O5438J2544J5697
11338E26644k1103k2075O08m7026o8544o55q524L3314k7349M5536q081o1116L938
$$ y = [333835, 380176, 380200, 340082, 307403, 267693, 252688, 294503, 323309, 369907, 409221, 394221, 442113, 460743, 464136, 519840, 539618, 483150, 455155, 540587, 530442, 488523, 452195, 496477, 451605, 447612, 480348, 475643, 429701, 463087, 506400, 483040, 455567, 479182, 473943, 470227, 443496, 426965, 400983, 382620, 340401, 283090, 317745, 326938, 318574, 300596, 304035, 299227, 330018, 373922, 439123, 459516, 485482, 515693, 524374, 512134, 482311, 399610, 332043, 334358, 374277, 437412, 431413, 377206, 346536, 346873, 331264, 263415, 277712, 329916, 351147, 363440, 323755, 268840, 253437, 308275, 276114, 271247, 248536, 312913, 407696, 432965, 498403, 510947, 526644, 505541, 483466, 484074, 437048, 368504, 367849, 359325, 392639, 365290, 410826, 402745, 341629, 345567]
11325C45567K3951J1940p527O79l1328j9237P490k9535L1781J4090n1635L823
11313C00059Q0788R3263N7243Q9429M6775R4385J21662K7311m9223p875r172p567
11301H37078l9155J4353n7324l5093p590k0668j4894L169M6794N3518O2523M4694
11289H87405k6054K9811N0634n763l4687j6671L7218K1698j1192L6711K7692O7551
11277A064353J00230R9438R4244N0886K9411J5384j3541K6118M3567m2076l3433
11266A434581n2787k00n7451n0874k3777j0627l816K9882J14452N0910N0924O497
11254A487714O3523R4543O0371M2712M2802J7963L088M4220L8332N2866N3674
11243B001808Q3405J39494P6706L5481O7878J12485K2132O3171O4697L8569N4100
$$ y = [345567, 369518, 381458, 373931, 374610, 343282, 324045, 331535, 302000, 333781, 347871, 296236, 300059, 380847, 474110, 531353, 620782, 667557, 761942, 883604, 910915, 861692, 853817, 844645, 837078, 797923, 812276, 754952, 719859, 712269, 691601, 676707, 679876, 726670, 780188, 842711, 887405, 861351, 891162, 941796, 936033, 901346, 884675, 921893, 943591, 932399, 969110, 996802, 1064353, 1164583, 1264021, 1358265, 1409151, 1438562, 1453946, 1440405, 1466523, 1510090, 1468014, 1434581, 1381794, 1381594, 1324143, 1273269, 1249492, 1238865, 1235049, 1264931, 1379383, 1430293, 1481217, 1487714, 1551237, 1645780, 1706151, 1748863, 1791665, 1809628, 1812716, 1856936, 1895268, 1948134, 2001808, 2085213, 2224707, 2301413, 2336894, 2404772, 2517257, 2539389, 2602560, 2667257, 2705826, 2759926]
11232B759926M7336L3408O9866P5231J26539J66461J33998J04089R2625J71013
11222C780492K29602K63111K76123L06741L89069L72166M22105M63591M64999
11213F967999M41053M52408N49546O41544Q61107J020855J258309J404284J570661
11204A5167766J766470J898904K163262K586502L183441L982247M945884O157804
11196D1852280P837036J0135854J2952252J6002546J8453763J9115031J6591345
11189A42940107R473640k729336j6702917k4927133k3771099j7788305j1866193
11182E4628764p668790n007029l272371k116320j391088j021448q02875l87133
11174C2961710K11454O78772J053472J343585J832525K333783K805896L312505
$$ y = [2759926, 2807262, 2840670, 2910536, 2985767, 3112306, 3278767, 3412765, 3516854, 3609479, 3780492, 4010094, 4273205, 4549328, 4856069, 5245138, 5617304, 6039409, 6503000, 6967999, 7409052, 7861460, 8411006, 9052550, 9913657, 10934512, 12192821, 13597105, 15167766, 16934236, 18833140, 20996402, 23582904, 26766345, 30748592, 35694476, 41852280, 49689316, 59825170, 72777422, 88779968, 107233731, 126348762, 142940107, 152413747, 149684411, 132981494, 108054361, 84283262, 66494957, 54628764, 46959974, 41952945, 38680574, 36564254, 35173166, 34151718, 33348843, 32961710, 33173164, 33851936, 34905408, 36248993, 38081518, 40415301, 43221197, 46533702]
11166D6533702L966823M795611N976080P483379R524478J2157968J5811559K0651610
11158A26901210K6492995L2377573L6534563L6265078K8195844R907698j6557204
11151B80117757m1295788n1660549m5305893l2523522k1654254j4464000r886924
11144F3326827o883606m885185l512344k577342j878835j400590r24618p39582
11136D0524725n10286j53264J58070O83302J207026J652646K147729K591362K982003
11127E1283313L311013L863966M965925O850551R324060J2137022J4697015J6195932
11119A22628797J5211777J0464122J134740j1798479k2575914k5065060k0597922
11112F9402061j4569850r864189o845543m896293l543560k663977k075236j667429
$$ y = [46533702, 50500525, 55296136, 61272216, 68755595, 78280073, 90438041, 106249600, 126901210, 153394205, 185771778, 222306341, 258571419, 286767263, 296674961, 280117757, 238821969, 187161420, 141855527, 109332005, 87677751, 73213751, 63326827, 56443221, 51558036, 48045692, 45468350, 43589515, 42188925, 41264307, 40524725, 40014439, 39861175, 40019245, 40702547, 41909573, 43562219, 45709948, 48301310, 51283313, 54594326, 58458292, 63424217, 70274768, 79598828, 91735850, 106432865, 122628797, 137840574, 148304696, 149439436, 137640957, 115065043, 89999983, 69402061, 54832211, 44968022, 38122479, 33226186, 29682626, 27018649, 24943413, 23275984]
11104B3275984j394432j221626j122632j031993r60541q87268q47380o01041m58153
11095A4750918l60562k89535l25366l28241m05158n91711o76042o24510o08599
11086A0541194o17663n92191n31279m97834m97849m05738m36516l97476l39832
11077F224816l46249l21324k95849k65326k22848j89534j80613j65451j53668
11068D083954j67334j34002j32949j07020j09225j43370j64263q9425q2028n7902
11058B896436p0290j18343r5039m1617n5415q9094j07492o7633l5530l9784k9505
11047B146694m3773q6457o2799m0539j4005m6526o0053q4786n6903m9135q6858
11036A514860o569L9706P4367L2103O4472N9339Q955L5041J8031j015L315j7752
$$ y = [23275984, 21881552, 20659926, 19537294, 18505301, 17544760, 16657492, 15810112, 15209071, 14750918, 14390356, 14100821, 13775455, 13447214, 13042056, 12450345, 11774303, 11149793, 10541194, 9923531, 9331340, 8800061, 8302227, 7804378, 7398640, 6962124, 6564648, 6224816, 5878567, 5557243, 5261394, 4996068, 4773220, 4583686, 4403073, 4237622, 4083954, 3916620, 3782618, 3649669, 3542649, 3433424, 3290054, 3125791, 3036366, 2954338, 2896436, 2826146, 2707803, 2612764, 2571147, 2515732, 2426638, 2319146, 2251513, 2215983, 2176199, 2146694, 2102921, 2016464, 1953665, 1913126, 1899121, 1852595, 1792542, 1707756, 1650853, 1601718, 1514860, 1508291, 1547997, 1622364, 1654467, 1718939, 1778278, 1787233, 1822274, 1840305, 1839290, 1842605, 1824853]
11024A824853o7005p4669k1027n2990l6661p4951m3344k5306m9906n2867K0467
11013A346594J8841l0339K3365P232m6866r7698O173R700l1268j7097k9578k3745
11001A135314k4493M6463Q0796J12058R5689O4163N4823J744p0063N993K7851
10990A530338l7596p2923k1201q8402K046m3979q5996q0161k5126q981J4013K5573
10978A107605j3126m7320m2773n8617J0045K6999j9543J8719J4760o9868l5489
10967H91392K9434J7841o2428j7206J5897L0405O2844P2867k6038o6800R467l544
10955I54131M7618l326J114Q2067P7496J2260K4677P3505Q6815Q423o0233o4273
10943A240274r3645j9114L0467P126Q377l0499k0273m180L6038K9578N6545Q9289
$$ y = [1824853, 1757848, 1683179, 1662152, 1609162, 1572501, 1497550, 1454206, 1428900, 1378994, 1326127, 1346594, 1365435, 1335096, 1358461, 1365693, 1318827, 1221129, 1227302, 1237002, 1205734, 1188637, 1159059, 1135314, 1110821, 1157284, 1238080, 1350138, 1445827, 1509990, 1564813, 1566557, 1496494, 1502487, 1530338, 1492742, 1419819, 1398618, 1310216, 1312262, 1268283, 1182287, 1102126, 1077000, 1068019, 1082032, 1107605, 1094479, 1047159, 1004386, 945769, 955814, 982813, 963270, 981989, 996749, 926881, 891392, 920826, 938667, 876239, 859033, 874930, 905335, 968179, 1041046, 1015008, 948208, 957675, 954131, 1001749, 998423, 999537, 1081604, 1159100, 1171360, 1196037, 1269542, 1356357, 1364780, 1304547, 1240274, 1146629, 1127515, 1157982, 1165108, 1173485, 1142986, 1122713, 1118533, 1154571, 1184149, 1240694, 1329983]
10931A329983N1393j9162K0442L7549M3309M7202j8588N079L8442P1090R0597
10920A697336J34623J32293J29566J34169R2631M5538M0016N6195k9884K1792
10910B454275M8369m953o811L743N30K8171L0223O599m1511q3499n8385p105j3023
10897B356623Q974J7886J8388O3480R8752P5844R7610R4871N9320Q4407N0904
10886C027059K9289L1323q996L2880K7619l4971l9906M646L6725P1738N8372K924
10874C238702j0181L3983R6788J18122Q2992O2081N9591J7560J9514J06012P7295
10863C902459M9838R2555J41619J13649J17571J35782Q6069Q0263M5358P9149
10853D844312Q1656M4795M9019J06780J23649M9588R3532R9282J37776K28089
$$ y = [1329983, 1381376, 1362214, 1382656, 1420205, 1463514, 1510716, 1492128, 1497207, 1535649, 1606739, 1697336, 1831959, 1964252, 2093818, 2227987, 2320618, 2366156, 2406172, 2462367, 2432483, 2454275, 2502644, 2497691, 2490880, 2494623, 2495153, 2523324, 2553547, 2560146, 2518635, 2435136, 2376751, 2369646, 2356623, 2365597, 2383483, 2401871, 2465351, 2564103, 2639947, 2737557, 2832428, 2891748, 2976155, 3027059, 3056348, 3087671, 3078675, 3111555, 3139174, 3104203, 3064297, 3068943, 3105668, 3177406, 3235778, 3238702, 3228521, 3262504, 3359292, 3477414, 3560406, 3622487, 3682078, 3699638, 3719152, 3825164, 3902459, 3952297, 4044852, 4186471, 4300120, 4417691, 4553473, 4639542, 4719805, 4765163, 4844312, 4925968, 4970763, 5019782, 5126562, 5250211, 5299799, 5393331, 5492613, 5630389, 5858478]
10843E858478J45206R5788J11305K07123K28363K11448K13087K50027K53603K55704
10833G830132K99692K78681K75241L98197M12421M51732M72796N00208N89063
10824A1508163O40946P23897Q64297R79838J123256J296685J461890J732123J928762
10815B2259857K206488K494449K784226L197350L662210M183102M890200N717578
10807E1395460O762786Q130405R670268J1541066J3779640J6264301J8972358
10800A36516284K1448877K3065975K2893383J9990371J3683310M334906o390596
10793B35542510j5426375k0314978k0887557j8313233j4274417r906549n783774
10786A30635627k092195J227574M145275O669650Q666318J0177469J0665491R960649
$$ y = [5858478, 6003684, 6099472, 6210777, 6417900, 6646263, 6857711, 7070798, 7320825, 7574428, 7830132, 8129824, 8408505, 8683746, 9081943, 9494364, 9946096, 10418892, 10919100, 11508163, 12149109, 12873006, 13737303, 14717141, 15840397, 17137082, 18598972, 20331095, 22259857, 24466345, 26960794, 29745020, 32942370, 36604580, 40787682, 45677882, 51395460, 58158246, 66288651, 75958919, 87499985, 101279625, 117543926, 136516284, 157965161, 181031136, 203924519, 223914890, 237598200, 241933106, 235542510, 220116135, 199801157, 178913600, 160600367, 146325950, 136419401, 130635627, 128543432, 129771006, 133916281, 140585931, 149252249, 159429718, 170095209, 180055858]
10778A80055858Q249979O012958L639104K134052K043135L617230O513473R818347
10770B22084136J2730396J4536209J4425289J2117966P352088O93660o506928
10763B77432816j2565921j5937672j6193366j3927915j0340731o705322l764295
10756A97997594k099410j938893l226102n397685p551784q902831r064093q049963
10748A51766833o000560l335097m67398K420549N214673Q008038J0643707J2965488
10740A81216233J4585242J4921832J3414092R611029L235477n064872j3631360
10733B18287673k0290879k3437574k2981908k0325099j6983806j3890809j1297879
10726H9079719r263332p617174o280169n203387m415935l827948l317626k858153
$$ y = [180055858, 188305837, 194318795, 197957899, 200091951, 202135086, 205752316, 212265789, 222084136, 234814532, 249350741, 263776030, 275893996, 283246084, 283939744, 277432816, 264866895, 248929223, 232735857, 218807942, 208467211, 201761889, 197997594, 195898184, 193959291, 190733189, 185335504, 177783720, 168880889, 159816796, 151766833, 145766273, 142431176, 141963778, 144384327, 149599000, 157607038, 168250745, 181216233, 195801475, 210723307, 224137399, 233748428, 236983905, 231919033, 218287673, 197996794, 174559220, 151577312, 131252213, 114268407, 100377598, 89079719, 79816387, 72199213, 65919044, 60715657, 56299722, 52471774, 49154148, 46295995]
10718D6295995k579449k293792k003679j730613j485225j340904j302304j309622
10710C2250407j206838j259260j339187j302939j271088j222072j216897j226170
10702B2205956j200090j117210j001750r24418q82652q22678p10303o58160o28742
10693A4259953o12521o13961o48969o59099p02830o10942n68816m76249m12810
10684H953756m18366l54232l88768l61532l24309l47385k99880k56657k40912
10675E961715k31571j60804j50784k10303j74672j21071l1857p1282j77999k08785
10665D422587j63750q6789q342M4219o923l9832n3666j70055k38922k24317k47051
10654C227159j28465j32494j45145q1143p5564m1478p7027o8776k6110n7229p0826
$$ y = [46295995, 43716546, 41422754, 39419075, 37688462, 36203237, 34862333, 33560029, 32250407, 31043569, 29784309, 28445122, 27142183, 25871095, 24649023, 23432126, 22205956, 21005866, 19888656, 18886906, 17962488, 17079836, 16257158, 15546855, 14888695, 14259953, 13647432, 13033471, 12384502, 11725403, 11022573, 10411631, 9842815, 9366566, 8953756, 8535390, 8181158, 7792390, 7430858, 7106549, 6759164, 6459284, 6202627, 5961715, 5730144, 5569340, 5418556, 5208253, 5033581, 4912510, 4880653, 4809371, 4631372, 4422587, 4258837, 4172048, 4163706, 4207925, 4201002, 4161170, 4107504, 3937449, 3698527, 3474210, 3227159, 3098694, 2966200, 2821055, 2739912, 2664348, 2622870, 2545843, 2477067, 2450957, 2393728, 2322902]
10643B322902O1543L5847K8832M9118R7028M980r004J2813n610O2791R0892J44598
10631B896730J06069J11369O2795j065k9220J4152O4853J4453p6300q6295j29119
10620B948422j46564r3056j28405j17655n0370l2633k9328Q605m862O0733N1720
10609B466607M7440N7368J08788J04321K1499L932R4500J25129O3755P8069R0006
10598C261414o169l901L3769o0324j0138k6622l8764K7678O0163o9528j52296
10587C015282j04148j0143J10362J75085J75765J39938J26339J8007j64837k10139
10577C271511j79095m2178k8647n5834n3230Q737M1963M8505J2070k1123l5275
10566B967404o5867j4404l8104p5594p7856p9453p948k1227l2490o898j1523q2919
$$ y = [2322902, 2384445, 2420292, 2449124, 2498242, 2595270, 2600250, 2591246, 2604059, 2598449, 2661240, 2752132, 2896730, 3002799, 3114168, 3176963, 3175898, 3146678, 3160830, 3225683, 3240136, 3163836, 3077541, 2948422, 2801858, 2708802, 2580397, 2462742, 2412372, 2379739, 2350411, 2359016, 2354154, 2414887, 2466607, 2514047, 2571415, 2680203, 2784524, 2806023, 2809955, 2904455, 3029584, 3093339, 3171408, 3261414, 3255245, 3251344, 3285113, 3224789, 3214651, 3188029, 3149265, 3176943, 3237106, 3167578, 3015282, 2911134, 2900991, 3011353, 3186438, 3362203, 3502141, 3628480, 3646487, 3481650, 3271511, 3092416, 3050238, 3021591, 2965757, 2912527, 2921264, 2963227, 3011732, 3023802, 3002679, 2967404, 2901537, 2887133, 2849029, 2773435, 2695579, 2616126, 2608178, 2586951, 2554461, 2547563, 2536040, 2453121]
10554B453121j14500k3475j6321L1646q1267q9818j0363M8017j1811M100N7111
10543B246440L6182P3631Q3148Q2075L9407l2408o1798m2402L4645M0875m8383
10532B451412j5259k6683n9526j7287K2228n4084p4918n2611r1831q2954K88n813
10520A992962l5179k6445LK927k1476o1664K0893M0329k5403o7218P90K0419j7098
10507A823840N423K7134N4187L566j3627J5945l671R270J08423j4331o1265p8820
10495A876074n3807q9857r3932J088m3819r8444M592k0077j03884n7352q0602
10484A239980m7691J0894M2211J6563j7655J968j6072J8497n68m358M4060j3985
10472A273844k2828J7626K1537n6918m7030j0017m8104j12528q6470l6680j4792
$$ y = [2453121, 2338621, 2315146, 2298825, 2330471, 2249204, 2159386, 2149023, 2197040, 2185229, 2189329, 2246440, 2282622, 2356253, 2439401, 2521476, 2560883, 2528475, 2466677, 2424275, 2458920, 2499795, 2451412, 2436153, 2409470, 2349944, 2332657, 2354885, 2300801, 2225883, 2173272, 2081441, 1998487, 1998775, 1992962, 1957783, 1931338, 1931341, 1934268, 1912792, 1851128, 1872021, 1912350, 1886947, 1819729, 1820519, 1840938, 1823840, 1829263, 1856397, 1910584, 1914150, 1900523, 1916468, 1912797, 1922067, 2030490, 2016159, 1954894, 1876074, 1822267, 1732410, 1638478, 1639566, 1595747, 1497303, 1501895, 1481818, 1377934, 1320582, 1239980, 1192289, 1203183, 1245394, 1261957, 1244302, 1246270, 1230198, 1248695, 1248127, 1243769, 1287829, 1273844, 1251016, 1268642, 1290179, 1233261, 1186231, 1176214, 1128110, 1015582, 929112, 892432, 877640]
10461H77640m5194k5358m5244r915j3758k0816j5301j4775n2443l8815O297L2284
10449F34602j6958n1641Q827L0697M10K5941J9404n5399j9806k539l679n392m977
10436E59490k4467m9361k844j3749J7238l2254l9086K617J6779K4411K5990j3528
10424D71236k2576l3385j7041L357j8381L766q512L2901j9619O440r143L579J3298
10411D05920J9690m0228n0013k4869K7351K1392p5474l4640N4243R632k3529J926
10399B91401k622L0513M3045M4675l6051m0524p813J2795J6447n8329o9830N5573
10387B79280R1889m87m003R2131Q665L4301R2744L3580M9734R0327M0282P7951
10375H86394J08515J08073O4227O1452N0922M6783J0260o1722q2787p7383j06743
$$ y = [877640, 832446, 807088, 761844, 751929, 738171, 717355, 702054, 687279, 634836, 596021, 602318, 634602, 617644, 566003, 574830, 605527, 605937, 631878, 651282, 595883, 576077, 573538, 569859, 564467, 559490, 535023, 485662, 482818, 469069, 486307, 454053, 414967, 417584, 434363, 458774, 484764, 471236, 448660, 415275, 398234, 401591, 383210, 386976, 378464, 411365, 391746, 398186, 389043, 392622, 405920, 425610, 385382, 335369, 310500, 337851, 359243, 283769, 249129, 303372, 313004, 289475, 291401, 288779, 319292, 362337, 407012, 370961, 330437, 322624, 335419, 351866, 293537, 223707, 279280, 371169, 370682, 366679, 458810, 467475, 501776, 594520, 628100, 677834, 768161, 808443, 886394, 994909, 1102982, 1167209, 1228661, 1279583, 1326366, 1336626, 1274904, 1192117, 1114734, 1007991]
10364A007991p5444o4308k6522k0688L7299m995J8998N7433P2415R329L8156N8284
10352A107948K0533K1502K2085m3583K801Q3865L6627P7638J01475M9849p62P944
10340A487922L3217L3765k8179l6158n3123k0927l2236p1286l8461l3313q3951
10329A157270j5909j2746K0302N994n0205o9864m4971n2082J6108P2451J5543
10318A041891M3296P1802P5699J2200K4474R9543r290j9435l2512p026m1165j08182
10306A151295p2588o5261j11627j00443r5484m0591l4702l3930o0084m9646Q34
10295D87773r243k4815m1753R849J061R200j1652l4067l9178m1985L6338L0445
10283C71973k1428n9608j7775l5451j1843k2309k3014N5198J3475L8130L8992
$$ y = [1007991, 932547, 868239, 841717, 821029, 858328, 853333, 872331, 929764, 1002179, 1011508, 1049664, 1107948, 1128481, 1149983, 1172068, 1128485, 1131286, 1215151, 1251778, 1329416, 1430891, 1480740, 1479978, 1487922, 1521139, 1554904, 1526725, 1490567, 1437444, 1416517, 1384281, 1312995, 1274534, 1241221, 1157270, 1141361, 1128615, 1148917, 1154911, 1104706, 1034842, 989871, 937789, 953897, 1026348, 1041891, 1085187, 1156989, 1232688, 1244888, 1269362, 1368905, 1359615, 1340180, 1307668, 1300642, 1259477, 1151295, 1078707, 1013446, 901819, 801376, 705892, 665301, 630599, 596669, 536585, 486939, 487773, 478530, 453715, 411962, 421811, 422872, 432072, 420420, 386353, 347175, 305190, 341528, 371973, 350545, 290937, 273162, 237711, 225868, 203559, 180545, 235743, 249218, 287348, 326340]
10272C26340l4575l9379K7640k0719j3778L2911J8807l1457p242j7490J8262j192
10260B58128K0030o6889n5873j1543R00p67j8737J2764N8584p285m6614j689K4413
10247A65422l8678J3616N0975k2401J0559l6525o6099k305K0636j1875l700K6468
10235A06093m232l4464L7027Q4398M453l2428l8689K870j5720n4255M987K6343
10223H6383p41p970P838K7441o810q540j3334m3895J4714K5013m949L4886N7131
10210A67167J1206o434m08M201M5001J8194o3198M9178L7110Q098L0093k9157
10198B71051j8190m6387M927R663p202k3082j2695j2092j5499K1409l1740q6554
10186E3609P440J8131n579K2470J8931l3230j096k218L1369N8006j3714m5491
$$ y = [326340, 291765, 252386, 280026, 259307, 245529, 278440, 297247, 265790, 258548, 241058, 259320, 258128, 278158, 211269, 155396, 143853, 144753, 143986, 125249, 138013, 196597, 189312, 142698, 141009, 165422, 126744, 140360, 191335, 168934, 179493, 142968, 76869, 74564, 95200, 83325, 79625, 106093, 101861, 67397, 104424, 188822, 193275, 160847, 122158, 125028, 109308, 55053, 60040, 86383, 85642, 77672, 85510, 112951, 106141, 97601, 84267, 40372, 55086, 80099, 75150, 110036, 167167, 178373, 171939, 171531, 175732, 220733, 238927, 175729, 224907, 262017, 270115, 300208, 271051, 252861, 206474, 211401, 221064, 213862, 190780, 178085, 165993, 150494, 171903, 140163, 53609, 61049, 79180, 73601, 96071, 115002, 81772, 80676, 78458, 109827, 167833, 154119, 108628]
10174A08628k8111M1923N5497j3541m2134n578j1374n877J71K5634m5167p513
10162G2558o386J5867l486N1980M4961p3628m2186K174j2879l1794O9869K2407
10150A09457L3254j2816j6375K574l3051m2742m044l5499J8731K5191j8723k260
10138B3697j9276M316N9407O9823l8585J4200J3621n053l5632o348R138M1547
10126A30855K5932P349K2567r3776p6023L1303N9280N9205N99J0641m3819j485
10114A32628N1271n167J8411p963m762m6044r506K0116m9645l7170j3955N1310
10102I9524O1469p76J9775o834k0576L498k0522J0325l1429j5758K3327o2538
10090E9485l8860j9721m3502K6271R0123L9563j6818q172L7674M1543L427Q385
$$ y = [108628, 80517, 122440, 177937, 164396, 122262, 116684, 105310, 99433, 99604, 125238, 80071, 72558, 66172, 82039, 78553, 130533, 175494, 101866, 59680, 61854, 48975, 17181, 87050, 109457, 142711, 129895, 113520, 116094, 83043, 40301, 36257, 758, 19489, 44680, 25957, 23697, 4421, 8737, 68144, 137967, 99382, 113582, 127203, 122150, 86518, 80170, 89308, 130855, 156787, 164136, 186703, 92927, 16904, 48207, 107487, 166692, 167291, 177932, 134113, 132628, 183899, 178732, 197143, 189180, 184418, 138374, 128868, 148984, 99339, 62169, 48214, 99524, 160993, 160217, 179992, 173158, 152582, 156080, 135558, 145883, 114454, 98696, 122023, 59485, 20625, 904, -42598, -16327, 73796, 113359, 96541, 88369, 126043, 167586, 171013, 179398]
10078A79398o900M0424o197m3331K2898J4851o9773m4572O551j5958L1099Q0259
10066A88749J1836Q000l2539m4407p436n131j4967N061n892M3757J267J9337k294
10053A65341j2049o300m1606N58K5052l0802l9108j4537O4650M0052n747l925
10041A41579J8577M777L0634l1388K2872l650o9532K4444J6477L4394K0167M8464
10029B57815q420n5637o2767n697K6980l443R970m1979J6237m228k1004k4982
10017H2845N3183N5506l6139l6858l5619O0733J0692k7493J3591m000l4326J0315
10005A12430l448L3921M3145k1446m4474k2095L4704J300K7526M6034N640n6272
9993A56965l7818R036q697L5982J3670p686M3814J5455n6966j8060L7682j6514
$$ y = [179398, 172498, 212922, 206725, 163394, 186292, 201143, 131370, 86798, 93349, 77391, 108490, 188749, 200585, 208585, 176046, 131639, 124203, 119072, 104105, 109166, 103274, 147031, 148298, 167635, 165341, 153292, 146992, 105386, 105944, 130996, 100194, 61086, 46549, 111199, 151251, 145504, 141579, 160156, 164933, 195567, 164179, 187051, 183401, 113869, 138313, 154790, 189184, 209351, 257815, 249395, 193758, 130991, 125294, 152274, 148831, 158801, 116822, 133059, 128831, 107827, 82845, 136028, 191534, 155395, 118537, 82918, 143651, 154343, 126850, 140441, 136441, 102115, 112430, 108982, 142903, 186048, 164602, 120128, 98033, 132737, 134037, 161563, 207597, 213237, 156965, 119147, 128183, 119486, 155468, 169138, 161452, 205266, 220721, 163755, 145695, 183377, 166863]
9981A66863P052L6772P3450o154j5749J8495o0933L077K8670k895p9805q229r902
9968A50712K7489N0831k2328n4687J6397K2290M4408O5574K4699p557N471P676
9956C30975n7611n2173L5988M3410m3757k8851N536K2091n1587o7265k1171R844
9944A25429J7311L5908Q694K2998L3525M1671k7512j1810l1161n120Q3515Kk9464
9931B63986j9937M5477M5154m742P445O634k4852m0349J9992N5018O1364j9648
9919C95542m9955N752J607p187L1034Q878K2098M4721k3014j3298K8156j486J3313
9906D56161O127J3875k6172k1298J9245l2923J7378J0623L2135M0665R7093Q263
9894F21172m6582L329L9010J3881j2099J02J9842K0359n3972q287K1886K0508
$$ y = [166863, 173915, 210687, 284137, 277983, 262234, 280729, 219796, 222873, 251543, 248648, 168843, 160614, 150712, 178201, 229032, 206704, 152017, 168414, 190704, 235112, 300686, 325385, 317828, 323299, 330975, 273364, 221191, 257179, 300589, 256832, 227981, 233517, 255608, 204021, 136756, 115585, 125429, 142740, 178648, 187342, 210340, 243865, 285536, 258024, 246214, 215053, 209933, 293448, 293450, 263986, 244049, 289526, 334680, 329938, 337383, 344017, 319165, 278816, 298808, 353826, 415190, 395542, 345587, 351339, 352946, 345759, 376793, 385671, 407769, 452490, 429476, 416178, 444334, 442848, 456161, 462288, 476163, 449991, 428693, 447938, 415015, 432393, 443016, 475151, 515816, 612909, 621172, 574590, 577919, 616929, 630810, 618711, 618813, 638655, 659014, 605042, 596755, 618641, 639149]
9882F39149N897J0582j3179J1153L5970J6098M0034J1392j183K3627M008K063
9870G85611L0627l8276j3646M0423L374K8134N8422L0312K9014J8973j9981M7480
9858A000467M034Q378l6711O143Q1016L9769O550O7528N4110J0563K8368j890
9846A268325n355l5713L8237Q1754L9624N3000L69j5058N0108O3012P9814O786
9834A624903N0252L7585M9401K4045N7819L6928L4607J07482P0518M8329M0113
9823B181982L1092R3282M9227J18240J00845j368N0385R9921P9224Q9470R6277
9812B988577J44621J31773J08781J06406J36855O6870K2082J11686J76779J24340
9802D118770R5250J61705J35913J42332J98533J52120J86410K06928K29182K22143
$$ y = [639149, 645046, 655628, 642449, 653602, 689572, 705670, 745704, 757096, 755913, 779540, 783548, 785611, 816238, 777962, 764316, 804739, 808113, 836247, 894669, 924981, 953995, 972968, 952987, 1000467, 1004501, 1012879, 976168, 982311, 1063327, 1103096, 1109646, 1177174, 1231284, 1241847, 1270215, 1268325, 1262970, 1227257, 1265494, 1347248, 1386872, 1439872, 1440241, 1425183, 1475291, 1538303, 1618117, 1624903, 1675155, 1712740, 1762141, 1786186, 1844005, 1880933, 1915540, 2023022, 2093540, 2141869, 2181982, 2213074, 2306356, 2355583, 2473823, 2574668, 2573300, 2623685, 2723606, 2802830, 2892300, 2988577, 3133198, 3264971, 3373752, 3480158, 3617013, 3683883, 3705965, 3817651, 3994430, 4118770, 4214020, 4375725, 4511638, 4653970, 4852503, 5004623, 5191033, 5397961, 5627143, 5849286]
9792E849286K63522L20577L18883K91309L42251L92360M53885M82602N56568P56449
9782A0027692R34625J194482J513037K081916K892442L680947M391305M252403
9774C0968849L068189M33821n200207p906563n504005k988371j731580j037101
9766A0103032o84971n16869m64469l73359k87204k48683k24084j58566j38508
9757G006319j46483j16582j62470j15473j29460j09699r8590m3503q9161j04261
9747E890637j67456k34399j79188j77647j26825p8649j62272j27652k59742k88619
9737D088188j44510j28047j34242j15965j01857j08981j53731j18298o2960o6177
9727B953420p5087j27987j55967l4229r8832j49921l0343j3481m2601J3518k6631
$$ y = [5849286, 6112808, 6433385, 6752268, 7043577, 7385828, 7778188, 8232073, 8714675, 9271243, 10027692, 10962317, 12156799, 13669836, 15751752, 18644194, 22325141, 26716446, 30968849, 34037038, 34470859, 29270652, 21364089, 15860084, 12871713, 11140133, 10103032, 9418061, 8901192, 8436723, 8063364, 7776160, 7527477, 7303393, 7144827, 7006319, 6859836, 6743254, 6580784, 6465311, 6335851, 6226152, 6127562, 6084059, 5994898, 5890637, 5723181, 5488782, 5309594, 5131947, 5005122, 4926473, 4764201, 4636549, 4376807, 4088188, 3943678, 3815631, 3681389, 3565424, 3463567, 3354586, 3200855, 3082557, 3019597, 2953420, 2878333, 2750346, 2594379, 2560150, 2461318, 2311397, 2281054, 2267573, 2224972, 2238490, 2211859]
9716B211859n8559j17153j34966q4398k8066j6611m2073l8896J936l1271j31924
9705A529878n5038n7851m9404k6230j5274J8353n947q0873l0701p192k4582l3500
9693A161639n8879J6304N613n8295q1404P029O617n7244j8492j4576R560m1200
9681H76672k5674n474k0011n0720K8362L933o2237m3995m7109k8700K4399K2521
9669F71967k1135P995J4937o872n5291K1114j9062k3415k6096j4638J5339n4494
9657E10349k9425m779k3643p0019J7372K2124M8178K0880n1627k9984l4082k4118
9645C51226q651P877L976J4878L051m8314r402J0941J2201M386O4202k0036j7572
9632C68763m8660l9334n0139J2446L1166j1766l5327j8241k246m1137Q911N1929
$$ y = [2211859, 2153300, 2036147, 1901181, 1816783, 1788717, 1772106, 1730033, 1691137, 1693073, 1661802, 1529878, 1474840, 1416989, 1367585, 1341355, 1326081, 1344434, 1338487, 1257614, 1226913, 1219721, 1195139, 1161639, 1102760, 1119064, 1124677, 1066382, 984978, 992007, 998624, 941380, 922888, 908312, 917872, 876672, 850998, 845524, 825513, 774793, 803155, 807088, 744851, 700856, 653747, 625047, 649446, 671967, 650832, 658827, 673764, 666892, 611601, 632715, 613653, 590238, 564142, 549504, 564843, 510349, 480924, 476145, 452502, 382483, 399855, 421979, 470157, 491037, 439410, 409426, 375344, 351226, 342575, 350452, 354428, 369306, 372357, 324043, 314641, 325582, 337783, 342169, 406371, 386335, 368763, 320103, 280769, 230630, 243076, 274242, 262476, 227149, 208908, 206662, 165525, 174436, 226365]
9620B26365O5720J1488J7407L6105m4481n7001k4436Q554L374L7606N0880L0310
9608C61891j1654m2357k6647L2194l3557n6985k0246J9498j7934O1191M1427m2546
9596B64275j4914j2733J2740J6678K6746k043m0941j5877k5849K5784L5465R678
9584B79009o8054l5935l5875N0420K7195o496K7440l066l9160l87j9387l4924
9572A40780o2276j4663M2072M3360M2698K7293K8429o3844k0236k295m7166J7347
9560A31499K5434L5614L910K5531m3468n0166O657L7395Q104O8428J09844l288
9548C55494j01757m6641n1512o3773k3023K2908L0351m7070k4971J833j1393l6726
9536C720J8229P3955K1477m3749j988P1604K2399J4271j2271k66j5023k1162j337
$$ y = [226365, 292085, 303573, 320980, 357085, 312604, 255603, 231167, 239721, 243095, 280701, 331581, 361891, 350237, 307880, 281233, 313427, 279870, 222885, 202639, 222137, 204203, 265394, 306821, 264275, 249361, 236628, 249368, 266046, 292792, 290749, 249808, 233931, 208082, 233866, 269331, 279009, 210955, 175020, 139145, 189565, 216760, 210264, 237704, 234638, 195478, 195091, 175704, 140780, 78504, 63841, 105913, 149273, 191971, 219264, 247693, 183849, 163613, 161318, 114152, 131499, 156933, 192547, 196457, 221988, 178520, 128354, 135011, 172406, 180510, 248938, 358782, 355494, 253737, 207096, 155584, 91811, 68788, 91696, 122047, 74977, 50006, 51839, 40446, 3720, 21949, 95904, 117381, 73632, 71644, 143248, 165647, 179918, 167647, 167381, 152358, 131196, 129859]
9523A29859k0199K596J9411K4426l740m1029N017M9382j8133k774j074l7820K5686
9510A31608J0764l7066n2422l1153J2537r221K8926j266N2570O5166L825r836
9498A64432l1212k5697L9515L361l5671k6438J6449K5369m2169J7663l091m8279
9486E4232M4319K7555k8080k4180M7421p163l2023l7668m1400J4800M9865j3054
9474E4624P393j1013j3539m664O743K2727N414r79N2668j049o0857J0225K5229
9461I2922r278n1367k653M3911K6232k0717n9365J181P0235K6666j8543j7851
9449H1373j9168m3672J8783J4214k3813m710K9551J2660O152O664j3929L6841
9437A00946P914q71o3111l0960Q3441Q9507K8980J0544l7388l8661l541k3262
$$ y = [129859, 109660, 112256, 131667, 156093, 152353, 111324, 116341, 165723, 147590, 144816, 143742, 105922, 131608, 142372, 105306, 52884, 21731, 34268, 25047, 53973, 52707, 105277, 170443, 174268, 164432, 133220, 107523, 147038, 150399, 114728, 88290, 104739, 130108, 87939, 105602, 102511, 54232, 98551, 126106, 98026, 73846, 121267, 114104, 82081, 44413, 3013, 17813, 67678, 54624, 62017, 51004, 37465, 32801, 39544, 62271, 67685, 66706, 119374, 118325, 57468, 67693, 92922, 83644, 32277, 29624, 73535, 99767, 79050, 19685, 20866, 91101, 117767, 99224, 81373, 62205, 18533, 37316, 51530, 27717, 23007, 52558, 65218, 71370, 78034, 64105, 100946, 108860, 107989, 44878, 13918, 97359, 186866, 215846, 226390, 189002, 150341, 146800, 123538]
9425A23538l8105K848K1200M096l3320r240J7901l8330q046J6744k473R249j5986
9412E0076k548n1353j9003J0000l376K0872K7013J2133M682J6656k5805j4270
9400B5077j2841M8010O8246K5131r909m8168J0605j7075j7815o1515k6685J7713
9388G74k1539k1233Q380K841K9447N6921K1381n38l894j1879n6688o5377L144
9375e8260J69o7M73K9532O3140J7741l498o558N2705P328k8868M6138j9356r300
9361I1319k432o5839l5170p722k1181J7862P4126J017K261K5407M9940J6197k5210
9348A20575l814L4489Q084R123k0j2522J4473N926L1631k1968n040j0727n9340
9335A10870q2555n1268k2207J8549j912k183j3355N9153k0155O2127J51j4993
$$ y = [123538, 85433, 88281, 109481, 113577, 80257, 71017, 88918, 50588, 42542, 59286, 56813, 66062, 50076, 47528, -3825, -22828, -12828, -16204, 4668, 31681, 43814, 48496, 65152, 39347, 25077, 12236, 60246, 128492, 153623, 143714, 95546, 106151, 89076, 71261, 9746, -16939, 774, -20765, -41998, -33618, -30777, -1330, 55591, 76972, 76434, 72540, 60661, 3973, -61404, -58260, -58091, -58158, -57685, -28153, 34987, 52728, 49230, 42672, 95377, 102705, 73837, 119975, 100619, 91319, 88887, 23048, -12122, -19844, -41025, -23163, 50963, 51980, 54241, 79648, 129588, 145785, 120575, 116761, 151250, 159334, 168457, 168437, 155915, 170388, 176314, 207945, 185977, 180937, 170210, 110870, 28315, -22953, -45160, -26611, -28523, -30706, -44061, 15092, -5063, 57064, 57215, 42222]
9323D2222l1832p339r649k0644l3058K0087R8155N8011M1812M9070k6463j03499
9311G6873m4721J4591M5640J6210j6973J9180L2059n276m3210k0309l660O497
9299G6901L135p6370j2568J5666k5695k4439J8029L5527L2884J9327J8834j5355
9287F5876m4225l004N647P171K5205K0778k8855k0758J2085P534K8145k1282K1775
9274G6092J3371K4450R183n7965k1392j5726L0088L3197J2701k0092k8363l9867
9262A5677n6996J2737j3075k0390Q708K549K6172N0326J490l602R742l6003L4153
9249C1488j629m9448N4165N0992M1200k4494r1993k1636P3327P201l2070K5495
9237F2598K2838K3696m073n3754m8097J2102K3687M7622j0502l2611k2380K6978
$$ y = [42222, 10390, 3051, -6598, -27242, -60300, -40213, 57942, 115953, 157765, 206835, 180372, 76873, 32152, 46743, 92383, 108593, 91620, 110800, 142859, 137583, 94373, 74064, 70404, 76901, 80036, 3666, -8902, 6764, -18931, -43370, -25341, 10186, 43070, 62397, 81231, 65876, 21651, 18647, 24294, 31465, 56670, 77448, 48593, 27835, 39920, 47454, 75599, 54317, 76092, 89463, 113913, 123096, 65131, 43739, 28013, 58101, 91298, 103999, 83907, 55544, 15677, -41319, -28582, -41657, -62047, -53339, -50790, -24618, 25708, 27198, 23596, 33338, -2665, 31488, 29859, -19589, 34576, 85568, 126768, 102274, 10281, -11355, 61972, 69173, 37103, 62598, 85436, 109132, 105059, 51305, 3208, 15310, 38997, 86619, 76117, 43506, 21126, 48104]
9225D8104L874M145m68n0949N602l1490q0407m0690N2495N3141M2493L3142J1092
9212E0084m6308q1785M3267K3959k4268k620J515K3614M8685J973p867l9823j7057
9199b6631J0103M4901J1055O541M484p9812m0350l360K2209N5901L9657J3795
9187E8493J7956n9428m5576M4275L3075l6526l3128L395O5610R238m7170j4155
9175c941j9404K8079O7079J9801k8402k9640k5028q701K4819L1122k473k0541
9163C2770j4172K6628j857k3800M1976J3199l6077k8656K7027K3418j1854J0130
9151E8732r974k3164j025q58R900k770n849k5135q721j4915j4877k8882K3742
9138d3796J6485m4657K3876L1382P5201J0259j1631J2343K6926L262n58j7920
$$ y = [48104, 51978, 56123, 55655, 4706, 10308, -21182, -101589, -142279, -89784, -36643, 5850, 38992, 50084, 3776, -78009, -34742, -10783, -35051, -37671, -36156, -12542, 36143, 38116, 30249, -9574, -26631, -16528, 28373, 39428, 45969, 50453, -29359, -69709, -73069, -50860, 5041, 44698, 58493, 76449, 17021, -28555, 15720, 48795, 12269, -20859, -17464, 48146, 57384, 10214, -3941, -23345, 4734, 71813, 91614, 63212, 33572, 8544, -157, 24662, 55784, 53311, 32770, 18598, 45226, 43369, 19569, 61545, 74744, 38667, 10011, 37038, 60456, 48602, 58732, 48758, 25594, 24569, 23711, 33611, 30841, 24992, -143, -8864, -23779, -38656, -67538, -43796, -27311, -71968, -48092, -16710, 58491, 68750, 57119, 69462, 96388, 99650, 99092, 81172]
9126H1172k9137L1501O0075P078l3111l0035q423k3295l0625k3560J8591P877
9114B8108n3741j9311K8970J6676m225K8707P520l9134k1624k6323J5251n157
9102d4283r135N7362K6213n137k1718J6131J491J6989j0045k5796j1611p08M45
9089i802L9130j3192l4364M0704P4555P455p0218j5960j6021k3723O3392L3973
9077G5929J0382q761k476l3472K2330M543k8151o1621N1427O6599N9078l3012
9065A22795m5858L3175L8376q2529k0517M5585P0423R184p4882j3136j8010j4151
9053E0455k9528j7143M1163O9269n8698q6375q41L1028N093L0459Q2680n8535
9041E9027m7260m8039R851L885q8116K1358N9112l19M088Q1879J1783j2861L4930
$$ y = [81172, 52035, 83536, 143611, 150689, 117578, 87543, 79120, 55825, 25200, 1640, 20231, 28108, -25633, -44944, -15974, 702, -3523, 25184, 32704, -6430, -28054, -54377, -39126, -44283, -53418, 3944, 30157, 25020, 3302, 19433, 20924, 37913, 27868, 2072, -9539, -10247, -9802, 29328, 16136, -18228, 22476, 97031, 104486, 34268, 18308, 2287, -21436, 41956, 75929, 86311, 77550, 75074, 41602, 63932, 68475, 40324, -21297, 30130, 96729, 155807, 122795, 76937, 110112, 148488, 65959, 45442, 91027, 161450, 170634, 95752, 82616, 64606, 50455, 20927, 3784, 44947, 114216, 55518, -30857, -31698, -670, 4423, 34882, 117562, 59027, 11767, -36272, -26421, -22536, -110652, -89294, -30182, -30501, -26413, 55466, 67249, 54388, 89318]
9028H9318r800k4119k2659l0108J1408J9244n0560k8119j0010M2712J482k7912
9016c9123J5479J6199L7457Q339j3774p5199j6009K3543m813O277O0387K7788
9004D6551J4564L2362k5024j1326L0461L1748p5185k9229P3913L9444j6097l0284
8992H1898L4383K0710O106J0288m0664l0667R803m8979j3504N987l7208m998O0999
8979E4154J8566l7794j9n1323m0142m022K615k952P8769O5340k6652N5026q860
8966A02706j00541K8964L1699k6123K5705Q949l3782m9808O8357p365l6836J1890
8954B3815l5692K9965L6793k994l904L2629L8765K755j4562J1795j023r620k3158
8941H5564j710n2504l2201l1413L0767k6309k2763O012K3623K2940l461J8829
$$ y = [89318, 79518, 55399, 32740, 2632, 14040, 33284, -17276, -45395, -55405, -12693, -11211, -39123, -23644, -7445, 30012, 38351, 24577, -50622, -66631, -43088, -47901, -41624, 18763, 46551, 61115, 93477, 68453, 57127, 87588, 119336, 44151, 14922, 88835, 128279, 112182, 81898, 116281, 136991, 143097, 153385, 112721, 82054, 91857, 42878, 29374, 35361, -1847, -6845, 54154, 72720, 34926, 34907, -16416, -56558, -60580, -57965, -60917, 17852, 83192, 56540, 111566, 102706, 2165, 31129, 62828, 36705, 62410, 71359, 37577, -12231, 56126, 48761, 11925, 23815, -11877, 18088, 54881, 51887, 47983, 80612, 119377, 122132, 107570, 119365, 118342, 108722, 85564, 83854, 31350, -851, -32264, -1497, -27806, -50569, -44557, -20934, 2006, -1455, 17374]
8929A7374J9490J4110O227R767J746n2328k8538L5027k2923r5320O545K6073J8031
8916d4719K0095o3824j0716Q4514J10577K4394n5527k2773J0673K8299J7232P617
8904A05842n855o5853m9435J4304P8126r211p3786K5524P8666L3316k0479l7464
8892G3695j2373J291p505j0549K6369j5081k7636k3713L3260l9403L4528k924
8880B9959k8919j2516k6615k6519K1350N9651l9598p4715l3247O4977R7316O1164
8868I2288q40j8702n7642Q617J2695J1019R478n1992n0707l5112P6053J53778
8856A48933R0473L5670L0550k7052n3712p9827q1525n5759j2277J4635k4371l4587
8844d8849J034J2523n979L4451M6845J1758J5349L6791K128j9697l150J7512k6501
$$ y = [17374, 36864, 50974, 57201, 66968, 68714, 16386, -12152, 22875, -48, -95368, -88823, -62750, -44719, -24624, -88448, -99164, -14650, 95927, 120321, 64794, 42021, 52694, 80993, 98225, 105842, 99987, 34134, -15301, -997, 77129, 67918, -5868, 19656, 98322, 131638, 111159, 73695, 61322, 62613, 55108, 44559, 70928, 55847, 28211, 4498, 37758, -1645, 32883, 29959, 1040, -11476, -38091, -64610, -43260, 16391, -23207, -97922, -131169, -66192, 31124, 92288, 91448, 72746, 15104, 23721, 36416, 47435, 56913, 4921, -45786, -80898, -4845, 148933, 239406, 275076, 305626, 278574, 224862, 145035, 63510, 7751, -4526, 10109, -14262, -48849, -47815, -35292, -41271, -6820, 40025, 51783, 67132, 103923, 106051, 86354, 83204, 100716, 74215]
8831G4215N142l1345r264R942m6261l7542o234K8049J3914K4691m7397q661K4262
8818f489k3522j7377O3195M0467o2005m5490J0168L1256N9993o200j0639k6758
8806F599p3330M7459Q1477j6099o0813K6345n287l029M8014l0838m0690K3665
8794C473M2117K2836j2835k6489o9905j3983N5027K0507l428k9358k7298N4107
8782A4771l2783l1722O4828L1136k1602l3980K9577O8612J98o1795l3083r082
8770a4925l3968n101M2637N2840J2624J6284m0815K7789j708k2927m6569m7686
8758f1525j6408j861L0381m496O000k315J2317K5274j437M0686n233l3516K901
8745i232M9228L9720j8213j8679k8640J4328O0563o6096l4559J7824j6835j7851
$$ y = [74215, 79357, 48012, 38748, 48690, 2429, -35113, -41347, -13298, 616, 25307, -22090, -30751, -6489, -30011, -47388, 15807, 56274, -5731, -51221, -41053, -9797, 50196, 43996, 33357, 6599, -66731, -19272, 62205, 46106, -14707, 11638, 6351, 3322, 51336, 20498, -20192, 3473, 45590, 68426, 55591, 29102, -40803, -54786, 241, 20748, 17320, -12038, -39336, 14771, -18012, -49734, 15094, 46230, 24628, -9352, 20225, 88837, 89035, 27240, -5843, -14925, -48893, -53994, -11357, 41483, 54107, 70391, 29576, 57365, 55657, 32730, -13839, -61525, -77933, -79794, -49413, -53909, -47909, -50224, -37907, -12633, -14070, 26616, 21383, -12133, -9232, 39996, 79716, 61503, 42824, 14184, 28512, 89075, 22979, -11580, 6244, -10591, -28442]
8733b8442k1137L6102M2468L3512K3119k6284r3786k1226J8602l7328M260P7266
8721G126J6805n9891R084P708r587J1209M5386K875j8079R812O172L897m1123
8708h606l2543K4508N0717J2398L285k8040l995l3318k1216L3391r282l722o2485
8695g8908m9808L8160J24179J0026k8228M9147M5608k8571l4256n388l2547K419
8683A1833K365r273J8688j6822K6858k044K079K0628J0962l9248J1140K951k435
8670C7682K5571j1556m7339l2334k7205j3485m4426M8475R0853K8068l6165L1067
8658D9206j4404k1254r616n1565K9436N6709k2991k8512j1079N0305L9194J9412
8646H4841K6210l3488j9832O002J1890M427l1564K1296J301m1893l6278J4398
$$ y = [-28442, -49579, -13477, 28991, 62503, 85622, 59338, -34448, -55674, -37072, -74400, -70140, 7126, 23931, -35960, -26876, -19168, -28755, -17546, 27840, 30715, 12636, 22448, 28620, 32517, -8606, -41149, -16641, 34076, 46474, 49759, 21719, 17724, -15594, -36810, -3419, -12701, -16423, -78908, -128716, -90556, 33623, 43649, 15421, 64568, 110176, 81605, 47349, 41961, 9414, 11833, 14198, 4925, 23613, 6791, 33649, 31605, 33684, 54312, 65274, 26026, 37166, 40117, 37682, 63253, 51697, 4358, -27976, -55181, -68666, -113092, -64617, 26236, 54304, 18139, 49206, 34802, 13548, 3932, -47633, -18197, 38512, 15521, -12991, -24070, 26235, 65429, 84841, 111051, 77563, 57731, 63733, 75623, 80050, 48486, 69782, 71083, 29190, -7088, 7310]
8634G310k8661K1312O0825K2151l2910j8601j7611L2646K537j6927j789L7007
8622F7289J0459L9929m7396n7510m1171q575K5840L3752l4090j6757O802J832
8610a9596K274J6563O4026k314l2545p443M786N5240L6880n2868m6868O003J6274
8597D0412J4114L0524M1083k2582M5562l2043k4575m6235l490k9281N9648L1846
8585A04983p5004l5949k78k4231L6659M1395L9959k6642n825J1642p645L0419
8573H9483J5539o5324k1677J1969J2997j1424j258N404n001j8179k7492m4799
8561e9762Q474L1729O1613L2813p361n7594r640K3747J497K1536J6945N5950J9375
8548A39322o7297q557N1904k7530l5484R569k6591r057j2470k4185O146j4124
$$ y = [7310, -21351, -39, 60786, 82937, 50027, 31426, 13815, 46461, 48998, 32071, 30282, 67289, 77748, 117677, 70281, 12771, -28400, -36975, -11135, 22617, -11473, -28230, -21428, -19596, -17322, -759, 63267, 60953, 28408, 20965, 25751, 80991, 117871, 65003, 18135, 24138, 40412, 54526, 85050, 126133, 103551, 149113, 117070, 92495, 46260, 42770, 13489, 73137, 104983, 29979, -5970, -6248, -30479, 6180, 47575, 87534, 60892, 55067, 66709, 59064, 89483, 105022, 39698, 18021, 29990, 42987, 31563, 30305, 35709, 30708, 12529, -14963, -59762, -51288, -19559, 42054, 74867, 67506, 9912, 272, 24019, 25516, 47052, 63997, 119947, 139322, 72025, 63468, 115372, 87842, 52358, 61927, 35336, 26279, 13809, -10376, -4230, -18354]
8536a8354L07K7846l7198k3641j8786l4527L9979Q3712J7984m9973j8190M239
8524b6602L500L7942M163k0669m7936q303O738J0351n2496J3789L3883R834q091
8511d3897J947j4526N2617L4624l3777K6047L5826K0375J7620M2934m4499n9088
8499C6203m610M2406L5182m6760m6951l1598N28M9440J1285m9507l1833m0100
8487g6315r678K7259K8118K871j6865n169L187J0772O1531L2331P663j9249j8167
8474B8289m616M4119M5118m8055P09l3614m6984J6583N8476m9099m8143L0567
8462f650L1540N886K462J8765Q049l1719l5283l8806k6794p1546J9414R0276R1187
8449E6781J3749m0281j2819k0217m0166j8074n7715P4049O4893L9385O045k5793
$$ y = [-18354, -18047, 9799, -27399, -51040, -69826, -104353, -64374, 19338, 37322, -12651, -30841, -26602, -23102, 14840, 19003, -1666, -49602, -57905, -51167, -40816, -93312, -79523, -45640, -35806, -43897, -41950, -56476, -3859, 30765, -3012, 23035, 58861, 79236, 96856, 139790, 95291, 36203, 31593, 73999, 109181, 62421, 15470, -16128, -15600, 33840, 45125, -4382, -36215, -76315, -85993, -58734, -30616, -27745, -44610, -49779, -46592, -35820, 25711, 58042, 65705, 46456, 28289, 23673, 67792, 112910, 64855, 65564, 31950, -15034, 1549, 60025, 10926, -37217, -6650, 24890, 30776, 33238, 52003, 60052, 28333, -6950, -45756, -72550, -144096, -124682, -34406, 56781, 70530, 30249, 17430, -2787, -42953, -61027, -118742, -44693, 20200, 59585, 65630, 39837]
8437C9837o1425M4051K0505j2072Q737N527J353J1994L814m9735J6220Q852J6481
8424E4139J6962m7501q8377j1766K7364L7964M8091k2735m430J6999J2789J8674
8412E8173l8697j9634M571l3043l457j8856l3123J1981O7305J9315K766l9255
8400b1954R986J5117L1667M3535m0274l9391j7626N1798L1155l0128J1633J2175
8388E7693j8141n3763j5942j1176n0398J8627N0469L2K2488N976j5804R638l8636
8375c8937L8664l4485k1518K5309m573k7471j7201k895m4q110j4779J834J07336
8362C130K0011k1445l4352j8172K148K072P651l6032J4514M1574L2843j7289O666
8349C319k9489l1080P82J2588L1986O2129K2801m5196m0655J5749j6854P236P5636
$$ y = [39837, -21588, 22463, 42968, 30896, 39633, 45160, 46513, 58507, 62321, 12586, 28806, 37658, 54139, 71101, 23600, -64777, -76543, -49179, -11215, 36876, 14141, 9711, 26710, 39499, 58173, 19476, -158, 4413, -28630, -32087, -50943, -84066, -72085, -4780, 14535, 17301, -21954, -11968, 3149, 34816, 78351, 38077, -1314, -18940, 32858, 64013, 33885, 45518, 57693, 39552, -14211, -30153, -41329, -91727, -73100, -22631, -22599, -111, 5865, -9939, -301, -38937, -273, -34758, -56276, -30967, -35540, -63011, -80212, -83107, -83151, -91261, -106040, -104206, 3130, 23141, 1696, -32656, -50828, -48680, -46608, -38957, -74989, -60475, -18901, 13942, -3347, 3319, -26170, -57250, -56468, -43880, -11894, 50235, 73036, 27840, -12815, 2934, -13920, -6684, 68952]
8336F8952K5786p340l6900k4755k9383M6822j4109j7018n050j7762m176l9998
8324e4931L5252k797j6139j1625J1004N668P857P383m908n431r63K984K655L3654
8310I663J5372j3591K239m556K2200J5601n827N6543N2216k7015n698R165K737
8297A29049K3967o686p7333n2640j2159l0546j0596l6321M8040K3705J6264l322
8285A1422m2251q917K3195j8616K1996J3036r290j5700k1321J1995L7693L7175
8273D0417L7764L7281l1084r1674m7089M8608j1991l7923J0192K2215k4559j7846
8261f5689p704j205K5688K4917l0107L4607L9387m4555o6449j2835N9181L9575
8249e189l2981l1824J9695M9139k113j1510j6857j727M0841l1063l0064j751K9050
$$ y = [68952, 94738, 87398, 50498, 25743, -3640, 43182, 29073, 12055, 7005, -10757, -14933, -54931, -19679, -22476, -38615, -50240, -39236, -33568, -25711, -18328, -23236, -28667, -29630, -26646, -23991, 9663, 25035, 11444, 13683, 9127, 31327, 46928, 41101, 97644, 149860, 122845, 117147, 126312, 129049, 153016, 146330, 68997, 16357, 4198, -26348, -36944, -73265, -25225, -1520, 14744, 11422, -30829, -39746, -16551, -35167, -13171, -135, -9425, -25125, -46446, -34451, 3242, 40417, 78181, 115462, 84378, -7296, -54385, -5777, -17768, -55691, -45499, -23284, -47843, -65689, -73393, -74598, -48910, -23993, -54100, -19493, 19894, -24661, -91110, -103945, -44764, -5189, -38170, -69994, -50299, -1160, -3273, -14783, -31640, -33367, 7474, -23589, -53653, -55404, -26354]
8236b6354L0590k7194L8864Q6007M8066N1183L648n130M5359J8408O4205P4344
8224D01996J07367L3281q847l7746o3754j01587q3718j2987o6623p7860m1857
8213D7665K8131J4652j7531l1404K535j0579K6744j3740M0555L1037O3551o6204
8201A15412j8270k2214j9028j3381P899N0763K2464M3304m437K3570N030L506
8189A94618M3755M9041N3163O990n036P1311K4210o2362q485r3656o8760p0085
8177A34704l4982n06l39m697l6563l2941K5880L5623m375o1990j7069Q515Q248
8164A9508l0662L7961P214J3195J8482L0625k6388k4695R605J5450K6359k4569
8152G2085K2830l71n8686k8079l8550j7418N1049j7322n5946K0937K6506J9143
$$ y = [-26354, 4236, -22958, 15906, 101913, 149979, 201162, 204810, 199680, 245039, 263447, 327652, 401996, 509363, 542644, 533797, 496051, 432297, 330710, 246992, 234005, 167382, 89522, 47665, 75796, 90448, 72917, 41513, 44048, 33469, 60213, 46473, 87028, 118065, 181616, 115412, 97142, 74928, 55900, 42519, 50418, 101181, 123645, 166949, 162512, 186082, 191112, 194618, 238373, 287414, 340577, 347567, 342531, 413842, 438052, 375690, 367205, 273549, 204789, 134704, 99722, 99216, 98877, 94180, 57617, 24676, 50556, 86179, 81804, 19814, 2745, 11260, 19508, -11154, 26807, 34021, 47216, 65698, 96323, 69935, 45240, 54845, 70295, 96654, 72085, 94915, 94544, 35858, 7779, -30771, -48189, 2860, -14462, -70408, -49471, -22965, -3822]
8140c822J9048K8000k9828k9111O602o9235l5845J3721M1280O307l3425j8226
8128a04534P22K0032q124l0348K6924K9943K6888J2931O0447p446j7495R847n6528
8115c6741n2032o325q140P4378J00981j4867j10322n8319L5057M2181M0338L3890
8103D0079M8062k7446j1164L513k3196l7428o3414m4045j6710M6024K7618N2064
8091f043N9144J6303j6233k8452m434r553j2879J3514k3290K523J0438j5248L2722
8078A8512R805J0765k3300m3704M2396j0678m2623k3552p7145n1449L5404P1870
8066h3699K0626K0917N4134J2364J1302J5415M050k5162j5971k5314l3913M7417
8054B166k5531K0174j394o4855J4996K3260K2969L4970K4228j7322M198L6040
$$ y = [-3822, 15226, 43226, 13398, -15713, -9111, -78346, -114191, -100470, -59190, -52883, -86308, -104534, -103812, -83780, -91904, -122252, -95328, -65385, -38497, -25566, 34881, 27435, 9940, 19787, -36741, -88773, -95098, -103238, -28860, 72121, 57254, -53068, -111387, -76330, -34149, 6189, 40079, 88141, 60695, 49531, 53044, 29848, -7580, -70994, -115039, -131749, -85725, -58107, -6043, 53101, 69404, 53171, 24719, 20285, 10732, -2147, 11367, -11923, -9400, 1038, -14210, 18512, 28317, 39082, 15782, -27922, 14474, 3796, -38827, -62379, -139524, -190973, -155569, -83699, -63073, -42156, 11978, 24342, 35644, 51059, 55109, 29947, 13976, -11338, -45251, 2166, -23365, -3191, -4585, -69440, -54444, -31184, -8215, 26755, 50983, 33661, 37859, 73899]
8042G3899k8942k1852l1372O266J6131k2946m2837k6382M2316J00J8337J6899
8030c83L0441P67J4643Q41k5091n3395L0785J8798P405j1373k4936k6314J1031
8017b6781O7600K8713q454o1760j8203r547M587J2083o816O322P822K0238j6657
8004h53j5550l230k3647N600M6699K2579j5066L8498M5355K7161k6845l0402n014
7991F5285l2781r430l6553J2702K8916n5820l6955O581l813J5698O9019O3818
7979H6667n4744p900M4344j5563K1224P823K0530m5648m8126l9447j5454J7309
7967b8985Q0651K240m0060J7907L8047k8189M5112J668J675L374k939k1741k3021
7954D5739J9315M5567j1023r743o10K4170l1655J5364j8046k8411j0572P032k4958
$$ y = [73899, 44957, 23105, -8267, -2001, 14130, -8816, -51653, -78035, -35719, -35619, -17282, -383, 30058, 30825, 45468, 46309, 21218, -32177, -1392, 17406, 24811, 13438, -11498, -37812, -26781, 40819, 69532, 61078, -682, -18885, -28432, -23845, -11762, -18578, -12256, -4434, 15804, -853, -16403, -19633, -43280, -37680, 9019, 31598, 16532, 55030, 100385, 127546, 100701, 70299, 65285, 32504, 23074, -13479, -777, 28139, -27681, -64636, -58055, -61868, -46170, 22849, 86667, 31923, 24023, 68367, 52804, 74028, 81851, 102381, 56733, 8607, -30840, -46294, -28985, 51666, 53906, 13846, 31753, 69800, 41611, 86723, 88391, 90066, 93440, 90501, 68760, 45739, 65054, 110621, 99598, 89855, 89245, 113415, 81760, 97124, 79078, 50667, 40095, 47127, 22169]
7941B2169p301l2810r132k9701J8485M4821K2751j4131K8629K4460p863J0085
7929G0462J3680m2000l078L6200k0067m5605L136k4473L842N7965K095n391M098
7916E0864j8417j3319k6509L905M2110j8111l1772R111L0225K2257L9290k9219
7904F0415j0495K4689j9778M270K4339l7371l8062L5078M1241o587j2297j0052
7892E5390k6918l7205k5363O5242N0009l1415n6186k0098K4756K1812J0462m365
7880B6121K6142l005k4967k4957N3546L0103n0174o3525K2898r629j6586M7506
7868A3473M2648j3049j3306K7983q288J9956M6752j9652o9701j5024K3043m5445
7856a0610p861J642n7108K1094L7218l0123j5737N0479j3816m2793J4118O4377
$$ y = [22169, 14868, -17942, -27074, -56775, -38290, 6531, 29282, 15151, 43780, 68240, 60377, 70462, 84142, 42142, 39064, 75264, 55197, 9592, 12728, -11745, -7903, 50062, 52157, 46766, 50864, 32447, 19128, -7381, -3476, 38634, 20523, -11249, -2138, 28087, 50344, 89634, 60415, 49920, 74609, 54831, 59101, 83440, 46069, 8007, 43085, 84326, 77739, 65442, 55390, 28472, -8733, -34096, 31146, 81155, 49740, -6446, -26544, -1788, 20024, 30486, 26121, 52263, 49258, 24291, -666, 52880, 82983, 32809, -30716, -7818, -17447, -34033, 13473, 56121, 43072, 29766, 57749, 49461, 69417, 116169, 96517, 26816, 11792, 34835, -10610, -18471, -16829, -73937, -52843, -15625, -45748, -61485, -11006, -24822, -67615, -53497, 10880]
7844A0880L4014l6027R786J7699K9443k8830l1867Q187j1685J1384P779J6362
7832C7125M0296p115q708K9909K1228k6962j615j4950l5460j8023k6339m1166
7820e1780q949L100j1430L3466J7044J6452L4552j179m5619j1337J389L768J747
7807a8776j3218j4747l1551O5465L9297K2573M1026l8561o7874n5126l2912M3016
7795f1388O693J510M0626L3437J2158j4511k4838K2821K7354j4809l822j1232
7783A3999K4376L0098q3090o3796m001L6641M5907J2202k6273k2851P841J6166
7771a2781K5577K8225K2481m166p406L48R700O514q8773J2195K4154l4917j9854
7758c8703m9251j7804O7421K3294K907p2849J9092N9092k3078j0269Q516n5963
$$ y = [10880, 44894, 8867, 18653, 36352, 65795, 36965, 5098, 13285, 1600, 12984, 20763, 37125, 77421, 70306, 61598, 91507, 112735, 85773, 84158, 69208, 33748, 15725, -10614, -51780, -60729, -57629, -69059, -35593, -18549, -2097, 32455, 31276, -14343, -25680, -24291, -20523, -18776, -31994, -46741, -78292, -12827, 26470, 49043, 90069, 51508, -16366, -71492, -104404, -61388, -54695, -53185, -12559, 20878, 33036, 18525, -6313, 16508, 43862, 29053, 25231, 13999, 38375, 68473, -14617, -78413, -82414, -45773, 134, 12336, -13937, -36788, -28947, -12781, 12796, 41021, 63502, 59336, 51930, 52278, 61978, 68492, -20281, -8086, 16068, -18849, -38703, -87954, -105758, -38337, -15043, -12136, -84985, -65893, -6801, -29879, -40148, -31632, -87595]
7746h7595K0355R6834L6933o5545m4382O567N795j7886O3743J6566J1889o6402
7734b3128j9563M9770O617j7006k5508j6857J0531j3430p4641j7427P9472O7888
7722F718L6107l7575q811P898m1630m7649J0723L1100r713j2941J0009j0078l3065
7709i8907j0849K0847N2576J3517j432L6054r874j7104M7479L5628j6669l8959
7697A2307j7790j9124L4621J3340j4817J8796J8054J0458p2281j1964l0978M5623
7685a3755L7257j7909O87j1472l022k1015j731o283j5159m4748k4775P7340L491
7672d1094j538K9731J7509K3998J3838q3024n7720Q420O1567N3215O214n4864
7660b3748j3014O672n1492J9461L1639k0079o351M3102J8537l5254J4693N092
$$ y = [-87595, -67240, 29594, 66527, 982, -43400, -36833, -31038, -48924, 14819, 31385, 43274, -23128, -42691, 7079, 13696, -3310, -28818, -45675, -35144, -48574, -123215, -140642, -61170, 6718, 42825, 5250, -3561, 4337, -37293, -84942, -74219, -43119, -52832, -65773, -55764, -65842, -98907, -109756, -88909, -36333, -22816, -24248, 11806, 1932, -15172, 32307, 67935, 51266, 12307, -5483, -24607, 10014, 23354, 8537, 27333, 45387, 55845, -16436, -28400, -59378, -13755, 23502, 5593, 6280, -5192, -8214, -29229, -30960, -37243, -52402, -97150, -121925, -44585, -41094, -42632, -12901, 4608, 28606, 42444, -40580, -98300, -89880, -28313, 24902, 31116, -23748, -36762, -30090, -81582, -62121, -30482, -50561, -56912, -13810, 4727, -30527, -15834, -10742]
7648a0742M4845j764N8642j8611n6611j9891j1878J7339K6030M179n2709l1795
7636e2966o811k61j5676M3474J2886p5217l2043Q4637J1923n435K7174j344p050
7623a6709K5432j5616r72k3200k458R553M1274L3902n2267j4863Q856o2779n8392
7610a28239M4169M369q244L3767M1607k1156j376K9621r724N632k1030J188R120
7597b0296K7723L4223j4746l1928k9408k7831M0628M7922l4872o4056r449j1390
7585i3480K3986P7273K8309o7014k0168l9544k0571O3744N3394K6902o127R458
7573C6162j3737o028m971m598N6516K397k6151n371Q495l0134n355j2888K5099
7560A9436K594n2897l5398K6890K2491q5670n5860K1683Q8737J5676m1423j3254
$$ y = [-10742, 34103, 32339, 90981, 72370, 15759, -4132, -16010, 1329, 27359, 31538, -21171, -52966, -59777, -60038, -75714, -32240, -19354, -94571, -126614, -41977, -30054, -35489, -8315, -9659, -16709, 8723, -6893, -7865, -31065, -33523, -23970, 17304, 51206, -1061, -15924, -7068, -69847, -128239, -84070, -79701, -87945, -54178, -12571, -33727, -35103, -5482, -15206, -9574, -30604, -29416, -20296, 7427, 41650, 26904, -5024, -34432, -62263, -21635, 26287, -8585, -72641, -82090, -93480, -69494, 7779, 36088, -30926, -51094, -90638, -111209, -47465, 5929, 32831, 26704, 36162, 22425, 16397, 11426, 6828, 63344, 65741, 39590, 34219, 42714, 12580, 7225, -5663, 19436, 22030, -30867, -66265, -39375, -16884, -102554, -158414, -136731, -47994, -32318, -73741, -86995]
7548h6995j0274K9386M131L9677J5989N6083K8558o0580j6880L0803J4685k2756
7536B1827L7772P878o0267k5744k336k480m4262J5334L8002J5699j7968l2500
7524d9045K30M5304K6007L2342m5141j1612M0198l0227j5368l7699R391j4928
7512e0548o223k7853m8244N0449K0191K4863m4358K327K6447n4521l2182N6759
7500h2893N2253n113M312K7394N060j1935L77M2110K3720K1744l7943o819j9498
7487A2769m756M8115n140q1259m5947R405Q2114q421q088k2684O671j5216k6615
7474e9052k9901K8818J0377N7588L1478Q749j7207l1354K2830r852p4936m8546
7462a11008O1845O7111J8199p5064n7242Q834K7923M8421l063m1165j6441L2514
$$ y = [-86995, -97269, -67883, -63752, -24075, -8086, 47997, 76555, 15975, -905, 29898, 44583, 21827, 59599, 67477, 7210, -18534, -20870, -23350, -67612, -52278, -14276, 1423, -16545, -49045, -48815, -3511, 22496, 54838, 9697, -1915, 38283, 8056, -7312, -45011, -35620, -50548, -56771, -84624, -132868, -82419, -62228, -37365, -81723, -79396, -52949, -107470, -139652, -82893, -30640, -35753, -31441, -4047, 1013, -10922, -10545, 31565, 55285, 77029, 39086, 32267, 12769, 8013, 56128, 50988, -30271, -76218, -66813, 15301, 6880, -1208, -23892, -17221, -32437, -59052, -88953, -60135, -49758, 7830, 39308, 48057, 30850, -504, 22326, 12474, -62462, -111008, -49163, 17948, 36147, -38917, -96159, -87325, -59402, -10981, -14044, -55209, -71650, -39136]
7450c9136n97l8303p1055j6986K4734P8128L3161o790l2245O8862J5046j6950
7438b131J1104k8959k0713r778J268L4271k9888J5561k5869l6434J1497O017K4649
7425d9405M346k1681J4017K6872R1015j691k8388o32o319j8096l2369j5942l862
7412d2135J5238M0944J3106l9484k9117L1326J6785K0625K5491J170m6612m1580
7400c4243r524l5616l3510M4438J0249J435K0998j8750J9627L1802K4376k0232
7388A050n956M268n7632J9872L922j9203j0120Q533L1399O67K3158m1457m4145
7375h5644J3120L1558J1199l2914J6918k7692r338K267M7937J6467n2687R31L7467
7362c0411J8231m020J8607J3719j0287p2315j5384K9350O9159j589m2742J6469
$$ y = [-39136, -39733, -78036, -149091, -166077, -141343, -63215, -30054, -36844, -69089, -227, 14819, -2131, 8973, -19986, -40699, -50477, -49209, -14938, -44826, -29265, -55134, -91568, -80071, -74054, -49405, -45059, -66740, -52723, -25851, 65164, 63473, 35085, 34453, 28134, 10038, -22331, -38273, -42135, -26897, 14047, 27153, -12331, -41448, -10122, 6663, 27288, 52779, 53949, 7337, -34243, -43767, -79383, -112893, -68455, -58206, -56771, -35773, -54523, -34896, -3094, 21282, 1050, -4906, -638, -58270, -38398, -34476, -53679, -63799, -55266, -23867, -23200, -42, -41499, -85644, -72524, -40966, -29767, -62681, -45763, -73455, -82793, -80526, -32589, -16122, -68809, -67878, -30411, -12180, -16200, 2407, 16126, 5839, -66476, -81860, -52510, 16649, 15060, -27682, -11213]
7350a1213M6074N0579o008j3655o3655k5733j67j2148L1637N3515L1700k9620
7338E1306n5930q5087l6941O3959O7903j6170p3282J0826N9892M5022J3670j4125
7326C1043l1571l0081n7479k5204L4606L2846L316j633r473j7457k6378o626J0646
7313i3445j0097J9615L1023M1713k2371o7063M7742M2832m7805j1915j2026k6013
7301a07810k8037L4930m5715K9170P3119j9005m4352O9628Q5519N4378M7755Q321
7289A57901j5886l0580p4382l5420J2413j9847n8728j5801L2158N8880L1866L1562
7277G4136J223l5892K8444k0139m9564K2546K9350k6974m0864M175j0339K0500
7265c398J6237J544j1092k8899K0103p100J1954L8161K2828K3019L2905k8021
$$ y = [-11213, 34861, 85440, 79432, 65777, 2122, -23611, -23778, -35926, -4289, 49226, 80926, 51306, -4624, -89711, -126652, -62693, 5210, -10960, -84242, -73416, -13524, 31498, 45168, 31043, -528, -30609, -88088, -113292, -78686, -45840, -42524, -44157, -53630, -71087, -97465, -104091, -93445, -103542, -83927, -52904, -11191, -33562, -100625, -52883, -10051, -57856, -69771, -81797, -107810, -135847, -100917, -146632, -117462, -44343, -63348, -107700, -38072, 47447, 101825, 149580, 157901, 142015, 111435, 37053, 1633, 14046, -5801, -64529, -80330, -48172, 10708, 42574, 74136, 75359, 39467, 67911, 47772, -1792, 20754, 50104, 23130, -17734, -13559, -23898, -3398, 12839, 14383, 3291, -25608, -5505, -12605, -651, 37510, 60338, 83357, 116262, 88241]
7253H8241l9944k6396j7725j9975L6972J9433K3578j6222j8792P908J3667j1559
7241C9186o7574K1230O8194r659j9555m0l8716j7020J382J4039k6653k5843N925
7228e5104o008M2704j9473J416M1349M8781k0031q7140N683P6402K2539l5399
7216A5719m8143M059M3419J5040m511L9757L5687K1234m2762n5874k4314N5570
7204E4881n796k3465n7494l5506L3814J2113J8691J7537K8939M133r7897j5688
7192f5738J4943m2221K4357N1151l8607m0581J6629L1628k101J4065P2647L8938
7180G5110Q421O020n1769j8512M7233K5254m3883L915J0971l3170n1532K9686
7168G744L6013N119J1693k612n8489l525M7531J7342j8751l6257l9719O93M0035
$$ y = [88241, 48297, 21901, 4176, -15799, 21173, 40606, 64184, 47962, 29170, 37078, 50745, 39186, -28388, -7158, 61036, 51377, 31822, 31782, -6934, -23954, -22572, -8533, -35186, -61029, -55104, -61112, -18408, -37881, -36465, 4884, 53665, 33634, -53506, -47823, 28579, 51118, 15719, -32424, -28365, 15054, 30094, 25583, 65340, 101027, 122261, 79499, 23625, -689, 54881, 49085, 25620, -31874, -67380, -33566, -21453, -2762, 14775, 43714, 47847, -50050, -65738, -50795, -93016, -68659, -17508, -56115, -96696, -80067, -48439, -50540, -36475, 36172, 75110, 83531, 89551, 37782, 19270, 66503, 91757, 47874, 51789, 62760, 29590, -21942, 7744, 43757, 48876, 60569, 57957, -532, -4057, 43474, 60816, 42065, 5808, -33911, -33218, 6817]
7155F817Q080l7351m2743K0345J1823j5811m728O2085K1913J780O493m9329k1962
7142c2588r872L0096M566J9156K9287k1168j3378K816J8810o2368j00570O257
7130a28956N9134L9453k4458j6146L5348k618N2177L4309p4763k9792k0572k1327
7118i8211Q878n579J3087K732l492o683K2488L7800P900r722Q116N9972j8606
7105A8680j4257M199j8352o594N3642j9202l6377k0118q875R082J2564k0923k3363
7092f9894N078k2080N685k2442K7834K1853M8515j45K3242N25K1040l2479m2286
7079c5554n936M1752J0031l1488K481L1497j6955J2618n2889k1897l962R473j8707
7066g9536l5486L0216J2893p006J9352K7318M7406k2254k0166K1542K0562n8044
$$ y = [6817, 14897, -22454, -65197, -44852, -33029, -48840, -53568, 8517, 30430, 32210, 38703, -10626, -32588, -42460, -12364, -7798, 11358, 40645, 19477, 6099, 8915, 27725, -34643, -135213, -128956, -69822, -30369, -54827, -70973, -35625, -38243, 13934, 48243, -26520, -56312, -76884, -98211, -89333, -94912, -81825, -79093, -82585, -89268, -66780, -28980, -21080, -30802, -22686, 37286, 18680, 4423, 8622, -9730, -16324, 37318, 18116, -18261, -38379, -47254, -38172, -25608, -46531, -69894, -64816, -86896, -81211, -103653, -75819, -53966, -5451, -5596, 17646, 18171, 39211, 6732, -35554, -41490, 262, 10293, -21195, -18714, 12783, -4172, 8446, -44443, -66340, -70302, -60829, -79536, -115022, -84806, -71913, -78919, -59567, -32249, 15157, -7097, -27263, -5721, 14841, -43203]
7054d3203L4159J0828L2931L758n976O4402o4304m8073N035J3209J2905J7075
7042C2746J8739k0917j9187j8978K8137j2529p6799m5634L0470K6673M2794J3699
7030g86L0256k209m8309l0040K9287r759j3402r009k7432q671Q3772K3512K8308
7017D5518L0277m9337o0714K8345L8108L0175R9M421m0564m7393k6011l477L5830
7004a4723M6637J3962l3996P205J2325L027j3596n5014m962J2454j6670J7756
6992b5595k8404k17J0598O3329J3966M2695j9340J0788m0891l9766k157J9537
6980D543l7074J2040J0066j4563J7179J7475o644o2409n7538L0643n1471j6619
6968a54372K9396N0261Q9305O1905K3576j3834o2928j2070K3801j4992N1533q144
$$ y = [-43203, -9044, 1784, 34715, 38473, 32497, 96899, 32595, -15478, -10443, 2766, 15671, 32746, 51485, 30568, 11381, -7597, 20540, 8011, -68788, -114422, -83952, -57279, -14485, -786, 29470, 27261, -21048, -51088, -21801, -31560, -44962, -53971, -81403, -90074, -6302, 17210, 45518, 75795, 26458, -34256, -5911, 32197, 62372, 62471, 66892, 26328, -21065, -47076, -50553, -14723, 31914, 45876, 11880, 19085, 31410, 34437, 20841, -34173, -39135, -26681, -43351, -25595, -53999, -54216, -43618, 19711, 33677, 76372, 57032, 67820, 26929, -12837, -14994, 4543, -32531, -20491, -10425, -24988, -7809, 9666, 3022, -59387, -116925, -86282, -137753, -154372, -124976, -74715, 14590, 76495, 100071, 86237, 23309, 11239, 35040, 20048, 71581, 63437]
6956F3437l1200m2284j5042N777L2431O0546j3369p9751k3063N1344L5995m0499
6944D322M326m640j8523l7645J0278N1605l8527l6020k3511K9738O4906L1113
6932C7422Q935k1442l2480J2500L5233j3246m2526j277L8651k6245k3103j7027
6920d4605k7440J3942J8330n5801p862M0696M4594J1522L767M6924j8960K2043
6908D7150L4794k3063p2974m107j7946l0348N9537j2155n8418K2252J1833J7574
6896b5871L208K0340k2319K7016N6167q232o098l5837p6859m2439K1832J5601
6884g3491K2022M7883K0268P776j3454l1992K4703J3033l0410j0559l3438k2328
6872g9987O1463O7534l1238l3358K7977J2579l921k1668p0883m8861j2475J4712
$$ y = [63437, 32237, -10047, -25089, -19312, 13119, 73665, 60296, -19455, -42518, 8826, 44821, 4322, 8648, 4008, -14515, -52160, -41882, 9723, -28804, -64824, -88335, -58597, 6309, 37422, 46357, 24915, -7565, 4935, 40168, 26922, -15604, -16881, 21770, -4475, -27578, -44605, -72045, -58103, -39773, -95574, -103436, -62740, -18146, -6624, -2857, 44067, 25107, 47150, 81944, 58881, -14093, -18200, -36146, -66494, -6957, -19112, -77530, -55278, -43445, -25871, -22663, -2323, -24642, 2374, 58541, 50309, 44211, 8374, -68485, -110924, -89092, -73491, -51469, -3586, 16682, 24458, 11004, -20988, 3715, 16748, -13662, -24221, -57659, -79987, -18524, 49010, 17772, -15586, 12391, 24970, 21049, -619, -71502, -120363, -132838, -118126]
6860a18126K1250l6093J5674K1625J6733Q8439l6775K7462M5771q8359m2671k0403
6848a05473J0239L1837J4291M090K276k6893Q868K4389L2034N1310j4454k6752
6836E762L2270j8206k7418J6942L1764j5124j4770k3568J6616L9798J4750l9756
6824A9060l8158j1740M6229m659l4099K8458j2576m0472j6962L4758L6433J2897
6812A9169j8141p1565l4292K4264M3361o192k6363J8203L7602L8642j5310P996
6800A7374j4695j7747m7604L044L1139r135m7106J0513M7002K9960M5952k4334
6788B4363m1282q716M822P517J1120J7912L563J2737L4148K8604n8745n4656j1846
6775c0459r778L5811l8962k0232j7730k3823k4711M4848K6339j0634Q84k9323
$$ y = [-118126, -96876, -132969, -117295, -95670, -78937, 9502, -27273, 189, 45960, -42399, -85070, -105473, -95234, -63397, -49106, -45016, -42740, -69633, -60765, -36376, -4342, 46968, 32514, 5762, 38032, 19826, -7592, 9350, 41114, 25990, 11220, -12348, 4268, 44066, 58816, 19060, -19098, -30838, 15391, 10732, -23367, 5091, -7485, -47957, -64919, -30161, 6272, 19169, 1028, -70537, -104829, -80565, -37204, -43396, -69759, -51556, -13954, 24688, 9378, 17374, 2679, -15068, -62672, -59628, -28489, -37624, -84730, -74217, -27215, 2745, 48697, 24363, -16919, -25635, -20813, -13296, -2176, 15736, 19299, 32036, 66184, 94788, 36043, -18613, -30459, -40237, -4426, -43388, -63620, -81350, -105173, -129884, -85036, -58697, -69331, -68447, -97770]
6763i7770J9351K5343Q495R926K968J3397n9442n6854k7837J6937L5121Q5692
6751b4673L9727Q533N929J4652o291l1506j6528m2825n2012O6168O2068K4262
6739D7504j7190p357o479K4156M9221n0639q7237m4042j9170j5170M9907N6864
6727a9632j3291J606j8873K7298L6621k9458n1896O82M9503M730j1595O299N3630
6714C5624K9769r528j4830l1975K3799K6609j7578j0541k4610k8212k1711N675
6702c7509K9152J1707p335l8264l7558j6021L0431L2936j8112m5117o897K679
6690i9908L8801L3831K830m8479P4493M1830l1564l1810j4123M2815K1930L8865
6678F9511j7480m5945j018m0930n0355O1093P0016J5290n3481l0693j0894j5569
$$ y = [-97770, -78419, -53076, -44581, -34655, -31687, -18290, -77732, -134586, -162423, -145486, -110365, -24673, 15054, 23587, 29516, 44168, 37877, 6371, -10157, -52982, -104994, -38826, 23242, 47504, 30314, 22957, 16478, 40634, 89855, 39216, -48021, -92063, -111233, -126403, -76496, -19632, -32923, -31317, -50190, -22892, 13729, -15729, -67625, -66943, -17440, -12710, -24305, -18006, 35624, 65393, 55865, 41035, 9060, 32859, 59468, 41890, 31349, 6739, -21473, -43184, -37509, -8357, 3350, -3985, -42249, -79807, -95828, -65397, -32461, -50573, -95690, -102587, -99908, -61107, -27276, -24446, -72925, 1568, 43398, 11834, -19976, -34099, 8716, 30646, 69511, 52031, 6086, 5068, -35862, -86217, -25124, 44892, 60182, 6701, -23992, -34886, -50455]
6666e0455M4960M1220k0351p838l1622j1948J3896l3391Q885k236r047j1593k518
6653g2038K5408j09m583j732K0255K9753K7077J2781K1611l4296j1475q680K1109
6640B5081M634K2887j6479k9549m373M6401k0814r9175k7014L4756M0222j4494
6628c7917M041L9598O020K7091j6138m3368L6346N4162L7149k3468l9020k5354
6616A9142k5040m0862O74K7693K186m7746K561N5710n179K6811l8110K275M5977
6603B6092L0351l0941L7641L33J2096l7822q2429M5669P4736j2519p7183o4841
6591g8817L9619M0998L8366K4465K9707p8016p6472o5318L3490L4486M4580L5421
6579B2509J8591l8261l8151l946M0263O303n2756J8052Q4300J2965R890m8511
$$ y = [-50455, -5495, 35725, 15374, 7536, -24086, -36034, -22138, -55529, -46644, -48880, -57927, -69520, -72038, -46630, -46739, -51322, -53054, -32799, -3046, 24031, 36812, 58423, 24127, 12652, 3972, 25081, 29715, 52602, 36123, 6574, 2201, 48602, 27788, -71387, -98401, -63645, -23423, -37917, -33876, 5722, 11742, 38833, 22695, -20673, 15673, 69835, 106984, 83516, 44496, 19142, -5898, -46760, -46086, -18393, -16207, -63953, -61392, -5682, -10861, 15950, -22160, -19885, 26092, 56443, 25502, 63143, 63476, 75572, 37750, -44679, 990, 75726, 63207, -13976, -78817, -39198, 1800, 40166, 64631, 94338, 16322, -60150, -125468, -91978, -57492, -12912, 22509, 41100, 2839, -35312, -39258, 1005, 7308, -45448, -27396, 56904, 69869, 79759, 31248]
6567C1248J6544L7780n435o5545M6500J3038o5317p492k1956q379k6909m8160
6555a04083Q483p961j2545N5429M3731l254N2859J4379l9732k7441o7440n6218
6543a43793M7483L6185m3211n607L0163O3035j7610n442k5940K6311K9521m2528
6531e1433K0696K9788K1652N2628K6699k8071n4642p3963j5519K0508k8531p7346
6519a57534L9079Q4411J2904j3359k7988n1780O018R4954J4954l2273k7052l0988
6507h8654J6503L5621K2239j0360m1230l3027J7170k582N2452K8279l3389o7437
6495a04415l8630M3522j1370K5164j9052l9882L2929M6785K3288J4280O6010J8548
6483E7177M9563J8650n8736M07J3168k2752m2516l0647l584J0089k9474J1371
$$ y = [31248, 47792, 85572, 80137, 14592, 61092, 74130, 8813, 1321, -20635, -29014, -55923, -104083, -95600, -103561, -116106, -60677, -16946, -20200, 32659, 47038, 7306, -20135, -87575, -143793, -96310, -60125, -103336, -108943, -78780, -15745, -33355, -38797, -64737, -38426, -8905, -51433, -30737, -949, 20703, 73331, 100030, 71959, 17317, -56646, -72165, -51657, -80188, -157534, -118455, -34044, -21140, -34499, -62487, -114267, -108249, -13295, 1659, -30614, -57666, -88654, -72151, -36530, -14291, -24651, -65881, -98908, -81738, -84320, -31868, -3589, -36978, -104415, -143045, -99523, -110893, -85729, -104781, -144663, -111734, -64949, -41661, -27381, 38629, 57177, 106740, 125390, 66654, 67061, 80229, 57477, 14961, -15686, -19270, -9181, -38655, -27284]
6471b7284P932p9104O097O7734J9779l8959L4389M217K6269j6027q43M1757j1814
6458C4143j2898r780l4470l3334L454q855Q519J6351k2616K6176J5560l322n1310
6445g2382j6006r496K8310L5834l1634J6519P9313K2515m086k6631L5270O8909
6433A26435k8040m2345j094m5913l5370j2393N7069K0109k0366j3273N189J0615
6421B0623k1157L7066M7756k5149m3931l656k707M560o1218j9166K5164L3295
6409h520L2947J219l8453j4876L1242L2078q435l7738o3570m6601m2799N9433
6397a04073R856k0284k5256M8202N0090M7548J0210n0482m1103m1125j5999q507
6385a40923M2255M2927J415n079M6673M7097J4886k9738q515N0304m872p898M828
$$ y = [-27284, -19352, -98456, -92359, -24625, -4846, -43805, -9416, -5199, 21070, 5043, 4200, 45957, 34143, 21245, 11465, -23005, -56339, -52885, -61740, -53221, -36870, -59486, -33310, -17750, -21072, -72382, -88388, -97884, -69574, -33740, -65374, -48855, 30458, 52973, 48887, 22256, 57526, 126435, 98395, 56050, 54956, 9043, -26327, -38720, 18349, 38458, 18092, 4819, 10008, 20623, -534, 36532, 84288, 59139, 15208, 11552, 8845, 13405, -47813, -66979, -41815, -8520, 24427, 25646, -12807, -27683, 3559, 35637, 27202, -10536, -74106, -120707, -163506, -104073, -94217, -114501, -139757, -91555, -41465, 6083, 16293, -34189, -75292, -116417, -132416, -140923, -98668, -55741, -54326, -59405, -12732, 34365, 49251, 19513, 10998, 61302, 56430, 48532, 53360]
6372E3360J9423j5291J4770j3464k7151n0608M0955K0815J7277L1559j8663O345
6360G9327p246Q32k8636K2514l8880j9427k9344j2943k2958L1332M4402j4660
6348D313p73k4886k5833n6731R116P7232K7386O1890L8366k4354j9296j5905J6281
6335F6806m7541l417l9056l9866L6682M8672K8737j9263n1557J7669L2321n7483
6323b7296J7499M562J6564l2781m474J9791L6772K0154r772j8414N790k365j5202
6310A0828K6720k762k4293m0004l5028j8350j1054L1083P3281O5981n6738l2730
6298a3066l4483J8507L3389k6954j6349L2361J1855q561L7693K9897l9382k9682
6286d775K1389l8442m4299O791M3540k1032l294O1421k8277l1339J131n021k9590
$$ y = [53360, 72783, 57492, 72262, 58798, 31647, -18961, 21994, 42809, 60086, 91645, 72982, 79327, 72081, 72913, 44277, 66791, 27911, 8484, -20860, -33803, -56761, -25429, 18973, 4313, 3540, -21346, -47179, -103910, -94794, -17562, 9824, 71714, 110080, 85726, 66430, 50525, 66806, 19265, 15848, -23208, -63074, -26392, 22280, 51017, 31754, -19803, -2134, 30187, -27296, -9797, -5235, 11329, -21452, -25926, -6135, 30637, 50791, 41019, 22605, 28395, 26030, 10828, 37548, 34786, 10493, -29511, -64539, -82889, -93943, -62860, 10421, 76402, 19664, -13066, -47549, -29042, 4347, -22607, -38956, -6595, 5260, -3301, 34392, 64289, 24907, -4775, 16614, -21828, -66127, -59336, -15796, -36828, -40122, 21299, -6978, -38317, -37186, -42207, -71797]
6273g1797k09P5842P473n9545J5700k076J1001k3200j7943R041j169R13k4637
6260h0606J627N7500K758L9959r121M344K6295k4769l0756n676l5460l8m2125
6247i6068n9466R905M7188N9915K7802n7629j1629J2817r3j7073L8570K6565l2401
6234e1597j2536L3945k2742m9632l480L5072j0483J086K6898k1605j5345P7899
6222a2520J0377k1553l879J4254l000R276n1393j9853j679K8644M0490K1410r12
6209I662m4699l5590J4533j694q717L7154Q4J9878K4704K3343m0966j2315K1763
6196G140j2520l1269j279M4074L2120N393n110J8909J3532n624k4598M882m0923
6183D727j8387J0951l116J1794j850k0313k4167l6734O936N0239J2104k6182k2027
$$ y = [-71797, -72006, 3836, 11309, -48236, -32536, -34612, -23611, -46811, -64754, -55713, -56882, -55969, -80606, -78979, -21479, -18721, 21238, 12117, 16461, 42756, 17987, -12769, -18445, -53905, -53943, -96068, -155534, -145629, -98441, -38526, -10724, -68353, -79982, -67165, -67258, -84331, -45761, -19196, -51597, -64133, -30188, -52930, -102562, -106042, -70970, -81453, -80367, -53469, -75074, -90419, -12520, -2143, -23696, -27575, -13321, -16321, -7045, -58438, -78291, -79970, -51326, -10836, 10574, 9662, -35037, -70627, -56094, -57788, -66505, -29351, -29267, -9389, 15315, 38658, -2308, -14623, 7140, -5380, -36649, -37928, 6146, 38266, 43659, 38549, 57458, 70990, 65366, 40768, 45650, 4727, -13660, -2709, -5825, 5969, 4119, -16194, -40361, -77095, -70159, -19920, -7816, -33998, -56025]
6170e6025l666o455K9029J5782M5340J8561j330j6436J0743J0591n3747m5034
6158e2647k2251N140K452j8390l3937J4982O0249Q4401K5265n1410Q616J3417
6146C5887j4537j8067L1554K4154k474q1584K3254L2903l068j646K742o071R3845
6133A16892J1145q793p0907o5676l1873m2302N534j6330L806O0640K5852O9061
6121E7049J9717n0306l0349J6544K591j8722j2911K6693L728k5046N539m2026
6109d7499p560M647M9922K7695l6158J6484R10k7745q027p778J9897J1982l7897
6096d1127J7194N9246K1740J5052O628m1531j1313l0523k770j2551L454k7837
6084d4338n8498J5418j4780O5634O2643j6776o0798m8975L9108O818K0522K2624
$$ y = [-56025, -59691, -66146, -37117, -21335, 24005, 42566, 41236, 24800, 35543, 46134, -7613, -52647, -74898, -69758, -67306, -85696, -119633, -104651, -44402, 39999, 65264, 13854, 22470, 35887, 21350, 3283, 34837, 58991, 56517, -25067, -1813, 31090, 28022, 26376, 29118, 23047, 116892, 128037, 119244, 48337, -17339, -49212, -91514, -85980, -102310, -98504, -37864, -12012, 57049, 76766, 26460, -3889, 12655, 15246, -3476, -16387, 10306, 14034, -11012, -5473, -47499, -55059, -50412, -490, 27205, -8953, 7531, 8441, -19304, -27331, -35109, -15212, -3230, -41127, -23933, 35313, 57053, 72105, 78733, 37202, 25889, -4634, -7404, -19955, -16501, -44338, -102836, -87418, -102198, -36564, 26079, 9303, -51495, -100470, -61362, -54544, -34022, -11398]
6072a1398k0776J503M3470J2545J4162l1627l1818M0293j7440l3316j128k3584
6060e9114r899K165J2408j0987J3645J1580L1886M2796L5629K62L7120n821p4761
6047B6909m2981k4402l2838J5812J309L6474L8635j6086o1789l1832O2657j6888
6035d5020n544J7358K2188j2442k5105O1329L7417j1570l8509j0631K283J0769
6023B523l9058n4866j3524j6373J1244q236K9633O303L0109L7350r416N212J9112
6010A3K0903k700J0569K0806O4232K2339k4002j0157m0365m6546K7211k9680l1351
5997a8728N2911J1773k1247j8562L103K975M88l4179J7250q637k6927r184J1976
5984c6988J3701K0203p631o495J706K8918l5085l6677L066M2465L9775K3264n2878
$$ y = [-11398, -32174, -30671, 12799, 25344, 39506, 7879, -23939, 16354, -1086, -34402, -35530, -59114, -69013, -66848, -54440, -65427, -51782, -40202, -8316, 34480, 70109, 70371, 107491, 101670, 26909, -16072, -40474, -73312, -57500, -56191, -19717, 18918, 2832, -58957, -90789, -28132, -45020, -50564, -33206, -11018, -23460, -48565, 12764, 50181, 38611, 102, -10529, -8246, 2523, -36535, -91401, -104925, -121298, -110054, -118290, -88657, -82354, -52245, -14895, -24311, -19099, 13, 20916, 18216, 28785, 49591, 113823, 136162, 112160, 102003, 61638, 15092, 42303, 12623, -18728, 34183, 45956, 24709, 6147, 9250, 12225, 12713, -21466, -4216, -12853, -39780, -48964, -36988, -23287, -3084, -10715, -17210, -15504, 13414, -21671, -58348, -55282, -12817, 26958, 50222, -2656]
5971b656J146L7553P4072J0716r52k9919m9131j0314J9135k4839m7264J4503m1097
5958d9047l1531j0816Q6607R800L414k1441o5946L5189l1092o8567j3664O5850
5946i1244R9716O3564o1670r980L3214L9544J7534m9676j4177N5051k893l7262
5934D1721n0933K1209j3822N177j6598J386j9145j4274M7767L3623L638j2033
5922B7716m5619k0077K4452K9806j1819m6620l567M4011K0389K0562j8811O1719
5910H2142N1641j02010r3301k5558M453K001K37j8713M2569M5802L1029R744J5914
5897D5950l063n7118l5791j5426k2012m0188L4007K2306Q8994J6602K2677k525
5885E4413l1844k2289j809o012n7693L4250K0586l2500K0088K1268L0580p961
$$ y = [-2656, -1510, 36043, 110115, 120831, 119879, 89960, 40829, 30515, 49650, 24811, -22453, -7950, -49047, -80578, -91394, -4787, 5013, 8427, -13014, -78960, -43771, -74863, -143430, -157094, -91244, 8472, 72036, 10366, 386, 33600, 73144, 90678, 41002, 26825, 81876, 78983, 41721, -9212, 11997, -1825, 3352, -13246, -11860, -31005, -45279, 2488, 36111, 39749, 27716, -17903, -37980, -13528, 16278, 4459, -42161, -45728, -1717, 18672, 39234, 20423, 82142, 133783, 31773, -61528, -87086, -82633, -80632, -80395, -99108, -56539, -10737, 20292, 30036, 45950, 42887, -14231, -50022, -65448, -87460, -127648, -93641, -71335, 17659, 34261, 56938, 54413, 22569, 280, -1529, -7541, -65234, -30984, -10398, -42898, -22810, -1542, 29038, 21077]
5873B1077k6813M192L4207L3231m9845l0176N673m524K624J2402J6660l2682k6844
5860d0818K0823J6117K1717J1738l2085k8660M879J4060L2885k6310L570k0542
5848b2626k114K7887K4749p226j6760K1208L2703l4832n2000k7941J7710J8152
5836b1090R042l1961J4188m461J9470N92j0846Q295k4738j7781P601o1055o837
5823a19581j2678O4778J6383j1879M488L5543J9163Q850K7365j7654l441N670
5811A7007k9253L8200J5041m0884K628k6015l829J8547K5242k4951k224K1687
5799A1196k0201m4557K8934K697J008k3609J2733j5361K726K7280J0241k7802
5787c4715J9436r253k8941p3367K1733K7107L4730j205M5696j3525k021l5030
$$ y = [21077, -5736, -1544, 32663, 65894, 16049, -14127, -8454, -12978, -10354, 2048, 18708, -13974, -40818, -19995, -3878, 17839, 29577, -2508, -31168, -26289, -12229, 20656, -5654, -2084, -22626, -24740, 3147, 27896, 20670, 3910, 25118, 57821, 22989, -29011, -56952, -39242, -21090, -12048, -44009, -29821, -34282, -14812, -14220, -25066, -16771, -41509, -59290, -51689, -112744, -119581, -132259, -67481, -51098, -62977, -58489, -22946, -3783, 5067, 32432, 14778, 11337, 17007, -12246, 25954, 40995, 111, 2739, -23276, -27105, -8558, 16684, -8267, -10491, 11196, -9005, -53562, -24628, -21931, -20923, -44532, -31799, -47160, -44434, -17154, -6913, -34715, -15279, -24532, -53473, -126840, -105107, -78000, -43270, -44475, 1221, -12304, -14325, -49355]
5775d9355j6887M7679L6067j973J4850j054J2317J3115l0703k1499l1732q5931
5763a15106k9846K7276j8141L4460j2771K6130K6910L991n245N7847K2430m2738
5751b4803m2239o422p0057N906N5276J15336J8630K953k3899o9332o941L9854
5739e738m7115j8029K7289K6782k3242l2851K6620n775L527K5286l1672j0632
5727f5550O789n826j298J9441l405k3666o927K7568k3592o194O7891K5754p28
5714A0257q638l4890k9959J2677Q205k5075L4179Q3564K3893k2648l0707q143
5702A2715q514j8100j8880K2735j5985n3543k1917K2256k9652L5026M5750N9535
5690C1426J6510j3860M1705L2722j6525m9841j0814P326j0372m8821j2687j7668
$$ y = [-49355, -66242, -18563, 17504, 15531, 30381, 29327, 41644, 54759, 24056, 2557, -29175, -115106, -144952, -117676, -135817, -101357, -114128, -87998, -61088, -57097, -62342, -4495, 17935, -24803, -67042, -73464, -143521, -137615, -82339, 32997, 51627, 54580, 30681, -38651, -45592, -5738, -52853, -70882, -43593, -16811, -40053, -72904, -46284, -52059, -48532, -23246, -54918, -65550, -58761, -64587, -65885, -46444, -49849, -73515, -80442, -52874, -76466, -82660, -14769, 10985, 10257, 1619, -33271, -63230, -50553, -42348, -67423, -33244, 50320, 74213, 51565, 20858, 12715, 4201, -13899, -32779, -10044, -26029, -79572, -101489, -79233, -108885, -73859, -28109, 31426, 47936, 34076, 75781, 108503, 91978, 42137, 31323, 38649, 28277, -20544, -33231, -50899]
5678e0899k2938P030l0987m2616N3021N9810o631O1650L6283k3614m5840K1198
5666A5467Q225k5192k7711j6679K6538R179j7021K309N1096j4016k2980J2800
5654B015o223L6189M367J1404j0772q274O870m3578n294K4889N0944J0326m2153
5641C0710m701M039K7628j1918o4269l3045O922l4600K2571K4971K9708k6324
5629b8308j8585P335l3115L8622L6475J3066m9624k855K1869M084l1808J6308
5617b6536N770o757P319j9163L3225J9834K6942N9045p460J4145M2843m6798n2353
5604E0056n7228Q434J7335n5501L2861L3453K2376n2182J2787k7393p0315P941
5592g7376N3130K7873L7471L1842j8025n0286n1531M5911P3272P436n6342k6385
$$ y = [-50899, -73837, -66807, -97794, -140410, -87389, -27579, -34210, 27440, 63723, 40109, -5731, 15467, 23692, -1500, -29211, -45890, -19352, -10173, -27194, -24885, 26211, 12195, -10785, 2015, -4208, 31981, 36348, 47752, 36980, 28706, 35576, -8002, -13296, 11593, 62537, 72863, 30710, 26009, 30048, 57676, 45758, -18511, -51556, -44634, -79234, -56663, -31692, -1984, -28308, -46893, -39558, -72673, -34051, 2424, 15490, -34134, -36989, -15120, -11036, -42844, -26536, -20766, -27523, -20204, -39367, -6142, 13692, 40634, 99679, 92219, 106364, 149207, 102409, 50056, -7172, 1262, 18597, -36904, -4043, 29410, 51786, -396, 12391, -15002, -85317, -77376, -24246, 3627, 41098, 72940, 54915, 4629, -46902, -991, 72281, 79717, 23375, -3010]
5580c010j8684L2710M5674L4701l0683j4821m2729P111P071K5452K2633m8527
5568A6898n2997r849N1824J3975n6740N861J8717M240r444k3219J0680K474L2634
5555E054L407l3687l6538R198L3696Q840K0741n823Q650J1150J1925M9466j1937
5542G4142j599j4291k1255l6508K9836Q108J4200n764k7159l9651J0696K1474
5530A2229J7017k856p6077J2789p500K8199k4385J96o790K6842J3193j3420J9291
5517a272K8348j1455l9856K5249J7390j356m1704k1783j3252O4020n079k2380
$$ y = [-3010, -21694, 11016, 56690, 91391, 60708, 45887, 3158, 10269, 17340, 42792, 65425, 16898, -36099, -45948, 5876, 19851, -36889, -31028, -12311, -8071, -17515, -40734, -30054, -27580, 5054, 8461, -25226, -61764, -52566, -18870, -10030, 10711, 4888, 13538, 24688, 36613, 86079, 74142, 72543, 58252, 36997, 489, 30325, 38433, 52633, 46869, 19710, -19941, -9245, 12229, 29246, 26390, -49687, -36898, -44398, -16199, -40584, -40388, -47178, -20336, -7143, -20563, -1272, 27076, 15621, -24235, 1014, 18404, 17048, -24656, -46439, -59691, 4329, -750, -23130]
$$ [...]
##END NTUPLES=NMR SPECTRUM
##END=
