##TITLE=Analysis number 310493
Compound Code cc 42014
Book Reference 437/16
Chemist Name wendyb
##JCAMPDX= 6.0         $$ Bruker NMR JCAMP-DX V2.0
##DATA TYPE= NMR SPECTRUM
##DATA CLASS= NTUPLES
##ORIGIN= Bruker BioSpin GmbH
##OWNER= NMR
$$ XWIN-NMR		Version 3.5
$$ Mon Jun 20 11:34:25 2005 GMT Daylight Time (UT+1h)  MAYBRIDGE\NMR@NMR_250MHZ
##.OBSERVE FREQUENCY= 250.131544655141
##.OBSERVE NUCLEUS= ^1H
##.ACQUISITION MODE= SIMULTANEOUS (DQD)
##.ACQUISITION SCHEME= undefined
##.AVERAGES= 16
##.DIGITISER RES= 18
##SPECTROMETER/DATA SYSTEM= dpx250
##.PULSE SEQUENCE= zg30
##.SOLVENT NAME= CDCl3
##.SHIFT REFERENCE= (INTERNAL, CDCl3, 0, 16.522)
##AUDIT TRAIL= $$ (NUMBER, WHEN, WHO, WHERE, WHAT)
$$ ##TITLE= Audit trail, XWIN-NMR		Version 3.5
$$ ##JCAMPDX= 5.01
$$ ##ORIGIN= Bruker BioSpin GmbH
$$ ##OWNER= NMR
$$ C:\u/data/dgb/nmr/ADRS/4200/pdata/1/auditp.txt
$$ ##AUDIT TRAIL=  $$ (NUMBER, WHEN, WHO, WHERE, WHAT)
(   1,<2005-06-20 11:34:06.33 +100>,<MAYBRIDGE\NMR>,<NMR_250MHZ>,
      <created by zg, POWCHK disabled, PULCHK disabled
       configuration hash MD5:
       62 19 C7 07 E1 42 D1 B7 37 6C 3D D0 77 39 F9 E6
       data hash MD5: 64K
       E7 F4 B7 D4 D7 BF E9 D7 1B F5 25 85 F7 1B BA 81>)
(   2,<2005-06-20 11:34:17.80 +100>,<MAYBRIDGE\NMR>,<NMR_250MHZ>,
      <Start of raw data processing
       ef LB = 0.3 FT_mod = 6 PKNL = 1 SI = 32K 
       data hash MD5: 32K
       27 54 54 1E 1B FC BC 1B 13 AC AD CD 01 90 AC EC>)
(   3,<2005-06-20 11:34:19.41 +100>,<MAYBRIDGE\NMR>,<NMR_250MHZ>,
      <apk 
       data hash MD5: 32K
       53 47 BB B7 0F BA F2 99 66 33 B3 15 D4 60 E0 85>)
(   4,<2005-06-20 11:34:20.18 +100>,<MAYBRIDGE\NMR>,<NMR_250MHZ>,
      <abs ABSG = 5 
       data hash MD5: 32K
       90 A8 F8 83 08 CA DC AF 5F 2B BC 4A 88 22 2A ED>)
$$ ##END=
$$ 
$$ hash MD5
$$ B0 51 B7 72 5B 03 3B 12 0D EB C9 8F DC F7 CF 1B
##$RELAX= 
##$RELAX= 
##$RELAX= 
##$RELAX= 
##$RELAX= 
##$RELAX= 
##$RELAX= 
$$ Bruker specific parameters
$$ --------------------------
##$DU= <C:\u>
##$EXPNO= 4200
##$NAME= <ADRS>
##$PROCNO= 1
##$TYPE= <nmr>
##$USER= <dgb>
##$AMP= (0..31)
100 100 100 100 100 100 100 100 100 100 100 100 100 100 100 100 100 100 
100 100 100 100 100 100 100 100 100 100 100 100 100 100 
##$AQSEQ= 0
##$AQ_mod= 3
##$AUNM= <au_zg>
##$AUTOPOS= <1 >
##$BF1= 250.13
##$BF2= 250.13
##$BF3= 250.13
##$BF4= 250.13
##$BF5= 500.13
##$BF6= 500.13
##$BF7= 500.13
##$BF8= 500.13
##$BYTORDA= 1
##$CFDGTYP= 0
##$CFRGTYP= 5
##$CHEMSTR= <none>
##$CNST= (0..31)
1 1 145 1 1 1 1 1 1 1 1 1 1 1 1 1 1 1 1 1 1 1 1 1 1 1 1 1 1 1 1 1 
##$CPDPRG= <>
##$CPDPRG1= <>
##$CPDPRG2= <>
##$CPDPRG3= <>
##$CPDPRG4= <mlev>
##$CPDPRG5= <mlev>
##$CPDPRG6= <mlev>
##$CPDPRG7= <mlev>
##$CPDPRG8= <mlev>
##$CPDPRGB= <>
##$CPDPRGT= <>
##$D= (0..31)
0 1 0 0 0 0 0 0 0 0.06 0 0 0 0 0 0 0.0002 0 0 0 0 0 0 0 0 0 0 0 0 0 0 
0 
##$DATE= 1119263645
##$DBL= (0..7)
120 120 120 120 120 120 120 120 
##$DBP= (0..7)
150 150 150 150 150 150 150 150 
##$DBP07= 0
##$DBPNAM0= <>
##$DBPNAM1= <>
##$DBPNAM2= <>
$$ [...]
##$SUBNAM7= <"">
##$SUBNAM8= <"">
##$SUBNAM9= <"">
##$SW= 20.6930455092707
##$SWIBOX= (0..15)
0 0 3 0 0 0 0 0 0 0 0 0 0 0 0 0 
##$SW_h= 5175.983436853
##$TD= 65536
##$TD0= 1
##$TE= 294.16
##$TE2= 300
##$TE3= 300
##$TEG= 300
##$TL= (0..7)
0 120 120 120 120 120 120 120 
##$TP= (0..7)
150 150 150 150 150 150 150 150 
##$TP07= 0
##$TPNAME0= <>
##$TPNAME1= <>
##$TPNAME2= <>
##$TPNAME3= <>
##$TPNAME4= <>
##$TPNAME5= <>
##$TPNAME6= <>
##$TPNAME7= <>
##$TPOAL= (0..7)
0.5 0.5 0.5 0.5 0.5 0.5 0.5 0.5 
##$TPOFFS= (0..7)
0 0 0 0 0 0 0 0 
##$TUNHIN= 0
##$TUNHOUT= 0
##$TUNXOUT= 0
##$USERA1= <user>
##$USERA2= <user>
##$USERA3= <user>
##$USERA4= <user>
##$USERA5= <user>
##$V9= 5
##$VALIST= <valist>
##$VCLIST= <CCCCCCCCCCCCCCC>
##$VD= 0
##$VDLIST= <DDDDDDDDDDDDDDD>
##$VPLIST= <PPPPPPPPPPPPPPP>
##$VTLIST= <TTTTTTTTTTTTTTT>
##$WBST= 1024
##$WBSW= 4
##$XGAIN= (0..3)
0 0 0 0 
##$XL= 0
##$YL= 0
##$YMAX_a= 237708
##$YMIN_a= -371219
##$ZGOPTNS= <>
##$ZL1= 120
##$ZL2= 120
##$ZL3= 120
##$ZL4= 120
##$ABSF1= 16.522
##$ABSF2= -4.171173
##$ABSG= 5
##$ABSL= 3
##$ALPHA= 0
##$AQORDER= 0
##$ASSFAC= 0
##$ASSFACI= 0
##$ASSFACX= 0
##$ASSWID= 0
##$AUNMP= <proc_1d>
##$AZFE= 0.1
##$AZFW= 0.1
##$BCFW= 0
##$BC_mod= 0
##$BYTORDP= 0
##$COROFFS= 0
##$CY= 12.5
##$DATMOD= 1
##$DC= 0
##$DFILT= <>
##$DTYPP= 0
##$F1P= 14.0000005364418
##$F2P= -0.99999901652339
##$FCOR= 0.5
##$FTSIZE= 32768
##$FT_mod= 6
##$GAMMA= 0
##$GB= 0
##$INTBC= 1
##$INTSCL= 1
##$ISEN= 128
##$LB= 0.3
##$LEV0= 0
##$LPBIN= 0
##$MAXI= 10000
##$MC2= 0
##$MEAN= 0
##$ME_mod= 0
##$MI= 0
##$NCOEF= 0
##$NC_proc= -5
##$NLEV= 6
##$NOISF1= 0
##$NOISF2= 0
##$NSP= 0
##$NTH_PI= 0
##$NZP= 0
##$OFFSET= 16.522
##$PC= 1
##$PHC0= -70.84918
##$PHC1= 5.456129
##$PH_mod= 1
##$PKNL= yes
##$PPARMOD= 0
##$PSCAL= 4
##$PSIGN= 0
##$REVERSE= no
##$SF= 250.13
##$SI= 32768
##$SIGF1= 0
##$SIGF2= 0
##$SINO= 400
##$SIOLD= 32768
##$SREGLST= <1H.CDCl3>
##$SSB= 0
##$STSI= 32768
##$STSR= 0
##$SW_p= 5175.98343685301
##$SYMM= 0
##$S_DEV= 0
##$TDeff= 65536
##$TDoff= 0
##$TI= <Analysis number 999999
Compound Code 99
Book Reference 9
Project Code 9>
##$TILT= no
##$TM1= 0
##$TM2= 0
##$TOPLEV= 0
##$USERP1= <user>
##$USERP2= <user>
##$USERP3= <user>
##$USERP4= <user>
##$USERP5= <user>
##$WDW= 1
##$XDIM= 32768
##$YMAX_p= 386966197
##$YMIN_p= -908744
$$ End of Bruker specific parameters
$$ ---------------------------------
##NTUPLES= NMR SPECTRUM
##VAR_NAME=  FREQUENCY,     SPECTRUM/REAL,   SPECTRUM/IMAG
##SYMBOL=    X,             R,               I
##VAR_TYPE=  INDEPENDENT,   DEPENDENT,       DEPENDENT
##VAR_FORM=  AFFN,          ASDF,            ASDF
##VAR_DIM=   32768,         32768,           32768
##UNITS=     HZ,            ARBITRARY UNITS, ARBITRARY UNITS
##FACTOR=    0.157963299565203, 1,           1
##FIRST=     4132.6476996994, 0,             0
##LAST=      -1043.33573715361, 0,           0
##MIN=       -1043.33573715361, -908744,     0
##MAX=       4132.6476996994, 386966197,     0
$$ Real data points
##PAGE= N=1
##DATA TABLE= (X++(R..R)), XYDATA
$$ [...]
$$ plain form
23250 297352 213697 225150 92745 163586 190917 214452 112031 150966 113824 187583 70677
23239 70677 -31382 30169 55014 244397 373033 263796 192146 89231 266580 452110
23229 452110 431010 246444 98612 52494 122730 218436 86192 -2404 76098 57120 141754
23218 141754 354630 35694 -354540 -163227 -229682 -324655 -300500 81346 215800 696
23208 696 -56065 -14513 197941 -43996 -55699 153949 319491 118390 73495 145842 199650
23197 199650 152701 27218 68542 249145 56834 58583 210506 355355 84361 13791
23187 13791 8340 46137 -41051 -181743 -69077 -129309 31026 162478 -82560 -161338 -65732
23176 -65732 149430 271378 261975 122011 84496 -132514 -85249 91902 331500 66582
$$ packed form
23250B97352q3655J1453j32405P0841K7331K3535j02421L8935l7142P3759j16906
23239G0677j02059O1551K4845J89383J28636j09237p1650j02915J77349J85530
23229D52110k1100j84566j47832m6118P0236R5706j32244q8596P8502j8978Q4634
23218A41754K12876l18936l90234J91313o6455r4973K4155L81846J34454k15104
23208F96n6761M1552K12454k41937j1703K09648J65542k01101m4895P2347N3808
23197A99650m6949j25483M1324J80603j92311J749J51923J44849k70994p0570
23187A3791n451L7797q7188j40692J12666o0232J60335J31452k45038p8778R5606
23176f5732K15162J21948r403j39964l7515k17010M7265J77151K39598k64918
$$ plain form
23166 66582 7183 -72385 -10702 128308 11380 128767 250252 87309 68792 101770 161878
23155 161878 155744 140135 166714 55352 177202 241362 371829 258616 26398 114043 297463
23144 297463 192330 -68287 -249257 -373092 -210804 137612 190256 106693 -62194 -168327
23134 -168327 -96324 -4972 124286 152320 -87372 -14709 123790 133069 227699 175961 -10708
23123 -10708 56026 -32618 -64445 73556 111914 -137300 72782 259105 141861 -88335
23113 -88335 169127 230786 67685 -18556 -38755 82932 98949 -150942 -139163 -75658 -153116
23102 -153116 -89133 -100150 -136885 -17770 -55236 54098 181329 177398 102334 396840 385698
23091 385698 -33048 228499 404876 384266 286718 421177 401713 383046 174171 231450
$$ packed form
23166F6582n9399p9568O1683J39010j16928J17387J21485j62943j8517L2978O0108
23155A61878o134j5609K6579j11362J21850O4160J30467j13213k32218Q7645J83420
23144B97463j05133k60617j80970j23835J62288L48416N2644q3563j68887j06133
23134a68327P2003R1352J29258K8034k39692P2663J38499R279R4630n1738j86669
23123a0708O6734q8644l1827J38001L8358k49214K10082J86323j17244k30196
23113h8335K57462O1659j63101q6241k0199J21687J6017k49891J1779O3505p7458
23102a53116O3983j1017l6735J19115l7466J09334J27231l931p5064K94506j1142
23091C85698m18746K61547J76377k0610r7548J34459j9464j8667k08875N7279
$$ plain form
23081 231450 383273 330658 76372 -168706 -169531 -99661 -97990 -209734 -318869 -245199 -125689
23070 -125689 104672 45884 -100361 -36081 -205822 -146940 -131759 -87902 13752 126016
23060 126016 103415 -132878 -314122 -164733 -111882 -312808 -338398 -345993 -201930 -131597 -223355
23049 -223355 -221485 -250559 -409055 -325006 -202098 -188458 -51406 -185176 -283006 -178559 -142590
23038 -142590 116146 243952 131654 158771 -156071 -115719 20556 43510 72369 227662
23028 227662 364829 306440 219018 204556 295778 534074 623861 701728 567685 331296 176567
23017 176567 325801 325097 129976 37599 -120211 -272408 -55241 109130 51509 -58226
23007 -58226 -107543 66223 9978 -32099 -183511 -209278 -140783 -208648 -155117 -162044 -261773
$$ packed form
23081B31450J51823n2615k54286k45078q25O9870J671j11744j09135P3670J19510
23070a25689K30361n8788j46245O4280j69741N8882J5181M3857J01654J12264
23060A26016k2601k36293j81244J49389N2851k00926k5590p595J44063P0333r1758
23049b23355J870k9074j58496Q4049J22908J3640J37052j33770r7830J04447L5969
23038a42590K58736J27806j12298K7117l14842M0352J36275K2954K8859J55293
23028B27662J37167n8389q7422j4462R1222K38296Q9787P7867j34043k36389j54729
23017A76567J49234p04j95121r2377j57810j52197K17167J64371n7621j09735
23007e8226m9317J73766n6245m2077j51412k5767O8495o7865N3531o927r9729
$$ plain form
22996 -261773 -107490 -129433 37120 159036 70535 -228482 -387632 -98195 -28200 -149283
22986 -149283 -208470 -148474 119032 99175 71065 41517 226413 182566 247764 194527 361734
22975 361734 284118 1662 -68489 143789 286293 237776 57780 -4693 105821 99850 27804
22964 27804 -1651 -26149 -72468 -112209 -173779 -252116 -311072 -452408 -210991 53660 96074
22953 96074 122248 151968 193566 209239 221976 229960 49213 -102416 -182721 -256880 -272488
22942 -272488 -119296 -59737 -356838 -471525 -472494 -254799 -212972 -142980 -55964 -57655 -48795
22931 -48795 -63924 -237588 -335942 -207116 -160477 -119032 -132786 -12011 -49207 -65021 -18899
22920 -18899 -261130 -42434 53559 -4280 36829 35818 -137353 -312038 -71099 144254 228402
$$ packed form
22996b61773J54283k1943J66553J21916q8501k99017j59150K89437O9995j21083
22986a49283n9187N9996K67506j9857k8110k9548J84896m3847O5198n3237J67207
22975C61734p7616k82456p0151K12278J42504m8517j79996o2473J10514n971p2046
22964B7804k9455k4498m6319l9741o1570p8337n8956j41336K41417K64651M2414
22953I6074K6174K9720M1598J5673J2737P984j80747j51629q0305p4159j5608
22942b72488J53192N9559k97101j14687r69K17695M1827O9992Q7016j691Q860
22931d8795j5129j73664r8354J28826M6639M1445j3754J20775l7196j5814M6122
22920a8899k42231K18696R5993n7839M1109j011j73171j74685K40939K15353Q4148
$$ plain form
22909 228402 163939 -112282 -170879 -134141 -325340 -504342 -560776 -447098 -203928 -267076
22899 -267076 -337946 -146253 90104 91265 213367 169594 147602 172765 226703 53900 -46228
22888 -46228 24166 60286 -49758 -14890 142556 92899 -96691 -188090 -180749 87828 159556
22877 159556 51352 -3990 -110264 -270746 -142506 -13606 41471 -101373 -102013 -206681
22867 -206681 -288743 -305145 -434852 -389673 -372332 -192721 -83532 -70324 12172 -31908 90832
22856 90832 319663 323700 479141 291609 -15239 -246186 -352361 -147083 -75155 -128439
22846 -128439 -130895 -126969 -136165 52430 -15175 -119961 -44401 40987 45532 209869 49861
22835 49861 127462 22773 -199123 -161445 22113 175691 211079 154569 60101 118634 38254
$$ packed form
22909B28402o4463k76221n8597L6738j91199j79002n6434J13678K43170o3148
22899b67076p0870J91693K36357J161J22102m3773k1992K5163N3938j72803j00128
22888d6228P0394L6120j10044L4868J57446m9657j89590r1399P341K68577P1728
22877A59556j08204n5342j06274j60482J28240J28900N5077j42844o40j04668
22867b06681q2062j6402j29707M5179J7341J79611J09189J3208Q2496m4080J22740
22856I0832K28831M037J55441j87532l06848k30947j06175K05278P1928n3284
22846a28439k456L926r196J88595o7605j04786P5560Q5388M545J64337j60008
22835D9861P7601j04689k21896L7678J83558J53578L5388n6510r4468N8533q0380
$$ plain form
22824 38254 85701 227354 68589 -14657 55154 191139 157174 -43237 -31015 27327 23085
22813 23085 49028 212507 269194 175042 62741 272993 288516 -2278 -53021 86193 201411
22802 201411 194617 411376 258510 107405 44405 -6425 -101883 -142440 67551 85215 88286
22791 88286 245153 292325 93261 86882 -65488 -30345 -203899 -168984 140568 311018 477364
22780 477364 429825 388130 83821 -10353 86135 -33942 24536 32360 -131804 -423163 -347568
22769 -347568 -269794 -165418 -140457 -204757 -146340 -166674 -29015 -55645 30279 20382 -121167
22758 -121167 -287968 -473408 -359376 -31168 135100 85663 -106869 -259931 -244445 -79996
22748 -79996 46475 -202180 -313146 -361377 -234517 -128318 -154654 -16771 5254 -12284
$$ packed form
22824C8254M7447J41653j58765q3246O9811J35985l3965k00411J2222N8342m242
22813B3085K5943J63479N6687r4152j12301K10252J5523k90794n0743J39214J15218
22802B01411o794K16759j52866j51105o3000n0830r5458m0557K09991J7664L071
22791H8286J56867M7172j99064o379j52370L5143j73554L4915L09552J70450J66346
22780D77364m7539m1695l04309r4174R6488j20077N8478P824j64164k91359P5595
22769c47568P7774J04376K4961o4300N8417k0334J37659k6630Q5924r897j41549
22758a21167j66801j85440J14032L28208J66268m9437j92532j53062J5486J64449
22748g9996J26471k48655j10966m8231J26860J06199k6336J37883K2025j7538
$$ plain form
22738 -12284 38432 113212 139625 127604 -25389 43498 114279 39671 -40700 -217098 -150709
22727 -150709 -89975 65894 106999 -150212 -263469 -223354 -123898 -153214 -165796 -111167 133240
22716 133240 268039 391800 101639 -46954 -116007 -92717 -138344 -44495 27176 -30971 201431
22705 201431 285373 326737 265002 275495 268712 97412 324146 279866 -139724 -250872 -246763
22694 -246763 -291639 -260045 -145366 -66963 102699 223361 60293 267327 383486 307961
22684 307961 188315 266974 208127 28745 6091 22130 -223894 -213682 -109963 -1219
22674 -1219 -155258 -373694 -506856 -427658 -360971 -312842 -278059 -455835 -534568 -133166 27742
22663 27742 -122143 -205508 -68881 22136 18952 159515 241592 264888 215466 181960 129224
$$ packed form
22738a2284N0716P4780K6413j2021j52993O8887P0781p4608q0371j76398O6389
22727a50709O0734J55869M1105k57211j13257M0115R9456k9316j2582N4629K44407
22716A33240J34799J23761k90161j48593o9053K3290m5627R3849P1671n8147K32402
22705B01431Q3942M1364o1735J0493o783j71300K26734m4280m19590j11148M109
22694b46763m4876L1594J14679P8403J69662J20662j63068K07034J16159p5525
22684C07961j19646P8659n8847j79382k2654J6039k46024J0212J03719J08744
22674a219j54039k18436j33162P9198O6687M8129L4783j77776p8733M01402J60908
22663B7742j49885q3365J36627R1017l184J40563Q2077K3296m9422l3506n2736
$$ plain form
22652 129224 206241 123765 204170 68547 85266 84130 192451 150684 -8520 -117575 -188185
22641 -188185 -222500 -95824 86733 253360 114627 21678 -150684 -214692 -16203 20516
22631 20516 -266319 -481368 -304173 -315502 -315082 -206894 -154932 -185943 90765 238550 146411
22620 146411 342361 465814 440467 368081 98895 50075 30734 -111678 -60023 -36408 69254
22609 69254 -130557 -465846 -351280 -197559 -213007 -201319 -245403 -210629 8946 157349
22599 157349 73825 -59267 -1788 133262 108004 74499 -246838 -324196 -46922 209745
22589 209745 179935 -16260 -249096 -178576 -144522 -237467 -347237 -417474 -402399 -422988 -387131
22578 -387131 -300594 -131555 -291147 -413515 -495863 -426722 -204323 -154637 -222910 -415224
$$ packed form
22652A29224P7017q2476Q0405j35623J6719j136J08321m1767j59204j09055p0610
22641a88185l4315J26676J82557J66627j38733r2949j72362o4008J98489L6719
22631B0516k86835k15049J77195j1329M20J08188N1962l1011K76708J47785r2139
22620A46411J95950J23453k5347p2386k69186m8820j9341j42412N1655K3615J05662
22609F9254j99811l35289J14566J53721j5448J1688m4084L4774K19575J48403
22599A57349q3524j33092N7479J35050k5258l3505l21337p7358K77274K56667
22589B09745k9810j96195k32836P0520L4054r2945j09770p0237J5075k0589L5857
22578c87131Q6537J69039j59592j22368q2348O9141K22399M9686o8273j92314
$$ plain form
22568 -415224 -474514 -486368 -259594 30031 73598 -105434 -251269 -314246 -341278 -119992
22558 -119992 45370 285286 311037 143960 49008 -125996 -283803 -266148 -364349 -330007
22548 -330007 -155890 36535 190473 262841 346290 109771 -171290 -383229 -389938 -126068
22538 -126068 -28460 -166996 -234362 -365834 -435513 -308049 -141877 -7346 31150 -92993
22528 -92993 -179380 -151585 -98571 -298722 -207565 60024 -65012 -212962 -107634 -59828 -51585
22517 -51585 -33737 27541 237890 415535 328190 288283 411639 500054 277785 74232 97125
22506 97125 238576 46982 -9169 107803 159979 161453 315523 227950 -116767 -327220 -112023
22495 -112023 -1528 -92439 41837 75689 71120 91658 12902 -39339 258817 306225 294041
$$ packed form
22568d15224n9290j1854K26774K89625M3567j79032j45835o2977k7032K21286
22558a19992J65362K39916K5751j67077r4952j75004j57807J7655r8201L4342
22548c30007J74117J92425J53938P2368Q3449k36519k81061k11939o709K63870
22538a26068R7608j38536o7366j31472o9679J27464J66172J34531L8496j24143
22528i2993q6387K7795N3014k00151R1157K67589j25036j47950J05328M7806Q243
22517e1585J7848O1278K10349J77645q7345l9907J23356Q8415k22269k03553K2893
22506I7125J41451j91594n6151J16972N2176J474J54070q7573l44717k10453K15197
22495a12023J10495r0911J34276L3852m569K0538p8756n2241K98156M7408j2184
$$ plain form
22484 294041 177656 -11818 -97802 158549 340704 325044 62630 -156448 -110258 -75059
22474 -75059 74587 131523 2489 -48296 -51607 -43664 25739 -82344 28718 -106410 -171935
22463 -171935 -173664 -409961 -623012 -211368 188092 -50678 -249641 -193936 -223210 -216040 -199054
22452 -199054 -264679 -229792 -94779 -101238 64816 321806 410727 262428 -16534 -97985 -110475
22441 -110475 69354 195783 -75328 -138292 7022 36998 -96477 -127112 -131924 -201025 -318212
22430 -318212 -428862 -372741 -87100 -35174 -300122 -318929 -104155 -1231 27657 -121553
22420 -121553 -333065 -98390 166664 189860 79581 181676 183020 158520 -78228 -211132
22410 -211132 -11674 9790 238217 439205 534740 458612 243403 159277 153884 -57459 -38897
$$ packed form
22484B94041j16385j89474q5984K56351J82155j5660k62414k19078M6190L5199
22474g5059J49646N6936j29034n0785l311P943O9403j08083J11062j35128o5525
22463a71935j729k36297k13051M11644L99460k38770j98963N5705k9274P170J6986
22452a99054o5625L4887J35013o459J66054K56990Q8921j48299k78962q1451j2490
22441a10475J79829J26429k71111o2964J45314K9976j33475l0635m812o9101j17187
22430c18212j10650N6121K85641N1926k64948j8807K14774J02924K8888j49210
22420a21553k11512K34675K65054K3196j10279J02095J344k4500k36748j32904
22410b11132J99458K1464K28427K00988R5535p6128k15209q4126n393k11343J8562
$$ plain form
22399 -38897 2064 89835 43345 -132595 -44613 -82012 -62572 325703 366506 263550 162203
22388 162203 -21689 -228328 -299842 -136762 -232260 -386690 -437925 -405024 -205243 -19027
22378 -19027 -146926 -177454 -136266 -228697 -21808 170821 139820 175672 -35433 -166279 -312072
22367 -312072 -250067 -85136 79161 -60349 -167333 18682 -16941 -66714 -6558 49791
22357 49791 -23527 -262157 -392411 -167083 -218473 -25411 336823 545426 190623 -9672
22347 -9672 -60217 -240079 -145192 17941 99670 -142495 -361691 -371610 -152468 -116599 -24854
22336 -24854 -45997 173429 182170 310847 156849 163404 20302 93263 304874 461058 425015
22325 425015 365745 194048 126654 76800 109598 83171 -40229 -84374 -75085 -23480 22575
$$ packed form
22399c8897M0961Q7771m6490j75940Q7982l7399J9440L88275M0803j02956j01347
22388A62203j83892k06639p1514J63080r5498j54430n1235L2901J99781J86216
22378a9027j27899l0528M1188r2431K06889J92629l1001L5852k11105j30846j45793
22367c12072O2005J64931J64297j39510j06984J86015l5623m9773O0156N6349
22357D9791p3318k38630j30254K25328n1390J93062L62234K08603l54803k00295
22347i672n0545j79862R4887J63133Q1729k42165k19196r919K19142L5869R1745
22336b4854k1143K19426Q741J28677j53998O555j43102P2961K11611J56184l6043
22325D25015n9270j71697o7394m9854L2798k6427j23400m4145R289N1605M6055
$$ plain form
22314 22575 44499 168942 64398 42422 22969 15995 -197863 -736 155771 74737 240934
22303 240934 259048 96856 -14587 173108 166582 103785 61490 147652 -60472 -402184 -459980
22292 -459980 -318647 -157975 -199098 -145700 -117391 -252178 -153236 -21384 -213104 -420475
22282 -420475 -340226 -294120 -141821 -48279 6524 180200 -144412 -312327 -275214 -189217 -94215
22271 -94215 -75356 -106958 -55502 -158868 -90208 -4246 -34821 -161303 -278714 -288106 -45795
22260 -45795 -60232 -101769 -3810 -181875 -303796 -384978 -455308 -317575 -109394 92762 -58989
22249 -58989 -152147 -201930 -255511 -194789 -103331 -200424 53803 381828 251149 137262 -20621
22238 -20621 69795 132201 29400 -43092 20538 -21210 -76540 -138065 -458178 -526097 -359557
$$ packed form
22314B2575K1924J24443j04544k1976j9453o974k13858J97127J56507q1034J66197
22303B40934J8114j62192j11443J87695o526o2797m2295Q6162k08124l41712n7796
22292d59980J41333J60672m1123N3398K8309j34787R8942J31852j91720k07371
22282d20475Q0249M6106J52299R3542N4803J73676l24612j67915L7113Q5997R5002
22271i4215J8859l1602N1456j03366O8660Q5962l0575j26482j17411r392K42311
22260d5795j4437m1537R7959j78065j21921q1182p0330J37733K08181K02156j51751
22249e8989r3158m9783n3581O0722R1458r7093K54227L28025j30679j13887j57883
22238b0621R0416O2406j02801p2492O3630m1748n5330o1525l20113o7919J66540
$$ plain form
22227 -359557 -170078 -145981 -197317 -314455 -309150 -341867 -480031 -297351 -97029 -21412 -266197
22216 -266197 -440679 -402215 -361003 -412971 -239914 -344604 -354224 -20263 -32296 -3322 67731
22205 67731 110963 173105 116103 189443 251880 124864 -229186 -394621 -382614 -167939 -214796
22194 -214796 -186273 -176608 -327560 -268506 -330302 -105968 108026 109274 148371 292290 257353
22183 257353 -16006 50784 182647 279134 158776 -17721 -40541 -35760 -28895 120525 238560
22172 238560 113957 -34769 138205 50213 -9872 93700 12940 -75195 -271741 -396994
22162 -396994 -351295 -86221 -163925 -342328 -151208 47770 88121 -70130 -238916 -459473
22152 -459473 -108665 10494 -7874 -6564 -108873 -192404 84967 236860 196542 194716 256364
$$ packed form
22227c59557J89479K4097n1336j17138N305l2717j38164J82680K00322P5617k44785
22216b66197j74482L8464M1212n1968J73057j04690r620L33961j2033K8974P1053
22205F7731M3232O2142n7002P3340O2437j27016l54050j65435J2007K14675m6857
22194b14796K8523R665j50952N9054o1796K24334K13994J248L9097J43919l4937
22183B57353k73359O6790J31863R6487j20358j76497k2820M781O865J49420J18035
22172B38560j24603j48726J72974q7992o0085J03572q0760q8135j96546j25253
22162c96994M5699K65074p7704j78403J91120J98978M0351j58251j68786k20557
22152d59473L50808J19159j8368J310j02309q3531K77371J51893m0318j826O1648
$$ plain form
22141 256364 79891 67772 -44564 -122265 31072 81139 251772 311025 262262 435678
22131 435678 247065 50206 -140800 -26426 -126036 -51670 145924 179443 202869 261141
22121 261141 178706 22171 -367866 -38627 80053 149525 221053 162577 232324 12300
22111 12300 -314434 -387049 -174781 -162415 -277608 -283915 -367414 -315067 -248555 -305234 -385208
22100 -385208 -408514 -243895 -223718 -417764 -347140 -458307 -476865 -449419 -202655 -154223 92741
22089 92741 324561 119551 -26702 -173333 -33343 332701 378651 458209 413122 220369
22079 220369 38270 95238 83411 231769 195979 340310 422647 276648 223471 418371
22069 418371 392242 338700 143089 131064 -104191 -215243 -86358 27672 -94685 -218782
$$ packed form
22141B56364j76473j2119j12336p7701J53337N0067J70633N9253m8763J73416
22131D35678j88613j96859j91006J14374r9610P4366J97594L3519K3426N8272
22121B61141q2435j56535l90037L29239J18680O9472P1528n8476O9747k20024
22111A2300l26734p2615K12268J2366j15193o307q3499N2347O6512n6679p9974
22100c85208k3306J64619K0177j94046P0624j11167j8558K7446K46764M8432K46964
22089I2741K31820k05010j46253j46631J39990L66044M5950P9558m5087j92753
22079B20369j82099N6968j1827J48358l5790J44331Q2337j45999n3177J94900
22069D18371k6129n3542j95611j2025k35255j11052J28885J14030j22357j24097
$$ plain form
22059 -218782 -176752 -50940 243510 414234 256996 -58110 -295347 -257907 -178448 -293908
22049 -293908 -228120 -22659 -29599 -204238 -438895 -335628 -348752 16814 45442 -86055
22039 -86055 -123090 -180944 -1010 147028 135356 100779 164270 357078 291881 -113734 -261730
22028 -261730 -247709 -266255 -445829 -490055 -442694 -191397 -198770 -101944 -48811 15809 328303
22017 328303 305302 74267 -80401 -6059 202499 388831 277322 94922 205601 74562
22007 74562 5796 -7018 119698 843 -285341 -401565 -392416 -497375 -180298 -128230 -46965
21996 -46965 65554 218124 216410 129449 188276 30836 2562 -97706 -63792 -36663 -99950
21985 -99950 -63359 -129433 -179727 -141420 -58211 -110411 93236 194132 87921 -6330 114253
$$ packed form
22059b18782M2030J25812K94450J70724j57238l15106k37237L7440P9459j15460
22049b93908O5788K05461o940j74639k34657J03267j3124L65566K8628j31497
22039h6055l7035n7854J79934J48038j1672l4577O3491J92808o5197m05615j47996
22028b61730J4021j8546j79574m4226M7361K51297p373R6826N3133O4620L12494
22017C28303k3001k31035j54668P4342K08558J86332j11509j82400J10679j31039
22007G4562o8766j2814J26716j18855k86184j16224R149j04959L17077N2068Q1265
21996d6965J12519J52570j714q6961N8827j57440k8274j00268L3914K7129o3287
21985i9950L6591o6074n0294L8307Q3209n2200K03647J00896j06211r4251J20583
$$ plain form
21974 114253 -35888 -230713 -423728 -450604 -288048 -345846 -309708 -252183 -199529 -220127 -81963
21963 -81963 71867 16888 -126621 -11749 -109223 -4269 -2893 -79115 -225282 -463366 -353943
21952 -353943 -79573 39380 101026 -122747 -113168 -125828 -318478 -399339 -235794 -63529
21942 -63529 -133397 -145670 -174237 7592 -45343 -295468 -361054 -389581 -390047 -262331 -128860
21931 -128860 -63181 -73675 -77170 49672 122913 92764 107287 101481 201976 56822 -23644
21920 -23644 14594 54994 78006 211656 8619 -371313 -343775 -157153 -136832 13888 78952
21909 78952 90123 12128 -42383 130267 219656 189988 164978 124734 -68943 -77558 -86424 -226166
21897 -226166 -395557 -252504 108641 38407 -328983 15325 196004 91940 161160 51811
$$ packed form
21974A14253j50141j94825j93015k6876J62556n7798L6138N7525N2654k0598J38164
21963h1963J53830n4979j43509J14872r7474J04954J376p6222j46167k38084J09423
21952c53943K74370J18953O1646k23773R579j2660j92650q0861J63545J72265
21942f3529o9868j2273k8567J81829n2935k50125o5586k8527m66J27716J33471
21931a28860O5679j0494l495J26842P3241l0149J4523n806J00495j45154q0466
21920b3644L8238M0400K3012J33650k03037l79932K7538J86622K0321J50720O5064
21909G8952J1171p7995n4511J72650Q9389k9668k5010m0244j93677q615q866j39742
21897b26166j69391J43053L61145p0234l67390L44308J80679j04064O9220j09349
$$ plain form
21887 51811 -45959 6866 19596 -140358 -329022 -320549 -80455 137447 130643 37202 -110680
21876 -110680 -110767 -68762 -106073 -268488 -89922 112139 239283 290513 233562 371887 509000
21865 509000 304483 115568 157025 268989 121362 63063 36049 -50600 18556 -193385
21855 -193385 -450152 -377801 -174032 -130917 -225200 -210270 -108755 -149772 -165691 -85493 -157743
21844 -157743 10388 94628 17668 171634 158340 224817 64925 144994 372212 309810 15243
21833 15243 -68056 -73534 -71554 5900 -55173 99858 -10995 32989 92535 -96532 -160744
21822 -160744 -279538 -236431 -122791 33575 17607 -2785 -29685 -241095 -374495 -269736
21812 -269736 -225077 -127606 -127437 15774 -100402 -131865 -132789 142398 121895 -73093 -105913
$$ packed form
21887E1811r7770N2825J2730j59954j88664Q473K40094K17902o804r3441j47882
21876a10680q7M2005l7311j62415J78566K02061J27144N1230n6951J38325J37113
21865E09000k04517j88915M1457J11964j47627n8299k7014q6649O9156k11941
21855a93385k56767P2351K03769M3115r4283J4930J01515m1017j5919Q0198p2250
21844a57743J68131Q4240p6960J53966j3294O6477j59892Q0069K27218o2402k94567
21833A5243q3299n478J980P7454o1073J55031j10853M3984N9546j89067o4212
21822a60744j18794M3107J13640J56366j5968k0392k6900k11410j33400J04759
21812b69736M4659R7471J69J43211j16176l1463r24K75187k0503j94988l2820
$$ plain form
21801 -105913 -43461 75340 -50715 -153896 -184885 -69652 132280 129225 258894 14846
21791 14846 -1843 20232 -77342 -79368 113076 5511 6615 32972 -62282 -179163 -241440
21780 -241440 -312646 -183894 93168 181789 207623 142842 64666 36705 90212 -12098 -283635
21769 -283635 -320719 -81162 81570 -98468 -71947 -47563 -144848 -143996 -64178 151367 91976
21758 91976 34463 284432 437232 313243 121329 106272 97704 181290 135754 26896 30289
21747 30289 -5740 187414 -57194 -353681 -191907 -25668 83157 -48508 -109747 -136415
21737 -136415 -76560 -45446 -193516 -90528 -47840 -24416 16160 -5362 -206145 -267030 -232014
21726 -232014 -64905 69620 -118590 -34022 324506 421676 216125 214847 285484 433721
$$ packed form
21801a05913O2452J18801j26055j03181l0989J15233K01932l055J29669k44048
21791A4846j6689K2075r7574k026J92444j07565J104K6357r5254j16881o2277
21780b41440p1206J28752K77062Q8621K5834o4781p8176k7961N3507j02310k71537
21769b83635l7084K39557J62732j80038K6521K4384r7285Q52P9818K15545n9391
21758I1976n7513K49969J52800j23989j91914j5057q568Q3586m5536j08858L393
21747C0289l6029J93154k44608k96487J61774J66239J08825j31665o1239k6668
21737a36415N9855L1114j48070J02988M2688K3424M0576k1522k00783o0885L5016
21726b32014J67109J34525j88210Q4568L58528R7170k05551j278P0637J48237
$$ plain form
21716 433721 496813 226846 -14359 -118882 -49523 -183979 159447 369293 439899 327351
21706 327351 160915 190368 177717 206457 97279 256394 314282 223583 133246 152020 104637
21695 104637 -16396 -113212 -177191 -103411 -119172 -11621 -169705 -93139 103615 83032 285865
21684 285865 494711 579272 268874 17183 -102906 -84340 83996 45037 -32143 -41887 -153207
21673 -153207 20112 29396 21444 -36622 -244947 -28140 27253 -96736 6173 25237 56117
21662 56117 33868 1657 -6607 70493 -127730 -345347 -198820 -157059 -201838 -124573 153407
21651 153407 45339 -142112 43490 81861 -140993 -348643 -341151 -176933 96196 39846
21641 39846 78088 -85744 -255092 -162107 -110062 -209146 -289443 -504490 -569298 -437086 -52439
$$ packed form
21716D33721O3092k69967k41205j04523O9359j34456L43426K09846P0606j12548
21706C27351j66436K9453j2651K8740j09178J59115N7888r0699r0337J8774m7383
21695A04637j21033r6816o3979P3780j5761J07551j58084P6566J96754k0583K02833
21684B85865K08846Q4561l10398k51691j20089J8566J68336l8959p7180r744j11320
21673a53207J73319R284p952n8066k08325K16807N5393j23989J02909J9064L0880
21662E6117k2249l2211q264P7100j98223k17617J46527M1761m4779P7265K77980
21651A53407j08068j87451J85602L8371k22854k07650P492J64218K73129n6350
21641C9846L8242j63832j69348R2985N2045r9084q0297k15047o4808J32212L84647
$$ plain form
21630 -52439 -5391 32415 -155245 -274424 -375059 -326181 -258384 -349360 -440876 -54365 -36449
21619 -36449 -403676 -573957 -537532 -404156 -433113 -280246 -145280 -105853 -153192 -87426 -75717
21608 -75717 -151818 -133575 -195875 -287331 -35133 109119 181978 -19965 -145274 -181898 -321221
21597 -321221 -234219 -212604 -253917 -121427 -31619 232035 146024 102963 -47551 -42844 -2454
21586 -2454 -30905 -175587 -182806 -284257 -243292 -145309 73766 428278 403154 256480 -15626
21575 -15626 -71423 -111660 -141412 -61237 94623 306951 387679 349830 279493 386950 501829
21564 501829 432508 69494 -234248 -394908 -262481 -439191 -518486 -478963 -544049 -309385
21554 -309385 48457 147546 273041 220637 73315 -30029 -108828 -200434 -175030 -56058
$$ packed form
21630e2439M7048L7806j87660j19179j00635M8878O7797r0976r1516L86511J7916
21619c6449l67227j70281L6425J33376k8957J52867J34966L9427m7339O5766J1709
21608g5717p6101J8243o2300r1456K52198J44252P2859k01943j25309l6624j39323
21597c21221Q7002K1615m1313J32490Q9808K63654q6011m3061j50514M707M0390
21586b454k8451j44682p219j01451M0965R7983K19075L54512k5124j46674k72106
21575a5626n5797m0237k9752Q0175J55860K12328Q0728l7849p0337J07457J14879
21564E01829o9321l63014l03742j60660J32427j76710p9295L9523o5086K34664
21554c09385L57842R9089J25495n2404j47322j03344p8799r1606K5404J18972
$$ plain form
21544 -56058 15652 189223 244106 397103 197971 -55748 -73217 -219709 -107966 -72710
21534 -72710 -121735 -191978 -401558 -383114 -164937 -426698 -612761 -454381 -266372 -174987
21524 -174987 -235349 -109797 -82365 -248619 -155940 -296203 -300215 -154257 -75395 -51146 -18646
21513 -18646 -115513 -308873 -231502 -82109 -110759 -12349 283951 183136 3915 110772
21503 110772 222077 317763 351422 336279 290493 352376 205501 264515 176365 67133 199566
21492 199566 292702 89598 -375650 -551181 -418690 -43263 -70404 -83131 28403 -108404
21482 -108404 -95113 -963 -18655 6103 3048 15724 261657 438549 322464 215952 263879
21471 263879 419671 441384 200285 242626 307983 254721 151334 56121 -55696 -222031
$$ packed form
21544e6058P1710J73571N4883J52997j99132k53719j7469j46492J11743L5256
21534g2710m9025p0243k09580J8444K18177k61761j86063J58380J88009R1385
21524a74987o0362J25552K7432j66254R2679j40263m012J45958P8862K4249L2500
21513a8646r6867j93360P7371J49393k8650R8410K96300j00815j79221J06857
21503A10772J11305R5686L3659j5143m5786O1883j46875N9014q8150j09232J32433
21492A99566R3136k03104m65248j75531J32491L75427k7141j2727J11534j36807
21482a08404J3291R4150j7692K4758l055J2676K45933J76892j16085j06512M7927
21471B63879J55792K1713k41099M2341O5357n3262j03387r5213j11817j66335
$$ plain form
21461 -222031 -78669 -66902 211839 429096 509370 243744 118848 75742 -128153 -187155
21451 -187155 -287352 -81426 119952 -3994 166519 15093 -162427 -293819 -302432 -179861
21441 -179861 -157626 46013 65896 10082 89190 26209 -13733 -58583 -162576 87971 -1280
21430 -1280 73745 102976 128416 174969 170165 288060 273913 39816 128404 263917 137330
21419 137330 43716 99498 -96807 -214314 -212080 -266903 -219878 -179576 -254676 -154411 -95881
21408 -95881 24882 166096 179260 288220 150065 237870 259360 163613 150241 29158 90697
21397 90697 151659 133498 100199 250348 106741 111180 103519 70535 38319 -66545 -199061
21386 -199061 -185409 -277756 -92068 73077 181694 342785 331638 174205 142292 311685
$$ packed form
21461b22031J43362J1767K78741K17257Q0274k65626j24896m3106k03895n9002
21451a87155j00197K05926K01378j23946J70513j51426j77520j31392q613J22571
21441a79861K2235K03639J9883n5814P9108o2981l9942m4850j03993K50547q9251
21430a280P5025K9231K5440M6553m804J17895j4147k34097Q8588J35513j26587
21419A37330r3614N5782j96305j17507K234n4823M7025M0302p5100J00265N8530
21408i5881J20763J41214J3164J08960j38155Q7805K1490r5747j3372j21083O1539
21397I0697O0962j8161l3299J50149j43607M439p661l2984l2216j04864j32516
21386a99061J3652r2347J85688J65145J08617J61091j1147j57433l1913J69393
$$ plain form
21376 311685 450885 241883 -96129 6579 -35844 -201631 -458639 -314108 -242728 -129625
21366 -129625 -52382 -90631 62843 -101285 -147404 -105129 -36011 -213377 -162431 10065 11508
21355 11508 33964 22364 -49525 -125067 -44899 -448951 -526118 -245934 -168760 -481434 -539502
21344 -539502 -656157 -606588 -473323 -387024 -334309 -240830 -204572 -41653 -263746 -280395 -95983
21333 -95983 25497 4233 45289 -266741 -389961 -91852 30064 -285817 -437071 -347116
21323 -347116 -239380 -144896 104065 130541 337614 78511 -307045 -433402 -764964 -562958
21313 -562958 -335078 -312520 -406830 -319534 739 -10462 -91309 -139865 -161859 -74423 -2187
21302 -2187 -132821 -155637 39630 15798 99502 3692 -259446 -416953 -236944 -136103 -471336
$$ packed form
21376C11685J39200k09002l38012J02708m2423j65787k57008J44531P1380J13103
21366a29625P7243l8249J53474j64128m6119M2275O9118j77366N0946J72496J443
21355A1508K2456j1600p1889p5542Q0168m04052p7167K80184P7174l12674n8068
21344e39502j16655M9569J33265Q6299N2715R3479L6258J62919k22093j6649J84412
21333i5983J21480k1264M1056l12030j23220K98109J21916l15881j51254Q9955
21323c47116J07736R4484K48961K6476K07073k59103l85556j26357l31562K02006
21313e62958K27880K2558r4310Q7296L20273j1201q0847m8556k1994Q7436P2236
21302b187j30634k2816J95267k3832Q3704r5810k63138j57507J80009J00841l35233
$$ plain form
21291 -471336 -365315 -47969 25840 -107596 -262387 -468 142176 67756 35038 208012
21281 208012 312269 257597 88954 -203863 -118238 232171 99484 99514 23651 -156680 -291713
21270 -291713 -314207 -450605 -501577 -393662 -316886 -337294 -388726 -455195 -544664 -730554 -515477
21259 -515477 87914 526805 548093 250810 -82565 -185372 -126670 157795 374153 207408
21249 207408 -9008 -90718 31080 410028 308002 317655 305981 163305 163090 279588 413348
21238 413348 351837 102414 -57501 -35578 -228817 -294479 -249978 -268817 -256788 -149301 12575
21227 12575 31906 -10207 -63965 44012 173897 299047 158737 -154429 -83257 72169
21217 72169 -34911 179419 229113 32898 -376631 -339157 -143530 149316 205859 232018
$$ packed form
21291d71336J06021L17346P3809j33436j54791K61919J42644p4420l2718J72974
21281B08012J04257n4672j68643k92817Q5625L50409j32687L0p5863j80331j35033
21270b91713k2494j36398n0972J07915P6776k0408n1432o6469q9469j85890K15077
21259e15477O03391M38891K1288k97283l33375j02807N8702K84465K16358j66745
21249B07408k16416q1710J21798L78948j02026R653j1674j42676k15J16498J33760
21238D13348o1511k49423j59915K1923j93239o5662M4501j8839J2029J07487J61876
21227A2575J9331m2113n3758J07977J29885J25150j40310l13166P1172J55426
21217G2169j07080K14330M9694j96215m09529L7474J95627K92846N6543K6159
$$ plain form
21207 232018 46635 -207341 -159589 116427 299592 156332 -79296 -109137 -221550 -251727
21197 -251727 -282808 -242733 -343021 -441383 -306380 -231390 -285674 -215153 -330075 -300930 -176865
21186 -176865 -140656 -212794 -77846 -7530 -64152 -97265 79045 -304917 -121357 120774
21176 120774 267544 297372 427380 95040 -169344 -162954 -98531 -270905 -305221 100105
21166 100105 151748 180905 141951 364 -177223 -245095 -111947 -71513 -28398 137453 213450
21155 213450 120177 -2116 -87972 2367 -295006 -520808 -675563 -675157 -530868 -414052 -259409
21144 -259409 -341116 -64560 -239924 -228306 -62018 52101 211151 137292 68682 205777
21134 205777 189175 96678 74103 -79127 -42432 -105391 -140507 -98231 -91480 -81634 -39022 -154170
$$ packed form
21207B32018j85383k53976M7752K76016J83165j43260k35628k9841j12413l0177
21197b51727l1081M0075j00288r8362J35003P4990n4284P0521j14922K9145J24065
21186a76865L6209p2138J34948P0316n6622l3113J76310l83962J83560K42131
21176A20774J46770K9828J30008l32340k64384O390O4423j72374l4316M05326
21166A00105N1643K9157l8954j41587j77587o7872J33148M0434M3115J65851P5997
21155B13450r3273j22293q5856R0339k97373k25802j54755M06J44289J16816J54643
21144b59409q1707K76556j75364J1618J66288J14119J59050p3859o8610J37095
21134B05777j6602r2497k2575j53230L6695o2959l5116M2276O751R846M2612j15148
$$ plain form
21122 -154170 -147186 -124698 38147 139349 151841 175277 191154 37850 73655 47295 -64213
21111 -64213 -20420 75434 -56492 -200373 -34466 11791 167257 42110 36657 185994 72769
21100 72769 -217080 -139945 53514 14037 -107681 -19551 -29824 -115327 68463 132543 -27963
21089 -27963 19223 -14523 -150918 -269074 -150325 -120423 -276116 -394493 -690591 -744759
21079 -744759 -517172 -368063 -465251 -389199 -242708 -203607 -22951 -242923 -363602 -319619
21069 -319619 -27432 88288 106680 -59611 -261727 -264714 -182717 -76989 -26589 -160668
21059 -160668 -139899 301349 387966 406785 314077 55847 -121281 -227803 -241980 -339898 -218346
21048 -218346 -185110 -66014 -62119 -260778 -50230 207073 274545 69929 -459760 -675383
$$ packed form
21122a54170O984K2488J62845J01202J2492K3436J5877j53304L5805k6360j11508
21111f4213M3793R5854j31926j43881J65907M6257J55466j25147n453J49337j13225
21100G2769k89849P7135J93459l9477j21718Q8130j0273q5503J83790O4080j60506
21089b7963M7186l3746j36395j18156J18749K9902j55693j18377k96098n4168
21079g44759K27587J49109r7188P6052J46491L9101J80656k19972j20679M3983
21069c19619K92187J15720J8392j66291k02116k987Q1997J05728N0400j34079
21059a60668K0769M41248Q6617J8819r2708k58230j77128j06522j4177r7918J21552
21048b18346L3236J19096L895j98659K10548K57303O7472k04616n29689k15623
$$ plain form
21038 -675383 -690740 -466990 -386091 -675703 -524059 -260511 -163502 -181448 -300821 -424432
21028 -424432 -516790 -461422 -427205 -266536 -299981 -446993 -414558 -381624 -345781 -320872 -266059
21017 -266059 -283413 -365487 -343142 -96030 -90615 -197246 -299906 -172508 21574 40489 -172323
21006 -172323 -294487 -124309 40634 81041 116468 38175 45528 25901 90009 -135044 -247588
20995 -247588 -295576 -111095 36558 -135378 -156648 -89762 11912 51183 -21400 -227829
20985 -227829 -352748 -197356 -142966 -203136 -391659 -353232 17646 131187 -50102 -312406
20975 -312406 -380582 -161863 21340 -79155 -173743 -387176 -441693 -298473 -294784 -344839 -220246
20964 -220246 -94500 -324540 -384428 -218510 -197282 -94725 -122309 -218077 -225321 -30942 11133
$$ packed form
21038f75383j5357K23750Q0899k89612J51644K63548R7009j7946j19373j23611
21028d24432r2358N5368L4217J60669l3445j47012L2435L2934L5843K4909N4813
21017b66059j7354q2074K2345K47112N415j06631j02660J27398J94082J8915k12812
21006a72323j22164J70178J64943M0407L5427p8293P353j9627O4108k25053j12544
20995b47588m7988J84481J47653j71936k1270O6886J01674L9271p2583k06429
20985b27829j24919J55392N4390o0170j88523L8427L70878J13541j81289k62304
20975c12406o8176K18719J83203j00495r4588k13433n4517J43220L689n0055J24593
20964b20246J25746k30040n9888J65918K1228J02557k7584r5768p244J94379M2075
$$ plain form
20953 11133 11103 133649 -19293 -348599 -405330 -255540 -214791 -256741 -187333 -9197 -141022
20942 -141022 -102759 -134013 -300790 -476226 -397811 -267689 -384400 -413421 -256079 -271440
20932 -271440 -194728 -28668 -79897 -151821 -335536 -203480 -250898 -65518 -84279 -230109
20922 -230109 -111645 -165124 -122551 -130261 -351180 -87720 143686 191859 191905 91677 93975
20911 93975 -160873 -62728 -127315 -201691 -266929 -210158 -147665 -89756 -200846 -352894 -327590
20900 -327590 3755 205947 173113 77117 74085 145535 230562 321240 217668 296521 200916
20889 200916 73223 -14676 65310 182139 -9154 -322899 -297587 -139495 4379 -59881
20879 -59881 -186366 -162932 -201258 -343316 -282932 -83316 -98261 35012 289165 303613 346134
$$ packed form
20953A1133l0J22546j52942l29306n6731J49790M0749m1950O9408J78136j31825
20942a41022L8263l1254j66777j75436P8415J30122j16711k9021J57342j5361
20932b71440P6712J66060n1229p1924j83715J32056m7418J85380j8761j45830
20922b30109J18464n3479M2573p710k20919K63460K31406M8173M6j00228K298
20911I3975k54848R8145o4587p4376o5238N6771O2493N7909j11090j52048K5304
20900c27590L31345K02192l2834r5996l032P1450Q5027R0678j03572P8853r5605
20889B00916j27693q7899P9986J16829j91293l13745K5312J58092J43874o4260
20879e9881j26485K3434l8326j42058O0384J99616j4945J33273K54153J4448M2521
$$ plain form
20868 346134 336552 364415 114851 -88637 -103598 -59192 -78447 -72335 -70518 -274260 -241564
20857 -241564 -184186 165104 55576 -18862 -25442 36222 -223996 -223566 -265463 -205270 -84909
20846 -84909 -20510 -92559 -2943 -84963 -297177 -465252 -506828 -480960 -399916 -364285 -322692
20835 -322692 -72400 75095 -74360 -208008 -318662 -306081 -118449 139386 282320 363048
20825 363048 233633 -11522 3393 28165 -49449 -155795 -254027 -351721 -433256 -481251 -386038
20814 -386038 -123574 4548 -19657 -392366 -149339 136914 103299 -338415 -635899 -561515
20804 -561515 -246267 -47977 25779 263258 446168 356909 210753 10254 -310675 -186434
20794 -186434 -71332 17981 294379 389285 218290 83341 105168 -44652 137621 93107
$$ packed form
20868C46134r582K7863k49564k03488j4961M4406j9255O112J817k03742L2696
20857b41564N7378L49290j09528p4438o580O1664k60218M30m1897O0193J20361
20846h4909O4399p2049Q9616q2020k12214j68075m1576K5868Q1044L5631M1593
20835c22692K50292J47495j49455j33648j10654J2581J87632K57835J42934Q0728
20825C63048j29415k45155J4915K4772p7614j06346r8232r7694q1535m7995R5213
20814c86038K62464J28122k4205l72709K43027K86253l3615m41714k97484P4384
20804e61515L15248J98290P3756K37479J82910q9259j46156k00499l20929J24241
20794a86434J15102Q9313K76398R4906j70995j34949K1827j49820J82273m4514
$$ plain form
20784 93107 -224816 -190963 134864 119203 141458 355087 440146 243095 -34234 -33893 89051
20773 89051 291421 179640 -62438 -201364 -256213 95881 154219 -44356 -269913 -266573
20763 -266573 -277607 45979 212745 20565 111871 257296 333837 483800 545770 462300
20753 462300 116872 98141 113203 75909 -89033 -122824 -78147 -79302 -209039 -170341 -273461
20742 -273461 -153276 -63043 -174128 -149229 48854 -25651 9475 265519 203211 -36936
20732 -36936 -41665 128824 380534 176956 -129780 -153713 -84637 103696 129734 120669 71314
20721 71314 -172610 -233510 -31194 21902 113088 228758 190881 -54284 -44138 100124 29531
20710 29531 -104864 -25720 77520 -1730 -29068 -80640 -277846 -174851 -159207 -169339 -197213
$$ packed form
20784I3107l17923L3853L25827j5661K2255K13629Q5059j97051k77329L41J22944
20773H9051K02370j11781k42078j38926n4849L52094N8338j98575k25557L340
20763b66573j1034L23586J66766j92180R1306J45425P6541J49963O1970q3470
20753D62300l45428j8731J5062l7294j64942l3791M4677j155j29737L8698j03120
20742b73461J20185R0233j11085K4899J98083p4505L5126K56044o2308k40147
20732c6936m729J70489K51710k03578l06736k3933O9076J88333K6038r065m9355
20721G1314k43924o0900K02316N3096R1186J15670l7877k45165J0146J44262p0593
20710B9531j34395P9144J03240p9250k7338n1572j97206J02995J5644j0132k7874
$$ plain form
20699 -197213 -350584 -457284 -403495 -224928 -113041 -233178 -478079 -317019 -120284 -378247
20689 -378247 -440483 -339370 -234741 -142529 -293332 -464451 -330850 -118141 -126318 -307940
20679 -307940 -368885 -261024 -324269 -305713 30205 70763 -75787 -160647 38390 -155816
20669 -155816 -223594 -13569 195513 137877 11161 41203 4574 -25794 -53110 -342677 -244024
20658 -244024 -114310 -247757 -314326 -256350 -148726 -172255 -249485 -322593 -198179 8066
20648 8066 -41349 -229863 -145925 -41558 -97615 -105948 -171944 -250553 -187485 -60204 118519
20637 118519 284140 228287 -3967 -169493 -137138 -41540 -73401 -29950 47238 -7061 -229783
20626 -229783 -284732 -258783 -364130 -228543 -71772 -324762 -564401 -480634 -273148 -206346
$$ packed form
20699a97213j53371j06700N3789J78567J11887j20137k44901J61060J96735k57963
20689c78247o2236J01113J04629R2212j50803j71119J33601K12709q177j81622
20679c07940o0945J07861o3245J8556L35918M0558j46550q4860J99037j94206
20669a55816o7778K10025K09082n7636j26716L0042l6629l0368k7316k89567R8653
20658b44024J29714j33447o6569N7976J07624k3529p7230p3108J24414K06245
20648H066m9415j88514Q3938J04367n6057q333o5996p8609O3068J27281J78723
20637A18519J65621n5853k32254j65526L2355R5598l1861M3451P7188n4299k22722
20626b29783n4949K5949j05347J35587J56771k52990k39639Q3767K07486O6802
$$ plain form
20616 -206346 -361238 -306674 -311223 -327002 -211380 -152463 -212574 -193562 -160330 -282419 -193503
20605 -193503 -288697 -426758 -127147 94366 -128744 -240371 -462982 -380038 -314537 -237832
20595 -237832 -337451 -207636 -96434 -258171 -481823 -412112 -468582 -458541 -647744 -689989
20585 -689989 -325480 -193502 -146492 -400324 -629818 -486831 -251809 -1861 62561 24419
20575 24419 -163888 -240291 -364034 -335565 -254856 -88248 -232310 -301949 -444822 -371640 -472328
20564 -472328 -566474 -557250 -324944 -106408 97576 -76527 -151151 -109822 34287 149326
20554 149326 -69423 12945 150315 99784 -133966 -154527 86135 258286 176076 -1875
20544 -1875 -375632 -501059 -355333 -421356 -385456 -377260 -274928 -223901 -208895 -272467 -309449
$$ packed form
20616b06346j54892N4564m549j5779J15622N8917o0111J9012L3232j22089Q8916
20605a93503r5194j38061K99611K21513k23110j11627k22611Q2944O5501P6705
20595b37832r9619J29815J11202j61737k23652O9711n6470J0041j89203m2245
20585f89989L64509J31978M7010k53832k29494J42987K35022K49948O4422l8142
20575B4419j88307p6403j23743K8469Q0709J66608j44062o9639j42873P3182j00688
20564d72328r4146R224K32306K18536K03984j74103p4624M1329J44109J15039
20554A49326k18749Q2368J37370n0531k33750k0561K40662J72151q2210j77951
20544a875l73757j25427J45726o6023L5900Q196J02332N1027J5006o3572l6982
$$ plain form
20533 -309449 -142513 -48619 27386 -119423 -161629 -93309 -264339 -257552 -193106 -119586 -266693
20522 -266693 -53207 146384 54709 65995 -146859 -20356 -54113 -194197 -147659 -70497
20512 -70497 -52845 -201343 -337456 -219152 -45214 -19801 134466 165291 -52172 -345450
20502 -345450 -179494 29808 -101333 -304387 -545161 -570897 -614007 -664270 -429688 -149465
20492 -149465 -224092 84576 78583 -70991 6032 6838 -156597 -181387 -34006 -115960 -261133
20481 -261133 -506374 -513440 -364259 -173903 -278450 -284618 -284119 -267358 -443449 -563419 -794131
20470 -794131 -667803 -534397 -311784 -292257 -379411 -176253 59333 -146874 -357551 -347513
20460 -347513 -372812 -57026 -67465 -217317 -199787 -31945 -191853 -300907 -341108 -401563
$$ packed form
20533c09449J66936R3894P6005j46809m2206O8320j71030O787O4446P3520j47107
20522b66693K13486J99591r1675J1286k12854J26503l3757j40084M6538P7162
20512g0497J7652j48498j36113J18304J73938K5413J54267L0825k17463k93278
20502c45450J65956K09302j31141k03054k40774k5736m3110n0263K34582K80223
20492a49465p4627L08668n993j49574P7023Q06j63435k4790J47381q1954j45173
20481b61133k45241p066J49181J90356j04547o168M99J6761j76091j19970k30712
20470g94131J26328J33406K22613J9527q7154K03158K35586k06207k10677J0038
20460c47513k5299L15786j0439j49852J7530J67842j59908j09054m0201o0455
$$ plain form
20450 -401563 -220580 -218237 -116453 -154594 -172715 -587 -92777 48608 245803 160279 26345
20439 26345 19688 90861 13865 67321 367010 529318 426484 226024 163339 279731 255143
20428 255143 192541 257220 100270 50978 208976 71302 -60670 82079 203329 154638
20418 154638 23822 -34124 -103187 -127100 -68797 -110159 -42352 29762 45625 209143 111157
20407 111157 -86996 77614 -36098 -271341 -351377 -304432 -400609 -333237 -173242 -76223
20397 -76223 -106276 30484 117299 -132026 -469447 -549936 -372179 -90280 18847 -40004
20387 -40004 -53896 132710 105628 -177993 -160564 -244961 -389987 -338248 -125650 -49910 -61351
20376 -61351 -88851 -173412 -356200 -461858 -326733 -159228 -134110 -193060 7115 106221 -144124
$$ packed form
20450d01563J80983K343J01784l8141j8121J72128r2190J41385J97195q5524j33934
20439B6345o657P1173p6996N3456K99689J62308j02834k00460o2685J16392k4588
20428B55143o2602O4679j56950m9292J57998j37674j31972J42749J21250m8691
20418A54638j30816n7946o9063k3913N8303m1362O7807P2114J5863J63518r7986
20407A11157j98153J64610j13712k35243q0036M6945r6177O7372J59995R7019
20397g6223l0053J36760Q6815k49325l37421q0489J77757K81899J09127n8851
20387d0004j3892J86606k7082k83621J7429q4397j45026N1739K12598P5740j1441
20376f1351k7500q4561j82788j05658J35125J67505K5118n8950K00175R9106k50345
$$ plain form
20365 -144124 -32556 253967 205291 139978 123620 216865 239980 62072 83789 91310 74583
20354 74583 135959 84291 -11494 -259143 -540266 -437308 -86658 111256 -1867 88074
20344 88074 373730 75358 -123299 -331397 -384345 -289211 -361380 -395125 -312461 -155141 91168
20333 91168 8577 -198532 -242081 -247946 -83026 98696 287281 238426 102273 -51182 68411
20322 68411 19212 -7967 125740 56053 106716 7910 -8863 33902 -213637 -289695 -283827
20311 -283827 -253662 -108500 -211299 -202819 -167282 -28512 -42093 12728 -28031 -4674 130664
20300 130664 -35991 -190633 -123349 -193232 -223136 -314095 -243251 -96387 -98624 -25991 10596
20289 10596 -36321 -167346 -167340 52455 40344 -55146 85529 108579 85393 35586 -118251 -91616
$$ packed form
20365a44124J11568K86523m8676o5313j6358R3245K3115j77908K1717P521j6727
20354G4583O1376n1668r5785k47649k81123J02958L50650J97914j13123Q9941
20344H8074K85656k98372j98657k08098n2948R5134p2169l3745Q2664J57320K46309
20333I1168q2591k07109m3549n865J64920J81722J88585m8855j36153j53455J19593
20322F8411m9199k7179J33707o9687N0663r8806j6773M2765k47539p6058N868
20311b83827L0165J45162j02799Q480L5537J38770j3581N4821m0759K3357J35338
20300A30664j66655j54642O7284o9883k9904r0959P0844J46864k237P2633L6587
20289A0596m6917j31025OK19795j2111r5490J40675K3050k3186m9807j53837K6635
$$ plain form
20277 -91616 -90446 -112398 -71690 98359 -91771 -245662 -152328 -85207 15159 60075 -145987
20266 -145987 -124180 -204384 -138941 -134362 -237814 -73884 90587 -20705 -178604 -150861 -63753
20255 -63753 -12588 -200024 -143908 -31825 -233323 -321459 60669 265441 197696 39092
20245 39092 102467 196867 389587 240062 27443 -100215 -65545 259323 454591 221374
20235 221374 167771 -119393 151607 241941 250772 137380 -189752 -445463 -397079 -690421
20225 -690421 -427417 -113412 -50940 -198254 -357934 -370016 -452220 -378021 -425418 -581338
20215 -581338 -512375 -335336 -187450 -241887 -62667 -79818 86407 29030 306674 97325
20205 97325 -142057 -261282 -150761 72548 263211 412697 218484 58832 117377 53062
$$ packed form
20277i1616J170k1952M0708J70049j90130j53891R3334O7121J00366M4916k06062
20266a45987K1807q0204O5443M579j03452J63930J64471j11292j57899K7743Q7108
20255f3753N1165j87436N6116J12083k01498q8136L82128K04772o7745j58604
20245C9092O3375R4400J92720j49525k12619j27658L4670L24868J95268k33217
20235B21374n3603k87164K71000R0334Q831j13392l27132k55711M8384k93342
20225f90421K63004L14005O2472j47314j59680j2082q2204P4199m7397j55920
20215e81338O8963J77039J47886n4437J79220j7151J66225n7377K77644k09349
20205I7325k39382j19225J10521K23309J90663J49486j94213j59652N8545o4315
$$ plain form
20195 53062 94811 250887 71367 -37120 -186885 -35626 -76360 -136484 -144671 -88818 75607
20184 75607 250366 144531 43498 21281 -101063 -219380 -519712 -551858 -326460 -242495
20174 -242495 -323009 -352411 -369461 -347996 -262573 -49875 29800 -220089 -273822 -89688 -18350
20163 -18350 -10703 18699 -68989 -113893 -232713 -2685 226004 78704 -196672 -252438 -266500
20152 -266500 -90568 -123059 96462 343396 108278 -17550 -5325 6971 65466 -13518
20142 -13518 89310 218059 315922 149176 -44010 52857 217176 148219 23479 -141543
20132 -141543 -38377 -269980 -320147 -265989 -73345 -34310 -81320 -102913 -341231 -168284
20122 -168284 1302 180951 265266 114442 231544 230775 -4924 -54592 -156228 -207683 -360090
$$ packed form
20195E3062M1749J56076j79520j08487j49765J51259m0734o0124q187N5853J64425
20184G5607J74759j05835j01033k2217j22344j18317l00332l2146K25398Q3965
20174b42495q0514k9402j7050K1465Q5423K12698P9675k49889n3733J84134P1338
20163a8350P647K9402q7688m4904j18820K30028K28689j47300k75376n5766j4062
20152b66500J75932l2491K19521K46934k35118j25828J2225J2296N8495p8984
20142a3518J02828J28749R7863j66746j93186R6867J64319o8957j24740j65022
20132a41543J03166k31603n0167N4158J92644L9035m7010k1593k38318J72947
20122a68284J69586J79649Q4315j50824J17102p69k35699m9668j01636n1455j52407
$$ plain form
20111 -360090 -551982 -572105 -484775 -400176 -382657 -197691 -115213 -261919 -320089 -487549 -498761
20100 -498761 -462759 -408386 -522148 -485382 -419405 -44115 155070 292542 242997 -16212
20090 -16212 -46811 107252 33063 37428 122771 51141 -106773 -59760 168212 129119 39022
20079 39022 194505 267626 112385 3125 -74645 -201095 -121739 195662 236347 282584 294447
20068 294447 389175 358334 353110 430960 216819 271382 315922 299706 308482 137533 -47263
20057 -47263 -106249 -138148 -241133 -351897 -331784 -328094 -301393 -151493 -92139 -28404 27444
20046 27444 -25344 -180839 -306366 -318570 -411040 -368254 -392095 -358690 -215735 -65024 50519
20035 50519 92964 50762 -56343 -166794 21327 179430 161896 171474 127823 185982 215458
$$ packed form
20111c60090j91892k0123Q7330Q4599J7519J84966Q2478j46706n8170j67460j1212
20100d98761L6002N4373j13762L6766O5977L75290J99185J37472m9545k59209
20090a6212l0599J54063p4189M365Q5343p1630j57914M7013K27972l9093r0097
20079C9022J55483P3121j55241j09260p7770j26450P9356L17401M0685M6237J1863
20068B94447R4728l0841n224P7850k14141N4563M4540j6216Q776j70949j84796
20057d7263n8986l1899j02985j10764K0113L690K6701J49900N9354O3735N5848
20046B7444n2788j55495j25527j2204r2470M2786k3841L3405J42955J50711J15543
20035E0519M2445m2202j07105j10451J88121J58103j7534R578m3651N8159K9476
$$ plain form
20024 215458 155785 128709 277790 175358 16783 -118841 75738 202175 36868 -360827
20014 -360827 -411342 -377726 -235441 -211024 -13118 12556 187670 435302 258253 -136412
20004 -136412 -494423 -542880 -364964 -286100 -472938 -369262 -379563 -408869 -540396 -381453
19994 -381453 -133815 45421 -63814 14746 83629 -96780 -249280 -355476 -411240 -341501
19984 -341501 -232146 -12305 -107765 -5934 23645 -287592 -567521 -508065 -547062 -476320
19974 -476320 -414875 -168833 48566 196710 27758 -145938 -106347 19100 226542 285813
19964 285813 216172 124062 133747 67257 230932 98140 -48917 -184202 -322207 -395098 -373491
19953 -373491 -356971 -364127 -393817 -272107 -282802 -202482 -53934 -49373 -67463 114740 261518
$$ packed form
20024B15458n9673k7076J49081j02432j58575j35624J94579J26437j65307l97695
20014c60827n0515L3616J42285K4417J97906K5674J75114K47632j77049l94665
20004a36412l58011m8457J77916P8864j86838J03676j0301k9306j31527J58943
19994c81453K47638J79236j09235P8560O8883j80409j52500j06196n5764O9739
19984c41501J09355K19841r5460J01831K9579l11237k79929N9456l8997P0742
19974d76320O1445K46042K17399J48144j68952j73696L9591J25447K07442N9271
19964B85813o9641r2110R685o6490J63675j32792j47057j35285j38005p2891K1607
19953c73491J6520p156k9690J21710j0695Q0320J48548M561j8090J82203J46778
$$ plain form
19942 261518 302842 160940 197822 66358 -6958 213594 132321 28856 -254627 -246582 -19064
19931 -19064 -185908 -265078 -176272 -156723 28900 45247 105251 -90605 -313504 -221154 -201433
19920 -201433 -85190 -193871 -111243 122433 6796 47824 80528 57237 232843 235013 29188
19909 29188 -25589 14422 -71179 38074 -82464 -258834 -176268 -7233 -109834 -36820 -63000
19898 -63000 -54687 -102975 -40143 208873 173277 41940 18343 -75372 -207018 -181586 -366161
19887 -366161 -453655 -487078 -320559 -135595 -85156 -131106 -31313 243370 482510 515887 458128
19876 458128 351192 217212 100987 36945 122159 99535 16481 84133 27221 -211226 -201451
19865 -201451 -259621 -276906 -408331 -342687 -389852 -336701 -13847 197781 223948 433308 444663
$$ packed form
19942B61518M1324j41902L6882j31464p3316K20552q1273j03465k83483Q045K27518
19931a9064j66844p9170Q8806J9549J85623J6347O0004j95856k22899R2350J9721
19920b01433J16243j08681Q2628K33676j15637M1028L2704k3291J75606K170k05825
19909B9188n4777M0011q5601J09253j20538j76370Q2566J69035j02601P3014k6180
19898f3000Q313m8288O2832K49016l5596j31337k3597r3715j31646K5432j84575
19887c66161q7494l3423J66519J84964N0439m5950R9793K74683K39140L3377n7759
19876D58128j06936j33980j16225o4042Q5214k2624q3054O7652n6912k38447R775
19865b01451n8170j7285j31425O5644m7165N3151L22854K11628K6167K09360J1355
$$ plain form
19854 444663 241796 118388 184889 369918 59527 -84519 42217 135732 63712 -42097
19844 -42097 -23209 -206404 -280728 -552920 -444922 -443790 -227720 5366 -23984 -145934 -44258
19833 -44258 57994 -138300 -157250 -151273 -200222 -300890 -360069 -364382 -406620 -93568 3719
19822 3719 -139158 -292636 -225208 -32509 -102605 -26989 269327 179300 79373 -89271 -195535
19811 -195535 -103338 -123199 -32947 77005 88819 -21846 -159219 -285443 -291535 -86564 -22823
19800 -22823 173362 212741 177089 96814 98160 137184 95772 -167613 -74562 70096 -28541
19789 -28541 103301 44951 32952 34516 144495 289756 284641 307153 201384 -23928 12042
19778 12042 164553 -41451 -122760 -315218 -388317 -403419 -503143 -621620 -412495 -154852
$$ packed form
19854D44663k02867j23408O6501J85029l10391j44046J26736R3515p2020j05809
19844d2097J8888j83195p4324k72192J07998J132K16070K33086k9350j21950J01676
19833d4258J02252j96294j8950N977m8949j00668n9179m313m2238L13052R7287
19822C719j42877j53478O7428J92699p0096P5616K96316r0027r9927j68644j06264
19811a95535R2197j9861R0252J09952J1814j10665j37373j26224o092K04971O3741
19800b2823J96185L9379l5652q0275J346L9024m1412k63385R3051J44658r8637
19789b8541J31842n8350j1999J564J09979J45261n115K2512j05769k25312L5970
19778A2042J52511k06004q1309j92458p3099j5102r9724j18477K09125K57643
$$ plain form
19768 -154852 -184636 -163971 11138 82636 228708 112682 -19042 -71807 113501 138522
19758 138522 -194279 -131533 13242 86900 -31802 -111892 17095 83745 -111675 -408700
19748 -408700 -586144 -505095 -430747 -252172 -52550 -301208 -351107 -49407 -256488 -579491
19738 -579491 -470477 -381827 -328298 -481137 -318907 -144154 -113287 -7669 -107260 -199078
19728 -199078 -132420 35895 50465 -7091 25900 -56176 -145495 -154230 171900 301696 274411
19717 274411 303371 449009 495540 101973 87616 102446 233939 362731 242945 126118
19707 126118 -42442 -7206 -40526 18471 -45225 -44267 -44400 -211472 -254370 -186741 -171327 -58639
19695 -58639 151301 350395 324746 110142 -53629 -47305 70079 9022 -40369 -67324 -113379
$$ packed form
19768a54852k9784K0665J75109P1498J46072j16026j31724n2765J85308K5021
19758A38522l32801O2746J44775P3658j18702q0090J28987O6650j95420k97025
19748d08700j77444Q1049P4348J78575J99622k48658m9899L01700k07081l23003
19738e79491J09014Q8650N3529j52839J62230J74753L0867J05618r9591r1818
19728a99078O6658J68315J4570n7556L2991q2076q9319q735L26130J29796k7285
19717B74411K8960J45638M6531l93567j4357J4830J31493J28792j19786j16827
19707A26118j68560L5236l3320N8997o3696R58j33j67072m2898O7629J5414J12688
19695e8639K09940J99094k5649k14604j63771O324J17384o1057m9391k6955m6055
$$ plain form
19684 -113379 -81743 -195611 -314553 -427397 -360651 -198812 -6481 -69794 18663 232192
19674 232192 269207 -61762 -96992 -173571 -58241 -116808 -344927 -359681 -355725 -111617 65089
19663 65089 329706 360575 260450 339354 392750 216558 25973 -122046 -130790 -29599 79869
19652 79869 4172 55440 218440 132847 -277076 -392724 -220788 -30870 -194011 -245898
19642 -245898 -332267 -394144 -69462 -81945 -234083 -322898 -287178 -174624 -208544 -225755 -214523
19631 -214523 -272781 -378947 -324273 -245185 -257511 -317984 -382747 -192072 -49747 -64370 -87539
19620 -87539 -263426 -489676 -459023 -352170 -301102 -137131 -77704 -17693 -30098 1683 18831
19609 18831 -20823 50959 -80381 -260721 -329222 -482484 -620466 -578955 -394316 -119784
$$ packed form
19684a13379L1636j13868j18942j12844O6746J61839J92331o3313Q8457K13529
19674B32192L7015l30969l5230p6579J15330n8567k28119j4754L956K44108J76706
19663F5089K64617L0869j00125P8904N3396j76192j90585j48019q744J01191J09468
19652G9869p5697N1268J63000q5593m09923j15648J71936J89918j63141n1887
19642b45898q6369o1877L24682j2483j52138q8815L5720J12554l3920j7211J1232
19631b14523n8258j06166N4674P9088j2326o0473o4763J90675J42325j4623k3169
19620h7539j75887k26250L0653J06853N1068J63971N9427O0011j2405L1781J7148
19609A8831l9654P1782j31340j80340o8501j53262j37982M1511J84639K74532
$$ plain form
19599 -119784 -76756 -112144 -51310 -192772 -218722 -13676 -53346 -184304 -244597 -267796 -180268
19588 -180268 -142730 -187171 -289060 -341990 -166875 -393443 -721794 -738851 -598547 -533063
19578 -533063 -466422 -321429 -232089 -94928 -43286 80009 85152 1203 -29124 46633 30630
19567 30630 -25962 -137018 7427 102724 48895 -180853 -184213 -178045 -239722 -307443 -236474
19556 -236474 -205817 -145742 79812 181546 42107 -1679 53515 36427 57633 -102790 -248983
19545 -248983 -324505 -429051 -487891 -345298 -52482 14563 22275 143105 146659 42329 -15458
19534 -15458 -153024 120136 211195 -21071 -73343 -41008 46324 58783 144389 71624 -11465
19523 -11465 -239117 -103992 -28303 -145664 -186912 -455132 -459567 -120074 -105134 -17762 -9267
$$ packed form
19599a19784M3028l5388O0834j41462k5950K05046l9670j30958o0293k3199Q7528
19588a80268L7538m4441j01889n2930J75115k26568l28351j7057J40304O5484
19578e33063O6641J44993Q9340J37161N1642J23295N143q3949l0327P5757j6003
19567C0630n6592j11056J44445R5297n3829k29748l360O168o1677o7721P0969
19556b36474L0657O0075K25554J01734j39439m3786N5194j7088K1206j60423j46193
19545b48983p5522j04546n8840J42593K92816O7045P712J20830L554j04330n7787
19534a5458j37566K73160R1059k32266n2272L2335Q7332J2459Q5606p2765q3089
19523a1465k27652J35125P5689j17361m1248k68220m435L39493J4940Q7372Q495
$$ plain form
19512 -9267 179047 79761 -163473 -221490 73958 153813 9944 18943 -58022 27449 218558
19501 218558 128102 178981 158679 171904 125223 209843 319400 396596 206054 34905 57126
19490 57126 -9766 -203306 -50239 210161 284 -52386 77633 29318 -23803 201581
19480 201581 248258 180114 100494 -265513 -407400 -396553 -514002 -778486 -686800 -590181 -455789
19469 -455789 -182135 -195819 -224640 -25326 -91584 -244338 -168977 -172139 -224748 -229735 -164549
19458 -164549 -53914 -58238 174518 205508 -32036 -87216 -70235 -173475 -88903 -118270 -229473
19447 -229473 -376748 -359276 -141423 -31027 1626 125018 -89770 -198331 -42162 -73837
19437 -73837 -14661 -67578 -323587 -531452 -599927 -435212 -379613 -296089 -388807 -323872 -40362
$$ packed form
19512i267J88314r9286k43234n8017K95448P9855j43869Q999p6965Q5471J91109
19501B18558r0456N0879k0302J3225m6681Q4620J09557P7196j90542j71149K2221
19490E7126o6892j93540J53067K60400k09877n2670J30019m8315n3121K25384
19480B01581M6677o8144p9620l66007j41887J0847j17449k64484R1686R6619J34392
19469d55789K73654j3684k8821J99314o6258j52754P5361l162n2609m987O5186
19458a64549J10635m324K32756L0990k37544n5180J6981j03240Q4572k9367j11203
19447b29473j47275J7472K17853J10396L2653J23392k14788j08561J56169l1675
19437g3837N9176n2917k56009k07865o8475J64715N5599Q3524r2718O4935K83510
$$ plain form
19426 -40362 68404 52367 -25520 -198013 -39393 -50801 -70493 4463 -96724 -284425 -151577
19415 -151577 -351216 -391718 -212420 -215255 -220063 -199309 -240615 -56942 147638 -16823 -16134
19404 -16134 19891 52255 -222117 -339747 -249052 -109453 -173862 -139964 -73354 40881 134737
19393 134737 -74461 -143691 -16109 -54571 -196157 -414840 -482420 -430393 -374443 -287380 -339773
19382 -339773 -385700 -144448 89274 -1273 31363 -77157 20978 83085 -122957 -110250 62670
19371 62670 183090 -43385 -368481 -352135 -425975 -371128 -270341 -118218 -106029 -208501
19361 -208501 -198920 109201 210230 -43586 -269707 -375267 -245118 -61772 -303840 -347681
19351 -347681 -295450 -178288 -95958 -23363 -114200 -403819 -289285 -152029 -38404 20652
$$ packed form
19426d0362J08766j6037p7887j72493J58620j1408j9692P4956j01187j87701J32848
19415a51577j99639m0502J79298k835m808K0754m1306J83673K04580j64461O89
19404a6134L6025L2364k74372j17630R0695J39599o4409L3898O6610J14235R3856
19393A34737k09198o9230J27582l8462j41586k18683o7580N2027N5950Q7063n2393
19382c39773m5927K41252K33722r0547L2636j08520R8135O2107k06042J2707J72920
19371F2670J20420k26475l25096J6346p3840N4847J00787J52123J2189j02472
19361b08501R581L08121J01029k53816k26121j05560J30149J83346k42068m3841
19351c47681N2231J17162Q2330P2595r0837k89619J14534J37256J13625N9056
$$ plain form
19341 20652 -17525 -30315 60905 -158153 -270705 -153329 -274605 -289014 -236532 -56976 -254090
19330 -254090 -324749 -132048 139913 204126 70149 186695 91639 -19765 -139799 -217354
19320 -217354 -280382 -197507 -55791 -60840 -101721 -292021 -356024 -357931 -220780 -191527 -132757
19309 -132757 38159 143899 130135 -25606 8469 85523 74550 -204664 -314761 -244827
19299 -244827 -373886 -596730 -465224 -319297 -227034 117791 23535 -28160 58710 -12811
19289 -12811 -87550 -60658 -56775 -76007 -49840 -121531 -168459 -174088 -37740 -25471 -53558 -86786
19277 -86786 -188192 -272513 -227854 -40085 -36245 -74405 -129780 -156082 -116772 53128 32065
19266 32065 -27788 94726 125713 -45863 -92364 -53485 -133374 -192076 -117289 -237176 -249773
$$ packed form
19341B0652l8177j2790R1220k19058j12552J17376j21276j4409N2482J79556j97114
19330b54090p0659J92701K71961O4213j33977J16546r5056j11404j20034p7555
19320b17354o3028Q2875J41716n049m0881j90300o4003j907J37151K9253N8770
19309a32757J70916J05740j3764j55741L4075P7054j0973k79214j10097O9934
19299b44827j29059k22844J31506J45927R2263L44825r4256n1695Q6870p1521
19289a2811p4739K6892L883j9232K6167p1691m6928n629J36348J2269k8087l3228
19277h6786j01406q4321M4659J87769L840l8160n5375k6302L9310J69900k1063
19266C2065n9853J22514L0987j71576m6501L8879p9889n8702P4787j19887j2597
$$ plain form
19255 -249773 -495813 -588303 -325376 -147752 -253211 -584383 -527023 -295311 -145537 -11760
19245 -11760 -105743 -46227 -15469 -55705 -291875 -214162 -237005 -442644 -597332 -432533 -238121
19234 -238121 -264611 -374676 -408567 -320743 -385142 -267071 -114001 105777 -602 -34294
19224 -34294 -38677 -138368 -320863 -25798 93380 121111 142349 225673 241338 283795 112641
19213 112641 132861 133314 -91607 -7821 73241 48663 360304 496471 176336 293599 258431
19202 258431 238363 272947 190323 173552 140471 -4819 -159920 -408502 -538506 -297097
19192 -297097 -110661 -122499 -166800 -317863 -223736 -14413 117485 -206765 -390908 -345745
19182 -345745 -173174 -130934 -233753 -226859 -204929 1158 72690 160648 -44050 30879 98443
$$ packed form
19255b49773k46040r2490K62927J77624j05459l31172N7360K31712J49774J33777
19245a1760r3983N9516L0758m0236k36170P7713k2843k05639j54688J64799J94412
19234b38121k6490j10065l3891Q7824o4399J18071J53070K19778j06379l3692
19224c4294m383r9691j82495K95065J19178K7731K1238Q3324J5665M2457j71154
19213A12641K0220M53k24921Q3786Q1062k4578L11641J36167l20135J17263l5168
19202B58431k0068L4584q2624j6771l3081j45290j55101k48582j30004K41409
19192b97097J86436j1838m4301j51063R4127K09323J31898l24250j84143M5163
19182c45745J72571M2240j02819O894K1930K06087P1532Q7958k04698P4929O7564
$$ plain form
19171 98443 -84519 -218919 -151371 -112540 -211077 -217546 -321136 -332565 -133101 -129393 -326407
19160 -326407 -311897 -247844 -219648 -135173 -39200 8347 12955 78378 120810 -88138 25050
19149 25050 -213895 -315855 184043 463139 394370 330011 310797 217301 214740 364433 616562
19138 616562 523305 319826 154520 53159 73946 69846 170324 107787 129175 160987 242206
19127 242206 163708 -74261 -138917 -15490 -252612 -259516 -17418 44073 -59528 -238995
19117 -238995 -243583 -175190 -169961 -377766 -293769 -82984 -268279 -384087 -402423 -249978 -466021
19106 -466021 -494212 -496271 -385891 -324536 -382678 -518210 -614608 -352478 -62271 -22601 -134888
19095 -134888 -267791 -327744 -318681 -248941 -322771 -257718 -159255 -237881 -53845 233444 217022
$$ packed form
19171I8443j82962j34400O7548L8831r8537o469j03590j1429J99464L708j97014
19160c26407J4510O4053K8196Q4475R5973M7547M608O5423M2432k08948J13188
19149B5050k38945j01960M99898K79096o8769o4359j9214r3496k561J49693K52129
19138F16562r3257k03479j65306j01361K0787m100J00478o2537K1388L1812Q1219
19127B42206p8498k37969o4656J23427k37122o904K42098O1491j03601j79467
19117b38995m588O8393N229k07805Q3997K10785j85295j15808j8336J52445k16043
19106d66021k8191k059J10380O1355n8142j35532r6398K62130K90207L9670j12287
19095a34888j32903n9953R063O9740p3830O5053R8463p8626J84036K87289j6422
$$ plain form
19084 217022 168292 302758 377478 552863 621813 509429 304442 178593 221639 273690
19074 273690 67885 -4953 29970 171161 154593 -164143 -355640 -116521 -185072 -311837
19064 -311837 -191063 -47174 -67213 -182270 -156889 67760 53626 60422 154956 307062 193082
19053 193082 119111 69718 23200 -29629 -22711 10198 122117 267789 415471 641467 639104
19042 639104 531805 600773 578497 333948 -15001 -114345 -85608 116578 225239 290742
19032 290742 149726 262788 196043 337791 337656 348660 373691 395083 303785 124524 44528
19021 44528 236698 390965 336556 208293 173651 121039 67492 13377 -43574 112771 268954
19010 268954 540638 765793 660180 432478 480870 410337 324280 349120 465140 500378
$$ packed form
19084B17022m8730J34466P4720J75385O8950j12384k04987j25849M3046N2051
19074B73690k05805p2838L4923J41191j6568l18736j91497K39119o8551j26765
19064c11837J20774J43889k0039j15057K5381K24649j4134O796R4534J52106j13980
19053A93082p3971m9393m6518n2829O918L2909J11919J45672J47682K25996k363
19042F39104j07299O8968k2276k44549l48949r9344K8737K02186J08661O5503
19032B90742j41016J13062o6745J41748j35J1004K5031K1392r1298j79261p9996
19021D4528J92170J54267n4409j28263l4642n2612n3547n4115n6951J56345J56183
19010B68954K71684K25155j05613k27702M8392p0533q6057K4840J16020L5238
$$ plain form
19000 500378 303509 169888 198024 72372 -53451 -12980 168400 266891 119708 -106870
18990 -106870 -355513 -469595 -372083 -129241 -19941 59173 218005 539128 552775 399881
18980 399881 123728 28371 -77086 -348410 -494074 -298082 260420 357883 -9264 -253745
18970 -253745 -255095 -82017 -181943 -302263 -502642 -585534 -230065 -59958 -123157 -70097 25254
18959 25254 -70537 -323518 -286504 -391458 -338855 -304306 -182518 -188071 -135990 -130348 -224597
18948 -224597 -319881 -110394 -10591 -150377 -57746 -76318 -157199 -197399 -161849 -65026 -355829
18937 -355829 -400186 -126968 -142884 -121792 -169794 -73198 -129071 -259377 -106500 6444 96979
18926 96979 -77164 -262883 -194288 -21118 109601 -61555 -37697 184602 426350 359787
$$ packed form
19000E00378j96869j33621K8136j25652j25823M0471J81380R8491j47183k26578
18990a06870k48643j14082R7512K42842J09300P9114J58832L21123J3647j52894
18980C99881k76153r5357j05457k71324j45664J95992N58502R7463l67147k44481
18970b53745j350J73078r9926j20320k00379q2892L55469J70107o3199N3060R5351
18959B5254r5791k52981L7014j04954N2603L4549J21788n553N2081N642r4249
18948b24597r5284K09487R9803j39786R2631j8572q0881m0200L5550R6823k90803
18937c55829m4357K73218j5916K1092m8002R6596n5873j30306J52877J12944R0535
18926I6979j74143j85719O8595J73170J30719j71156K3858K22299K41748o6563
$$ plain form
18916 359787 402105 370463 198091 25361 -77158 -194317 -262793 4539 -109288 -340304
18906 -340304 -404832 -300985 -130980 -244212 -289353 -86492 191943 127202 -120650 -359707
18896 -359707 -273581 -404495 -555794 -337331 -272925 -286280 -6433 143197 -43868 74791
18886 74791 139738 50835 -91661 -117757 -401494 -357521 -91869 -80497 -141259 -145628 -154160
18875 -154160 -288221 -282010 -361076 -538795 -620823 -496532 -512450 -505202 -416218 -283235 -104709
18864 -104709 197070 313720 104700 -100090 958 6526 -71045 379 -24734 -238486
18854 -238486 -149311 -339521 -352991 -25527 127491 44926 42006 271801 469906 395298 323535
18843 323535 245434 98852 -15268 -118560 -25560 321101 307912 469490 307203 130377
$$ packed form
18916C59787M2318l1642j72372j72730j02519j17159o8476K67332j13827k31016
18906c40304o4528J03847J70005j13232m5141K02861K78435o4741k47852k39057
18896c59707Q6126j30914j51299K18463O4406j3355K79847J49630j87065J18659
18886G4791O4947q8903j42496k6096k83737M3973K65652J1372o0762m369q532
18875a54160j34061O211p9066j77719q2028J24291j5918P248Q8984J32983J78526
18864a04709L01779J16650k09020k04790J01048N568p7571P1424k5113k13752
18854b38486Q9175j90210j3470L27464J53018q2565k920K29795J98105p4608p1763
18843C23535p8101j46582j14120j03292R3000L46661j3189J61578j62287j76826
$$ plain form
18833 130377 -10086 48127 -11345 36587 350888 472672 361105 38708 -81272 -95553
18823 -95553 -39298 122935 -10998 -42718 34744 277812 434822 229463 104117 53382
18813 53382 24832 42670 -269650 -177142 -31400 -90342 212743 371869 198661 112214 129588
18802 129588 390328 344035 26075 20466 -74926 16207 383740 552295 619741 452286 -28635
18791 -28635 -175686 -132607 -215998 -20991 121691 111543 24773 95348 -108122 -331001 -464099
18780 -464099 -394986 -567124 -461182 -158783 114696 356031 490027 362648 387392 475134
18770 475134 522549 482688 809879 1463837 1969512 1944942 1534837 1018814 678136 337645
18760 337645 91501 313792 208908 94169 -29892 -99245 -148782 5260 220468 331470
$$ packed form
18833A30377j40463N8213n9472M7932L14301J21784j11567l22397j19980j4281
18823i5553N6255J62233j33933l1720P7462K43068J57010k05359j25346n0735
18813E3382k8550J7838l12320R2508J45742n8942L03085J59126j73208q6447J7374
18802A29588K60740m6293l17960n609r5392R1133L67533J68555O7446j67455m80921
18791b8635j47051M3079q3391J95007J42682j0148q6770P0575k03470k22879j33098
18780d64099O9113j72138J05942L02399K73479K41335J33996j27379K4744Q7742
18770D75134M7415l9861L27191O53958N05675k4570m10105n16023l40678l40491
18760C37645k46144K22291j04884j14739j24061o9353m9537J54042K15208J11002
$$ plain form
18750 331470 288582 181889 -21214 -109120 -142198 -86298 -83658 -265356 -195613 74473 55878
18739 55878 -1401 -59756 19435 -12605 -75280 36202 104086 -28907 -26181 -114493 -278882
18728 -278882 -315655 -206082 -209876 -100781 -136391 -318526 -496454 -468791 -391821 -149336 -239995
18717 -239995 -422367 -644653 -594740 -476723 -340734 -421875 -484529 -508642 -677914 -543946
18707 -543946 -194637 29084 154687 263552 115047 9134 57297 -114480 69774 364795
18697 364795 565942 292328 9967 -165294 33588 281592 227146 69090 74909 251316
18687 251316 286233 403856 296085 235848 205135 305941 451474 540906 337657 66980
18677 66980 6602 -37693 70774 120240 -85701 -246571 -312286 -239528 -65942 -125166 -74104
$$ packed form
18750C31470m2888j06693k03103q7906l3078N5900K640j81698O9743K70086j8595
18739E5878n7279n8355P9191l2040o2675J11482O7884j32993K726q8312j64389
18728b78882l6773J09573l794J09095l5610j82135j77928K7663P6970K42485r0659
18717b39995j82372k22286M9913J18017J35989q1141o2654k4113j69272J33968
18707e43946L49309K23721J25603J08865j48505j05913M8163j71777J84254K95021
18697C64795K01147k73614k82361j75261J98882K48004n4446j58056N819J76407
18687B51316L4917J17623j07771o0237l0713J00806J45533Q9432k03249k70677
18677F6980o0378m4295J08467M9466k05941j60870o5715P2758J73586n9224N1062
$$ plain form
18666 -74104 75929 123417 72544 -81361 -184312 -102622 -31744 -213499 -192341 -369765 -207426
18655 -207426 -60905 121187 91805 -114817 -18567 -80237 -181673 -156931 -69466 -47390 -152532
18644 -152532 45394 171849 197164 224640 189805 249943 202125 120071 29021 -240661 -93896
18633 -93896 24867 -127189 -225080 -228742 -127967 45823 70874 17812 -185978 -398563 -518847
18622 -518847 -608953 -320927 -293735 -311479 -308343 -214153 -121824 -13860 -103844 -61583 -29622
18611 -29622 57282 183361 343788 342283 157069 91939 25400 -5838 11961 -198346 -372618
18600 -372618 -374413 -41985 50623 -6474 108662 140719 25989 -33489 155133 351536 45809
18589 45809 77207 -152405 -306527 -246711 -200324 -204322 -19085 103632 -73750 -360999 -169641
$$ packed form
18666g4104J50033M7488n0873j53905j02951Q1690P0878j81755K1158j77424J62339
18655b07426J46521J82092k9382k06622R6250o1670j01436K4742Q7465K2076j05142
18644a52532J97926J26455K5315K7476l4835O0138m7818q2054r1050k69682J46765
18633i3896J18763j52056r7891l662J00775J73790K5051n3062k03790k12585j20284
18622e18847r0106K88026K7192j7744L136R4190R2329J07964q9984M2261L1961
18611b9622Q6904J26079J60427j505j85214o5130o6539l1238J7799k10307j74272
18600c72618j795L32428R2608n7097J15136L2057j14730n9478J88622J96403l05727
18589D5809L1398k29612j54122N9816M6387l998J85237J22717j77382k87249J91358
$$ plain form
18578 -169641 -145182 -96685 10719 -32656 -83644 85319 -21173 81491 228360 230058 149050
18567 149050 137988 -67156 -119201 -19854 9488 139579 296116 221827 -75310 -170450 -115631
18556 -115631 -6934 104481 144838 195380 73588 118322 129857 119046 363199 304702 332704
18545 332704 538312 481119 75259 -251059 -309304 -173534 -67556 -18337 49861 -68201
18535 -68201 74619 217276 103216 -104982 -298717 -216412 -90395 -315474 -474376 -337601
18525 -337601 -279459 -306355 -337185 -283311 -275685 -110448 192975 162114 -46128 35576 309847
18514 309847 342146 166720 251500 346727 145155 -194412 -405232 -336318 -174732 173702
18504 173702 129068 149044 23615 -94235 -163857 -4188 266249 256173 40231 -149975
$$ packed form
18578a69641K4459M8497J07404m3375n0988J68963j06492J02664J46869J698q1008
18567A49050j1062k05144n2045R9347K9342J30091J56537p4289k97137r5140N4819
18556a15631J08697J11415M0357N0542j21792M4734J1535j0811K44153n8497K8002
18545C32704K05608n7193m05860l26318n8245J35770J05978M9219O8198j18062
18535f8201J42820J42657j14060k08198j93735Q2305J26017k25079j58902J36775
18525c37601N8142k6896l0830N3874P626J65237L03423l0861k08242Q1704K74271
18514C09847L2299j75426Q4780R5227k01572l39567k10820O8914J61586L48434
18504A73702m4634J9976j25429j17850o9622J59669K70437j0076k15942j90206
$$ plain form
18494 -149975 32163 40889 29822 82356 151698 74967 -96358 -8119 -86488 -336241 -558367
18483 -558367 -628732 -424930 -208409 -180880 -306593 -208080 -249854 -257852 -333864 -369413 -289137
18472 -289137 -81261 163512 75755 -1073 -166025 -327895 -332478 101913 188191 -93
18462 -93 64920 202608 -75509 -161786 -8951 -168949 -147204 -73616 -187391 -247460 -117423
18451 -117423 -118210 -116760 -174589 -101356 77162 128929 87034 73879 155100 223721 -805 -21967
18439 -21967 183635 180566 87301 133250 -282833 -384351 -205983 -33755 -113156 -111273 -189116
18428 -189116 -199143 -11477 99930 183434 189845 100311 87008 232399 304765 160870 242419
18417 242419 453681 368895 431949 405812 342534 319404 325841 369164 161610 40559 -56929
$$ packed form
18494a49975J82138Q726j1067N2534O9342p6731j71325Q8239p8369k49753k22126
18483e58367p0365K03802K16521K7529j25713R8513m1774p998p6012l5549Q0276
18472b89137K07876K44773q7757p6828j64952j61870m583M34391Q6278j88284
18462i3O5013J37688k78117q6277J52835j59998K1745P3588j13775o0069J30037
18451a17423p87J450n7829P3233J78518N1767m1895j3155Q1221O8621k24526k1162
18439b1967K05602l069r3265M5949m16083j01518J78368J72228p9401J883p7843
18428a89116j0027J87666J11407Q3504O411q9534j3303J45391P2366j43895Q1549
18417B42419K11262q4786O3054k6137o3278k3130O437M3323k07554j21051r7488
$$ plain form
18406 -56929 -325763 -285892 -307426 -409805 -205835 203187 451382 467770 139297 238580
18396 238580 292065 194692 322120 182735 -28801 -102377 -216492 -379499 -305735 53017
18386 53017 205375 47426 33614 210290 277297 286279 440317 463372 291530 271866 113018
18375 113018 -233565 -188142 -180323 65308 79286 199456 318816 298757 376642 484164 270943
18364 270943 244983 198580 298057 240455 183269 87089 204355 426390 390883 369786 391094
18353 391094 340160 299657 253084 182650 -30976 48297 398722 501197 313877 -96292
18343 -96292 -111458 74618 141515 54834 -191931 -147471 -108432 76540 4567 97840 327468
18332 327468 358139 436321 511967 629079 686736 503733 509410 358663 247687 253466 647167
$$ packed form
18406e6929k68834L9871k1534j02379K03970M09022K48195J6388l28473R9283
18396B38580N3485r7373J27428j39385k11536p3576j14115j63007P3764L58752
18386E3017J52358j57949j3812J76676O7007Q982J54038K3055j71842j9664j58848
18375A13018l46583M5423P819K45631J3978J20170J19360k0059P7885J07522k13221
18364B70943k5960m6403R9477n7602n7186r6180J17266K22035l5507k1097K1308
18353C91094n0934m0503m6573p0434k13626P9273L50425J02475j87320m10169
18343i6292j5166J86076O6897q6681k46765M4460L9039J84972p1973R3273K29628
18332C27468L0671P8182P5646J17112N7657j83003N677j50747j10976N779L93701
$$ plain form
18321 647167 852459 616034 316690 353092 462082 385848 292862 269460 101376 118460
18311 118460 -59992 -33774 262490 463786 708811 831367 838570 693727 540288 498427
18301 498427 489298 536215 416741 137279 104115 246203 267007 191635 221510 125901 140639
18290 140639 179978 133359 -122170 -191267 -275633 -196620 98131 107277 178593 50457 -125301
18279 -125301 19252 191569 104343 90645 126960 350663 406228 486263 451835 486982 692014
18268 692014 632963 418490 274879 284934 210059 264389 19843 -73334 -43537 198234 211508
18257 211508 292143 185316 268583 356008 374651 217677 4873 13970 61863 -9700 84154
18246 84154 283167 307615 225147 213311 154401 166719 69637 159785 78836 101324 379666
$$ packed form
18321F47167K05292k36425k99344L6402J08990p6234r2986k3402j68084J7084
18311A18460j78452K6218K96264K01296K45025J22556P203j44843j53439m1861
18301D98427r129M6917j19474k79462l3164J42088K0804p5372K9875r5609J4738
18290A40639L9339m6619k55529o9097q4366P9013K94751R146P1316j28136j75758
18279a25301J44553J72317q7226j3698L6315K23703N5565Q0035l4428L5147K05032
18268F92014n9051k14473j43611J0055p4875N4330k44546r3177K9797K41771J3274
18257B11508Q0635j06827Q3267Q7425J8643j56974k12804R097M7893p1563R3854
18246H4154J99013K4448q2468j1836n8910J2318r7082R0148q0949K2488K78342
$$ plain form
18235 379666 307949 131450 72819 84657 54883 -63187 -120387 -92306 28938 67058 131775
18224 131775 119621 264817 335523 378786 402440 411559 529411 603218 372346 393882 242979
18213 242979 158519 127104 -181615 -164828 -2634 223467 84355 99979 -70594 -302073
18203 -302073 -147070 76929 193301 135108 -66119 -114709 250313 340736 469519 674009
18193 674009 382173 175226 319825 239259 270263 387211 537885 393977 430815 312324
18183 312324 404700 318650 264720 218373 365078 396280 525265 453184 314302 439909 762057
18172 762057 866184 919169 1052297 835660 566050 715160 905063 682705 662449 803151
18162 803151 1056867 1282949 1252834 1308768 1210614 1286598 1326502 1115538 960324 701127
$$ packed form
18235C79666p1717j76499n8631J1838k9774j18070n7200K8081J21244L8120O4717
18224A31775j2154J45196P0706M3263K3654R119J17852P3807k30872K1536j50903
18213B42979q4460l1415l08719J6787J62194K26101j39112J5624j70573k31479
18203c02073J55003K23999J16372n8193k01227m8590L65022R0423J28783K04490
18193F74009k91836k06947J44599q0566L1004J16948J50674j43908L6838j18491
18183C12324R2376q6050n3930m6347J46705L1202J28985p2081j38882J25607L22148
18172G62057J04127N2985J33128k16637k69610J49110J89903k22358k0256J40702
18162H03151K53716K26082l0115N5934r8154P5984L9904k10964j55214k59197
$$ plain form
18152 701127 777851 1001319 1278680 1278847 1307501 1439995 1607169 1639534 1551349 1426876 1412308
18141 1412308 1493724 1814025 1985563 2255540 2579314 2829035 3098052 3237207 3446544 3768789
18131 3768789 3986129 4050593 4285111 4927177 5387861 5836466 6292612 6900222 8207996
18122 8207996 9805800 11361319 12992130 15233943 18618902 23190542 29381122 37550933
18114 37550933 48426160 63741344 87154141 125743567 191114419 292568547 386966197
18107 386966197 362927637 275029909 204498712 149707732 109792024 83650370 66262319
18100 66262319 53709672 44812382 38291625 33349005 29634252 26871355 24611332 22394467
18092 22394467 20690477 19307661 17995036 17037450 16303502 15532055 14983720 14584597 13964797
$$ packed form
18152G01127P6724K23468K77361J67K8654J32494J67174L2365q8185j24473j4568
18141A412308Q1416L20301J71538K69977L23774K49721K69017J39155K09337L22245
18131C768789K17340O4464K34518O42066M60684M48605M56146O07610J307774
18122H207996J597804J555519J630811K241813L384959M571640O190580Q169811
18114C7550933J0875227J5315184K3412797L8589426O5370852J01454128R4397650
18107C86966197k4038560q7897728p0531197n4790980l9915708k6141654j7388051
18100F6262319j2552647q897290o520757m942620l714753k762897k260023k216865
18092B2394467j703990j382816j312625r57586p33948p71447n48335l99123o19800
$$ plain form
18083 13964797 13444600 13093204 13058201 12772522 12550179 12481610 12329585 12102375 12127428 12068206
18073 12068206 12043191 12321498 12584969 12704644 12411992 11817170 11106445 10478356 9658645
18064 9658645 9012953 8534114 8087428 7700102 7204961 6618279 6252144 6054600 5891585
18055 5891585 5761263 5704453 5432404 5061345 4844454 4586159 4424751 4368214 3897660 3556801
18045 3556801 3496988 3265573 3002699 2725612 2405592 2361104 2563695 2354972 2262456 1962452
18035 1962452 1681852 1611222 1655812 1816795 1952373 2008249 1905773 1745584 1766258 1781408
18025 1781408 1610878 1593086 1431865 1048889 879294 1067418 1201286 1059911 991804 935313
18015 935313 1046589 1278416 1150007 1277466 1342386 1071781 704825 796220 1011850 1039880
$$ packed form
18083A3964797n20197l51396l5003k85679k22343o8569j52025k27210K5053n9222
18073A2068206k5015K78307K63471J19675k92652n94822p10725o28089q19711
18064I658645o45692m78839m46686l87326m95141n86682l66135j97544j63015
18055E891585j30322n6810k72049l71059k16891k58295j61408n6537m70554l40859
18045C556801n9813k31415k62874k77087l20020m4488K02591k08723r2516l00004
18035A962452k80600p0630M4590J60983J35578N5876j02476j60189K0674J5150
18025A781408j70530j7792j61221l82976j69595J88124J33868j41375o8107n6491
18015I35313J11276K31827j28409J27459O4920k70605l66956R1395K15630K8030
$$ plain form
18005 1039880 991198 964989 886582 673868 542490 360654 383806 584778 795639 701760
17995 701760 812743 944782 1031826 991067 1003392 1115749 962415 777222 622355 533253
17985 533253 435956 395606 523118 725526 1033665 1199587 1086758 778049 639770 566167
17975 566167 672705 815937 873763 778438 849046 701691 682716 609044 583254 499924 848984
17964 848984 867287 579160 535290 593750 618496 461304 217972 317794 501938 475861 238290
17953 238290 114195 42963 235255 333585 326387 209034 108805 29718 189934 418844
17943 418844 513514 458565 530867 775149 870417 752844 502000 236187 150762 216976 77722
17932 77722 84073 198036 420083 501526 513631 461763 605915 653931 418621 -5097 -127338
$$ packed form
18005A039880m8682k6209p8407k12714j31378j81836K3152K00972K10861r3879
17995G01760J10983J32039Q7044m0759J2325J12357j53334j85193j54867q9102
17985E33253r7297m0350J27512K02408L08139J65922j12829l08709j38279p3603
17975E66167J06538J43232N7826r5325P0608j47355j8975p3672k5790q3330L49060
17964H48984J8303k88127m3870N8460K4746j57192k43332R9822J84144k6077k37571
17953B38290j24095p1232J92292R8330p198j17353j00229p9087J60216K28910
17943D18844R4670n4949P2302K44282R5268j17573k50844k65813q5425O6214j39254
17932G7722O351J13963K22047Q1443J2105n1868J44152M8016k35310m23718j22241
$$ plain form
17921 -127338 -40477 179936 339721 323386 403112 517728 656475 591581 597006 675381 739937
17910 739937 644399 734818 695451 755672 806079 689285 612566 644918 750113 671629 632025
17899 632025 609952 805190 899712 922867 870894 744600 683484 844318 874497 763967 653306
17888 653306 772835 1040386 950832 758628 745928 821788 730155 560363 546115 555064 391562
17877 391562 310644 440332 572975 698068 881744 934620 955249 903220 586958 488467
17867 488467 488764 489717 775954 1017083 911130 919268 1029572 1012611 967750 916758 1073676
17856 1073676 1212414 1324738 1635451 1609570 1506121 1618680 1835445 1835331 1739965 1644983
17846 1644983 1485020 1424970 1537536 1566230 1480028 1406291 1471366 1463803 1681876 2162642 2660099
$$ packed form
17921a27338Q6861K20413J59785j6335P9726J14616J38747o4894N425P8375O4556
17910G39937r5538R0419l9367O0221N0407j16794p6719L2352J05195p8484l9604
17899F32025k2073J95238R4522K3155n1973j26294o1116J60834L0179j10530j10661
17888F53306J19529K67551q9554j92204j2700P5860r1633j69792j4248Q949j63502
17877C91562q0918J29688J32643J25093J83676N2876K0629n2029l16262r8491
17867D88467K97R53K86237K41129j05953Q138J10304j6961m4861n0992J56918
17856A073676J38738J12324L10713k5881j03449J12559K16765j14r5366r4982
17846A644983j59963o0050J12566K8694q6202p3737O5075p563K18073M80766M97457
$$ plain form
17835 2660099 3120730 3579512 4185838 5083778 6342499 8068189 10269429 13747039 18729683
17826 18729683 24956359 31173696 35377833 37121919 36509205 33156520 27995324 22678068
17818 22678068 18078291 14470827 11678210 9644999 8388695 7204319 6258868 5629953
17810 5629953 5106023 4875710 4912911 5148011 5108917 5253387 5072679 4748244 4396875 4274930
17800 4274930 4305254 4261400 4000190 3978814 3700830 3744264 4087176 4371559 4826677 5053915
17790 5053915 5101062 5276686 5518016 5665096 5846183 6688687 7967391 9411403 10968103
17781 10968103 13108581 16491942 21141876 27953322 37019346 47777662 58865964 68742473
17773 68742473 75905609 77687783 73860867 66141688 55596474 44932504 35818879 28508802
$$ packed form
17835B660099M60631M58782O06326Q97940J258721J725690K201240L477610M982644
17826A8729683O226676O217337M204137J744086o12714l352685n161196n317256
17818B2678068m599777l607464k792617k033211j256304j184376r45451o28915
17810E629953n23930k30313L7201K35100l9094J44470j80708l24435l51369j21945
17800D274930L0324m3854k61210k1376k77984M3434L42912K84383M55118K27238
17790E053915M7147J75624K41330J47080J81087Q42504J278704J444012J556700
17781A0968103K140478L383361M649934O811446R066024J0758316J1088302R876509
17773F8742473P163136J782174l826916p719179j0545214j0663970r113625p310077
$$ plain form
17765 28508802 23227957 19244040 16011307 13627492 12131954 10798197 9569208 8764300
17757 8764300 8480637 8028525 7426040 7062672 7027549 6744408 6389191 6477755 6335144 6243777
17747 6243777 6181709 6004641 6230882 6281266 6359963 6470149 6598420 6352646 6548389 6764186
17737 6764186 6929671 7094956 7336007 7689800 8018466 8388297 9063083 9980981 11493131
17728 11493131 13824185 17380625 22384249 29181247 36730342 43084811 46310273 46324882
17720 46324882 42830008 36676226 29757584 23618752 18690906 15125375 12517738 10495413
17712 10495413 8890989 7515638 6621683 6136375 5916552 5620392 5204376 5015247 4524887
17703 4524887 4299719 3845668 3774784 3668705 3598593 3659925 3910567 3960050 3706099 3822483
$$ packed form
17765B8508802n280845l983917l232733k383815j495538j333757j228989q04908
17757H764300k83663m52112o02485l63368l5123k83141l55217Q8564j42611r1367
17747F243777o2068j77068K26241N0384P8697J10186J28271k45774J95743K15797
17737F764186J65485J65285K41051L53793L28666L69831O74786R17898J512150
17728A1493131K331054L556440N003624O796998P549095O354469L225462J4609
17720D6324882l494874o153782o918642o138832m927846l565531k607637k022325
17712A0495413j604424j375351q93955m85308k19823k96160m16016j89129m90360
17703D524887k25168m54051p0884j06079p0112O1332K50642M9483k53951J16384
$$ plain form
17693 3822483 3753195 3612635 3631034 3623919 3599141 3364059 3242799 3250907 3232529 3157926 3026970
17682 3026970 2824985 2792323 2898159 2986993 2854215 2370111 2123895 2223826 2317614 2205138
17672 2205138 1825156 1650401 1446526 1593029 1677745 1557433 1366302 1185844 1082829 1085232
17662 1085232 1264451 1330015 1053453 889233 848168 815627 857766 754422 546346 479696
17652 479696 543486 748830 934499 732039 722907 658308 723905 860541 888203 748758 551730
17641 551730 438579 476054 647589 747939 868445 654616 746404 929481 967712 937184
17631 937184 643345 415043 341582 197964 223487 325577 366136 584575 719298 697880
17621 697880 707171 705703 543486 356712 227223 27736 -163095 -23987 185258 50315
$$ packed form
17693C822483o9288j40560J8399p115k4778k35082j21260Q108j8378p4603j30956
17682C026970k01985l2662J05836Q8834j32778m84104k46216R9931R3788j12476
17672B205138l79982j74755k03875J46503Q4716j20312j91131j80458j03015K403
17662A085232J79219O5564k76562j64220m1065l2541M2139j03344k08076o6650
17652D79696O3790K05344J85669k02460r132o4599O5597J36636K7662j39445j97028
17641E51730j13151L7475J71535J00350J20506k13829R1788J83077L8231l0528
17631I37184k93839k28302p3461j43618K5523J02090M0559K18439J34723k1418
17621F97880R291j468j62217j86774j29489j99487j90831J39108K09245j34943
$$ plain form
17611 50315 272509 412179 307919 347434 416043 310982 168780 26318 90689 404394
17601 404394 330900 242215 200232 263242 174899 279140 187087 264426 360954 437065 232544
17590 232544 215871 342821 500428 324559 -11738 -114806 -52924 -63146 -67638 -68682 -185726
17579 -185726 -353330 -188146 109120 149135 35056 403729 501049 439392 353801 209923
17569 209923 33732 367752 463145 396435 294525 162663 214522 100392 63141 32702
17559 32702 -49376 -59332 -26806 68053 -14955 34037 -125224 87722 -110255 -90315 234432
17548 234432 243662 266144 324080 150512 -41130 -40123 -139260 -186541 138896 326162 280055
17537 280055 195640 68969 100922 353698 272717 213650 185115 37899 -7030 -247018 -203059
$$ packed form
17611E0315K22194J39670j04260L9515O8609j05061j42202j42462O4371L13705
17601D04394p3494q8685m1983O3010q8343J04241r2053P7339R6528P6111k04521
17590B32544j6673J26950J57607j75869l36297j03068O1882j0222m492j044j17044
17579a85726j67604J65184K97266M0015j14079L68673R7320o1657q5591j43878
17569B09923j76191L34020R5393o6710j01910j31862N1859j14130l7251l0439
17559C2702q2078r956L2526R4859q3008M8992j59261K12946j97977J9940L24747
17548B34432R230K2482N7936j73568j91642J007r9137m7281L25437J87266m6107
17537B80055q4415j26671L1953K52776q0981n9067k8535j47216m4929k39988M3959
$$ plain form
17526 -203059 -5435 -33814 -245375 -293747 -82674 -402220 -484136 -310325 -41473 80113
17516 80113 198212 132425 151551 108153 36390 51991 -30682 -3531 166704 422386 319868
17505 319868 -65501 -166429 -173903 -171056 -254477 -166936 -13855 138814 252209 154760 158460
17494 158460 207647 286623 203357 191003 107868 115943 289495 255958 194478 35825 -115346
17483 -115346 -135368 -148549 -333386 -253571 -137042 68292 203082 127079 82228 218838
17473 218838 453647 563040 495308 393946 385902 426015 349892 353524 458288 451107 231429
17462 231429 11181 -118085 -136385 38368 48295 100428 122960 -43311 30175 274725 335057
17451 335057 646049 580411 353560 183681 621336 1136659 1300224 1434259 1866346 2411463
$$ packed form
17526b03059J97624k8379k11561m8372K11073l19546q1916J73811K68852J21586
17516H0113J18099o5787J9126m3398p1763J5601q2673K7151J70235K55682j02518
17505C19868l85369j00928p474K847q3421Q7541J53081J52669J13395r7449L700
17494A58460M9187P8976q3266j2354q3135Q075J73552l3537o1480j58653j51171
17483a15346k0022j3181j84837P9815J16529K05334J34790p6003m4851J36610
17473B18838K34809J09393o7732j01362q044M0113p6123L632J04764p181k19678
17462B31429k20248j29266j8300J74753R927N2133K2532j66271P3486K44550O0332
17451C35057L10992o5638k26851j69879M37655N15323J63565J34035M32087N45117
$$ plain form
17441 2411463 2291813 1660904 1061628 845649 620335 564243 531659 440435 400022 316101
17431 316101 418436 582841 515159 527439 501055 65274 -82672 102575 166378 17586
17421 17586 3913 127725 289243 406631 246354 287288 57534 -14564 98075 293248
17411 293248 226091 239976 318448 359132 228457 204455 145176 -56092 48301 239287 478814
17400 478814 387915 316251 469708 443130 186611 787 71176 172948 152744 255519
17390 255519 302442 192124 271754 193861 -17075 -240151 -144329 28043 115899 89638 171612
17379 171612 171366 -12948 -71104 226654 179768 152079 54216 -31147 86063 -5515 -233827
17368 -233827 -226917 -60971 -190832 -86244 -212161 -4292 2619 13980 174321 115034 49369
$$ packed form
17441B411463j19650o30909n99276k15979k25314n6092l2584r1224m0413q3921
17431C16101J02335J64405o7682J2280k6384m35781j47946J85247O3803j48792
17421A7586j3673J23812J61518J17388j60277M0934k29754p2098J12639J95173
17411B93248o7157J3885P8472M0684j30675k4002n9279k01268J04393J90986K39527
17400D78814r0899p1664J53457k6578k56519j85824P0389J01772k0204J02775
17390B55519M6923j10318P9630p7893k10936k23076R5822J72372Q7856k6261Q1974
17379A71612k46j84314n8156K97758m6886k7689r7863q5363J17210r1578k28312
17368b33827O910J65946j29861J04588j25917K07869O911J1361J60341n9287o5665
$$ plain form
17357 49369 -164313 -240216 -197363 -69509 -57915 -104280 -163463 -9521 -106651 -6935 -237242
17346 -237242 -325049 -403535 -467354 -308329 -79883 88307 95850 114245 70672 92214 38461
17335 38461 260238 161171 -119697 -391680 -321517 -238172 -250517 -126577 13804 205978
17325 205978 413201 403989 328586 407250 381425 237083 362145 435596 382497 265110 95118
17314 95118 154725 409657 172400 142385 248386 268150 405868 165099 221215 -42551
17304 -42551 -39696 219983 246577 305429 115650 146346 143004 16765 18878 140306 203478
17293 203478 205827 273281 199088 48574 -15836 -319039 -196177 -72136 -187591 -160246 64933
17282 64933 377375 133389 -68790 13041 287192 198358 -42896 -66002 30768 68185 350242
$$ packed form
17357D9369k13682p5903M2853J27854J1594m6365n9183J53942r7130R9716k30307
17346b37242q7807p8486o3819J59025K28446J68190P543J8395m3573K1542n3753
17335C8461K21777r9067k80868k71983P0163Q3345j2345J23940J40381J92174
17325B05978K07223r212p5403P8664k5825j44342J25062P3451n3099j17387j69992
17314I5118N9607K54932k37257l0015J06001J9764J37718k40769N6116k63766
17304d2551K855K59679K6594N8852j89779L0696l342j26239K113J21428O3172
17293B03478K349O7454p4193j50514o4410l03203J22862J24041j15455K7345K25179
17282F4933L12442k43986k02179Q1831K74151q8834k41254k3106R6770L7417K82057
$$ plain form
17271 350242 426817 377326 605638 640210 564985 729444 617791 468275 445249 410614 183659
17260 183659 -111176 -80547 -135942 -53322 103534 -242724 -520262 -295863 -141667 -203914
17250 -203914 -321053 -26893 163364 343926 153599 51957 87894 203558 266988 268538
17240 268538 192117 144213 397390 351997 130941 53508 -157131 -210760 -72294 65754
17230 65754 98944 -52147 -52124 128538 301388 448291 326541 377879 466296 583800 722041
17219 722041 823597 723471 484734 242837 289164 540472 483250 348576 268157 178439
17209 178439 69448 30797 78562 89266 49805 72517 118090 303680 433836 502912 466804
17198 466804 523567 595785 424321 277346 287178 81501 -217355 -200374 -147330 -91986 -202463
$$ packed form
17271C50242P6575m9491K28312L4572p5225J64459j11653j49516k3026l4635k26955
17260A83659k94835L0629n5395Q2620J56856l46258k77538K24399J54196o2247
17250b03914j17139K94160J90257J80562j90327j01642L5937J15664O3430J550
17240B68538p6421m7904K53177m5393k21056p7433k10639n3629J38466J38048
17230F5754L3190j51091K3J80662J72850J46903j21750N1338Q8417J17504J38241
17219G22041J01556j00126k38737k41897M6327K51308n7222j34674q0419q9718
17209A78439j08991l8651M7765J0704l9461K2712M5573J85590J30156O9076l6108
17198D66804N6763P2218j71464j46975R832k05677k98856J6981N3044N5344j10477
$$ plain form
17187 -202463 -120965 80234 -73453 -14247 136403 157675 36253 -200288 -378600 -475515
17177 -475515 -92074 195707 216900 140428 331782 344328 337940 365355 321228 244747 243328
17166 243328 123860 293041 422034 133330 125351 92279 209209 236768 330150 279645 340662
17155 340662 715617 882331 820635 623908 472301 620029 669239 565579 539539 573123
17145 573123 664974 598959 463158 355387 407829 568602 469756 386256 326026 236049 402599
17134 402599 554881 253583 9131 219327 361591 260291 24739 -115938 -297778 -306879
17124 -306879 -321158 -192010 -6711 289532 505291 567731 764056 799539 559525 275345
17114 275345 291344 429248 470469 399350 442560 733648 679986 656545 582479 612002 784634
$$ packed form
17187b02463Q1498K01199j53687N9206J50650K1272j21422k36541j78312r6915
17177d75515L83441K87781K1193p6472J91354J2546o388K7415m4127p6481j419
17166B43328j19468J69181J28993k88704p979l3072J16930K7559R3382n0505O1017
17155C40662L74955J66714o1696j96727j51607J47728M9210j03660k6040L3584
17145E73123R1851o6015j35801j07771N2442J60773r8846q3500o0230q9977J66550
17134D02599J52282l01298k44452K10196J42264j01300k35552j40677j81840r101
17124c06879j4279J29148J85299K96243K15759O2440J96325L5483k40014k84180
17114B75345J5999J37904M1221p1119M3210K91088n3662k3441p4066K9523J72632
$$ plain form
17103 784634 803562 1009346 950758 807081 723443 777384 1055684 1327634 1175637 730511
17093 730511 651517 768682 642162 490735 440958 373907 362015 388005 136521 141682 357004
17082 357004 344408 294196 263509 324274 501737 420331 266030 156844 282636 585661
17072 585661 496935 414560 230829 -20222 -139781 105092 238565 253963 228725 162323
17062 162323 149570 319536 368088 324676 452666 483970 428484 438103 422640 254593 352392
17051 352392 526345 635008 666213 768859 694797 393122 332396 139254 -96274 72636
17041 72636 225854 538613 688990 540543 318555 238886 347810 435218 252573 258468
17031 258468 272865 142770 73362 201845 97417 140285 -885 145372 312596 121314
$$ packed form
17103G84634J8928K05784n8588j43677q3638N3941K78300K71950j51997m45126
17093G30511p8994J17165j26520j51427m9777o7051j1892K5990k51484N161K15322
17082C57004j2596n0212l0687O0765J77463q1406j54301j09186J25792L03025
17072E85661q8726q2375j83731k51051j19559K44873J33473J5398k5238o6402
17062A62323j2753J69966M8552m3412J27990L1304n5486R619j5463j68047R7799
17051C52392J73953J08663L1205J02646p4062l01675o0726j93142k35528J68910
17041G2636J53218L12759J50377j48447k21988p9669J08924Q7408j82645N895
17031B58468J4397j30095o9408J28483j04428M2868j41170J46257J67224j91282
$$ plain form
17021 121314 146773 278776 262254 82075 243836 253736 209559 161296 301251 373865 351430
17010 351430 333283 140530 54320 123371 197884 116713 -9866 -7264 59371 348614 340204
16999 340204 377671 496741 687035 728880 435205 349993 651905 612576 353596 408875
16989 408875 374840 494925 633523 679918 617836 532699 256811 -126579 94890 435171
16979 435171 335056 171767 115364 150527 185296 296066 145766 -137161 -208653 -342347
16969 -342347 -133049 72302 -3525 -25653 97194 205156 219171 237592 365510 460669
16959 460669 137091 128504 308588 260272 143883 227639 436177 408801 245337 294619 298145
16948 298145 369202 343829 166775 -53118 -178163 -364258 -273566 -76658 119440 210227
$$ packed form
17021A21314K5459J32003j6522j80179J61761R900m4177m8263J39955P2614k2435
17010C51430j8147j92753q6210O9051P4513q1171j26579K602O6635K89243q410
16999C40204L7467J19070J90294M1845k93675q5212L01912l9329k58980N5279
16989D08875l4035J20085J38598M6395o2082q5137k75888l83390K21469L40281
16979D35171j00115j63289n6403L5163L4769J10770j50300k82927p1492j33694
16969c42347K09298K05351p5827k2128J22847J07962J4015J8421J27918R5159
16959D60669l23578q587J80084m8316j16389Q3756K08538k7376j63464M9282L526
16948B98145P1057k5373j77054k19893j25045j86095R0692J96908J96098R0787
$$ plain form
16938 210227 62097 -39676 88007 230523 50366 -92205 -184936 -224661 16876 363816
16928 363816 328789 124807 71635 170981 292685 444606 651194 564653 417633 354539
16918 354539 323435 247703 55315 -25486 59131 62423 80352 104214 171809 112604 212124
16907 212124 113906 -132334 -133329 41521 93891 -152913 -249663 -163511 -125976 -33024 -204178
16896 -204178 -243691 -96295 1010 143318 501510 585532 596842 408184 274989 139827
16886 139827 37693 -11626 75065 183541 214440 196918 292273 389315 386359 291217 183533
16875 183533 341877 250692 38591 -62604 3753 191051 129698 -94065 -398759 -187564
16865 -187564 160120 80569 47106 69508 -97845 -110211 -113273 40908 89911 -80075 70504
$$ packed form
16938B10227j48130j01773J27683J42516j80157j42571r2731l9725K41537L46940
16928C63816l5027k03982n3172R9346J21704J51921K06588q6541j47020o3094
16918C54539l1104p5732j92388q0801Q4617L292J7929K3862O7595n9205R9520
16907B12124r8218k46240r95J74850N2370k46804r6750Q6152L7535R2952j71154
16896b04178l9513J47396R7305J42308L58192Q4022J1310j88658j33195j35162
16886A39827j02134m9319Q6691J08476L0899j7522R5355R7042k956r5142j07684
16875A83533J58344r1185k12101j01195O6357J87298o1353k23763l04694K11195
16865a87564L47684p9551l3463K2402j67353j2366l062J54181M9003j69986J50579
$$ plain form
16854 70504 301046 161780 246229 229102 209083 161960 32720 -4133 141529 74742 40182
16843 40182 136447 499988 651301 540784 161249 92403 51203 -17974 290488 242796 222078
16832 222078 298604 194385 177207 234013 219785 148903 251398 398598 352202 82903 -78958
16821 -78958 195794 526677 565533 562476 403022 362083 148459 -78688 20273 237734 182595
16810 182595 53012 22145 288929 587569 660305 448584 224329 241096 365256 356661
16800 356661 196774 175755 170833 133145 184731 173252 224995 453837 453551 382143 328868 270690
16788 270690 222514 176908 301486 221488 18504 12267 -227205 -105309 233616 350155
16778 350155 265489 86348 49382 -45010 174712 145050 218261 250036 293163 394354 334967
$$ packed form
16854G0504K30542j39266Q4449j7127k0019m7123j29240l6853J45662o6787l4560
16843D0182R6265L63541J51313j10517l79535o8846m1200o9177L08462m7692k0718
16832B22078P6526j04219j7178N6806j4228p0882J02495J47200m6396k69299j61861
16821g8958K74752L30883L8856l057j59454m0939k13624k27147R8961K17461n5139
16810A82595j29583l0867K66784K98640P2736k11721k24255J6767J24160q595
16800C56661j59887k1019m922l7688N1586j1479N1743K28842k86p1408n3275n8178
16788B70690m8176m5606J24578p9998k02984o237k39472J21896L38925J16539
16778C50155q4666j79141l6966r4392K19722k9662P3211L1775M3127J01191n9387
$$ plain form
16767 334967 345187 418881 367892 205939 254175 269139 178783 314673 460426 485091 203460
16756 203460 159899 362363 224330 -46161 119763 200126 265349 394564 573881 652865
16746 652865 656716 559267 292588 133379 97375 101276 288517 458018 585323 619459 287697
16735 287697 99528 53560 295503 436322 596443 596544 363411 283583 346077 338187 260519
16724 260519 313770 523808 581472 618010 625659 532264 599911 661406 913588 1072884 1107004
16713 1107004 1182738 1001480 786467 1143763 1325362 1306839 1343431 1053264 712349 474019
16703 474019 567218 641608 757745 759606 635418 504361 532305 661052 954398 1213410
16693 1213410 1351758 1103610 1200894 1294296 1175754 1198969 1218113 924903 1096079 1292034
$$ packed form
16767C34967J0220P3694n0989j61953M8236J4964r0356J35890J45753K4665k81631
16756B03460m3561K02464j38033k70491J65924Q0363O5223J29215J79317P8984
16746F52865L851r7449k66679j59209l6004L901J87241J69501J27305L4136l31762
16735B87697j88169m5968K41943J40819J60121J01k33133p9828O2494p890p7668
16724B60519N3251K10038N7664L6538P649r3395O7647O1495K52182J59296L4120
16713A107004P5734j81258k15013L57296J81599j8523L6592k90167l40915k38330
16703D74019R3199P4390J16137J861j24188j31057K7944J28747K93346K59012
16693A213410J38348k48148R7284R3402j18542K3215J9144k93210J71176J95955
$$ plain form
16683 1292034 1166138 1190596 1072300 1150775 1340674 1769845 1850453 1598101 1578713 1598946
16673 1598946 1658760 1585859 1745719 2361520 2574493 2543660 2575519 2945134 3562906 4079011
16663 4079011 4321895 4733723 5549899 6492098 7830011 9878996 12734207 16609963 21259693
16654 21259693 25189082 27164784 28154664 29097959 31222482 34120364 35568635 34089377
16646 34089377 30489840 26998584 24610212 23728448 24931300 28044133 32290001 36025479
16638 36025479 37468378 37544884 38322824 40805449 43646956 44032229 40306914 34653386 28977836
16629 28977836 23837693 19698445 16873162 15231290 14018894 13235099 12683599 12646884 12829325
16620 12829325 13585825 14798368 16342339 19055779 23085080 28350182 34026423 37595224
$$ packed form
16683A292034j25896K4458j18296P8475J89899M29171Q0608k52352j9388K0233
16673A598946N9814p2901J59860O15801K12973l0833L1859L69615O17772N16105
16663D079011K42884M11828Q16176R42199J337913K048985K855211L875756M649730
16654B1259693L929389J975702R89880R43295K124523K897882J448271j479258
16646C4089377l599537l491256k388372q81764J202852L112833M245868L735478
16638C6025479J442899P6506P77940K482625K841507L85273l725315n653528n675550
16629B8977836n140143m139248k825283j641872j212396p83795n51500l6715J82441
16620A2829325P56500J212543J543971K713440M029301N265102N676241L568801
$$ plain form
16612 37595224 37796876 36961061 37304646 39180099 41583104 42171811 41258005 41322958 44055005
16603 44055005 49210378 55917544 62960674 68976753 72130456 71671030 70768390 70409266
16595 70409266 69409980 66748798 61010838 54046924 48813161 46084175 46398742 47917629
16587 47917629 48619290 47388926 45579702 45155718 46759684 48924373 48615603 44512856
16579 44512856 38542641 32713318 28078677 24431596 21643993 19639346 18454862 17609801
16571 17609801 17419685 17470875 17807575 18842661 20668743 23542613 27270656 30563259 31496004
16562 31496004 30860541 30606796 31544878 33179438 34459101 33802576 32112428 31080740 31813320
16553 31813320 34796932 40194912 47239092 52033659 51750680 48054578 44898470 44224202
$$ packed form
16612C7595224K01652q35815L43585J875453K403005N88707r13806O4953K732047
16603D4055005N155373O707166P043130O016079L153703m59426r02640l59124
16595G0409266r99286k661182n737960o963914n233763k728986L14567J518887
16587D7917629P01661j230364j809224m23984J603966K164689l08770m102747
16579D4512856n970215n829323m634641l647081k787603k004647j184484q45061
16571A7609801j90116N1190L36700J035086J826082K873870L728043L292603R32745
16562C1496004o35463k53745R38082J634560J279663o56525j690148j031688P32580
16553C1813320K983612N397980P044180M794567k82979l696102l156108o74268
$$ plain form
16545 44224202 45010777 44245153 40071626 34371263 29090095 24853121 21748830 19491533
16537 19491533 17871581 16912135 16450187 16121406 16292669 17080858 18327674 20274380 23402556
16528 23402556 27952161 34507687 42995554 52256677 59928631 65030881 67364228 64824470
16520 64824470 58130481 50522417 44078478 39569754 37606831 38215638 41531998 47913426
16512 47913426 57447192 69081013 79119863 85070477 86392807 82529147 73338128 61595507
16504 61595507 50997340 42918121 37387868 33786689 31749383 31775699 33721582 36940446
16496 36940446 40055889 41654910 41250782 38702369 34803942 29983489 25315710 21487020
16488 21487020 18699114 16569148 15202319 14253775 13285963 12348955 11623285 11045376 10625575
$$ packed form
16545D4224202P86575p65624m173527n700363n281168m236974l104291k257297
16537A9491533j619952r59446m61948l28781J71263P88189J246816J946706L128176
16528B3402556M549605O555526Q487867R261123P671954N102250K333347k539758
16520F4824470o693989p608064o443939m508724j962923O08807L316360O381428
16512D7913426R533766J1633821J0038850N950614J322330l863660r191019j1742621
16504F1595507j0598167q079219n530253l601179k037306K6316J945883L218864
16496C6940446L115443J599021m04128k548413l898427m820453m667779l828690
16488B1487020k787906k129966j366829r48544r67812r37008p25670n77909m19801
$$ plain form
16479 10625575 10471713 10019675 9489892 9135565 8827191 8472073 8231476 7965554 7495905
16470 7495905 7329164 7274633 6931792 6680275 6366770 6206272 6035561 5955270 5423372 4974474
16460 4974474 4781807 4830567 4668306 4285872 4110671 4035748 3876904 3664185 3657773 3482811
16450 3482811 3171671 3024848 2940262 2760090 2493606 2442615 2650294 2561237 2386616 2161974
16440 2161974 2088319 2132231 2176007 2282311 2207180 1972844 1792726 1922820 2131061 2153407
16430 2153407 2211497 1924352 1678598 1367957 1311956 1318399 1374287 1318672 1378326 1257001 1165574
16419 1165574 1127027 1390935 1449320 1404250 1261087 1118223 1027655 1160257 1424405 1317473
16409 1317473 1251278 1190149 1047450 932185 825717 703498 502756 811107 829500 850688
$$ packed form
16479A0625575j53862m52038n29783l54327l08374l55118k40597k65922m69649
16470G495905j66741n4531l42841k51517l13505j60498j70711q0291n31898m48898
16460D974474j92667M8760j62261l82434j75201p4923j58844k12719o412j74962
16450C482811l11140j46823q4586j80172k66484n0991K07679q9057j74621k24642
16440B161974p3655M3912M3776J06304p5131k34336j80118J30094K08241K2346
16430B153407N8090k87145k45754l10641n6001O443N5888n5615N9654j21325r1427
16419A165574l8547K63908N8385m5070j43163j42864r0568J32602K64148j06932
16409A317473o6195o1129j42699j15265j06468j22219k00742L08351J8393K1188
$$ plain form
16399 850688 743531 625156 715842 799313 636819 707683 626267 812538 606292 608576 804010
16388 804010 830650 725501 755363 1164022 1234939 1204573 1122380 1235769 934065 738034
16378 738034 746363 908960 951705 993406 977650 727285 501975 503227 606869 579266 549388
16367 549388 446816 381983 313554 249708 375452 354308 243024 290331 432287 477930 330390
16356 330390 241416 344897 385379 257628 61193 38223 242114 404951 400418 279071
16346 279071 256199 216097 232272 450468 531577 642140 596027 625981 544247 146924 145948
16335 145948 351361 365176 451160 348667 299128 222388 242828 292743 376049 467340 410080
16324 410080 360813 433959 478904 537706 532889 352240 158187 417610 420934 113628 141850
$$ packed form
16399H50688j07157j18375R0686Q3471j62494P0864q1416J86271k06246K284J95434
16388H04010K6640j05149K9862M08659P0917l0366q2193J13389l01704j96031
16378G38034Q329J62597M2745M1701j5756k50365k25310J252J03642k7603k9878
16367E49388j02572o4833o8429o3846J25744k1144j11284M7307J41956M5643j47540
16356C30390q8974J03481M0482j27751j96435k2970K03891J62837m533j21347
16346B79071k2872m0102J6175K18196Q1109J10563m6113K9954q1734l97323r76
16335A45948K05413J3815Q5984j02493m9539p6740K0440M9915Q3306R1291n7260
16324D10080m9267P3146M4945N8802m817j80649j94053K59423L324l07306K8222
$$ plain form
16313 141850 225418 241643 -173802 -302515 -97998 80020 87646 94616 158383 282966 367925
16302 367925 318876 326588 322608 186151 120385 278833 219399 397031 631231 596730 442864
16291 442864 72435 -11823 81590 328602 435377 332610 426051 437988 492133 350376
16281 350376 214961 16447 -257509 -349750 -86690 97394 23325 -39005 18095 168637
16271 168637 378153 529958 281934 202902 -14252 -123851 -204887 -35557 64762 -5808
16261 -5808 -7630 -32825 -122205 262131 413034 156126 -68311 -379584 -331946 -232721 -174142
16250 -174142 129305 446094 619972 246349 232380 365193 403415 591262 613145 375901
16240 375901 232816 401367 256889 46697 125808 8684 63050 -72634 7101 209775
$$ packed form
16313A41850Q3568J6225m15445j28713K04517J78018P626O970O3767J24583Q4959
16302C67925m9049P712l980j36457o5766J58448n9434J77632K34200l4501j53866
16291D42864l70429q4258R3413K47012J06775j02767R3441J1937N4145j41757
16281C50376j35415j98514k73956r2241K63060J84084p4069o2330N7100J50542
16271A68637K09516J51805k48024p9032k17154j09599q1036J69330J00319p0570
16261e808j822k5195q9380L84336J50903k56908k24437l11273M7638R9225N8579
16250a74142L03447L16789J73878l73623j3969J32813L8222J87847K1883k37244
16240C75901j43085J68551j44478k10192P9111j17124N4366j35684P9735K02674
$$ plain form
16230 209775 232925 190649 86516 202376 297244 167736 268140 320250 228462 86124
16220 86124 -14343 -75069 -26742 238940 414106 396426 228078 371339 237478 -95192
16210 -95192 -197564 -67656 -138158 -284638 -2450 123740 218220 271557 163626 282734
16200 282734 146629 -33824 104187 271917 278313 252819 111850 -38073 25841 -92142
16190 -92142 -118479 -132103 -38068 272051 390094 348887 343127 296942 200157 167446 132887
16179 132887 294574 365211 199457 158313 40408 -79245 48685 351635 381320 266260
16169 266260 150065 5383 121746 122456 -37510 27959 88153 165158 184296 -167121 -297647
16158 -297647 247 -42674 -181637 -32383 63241 48797 125176 4959 58027 81865 43330
$$ packed form
16230B09775K3150m2276j04133J15860R4868j29508J00404N2110r1788j42338
16220H6124j00467o0726M8327K65682J75166j7680j68348J43261j33861l32670
16210i5192j02372J29908p0502j46480K82188J26190R4480N3337j07931J19108
16200B82734j36105j80453J38011J67730O396k5494j40969j49923O3914j17983
16190i2142k6337j3624R4035L10119J18043m1207n760m6185r6785l2711l4559
16179A32887J61687P0637j65754m1144j17905j19653J27930L02950K9685j15060
16169B66260j16195j44682J16363P10j59966O5469O0194P7005J9138l51417j30526
16158b97647K97894m2921j38963J49254R5624j4444P6379j20217N3068K3838l8535
$$ plain form
16147 43330 142742 349032 83163 -141135 -167389 -88938 -7631 84275 -30890 86182 -14752
16136 -14752 32104 171029 134830 304750 293730 226350 34068 -118832 -152100 -85497 39531
16125 39531 73480 25761 56745 133395 223336 227002 4851 -104952 -49497 76805 219151
16114 219151 291948 287752 198517 197901 49501 42 85210 145033 242426 196852 254800 123571
16102 123571 -94193 -242471 -176079 -187885 -334867 -229385 -28567 118383 140008 148300
16092 148300 99661 35727 -41960 -183589 -298242 -367805 -484720 -559635 -322850 -295986 -404946
16081 -404946 -123764 110986 -48564 -90225 -8886 106860 190569 372637 314862 152253
16071 152253 38840 -145486 -73481 95069 99181 297946 210079 182557 350309 281562 308477
$$ packed form
16147D3330R9412K06290k65869k24298k6254P8451Q1307R1906j15165J17072j00934
16136a4752M6856J38925l6199J69920j1020o7380j92282j52900l3268O6603J25028
16125C9531L3949m7719L0984P6650Q9941L666k22151j09803N5455J26302J42346
16114B19151P2797m196q9235o16j48400m9459Q5168N9823R7393m5574N7948j31229
16102A23571k17764j48278O6392j1806j46982J05482K00818J46950K1625Q292
16092A48300m8639o3934p7687j41629j14653o9563j16915p4915K36785K6864j08960
16081d04946K81182K34750j59550m1661Q1339J15746Q3709J82068n7775j62609
16071A52253j13413j84326P2005J68550M112J98765q7867k7522J67752o8747K6915
$$ plain form
16060 308477 234229 144778 80488 19811 64036 78359 19572 225297 173322 64636 35063
16049 35063 -212478 -79288 22310 107188 107428 -47850 -133220 -19002 10104 -183919 -142272
16038 -142272 -62373 -139002 -171651 -16653 157014 163014 115661 321220 427618 397659 588988
16027 588988 558554 287159 247550 103582 177658 391713 453746 477581 499065 668574 637792
16016 637792 554359 691463 636995 480593 657656 487400 371973 286449 190388 410951
16006 410951 530844 302804 254012 222380 158561 425039 503328 532220 561514 302935 105334
15995 105334 58764 -14858 185750 173548 73729 -138439 -178989 -347334 -250829 -10135 130931
15984 130931 134563 19996 52630 251155 330320 292832 167410 17960 -27901 52446 102580
$$ packed form
16060C08477p4248q9451o4290o0677M4225J4323n8787K05725n1975j08686k9573
16049C5063k47541J33190J01598Q4878K40j55278q5370J14218K9106j94023M1647
16038a42272P9899p6629l2649J54998J73667O000m7353K05559J06398k9959J91329
16027E88988l0434k71395l9609j43968P4076K14055O2033K3835K1484J69509l0782
16016F37792q3433J37104n4468j56402J77063j70256j15427q5524r6061K20563
16006D10951J19893k28040m8792l1632o3819K66478P8289K8892K9294k58579j97601
15995A05334m6570p3622K00608j2202r9819k12168m0550j68345R6505K40694J41066
15984A30931L632j14567L2634J98525P9165l7488j25422j49450m5861Q0347N0134
$$ plain form
15973 102580 163039 97916 102486 -113469 -282792 -61932 41319 14066 234300 389857
15963 389857 218999 60857 192699 276510 330539 273354 199711 76708 74378 14034 -39998
15952 -39998 101944 83582 113456 232898 277368 92172 -63660 -60622 -373957 -317161 -171319
15941 -171319 -296449 -304189 -278647 -332753 -280520 -168400 -36085 142513 269731 77637
15931 77637 -81941 -55606 -88922 -204391 -470531 -383881 -97072 70732 148997 87614 -119350
15920 -119350 -228937 -134933 -130567 -328024 -239167 -78555 -1292 -47777 -108149 -24792 46143
15909 46143 -130986 -30858 177992 474918 513294 310108 451984 257693 276215 55720
15899 55720 114666 348793 305430 346527 381223 20553 -95184 -40428 -87289 19921 208129
$$ packed form
15973A02580O0459o5123M570k15955j69323K20860J03251k7253K20234J55557
15963C89857j70858j58142J31842Q3811N4029n7185p3643j23003k330o0344n4032
15952c9998J41942j8362K9874J19442M4470j85196j55832L038l13335N6796J45842
15941a71319j25130p740K5542n4106N2233J12120J32315J78598J27218j92094
15931G7637j59578K6335l3316j15469k66140Q6650K86809J67804P8265o1383k06964
15920a19350j09587R4004M366j97457Q8857J60612P7263m6485o0372Q3357P0935
15909D6143j77129J00128K08850K96926L8376k03186J41876j94291J8522k20495
15899E5720N8946K34127m3363M1097L4696l60670j15737N4756m6861J07210J88208
$$ plain form
15888 208129 82862 -87896 -226035 -264391 -408327 -457437 -206741 -79968 -5568 -46212
15878 -46212 -111977 -50849 -2922 -134110 -154234 -255269 -202620 -69558 -168580 -174430 -343814
15867 -343814 -235931 198618 241761 180190 118822 64670 -79756 -331866 -235147 -67016
15857 -67016 -162027 -218291 45156 203986 85143 261734 170784 209873 244025 -30677 -130298
15846 -130298 179293 390093 250106 231402 433282 237953 152730 35016 32562 65568
15836 65568 323439 545581 336070 99307 127168 34220 -66783 167639 252676 197288
15826 197288 196017 79862 17984 151846 445962 432069 317507 -4825 -92824 -202928
15816 -202928 42302 160094 209368 134323 -6865 -288905 -526264 -492035 -551532 -225335
$$ packed form
15888B08129j25267j70758j38139l8356j43936m9110K50696J26773P4400m0644
15878d6212o5765O1128M7927j31188k0124j01035N2649J33062r9022n850j69384
15867c43814J07883M34549M3143o1571o1368n4152j44426k52110R6719J68131
15857f7016r5011n6264K63447J58830j18843J76591r0950L9089L4152k74702r9621
15846a30298L09591K10800j39987j8704K01880j95329q5223j17714k454L3006
15836F5568K57871K22142k09511k36763K7861r2948j01003K34422Q5037n5388
15826A97288j271j16155o1878J33862K94116j3893j14562l22332q7999j10104
15816b02928K45230J17792M9274p5045j41188k82040k37359L4229n9497L26197
$$ plain form
15806 -225335 142665 295405 338356 227380 -13281 -167747 -218754 -46920 140991 465513
15796 465513 542911 188031 65912 314685 400011 270741 398096 352873 171875 12545
15786 12545 90509 152734 393770 336987 458345 217204 51676 -321693 -298308 -55781
15776 -55781 -24073 -79283 -66393 -198912 -195915 -59849 45502 256519 331563 90053 -49037
15765 -49037 -6125 96691 88465 179989 62438 -232386 -274387 -147905 -108163 -78375 -28406
15754 -28406 -81368 -122783 -144146 -189075 -335284 -381480 -370243 -461125 -509706 -257864 186232
15743 186232 370538 305597 98312 -24746 58494 -66930 -17155 45759 -81514 -92820
15733 -92820 -143080 -148157 -18139 108564 163203 148657 73752 43625 -39388 -109857 -64046
$$ packed form
15806b25335L68000J52740M2951j10976k40661j54466n1007J71834J87911L24522
15796D65513P7398l54880j22119K48773Q5326j29270J27355m5223j80998j59330
15786A2545P7964O2225K41036n6783J21358k41141j65528l73369K3385K42527
15776e5781L1708n5210J2890j32519K997J36066J05351K11017P5044k41510j39090
15765d9037M2912J02816q226R1524j17551k94824m2001J26482L9742K9788M9969
15754b8406n2962m1415k1363m4929j46209m6196J1237r0882m8581K51842M44096
15743A86232J84306o4941k07285j23058Q3240j25424M9775O2914j27273j1306
15733i2820n0260n077J30018J26703N4639j4546p4905l0127q3013p0469M5811
$$ plain form
15722 -64046 -18405 -55984 -14392 87689 119956 301999 320605 314210 60280 -58619 -40409
15711 -40409 -8258 121746 317070 292761 393668 319603 33719 -99754 -122469 -33482 113110
15700 113110 214558 69393 -128970 105000 449967 460015 171245 113007 175827 284616
15690 284616 88461 -241896 -235742 -332937 -202546 -84758 -263275 -416827 -430818 -657121
15680 -657121 -692241 -600306 -454807 85928 175040 7450 152466 180881 160066 -41055
15670 -41055 -204633 -110903 -62133 -101982 -171843 -93006 -186041 -262692 -114478 -69061 36697
15659 36697 -219015 -336391 -239293 -280093 -259915 -180660 -90695 -6671 -57627 97562 293467
15648 293467 369281 250324 108863 176746 232099 317843 285203 170543 87902 21043 -38175
$$ packed form
15722f4046M5641l7579M1592J02081L2267J82043J8606o395k53930j18899J8210
15711d0409L2151J30004J95324k4309J00907p4065k85884j33473k2715Q8987J46592
15700A13110J01448j45165j98363K33970L44967J0048k88770n8238O2820J08789
15690B84616j96155l30357O154r7195J30391J17788j78517j53552j3991k26303
15680f57121l5120R1935J45499N40735Q9112j67590J45016K8415k0815k01121
15670d1055j63578R3730M8770l9849o9861P8837r3035p6651J48214M5417J05758
15659C6697k55712j17376R7098m0800K0178P9255Q9965Q4024n0956J55189J95905
15648B93467P5814j18957j41461O7883N5353Q5744l2640j14660q2641o6859n9218
$$ plain form
15637 -38175 -35854 -176552 -345312 -245237 -41053 -148003 -274709 -150139 -153113 -70294 126662
15626 126662 107757 -8933 24724 -330335 -398075 -471676 -401692 -116287 235959 282184 332703
15615 332703 242449 122812 -60605 108903 66944 -53078 -154633 47187 133695 85720
15605 85720 222418 231168 15569 -61350 -14985 35499 139518 371775 256257 236160 104335
15594 104335 142655 254488 170188 115562 31439 3916 -59247 -10345 16882 -53471 112209
15583 112209 310322 380181 248885 107165 32796 -162094 -165558 -424463 -599496 -544920
15573 -544920 -322266 46411 113305 -64822 -79175 -303219 -260789 -350698 -356986 -3765 155094
15562 155094 -7270 -20138 -73050 -70190 29602 -257624 -340129 -214610 -92255 -137221 -67786
$$ packed form
15637c8175K321j40698j68760J00075K04184j06950j26706J24570k974Q2819J96956
15626A26662j8905j16690L3657l55059o7740p3601O9984K85405L52246M6225N0519
15615C32703r0254j19637j83417J69508m1959j20022j01555K01820Q6508m7975
15605H5720J36698Q750k15599p6919M6365N0484J04019K32257j15518k0097j31825
15594A04335L8320J11833q4300n4626q4123k7523o3163M8902K7227p0353J65680
15583A12209J98113O9859j31296j41720p4369j94890l464k58905j75033N4576
15573e44920K22654L68677O6894j78127j4353k24044M2430q9909o288L53221J58859
15562A55094j62364j2868n2912K860R9792k87226q2505J25519J22355m4966O9435
$$ plain form
15551 -67786 -76930 -275068 -404158 -741734 -498257 -181629 14016 -150511 -191154 -194433 63615
15540 63615 256711 189970 262727 291762 256627 -52070 -131569 -263884 -91597 111816 208606
15529 208606 322052 430499 661786 595810 259719 -78401 137719 153321 32344 50221
15519 50221 109266 100678 -177791 -241592 -161748 54008 115998 -88164 -381200 -220460 90436
15508 90436 132989 -87131 58822 276795 419661 321423 115748 130358 63254 -156847
15498 -156847 -284644 -263351 -264410 -274816 -411538 -379602 -365921 -412617 -286670 -253429 -296214
15487 -296214 -116719 -103708 -73160 -161792 -102998 -14347 73436 -83467 -242550 -116174 58469
15476 58469 -11646 118652 8860 -2608 46242 -8065 287332 211970 -12713 349214 279176
$$ packed form
15551f7786r144j98138j29090l37576K43477L16628J95645j64527m0643l279K58048
15540F3615J93096o6741P2757K9035l5135l08697p9499j32315J72287K03413R6790
15529B08606J13446J08447K31287o5976l36091l38120K16120J5602j20977J7877
15519E0221N9045q588k78469o3801P9844K15756O1990k04162k93036J60740L10896
15508I0436M2553k20120J45953K17973J42866r8238k05675J4610o7104k20101
15498a56847j27797K1293j059j0406j36722L1936J3681m6696J25947L3241m2785
15487b96214J79495J3011L0548q8632N8794Q8651Q7783j56903j59083J26376J74643
15476E8469p0115J30298j09792j1468M8850n4307K95397p5362k24683L61927p0038
$$ plain form
15465 279176 52257 41682 153972 183844 74235 150404 74028 101085 177955 21270 -157695
15454 -157695 -216860 -107926 157384 3861 -115159 -154767 -115806 -327886 -219731 -86552
15444 -86552 -241191 -348279 -465319 -544023 -282553 -196167 -151753 -85417 -46468 -24642 -66820
15433 -66820 -95019 -215643 -33357 230797 450862 499030 253899 181182 232470 255476 298953
15422 298953 343859 408406 316730 268094 288868 137565 -88854 -167250 -200635 -172829 53407
15411 53407 133032 119105 123047 91311 -131791 -366431 -573373 -494106 -217704 -75118 -131635
15400 -131635 -304951 -449977 -299148 -442043 -376774 -77587 -28235 105285 136106 -37663
15390 -37663 -43397 29590 5080 -145434 -284750 -138329 -4019 -2769 65173 -88040 -27230
$$ packed form
15465B79176k26919j0575J12290K9872j09609P6169p6376K7057P6870j56685j78965
15454a57695n9165J08934K65310j53523j19020l9608L8961k12080J08155J33179
15444h6552j54639j07088j17040p8704K61470Q6386M4414O6336L8949K1826m2178
15433f6820k8199j20624J82286K64154K20065M8168k45131p2717N1288K3006M3477
15422B98953M4906O4547r1676m8636K0774j51303k26419p8396l3385K7806K26236
15411E3407P9625j3927L942l1736k23102k34640k06942P9267K76402J42586n6517
15400a31635j73316j45026J50829j42895O5269K99187M9352J33520L0821j73769
15390c7663n734P2987k4510j50514j39316J46421J34310J250O7942j53213O0810
$$ plain form
15379 -27230 137584 50897 -125934 -14305 168991 243796 285962 318619 217054 -33274
15369 -33274 58794 -22293 -307476 -222053 -223022 -71373 75614 -8907 37288 241546 173161
15358 173161 -156393 -428933 -275008 -17783 33434 -131926 17520 -246443 -411204 -362829
15348 -362829 -303316 -488216 -380766 -140362 -120703 -105770 -40340 -19944 -288043 -646200
15338 -646200 -558058 -239081 -80888 26129 85238 56675 185111 60751 -133183 -248086
15328 -248086 -317186 -497980 -206738 153180 395955 310896 295832 102779 135059 355179
15318 355179 323239 89294 -105796 -27344 -52754 -258809 -330886 -426487 -265692 -367181
15308 -367181 -260696 -201262 24918 -247468 -303510 -175074 -374775 -422099 -189446 139733
$$ packed form
15379b7230J64814q6687j76831J11629J83296P4805M2166L2657j01565k50328
15369c3274R2068q1087k85183Q5423r69J51649J46987q4521M6195K04258o8385
15358A73161l29554k72540J53925K57225N1217j65360J49446k63963j64761M8375
15348c62829N9513j84900J07450K40404J9659J4933O5430K0396k68099l58157
15338f46200Q8142L18977J58193J07017N9109k8563J28436j24360j93934j14903
15328b48086o9100j80794K91242L59918K42775q5059j5064j93053L2280K20120
15318C55179l1940k33945j95090P8452k5410k06055p2077r5601J60795j01489
15308c67181J06485N9434K26180k72386n6042J28436j99701m7324K32653L29179
$$ plain form
15298 139733 151686 64189 20596 -182666 -242572 -301086 -245708 -274619 -79689 148915 92903
15287 92903 -126573 63380 52557 22930 112000 -131339 -172115 -186714 -231645 -502367 -406314
15276 -406314 -227736 -461936 -374924 -258200 -27807 75595 -141884 -226558 -254168 -430540
15266 -430540 -182962 11793 -93023 52936 -138944 -75854 29364 -4307 -227210 -403126
15256 -403126 -491950 -647055 -654963 -457182 -194151 -188426 -11567 37540 -25125 19888 238993
15245 238993 211195 53796 -237355 -103364 -147963 -142924 -187675 -302623 -341405 -467964 -587187
15234 -587187 -639759 -390597 -93902 -86970 -21264 -2042 -16384 -95344 -96295 -39856 -41182 -246228
15222 -246228 49462 456189 391270 294469 121214 -76672 -281546 -186277 -28485 -121160
$$ packed form
15298A39733J1953q7497m3593k03262n9906n8514N5378k8911J94930K28604n6012
15287I2903k19476J89953j0823k9627Q9070k43339m0776j4599m4931k70722R6053
15276d06314J78578k34200Q7012J16724K30393J03402k17479q4674k7610j76372
15266d30540K47578J94755j04816J45959j91880O3090J05218l3671k22903j75916
15256d03126q8824j55105p908J97781K63031N725J76859M9107o2665M5013K19105
15245B38993k7798j57399k91151J33991m4599N039m4751j14948l8782j26559j19223
15234e87187n2572K49162K96695O932O5706J9222j4342p8960r51N6439j326k05046
15222b46228K95690M06727o4919r6801j73255j97886k04874R5269J57792r2675
$$ plain form
15212 -121160 -167881 -314503 -255881 -91752 80523 -164802 -426037 -486753 -512042 -198174
15202 -198174 73159 -165677 -373288 -533240 -422233 -179371 -113265 -101841 -229932 -491943
15192 -491943 -419256 -223326 13248 118654 -50578 -194900 -199708 -360056 -572067 -407615
15182 -407615 -310610 -231197 -252897 -163493 -271832 -346174 -141859 148612 282180 564747
15172 564747 328847 -506 47863 -5589 -213301 -145476 -38791 32673 60609 251883
15162 251883 174873 53389 -127041 -305090 -227917 -35165 43373 -122403 -51104 53443
15152 53443 153734 261636 372868 401305 315123 242356 57639 166984 272785 108840
15142 108840 -127111 -217768 -224938 -6792 79783 -38081 -165095 -290226 -260424 -107368
$$ packed form
15212a21160m6721j46622N8622J64129J72275k45325k61235o0716k5289L13868
15202a98174K71333k38836k07611j59952J11007K42862O6106J1424j28091k62011
15192d91943P2687J95930K36574J05406j69232j44322m808j60348k12011J64452
15182d07615R7005P9413k1700Q9404j08339p4342K04315K90471J33568K82567
15172E64747k35900l29353M8369n3452k07712O7825J06685P1464K7936J91274
15162B51883p7010j21484j80430j78049P7173J92752P8538j65776P1299J04547
15152E3443J00291J07902J11232K8437q6182p2767j84717J09345J05801j63945
15142A08840k35951r0657p170K18146Q6575j17864j27014j25131K9802J53056
$$ plain form
15132 -107368 -237955 -80763 179973 21644 -350078 -349284 -224797 -37541 -103535 -135685
15122 -135685 28560 77937 -69749 -38520 -262984 -299854 -171962 15945 -116949 -266237
15112 -266237 -198719 -25783 120163 63762 -70163 59427 102455 322236 571627 419900
15102 419900 320488 145224 -30232 -88492 -236343 -507690 -414559 -310601 -177810 -190375
15092 -190375 -93931 62860 -19157 51427 218283 98126 45335 -149956 -2443 281962
15082 281962 187618 74181 -102306 -69063 -101794 -286188 -84824 6295 23870 57384 70408
15071 70408 -165113 -364129 -470668 -412151 -535620 -768386 -848639 -589868 -429069 -137257
15061 -137257 -31521 -64821 -27332 -81261 -92975 -118868 -157783 81192 -48109 -207180 -232571
$$ packed form
15132a07368j30587J57192K60736j58329l71722P94J24487J87256o5994l2150
15122a35685J64245M9377j47686L1229k24464l6870J27892J87907j32894j49288
15112b66237O7518J72936J45946n6401j33925J29590M3028K19781K49391j51727
15102D19900r9412j75264j75456n8260j47851k71347R3131J03958J32791j2565
15092a90375R6444J56791q2017P0584J66856j20157n2791j95291J47513K84405
15082B81962r4344j13437j76487L3243l2731j84394K01364R1119J7575L3514J3024
15071G0408k35521j99016j06539N8517j23469k32766q0253K58771J60799K91812
15061a37257J05736l3300L7489n3929j1714k5893l8915K38975j29301j59071k5391
$$ plain form
15050 -232571 -180812 -44529 57645 -140553 -410696 -407255 -238228 70088 48893 -151555
15040 -151555 -204923 -413297 -521277 -415671 -560609 -542339 -253032 -183312 -79232 -7302
15030 -7302 -40640 -96354 -183499 -96640 133113 191674 -238037 -368612 -254506 -142539 -116821
15019 -116821 -109887 -68005 -165220 -328784 -385504 -300197 -134285 101898 198036 60072 -116588
15008 -116588 180553 612216 405748 129069 56387 -42920 -70578 26044 58799 121397 -45495
14997 -45495 -359024 -280371 -184000 30538 134730 31193 100818 -61103 -103231 -27646 87275
14986 87275 121004 88295 -6259 173189 215012 206233 90134 65707 73389 -21542 -91045 -62197
14974 -62197 -115376 -53265 248158 386243 283061 110060 20257 -63070 -117875 57594 103337
$$ packed form
15050b32571N1759J36283J02174j98198k70143L441J69027L08316k1195k00448
15040a51555n3368k08374j07980J05606j44938J8270K89307O9720J04080P1930
15030g302l3338n5714q7145Q6859K29753N8561m29711j30575J14106J11967K5718
15019a16821O934M1882r7215j63564n6720Q5307J65912K36183R6138j37964j76660
15008a16588K97141M31663k06468k76679p2682r9307k7658R6622L2755O2598j66892
14997d5495l13529P8653R6371K14538J04192j03537O9625j61921m2128P5585J14921
14986H7275L3729l2709r4554J79448M1823q779j16099k4427P682r4931o9503K8848
14974f2197n3179O2111L01423J38085j03182j73001q9803q3327n4805J75469M5743
$$ plain form
14963 103337 83583 295864 335423 136126 296370 304972 164710 125973 133269 93890 104498
14952 104498 81325 60071 -89216 -63519 210965 304441 269951 374951 325724 353750 -12461
14941 -12461 -314153 -275542 -307393 -57412 -74576 -127853 61541 58596 -167704 -322328 -229280
14930 -229280 -3088 32947 179866 355665 -75820 -261535 -96128 100247 40495 47296
14920 47296 33410 22067 -29063 -410900 -475374 -426968 -460817 -500559 -424512 -524131 -587008
14909 -587008 -268580 -54375 -64385 -132641 -357699 -447532 -365568 -368018 -355006 -212016 -194772
14898 -194772 -212929 -122470 -142457 -183553 -153783 -170707 -65054 70544 76910 69787 10784
14887 10784 -290157 -618305 -449133 -171063 -286531 -432619 -229284 -89913 -3703 -31205
$$ packed form
14963A03337j9754K12281L9559j99297J60244Q602j40262l8737P296l9379J0608
14952A04498k3173k1254j49287K5697K74484R3476l4490J05000m9227K8026l66211
14941a2461l01692L8611l1851K49981j7164n3277J89394k945k26300j54624R3048
14930b29280K26192L6035J46919J75799m31485j85715J65407J96375n9752O801
14920D7296j3886j1343n1130l81837o4474M8406l3849l9742P6047r9619o2877
14909e87008L18428K14205j0010o8256k25058q9833Q1964k450J3012J42990J7244
14898a94772j8157R0459j9987m1096K9770j6924J05653J35598O366p123n9003
14887A0784l00941l28148J69172K78070j15468j46088K03335J39371Q6210k7502
$$ plain form
14877 -31205 -50906 -61945 -98320 -242459 -220486 -124989 -22976 -164039 -57709 57508 203420
14866 203420 258708 135454 -72894 -7949 -59635 -381671 -411268 -318889 -313994 -356851 -184092
14855 -184092 52517 15823 -185537 -251846 -167370 -281768 -450517 -460230 -305901 205453
14845 205453 419437 79728 57818 24937 -47688 39711 176324 158274 203577 378504 507111
14834 507111 354979 197045 150983 216383 237816 204491 -50704 9386 -6270 -26451 -44153
14823 -44153 224389 172747 -37097 -87768 7792 -60232 -190298 -149984 -75147 106321 273969
14812 273969 275861 341749 106593 -28994 -32403 -122437 -88607 -86882 -87659 42727 288411 524909
14800 524909 502076 336607 411771 371877 214320 211952 148585 -4895 -74733 -95894 -258287
$$ packed form
14877c1205j9701j1039l6375j44139K1973R5497J02013j41063J06330J15217J45912
14866B03420N5288j23254k08348O4945n1686l22036k9597R2379M895m2857J72759
14855a84092K36609l6694k01360o6309Q4476j14398j68749r713J54329N11354
14845B05453K13984l39709k1910l2881p2625Q7399J36613j8050M5303J74927J28607
14834E07111j52132j57934m6062O5400K1433l3325k55195O0090j5656k0181j7702
14823d4153K68542n1642k09844n0671R5560o8024j30066M0314P4837J81468J67648
14812B73969J892O5888k35156j35587l409r0034L3830J725p77J30386K45684K36498
14800E24909k2833j65469P5164l9894j57557k368o3367j53480o9838k1161j62393
$$ plain form
14789 -258287 -244506 -84463 3101 -790 -83837 1655 105212 92357 93330 88291 169999 1905
14777 1905 55550 201679 295306 365174 358038 288354 135892 114489 59992 -8829 -70721 -162727
14765 -162727 -189818 -52686 -90122 -58731 103868 146236 2858 -42277 53584 114161 84755
14754 84755 214228 270075 180486 87622 10979 -184334 -106095 -37295 4327 -13076 -45045
14743 -45045 -43868 -170655 -219592 -221577 -174138 -56483 184455 142609 96968 6024 -110656
14732 -110656 -70190 -134873 16100 58965 -109411 -137621 18785 162996 75380 136104 316645
14721 316645 279343 59241 190192 208488 228022 342935 315918 233589 139384 223182 147302
14710 147302 55368 -74351 -201488 -299099 -427671 -157853 14035 84258 50526 -272830
$$ packed form
14789b58287J3781J60043Q7564l891q3047Q5492J03557j2855R73n039Q1708j68094
14777A905N3645J46129R3627O9868p136o9684j52462k1403n4497o8821o1892r2006
14765a62727k7091J37132l7436L1391J62599M2368j43378m5135R5861O0577k9406
14754H4755J29473N5847q9589r2864p6643j95313P8239O8800M1622j7403l1969
14743d5045J177j26787m8937j985M7439J17655K40938m1846m5641r0944j16680
14732a10656M0466o4683J50973M2865j68376k8210J56406J44211q7616O0724J80541
14721C16645l7302k20102J30951J8296J9534J14913k7017q2329r4205Q3798p5880
14710A47302r1934j29719j27137r7611j28572K69818J71888P0223l3732l23356
$$ plain form
14700 -272830 9383 307007 310445 159863 -6260 67599 266738 403456 243001 179489
14690 179489 183367 74817 -166725 -222412 -83096 143462 -22820 -240756 -215095 -76389
14680 -76389 -20052 -110492 -242544 -333873 -254628 -226436 -208849 -37152 -6032 82220 -213192
14669 -213192 -131284 18557 -58991 -150852 -277692 -328413 -266325 -70664 -108419 -328415 -289844
14658 -289844 -149150 61777 199052 381091 302683 215611 113269 -73574 -16423 -65972
14648 -65972 -41491 -5090 105977 146405 32295 11698 149316 202999 158371 195420 182334
14637 182334 -24203 -37226 269598 352919 151735 -71026 75707 -41795 -339771 -306453
14627 -306453 5858 56771 -17936 152466 46051 -151953 -96547 -201982 -356975 -232057
$$ packed form
14700b72830K82213K97624L438j50582j66123P3859J99139J36718j60455o3512
14690A79489L878j08550k41542n5687J39316K26558j66282k17936K5661J38706
14680g6389N6337r0440j32052r1329P9245K8192J7587J71697L1120Q8252k95412
14669b13192Q1908J49841p7548r1861j26840n0721O2088J95661l7755k19996L8571
14658b89844J40694K10927J37275J82039p8408q7072j02342j86843N7151m9549
14648f5972K4481L6401J11067M0428j14110k0597J37618N3683m4628L7049j3086
14637A82334k06537j3023L06824Q3321k01184k22761J46733j17502k97976L3318
14627c06453L12311N0913p4707J70402j06415j98004N5406j05435j54993J24918
$$ plain form
14617 -232057 -182820 -70728 -58916 106470 63853 122861 -29605 -78444 -123851 -345507 -252704
14606 -252704 51048 132805 132879 32623 96278 -229398 135121 222661 129283 -78720 -233470
14595 -233470 -276774 -258432 -198356 -163935 -185917 54546 160943 383639 468072 539632 307425
14584 307425 115523 172855 85100 43948 27454 4680 15910 190199 333940 307685 94894
14573 94894 14528 124163 -12294 -122902 -51110 25793 -178900 -276873 -184570 -170739 -193177
14562 -193177 -117944 -235590 -296169 -105847 -203919 -438814 -206201 -263646 -250901 -186820 -310592
14551 -310592 -233834 -59642 234041 100938 -54528 -154801 -157038 -277006 -165300 5432
14541 5432 -138667 51837 256596 195493 4211 -208557 -113192 50933 102363 27126 38418
$$ packed form
14617b32057M9237J12092J1812J65386m2617N9008j52466m8839m5407k21656R2803
14606b52704L03752Q1757P4j00256O3655l25676L64519Q7540r3378k08003j54750
14595b33470m3304J8342O0076L4421k1982K40463J06397K22696Q4433P1560k32207
14584C07425j91902N7332q7755m1152j6494k2774J1230J74289J43741k6255k12791
14573I4894q0366J09635j36457j10608P1792P6903k04693r7973R2303J3831k2438
14562a93177P5233j17646o0579J90322r8072k34895K32613n7445J2745O4081j23772
14551c10592P6758J74192K93683j33103j55466j00273k237j19968J11706J70732
14541E432j44099J90504K04759o1103j91282k12768R5365J64125N1430p5237J1292
$$ plain form
14530 38418 195385 166641 249454 -67690 -330944 -511999 -423350 -198064 153745 269257
14520 269257 259146 283767 159457 201327 458511 426301 -65317 -763542 -763713 -483751 -324635
14509 -324635 -127232 22491 -184345 -234281 -85897 -29825 -112192 41158 113559 155321
14499 155321 130194 359556 401387 63358 55273 211423 50955 53548 37495 38893 -170303
14488 -170303 -136394 -207704 -542025 -498034 -552142 -377480 -197393 -183351 -180271 -131887 -435652
14477 -435652 -364510 -144814 -246390 -22496 120332 61338 -97889 -205565 -202591 -398188
14467 -398188 -611918 -184377 -86465 -246327 -413316 -269924 -210099 -291112 -326693 -3567
14457 -3567 110658 224224 117897 27889 158960 120396 -51922 -57470 -42790 131217 124978
$$ packed form
14530C8418J56967k8744Q2813l17144k63254j81055Q8649K25286L51809J15512
14520B69257j0111K4621j24310M1870K57184l2210m91618o98225j71K79962J59116
14509c24635J97403J49723k06836m9936J48384N6072q2367J53350P2401M1762
14499A55321k5127K29362M1831l38029q085J56150j60468K593j6053J398k09196
14488a70303L3909p1310l34321M3991n4108J74662J80087J4042L080M8384l03765
14477d35652P1142K19696j01576K23894J42828n8994j59227j07676K974j95597
14467c98188k13730M27541R7912j59862j66989J43392N9825q1013l5581L23126
14457c567J14225J13566j06327r0008J31071l8564j72318n548J4680J74007o239
$$ plain form
14446 124978 78281 -53996 -168458 -132652 -352181 -296981 -475937 -255128 -45912 115193
14436 115193 -31508 -207926 -353704 -449389 -503440 -439821 -204740 38053 45686 -58708
14426 -58708 -295183 -503915 -545617 -432138 -329390 -267625 -318153 -221133 65002 134876 147779
14415 147779 112503 297293 338178 -74668 -28882 271109 195673 -72756 -28216 126986
14405 126986 116170 89699 73860 18814 -10322 -131878 -303030 -290560 -184825 -182567 -140526
14394 -140526 -169821 -97792 -203694 -419871 -466456 -372193 -236429 -232248 -184771 -191606 72357
14383 72357 106006 216218 132006 -32648 11319 21851 -190886 -275901 -169879 -231876 -232337
14372 -232337 -186608 -414178 -617177 -532379 -51439 68965 6234 -41550 -238189 -458349
$$ packed form
14446A24978m6697j32277j14462L5806k19529N5200j78956K20809K09216J61105
14436A15193j46701j76418j45778r5685n4051O3619K35081K42793P633j04394
14426e8708k36475k08732m1702J13479J02748O1765n0528R7020K86135O9874J2903
14415A47779l5276J84790M0885m12846M5786K99991p5436k68429M4540J55202
14405A26986j0816k6471j5839n5046k9136j21556j71152J2470J05735K258M2041
14394a40526k9295P2029j05902k16177m6585R4263J35764M181M7477o835K63963
14383G2357L3649J10212q4212j64654M3967J0532k12737q5015J06022o1997m61
14372b32337M5729k27570k02999Q4798M80940J20404o2731m7784j96639k20160
$$ plain form
14362 -458349 -408443 -195088 -233041 -266305 -42657 78123 80256 -34525 162580 447732
14352 447732 376803 39764 -15858 -144591 -227606 -90466 -197486 -230318 -87591 143521
14342 143521 293397 135923 161646 190211 322126 175581 224707 290262 367693 392962 48578
14331 48578 -167679 -207855 -340104 -283865 -330590 -352452 -102344 -165686 -82702 51533 216072
14320 216072 148231 -63781 -223018 -243584 -176473 -10814 115421 177701 244711 237070 240014
14309 240014 247674 225531 72493 -105967 -8863 -23909 -135940 -82591 -175837 -229184 -370743
14298 -370743 -316364 -390231 -235035 75555 439441 390792 339580 364543 249342 52687
14288 52687 161497 100227 7660 -18322 209453 114546 44772 -12301 -86242 -196372 -135913
$$ packed form
14362d58349M9906K13355l7953l3264K23648J20780K133j14781J97105K85152
14352D47732p0929l37039n5622j28733q3015J37140j07020l2832J42727K31112
14342A43521J49876j57474K5723K8565J31915j46545M9126O5555P7431K5269l44384
14331D8578k16257m0176j32249N6239m6725k1862K50108o3342Q2984J34235J64539
14320B16072o7841k12012j59237k0566O7111J65659J26235O2280O7010p641K944
14309B40014P660k2143j53038j78460R7104j5046j12031N3349r3246n3347j41559
14298c70743N4379p3867J55196L10590L63886m8649n1212K4963j15201j96655
14288E2687J08810o1270r2567k5982K27775r4907o9774n7073p3941j10130O0459
$$ plain form
14277 -135913 -14108 135853 229938 165039 27741 63982 65767 -67142 -172756 -220569 -124593
14266 -124593 -264342 -205010 -187143 -241146 -115165 1466 63378 192212 65515 -222127
14256 -222127 -17717 155504 221692 -47852 -332468 -324269 -52262 73581 193990 156624
14246 156624 -33411 -20502 89575 72551 90328 36876 -170783 -339743 -234272 52303
14236 52303 73867 -97534 -307864 -357659 -257653 -215116 -237526 -330206 -312509 -97849 72558
14225 72558 294989 181955 194049 194787 64841 -168590 -310591 -338860 -439518 -491009 -455928
14214 -455928 -384078 -280727 -207870 -19549 -16196 -283055 -326081 -224442 -334044 -387689 -324089
14203 -324089 -141426 143171 168802 11623 -1912 97634 -50572 -272540 -74331 -26068
$$ packed form
14277a35913J21805J49961R4085o4899j37298L6241J785j32909j05614m7813R5976
14266a24593j39749N9332J7867n4003J25981J16631O1912J28834j26697k87642
14256b22127K04410J73221O6188k69544k84616Q199K72007J25843J20409l7366
14246A56624j90035J2909J10077j7024J7777n3452k07659j68960J05471K86575
14236E2303K1564j71401k10330m9795J00006M2537k2410r2680J7697K14660J70407
14225G2558K22431j13034J2094P38j29946k33431j42001k8269j00658n1491L5081
14214d55928P1850J03351P2857J88321L353k66859m3026J01639j09602n3645O3600
14203c24089J82663K84597K5631j57179j3535R9546j48206k21968J98209M8263
$$ plain form
14193 -26068 -210589 -267790 -92662 -187366 64665 53778 101170 486086 555217 329660 -58184
14182 -58184 138619 446635 283178 -103014 -103224 -65101 -87396 21731 84359 -68431 -247623
14171 -247623 -173751 -247763 -228 -34262 -89047 -150743 -124377 -215418 -274826 -326513 -377845
14160 -377845 -124260 -37850 -40225 -74761 -173377 -186207 -388752 -369958 -176657 -104576 32329
14149 32329 51452 9327 -227752 -310812 -326509 -441983 -517476 -249240 32799 -28510 -176483
14138 -176483 -167991 -336553 -307898 -40174 48208 82902 87695 33650 -28825 -87553 -246081
14127 -246081 -568721 -736855 -417597 -153607 -83143 -34478 -78136 26427 -58286 -127764
14117 -127764 -75392 -48088 -172933 -235754 -108051 -92696 -190874 -277192 -293782 -144482 70377
$$ packed form
14193b6068j84521n7201J75128r4704K52031j0887M7392L84916O9131k25557l87844
14182e8184J96803L08016j63457l86192k10L8123k2295J09127O2628j52790j79192
14171b47623P3872p4012K47535l4034n4785o1696K6366r1041n9408n1687n1332
14160c77845K53585Q6410k375l4536r8616j2830k02545J8794J93301P2081J36905
14149C2329J9123m2125k37079q3060j5697j15474p5493K68236K82039o1309j47973
14138a76483Q492j68562K8655K67724Q8382L4694M793n4045o2475n8728j58528
14127b46081l22640j68134L19258K63990P0464M8665m3658J04563q4713o9478
14117a27764N2372K7304j24845o2821J27703J5355r8178q6318j6590J49300K14859
$$ plain form
14106 70377 133962 61808 86501 31004 -243983 -231301 -102831 -22938 117276 256015 357783
14095 357783 364616 59130 -164878 -158169 43177 186239 23725 99853 272750 129023
14085 129023 236704 252690 68151 99157 99229 -42797 -205132 -349149 -699468 -692978 -598538
14074 -598538 -548700 -501662 -341779 -29480 -108253 -241677 -262693 -49234 78974 78739 92104
14063 92104 -50030 -58670 110702 304063 403265 323382 332015 184923 -148774 -209960 22741
14052 22741 -82246 -369554 -488188 -601240 -695283 -602771 -520595 -341592 -343566 -248432 -443588
14041 -443588 -469074 -123644 8511 -32042 -92710 -60837 -60660 -67180 130936 89097 100578
14030 100578 64079 180991 257583 176527 -13428 -170339 -394325 -528379 -160151 76001
$$ packed form
14106G0377O3585p2154K4693n5497k74987J2682J28470P9893J40214J38739J01768
14095C57783O833l05486k24008O709K01346J43062j62514P6128J72897j43727
14085A29023J07681J5986j84539L1006P2j42026j62335j44017l50319O490R4440
14074e98538M9838M7038J59883L12299p8773j33424k1016K13459J28208k35J3365
14063I2104j42134q640J69372J93361R9202p9883Q633j47092l33697o1186K32701
14052B2741j04987k87308j18634j13052r4043R2512Q2176J79003j974R5134j95156
14041d43588k5486L45430J32155m0553o0668L1873J77o520J98116m1839J1481
14030A00578l6499J16912P6592q1056j89955j56911k23986j34054L68228K36152
$$ plain form
14020 76001 -3695 -30187 -42562 -136991 -219957 -203237 -170582 -459924 -295624 -106803 -23615
14009 -23615 -164995 -6026 255998 200260 237015 149810 254984 372613 270421 104688
13999 104688 -51728 -206421 -174252 -348792 -442662 -222152 -14380 -331310 -385855 -451230
13989 -451230 -242622 -101136 20137 77838 200278 474267 628392 379316 389075 423849
13979 423849 375495 305305 401244 408687 268064 66410 -46927 -134261 93505 157174 112463
13968 112463 51449 -60510 -84381 -72076 16421 89415 29108 34052 27496 -43392 -193320
13957 -193320 -18815 83188 -67521 -434499 -607278 -159170 50610 -86603 -26875 221836
13947 221836 -75102 -191064 -111201 -173649 -117376 167154 428940 394608 323721 195862
$$ packed form
14020G6001p9696k6492j2375r4429q2966J6720L2655k89342J64300J88821Q3188
14009b3615j41380J58969K62024n5738L6755q7205J05174J17629j02192j65733
13999A04688j56416j54693L2169j74540r3870K20510K07772l16930n4545o5375
13989d51230K08608J41486J21273N7701J22440K73989J54125k49076R759L4774
13979D23849m8354p0190R5939P443j40623k01654j13337q7334K27766O3669m4711
13968A12463o1014j11959k3871J2305Q8497P2994o0307M944o556p0888j49928
13957a93320J74505J02003j50709l66978j72779M48108K09780j37213N9728K48711
13947B21836k96938j15962P9863o2448N6273K84530K61786l4332p0887j27859
$$ plain form
13937 195862 145943 409425 674203 531225 334730 88080 125848 348643 497758 547147
13927 547147 575549 528822 350695 43071 -86985 -68746 55044 142547 214950 293617 95581
13916 95581 -232590 -84620 -225124 -257412 -16063 106182 -142140 -143121 -122368 -210434 -86164
13905 -86164 -23465 -27998 -106844 -116146 -311025 -346935 -146736 -121401 -184573 -176167 -72080 -2753
13893 -2753 -52701 -241836 -144729 -200268 -116679 226351 236408 -102950 -233754 -313693 -341524
13882 -341524 -213770 -213654 160875 409521 307031 175222 80209 249940 -21967 -133178
13872 -133178 -121982 92382 371277 475041 408461 253948 61703 -111771 -319410 -339127
13862 -339127 -5383 -117866 -293881 -425063 -369453 -314632 -158575 12687 119846 -82704
$$ packed form
13937A95862m9919K63482K64778j42978j96495k46650L7768K22795J49115M9389
13927E47147K8402m6727j78127l07624j30056J8239J23790Q7503P2403P8667j98036
13916I5581l28171J47970j40504l2288K41349J22245k48322r81K0753q8066J24270
13905h6164O2699m533p8846r302j94879l5910K00199K5335o3172Q406J04087O9327
13893b753m9948j89135R7107n5539Q3589L43030J0057l39358j30804p9939k7831
13882c41524J27754J16L74529K48646j02490j31809r5013J69731k71907j11211
13872a33178J1196K14364K78895J03764o6580j54513j92245j73474k07639j9717
13862c39127L33744j12483j76015j31182N5610N4821J56057J71262J07159k02550
$$ plain form
13852 -82704 -305581 -196679 -155513 -206370 -82655 25297 -98038 167850 456241 439693
13842 439693 60271 -213997 -226380 -264816 -336938 -391318 -496791 -455284 -523558 -402741 -54863
13831 -54863 121792 189989 150381 -84996 -82555 -116568 -51408 53676 29618 -195261 -140403
13820 -140403 -356456 -342286 -38942 -185375 -475912 -227805 -331586 -603701 -516363 -192669
13810 -192669 -233467 -97965 9444 53888 -35304 -220267 -72740 -156807 -605558 -779851
13800 -779851 -453868 -203929 -193067 -50330 34289 64103 16128 -193524 -295445 -139983
13790 -139983 36814 53013 -89804 76753 220070 282610 358793 179193 28775 -30872
13780 -30872 -110598 -13392 -39642 -143924 -238132 -125780 156635 324842 261748 237001 358335
$$ packed form
13852h2704k22877J08902M1166n0857J23715J07952j23335K65888K88391j6548
13842D39693l79422k74268j2383l8436p2122n4380j05473M1507o8274J20817L47878
13831e4863J76655O8197l9608k35377K441l4013O5160J05084k4058k24879N4858
13820a40403k16053J4170L03344j46433k90537K48107j03781k72115Q7338L23694
13810a92669m0798J35502J07409M4444q9192j84963J47527q4067m48751j74293
13800g79851L25983K49939J0862J42737Q4619K9814m7975k09652j01921J55462
13790a39983J76797J6199j42817J66557J43317O2540P6183j79600j50418n9647
13780c0872p9726R7206k6250j04282r4208J12352K82415J68207o3094k4747J21334
$$ plain form
13769 358335 159416 9738 22561 231577 236917 88560 -56663 -136044 -223468 -346660
13759 -346660 -425993 -396924 -233098 -112521 -219072 -157255 -95443 32475 138828 211054
13749 211054 193693 166123 -79613 -68220 -77778 -21216 147354 250341 240352 270970 43520
13738 43520 70495 -19396 21220 -135041 -268563 -137949 -51422 -108264 -284469 -186743 -249987
13727 -249987 -291197 -102256 -275380 -415401 -517619 -491531 -615942 -508683 -401782 -343673
13717 -343673 -92235 80416 120072 -148050 -50743 6771 -32545 -251328 -255731 -157900 -209939
13706 -209939 -223438 106257 153531 -588 -64880 -105934 -89208 -190350 -183718 -231881 -258714
13695 -258714 -310405 -393171 -66695 149543 334274 172749 82812 -91919 -145562 -167943
$$ packed form
13769C58335j98919j49678J2823K09016N340j48357j45223p9381q7424j23192
13759c46660p9333K9069J63826J20577j06551O1817O1812J27918J06353P2226
13749B11054j7361k7570k45736J1393r558N6562J68570J02987r989L0618k27450
13738D3520K6975q9891M0616j56261j33522J30614Q6527n6842j76205R7726o3244
13727b49987m1210J88941j73124j40021j02218K6088j24411J07259J06901N8109
13717c43673K51438J72651L9656k68122R7307N7514l9316k18783m403R7831n2039
13706b09939j3499L29695M7274j54119o4292m1054J6726j01142O632m8163k6833
13695b58714n1691q2766L26476K16238J84731j61525q9937j74731n3643k2381
$$ plain form
13685 -167943 -21357 81239 17605 135398 -20773 -126583 -252950 -53834 95104 91922
13675 91922 -231450 -258375 -150609 -102345 159566 240323 77278 21471 195895 159726 218737
13664 218737 273945 353427 122054 136597 73063 -6863 95418 148650 11067 -304463 -402835
13653 -402835 -427690 -291971 -281549 13913 -18610 -46189 -211248 -237523 -250722 -26568 173960
13642 173960 -5355 -5862 267617 476936 557807 394572 66996 -38656 -106260 -338812
13632 -338812 -415660 -476344 -239414 37179 322806 292646 167606 66676 203110 195157
13622 195157 231467 273548 210088 141943 318806 164476 174812 185827 293129 173769 -146857
13611 -146857 -305522 -260968 -256889 -383790 -232739 -226056 -186704 -96686 -249463 -277091 -202307
$$ packed form
13685a67943J46586J02596o3634J17793j56171j05810j26367J99116J48938l182
13675I1922l23372k6925J07766M8264K61911Q0757j63045n5807J74424l6169N9011
13664B18737N5208P9482k31373J4543o3534p9926J02281N3232j37583l15530r8372
13653d02835k4855J35719J0422K95462l2523k7579j65059k6275j3199K24154K00528
13642A73960j79315n07K73479K09319Q0871j63235l27576j05652o7604k32552
13632c38812p6848o0684K36930K76593K85627l0160j25040j00930J36434p953
13622A95157L6310M2081o3460o8145J76863j54330J0336J1015J07302j19360l20626
13611a46857j58665M4554M079j26901J51051O683L9352R0018j52777k7628P4784
$$ plain form
13600 -202307 21207 142867 69021 -221996 -429981 -360845 -211036 -25388 124548 167186
13590 167186 207130 240918 153884 321423 350858 119829 -183760 -297332 -128101 -209376
13580 -209376 -351476 -276492 -157655 -158018 -259752 -233983 -95237 -190470 -382249 -459051 -275684
13569 -275684 -22526 -61227 -188287 -332485 -332780 -268596 -46128 117664 234264 282909 146245
13558 146245 58528 138653 -12396 237338 248287 136223 105976 5972 -162832 -157803 -74318
13547 -74318 -208588 -24907 33843 -130586 -18467 367494 591571 514037 549220 646720
13537 646720 392945 319698 336842 314637 242070 319747 205008 -45676 -53452 -131232 -142971
13526 -142971 -147433 -105222 -129922 -109999 -37176 7541 36193 126158 304711 228793 340449
$$ packed form
13600b02307K23514J21660p3846k91017k07985O9136J49809J85648J49936M2638
13590A67186L9944L3788q7034J67539K9435k31029l03589j13572J69231q1275
13580b09376j42100P4984J18837l63j01734K5769J38746r5233j91779p6802J83367
13569b75684K53158l8701j27060j44198k95O4184K22468J63792J16600M8645j36664
13558A46245q7717Q0125j51049K49734J0949j12064l0247j00004j68804N029Q3485
13547g4318j34270J83681N8750j64429J12119L85961K24077p7534L5183R7500
13537F46720k53775p3247J7144k2205p2567P7677j14739k50684p776p7780j1739
13526a42971m462M2211k4700J9923P2823M4717K8652Q9965J78553p5918J11656
$$ plain form
13515 340449 441401 178405 211178 284833 561530 960842 1059158 1151773 1429432 1234881
13505 1234881 689362 272712 -38946 21936 222071 126355 30637 12347 22945 122102
13495 122102 -72442 -91768 -20048 -10598 27689 137755 -5091 -52026 128346 118135 -122381
13484 -122381 92045 -4541 -81564 89984 352961 190401 -2294 198013 413945 320176
13474 320176 428093 401436 170225 34676 135753 267129 187941 187301 47724 90960 149152
13463 149152 89429 157843 239769 376669 338117 339418 -7465 -389016 -367075 -68543 171495
13452 171495 269916 191021 225726 70230 -113146 -130522 -249419 -157521 -47054 154514
13442 154514 592485 492085 198424 7718 95315 125790 186743 94159 176041 157310 289427
$$ packed form
13515C40449J00952k62996L2773P3655K76697L99312R8316R2615K77659j94551
13505A234881n45519m16650l11658O0882K00135r5716r5718j8290J0598R9157
13495A22102j94544j9326P1720R450L8287J10066j42846m6935J80372j0211k40516
13484a22381K14426r6586p7023J71548K62977j62560j92695K00307K15932r3769
13474C20176J07917k6657k31211j35549J01077J31376p9188o40j39577M3236N8192
13463A49152n9723O8414Q1926J36900l8552J301l46883l81551K1941K98532K40038
13452A71495R8421p8895L4705j55496j83376j7376j18897R1898J10467K01568
13442A54514M37971j00400k93661j90706Q7597L0475O0953r2584Q1882j8731J32117
$$ plain form
13431 289427 365070 258318 113367 231708 228747 154481 277951 279279 165002 -20749 -119481
13420 -119481 -163697 -62862 -62379 -143585 -67338 106637 30851 30313 -913 44707 -47571 -90090
13408 -90090 -317986 -320707 -181689 -69752 153152 -70357 -201170 -71556 -139936 -484646
13398 -484646 -513417 -377281 -183802 -67203 88121 277379 172814 9433 13539 178562
13388 178562 179630 146313 191172 322392 210151 -50032 -141216 30868 -8342 -223868 -92671
13377 -92671 61820 374481 494724 228782 -201347 -547226 -589898 -203912 -82870 -45901
13367 -45901 -77080 -87564 101603 -92428 -54392 88590 221657 80829 53000 190805
13357 190805 263652 457679 478538 224771 151417 133574 32866 224991 271661 162713
$$ packed form
13431B89427P5643j06752j44951J18341k961p4266J23470J328j14277j85751r8732
13420a19481m4216J00835M83q1206P6247J73975p5786n38l1226M5620r2278m2519
13408i0090k27896k721J39018J11937K22904k23509j30813J29614o8380l44710
13398d84646k8771J36136J93479J16599J55324J89258j04565j63381M106J65023
13388A78562J068l3317M4859J31220j12241k60183r1184J72084l9210k15526J31197
13377i2671J54491L12661J20243k65942m30129l45879m2672L85986J21042L6969
13367d5901l1179j0484J89167j94031L8036J42982J33067j40828k7829J37805
13357A90805P2847J94027K0859k53767p3354j7843j00708J92125M6670j08948
$$ plain form
13347 162713 280061 144608 55988 220962 51850 -372622 -269369 40580 -27463 -115351
13337 -115351 -65284 167884 302036 358331 258842 204655 361247 385452 182604 308905
13327 308905 345960 214709 106314 -38840 103013 315022 368018 285825 543286 550433
13317 550433 666321 687262 520266 680940 646844 794434 935433 780963 746767 759660
13307 759660 670559 582918 498021 393737 482610 745943 618081 357889 407450 359960 379590
13296 379590 289498 664187 695638 771787 669877 511769 604722 728932 701309 565183
13286 565183 478149 608204 957568 1124923 1100742 1099983 1183201 1081467 1240696 1457684 1554324
13275 1554324 1500360 1416556 1469333 1387171 1364907 1181913 1140993 1152536 1063881 825129 841726
$$ packed form
13347A62713J17348j35453q8620J64974j69112m24472J03253L09949o8043q7888
13337a15351N0067K33168J34152N6295r9489n4187J56592K4205k02848J26301
13327C08905L7055j31251j08395j45154J41853K12009N2996q2193K57461P147
13317E50433J15888K0941j66996J60674l4096J47590J40999j54470l4196J2893
13307G59660q9101q7641q4897j04284Q8873K63333j27862k60192M9561m7490J9630
13296C79590r0092L74689L1451P6149j01910j58108R2953J24210k7623j36126
13286E65183q7034J30055L49364J67355k4181p59Q3218j01734J59229K16988R6640
13275A554324n3964q3804N2777q2162k2264j82994m0920J1543q8655k38752J6597
$$ plain form
13264 841726 707576 621135 586161 609503 757740 862636 719209 618388 739768 664414
13254 664414 400101 549408 721507 605829 556442 471018 574626 770303 822819 820689
13244 820689 1009364 1235634 1084446 933968 1081599 1249996 1269227 1382168 1402942 1437864
13234 1437864 1107686 1078074 1187415 1051538 1255774 1334692 1228022 791493 775255 772758
13224 772758 796819 991876 771342 693873 694342 826502 913874 1008483 977426 775685 765921
13213 765921 878573 763340 756758 1008346 1211893 1821363 2506276 2942367 3398818 3846248
13203 3846248 3631670 3124989 2733011 2320709 2214713 1904953 1469887 1252495 1408103
13194 1408103 1465560 1445381 1658904 1649566 1471007 1192089 1071836 843327 768792 834668
$$ packed form
13264H41726j34150q6441l4974K3342J48237J04896j43427j00821J21380p5354
13254F64414k64313J49307J72099j15678m9387q5424J03608J95677N2516k130
13244H20689J88675K26270j51188j50478J47631J68397J9231J12941K0774L4922
13234A437864l30178k9612J09341j35877K04236P8918j06670m36529j6238k497
13224G72758K4061J95057k20534p7469M69J32160Q7372R4609l1057k01741r764
13213G65921J12652j15233o582K51588K03547O09470O84913M36091M56451M47430
13203C846248k14578n06681l91978m12302j05996l09760m35066k17392J55608
13194A408103N7457k0179K13523r338j78559k78918j20253k28509p4535O5876
$$ plain form
13184 834668 785390 603291 664110 738868 775819 842229 775458 779196 680341 710325 794180
13173 794180 893020 1209487 1283710 1369903 1670884 2014103 2261474 2222069 2685049 3701620
13163 3701620 4983376 6500076 8479921 10499395 11496988 11149628 9558191 7811020
13155 7811020 6302897 4940184 3879501 3503953 3088965 2965310 2606297 2338449 2279383
13146 2279383 2479364 2439826 2259906 2255613 2204255 2190143 1912834 1926588 1909145 1981955 2231216
13135 2231216 2395335 2634906 2647038 2747859 2797985 2614811 2526120 2819866 3206297 3358624
13125 3358624 3524680 3804953 3909621 4284493 4782392 5205984 6137021 7368439 8920108
13116 8920108 11005709 13203803 14960979 15409767 14457442 12994810 11583069 10803417 10689627
$$ packed form
13184H34668m9278j82099O0819P4758L6951O6410o6771L738r8855K9984Q3855
13173G94180R8840L16467P4223Q6193L00981L43219K47371l9405M62980J016571
13163C701620J281756J516700J979845K019474R97593l47360j591437j747171
13155G811020j508123j362713j060683l75548m14988j23655l59013k67848n9066
13146B279383J99981l9538j79920m293n1358j4112k77309J3754j7443P2810K49261
13135B231216J64119K39571J2132J00821N0126j83174q8691K93746L86431J52327
13125C358624J66056K80273J04668L74872M97899M23592R31037J231418J551669
13116H920108K085601K198094J757176M48788r52325j462632j411741p79652j13790
$$ plain form
13107 10689627 11252749 12402272 13936913 15882421 18195942 21815395 27134979 34838748
13099 34838748 45129929 58120225 71499290 80195116 80076850 72180632 60885744 50247903
13091 50247903 41353173 34295204 28851416 24794821 22000153 19907301 18006995 16767351
$$ packed form
13107A0689627N63122J149523J534641J945508K313521L619453N319584P703769
13099C4838748J0291181J2990296J3379065Q695826j18266p896218j1294888j0637841
13091E0247903q894730p057969n443788m056595k794668k092852j900306j239644
$$ [...]
##END NTUPLES=NMR SPECTRUM
##END=
