##TITLE=Analysis number 312406
Compound Code cc 42016
Book Reference 437/30
Project Code adrs
Chemist Name wendyb
##JCAMPDX= 6.0         $$ Bruker NMR JCAMP-DX V2.0
##DATA TYPE= NMR SPECTRUM
##DATA CLASS= NTUPLES
##ORIGIN= Bruker BioSpin GmbH
##OWNER= NMR
$$ XWIN-NMR		Version 3.5
$$ Wed Aug  3 11:41:44 2005 GMT Daylight Time (UT+1h)  MAYBRIDGE\NMR@NMR_250MHZ
##.OBSERVE FREQUENCY= 250.131544655141
##.OBSERVE NUCLEUS= ^1H
##.ACQUISITION MODE= SIMULTANEOUS (DQD)
##.ACQUISITION SCHEME= undefined
##.AVERAGES= 16
##.DIGITISER RES= 18
##SPECTROMETER/DATA SYSTEM= dpx250
##.PULSE SEQUENCE= zg30
##.SOLVENT NAME= CDCl3
##.SHIFT REFERENCE= (INTERNAL, CDCl3, 0, 16.522)
##AUDIT TRAIL= $$ (NUMBER, WHEN, WHO, WHERE, WHAT)
$$ ##TITLE= Audit trail, XWIN-NMR		Version 3.5
$$ ##JCAMPDX= 5.01
$$ ##ORIGIN= Bruker BioSpin GmbH
$$ ##OWNER= NMR
$$ C:\u/data/dgb/nmr/ADRS/7100/pdata/1/auditp.txt
$$ ##AUDIT TRAIL=  $$ (NUMBER, WHEN, WHO, WHERE, WHAT)
(   1,<2005-08-03 11:41:09.04 +100>,<MAYBRIDGE\NMR>,<NMR_250MHZ>,
      <created by zg, POWCHK disabled, PULCHK disabled
       configuration hash MD5:
       62 19 C7 07 E1 42 D1 B7 37 6C 3D D0 77 39 F9 E6
       data hash MD5: 64K
       15 03 EA 76 61 FC 71 7E A5 7F BF E1 80 4E D7 F5>)
(   2,<2005-08-03 11:41:24.34 +100>,<MAYBRIDGE\NMR>,<NMR_250MHZ>,
      <Start of raw data processing
       ef LB = 0.3 FT_mod = 6 PKNL = 1 SI = 32K 
       data hash MD5: 32K
       51 2A 71 72 E7 74 19 79 6D E9 FF 69 00 98 2B F5>)
(   3,<2005-08-03 11:41:29.78 +100>,<MAYBRIDGE\NMR>,<NMR_250MHZ>,
      <apk 
       data hash MD5: 32K
       48 CB 94 AA 9F F7 73 BD ED 8D 2A 25 FA 30 59 7F>)
(   4,<2005-08-03 11:41:31.50 +100>,<MAYBRIDGE\NMR>,<NMR_250MHZ>,
      <abs ABSG = 5 
       data hash MD5: 32K
       D6 C3 DE 9B CF DB 7E F1 4C 05 2C 37 4B DE 05 58>)
$$ ##END=
$$ 
$$ hash MD5
$$ A1 C0 F3 EB C7 17 F6 4A 30 EF 2F E1 9A F7 4D 4B
##$RELAX= 
##$RELAX= 
##$RELAX= 
##$RELAX= 
##$RELAX= 
##$RELAX= 
##$RELAX= 
$$ Bruker specific parameters
$$ --------------------------
##$DU= <C:\u>
##$EXPNO= 7100
##$NAME= <ADRS>
##$PROCNO= 1
##$TYPE= <nmr>
##$USER= <dgb>
##$AMP= (0..31)
100 100 100 100 100 100 100 100 100 100 100 100 100 100 100 100 100 100 
100 100 100 100 100 100 100 100 100 100 100 100 100 100 
##$AQSEQ= 0
##$AQ_mod= 3
##$AUNM= <au_zg>
##$AUTOPOS= <16 >
##$BF1= 250.13
##$BF2= 250.13
##$BF3= 250.13
##$BF4= 250.13
##$BF5= 500.13
##$BF6= 500.13
##$BF7= 500.13
##$BF8= 500.13
##$BYTORDA= 1
##$CFDGTYP= 0
##$CFRGTYP= 5
##$CHEMSTR= <none>
##$CNST= (0..31)
1 1 145 1 1 1 1 1 1 1 1 1 1 1 1 1 1 1 1 1 1 1 1 1 1 1 1 1 1 1 1 1 
##$CPDPRG= <>
##$CPDPRG1= <>
##$CPDPRG2= <>
##$CPDPRG3= <>
##$CPDPRG4= <mlev>
##$CPDPRG5= <mlev>
##$CPDPRG6= <mlev>
##$CPDPRG7= <mlev>
##$CPDPRG8= <mlev>
##$CPDPRGB= <>
##$CPDPRGT= <>
##$D= (0..31)
0 1 0 0 0 0 0 0 0 0.06 0 0 0 0 0 0 0.0002 0 0 0 0 0 0 0 0 0 0 0 0 0 0 
0 
##$DATE= 1123065667
##$DBL= (0..7)
120 120 120 120 120 120 120 120 
##$DBP= (0..7)
150 150 150 150 150 150 150 150 
##$DBP07= 0
##$DBPNAM0= <>
##$DBPNAM1= <>
$$ [...]
##$SUBNAM7= <"">
##$SUBNAM8= <"">
##$SUBNAM9= <"">
##$SW= 20.6930455092707
##$SWIBOX= (0..15)
0 0 3 0 0 0 0 0 0 0 0 0 0 0 0 0 
##$SW_h= 5175.983436853
##$TD= 65536
##$TD0= 1
##$TE= 295.16
##$TE2= 300
##$TE3= 300
##$TEG= 300
##$TL= (0..7)
0 120 120 120 120 120 120 120 
##$TP= (0..7)
150 150 150 150 150 150 150 150 
##$TP07= 0
##$TPNAME0= <>
##$TPNAME1= <>
##$TPNAME2= <>
##$TPNAME3= <>
##$TPNAME4= <>
##$TPNAME5= <>
##$TPNAME6= <>
##$TPNAME7= <>
##$TPOAL= (0..7)
0.5 0.5 0.5 0.5 0.5 0.5 0.5 0.5 
##$TPOFFS= (0..7)
0 0 0 0 0 0 0 0 
##$TUNHIN= 0
##$TUNHOUT= 0
##$TUNXOUT= 0
##$USERA1= <user>
##$USERA2= <user>
##$USERA3= <user>
##$USERA4= <user>
##$USERA5= <user>
##$V9= 5
##$VALIST= <valist>
##$VCLIST= <CCCCCCCCCCCCCCC>
##$VD= 0
##$VDLIST= <DDDDDDDDDDDDDDD>
##$VPLIST= <PPPPPPPPPPPPPPP>
##$VTLIST= <TTTTTTTTTTTTTTT>
##$WBST= 1024
##$WBSW= 4
##$XGAIN= (0..3)
0 0 0 0 
##$XL= 0
##$YL= 0
##$YMAX_a= 458623
##$YMIN_a= -705983
##$ZGOPTNS= <>
##$ZL1= 120
##$ZL2= 120
##$ZL3= 120
##$ZL4= 120
##$ABSF1= 16.522
##$ABSF2= -4.171173
##$ABSG= 5
##$ABSL= 3
##$ALPHA= 0
##$AQORDER= 0
##$ASSFAC= 0
##$ASSFACI= 0
##$ASSFACX= 0
##$ASSWID= 0
##$AUNMP= <proc_1d>
##$AZFE= 0.1
##$AZFW= 0.1
##$BCFW= 0
##$BC_mod= 0
##$BYTORDP= 0
##$COROFFS= 0
##$CY= 12.5
##$DATMOD= 1
##$DC= 0
##$DFILT= <>
##$DTYPP= 0
##$F1P= 14.0000005364418
##$F2P= -0.99999901652339
##$FCOR= 0.5
##$FTSIZE= 32768
##$FT_mod= 6
##$GAMMA= 0
##$GB= 0
##$INTBC= 1
##$INTSCL= 1
##$ISEN= 128
##$LB= 0.3
##$LEV0= 0
##$LPBIN= 0
##$MAXI= 10000
##$MC2= 0
##$MEAN= 0
##$ME_mod= 0
##$MI= 0
##$NCOEF= 0
##$NC_proc= -5
##$NLEV= 6
##$NOISF1= 0
##$NOISF2= 0
##$NSP= 0
##$NTH_PI= 0
##$NZP= 0
##$OFFSET= 16.522
##$PC= 1
##$PHC0= -79.83512
##$PHC1= 6.554039
##$PH_mod= 1
##$PKNL= yes
##$PPARMOD= 0
##$PSCAL= 4
##$PSIGN= 0
##$REVERSE= no
##$SF= 250.13
##$SI= 32768
##$SIGF1= 0
##$SIGF2= 0
##$SINO= 400
##$SIOLD= 32768
##$SREGLST= <1H.CDCl3>
##$SSB= 0
##$STSI= 32768
##$STSR= 0
##$SW_p= 5175.98343685301
##$SYMM= 0
##$S_DEV= 0
##$TDeff= 65536
##$TDoff= 0
##$TI= <Analysis number 999999
Compound Code 99
Book Reference 9
Project Code 9>
##$TILT= no
##$TM1= 0
##$TM2= 0
##$TOPLEV= 0
##$USERP1= <user>
##$USERP2= <user>
##$USERP3= <user>
##$USERP4= <user>
##$USERP5= <user>
##$WDW= 1
##$XDIM= 32768
##$YMAX_p= 478739667
##$YMIN_p= -221715
$$ End of Bruker specific parameters
$$ ---------------------------------
##NTUPLES= NMR SPECTRUM
##VAR_NAME=  FREQUENCY,     SPECTRUM/REAL,   SPECTRUM/IMAG
##SYMBOL=    X,             R,               I
##VAR_TYPE=  INDEPENDENT,   DEPENDENT,       DEPENDENT
##VAR_FORM=  AFFN,          ASDF,            ASDF
##VAR_DIM=   32768,         32768,           32768
##UNITS=     HZ,            ARBITRARY UNITS, ARBITRARY UNITS
##FACTOR=    0.157963299565203, 1,           1
##FIRST=     4132.6476996994, 0,             0
##LAST=      -1043.33573715361, 0,           0
##MIN=       -1043.33573715361, -221715,     0
##MAX=       4132.6476996994, 478739667,     0
$$ Real data points
##PAGE= N=1
##DATA TABLE= (X++(R..R)), XYDATA
$$ [...]
$$ plain form
17981 2382901 2417643 2442623 2410955 2405041 2458365 2493052 2542786 2575553 2574758 2564861 2646935 2730790
17969 2730790 2782910 2896256 2969493 3085732 3201451 3295643 3514927 3780505 3978567 4121199
17959 4121199 4300313 4585394 4839098 5123104 5487459 5910830 6419923 6941458 7525026
17950 7525026 8146694 8855921 9691464 10599029 11664436 12941525 14479620 16419228 18549136
17941 18549136 20489226 21908051 23197196 24831492 27272618 30808158 35736236 42079031
17933 42079031 49753038 59320364 72424222 91406601 118268612 153466873 197675933
17926 197675933 251713461 309812824 356170204 375434334 366581348 343371848 323762936
17919 323762936 319662030 333958145 359992527 382559327 387030767 369921258 339650717
$$ packed form
17981B382901L4742K4980l1668n914N3324L4687M9734L2767p95r897Q2074Q3855
17969B730790N2120J13346P3237J16239J15719R4192K19284K65578J98062J42632
17959D121199J79114K85081K53704K84006L64355M23371N09093N21535N83568
17950G525026O21668P09227Q35543R07565J065407J277089J538095J939608K129908
17941A8549136J940090J418825J289145J634296K441126L535540M928078O342795
17933D2079031P674007R567326J3103858J8982379K6862011L5198261M4209060
17926A97675933N4037528N8099363M6357380J9264130q852986k3209500j9608912
17919C23762936m100906J4296115K6034382K2566800M471440j7109509l0270541
$$ plain form
17912 339650717 306108928 272613785 238364350 204098968 172817434 147551838 130227325
17905 130227325 121831949 121854724 126627370 129452298 125095610 113241917 97379789 81174841
17897 81174841 67022362 55712142 47102660 40570798 35443268 31356175 28304634 26267307
17889 26267307 25340849 25447151 26821612 29895956 35358259 44526833 58590687 76660490
17881 76660490 93734984 103042099 102575564 96094609 89843526 88636021 93856159 102088862
17873 102088862 106384190 102264430 90895024 76787372 64250458 55746135 52087642
17866 52087642 53057832 56904215 60107901 59707155 55677848 50464693 46778407 46124580
17858 46124580 48280670 50870385 50668465 46463148 39502367 31941481 25271768 20181861
$$ packed form
17912C39650717l3541789l3495143l4249435l4265382l1281534k5265596j7324513
17905A30227325q395376K2775M772646K824928m356688j1853693j5862128j6204948
17897H1174841j4152479j1310220q609482o531862n127530m087093l051541k037327
17889B6267307r26458J06302J374461L074344N462303R168574J4063854J8069803
17881G6660490J7074494R307115m66535o480955o251083j207505N220138Q232703
17873A02088862M295328m119760j1369406j4107652j2536914q504323l658493
17866E2087642R70190L846383L203686m00746m029307n213155l686286o53827
17858D6124580K156090K589715k01920m205317o960781p560886o669713n089907
$$ plain form
17850 20181861 16468388 13756376 11593933 9756720 8276836 7108996 6169571 5482590
17842 5482590 4992850 4574155 4176076 3838397 3542798 3321113 3112144 2882172 2697709
17833 2697709 2531627 2381425 2224943 2086908 1952278 1878823 1860054 1912473 1871264 1806887
17823 1806887 1792540 1737459 1667377 1603672 1561518 1514250 1463021 1403792 1345819 1312106 1320288
17812 1320288 1295151 1280651 1304313 1316728 1320712 1304516 1299153 1254922 1206719 1188278 1128645 1086953
17800 1086953 1099026 1142176 1139498 1123278 1127641 1163153 1156733 1151023 1228587 1223716 1136078 1151178
17788 1151178 1227322 1303422 1379329 1484919 1639834 1735869 1786751 1768233 1748987 1701886 1626276
17777 1626276 1574995 1472935 1431135 1396261 1364425 1446564 1493053 1545981 1566109 1575236 1561439
$$ packed form
17850B0181861l713473k712012k162443j837213j479884j167840r39425o86981
17842E482590m89740m18695l98079l37679k95599k21685k08969k29972j84463
17833B697709j66082j50202j56482j38035j34630p3455j8769N2419m1209o4377
17823A806887j4347n5081p0082o3705m2154m7268n1229n9229n7973l3713Q182
17812A320288k5137j4500K3662J2415L984j6196n363m4231m8203j8441n9633m1692
17800A086953J2073M3150k678j6220M363L5512o420n710P7564m871q7638J5100
17788A151178P6144P6100P5907J05590J54915R6035N0882j8518j9246m7101p5610
17777A626276n1281j02060m1800l4874l1836Q2139M6489N2928K0128R127j3797
$$ plain form
17766 1561439 1602426 1595666 1538668 1478315 1410472 1310904 1201899 1115869 1032712 956359 871674
17755 871674 798998 737449 726528 742747 720335 762496 792643 834198 815329 819294 854577 877562
17743 877562 908997 926528 956991 987506 1077049 1217148 1354353 1502148 1565454 1546147 1447972
17732 1447972 1284841 1092767 1016357 1014414 1045902 1062154 1066174 1042778 1001733 1001567 956466 868566
17720 868566 802930 744277 682339 603424 542463 506793 469170 465197 465145 408993 318902 238523
17708 238523 173063 147009 138575 114720 128966 179185 136021 130323 114450 157099 191077 193218
17696 193218 228283 251189 279945 281045 283384 296188 282301 248122 221366 173491 173968 201037
17684 201037 309442 339063 285590 283426 364774 385116 419309 485149 574089 601674 586427
$$ packed form
17766A561439M0987o760n6998o0353o7843r9568j09005q6030q3157p6353q4685
17755H71674p2676o1549j0921J6219k2412M2161L0147M1555j8869L965L5283K2985
17743H77562L1435J7531L0463L0515Q9543J40099J37205J47795O3306j9307r8175
17732A447972j63131j92074p6410j943L1488J6252M020k3396m1045j66m5101q7900
17720H68566o5636n8653o1938p8915o0961l5670l7623l973n2n6152r0091q0379
17708B38523o5460k6054q434k3855J4246N0219m3164n698j5873M2649L3978K141
17696A93218L5065K2906K8756J100K339J2804j3887l4179k6756m7875M77K7069
17684B01037J08405K9621n3473k164Q1348K0342L4193O5840Q8940K7585j5247
$$ plain form
17673 586427 552320 503542 462589 395672 334962 314749 357928 372206 355935 268074 237698
17662 237698 242568 242362 285205 321858 331873 337656 309004 269070 206753 201844 146462 90008
17650 90008 72772 44708 57741 92917 109785 81056 80831 89176 86708 79126 96780 115753 200494
17637 200494 236619 204564 166215 111371 120316 143157 112959 100686 144425 137672 108319 38920
17625 38920 38368 23179 -6056 18675 49747 69182 51956 59363 57576 79786 28850 -2163
17613 -2163 2130 8735 42921 -5250 21396 81140 -5579 -61492 -85939 -69270 -67127 -63355 -77341
17600 -77341 -72789 -46003 -5725 40048 72286 62018 49825 42055 -2837 -20068 -13630 -1498
17588 -1498 -31605 -40288 -54684 -36748 -32950 -25493 22709 64193 131973 149186 55357 65474
$$ packed form
17673E86427l4107m8778m0953o6917o0710k0213M3179J4278j6271q7861l0376
17662B37698M870k06M2843L6653J0015N783k8652l9934o2317m909n5382n6454
17650I0008j7236k8064J3033L5176J6868k8729k25Q345k468p582J7654J8973Q4741
17637B00494L6125l2055l8349n4844Q945K2841l0198j2273M3739o753k9353o9399
17625C8920n52j5189k9235K4731L1072J9435j7226P407j787K2210n0936l1013
17613b163M293O605L4186m8171K6646N9744q6719n5913k4447J6669K143L772j3986
17600g7341M552K6786M0278M5773L2238j0268j2193p770m4892j7231O438J2132
17588a498l0107q683j4396J7936L798P457M8202M1484O7780J7213r3829J0117
$$ plain form
17576 65474 101995 41351 42164 40890 70339 61974 62539 44898 4920 -9571 -1650 73941 109283
17563 109283 104066 126293 126559 198150 278762 363995 371618 383040 406274 413113 515537 658208
17551 658208 755400 817633 892453 823441 636755 563171 547877 556506 505045 457683 473094
17540 473094 434669 385027 297723 163116 97316 47807 66511 52335 20848 37153 31601
17529 31601 28437 12451 -28937 -11324 12167 -19538 -25718 8238 44906 61201 67904 68662 122473
17516 122473 181444 180659 177062 235480 275666 317865 328116 372901 437640 438450 475409 517010
17504 517010 527201 586604 660023 682721 647203 605750 576014 504702 465448 455123 450614 418270
17492 418270 429225 382081 275754 229797 181368 153276 134894 114010 81209 66912 68957
$$ packed form
17576F5474L6521o0644Q13j274K9449q365N65j7641l9978j4491P921P5591L5342
17563A09283n217K2227K66P1591Q0612Q5233P623J1422K3234O839J02424J42671
17551F58208R7192O2233P4820o9012j86686p3584j5294Q629n1461m7362J5411
17540D73094l8425m9642q7304j34607o5800m9509J8704j4176l1487J6305n552
17529C1601l164j5986m1388J7613K3491l1705o180L3956L6668J6295O703P58N3811
17516A22473N8971p85l597N8418M0186M2199J0251M4785O4739Q10L6959M1601
17504E17010J0191N9403P3419K2698l5518m1453k9736p1312l9254j0325m509l2344
17492D18270J0955m7144j06327m5957m8429k8092j8382k0884l2801j4297K045
$$ plain form
17481 68957 74890 67969 65743 50409 11253 12595 17398 62311 53791 34726 32986 59441 55540
17468 55540 85199 58346 15645 10911 7621 -16125 -27421 -17838 -35198 -30162 -28488 4152 -26095
17455 -26095 -70439 -37546 -31714 -1471 1203 -6867 -26151 -11703 19978 39817 48421 141192
17443 141192 261844 402100 508665 520984 437772 276515 141740 114517 23158 -14318
17433 -14318 7532 44605 48256 60460 70442 46235 86563 144880 222719 285144 351337 432459
17421 432459 509020 506284 521248 537864 576712 572858 562299 583087 531026 530305 558260 536865
17409 536865 614460 774546 894965 1024734 1163056 1239899 1214062 1154129 1124894 1151931 1183442
17398 1183442 1317664 1330570 1295184 1261314 1165077 1075969 1054882 1005399 1026313 1018408 986819
$$ packed form
17481F8957N933o921k226j5334l9156J342M803M4913q520j9065j740K6455l901
17468E5540K9659k6853m2701m734l290k3746j1296R583j7360N036J674L2640l0247
17455b6095m4344L2893N832L0243K674q070j9284J4448L1681J9839Q604R2771
17443A41192J20652J40256J06565J2319q3212j61257j34775k7223r1359l7476
17433a4318K1850L7073L651J2204R982k4207M0328N8317P7839O2425O6193Q1122
17421D32459P6561k736J4964J6616L8848l854j0559K0788n2061p21K7955k1395
17409E36865P7595J60086J20419J29769J38322P6843k5837n9933k9235K7037L1511
17398A183442J34222J2906l5386l3870r6237q9108k1087m9483K0914p905l1589
$$ plain form
17387 986819 942184 874268 842644 789950 786425 821368 825135 834765 788705 731697 754255 660888
17375 660888 558434 479574 418365 462258 481935 487464 492759 462443 442002 451983 421369 453833
17363 453833 512999 541946 556204 519857 450918 401084 284195 251008 293359 332820 397333
17352 397333 492147 488093 429585 381745 371863 347399 342729 365768 410960 437091 411401 280113
17340 280113 153667 46410 20129 70021 114470 114429 70614 55949 14251 -34519 -72136 -86455
17328 -86455 -23862 -64754 -79070 -80748 -95763 -99239 -84849 -33523 -2493 -13430 -667 69639
17316 69639 128574 126595 147896 94077 22734 -23842 -12086 -35303 -53696 -8271 -16888 -27290
17304 -27290 -36948 -64219 -87818 -75462 -93392 -47054 13138 16374 -40369 -36766 -50236 -60846
$$ packed form
17387I86819m4635o7916l1624n2694l525L4943L767R630m6060n7008K2558r3367
17375F60888j02454p8860o1209M3893J9677N529N295l0316k0441R981l0614L2464
17363D53833N9166K8947J4258l6347o8939m9834j16889l3187M2351L9461O4513
17352C97333R4814m054n8508m7840r882k4464m670K3039M5192K6131k5690j31288
17340B80113j26446j07257k6281M9892M4449m1m3815j4665m1698m8770l7617j4319
17328h6455O2593m0892j4316j678j5015l476J4390N1326L1030j0937J2763P0306
17316F9639N8935j979K1301n3819p1343m6576J1756k3217j8393M5425q617j0402
17304b7290r658k7271k3599J2356j7930M6338O0192L236n6743L603j3470j0610
$$ plain form
17292 -60846 -64838 -108598 -110639 -138017 -129550 -79594 -26491 -38391 -53906 -75743 -119358 -108540
17280 -108540 -76461 -105409 -121010 -90188 -23356 -47678 -93505 -158825 -158979 -136218 -114502 -80181
17268 -80181 -32650 -14836 27462 -45007 -108576 -75322 -52327 7491 18051 20891 -25188 -11756
17256 -11756 49625 13400 -49182 -37704 -101416 -93035 -55538 -51451 -69050 -128392 -143709 -114716
17244 -114716 -85569 -98483 -82057 -115319 -153431 -128884 -98895 -89168 -90691 -125612 -133102 -111876
17232 -111876 -59251 -71794 -102656 -111301 -140021 -148521 -109306 -70266 -73548 -96802 -87903 -97807
17220 -97807 -163402 -142975 -108347 -56712 -35278 -5019 19916 12806 17588 13994 26190 17656
17208 17656 34970 21544 -2553 -18580 -85719 -96445 -67661 -109646 -138188 -76690 -58230 -55104
$$ packed form
17292f0846l992m3760k041k7378Q467M9956N3103j1900j5515k1837m3615J0818
17280a08540L2079k8948j5601L0822O6832k4322m5827o5320j54K2761K1716L4321
17268h0181M7531J7814M2298p2469o3569L3254K2995N9818J0560K840m6079J3432
17256a1756O1381l6225o2582J1478o3712Q381L7497M087j7599n9342j5317K8993
17244a14716K9147j2914J6426l3262l8112K4547K9989R727j523l4921p490K1226
17232a11876N2625j2543l0862q645k8720q500L9215L9040l282k3254Q899r904
17220i7807o5595K0427L4628N1635K1434L0259K4935p110M782l594J2196q534
17208A7656J7314j3426k4097j6027o7139j0726K8784m1985k8542O1498J8460L126
$$ plain form
17196 -55104 -99051 -56025 -17025 10689 -2639 -27909 -88829 -104150 -59118 56259 68121
17185 68121 -13937 -18474 -9877 -20294 -14713 -17777 -61406 -81566 -105863 -132358 -140266 -96026 -73912
17172 -73912 -69101 -67760 -54935 -33859 -22750 -28554 -13172 24511 13453 -3985 8044 -9853
17160 -9853 -12703 -5779 -30679 -63429 -52390 -103364 -141160 -172729 -201314 -213411 -169797 -180445
17148 -180445 -138298 -104657 -113497 -89713 -55290 -39218 -50205 -30396 -9366 -13522 -5542 -24652
17136 -24652 -54911 -14029 593 -47347 -9610 50843 52509 42442 -2915 -40175 -70436 -79690
17124 -79690 -63222 -38974 -72842 -158857 -133090 -57736 -43622 -28952 1950 -23929 -3959 57042
17112 57042 27638 -24456 -104981 -47317 -16073 -35208 -56057 -1488 8938 -33777 -75620 -50093
$$ packed form
17196e5104m3947M3026L9000K7714j3328k5270o0920j5321M5032J15377J1862
17185F8121q2058m537Q597j0417N581l064m3629k0160k4297k6495p908M4240K2114
17172g3912M811J341J2825K1076J1109n804J5382L7683j1058j7438J2029j7897
17160i853k850O924k4900l2750J1039n0974l7796l1569k8585j2097M3614j0648
17148a80445M2147L3641q840K3784L4423J6072j0987J9809K1030m156P980j9110
17136b4652l0259M0882J4622m7940L7737O0453J666j0067m5357l7260l0261r254
17124g9690J6468K4248l3868q6015K5767P5354J4114J4670L0902k5879J9970O1001
17112E7042k9404n2094q0525N7664L1244j9135k0849N4569J0426m2715m1843K5527
$$ plain form
17100 -50093 -16363 -30149 -63334 -8502 -7417 -67981 -126670 -133391 -163056 -186763 -109695 -53480
17088 -53480 -69825 -70496 -110739 -137764 -120138 -83079 -49285 -791 26418 18702 -272 -25841
17076 -25841 -24277 -44625 -35803 -12292 12181 5705 -32721 -29778 -34063 -40047 -34624 -28038 21811
17063 21811 12111 12033 -20962 -63497 -53044 -52689 -95180 -122201 -62438 -20676 -58093 -39641 -77885
17050 -77885 -29378 16557 -64693 -97170 -69704 -51902 -107550 -109332 -79997 -61368 -59412 -67857
17038 -67857 -53062 -61294 -63120 -14651 -28623 -10937 43594 8276 -10123 -45375 -89533 -58628
17026 -58628 -47242 -51425 -95217 -117762 -90912 -52592 -29956 4382 -10779 26680 35012 26640
17014 26640 23129 -17373 -40195 -73134 -98677 -66842 -16610 -10483 2660 -7843 -52843 -90604
$$ packed form
17100e0093L3730j3786l3185N4832J085o0564n8689o721k9665k3707P7068N6215
17088e3480j6345o71m0243k7025J7626L7059L3794M8494K7209p716j8974k5569
17076b5841J564k0348Q822K3511K4473o476l8426K943m285n984N423O586M9849
17063B1811r700p8l2995m2535J0453L55m2491k7021N9763M1762l7417J8452l8244
17050g7885M8507M5935q1250l2477K7466J7802n5648j782K9335J8629J956q445
17038f7857J4795q232j826M8469j3972J7686N4531l5318j8399l5252m4158L0905
17026e8628J1386m183m3792k2545K6850L8320K2636L4338j5161L7459Q332q372
17014B6640l511m0502k2822l2939k5543L1835N0232O127J3143j0503m5000l7761
$$ plain form
17002 -90604 -97241 -29969 -36494 -74106 -29390 13322 48719 80645 75498 68178 24144 29879 14393
16989 14393 -7234 -24337 7742 40623 25359 -7482 -87554 -57754 -51093 -31512 -27070 -37616
16977 -37616 -64461 -116734 -112786 -120986 -84835 -54512 -61099 -36255 -417 21342 65567 68246
16965 68246 38530 -7219 -25674 -18447 -35910 -76327 -76412 -40161 -52420 -11768 17106 25430 40843
16952 40843 36090 -27413 -73791 -120395 -146224 -98283 -58094 -46721 -32251 18485 5790 13295
16940 13295 26359 5762 -28611 -9104 -82047 -82977 -57080 -78442 -98062 -114942 -76850 -75683
16928 -75683 -74490 -65259 -84245 -81850 -102723 -89450 -63631 -108376 -128136 -125400 -144090 -121505
16916 -121505 -78517 -30544 -26926 -69209 -50304 -22477 -84305 -70711 -29481 -39354 -22679 32013
$$ packed form
17002i0604o637O7272o525l7612M4716M2712L5397L1926n147p320m4034N735j5486
16989A4393k1627j7103L2079L2881j5264l2841q0072K9800O661J9581M442j0546
16977c7616k6845n2273L948q200L6151L0323o587K4844L5838K1759M4225K679
16965F8246k9716m5749j8455P227j7463m0417q5L6251j2259M0652K8874Q324J5413
16952D0843m753o3503m6378m6604k5829M7941M0189J1373J4470N0736j2695P505
16940A3295J3064k0597l4373J9507p2943r30K5897k1362j9620j6880L8092J167
16928g5683J193R231j8986K395k0873J3273K5819m4745j9760K736j8690K2585
16916a21505M2988M7973L618m2283J8905K7827o1828J3594M1230r873J6675N4692
$$ plain form
16904 32013 64236 98733 4097 -24880 -37843 22967 31612 -11839 -51511 -55103 -74690 -68003
16892 -68003 -27641 -68899 -110885 -100543 -71647 -10817 -38945 -36015 -10791 4852 10981 -7041
16880 -7041 39323 -11775 -59764 -79064 -69825 -40957 -36270 -64474 -106808 -97205 -76596 -74064 -79015
16867 -79015 -76312 -6079 19772 9682 47667 55215 51012 6928 -14363 -21735 1806 38018
16855 38018 -8555 -38857 -21595 -52586 -98342 -68223 -63992 -47753 -24302 -34024 -11619 30397
16843 30397 4363 -24490 -14335 -3253 -39432 -19416 21512 13897 -13417 -52076 -52821 -63302
16831 -63302 -89559 -138383 -121031 -92040 -101303 -74506 -126220 -133553 -113550 -108240 -85815 -114788
16819 -114788 -90098 -51447 -4073 -12377 -51573 -107964 -58352 -30153 -75744 -48813 -15191 -2747
$$ packed form
16904C2013L2223L4497r4636k8977j2963O0810Q645m3451l9672l592j9587O687
16892f8003M0362m1258m1986J0342K8896O0830k8128K930K5224J5643O129j8022
16880g041M6364n1098m7989j9300R239K8868M687k8204m2334R603K0609K532m951
16867g9015K703P0233K5851j0090L7985P548m203m4084k1291p372K3541L6212
16855C8018m6573l0302J7262l0991m5756L0119M231J6239K3451r722K2405M2016
16843C0397k6034k8853J0155J1082l6179K0016M0928p615k7314l8659p45j0481
16831f3302k6257m8824J7352K8991r263K6797n1714p333K0003N310K2425k8973
16819a14788K4690L8651M7374q304l9196n6391M9612K8199m5591K6931L3622J2444
$$ plain form
16807 -2747 -18683 -22045 -61838 -108654 -153572 -117299 -96134 -92953 -51251 -128599 -117603 -93510
16795 -93510 -134335 -159089 -124718 -58324 5150 46505 17276 -86950 -144481 -108330 -88455
16784 -88455 -129459 -106496 -96731 -90684 -77023 -89148 -67679 24882 10480 -52685 -64511 -73948
16772 -73948 -76335 -72558 -97683 -120729 -177131 -121424 -74126 21451 30038 -35219 -91810 -73226
16760 -73226 -83543 -84109 -32543 -32123 -29761 -36128 -18840 31215 82218 61660 34378 -39594 -32880
16747 -32880 -57379 -95550 -59887 -14156 -19756 -9336 10156 65195 36029 -10227 -25441 466
16735 466 -5375 -21273 -37572 -24057 -27034 -36680 -47702 -69562 -57866 -34867 -3718 -35844 422
16722 422 -39526 -51322 -31417 3678 -33824 -56216 -95683 -90493 -53736 -28463 -4197 -13514
$$ packed form
16807b747j5936l362l9793m6816m4918L6273K1165L181M1702p7348J0996K4093
16795i3510m0825k4754L4371O6394O3474M1355k9229j04226n7531L6151J9875
16784h8455m1004K2963R765O047J3661j2125K1469R2561j4402o3165j1826r437
16772g3948k387L777k5125k3046n6402N5707M7298R5577Q587o5257n6591J8584
16760g3226j0317n66N1566M20K362o367J7288N0055N1003k0558k7282p3972O714
16747c2880k4499l8171L5663M5731n600J0420J9492N5039k9166m6256j5214K5907
16735D66n841j5898j6299J3515k977r646j1022k1860J1696K2999L1149l2126L6266
16722D22l9948j1796J9905L5095l7502k2392l9467N190L6757K5273K4266r317
$$ plain form
16710 -13514 -19659 -999 28648 -27017 -56019 -81484 -103226 -99171 -37970 -11519 10943 13100
16698 13100 20383 -2495 -5030 -13131 -5602 -31140 -46667 -62278 -71315 -117383 -126490 -132297 -131417
16685 -131417 -90866 -21687 5345 -17044 6905 -1586 -12311 5627 -18161 -24606 -33644 -41159
16673 -41159 -46374 -39458 -32001 14227 -24171 -36876 -42240 5757 -4151 -32713 -36874 -82347 -50324
16660 -50324 -31311 -8641 9780 -23412 -5041 60573 55743 63785 53267 3331 -19493 -38649
16648 -38649 -30078 -19367 -45552 -55060 -64304 -35503 -48558 -72273 -105934 -147253 -125615 -92847
16636 -92847 -32151 21644 25559 -36717 -56536 -80083 -68057 -43943 -30697 -91634 -115105 -83757
16624 -83757 -59415 -69457 -13063 31417 -12325 -42127 8983 54123 21141 16661 37797 -2537
$$ packed form
16710a3514o145J8660K9647n5665k9002k5465k1742M055O1201K6451K2462K157
16698A3100P283k2878k535q101P529k5538j5527j5611r037m6068r107n807Q80
16685a31417M0551O9179K7032k2389K3949q491j0725J7938k3788o445r038p515
16673d1159n215O916P457M6228l8398j2705n364M7997r908k8562m161m5473L2023
16660e0324J9013K2670J8421l3192J8371O5614m830Q042j0518m9936k2824j9156
16648c8649Q571J0711k6185r508r244K8801j3055k3715l3661m1319K1638L2768
16636i2847O0696N3795L915o2276j9819k3547J2026K4114J3246o0937k3471L1348
16624h3757K4342j0042N6394M4480m3742k9802N1110M5140l2982m480K1136m0334
$$ plain form
16612 -2537 -42629 -34689 -25005 -17468 -42556 -82071 -43562 -22014 -4960 8753 -31449 -57569
16600 -57569 -54666 -18672 -19042 -13291 8673 -19114 -62287 -29663 -6065 -2423 -371 17094 -14653
16587 -14653 -10330 -17071 -22536 -45271 -30037 -16521 1160 25895 47811 49165 51021 20413 -50389
16574 -50389 -104761 -104742 -44364 -21307 -45765 -63646 -33056 -24789 -11478 -7737 32823 16981 -25770
16561 -25770 -103203 -133883 -129106 -119654 -53405 -21959 -90381 -104361 -142832 -110774 -76152 -64010
16549 -64010 -36681 -33828 -5495 28343 35890 32700 20744 -29169 -58011 -28473 10577 -3089
16537 -3089 -68480 -30553 10990 -4654 -48634 -47283 -43408 -51469 -77179 -84662 -104804 -91074 -44350
16524 -44350 -38678 -51026 -27812 -23936 -15227 -12069 -21138 -64478 -110723 -119116 -105954 -54952 -17263
$$ packed form
16612b537m0092P940R684P537k5088l9515L8509K1548J7054J3713m0202k6120
16600e7569K903L5994l70N751K1964k7787m3173L2624K3598L642K052J7465l1747
16587a4653M323o741n465k2735J5234J3516J7681K4735K1916J354J856l0608p0802
16574e0389n4372J9O0378K3057k4458j7881L0590Q267J3311L741M0560j5842m2751
16561b5770p7433l0680M777R452O6249L1446o8422j3980l8471L2058L4622J2142
16549f4010K7329K853K8333L3838P547l190j1956m9913k8842K9538L9050j3666
16537c089o5391L7927M1543j5644m3980J351L875q061k5710p483k0142J3730M6724
16524d4350N672j2348K3214L876Q709L158r069m3340m6245q393J3162N1002L7689
$$ plain form
16511 -17263 -27459 18372 16506 -10929 -16404 -18007 -43138 -33594 -2243 3059 19355 -6721 -35730
16498 -35730 -36121 -42721 -12062 4837 34834 66644 29538 22036 37472 41232 48198 41058 21034
16485 21034 32055 17001 809 -39721 -85399 -112091 -47267 -3059 33420 20102 1140 -59051
16473 -59051 -86459 -100939 -98155 -67291 -86257 -123417 -100073 -49342 -62521 -73229 7347 13810
16461 13810 -38409 -59575 -19040 28481 63955 -29619 -73736 -90518 -84649 -89561 -96576 -97700
16449 -97700 -53612 -23863 30348 45704 -2305 -74066 -88826 -83203 -26218 -13503 -8459 -12317
16437 -12317 -55754 -76412 -55643 -11900 1354 32810 74359 47231 -10301 -31305 -18146 -5093
16425 -5093 -22553 -52119 -10707 12328 -46148 -5617 31527 1363 -47523 -61054 -6243 -48366
$$ packed form
16511a7263j0196M5831j866k7435n475j603k5131R544L1351N302J6296k6076k9009
16498c5730l91o600L0659J6899K9997L1810l7106p502J5436L760O966p140k0024
16485B1034J1021j5054j6192m0530m5678k6692O4824M4208L6479j3318j8962o0191
16473e9051k7408j4480K784L0864j8966l7160K3344N0731j3179j0708Q0576O463
16461A3810n2219k1166M0535M7521L5474r3574m4117j6782N869m912p015j124
16449i7700M4088K9749N4211J5356m8009p1761j4760N623N6985J2715N044l858
16437a2317m3437k0658K0769M3743J3254L1456M1549k7128n7532k1004J3159J3053
16425e093j7460k9566M1412K3035n8476M0531L7144l0164m8886j3531N4811m2123
$$ plain form
16413 -48366 -15680 57587 22747 -6696 5944 -6759 -38247 -26081 -6163 -5180 18692 32195
16401 32195 26098 33434 24784 17351 41558 -31169 -53182 -70260 -67965 -24093 48660 89853 70276
16388 70276 47492 33329 27062 11490 46401 39390 13830 16956 -34740 -79811 -95741 -36712
16376 -36712 18312 32397 43207 43715 22308 14920 23429 61455 55417 14744 -6848 -68885 -59642
16363 -59642 -30915 1080 36687 46849 41122 22856 4986 50548 95267 17185 -35987 -100539
16351 -100539 -61604 39502 48258 44740 102331 107262 72353 47552 45236 79193 99645 60757
16339 60757 50750 31679 32465 80417 51773 -8536 -41576 -36697 -18116 -23143 16421 18706 -48360
16326 -48360 -68 27400 -16128 -1273 24617 52560 35802 -31535 -65213 -75915 -60857 -40913
$$ packed form
16413d8366L2686P3267l4840k9443J2640j2703l1488J2166J9918R83K3872J3503
16401C2195o097P336q650p433K4207p2727k2013j7078K295M3872P2753M1193j9577
16388G0276k2784j4163o267j5572L4911p011k5560L126n1696m5071j5930N9029
16376c6712N5024J4085J0810N08k1407p388Q509L8026o038m0673k1592o2037R243
16363e9642K8727L1995L5607J0162n727j8266j7870M5562M4719p8082n3172o4552
16351a00539L8935J01106Q756l518N7591M931l4909k4801k316L3957K0452l8888
16339F0757j0007j9071P86M7952k8644o0309l3040M879J8581n027L9564K285o7066
16326d8360M8292K7468m3528J4855K5890K7943j6758o7337l3678j0702J5058J9944
$$ plain form
16314 -40913 -46358 -49714 -32430 -965 1762 -48131 -122430 -113934 -74078 -37100 -74704 -86918
16302 -86918 -98491 -110474 -63690 -41840 -22546 -17522 -28185 -54211 -60789 -38598 6461 7898
16290 7898 29969 16779 -36860 -28720 -26041 -16335 -8973 -1750 -11327 42852 28807 -2074 31842
16277 31842 1163 -30549 -55031 1206 59435 27199 49106 88950 101435 61784 37342 39505
16265 39505 44647 45845 67741 96459 57315 7671 14977 -4630 -21022 -2284 -26777 -66767
16253 -66767 -96984 -75330 -38969 -29320 -2015 15573 14777 62311 61521 -16412 -28148 -29215 43715
16240 43715 46032 39749 -9591 -42491 -47241 -44009 -58867 -25354 -1322 10675 4734 -9086 -43556
16227 -43556 -22095 -17817 -79110 -67669 -79867 -27508 -24080 -34983 -40401 -59755 -69982 -15505
$$ packed form
16314d0913n445l356J7284L1465K727m9893p4299Q496L9856L6978l7604j2214
16302h6918j1573j1983M6784K1850J9294N024j0663k6026o578K2191M5059J437
16290G898K2071j3190n3639Q140K679R706P362P223r577N4179j4045l0881L3916
16277C1842l0679l1712k4482N6237N8229l2236K1907L9844J2485l9651k4442K163
16265C9505N142J198K1896K8718l9144m9644P306j9607j6392J8738k4493l9990
16253f6767l0217K1654L6361R649K7305J7588p96M7534p90p7933j1736j067P2930
16240D3715K317o283m9340l2900m750L232j4858L3513K4032J1997n941j3820l4470
16227d3556K1461M278o1293J1441j2198N2359L428j0903n418j9354j0227N4477
$$ plain form
16215 -15505 19312 28014 72017 29575 -17396 -10804 -5405 -16897 18633 36831 14823 51378
16203 51378 43426 2633 -44362 -96500 -75894 -5298 41709 101114 103385 97686 128025 141985
16191 141985 99798 64556 69496 41038 -66313 -129678 -103388 -45511 5399 34768 30935 36194
16179 36194 40040 45388 -16371 -39837 -72857 -119661 -120950 -100446 -47321 -26502 -31313 -61963
16167 -61963 -93728 -82660 -89865 -25439 -22868 -27650 -66082 -140293 -112358 -92719 -65163 -25643
16155 -25643 -49367 -46720 -11466 -32287 -64166 -58788 -25321 40680 32785 14273 -74357 -90442
16143 -90442 -38192 16722 -18371 -45878 -24089 -10589 -27002 -810 -3235 -1988 32486 8660
16131 8660 -25644 -26267 31889 22549 -14487 -49557 -86709 -87274 9756 39802 28709 -17843 -6690
$$ packed form
16215a5505L4817Q702M4003m2442m6971O592N399j1492L5530J8198k2008L6555
16203E1378p952m0793m6995n2138K0606P0596M7007N9405K271n699L0339J3960
16191A41985m2187l5242M940k8458j07351o3365K6290N7877N0910K9369l833N259
16179C6194L846N348o1759k3466l3020m6804j289K0504N3125K0819m811l0650
16167f1963l1765J1068p205O4426K571m782l8432p4211K7935J9639K7556L9520
16155b5643k3724K647L5254k0821l1879N378L3467O6001p895j8512q8630j6085
16143i0442N2250N4914l5093k7507K1789J3500j6413K6192k425J247L4474k3826
16131H660l4304o23N8156r340l7036l5070l7152n65R7030L0046j1093m6552J1153
$$ plain form
16118 -6690 57177 97541 88429 81319 69122 45755 16063 -23993 -38096 -26511 -16873 33059
16106 33059 22041 -28375 -105791 -45329 26604 40609 -52737 -81676 -46341 -32890 41466 34397
16094 34397 32179 53586 110102 166723 152094 131901 89369 17137 40289 66583 46605 32843
16082 32843 6871 -5362 -26073 17923 24496 18948 18842 16042 -3235 -30288 -22967 18465 42587
16069 42587 55793 33773 38400 54826 34714 35031 19319 12312 17507 61093 52626 20716 24348
16056 24348 -3808 6046 16646 15389 -35737 -54508 -71241 -54587 -41051 -55672 -68637 -86128
16044 -86128 -91488 -81672 -48573 -35596 -45046 -13450 -41798 -41227 -32495 -31267 -17610 -58803 -107466
16031 -107466 -48336 -32940 -68712 -113219 -177419 -185523 -151595 -89851 -39765 -6935 -31312 -37086
$$ packed form
16118f690O3867M0364r112p110j2197k3367k9692m0056j4103J1585R638M9932
16106C3059j1018n0416p7416O0462P1933J4005r3346k8939L5335J3451P4356p069
16094C4397k218K1407N6516N6621j4629k0193m2532p2232K3152K6294j9978j3762
16082C2843k5972j2233k0711M3996O573n548j06k800j9277k7053P321M1432K4122
16069D2587J3206k2020M627J6426k0112L17j5712p007N195M3586q467l1910L632
16056B4348k8156R854J0600j257n1126j8771j6733J6654J3536j4621j2965j7491
16044h6128n360R816L3099J2977r450L1596k8348N71Q732J228J3657m1193m8663
16031a07466N9130J5396l5772m4507o4200q104L3928O1744N0086L2830k4377n774
$$ plain form
16019 -37086 -24893 -80926 -69911 -53112 7518 33377 32762 7464 -26113 -113128 -86342 -84476
16007 -84476 -106228 -109498 -75972 -10779 -20623 -60246 -58097 -90351 -58936 -38638 -43085 -39447 27411
15994 27411 78249 67070 33835 51749 47162 42516 57225 46664 66208 108382 99950 123654
15982 123654 111979 89860 101916 151240 135462 86787 133503 163443 134440 125779 134577 199161
15970 199161 261489 283759 272389 258523 202986 170290 195433 220130 183797 180028 180621 189781
15958 189781 188778 209281 252820 314109 316159 304530 257377 245680 268981 277987 240017 224000
15946 224000 232596 219294 210293 214415 179737 182895 342506 440953 485229 458342 428946 399837
15934 399837 361288 365537 376930 382720 410028 410478 366228 332882 336271 293346 277442 224366
$$ packed form
16019c7086J2193n6033J1015J6799O0630K5859o15k5298l3577q7015K6786J866
16007h4476k1752l270L3526O5193r844l9623K149l2254L1415K0298m447L638O6858
15994B7411N0838j1179l3235J7914m587m646J4709j0561J9544M2174q432K3704
15982A23654j1675k2119J2056M9324j5778m8675M6716K9940k9003q661Q798O4584
15970A99161O2328K2270j1370j3866n5537l2696K5143K4697l6333l769N93R160
15958A89781j003K0503M3539O1289K050j1629m7153j1697K3301R006l7970j6017
15946B24000Q596j3302r001M122l4678L158J59611R8447M4276k6887k9396k9109
15934C99837l8549M249J1393N790K7308M50m4250l3346L389m2925j5904n3076
$$ plain form
15922 224366 232241 229561 179528 172506 120959 150388 207838 244330 218880 238664 285307 246727
15910 246727 204869 202608 253792 259285 274884 293059 256453 217902 192552 182099 220018 255466
15898 255466 260884 227217 221091 203465 209861 253859 294649 280727 261075 265986 263113 276435
15886 276435 331988 353802 326014 274036 278443 300724 326899 280917 264957 280436 261278 288186
15874 288186 207506 183196 224866 200924 209342 323730 446640 492562 510695 487150 486786 493862
15862 493862 459660 467419 584306 676664 652094 638137 545067 473165 479749 421003 350350 336834
15850 336834 329327 314953 298007 322084 343982 296940 261331 281881 268676 286236 351656 408028
15838 408028 444671 428794 399055 358285 346721 325093 342398 307444 255413 232951 157806
$$ packed form
15922B24366P875k680n0033p022n1547K9429N7450L6492k5450J9784M6643l8580
15910B46727m1858k261N1184N493J5599J8175l6606l8551k5350j0453L7919L5448
15898B55466N418l3667o126j7626O396M3998M0790j3922j9652M911k873J3322
15886B76435N5553K1814k7788n1978M407K2281K6175m5982j5960J5479j9158K6908
15874B88186q0680k4310M1670k3942Q418J14388J22910M5922J8133k3545l64P076
15862D93862l4202P759J16887R2358k4570j3957r3070p1902O584n8746p0653j3516
15850C36834p507j4374j6946K4077K1898m7042l5609K0550j3205J7560O5420N6372
15838D08028L6643j5877k9739m0770j1564k1628J7305l4954n2031k2462p5145
$$ plain form
15827 157806 49627 56720 82833 56631 19643 17940 -5032 3585 48789 111642 91411 18569
15815 18569 -22120 -31685 5643 -11905 25504 80905 65805 11830 26607 12293 -33481 -28837
15803 -28837 -11929 -9691 -42828 -3977 21698 32651 -40708 -18983 -11924 -56107 -39778 -8163
15791 -8163 23521 -3527 -22322 -17169 53308 41448 -3463 -25764 33820 30272 60530 65438
15779 65438 52556 40827 25008 47829 113785 145508 134124 138996 184509 184385 207821 264505
15767 264505 315057 385303 435815 475597 454383 448076 450166 496866 495230 458172 398277 336082
15755 336082 300082 261556 210097 142399 89777 119889 155367 200333 168018 165981 242136 278253
15743 278253 233308 207326 223490 241764 333925 349284 343593 333928 356365 276073 185231 170908
$$ packed form
15827A57806j08179P093K6113k6202l6988j703k2972Q617M5204O2853k0231p2842
15815A8569m0689r565L7328j7548L7409N5401j5100n3975J4777j4314m5774M644
15803b8837J6908K238l3137L8851K5675J0953p3359K1725P059m4183J6329L1615
15791h163L1684k7048j8795N153P0477j1860m4911k2301N9584l548L0258M908
15779F5438j2882j1729j5819K2821O5956L1723j1384M872M5513j24K3436N6684
15767B64505N0552P0246N0512L9782k1214o307K090M6700j636l7058n9895o2195
15755C36082l6000l8526n1459o7698n2622L0112L5478M4966l2315k037P6155L6117
15743B78253m4945k5982J6164J8274R2161J5359n691r665K2437q0292r0842j4323
$$ plain form
15731 170908 187280 166621 115211 77817 88837 52132 47106 61367 51997 44789 64249 115565
15719 115565 108101 59025 25981 30488 31112 -5631 29660 54449 51143 30343 -38443 -93679
15707 -93679 -63523 -21238 -23132 -45296 -54916 -34032 7917 32728 40608 68910 44054 22350
15695 22350 24487 27073 13013 -14796 -40924 -92133 -155235 -137675 -90977 -100612 -102255 -95538 -115295
15682 -115295 -61923 -4408 -26418 -5311 -41902 -46341 -25461 6500 34592 51823 -46229 -88487
15670 -88487 -47777 -54844 -51918 -19334 48784 53653 36190 32195 -25557 -15956 1867 61811 37513
15657 37513 -382 11579 27790 35537 67487 96395 93059 64752 44621 27327 -19986 -38660
15645 -38660 -66016 -50578 -9984 -30026 -40349 -11804 11801 -33785 -56695 -61888 -37822 -13245
$$ packed form
15731A70908J6372k0659n1410l7394J1020l6705n026J4261r370p208J9460N1316
15719A15565p464m9076l3044M507O24l6743L5291K4789l306k0800o8786n5236
15707i3679L0156M2285j894k2164r620K0884M1949K4811P880K8302k4856k1704
15695B2350K137K586j4060k7809k6128n1209o3102J7560M6698r635j643O717j9757
15682a15295N3372N7515k2010K1107l6591m439K0880L1961K8092J7231r8052m2258
15670h8487M0710p067K926L2584O8118M869j7463l995n7752R601J7823N9944k4298
15657C7513l7895J1961J6211P747L1950K8908l336k8307k0131j7294m7313j8674
15645c8660k7356J5438M0594k0042j0323K8545K3605m5586k2910n193K4066K4577
$$ plain form
15633 -13245 -57000 -29501 13703 -16863 -49742 -15719 3091 -34861 -66503 -39792 -28172 -66219
15621 -66219 4193 49608 113453 149607 165261 127843 33401 23296 28690 17783 -35044 -28279
15609 -28279 -33580 -84883 -66478 -90649 -97111 -71230 -69066 -59786 -4620 11374 46642 4478
15597 4478 -27389 -34055 -82703 -69774 -46090 -43409 -33264 -40472 -9863 16606 82572 95710
15585 95710 22988 -35486 -7959 28865 74171 47977 -21722 -65869 -72515 -81656 -56462 -61271
15573 -61271 -78996 -34071 -62181 -84368 -37989 -49657 -55952 -61309 -95475 -108291 -88759 -47235
15561 -47235 -30441 -21378 -72760 -57025 3108 11390 -13201 -34971 -6695 1085 -36332 -40555
15549 -40555 -15052 -36850 -44290 -8238 1963 15374 33359 9572 9107 -4663 -43079 -41359
$$ packed form
15633a3245m3755K7499M3204l0566l2879L4023J8810l7952l1642K6711J1620l8047
15621f6219P0412M5415O3845L6154J5654l7418r4442j0105N394j0907n2827O765
15609b8279n301n1303J8405k4171o462K5881K164R280N5166J5994L5268m2164
15597D478l1867o666m8648J2929K3684K681J0145p208L0609K6469O5966J3138
15585I5710p2722n8474K7527L6824M5306k6194o9699m4147o646r141K5194m809
15573f1271j7725M4925k8110k2187M6379j1668o295n357l4166j2816J9532M1524
15561d7235J6794R063n1382J5735O0133Q282k4591k1770K8276P780l7417m223
15549d0555K5503k1798p440L6052J0201J3411J7985k3787m65j3770l8416J720
$$ plain form
15537 -41359 11819 50070 28336 -38024 -31626 -36624 -35117 -72387 -102012 -36653 -57463 -104147
15525 -104147 -108121 -116201 -126719 -119214 -26339 2374 -37894 -77000 -61335 -45741 -6525 -22505
15513 -22505 -13521 39931 91539 69091 25051 -9104 -56071 -41262 -20066 -71539 -85830 -54984
15501 -54984 -8962 8792 12449 13684 18313 70012 110994 88111 62512 20510 -81199 -90064
15489 -90064 -65630 -61361 -42721 -45802 -21665 8955 -22559 -85610 -135122 -93729 -28182 -1939
15477 -1939 8094 21562 31344 8815 -37661 -52266 -43731 -69180 -82276 -30069 -51058 -3569
15465 -3569 -2735 22466 -4999 -55636 -87102 -76441 -46994 -45710 -52774 -49022 -44200 -78844 -72011
15452 -72011 -108852 -130164 -140772 -121299 -97635 -91455 -58573 -54103 -36173 8984 28749 46470
$$ packed form
15537d1359N3178L8251k1734o6360O398m998J507l7270k9625O5359k0810m6684
15525a04147l974q080j0518P505R2875K8713m0268l9106J5665J5594L9216j5980
15513b2505Q984N3452N1608k2448m4040l4155m6967J4809K1196n1473j4291L0846
15501e4984M6022J7754L657J235M629N1699M0982k2883k5599m2002j01709q865
15489i0064K4434M269J8640l081K4137L0620l1514o3051m9512M1393O5547K6243
15477a939J0033J3468R782k2529m6476j4605Q535k5449j3096N2207k0989M7489
15465c569Q34K5201k7465n0637l1466J0661K9447J284p064L752M822l4644O833
15452g2011l6841k1312j0608J9473K3664O180L2882M470J7930M5157J9765J7721
$$ plain form
15440 46470 74744 97287 75593 -35869 -16333 -30284 -14292 -31683 -22460 -43043 -34871 -41640
15428 -41640 -54750 -50784 -17761 22274 5265 41370 64895 32708 -11851 -19146 36739 92868
15416 92868 76067 33838 6543 -4511 -5068 23271 15207 25314 15469 -44906 -52987 -71346 -59092
15403 -59092 -11495 29205 76877 42964 37673 44895 32730 -654 -47512 -43571 -93213 -76011
15391 -76011 -24003 -19298 -55983 -35666 -24926 -102462 -65884 -32366 -50297 -76717 -98623 -73950
15379 -73950 -14969 29932 20629 32229 -6998 -36052 557 -20087 -40915 -40754 -17472 -23435
15367 -23435 -22777 21020 16915 -982 -29382 -25252 18674 40134 55405 53342 62886 69683 22953
15354 22953 5158 25210 18141 -36712 -74605 -58756 -5212 7109 12501 48172 24243 -19681
$$ packed form
15440D6470K8274K2543k1694j11462J9536j3951J5992j7391R223k0583Q172o769
15428d1640j3110L966L3023M0035j7009L6105K3525l2187m4559p295N5885N6129
15416I2868j6801m2229k7295j1054n57K8339q064J0107r845o0375q081j8359J2254
15403e9092M7597M0700M7672l3913n291P222j2165l3384m6858L941m9642J7202
15391g6011N2008M705l6685K0317J0740p7536L6578L3518j7931k6420k1906K4673
15379g3950N8981M4901r303J1600l9227k9054L6609k0644k0828J61K3282n963
15367b3435O58M3797m105j7897k8400M130M3926K1460J5271k063R544O797m6730
15354B2953j7795K0052p069n4853l7893J5849N3544J2321N392L5671k3929m3924
$$ plain form
15342 -19681 -17393 -5973 -30978 -63542 -35050 29696 -29954 -83725 -33948 -61162 -91630 -98558
15330 -98558 -68186 7260 -8113 -24745 -8133 27851 32207 7578 -41779 -115787 -156874 -139971
15318 -139971 -35378 -492 -27147 -43655 -47649 -73270 -58398 -113348 -104157 -83037 -21382 2323
15306 2323 -1669 -39095 -44213 -8823 -13239 -67508 -65642 -1207 11257 12639 7947 50441 93647
15293 93647 32152 -72853 -64668 -105679 -169624 -157648 -90643 -53018 -37751 -40675 -82672 -102382
15281 -102382 -99887 -111401 -102044 -95301 -145610 -139010 -1734 58461 31089 -36387 -48588 -155578
15269 -155578 -150645 -85493 -77820 -84743 -89760 -71622 -63048 -55040 -48760 -95119 -93536 -84511 -42878
15256 -42878 -30951 -13322 -33104 -27462 -7709 -7906 7632 24587 31626 -17862 -20214 -29535 -78167
$$ packed form
15342a9681K288J1420k5005l2564K8492O4746n9650n3771M9777k7214l0468o928
15330i8558L0372P5446j5373j6632J6612L5984M356k4629m9357p4008m1087J6903
15318a39971J04593L4886k6655j6508l994k5621J4872n4950R191K1120O1655K3705
15306B323l992l7426n118L5390m416n4269J866O4435J2464J382m692M2494M3206
15293I3647o1495j05005Q185m1011o3945J1976O7005L7625J5267k924m1997j9710
15281a02382K495j1514R357O743n0309O600J37276O0195k7372o7476j2201j06990
15269a55578M933O5152P673o923n017J8138Q574Q008O280m6359J583R025M1633
15256d2878J1927J7629j9782N642J9753j97J5538J6955P039m9488k352r321m8632
$$ plain form
15243 -78167 -136616 -143417 -103759 -77155 -95461 -137063 -107411 -65817 -40190 -65348 -76964 -67163
15231 -67163 -92751 -23890 -18697 -35976 -48226 1184 -9680 -31466 -9730 -124 13803 36088
15219 36088 -7346 -16270 -19532 -52997 -70592 -80007 -60777 -36297 -78074 -23244 -36211 -61385
15207 -61385 -67273 -89699 -78405 -61300 -46413 -62606 -82647 -54063 -61273 -67548 -48929 -31544
15195 -31544 -50162 -70631 -106253 -51376 -29935 -9295 29709 25753 35017 -3247 -19053 -5205
15183 -5205 22490 19209 41456 40690 56094 73217 42846 59063 34405 48744 10608 -18774
15171 -18774 -66754 -63146 -62675 -124350 -185239 -163496 -148796 -141703 -121273 -83072 -76423 -78790 -21909
15158 -21909 -10589 -85068 -97637 -80457 -40681 -15234 -53410 -82148 -91881 -65953 -53271 -53382
$$ packed form
15243g8167n8449o801L9658K6604j8306m1602K9652M1594K5627k5158j1616R801
15231f7163k5588O8861N193j7279j2250M9410j0864k1786K1736R606J3927K2285
15219C6088m3434q924l262l3465j7595r415J9230K4480m1777N4830j2967k5174
15207f1385n888k2426J1294J7105J4887j6193k0041K8584p210o275J8619J7385
15195c1544j8618k0469l5622N4877K1441K0640L9004l956R264l8264j5806J3848
15183e205K7695l281K2247p66J5404J7123l0371J6217k4658J4339l8136k9382
15171a8774m7980L608M71o1675o0889K1743J4700P093K0430L8201O649k367N6881
15158b1909J1320p4479j2569J7180L9776K5447l8176k8738r733K5928J2682j11
$$ plain form
15146 -53382 -27665 -37008 -16727 50501 49905 -8264 -22815 28445 53633 -10467 -50491 -32641
15134 -32641 12046 30694 56483 42905 -9947 -19266 -42216 19244 7744 -38279 -35446 17386
15122 17386 32166 37337 16604 -21910 -13161 -52617 -89008 -110487 -82998 -103104 -91252 -59393
15110 -59393 -37023 -25983 -42143 -9222 12926 8793 7993 2414 8138 20600 4978 -28160 -64605
15097 -64605 -46120 -38756 -52891 -42389 -55688 -102695 -103620 -63377 -54411 -90655 -106353 -145266
15085 -145266 -121143 -51089 -74800 -70461 -50831 -50645 -69574 -95522 -96757 -39931 41835 42339 19961
15072 19961 36192 56494 -188 -62762 -93853 -54963 9368 12103 -38136 -89935 -28651 -9366
15060 -9366 -66980 -42190 -13267 27212 34338 15948 51141 76608 -9394 -37791 -45162 -32779
$$ packed form
15146e3382K5717r343K0281O7228n96n8169j4551N1260K5188o4100m0024J7850
15134c2641M4687J8648K5789j3578n2852r319k2950O1460j1500m6023K833N2832
15122A7386J4780N171k0733l8514Q749l9456l6391k1479K7489k0106J1852L1859
15110e9393K2370J1040j6160L2921K2148m133q00n579N724J2462j5622l3138l6445
15097f4605J8485P364j4135J0502j3299m7007r25M0243Q966l6244j5698l8913
15085a45266K4123P0054k3711M339J9630J86j8929k5948j235N6826Q1766N04k2378
15072A9961J6231K0302n6682o2574l1091L8890O4331K735n0239n1799O1284J9285
15060i366n7614K4790K8923M0479P126j8390L5193K5467q6002k8397p371J2383
$$ plain form
15048 -32779 11886 18009 -9174 -48358 -82410 -106476 -133851 -85678 -76806 -43250 32042 26661
15036 26661 9934 -22764 -46389 -63560 -90947 -150468 -125484 -131829 -145858 -144601 -132288 -156188
15024 -156188 -126645 -122567 -136632 -116997 -107670 -95166 -91205 -128310 -57751 16918 32103 -80151
15012 -80151 -131493 -104665 -84856 -9957 -15643 -49704 -29242 -6136 -4981 -37995 -36898 -43831
15000 -43831 -26162 -12764 -32778 -69907 -109193 -102403 -90065 -57509 -70806 -74789 -8358 33416
14988 33416 -14872 -14330 8549 -574 -22349 -61679 -71103 -82327 -30464 18121 -27363 -45691
14976 -45691 -9918 -8553 -2322 9916 -1240 9372 -4839 12660 1217 2518 -19630 -14485
14964 -14485 2348 -29166 709 -2623 -32852 -42300 -16444 -24899 -33507 29187 67755 14754
$$ packed form
15048c2779M4665O123k7183l9184l4052k4066k7375M8173Q872L3556P5292n381
15036B6661j6727l2698k3625j7171k7387n9521K4984o345j4029J257J2313k3900
15024a56188K9543M078j4065J9635R327J2504L961l7105P0559P4669J5185j12254
15012h0151n1342K6828J9809P4899n686l4061K0462K3106J155l3014J097o933
15000d3831J7669J3398k0014l7129l9286O790J2338L2556j3297l983O6431M1774
14988C3416m8288N42K2879r123k1775l9330r424j1224N1863M8585m5484j8328
14976d5691L5773J365O231J2238j1156J0612j4211J7499j1443J301k2148N145
14964a4485J6833l1514K9875l332l0229r448K5856q455q608O2694L8568n3001
$$ plain form
14952 14754 24336 58116 64043 48272 38380 32249 32831 71603 91650 64556 53619 31739 17836
14939 17836 -18153 5797 58858 27122 -22785 -61346 -41151 -31114 -6854 -2380 -27082 -15130
14927 -15130 -43558 -7790 19935 27896 13440 33222 -16488 -78506 -96281 -52535 -17361 -52128
14915 -52128 -94639 -83190 -50516 -12668 -13879 -6815 17116 21370 11638 -17210 -25217 -31684 30172
14902 30172 33513 5710 -42757 -58619 -20030 23066 19047 -17356 10585 11415 -1203 -5014 12716
14889 12716 -2220 3079 60906 38607 -11004 10879 46415 38842 22288 -27886 -95399 -73379
14877 -73379 -33058 -57578 -63368 -18833 -45976 -53976 -8560 18274 -38769 -72150 -65639 -126927
14865 -126927 -153931 -109721 -83356 -87305 -75948 -54308 -34737 -79542 -85385 1667 1800 -33899
$$ packed form
14952A4754R582L3780N927j5771r892o131N82L8772K0047k7094j0937k1880j3903
14939A7836l5989K3950N3061l1736m9907l8561K0195J0037K4260M474k4702J1952
14927a5130k8428L5768K7725P961j4456J9782m9710o2018j7775M3746L5174l4767
14915e2128m2511J1449L2674L7848j211P064K3931M254r732k8848q007o467O1856
14902C0172L341k7803m8467j5862L8589M3096m019l6403K7941Q30j2618l811J7730
14889A2716j4936N299N7827k2299m9611K1883L5536p573j6554n0174o7513K2020
14877g3379M0321k4520n790M4535k7143q000M5416K6834n7043l3381O511o1288
14865a26927k7004M4210K6365l949J1357K1640J9571m4805n843Q7052J33l5699
$$ plain form
14853 -33899 -42912 -71471 -20049 55526 35281 5495 -61334 -46194 -46916 -133102 -156047 -77682
14841 -77682 507 1788 9547 11159 -14850 -38844 -63081 -51781 -48429 -57307 -99123 -118564 -147237
14828 -147237 -153778 -157380 -146243 -120228 -134345 -92500 -48340 -26810 27176 24562 56753 69870
14816 69870 47582 13978 -4773 -30291 -50141 -57435 -96138 -122971 -86395 -22220 -20427 -30472
14804 -30472 -45626 10093 -21918 -17528 -26746 -14111 2306 -3384 -35731 -25582 21307 24692
14792 24692 39503 5161 -17980 -75697 -52312 -2265 48634 53943 58662 29792 -4555 -1789
14780 -1789 22120 33657 1221 -47561 -56234 -35022 -20732 9219 29315 21358 20696 -5581 21293
14767 21293 23802 -25135 -18166 -54114 -67454 -26413 -37353 -71876 -67209 -45589 -62424 -4463
$$ packed form
14853c3899r013k8559N1422P5575k0245k9786o6829J5140p22q6186k2945P8365
14841g7682P8189J281P759J612k6009k3994k4237J1300L352q878m1816j9441k8673
14828a47237o541l602J1137K6015j4117M1845M4160K1530N3986k614L2191J3117
14816F9870k2288l3604j8751k5518j9850p294l8703k6833L6576O4175J793j0045
14804c0472j5154N5719l2011M390r218J2635J6417n690l2347J0149M6889L385
14792B4692J4811l4342k3141n7717K3385N0047N0899N309M719k8870l4347K766
14780a789K3909J1537l2436m8782q673K1212J4290K9951K0096p957o62k6277K6874
14767B1293K509m8937O969l5948j3340M1041j0940l4523M667K1620j6835N7961
$$ plain form
14755 -4463 -13492 -29314 -49383 -44740 -37554 -61854 -77777 -54825 -40890 -56990 -66073 -32725 -12833
14742 -12833 16577 48625 14785 -16000 -18613 -53939 -82807 -72073 -68392 -2025 -7791 -68020
14730 -68020 -51739 2074 -30200 -33307 -22771 -57814 -98944 -112551 -46933 -52249 -79510 -70454
14718 -70454 -40135 -67207 -85237 -79917 -66950 -75945 -77892 -46076 -11724 -17250 -28033 -18471 -24410
14705 -24410 24066 33063 15301 13253 -12487 -46006 -92128 -42325 -38094 -83380 -83949 -95224 -125963
14692 -125963 -77880 -81815 -134633 -143219 -57191 -488 6988 -51464 -122340 -163579 -143854 -102573
14680 -102573 -90271 -80161 -73553 -78503 -80181 -54362 -54708 -17428 -16214 -21509 42903 84900 104652
14667 104652 131309 108038 63138 20239 8376 -7230 -69948 -145019 -105125 -82159 -103356
$$ packed form
14755d463r029j5822k0069M643P186k4300j5923K2952J3935j6100r083L3348J9892
14742a2833K9410L2048l3840l0785k613l5326k8868J0734L681O6367n766o0229
14730f8020J6281N3813l2274l107J0536l5043m1130j3607O5618n316k7261R056
14718g0454L0319k7072j8030N320J2967q995j947L1816L4352n526j0783R562n939
14705b4410M8476Q997j7762k048k5740l3519m6122M9803M231m5286n69j1275l0739
14692a25963M8083l935n2818q586Q6028N6703P476n8452p0876m1239J9725M1281
14680a02573J2302J0110O608m950j678K5819l46L7280J214n295O4412M1997J9752
14667A04652K6657k3271m4900m2899j1863j5606o2718p5071L9894K2966k1197
$$ plain form
14656 -103356 -104978 -86337 -35686 23115 38245 -1756 -17488 23483 24630 79634 78424 7230
14644 7230 -28617 -7100 -24707 -17181 10239 -37284 -24742 -40385 -42524 -43240 -38345 -33566 -64941
14631 -64941 -55013 -50591 -9467 15264 -30634 -43578 -38096 -52660 -18527 -21813 -56456 -86517
14619 -86517 -74745 -37072 25407 64154 68477 40786 10066 -13977 -34677 -10004 26560 26168
14607 26168 42344 16585 10121 30788 3361 -17635 -34314 -63723 -33100 -7278 -12438 -23603
14595 -23603 -59671 -75282 -32601 -23173 -28071 -39273 -49634 -79412 -95675 -27903 -30503 -102422
14583 -102422 -127935 -99410 -106846 -136144 -148986 -168648 -92842 -33044 -63 45718 37023 -14647
14571 -14647 -90241 -87203 -57229 -31631 -11254 23018 60881 32976 28313 13003 49842 52134
$$ packed form
14656a03356j622J8641N0651N8801J5130m0001j5732M0971J147N5004j210p1194
14644G230l5847K1517j7607P526K7420m7523J2542j5643k139p16M895M779l1375
14631f4941R928M422M1124K4731m5898j2944N482j4564L4133l286l4643l0061
14619h6517J1772L7673O2479L8747M323k7691l0720k4043k0700K4673L6564l92
14607B6168J6176k5759o464K0667k7427k0996j6679k9409L0623K5822n160j1165
14595b3603l6068j5611M2681R428m898j1202j0361k9778j6263O7772k600p1919
14583a02422k5513K8525p436k9298j2842j9662P5806N9798L2981M5781q695n1670
14571a4647p5594L038K9974K5598K0377L4272L7863k7905m663j5310L6839K292
$$ plain form
14559 52134 17350 15718 8895 21688 69514 69712 111655 54069 -2193 15738 7587 -54059 -72349
14546 -72349 -43714 -42095 -63497 -49189 -11313 38422 33826 71443 106727 105134 16074 -44916
14534 -44916 -96722 -99356 -97737 -43292 -13255 -2218 -18273 -13745 -37203 -99756 -55946 53012
14522 53012 47144 -11575 -4744 -29173 -34265 9975 -12863 -77989 -49368 -41640 -45772 -8791 -10649
14509 -10649 -4182 -31370 19546 24765 -28080 -71305 -71634 -50371 -25613 -17655 10011 48931 35498
14496 35498 59532 74038 46861 12035 -25377 -27341 10287 15780 5294 -9903 -10938 9617
14484 9617 -10578 24622 72771 48812 16733 -21650 -42935 -46808 -12072 -23419 -30182 -44379
14472 -44379 -6857 45124 61735 20537 -28113 -16697 -20263 -53029 -25730 -2497 -11823 -10927
$$ packed form
14559E2134l4784j632o823J2793M7826J98M1943n7586n6262J7931q151o1646j8290
14546g2349K8635J619k1402J4308L7876M9735m596L7617L5284j593q9060o0990
14534d4916n1806k634J619N4445L0037J1037j6055M528k3458o2553M3810J08958
14522E3012n868n8719O831k4429n092M4240k2838o5126K8621P728m132L6981j858
14509a0649O467k7188N0916N219n2845m3225l29K1263K4758P958K7666L8920j3433
14496C5498K4034J4506k7177l4826l7412j964L7628N493j0486j5197j035K0555
14484I617k0195L5200M8149k3959l2079l8383k1285l873L4736j1347o763j4197
14472d4379L7522N1981J6611m1198m8650J1416l566l2766K7299K3233r326Q96
$$ plain form
14460 -10927 -52879 -59865 -86819 -119377 -130789 -137987 -117846 -51784 -3145 49720 32155 -58132
14448 -58132 -93594 -114289 -101346 -45152 -74245 -94154 -37387 -54363 -103353 -86835 -123014 -161402
14436 -161402 -126963 -91705 -28414 -3188 -35948 -49610 -39697 -25026 15610 14283 36645 57351
14424 57351 17590 49721 20929 15271 32616 -1955 -40656 -31041 -5297 -19812 -13561 -31925
14412 -31925 -45246 -9197 21748 -4920 -16825 -36233 -65417 -31206 -7158 -27474 -28715 -26820
14400 -26820 -9791 15320 61292 74527 46591 13726 -16971 -25342 7754 -19409 -64853 -52994
14388 -52994 -27857 -11622 18145 14155 17031 62495 8976 -30747 2975 25230 37309 10816
14376 10816 19447 24991 -17952 -53856 -58036 -19306 -6252 -2464 12211 -13912 16062 67304
$$ packed form
14460a0927m1952o986k6954l2558j1412p198K0141O6062M8639N2865j7565r0287
14448e8132l5462k0695J2943N6194k9093j9909N6767j6976m8990J6518l6179l8388
14436a61402L4439L5258O3291K5226l2760j3662R913J4671M0636j327K2362K0706
14424E7351l9761L2131k8792n658J7345l4571l8701R615K5744j4515O251j8364
14412c1925j3321L6049L0945k6668j1905j9408k9184L4211K4048k0316j241J895
14400b6820J7029K5111M5972J3235k7936l2865l0697q371L3096k7163m5444J1859
14388e2994K5137J6235K9767l990K876M5464n3519l9723L3722K2255J2079k6493
14376A0816Q631N544m2943l5904m180L8730J3054L788J4675k6123K9974N1242
$$ plain form
14364 67304 96452 7146 -23366 1633 21480 -35376 -74153 -27011 -63398 -82904 -63023 -53497
14352 -53497 18740 18223 4185 10476 12066 4763 58110 114375 62077 35567 6876 -5511 -449
14339 -449 958 56269 106666 91638 49886 39329 49034 45817 103575 78744 71210 22009 17153
14326 17153 -32153 -71630 -43333 -25673 -14517 5331 -2284 -48326 -69012 -58004 -32977 -29261
14314 -29261 -44234 -52956 -10309 61971 93345 42200 33955 72260 54358 -12796 -60751 3418
14302 3418 35376 -17532 -34511 -11961 27591 41371 29243 31745 -12127 -24333 18703 45061
14290 45061 65568 72327 49398 -9843 -25675 -30623 -12881 -6793 3376 -11422 -25245 -218
14278 -218 43903 10886 -71094 -72674 -63150 -79699 -62252 -35503 32505 120074 132867 78683
$$ packed form
14364F7304K9148q9306l0512K4999J9847n6856l8777M7142l6387j9506J9881R526
14352e3497P2237n17j4038O291J590p303N3347N6265n2298k6510k8691j2387N062
14339d49J407N5311N0397j5028m1752j0557R705l217N7758k4831p534m9201m856
14326A7153m9306l9477K8297J7660J1156J9848p615m6042k0686J1008K5027L716
14314b9261j4973q722M2647P2280L1374n1145q245L8305j7902o7154m7955O4169
14302C418L1958n2908j6979K2550L9552J3780j2128K502m3872j2206M3036K6358
14290D5061K0507O759k2929n9241j5832m948J7742O088J0169j4798j3823K5027
14278b18M4121l3017q1980j580R524j6549J7447K6749O8008Q7569J2793n4184
$$ plain form
14266 78683 50039 66417 56739 92275 59613 112930 75185 11313 -17837 -30389 -93853 -96420
14254 -96420 -53125 -21044 12386 24945 8233 9229 -21881 -74162 -96813 -52010 -43195 31189
14242 31189 50023 63302 26915 14038 60964 85856 -29410 -57303 -63792 -77458 -36639 6237
14230 6237 -2526 -3165 8242 -33371 -50744 -32948 -55266 -58949 -27103 -196 -1570 -21958 -1562
14217 -1562 25105 -26848 -32078 -23627 -6356 14862 -39178 -82626 -15204 9148 -15052 -724
14205 -724 -560 21971 17565 -23964 -6359 29293 29281 26974 8833 31829 45272 70453 27407
14192 27407 67104 37350 695 -52942 -35714 -4942 -15117 -372 10684 2089 -7332 -26130
14180 -26130 25177 65799 -257 -49213 -19803 14229 8714 13836 -11721 -40009 -81055 -70703
$$ packed form
14266G8683k8644J6378r678L5536l2662N3317l7745o3872k9150j2552o3464k567
14254i6420M3295L2081L3430J2559j6712R96l1110n2281k2651M4803Q815P4384
14242C1189J8834J3279l6387j2877M6926K4892j15266k7893o489j3666M0819M2876
14230F237q763o39J1407m1613j7373J7796k2318l683L1846K6907j374k0388K0396
14217a562K6667n1953n230Q451J7271K1218n4040m3448O7422K4352k4200J4328
14205g24J64K2531m406m1529J7605L5652j2k307j8141K2996J3443K5181m3046
14192B7407L9697k9754l6655n3637J7228L0772j0175J4745J1056q595r421j8798
14180b6130N1307M0622o6056m8956K9410L4032n515N122k5557k8288m1046J0352
$$ plain form
14168 -70703 -37672 -26293 -58437 -61592 -8836 -32512 -44003 4867 26420 5408 -2503 -44690
14156 -44690 -25535 -31296 -30690 -16540 -13950 -10980 45685 73342 39071 23276 3168 -11389 5195
14143 5195 35985 25246 36438 5558 -15373 -2615 -29712 -57877 -28699 8393 13561 20863
14131 20863 -3917 8497 78693 69706 95178 90628 81643 111247 105550 68572 82967 95294
14119 95294 73030 84435 64286 7338 -10500 -5969 5837 53381 77490 91679 137241 187169
14107 187169 150102 90455 79816 81627 63933 108768 153898 111090 51271 49583 24950 30954
14095 30954 51558 78587 110620 149217 139079 119617 126115 189478 235157 197277 207061 263580
14083 263580 262169 215252 273843 274321 252460 255261 265403 242543 283644 336832 405775 371951
$$ packed form
14168g0703L3031J1379l2144l155N2756k3676j1491M8870K1553k1012p911m2187
14156d4690J9155n761O06J4150K590K970N6665K7657l4271j5795k0108j4557J6584
14143E195L0790j0739J1192l0880k0931J2758k7097k8165K9178L7092N168P302
14131B0863k4780J2414P0196q987K5472m550q985K9604n697l6978J4395J2327
14119I5294k2264J1405k0149n6948j7838M531J1806M7544K4109J4189M5562M9928
14107A87169l7067n9647j0639J811j7694M4835M5130m2808n9819j688k4633O004
14095C0954K0604K7029L2033L8597j0138j9462O498O3363M5679l7880R784N6519
14083B63580j411m6917N8591M78k1861K801J0142k2860M1101N3188O8943l3824
$$ plain form
14071 371951 399337 399383 428079 459305 488416 537693 539231 553224 575637 560571 526901 543897
14059 543897 545439 582891 605143 627106 659746 652900 650634 663885 704628 704211 773026 819358
14047 819358 797541 777717 881716 968327 948623 860693 837612 866723 874056 865800 896072 910506
14035 910506 936587 904508 891405 918827 952694 917582 897994 938614 979890 1039715 1033408 1056058
14023 1056058 1063673 1073783 1115469 1238156 1324359 1402418 1363015 1268953 1222999 1189291 1178269
14012 1178269 1181169 1213739 1193436 1203342 1194886 1183653 1231180 1247153 1198902 1151361 1116109 1072115
14000 1072115 1039976 1014133 988366 952241 909528 843390 799184 814061 875105 884215 788339
13989 788339 748950 702188 773788 829855 799802 770082 768359 768349 804240 782743 841366 898553
$$ packed form
14071C71951K7386M6K8696L1226K9111M9277J538J3993K2413j5066l3670J6996
14059E43897J542L7452K2252K1963L2640o846k266J3251M0743m17O8815M6332
14047H19358k1817j9824J03999Q6611j9704q7930k3081K9111P333q256L0272J4434
14035I10506K6081l2079j3103K7422L3867l5112j9588M0620M1276N9825o307K2650
14023A056058P615J0110M1686J22687Q6203P8059l9403r4062m5954l3708j1022
14012A178269K900L2570k0303R906q456j1233M7527J5973m8251m7541l5252m3994
14000A072115l2139k5843k5767l6125m2713o6138m4206J4877O1044R110r5876
13989G88339l9389m6762P1600N6067l0053k9720j723j0L5891k1497N8623N7187
$$ plain form
13977 898553 848776 873360 952595 971899 996557 990223 1013005 1027083 1068055 1074534 1062355 1064494
13965 1064494 1099368 1150815 1156137 1163745 1185471 1240482 1186040 1140187 1155264 1142020 1081936 1093550
13953 1093550 1080307 1070789 1083598 1055341 1046265 1019512 965690 959596 1009172 1039052 1033456 991384
13941 991384 935742 844152 799764 842220 835556 779757 783044 836414 852844 884809 832375 788216
13929 788216 786959 786179 828373 803775 754123 710908 701733 657421 617554 677901 758083 761157
13917 761157 652869 646544 609556 571328 639433 597682 553951 542647 507862 508898 491769 479503
13905 479503 505219 511558 462666 465122 411449 391485 384695 373291 368179 349034 308203 257067
13893 257067 254809 263314 246966 211349 157722 188812 255347 242343 214563 214272 216515 213210 196416
$$ packed form
13977H98553m9777K4584P9235J9304K4658o334K2782J4078M0972O479j2179K139
13965A064494L4874N1447N322P608K1726N5011n4442m5853J5077j3244o0084J1614
13953A093550j3243r518J2809k8257r076k6753n3822o094M9576K9880n596m2072
13941I91384n5642r1590m4388M2456o664n5799L287N3370J6430L1965n2434m4159
13929G88216j257p80M2194k4598m9652m3215r175m4312l9867O0347Q0182L074
13917G61157j08288o325l6988l8228O8105m1751m3731j1304l4785J036j7129j2266
13905D79503K5716O339m8892K456n3673j9964o790j1404n112j9145m0831n1136
13893B57067k258Q505j6348l5617n3627L1090O6535j3004k7780k91K243l305j6794
$$ plain form
13880 196416 221705 232871 194403 161005 154258 93419 78162 122547 149168 140532 103153 60802
13868 60802 21483 1889 53076 74256 29303 1964 40422 118283 176395 143769 124219 160010
13856 160010 178708 145054 130249 124717 148686 174574 183781 141812 141318 158168 153541 172966
13844 172966 128491 114820 83339 58839 44802 -43245 -70655 -43464 5031 25436 29422 24519
13832 24519 50224 37544 50202 28302 23403 51736 71303 57900 48688 47565 79654 62828
13820 62828 66556 15975 41628 97292 65318 84665 125216 106348 84220 78097 62214 28967
13808 28967 40981 75573 111476 103394 124445 127540 99236 67076 8434 -3706 14634 61151
13796 61151 78036 42969 49107 64777 93996 97244 68859 81163 72234 86950 92991 86524 30213
$$ packed form
13880A96416K5289J1166l8468l3398o747o0839j5257M4385K6621q636l7379m2351
13868F0802l9319j9594N1187K1180m4953k7339L8458P7861N8112l2626j9550L5791
13856A60010J8698l3654j4805n532K3969K5888R207m1969m94J6850m627J9425
13844A72966m4475j3671l1481k4500j4037q8047k7410K7191M8495K0405L986m903
13832B4519K5705j2680J2658k1900m899K8333J9567j3403r212j123L2089j6826
13820F2828L728n0581K5653N5664l1974J9347M0551j8868k2128o123j5883l3247
13808B8967J2014L4592L5903q082K1051L095k8304l2160n8642j2140J8340M6517
13796F1151J6885l5067O138J5670K9219L248k8385J2304q929J4716O041o467n6311
$$ plain form
13783 30213 31391 29580 -17404 -8279 59330 69774 30191 -48424 -87465 -55679 -10775 4644
13771 4644 9607 -27971 -27753 5685 -6720 22169 29991 12857 44097 62075 120924 170409 156910
13758 156910 115214 86727 33657 1423 19766 46286 98684 91265 37273 60973 79189 81262
13746 81262 131082 105486 89946 115427 151485 136139 97794 114460 137963 111903 117246 126811
13734 126811 83677 28984 84774 79261 83785 61758 27860 73305 102076 90572 94584 109348
13722 109348 119253 106274 88164 63510 85972 102907 84980 -7091 3848 46821 73347 107702
13710 107702 93916 32602 20539 5796 -47154 -99021 -52772 -10148 80153 95242 39958
13699 39958 10571 37722 62244 61121 19375 -1305 -28678 -55030 -18464 35295 36111 72902
$$ packed form
13783C0213J178j811m6984R125O7609J0444l9583p8615l9041L1786M4904J5419
13771D644M963l7578K18L3438j2405K8889P822j7134L1240J7978N8849M9485j3499
13758A56910m1696k8487n3070l2234J8343K6520N2398p419n3992K3700J8216K073
13746H1262M9820k5596j5540K5481L6058j5346l8345J6666K3503k6060N343R565
13734A26811m3134n4693N5790n513M524k2027l3898M5445K8771j1504M012J4764
13722A09348R905j2979j8110k4654K2462J6935j7927r2071J0939M2973K6526L4355
13710A07702j3786o1314j2063j4743n2950n1867M6249M2624R0301J5089n5284
13699C9958k9387K7151K4522j123m1746k0680k7373k6352L6566N3759Q16L6791
$$ plain form
13687 72902 84630 97921 113841 56185 44371 50680 71564 77028 116840 123564 136250 145987
13675 145987 83837 107344 129312 110378 114366 129662 142995 175614 58259 27222 35766 -22894
13663 -22894 -36417 7782 74946 44116 16103 47401 20080 -14763 -8749 30661 85517 96412
13651 96412 155763 150710 80373 67751 97922 93186 67090 88349 78569 51156 43578 39499 26087
13638 26087 4647 -4298 23447 83286 140860 156008 208221 166473 93426 59239 77619 79744
13626 79744 72700 109130 144961 149894 142424 131030 133889 135419 165102 157500 147205 156847 174432
13613 174432 108372 101681 125137 153286 183674 239096 271963 253581 253793 298287 328599 391439
13601 391439 433966 488334 612413 735488 911311 1144586 1276976 1388340 1441728 1448213
$$ packed form
13687G2902J1728J3291J5920n7656j1814O309K0884N464L9812O724J2686R737
13675A45987o2150K3507K1968j8934L988J5296J3333L2619j17355l1037Q544n8660
13663b2894j3523M4199O7164l0830k8013L1298k7321l4843O014L9410N4856J0895
13651I6412N9351n053p0337j2622L0171m736k6096K1259r780k7413p578m079j3412
13638B6087k1440q945K7745N9839N7574J5148N2213m1748p3047l4187J8380K125
13626G9744p044L6430L5831M933p470j1394K859J530K9683p602j0295R642J7585
13613A74432o6060o691K3456K8149L0388N5422L2867j8382K12M4494L0312O2840
13601C91439M2527N4368J24079J23075J75823K33275J32390J11364N3388O485
$$ plain form
13591 1448213 1358560 1182611 1102741 1022410 895622 826350 794808 806621 766133 733348 767846
13580 767846 782414 803886 812623 777603 796910 823429 792553 830899 841546 811399 846416 850338
13568 850338 816922 844446 985556 1099294 1291564 1534486 1796531 2085706 2420492 2715342
13558 2715342 2802646 2743459 2565644 2320025 2009140 1774086 1576129 1397915 1183355 1046434
13548 1046434 956570 878537 771519 702970 685980 691149 576169 511920 601766 605243 506441
13537 506441 479733 531656 562455 516084 498988 563138 539891 544398 612452 742475 897682
13526 897682 1012569 1121711 1295990 1478091 1519416 1432468 1299197 1178959 1051645 938723
13516 938723 928339 902685 842181 741773 735292 742213 719992 748263 788836 783917 814823 839650
$$ packed form
13591A448213q9653j75949p9870q0331j26788o9272l1542J1813m0488l2785L4498
13580G67846J4568K1472Q737l5020J9307K6519l0876L8346J0647l0147L5017L922
13568H50338l3416K7524J41110J13738J92270K42922K62045K89175L34786K94850
13558B715342Q7304n9187j77815k45619l10885k35054j97957j78214k14560j36921
13548A046434q9864p8033j07018o8549j6990N169j14980o4249Q9846L477r8802
13537E06441k6708N1923L0799m6371j7096O4150k3247M507O8054J30023J55207
13526H97682J14887J09142J74279J82101M1325q6948j33271j20238j27314j12922
13516I38723j0384k5654o0504j00408o481O921k2221K8271M0573m919L0906K4827
$$ plain form
13504 839650 823254 783386 763631 828183 929975 1003113 1049163 1075677 1094787 1057556 1016455
13493 1016455 1027030 1059668 1126480 1181826 1179743 1187660 1169321 1151438 1161191 1217557 1190655 1131152
13481 1131152 1055380 1003575 1039087 1047809 1041852 1069452 1101852 1168981 1226135 1264573 1234140 1240459
13469 1240459 1262773 1207798 1192830 1146885 1123730 1116814 1100920 1078828 1046868 1000347 991000 943001
13457 943001 889970 872978 854875 882991 897393 906418 927508 906372 852030 875634 909263 921587
13445 921587 969147 1001419 1001273 952471 983424 1022416 1079914 1100414 1151533 1242900 1282068 1266569
13433 1266569 1299027 1274331 1271258 1249528 1218639 1217215 1174869 1153565 1130354 1112251 1085258 1015545
13421 1015545 967790 1003052 1032537 992440 896435 855391 830070 832742 789605 744368 735470 700808
$$ packed form
13504H39650j6396l9868j9755O4552J01792P3138M6050K6514J9110l7231m1101
13493A016455J0575L2638O6812N5346k083P917j8339j7883R753N6366k6902n9503
13481A131152p5772n1805L5512Q722n957K7600L2400O7129N7154L8438l0433O319
13469A240459K2314n4975j4968m5945k3155o916j5894k2092l1960m6521r347m7999
13457I43001n3031j6992j8103K8116J4402R025K1090k1136n4342K3604L3629J2324
13445I21587M7560L2272j46m8802L0953L8992N7498K0500N1119R1367L9168j5499
13433A266569L2458k4696l073k1730l0889j424m2346k1304k3211j8103k6993o9713
13421A015545m7755L5262K9485m0097r6005m1044k5321K672m3137m5237q898l4662
$$ plain form
13409 700808 689451 684881 743528 804884 799675 848607 891157 953168 995386 1029136 1073169 1087303
13397 1087303 1135061 1172733 1193572 1159715 1068321 979617 919551 809540 669050 576781 517178
13386 517178 514565 475900 480322 488066 479196 488966 485530 419990 438247 434226 413641 316276 306029
13373 306029 372680 429753 420898 394814 390670 345773 374294 449097 525342 566742 586912 649618
13361 649618 753719 746225 717738 648948 598305 591037 589295 591720 548529 502994 462081 459138
13349 459138 498171 513948 460133 447706 471770 469736 514444 545269 563195 569972 585129 625111
13337 625111 637749 641305 615029 559078 471944 420181 403843 420931 477378 514784 521591 515294
13325 515294 511212 532297 513795 506384 539226 524025 459469 450621 437556 514882 549803 525333
$$ packed form
13409G00808j1357m570N8647O1356n209M8932M2550O2011M2218L3750M4033J4134
13397A087303M7758L7672K0839l3857r1394q8704o0066j10011j40490r2269n9603
13386E17178k613l8665M422P744q870R770l436o5540J8257m021k0585r7365j0247
13373C06029O6651N7073q855k6084m144m4897K8521P4803P6245M1400K0170O2706
13361F49618J04101p494k8487o8790n0643p268j742K425m3191m5535m0913k943
13349D59138L9033J5777n3815j2427K4064k034M4708L0825J7926O777J5157L9982
13337F25111J2638L556k6276n5951q7134n1763j6338J7088N6447L7406O807o297
13325E15294m082K1085j8502p411L2842j5201o4556q848j3065P7326L4921k4470
$$ plain form
13313 525333 522828 475603 421426 498493 576999 620013 631053 647631 672256 740249 831941 848608
13301 848608 811401 683562 494511 333416 286863 246904 260725 248090 196559 218345 246192
13290 246192 240882 211006 222159 302459 372259 425666 422651 432962 460882 517671 590290 701231
13278 701231 886425 1061087 1272156 1583620 2048416 2435355 2691061 2783025 2755895 2612819
13268 2612819 2437691 2240168 2023919 1717056 1479212 1197691 974343 828593 755390 798870
13258 798870 891922 926517 1001730 1035456 1016144 966668 959964 1040700 1167340 1207960 1228129
13247 1228129 1285570 1395427 1521241 1601788 1740671 1859108 2076832 2435390 2986531 3716070
13237 3716070 4517968 5261649 5861502 6143599 6062351 5773013 5289334 4721040 4229017 3818862
$$ packed form
13313E25333k505m7225n4177P7067P8506M3014J1040J6578K4625O7993R1692J6667
13301H48608l7207j27839j89051j61095m6553l9959J3821j2635n1531K1786K7847
13290B46192n310k9876J1153Q0300O9800N3407l015J0311K7920N6789P2619J10941
13278G01231J85194J74662K11069L11464M64796L86939K55706R1964k7130j43076
13268B612819j75128j97523k16249l06863k37844k81521k23348j45750p3203M3480
13258G98870R3052L4595P5213L3726j9312m9476o704Q0736J26640M0620K0169
13247A228129N7441J09857J25814Q0547J38883J18437K17724L58558N51141P29539
13237C716070Q01898P43681N99853K82097q1248k89338m83679n68294m92023m10155
$$ plain form
13227 3818862 3471040 3104503 2855483 2710650 2553266 2423503 2364669 2396433 2361283 2317157
13217 2317157 2311863 2376546 2446920 2475703 2572951 2729327 2887078 3051420 3139286 3121629 3122162
13206 3122162 3141505 3167985 3254191 3402043 3620119 4063541 4571903 4983307 5375978 5576066
13196 5576066 5482949 5202601 4816814 4475331 4269215 4092657 3988936 3858774 3797413 3787863
13186 3787863 3801396 3776728 3749574 3768314 3877059 4032856 4228641 4416928 4712917 5024036
13176 5024036 5372165 5689098 5930709 6098046 6216346 6260684 6274003 6384843 6540976 6709717
13166 6709717 6931824 7163795 7489405 7989500 8514971 9123017 9957707 10966564 12221481
13157 12221481 13766832 15717604 18159629 21170740 24948432 29887297 36343842 45086166
$$ packed form
13227C818862l47822l66537k49020j44833j57384j29763n8834L1764l5150m4126
13217B317157n294O4683P0374K8783R7248J56376J57751J64342Q7866j7657N33
13206C122162J9343K6480Q6206J47852K18076M43422N08362M11404L92671K00088
13196E576066r3117k80348l85787l41483k06116j76558j03721j30162o1361r550
13186C787863J3533k4668k7154J8740J08745J55797J95785J88287K95989L11119
13176E024036L48129L16933K41611J67337J18300M4338J3319J10840J56133J68741
13166F709717K22107K31971L25610N00095N25471O08046Q34690J008857J254917
13157A2221481J545351J950772K442025L011111L777692M938865O456545Q742324
$$ plain form
13149 45086166 57342147 74902541 99755747 132786859 171088306 206364530 227936533
13142 227936533 229509766 212855481 185412231 155351321 128061740 105694571 88250529
13135 88250529 74685850 63981049 55586427 49039843 43975580 39884681 36519266 33767301
13127 33767301 31575978 30079508 29266325 29195133 29809728 31165024 33396591 36629986 40966563
13118 40966563 46738170 54385189 64522168 78217367 97297516 124692344 164462396
13111 164462396 220396489 292481342 371145706 437110029 470380926 462044061 418655497
13104 418655497 356422721 291644235 234685912 188976032 153550169 125812823 103440018
13097 103440018 85252301 70678038 59337674 50808760 44389480 39593325 36152525
$$ packed form
13149D5086166J2255981J7560394K4853206L3031112L8301447L5276224K1572003
13142B27936533J573233j6654285k7443250l0060910k7289581k2367169j7444042
13135H8250529j3564679j0704801q394622o546584n064263m090899l365415k751965
13127C3767301k191323j496470q13183p1192O14595J355296K231567L233395M336577
13118D0966563N771607P647019J0136979J3695199J9080149K7394828L9770052
13111A64462396N5934093P2084853P8664364O5964323L3270897q336865m3388564
13104D18655497o2232776o4778486n6958323m5709880l5425863k7737346k2372805
13097A03440018j8187717j4574263j1340364q528914o419280m796155l440800
$$ plain form
13090 36152525 33637484 31918012 31035318 30934272 31582383 33013619 35001354 37285172
13082 37285172 39953787 43258105 47913806 54699683 64778652 79733116 101573040 131839796
13074 131839796 169556866 208628888 238154503 248256244 236656179 209344648 175593044
13067 175593044 143017939 115411120 93558638 76496298 62847924 51644619 42477411
13060 42477411 35124695 29361133 24832860 21298629 18555925 16401543 14575481 13077285
13052 13077285 11888241 10849448 9999390 9223063 8525818 7966604 7506429 7013222 6535825
13043 6535825 6184625 5843010 5540576 5283357 5071707 4951102 4847708 4682786 4501164
13034 4501164 4314156 4196851 4062194 3917151 3766958 3677075 3598230 3487463 3402683 3279347
$$ packed form
13090C6152525k515041j719472q82694j01046O48111J431236J987735K283818
13082C7285172K668615L304318M655701O785877J0078969J4954464K1839924L0266756
13074A31839796L7717070L9072022K9525615J0101741j1600065k7311531l3751604
13067A75593044l2575105k7606819k1852482j7062340j3648374j1203305r167208
13060D2477411p352716n763562m528273l534231k742704k154382j826062j498196
13052A3077285j189044j038793q50058p76327o97245n59214m60175m93207m77397
13043F535825l51200l41615l02434k57219k11650j20605j03394j64922j81622
13034D501164j87008j17305j34657j45043j50193q9883p8845j10767q4780j23336
$$ plain form
13024 3279347 3178230 3073670 2982675 2945294 2839306 2737338 2630823 2588549 2618033 2628074
13014 2628074 2614048 2602165 2649965 2702495 2648049 2588985 2557563 2563962 2566210 2513517 2447070 2429981
13002 2429981 2463083 2518940 2503527 2413349 2430784 2466734 2432979 2485970 2514343 2507280 2522144
12991 2522144 2557867 2589834 2625845 2749587 2934410 3084265 3208804 3409837 3629254 3883542
12981 3883542 4258193 4706423 5029890 5212049 5297797 5300870 5240953 5209007 5207564 5163445 5166221
12970 5166221 5224660 5318073 5416911 5580748 5726625 5821127 5964567 6151117 6325313 6453314
12960 6453314 6577786 6616871 6629535 6658755 6716256 6763738 6821388 6860911 6814743 6695217 6531078
12949 6531078 6414750 6314173 6188955 6089932 6036931 5980837 5949695 5832281 5683864 5567001
$$ packed form
13024C279347j01117j04560r0995l7381j05988j01968j06515m2274K9484J0041
13014B628074j4026j1883M7800N2530n4446n9064l1422O399K248n2693o6447j7089
13002B429981L3102N5857j5413r0178J7435L5950l3755N2991K8373p063J4864
12991B522144L5723L1967L6011J23742J84823J49855J24539K01033K19417K54288
12981C883542L74651M48230L23467J82159Q5748L073n9917l1946j443m4119K776
12970E166221N8439R3413R8838J63837J45877R4502J43440J86550J74196J28001
12960F453314J24472L9085J2664K9220N7501M7482N7650L9523m6168j19526j64139
12949F531078j16328j00577j25218r9023n3001n6094l1142j17414j48417j16863
$$ plain form
12939 5567001 5450723 5345838 5267973 5099627 4900925 4724304 4600059 4404319 4298035 4186210
12929 4186210 4105307 4065595 4170086 4329911 4500522 4641545 4860318 5132891 5455992 5796303
12919 5796303 6022833 6002663 5792237 5443592 4937842 4444641 4067622 3764036 3521610 3360970
12909 3360970 3144563 2983074 2781838 2608432 2504040 2407775 2280164 2198817 2102790 2016136
12899 2016136 1902387 1776806 1679926 1575251 1506092 1422315 1317824 1267761 1215581 1172843
12889 1172843 1162464 1119765 1100035 1092895 1090171 1068134 1058524 1074956 1028102 962858 904630 819924
12877 819924 753345 733633 731036 746435 709347 659088 651511 664971 690178 692666 708932 707829
12865 707829 732638 849825 941928 942377 941703 961525 1075711 1136953 1154474 1135000 1143116 1161415
$$ packed form
12939E567001j16278j04885p7865j68346j98702j76621j24245j95740j06284j11825
12929D186210q0903l9712J04491J59825J70611J41023K18773K72573L23101L40311
12919E796303K26530k0170k10426l48645n05750m93201l77019l03586k42426j60640
12909C360970k16407j61489k01236j73406j04392r6265j27611q1347r6027q6654
12899B016136j13749j25581r6880j04675o9159q3777j04491n0063n2180m2738
12889A172843j0379m2699j9730p140k724k2037r610J6432m6854o5244n8228q4706
12877H19924o6579j9712k597J5399l7088n0259p577J3460K5207K488J6266j103
12865G07829K4809J17187R2103M49o74J9822J14186O1242J7521j9474Q116J8299
$$ plain form
12853 1161415 1132811 1116655 1125501 1174734 1251904 1205975 1149318 1139563 1210506 1142469 1021757
12842 1021757 1011380 1022811 988873 996403 976398 860998 848112 824762 816196 797807 772186
12831 772186 784270 766935 701934 690868 665823 634851 653411 682313 681087 700472 717503 710721
12819 710721 670758 663535 641006 609461 602014 635127 666266 677597 706864 696995 669262 667750
12807 667750 622620 574143 542963 552258 570285 547212 573543 546699 531737 562176 528456 506951
12795 506951 553393 621604 665538 696888 704422 719137 697483 724335 730503 784982 902729 917446
12783 917446 971421 1068543 1073335 1113443 1116632 1002418 907220 892038 894716 928820 944354 932583
12771 932583 867685 829125 835870 854577 910187 941438 939419 1005377 1065185 1047037 1019775 1066170
$$ packed form
12853A161415k8604j6156Q846M9233P7170m5929n6657r755P0943o8037j20712
12842A021757j0377J1431l3938P530k0005j15400j2886k3350q566j8389k5621
12831G72186J2084j7335o5001j1066k5045l0972J8560K8902j226J9385J7031o782
12819G10721l9963p223k2529l1545p447L3113L1139J1331K9267r869k7733j512
12807F67750m5130m8477l1180R295J8027k3073K6331k6844j4962L0439l3720k1505
12795E06951M6442O8211M3934L1350P534J4715k1654K6852O168N4479J17747J4717
12783I17446N3975R7122M792M0108L189j14214r5198j5182K678L4104J5534j1771
12771I32583o4898l8560O745J8707N5610L1251k019O5958N9808j8148k7262M6395
$$ plain form
12759 1066170 1106494 1123231 1167712 1199874 1170749 1118953 1120557 1117474 1014864 909121 890469
12748 890469 924432 962447 963658 995348 990855 949521 992836 1020596 997932 939262 945910 997758
12736 997758 999670 931260 906743 884481 910291 960611 1017558 1069596 1137456 1218689 1294571 1356945
12724 1356945 1334342 1274063 1252962 1227566 1073268 915840 814533 762510 704913 715218 750482
12713 750482 729598 765787 798064 838279 822248 839899 911505 942576 945539 998284 980890 953979
12701 953979 945168 1010733 1034951 1067227 1044768 1048334 1044929 1031816 1024159 995837 971455 987417
12689 987417 979248 1008298 1100646 1146177 1171974 1226398 1207050 1112051 1050686 989068 915515 871057
12677 871057 816428 746627 690012 655676 621788 590192 619128 657659 640988 631931 681555 774966
$$ packed form
12759A066170M0324J6737M4481L2162k9125n1796J604l083j02610j05743j8652
12748H90469L3963L8015J211L1690m493m1334M3315K7760k2664n8670O648N1848
12736I97758J912o8410k4517k2262K5810N0320N6947N2038O7860Q1233P5882O2374
12724A356945k2603o0279k1101k5396j54298j57428j01307n2023n7597J0305L5264
12713G50482k0884L6189L2277M0215j6031J7651P1606L1071K963N2745j7394k6911
12701I53979q811O5565K4218L2276k2459L566l405j3113p657k8322k4382J5962
12689I87417q169K9050R2348M5531K5797N4424j9348r4999o1365o1618p3553m4458
12677H71057n4629o9801n6615l4336l3888l1596K8936L8531j6671r057M9624R3411
$$ plain form
12665 774966 827753 850395 851832 764448 736533 774159 830237 978309 1231882 1523269 1791703
12654 1791703 2034388 2306184 2574118 2921348 3233293 3528054 3633362 3610068 3497594 3262992
12644 3262992 3009892 2784266 2563264 2330713 2132940 2031395 1975657 1922912 1920871 1942252
12634 1942252 1982815 2008158 2037120 2113926 2168544 2195666 2151655 2175934 2235218 2246160 2269983
12623 2269983 2275239 2339985 2431378 2530607 2647472 2729095 2828686 2984801 3173525 3326818 3455910
12612 3455910 3468184 3389098 3237007 3120996 2976642 2812170 2662629 2501859 2449308 2440407
12602 2440407 2450841 2516647 2626388 2754884 2906440 3101652 3330058 3573044 3703625 3705681
12592 3705681 3672744 3674705 3669498 3663277 3620272 3633418 3628227 3600522 3574691 3638829 3674412 3686151
$$ packed form
12665G74966N2787K2642J437q7384k7915L7626N6078J48072K53573K91387K68434
12654A791703K42685K71796K67934L47230L11945K94761J05308k3294j12474k34602
12644C262992k53100k25626k21002k32551j97773j01545n5738n2745k041K1381
12634A942252M0563K5343K8962P6806N4618K7122m4011K4279N9284J0942K3823
12623B269983N256O4746R1393R9229J16865Q1623R9591J56115J88724J53293J29092
12612C455910J2274p9086j52091j16011j44354j64472j49541j60770n2551q901
12602B440407J0434O5806J09741J28496J51556J95212K28406K42986J30581K056
12592C705681l2937J961n207o221m3005J3146n191k7705k5831O4138L5583J1739
$$ plain form
12580 3686151 3742007 3787246 3886573 3981146 4103571 4239961 4389176 4512291 4650451 4808920
12570 4808920 4978071 5195995 5479427 5790629 6070777 6388914 6741844 7083175 7403560
12561 7403560 7805642 8260022 8699877 9164197 9612483 10130480 10671566 11301364 12086675
12552 12086675 12991221 13971626 15105070 16478087 18103061 20033681 22305921 24920531
12544 24920531 27970109 31523702 35740657 40918460 47403113 55837741 66892948 81629777
12536 81629777 101555220 128512707 164614179 211364490 267860229 328243081 380789719
12529 380789719 412390695 416089825 394468668 356521855 312557862 270347076 234157442
12522 234157442 205164352 183019259 166986832 156548182 151374486 151401350 156371149 165864181
$$ packed form
12580C686151N5856M5239R9327R4573J22425J36390J49215J23115J38160J58469
12570D808920J69151K17924K83432L11202K80148L18137L52930L41331L20385
12561G403560M02082M54380M39855M64320M48286N17997N41086O29798P85311
12552A2086675R04546R80405J133444J373017J624974J930620K272240K614610
12544B4920531L049578L553593M216955N177803O484653Q434628J1055207J4736829
12536H1629777J9925443K6957487L6101472M6750311N6495739O0382852N2546638
12529C80789719L1600976L699130k1621157l7946813m3963993m2210786l6189634
12522B34157442k8993090k2145093j6032427j0438650n173696K6864M969799R493032
$$ plain form
12514 165864181 179253381 195653619 214035022 233426090 253213389 272942521 292515582
12507 292515582 311989874 331540551 351354682 371261315 390705163 408462836 422881395
12500 422881395 432247390 435326615 431952071 422846631 409371503 393226612 375989557
12493 375989557 358886185 342523474 327114455 312364389 297645817 282501325 266601646
12486 266601646 249939756 232946012 216363258 201079168 187935494 177729481 171017053
12479 171017053 168389292 170622534 178765854 194312908 218939173 253976554 299251268
12472 299251268 351195359 401401980 437735873 449605560 433929786 396229087 346675416
12465 346675416 294972626 247269848 206226008 172097993 143943694 120808428 101924338
$$ packed form
12514A65864181J3389200J6400238J8381403J9391068J9787299J9729132J9573061
12507B92515582J9474292J9550677J9814131J9906633J9443848J7757673J4418559
12500D22881395R365995L079225l374544r105440j3475128j6144891j7237055
12493C75989557j7103372j6362711j5409019j4750066j4718572j5144492j5899679
12486B66601646j6661890j6993744j6582754j5284090j3143674j0206013o712428
12479A71017053k627761K233242Q143320J5547054K4626265L5037381M5274714
12472B99251268N1944091N0206621L6333893J1869687j5675774l7700699m9553671
12465C46675416n1702790m7702778m1043840l4128015k8154299k3135266j8884090
$$ plain form
12458 101924338 86724297 74686673 65286979 58010590 52324336 47906979 44571465 42096637
12450 42096637 40321048 39046359 37907696 36431745 34359446 31763261 28884558 26046777
12442 26046777 23546511 21470601 19765550 18485592 17493753 16829016 16379338 16210335 16253320
12433 16253320 16473301 16737253 16918137 16942535 16736124 16311254 15758125 15093945 14391169
12424 14391169 13715963 13107026 12528788 12027543 11560137 11129472 10759085 10418684 10090724
12415 10090724 9727917 9355348 8955382 8636278 8487748 8366932 8258356 8163392 8085755 8044445
12405 8044445 7994698 7924651 7929613 7953149 8005797 8037284 8031333 7998190 7872012 7747055 7618110
12394 7618110 7453032 7305460 7152717 7078750 6986292 6960753 6936161 6783471 6594340 6292816
$$ packed form
12458A01924338j5200041j2037624r399694p276389n686254m417357l335514k474828
12450D2096637j775589j274689j138663j475951k072299k596185k878703k837781
12442B6046777k500266k075910j705051j279958r91839o64737m49678j69003M2985
12433A6253320K19981K63952J80884K4398k06411m24870n53129o64180p02776
12424A4391169o75206o08937n78238n01245m67406m30665l70387l40401l27960
12415A0090724l62807l72569l99966l19104j48530j20816j08576r4964p7637m1310
12405H044445m9747p0047M962K3536N2648L1487n951l3143j26178j24957j28945
12394G618110j65078j47572j52743p3967r2458k5539k4592j52690j89131l01524
$$ plain form
12384 6292816 5892964 5515034 5262467 5082707 4900924 4774861 4704129 4755992 4832408 4883890
12374 4883890 4921303 4952056 4976760 4966829 4964736 4915354 4846449 4791224 4714837 4637848 4525886
12363 4525886 4358355 4216462 4095635 4043979 3982468 3924248 3950598 3967825 3944508 3863236 3799910
12352 3799910 3778864 3719925 3620565 3578134 3527406 3446789 3432194 3380983 3327094 3312795 3282505
12341 3282505 3239200 3133136 2938563 2773284 2623714 2430561 2309854 2216487 2190803 2180362
12331 2180362 2143216 2102538 2096649 2135946 2151248 2130374 2173790 2180144 2248121 2312845 2391354 2579975
12319 2579975 2830927 3130554 3553898 4262308 5201507 6239577 6945368 7004054 6428781
12310 6428781 5486870 4550269 3770762 3133779 2653106 2368807 2094060 1812937 1584675
$$ packed form
12384F292816l99852l77930k52567j79760j81783j26063p0732N1863P6416N1482
12374D883890L7413L0753K4704r931k093m9382o8905n5225p6387p6989j11962
12363D525886j67531j41893j20827n1656o1511n8220K6350J7227k3317q1272o3326
12352C799910k1046n8939r9360m2431n0728q0617j4595n1211n3889j4299l0290
12341C282505m3305j06064j94573j65279j49570j93153j20707r3367k5684j0441
12331B180362l7146m0678n889L9297J5302k0874M3416O354O7977O4724P8509J88621
12319B579975K50952K99627M23344P08410R39199J038070P05791N8686n75273
12310F428781r41911r36601p79507o36983m80673k84299k74747k81123k28262
$$ plain form
12301 1584675 1398018 1303484 1233158 1156697 1096369 1020762 988286 989497 976465 997150 1004406
12290 1004406 1025500 1097271 1137509 1162051 1233571 1303748 1430382 1544957 1652088 1662296 1655885
12279 1655885 1582356 1529942 1617283 1804179 2123426 2747611 3786216 5414371 7454459
12270 7454459 9115753 9860914 9700707 8860276 7592239 6143722 4856539 3877192 3134454
12261 3134454 2530695 2084102 1759255 1478169 1327519 1236226 1146409 1066946 989171 904571
12251 904571 818373 715932 651158 650541 645521 644444 638970 597907 564889 587382 590046 554196
12239 554196 528011 568199 623995 700612 762620 778075 848685 980439 1254932 1716184 2368832
12228 2368832 3385120 4599070 5696741 6236232 5898979 5059515 4073526 3222177 2553228
$$ packed form
12301A584675j86657r4534p0326p6461o0328p5607l2476J211j3032K0685P256
12290A004406K1094P1771M0238K4542P1520P0177J26634J14575J07131J0208o411
12279A655885p3529n2414Q7341J86896L19247O24185J038605J628155K040088
12270G454459J661294P45161j60207q40431j268037j448517j287183r79347p42738
12261C134454o03759m46593l24847k81086j50650r1293q9817p9463p7775q4600
12251I04571q6198j02441o4774o17n020j077n474m1063l3018K2493K664l5850
12239E54196k6185M0188N5796P6617O2008J5455P0610J31754K74493M61252O52648
12228B368832J016288J213950J097671N39491l37253q39464r85989q51349o68949
$$ plain form
12219 2553228 2035450 1660377 1348803 1113041 917865 778379 678580 598287 566939 579278
12209 579278 561210 497349 452025 404678 347725 300361 291097 240672 220145 233209 236552 245020
12197 245020 239249 213622 213583 233472 211185 246249 257251 250473 230159 229694 238041 231486 313855
12184 313855 339248 334904 320776 263420 225245 254163 266025 253349 191648 184019 219909 174735
12172 174735 165712 173226 185630 194681 192294 234128 247128 233181 231508 280360 244802 184253
12160 184253 187174 212059 239370 228993 167099 147573 230200 260700 199831 184523 175874 223125
12148 223125 237317 201586 226970 251319 221873 171450 148787 169559 160047 181879 180572 161916
12136 161916 146773 124143 146018 193618 195092 200515 180021 177882 188896 185775 120170 125414
$$ packed form
12219B553228n17778l75073l11574k35762j95176j39486r9799q0293l1348J2339
12209E79278j8068o3861m5324m7347n6953m7364r264n0425k0527J3064L343Q468
12197B45020n771k5627l9J9889k2287L5064J1002o778k0314m65Q347o555Q2369
12184C13855K5393m344j4128n7356l8175K8918J1862j2676o1701p629L5890m5174
12172A74735r023P514J2404R051k387M1834J3000j3947j673M8852l5558o0549
12160A84253K921K4885K7311j0377o1894j9526Q2627L0500o0869j5308q649M7251
12148B23125J4192l5731K5384K4349k9446n0423k2663K0772r512K1832j307j8656
12136A61916j5143k2630K1875M7600J474N423k0494k139J1014l121o5605N244
$$ plain form
12124 125414 180413 240454 285305 266509 204903 178849 166783 198558 204291 244141 240981 225591
12112 225591 237489 288525 235705 222223 238122 256746 245997 279807 300246 284120 326621
12101 326621 325898 298428 287148 288050 322106 342958 299957 292444 262144 199257 237320 309159
12089 309159 344873 326928 359374 417803 510136 524196 580185 607029 617646 680150 793837
12078 793837 936847 1200369 1494671 1788887 2083300 2277299 2379561 2333124 2201055 1982312
12068 1982312 1812945 1668569 1475102 1260278 1140468 1082789 975478 945553 1033963 1082658
12058 1082658 1112895 1184197 1306776 1446949 1506292 1554932 1658075 1775398 1835318 1871884
12048 1871884 1926017 2024978 2222014 2389787 2455267 2477548 2484340 2431192 2405853 2331420 2238583
$$ packed form
12124A25414N4999O0041M4851j8796o1606k6054j2066L1775N733L9850l160j5390
12112B25591J1898N1036n2820j3482J5899J8624j0749L3810K0439j6126M2501
12101C26621p23k7470j1280R02L4056K0852m3001p513l0300o2887L8063P1839
12089C09159L5714j7945L2446N8429R2333J4060N5989K6844J0617O2504J13687
12078G93837J43010K63522K94302K94216K94413J93999J02262m6437j32069k18743
12068A982312j69367j44376j93467k14824j19810n7679j07311k9925Q8410M8695
12058A082658L0237P1302J22579J40173N9343M8640J03143J17323N9920L6566
12048A871884N4133R8961J97036J67773O5480K2281O792n3148k5339p4433r2837
$$ plain form
12037 2238583 2132925 2075383 2003949 1920432 1822052 1740750 1628654 1481191 1327414 1257031
12027 1257031 1255318 1231954 1178059 1132294 1147428 1169050 1193275 1232050 1323969 1446657 1574813
12016 1574813 1773332 2022107 2276697 2377481 2395456 2296254 2135482 1932652 1665948 1406394
12006 1406394 1157889 930487 799488 680971 591512 531234 454030 418974 390033 330407
11996 330407 300310 325399 271007 230424 235731 242066 243961 264329 273853 227665 135109 130302
11984 130302 158619 152096 100407 116096 159802 218775 266112 264956 275262 262967 230952 212332
11972 212332 161965 154880 198836 180583 108305 66931 98516 134664 146214 169321 128488 118348
11960 118348 122059 165542 193983 185867 178062 132766 140267 143901 120562 130668 140265 133300 114799
$$ packed form
12037B238583j05658n7542p1434q3517r8380q1302j12096j47463j53777p0383
12027A257031j713k3364n3895m5765J5134K1622K4225L8775R1919J22688J28156
12016A574813J98519K48775K54590J00784J7975r9202j60772k02830k66704k59554
12006A406394k48505k27402j30999j18517q9459o0278p7204l5056k8941n9626
11996C30407l0097K5089n4392m0583N307O335J895K0368R524m6188r2556m807
11984A30302K8317o523n1689J5689M3706N8973M7337j156J0306j2295l2015j8620
11972B12332n0367p085M3956j8253p2278m1374L1585L6148J1550K3107m0833j0140
11960A18348L711M3483K8441q116p805m5296P501L634k3339J0106R597o965j8501
$$ plain form
11947 114799 116367 163414 172160 181876 210771 199554 181672 184143 202537 223705 238721 218620
11935 218620 238691 203674 185760 168583 133654 88179 43629 76528 72656 81357 84928 134016
11923 134016 170837 156650 101909 86226 125705 142099 97400 101570 81003 70701 61687 26933
11911 26933 -1044 53959 76634 64270 23627 7054 48787 132188 109684 120515 122117 126708
11899 126708 103291 70090 62081 105047 127697 127497 167870 232317 243760 202520 193879 181028
11887 181028 117463 111331 84410 7153 2889 34604 48169 93165 150517 145604 112784 113303
11875 113303 81706 88774 86577 83018 128119 143730 159275 171163 156284 132984 60657 44396
11863 44396 92299 99617 62496 41925 4810 33873 75951 67355 34475 26340 73048 139509
$$ packed form
11947A14799J568M7047Q746R716K8895j1217j7882K471J8394K1168J5016k0101
11935B18620K0071l5017j7914j7177l4929m5475m4550L2899l872Q701L571M9088
11923A34016L6821j4187n4741j5683L9479J6394m4699M170k0567j0302r014l4754
11911B6933k7977N5003K2675j2364m0643j6573M1733Q3401k2504J0831J602M591
11899A26708k3417l3201q009M2966K2650k00M0373O4447J1443m1240q641j2851
11887A81028o3565o132k6921p7257m264L1715J3565M4996N7352m913l2820N19
11875A13303l1597P068k197l559M5101J5611J5545J1888j4879k3300p2327j6261
11863D4396M7903P318l7121k0571l7115K9063M2078q596l2880q135M6708O6461
$$ plain form
11851 139509 157770 94756 85739 28890 11350 19851 8427 41293 129382 144718 71489 89172
11839 89172 126658 101325 66789 92147 119849 106286 112438 113649 62061 74346 86856 85703
11827 85703 99827 101647 79285 104695 126945 100759 71100 35890 81880 94491 78153 89410
11815 89410 94899 63712 107945 120727 76109 44735 52766 40118 35872 76391 104989 125838
11803 125838 84721 68568 89712 137714 110241 96884 91068 47363 49102 102479 116541 153937
11791 153937 140800 129613 151760 158939 121128 46886 5374 15698 54702 54522 28030 39733
11779 39733 77317 60044 62796 89274 120596 113723 112793 125968 58124 27765 80782 129281
11767 129281 129934 151836 158214 173024 163428 159424 158132 158516 133396 121980 98347 61780 15581
$$ packed form
11851A39509J8261o3014r017n6849j7540Q501j1424L2866Q8089J5336p3229J7683
11839H9172L7486k5333l4536K5358K7702j3563O152J211n1588J2285J2510j153
11827H5703J4124J820k2362K5410K2250k6186k9659l5210M5990J2611j6338J1257
11815H9410N489l1187M4233J2782m4618l1374Q031j2648m246M0519K8598K0849
11803A25838m1117j6153K1144M8002k7473j3357n816m3705J739N3377J4062L7396
11791A53937j3137j1187K2147P179l7811p4242m1512J0324L9004j80k6492J1703
11779C9733L7584j7273K752K6478L1322o873r30J3175o7844l0359N3017M8499
11767A29281O53K1902O378J4810r596m004j292L84k5120j1416k3633l6567m6199
$$ plain form
11754 15581 53772 81434 96752 123220 122643 108858 133496 120741 93986 41389 50525 49125
11742 49125 35498 9107 2238 13678 -7370 -56673 -39819 -26570 -61226 -21177 29458 87963
11730 87963 102894 25198 -26416 -22403 52582 51322 50772 32791 49044 107759 105858 129752 184858
11717 184858 194330 165321 162890 141544 92180 68731 59042 54127 37967 58173 80454 101519
11705 101519 115352 71194 44096 18251 32048 102406 115163 83528 50154 75505 95614
11694 95614 91931 52343 28010 45682 88159 105120 76965 27039 -2167 386 28225 74635
11682 74635 94424 101473 85215 114799 118476 91154 100154 102345 23817 -60338 -102465 -127742
11670 -127742 -70454 15416 59729 88425 68394 -22164 -67736 -19767 -7479 -9869 85314 149309
$$ packed form
11754A5581L8191K7662J5318K6468n77j3785K4638j2755k6755n2597R136j400
11742D9125j3627k6391o869J1440k1048m9303J6854J3249l4656M0049N0635N8505
11730H7963J4931p7696n1614M013P4985j260n50j7981J6253N8715j901K3894N5106
11717A84858R472k9009k431k1346m9364k3449r689m915j6160K0206K2281K1065
11705A01519J3833m4158k7098k5845J3797P0358J2757l1635l3374K5351K0109
11694I5614l683l9588k4333J7672M2477J6961k8155m9926k9206K553K7839M6410
11682G4635J9789P049j6258K9584L677k7322R000K191p8528q4155m2127k5277
11670a27742N7288Q5870M4313K8696k0031r0558m5572M7969J2288k390R5183O3995
$$ plain form
11658 149309 194556 175172 141801 120336 164242 169829 131070 155790 144566 99124 54158 119678
11646 119678 128354 128572 122435 106271 80383 78057 98802 128552 94220 49420 53023 45884 66126
11633 66126 112324 127807 64750 48843 74250 58954 69085 83992 58525 30460 74527 173661
11621 173661 184382 161902 151172 137526 127810 133330 104570 36079 13153 38180 72385 129784
11609 129784 89667 99344 135343 118413 103794 58571 49620 14549 59002 134842 173427 147945
11597 147945 187589 153853 102419 103025 63188 75372 161438 165604 183005 172128 156145 122666
11585 122666 98384 114740 69402 22945 49635 98699 143026 149658 110006 66700 70110 102851
11573 102851 90232 110829 115882 86166 62153 125253 176057 137437 89200 95708 87360 62524
$$ packed form
11658A49309M5247j9384l3371k1465M3906N587l8759K4720j1224m5442m4966O5520
11646A19678Q676K18o137j6164k5888k326K0745K9750l4332m4800L603p139K0242
11633F6126M6198J5483o3057j5907K5407j5296J0131J4907k5467k8065M4067R9134
11621A73661J0721k2480j0730j3646r716N520k8760o8491k2926K5027L4205N7399
11609A29784m0117R677L5999j6930j4619m5223q951l5071M4453P5840L8585k5482
11597A47945L9644l3736n1434O06l9837J2184Q6066M166J7401j0877j5983l3479
11585A22666k4282J6356m5338m6457K6690M9064M4327O632l9652m3306L410L2741
11573A02851j2619K0597N053k9716k4013O3100N0804l8620m8237O508q348k4836
$$ plain form
11561 62524 95183 80755 85262 117729 119019 152626 151329 159970 137239 121020 166784 178860
11549 178860 162310 106238 74592 53359 36682 25539 60695 139229 140402 149841 67662 63128
11537 63128 57292 40829 112314 153227 148146 174062 196692 158378 150771 183810 152954 129617
11525 129617 162336 122489 120439 124926 144179 157706 149339 139901 110977 155459 220260 178383
11513 178383 179505 206213 197716 222959 269849 256068 260333 271462 260278 275749 334239 365160
11501 365160 328753 345988 413594 503888 608308 762244 951079 1170504 1357503 1427276
11491 1427276 1338165 1225780 1104224 983630 869663 707308 630973 579536 526454 478838
11481 478838 356193 360465 388921 375383 372054 431284 442522 419956 417824 403311 407686 395536
$$ packed form
11561F2524L2659j4428M507L2467J290L3607j297Q641k2731j6219M5764J2076
11549A78860j6550n6072l1646k1233j6677j1143L5156P8534J173R439q2179m534
11537F3128n836j6463P1485M0913n081K5916K2630l8314p607L3039l0856k3337
11525A29617L2719l9847k050M487J9253J3527q367r438k8924M4482O4801m1877
11513A78383J122K6708q497K5243M6890j3781M265J1129j1184J5471N8490L0921
11501C65160l6407J7235O7606R0294J04420J53936J88835K19425J86999O9773
11491A427276q9111j12385j21556j20594j13967j62355p6335n1437n3082m7616
11481D78838j22645M272K8456j3538l329N9230J1238k2566k132j4513M375j2150
$$ plain form
11469 395536 355967 412219 453308 498958 597687 674915 824356 1013504 1242540 1555596 1985920
11458 1985920 2410059 2619850 2575129 2407379 2141477 1832296 1513137 1297035 1151072 939293
11448 939293 822519 752345 650139 573589 469948 417026 385988 356689 432286 481818 490022
11437 490022 463238 407516 429631 444393 461430 486322 532708 530244 591291 658490 684235 782408
11425 782408 934642 1094818 1205963 1303771 1387744 1423579 1334488 1175366 1042570 931076
11415 931076 786948 689338 600082 561046 528757 492408 462615 444836 500028 464508 441757
11404 441757 398116 385832 394176 402292 442900 429362 431565 502889 601449 626814 624089 625570
11392 625570 691352 646687 677894 743412 752843 772068 793134 848450 886077 938070 945783 949771
$$ packed form
11469C95536l9569N6252M1089M5650R8729P7228J49441J89148K29036L13056M30324
11458A985920M24139K09791m4721j67750k65902l09181l19159k16102j45963k11779
11448I39293j16774p0174j02206p6550j03641n2922l1038k9299P5597M9532Q204
11437D90022k6784n5722K2115J4762J7037K4892M6386k464O1047O7199K5745R8173
11425G82408J52234J60176J11145R7808Q3973L5835q9091j59122j32796j11494
11415I31076j44128r7610q9256l9036l2289l6349k9793j7779N5192l5520k2751
11404D41757m3641j2284Q344Q116M0608j3538K203P1324R8560K5365k725J481
11392F25570O5782m4665L1207O5518R431J9225K1066N5316L7627N1993P713L988
$$ plain form
11380 949771 973758 957428 932204 923937 898643 896604 894343 905856 972409 960314 971699 1014058
11368 1014058 1026899 999944 1038507 1063442 1118925 1158922 1187207 1214450 1183267 1119658 1134507
11357 1134507 1171250 1138608 1171280 1194450 1216463 1290666 1340929 1356072 1312696 1223710 1191986
11346 1191986 1214814 1268000 1326102 1287835 1253544 1236398 1257706 1251264 1144883 1109343 1147479
11335 1147479 1192623 1219796 1217390 1217780 1269758 1263749 1208306 1208506 1178523 1121803 1087945 1099657
11323 1099657 1117595 1103665 1141298 1103448 1066501 1083402 1046070 1013407 1021291 1017830 1023221 958736
11311 958736 909456 897906 850625 836356 830603 783378 749941 753491 759317 760368 728025 694612
11299 694612 760320 822171 834977 841252 890756 904603 894119 860390 826755 806957 752969 699711
$$ packed form
11380I49771K3987j6330k5224q267k5294k039k261J1513O6553j2095J1385M2359
11368A014058J2841k6955L8563K4935N5483L9997K8285K7243l1183o3609J4849
11357A134507L6743l2642L2672K3170K2013P4203N0263J5143m3376q8986l1724
11346A191986K2828N3186N8102l8267l4291j7146K1308o442j06381l5540L8136
11335A147479M5144K7173k406L90N1978o009n5443K00k9983n6720l3858J1712
11323A099657J7938j3930L7633l7850l6947J6901l7332l2663P884l461N391o4485
11311I58736m9280j1550m7281j4269n753m7225l3437L550N826J051l2343l3413
11299F94612O5708O1851J2806O275M9504J3847j0484l3729l3635j9798n3988n3258
$$ plain form
11287 699711 681272 590043 490887 495495 468524 497548 516251 509475 480404 483155 515209 541051
11275 541051 559444 591897 598132 652037 666552 690465 663534 617976 577988 534273 414341
11264 414341 313384 291546 329195 362958 410119 443087 498540 550883 533437 516959 482813
11253 482813 447505 432452 440409 454306 508887 568120 560198 544422 544638 540424 609985 660620
11241 660620 677386 695258 678499 691674 728383 773762 775019 720696 598420 385481 209477
11230 209477 73022 -79160 -139358 -99008 250 38640 69066 111205 101109 103635 155460
11219 155460 206213 241384 304358 353901 366454 317313 298133 345359 400305 435463 494099
11208 494099 524759 544943 583554 630565 782944 944089 1074807 1236073 1346383 1366859
$$ packed form
11287F99711j8439r1229r9156M608k6971K9024J8703o776k9071K751L2054K5842
11275E41051J8393L2453O235N3905J4515K3913k6931m5558l9988m3715j19932
11264D14341j00957k1838L7649L3763M7161L2968N5453N2343j7446j6478l4146
11253D82813l5308j5053P957J3897N4581N9233p922j5776K16m214O9561N0635
11241F60620J6766J7872j6759J3175L6709M5379J257n4323j22276k12939j76004
11230B09477j36455j52182o0198M0350R9258L8390L0426M2139j0096K526N1825
11219A55460N0753L5171O2974M9543J2553m9141j9180M7226N4946L5158N8636
11208D94099L0660K0184L8611M7011J52379J61145J30718J61266J10310K0476
$$ plain form
11198 1366859 1246238 1081160 868892 618595 422917 347937 349101 398480 453190 559023
11188 559023 597443 548826 497796 493839 483936 415084 438316 540371 567559 615065 695331 783874
11176 783874 877365 989167 1126343 1353361 1598791 1885924 2186098 2405366 2567051 2633145
11166 2633145 2682021 2641997 2560767 2441628 2260841 2119143 1939122 1764994 1614532 1598108
11156 1598108 1589506 1559597 1584382 1685445 1710443 1769930 1841090 1842800 1875677 2002793 2031260
11145 2031260 2103230 2191963 2300737 2424594 2575394 2695993 2737625 2696644 2651164 2621715
11135 2621715 2575275 2589445 2670437 2797202 3014230 3142100 3227625 3185346 3165787 3159036 3150529
11124 3150529 3090469 3056639 2994750 2997699 3030661 3149535 3370964 3643316 4003447 4343086
$$ packed form
11198A366859j20621j65078k12268k50297j95678p4980J164M9379N4710J05833
11188E59023L8420m8617n1030l957r903o8852K3232J02055K7188M7506Q0266Q8543
11176G83874R3491J11802J37176K27018K45430K87133L00174K19268J61685O6094
11166B633145M8876m0024q1230j19139j80787j41698j80021j74128j50462j6424
11156A598108q602k9909K4785J01063K4998N9487P1160J710L2877J27116K8467
11145B031260P1970Q8733J08774J23857J50800J20599M1632m0981m5480k9449
11135B621715m6440J4170Q0992J26765K17028J27870Q5525m2279j9559o751q507
11124C150529o0060l3830o1889K949L2962J18874K21429K72352L60131L39639
$$ plain form
11114 4343086 4759452 5262062 5773790 6191329 6553962 6678015 6613196 6453552 6310177 6210485
11104 6210485 6170469 6211905 6291320 6459858 6689111 7007477 7411361 7910350 8554638 9285608
11094 9285608 10233071 11390250 12823594 14422939 16114726 17894632 19889609 22367984
11086 22367984 25527518 29554502 34967629 42323983 52676906 67652962 89371489 120095435
11078 120095435 160027057 203831411 239059073 253123413 242863649 215343946 181188593
11071 181188593 148532478 121382593 100383566 84460460 72161551 62530644 55174278
11064 55174278 49555202 45071752 41494552 38634581 36483344 35012919 34275790 34353793
11056 34353793 35170745 36637525 38581843 40938366 43899985 47842601 53173325 60421058
$$ packed form
11114D343086M16366N02610N11728M17539L62633J24053o4819j59644j43375r9692
11104F210485m0016M1436P9415J68538K29253L18366M03884M98989O44288P30970
11094I285608R47463J157179J433344J599345J691787J779906J994977K478375
11086B2367984L159534M026984N413127P356354J0352923J4976056K1718527L0723946
11078A20095435L9931622M3804354L5227662J4064340j0259764k7519703l4155353
11071A81188593l2656115k7149885k0999027j5923106j2298909r630907p356366
11064E5174278n619076m483450l577200k859971k151237j470425p37129P8003
11056C4353793Q16952J466780J944318K356523K961619L942616N330724P247733
$$ plain form
11048 60421058 70549484 85141560 106626930 138811815 186400754 252758595 333904536
11041 333904536 413737537 468161141 478739667 445596373 384836406 316292699 253810224
11034 253810224 203029494 163889694 133842065 110192380 91143203 76021593 64577928
11027 64577928 56158857 50024963 45480751 41875922 38954316 36619408 35035049 34273758
11019 34273758 34300229 34942191 35943484 37041875 38277044 39939021 42661018 47052223
11011 47052223 54088979 64888409 81065923 104651690 136884323 175500599 211730524
11004 211730524 232913753 231522556 210256457 178431851 145295167 116258146 93090512
10997 93090512 75388569 61663006 50562132 41603902 34501055 29165995 25109685 21985031
$$ packed form
11048F0421058J0128426J4592076K1485370L2184885M7588939O6357841Q1145941
11041C33904536P9833001N4423604J0578526l3143294o0759967o8543707o2482475
11034B53810224n0780730l9139800l0047629k3649685j9049177j5121610j1443665
11027F4577928q419071o133894m544212l604829k921606k334908j584359p61291
11019C4273758K6471O41962J001293J098391J235169J661977K721997M391205
11011D7052223P036756J0799430J6177514K3585767L2232633L8616276L6229925
11004B11730524K1183229j391197k1266099l1824606l3136684k9037021k3167634
10997I3090512j7701943j3725563j1100874q958230p102847n335060m056310l124654
$$ plain form
10989 21985031 19476117 17346149 15429919 13701138 12208863 10945435 9837240 8951767
10981 8951767 8201379 7523628 6872644 6307998 5863204 5421437 5061502 4768414 4501582
10972 4501582 4337171 4234367 4125259 3978817 3807485 3632520 3542278 3438732 3313962 3156874
10962 3156874 3076746 3057579 3063442 3054729 3010648 2908755 2786238 2711776 2695331 2707598 2708364 2735006
10950 2735006 2798934 2867050 2953222 3129233 3208360 3338052 3728714 4262532 5040710 6149074
10940 6149074 7232606 7958392 7912801 7229860 6260375 5360351 4608901 4042422 3646853
10931 3646853 3340439 3036045 2803206 2663347 2540720 2511938 2500069 2537281 2537842 2478639 2455576
10920 2455576 2438583 2416031 2359875 2304739 2283559 2291250 2324887 2435939 2593014 2783297 2847640
$$ packed form
10989B1985031k508914k129968j916230j728781j492275j263428j108195q85473
10981H951767p50388o77751o50984n64646m44794m41767l59935k93088k66832
10972D501582j64411j02804j09108j46442j71332j74965r0242j03546j24770j57088
10962C156874q0128j9167N863q713m4081j01893j22517p4462j6445J2267P66K6642
10950B735006O3928O8116Q6172J76011P9127J29692L90662N33818P78178J108364
10940F149074J083532P25786m5591o82941r69485r00024p51450n66479l95569
10931C646853l06414l04394k32839j39859j22627k8782j1869L7212N61n9203k3063
10920B455576j6993k2552n6156n5136k1180P691L3637J11052J57075J90283O4343
$$ plain form
10909 2847640 2833473 2804592 2751555 2798132 2934257 3017804 3190632 3484710 3997548 4824231
10899 4824231 5978148 7446680 9084688 10698459 11747734 11757796 10812118 9315069 7851578
10890 7851578 6661748 5707728 5128202 4784187 4361291 3960719 3554247 3210449 2889376
10881 2889376 2569840 2350330 2220587 2077090 1930844 1831072 1703773 1633067 1647190 1681269
10871 1681269 1672327 1719858 1743045 1743962 1788709 1783936 1733821 1727594 1774169 1850176 1998640 2118968
10859 2118968 2257246 2468681 2712869 3028403 3658044 4567265 5611899 6468611 6726973
10850 6726973 6267773 5379309 4332321 3363817 2640547 2124951 1711380 1463415 1328641
10841 1328641 1230697 1175167 1125691 1141717 1099527 1072747 1124408 1167125 1166018 1136435 1175443
$$ packed form
10909B847640j4167k8881n3037M6577J36125Q3547J72828K94078N12838Q26683
10899D824231J153917J468532J638008J613771J049275J0062r45678j497049j463491
10890G851578j189830r54020n79526l44015m22896m00572m06472l43798l21073
10881B889376l19536k19510j29743j43497j46246r9772j27299p0706J4123L4079
10871A681269q942M7531K3187R17M4747m773n0115o227M6575P6007J48464J20328
10859B118968J38278K11435K44188L15534O29641R09221J044634Q56712K58362
10850F726973m59200q88464j046988r68504p23270n15596m13571k47965j34774
10841A328641r7944n5530m9476J6026m2190k6780N1661M2717j107k9583L9008
$$ plain form
10830 1175443 1175064 1174497 1225713 1328843 1343913 1373742 1403601 1454158 1517555 1607046 1723344 1875849
10818 1875849 2058935 2192428 2345738 2431035 2411768 2380599 2338984 2325871 2353181 2440171 2564417
10807 2564417 2641136 2673087 2665846 2648805 2635481 2612403 2635820 2728282 2753180 2833708 2876500
10796 2876500 2940709 2918847 2908930 2985521 3017046 3113784 3271594 3390965 3567076 3694246 3783526
10785 3783526 3892383 4014600 4205412 4414295 4711521 5091559 5584560 6071504 6499272
10776 6499272 6684742 6599315 6321429 6091179 5891346 5725921 5618788 5523132 5484362 5385678
10766 5385678 5384659 5394918 5430945 5612248 5753326 5912840 6088212 6197771 6333438 6552996
10756 6552996 6734295 6851613 6953783 7067504 7222479 7339893 7430223 7569509 7747467 7903214
$$ packed form
10830A175443l79n67N1216J03130J5070K9829K9859N0557O3397Q9491J16298J52505
10818A875849J83086J33493J53310Q5297j9267l1169m1615j3113K7310Q6990J24246
10807B564417P6719L1951p241j7041j3324k3078K3417R2462K4898Q0528M2792
10796B876500O4209k1862r917P6591L1525R6738J57810J19371J76111J27170Q9280
10785C783526J08857J22217J90812K08883K97226L80038M93001M86944M27768
10776F499272J85470q5427k77886k30250j99833j65425j07133r5656l8770r8684
10766E385678j019J0259L6027J81303J41078J59514J75372J09559J35667K19558
10756F552996J81299J17318J02170J13721J54975J17414R0330J39286J77958J55747
$$ plain form
10746 7903214 8111681 8464673 8921417 9475499 10191019 11016708 11677232 11988445 11981032 11711709
10736 11711709 11382295 11031929 10852060 10811981 10857391 10986465 11227596 11492692 11793265 12215663
10726 12215663 12570339 12974794 13455234 14034861 14656543 15335583 16068579 16841860 17774509
10717 17774509 18789344 19906828 21191763 22590377 24220114 26140343 28344349 30951564
10709 30951564 34002854 37556893 41718859 46709685 52721781 60029299 68838046 79403616
10701 79403616 92286259 108295882 128439070 153697227 184825434 221657684 262423868
10694 262423868 302976610 337202789 359113070 365355792 356391679 335937622 308923150
10687 308923150 280109442 252906512 229277646 210276741 196249465 187347415 183665561
$$ packed form
10746G903214K08467L52992M56744N54082P15520Q25689O60524L11213p413k69323
10736A1711709l29414l50366j79869m0079M5410J29074K41131K65096L00573M22398
10726A2215663L54676M04455M80440N79627O21682O79040P32996P73281R32649
10717A7774509J014835J117484J284935J398614J629737J920229K204006K607215
10709C0951564L051290L554039M161966M990826O012096P307518Q808747J0565570
10701G9403616J2882643J6009623K0143188K5258157L1128207L6832250M0766184
10694B62423868M0552742L4226179K1910281O242722q964113k0454057k7014472
10687C08923150k8813708k7202930k3628866j9000905j4027276q902050l681854
$$ plain form
10680 183665561 185345909 192043190 203026028 216945122 231734310 245239432 255586014
10673 255586014 261960072 264960369 266569034 269186987 275214772 286373475 303243075 325262858
10665 325262858 350498321 375536163 396246948 408570121 410047814 400748031 383289455
10658 383289455 361441396 339029304 319249040 303890894 293431389 286848524 282156994
10651 282156994 277031698 269390992 258537864 244791823 229217245 213508312 199257622
10644 199257622 187667214 179605065 175556383 175896012 181057744 191510864 207367607 228354539
10636 228354539 253604317 280669120 305786144 324269867 331846111 326452117 309077829
10629 309077829 283126247 252775304 221822499 192603142 166341440 143451948 123738522
$$ packed form
10680A83665561J680348O697281J0982838J3919094J4789188J3505122J0346582
10673B55586014O374058L000297J608665K617953O027785J1158703J6869600K2019783
10665C25262858K5235463K5037842K0710785J2323173J477693r299783j7458576
10658C83289455k1848059k2412092j9780264j5358146j0459505o582865m691530
10651B82156994n125296p640706j0853128j3746041j5574578j5708933j4250690
10644A99257622j1590408q062149m048682L39629N161732J0453120J5856743K0986932
10636B28354539K5249778K7064803K5117024J8483723P576244n393994j7374288
10629C09077829k5951582l0350943l0952805k9219357k6261702k2889492j9713426
$$ plain form
10622 123738522 106982423 93046744 81605562 72252699 64625147 58210178 52566889
10615 52566889 47534899 43026320 38977632 35396606 32307452 29591130 27222878 25232348
10607 25232348 23587850 22163646 20910172 19841288 19006638 18355767 17894305 17686293 17615448
10598 17615448 17842675 18232494 18792765 19495218 20190878 20637828 20703466 20386317 19773911
10589 19773911 18956033 18041111 17217664 16568154 16163659 15878506 15756454 15699865 15798511 16158012
10579 16158012 16687538 17356589 18286302 19363578 20223269 20519768 20196470 19332068 18360638
10570 18360638 17564462 17057984 16779610 16807409 17118229 17575919 18038909 18389516 18496613
10561 18496613 18324188 17971579 17443023 16799609 16228331 15705943 15314257 15041045 14884260
$$ packed form
10622A23738522j6756099j3935679j1441182r352863p627552o414969n643289
10615E2566889n031990m508579m048688l581026l089154k716322k368252j990530
10607B5232348j644498j424204j253474j068884q34650o50871m61462k08012p0845
10598A7615448K27227L89819N60271P02453O95660M46950O5638l17149o12406
10589A9773911q17878r14922q23447o49510m04495k85153j22052n6589R8646L59501
10579A6158012N29526O69051R29713J077276Q59691K96499l23298q64402r71430
10570A8360638p96176n06478k78374K7799L10820M57690M62990L50607J07097
10561A8496613j72425l52609n28556o43414n71278n22388l91686k73212j56785
$$ plain form
10552 14884260 14841015 14787989 14649847 14403346 14135223 13827425 13470915 13056357 12664654 12359953
10542 12359953 12140454 12033412 12021131 12203225 12582228 13195402 13920185 14633551 15210668
10533 15210668 15531016 15402898 14920539 14162794 13202317 12179404 11195207 10355981 9708042
10524 9708042 9186520 8804473 8575676 8454848 8417650 8472259 8495821 8459149 8328793 8114333
10514 8114333 7794955 7438392 7058597 6705582 6345939 6032462 5765319 5514183 5195768
10505 5195768 4876931 4694463 4454697 4156500 3946760 3794952 3654430 3542914 3444141 3326620
10495 3326620 3285998 3300339 3313489 3284597 3200417 3162478 3145926 3108535 3052202 2899329 2739325
10484 2739325 2646922 2605787 2612145 2591570 2509944 2444276 2338702 2254310 2142947 2024402 1919102
$$ packed form
10552A4884260m3245n3026j38142k46501k68123l07798l56510m14558l91703l04701
10542A2359953k19499j07042j2281J82094L79003O13174P24783P13366N77117
10533A5210668L20348j28118m82359p57745r60477j022913r84197q39226o47939
10524I708042n21522l82047k28797j20828l7198N4609K3562l6672j30356k14460
10514H114333l19378l56563l79795l53015l59643l13477k67143k51136l18415
10505E195768l18837j82468k39766k98197k09740j51808j40522j11516r8773j17521
10495C326620m0622J4341J3150k8892q4180l7939j6552l7391n6333j52873j60004
10484B739325r2403m1135O358k0575q1626o5668j05574q4392j11363j18545j05300
$$ plain form
10473 1919102 1847479 1772672 1662011 1529096 1469848 1415628 1364624 1324267 1263257 1261884 1277931
10462 1277931 1277345 1257100 1202719 1166810 1093798 1028291 988680 970595 1024787 1014863 1022692 997929
10450 997929 953942 1001671 1128999 1151676 1085651 1064540 1104880 1103091 1023115 933461 858795
10439 858795 811972 803360 719598 687596 644201 626041 641098 619624 651588 679855 673044 658021
10427 658021 673831 708123 767349 805068 747298 667754 646293 664052 746341 841775 897616
10416 897616 929020 931113 903632 866181 859306 844962 747056 666809 649598 629343 620189 660971
10404 660971 734474 727636 685922 646062 627098 611534 602348 613724 569228 604964 642730 621559
10392 621559 521482 445095 403370 498791 527948 529464 513477 510043 482817 411635 370472 335469
$$ packed form
10473A919102p1623p4807j10661j32915n9248n4220n1004m0357o1010j373J6047
10462A277931n86k0245n4381l5909p3012o5507l9611j8085N4192r924P829k4763
10450I97929m3987M7729J27328K2677o6025k1111M0340j789p9976q9654p4666
10439H58795m6823q612q3762l2002m3395j8160J5057k1474L1964K8267o811j5023
10427F58021J5810L4292N9226L7719n7770p9544k1461J7759Q2289R5434N5841
10416H97616L1404K093k7481l7451o875j4344r7906q0247j7211k0255r154M0782
10404F60971P3503o838m1714l9860j8964j5564r186J1376m4496L5736L7766k1171
10392F21559j00077p6387m1725R5421K9157J516j5987l434k7226p1182m1163l5003
$$ plain form
10380 335469 346810 339467 327916 347057 329751 350357 410634 372378 398394 420205 436990 414521
10368 414521 425048 444335 414278 404311 409287 419293 394821 396869 335599 331975 359098 421862
10356 421862 410137 383451 354080 404614 400148 326377 298442 300915 349690 355453 364792 368813
10344 368813 388921 400788 392338 313692 262471 223599 245006 272122 306520 300513 312443 323385
10332 323385 366947 411576 391385 359906 340125 352883 348397 364195 302595 210859 265050 275138
10320 275138 235246 210645 239745 290113 306972 309373 239981 230182 196294 146287 176078 204855
10308 204855 200313 199777 215917 234003 251174 244298 270314 289305 245673 222333 261126 333459
10296 333459 352375 360027 321202 292654 269955 322882 297513 325474 364030 407510 456893 447170
$$ packed form
10380C35469J1341p343j1551J9141j7306K0606O0277l8256K6016K1811J6785k2469
10368D14521J0527J9287l0057r967M976J0006k4472K048o1270l624K7123O2764
10356D21862j1725k6686k9371N0534m466p3771k7935K473M8775N763R339M021
10344C68813K0108J1867q450p8646n1221l8872K1407K7116L4398o007J1930J0942
10332C23385M3562M4629k0191l1479j9781J2758m486J5798o1600r1736N4191J0088
10320B75138l9892k4601K9100N0368J6859K401o9392r799l3888n0007K9791K8777
10308B04855m542n36J6140J8086J7171o876K6016J8991m3632k3340L8793P2333
10296C33459J8916P652l8825k8548k2699N2927k5369K7961L8556M3480M9383r723
$$ plain form
10284 447170 397202 361300 448181 518000 580491 619577 609536 665353 725868 786073 929546
10273 929546 1125082 1398447 1574335 1750079 1932563 2013886 2026211 2000105 2005305 1935711 1772452
10262 1772452 1656933 1505834 1419638 1329868 1264498 1245877 1198923 1193509 1202254 1278139 1299978
10251 1299978 1333011 1436334 1558223 1633426 1707903 1744993 1740846 1736289 1729942 1829821 1934489
10240 1934489 2020316 2124193 2187062 2222115 2236061 2178261 2110140 2031659 1949879 1871042 1839053
10229 1839053 1798598 1712372 1649845 1646640 1608545 1564367 1566226 1495099 1398577 1364751 1255022
10218 1255022 1193489 1194943 1191110 1306169 1385608 1442801 1476367 1587724 1714862 1849697 1954281
10207 1954281 2053191 1995039 1854180 1681374 1567147 1474752 1347159 1196321 1110944 997611
$$ packed form
10284D47170m9968l5902Q6881O9819O2491L9086j0041N5817O0515O0205J43473
10273I29546J95536K73365J75888J75744J82484Q1323J2325k6106N200o9594j63259
10262A772452j15519j51099q6196q9770o5370j8621m6954n414Q745P5885K1839
10251A299978L3033J03323J21889P5203P4477L7090m147m557o347R9879J04668
10240A934489Q5827J03877O2869L5053J3946n7800o8121p8481q1780p8837l1989
10229A839053m0455q6226o2527l205l8095m4178J859p1127r6522l3826j09729
10218A255022o1533J454l833J15059P9439N7193L3566J11357J27138J34835J04584
10207A954281R8910n8152j40859j72806j14227r2395j27593j50838q5377j13333
$$ plain form
10197 997611 861584 805941 810584 811565 690623 594964 577389 564978 524688 519173 467549 427317
10185 427317 356514 351845 325838 314473 275643 263691 228242 227671 253533 258948 298870 322086
10173 322086 316780 294217 322839 377375 336411 270499 298638 311546 271163 286513 320358 366718
10161 366718 365902 304440 299782 328927 270106 229087 223606 229946 254896 260792 245333 226290 245431
10148 245431 289554 322604 281887 245514 221778 219520 195591 204191 230112 218405 229755 209322
10136 209322 162382 114251 119345 129599 183621 227976 255814 237509 199464 161120 185575 170333
10124 170333 134985 140515 163395 245603 241631 195348 190768 260840 279938 273366 263921 251606
10112 251606 253649 199463 194289 192299 175083 137030 106439 100791 104181 139825 178296 161977
$$ packed form
10197I97611j36027n5643M643R81j20942r5659j7575j2411m0290n515n1624m0232
10185D27317p0803m669k6007j1365l8830j1952l5449n71K5862N415L9922K3216
10173C22086n306k2563K8622N4536m0964o5912K8139J2908m0383J5350L3845M6360
10161C66718q16o1462m658K9145n8821m1019n481O340K4950N896j5459j9043J9141
10148B45431M4123L3050m0717l6373k3736k258k3929Q600K5921j1707J1350k0433
10136B09322m6940m8131N094J0254N4022M4355K7838j8305l8045l8344K4455j5242
10124A70333l5348N530K2880Q2208l972m6283m580P0072J9098o572r445j2315
10112B51606K043n4186n174j990j7216l8053l0591n648L390L5644L8471j6319
$$ plain form
10100 161977 139048 104683 101741 213327 288352 315399 393651 551723 759787 889177 983604
10089 983604 883277 738759 582886 436368 399449 308163 243959 216009 187524 168130 154458
10078 154458 170891 219352 308090 450631 579987 720496 802411 803706 677474 489942 344081
10067 344081 296922 300394 304567 288224 289925 257090 237435 237239 274586 245124 177861 197112
10055 197112 239556 253161 166933 69852 35235 -2380 -18445 27494 72107 71027 9499 -28987
10043 -28987 19259 89984 105942 66777 65655 64974 68399 69566 47032 53298 76510 93283 46417
10030 46417 83869 117250 131778 121155 111970 114985 111555 169079 203828 179568 164660 180504
10018 180504 161268 149163 126390 70237 20975 46050 103324 112931 118364 120548 121328 117984 64695
$$ packed form
10100A61977k2929l4365k942J11586P5025K7047P8252J58072K08064J29390R4427
10089I83604j00327j44518j55873j46518l6919r1286o4204k7950k8485j9394j3672
10078A54458J6433M8461Q8738J42541J29356J40509Q1915J295j26232j87532j45861
10067C44081m7159L472M173j6343J701l2835j9655j96L7347k9462o7263J9251
10055A97112M2444J3605q6228r7081l4617l7615j6065M5939M4613j080o1528l8486
10043b8987M8246P0725J5958l9165j122o81L425J167k2534O266K3212J6773m6866
10030D6417L7452L3381J4528j0623r185L015l430N7524L4749k4260j4908J5844
10018A80504j9236j2105k2773n6153m9262K5075N7274R607N433K184P80l344n3289
$$ plain form
10005 64695 73874 46334 65019 58380 530 4263 47411 66013 54158 67066 107498 90617
9993 90617 111743 121333 74438 31050 43580 100700 91298 57397 57557 39012 100140 143345 134135
9980 134135 126065 128833 146761 102747 68198 44807 50141 68092 33267 49605 72793 78384
9968 78384 121932 131349 117828 90905 68069 65767 101912 108919 139695 150406 142076 32194
9956 32194 -30603 -64457 -3990 53124 69575 68522 92069 88878 66114 68075 49583 29406
9944 29406 35539 56017 31631 40684 -25640 20952 69899 42971 55574 40287 74597 110461
9932 110461 79511 46840 85376 133469 104687 82553 17672 -16090 -19345 -26831 40784 52473
9920 52473 27625 24387 65487 90487 112186 119440 111912 130802 174687 150704 107322 71072
$$ packed form
10005F4695R179k7540J8685o639n7850L733M3148J8602j1855J2908M0432j6881
9993I0617K1126R590m6895m3388J2530N7120r402l3901J60j8545O1128M3205r210
9980A34135q070K768J7928m4014l4549k3391N334J7951l4825J6338K3188N591
9968G8384M3548R417j3521k6923k2836k302L6145P007L0776J0711q330j09882
9956C2194o2797l3854O0467N7114J6451j053K3547l191k2764J961j8492k0177
9944B9406O133K0478k4386R053o6324M6592M8947k6928J2603j5287L4310L5864
9932A10461l0950l2671L8536M8093k8782k2134o4881l3762l255p486O7615J1689
9920E2473k4848l238M1100K5000K1699P254p528J8890M3885k3983m3382l6250
$$ plain form
9908 71072 120793 126225 64274 35035 25076 63518 56255 54269 142903 200672 161134 158636 185448
9895 185448 242693 273648 288251 302077 329138 303602 242177 223045 217020 219093 207022 243630
9883 243630 264808 299302 352583 371229 350598 325789 355004 377013 432308 525589 640407
9872 640407 757351 987174 1322981 1778190 2478717 3644047 5567869 8336629 11423576
9863 11423576 13522328 13743771 12239544 9850822 7509908 5623666 4246154 3245850
9855 3245850 2560207 2023905 1551608 1218796 1006640 820286 733663 629869 522543 493499
9845 493499 442122 410852 362825 338468 304895 274292 291540 281551 273029 291452 301846 274043
9833 274043 267459 284321 284783 244520 242529 259873 232919 212304 243146 262809 262976 266777 248721
$$ packed form
9908G1072M9721N432o1951k9239r959L8442p263j986Q8634N7769l9538k498K6812
9895A85448N7245L0955J4603J3826K7061k5536o1425j9132o025K073j2071L6608
9883B43630K1178L4494N3281J8646k0631k4809K9215K2009N5295R3281J14818
9872F40407J16944K29823L35807M55209P00527J165330J923822K768760L086947
9863A1423576K098752K21443j504227k388722k340914j886242j377512j000304
9855C245850o85643n36302m72297l32812k12156j86354q6623j03794j07326k9044
9845D93499n1377l1270m8027k4357l3573l0603J7248r989q522J8423J0394k7803
9833B74043o584J6862M62m0263j991J7344k6954k0615L0842J9663J67L801j8056
$$ plain form
9820 248721 305396 275195 244226 192460 180803 179773 133086 169507 218299 235047 204347 209376
9808 209376 246190 243007 191166 243562 262276 268142 296136 258457 219801 271305 349700 396170
9796 396170 376771 345856 354386 405339 368708 337364 339101 383637 402315 439587 465524 415757
9784 415757 399341 506191 594144 657151 784560 913332 1078016 1211996 1401789 1677964
9774 1677964 1971848 2530333 3546890 5144272 7787193 12255436 18515191 23875445 25163091
9765 25163091 22462144 17874964 13369896 9767957 7325051 5684814 4632297 3742922
9757 3742922 2896655 2221796 1749804 1435855 1242544 1111293 953436 821015 734411 695835
9747 695835 610002 535349 485154 427003 424696 420467 485083 503982 502153 459486 418476 434965
$$ packed form
9820B48721N6675l0201l0969n1766j1657j030m6687L6421M8792J6748l0700N029
9808B09376L6814l183n1841N2396J8714N866K7994l7679l8656N1504P8395M6470
9796C96170j9399l0915Q530N0953l6631l1344J737M4536J8678L7272K5937m9767
9784D15757j6416J06850Q7953O3007J27409J28772J64684J33980J89793K76175
9774A677964K93884N58485J016557J597382K642921M468243O259755N360254J287646
9765B5163091k700947m587180m505068l601939k442906j640237j052517q89375
9757C742922q46267o74859m71992l13949j93311j31251j57857j32421q6604l8576
9747F95835q5833p4653n0195n8151k307m229O4616J8899j829m2667m1010J6489
$$ plain form
9735 434965 467723 493740 422229 354347 364912 375410 387241 424451 405592 383500 465970 450199
9723 450199 398032 455902 410114 401886 414384 419737 381451 343090 416159 506135 493786 480130
9711 480130 464199 434754 430194 468100 544536 540388 494274 487380 527530 563448 572528 540912
9699 540912 531863 594661 622889 636096 701194 737173 802959 857914 869053 826040 845214 887095
9687 887095 946644 976414 1001075 1024853 1099659 1141934 1212059 1252970 1338840 1387128 1403515 1532491
9675 1532491 1677274 1709838 1736264 1775841 1883264 2038899 2137567 2194241 2293534 2492752 2724698
9664 2724698 2930496 3120019 3352332 3614021 3853425 4137497 4440625 4807362 5254895 5683748
9654 5683748 6177744 6770131 7433794 8171186 9022950 9926276 10841074 11870234 12891967
$$ packed form
9735D34965L2758K6017p1511o7882J0565J0498J1831L7210j8859k2092Q2470j5771
9723D50199n2167N7870m5788q228J2498N353l8286l8361P3069Q9976j2349j3656
9711D80130j5931k9445m560L7906P6436m148m6114o894M0150L5918R080l1616
9699E40912r049O2798K8228J3207O5098L5979O5786N4955J1139m3013J9174M1881
9687H87095N9549K9770K4661K3778P4806M2275P0125M0911Q5870M8288J6387J28976
9675A532491J44783L2564K6426L9577J07423J55635R8668N6674R9293J99218K31946
9664B724698K05798J89523K32313K61689K39404K84072L03128L66737M47533M28853
9654E683748M93996N92387O63663P37392Q51764R03326R14798J029160J021733
$$ plain form
9645 12891967 13907645 15015998 16126896 17074509 17793879 18333022 18648551 18623107 18373429
9636 18373429 17844108 17105953 16252696 15267539 14266714 13243850 12236259 11304177 10401585
9627 10401585 9551394 8681730 7866272 7233379 6708879 6166337 5660251 5213501 4854628
9618 4854628 4505559 4152422 3874288 3625894 3428842 3208954 2950313 2743765 2625548 2475003
9608 2475003 2268480 2146825 2068156 1985101 1821148 1696505 1589135 1527209 1479719 1445032
9598 1445032 1384985 1347019 1286518 1215190 1162488 1079128 1065719 1073801 1039370 971105 897779 874735
9586 874735 880917 866937 843314 810083 755046 673143 605234 593320 572519 565171 585751 604509
9574 604509 631794 597468 565997 546373 494547 424166 394959 422437 466072 523476 518313 447545
$$ packed form
9645A2891967J015678J108353J110898R47613P19370N39143L15529k5444k49678
9636A8373429n29321p38155q53257r85157j000825j022864j007591r32082r02592
9627A0401585q50191q69664q15458o32893n24500n42542n06086m46750l58873
9618D854628l49069l53137k78134k48394j97052k19888k58641k06548j18217j50545
9608B475003k06523j21655p8669q3055j63953j24643j07370o1926m7490l4687
9598A445032o0047l7966o0501p1328n2702q3360j3409Q082l4431o8265p3326k3044
9586H74735O182j3980k3623l3231n5037q1903o7909j1914k0801p348K0580J8758
9574F04509K7285l4326l1471j9624n1826p0381k9207K7478M3635N7404n163p0768
$$ plain form
9562 447545 444318 413863 399310 364567 319329 305151 290743 347593 418077 467923 410191 339064
9550 339064 303112 333145 332098 297527 326404 313399 237283 197052 204823 236538 264708 306739
9538 306739 304093 274249 273573 246896 265396 281733 223749 196099 160581 148314 174863 180110
9526 180110 188906 190060 223603 204842 177570 114643 143115 204161 184805 162401 205112 214632
9514 214632 195851 200519 177011 134897 170284 217704 192906 162470 157680 142004 140254 128115
9502 128115 142722 152916 164993 164811 154829 121238 79551 80753 115869 165694 171537 163531 109479
9489 109479 109620 76026 95809 88652 51935 115631 156017 111261 137339 179308 186309 175325
9477 175325 204860 199709 185992 123205 70353 75694 47240 67978 103159 127783 127119 138915
$$ packed form
9562D47545l227l0455j4553l4743m5238j4178j4408N6850P0484M9846n7732p1127
9550C39064l5952L0033j047l4571K8877j3005p6116m0231P771L1715K8170M2031
9538C06739k646k9844o76k6677J8500J6337n7984k7650l5518j2267K6549N247
9526A80110Q796J154L3543j8761k7272o2927K8472O1046j9356k2404M2711R520
9514B14632j8781M668k3508m2114L5387M7420k4798l0436m790j5676j750j2139
9502A28115J4607J0194J2077j82r982l3591m1687J202L5116M9825N843q006n4052
9489A09479J41l3594J9783p157l6717O3696M0386m4756K6078M1969P001j0984
9477A75325K9535n151j3717o2787n2852N341k8454K0738L5181K4624o64J1796
$$ plain form
9465 138915 139869 157298 125386 137941 122860 113092 101239 91514 88327 118157 133416 114412 99427
9452 99427 149515 209132 223037 204129 154253 174322 161065 143858 97779 83154 96689 107533
9440 107533 151996 141596 105852 104083 35612 26751 111493 139849 125368 106747 37813 12712
9428 12712 50085 36716 5026 7899 12704 15810 3066 1293 3942 -27074 -20308 14971 2389
9415 2389 29751 34930 19054 -22348 -12001 -47898 -72554 -62250 -21314 13030 39321 76718
9403 76718 51409 9538 26914 65537 71635 7481 -51326 -28117 39597 12229 29794 75869
9391 75869 90605 54171 14056 2852 -1658 74231 88339 47274 74968 40986 -6344 -3948
9379 -3948 -6688 54920 125065 115407 86092 116912 130098 145463 106399 34835 -23347 -29737 -22837
$$ packed form
9465A38915R54J7429l1912J2555j5081r768j1853r725l187K9830J5259j9004j4985
9452I9427N0088N9617J3905j8908m9876K0069j3257j7207m6079j4625J3535J0844
9440A07533M4463j0400l5744j769o8471q861Q4742K8356j4481j8621o8934k5101
9428A2712L7373j3369l1690K873M805L106j2744j773K649l1016O766L5279j2582
9415B389K7362N179j5876m1402J0347l5897k4656J0304M0936L4344K6291L7397
9403G6718k5309m1871J7376L8623O098o4154n8807K3209O7714k7368J7565M6075
9391G5869J4736l6434m0115j1204m510P5889J4108m1065K7694l3982m7330K396
9379c948k740O1608P0145r658k9315L0820J3186J5365l9064p1564n8182o390O900
$$ plain form
9366 -22837 -8787 12001 -2099 -40749 -57695 -37056 -3588 28146 35602 66157 25610 8317
9354 8317 20963 40609 51082 81150 87549 84739 10083 1546 20892 31122 4995 28708 80925
9341 80925 80662 81756 36624 65416 95769 125729 160563 160292 177884 192356 175996 125800 72759
9328 72759 5802 -4332 -28195 -30704 -30961 47704 52183 439 -5868 85389 74414 55789 55922
9315 55922 67830 41340 4648 -7590 30608 57232 56440 41367 6092 16561 -11878 -1043
9303 -1043 14454 -29911 65630 93042 95810 72228 15790 -36636 -43046 14671 36428 -2686
9291 -2686 2266 5540 -4746 -32093 -53036 -17366 15971 33665 32625 25731 4869 7287 -3696
9278 -3696 -6876 2805 33311 32430 53092 98065 152705 87805 36293 -12454 -647 -4207 -30419
$$ packed form
9366b2837J4050K0788j4100l8650j6946K0639L3468L1734P456L0555m0547j7293
9354H317J2646J9646J0473L0068O399k810p4656q537J9346J0230k6127K3713N2217
9341H0925k63J094m5132K8792L0353K9960L4834k71J7592J4472j6360n0196n3041
9328G2759o6957j0134k3863k509k57P8665M479n1744o307R1257j0975j8625J33
9315E5922J1908k6490l6692j2238L8198K6624p92j5073l5275J0469k8439J0835
9303a043J5497m4365R5541K7412K768k3582n6438n2426o410N7717K1757l9114
9291b686M952L274j0286k7347k0943L5670L3337J7694j040o894k0862K418j0983
9278c696l180R681L0506q81K0662M4973N4640o4900n1512m8747J1807l560k6212
$$ plain form
9265 -30419 -70421 1761 64669 75388 26306 47341 63487 31165 -16195 -47417 -21747 -24614
9253 -24614 -62291 -41390 -26319 -10021 36659 34252 26238 26194 21419 14217 -57514 -51081 -51846 -50880
9239 -50880 25957 37164 6087 -17428 -8407 33152 56970 14640 -35003 -5538 60719 73284
9227 73284 66800 54107 2352 16551 13364 -6264 18089 261 -18678 12069 10577 -23108
9215 -23108 -3285 20605 20712 30931 2968 -12636 -24876 -32534 -16527 34146 39431 -7931 -28576
9202 -28576 25740 -16488 -34051 -15655 11401 -4790 16944 69127 16736 -12770 4604 33805
9190 33805 36230 20539 -1403 6024 32302 41088 36982 -1362 -5122 -26198 -15966 5282 8130
9177 8130 -17252 -28686 -58929 -73434 -74521 -62100 -52897 -29225 -77132 -61156 -92 5929 14840
$$ packed form
9265c0419m0002P2182O2908J0719m9082K1035J6146l2322m7360l1222K5670k867
9253b4614l7677K0901J5071J6298M6680k407q014m4m775p202p1731O433p65R66
9239e0880P6837J1207l1077k3515R021M1559K3818m2330m9643K9465O6257J2565
9227G3284o484j2693n1755J4199l187j9628K4353j7828j8939L0747j492l3685
9215b3108J9823K3890J07J0219k7963j5604j2240p658J6007N0673N285m7362k0645
9202b8576N4316m2228j7563J8396K7056j6191K1734N2183n2391k9506J7374K9201
9190C3805K425j5691k1942P427K6278Q786m106l8344l760k1076J0232K1248K848
9177H130k5382j1434l0243j4505j087J2421R203K3672m7907J5976O1064O021Q911
$$ plain form
9164 14840 30439 41692 57016 46084 14127 -41439 -76627 -60018 -4665 36894 -10248 -52593
9152 -52593 -91302 -79662 -60855 -21732 24816 21870 22211 38568 83586 81959 67141 90657 70748
9139 70748 49666 6609 15560 42671 60734 61948 68026 103 27927 68262 109892 119999
9127 119999 131936 83875 22493 -25375 -69736 -76956 -12582 -28947 -4307 -25432 -29081 -47872
9115 -47872 -33966 -33924 -27385 -43377 -88722 -83730 -35886 32435 72745 56514 18165 24800 21370
9102 21370 16977 34610 2713 35371 50052 9532 77713 42093 -13747 -32764 -28424 -56939
9090 -56939 -18535 60581 121706 161070 134368 89516 20065 -74330 -73996 -47364 -12325 -787
9078 -787 -15737 -46351 -29982 -73044 -61831 -62609 -38084 -2844 56446 63996 29400 5398 -4051
$$ packed form
9164A4840J5599J1253J5324j0932l1957n5566l5188J6609N5353M1559m7142m2345
9152e2593l8709J1640J8807L9123M6548k946L41J6357M5018j627j4818K3516j9909
9139G0748k1082m3057Q951K7111J8063J214O078o7923K7824M0335M1630J0107
9127A19999J1937m8061o1382m7868m4361p220O4374j6365K4640k1125l649j8791
9115d7872J3906M2O539j5992m5345M992M7844O8321M0310j6231l8349O635l430
9102B1370m393J7633l1897L2658J4681m0520O8181l5620n5840j9017M340k8515
9090e6939L8404P9116O1125L9364k6702m4852o9451r4395L34K6632L5039J1538
9078g87j4950l0614J6369m3062J1213p78K4525L5240N9290P550l4596k4002r449
$$ plain form
9065 -4051 -14911 -220 20304 900 36545 72992 65741 54586 37010 33896 18547 -19420
9053 -19420 -12766 42817 70986 54589 3369 9646 58317 67355 8745 -35272 -33535 -21942 -42434
9040 -42434 -42359 15099 31480 -2613 23721 36968 1426 -38383 -57860 -50352 6662 53742 52430
9027 52430 77397 62208 116845 126525 102947 93667 50266 -465 -7117 -4974 -55641 -33550 15323
9014 15323 -24551 -46950 -92579 -70672 -45414 -24095 -9614 -26471 -17971 -40592 -14938 -28388
9002 -28388 29828 100927 80626 9928 -40171 -61424 -36614 21183 28053 17559 -7395 2535
8990 2535 -36065 -79135 -54098 -41316 -15607 609 5360 33493 15506 -17939 -41665 -62539
8978 -62539 -56376 -25214 56616 132814 113176 99372 84748 68820 46092 -7987 -42429 -68167
$$ packed form
9065d051j0860J4691K0524j9404L5645L6447p251j1155j7576l114j5349l7967
9053a9420O654N5583K8169j6397n1220O277M8671R038n8610m4017J737J1593k0492
9040d2434P5N7458J6381l4093K6334J3247l5542l9809j9477P508N7014M7080j312
9027E2430K4967j5189N4637R680k3578r280m3401n0731o652K143n0667K2091M8873
9014A5323l9874k2399m5629K1907K5258K1319J4481j6857Q500k2621K5654j3450
9002b8388N8216P1099k0301p0698n0099k1253K4810N7797O870j0494k4954R930
8990B535l8600m3070K5037J2782K5709J6216M751K8133j7987l3445k3726k0874
8978f2539O163L1162Q1830P6198j9638j3804j4624j5928k2728n4079l4442k5738
$$ plain form
8966 -68167 -11199 79149 108023 72564 42249 65179 64849 50999 48510 43215 44668 -4916 -86053
8953 -86053 -71881 -38344 -13223 -17410 3457 -29841 9570 96122 57756 10106 39870 16557
8941 16557 -22312 -1202 30001 28219 58884 47421 59464 18261 19187 13225 -28607 -55104 24551
8928 24551 80059 63839 66168 50104 50964 80942 113357 99331 121238 144738 123954 155143
8916 155143 146677 82039 47416 21725 57733 71660 83411 112329 102767 67244 48768 34346
8904 34346 33939 50953 71859 48998 -25035 -21157 -1105 67896 59788 57428 41859 14810 33880
8891 33880 44974 46603 25243 6688 -18042 -20495 -9517 20636 -30632 -37961 -39634 -49704 -57086
8878 -57086 -29991 -15638 -13416 -32416 -85797 -124926 -79555 -27055 -51665 -60125 -46074 -68021
$$ packed form
8966f8167N6968R0348K8874l5459l0315K2930l30j3850k489n295J453m9584q1137
8953h6053J4172L3537K5121m187K0867l3298L9411Q6552l8366m7650K9764k3313
8941A6557l8869K1110L1203j782L0665j1463J2043m1203R26n962m1832k6497P9655
8928B4551N5508j6220K329j6064Q60K9978L2415j4026K1907K3500k0784L1189
8916A55143q466o4638l4623k5691L6008J3927J1751K8918r562l5523j8476j4422
8904C4346m07J7014K0906k2861p4033L878K0052O9001q108k360j5569k7049J9070
8891C3880J1094J629k1360j8555k4730k453J0978L0153n1268p329j673j0070p382
8878e7086K7095J4353K222j9000n3381l9129M5371N2500k4610q460J4051k1947
$$ plain form
8866 -68021 -100592 -90661 -88280 -54863 14696 53304 9916 10685 7223 -43312 -37826 -1700 11590
8853 11590 36743 35797 21396 51341 73347 45983 31585 24549 -17391 13175 52975 85872
8841 85872 92193 26116 -31133 -77059 -86167 -47272 -53030 -23713 -11693 -45547 -3508 38032
8829 38032 11207 -1909 4096 18807 -30331 45313 137669 180113 202132 240348 178070 78096
8817 78096 50293 35712 5252 -10422 -2932 -4115 -26221 -41840 -86596 -144313 -221715 -192592
8805 -192592 -132367 -90738 -62757 -62367 -126436 -97032 -56207 -46047 -58532 -70727 -79914 -74617
8793 -74617 -89108 -83225 -46125 -47453 -77261 -122082 -134849 -134543 -165992 -112358 -54037 -8000 1946
8780 1946 724 1283 -13437 -10178 35218 52561 50488 -15995 -52156 -88797 -106116 -70912 -23651
$$ packed form
8866f8021l2571R931K381L3417O9559L8608m3388P69l462n0535N486L6126J3290
8853A1590K5153r46j4401K9945K2006k7364j4398p036m1940L0566L9800L2897
8841H5872O321o6077n7249m5926r108L8895n758K9317J2020l3854M2039M1540
8829C8032k6825j3116O005J4711m9138P5644R2356M2444K2019L8216o2278r9974
8817G8096k7803j4581l0460j5674P490j183k2106j5619m4756n7717p7402K9123
8805a92592O0225M1629K7981L90o4069K9404M0825J0160j2485j2195r187N297
8793g4617j4491N883L7100j328k9808m4821j2767L06l1449N3634N8321M6037R946
8780A946j222N59j4720L259M5396J7343k073o6483l6161l6641j7319L5204M7261
$$ plain form
8767 -23651 -843 -12044 9476 38566 28234 21872 14814 -1409 -20834 -22996 31349 61197
8755 61197 60684 45877 28582 30608 71071 90372 59018 49867 71573 55173 -16881 15513 50764
8742 50764 11692 -34591 -65527 -90560 -63919 -37375 -76621 -75751 -85526 -39022 -715 -12411
8730 -12411 -12896 27272 -2606 -49540 28086 26793 2866 -30049 -69815 -97552 -35559 -14051
8718 -14051 -8021 13596 38028 -45013 -33030 -68769 -108499 -60584 36425 47315 34307 32674
8706 32674 41963 47310 34457 -19632 -88362 -74638 -60562 -46480 -27243 -26310 48654 154894
8694 154894 129709 23385 -51999 -3729 46791 38777 -22923 -33639 -36438 -29861 -30041 -24815 -4372
8681 -4372 15655 -5102 -30179 -24113 -73827 -60011 -30382 -5898 -30342 -22940 6263 -21906
$$ packed form
8767b3651K2808j1201K1520K9090j0332o362p058j6223j9425k162N4345K9848
8755F1197n13j4807j7295K026M0463J9301l1354r151K1706j6400p2054L2394L5251
8742E0764l9072m6283l0936k5033K6641K6544l9246Q70r775M6504L8307j1696
8730a2411m85M0168k9878m6934P7626j293k3927l2915l9766k7737O1993K1508
8718a4051O030K1617K4432q3041J1983l5739l9730M7915R7009J0890j3008j633
8706C2674R289N347j2853n4089o8730J3724J4076J4082J9237R33P4964J06240
8694A54894k5185j06324p5384M8270N0520q014o1700j0716k799O577j80N226K0443
8681d372K0027k0757k5077O066m9714J3816K9629K4484k4444P402K9203k8169
$$ plain form
8669 -21906 -49391 -50559 2129 36457 -1911 -12632 -14328 -57858 -32495 65340 91609 88855
8657 88855 114757 134451 122318 107169 74715 63348 72944 92239 102148 92304 81244 76586 64699
8644 64699 99671 103241 154940 180482 155705 84200 87417 82805 59106 50466 44264 10157 -34144
8631 -34144 -53673 -73190 -104467 -89660 -11326 106912 136407 146312 178678 209135 187313 162450
8619 162450 139689 116195 126956 131122 140632 134866 107321 89800 116202 130535 107523 91483
8607 91483 80223 32467 -17187 -27698 -10516 33369 35187 53292 95213 64834 930 -25867
8595 -25867 -19976 1266 84362 149976 140090 124400 48933 24525 1531 -18903 21167 40768
8583 40768 60535 128451 114935 116614 103860 122570 79042 75639 142287 152622 135117 125193
$$ packed form
8669b1906k7485j168N2688L4328l8368j0721j696m3530K5363R7835K6269k754
8657H8855K5902J9694j2133j5149l2454j1367R596J9295R909r844j1060m658j1887
8644F4699L4972L570N1699K5542k4777p1505L217m612k3699q640o202l4107m4301
8631c4144j9529j9517l1277J4807P8334J18238K9495R905L2366L0457k1822k4863
8619A62450k2761k3494J0761M166R510n766k7545j7521K6402J4333k3012j6040
8607I1483j1260m7756m9654j0511J7182M3885J818J8105M1921l0379o3904k6797
8595b5867N891K1242Q3096O5614r886j5690p5467k4408k2994k0434M0070J9601
8583D0768J9767O7916j3516J679j2754J8710m3528l403O6648J0335j7505r924
$$ plain form
8571 125193 77016 61070 76389 96000 114443 105215 122562 137863 125022 83559 74721 87619
8559 87619 111788 74529 53132 63381 23499 4552 -1905 -11943 -13062 37367 -35928 -69226
8547 -69226 -111988 -74371 -36295 -19022 -36482 -6246 34573 44907 -33383 -1623 24897 14708
8535 14708 43500 23207 29031 10856 9871 6516 77381 71085 536 -48774 -24816 -30726 -30383
8522 -30383 -25566 -8757 -16592 28886 28251 13910 -36062 -9161 61405 83165 65088 5709 -34359
8509 -34359 -23935 9247 -4518 -30465 -51358 -21841 34633 20105 -29437 -5982 9963 51620
8497 51620 53871 59609 86461 85384 42842 52845 129002 181630 193473 235579 247634 255526 281782
8484 281782 301326 202609 88110 66928 89517 88086 -7510 -16523 11339 -14634 -33121 -15399
$$ packed form
8571A25193m8177j5946J5319J9611J8443r228J7347J5301j2841m1463q838J2898
8559H7619K4169l7259k1397J0249l9882j8947o457j0038j119N0429p3295l3298
8547f9226m2762L7617L8076J7273j7460L0236M0819J0334p8290L1760K6520j0189
8535A4708K8792k0293N824j8175r85l355P0865o296p0549m9310K3958n910L43
8522c0383M817J6809p835M5478o35j4341m9972K6901P0566K1760j8077n9379m0068
8509c4359J0424L3182j3765k5947k0893K9517N6474j4528m9542K3455J5945M1657
8497E1620K251N738K6852j077m2542J0003P6157N2628J1843M2106J2055P892K6256
8484B81782J9544r8717j14499k1182K2589j431r5596r013K7862k5973j8487J7722
$$ plain form
8472 -15399 22393 33016 28029 17413 14960 46383 70273 49998 30356 9007 9020 6476 -36076
8459 -36076 16380 81571 79271 51068 47193 40524 82853 92284 35756 82908 134274 169684 212016
8446 212016 210065 238259 264272 232895 117949 35656 41330 98400 89055 50822 62054 91273
8434 91273 136895 154537 101816 57855 58762 82671 45663 -4008 -8433 -13777 6308 30149 22834
8421 22834 8756 17402 8138 -17941 -22377 43516 52274 634 7788 40385 -2451 -43714 -7054
8408 -7054 5621 -6597 14879 26855 31663 29349 -1674 6996 58516 25434 -4579 -2682 32245
8395 32245 50250 64251 61814 81691 98985 8360 22163 40469 16168 -41497 -75641 -99474
8383 -99474 -134528 -128897 -130469 -103965 -139618 -167050 -152231 -104512 -57438 -46074 -91564 -156304
$$ packed form
8472a5399L7792J0623m987j0616k453L1423K3890k0275j9642k1349J3k544m2552
8459c6076N2456O5191k300k8203l875o669M2329R431n6528M7152N1366L5410M2332
8446B12016j951K8194K6013l1377j14946q2293N674N7070r345l8233J1232K9219
8434I1273M5622J7642n2721m3961R07K3909l7008m9671m425n344K0085K3841p315
8421B2834j4078Q646r264k6079m436O5893Q758n1640P154L2597m2836m1263L6660
8408g054J2675j2218K1476J1976M808k314l1023Q670N1520l3082l0013J897L4927
8395C2245J8005J4001k437J9877J7294r0625J3803J8306k4301n7665l4144k3833
8383i9474l5054N631j572K6504l5653k7432J4819M7719M7074J1364m5490o4740
$$ plain form
8371 -156304 -80713 -11721 18634 53894 87675 65283 58040 26654 21265 4794 -15314 -12257
8359 -12257 -66915 -78070 -46313 -49110 -89481 -18911 60064 25047 10599 -34118 -78683 -112482
8347 -112482 -104484 -70114 -46182 -54728 -47421 -15506 591 -18307 4144 6882 32291 37590 18338
8334 18338 -39947 -67889 20960 62674 -4975 -53041 -56345 -885 4743 10529 -19964 -43664
8322 -43664 -18376 41623 31721 24949 15121 22215 -7259 -32049 10930 57765 79198 61642 21818
8309 21818 -35050 39448 9435 49628 45130 18186 -58783 -57061 16251 38982 1696 -33675
8297 -33675 -19595 13965 49401 36040 75800 75720 -7458 14393 -8645 -25725 -47848 -120127
8285 -120127 -130540 -146380 -159769 -93294 -61681 -23990 -3118 -38332 -20297 92 19997 63027
$$ packed form
8371a56304P5591O8992L0355L5260L3781k2392p243l1386n389j6471k0108L057
8359a2257n4658j1155L1757k797m0371P0570P8975l5017j4448m4717m4565l3799
8347a12482P998L4370K3932q546P307L1915J6097j8898K2451K738K5409N299j9252
8334A8338n8285k7942Q8849M1714o7649m8066l304N5460N628N786l0493k3700
8322d3664K5288N9999r902o772r828P094k9474k4790M2979M6835K1433j7556l9824
8309B1818n6868P4498l0013M0193m498k6944p6969J722P3312K2731l7286l5371
8297c3675J4080L3560L5436j3361L9760q0q3178K1851k3038j7080k2123p2279
8285a20127j0413j5840j3389O6475L1613L7691K0872l5214J8035K0389J9905M3030
$$ plain form
8273 63027 138363 121791 67115 8045 -33021 -14288 27051 35176 28384 22557 -30194 -31531 4668
8260 4668 27267 34480 50274 62152 98003 101182 50328 -15368 -27694 -44244 -96299 -99194 -97380
8247 -97380 6177 1458 -19837 471 8089 -16771 -3171 28110 25052 -36108 -75721 -82703
8235 -82703 -66009 -28330 -11825 -92569 -92229 -47380 -7838 4200 -45853 -7770 36291 -22494
8223 -22494 -51864 -62099 -73089 -37355 -13849 -4233 10312 1316 39528 81846 90878 46405
8211 46405 -2389 -1254 -4895 4703 -363 18734 23336 12100 -23425 -10752 27304 57092 54809
8198 54809 13513 -33800 -22910 19412 6710 -52683 -58661 -48283 -626 13943 17668 23142
8186 23142 23681 8556 4574 -17287 -19498 -8982 34654 -16929 427 -2628 46542 76346 46164
$$ packed form
8273F3027P5336j6572n4676n9070m1066J8733M1339Q125o792n827n2751j337L6199
8260D668K2599P213J5794J1878L5851L179n0854o5696j2326j6550n2055k895J814
8247i7380J03557m719k1295K0308P618k4860J3600L1281l058o1160l9613o982
8235h2703J6694L7679J6505q0744L40M4849L9542J2038n0053L8083M4061n8785
8223b2494k9370j0235j0990L5734K3506R616J4545q996L8212M2318R032m4473
8211D6405m8794J135l641R598n066J9097M602j1236l5525J2673L8056K9788k283
8198E4809m1296m7313J0890M2322j2702n9393n978J0378M7657J4569L725N474
8186B3142N39j5125l982k1861k211J0516M3636n1583J7356l055M9170K9804l0182
$$ plain form
8173 46164 44190 121580 76189 6172 8298 -5685 3564 -10969 -85878 -76861 -32449 -62289 -75388
8160 -75388 -114685 -93861 -4003 56271 77634 36584 48399 42357 -335 -15455 -48029 -81960
8148 -81960 -110383 -57755 39024 26311 -12376 -40492 -4495 -17167 -57766 -49171 -76037 -89130
8136 -89130 -110113 -158704 -150549 -99797 -41315 -3032 41913 43470 26324 11710 7975 -19672
8124 -19672 -64020 -79717 -36686 -20666 -38452 -43490 -60610 -47537 -76545 -74258 -62058 -24744
8112 -24744 -13127 21555 50804 16050 16420 48754 24069 -63462 -94455 -106671 -24983 -4959
8100 -4959 -23954 -20966 -16485 1503 -18823 -41783 -48484 -62060 -57286 -16534 66238 47087 -61233
8087 -61233 -67328 -9417 -5921 16105 19247 58212 64897 -7191 -58405 -59717 -16168 54538 88567
$$ packed form
8173D6164j974P7390m5391p0017K126j3983R249j4533p4909R017M4412k9840j3099
8160g5388l9297K0824Q9858O0274K1363m1050J1815o042m2692j5120l2574l3931
8148h1960k8423N2628R6779j2713l8687k8116L5997j2672m0599Q595k6866j3093
8136h9130k0983m8591Q155N0752N8482L8283M4945J557j7146j4614l735k7647
8124a9672m4348j5697M3031J6020j7786n038j7120J3073k9008K287J2200L7314
8112b4744J1617L4682K9249l4754L70L2334k4685q7531l0993j2216Q1688K0024
8100d959j8995K988M481J7988k0326k2960o701j3576M774M0752Q2772j9151j08320
8087f1233o095N7911L496K2026L142L8965O685p2088n1214j312M3549P0706L4029
$$ plain form
8074 88567 83257 93731 23831 -60825 -57968 -22299 4074 -34009 -19706 -19725 -32973 -54164 -43616
8061 -43616 29631 135584 131429 67195 50060 13206 -11500 -14217 -45071 -42785 -8517 -15958
8049 -15958 -68858 -49234 -25407 -60918 -53524 -80290 -72908 28592 69981 38417 29366 -11409
8037 -11409 -30354 -30593 -42762 -24991 -3277 -15029 -13071 42223 51199 2152 -82526 -42389 -18424
8024 -18424 -37341 -43276 -101139 -91687 -26104 -5051 -8123 17756 49819 38746 51393 59918 19521
8011 19521 30351 -9398 -50033 -21785 -4040 -18278 -1887 66382 82410 69094 99475 56730
7999 56730 47340 24422 66478 74439 74422 69518 64012 85450 73754 23537 -32508 -22221 -18429
7986 -18429 -14644 -16951 2106 6271 19825 23678 71576 62900 36910 7219 -29113 9326 40665
$$ packed form
8074H8567n310J0474o9900q4656K857L5669K6373l8083J4303j9j3248k1191J0548
8061d3616P3247J05953m155o4234j7135l6854k4706k717l0854K286L4268p441
8049a5958n2900J9624K3827l5511P394k6766P382J01500M1389l1564r051m0775
8037a1409j8945k39j2169J7771K1714j1752J958N5294Q976m9047q4678M0137K3965
8024a8424j8917n935n7863R452O5583K1053l072K5879L2063j1073J2647Q525m0397
8011A9521J0830l9749m0635K8248J7745j4238J6391O8269J6028j3316L0381m2745
7999E6730r390k2918M2056P961j7m904n506K1438j1696n0217n6045J0287L792
7986a8429L785k307J9057M165J3554L853M7898q676k5990k9691l6332L8439L1339
$$ plain form
7973 40665 64623 1095 -58060 4168 71605 112457 158664 122671 132289 178762 126546 106158
7961 106158 86233 67679 99543 132683 95015 103528 92552 82968 81172 103676 119604 123281
7949 123281 123779 90048 66760 68399 91405 86866 24667 -16270 -53041 -12889 10095 67554
7937 67554 142121 106557 79048 64047 60450 64185 60413 102725 166709 199752 154068 98049
7925 98049 103548 83526 94180 61201 40722 44504 5275 56342 35889 -27438 -24958 -5729
7913 -5729 32869 18480 23123 94530 73800 47141 17498 -3510 2322 -20225 -244 54618
7901 54618 93438 24335 -27779 -21524 -10077 11225 10998 30970 -7984 9686 43255 83086
7889 83086 100657 89693 83020 115532 155670 138345 83022 55016 75254 67921 43062 21257
$$ packed form
7973D0665K3958o3528n9155O2228O7437M0852M6207l5993R618M6473n2216k0388
7961A06158j9925j8554L1864L3140l7668Q513j0976r584j796K2504J5928L677
7949A23281M98l3731k3288J639K3006m539o2199m0937l6771M0152K2984N7459
7937F7554P4567l5564k7509j5001l597L735l772M2312O3984L3043m5684n6019
7925I8049N499k0022J0654l2979k0479L782l9229N1067k0453o3327K480J9229
7913e729L8598j4389M643P1407k0730k6659k9643k1008N832k2547J9981N4862
7901E4618L8820o9103n2114O255J1447K1302k27J9972l8954J7670L3569L9831
7889H3086J7571j0964o673L2512M0138j7325n5323k8006K0238p333k4859k1805
$$ plain form
7877 21257 62352 89822 47767 -11349 23521 -1791 -8579 19728 39869 59356 65559 57378
7865 57378 80794 92908 55565 53882 104691 84397 119540 139605 93210 93932 74572 32574
7853 32574 48298 57333 62177 30065 -6215 -24868 1097 15637 10718 -3528 36584 35279 -27328
7840 -27328 -42233 -1677 13888 10705 24993 45964 46412 9652 -9752 -6462 -52289 -91455 -93855
7827 -93855 -26903 12306 -9462 -8221 -36112 -89746 -45100 -17730 -70899 -34809 -24084 -43868
7815 -43868 -70541 -38884 -54753 -34780 25775 -6029 -14564 -10047 7377 27296 104 -13006
7803 -13006 -16541 -21923 -8807 -17728 -59463 -30290 48205 27626 8980 12878 25790 54296 54760
7790 54760 46097 -46518 -54878 41710 4927 -26992 -38709 -35960 -77633 -115203 -69668 -2259
$$ packed form
7877B1257M1095K7470m2055n9116L4870k5312o788K8307K0141J9487O203q181
7865E7378K3416J2114l7343j683N0809k0294L5143K0065m6395P22j9360m1998
7853C2574J5724R035M844l2112l6280j8653K5965J4540m919j4246M0112j305o2607
7840b7328j4905M0556J5565l183J4288K0971M48l6760j9404L290m5827l9166k400
7827i3855O6952L9209k1768J241k7891n3634M4646K7370n3169L6090J0725j9784
7815d3868k6673L1657j5869J9973O0555l1804q535M517J7424J9919k7192j3110
7803a3006l535n382J3116q921m1735K9173P8495k0579j8646L898J2912K8506M64
7790E4760q663r2615q360R6588l6783l1919j1717K749m1673l7570M5535O7409
$$ plain form
7778 -2259 -3616 2989 23804 8188 22313 12359 -9256 -45770 -37715 -1518 41414 35499 -13727
7765 -13727 -64737 -84785 -116238 -139792 -68972 25050 52901 16709 29254 39458 -1546 -72269
7753 -72269 -63761 -36850 -33120 21743 81349 78411 34250 -2224 5943 46309 63198 79447 -22613
7740 -22613 -109760 -86349 -54575 -18775 -4972 11232 27008 17337 -12701 -54067 -45867 -37308
7728 -37308 -47061 -57812 -54597 -88505 -70084 30297 20122 -41100 -63796 -30306 -14744 -85496
7716 -85496 -101520 -63935 -31963 -27189 21427 64515 56196 45436 11525 15914 64969 35193
7704 35193 1385 -35060 -45530 -28115 -17596 -29464 -3475 33097 -25744 -62036 -73201 -51625
7692 -51625 -45896 -13850 25786 -1620 -21033 -51606 -71748 -51202 -44668 -39964 -68730 -96720
$$ packed form
7778b259j357O605K0815j5616J4125r954k1615l6514Q055L6197M2932n915m9226
7765a3727n1010k0048l1453k3554P0820R4022K7851l6192J2545J0204m1004p0723
7753g2269Q508K6911L730N4863N9606k938m4161l6474Q167M0366J6889J6249j02060
7740b2613q7147K3411L1774L5800J3803J6204J5776r671l0038m1366Q200Q559
7728c7308r753j0751L215l3908J8421J00381j0175o1222k2696L3490J5562p0752
7716h5496j6024L7585L1972M774M8616M3088q319j0760l3911M389M9055k9776
7704C5193l3808l6445j0470J7415J0519j1868K5989L6572n8841l6292j1165K1576
7692e1625N729L2046L9636k7406j9413l0573k0142K0546O534M704k8766k7990
$$ plain form
7680 -96720 -74451 -62759 1811 43908 9259 -13388 -73597 -56765 -30780 57388 40036 -44834
7668 -44834 -91878 -118710 -98952 -72130 -68679 -50375 11318 43843 70768 55110 86613 166943
7656 166943 120656 32362 39020 41970 40896 55640 69990 47549 59403 44025 2265 -22324
7644 -22324 -24055 -55406 -48578 -100036 -166058 -182401 -109199 -73925 -103805 -46498 -55634 -112169
7632 -112169 -138122 -121883 -96176 -90069 -89262 -82922 -82078 4123 -3788 59257 36695 -36200 -44209
7619 -44209 -43927 -65379 -28708 -17141 -9867 -8032 -30009 -54329 -63695 -58155 -47359 13345 -16978
7606 -16978 -66784 -75302 -68199 -21816 5446 -49913 -82206 -95646 -54581 -35311 -44705 -19277
7594 -19277 -9909 -11170 -7196 23834 29600 -2706 -15489 -1991 2489 -33975 5908 8424 5240
$$ packed form
7680i6720K2269J1692O4570M2097l4649k2647o0209J6832K5985Q8168j7352q4870
7668d4834m7044k6832J9758K6822L451J8304O1693L2525K6925j5658L1503Q0330
7656A66943m6287q8294O658K950j074J4744J4350k2441J1854j5378m1760k4589
7644b2324j731l1351O828n1458o6022j6343P3202L5274k9880N7307r136n6535
7632a12169k5953J6239K5707O107Q07O340Q44Q6201p911O3045k2562p2895q009
7619d4209K82k1452L6671J1567P274J835k1977k4320r366N540J0796O0704l0323
7606a6978m9806q518P103M6383K7262n5359l2293j3440M1065J9270r394K5428
7594a9277R368j261L974L1030N766l2306j2783J3498M480l6464L9883K516l184
$$ plain form
7581 5240 15750 83542 82622 54035 71518 56904 26134 -20323 -48275 -50228 -33525 -91532 -74861
7568 -74861 -21170 15858 23413 -1718 -29345 -9596 42167 61525 33462 -8709 49 23472
7556 23472 62503 73264 77439 37450 14145 26959 37256 -30973 -78455 -73685 -44052 -7374
7544 -7374 36848 22425 31460 -8547 -69058 -113883 -66218 -31838 -13812 -3869 -20576 -73200
7532 -73200 -118300 -143891 -107434 -49404 6378 -45395 -96464 -94700 -61494 -39497 -3765 34711
7520 34711 57098 26319 50605 48147 -903 -57503 -103172 -101801 -99803 -63786 -39049 -25506
7508 -25506 8498 33281 69319 43200 35470 -44869 -109453 -111345 -98400 -120641 -169033 -182147
7496 -182147 -115102 -4163 51776 50244 24903 -13288 -53750 -24971 -19351 -19270 -1808 4973 11732
$$ packed form
7581E240J0510O7792r20k8587J7483j4614l0770m6457k7952j953J6703n8007J6671
7568g4861N3691L7028P555k5131k7627J9749N1763J9358k8063m2171Q758K3423
7556B3472L9031J0761M175l9989k3305J2814J0297o8229m7482M770K9633L6678
7544g374M4222j4423R035m0007o0511m4825M7665L4380J8026R943j6707n2624
7532g3200m5100k5591L6457N8030N5782n1773n1069J764L3206K1997L5732L8476
7520C4711K2387l0779K4286k458m9050n6600m5669J371J998L6017K4737J3543
7508b5506L4004K4783L6038k6119p730q0339o4584j892J2945k2241m8392j3114
7496a82147O7045J10939N5939j532k5341l8191m0462K8779N620Q1J7462O781O759
$$ plain form
7483 11732 -18421 -18923 18624 11983 -5161 2472 1828 -25035 -38309 -27599 -14192 13740 -1392
7470 -1392 -7338 18736 53785 25361 16547 15228 39727 37819 67460 14546 -28000 -3958 75740
7457 75740 76246 67530 41591 14121 -10457 -37758 -13376 -60438 -66044 -53915 -76955 -64331 -61520
7444 -61520 -77862 -90464 -21226 30018 31760 26521 19457 22748 2305 -21174 -9530 5353 30782
7431 30782 -15595 -37225 -9147 19624 -29113 -45371 -41378 -27961 8581 26328 16333 59414
7419 59414 32885 37399 34841 44300 91995 125768 123348 88201 82978 80236 46674 44427 48873
7406 48873 50105 31402 -17958 -77699 -62278 11002 2420 15006 47604 62683 45282 33483
7394 33483 13928 -8231 -34827 -13923 -17470 19232 55426 52475 35638 4623 -18210 -35386
$$ packed form
7483A1732l0153n02L7547o641j7144P633o44k6863j3274J0710J3407K7932j5132
7470a392n946K6074L5049k8424q814j319K4499j908K9641n2914m2546K4042P9698
7457G5740N06q716k5939k7470k4578k7301K4382m7062n606J2129k3040J2624K811
7444f1520j6342j2602O9238N1244J742n239p064L291k0443k3479J1644J4883K5429
7431C0782m6377k1630K8078K8771m8737j6258L993J3417L6542J7747r995M3081
7419E9414k6529M514k558R459M7695L3773k420l5147n223k742l3562k247M446
7406D8873J232j8703m9360n9741J5421P3280q582J2586L2598J5079j7401j1799
7394C3483j9555k2159k6596K0904l547L6702L6194k951j6837l1015k2833j7176
$$ plain form
7382 -35386 -49342 -53752 -35880 -12696 -7066 -20581 -54612 -41601 -21299 -31034 -66169 6434
7370 6434 7223 -55093 -99586 -90453 -99300 -103443 -55840 -33405 -25572 11276 65610 24460 -20537
7357 -20537 -35403 -21997 3888 23936 29150 14741 42392 45425 34295 27120 640 -11612
7345 -11612 -14796 -18443 -30620 -10801 -10119 -38520 -62977 -88985 -120317 -106400 -102452 -65134 -68279
7332 -68279 -104373 -80016 -69886 -17210 27425 104135 77757 57074 14296 -31003 -63469 -27902
7320 -27902 -20909 -6959 -9740 5324 9258 10329 -19785 -36293 -55492 -30779 37907 70176 41194
7307 41194 55306 61427 56472 20065 -22541 -34668 -8823 45801 17742 -41878 -21945 24387
7295 24387 -15243 -26529 -6485 9267 20385 34631 20547 -4280 -32516 -68489 -78790 -81627
$$ packed form
7382c5386j3956m410J7872K3184N630j3515l4031J3011K0302r735l5135P2603
7370F434P89o2316m4493R133q847m143M7603K2435P833L6848N4334m1150m4997
7357b0537j4866J3406K5885K0048N214j4409K7651L033j1130p175k6480j2252
7345a1612l184l647j2177J9819O82k8401k4457k6008l1332J3917L948L7318l145
7332f8279l6094K4357J0130N2676M4635P6710k6378k0683m2778m5299l2466L5567
7320b7902O993J3950k781J5064L934J071l0114j6508j9199K4713O8686L2269k8982
7307D1194J4112O121m955l6407m2606j2127K5845N4624k8059n9620J9933M6332
7295B4387l9630j1286K0044J5752J1118J4246j4084k4827k8236l5973j0301k837
$$ plain form
7283 -81627 -63846 -128298 -177186 -187254 -127857 -78092 -34510 -40478 -129076 -104214 -58860 -20925
7271 -20925 3564 43474 47196 36689 -27073 -66445 -85397 -35086 -5702 3215 -32688 -26148
7259 -26148 -12014 -61382 -41132 -6329 -1364 -9029 -27302 -38065 -7773 32793 46524 50239
7247 50239 97288 79690 71045 47983 -3711 -63691 -67728 -72379 -13674 21991 -7310 -10140 -31647
7234 -31647 8566 26284 -3298 -15022 -68512 -30513 6008 -24781 -47732 -74314 -70409 -92270
7222 -92270 -127719 -140531 -90134 -43447 -64123 -92983 -51823 14486 26611 2900 -21495 -24867
7210 -24867 -37406 -56173 -32506 70127 84673 30698 -15352 -43936 672 20315 11356 54544
7198 54544 3174 -44864 -20275 -60915 -108764 -122470 -37764 27862 58938 3173 -84532 -64435
$$ packed form
7283h1627J7781o4452m8888j0068N9397M9765M3582n968q8598K4862M5354L7935
7271b0925K4489L9910L722j0507o3762l9372j8952N0311K9384Q917l5903O540
7259b6148J4134m9368K0250L4803M965p665j8273j0763L0292M0566J3731L715
7247E0239M7049j7598q645k3062n1694n9980m037m651N8705L5665k9301k830k1507
7234c1647M0213J7718k9582j1724n3490L7999L6521l0789k2951k6582L905k1861
7222i2270l5449j2812N0397M6687k0676k8860M1160O6309J2125k3711k4395l372
7210b4867j2539j8767K3667J02633J4546n3975m6050k8584M4608J9643q959M3188
7198E4544n1370m8038K4589m0640m7849j3706Q4706O5626L1076n5765q7705K0097
$$ plain form
7186 -64435 -2957 358 16625 8864 15157 22378 5573 -25796 -55513 -98977 -106086 -51771 -14109
7173 -14109 9282 29724 23569 -13705 11405 62240 32260 -9632 -20302 8158 43067 45363
7161 45363 35005 56802 73265 78525 14674 -59466 -36484 -26350 -50367 -80187 -77584 -40814
7149 -40814 -52559 -17207 34966 60086 42731 52668 53026 -14599 -33599 -80797 -30042 2737
7137 2737 -57491 -68438 -24773 12563 43875 -7782 -32926 -35110 2701 -6017 18569 24144 17894
$$ packed form
7186f4435O1478L315J6267p761O293P221j6805l1369k9717m3464p109N4315L7662
7173a4109K3391K0442o155l7274K5110N0835k9980m1892j0670K8460L4909K296
7161D5363j0358K1797J6463N260o3851p4140K2982J0134k4017k9820K603L6770
7149d0814j1745L5352N2173K5120j7355R937L58o7625j9000m7198N0755L2779
7137B737o0228j0947M3665L7336L1312n1657k5144k184L7811q718K4586N575o250
$$ [...]
##END NTUPLES=NMR SPECTRUM
##END=
