##TITLE=Analysis number 308001
Compound Code cc 42025
Book Reference 437/8
Project Code adrs
Chemist Name wendyb
##JCAMPDX= 6.0         $$ Bruker NMR JCAMP-DX V2.0
##DATA TYPE= NMR SPECTRUM
##DATA CLASS= NTUPLES
##ORIGIN= Bruker BioSpin GmbH
##OWNER= NMR
$$ XWIN-NMR		Version 3.5
$$ Wed May 18 15:56:58 2005 GMT Daylight Time (UT+1h)  MAYBRIDGE\NMR@NMR_250MHZ
##.OBSERVE FREQUENCY= 250.131544655141
##.OBSERVE NUCLEUS= ^1H
##.ACQUISITION MODE= SIMULTANEOUS (DQD)
##.ACQUISITION SCHEME= undefined
##.AVERAGES= 16
##.DIGITISER RES= 18
##SPECTROMETER/DATA SYSTEM= dpx250
##.PULSE SEQUENCE= zg30
##.SOLVENT NAME= CDCl3
##.SHIFT REFERENCE= (INTERNAL, CDCl3, 0, 16.522)
##AUDIT TRAIL= $$ (NUMBER, WHEN, WHO, WHERE, WHAT)
$$ ##TITLE= Audit trail, XWIN-NMR		Version 3.5
$$ ##JCAMPDX= 5.01
$$ ##ORIGIN= Bruker BioSpin GmbH
$$ ##OWNER= NMR
$$ C:\u/data/dgb/nmr/ADRS/3130/pdata/1/auditp.txt
$$ ##AUDIT TRAIL=  $$ (NUMBER, WHEN, WHO, WHERE, WHAT)
(   1,<2005-05-18 15:56:38.20 +100>,<MAYBRIDGE\NMR>,<NMR_250MHZ>,
      <created by zg, POWCHK disabled, PULCHK disabled
       configuration hash MD5:
       62 19 C7 07 E1 42 D1 B7 37 6C 3D D0 77 39 F9 E6
       data hash MD5: 64K
       CC A5 D8 47 EC 2E EE 77 AE BF 42 AC 0F 2A A7 0D>)
(   2,<2005-05-18 15:56:49.73 +100>,<MAYBRIDGE\NMR>,<NMR_250MHZ>,
      <Start of raw data processing
       ef LB = 0.3 FT_mod = 6 PKNL = 1 SI = 32K 
       data hash MD5: 32K
       2D BA 88 A0 96 DA 17 D8 E2 C1 86 D5 5E 08 FB 9B>)
(   3,<2005-05-18 15:56:51.68 +100>,<MAYBRIDGE\NMR>,<NMR_250MHZ>,
      <apk 
       data hash MD5: 32K
       4F C2 D9 8B 8D 14 A4 24 CD CC 2E 6C CD 75 F9 E5>)
(   4,<2005-05-18 15:56:52.42 +100>,<MAYBRIDGE\NMR>,<NMR_250MHZ>,
      <abs ABSG = 5 
       data hash MD5: 32K
       AD 07 D7 CE 6C 55 95 30 12 F1 8E 6B B1 C1 84 A5>)
$$ ##END=
$$ 
$$ hash MD5
$$ 2D 9B D8 87 57 2C 12 CE B7 2B E0 37 FA 6C 8E 83
##$RELAX= 
##$RELAX= 
##$RELAX= 
##$RELAX= 
##$RELAX= 
##$RELAX= 
##$RELAX= 
$$ Bruker specific parameters
$$ --------------------------
##$DU= <C:\u>
##$EXPNO= 3130
##$NAME= <ADRS>
##$PROCNO= 1
##$TYPE= <nmr>
##$USER= <dgb>
##$AMP= (0..31)
100 100 100 100 100 100 100 100 100 100 100 100 100 100 100 100 100 100 
100 100 100 100 100 100 100 100 100 100 100 100 100 100 
##$AQSEQ= 0
##$AQ_mod= 3
##$AUNM= <au_zg>
##$AUTOPOS= <50 >
##$BF1= 250.13
##$BF2= 250.13
##$BF3= 250.13
##$BF4= 250.13
##$BF5= 500.13
##$BF6= 500.13
##$BF7= 500.13
##$BF8= 500.13
##$BYTORDA= 1
##$CFDGTYP= 0
##$CFRGTYP= 5
##$CHEMSTR= <none>
##$CNST= (0..31)
1 1 145 1 1 1 1 1 1 1 1 1 1 1 1 1 1 1 1 1 1 1 1 1 1 1 1 1 1 1 1 1 
##$CPDPRG= <>
##$CPDPRG1= <>
##$CPDPRG2= <>
##$CPDPRG3= <>
##$CPDPRG4= <mlev>
##$CPDPRG5= <mlev>
##$CPDPRG6= <mlev>
##$CPDPRG7= <mlev>
##$CPDPRG8= <mlev>
##$CPDPRGB= <>
##$CPDPRGT= <>
##$D= (0..31)
0 1 0 0 0 0 0 0 0 0.06 0 0 0 0 0 0 0.0002 0 0 0 0 0 0 0 0 0 0 0 0 0 0 
0 
##$DATE= 1116428197
##$DBL= (0..7)
120 120 120 120 120 120 120 120 
##$DBP= (0..7)
150 150 150 150 150 150 150 150 
##$DBP07= 0
##$DBPNAM0= <>
##$DBPNAM1= <>
$$ [...]
##$SUBNAM7= <"">
##$SUBNAM8= <"">
##$SUBNAM9= <"">
##$SW= 20.6930455092707
##$SWIBOX= (0..15)
0 0 3 0 0 0 0 0 0 0 0 0 0 0 0 0 
##$SW_h= 5175.983436853
##$TD= 65536
##$TD0= 1
##$TE= 296.16
##$TE2= 300
##$TE3= 300
##$TEG= 300
##$TL= (0..7)
0 120 120 120 120 120 120 120 
##$TP= (0..7)
150 150 150 150 150 150 150 150 
##$TP07= 0
##$TPNAME0= <>
##$TPNAME1= <>
##$TPNAME2= <>
##$TPNAME3= <>
##$TPNAME4= <>
##$TPNAME5= <>
##$TPNAME6= <>
##$TPNAME7= <>
##$TPOAL= (0..7)
0.5 0.5 0.5 0.5 0.5 0.5 0.5 0.5 
##$TPOFFS= (0..7)
0 0 0 0 0 0 0 0 
##$TUNHIN= 0
##$TUNHOUT= 0
##$TUNXOUT= 0
##$USERA1= <user>
##$USERA2= <user>
##$USERA3= <user>
##$USERA4= <user>
##$USERA5= <user>
##$V9= 5
##$VALIST= <valist>
##$VCLIST= <CCCCCCCCCCCCCCC>
##$VD= 0
##$VDLIST= <DDDDDDDDDDDDDDD>
##$VPLIST= <PPPPPPPPPPPPPPP>
##$VTLIST= <TTTTTTTTTTTTTTT>
##$WBST= 1024
##$WBSW= 4
##$XGAIN= (0..3)
0 0 0 0 
##$XL= 0
##$YL= 0
##$YMAX_a= 370582
##$YMIN_a= -501090
##$ZGOPTNS= <>
##$ZL1= 120
##$ZL2= 120
##$ZL3= 120
##$ZL4= 120
##$ABSF1= 16.522
##$ABSF2= -4.171173
##$ABSG= 5
##$ABSL= 3
##$ALPHA= 0
##$AQORDER= 0
##$ASSFAC= 0
##$ASSFACI= 0
##$ASSFACX= 0
##$ASSWID= 0
##$AUNMP= <proc_1d>
##$AZFE= 0.1
##$AZFW= 0.1
##$BCFW= 0
##$BC_mod= 0
##$BYTORDP= 0
##$COROFFS= 0
##$CY= 12.5
##$DATMOD= 1
##$DC= 0
##$DFILT= <>
##$DTYPP= 0
##$F1P= 14.0000005364418
##$F2P= -0.99999901652339
##$FCOR= 0.5
##$FTSIZE= 32768
##$FT_mod= 6
##$GAMMA= 0
##$GB= 0
##$INTBC= 1
##$INTSCL= 1
##$ISEN= 128
##$LB= 0.3
##$LEV0= 0
##$LPBIN= 0
##$MAXI= 10000
##$MC2= 0
##$MEAN= 0
##$ME_mod= 0
##$MI= 0
##$NCOEF= 0
##$NC_proc= -5
##$NLEV= 6
##$NOISF1= 0
##$NOISF2= 0
##$NSP= 0
##$NTH_PI= 0
##$NZP= 0
##$OFFSET= 16.522
##$PC= 1
##$PHC0= -71.73108
##$PHC1= 1.231244
##$PH_mod= 1
##$PKNL= yes
##$PPARMOD= 0
##$PSCAL= 4
##$PSIGN= 0
##$REVERSE= no
##$SF= 250.13
##$SI= 32768
##$SIGF1= 0
##$SIGF2= 0
##$SINO= 400
##$SIOLD= 32768
##$SREGLST= <1H.CDCl3>
##$SSB= 0
##$STSI= 32768
##$STSR= 0
##$SW_p= 5175.98343685301
##$SYMM= 0
##$S_DEV= 0
##$TDeff= 65536
##$TDoff= 0
##$TI= <Analysis number 999999
Compound Code 99
Book Reference 9
Project Code 9>
##$TILT= no
##$TM1= 0
##$TM2= 0
##$TOPLEV= 0
##$USERP1= <user>
##$USERP2= <user>
##$USERP3= <user>
##$USERP4= <user>
##$USERP5= <user>
##$WDW= 1
##$XDIM= 32768
##$YMAX_p= 409110987
##$YMIN_p= -445712
$$ End of Bruker specific parameters
$$ ---------------------------------
##NTUPLES= NMR SPECTRUM
##VAR_NAME=  FREQUENCY,     SPECTRUM/REAL,   SPECTRUM/IMAG
##SYMBOL=    X,             R,               I
##VAR_TYPE=  INDEPENDENT,   DEPENDENT,       DEPENDENT
##VAR_FORM=  AFFN,          ASDF,            ASDF
##VAR_DIM=   32768,         32768,           32768
##UNITS=     HZ,            ARBITRARY UNITS, ARBITRARY UNITS
##FACTOR=    0.157963299565203, 1,           1
##FIRST=     4132.6476996994, 0,             0
##LAST=      -1043.33573715361, 0,           0
##MIN=       -1043.33573715361, -445712,     0
##MAX=       4132.6476996994, 409110987,     0
$$ Real data points
##PAGE= N=1
##DATA TABLE= (X++(R..R)), XYDATA
$$ [...]
22844 165132 26580 -67024 -60731 37174 18941 67775 17333 -37802 5050 -52821 -31478
22833 -31478 7539 65283 114799 41829 -70703 -106036 -84729 -104172 -86371 -69341 -90670
22822 -90670 -60694 252 -18444 -97014 -113179 -81476 25581 110801 81557 -39597 -78384
22811 -78384 -42470 -74967 -47910 -63049 -103923 -80897 -52125 -108073 -73657 -5979 5656 26477
22799 26477 -15985 -78096 -113257 -110072 -23929 37138 12397 -5289 -37836 -141510 -234466 -243025
22787 -243025 -180980 -112527 -66258 9834 85905 73895 47851 96357 144458 140936 117985 44611
22775 44611 -20121 -47441 -77824 -72782 11950 39030 25471 38713 -7809 -42866 -40364 22126
22763 22126 -43527 -38889 9213 -76471 -56538 -2130 82857 114267 40293 25327 99382 135178
22751 135178 141854 138514 79367 -35774 -22029 8219 -6976 -26282 7061 41797 74137 8929
22739 8929 -46752 -40504 -48913 -153493 -183084 -169428 -88837 -68018 -78599 -134114 -133489 -69974
22727 -69974 -8601 -15859 -20166 -55284 -36927 34517 8284 -35383 5040 39158 62731 66621
22715 66621 26982 -8824 -27195 -27990 -31146 -19993 15825 -2352 -71082 -95962 -73913 -58980
22703 -58980 -81703 -36106 -31113 -76581 -78182 -87276 -165023 -220406 -222148 -209627 -165411 -70782
22691 -70782 -23821 19825 16799 -108499 -152994 -90179 -18561 4067 47662 2224 -58853 50232
22679 50232 138534 148361 90056 158704 148366 156147 127727 47898 -25727 -111601 -182541 -107027
22667 -107027 -74375 -88239 -29586 -14114 4863 45790 42138 15963 45302 31871 -33458 -166004
22655 -166004 -169598 -147471 -93363 -52923 -14243 15534 -14709 -19995 -27818 -24085 -68316 -103849
22643 -103849 -75625 14329 -20956 -16840 -12958 141813 141276 16625 -58020 -68171 -14262 56865
22631 56865 68381 52192 -28254 39967 76971 53656 19259 26682 -12179 -69053 -16996 11268
22619 11268 29545 22275 22633 69852 147521 143195 139308 9929 -65599 -87339 -52283 18016
22607 18016 31263 31911 90787 66624 99460 161139 124590 81641 23693 -21322 -17873 56022
22595 56022 14776 36055 116562 134353 75107 25922 4497 37638 11905 -26569 -1894 42255
22583 42255 -39052 -45108 -12093 18151 56751 67468 -27025 -57502 -39324 -60604 -14822 -31486
22571 -31486 -11647 -558 -12724 -14813 -91192 -94952 -8918 -796 28152 43509 -36728 -51477
22559 -51477 -840 -7385 -105068 -67388 -14669 -28316 -67461 -130919 -62528 -29636 9021 26663
22547 26663 -47817 -78247 -36023 53632 21989 -10972 -16184 -25390 -30369 -6203 -38473 -76747
22535 -76747 -23010 16970 -30014 -13025 -11366 35374 1533 -41494 -43896 -79782 -105267 -112693
22523 -112693 -61283 21907 15322 -26164 -38904 -31181 -18532 -16231 -47061 -40327 -10498 -37200
22511 -37200 -54367 -65603 -29891 -32797 29506 -9335 -11718 64643 96232 132873 44506 -68039
22499 -68039 -40672 -16530 -17422 -24950 -86378 -108791 -147793 -109570 -41730 -10541 10813 13865
22487 13865 -3391 -2418 -28198 -84270 -121317 -61210 -25082 2230 55849 -33169 -87334 -5110
22475 -5110 -9036 -65992 -99488 -112029 -36627 -46239 -10934 133642 131866 96772 29666 -70453
22463 -70453 -45164 -16159 8085 35747 26477 16121 -23357 -42730 -72141 -30971 -15209 -51734
22451 -51734 -131256 -117181 -183951 -177038 -151351 -111934 -94932 -91368 -80195 -3311 -21063 -4805
22439 -4805 -31135 -13050 -75700 -82780 9299 47719 83690 101039 61337 -10451 -22066 -4743
22427 -4743 -79708 -61178 -4341 -55231 -84155 -3453 6278 -77356 -59287 -86441 -92009 -88878
22415 -88878 -9088 -17261 32785 -69297 -173489 -202591 -115679 -108228 -67361 -44464 49741 61779
22403 61779 -28535 -22680 -1478 -101521 -143244 -147791 -94470 -125961 -86309 -8402 -14226 -36774
22391 -36774 -36655 -48888 -27063 9713 63200 103876 64526 88073 138918 57448 -26530 -40760
22379 -40760 -10151 -53823 -81908 -55175 -51366 -19087 -134557 -150114 -177699 -145799 -102468 -72276
22367 -72276 -97571 -101082 -13294 -72083 -108615 -97241 -24821 13676 -71657 -154267 -166210 -139217
22355 -139217 -144803 -84253 -22417 7465 63835 47033 -14155 -95316 -121695 -47304 -34608 -49359
22343 -49359 -52562 -9922 67008 -18411 -77547 -24875 -48791 -100872 -60703 -66687 -149941 -170695
22331 -170695 -103868 -27087 53795 57838 56328 19681 32422 46475 87513 80762 33914 34903
22319 34903 115239 108209 69613 27524 -26806 -74938 -79260 -44118 50308 82309 84615 81260
22307 81260 -21069 -98820 -139668 -163922 -110809 -36257 -253 29195 -38745 -63977 -93955
22296 -93955 -80171 -95560 -160361 -178303 -99611 -37867 -85221 -86430 -17732 -46945 -101036 -103809
22284 -103809 -83200 -15916 25619 40565 28353 63540 69685 -44175 -149482 -146035 -32698
22273 -32698 -38531 -1164 -10461 -24909 -15577 -24176 -72167 -125135 -118468 -69082 -6579 7438 -21066
22260 -21066 51466 56803 -26644 -39712 39135 17258 66221 106713 56709 17359 -18999 -70909
22248 -70909 -81006 -69407 -83580 -25383 -32622 2240 -48288 -116001 -63682 -10821 -58092 22374
22236 22374 19874 5503 -5696 -64316 -134821 -162940 -179736 -246555 -209509 -95212 -36244 -37504
22224 -37504 -41889 -31195 -21942 -54625 -65835 -132046 -158267 -222820 -255182 -166559 -119713 -82260
22212 -82260 -100041 -100294 -59015 -82427 -63394 -50971 -57779 -30301 -35764 -55818 -52636 -47362 -22188
22199 -22188 -39037 -40682 4107 -69550 -124485 -126735 -60987 2758 18871 -54601 -89081 -71009
22187 -71009 -88304 14282 31710 62392 -12618 -110073 -163958 -95118 -50195 -32530 -57668
22176 -57668 -76597 -55565 -25916 -17327 -24064 -112519 -42172 -50986 -18397 -27149 -102137 -97633 -81185
22163 -81185 -78651 -25588 -34647 -83893 -53461 -26344 -48101 -104504 -123413 -27903 15480 28677
22151 28677 63924 34922 66708 121512 134438 74754 55996 -48330 -161496 -197477 -141503
22140 -141503 -25676 -69667 -67791 6756 10761 -4331 -51389 18544 57204 14001 -52304 -35737
22128 -35737 12841 5031 -35331 -48429 11460 14505 -50525 -50769 -97386 -123085 -35719 -13729
22116 -13729 -5379 -13699 1026 -44548 -78394 -138017 -130268 -55380 -50665 -91715 -91987 -139448 -195135
22103 -195135 -196447 -121007 -76857 18454 16243 -6442 -32137 -59620 -81964 -100437 -71037 -35741
22091 -35741 -74472 -92863 -38052 22117 65890 41860 89342 48757 -14035 29818 43573 -8453
22079 -8453 -40434 -20074 -78642 -12309 76838 -9290 -65803 -54791 -16317 -31297 -41215 12344
22067 12344 -55347 -126177 -136000 -72587 -49319 -34416 -93298 -66943 -44615 -546 -32071 -2956
22055 -2956 5254 -4310 -26147 -82171 -17496 -3290 18542 70009 45365 15419 -16374 -9570
22043 -9570 -48125 -83546 -116124 -111204 -90212 -92965 -146419 -174558 -145404 -143043 -100590 -101338 -102276
22030 -102276 -119600 -108386 -19603 -11143 -1195 -29651 -95953 -72044 15005 3286 -42641 -20339
22018 -20339 -61644 -83003 -75557 -29664 23871 -6169 18897 -10354 -31304 12846 -32072 -18745
22006 -18745 25489 27047 7280 -8141 -25024 6099 5819 -17188 -31424 -11847 -46620 -38961
21994 -38961 -55329 -55833 -19748 50706 -487 -88252 -88655 -64502 32018 118207 91408 9900
21982 9900 -3327 -36892 -34943 21711 -14216 -105500 -125640 -131897 -164237 -165095 -101950 -66091 208
21969 208 52939 -23382 -92945 -118306 -69382 -7320 -16675 -20512 -51147 -58377 24672 34296 -14602
21956 -14602 19804 100407 106628 74956 54900 -27185 -111726 -64089 19575 34588 39611 83685
21944 83685 25881 42445 94130 51669 37764 33727 -8484 -52433 -43019 -3021 -8073 -49157
21932 -49157 -90121 -96082 -40742 -24228 2216 17189 -28061 -116548 -96161 -49534 -31503 6713
21920 6713 -11960 -20104 8980 58656 64821 81656 100586 110218 98313 21084 -31968 23963
21908 23963 40447 -41460 -31389 -7568 702 -14648 9660 51316 98204 -19819 -32857 52112
21896 52112 74459 57994 52341 47828 67188 86111 80694 34161 64016 142528 129253 83762
21884 83762 53724 -23769 25498 45448 48578 28891 8939 20298 23740 31315 76160 51487
21872 51487 53105 63590 -51120 -47074 -17811 1669 -4058 -2839 -54784 -101642 -54988 -104886
21860 -104886 -140292 -126031 -84892 -88265 -148696 -126254 -111801 -127363 -14597 62006 15340
21849 15340 -33012 -41710 -67254 -101866 14098 57636 131992 181568 193677 152549 37428
21838 37428 -23693 -50690 -48736 -41196 22295 -19899 -35069 -161019 -163164 -44753 47680 24046
21826 24046 61899 94127 85271 65390 66823 30186 -85021 -55234 -59654 -47790 -22071 13039
21814 13039 -12609 -15939 -1964 15036 5892 -47033 -78771 -51582 -29638 -81709 -61415 4129
21802 4129 54812 -35701 -60942 -85358 -101980 -119279 -95975 -52568 -34445 57442 106430 115724
21790 115724 106105 59041 17406 -14692 -23198 24762 59313 -39577 -127037 -160138 -122710 -70184
21778 -70184 -46359 -72710 -117690 -171072 -150845 -151341 -87055 -80432 -175545 -240536 -104966 -48568
21766 -48568 -51431 12344 46833 52182 -2066 -58448 -104049 -99449 -27085 -31572 -54397 -104829
21754 -104829 -117406 -39971 15049 73176 23124 -34902 -84487 -117426 -98238 -100617 -12556 -11433
21742 -11433 10686 -29446 -60510 -73764 -166144 -165416 -124676 -44332 -47007 -105557 -120800 -138176
21730 -138176 -155832 -72393 7029 16587 8948 12217 7084 -62666 -71710 -35475 -13883 21981
21718 21981 40329 -9950 -40199 -100049 -129055 -61441 -61550 -37597 97978 133524 93107 63014
21706 63014 68319 80733 46931 -50726 -97993 -92566 -141994 -96951 -98383 -45491 -12781 67408
21694 67408 135392 118262 111548 111189 13698 -67420 -127402 -151590 -88672 -45972 -104312 -77968
21682 -77968 -88132 -138583 -64186 -56011 -38755 -48882 -48905 -7723 -21572 -115792 -146102 -127954
21670 -127954 -118470 -110455 -45925 7112 188 58015 32462 38102 -13263 10986 108 -32946
21658 -32946 10202 69277 105329 49559 -59210 -75688 -39108 21542 -77865 -88899 -88868 -81713
21646 -81713 3047 46143 45114 109965 82270 29850 -40456 -107320 -77195 5549 73548 23008
21634 23008 -37158 -40208 -122152 -129243 -53631 -69668 -11244 -34126 -106081 -108164 -95972 -68768
21622 -68768 -30568 -4915 -62324 -70946 -69891 -36336 -32062 -20212 -23742 66645 100202 27561
21610 27561 -59601 -43678 -41547 -24615 -92718 -132972 -69084 -76874 -106302 -50491 -6841 1630
21598 1630 -47 23817 15601 18302 -42829 -92264 -104534 -37283 -46517 -83162 -169605 -133194 9038
21585 9038 22329 -25731 -39383 -76493 -40283 -78034 -106771 -97881 -43978 -112658 -146068 -54748
21573 -54748 -71218 -54480 -41236 -56816 28952 46971 -11111 -78077 -72846 -55079 -91904 -35973
21561 -35973 -93418 -106918 20703 45966 64331 94157 40721 55073 49263 15944 34899 -8992
21549 -8992 -5575 -37175 -44286 -23838 -10624 -54141 -117167 -84244 -10433 65338 106502 142948
21537 142948 92472 29482 -13113 -67083 -122567 -82051 -48785 -54872 -93955 -98959 -88113 -27211
21525 -27211 22154 -91720 -175739 -159196 -126515 -2732 43744 82171 34811 78965 110503
21514 110503 54561 65126 89944 109824 90063 67827 85232 1256 -38925 -32281 -14556 5634
21502 5634 -42560 -33258 -5655 14177 55492 20881 -63970 -59283 -41864 -9989 -28534 20188
21490 20188 25796 9587 7451 12996 12689 52982 62537 19173 -22517 -62754 -139789 -109738 -120060
21477 -120060 -141238 -84286 -18121 10717 -52465 -126696 -129820 -118746 -116725 -72512 -47890 -20109
21465 -20109 13182 64343 111164 124721 151802 144679 93892 76710 116001 55550 18800 43377
21453 43377 98651 103200 86515 107390 140757 166102 141757 163843 119758 93127 26238 -22228
21441 -22228 -25209 18906 -75647 -111113 -50568 -77629 -110566 -98094 -70029 -112294 -178467 -172098
21429 -172098 -135108 -151711 -139084 -51416 38423 110131 144235 121745 119373 93608 24440 -79447
21417 -79447 -102076 -96563 -6691 95072 78439 51762 -56712 -129699 -97511 -42681 -38573 32092
21405 32092 33791 -56674 -124785 -112483 -37023 -12458 -121 60823 13882 -32168 -20030 -42960
21393 -42960 -55091 27197 62491 -46680 -97545 7325 22799 40180 -447 30275 61947
21382 61947 44316 62602 69853 -6001 -21717 27526 27513 16144 -686 2573 -18076 -39406 -80440
21369 -80440 -26696 88245 122102 127553 149070 129886 99800 58312 -45911 -143196 -140744 -162539
21357 -162539 -84842 -23842 31429 11740 -28483 47479 16636 25840 62526 -3179 -55927 -40294
21345 -40294 37449 21404 -152089 -131783 -44224 -55584 -27592 -35031 -433 -24161 -65396 -134339
21333 -134339 -117254 -46991 -4044 56406 106993 18171 19545 -38353 -60632 -60923 -53075 -21994
21321 -21994 -9682 -17472 -45152 -14093 -65583 -68247 -92682 -74533 -103078 -80896 -57651 -17770
21309 -17770 -1328 -45428 -110713 -134366 -92701 -112896 -111446 -86993 14955 87273 40806 43657
21297 43657 39819 86885 15222 -21862 -4216 -4959 -9012 -22232 -70254 -14744 -60091 -66464 -10887
21284 -10887 55248 71746 69792 86894 93450 18820 -31828 -44977 -73163 -112339 -124263 -68313
21272 -68313 -80142 -87950 -110104 -91026 -105888 -70037 -27112 35368 99145 76905 -2406 -58477
21260 -58477 -18053 8364 -11559 -36182 -116675 -102740 -49993 -58534 -101449 -89342 -45864 -10564
21248 -10564 -23225 -82752 -110328 -48656 -6606 5616 8141 12464 -29592 -3893 25647 -4344
21236 -4344 21228 45237 86739 75790 33879 -15848 9439 -23392 -119198 -135587 -20092 112038
21224 112038 133781 10149 -24005 -11762 -17346 -40499 -22137 -29326 -40666 -3479 20662 -67154
21212 -67154 -89324 3367 53060 92142 46600 71523 26765 22764 2706 -45557 -83701 -73188
21200 -73188 -95453 -66469 -80457 -37716 2202 -69015 -127804 -39501 -70897 -152022 -173103 -151030
21188 -151030 -80542 -1152 78056 -46547 -82102 -58381 -69968 -69145 -78625 -60142 -83687 -34310
21176 -34310 26917 82447 21854 -63100 -72868 -25985 -33045 -13003 52006 -11180 -121489 -143848
21164 -143848 -91975 2256 44151 33035 1260 4665 22155 -46618 -90351 -55457 -76207 -88065
21152 -88065 37081 32739 -57888 -16958 12934 -276 44963 91366 10960 -77612 -87421 1751
21140 1751 53500 17826 -70604 -116484 -101504 6320 -35710 -98811 -92038 -26298 6323 -19560
21128 -19560 -71560 -89257 7517 43585 24445 -17965 -26115 -23906 -47672 -111092 -204882 -221418
21116 -221418 -161629 -78970 -68802 -68161 -65114 -63588 -53002 983 41475 43105 80092 156462
21104 156462 102351 46855 122016 147823 66938 -29028 -41302 13430 -5852 -12415 -27168 -68340
21092 -68340 -28433 -17852 -107243 -164671 -135575 -25034 21234 -59282 -147942 -52751 31182
21081 31182 51827 15895 -60172 -111591 -64491 -39969 -40804 -112413 -127521 -88708 -64645 14624
21069 14624 -1547 -69300 -35387 26108 7300 -18144 25948 25563 57622 72032 50972 8520
21057 8520 31868 -38812 -89020 -88836 -48949 -61115 -27698 -34368 -74109 -122236 -121782 -79741 37949
21044 37949 80864 80665 -29096 -36533 -89878 -101568 -80697 -49871 -103365 -142818 -124223 -93930
21032 -93930 -38111 -89251 -78735 -47680 -28608 -19389 -57283 -59718 -11930 -18237 602 18093
21020 18093 7874 -21296 -65893 -43745 -27751 -8013 47985 86570 -29008 -52744 973
21009 973 37960 25378 -12044 -22274 -22206 -38030 -2384 23136 116975 143140 117508 107698 82384
20996 82384 47222 -24866 -39610 -52755 -10953 -39845 -272 59580 32988 -31446 -38820 -34706
20984 -34706 -1880 -10309 -27379 -11646 -39721 -53350 15915 42418 -16526 -87296 -75750 -15555
20972 -15555 -29643 16217 -7882 -53672 -115497 -173156 -157704 -161538 -120435 -94596 -59082 -38356
20960 -38356 -27156 -9644 -25708 -33531 -31983 -12602 -46818 -192883 -228230 -163443 -77291 -61043
20948 -61043 -39600 -26391 10565 4612 -57377 -129333 -144347 -102401 -10166 22516 50266 57623
20936 57623 77372 163145 124772 39529 9309 -38849 -51949 -74868 -101705 -49528 3910 -25907
20924 -25907 -87553 -39609 -35211 -51916 -55448 -89394 -70526 -25843 -68574 -101419 -99405 -106247
20912 -106247 -30249 7370 -23469 -16391 -29008 -61517 -50499 -14674 -64588 -46555 -13207 -28232
20900 -28232 -43061 -69326 -37121 -45222 -60036 -102672 -111793 -121103 -106707 -116902 -119890 -161381
20888 -161381 -152563 -146708 -213254 -245301 -179249 -114331 -113785 -108175 840 -46890 -52642 -59654 -41403
20875 -41403 -47777 -60021 18102 44699 -53145 -98833 -92219 -72621 -97281 -60531 19226 -773
20863 -773 -10193 -45250 -94384 -126421 -72730 2351 -36301 -89395 -94445 -99910 -96244 -87581 -66045
20850 -66045 -69383 -76056 -186908 -160011 -116450 -114565 -95875 -63751 -36870 10319 -58268 -59677
20838 -59677 -42287 -51554 -64524 -57267 -112801 -117074 -111843 -76031 -123374 -151200 -86167 -39587
20826 -39587 -57519 -81059 -23724 -50418 -93613 -98294 -77273 -111802 -41988 5441 -45673 -81360
20814 -81360 -75235 -70773 -21425 17196 2532 -59930 -123101 -113481 -49671 1755 23962 -27381
20802 -27381 -48987 -14049 20806 -25750 -95380 -81993 -38714 -66447 -40632 44663 7972 -15411
20790 -15411 -1680 -15153 -8742 -14545 -34728 -132690 -92866 43228 54276 2716 -55953 -54588
20778 -54588 15325 76092 111510 133518 19734 -54440 -62652 -45479 -64256 -98272 -136853 -120494
20766 -120494 -46732 -44226 -82420 -61773 -110349 -127415 -37054 -30133 -24995 -28337 -4229 -38881
20754 -38881 -90181 -171438 -214302 -231303 -164121 -138728 -179063 -133239 -75231 -60868 6012 44964
20742 44964 53311 30068 11173 34096 -23621 19846 72320 417 -75555 -127035 -143123 -127235
20730 -127235 -71295 -34436 41057 16601 -10119 -35414 -9673 -9102 -34756 -51684 -48755 -38140
20718 -38140 -114052 -141226 -93582 -44260 -80800 -64732 -27558 14506 -38937 -130235 -123742 -181934
20706 -181934 -121342 -118249 -111920 -89305 -62695 -86670 -84908 -7866 10263 45208 33855 -14020
20694 -14020 -1869 44662 -3395 -66273 -128524 -75100 -99316 -108337 -63009 -58378 -30418 -2485
20682 -2485 -72104 -83958 -67465 -75060 -29627 4270 38880 -11296 -19368 -13350 51480 92793
20670 92793 3254 -45793 -24288 44237 -38606 -98061 -56610 -104812 -116701 -97476 -112484 -160877
20658 -160877 -146669 -132673 -154582 -194015 -123487 -47733 -78180 -52402 -44317 -35255 -3648 -31320
20646 -31320 -86490 -41095 6838 -6224 -26845 -19523 16342 48774 71097 101724 66630 -24765
20634 -24765 -82109 -53631 -22447 -5944 -46209 -92851 -92827 -33888 -65710 -68952 25435 61430
20622 61430 20911 32791 25750 -53488 -55619 -49205 -91904 -58457 -9371 -37351 -49523 -64210
20610 -64210 -90272 -102930 -86160 -21091 -13064 -61169 12237 105777 78875 20381 32438 1016
20598 1016 20218 39096 -10456 -22213 15458 29969 -16645 -63469 -130657 -104757 -86595 -96810
20586 -96810 -107239 -60242 -23922 387 74549 129763 107150 47302 -43387 -38608 6205 -19372
20574 -19372 18364 67417 10064 -83577 -153134 -140881 -70660 -28078 52235 66669 5622 -53584
20562 -53584 -112802 -131472 -149127 -94989 -51711 4498 19764 -47685 -99210 -71981 -12355 -31558
20550 -31558 -120626 -124337 -107685 -138124 -133376 -144161 -143899 -135950 -131889 -130241 -145404 -125889 -58989
20537 -58989 -98953 -159038 -161919 -61396 -19146 -70379 -162464 -156884 -48797 -64762 -94454 -83457
20525 -83457 -110107 -69636 685 -2319 -32548 -14687 59867 43065 3577 -1901 -57504 -119149
20513 -119149 -154227 -65171 -77109 -82419 -40546 -41611 -116446 -150900 -99549 -52211 -22001 -35229
20501 -35229 -47506 -66606 -7327 18223 3268 -1677 -31453 -17412 20886 52481 -58898 -120581
20489 -120581 -59111 -64020 27790 23793 -7377 -49025 -81837 43422 36024 -10279 -30928 8880
20477 8880 -48624 -96173 -112156 -36057 18174 72635 23688 -58307 -18791 -23321 -41358 -29418
20465 -29418 -109473 -140351 -123368 -116928 -96640 -25204 -34792 -121882 -120658 -25324 -42914 -62527
20453 -62527 -51813 10669 53139 -33206 -65856 -81567 -126456 -120641 -183627 -156058 -139067 -164700
20441 -164700 -41928 -46574 -73554 -101915 -123225 -137789 -118829 6866 45935 1784 4570
20430 4570 -346 -77625 -116098 -109424 -47190 -9795 -89447 -61179 -36675 1959 -31659 -40692
20418 -40692 -73775 -46905 -39671 -70494 -90156 -150726 -108428 -95998 -61409 -45378 -40667 -62322
20406 -62322 -95618 -59247 1102 53483 31243 -39757 -35025 -92814 -171823 -130379 -140291 -92508
20394 -92508 1469 18478 -4257 -25439 -46960 13276 10846 -38850 -10790 60911 82518 84621
20382 84621 -5457 -42323 -5087 -17111 -11297 4035 -40527 -98651 -123359 -79728 12146 -13608
20370 -13608 -129441 -114287 -48768 -44693 10106 82264 20855 -60513 -4274 48938 -58797
20359 -58797 -131160 -120890 -136212 -147292 -134273 -108562 -84514 -53473 18675 -34228 -83028 -111724
20347 -111724 -99555 -120333 -105960 -63584 -73596 -87209 -49292 -76118 -29250 47278 -7071
20336 -7071 -103412 -88577 -21372 -12776 -46950 -28436 -14978 -9429 -5472 4391 -29165 -98648 -77637
20323 -77637 -59622 -118355 -121014 -92633 -83662 -127532 -150031 -74651 27661 69279 43825 -61044
20311 -61044 -100140 -105558 -128457 -129196 -137086 -94591 -30841 -9154 25173 14437 9662 -87083 -89290
20298 -89290 -59210 -11437 58517 -9954 -37934 11674 -52995 -78523 -40831 -67507 -86112 -59749
20286 -59749 -45087 -128169 -144760 -121442 -113823 -85922 -24189 -25732 -39913 -103254 -43954 -7897
20274 -7897 -22896 -27885 -37238 -35181 -92985 -71279 -21630 29201 18837 -44504 -27919 -72179
20262 -72179 -84548 -50951 7069 10115 -10536 -52795 -53763 -37492 -81745 -47878 78098 133487
20250 133487 129122 -24271 -53229 -25205 -4612 15408 -50563 -74931 -68040 -38388 -32177 -16592
20238 -16592 34673 83934 85917 14766 -67134 -134592 -109401 -68584 -52971 -25920 -11102 -43508
20226 -43508 -68248 -118949 -183251 -132497 -160586 -186973 -74305 -88456 -94794 -106599 -124213 -182468
20214 -182468 -135460 -26682 -98221 -57036 39785 47166 -38186 -60401 3058 51294 21049
20203 21049 36061 -31644 -75338 -86349 -131248 -88545 -14533 22747 39431 13548 68677 75955
20191 75955 42738 43115 2313 3248 -26990 17027 50130 46327 10505 -62962 -149917 -134931 -149505
20178 -149505 -169051 -175395 -151219 -123982 -111993 -189485 -182965 -78042 -89151 -97531 -129684 -87762
20166 -87762 -60063 -72298 -13174 26819 -14912 -106369 -59366 -79697 -164131 -182563 -72562
20155 -72562 -40555 -9658 4071 46377 18018 -74272 -21280 -9391 -81542 -127675 -156192 -182354
20143 -182354 -89037 17656 41527 50929 -80 -335 -174 28580 35312 54307 70272 71352 91574
20130 91574 98725 98970 82013 29415 32148 -138 -93225 -93864 -95303 -131601 -169458 -158296 -68719
20117 -68719 -32162 -1093 26753 26380 -40761 -69702 -83112 -47550 -4147 104527 84638 44987
20105 44987 -36980 -112381 -113495 -96908 -101242 -118840 -105992 -101082 -66123 -45450 -36076 -6915
20093 -6915 -35103 -26699 -71116 -98799 -71394 -51312 -88655 -108503 -167403 -125428 -100536 -83001
20081 -83001 -68518 -62452 -126982 -118025 -104796 -49294 -22658 19101 62220 50005 62988 46621
20069 46621 -41402 -98261 -157215 -95207 -133235 -129098 -67738 -50233 -78179 -89895 -122567 -154362
20057 -154362 -177786 -163183 -167175 -143625 -101959 -58252 -47575 1458 -71038 -107547 -72222 -52521
20045 -52521 4483 6729 24364 74735 119102 57773 -4856 -30671 -31493 -11642 -64366 -63841 740
20032 740 112435 140228 116574 140796 251671 276351 240803 240622 194588 151582 141723 117408
20020 117408 179320 165036 136884 153399 177669 180270 149958 69901 47466 67259 -46939
20009 -46939 -97234 -67461 -14836 46705 18211 -56991 -78909 -133142 -120032 -51233 -51962 -44117
19997 -44117 -19305 -57521 -99611 -141837 -100575 -48432 -4618 -78841 -71843 -42670 -34309 -20108
19985 -20108 26574 11243 -17219 -49768 -51380 -57979 -60080 -112111 -160439 -142568 -110443 -123834
19973 -123834 -191290 -151703 -38477 3592 -63608 -67065 19128 19891 -7936 1711 -17792 -49753
19961 -49753 -15709 41072 61754 36127 -5516 -6588 31411 -19650 -84319 -61593 -42175 -93873
19949 -93873 -93938 25320 67920 76527 27444 24868 75196 93527 42130 28450 44746 27427
19937 27427 -2956 13687 83548 87884 82912 -18727 -100167 -96913 -133107 -162374 -180660 -182678
19925 -182678 -232778 -189905 -124795 -91313 -58475 -86153 -79527 -91642 -22687 -6676 -9181 -87364
19913 -87364 -62625 -35083 -20828 14590 4848 -38503 -24107 -30480 -54834 5711 36055 -28698
19901 -28698 -65472 -85158 -105626 -90540 -131402 -149768 -87426 -67101 -77478 -133476 -183668 -168500
19889 -168500 -170593 -202572 -213077 -204693 -170529 -90539 -58630 -45525 -93405 -166399 -130815 -51548
19877 -51548 -80367 -113389 -94525 7128 87319 115374 58317 2453 -55241 -91559 -102169
19866 -102169 -79905 -40690 -5040 39953 40856 18332 17415 -14061 -6698 -37546 -20190 -110002
19854 -110002 -142851 -141795 -124938 -57763 -58871 -92712 -86193 -134321 -91714 -53628 -143525 -177602
19842 -177602 -163164 -218600 -199539 -124211 -108747 -61693 -46550 19616 20363 7963 -22979 -29456
19830 -29456 -116008 -122430 -132719 -118772 -105499 18718 81777 43627 -23009 -97590 -117709 -170468
19818 -170468 -149183 -46531 34451 42768 1020 -5581 -16704 -119876 -90171 -49435 20212
19807 20212 -2209 -29003 -26091 -16442 -65081 -86096 -24230 -124335 -224842 -194585 -71019
19796 -71019 -11837 -70331 -100480 -71454 -134053 -177578 -198147 -267765 -272695 -216496 -235992 -188253
19784 -188253 -119492 -139350 -102012 -41051 -40177 -142600 -137033 -95482 -125804 -89041 -70864 -96862
19772 -96862 -109965 -174510 -124220 -189248 -155718 -36417 -59027 -118749 -146109 -170073 -138707
19761 -138707 -11685 -8820 -44848 2112 -78667 -65816 -70945 -3517 4491 -23425 1499 -42704
19749 -42704 -31367 34014 84273 53993 -12130 -32540 -10617 -94396 -150556 -166979 -129721 -98138
19737 -98138 -57661 46008 35676 -12751 -55494 -116087 -72653 -57868 -26216 -6657 -80170
19726 -80170 -115767 -50026 -60953 -82049 -42393 -19512 -43094 -46948 -54244 -5495 40158 23968
19714 23968 803 56374 58876 53630 37085 38784 22620 34620 35098 77472 50840 -8237 -15821
19701 -15821 1571 84737 171988 168468 117331 66401 49367 22472 10309 42429 83082 98601
19689 98601 141169 190543 194986 153133 112402 151680 158438 170934 126446 97799 49648 6038
19677 6038 81994 144015 171983 270565 365765 429752 532932 557054 535103 484223 366547
19666 366547 283276 236602 187969 206408 228399 199443 120347 81763 153581 280565 332155
19655 332155 295828 321116 288323 261157 258099 232561 217729 293302 237453 204488 226872 225213
19643 225213 188616 169800 185259 173106 153713 61370 38104 77787 61221 73399 92700
19632 92700 169682 217868 242322 306588 418434 431035 317980 300631 318503 308268 182940
19621 182940 66423 1823 -60626 -13895 23864 67829 165427 257760 252106 290220 327005
19610 327005 256544 159374 97043 66142 59416 64839 59102 -25133 58261 90833 60526 48515
19598 48515 85771 53873 27350 30494 -27392 -135439 -186487 -188076 -165064 -93954 -101170 -60964
19586 -60964 -58999 -149945 -142083 3366 4539 -22071 -14992 -30689 -52479 -88599 -63920 -12059
19574 -12059 76133 123325 88473 79546 145512 134291 182875 259164 321183 436769 547121
19563 547121 674315 709247 725153 748260 762181 814951 821379 873441 935071 1084862 1163452
19552 1163452 1123485 1174881 1235176 1225194 1122060 1043564 959902 882851 760830 817439 830191
19541 830191 782417 753479 669030 653168 664326 568356 581731 487700 365936 236060 220028
19530 220028 214518 174988 129666 118381 103425 136186 224148 195050 95637 55610 28056 -2401
19518 -2401 25903 108042 196450 205468 233021 339599 439386 370917 340156 381585 399710 379250
19506 379250 342924 359562 336245 341340 425992 406861 391456 397664 431085 474636 432001 338194
19494 338194 281435 248428 154824 50792 9181 17944 -81263 -76443 -36282 -50263 -114277 -94304
19482 -94304 -2105 78741 18089 2312 -92859 -66408 87199 114397 -22084 -128946 -107891
19471 -107891 -24242 -54886 -61825 28239 71410 49396 67199 72115 -1334 1709 2154 -51345
19459 -51345 -16487 15223 -56901 -66372 -27631 -25342 -67691 -53588 -20654 30909 30154 31797 17692
19446 17692 46281 57141 50560 35409 10402 -15154 -3419 -9760 -89536 -146154 -174705 -96670
19434 -96670 1704 -4970 -26021 -82524 -73880 16469 127645 189261 163180 108304 79188 75992
19422 75992 24685 42535 91199 138624 147516 203192 287877 375177 476412 531118 524323 551645
19410 551645 490059 449064 332207 240208 178549 235883 264849 356447 527934 692588 779724
19399 779724 926729 1067291 1037221 954617 831940 660542 506560 401945 346876 344583
19389 344583 298209 227354 155516 250582 414094 527197 623880 648691 573726 415637 384165
19378 384165 378223 347267 221563 216170 192342 178993 75594 5218 42422 127867 91413
19367 91413 28091 -23163 -35236 22358 140170 163728 96149 -4030 7268 112 42476
19356 42476 -8611 -70332 -64999 -71971 -40879 -14918 40074 69852 183 -45969 -20826 102852
19344 102852 143961 142847 149177 121251 82435 1457 -42374 -44335 40984 27308 -79701 -90152
19332 -90152 -90936 -55131 31337 87281 76050 51142 93044 104833 144166 119238 7111 -74733
19320 -74733 -42342 -8292 47457 117387 172111 139252 -7347 -23917 -28310 -64997 -37553 -51348
19308 -51348 -64238 -58063 -98025 -69481 -88303 -110244 -148212 -176539 -148033 -132656 -108422 -96649
19296 -96649 178 38484 23862 37279 -39036 -76743 -70058 -5349 41497 41298 54231 32791
19284 32791 17825 78350 74248 20625 -9255 33366 144786 148262 191912 269894 286651 205147
19272 205147 143416 50949 24161 42318 50688 45121 50389 38124 -6899 -31095 -18985 19613
19260 19613 -7868 -41834 -42950 5554 -12610 -19720 -68764 -138090 -127896 -126140 -137874 -207702
19248 -207702 -302095 -272815 -281090 -236659 -178157 -74685 -34023 -16767 1378 49674 26454
19237 26454 39886 61422 13157 -44942 -114518 -91672 -95108 -27312 42197 121729 146681 74850
19225 74850 12852 46374 121623 124019 32149 27451 -22780 -73196 -23720 25891 22652 5634
19213 5634 32177 34043 18459 72558 97714 57663 12154 -31110 -5890 -13601 -32092 46923
19201 46923 83974 91883 46941 -39687 -38974 45864 69736 47818 93541 169985 189905 214415
19189 214415 248434 245586 276397 229577 244689 278895 316511 398596 418308 429738 409585 346617
19177 346617 277591 227639 190982 213913 237564 202151 212221 183687 204382 237033 230268 198637
19165 198637 64630 -34622 -23753 -75154 -158976 -211399 -254207 -273672 -202372 -104859 -50434
19154 -50434 11700 -10462 -18915 41429 59176 -22521 -90679 -179012 -183322 -158774 -105370 -35843
19142 -35843 25692 65218 109211 196443 191178 136996 141557 113487 141069 129935 83882 58251
19130 58251 116338 141296 136741 120592 76219 -10278 -52446 -57250 -32463 -86611 -64893 -8346
19118 -8346 -26424 -36035 -53329 -106604 -186445 -176307 -119029 -52365 -57591 -161731 -249164 -218943
19106 -218943 -93354 -102404 -59869 -8672 19520 103361 196760 260183 306934 285831 263911
19095 263911 242612 198542 177112 185921 188937 212921 190779 236327 291989 238230 309305 389382
19083 389382 385517 281942 116017 50735 -4355 -45106 -61192 50674 81215 -51987 -47001
19072 -47001 -47643 -67870 -73119 -5643 86372 186792 230013 315306 312858 336625 382381 501003
19060 501003 526225 538063 609882 713706 811529 906099 1011358 1102128 1190470 1249861 1382043
19049 1382043 1538873 1751355 2021641 2342566 2567779 2789472 3144371 3514660 4006300
19040 4006300 4684026 5498173 6569251 8078670 10318515 13740889 19208734 28136473
19032 28136473 40879495 53787313 59800395 58667449 56238034 56094467 60463055 67903423
19024 67903423 71050282 66515158 59812408 54818304 54049289 60118058 71194671 79309656
19016 79309656 78339934 73028143 68986097 69508015 75242201 79912762 75090561 63394443
19008 63394443 50527671 38518676 28845783 21908714 17055166 13558327 11234234 9744435
19000 9744435 8647383 7840333 7285533 6860751 6602439 6494056 6499049 6621355 6741464 6881166
18990 6881166 7189094 7748128 8552497 9641716 11249746 13665162 17258827 22950967 32264822
18981 32264822 46276918 61596430 69639901 68517785 65160994 64090951 67931375 75982439
18973 75982439 80802280 77185563 70214117 64719339 63809760 70863764 85079605 97239999
18965 97239999 97406546 90397854 84271181 83082981 88630213 95192202 91762092 78606082
18957 78606082 63154613 48252913 35830263 26775994 20329215 15778854 12598783 10447708
18949 10447708 8908066 7712470 6742743 5906552 5310292 4732150 4362026 4135596 3865809
18940 3865809 3588169 3323725 3083196 2956330 2875871 2813888 2680694 2599794 2486462 2332667
18930 2332667 2201874 2147250 2191951 2289115 2366935 2389194 2420397 2391927 2345657 2323913 2285211
18919 2285211 2179563 2085874 2047715 2061020 2038827 2067836 2169412 2293033 2502915 2742206
18909 2742206 3003110 3295760 3604751 4071921 4613971 5234735 5771395 6411774 7057949
18900 7057949 7724843 8509370 9569153 11155116 13409346 16763388 21911834 29968170
18892 29968170 42395608 60084096 81472486 102282618 117559406 123430131 118148139
18885 118148139 104441441 87871545 72631384 61342487 55196054 54695864 60576489
18878 60576489 73837743 94836408 121912055 151376740 178373360 196609663 200983366
18871 200983366 191377857 170135275 142129513 113945353 89902992 71774763 60032945
18864 60032945 54663362 55611303 62994412 75780804 90530123 101998956 106528148 102581970
18856 102581970 90817545 74906976 58729700 44651326 33578261 25399367 19666972
18849 19666972 15801949 13200988 11470453 10184122 9249629 8441491 7788149 7156074 6510456
18840 6510456 5898715 5312800 4830529 4304953 3883754 3627365 3455515 3297808 3119826
18831 3119826 2958804 2874303 2810570 2720056 2674566 2647586 2700650 2774586 2783012 2694915 2590238
18820 2590238 2413595 2303147 2330967 2330352 2302399 2210394 2107638 2004222 1966455 1820747 1831660
18809 1831660 1851589 1820330 1801740 1855582 1770728 1651972 1593080 1559303 1479716 1419028 1376043
18798 1376043 1352648 1222544 1086954 1061171 1005739 922835 913579 907113 866315 954342 996145
18787 996145 936468 825789 813570 794161 755813 772672 753399 721543 731420 786776 749877
18776 749877 728297 688081 728855 810559 792650 840179 891901 1023204 1147807 1368492 1578908
18765 1578908 1602516 1433236 1257320 1149768 1058844 1002396 935015 931958 879449 754725 745106
18754 745106 734606 708237 693615 685198 752795 775584 782750 751806 728788 787372 780655 761375
18742 761375 807710 747257 721992 683903 633739 638410 634264 567290 534641 562494 601380 585950
18730 585950 565157 539253 593457 655422 626606 624641 618041 562676 481678 380036 369793 317151
18718 317151 277744 347723 302356 251147 220917 275534 340978 336388 408837 517773 566697
18707 566697 568297 528374 469308 404018 273170 189570 150524 174661 200200 298553 340490
18696 340490 277682 300635 319469 318356 341100 411161 503901 534007 532926 529067 433297 360608
18684 360608 273955 254149 232305 244114 290762 405646 494800 559782 584181 620168 655966
18673 655966 664855 690081 627823 569091 447876 333822 280309 347683 379062 331974 284332
18662 284332 307227 361754 409141 421009 450334 595949 720022 676976 568377 515537 430971
18651 430971 370685 304376 242966 211235 254457 422704 609913 771069 911126 982804 911441
18640 911441 840908 808604 721949 603114 495006 481003 552197 742755 896182 1112328
18630 1112328 1336214 1442135 1590060 1657031 1610959 1474033 1339906 1287268 1212279 1194820
18620 1194820 1187518 1247304 1387861 1493873 1690269 1917108 1950930 1921621 1794417 1719787
18610 1719787 1784170 1897695 1960798 1936747 1874626 1843580 1710523 1537347 1311114 1134782
18600 1134782 1019156 805722 625032 516497 458345 437433 524800 620115 702109 804843
18590 804843 754303 772849 871923 862180 899535 1036107 1108382 1239497 1260585 1124877 979958
18579 979958 762335 564305 468957 493764 534348 643664 781302 854575 940902 1143524
18569 1143524 1336492 1481326 1623081 1739779 1764427 1757537 1613504 1497332 1490370 1437338
18559 1437338 1500126 1748950 2132513 2306377 2222958 2146140 1972266 1652945 1377996 1179203
18549 1179203 1109425 1031736 993610 990645 944499 826730 740303 715215 775417 785993 766192
18538 766192 804523 895898 857793 788596 762992 673504 671446 743438 712198 653972 605475 507146
18526 507146 442735 376426 399445 349654 241819 208745 181606 178808 190434 187551 224010 197123
18514 197123 167187 164345 266896 242315 269953 387763 590718 774482 930717 966212 855284
18503 855284 704678 616017 493243 401881 319433 336646 358803 262100 332110 428544 406967
18492 406967 293818 329340 438874 410728 382922 527178 622129 629235 670032 709685 635350
18481 635350 535388 573382 567553 497295 441826 421128 417767 371455 344743 435012 547070 613896
18469 613896 556155 465479 407090 394141 403608 441640 441366 346266 208790 231284 268958 323222
18457 323222 477657 540810 636109 803526 963749 1057605 1208141 1441797 1666911 1893259
18447 1893259 1947430 1929924 1902659 1784975 1648464 1538534 1438679 1437807 1444303 1464516 1617199
18436 1617199 1725883 1911987 2065395 2255965 2368796 2443781 2671608 2956516 3128892 3471549
18426 3471549 3955822 4624983 5607447 6950539 8977608 11940445 16423002 23591549 35316825
18417 35316825 53478118 75780114 94033558 103640900 103331208 90255055 71752274
18410 71752274 54470573 39892844 28844521 21229340 16023984 12511096 10113493 8563987
18402 8563987 7530094 6858198 6511814 6313163 6175986 6122806 5945850 5611626 5174970
18393 5174970 4704083 4233352 3843293 3508226 3257568 3142616 3131696 3284692 3455434 3733701
18383 3733701 4087347 4417380 4744057 5063951 5378977 5754615 6140560 6759402 7611520
18374 7611520 8730180 10271390 12241494 15041900 19425057 26133609 36509264 53008761
18366 53008761 79215534 116826456 160331502 198140280 218964897 217142517 193547479
18359 193547479 156600624 119505695 88029569 63881359 46677202 34794297 26679105
18352 26679105 21177071 17271445 14513406 12443062 10918159 9929623 9290336 8743840
18344 8743840 8240212 7591697 6858368 6167907 5489643 4992437 4683340 4450355 4296606
18335 4296606 4345710 4585362 4901395 5284908 5743847 6083936 6331762 6440025 6343398 6124566
18325 6124566 5961034 5957166 6189130 6645254 7349970 8409234 10066153 12666733 16630090
18316 16630090 22872399 32776779 48939473 72651517 99022353 117801999 126101311
18309 126101311 121247782 102317673 79872442 59691413 43215174 31314806 23253389
18302 23253389 17680423 13746393 10999854 8984776 7420464 6240510 5356693 4600878
18294 4600878 3969962 3484430 3103198 2846410 2626673 2433477 2278271 2179500 2070718 1987009
18284 1987009 1970398 1940137 1960804 2066793 2207742 2315130 2391126 2347448 2281323 2186907 1959843
18273 1959843 1783424 1553446 1414987 1303010 1191986 1020679 944410 970731 957098 1005637
18263 1005637 1042298 1148140 1213948 1128383 1045842 916473 874229 934552 1002295 1091890 1205722
18252 1205722 1402095 1678758 1899443 1953713 1903413 1654847 1381002 1219981 978213 843349
18242 843349 724706 624665 607478 604591 619089 603845 590436 594334 618991 616267 557174 552922
18230 552922 499133 449933 470209 526807 557011 493129 389649 351045 422234 413017 331589
18219 331589 368809 363374 303190 274129 336700 420815 467966 483412 488757 618436 721120
18208 721120 787564 836156 924777 956874 964471 932339 893914 855487 887411 1025759 1110974
18197 1110974 1091607 1023283 915713 742548 613872 546386 462843 449428 486360 474987 457351
18186 457351 410965 334863 378760 385474 379093 341000 367901 433230 450388 394817 429448 465535
18174 465535 396823 372759 392793 403499 382132 327453 307524 416203 405677 367228 342603
18163 342603 332160 291187 254645 329939 396489 452418 475000 429838 458947 472317 486580
18152 486580 533056 497459 502763 436538 364280 436130 514749 515442 604551 749083 849754 978037
18140 978037 966199 902778 946330 977531 932948 988199 1083998 1197946 1319380 1464659 1756451
18129 1756451 2079488 2331631 2542641 2651317 2776459 2981407 3324093 3681197 4045618
18120 4045618 4647517 5312317 6164266 7259874 8645796 10648547 13607538 18067956 25413969
18111 25413969 38362610 61756759 100495403 144663934 160367883 141527769 116784856
18104 116784856 92894061 75417011 70106024 75787524 87458270 95750845 94785165 88994937
18096 88994937 84675926 86016072 93493454 99826495 96316114 84766569 71369506 59414687
18088 59414687 51397032 48844459 52640051 63074937 77573269 88348390 89341966 84503802
18080 84503802 80274498 80758318 86828306 92144464 88041363 75708425 60930321 46668499
18072 46668499 34797825 26185270 20148909 16004790 13280190 11553936 10428576 9548304
18064 9548304 8849695 8316384 7935232 7734549 7541372 7439000 7521850 7744436 8073388 8696215
18054 8696215 9619420 11136684 13428045 17081587 22997385 32393254 45405988 58065593
18046 58065593 63963634 62580530 59020728 57409211 60148075 65722684 67838034 62858580
18038 62858580 54252537 45420080 38353803 34652328 35100109 40235662 49917220 60466144
18030 60466144 65457437 63242632 58826705 56527881 58263788 62779414 64074154 58083551
18022 58083551 48016167 37444594 27998427 20643770 15431215 11967326 9627316 8020973
18014 8020973 6901804 6055469 5376818 4861632 4418903 4089961 3800699 3462314 3161146
18005 3161146 2865362 2613856 2493035 2373610 2250232 2163758 2117991 2003338 1861656 1727390
17995 1727390 1604861 1550349 1470879 1323695 1223817 1174584 1133020 1062263 1051279 1074240 1120636
17984 1120636 1132650 1159581 1153225 1128439 1120826 1107068 1051880 978276 995142 975759 965433 886823
17972 886823 840933 881810 855002 838935 864515 833531 809531 746789 701947 632821 665759
17961 665759 637231 591677 568357 597610 571498 569765 628606 605279 557077 566069 559496 512068
17949 512068 510092 476978 416220 336514 335228 466300 538498 540042 548305 490666 460665 421792
17937 421792 479759 482901 468737 451163 506917 521410 535844 533122 460980 385266 384785 397279
17925 397279 428725 410998 429533 477244 491141 482019 471341 490782 523110 484876 402091 383330
17913 383330 482722 532303 542119 597431 744181 845166 937950 980857 963283 962666 915051 938920
17901 938920 1001802 1006743 984328 932078 874448 795929 681201 717184 858318 985389 1037842
17890 1037842 1084408 1066297 1225959 1373340 1519476 1555895 1563167 1442131 1243385 1063372
17880 1063372 886519 713932 575478 482716 483512 506426 455780 488929 479641 449772 421130
17869 421130 389029 386637 390148 377678 384381 378629 355331 349332 342370 411797 442354 502194 530865
17856 530865 575244 676401 745808 724303 685428 721159 734567 796009 864308 787058 671539
17845 671539 643821 611626 557263 589107 726498 848127 838235 987645 1197431 1399840 1539893
17834 1539893 1630100 1648044 1597448 1442020 1191806 958630 811611 696474 702017 628513
17824 628513 622692 605144 617730 536713 468165 453181 415732 284685 113485 73668 117197
17813 117197 194168 225363 246705 176024 177337 151315 169005 164744 143858 110434 10585 -81967
17801 -81967 -99773 -72252 -50825 -18237 26713 27314 100229 111711 100782 130123 102691 116556
17789 116556 170643 185430 202245 253338 244670 267207 300008 345947 408393 372354 276597 206777
17777 206777 161280 119165 141486 201088 215264 221677 220720 193720 137041 158467 177108 121928
17765 121928 140380 121801 112215 127711 117190 178302 151471 123944 63396 -28153 -89312 -95068
17753 -95068 -106293 -94656 -61001 -33639 17 25386 55527 78552 29475 37126 130974 156064
17741 156064 174799 114853 -1603 -57953 -19304 4162 -32230 -85163 -121861 -123756 -115908 -31734
17729 -31734 -9833 -30421 -1554 -44523 -85874 -94987 -72274 -6050 31298 125084 136015 104877
17717 104877 45872 60010 75785 112094 134631 126200 120634 120717 122393 153925 122070 92989 58229
17704 58229 72667 155102 149176 90616 97831 123519 173770 118501 100489 88260 62629 107750
17692 107750 132518 121132 101881 69453 11478 -3944 10922 -61081 -69350 -44922 -36614 27049
17680 27049 54338 39295 9369 -13952 3247 -13985 -59201 -31880 15248 32124 34782 -4296
17668 -4296 16489 3568 2259 -23572 -29142 25412 68491 50026 80151 -23371 -120059 -106702
17656 -106702 -87035 -34924 16497 52582 21489 -6029 75972 96906 72107 111844 118033 86841
17644 86841 60556 111373 141381 23537 -90169 -81784 -27211 -23382 -40292 -8358 38330 89144
17632 89144 101906 66899 43703 78478 79924 2499 -54009 -36875 25382 -6027 -27245 -14435
17620 -14435 -21432 -20547 38837 80775 107394 103554 76503 80026 63195 5657 -58281 -50266 48763
17607 48763 77294 132251 188236 277532 323236 257780 177706 156193 116524 58258 78008 93042
17595 93042 113081 148869 194029 184617 222628 235430 257441 280281 285367 304095 415148 480282
17583 480282 492910 519255 546730 526629 504512 530971 482603 368347 269618 228696 254956
17572 254956 279866 322066 335862 323555 326089 372598 408674 437650 504694 567934 473218 370061
17560 370061 335523 343763 333376 250546 165008 151839 154562 120729 60831 26349 33840 33418
17548 33418 33375 88364 63521 9670 27433 98964 127982 57655 52145 106456 145426 114970
17536 114970 72617 199919 298815 345425 395728 400357 433894 340912 278605 254733 246263 259321
17524 259321 243448 232793 168231 201598 341123 342327 332456 446108 476954 461533 441319
17513 441319 447448 463841 418819 463455 454809 388946 419892 356828 235079 209279 155752 160009
17501 160009 196656 145656 106602 92659 56861 96041 76523 59544 7207 74053 110937
17490 110937 151626 79294 42475 53796 63569 57201 64677 86848 67373 60221 26024 55315
17478 55315 69857 148818 124592 121202 104034 148385 135723 93299 16487 -103964 -98608 -68942
17466 -68942 -81685 -68575 -74083 -118156 -104008 -93596 -76664 -57889 -17625 -31287 -12444 57358
17454 57358 95493 88108 50470 78291 82917 24003 32293 76731 145941 243137 331534 503328
17442 503328 709107 875761 865211 768477 547253 318975 145863 153224 172180 171796 140726
17431 140726 14056 -61217 21587 25387 35779 43076 -1337 -24824 -39557 -50243 -8759 32974
17419 32974 55431 58795 75951 107629 152696 206896 128865 59087 58463 69475 35060 -11820
17407 -11820 18780 41021 80478 62637 -55705 -131441 -116209 -91181 -43799 -19719 63641
17396 63641 144255 110411 15612 5497 24321 113906 185333 173904 130648 86897 61943 136153
17384 136153 149180 105938 -627 -74133 -4710 37152 38182 42486 35969 115763 138753 46749
17372 46749 80294 111932 105479 142730 207030 205745 160782 179760 97058 18267 -15131 -12605
17360 -12605 -45156 -26811 -60378 -96203 -48410 64638 93910 117571 30007 -12025 10123
17349 10123 -2435 -41269 -3632 6701 62601 53499 15556 34776 45916 1039 56508 90331
17337 90331 102010 98722 62310 99970 30395 -46886 -52797 -20596 -20674 -18525 97362 123469 57012
17324 57012 4546 42885 179797 208645 198772 166981 111451 101939 79375 132807 181324 103746
17312 103746 82760 52832 62202 96764 49847 12727 4879 1391 -8308 -76224 -58038 -53514
17300 -53514 -37914 6514 77476 96838 540 -4720 -78973 -97541 -85806 -113983 -132320 -108448
17288 -108448 -98275 -106245 -70524 -38621 52321 113223 92400 31421 19076 -28657 12615 -31796
17276 -31796 -41915 22312 82587 107884 79314 -22154 -4088 63186 50417 73933 32507
17265 32507 -34434 -57207 26765 3816 15880 9420 59271 117665 112456 138267 140569 129650
17253 129650 176533 163136 105878 13564 -34091 -51039 4453 102859 183260 201748 148381
17242 148381 54756 5099 -17232 63124 100213 54057 33484 49902 30043 17332 86327
17231 86327 80653 55281 86881 56549 27471 -30881 -41570 -29816 1760 -9911 -28665 45464
17219 45464 122768 118594 83504 52603 17476 19653 81887 40314 -31634 -26674 79363 132529
17207 132529 163234 186869 164992 115356 89264 128214 131773 98127 87326 98292 102057 89548
17195 89548 24068 -45231 -92217 -68476 -132656 -159008 -108794 -102371 -100278 -31520 -110670 -98315
17183 -98315 -73129 22220 83328 121501 150663 187602 183127 119695 69244 71063 101533 94869
17171 94869 117613 137206 123936 71823 89901 110297 48950 74438 141281 89554 51530 59709
17159 59709 82180 40430 -32052 -47442 25593 110141 139688 138675 92947 65307 102367 111219
17147 111219 126740 107477 74477 21950 -11241 -62399 -41113 -49716 -55547 -41248 2741 78927
17135 78927 45265 47375 72226 148981 96779 56911 55630 39098 58124 68921 77514 6742
17123 6742 19265 64518 20444 42722 9938 -14097 -38783 -68642 -92238 -80505 49150 63192
17111 63192 35037 19338 59982 147777 181521 164009 117981 68951 43239 55287 71620 648
17099 648 -41278 15803 32577 -16032 -31289 6583 17511 75590 134156 85852 77083 68642
17087 68642 54039 14806 -35627 13051 19127 60154 120360 118693 91075 93745 101440 84867
17075 84867 73537 73843 97108 111719 112194 83841 13167 -54706 -90545 -94513 -71313 -74254 -65421
17062 -65421 -52611 17926 47736 77898 103845 97275 21851 -79826 -56091 -19386 81390
17051 81390 113081 93489 94539 149008 155519 121439 48747 15194 1759 5953 -13422 -52455
17039 -52455 -71111 -68471 -60188 -92646 -49942 40495 48909 3615 -36223 -97623 -44950 -54138
17027 -54138 -56727 31931 66352 14219 -36215 -36850 -1226 -72877 -61246 -8551 -22143 -16586
17015 -16586 42660 -3813 -50396 36425 48814 9799 -21687 -74123 -14225 -10951 -43074 -66286
17003 -66286 -65513 -84879 -147571 -127167 -93914 -92023 -12017 -44881 25550 111667 78479 74078
16991 74078 68077 75641 32383 3794 27513 38354 5232 -114276 -76445 -94837 -106005 -86668
16979 -86668 -31263 46807 71123 63833 55998 86832 52142 63260 55504 -20941 -68316 -98332
16967 -98332 -116085 1314 37451 23802 -14973 -37949 -49728 -80503 -72282 -24667 -49920 -61477
16955 -61477 -134117 -98490 6804 4423 -89934 -60747 8720 -21559 -45506 5881 -7633 -49601
16943 -49601 -163704 -159834 -164238 -157711 -63041 -55886 -51891 -5198 -22748 -79918 -82936 20853
16931 20853 35634 -14197 -5724 -64817 -63185 -22342 1947 -48068 -41096 -22350 14998 75604
16919 75604 75266 19189 -36706 -121767 -159856 -127284 -119935 -116110 -85670 -105332 -188076 -219407
16907 -219407 -194668 -104661 -11290 54771 100249 48053 32686 11794 19799 4046 -15057 56906
16895 56906 92679 13538 -28442 76481 45562 4056 -38542 -69650 -136328 -123135 -93755
16884 -93755 -89069 -64437 -126472 -117501 -104949 -139078 -103834 -61641 -79429 -54567 -60875 -99592
16872 -99592 -79027 -111884 -55875 -37092 14780 843 -15834 -93439 -116633 -78409 -76944 -50032
16860 -50032 -58211 -24901 -22231 -13041 -58418 -32430 -17865 -93215 -83651 -75740 739 58502 52400
16847 52400 79144 110529 132761 100286 61191 -24441 -61134 -47628 -13708 -18579 8906 64516
16835 64516 4415 7577 -18877 -50534 -53547 18521 22900 43854 10864 -45246 -92610 -119634
16823 -119634 -58984 -22469 -67814 -75585 -38665 35709 56986 86883 73214 67730 14247 -52456
16811 -52456 -972 62762 75904 52347 78752 80403 62823 111140 97344 57171 -20612 -5344
16799 -5344 65572 56353 54472 -2776 -83217 -103613 -61076 -50178 -62538 -104136 -156565 -127078
16787 -127078 -113860 -134004 -76528 -23555 6444 -3850 -44643 -109886 -95605 -93543 -17861 -14823
16775 -14823 -9818 -63335 -28030 -12428 75376 140980 124313 113001 46230 5356 24111 52874
16763 52874 36943 80890 101693 89692 59474 94282 93624 74737 87068 20160 15330 53171
16751 53171 31325 9656 34701 68458 27453 10097 -37736 -3033 17633 8794 28502 86908
16739 86908 88273 39533 -3731 -10178 -45435 -34794 10568 11944 -46914 -42475 -32273 -26033 5931
16726 5931 -23882 -46470 -45104 -37413 -53329 -15470 10036 62823 49230 22768 -5865 -47626
16714 -47626 -104704 -66855 56319 141791 77476 20829 -2448 8083 -43786 -91472 -28343
16703 -28343 -29894 -31527 -66995 -132328 -166466 -97547 66899 156385 139183 103106 100612 1560
16691 1560 -5444 54516 -8502 -27798 9856 -7092 31606 37349 5382 -27749 -49913 11510
16679 11510 73984 69241 61907 94931 87915 58472 24739 26095 44814 95687 95618 28296 -32609
16666 -32609 -42911 -153960 -155448 -139586 -147909 -140090 -114737 -67278 -47523 -113784 -140539 -88483
16654 -88483 -70903 -89978 -89183 14850 25604 -50167 -77712 -32983 -72505 -96071 -65585 -61732
16642 -61732 16189 24443 44913 57400 6148 -24506 -32132 -5878 81544 57425 28320 -4125
16630 -4125 17582 50762 63038 26762 65913 147705 141012 63571 25240 30955 33031 39517 60427
16617 60427 90585 116468 110008 104526 109563 64275 62670 40270 94966 136035 107723 132141
16605 132141 47298 -15039 -50271 -72639 -107143 -90320 -61060 42616 88701 21408 36129
16594 36129 64842 56839 -15398 7738 32059 50739 25855 -43780 -77751 -67428 -1791 36766
16582 36766 77797 83247 77820 85578 50445 -32658 -33800 -65573 -19846 27285 -40206 -14379
16570 -14379 47215 96041 61609 104883 154795 104981 133099 143493 99023 72812 96505 101850
16558 101850 100827 43650 20449 39507 4573 -55770 -20559 -29015 -27473 -39056 -54756 -11207
16546 -11207 57701 39497 -6828 -16063 -335 -17631 26072 58211 60558 94401 97104 97587 71561
16533 71561 34043 14990 -43896 -5222 82592 81973 50372 49631 40334 18230 75117 134068 188869
16520 188869 82115 836 -22538 -12620 -18312 9302 23285 -13329 12461 111027 73427 87675
16508 87675 171045 132164 134274 95393 11871 -32240 19082 50698 15488 4542 -84693 -51222
16496 -51222 11680 -13872 6609 34898 101704 47753 -13501 21720 51035 116114 164529 117212
16484 117212 136294 139312 49808 82807 62035 -8574 -22457 2245 28296 5452 -34317 -65615
16472 -65615 -93491 -62313 -28827 -46595 -14379 43561 24654 -5441 33841 51062 56739 50873
16460 50873 48214 93629 215574 219889 111673 6177 -15907 24357 1604 -17089 12982
16449 12982 38403 92462 104087 29002 -48724 -67667 31017 22862 -22326 -26760 9287 11280
16437 11280 7743 46147 44865 60522 129425 133559 60905 51721 7819 22800 -22219 -75406
16425 -75406 -27417 79568 103451 65340 50969 17394 10085 67567 57625 45864 11282 13632
16413 13632 12953 49222 84190 51267 133601 147905 134030 98687 29086 13949 -7216 -17736
16401 -17736 -63347 -62458 -2537 -1076 -44664 -20449 -72579 -111265 -157113 -123744 -141990 -109139
16389 -109139 -96354 -117365 -98127 -51246 -44073 -327 -87061 -136497 -116283 -28789 -21590 -7562
16377 -7562 -22006 -28413 -93143 -106882 -49175 -12076 6661 10375 59008 106351 -6019 -66871
16365 -66871 -23691 4438 31972 1331 -48520 -35541 -41971 -99537 -87401 -34198 -49144 -111
16353 -111 36186 651 -52978 -154470 -131142 -53947 -52728 -62980 15486 -23773 -56202 -241
16341 -241 39210 132873 81315 37710 66203 69146 50539 121909 144191 189668 254482 158744
16329 158744 48105 -13690 -12286 41229 54448 76505 63747 40899 -26254 -69720 -103107
16318 -103107 -126895 -81798 11522 14173 75047 80106 135768 99890 48128 35189 26378 62388
16306 62388 84841 95365 174193 87085 8760 -97978 -54634 -6415 -35368 -28633 8317 -19001
16294 -19001 -30639 19949 36965 -37300 -49048 -24381 20074 21682 13698 59801 122713 202719
16282 202719 211597 168444 189090 135541 98664 90791 158429 156461 73877 73786 87690 107277 142413
16269 142413 150275 151039 89384 92371 -7891 -58660 -33474 -27650 -73009 -83239 -40758 -147296
16257 -147296 -145429 -129916 -112594 -133210 -119664 -133692 -34351 44083 48509 82925 81020 -15206
16245 -15206 -3831 -14652 -22001 -68744 -70845 -101656 -66820 -45750 -11041 24531 134754 111786
16233 111786 30780 72713 73311 51150 2409 -4882 -69956 -87982 -61900 -74109 -63183 -11962
16221 -11962 65710 96548 32147 19229 37057 -11693 -19451 -78890 -38180 -10415 -62110 -22312
16209 -22312 -58148 -145534 -147118 -93983 -28470 23040 -13612 -34975 -22590 29366 -5127 -3014
16197 -3014 30338 31201 -12437 -49630 -14259 -41016 -23528 -54793 -56443 -42445 -13601 -55740
16185 -55740 -30361 25166 103575 120637 47391 38643 38645 43649 -25721 -82142 -85148 -66265 -9465
16172 -9465 45403 45920 31029 -14349 -76387 -87449 -85948 -49395 -51464 -82393 -97854 -138859 -129446
16159 -129446 -15024 77361 78690 46370 37572 39925 66605 98318 66986 -30141 -40173 -19906
16147 -19906 -28924 -21104 3955 -19861 6578 -9348 -32991 -31536 52989 85374 24430 -47792
16135 -47792 -67451 -101487 -100811 -68842 43121 112779 90623 120930 45653 -53894 -9964 38295
16123 38295 24620 -12070 -150783 -198974 -127086 -121551 -26414 52037 12976 -55541 -136737 -114879
16111 -114879 -18911 -25003 24367 83309 60087 32795 9742 15408 72831 84218 19635 -105363
16099 -105363 -98124 -80502 -94623 -29104 -23410 -31172 -25575 -15787 -5052 37794 14882 -77060
16087 -77060 -116832 -62456 -15420 161 13033 66868 60937 5430 -3061 -11385 7489 54074
16075 54074 54516 8630 -53397 -34807 -57311 -42278 -48169 32359 63557 48789 51535 -19894
16063 -19894 -101362 -116612 -74404 -95060 -35674 -35004 2926 16498 6897 26000 -7936 -39226
16051 -39226 -118289 -135938 -172002 -127002 -88881 3617 -16369 -90049 -79313 -71821 -85599 -77097
16039 -77097 -78802 -26690 -23889 41418 11815 -61901 -82944 -18390 -4272 -93014 -102141 -63096
16027 -63096 -28315 12992 36287 -28403 -121409 -131649 -74533 -11888 28448 62886 978 -107403
16015 -107403 -97521 -69390 9071 9563 -61887 -76734 -102823 -99524 -108528 -104595 -92159 -21524 -1418
16002 -1418 -37863 39406 49467 61050 29602 -63388 -98279 -103048 -129228 -116262 -6095 30067
15990 30067 31003 34114 10770 -42268 -58221 -46132 -20997 -57429 -75130 -28176 -18469 -33091
15978 -33091 -30578 -52534 -62074 -49151 -33184 -38993 3572 -6937 17201 16994 6094 77719 31713
15965 31713 -38819 21141 98158 107876 74864 -18099 -60359 -37883 -11822 38479 -6973 -28315
15953 -28315 -102510 -114497 -152085 -106967 -37972 20222 -22525 -68007 -74040 -37947 -44784 -34194
15941 -34194 26700 29756 20806 79756 64770 19207 22398 55055 106691 7394 -10124 27607
15929 27607 32780 -15383 -57549 -26681 -90947 -88674 -13280 51148 38065 -42620 -43535 -4532
15917 -4532 25508 5720 -6515 23067 15926 41227 64593 45828 50016 83733 104502 136442
15905 136442 93095 56767 133031 162914 70623 -51255 -90990 -41600 -37762 -128822 -118612
15894 -118612 -26025 32743 -24782 -14185 -10584 -43228 -2739 -5369 11901 34589 65644 -876
15882 -876 23089 135680 115983 52438 23019 1633 -601 32410 -31950 -76049 -26046 -71525
15870 -71525 -11915 82534 57435 7503 11382 -58639 -67019 -55339 -82083 -121406 -27669 27155
15858 27155 -55181 -105992 -93939 -89484 -91230 32168 -9779 -97584 -154041 -142351 -148915 -113397
15846 -113397 -128452 -132626 -66931 21779 22867 23738 43830 98547 57358 14976 15683 -48852 -52988
15833 -52988 -79002 -31781 64071 108694 53128 -16283 -127043 -162141 -72387 -91883 -168493
15822 -168493 -128017 -86464 -63798 -49619 -45085 -45711 -91652 -30061 -60714 -95080 -92385 -51047
15810 -51047 -22881 -89325 -89958 -77407 -167635 -204430 -133564 -19478 37497 -5717 34111 -6465
15798 -6465 -35342 14741 47293 -55271 -110269 -83196 -29915 -63365 -70805 -21376 -53876 -96681
15786 -96681 -75064 -101988 -106649 -79571 6635 3837 -53132 -115065 -107082 -95313 -90931 -70037
15774 -70037 -18469 -12634 -47727 -39205 -87161 -62155 -5058 -7404 -9172 -21300 -87039 -22204
15762 -22204 -33629 28685 28850 40766 92110 32995 -55822 -54658 12855 24902 13107 43066
15750 43066 75256 69071 21858 43001 96202 85986 13458 27778 39153 113505 70434 21404
15738 21404 53815 18782 -3054 -32455 -93514 -30373 -13026 6676 27171 57672 84059 30240
15726 30240 -14569 25827 109830 98844 60800 -12274 -32713 -45353 18032 24927 -30677 -32638
15714 -32638 -11452 -74 34380 61811 62501 -14504 -42518 -53914 9261 79840 61111 165461
15702 165461 168759 123022 15593 57047 8418 73871 80827 33118 58389 56528 23298 8951
15690 8951 -19440 4260 -11599 -43952 11417 -32886 -73480 -75517 -79935 -58409 -19427 -62170
15678 -62170 -119612 -105315 -97446 -79007 -111217 -117522 -159984 -88857 -86818 -94099 -78125 -56136
15666 -56136 -27259 -34862 -56257 -111037 -102113 -28442 259 17795 58626 85626 45195 -47924
15654 -47924 -12415 16587 31713 37464 35329 14496 -63560 -133395 -119032 -48253 -10667 194
15642 194 -64681 -32128 -34294 -70323 -34401 19592 -28139 -48108 -46615 -60789 -148841 -101065
15630 -101065 -48018 -28697 -44540 -33800 -104782 -165862 -131979 -58827 59602 26028 -40445
15619 -40445 -48872 -2026 6420 -26593 -100383 -93944 -87959 -53526 -70237 -88275 -37864 -30452 -26983
15606 -26983 24504 12518 -3574 -3729 -8784 -44480 -46322 -19030 -5981 -39254 -65527 -93809
15594 -93809 -98498 -85122 -58027 -31094 35795 27252 -55745 -43340 -16948 -50410 -7432 -61687
15582 -61687 -54631 -86953 -51562 -64803 -32574 -40762 -28794 -18337 -13761 -20159 -37187 -51365
15570 -51365 -67864 -47320 30777 40412 89623 93827 12701 -73510 -95570 -46619 -7891 -4828
15558 -4828 64681 127959 78270 6745 -21037 -32089 31334 60474 -14493 -112408 -180564 -101916
15546 -101916 -50885 -91349 -119563 -33997 -12812 -76355 -189727 -178255 -93639 -31543 45215
15535 45215 53650 55695 84595 85769 98113 51612 26792 -9645 1039 -7300 57754 5538
15523 5538 -28323 -53774 -63752 -102728 -62314 43229 76824 76247 -57294 -146578 -151001 -154090
15511 -154090 -165069 -37331 30041 51308 12459 -72052 -78778 -50932 -28317 -49813 -71219
15500 -71219 -83165 -107632 -113234 -141658 -94268 -19238 -13750 18604 19306 43790 83314 9514
15488 9514 36240 132838 160975 56317 -27475 180 102137 147895 108121 86644 91118 65829
15476 65829 -38353 -119571 -93749 -72777 -8356 18520 27958 -11739 -66229 -45202 -22024 19225
15464 19225 -2153 -40361 -70108 -111226 -121689 -74060 -52627 -80364 -53477 345 18067 -19017
15452 -19017 -107044 -116634 -55816 -42290 -87974 -57568 -40046 -68732 -38420 15609 -3163 -55245
15440 -55245 -28121 -18694 -11797 23543 -9500 2059 -31473 -30534 20202 -57253 -82639 -36927
15428 -36927 29059 18108 37806 -17051 -83271 -4205 85190 88941 91168 99265 71699 48308
15416 48308 -2 -4537 -56856 -101813 -111659 -35283 -25995 -68144 -153527 -171670 -131877 -78454
15404 -78454 -46453 -43228 -26024 23329 45566 57070 60598 45687 -8286 -44028 -35681 -20657
15392 -20657 6134 10324 -50968 -24950 3025 103074 173500 136823 28717 27314 -7826 -15025
15380 -15025 -30174 -23946 -15714 3720 16570 11300 -14912 1020 60475 29933 -6493 -7376 -938
15367 -938 6588 -36118 -66633 -139242 -93229 -57762 -76597 -74963 -35120 -62654 -33800 -28181 -52853
15354 -52853 7070 12238 -2297 1461 99829 147456 138621 37152 -73155 -125330 -113179 -90981
15342 -90981 -65763 -19477 120070 161713 100981 56954 43037 30482 57849 21580 36425
15331 36425 2251 -4146 18115 3040 -7721 44344 28338 -40538 -113640 -72356 -61106 -14672
15319 -14672 53670 64139 63327 182419 245940 154787 97203 49974 28229 99092 100581 122736
15307 122736 134556 39311 39487 29750 46644 57416 109425 116086 52553 6566 48712 16108
15295 16108 -8948 17945 55714 79491 51269 -17161 42921 39940 11234 -50242 -12173 18401
15283 18401 62315 96720 163828 129050 41314 27637 13934 12146 48504 60740 68283 68192 22922
15270 22922 -16846 -4252 13491 28664 22814 31981 -30232 -36737 -53573 10076 118982 116131
15258 116131 154298 154907 95129 20742 -8077 3290 -5442 -63274 -92885 -97346 -71847 27617
15246 27617 31997 14852 21439 56093 48201 -1086 62004 57013 35709 46363 6293 40632
15234 40632 34276 8108 1787 17483 -3120 -8737 -10030 -28171 -47607 -73566 -63006 -17470
15222 -17470 -15906 -100912 -89731 -21609 16681 32847 -29734 -91201 -144300 -147691 -96803 -113130
15210 -113130 -89794 5477 12722 16522 6387 -11945 -29241 -48566 -6084 -18118 -13786 -67956
15198 -67956 -87165 2098 -40279 -24856 95 -17572 25007 29298 1366 -22953 -62879 -153797
15186 -153797 -176366 -132280 -148318 -109118 -102113 -52102 -37074 -95560 -91236 -126293 -47764 -22927
15174 -22927 -49594 -95237 -118794 -108426 -43659 -27297 -26615 47996 76401 86210 39070 57775
15162 57775 98689 82582 16526 -47007 -20920 -47780 -42793 64996 49578 24566 -17996 2516
15150 2516 -13518 -53287 -78913 -66871 -72744 -79405 -55053 24743 5458 -17919 -15541 47531
15138 47531 18516 -53398 -192281 -187959 -100825 -75398 -26871 48157 111808 98694 29360 -4630
15126 -4630 56800 107374 101570 78350 38669 45005 47162 -1389 20681 35606 17060 18427 51424
15113 51424 -3359 -35722 -3705 14448 56792 48704 -58285 -111067 -25505 67691 112091 76674
15101 76674 53341 24487 25897 -26329 17468 82883 28603 -17577 32304 32359 -10871 -40787
15089 -40787 -1135 57226 33624 -42857 -68362 -29757 69669 116396 111754 28614 -55086 -53900
15077 -53900 -11080 -83321 -77285 -97489 -117683 -70472 -28137 -24875 -56861 -29282 57963 67983
15065 67983 43613 37424 41267 70414 20189 -29756 -50001 -56555 -65035 -31167 9698 3975 -52023
15052 -52023 9380 67195 65797 66036 74050 46567 -30880 45631 54861 47248 28382 -26772 -99104
15039 -99104 -62175 -62345 -23629 -6914 23067 22813 39131 373 60884 18952 3121 24462
15027 24462 -31028 -53311 -37957 -81003 -79020 -96968 -10289 -77336 -150871 -136806 -67138 -15939
15015 -15939 -12494 -7524 -19016 -40149 -28598 2245 33057 53064 32034 2408 12875 -5169
15003 -5169 -68431 -121880 -119513 -77686 -83790 -64918 -24191 -65616 -71480 -49732 -39353 -43591 -67137
14990 -67137 -94387 -75290 -43024 -1993 -58782 -50568 -22304 68510 77250 115060 33071 7274
14978 7274 45312 -21224 -46683 -61135 -27309 -1639 -34068 -19608 -4546 55507 41971 -36374
14966 -36374 -36668 11977 34851 9835 -38612 -52225 11141 75727 41893 -5761 -38827 -304
14954 -304 103481 89059 35051 85372 102174 110945 53209 -3235 8203 40782 -14510 -93435
14942 -93435 -42604 -3240 87342 124078 126906 119620 84182 36355 22504 -3766 4264 -24939
14930 -24939 29422 31730 -65211 -96094 -122545 -125420 -86429 -25843 2409 35771 80311 55927
14918 55927 -36363 -53834 -24631 -87501 -72544 -45530 -61772 -124653 -95399 16157 12367 4816
14906 4816 -25285 -64074 -116534 -136639 -125376 -52149 -61970 33136 27460 -38126 -103202 -87653
14894 -87653 -7258 26467 190 -54192 -15890 1164 233 -37786 -38704 -30323 -31193 -65881 -59128
14881 -59128 -75540 -60872 -62170 -8624 1112 -23283 6994 109997 99868 89899 3370 -89075
14869 -89075 -34434 44561 45695 -635 -14196 17757 -62465 -101219 -62644 -85099 -78811 -33030
14857 -33030 76016 165254 65792 -32533 -104200 -166504 -165355 -72693 17333 46748 112057 108526
14845 108526 36045 -77277 -87784 -56180 -69475 -109524 -20553 62220 36141 31042 55454
14834 55454 38039 -42065 -93750 -98548 -84582 -28617 -20020 -61980 -84347 -103551 -135641 -71461
14822 -71461 -13792 -8438 9565 -15065 20758 5746 -41802 -33458 -12146 -24007 -105363 -115500
14810 -115500 -118883 -127131 -104862 -82142 -97812 -69498 -31878 1407 40399 -19532 -46095 -14667
14798 -14667 50999 4830 -21321 14798 -16819 -25558 -27445 -118402 -112000 -82212 -49168 -27221
14786 -27221 20077 103691 145561 113129 52891 41899 25280 -59607 -150579 -124141 -59767 -30942
14774 -30942 -24931 -5817 18337 32745 33403 25335 21859 7260 -40221 -30975 -3307 32624 43129
14761 43129 40372 21076 18932 -11680 -2584 58266 44522 -30014 -76988 -23973 -8964 -50784
14749 -50784 -10753 14984 -18924 38900 37002 45540 95397 13875 -16115 61301 70639 63753
14737 63753 12609 -36688 -64782 -78677 -94922 -55480 -3919 9773 36767 -898 -27628 -7983
14725 -7983 -28538 -19665 -13384 11517 60972 26616 21644 3623 -59434 -142329 -131513 -149578
14713 -149578 -107104 -55231 -74506 -13645 107652 150853 146453 91495 126508 163478 97356
14702 97356 13873 -14363 -41846 -25882 -17709 49 52729 -11612 -30533 7618 59222 80516
14690 80516 67893 -46953 -51038 -55085 -38247 -18228 19367 -46249 -61632 11264 25108 -92766
14678 -92766 -79806 -101723 -108946 -53082 -19863 -18397 -29473 -18804 4937 -23066 21656 -21503
14666 -21503 -54598 16750 82145 96103 92814 83025 54033 -19880 -102751 -189515 -214804 -220829
14654 -220829 -188675 -176023 -136917 -117985 -62191 -49301 -6001 55804 59674 43683 -36837 -31395
14642 -31395 -23407 -23342 -12497 -42181 -81235 -141470 -154899 -126463 -122279 -97321 -148062 -160265 -124794
14629 -124794 -90222 -75171 -9404 36865 -25008 -40546 -34109 -81800 -99888 -75887 -74929 -44080
14617 -44080 -105849 -60159 1121 71861 52727 34816 59320 5972 6628 -9000 -80447 -23758
14605 -23758 -8666 -65232 -44348 -18342 6924 16880 83884 47946 -13632 -6521 50495 13212
14593 13212 -40895 -39832 49722 92348 41546 71264 108970 97209 93935 86107 49393 -6775
14581 -6775 -84472 -79566 9924 74231 32053 -35822 -21543 9804 -30965 5458 17235 55325
14569 55325 119324 86510 127281 223138 134388 113321 101452 66368 -15015 -20919 -34883 -9535
14557 -9535 -30523 -19194 11991 4154 -40175 3174 38602 36070 18452 19880 11704 49223 61516
14544 61516 61213 63559 62443 19974 -23588 -12259 36683 27051 15284 38182 4896 10791 85071
14531 85071 99592 99650 33755 28362 20738 -11748 37717 29138 10019 -48178 -49765 -60044 -61363
14518 -61363 -102506 -33234 -34913 -9273 72951 56913 -43173 -25055 -911 -14193 -85889 -70659
14506 -70659 -15964 67763 32088 10356 43748 68223 7493 -25989 -26498 14103 34207 53165
14494 53165 33052 -16393 -10196 19325 39586 31837 40653 73369 78009 34014 28221 68869 104213
14481 104213 107540 82751 156828 195680 121462 90036 86785 71412 -18451 -66727 -2264 86968
14469 86968 143773 137137 81418 32385 -29585 -50072 -67577 3731 62911 82988 103977 54863
14457 54863 32272 51531 80463 95163 29645 33102 66973 105527 75811 28858 -4394 19872
14445 19872 111201 133958 147083 86164 34136 87241 93623 63662 7769 100911 118303 56076
14433 56076 122136 73794 -39314 -65327 42503 19139 -32140 -26828 7614 28315 53507
14422 53507 84837 100458 33780 48550 39662 53851 106000 96139 87578 52297 44370 14764
14410 14764 10093 -12022 -54311 -6626 48278 35366 -45690 34538 52850 76721 69934 21030
14398 21030 42095 54087 13586 40954 43137 -16916 -52626 -131941 -121547 -113842 -83744 -60445
14386 -60445 -65621 -129149 -135242 -79930 -26089 -21083 -22443 -46375 -51613 30156 23582 -104226 -113900
14373 -113900 -37695 54940 1127 2878 20987 -18770 -30207 21527 47822 35682 48327 82152
14361 82152 35212 -22678 -48472 -90125 -118566 -122306 -99883 -87223 -36167 45998 35471 73484
14349 73484 127179 128072 111289 152018 199601 132712 33659 26827 8711 66072 18116 22306
14337 22306 66375 69095 96949 112231 73557 -28755 13927 47734 65493 98325 107276 119086
14325 119086 146476 203133 183882 155571 139646 70302 54181 64290 16729 -16284 -15988 34023
14313 34023 40448 76727 103037 110784 101881 32044 -4959 15124 64327 114613 98137 37030
14301 37030 52396 76414 119720 68625 58791 117170 164144 89628 1219 54564 91903 105408
14289 105408 54893 -6393 2368 -4295 -52341 -148366 -116106 -51828 -30350 -96080 -85781 -53501
14277 -53501 -30907 17637 -29127 -50729 -3951 10890 49806 95420 120488 150378 153772 105087
14265 105087 40486 18163 -23139 -66649 -24859 -20229 -34904 -30363 -133911 -174242 -88894 -49676
14253 -49676 -77855 -52372 -35237 -81116 -118659 -115364 -68417 -51803 -28227 17521 8864 -38722
14241 -38722 -61501 -46528 -88711 -99214 -59511 -64961 -1610 33648 69571 49889 66857 101875
14229 101875 175113 132559 2373 -21700 68228 113954 50238 -21968 6428 15637 55094
14218 55094 -9185 -9693 48490 27222 -25873 -9196 25204 19922 72865 108864 36376 -11292
14206 -11292 -41037 -85136 -129380 -126163 -33530 -32472 -1658 -12058 69887 88685 18153 -6260
14194 -6260 438 -18529 -69554 -84152 -71121 -707 10903 41016 33220 -13608 40916 75299
14182 75299 2044 -82365 -71258 8079 39815 -7532 -54439 4596 49903 98185 90847 70208
14170 70208 50433 74258 55996 -7986 -44458 -44459 9424 -23041 -10842 -14689 -13043 47278 48107
14157 48107 -27408 3127 103950 78688 66905 108254 124402 134915 117827 38791 94518
14146 94518 84590 33552 -10608 47066 78368 5375 57433 68182 50087 1235 35687 85498
14134 85498 138885 139216 35680 -49533 15718 70936 59984 84099 90383 70286 -68355 -68824
14122 -68824 -42949 -25379 -2668 48452 39498 46465 42094 59804 76563 85191 -14546 7998
14110 7998 85570 88141 51217 23962 -3119 14693 -12704 -50584 -70503 -114569 -34427 17380
14098 17380 -9499 -20564 -56381 -45724 -4021 383 -2513 58843 25755 -6782 64161 36213
14086 36213 43870 90004 92276 135021 127068 129539 137092 80672 66770 33645 -24182 -36004 62877
14073 62877 49366 54656 51095 97244 171010 133710 43734 -57939 -50273 2461 7788 -26019
14061 -26019 12039 50663 117796 122841 105206 61185 10032 961 70203 79816 50310 -1406
14049 -1406 -25572 6935 45345 101899 210653 217297 120734 73629 89071 20018 -1983 112487
14037 112487 103974 109618 68388 91220 48698 8858 -49333 -87302 -84053 -29617 -28941 -74157
14025 -74157 -67608 -51892 -52534 1495 11299 36085 56492 5671 -13473 62796 85119 29514
14013 29514 -78742 -144664 -89690 -45132 -68184 -126140 -86126 4810 53188 131104 68771
14002 68771 26540 35474 95511 76671 65429 87999 14588 -2040 63877 88578 82397 28511
13990 28511 14820 19443 -33843 25985 39547 15699 368 -26012 -47893 -55274 -65006 -30681
13978 -30681 44341 46939 48910 93533 94194 92654 88608 93893 117258 52458 31530 6433 15477
13965 15477 43926 82556 3783 64983 143185 204999 230434 200106 143989 98945 47845 27624
13953 27624 80247 97270 87006 98971 82646 82144 72941 84068 83931 16464 -27657 28489 34982
13940 34982 58970 64735 57384 14954 87427 24949 9976 33320 38970 113053 99971 7920
13928 7920 205 122868 122467 91676 29750 10057 72487 93080 92304 68869 55253 19552 -9264
13915 -9264 -71461 45498 136092 147676 115323 158319 165259 89750 80671 56956 64648 38086
13903 38086 37151 95823 74543 14234 1899 -47119 -23589 -2813 -23157 -37910 17243 94353
13891 94353 64449 22901 -17430 29477 -18737 21200 75234 121648 128886 102179 158436 126105
13879 126105 82954 -55601 -80556 -139127 -125963 -53347 -60486 9183 39577 117824 167783
13868 167783 78943 -4631 -45165 -32611 -41141 -110071 -77414 17631 75249 62159 79412 56919
13856 56919 52233 120561 85756 37002 -979 -20781 -62937 -33481 -18488 26583 32571 38197
13844 38197 -33253 -16540 60174 55367 11823 -69934 -74341 -67702 -46989 -3708 21934 61654
13832 61654 65168 59301 93800 121830 174740 170816 175818 100413 97952 102236 85428 76061 119530
13819 119530 122893 137258 130259 47868 35848 17497 -54061 -56918 -45668 -72336 -59983 12971
13807 12971 15444 -4321 -15914 -17183 -41488 -50872 -73542 -58327 -1629 31948 -51407 -9187
13795 -9187 -13376 16958 75120 19613 -44044 13608 66435 86188 84756 80256 164510 217762
13783 217762 243025 230280 173085 64348 3067 -51028 -18251 -7596 -11286 -8466 -3150 -11925
13771 -11925 76355 50524 7226 -66409 -10548 31404 76754 30633 -61203 -64167 50989 20868
13759 20868 17965 57178 22158 -76228 -77607 -55952 -30640 12709 64437 120838 147026 144828
13747 144828 169615 130045 110244 115571 117493 132178 147916 200620 157654 75807 47853 61623
13735 61623 79936 122778 146376 111227 112149 191286 220933 214926 195993 236081 252383 200929
13723 200929 123201 149994 201893 221505 319743 319807 319444 354932 429654 584330 729283 905684
13711 905684 1098986 1150340 1120714 1007853 851104 614392 522345 462069 417040 333958 275720
13700 275720 239151 260380 260877 229379 195477 189250 183478 176378 187471 261751 338467 378828
13688 378828 403989 373130 317867 338676 474676 593419 556945 582173 664179 890204 1101293
13677 1101293 1377268 1737027 1932235 1984526 1799245 1651105 1464434 1172248 927051 775257
13667 775257 632222 534208 538671 459432 422372 291124 234710 255331 276830 264821 218606
13656 218606 261629 348652 408729 388642 369024 291450 284903 364813 352195 342533 314248 296145
13644 296145 448974 593948 744735 954255 1111859 1226905 1163547 977935 821638 729414
13634 729414 600792 419626 360841 268061 239965 279503 268440 213622 208317 176019 119258
13623 119258 113467 89026 93359 107148 148297 168471 152214 160073 159102 134288 87072 136274
13611 136274 178401 205282 175760 220602 263697 189511 153784 169362 173700 132595 162014 150088
13599 150088 213241 268560 215545 154275 178220 214520 195376 197944 144674 146273 183299 151830
13587 151830 188416 222411 207005 237334 177554 124358 127402 161001 223927 270197 219720 273460
13575 273460 305132 276112 326961 330525 286283 192583 129746 162454 234269 222646 158123 246813
13563 246813 280612 275018 304485 287540 251363 281915 363542 406156 443727 491758 580098 596052
13551 596052 516545 432285 282159 147196 1878 -12420 12444 13941 -105281 -90558 -54128
13540 -54128 -5977 128678 175818 173922 181833 240848 325996 276360 326203 305301 210654 249733
13528 249733 294429 338654 343139 344681 389260 389911 411645 477360 576378 707557 730006 715434
13516 715434 690931 636233 495791 382609 174568 21847 -88870 -157398 -145497 -187226
13506 -187226 -239598 -162389 -56639 -44255 44165 64930 93021 72056 27133 -9374 12670
13495 12670 29926 95739 155930 215387 196234 169283 205359 252096 309041 308329 358800 351319
13483 351319 396969 394843 392205 358249 359627 301790 202904 113492 64046 75281 18217 -62921
13471 -62921 -132596 -117374 -70896 -47980 -34350 -30588 -87415 -111329 -166626 -109349 -50036 -81676
13459 -81676 -45531 31582 32570 16947 87902 172249 132582 139199 156169 160375 185268 180762 73623
13446 73623 66911 41136 64864 129072 114511 113189 164322 178977 143682 88189 41387 108590
13434 108590 178985 146111 122186 150466 129800 73846 58556 35641 85609 155941 213529
13423 213529 165932 132650 176246 260685 273754 247315 228508 277637 238238 295041 322581
13412 322581 312307 234892 139199 88492 115296 130015 88799 103435 109438 113766 155409 262462
13400 262462 338564 269865 207911 207648 271741 244003 176461 142443 188667 224210 190760 214219
13388 214219 192742 195341 286822 280483 207703 338841 384539 360323 335039 299575 251294 214270
13376 214270 245563 252547 315454 276662 303311 340829 393216 428069 407649 392330 349054 351018
13364 351018 359956 314822 359568 409226 415682 437986 483162 522436 541392 522678 517894 542209
13352 542209 580638 558860 542336 535257 533559 542409 546890 603666 729676 726281 625187 549227
13340 549227 547470 626141 641642 642389 617596 652036 712986 696007 695722 730775 695440 748735
13328 748735 804325 873093 978561 1109674 1217888 1323562 1384526 1413082 1407615 1345325 1317678
13317 1317678 1300410 1186929 1125050 1230078 1291642 1279431 1349990 1315984 1191866 1147316 1177284
13306 1177284 1240332 1256608 1280179 1326981 1386519 1427950 1549671 1674611 1808490 1940878
13296 1940878 2039072 2187827 2317263 2382682 2450902 2521646 2647413 2808847 2990303 3289950
13286 3289950 3553624 3837532 4092791 4242152 4431281 4566978 4751592 5071723 5438674
13277 5438674 5939273 6593098 7305821 8185921 9274493 10660100 12390355 14641668 17568396
13268 17568396 21345798 26255606 33008268 42564280 56446814 76914196 105578864 140663817
13260 140663817 174084205 194093877 193756357 175809084 148435435 119403300 93674895
13253 93674895 73292310 58230818 47382572 39859580 34904619 31510538 29055147 26798025
13245 26798025 24660341 22902762 21554160 20650274 20277123 20462766 21225538 22436344 24194051
13236 24194051 26666254 30078191 34668355 40729333 48850224 60008305 75514957 98001177
13228 98001177 131529726 180365403 245378969 317366200 376014826 400963345 385483759
13221 385483759 338756075 277531866 216979334 165533221 125706084 96400963 75293986
13214 75293986 60241542 49380293 41426489 35409848 30799402 27306703 24730966 22924138
13206 22924138 21705496 21028350 20806127 21150219 22165274 23770510 25711196 27837947
13198 27837947 30113128 32938128 36839625 42560133 51133367 63928200 83039757 110470091
13190 110470091 145527479 181468781 206013274 209462906 192268247 162857421 130207716
13183 130207716 100509672 76572424 58563305 45269914 35577147 28590066 23463415
13176 23463415 19554097 16453942 13920392 11921254 10308307 9064501 8147635 7351631
13168 7351631 6665910 6074697 5579225 5175354 4821023 4574323 4309010 4071850 3764240
13159 3764240 3547543 3324027 3176144 3020288 2869771 2793661 2686507 2566120 2419176 2283397
13149 2283397 2146823 2108815 2053658 2075356 2153410 2132559 2209291 2352919 2389714 2308888 2292941
13138 2292941 2186696 2030582 1874139 1794019 1721274 1694046 1646182 1597128 1609306 1602053 1565615
13127 1565615 1437121 1393557 1391400 1374194 1369607 1349804 1297989 1252659 1199327 1157751 1142227
13116 1142227 1168878 1157054 1161648 1216061 1297957 1414645 1625443 1764853 1855404 1956749 2007578
13105 2007578 1972339 1837356 1766236 1681040 1495286 1343973 1245018 1135694 1030178 1000806
13095 1000806 951923 872624 837171 822113 807628 853517 936425 966736 887445 862565 870368
13084 870368 881888 876095 892449 786456 738083 789231 869591 975427 1110804 1241160 1315765
13073 1315765 1316269 1200667 1129055 1146943 1111739 1087880 998492 941217 884540 790727 643484
13062 643484 670182 717115 662629 637008 618343 619733 624709 614794 589787 628996 676874 666107
13050 666107 613748 530550 500658 528947 538591 491496 492742 530575 586577 534275 522516 569691
13038 569691 617271 644626 713695 705834 649202 485620 381105 389239 359863 393079 504937
13027 504937 561852 642279 647699 629225 653933 665043 658262 638173 669357 729469 750426 829985
13015 829985 815170 761634 813320 897386 1043267 1236435 1494694 1712725 1996370 2247824
13005 2247824 2388721 2451328 2378155 2192690 1950922 1650099 1484303 1387508 1327681 1240496
12995 1240496 1147268 1198952 1183546 1105897 1171810 1272532 1272986 1379496 1494548 1649787 1784731
12984 1784731 1891764 1940164 1965711 2082400 2211224 2263958 2297844 2346037 2415679 2371743 2311960
12973 2311960 2303600 2337951 2337083 2235414 2038912 1858037 1762156 1643294 1476745 1343155 1280574
12962 1280574 1245936 1143531 1116922 1042710 1000403 1056164 1065755 1052248 1032990 1062100 1168345
12951 1168345 1357092 1507042 1645806 1926768 2202498 2373106 2498016 2411480 2168525 1922216
12941 1922216 1708658 1568957 1500572 1468635 1359412 1163525 1036644 863526 660071 441779
12931 441779 148983 -18484 -61119 -18007 -41962 -35927 3551 -6630 -3969 104019 210690
12920 210690 237205 326994 324184 292689 341325 399323 348920 321601 329645 366950 386385 369818
12908 369818 368971 442649 431334 450102 526192 552867 503357 588430 588093 540012 371068 207440
12896 207440 132645 160573 236036 192750 198909 204457 216052 262834 278941 263640 209392 241168
12884 241168 260814 308358 341545 319099 259819 253030 226357 251796 363002 438484 468472
12873 468472 468511 426589 313387 264981 290294 439009 501579 502941 554699 604736 610241 617354
12861 617354 527760 511354 591881 584923 591331 620905 668728 693996 697619 753404 708989 758853
12849 758853 817995 824169 756748 611809 475258 433937 385684 355102 338338 304725 360473
12838 360473 347182 342631 403061 510825 561385 586149 607322 623829 696960 723723 716842 725198
12826 725198 728902 785627 872608 870416 863264 802316 752211 682790 598837 565801 579531 412731
12814 412731 347093 440141 432597 364352 305240 314663 398035 395023 353245 361107 555524 797880
12802 797880 952431 1075922 1192361 1333068 1304654 1227220 1135969 1055776 950390 903746
12792 903746 885867 854243 795830 784731 698793 631008 455328 245908 146145 101549 31218
12781 31218 -34656 -52221 50784 151121 238803 316573 348981 284018 249993 380581 532075
12770 532075 664395 843106 1017440 1176793 1455832 1838494 2045934 2066600 1965459 1747942
12760 1747942 1502003 1217279 905978 750360 716455 628133 577820 581220 559707 575952 568393
12749 568393 536876 522971 467235 447428 490981 549532 480207 406162 422152 394833 392875 400778
12737 400778 467680 497223 523899 585861 721497 818721 960936 1147768 1277655 1379250
12727 1379250 1270893 1154402 1042017 947896 817451 726239 672437 599578 592427 593579 579595
12716 579595 626023 670207 649494 742022 746397 638558 605748 650475 634470 626412 600536 555423
12704 555423 572997 606594 601988 569813 573134 581285 584815 570009 613268 698414 698113 718286 746073
12691 746073 757960 790768 782051 842514 882692 949996 984083 1002214 979878 1002984 969304 936351
12679 936351 954154 982415 1030051 993907 1063194 1112845 1154327 1173288 1283525 1291424 1276330
12668 1276330 1251475 1145480 1098867 1132105 1164336 1147397 1100513 1123728 1196899 1131783 1048331
12657 1048331 1029788 980873 934019 981791 1048731 1064934 1044626 1138170 1132353 1105340 1140801
12646 1140801 1112316 1102538 1112670 1104876 1128931 1158621 1189498 1147015 1176565 1144472 1177463 1345092
12634 1345092 1369647 1344672 1329796 1373514 1365317 1366957 1400148 1460657 1486061 1593171 1596886 1522168
12622 1522168 1551990 1634297 1752570 1793101 1871401 1920898 1926338 1932033 1867491 1883511 1900074
12611 1900074 1900423 1926932 2060659 2136428 2232334 2319235 2403869 2520061 2567077 2651214 2778656
12600 2778656 2877626 2870981 2938692 3150800 3338757 3552349 3790283 4046486 4329711 4544410
12590 4544410 4687382 4882338 5072242 5310278 5593153 5921871 6248069 6628393 7086972
12581 7086972 7692725 8415871 9241617 10190245 11226061 12389913 13727842 15291554 17008400
12572 17008400 18887771 21041677 23542790 26460123 30045773 34490766 40348785 48208302
12564 48208302 58914942 73582964 93860156 121657441 158909525 206348957 260435331
12557 260435331 311181435 344091427 349650244 329957397 294003520 251536937 210626360
12550 210626360 175874760 148779033 129139194 116118126 108715445 106147720 107737665
12543 107737665 112997466 121656828 133222336 147062598 162156061 177654687 192946755
12536 192946755 207587180 221783543 236058028 250955533 266782585 283580855 300738545
12529 300738545 316973354 330446370 339531905 342882116 340112005 331696925 318957991
12522 318957991 303708499 287654818 271972185 257427248 244310102 232435758 221212646
12515 221212646 209733214 197595094 184508265 170818684 157088125 144123732 132646689
12508 132646689 123463026 117211937 114395656 115724571 122040582 134306615 154094685 183006818
12500 183006818 221659784 268144261 315828838 353393964 368569559 355961403 321083173
12493 321083173 274417139 225424648 180731634 143232148 113426295 90405600 72949749
12486 72949749 59977711 50208717 42749506 37033686 32623312 29094730 26160979 23758132
12478 23758132 21752816 19966830 18389254 16905039 15723768 14697016 13839792 13157499
12470 13157499 12500356 11955767 11465319 10896690 10405826 9986983 9621674 9155287 8760393
12461 8760393 8395823 8023504 7682509 7358380 7029884 6770243 6515458 6250592 6002236
12452 6002236 5801277 5738260 5708232 5643148 5617959 5684709 5888122 6010855 6148919 6296956
12442 6296956 6356640 6342869 6109454 5833902 5551257 5245877 5020523 4782576 4575622 4379852
12432 4379852 4193375 3981469 3856975 3827328 3781194 3688020 3630518 3507369 3417656 3327917
12422 3327917 3306969 3267899 3246762 3205846 3118590 3120275 3035226 2967661 2931584 2920924 2867824
12411 2867824 2851469 2837548 2783014 2763273 2780334 2776814 2794349 2768443 2692678 2594032 2531152
12400 2531152 2518493 2471929 2449453 2476665 2497097 2499552 2478112 2440381 2513366 2621622 2682779
12389 2682779 2704151 2665960 2669266 2781427 2719138 2607933 2477147 2414358 2357023 2384385 2305095
12378 2305095 2168018 2029951 1925598 1811461 1758668 1714934 1668489 1563497 1514460 1457948
12368 1457948 1441520 1397025 1361672 1281932 1263692 1223055 1181096 1148580 1112156 1083570 1038520
12357 1038520 1109041 1118347 1085585 1067174 1041384 1027457 1031284 1108467 1067114 1011274 941651 969622
12345 969622 1019053 1022807 924975 866147 859112 853150 772905 728074 746201 753611 727948 725148
12333 725148 697297 674059 723682 797976 819064 826431 863390 902376 870344 804640 781162 767385
12321 767385 775601 827838 860906 866823 961525 895338 833391 883278 932339 959173 950357 969056
12309 969056 953242 911437 920810 893344 848079 822546 870895 941465 909007 1021893 1206022
12298 1206022 1383900 1477798 1609701 1812016 1996126 2129329 2137410 1989651 1817093 1626883
12288 1626883 1575283 1500094 1360283 1387095 1410767 1400902 1407164 1323255 1262350 1281780 1430483
12277 1430483 1563429 1617496 1649708 1689558 1752811 1714511 1749255 1811560 1798491 1861585 1923501
12266 1923501 1839212 1705131 1593094 1499275 1461456 1451307 1406127 1369481 1267931 1159199
12256 1159199 1128784 1181829 1141613 1181761 1233420 1227645 1263355 1281560 1215002 1082931 1065932
12245 1065932 1053427 1017777 945089 922223 1001860 1096190 1112155 1156261 1330707 1416468 1480365
12234 1480365 1498808 1425935 1258579 1033287 847766 655105 510934 386399 214117 114677
12224 114677 82626 85917 124819 111904 85796 137797 184593 170455 175352 163270 219226 320032
12212 320032 427453 407122 294673 258670 190519 113539 -6507 -127117 -247331 -330474
12202 -330474 -378170 -419308 -442522 -445712 -435355 -343361 -265750 -276459 -156962 -101959 -185265
12191 -185265 -105065 23766 53703 25528 -15476 36399 41055 -34930 -114105 -145885 -90392
12180 -90392 -91417 -179372 -231782 -146667 -18742 -42587 -109498 -79197 26628 72418 41372
12169 41372 70372 100302 19193 -38668 -42075 8671 13845 -30016 -123021 -139567 -51674 -11437
12157 -11437 844 -39387 22803 26508 -13877 -6342 14277 77067 67264 -12220 -1302 -13240
12145 -13240 -24739 200 72532 77125 48267 37500 75178 14749 35407 36928 4880 28388
12133 28388 80414 149221 215566 222694 159148 98883 84273 88629 128892 126752 142074 125784
12121 125784 78070 112337 235660 278714 314337 313780 302981 252263 276344 309439 375334 414072
12109 414072 422415 424896 548730 651992 773817 917067 1087533 1343034 1577170 1743044
12099 1743044 1878479 1914100 1769521 1577240 1408577 1304907 1114601 907187 798866 773774
12089 773774 710460 722605 793635 830763 852536 889325 967574 1015448 1129571 1197110 1294551
12078 1294551 1365414 1411150 1521985 1606428 1695478 1717920 1819417 1822948 1851707 1917284 1822084
12067 1822084 1693623 1658319 1622002 1492526 1416160 1367155 1383637 1320167 1228517 1157384 1171029
12056 1171029 1121619 1086591 980590 835065 691604 707185 752727 725712 726493 811408 940047
12045 940047 1075055 1247855 1413615 1656093 1886847 2058286 2058399 1862433 1630094 1381558
12035 1381558 1153582 947745 699159 545299 436778 374276 324464 318730 230396 172555
12025 172555 212073 201907 194378 228413 242222 168395 67334 96059 151680 173622 132006
12014 132006 140998 154066 186265 209783 232242 216949 216561 249875 196629 169982 116881 142435
12002 142435 177197 204908 214592 182064 132848 187093 218302 137199 120433 115114 25011 11317
11990 11317 2577 1712 29095 17296 26766 90591 155816 217062 192395 190647 161258 184400 134656
11977 134656 69536 90218 54161 16228 16950 -6166 17513 81561 89042 18092 -39247 43047
11965 43047 39853 99434 66030 44917 93686 125841 142885 156301 172298 186438 94722 28661
11953 28661 16892 29403 56543 8293 -11858 -45519 -88436 -66362 71178 137334 47671
11942 47671 -38196 6542 35648 936 -91285 -56154 20299 91633 106098 92660 32303 -37046
11930 -37046 -69098 -86735 -54942 -34487 14695 43874 92942 121791 117781 70880 45939 78438
11918 78438 105067 170309 161261 89107 28734 -26970 -28573 24402 28026 -41273 -20145 12835
11906 12835 112528 114074 150412 75288 26882 85186 70859 123135 77221 64794 87532 147398
11894 147398 156612 131474 101234 40496 52261 79819 91649 112633 111546 84371 154663 169214
11882 169214 165068 133907 102263 24801 44074 88262 9194 -44613 -20813 -28181 31029 42065
11870 42065 61697 119405 100729 105138 105698 91160 26424 58979 63255 116515 179623 149562
11858 149562 137251 119320 131855 162313 175864 69144 -47183 -23303 -40636 2467 25881
11847 25881 42569 74567 75302 91363 127429 187196 212204 137232 96751 33913 38749 65396
11835 65396 52442 28211 -21654 26180 25636 57579 16133 9059 102056 120016 93439 42455
11823 42455 61304 135234 206577 215849 176607 80010 18243 4528 -14540 -83900 -141285 -58156
11811 -58156 93090 180866 254053 290964 220888 230341 208135 206367 155303 96440 73587 140489
11799 140489 165939 130194 129775 85507 124532 82150 56875 19487 5646 73474 74096 66999
11787 66999 167217 169498 137247 91829 60436 111860 173468 195735 144078 164384 196520 144804
11775 144804 165372 147022 55734 25565 132729 189187 171363 117686 148840 202299 152358
11764 152358 72974 -702 25175 86547 128644 126597 167860 247454 235437 120482 50599
11753 50599 19398 51550 73125 79365 59934 127851 167690 141738 131046 133971 143195 103514
11741 103514 122798 100239 116820 69968 52876 73335 107065 19095 -12648 29243 108961
11730 108961 225026 195618 171063 165709 158623 166546 175347 184388 184451 229679 223953 232179 288482
11717 288482 236218 150974 116527 91349 30752 38212 106242 75665 121837 139359 101059 166470
11705 166470 214595 176223 175805 208363 218106 214395 237402 170994 156389 125976 172229 151816
11693 151816 108812 74702 66501 88753 113526 160993 144512 158961 153980 117668 135791 94544
11681 94544 59082 23765 -2023 81685 122765 151274 80977 15764 11621 39030 185287 174137
11669 174137 115917 43797 35196 193281 264007 251663 269052 285468 270108 259505 265608 138512
11657 138512 104120 123413 139786 114436 89263 65939 91064 117309 148535 127493 86370
11646 86370 90902 140250 144666 160774 196004 179207 163944 127009 157277 173099 154666 116985
11634 116985 126388 144389 112251 157087 204200 233598 169247 155554 197536 180751 166275 122985
11622 122985 88534 102086 65471 62963 131011 206775 289523 291594 253853 157518 108355 224906
11610 224906 253954 253209 233351 220326 150270 149403 90422 34275 86797 117035 117210 177383 195750
11597 195750 181774 209185 183830 146470 205963 173331 148816 136178 119039 162050 114818
11586 114818 102021 91533 149060 168729 143939 184595 133474 144153 213154 125033 40766
11575 40766 7770 -5848 -5529 128391 199894 193355 192363 185603 227355 227068 201808 192324 258355
11562 258355 192978 142796 182349 174845 274197 407844 478463 475581 492944 533071 513681 588200
11550 588200 699679 867664 1056983 1201918 1204715 1036196 900979 784954 671965 563191
11540 563191 469957 450754 455828 418276 368298 358148 387643 399143 420478 415141 378780 351893
11528 351893 374622 357353 333063 290389 295933 362593 479733 470212 498510 592947 671129 791483
11516 791483 964003 1199950 1532621 1851693 2153008 2270798 2159146 2002046 1733217 1451320
11506 1451320 1195865 951487 782698 694252 626658 513536 396717 395533 437586 379594
11496 379594 365079 288298 216481 232316 202989 218036 263926 302008 281769 249612 320416
11485 320416 358734 362500 384575 437271 451217 566617 703933 977001 1199150 1252658 1202895
11474 1202895 1116185 994426 859817 739610 640345 548316 484943 397947 429614 434993 332254
11463 332254 322270 281887 296563 238047 269683 323535 324722 367829 359587 360315 342272 361151
11451 361151 355867 309840 348296 388787 393383 355364 325092 350712 329636 384211 501956 548939
11439 548939 532510 456504 428046 434968 385216 435056 440520 430170 458848 472765 495707 528550
11427 528550 558672 526132 557401 621146 669428 719547 634941 528212 440995 329929 198060
11416 198060 187471 164347 179142 182266 177489 231663 304626 331909 305109 388300 425248 459286
11404 459286 470547 499098 459119 403084 433036 509319 546125 515228 550939 572448 587976
11393 587976 655894 726504 802723 878536 853818 849433 853686 850085 781585 581830 345819 152797
11381 152797 29609 34218 31426 47615 -9083 -51904 -8533 82524 141879 166953 228031 181353
11369 181353 170360 160303 140288 214859 265237 288066 360257 439172 465793 451781 525340
11358 525340 430152 408043 360055 378718 404514 432363 513469 517342 497482 466905 404411 266561
11346 266561 212971 150742 31559 22879 26079 25368 88486 152556 165484 137379 82392 59733
11334 59733 74970 72703 58160 116123 106891 99581 114930 218919 318048 363489 387618 346380
11322 346380 302251 317815 389161 450678 482295 466671 398011 361985 297606 313413 336703
11311 336703 410607 438079 438629 403751 393200 384552 395568 372228 384783 403490 360534 291914
11299 291914 313632 319958 286513 280050 351435 359077 397296 384988 359164 364337 390223 474929
11287 474929 562014 621292 617697 624460 611526 526835 472289 428592 447946 488389 460507 506153
11275 506153 495871 552680 498277 489135 516270 503000 511925 459508 509824 469880 440575 392311
11263 392311 385379 451765 496989 502548 515677 549272 586088 574420 561383 697399 829123
11252 829123 845364 766287 733290 765226 798880 761094 694645 624830 577650 607146 670037
11241 670037 709992 712660 717185 741034 707524 654828 685422 683267 670484 685457 723908 686907
11229 686907 666694 635345 695703 699105 694270 683580 690101 669953 686045 748319 825380 861490
11217 861490 971513 895007 834408 851621 858904 880435 810584 832855 853128 845678 920080 895112
11205 895112 811915 783580 774411 784421 941147 959799 1006781 1045686 1058812 1074830 1075278 1148519
11193 1148519 1314080 1432247 1523862 1581392 1556529 1428656 1418411 1433914 1365208 1322255 1324712
11182 1324712 1433727 1559604 1577914 1611253 1677052 1773565 1846256 1921606 2034805 2182206
11172 2182206 2310671 2462903 2603879 2784611 2912739 2946023 2990010 3053731 3105717 3202891
11162 3202891 3351776 3419854 3569956 3809970 4042283 4251089 4535028 4861400 5178628 5626506
11152 5626506 6164195 6788822 7515269 8318229 9190864 10161968 11181402 12367977 13485190
11143 13485190 14569679 15848595 17542405 19945747 23221260 27500355 33626659 42562753
11135 42562753 55726256 75308510 103804762 141802920 182875470 211940912 215826816
11128 215826816 196784331 166010017 132880491 103371109 80149812 63121741 51131540
11121 51131540 43144607 38121703 35056930 32747817 30711414 28952470 27449564 26209858
11113 26209858 25415993 25167003 25656112 26713744 28032136 29567772 31355105 33612098
11105 33612098 36773738 41265957 47613518 56657468 69829836 89623749 119858461 165528678
11097 165528678 229685662 305879267 373983698 409110987 397713851 349068563 284874923
11090 284874923 221427245 167586742 126296649 96344696 75047771 60150895 49857409
11083 49857409 42645757 37531590 33935214 31336501 29228772 27307103 25748703 24666022
11075 24666022 24116643 24108746 24766416 25909907 27128937 28183949 29260619 30836278 33435879
11066 33435879 37719830 44490344 54944892 70920458 94605322 126927727 163905851
11059 163905851 193347459 201354564 186245214 157865243 125736890 96165700 72406050
11052 72406050 54792757 41963530 32775599 26406999 21994207 18787301 16364032 14552375
11044 14552375 13195372 11940685 10679492 9478487 8436005 7510051 6715921 6110877
11036 6110877 5623507 5270702 5001254 4772394 4517406 4266789 4095699 3903827 3739532
11027 3739532 3581483 3411415 3245883 3176577 3027958 2898040 2731597 2413025 2220587 2198495
11017 2198495 2150931 2050738 2021576 1995540 1901637 1896639 1980189 2056157 2072252 2040221 1991468
11006 1991468 1949601 1887400 1894714 1952069 1949711 1995357 2163358 2144154 2104531 2159133 2233355
10995 2233355 2290089 2268648 2169400 2037104 1876881 1716316 1592813 1515558 1343861 1176819
10985 1176819 1144826 1163449 1196798 1192807 1137761 1144840 1113339 1075634 1074106 1082765 1027285 973221
10973 973221 1010541 1086206 1154366 1174262 1154534 1209140 1227402 1222459 1194976 1316706 1390132
10962 1390132 1384510 1398152 1366697 1304155 1105785 970117 841166 779185 708636 734351 743023
10951 743023 822633 816265 842465 865876 859868 822962 857377 909213 908726 822678 754385 726344
10939 726344 686710 649549 661637 775570 811778 725313 746202 800306 855406 793067 776012
10928 776012 850863 922113 933377 942499 927624 894048 872273 905425 871141 806155 768839 762050
10916 762050 789073 836878 780552 796238 829086 845186 841967 869124 819329 760581 664405 642995
10904 642995 616624 632428 694582 742486 693856 652024 719770 766497 837935 844954 829337 884972
10892 884972 931277 954008 987722 1011019 1023476 1025169 1075498 1094276 1046468 1016182 1120209
10881 1120209 1122600 1099871 1105045 1061934 1021678 1070089 1138186 1200367 1153251 1094071 1156240 1180972
10869 1180972 1281813 1323128 1307936 1271391 1253628 1263153 1273294 1277221 1321717 1346695 1413354
10858 1413354 1447381 1470030 1491978 1554477 1611350 1690477 1779614 1953937 2144136 2197683 2301373
10847 2301373 2335107 2433942 2517351 2527226 2494414 2449585 2386397 2240215 2020422 1889510 1834109
10836 1834109 1773976 1683343 1704148 1697568 1671114 1677763 1682895 1768105 1743483 1723590 1789986 1888411
10824 1888411 1997136 2051952 2097009 2143377 2201818 2208326 2177299 2212487 2309365 2429462 2436683
10813 2436683 2416055 2454845 2497136 2614313 2751743 2824999 2859155 2803833 2669697 2494188
10803 2494188 2320475 2114545 1994259 2042856 2102936 2103926 2174361 2389142 2503099 2594577 2721374
10792 2721374 2830658 2891654 2941455 3051230 3139534 3261968 3347288 3550592 3736012 3802150
10782 3802150 3856140 4018578 4198384 4318107 4422789 4582690 4751907 4903813 5109937 5397489
10772 5397489 5615074 5777272 6000405 6201068 6399479 6664761 6950689 7261171 7669270
10763 7669270 8071586 8467578 8943806 9440859 9908649 10546559 11252862 11994946 12830757
10754 12830757 13850885 15005459 16324152 17795117 19440519 21254921 23159084 25355099
10746 25355099 27937115 30826110 34265729 38366938 43315285 49505059 57208479 66960334
10738 66960334 79225049 94795852 114652250 139626531 170095619 205300511 242031306
10731 242031306 274594238 296621861 303811361 295966698 276489730 250260784 222167117
10724 222167117 195755663 173227965 155654981 143142804 135873526 133431344 135716668
10717 135716668 142412465 152915876 166079450 180043429 192807166 202410580 207857340
10710 207857340 209529324 209153002 209133891 211935087 219262560 232132897 250197607 272377163
10702 272377163 295845232 316437261 329663025 332545711 324642593 308194877 286863546
10695 286863546 264639284 244938590 229822814 219970950 214865493 212610024 210661311
10688 210661311 206745079 199606642 189130447 176342588 162759051 150070681 139497611
10681 139497611 131955042 128018284 128043258 132311251 141047878 154457440 172756906 195313217
10673 195313217 220475827 245039850 264410399 273877142 270584939 254992738 230532830
10666 230532830 201806165 172654274 145567258 121892175 102069953 85881280 72716395
10659 72716395 62076176 53497894 46545691 40911191 36282882 32384286 29052247 26245816
10651 26245816 23768379 21637231 19749021 18101699 16688443 15486728 14466828 13524449
10643 13524449 12700741 11997148 11378703 10913772 10504683 10067087 9802600 9560796 9225334
10634 9225334 8837029 8336552 7914529 7434999 7032639 6714005 6421870 6199300 5911168
10625 5911168 5607514 5415770 5218398 5044406 4850943 4759908 4636007 4481912 4382540 4356075
10615 4356075 4257144 4168967 4123583 4034848 3896734 3891549 3917069 3878226 3742303 3690895 3594163
10604 3594163 3504064 3449379 3470638 3556278 3601376 3608884 3647714 3756887 3887081 4205333 4721990
10593 4721990 5533426 6653169 7544406 7846965 7383533 6539777 5627336 4783551 4214692
10584 4214692 3770364 3455289 3229479 3110485 3085712 2958543 2836033 2787109 2774854 2797458
10574 2797458 2855044 2938902 3012774 3009072 3111416 3283469 3482413 3522116 3555164 3577692 3484744
10563 3484744 3347275 3220955 3123478 3053805 2977987 2909547 2915507 3017928 3062746 3094623 3123263
10552 3123263 3246697 3371064 3417352 3421577 3407939 3347258 3202525 3079184 2955640 2865374
10542 2865374 2877739 2884554 2916927 2945013 2996616 3062676 3043481 3012443 2946278 2862714 2841039
10531 2841039 2774483 2674962 2685641 2670363 2584437 2588531 2555039 2469696 2402177 2349256 2327469
10520 2327469 2315969 2266788 2160383 2111741 2064107 1980016 1974729 2031999 2075958 2119529 2177099
10509 2177099 2265027 2240893 2238085 2232918 2235100 2191392 2113748 1989782 1879062 1865954 1823959
10498 1823959 1722435 1559339 1442899 1411691 1415980 1437266 1461885 1494846 1503283 1423361 1352737
10487 1352737 1295288 1342579 1284926 1203668 1193060 1073480 1026692 1076702 1042667 1027398 1033392
10476 1033392 1047035 1060761 1097073 1062208 1025611 1021715 1016152 967526 878179 853885 866861 900892
10464 900892 882345 849660 835762 868487 923167 986977 1042019 1076356 1027876 1071207 1124591
10453 1124591 1074526 1048642 1042187 993222 1029253 1112097 1121792 1183696 1240307 1117660 1042308
10442 1042308 1053427 932612 833242 763001 667940 595985 496621 412424 347683 360308 403651
10431 403651 431735 463747 502948 543292 572572 612669 551803 562737 566058 548261 474576 377634
10419 377634 370543 402057 405198 397079 500434 553903 554982 554980 508585 387248 318271 257471 180172
10406 180172 80007 -23694 -70934 -5641 17085 -35586 -88840 -147905 -143903 -118351 -148330
10395 -148330 -187277 -144538 -78048 -53054 83264 122714 83263 33495 78828 69212 3958
10384 3958 29895 55790 40488 51718 -62446 -167376 -245207 -386514 -407189 -342321 -322620
10373 -322620 -388650 -403260 -327394 -271998 -198664 -128339 -76842 -96182 -111054 -165985 -166424 -164647
10361 -164647 -145531 -151007 -117349 -150737 -199356 -197526 -194273 -106966 -81240 -40694 -39676 -93944
10349 -93944 -103563 -6311 9365 -38854 -40840 -100081 -73716 -102083 -136642 -119115 -37778 3591
10337 3591 60674 50411 94116 178668 141699 158695 156531 109969 93764 46047 10511 850
10325 850 69628 132815 158629 171240 120202 49555 147091 171778 201833 244370 346950 480949
10313 480949 590974 702706 755670 841282 909575 1067009 1272870 1464349 1560672 1549156
10303 1549156 1495873 1406123 1287081 1179101 1065656 996316 890939 808857 855306 861272 881733
10292 881733 913354 924934 1014758 1066154 1118325 1188307 1227390 1202814 1199459 1263647 1322092 1346649
10280 1346649 1353661 1471957 1634967 1862921 2018339 2073127 2065858 2002552 1973598 1966391 1974086
10269 1974086 1944516 1986671 2117949 2119760 2168840 2204124 2133135 1963967 1814389 1701078 1588062
10258 1588062 1462206 1387879 1275486 1236902 1173783 1133518 1207181 1430483 1629440 1713957
10248 1713957 1891890 2027836 2134810 2171277 2196876 2120156 2015322 1944116 1775564 1700456
10238 1700456 1691785 1750851 1835763 1810368 1653673 1470106 1355724 1270606 1153470 1056523 932098
10227 932098 890481 910045 882464 850619 832031 724119 740357 676911 598988 601745 565812
10216 565812 528237 545663 573073 619086 652769 600847 614987 767477 847589 949655 1060381
10205 1060381 1018280 948961 887620 725585 579780 437212 419351 482521 406346 335610 274564
10194 274564 262504 239046 193098 145637 67692 38784 68831 16101 21759 103136 138425 63432
10182 63432 80559 109167 108208 96767 71752 79270 82259 33482 -13494 -41905 -43690 29672 44702
10169 44702 3881 1031 -59033 -74444 28385 47597 27856 40317 47673 44305 38204 2081
10157 2081 -4851 -9835 -56431 -103252 -146264 -140000 -127194 -128678 -125444 -116138 -37840 58106 15313
10144 15313 -1863 29767 -42741 -88485 -53078 -44944 -21639 12415 32831 16777 46714 11346
10132 11346 -29536 -14078 -25466 -78871 -139472 -128219 -57695 -55692 -26455 76 6698 14256
10120 14256 41735 67136 39386 -33599 -62378 -19081 -20521 -37113 -124640 -126494 -36527 18492
10108 18492 -56578 -85785 -41838 -4686 25156 -8320 21244 37215 -5366 -4085 -38150 -68292
10096 -68292 -95423 -114240 -74828 -83926 -11871 11896 -3188 -35293 -48547 -29990 4340 10129
10084 10129 26648 -15765 -101094 -63713 -99294 -63222 -20824 44179 118943 126065 57032 -14620
10072 -14620 -40922 -73332 -134100 -123796 -83079 -58826 -13927 -25744 -57303 -135891 -128998 -140537
10060 -140537 -118794 -98454 -145049 -146342 -162211 -121893 -101563 -69894 -40971 -46292 -49361 -18641
10048 -18641 33488 96403 59433 6028 44704 39079 -12026 -45516 -18501 37762 144170 136763
10036 136763 115685 90121 66317 112684 88660 92958 165667 124347 116545 204179 161099 104378
10024 104378 84709 52764 -29802 -58204 -61401 -49919 -77329 -89175 -85252 -141561 -120181 -139132
10012 -139132 -149888 -70394 7645 8086 3598 -43430 -82548 -64472 -20963 21077 47529 65558
10000 65558 -1990 -40043 -29256 -61658 -117011 -149422 -109270 -56960 -97034 -109890 -128116 -97691
9988 -97691 -73728 -140448 -126865 -41087 7544 -8118 -34683 -80809 -77483 -21406 -47223 -159901
9976 -159901 -170470 -122162 -48121 -38411 -107732 -83787 -48568 -77323 -75332 -25478 -60476 -140514
9964 -140514 -150119 -77718 -23930 -5691 4876 -78610 -48723 -7091 8753 41999 24621 -12714
9952 -12714 -31307 -28228 6104 -11362 -8372 25813 -15649 7179 158885 145182 55110 17200
9940 17200 -21970 -20872 21659 42698 20451 -36179 -55249 -93439 -127944 -126510 -78617 -45341
9928 -45341 40526 -26273 -72221 -110512 -137470 -107605 -54443 58635 236444 365158 396223
9917 396223 438789 406678 279528 169595 72803 87782 -3604 10911 22323 4291 -48282
9906 -48282 -41075 -27082 -95962 -20214 39601 19706 -85886 -117750 -56718 -6435 53764 85080
9894 85080 70948 32640 20340 -8935 -113321 -155767 -92999 -39391 5591 45183 -48 17412
9882 17412 34284 7622 -10659 33275 9323 38866 27233 36902 58568 -1204 -64896 -129560
9870 -129560 -150424 -145033 -63259 -84769 -112706 -61041 -18926 -18278 -4556 55514 31628 100532
9858 100532 84200 50288 36836 28341 108680 122806 56423 -8665 -59528 -26516 44593 74839
9846 74839 61436 14489 32909 41111 77576 55157 45215 12864 -35620 -4557 57373 74521
9834 74521 92081 113829 89304 80859 91714 70191 -4562 -44844 -52826 -28238 -23048 24717
9822 24717 6772 -5313 -1554 -33467 -86937 -71988 30545 106614 129460 41328 14320 24439
9810 24439 101016 78818 108802 220293 296460 267671 318814 403664 421478 405594 389398 387405
9798 387405 409188 269925 127816 70851 36526 67868 52782 3448 -19213 45020 56179
9787 56179 68537 128077 85042 3375 -67721 -69349 67592 83509 36687 467 23655 -10075
9775 -10075 4615 57766 22723 34846 47363 31847 -2 -17452 -102307 -151680 -162011 -112680
9763 -112680 -104631 -156756 -197156 -164622 -79452 6573 20460 -46641 -72435 -3668 -2792 15811
9751 15811 18301 32367 88263 94590 60561 54218 25853 20071 10619 61184 178018 146460 3114
9738 3114 -36814 -11658 -46608 -34986 16972 79308 81014 121252 111837 11993 -638 67587
9726 67587 116071 63173 28081 47771 9737 -13325 15295 68735 93124 78637 37182 -53932
9714 -53932 -69704 70896 159196 175861 148857 127514 107337 40270 41938 31775 -73811 -44965
9702 -44965 -32929 61285 70537 58701 77873 100879 68492 81959 136472 100894 118248 128304
9690 128304 71299 2083 25463 17728 16624 22373 25624 74438 137843 116016 104488 91079
9678 91079 128616 171175 172796 167430 136404 147558 183681 206923 129577 53640 83353 89170
9666 89170 129873 139327 130736 91689 65417 47360 73059 179674 229227 181618 101044 73095
9654 73095 21203 -59428 -81151 -91405 -82743 44099 117309 78952 26156 -25519 -40721 -19243
9642 -19243 67595 97171 53062 56285 32505 43909 60637 587 -40050 13154 40631 44032
9630 44032 39308 79327 149179 111762 70849 131145 162010 107598 84937 93747 130182 169736
9618 169736 197711 96064 34304 124750 98774 62260 81129 106931 44392 14217 -2514
9607 -2514 7664 -2563 9896 -10885 -28959 -24405 -32920 -48042 -2980 88358 158185 131522
9595 131522 96182 -1269 9754 160499 131899 127961 140171 142342 85100 25471 9893 65190
9583 65190 107749 141318 160780 103833 -18661 -48871 12789 23645 -64062 -58613 2331 -22006
9571 -22006 28201 61555 92125 61834 32333 36392 20685 61855 118924 112227 71702 99856
9559 99856 212498 202666 164238 146645 92382 106780 125783 104868 76495 121348 256898 279359
9547 279359 232799 188654 170133 134037 75966 97796 54390 12991 16948 104703 164347 193938
9535 193938 221790 276382 216086 150633 150812 230878 235525 174501 181390 134983 211295 244791
9523 244791 239573 244283 282672 318942 341684 274178 229255 235499 241508 266150 270618 209656 235516
9510 235516 216286 219897 155676 109475 187713 281952 288192 298613 292333 296258 244604 248877 329303
9497 329303 346886 393338 358605 323623 323431 355611 386047 390726 440929 525635 455709 430057
9485 430057 415216 336024 278523 289828 339186 372946 414661 381811 368389 285882 265862 330389
9473 330389 345676 375971 386802 352109 283176 343044 457582 555628 546783 502155 456944 459133
9461 459133 487433 512516 561790 534700 459591 466271 567809 617818 542093 555193 574273 658504
9449 658504 609379 653469 735855 766637 810494 747848 754243 750477 780100 770656 814844 805574
9437 805574 750540 754541 737123 781128 787743 806814 836645 867793 878978 922226 897738 946954
9425 946954 939742 900330 893366 928986 1034038 1084822 1059764 1060186 1044850 1031094 1105772 1186329
9413 1186329 1227338 1224093 1291806 1291372 1360337 1333492 1393490 1425145 1424194 1427503 1503325 1463942 1401901
9400 1401901 1449508 1467287 1393151 1426491 1473672 1523246 1527033 1481011 1501438 1560072 1629408 1726889
9388 1726889 1768444 1764540 1743485 1728518 1747530 1755771 1710752 1739539 1720942 1767574 1740983 1732736
9376 1732736 1825540 1886370 1792972 1754649 1698256 1595555 1571085 1582264 1614786 1707113 1735419
9365 1735419 1726239 1711428 1706348 1633487 1565631 1749292 1783990 1739921 1678160 1625503 1528161 1460087
9353 1460087 1505150 1581099 1546814 1548750 1496477 1426222 1385171 1436948 1407398 1403617 1379563 1301452
9341 1301452 1302352 1300779 1281390 1266132 1228304 1176950 1178090 1224880 1321456 1315745 1241741 1182074
9329 1182074 1184866 1189948 1144636 1140325 1140077 1109503 1046683 988162 904342 846499 871941 894681
9317 894681 887669 880774 853155 852579 864979 870319 851069 859218 841661 811985 817553 799122 745512
9304 745512 720821 759863 704528 732917 714009 679276 709774 699767 681239 664548 702419 726737
9292 726737 650824 583269 475013 476905 509649 596417 549435 507093 570072 607571 599963 577463
9280 577463 594662 535151 528111 501432 474823 467179 441859 374799 423795 504250 528025 486711
9268 486711 441317 397384 383480 418231 437394 404765 381939 484306 504343 409216 450486
9257 450486 499926 448796 398864 365986 381729 383058 438917 532216 467152 430155 452167 461879
9245 461879 443030 414653 404413 301698 224000 177389 236889 340640 370876 392459 409748
9234 409748 389141 420872 367925 285080 226293 213631 185386 185616 243060 243539 191070 147598
9222 147598 113995 97751 102396 118393 129364 179086 218612 243077 161698 143666 154103 167009
9210 167009 233457 302846 212204 135704 146363 177510 228424 205666 127800 144401 142338 169754
9198 169754 114650 123487 189534 265080 163097 138975 172714 203381 223967 162652 71344 46978
9186 46978 49527 125087 161825 156374 59052 22488 115499 185326 158561 169855 180891 132546
9174 132546 39266 22349 48260 175337 147843 48456 14183 46092 140164 184214 91586
9163 91586 122 27888 73680 91113 119846 125794 100216 130763 189712 184483 123188 97228
9151 97228 188023 259978 154026 130901 131221 92839 144607 145761 99752 88623 95694 140050
9139 140050 179969 154648 38243 13410 1307 -62141 -32126 17976 105973 146522 138468 109287
9127 109287 35920 81547 156845 208325 152810 110653 64483 87311 102962 132227 133493 102873
9115 102873 79584 103576 96580 11040 -63294 -43362 14299 71386 -2792 -34668 11295 16421
9103 16421 724 -15595 26468 61210 71842 39108 -60610 -61356 13798 22231 71958 69116 53660
9090 53660 136075 124590 49951 54600 68724 38851 55053 80263 174561 244195 251339 184283
9078 184283 119110 19774 -20205 4791 -19939 48304 117552 60504 21336 32192 42064 -34442
9066 -34442 -72114 1097 -2307 -4779 -53443 -27233 23386 26177 17753 -15432 -48235 -45780 -65655
9053 -65655 -65196 -33570 -45638 -33663 14358 22869 17725 30882 71104 122441 54867 47877 32169
9040 32169 61673 104015 141215 127143 9515 -80377 -77174 -46415 -57211 18345 4872 -14588
9028 -14588 -52219 -58865 33106 86170 55568 47208 114626 103960 63980 -2684 -63820 5604
9016 5604 51057 13771 -32054 -28304 -4097 52427 36720 130763 103093 23542 20161 -14494
9004 -14494 -39988 -69794 -152257 -139566 -77393 -42464 41469 -19222 -14275 21728 54530 57370
8992 57370 50308 12078 -36394 1156 38940 66442 -8 -55122 -100527 -63928 18787 62713
8980 62713 13847 -58696 -8049 50202 22167 -15681 31435 31999 18943 18598 -3307 2519 9408
8967 9408 -66404 -38162 72715 120685 93511 61619 101950 88505 97402 74827 -565 2935
8955 2935 -21623 66377 69403 45674 57562 91657 82573 7370 -55799 -104436 -154974 -87528
8943 -87528 -37069 89680 166618 99517 23994 16334 -18554 -69241 -30742 661 -15755 44924
8931 44924 63330 33292 27029 94564 116521 56220 -70686 -19081 -46926 -94795 -93704 -96236
8919 -96236 -61987 -15860 25044 59317 108999 91039 7737 -32301 26416 19352 32989 54128
8907 54128 132632 198532 187073 129838 106043 48639 11622 10088 -8510 -30283 -22265 -44367
8895 -44367 -80272 -80808 -27584 59457 65698 43052 60748 25989 -35571 -825 36290 -39587
8883 -39587 -73846 9889 102279 129791 71186 70882 65095 79537 34268 -34171 -21133 8258
8871 8258 -66404 -58751 -13016 26283 35975 -19717 14833 35571 34025 21888 -23690 -97508 -13822
8858 -13822 38662 -49476 -88241 -92994 -38243 83864 23950 7528 24955 20558 82160 70512
8846 70512 5251 -17940 -41972 -92356 -139905 -105727 -148740 -186872 -130174 -100192 -77259 -67240
8834 -67240 -60796 -26898 -2182 19538 53582 82000 90838 48376 -53213 -98832 -37209 10130
8822 10130 22068 -21083 -32519 -36081 -93912 -111664 -142755 -154246 -199549 -138248 -28110 -30922
8810 -30922 -75026 -63891 2575 92909 116956 31519 -119329 -186526 -201271 -203991 -172004 -171529
8798 -171529 -115625 -79122 -71406 -87395 -42313 -19885 -32118 -59882 -86002 -72480 -41534 -37158
8786 -37158 -70106 -83066 -60314 -83816 -155615 -190260 -110941 -25029 32545 37789 26155 43048
8774 43048 118587 146220 21495 -34516 21191 118926 79627 11398 -29744 -41320 18774 -1250
8762 -1250 9789 -15427 -277 7108 28160 28616 -25228 -72433 -83475 -22240 54256 19355 10572
8749 10572 49979 83368 33201 -38530 -38953 -92 77610 73423 60067 41311 23904 -50357
8737 -50357 -23886 -10458 -20225 -13725 -34691 -96789 -91123 -63365 31942 94567 64314 73921 43618
8724 43618 -6749 -3256 50637 40694 30620 40285 22092 55236 30303 -24044 -28557 -10374 16561
8711 16561 -5033 -57983 -90285 -46534 -9820 900 -4256 29285 -14245 -1009 29369 91969
8699 91969 121535 40808 -18586 -71427 -120880 -82196 -25665 6118 24870 66280 123792 108828
8687 108828 -40956 -132713 -173421 -185436 -237091 -175762 -100567 -92540 -124254 -82656 2997 37472
8675 37472 -5594 3528 17457 44900 133139 135873 40827 40126 77306 95318 61479 65017 35056
8662 35056 -47870 -98164 -139354 -106730 -118293 -38832 60007 50524 65332 86126 88385 -1761
8650 -1761 -54728 -50105 -28144 -19893 -43961 -59143 -77983 -70439 -127 43357 46294 24477 45836
8637 45836 -26013 -17770 -494 21610 77513 74785 103198 63061 14434 -64 20133 38919
8625 38919 43081 67453 -23765 -23877 -10369 14295 -29489 -1258 21922 42850 107788 120961
8613 120961 110088 95718 89495 69043 65995 69080 122232 123675 171036 158966 128675 132844 141191
8600 141191 248718 240087 180877 68227 32219 30817 39058 39295 28523 10163 75159 93292
8588 93292 86424 40293 52542 109326 191149 241877 259512 177677 86948 85065 155894 212988
8576 212988 178689 95463 98515 85090 133420 157043 176881 192079 133612 93550 68082 52023
8564 52023 9434 -12154 75664 105355 60073 86059 113237 120365 170521 177002 233438 264264
8552 264264 215600 223975 240431 256888 269890 263261 207264 204264 203044 231938 219329 243168
8540 243168 194662 122297 148977 145982 143204 101526 56693 -8476 1261 -2804 -19937 -15692 -25789
8527 -25789 22199 76079 97104 94039 129693 83628 142411 152762 115316 94556 106386 70502
8515 70502 99457 162383 261811 366796 391203 391651 303711 315066 298786 242260 239380 224940
8503 224940 100173 83624 138141 126521 83366 41327 115541 76113 60804 64391 57360 52625
8491 52625 62795 41081 33865 67344 54411 10449 -15525 10390 80751 112016 126190 121633
8479 121633 76132 65626 116791 165891 163144 173488 145888 85969 139140 196972 209123 140425
8467 140425 91939 153280 111257 84158 189410 215595 201790 151672 93861 95372 42030 60481
8455 60481 39516 -12254 -16185 8498 10039 -19846 -81744 -8470 45957 74881 186118 184562
8443 184562 169780 101644 48202 41705 4420 -30518 -7379 55468 61275 107432 109940 106860
8431 106860 77225 105143 169968 139579 25429 -54651 -34319 56653 99650 53970 152842
8420 152842 146898 157739 254523 355626 286822 147946 21210 -7539 -44311 37847 45819
8409 45819 -8009 -32731 57039 88557 124113 170358 160579 83529 84954 89747 82685 22589 -39011
8396 -39011 -32142 53158 53414 13993 44721 96969 92711 84943 58713 59658 92590 112543 152075
8383 152075 240006 301720 337189 329348 363574 412366 284220 270489 255642 148164 77206
8372 77206 110607 127311 159259 126302 140810 114426 54231 41484 52222 58254 87596 138681
8360 138681 127749 110831 81213 134157 133212 132477 124209 127233 152815 126094 190232 242996 259953
8347 259953 324214 328388 389217 358343 324955 287553 293925 193288 47926 -18598 -45627 -64929
8335 -64929 -34887 -7181 101609 76880 56635 -46084 -73964 -50349 -17875 32269 33341 32032
8323 32032 51964 56237 3087 -50810 -969 53193 28826 -68145 -100886 -44592 -15830 -44078
8311 -44078 -88321 -63787 -35978 -41666 30618 13024 46350 16322 39282 97932 68900 9333
8299 9333 21057 1933 -16695 -10002 -45141 -32681 22255 20711 39016 -18785 -82998 -58930
8287 -58930 -21842 -3918 30508 13651 17394 63000 74869 118773 132589 97774 40368 1077
8275 1077 9191 12574 31804 94489 142862 79122 43178 14512 73421 83584 27648 19169 -34481
8262 -34481 -85733 -35606 53619 118548 100418 81520 88177 24992 -19144 22313 -3663 77190
8250 77190 142376 144160 148409 117383 -2052 -88121 -66325 -41689 16462 28468 34144 74755
8238 74755 118280 140544 88778 -10594 6947 -12650 -63479 -37837 11291 10950 17098 45279
8226 45279 11649 53904 74291 73235 82814 70547 67534 51624 11782 15377 22617 13664 87484
8213 87484 172520 223218 222511 223284 182754 129281 7538 24637 60575 85971 62977 48422
8201 48422 150265 167104 146278 78548 126173 110185 59286 88084 86007 29744 2574 61488
8189 61488 53517 6898 58058 86460 82492 57633 93466 43473 23220 57665 66784 757
8177 757 13626 104195 246048 232518 188428 237756 264384 147486 103291 81804 96130 112937
8165 112937 125666 173711 73708 -10489 -280 36828 107022 107278 85388 17146 4796 28246
8153 28246 14632 -44756 -23265 -33570 -5087 9347 -9355 -25403 30091 25568 56160 99336
8141 99336 135422 128719 121213 102727 70630 85297 29943 -23935 3151 64555 50411 54148
8129 54148 51315 -2180 -13536 29771 1336 9366 391 -25581 7059 -3694 -65449 -101231
8117 -101231 -104728 -103405 -33335 -29574 -35170 8794 19321 50276 41634 51241 82183 107870 82169
8104 82169 34542 -47522 -58516 -81613 -109329 -70406 -47123 -16872 -15512 19841 17692 -76659
8092 -76659 -139703 -67122 -25659 -67832 -44702 41857 64194 34713 -15693 5266 13597 -27384
8080 -27384 -56643 -35471 -75814 -41196 10827 1452 -18337 38055 162466 128153 127348 153332
8068 153332 165013 114028 58941 24082 36720 47739 25916 62285 107960 96652 -8160
8057 -8160 42432 131469 181171 141351 159798 238711 336869 531463 838316 1155749 1266595
8046 1266595 1215611 974894 788820 625758 502097 338537 233811 202549 218039 156886
8036 156886 116244 101778 126133 201502 182969 136989 52304 5837 -33710 -12937 19353 52988
8024 52988 58144 54240 118490 144420 160448 148825 180558 206619 214322 207583 214874 284650 385233
8011 385233 510002 622923 861217 1122666 1571174 2301914 3158288 4010957 4551486 4311376
8001 4311376 3579446 2761186 1981987 1370640 985290 724468 582690 442963 302534 185200
7991 185200 175301 170475 227923 240574 188188 120663 76828 11898 58169 87457 8133 -34917
7979 -34917 49449 107969 108436 50081 -2751 -50243 -59453 -88938 -33944 4594 -43102 -112836
7967 -112836 -80769 -17270 18693 -37885 -17541 -32982 -83901 -27903 34688 80020 -12341 -38554
7955 -38554 -49811 -64858 -46186 -59248 -33050 -101627 -168820 -182076 -86182 -22442 54674 89953
7943 89953 88060 57235 8546 -65778 -31011 -60164 -80980 -42387 -5135 -20527 48656 57827
7931 57827 -12029 -30453 -40334 -35346 -54601 -109494 -98953 -3656 3837 -72347 -119550 -90992
7919 -90992 -107691 -104761 -83920 -59603 -52935 -72204 -80266 -93025 -50591 -51758 -96206 -150656 -114876
7906 -114876 -119212 -89430 -49423 -78023 -43129 -88377 -125011 -89354 -106668 -104383 -24667 24970
7894 24970 36660 15208 -16204 -52370 -14667 -33572 -56595 -67825 -106462 -78585 7703 22353
7882 22353 41254 -20032 -96670 -141454 -146664 -96490 -84274 -87588 -97661 -108613 -140936 -139181
7870 -139181 -145494 -150745 -209257 -113364 -22553 8832 2434 -15679 -53377 -49663 -9849 -21063
7858 -21063 -26783 -16091 11185 80670 37995 -4210 23525 61849 51104 -40185 -60866 -3074
7846 -3074 -44606 -97872 -21404 -10106 -17352 -23391 -319 46834 27880 39404 62325 29007
7834 29007 41461 43255 34205 -13506 -32132 -19159 -26088 -18795 59671 69118 12158 -90681 -105339
7821 -105339 -74404 -139685 -102575 -11134 -15439 -4749 -9570 -65456 -113210 -102141 -31131 -21819
7809 -21819 -43906 -75664 -155662 -144045 -118328 -167649 -218233 -143072 -34961 -44947 -74073 -77070
7797 -77070 -40954 -13429 522 47091 54072 71402 5475 -64460 -36926 -32822 -48477 19927
7785 19927 55788 -35945 -55368 -54386 -50783 -47963 -14357 -84982 -43118 -22737 -78728 -54149 13820
7772 13820 78837 105400 72982 -22411 -76576 -74146 -41555 -39721 9902 -912 12732 -55783
7760 -55783 -118786 -140430 -158350 -133254 -110438 -57052 -60320 -65747 -56505 -29384 -30925 -81424 -54011
7747 -54011 -88905 -112456 -139995 -79776 -63353 -138317 -106012 -39563 84678 105311 20970 -19107
7735 -19107 -18220 -28579 -57899 -68546 -38478 4211 48962 39475 -27673 -38161 39324 29669 18891
7722 18891 1060 6481 15803 47301 -4316 -80855 -63545 -114562 -120079 -31809 -26450 -56666 -16293
7709 -16293 -11360 -43285 -64590 -90200 -53902 27864 80029 47884 7842 78033 81130 33417
7697 33417 -8621 -34173 -32056 -34139 -5427 7072 -440 -80165 -84613 -36296 -63632 -93753 -30017
7684 -30017 38693 25249 -60444 -39671 -41159 -58679 -45853 24970 -32323 -50057 -64098 -91774
7672 -91774 -73298 -36909 -23217 -131977 -156039 -150073 -164899 -217120 -179347 -173831 -202332 -189759
7660 -189759 -132845 -92271 -88941 -145936 -143147 -139938 -123409 -43885 47578 41022 6202 2726 -29933
7647 -29933 48269 39204 -82261 -93831 -38887 -8989 61734 41951 24402 63546 40620 -22740
7635 -22740 -91657 -86283 -67592 -76367 -36727 -66666 -90055 -109075 -109527 -64235 -38680 20831 35105
7622 35105 -13862 2066 21772 -73334 -107617 -68873 -74853 -27698 40627 83001 18447 7040
7610 7040 -2621 -8987 13727 50269 -19694 -57023 -91655 -128359 -85713 -28334 -56536 -102152
7598 -102152 -20117 -49496 -101225 -103641 -87474 7218 43968 52938 67678 139502 180738 96854
7586 96854 70636 83230 50977 -50431 -77048 -51978 -55505 -32270 18207 9304 -17988 -59204
7574 -59204 -82605 -113131 -72558 -45743 -103034 -148623 -112617 -129574 -108503 -100881 -40842 -74185
7562 -74185 -96137 -139951 -152359 -181422 -178228 -133591 -149946 -69559 -54934 -39154 11242 13347
7550 13347 25756 67175 104195 -19240 -77980 -50299 -72565 -111100 -74570 10744 -5260 -10481
7538 -10481 -39445 -8872 -15713 65274 102348 -25874 -79844 -143318 -169180 -187585 -133675 -167803
7526 -167803 -167944 -150914 14907 88693 64283 62679 -8698 7269 -13354 -66216 -105008 -103402
7514 -103402 -57155 -79782 -42353 -126632 -136475 -109934 -16784 -19266 -56363 -93799 -22609 -13280
7502 -13280 -1687 -72498 -131161 -109794 -89339 -93008 -52426 12251 43960 51106 33892 11634
7490 11634 25795 49357 21369 -25206 -250 -1579 -55846 -88725 -137093 -205387 -238303 -140820
7478 -140820 -90432 -77393 -74779 -67210 -56376 -84704 -76948 -17431 -20061 -55680 -54833 -32828 36531
7465 36531 -15190 -92186 -65328 -15419 1114 -19327 -26626 -19057 -112961 -141266 -124926 -80986
7453 -80986 -37277 -34824 -75039 -47338 6085 86974 65162 49868 32955 65055 22909 42194
7441 42194 -6517 -35862 2487 -14611 -13021 -8763 -3358 -23253 -12368 24032 17309 10008 8770
7428 8770 46506 28303 -26199 1441 65303 92863 57665 26455 -10561 -60346 -62967 -26841
7416 -26841 -32915 -26520 -96907 -151713 -183520 -139393 -104255 -82223 -17669 12296 11827 68866 52651
7403 52651 15249 16682 49351 44397 5529 -67148 -83587 -28424 11815 6830 -39508 -75593
7391 -75593 -12569 20307 -56744 -198235 -173424 -69185 -18989 -46118 -65073 -120939 -109227
7380 -109227 -52931 -23056 31526 58108 3966 -108344 -131217 -155867 -111397 23308 -6159
7369 -6159 -79018 -55362 -59229 -55818 -10496 -4943 -33149 1287 80747 128855 132589 -675 -45345
7356 -45345 -21403 -43647 -15959 49403 44439 22001 -17612 -31345 -75644 -101289 -78812 -109775
7344 -109775 -46675 -50045 -42472 -17913 -15887 -74826 -147314 -86656 -132823 -213169 -194809 -194601 -139263
7331 -139263 -112593 -97039 -13827 8368 -5368 50882 -45867 -102663 -108318 -50259 -51218 -25117
7319 -25117 -14931 -143956 -139010 -38450 47511 29465 23174 18160 29212 -27449 -65218 -71164
7307 -71164 -20149 -70841 15787 -5953 -43098 29178 24154 28536 56243 86067 123860 108357
7295 108357 74338 58889 73655 55748 43939 29905 20403 36451 44236 4820 31244 -34935
7283 -34935 -110161 -70924 -46855 -5845 -45692 -20492 -15478 -14872 -36385 12734 49343 53776 37691
7270 37691 10920 60844 72867 81428 77781 -14626 13724 2447 -18968 -85614 35300 55613
7258 55613 28571 42352 67140 41706 25886 -40746 -81108 -74325 -30858 6762 -14464 -107833
7246 -107833 -202755 -192439 -102408 -84876 -181587 -161555 -127943 -109790 -116929 -109514 -92920 -7227
7234 -7227 7604 -8001 -32592 -127799 -193204 -163012 -153623 -68135 -21772 -72255 -99378 -184869
7222 -184869 -188204 -170524 -141664 -161071 -195724 -232114 -212415 -179168 -86087 -8070 -6902 -10629
7210 -10629 2033 -32137 -75059 -123834 -129205 -122759 -122605 -177716 -166972 -163062 -185295 -148309 -99737
7197 -99737 -71456 -47149 -26740 2869 49384 36799 43490 -12885 -88875 -75363 -102715 -107835
7185 -107835 -118886 -81017 -76789 -16658 -35986 -58267 -77878 -48308 -6833 -49261 -33897 -56537
7173 -56537 -96371 -102244 -74824 -39680 -31860 -14410 -42480 -7751 -2218 -64727 10867 19602 -87292
7160 -87292 -104048 -38997 -44750 -35384 8346 35264 4364 -55057 -70959 -53542 30177 30089 57511
7147 57511 34701 67033 32528 -97524 -133823 -97370 -89011 -34132 15072 -819 -6604 25469
7135 25469 10804 3332 -892 -6289 -63298 -151468 -113027 -70522 -47238 -39615 -82650 -129646 -143802
7122 -143802 -125044 -82195 -2753 -10324 1954 -8151 -5178 1190 19177 13351 -97391 -195753
7110 -195753 -163879 -148227 -155785 -56491 -108102 -124803 -67803 15092 75758 104028 36950 36970
7098 36970 -9038 -83998 -99714 -80027 -71420 -57050 -128506 -128427 -40127 -8621 -1604 -25017 -56128
7085 -56128 -44380 -100882 -149789 -132671 -65869 -40437 28683 23862 -18141 27632 21316 -44320
7073 -44320 -24652 -3823 37545 23760 40822 738 -11588 -14433 -1751 34602 191528 192956
7061 192956 126929 101433 53071 73521 61187 68647 117416 101909 30219 -31597 -90507 -106662
7049 -106662 -83567 -41702 2721 -14758 -116084 -195662 -173324 -152244 -152055 -145126 -130300 -136784
7037 -136784 -51655 13779 32226 -11833 -32105 -46153 -38316 -33629 15801 -169 -62631 -84168
7025 -84168 -93971 -99357 -121991 -132699 -167830 -133497 -52399 -14765 -20709 -54658 -56981 -31491 49739
7012 49739 33103 -12435 24388 7998 188 5575 50248 86799 74240 74596 84769 29051 20449
6999 20449 87942 80831 91055 91068 102569 32571 1907 -55393 -73156 -7627 -20528 43040 26393
6986 26393 -4396 -10942 -7236 -2658 -13948 -45743 -120908 -63146 -18791 57059 121101 134927
6974 134927 105185 62081 10372 -5574 -27626 -27378 -21129 -24046 -97102 -187418 -221588 -238469
6962 -238469 -202575 -148028 -75813 -115436 -186211 -105674 -50842 -14163 -6184 -45408 -6499 -21071
6950 -21071 -56655 -30667 -49723 -68293 35737 123787 72242 -51516 -72461 -55400 -84762
6939 -84762 -66177 34389 84961 71738 31888 20116 23084 13464 31276 34079 95801 80152
6927 80152 50920 35146 -6486 -22276 -82058 -55532 879 -28767 -83977 -43780 -22206 -66925
6915 -66925 -95435 -45742 -23643 -108286 -112189 7633 75739 27204 -75624 -100473 -78218 -95294
6903 -95294 -62644 -50914 -39457 -65885 -15123 -11004 -37418 -56338 41775 10001 -20225 55946
6891 55946 26392 -20105 -34583 44010 56654 52907 -29193 -21287 -17348 -72924 -151110 -149354 -183885
6878 -183885 -170418 -174564 -180014 -169999 -144491 -161312 -213398 -152468 -112585 -39833 -24896 -110149
6866 -110149 -105449 -42775 57317 52534 -29377 -75380 -80364 4188 66596 23330 47467 90766
6854 90766 25605 -20214 -90304 -82005 -57244 -2977 30476 19184 25222 55410 28089 -37257
6842 -37257 -68167 -32061 48517 59055 45185 78290 31538 -69207 -164802 -130753 -57805 -98288
6830 -98288 -209451 -210476 -196698 -139010 -65449 -10823 25554 -71342 -83698 -76148 -27816 26033
6818 26033 55713 37631 1565 -89542 -148665 -135054 -89489 -15801 47350 -3076 -78057 -78062 7457
6805 7457 -30394 -48359 -61360 -34497 -16519 -52572 -86185 -36609 -73592 -81757 -86741 -105745
6793 -105745 -107548 -120834 -107370 -74952 -40161 -56046 -87498 -112869 -100437 -3347 20060 21096
6781 21096 7418 -10718 22113 18350 -70494 -64974 -77170 -11736 -13266 -121062 -144100 -127811
6769 -127811 -134624 -124139 -55695 -43450 -52827 -79533 -66399 -121751 -181845 -97785 -106458 -97885
6757 -97885 -87619 -82325 -57364 -40313 -36229 -65421 -59619 -31400 -29455 -17908 21819 7000 10595
6744 10595 7039 -13197 -79519 -92745 -68056 -116948 -129621 -107359 -47340 -66265 -102049 -127168
6732 -127168 -122734 -43904 -46102 -94140 -160643 -192778 -79750 -68145 -130089 -141394 -95021 -123610
6720 -123610 -108054 -84284 -84235 -102602 -87069 -109734 -106576 -42546 -70447 -66845 -15158 75146 -19296
6707 -19296 -77918 -127631 -113878 -50304 -31724 -74738 -131962 -114891 -74857 -60218 -43422 -24028
6695 -24028 -18 50387 108747 117958 91722 66776 37581 -26140 -30315 -35804 -102191 -150052
6683 -150052 -72119 18664 22111 -48640 -104859 -114770 -69183 -145535 -152055 -139289 -155554 -72295
6671 -72295 -21903 22934 9983 13355 -22836 32413 113777 64247 28223 -13006 32912 107401
6659 107401 47982 -16723 -41725 -50227 -39596 -87879 -109502 -78933 -52841 -75875 -87920 -76121
6647 -76121 -43437 1822 66494 78105 -922 -38689 -66687 -148601 -152504 -129253 -122494 -69848
6635 -69848 -66376 -35615 -43792 -21777 42445 50396 70627 91899 98637 73106 -19851 -116353 -55495
6622 -55495 74 45387 65836 23295 -7576 -61706 -65752 -78481 -18810 86226 84261 24257
6610 24257 22728 11122 -10797 -48781 -126997 -159086 -58019 7653 -18931 -40792 603 -61125
6598 -61125 -165183 -97868 -11523 23464 95349 -4448 -55947 -32116 -62206 -29733 47583 22061
6586 22061 -54670 -107269 -52812 -80792 -46799 31358 51372 134699 181738 81251 29739 -25915
6574 -25915 65242 165130 154500 127390 54348 1373 -3720 -44082 -79484 -118178 -87722 -31361
6562 -31361 -3500 -8271 -7014 -23081 -41656 -52333 -125518 -171848 -176864 -104832 14200 49558
6550 49558 -17055 -79897 -80810 -78213 -24755 22999 32282 92561 168995 157150 76387 -26009
6538 -26009 14377 41126 20798 -12599 53191 7429 -44955 -55308 8969 10397 -58185 -37465
6526 -37465 -113866 -93381 -68384 -78563 -6505 61913 12086 -33316 -151399 -220628 -193257 -117307
6514 -117307 -74877 18863 -19887 -25151 36158 9401 -60461 -43543 -67326 -76891 -53096 -70733
6502 -70733 -70783 -53886 29295 56318 -44933 -51614 -4165 47272 63710 59037 49141 94963 107703
6489 107703 68224 14474 6919 18093 -38800 -105555 -151539 -91376 -80183 -123445 -138470 -139979
6477 -139979 -123888 5956 43063 -40406 -94346 -108264 -85820 -79525 2482 68445 57573 5791
6465 5791 -9220 -9854 21266 -19787 -18229 40783 -12843 -27750 -64232 -74921 -74621 -80403 -89568
6452 -89568 -63538 -20133 2704 29336 3993 -20776 -79981 -167261 -130482 -88413 -169174 -182978
6440 -182978 -146473 -175614 -144542 -122354 -71957 -39727 -21955 47973 25229 -18603 -17100 32634
6428 32634 -6867 -111992 -156120 -99124 -35181 -63122 -154921 -203542 -179788 -142504 -174732 -163140
6416 -163140 -88332 -90407 -48864 -24202 -44846 12975 16603 45873 40881 43513 55493 70185
6404 70185 105085 81463 118381 168849 103559 -16574 -96505 -70257 -107295 -71205 -27609 -82074
6392 -82074 -124182 -68597 -27530 611 13980 -46948 -65158 -78492 -38520 4666 -51250 -47593
6380 -47593 -53415 70372 44309 -22010 -46922 -46224 -63446 -57485 -61403 -13299 14111 47905 -29674
6367 -29674 -58162 -49982 -110629 -109276 -58801 -8661 88127 141880 104259 69226 5651 -1671
6355 -1671 -47052 -83383 -33039 33516 18574 -45771 -38554 -49539 -71468 -18368 -40785 -167683
6343 -167683 -252350 -252124 -189288 -60443 -42694 -79304 -64637 8783 46508 -5706 -5167 -15422
6331 -15422 -55547 -45364 -24379 1174 50136 594 -22955 -4813 86062 126624 107125 77867
6319 77867 91451 98735 74983 69352 12492 -43486 -79658 -138929 -111677 -90915 -75281 -85197
6307 -85197 -86534 -20553 -49925 -33939 -46892 -27544 -14395 -39846 11992 -22545 -61696 -109675
6295 -109675 -89919 -29038 3498 -2414 -59512 -64279 -81635 -141364 -108396 -68915 -79912 -54909
6283 -54909 -24415 -38142 -70151 -86784 -79724 -63361 -35100 -36376 -54883 -55155 -13835 -19468 -51887
6270 -51887 -12559 18642 7639 -25392 -63509 -30301 -4734 -29880 20659 1236 -46812 -72426
6258 -72426 15779 -23129 -27748 -8615 -32694 -11252 62511 62284 4596 -58666 -45051 9251
6246 9251 90718 77645 88363 51119 -17314 53964 39720 -51468 -120837 -84317 -35445 12370
6234 12370 52876 78959 17729 16167 29142 47559 65393 61525 25272 21671 -4781 48893
6222 48893 129533 77485 27512 -55430 -130357 -124260 -75647 -65032 -78100 -28518 45006 123151
6210 123151 120805 42782 8893 5917 -10426 -52880 -1614 54760 96022 33785 -14928 -72964
6198 -72964 -80580 -37170 -25799 -57152 -157758 -66277 10124 7916 24097 10535 35123 -21722
6186 -21722 -58323 -64316 -1065 26987 100616 114919 62305 37798 47536 33170 65321 7745
6174 7745 -4232 54287 23443 -12750 19601 17600 -36093 -22764 8311 -27515 21641 28981
6162 28981 47866 111093 109395 57289 54979 43179 6870 -13793 -69440 -104973 -114942 -128585
6150 -128585 -54557 -60074 -16124 34669 11406 -52785 -87782 -48061 -28976 -41936 15150 -3757
6138 -3757 -19455 50012 123961 39833 -35424 -23026 33998 20162 23170 -20585 -17732 1171
6126 1171 14576 -76188 -115035 -88096 904 -510 -16072 -48971 -51121 -78219 -79378 -103124 -170087
6113 -170087 -224693 -229532 -232376 -302752 -248056 -182211 -91397 -115523 -97400 -27073 -19026 -41887
6101 -41887 -75346 -89520 -62653 -84959 -43898 -32075 -31355 -64950 -84297 -118153 -81255 -65901
6089 -65901 -73487 -52659 800 -6918 -35129 -150496 -166824 -183637 -132277 -72777 -57297 -62972
6077 -62972 -25249 -149 -4636 19569 30889 40845 64179 24243 12558 -16657 -7487 -15380 -7159
6064 -7159 37306 -48830 -169271 -188792 -120485 -93126 -22664 -17530 2592 14695 9258 6383
6052 6383 20157 19997 20153 50689 93599 77654 49178 57750 -56088 -72274 -86503 -34853 -14371
6039 -14371 -3427 16610 -5508 -14801 -34038 3342 42022 24562 16685 79434 -9847 50265
6027 50265 62579 5841 4056 -22976 -63702 -13637 4076 -25022 -42788 -12103 -4423 -72360
6015 -72360 -110625 -177280 -93213 -35621 -38550 -103424 -117399 -101148 -152875 -139392 -127212 -108936
6003 -108936 -118632 -84880 -9356 -25031 -111512 -23096 -241 -49890 -14350 26351 5342 1397
5991 1397 13193 -20514 -74864 -78771 -41767 -63951 -76935 -119724 -93458 -24168 1273 10201
5979 10201 -40812 -113007 -110826 -61455 -90367 -48300 -45196 -37076 -58135 -60873 -103269 -94706 -71410
5966 -71410 -10442 14558 -7804 -54864 -91122 -39609 -48229 15116 139790 182737 184874 158119
5954 158119 68141 -23668 -17228 -12401 -27097 -101406 -160896 -153251 -115184 -119750 -135216 -141837 -160151
5941 -160151 -108250 -97907 -44405 -57837 -39610 -28204 -56260 -117336 -129465 -151902 -126755 -116467
5929 -116467 -106738 -87001 -30014 -84426 -102489 -125102 -117087 -160982 -179357 -118860 -54518 -71426
5917 -71426 -122108 -91010 -49624 -66337 -153355 -150386 -92056 -62974 73702 142057 139547 17020
5905 17020 -4286 -19942 36507 50129 -37023 -13342 -8501 23406 1264 -22702 -64391 -24447
5893 -24447 1369 43743 78258 68357 -38380 -84333 -125940 -211234 -182103 -78055 -21249 -72837
5881 -72837 -128512 -107720 -89662 -30321 36520 51498 84498 36893 -20931 -43454 18703 15660
5869 15660 -25845 -18873 -12257 -74854 -104429 -92474 -52727 -52936 -19314 -7354 2789 -27264 -33950
5856 -33950 13238 86063 51777 53545 36313 29170 15110 -15742 -72120 -123648 -166970 -172067
5844 -172067 -133553 -139682 -161326 -116452 -36271 8147 15143 -18922 -71824 -7520 -2809 -65271
5832 -65271 -74408 -69253 -52743 -101208 -94529 -38801 -5120 -11362 474 11632 9006 52857 104735
5819 104735 87145 87578 72481 25326 -6889 -22739 4557 -22514 -66119 -102804 -52689 27276
5807 27276 2395 -61274 -44568 -24181 -13848 12103 726 -45666 -32263 -38845 -45690 -30407
5795 -30407 -28952 38213 74625 44530 37840 30348 30227 36461 80060 42230 49103 73741 78436
5782 78436 44076 39076 43836 48914 11680 -45252 -140972 -168150 -94687 -41283 24523 -9172
5770 -9172 -29914 -17485 -30626 -78141 -6676 70157 104928 67197 57316 28092 40249 55593
5758 55593 44380 69686 94508 47276 40287 57793 3737 -90279 -98937 -8223 41678 -52540
5746 -52540 -147674 -85917 -27033 57487 32645 74294 125754 131712 63124 18746 -27370 -32864
5734 -32864 2824 -39265 35500 44998 34169 56463 46272 92175 68601 33791 -16958 -79794
5722 -79794 -61565 -24551 27531 20348 -14267 15339 72688 59022 -54 -43822 -82097 -73125
5710 -73125 49838 57702 -2240 -90200 -131849 -133464 -124752 -100409 -78272 47897 69001 40062
5698 40062 18625 -10020 -36120 -46906 -70310 -130078 -92541 -70945 -29035 2432 29553 -8492
5686 -8492 7059 86017 96883 43988 -11947 -41492 -63548 -54678 -45687 -71951 -120275 -106177
5674 -106177 -79882 -33222 -85611 -161089 -201678 -225773 -256475 -258315 -215839 -98641 -13697 268
5662 268 7890 -101055 -139241 -146616 -178593 -125231 -58610 -43865 -63028 -54098 -54452 -13169 14234
5649 14234 11704 -46990 -66189 -22957 -35727 15743 42776 -54086 -82987 -30538 31499 60801
5637 60801 84158 17303 -89601 -51897 -31673 7447 -45210 -86799 -52840 -21958 -58564 -28410
5625 -28410 856 11645 20592 -24658 -98771 -98506 -13386 1009 -42892 -43141 -79324 -100303 -34947
5612 -34947 70390 70389 63448 22087 23981 38355 44005 17755 36209 1350 25443 83534 91137
5599 91137 34685 20641 67691 59710 109729 119072 118318 84302 32701 -14785 34138 24008 -82683
5586 -82683 -163166 -143180 -120817 -151790 -99032 -68597 -108475 -155091 -175473 -118394 -40991 -55733
5574 -55733 -116673 -118646 -171330 -171563 -193429 -228177 -212280 -137487 -80577 -10711 51965 15475
5562 15475 -47581 314 -28859 -73247 -83698 -47433 -66005 -68101 -92403 -110675 -54494 -37298
5550 -37298 7045 3355 65820 133045 57696 -2927 15444 24764 -7636 10898 118121 139457
5538 139457 71005 -21622 -43559 -26451 -37359 -79067 -29024 3305 -13492 -56533 -59740 -13233
5526 -13233 -18324 -910 32832 21771 -5842 20498 39453 75783 93046 90165 44858 57119
5514 57119 108826 74813 10412 -35143 -92016 -94119 -102668 -128596 -120308 -125536 -134064 -47116 11702
5501 11702 19117 3255 -49652 -60796 -2229 34904 84612 121517 61800 -6364 -27322 -7273
5489 -7273 27624 70939 140327 151194 75118 37272 78792 76078 35393 68661 105924 20202
5477 20202 -49989 -35815 -54043 -88639 67252 96976 95065 33071 7865 530 29441 56838
5465 56838 6732 -16201 7723 103081 105262 80644 93298 79167 21141 -64394 -59768 -43397
5453 -43397 -67548 -35686 -84638 -116737 -71814 -7494 46500 89890 67451 27133 31703 110954
5441 110954 92454 23415 -3282 -56622 -61480 -52513 -39959 -12209 7252 14950 94400 61742
5429 61742 -14297 -3024 61348 71979 49261 15232 7720 87237 44362 13651 35386 -25032
5417 -25032 -51457 -39281 -4082 44781 -32159 -23522 1463 -24389 -30807 -14857 -3124 18420
5405 18420 81947 124179 193960 194199 68131 -2360 41176 26616 -19198 -16158 -22790 -31091 -3239
5392 -3239 16365 -22954 -93459 -132855 -115271 -46525 -42582 24768 10560 -60905 -16520 36044
5380 36044 59014 86875 93055 93198 63861 22106 -13359 -20260 41498 56250 50815 -45768 -36192
5367 -36192 21946 32886 61182 107524 78714 5505 2927 30606 -12076 -9818 107370 175938
5355 175938 168162 122029 100783 -30854 -98607 -46030 -18370 22323 40753 71732 67535 43838
5343 43838 42164 64150 62280 54904 -4908 -627 -8719 50960 83716 71803 -14755 -14296 -53828
5330 -53828 -51790 -8579 -20630 -61706 -13682 -45076 -18565 9522 65885 43993 31893 43429
5318 43429 107626 70785 -42593 -65689 17571 38261 -16578 -37201 -10682 44835 49528 -42850
5306 -42850 -79778 -67894 -62527 -16113 10718 27373 1918 -795 -20655 47115 77118 19023
5294 19023 46192 93107 134666 115433 -5582 -35913 -41348 -32591 22470 -39351 -108939 -61248
5282 -61248 59440 42817 -43222 -78094 -70119 -27764 -26080 -21264 -39621 -41981 -33843 -21847 46866
5269 46866 91566 43277 -19088 -58624 -49680 -17218 38772 39613 -19456 -64946 -35849 18475
5257 18475 93215 143670 187530 125707 128644 69891 79168 101693 39752 55283 55673 101350 83850
5244 83850 39558 34749 -15775 -70203 -104716 -148600 -106151 -58454 -52768 -14131 17492 52017
5232 52017 356 -13079 11926 8757 9710 -27833 -100730 -72006 -26070 4512 34837 -25163
5220 -25163 -77804 -88607 -76836 -64460 -57306 6571 45638 46861 47900 29371 67893 63580 16509
5207 16509 -11359 -12067 -8102 27282 34421 71183 11034 -20954 24105 -3498 -15089 24293 20852
5194 20852 25473 74821 116078 26303 57545 98969 2287 24767 23416 58436 -23139 -76270
5182 -76270 -140257 -150880 -135550 -59898 -490 44596 70513 21052 26098 22836 61069 86471
5170 86471 10769 -13304 -17798 -15871 -18514 -9677 -29727 -69276 -42335 -21448 54208 58256 13997
5157 13997 -7775 -54094 39477 46401 -52577 -111873 -81081 -93135 -56515 -5836 -54002 -83715
5145 -83715 -24616 6849 24182 1744 -19485 -24461 -6619 9948 -22556 -42623 -3646 42094
5133 42094 -36153 -143127 -77743 -37804 -64717 -56341 52670 131257 67145 10217 111216
5122 111216 144039 106014 97733 137507 96322 38334 -24428 -52317 -35499 -26433 -5664 -82315
5110 -82315 -152543 -136283 -83569 -92688 -157645 -168212 -165291 -137256 -10218 21877 5374 -50440
5098 -50440 -112443 -118446 -91900 -14793 59285 78074 93452 32593 22866 43758 27387 13326
5086 13326 15535 -1888 60822 81321 7663 10449 -27260 -13762 7004 -51107 -9681 26532
5074 26532 13847 -16287 -33610 7948 69855 37990 8122 29286 25083 16608 52377 128624
5062 128624 179881 139237 57898 -13773 4362 34710 7631 40614 5349 28872 81156 51163
5050 51163 8629 -19361 16281 28833 24961 15416 -8880 21233 42439 84166 71975 48625
5038 48625 64197 42948 69652 -11443 -59825 -51090 -39610 -16640 43135 43073 18090 39334 56476
5025 56476 59593 -56436 -190105 -210919 -203804 -193508 -151272 -173147 -117952 -76551 -36918 -6203
5013 -6203 11582 -49159 -20721 14342 16392 41491 11878 -17326 -10545 35515 64211 -39884
5001 -39884 -123065 -27861 48698 -11933 13082 29332 52547 90239 135494 69524 32795 -7497
4989 -7497 -20924 -20132 -65927 -49159 -91497 -32044 -9986 -89036 -36829 -20507 -14118 -7483 27634
4976 27634 114904 83622 64269 11031 49088 89640 112612 88769 87977 60803 77216 111779
4964 111779 84770 54169 -6146 -8199 -41077 -92052 -34973 8486 -15175 -53127 -62672 -66047
4952 -66047 42017 57459 14632 -48008 -62954 -78432 -42457 -7935 15544 60441 106955 136300
4940 136300 128427 52593 -8578 -53001 -1123 -57402 -110540 -46946 -57656 -34470 -794 -49807
4928 -49807 -53254 -22222 -35156 -2315 8065 -48832 -23648 38439 84181 72493 50996 60764
4916 60764 111725 166394 171391 116692 64171 31331 62132 70259 45289 38044 34484 -28426 -39504
4903 -39504 -17069 42513 62924 6131 -7894 -42337 -66087 -35281 -44968 5746 34716 43593
4891 43593 85974 9324 -47332 -70821 -43448 497 -23531 31176 12982 -12481 -21983 -14574
4879 -14574 28680 56692 37043 25429 66916 29986 -16069 44313 41375 35727 32214 14873
4867 14873 64035 76678 110940 46312 17836 -27571 -81712 -95156 -43861 -65075 -35622 30612
4855 30612 55034 26450 -38527 -53863 4364 -15466 -10382 -33796 -22974 66059 58616 94013
4843 94013 46159 47453 60283 49561 51814 82470 36962 27014 -5489 -6555 -20437 -14902 -9497
4830 -9497 -15083 -43488 -62675 -5278 71784 49363 14009 22135 -35876 -91457 -78174 -43332
4818 -43332 -38413 -26901 3417 -1711 -83698 -108280 -95100 -13399 -17243 -6931 -50604 -55199 -34096
4805 -34096 -9564 22102 24786 10900 10453 -3067 -44869 -55662 -56072 -53684 -98200 -115933 -82085
4792 -82085 -51391 -81221 -74578 -118697 -126913 -52386 -16517 -25125 -99516 -81364 -41603 15672
4780 15672 91769 95889 47197 5127 -13864 -63698 -116189 -61893 -2691 7665 -59978 -120975
4768 -120975 -75350 -93363 -65123 -42624 -5443 -17066 43250 42643 -707 -78015 -63168 1635
4756 1635 8900 2239 -18627 -73100 -63938 1052 28129 4105 -19289 -33782 -24191 -1231 -47795
4743 -47795 -88028 -61703 -9292 -46331 -88634 -121442 -86562 -50700 -1013 -17271 4178 13620
4731 13620 -94667 -153581 -271180 -224934 -108265 -96570 -39498 17678 67230 33753 -1005
4720 -1005 -24850 -88014 -130141 -117756 -121103 -122665 -115425 -131666 -144148 -149248 -126348 -101347 -104680
4707 -104680 -120385 -125939 -72657 -18020 113214 138978 74100 61352 9100 -25406 6547 -12370
4695 -12370 786 48486 33776 2267 33487 1895 -81686 -104116 -28421 -32135 -35377 8418
4683 8418 29874 71754 104881 64629 23414 -3621 3599 -18754 -20866 -15421 -22561 26814 42014
4670 42014 44244 -19715 -94505 -92230 -69592 -24416 -61378 -26052 89599 105591 26026 -48435
4658 -48435 -91731 -8136 52298 10705 -53895 -98817 -28304 18457 5652 -98419 -83965 4954
4646 4954 57289 28831 24447 -12295 74165 141572 85899 21301 -21482 -89365 -57631 -54704
4634 -54704 -44820 -18940 11130 72668 107115 67988 40968 68309 94832 43819 62612 66088
4622 66088 100998 71877 8096 -20251 41723 34549 20515 2617 20104 113039 148743 123027
4610 123027 54847 -20914 -22904 70453 148521 114027 76418 54567 74704 12594 -72880 -92355
4598 -92355 -124003 -112169 -156574 -165232 -74836 -30816 -34118 -34463 25505 27213 40426 51355 76699
4585 76699 48445 -43178 -112989 -68639 -39798 -34715 -74170 -38440 5387 2920 -229 30137
4573 30137 50195 42395 -19906 -18686 1761 -45827 81 30848 83629 175342 225479 132462
4561 132462 91399 64003 -18998 -79629 -43918 -35672 -42643 -22404 -2788 -24924 -42459 -35786
4549 -35786 -3767 16416 39486 52825 58066 130521 74328 673 -37026 -65699 -38826 48676
4537 48676 39833 -36770 -90925 -59840 -50891 17849 39043 -65354 -42167 -14151 -35389 -28950
4525 -28950 -30017 13520 -24087 -76188 -159078 -163363 -73935 -53424 -130083 -110352 -41830 -4907
4513 -4907 21908 -11680 32713 -5716 -72034 -47618 -1330 11981 15036 -9790 -78070 -86481
4501 -86481 -77336 -109964 -79410 -63724 -112075 -147085 -155642 -151868 -70691 68571 90470 58122
4489 58122 17501 -48282 -109108 -75768 -42407 -6761 -2365 -18718 -62439 -97600 -71575 -62873
4477 -62873 -101716 -103556 -76539 -47190 -37298 18952 15523 -5914 -41796 2574 34026 16011
4465 16011 -6958 -36759 -10475 18420 36750 34120 55326 18125 8944 -53632 -80536 -96386
4453 -96386 -65026 3288 90398 92025 24073 -1240 -39300 -68157 -51441 -94350 -58676 -6496
4441 -6496 25296 40577 28710 66371 62967 -28159 -64420 -34526 -53503 -27296 -78472 -94183
4429 -94183 -116799 -70125 -89736 -103781 -65660 -110881 -138946 -92608 -110822 -64606 -51625 -48255
4417 -48255 -118499 -93373 -32301 -18610 934 -20255 -70843 -57875 -119525 -75114 -79206 -78697
4405 -78697 -30399 -49514 -17175 16449 -23687 -60806 -94724 -93082 -26407 -34565 -1086 -2345
4393 -2345 -49230 -55814 -43919 -70438 -68879 -52095 -70024 -80842 -64483 -9394 -19768 -8888
4381 -8888 17939 -76595 -116665 -91756 -100142 -144790 -130948 -130831 -81156 -36867 -43569 -38189 -18674
4368 -18674 -67807 -93819 -5564 -16694 -19953 31254 34557 -26931 -36455 32691 11179 -31288
4356 -31288 -32012 -19298 27227 41018 35254 71984 62449 -8861 -39477 -39246 -71483 -31489 -30480
4343 -30480 -85621 -69699 -6106 28289 -10150 -52413 -37713 -29909 22172 44110 56609 24539
4331 24539 -31537 -39813 11243 66869 45878 -5991 -79542 -61546 20030 21032 16214 56389
4319 56389 65729 68075 128827 135088 99451 50897 29536 91965 103282 137291 116604 68004
4307 68004 15816 -22015 -56507 -98420 -126093 -158800 -176365 -151744 -127917 -143779 -155620 -139876
4295 -139876 -82117 -63913 -127511 -127662 -74276 -8967 32127 49107 27440 16473 25372 3015
4283 3015 29708 11514 17690 16857 964 -37748 12843 -39729 -2619 47534 79125 32885 30290
4270 30290 83405 77707 74059 86661 76746 80557 51045 45195 76365 35750 -9799 11840 -22961
4257 -22961 -48014 -1703 43553 -15135 -19262 1301 13591 64544 140381 137307 101042 128363
4245 128363 174927 150128 93628 15526 6550 60353 37037 -4438 -16835 -13392 -29473 -71831
4233 -71831 -59985 29339 179142 215537 147925 41854 -686 -17100 -2655 -76552 -107441
4222 -107441 -108201 -117529 -79834 -51447 17438 29429 6472 224 7680 21088 -41728 36645 48118
4209 48118 47215 93082 45061 48640 67429 44451 28003 -33041 -25557 24739 48838 91550 110549
4196 110549 97707 55149 17686 48705 10840 -110297 -103659 -56234 -13384 -54709 -29526 52362
4184 52362 1283 -74962 -106541 -164584 -96156 -28559 -23019 -2430 27456 108876 108988 80648
4172 80648 30563 4810 21901 54562 61865 31641 2153 -49952 -96913 -113358 -97159 -36052
4160 -36052 33653 29183 -48379 -36897 29027 37094 -117912 -130657 19183 60060 119 4298
4148 4298 -12284 -33684 -42946 -45878 -91008 -173651 -174674 -91411 -116148 -77563 -19169 32742 103362
4135 103362 43227 2554 16501 -7808 -11645 15645 45527 -33718 -47578 92909 135648 113488
4123 113488 76506 -59702 -87363 2754 66219 104214 60241 -34446 -64880 -34539 -5857
4112 -5857 -43829 -22810 -6990 -54163 -80379 -112191 -134739 -114927 -131130 -141425 -49599 -67359
4100 -67359 -54234 3929 35890 9718 -15165 -11057 -21987 -13042 105694 163443 93066 42648
4088 42648 40574 45895 -42204 -76901 -38638 -14296 43573 -15045 -80668 -52353 24082 13625
4076 13625 77570 195428 211417 105001 54376 7827 46002 66727 24393 -20724 -2990
4065 -2990 -42797 -20205 20972 -54693 -69822 -47496 15704 85625 26591 35511 64785 112610
4053 112610 118487 64110 96599 88693 58515 49360 -49443 -102400 -167986 -215367 -164938 -161910
4041 -161910 -133776 -15770 51696 38534 18861 -37812 -631 84206 66556 38761 31375 35414
4029 35414 146026 193748 71296 5627 32396 29712 -31609 -69191 -65287 -47753 -67461 -90526
4017 -90526 -56420 -56557 -66209 -2901 -55530 -101543 -85028 -22258 -42199 -69768 -75387 -107107 -115698
4004 -115698 -73457 -79355 -100777 -23670 -10032 -71892 -93295 -79465 13924 49663 -6698 -44860
3992 -44860 27250 56571 -16100 -18954 -4955 -2161 -53514 -58635 -70777 -111274 -153256 -162864 -110829
3979 -110829 35936 81665 59536 71695 93557 117854 71406 17718 -7082 -36104 -15277
3968 -15277 -32531 -43118 -55465 -92170 -131315 -106341 -71045 -31196 -19978 -4282 -21485 -85740
3956 -85740 15152 115751 66931 13290 -6953 -24135 -64125 -5661 50785 1266 28176
3945 28176 39444 -39141 -70192 -89696 -94965 -76118 30106 66302 4215 22538 1420 46222
3933 46222 144234 95089 29347 44234 -8268 -27475 -50674 -69841 -57186 28405 37810 -63404
3921 -63404 -116390 -130857 -74790 -48016 -58066 -4829 -5395 -15895 -82840 -75095 -62703 -56574 -79393
3908 -79393 -34694 -33552 -1511 38686 14386 18096 83662 76832 49914 -4717 -4266 22897 39890
3895 39890 63367 21284 51761 76603 64360 71352 46039 28927 35062 64917 19937 -74758
3883 -74758 -116556 -97284 -84856 -89541 -16248 -30925 -40321 81879 90482 144181 177349 77637
3871 77637 19850 -11929 38245 73665 22799 30482 50488 106853 64860 24110 6626 -62949
3859 -62949 -80255 -24412 76568 50740 -7694 66875 41399 49955 23340 -3285 -29091 -83067
3847 -83067 -56752 -65356 -104053 -10632 20371 -20678 -9313 14444 4935 19402 -4042 -4536 -65013
3834 -65013 -62529 -116031 -115561 -101960 -113112 -45907 -31023 -16996 -7360 28689 46846 27940 73466
3821 73466 118953 84547 35330 -28781 -24489 -100503 -88190 -28534 -78370 -64443 -77461 -171867
3809 -171867 -146688 -47868 60235 98955 34320 -12021 29643 16939 -10851 2108 -31835
3798 -31835 -30970 -71499 -121053 -151554 -75970 -49354 -16491 -30252 -44562 -89048 -124891 -90632
3786 -90632 -94083 -94024 -82747 -48098 -79299 -139476 -118074 -99493 -120281 -118628 -56044 -33891 28685
3773 28685 -19235 -66101 -38674 -15166 -89506 -132890 -143881 -168418 -199035 -185114 -138579 -85208
3761 -85208 -14370 55234 6617 20540 29851 -64867 -109663 -99925 -2325 -22969 -25617 -6334
3749 -6334 55 -51304 -38283 -3089 32648 105717 187916 125224 50920 982 -27489 -17631
3737 -17631 44898 95457 105698 111027 117719 106625 63489 24380 49277 9902 -18699 -7523
3725 -7523 -43249 -87987 -92142 -43074 -95775 -86293 -97873 -123593 -78599 -41724 -34020 -18091 -73618
3712 -73618 -41992 2966 5893 2475 -40728 32893 111457 91512 93315 66118 41630 -42242
3700 -42242 -76254 -36150 6865 22981 -23901 13790 70133 33819 40913 2826 -28170 9591
3688 9591 83488 104612 107661 14479 -15707 38701 61933 71469 21707 -52290 -78877 -60160
3676 -60160 -39647 14257 -30122 -79686 -149575 -97038 -15878 -10182 -47657 -46409 -87729 -81991
3664 -81991 -47009 -57479 14820 17663 -14535 -17493 32470 42844 29185 -54755 -66690 -1473
3652 -1473 33114 50557 108910 82951 -75734 -178595 -199938 -126577 -92921 -84417 -103723 -146444
3640 -146444 -134348 -120347 -131477 -124232 -115230 -149512 -117212 -50536 -45802 -16620 54552 103191
3628 103191 57747 -3707 60136 84813 60584 53203 41647 28342 80797 45402 -4188 25783
3616 25783 67263 55155 -55937 -103662 -5582 9828 2704 47528 102202 117624 94752 31779
3604 31779 15068 71450 25587 -31746 -11545 -16125 89884 109325 61347 22272 80083 118379
$$ [...]
##END NTUPLES=NMR SPECTRUM
##END=
