##TITLE=Analysis number 312181
Compound Code cc 42113
Book Reference 437/22
Project Code qc-cat
Chemist Name wendyb
##JCAMPDX= 6.0         $$ Bruker NMR JCAMP-DX V2.0
##DATA TYPE= NMR SPECTRUM
##DATA CLASS= NTUPLES
##ORIGIN= Bruker BioSpin GmbH
##OWNER= NMR
$$ XWIN-NMR		Version 3.5
$$ Wed Jul 27 09:54:20 2005 GMT Daylight Time (UT+1h)  MAYBRIDGE\NMR@NMR_250MHZ
##.OBSERVE FREQUENCY= 250.131544655141
##.OBSERVE NUCLEUS= ^1H
##.ACQUISITION MODE= SIMULTANEOUS (DQD)
##.ACQUISITION SCHEME= undefined
##.AVERAGES= 16
##.DIGITISER RES= 18
##SPECTROMETER/DATA SYSTEM= dpx250
##.PULSE SEQUENCE= zg30
##.SOLVENT NAME= CDCl3
##.SHIFT REFERENCE= (INTERNAL, CDCl3, 0, 16.522)
##AUDIT TRAIL= $$ (NUMBER, WHEN, WHO, WHERE, WHAT)
$$ ##TITLE= Audit trail, XWIN-NMR		Version 3.5
$$ ##JCAMPDX= 5.01
$$ ##ORIGIN= Bruker BioSpin GmbH
$$ ##OWNER= NMR
$$ C:\u/data/dgb/nmr/ADRS/6690/pdata/1/auditp.txt
$$ ##AUDIT TRAIL=  $$ (NUMBER, WHEN, WHO, WHERE, WHAT)
(   1,<2005-07-27 09:53:55.16 +100>,<MAYBRIDGE\NMR>,<NMR_250MHZ>,
      <created by zg, POWCHK disabled, PULCHK disabled
       configuration hash MD5:
       62 19 C7 07 E1 42 D1 B7 37 6C 3D D0 77 39 F9 E6
       data hash MD5: 64K
       5E 25 78 0D C7 FA 26 ED C9 F4 1F 5D 6C 44 76 BA>)
(   2,<2005-07-27 09:54:08.61 +100>,<MAYBRIDGE\NMR>,<NMR_250MHZ>,
      <Start of raw data processing
       ef LB = 0.3 FT_mod = 6 PKNL = 1 SI = 32K 
       data hash MD5: 32K
       00 A5 B1 4D 3F 53 DD 6A 0A 18 80 2B 98 3D 58 CC>)
(   3,<2005-07-27 09:54:10.44 +100>,<MAYBRIDGE\NMR>,<NMR_250MHZ>,
      <apk 
       data hash MD5: 32K
       67 35 04 19 CE 65 FF 0C 18 75 81 F9 0D 83 63 4A>)
(   4,<2005-07-27 09:54:11.18 +100>,<MAYBRIDGE\NMR>,<NMR_250MHZ>,
      <abs ABSG = 5 
       data hash MD5: 32K
       3C 04 3F 3F 30 8E 99 12 E8 30 BB E3 23 8D 9E 1F>)
$$ ##END=
$$ 
$$ hash MD5
$$ 4E 0E EF D5 A3 35 3E CF 28 97 21 DA 40 3C 2C FC
##$RELAX= 
##$RELAX= 
##$RELAX= 
##$RELAX= 
##$RELAX= 
##$RELAX= 
##$RELAX= 
$$ Bruker specific parameters
$$ --------------------------
##$DU= <C:\u>
##$EXPNO= 6690
##$NAME= <ADRS>
##$PROCNO= 1
##$TYPE= <nmr>
##$USER= <dgb>
##$AMP= (0..31)
100 100 100 100 100 100 100 100 100 100 100 100 100 100 100 100 100 100 
100 100 100 100 100 100 100 100 100 100 100 100 100 100 
##$AQSEQ= 0
##$AQ_mod= 3
##$AUNM= <au_zg>
##$AUTOPOS= <5 >
##$BF1= 250.13
##$BF2= 250.13
##$BF3= 250.13
##$BF4= 250.13
##$BF5= 500.13
##$BF6= 500.13
##$BF7= 500.13
##$BF8= 500.13
##$BYTORDA= 1
##$CFDGTYP= 0
##$CFRGTYP= 5
##$CHEMSTR= <none>
##$CNST= (0..31)
1 1 145 1 1 1 1 1 1 1 1 1 1 1 1 1 1 1 1 1 1 1 1 1 1 1 1 1 1 1 1 1 
##$CPDPRG= <>
##$CPDPRG1= <>
##$CPDPRG2= <>
##$CPDPRG3= <>
##$CPDPRG4= <mlev>
##$CPDPRG5= <mlev>
##$CPDPRG6= <mlev>
##$CPDPRG7= <mlev>
##$CPDPRG8= <mlev>
##$CPDPRGB= <>
##$CPDPRGT= <>
##$D= (0..31)
0 1 0 0 0 0 0 0 0 0.06 0 0 0 0 0 0 0.0002 0 0 0 0 0 0 0 0 0 0 0 0 0 0 
0 
##$DATE= 1122454434
##$DBL= (0..7)
120 120 120 120 120 120 120 120 
##$DBP= (0..7)
150 150 150 150 150 150 150 150 
##$DBP07= 0
##$DBPNAM0= <>
##$DBPNAM1= <>
$$ [...]
##$SUBNAM7= <"">
##$SUBNAM8= <"">
##$SUBNAM9= <"">
##$SW= 20.6930455092707
##$SWIBOX= (0..15)
0 0 3 0 0 0 0 0 0 0 0 0 0 0 0 0 
##$SW_h= 5175.983436853
##$TD= 65536
##$TD0= 1
##$TE= 295.16
##$TE2= 300
##$TE3= 300
##$TEG= 300
##$TL= (0..7)
0 120 120 120 120 120 120 120 
##$TP= (0..7)
150 150 150 150 150 150 150 150 
##$TP07= 0
##$TPNAME0= <>
##$TPNAME1= <>
##$TPNAME2= <>
##$TPNAME3= <>
##$TPNAME4= <>
##$TPNAME5= <>
##$TPNAME6= <>
##$TPNAME7= <>
##$TPOAL= (0..7)
0.5 0.5 0.5 0.5 0.5 0.5 0.5 0.5 
##$TPOFFS= (0..7)
0 0 0 0 0 0 0 0 
##$TUNHIN= 0
##$TUNHOUT= 0
##$TUNXOUT= 0
##$USERA1= <user>
##$USERA2= <user>
##$USERA3= <user>
##$USERA4= <user>
##$USERA5= <user>
##$V9= 5
##$VALIST= <valist>
##$VCLIST= <CCCCCCCCCCCCCCC>
##$VD= 0
##$VDLIST= <DDDDDDDDDDDDDDD>
##$VPLIST= <PPPPPPPPPPPPPPP>
##$VTLIST= <TTTTTTTTTTTTTTT>
##$WBST= 1024
##$WBSW= 4
##$XGAIN= (0..3)
0 0 0 0 
##$XL= 0
##$YL= 0
##$YMAX_a= 323397
##$YMIN_a= -568705
##$ZGOPTNS= <>
##$ZL1= 120
##$ZL2= 120
##$ZL3= 120
##$ZL4= 120
##$ABSF1= 16.522
##$ABSF2= -4.171173
##$ABSG= 5
##$ABSL= 3
##$ALPHA= 0
##$AQORDER= 0
##$ASSFAC= 0
##$ASSFACI= 0
##$ASSFACX= 0
##$ASSWID= 0
##$AUNMP= <proc_1d>
##$AZFE= 0.1
##$AZFW= 0.1
##$BCFW= 0
##$BC_mod= 0
##$BYTORDP= 0
##$COROFFS= 0
##$CY= 12.5
##$DATMOD= 1
##$DC= 0
##$DFILT= <>
##$DTYPP= 0
##$F1P= 14.0000005364418
##$F2P= -0.99999901652339
##$FCOR= 0.5
##$FTSIZE= 32768
##$FT_mod= 6
##$GAMMA= 0
##$GB= 0
##$INTBC= 1
##$INTSCL= 1
##$ISEN= 128
##$LB= 0.3
##$LEV0= 0
##$LPBIN= 0
##$MAXI= 10000
##$MC2= 0
##$MEAN= 0
##$ME_mod= 0
##$MI= 0
##$NCOEF= 0
##$NC_proc= -5
##$NLEV= 6
##$NOISF1= 0
##$NOISF2= 0
##$NSP= 0
##$NTH_PI= 0
##$NZP= 0
##$OFFSET= 16.522
##$PC= 1
##$PHC0= -76.21415
##$PHC1= 3.475113
##$PH_mod= 1
##$PKNL= yes
##$PPARMOD= 0
##$PSCAL= 4
##$PSIGN= 0
##$REVERSE= no
##$SF= 250.13
##$SI= 32768
##$SIGF1= 0
##$SIGF2= 0
##$SINO= 400
##$SIOLD= 32768
##$SREGLST= <1H.CDCl3>
##$SSB= 0
##$STSI= 32768
##$STSR= 0
##$SW_p= 5175.98343685301
##$SYMM= 0
##$S_DEV= 0
##$TDeff= 65536
##$TDoff= 0
##$TI= <Analysis number 999999
Compound Code 99
Book Reference 9
Project Code 9>
##$TILT= no
##$TM1= 0
##$TM2= 0
##$TOPLEV= 0
##$USERP1= <user>
##$USERP2= <user>
##$USERP3= <user>
##$USERP4= <user>
##$USERP5= <user>
##$WDW= 1
##$XDIM= 32768
##$YMAX_p= 434924236
##$YMIN_p= -280940
$$ End of Bruker specific parameters
$$ ---------------------------------
##NTUPLES= NMR SPECTRUM
##VAR_NAME=  FREQUENCY,     SPECTRUM/REAL,   SPECTRUM/IMAG
##SYMBOL=    X,             R,               I
##VAR_TYPE=  INDEPENDENT,   DEPENDENT,       DEPENDENT
##VAR_FORM=  AFFN,          ASDF,            ASDF
##VAR_DIM=   32768,         32768,           32768
##UNITS=     HZ,            ARBITRARY UNITS, ARBITRARY UNITS
##FACTOR=    0.157963299565203, 1,           1
##FIRST=     4132.6476996994, 0,             0
##LAST=      -1043.33573715361, 0,           0
##MIN=       -1043.33573715361, -280940,     0
##MAX=       4132.6476996994, 434924236,     0
$$ Real data points
##PAGE= N=1
##DATA TABLE= (X++(R..R)), XYDATA
$$ [...]
22128 -124369 -74671 19458 28630 -14931 -19167 -32802 -92481 -28594 3946 -35147 -2775 -62393
22116 -62393 -114256 -135334 -153736 -158146 -131961 -111571 -48849 -20882 -15165 -40855 -97524 -81892
22104 -81892 -18107 21034 56709 -22218 -102269 -74132 -18757 -33685 -49760 22495 52280 -27261
22092 -27261 -79192 -52705 41887 7431 -39583 -9602 30551 27775 33539 68234 -8845 -34586
22080 -34586 4258 79850 136990 111551 92262 99285 31072 42016 59422 15400 -41652 -82402
22068 -82402 -84064 -14378 68716 -4171 -101656 -51951 19148 19686 27289 -1372 27828 43539
22056 43539 -21996 -27594 -67061 -38197 -4728 -67434 -61782 -5526 12202 -23000 -17168 -37071
22044 -37071 -63492 -50092 -19554 -94019 -57608 32390 52578 50037 53802 69420 70338 -615
22032 -615 -60790 -46734 20573 17692 2080 34496 19634 43750 70661 48549 -53176 -114690
22020 -114690 -78156 -59265 -37612 -50328 -63378 -106423 -104746 -116861 -81991 1278 -3935 -21716
22008 -21716 -22120 -10494 -20216 -39184 -74902 -81139 -78524 -139275 -93865 -10933 -23415 -13309 -48182
21995 -48182 -11934 12044 13165 37679 1626 15122 1509 -38638 -114668 -182992 -162185 -109097
21983 -109097 -76789 -70827 -42338 21020 68704 91994 -21113 6510 -20996 -74928 -70414 -95111
21971 -95111 -71937 -70115 -92946 -91982 -76547 -132998 -218132 -224066 -132483 -109959 -138394 -113144
21959 -113144 -56285 -90950 -161719 -133678 -124909 -81396 -115006 -155659 -103075 -86065 -45096 -27106
21947 -27106 47465 107824 151607 119003 41350 71132 67143 -38013 7838 -13834 92763
21936 92763 74666 56676 18269 -2996 35018 96035 55604 -65440 -68579 -42009 -80186 -124869
21924 -124869 -72996 -34655 -19159 -58730 -26310 41868 -26641 -47361 -9396 -37110 -64245
21913 -64245 -116540 -75176 987 81352 39418 -94696 -36929 13728 75650 121014 126902 84294
21901 84294 35104 -88835 -83004 -53210 39687 100116 159680 81621 82543 10746 -42114 -41253
21889 -41253 69246 86403 92794 32190 41790 10671 -75934 -94902 -44566 15445 71107 80120
21877 80120 102527 29420 40350 67054 45835 -26209 -73343 -42714 -34621 -39490 -18703 -55622
21865 -55622 -102912 -69272 -84442 -28875 -2441 19221 70172 68808 -39808 -68794 -18149 45217
21853 45217 15488 1371 -16622 9845 -5691 -87713 -61362 -45015 -44189 3823 10649 -693
21841 -693 82876 129662 109807 76711 102148 77361 21955 -9796 19504 26316 -38428 6201
21829 6201 34132 24047 -43483 -132710 -128673 -122774 -101055 -87104 -30441 94160 176503 152124
21817 152124 116251 27427 -76003 -137234 -108469 -134015 -133750 -62460 8903 74627 32812 -8831
21805 -8831 -10031 7101 -44089 -61242 -126490 -107083 -75076 -84581 -76918 -74304 -77811 -93975 -66051
21792 -66051 -53707 -47161 -37029 -45605 -6836 -52356 12140 27300 58980 57059 -32437 -67743
21780 -67743 -42023 -10499 65446 4382 -60102 -117042 -63621 -32073 -21281 58163 27250 -242
21768 -242 -24287 -23329 7826 -15591 -31470 -53610 -7187 77754 71252 91776 99170 45615 48413
21755 48413 -784 -13228 -40436 -131406 -186173 -116371 -15057 -51890 -103784 -76526 -115742
21744 -115742 -158817 -131170 -114129 -142689 -60142 -17856 -34709 -50073 -79170 -100786 -147661
21733 -147661 -146939 -112991 -72438 -72124 -97214 -150540 -134520 -100174 -93170 -39493 12575 56092
21721 56092 25517 10640 37359 44387 43396 17050 -8006 6270 -12758 -78784 -99670 -20440
21709 -20440 -2291 -34689 -16760 -63118 -76495 -125902 -92980 -59099 -88826 -110094 -2326
21698 -2326 28591 -19369 -35990 -50985 -78527 -28681 -89232 -160417 -174043 -128752 -27414 -14109
21686 -14109 -7645 61288 15688 -43874 -69582 -68499 -95865 -141421 -142298 -55019 -54412 -63322 -22557
21673 -22557 -49669 -69691 31402 69923 33848 -16302 -17460 -16667 -9285 -24262 -37803 26542
21661 26542 89323 42240 78452 107636 158535 125817 77758 17471 -51890 -54489 14303 64744
21649 64744 93640 117578 87567 -33294 -111508 -108789 -143258 -155075 -125391 -66590 -93594 -93453
21637 -93453 -40169 48115 77435 11922 7839 -6070 -70070 -66974 -36740 -27383 2940 -25387
21625 -25387 -33452 -43829 -100038 -52765 -15949 -46349 -79659 -102583 -189580 -202717 -182068 -158327
21613 -158327 -153909 -167926 -115081 -88390 -137128 -121858 -21583 40912 27509 -60779 -154646
21602 -154646 -161652 -178633 -124582 5716 38926 42090 51018 26280 -31261 -31390 -27988 -23123 -4052
21589 -4052 8947 15072 -36407 -16379 -60197 -82701 -25547 1015 -30917 -79346 -135499 -139359
21577 -139359 -63247 -32477 -736 -25998 -45883 -106270 -145077 -214831 -221299 -137742 -105133 -6046
21565 -6046 3661 -67276 -99332 -41572 -61441 -13028 38742 3146 -6322 -11970 -67793 -11923
21553 -11923 68212 25784 -32619 -168816 -164390 -109109 -86445 -47120 -58610 -24808 -46787 -100730
21541 -100730 -103043 -34399 -75682 -122017 -122217 -137967 -86430 -86359 -104849 -94798 -60635 -9214 23826
21528 23826 49640 -15401 -12951 -8433 -104065 -117910 -54193 -77848 -82944 -42897 32578 -22260
21516 -22260 19275 90361 2938 -95258 -57786 11356 -29554 -5832 -1268 -22607 -106643 -192452
21504 -192452 -180714 -94236 -3499 14692 -50458 -105094 -30556 -14720 26100 41551 -11113
21493 -11113 -52264 -44065 -8222 22058 11863 -3834 -7614 26092 53587 -26668 -108148 -134219
21481 -134219 -118341 -121824 -140219 -84251 -44883 -158648 -189972 -78659 -15681 -42310 -31025
21470 -31025 6129 25802 -1414 19594 -21042 -109174 -98757 -30177 244 24041 -4627 3787
21458 3787 4992 4998 47588 46380 -33348 -91451 -119075 -95713 -47863 -1576 75775 139871 64677
21445 64677 45783 7296 17575 22741 -96187 -106707 -88108 -31564 -16893 -27272 3885 2513
21433 2513 -17222 -86223 -103008 -60740 -45211 -111479 -130374 -99993 -84008 -132407 -29220 -7799
21421 -7799 -37273 -46256 -71080 -55554 -25264 -43768 -84460 -65350 -91899 -42486 34702 36807
21409 36807 43174 -26882 -63653 -77406 -142148 -116276 -130801 -172650 -106704 -46416 -82565 -116149
21397 -116149 -29876 92307 64201 47700 37523 42816 72682 47828 -32830 -153118 -153151 -121323
21385 -121323 -63109 -39934 -41678 -50836 -50939 -73198 -76147 -45483 -50632 -35420 -33175 -96243 -171687
21372 -171687 -189782 -91394 5542 28036 16346 -6831 -41316 -121649 -88513 -19049 -44163
21361 -44163 -29109 -44694 -38139 -58820 -111156 -108132 -95151 -140145 -103547 -73698 -65715 24591
21349 24591 33242 44292 66942 31804 -1509 -48168 -51109 16982 81224 92385 22509 -41508
21337 -41508 -20876 -3324 -30616 -42047 -191 -14103 -72123 -46400 -27560 -80256 -108780 -131153
21325 -131153 -152569 -161298 -94142 -58757 -39917 -63180 -97319 -83635 -38775 -79593 -110134 -111865
21313 -111865 -54901 -28606 243 8867 -7166 49426 40870 12106 -24224 -33771 11219 39795
21301 39795 -47894 -48313 -26966 3483 1407 -67886 -94233 -76931 -100604 -86988 -11764 2706
21289 2706 -60478 -53154 -89698 -104589 -106676 -34280 -21832 22709 -5792 -29381 -51052 -39909
21277 -39909 -42342 -43689 -27288 -31944 -81710 -59276 -113689 -106580 -58046 -25041 -40432 -22032
21265 -22032 6236 10102 31976 52841 -55765 -49687 10225 3681 -51273 -78324 -138101 -184633
21253 -184633 -158825 -206116 -144306 -67221 28317 -28350 -120174 -114674 -126936 -135860 -80871 -92461
21241 -92461 -72122 -70308 -62850 -42836 -35353 -53125 -150103 -155324 -77650 -17196 4253 -72660
21229 -72660 -129638 -210810 -221311 -164705 -122050 -111158 -195660 -178382 -16892 -36544 -103950
21218 -103950 -102860 -39078 -37692 -7961 -13514 -55841 -26890 -61763 -79099 -51070 -29895 -31527
21206 -31527 -37063 -75404 -69227 -102949 -138713 -144291 -79911 -87531 -67772 -17901 -45425 -69453
21194 -69453 -110006 -24942 56924 49355 284 -30242 92750 178533 159757 100829 32673 3084
21182 3084 17875 43302 25078 -25603 -69505 -108268 -169572 -163440 -47579 44872 43223 -52610
21170 -52610 -62842 3024 50883 18495 -102285 -74793 -46245 12873 49253 72323 89987
21159 89987 84949 -13676 -28679 -203 -16743 43060 78119 -13811 -40259 -92720 -65510 -38781
21147 -38781 -15469 -70073 -140072 -148272 -61271 -4639 -33881 -39195 -129261 -162071 -106657 17407
21135 17407 61644 20133 -31779 -5316 43438 40274 -22960 -26119 -25436 -39663 -12737 -12035 30728
21122 30728 35917 14174 -18398 -14857 -3406 26290 13625 -2699 -10627 -42534 -19090 -58833
21110 -58833 -74224 -134535 -111500 -104746 -130634 -87291 -84680 -70949 61661 118463 62263 22642
21098 22642 -20039 11315 55971 -18940 -51118 -11724 -6050 -80135 -103310 3812 39142 19005
21086 19005 -51696 -61146 -29166 -48745 -93160 -154719 -139784 -167901 -223519 -214085 -160419 -125821
21074 -125821 -160910 -135553 -169633 -136582 -48204 -19848 7179 63989 25128 -43827 -86097
21063 -86097 -118172 -156744 -132018 -2404 56989 1086 -71460 -12799 -22679 -82835 -28907 5739
21051 5739 1004 29800 82961 15153 -34102 -96033 -166880 -128043 -121948 -120265 -43264 16309
21039 16309 40336 47000 73686 77632 73782 12027 -33245 -50459 -3309 -48811 -31154 24569
21027 24569 2547 15200 -18703 -51522 -80250 -97309 -42835 -62534 -65172 25440 22149 12825
21015 12825 7094 -66841 -74724 -93807 -74111 -26823 29845 -15594 -36618 23012 116920 86824
21003 86824 1915 -34299 -74833 -63796 -65212 -93415 -142705 -137902 -169082 -115314 -90362 -76919
20991 -76919 -131919 -182439 -118989 1284 -22926 -73192 -70130 1670 83782 165971 130808 85734
20979 85734 -15355 -107394 -33032 78245 83040 6932 -27910 -84478 -66703 -103391 19944
20968 19944 65725 19837 27824 68553 22588 -27699 -20274 -45707 -44403 1292 -33463 -103190
20956 -103190 -157570 -118501 -126781 -29259 17667 -52531 -85040 11422 75059 46382 44173 19671
20944 19671 37355 78873 77511 132838 146551 86803 31297 45195 41711 -36642 -81955 -81940 -19568
20931 -19568 7980 12713 23177 4469 -30145 -113960 -148013 -37584 -29794 -37458 -104418 -69101
20919 -69101 -56888 -19670 -17174 -74708 -41224 -43510 -46663 -78012 -94687 -77473 -61271 -10037
20907 -10037 -56850 -114560 -109002 -118854 -63662 5669 30183 -52003 -114154 -121883 -72015 -50123
20895 -50123 -79880 -171940 -132881 -49290 -87471 -88909 -128492 -60736 -80745 -150854 -179400 -27310
20883 -27310 27406 -42394 -49188 -9420 -17041 -10433 13830 33701 30075 -7927 -18692 -30329
20871 -30329 -38242 -27520 -38105 -68148 -66457 -85164 -92823 -137376 -110675 -42232 8399 -39815
20859 -39815 -66240 -79174 -145269 -139052 -114395 16275 73587 -12305 -52467 -71083 -124405 -50798
20847 -50798 11610 45605 14700 36536 28048 -58137 -70229 -6928 -27628 -40574 -12543 -53962
20835 -53962 -107957 -111665 -91327 -65666 -48455 -35305 -32939 -55155 -17834 -6426 -79789 -120697
20823 -120697 -50923 -20894 42441 41706 6693 -12619 10806 -10302 -68154 -75395 -63840 -25252
20811 -25252 -46689 -79782 -95948 -122936 -73651 -88316 -153752 -183787 -192834 -187123 -138454 -112534
20799 -112534 -104492 -132174 -110860 -89207 -99665 -103373 -105239 -36668 -938 17148 61361 35887
20787 35887 -55142 -93909 -84181 -42856 40265 71282 -959 -69512 -107017 -92771 -33005 -38953
20775 -38953 -153541 -190007 -178600 -120134 -99804 -75953 -53254 -19869 -16832 -54258 -113694 -83914
20763 -83914 -26452 -21920 -60827 -55099 9386 62919 102095 68007 37090 736 -121849 -146417
20751 -146417 -98642 -20112 -5967 -105003 -123573 -79499 12511 47579 -83771 -125622 -49360
20740 -49360 -9681 53775 50791 27213 -41234 -109233 -43430 -73708 -99579 -86093 -113325 -19474
20728 -19474 12740 -21572 -100967 -84668 14796 87885 46964 -19983 -44283 -22156 -105959 -170813
20716 -170813 -87819 -12084 -44515 -64050 -18760 -28633 -63728 -69928 -28539 11301 99512 126208
20704 126208 59252 3610 -24164 7866 -35101 -61186 6930 12667 -10629 16989 7993 -75798
20692 -75798 -106999 -53816 8407 56134 74830 93103 80659 114942 42626 -34312 -99303 -93806
20680 -93806 -62213 -59450 -55506 -35056 -50668 -83457 -79536 -45720 -66293 -91386 -117379 -135785
20668 -135785 -146927 -89869 -33082 -108217 -152427 -132929 -145718 -116632 -69996 -54113 -60779 -55360
20656 -55360 -61885 -93966 -56760 -16028 -86792 -89355 -41658 11089 28829 -21080 -26031 -115159
20644 -115159 -124022 -145993 -116546 -61771 -129478 -179409 -173413 -159327 -75664 30861 2951 -28652
20632 -28652 -22089 -39742 -65746 -94777 -135643 -180664 -157011 -97255 -84684 -57247 15823 9423
20620 9423 50075 85975 72331 15227 9996 -83224 -149519 -168035 -90305 44193 -21946 -187024
20608 -187024 -159068 -94097 -46513 24410 -44807 -79641 -52481 -71743 -43870 -3833 11948
20597 11948 -48047 -137145 -121236 -22269 87887 68694 8854 -41007 -94770 -68431 -61195 -51845
20585 -51845 -27046 -69907 -51355 -57836 -120838 -51715 -7781 -15560 -26701 -37494 -74101 -21128
20573 -21128 -24713 -52887 -39164 -53867 -43642 -12622 6597 -70057 -63842 -110483 -124292 -61911
20561 -61911 -28801 -67376 -128840 -130333 -63321 1765 29066 43873 -1036 -10093 -109380 -168331
20549 -168331 -29031 55043 41920 8539 43258 -31495 -104740 -99539 -17689 22104 -2821
20538 -2821 61049 67314 27042 53039 47628 -8351 -28463 46920 97759 12905 -129217 -225649
20526 -225649 -138089 -68986 -74751 -49974 -147167 -136439 -134141 -145090 -116631 -150184 -133435 -152722
20514 -152722 -160298 -138860 -66404 -45951 -101684 -114579 -123321 -172375 -112400 -91813 -130888 -124501
20502 -124501 -68890 -105200 -98312 -94115 -103793 -101442 -97562 -64087 7931 18054 26285 8382 -43406
20489 -43406 -51724 -24027 -69152 -55789 -29891 -52468 -1229 7650 -63384 -71663 -37422 -30707
20477 -30707 -37298 -30906 37390 21010 -19321 14534 2374 -9837 2765 6674 -29105 -81867
20465 -81867 -115239 -91223 -136812 -88559 -57350 -46158 -65003 -99345 -40982 -94919 -134471 -146457
20453 -146457 -69864 -49506 -140744 -202229 -251600 -227794 -155268 -97941 -69922 -144251 -170573
20442 -170573 -117531 -103428 -85598 -41908 -55786 -98857 -175107 -199319 -195896 -177347 -182499 -141336
20430 -141336 -106122 -100916 -102149 -109535 -68519 -33536 33023 55781 31252 -17048 -44147 -15942
20418 -15942 10076 -1745 -23661 -153482 -194799 -137115 -172945 -170917 -90850 -66648 -163994 -140970
20406 -140970 -52909 -16728 -65439 -132504 -168877 -179443 -152990 -62311 -15496 37121 40117 55471
20394 55471 -2468 -6201 -17148 -17087 -23711 -42385 -15445 -42563 2549 -49840 -123673 -74384 -32691
20381 -32691 -92379 -171732 -35865 48891 26009 -26319 -43182 -52474 -82072 -83153 -76501 -99124
20369 -99124 -113859 -108166 -38028 -8575 5315 1332 58618 -22726 -111201 -80702 -21133 3379
20357 3379 48882 40247 16006 18850 -7363 -15341 -786 -38554 -93034 -170896 -188331 -169468
20345 -169468 -113663 -125690 -128739 -108839 -28270 83517 64252 -65750 -116460 -145167 -162396
20334 -162396 -93910 -47041 10911 87735 60055 -9888 -78558 -49967 -74790 -101257 -55835
20323 -55835 -49188 3671 -12565 -65428 -63505 27078 42598 19512 -22678 -16311 -4780 -72606
20311 -72606 -29794 30204 22176 7474 37688 56078 31063 -58559 -33688 5885 45771 106676
20299 106676 22007 -56094 -9520 -7816 -47337 -85368 -86844 -98361 -70822 -121290 -110810 -106333
20287 -106333 -134537 -84750 -50511 -82953 -33044 -33263 -81853 -59570 -23043 -46004 -43824 -29219
20275 -29219 -31435 -39371 -24582 -13169 -90280 -119350 -65068 -42428 -11476 6090 -29733 -35760
20263 -35760 -49451 -42734 -62806 -68909 -126566 -121013 -38410 -100148 -148819 -99095 -64927 -97866
20251 -97866 -77504 -33333 -51581 -100843 -71239 -94449 -178609 -161826 -98437 -101865 -86987 -81001
20239 -81001 -88057 -88168 -61059 -74168 -85776 -94029 -112783 -95821 -106339 -126724 -78868 -3404
20227 -3404 1510 -9821 3423 59572 94713 56683 -23076 -109380 -137216 -115059 -144338 -160698
20215 -160698 -144448 -38172 -10960 65567 19413 -112894 -133539 -114335 -142095 -164114 -154237
20204 -154237 -94343 -42261 -856 -1994 17622 15419 10947 -57097 -103396 -94831 -73467 -105183
20192 -105183 -93945 -5654 -40455 -63979 -13876 -40011 -68999 -114510 -73924 -42982 -69094
20181 -69094 -126796 -175940 -146092 -84911 -41655 -72967 -152634 -121723 -96630 -38316 79940
20170 79940 75445 65521 106353 60712 -25875 6645 16899 4291 -5178 -62765 -66330 -3485
20158 -3485 20659 -6412 8417 15984 -49815 -88955 -70321 -48766 -89137 -69329 -62651 -11824
20146 -11824 -25836 -106235 -207543 -221789 -184556 -101833 -4013 -40829 -81264 -59923 -53342 -25050
20134 -25050 -97257 -123594 -149540 -116675 -111636 -30922 62226 65510 56603 -6524 -49425 -54649
20122 -54649 -36366 -139856 -153075 -67137 -44325 -96564 -96558 -62080 -48108 -20505 29934 -4753
20110 -4753 -127813 -191111 -97735 -155602 -128050 -69633 -24742 -38432 46114 99311 97926 101235
20098 101235 41180 109148 84260 65330 105990 28511 -14456 -45129 -90770 -58119 -30218
20087 -30218 20015 -2387 -54931 -66004 -55718 2056 -11672 -11794 -45349 -62478 -80581 -48168
20075 -48168 50535 50078 54554 104219 113581 33492 -22600 378 -8931 -45995 -86778 -64596 1796
20062 1796 2658 -35391 -39589 19558 49262 -16824 -4157 15095 15482 -22548 -35412 32594 -16378
20049 -16378 -85123 -108928 -31118 45958 15738 -124030 -160818 -120300 -71856 -71797 -56137 -38075
20037 -38075 -57088 10894 -5694 -43360 -69129 -36324 -73720 -98789 -54874 -53423 -112745 -91437
20025 -91437 -67278 -119437 -160813 -140517 -117428 -108228 -108939 -21738 27421 35671 19639 25878 -40822
20012 -40822 -117645 -132486 -116608 -60758 -43006 -67386 -59596 -17449 -36455 37498 82453 63094
20000 63094 75396 49000 56283 66019 48933 27726 16239 4619 -38963 3136 43845 10684
19988 10684 11122 16511 71286 73929 140021 74879 44026 11194 -90443 -63123 3272 23940
19976 23940 49897 60281 30197 -9298 -3578 -31501 -48257 -16446 9221 45304 -237 -35069
19964 -35069 -85726 -25594 12425 -30492 -19823 -17421 26049 113267 83599 32475 45216 24290
19952 24290 -40734 -78944 -95783 -13289 -26777 -97738 -83587 -123454 -127697 -80614 -30033 60055
19940 60055 70082 66725 -29467 -82950 -157567 -164326 -180393 -150684 -120470 -67467 -49433 4505
19928 4505 -83386 -186793 -111793 -79759 -146365 -131302 -116450 -102530 -18451 37533 88939 82507
19916 82507 102219 167095 178686 162766 129913 56855 -24626 -43955 -84691 -129177 -111649 -75203
19904 -75203 -39502 23399 90450 107840 64779 72463 46220 8112 5487 -6103 -12344 -34696
19892 -34696 -24074 6394 -48538 -41464 27353 35624 -26503 -116948 -121891 -124983 -67763 -16678
19880 -16678 33931 -11850 -52245 52882 80493 64195 74845 55348 8919 -15153 12368
19869 12368 78006 76827 57947 52818 25606 -10162 -78809 -24644 -23035 -25063 -41379 -3587
19857 -3587 -39874 -104158 -60075 10157 -19869 -80916 -105571 -133406 -163291 -144865 -82334 -71804
19845 -71804 -133109 -58314 5840 -49248 -44635 -32649 -57887 -16960 1618 -67789 -53537 -96221
19833 -96221 -79580 -54952 20477 35513 9494 34403 9127 -5564 37660 -17593 2658 -49597
19821 -49597 -107875 -73949 -79134 -65076 -85708 -92987 -8629 42085 28522 25339 -7762 -52741
19809 -52741 -8814 -15991 -58431 -35039 -21222 -61415 -105170 -88644 -61273 -65722 -76790 -126059
19797 -126059 -155568 -129763 -77103 -73287 -55109 -4413 11010 -25824 -63233 -68939 -120246 -107107
19785 -107107 -54397 14948 21605 68300 105276 87504 9165 3078 -49549 -116451 -126297 -68828
19773 -68828 8254 -4042 23629 -3018 -12695 -6542 2523 24397 34594 12646 -119776 -70233
19761 -70233 62994 108315 168979 181562 207462 159156 151363 211053 215993 204278 213733 281040
19749 281040 309793 414984 507210 521792 563279 731547 867010 981109 1118895 1263398
19739 1263398 1353546 1383235 1441941 1599437 1737947 1854568 2011233 2147041 2333754 2380089
19729 2380089 2386057 2315149 2137180 1888074 1700057 1646569 1507845 1430430 1276022 1148588
19719 1148588 951747 785637 568418 509070 435340 353121 312448 291100 191671 121406 139623
19708 139623 138283 88503 97381 58647 5779 47592 41454 19228 78548 162143 162253 120197
19696 120197 125403 73366 82885 164056 162645 94322 25417 34945 117119 126362 120939 46353 24657
19683 24657 65139 80261 78090 126395 144017 108065 32796 -25352 -83121 -47120 3754 38928
19671 38928 1228 -59713 -81217 -13948 51483 40691 3767 -67265 -61980 -25549 -6899 49090
19659 49090 37276 6977 -27657 -91910 -73076 -983 21018 -8815 -32775 53493 90356 93605
19647 93605 33095 36469 66397 54077 43337 8096 15579 13968 56312 13981 -17608 -17104 -52360
19634 -52360 -42675 -9854 -33165 11130 44744 -4390 -19972 29148 57879 92083 86663 68173
19622 68173 55394 -37014 -24637 -16466 13985 29975 56451 41513 48169 119208 177002 154543
19610 154543 110851 90272 89127 77034 39105 2058 24716 43882 101087 108168 134969 153876
19598 153876 177637 208156 226754 200822 163917 55531 29826 53632 82826 100251 72256
19587 72256 -77728 -139541 -62565 511 43602 -33034 -30373 -29104 -20555 4878 59192 31011
19575 31011 15956 -70715 -58808 -27058 -71986 -84937 -45692 62174 6967 -37562 -50972
19564 -50972 -26858 39965 29180 48586 71878 61716 14675 83901 103184 85839 65475 35563
19552 35563 52483 12961 29606 57166 24278 50227 99634 108418 46921 39423 3570 -78531
19540 -78531 -76483 -5053 86088 36870 45622 113264 84169 96135 59470 54347 23168 9607
19528 9607 41256 84770 7359 -35142 -49663 -39892 -30690 -11837 23415 1904 16936 87251
19516 87251 120346 96193 76714 37494 45875 49721 -12411 -44801 48317 88263 139971 62148
19504 62148 3735 44518 -5529 -34946 -42707 -20514 61365 95587 43019 -22331 -44741 -18024
19492 -18024 38045 48974 43204 74914 156121 60040 4793 68235 75406 70334 30042 85738
19480 85738 118330 115559 70177 105024 86263 168043 228805 168418 105065 59013 -12420 -13232
19468 -13232 37902 58158 -51977 -101885 -129691 -122448 -67475 -70124 -43935 -31279 -11226 -20124
19456 -20124 -84884 -98911 -110346 -89932 -108140 -121598 -56704 -141904 -191478 -197379 -177941 -49656
19444 -49656 -15823 -8027 1878 30471 -2479 -9565 23731 8733 22807 127571 154485 90789
19432 90789 69881 61116 75610 96932 111999 34952 33801 99098 122254 92674 87836 -20250
19420 -20250 8093 31440 26150 32474 67610 32122 1532 11362 42518 81941 59811 37784
19408 37784 28131 -67576 -8240 36004 -25920 -15433 -100274 -103134 20976 36177 -8005 20025
19396 20025 -22746 -46804 -68541 -24054 -6171 -20591 -90060 -99978 -107117 -37070 50276 86966
19384 86966 -21630 -39798 -46512 31756 -18066 -20691 -21801 -87334 -87755 -14713 17850 -46681
19372 -46681 -96144 -92314 -59899 -56656 -25073 21160 -27683 -33161 -53862 -53074 -55522 38388 -13586
19359 -13586 -33427 -25070 -17165 -10626 6422 39338 17705 -30998 -15346 -25819 -44272 -35567
19347 -35567 56518 104252 151303 69052 -3240 -51209 -50557 -88626 -11693 961 1827 60454
19335 60454 41601 -5748 -35513 1864 88561 139739 81366 104746 109450 56809 86966 110003
19323 110003 51551 39509 33950 21272 13064 7212 65363 29150 -78034 -104293 -54538 19425
19311 19425 42282 32224 81345 84222 42679 -18222 6279 40020 96926 122948 140597 95385
19299 95385 4959 6785 44334 23720 42817 -6688 -84469 -96344 -65784 -40420 -26503 -10597
19287 -10597 30222 110448 101728 38970 21536 43952 61218 61437 101432 133732 86746 79692
19275 79692 77303 17964 47484 78583 110789 98091 97776 47365 -54312 -53879 -47044 -63661 -17362
19262 -17362 13772 -14718 -17925 2784 -19181 35435 40184 5303 -63511 -57217 -43996 -32434
19250 -32434 -15506 17215 -27815 -110022 -116632 -129216 -87334 -35077 2657 24936 41133 -8435
19238 -8435 29544 45942 65167 76215 77960 65346 55096 109311 88395 19145 16687 -36434
19226 -36434 -85365 -77913 -121080 -107782 -69603 -2328 -34481 28059 62751 12666 34551 116183
19214 116183 114216 121815 82297 62040 97093 155433 49731 48011 42646 61258 94136 57701
19202 57701 67419 47908 2389 -12714 -41930 -5096 47852 38808 26809 36857 3557 1093
19190 1093 29197 91970 108996 51634 14527 51959 112637 109968 103863 147414 154417 46134
19178 46134 -17032 51702 117491 108258 57167 42269 36835 -27885 -53711 -13034 -60179 -93213
19166 -93213 -132502 -72631 14940 107163 187979 154707 131479 111551 93272 87047 82115 104871
19154 104871 108970 87242 57760 9937 36333 69345 28724 42316 37450 1151 15320 86869
19142 86869 43417 -23235 -39654 -39293 -23133 10448 9179 2737 328 18709 26944 52237 15431
19129 15431 -38850 -39344 -44153 10790 19736 -361 -42441 -41886 -1340 -15907 7498 69730 78695
19116 78695 94386 78508 -2493 -41153 -26055 -83640 -111484 -20404 62345 84725 42502 70884
19104 70884 102764 69339 54164 60998 43295 26818 76023 93002 134710 155503 138169 31822
19092 31822 59357 86063 116436 127181 84058 51412 43703 82091 18654 350 43635 31814
19080 31814 -8999 25241 64278 87897 88759 34713 40841 67443 28826 -19751 -58075 -2165
19068 -2165 -43845 -102386 -70801 109976 250716 183144 100928 89568 67828 1898 25138
19057 25138 -3155 -84259 -44717 27371 45537 53516 117697 77929 58459 42674 -7566 -16976
19045 -16976 -63600 -14923 16164 54254 18023 4295 -39910 -30461 28862 138204 203991 119091
19033 119091 45923 -16475 -51913 -6153 61837 102929 150937 162853 179997 154448 122077
19022 122077 128104 135076 150398 129992 82277 67302 13971 14973 42496 86949 105544 116716
19010 116716 160612 157871 161409 217193 214335 183489 175064 174584 242212 328605 263095 208988 263534
18997 263534 317994 337059 306023 300373 307308 278064 315544 423805 486940 504022 444527 356590
18985 356590 265394 275607 273668 294795 328099 240054 231164 245123 294387 317846 299848 211819
18973 211819 147169 148256 115790 132383 121383 158100 212287 206553 188866 202437 218313 174720
18961 174720 255509 371416 399314 437759 457271 484102 474797 484247 430689 438073 355965 306771
18949 306771 344587 361214 330575 313654 263379 160479 133605 231825 265908 273714 241497
18938 241497 223562 176636 201062 209675 202192 226874 219110 178554 154194 148749 121173 108989
18926 108989 119110 138484 184429 173864 170318 129970 101768 148653 142707 98044 77102 89497
18914 89497 103387 80142 65181 37768 -12891 1900 49231 32079 47272 6838 -72422 -45655
18902 -45655 -34802 5739 38112 143347 144125 25987 -21668 -29347 -34347 -48792 -44056 -38052
18890 -38052 -92669 -63444 -35721 -10444 101553 136151 127817 119941 124032 93657 39372 50385
18878 50385 31974 3588 -31129 10347 78745 137644 144741 118855 104255 114994 111195 57600
18866 57600 56348 76189 103379 -5464 -48433 -99354 -135771 -82967 27705 91077 105228
18855 105228 74500 47180 8022 -14832 44627 88421 92672 98656 206867 228334 163518 138611
18843 138611 178507 170094 239081 307504 342333 345515 322755 399047 396490 547350 620858 640392
18831 640392 691245 686224 685763 772601 967696 1227889 1515730 1898445 2383312 2879076 3219767
18820 3219767 3280732 3134338 2801786 2437977 2003457 1549597 1290774 1207705 1103183 999353
18810 999353 931689 1003187 1071075 1040899 959604 830817 713320 596653 509588 460128 496735
18799 496735 465729 435479 447118 446193 387873 369114 374123 390797 352070 383462 414659 371086
18787 371086 330817 378345 447938 513346 607650 718314 867621 1054011 1216548 1299907 1304423
18776 1304423 1304470 1240501 1250893 1382168 1551338 1756155 2028110 2343293 2917361 3482484
18766 3482484 3914103 4134929 3986962 3572598 2970707 2337357 1801887 1364289 990531
18757 990531 846903 785933 619445 506227 526971 565826 549967 528092 517120 528133 473953
18746 473953 379912 346643 326743 300041 200791 179814 212832 208954 172366 204419 195183 149037
18734 149037 165577 115854 64916 74834 126950 141530 130763 42477 -20803 -69107 -58831 -84513
18722 -84513 -80987 -63728 -60690 -26292 2895 -12382 12910 37546 47051 55350 11935 564
18710 564 17574 -17831 -23706 7465 -11126 -38600 65697 140433 145379 106045 86731 3588
18698 3588 1733 44862 96411 139927 197260 220849 236894 229952 189030 171012 200030 151234
18686 151234 100666 43576 48033 77480 93456 96801 80682 158722 94680 48332 93312 155182
18674 155182 187777 116500 42335 8016 -14520 80103 109445 124765 140144 201648 165086
18663 165086 101227 81793 63205 18719 737 -17877 6047 10235 57765 147457 183109 157356
18651 157356 185637 183305 175551 189065 162768 164738 91618 50807 43136 68958 70845 94103
18639 94103 141085 138278 153463 189107 207079 288351 288901 173213 134862 144136 136919 220915
18627 220915 259973 208336 156005 128761 130901 105032 15017 5823 59931 62033 91154 69353
18615 69353 19690 -18743 63916 96445 66148 59531 55353 21688 -37674 -10673 10422 7259
18603 7259 -14651 17010 -21577 17512 32640 56211 92113 112306 101665 24978 30081 29207
18591 29207 70342 122358 117466 84113 44210 43253 82985 69991 49681 152180 153581 160356
18579 160356 116297 106077 157706 202787 245683 272475 297213 341607 391218 347063 334259
18568 334259 434407 455826 496235 615340 669905 581843 546170 518238 566180 544247 552653
18557 552653 554655 566977 520800 537824 565306 525290 488053 507059 527610 528651 411295 319046
18545 319046 368984 404367 431029 386382 370770 505755 509307 445332 415323 343242 327987
18534 327987 322734 335613 322681 317567 329854 279463 271333 314254 388497 422310 485526 524814
18522 524814 479855 421334 387288 398288 429655 415460 342596 392031 443109 521299 608225
18511 608225 674270 730906 665301 602525 674619 748179 777191 758361 663859 640459 620751
18500 620751 603531 661870 716922 749803 694940 671886 622314 528659 459918 365034 315079
18489 315079 266090 198858 344334 502262 477309 306195 201361 174904 135990 75197 169845
18478 169845 211492 151312 163107 101350 39477 -8814 45521 62306 25606 61383 131769
18467 131769 135269 102692 57576 35060 29303 -23911 -25927 28285 49657 144609 228543 152059
18455 152059 46647 58732 125710 176069 182826 135470 92546 142690 143755 97606 91828 85700
18443 85700 37389 12234 60692 53655 44287 49335 54232 110347 125572 76485 87610 52541
18431 52541 28862 63024 96662 153142 219883 218441 130452 106829 67276 75167 16739 17699
18419 17699 28763 13016 -44643 -15069 10792 -7834 28073 63373 148996 131121 21585
18408 21585 -62115 -33156 -54356 -78646 10475 101171 101779 62316 59954 100546 112368 165520
18396 165520 213736 138481 99686 172446 213261 176895 157944 129443 98704 -28508 -31351
18385 -31351 83980 189432 217288 192524 150198 57671 3984 40986 19581 3179 -25342
18374 -25342 13203 77917 115144 106589 96154 45835 78333 62433 64311 74372 102012 64037
18362 64037 -72 -12942 -7404 19266 51781 97441 111777 100044 86368 91024 81957 53977
18350 53977 6489 11755 81494 148788 76687 104146 155770 171978 150839 158061 215419 243986
18338 243986 247860 227769 163588 105257 31672 22660 91447 159091 200527 261077 252464 175580
18326 175580 145606 121365 201959 239497 149075 58490 78522 122411 224712 272999 137970
18315 137970 135594 191284 209310 204860 298808 283302 240626 212083 218624 245524 275400 236060
18303 236060 128775 104875 78260 65022 74360 84352 124499 152521 214388 231361 223631 209583
18291 209583 184294 228677 255597 198463 131831 183646 141882 130602 131667 119119 119621 185473
18279 185473 213972 199662 191365 213348 222932 184726 264852 344189 386419 356538 241524 158809
18267 158809 190503 255843 234446 267722 248635 269102 284280 253963 237867 200605 260823
18256 260823 347266 412328 340517 341268 407340 495408 518398 483577 417712 409059 378309 297332
18244 297332 217498 306133 398887 347398 385448 447339 499368 528289 521016 481632 381490
18233 381490 271683 288511 380623 519228 565927 581686 495284 395052 377652 374607 392503
18222 392503 347583 260228 193533 313661 371478 391554 381106 347326 364867 351511 407315
18211 407315 448075 396440 357615 438046 539749 552826 501462 481688 547633 588190 585331
18200 585331 670735 649402 582088 651863 707530 791178 887711 898496 896892 952343 948083 849614
18188 849614 872033 880591 906788 870807 859514 804936 781189 754870 761921 759721 825921 823184
18176 823184 837643 789373 808439 832604 788770 803245 806449 848110 903905 917699 1027512
18165 1027512 1092776 1023783 1012863 998711 1057996 1134758 1079898 1068138 1144946 1257122 1345463
18154 1345463 1402314 1476067 1503611 1564228 1623301 1618878 1690066 1740916 1703248 1698349 1851340
18143 1851340 1992817 2167250 2265923 2346889 2400932 2461001 2514473 2699519 2963961 3232393
18133 3232393 3446190 3716171 3969090 4259332 4543580 4849551 5090121 5376253 5746147
18124 5746147 6294870 6908974 7535453 8285839 9285899 10353422 11545984 13105041 15156654
18115 15156654 17802194 21059654 25222225 31523778 42528704 62485354 92265921 119386078
18107 119386078 138063833 136587952 101069363 68337681 46865962 33224486 25136615
18100 25136615 20161537 16957650 14888565 13547167 12625443 12075374 11827534 11904670 12347727
18091 12347727 13242001 14633687 16467595 18432466 20478431 22531198 24528135 26188116
18083 26188116 27424451 28139375 28611223 29246381 29981867 30971090 32512041 34775631 38249355
18074 38249355 43538658 51357851 62504539 76974562 94154270 113264338 132457895
18067 132457895 149566757 163145283 170921981 168077636 157764243 144921013 130210441
18060 130210441 112959880 96420664 83761650 74938789 69164744 65869700 64313528
18053 64313528 63392347 62259421 59966397 55448184 49628725 43777385 38025714 32491259
18045 32491259 27793503 24387458 22174997 20711374 19916056 19699199 19920116 20416547 21198054
18036 21198054 22336178 23763867 25435411 27604249 30543060 34522864 39507901 45352159
18028 45352159 52057358 59251013 66208137 72422832 77515597 80591876 81417796 81904760
18020 81904760 83841909 87718777 94284574 104954267 120113271 138739936 158778447
18013 158778447 178258919 193232886 202014840 204587311 198065417 178815144 154268499
18006 154268499 130489224 107004963 84123526 64691524 50358690 40460108 33916145
17999 33916145 29782826 27385497 26158612 25713834 25837021 26212005 26574216 26573408 25757241
17990 25757241 23656043 21070210 18567565 16062028 13611134 11464503 9852205 8650198
17982 8650198 7766713 7082033 6453684 5915242 5369340 4950455 4505805 4083249 3702925
17973 3702925 3373741 3118642 2916572 2765515 2605484 2390349 2283157 2129086 2014008
17964 2014008 1975784 1937555 1949116 1930185 1874304 1793293 1777173 1766182 1754822 1664484 1654713
17953 1654713 1736883 1801328 1820189 1795523 1832151 1838920 1784873 1717114 1733269 1769969 1774207 1781531
17941 1781531 1952378 2085114 2209760 2346945 2510811 2590907 2523620 2366729 2170485 1969994
17931 1969994 1743465 1559598 1344679 1152102 1046433 900908 853402 902332 890381 870622
17921 870622 912159 849448 839017 778316 826938 855211 850669 833189 767698 680301 712491 661959
17909 661959 590289 686297 691713 643985 646479 644442 562843 566582 614607 584949 492394 496794
17897 496794 567768 609674 595877 538786 483469 457232 457921 470125 430936 501716 498278 460944
17885 460944 484146 508064 504153 476141 500612 570286 589775 569797 531854 493675 398495 437516
17873 437516 366979 276961 265835 214840 172720 136697 163216 217662 267572 261710 265327 249539
17861 249539 318754 370875 365045 360523 286711 330098 298179 361716 374502 372315 339211 273431
17849 273431 264926 213157 208797 221114 174489 217842 223163 135695 149967 199330 103385 85381
17837 85381 140276 103931 166509 143011 77165 71701 85854 77418 78156 12557 39326 79685
17825 79685 17465 28127 -14178 -26092 -36825 26877 90141 102751 92872 101476 29681 -33970
17813 -33970 56252 148322 137724 149194 193560 273293 264419 177257 154202 245692 205218 234707
17801 234707 325010 316648 284739 269338 232652 203645 177285 162021 141267 160261 259673 240398
17789 240398 202252 260107 338967 251499 222330 224970 253787 265148 278558 230106 190731 173732
17777 173732 255565 226541 141809 161120 105036 120955 133803 132142 116457 161150 232549 219822
17765 219822 218452 259490 311607 289045 275061 310925 354967 321593 308680 339202 321688 304585
17753 304585 290795 231500 220769 244923 251813 220497 195043 195750 238053 220416 181914 143349
17741 143349 134380 139169 196347 226418 223256 192134 186293 267206 259630 255015 273700 281226 225536
17728 225536 308782 378069 372826 342300 255538 247992 258230 335013 467255 504801 399505
17717 399505 294872 213528 209376 310856 330237 244444 168672 179024 221078 253554 151204
17706 151204 155859 240064 314443 329981 306984 329724 346927 378861 367094 376648 312002 265348
17694 265348 233027 261199 274770 204597 173595 194099 132790 138779 164871 162734 133935 129228
17682 129228 124365 138297 145317 247708 237472 206010 198732 237274 227758 202037 223344 296016
17670 296016 324816 374192 458747 579197 644381 624843 619075 620903 666565 712793 782111 853222
17658 853222 941002 1009426 1105031 1151160 1189498 1170624 1216073 1255612 1332739 1354553 1275279
17647 1275279 1196948 1123443 1067381 962706 783145 754430 705327 755701 767080 787848 759779
17636 759779 721678 711353 695828 641378 609198 561251 567979 589760 589460 599889 586471 535462
17624 535462 470543 494196 545371 617541 644096 614682 607480 604066 635190 646692 715382 820406
17612 820406 913445 994182 1038934 1053166 1030673 1096645 1129857 1135320 1087286 1132510 1273409
17601 1273409 1431024 1529094 1601529 1780513 1972194 2238145 2535250 3012792 3515551 4069206
17591 4069206 4469645 4581305 4442878 4189963 3844422 3525322 3153022 2748535 2543344
17582 2543344 2486768 2407994 2331051 2281974 2385334 2452529 2470168 2424387 2340716 2285155 2216863
17571 2216863 2134330 2065987 1988805 1959663 2006986 2057200 2119152 2182681 2382255 2587504 2630534
17560 2630534 2766558 2972966 3135738 3316470 3574698 3857535 4117319 4372648 4814583
17551 4814583 5343491 5821103 6313843 7009859 7746168 8431145 9278177 10434666 11901421
17542 11901421 13593544 15715680 18299607 21556305 25541103 29953956 34045243 37050957
17534 37050957 38214013 37416098 35638310 34002119 33348446 33949172 35841772 38980852
17526 38980852 43485168 49628886 57721165 68945014 85230654 108689308 140252142
17519 140252142 177754190 214538291 241204634 249760154 237874283 211348554 179121932
17512 179121932 147762993 120623759 99148948 83824637 74532979 70668590 71070496
17505 71070496 74219362 77756381 79097945 76265610 69103134 59308517 49231504 40507676
17497 40507676 33866985 29089809 25664594 23158112 21321893 20116221 19298900 18699334
17489 18699334 18427525 18443594 18829138 19633145 20791148 22203894 24078858 26534746 29832905
17480 29832905 34539671 41001797 49252999 58655376 67546134 73799445 76081772 74623049
17472 74623049 71438832 69049566 69448121 73847893 82654247 96184213 114209133 136162343
17464 136162343 160143579 182329190 197233880 199084701 185033978 157597690 124838861
17457 124838861 94676245 70873090 53940839 42391229 34641296 29386691 25723282
17450 25723282 23144289 21373553 20334417 20143905 20816221 22004442 23179579 23664561
17442 23664561 22890918 20867795 18060095 15048373 12284250 10021024 8312885 7075671
17434 7075671 6118779 5381575 4815219 4349902 3937880 3652843 3361147 3113544 2871717
17425 2871717 2619637 2500842 2397588 2258162 2143115 2007726 1857420 1793173 1714399 1629064
17415 1629064 1616050 1607014 1549116 1480400 1447514 1416936 1337416 1169930 1113966 1076666 1031146
17404 1031146 1003034 1030698 1067986 987506 913110 912803 943262 910232 815051 807250 765209 700977
17392 700977 660025 728824 816183 853288 867680 791376 700957 668357 600976 658163 668999
17381 668999 591295 564320 531837 532554 559549 509547 405582 376275 463606 494689 427567 337267
17369 337267 322587 342790 310994 378133 419701 530931 644597 635448 659767 646103 622461
17358 622461 552931 461949 449733 424118 480791 500193 467993 363182 348449 391466 415935
17347 415935 354097 339050 347505 380522 326147 306844 326500 292410 303314 262141 262473 281282
17335 281282 262184 273072 243988 250636 268909 218290 193687 208008 243286 207747 202518 226209
17323 226209 169796 154363 196327 228749 329776 407612 370799 328858 275857 289150 321305
17312 321305 366846 427870 483474 475965 435641 376112 345427 384588 442357 341296 230836
17301 230836 209880 201201 215748 126631 140545 160538 55454 18125 58488 74046 65310 92158
17289 92158 150171 201429 160858 168687 157355 107055 58480 40939 33052 16383 101451 146315
17277 146315 111966 65815 72051 129298 57489 78022 110180 171514 164686 194139 187546 197353
17265 197353 271996 186020 104324 109645 131225 120496 101406 112880 139701 143021 120980 123078
17253 123078 87479 15872 -54716 33792 39042 -7441 39145 163733 245611 244238 232560 192183
17241 192183 119362 132274 158561 108077 50661 10847 -40772 -76600 -71433 -40789 39874 4492
17229 4492 -47844 -59347 -116769 -95717 -79750 -86156 -27736 -9851 15949 35695 23491 -51232
17217 -51232 -98669 -84907 -14152 12660 90546 94949 103563 117119 107462 180313 123914 130234
17205 130234 97834 97668 97342 105959 146582 111626 3563 -62530 -40578 3736 34972 50632
17193 50632 39912 16479 65688 90993 62979 4365 -14031 -53282 -64192 -97633 -54406 35038
17181 35038 44327 16841 42293 82651 26607 70298 141051 117338 53942 117 43190 40060
17169 40060 -33007 -40291 10451 28034 82493 70775 75634 89752 45722 -342 -36981 -19585
17157 -19585 -29739 -8728 17906 16162 50876 107111 93759 36606 50114 71506 94661 93139
17145 93139 105887 92245 43823 41098 46133 39997 30574 50035 143527 154010 89755 67040
17133 67040 131167 155079 145858 82562 37244 -5746 -67405 -83800 -2267 4154 -23896 34601
17121 34601 52339 47690 52780 32172 -1074 -15800 21074 35422 21539 8777 14344 -29524
17109 -29524 84696 21199 -80490 -48251 49466 31950 24294 -13596 -65723 -54715 -30773
17098 -30773 49900 23658 36070 -13077 -7386 50598 44382 63895 -4367 -51098 -60396 -87656
17086 -87656 -70142 7883 107425 177466 128887 106643 120789 174186 189463 179439 155198 143421
17074 143421 38390 2604 -10327 -6281 -19494 -74509 -131570 -105980 -32746 13233 580
17063 580 2415 -4338 -48522 -53962 -104715 -114566 -51524 -55239 -100215 -65848 -35768 -35224 -16367
17050 -16367 -36392 16449 47071 77483 101309 43709 47785 137821 200084 206969 154989 143298
17038 143298 178503 188932 159736 188308 148421 161186 176960 162051 156441 125076 171806 232779
17026 232779 224632 269963 345018 393580 430426 519456 578271 613794 666576 643547 656757 527715
17014 527715 473130 448315 387401 382714 400141 364410 421004 526150 588726 612728 633599
17003 633599 599565 494911 448917 401556 363292 279591 237122 189924 283152 337602 371233
16992 371233 309595 210024 153583 194491 234491 283591 315019 322210 238160 188557 114249 141989
16980 141989 111158 10409 20279 40258 108717 231420 338211 377455 479902 543561 574780
16969 574780 604584 679746 787287 782513 715867 657392 614021 561767 500334 441544 348737
16958 348737 292974 272854 316479 347086 353208 289995 299253 414093 491007 517410 609945 604445
16946 604445 537740 538044 523663 449008 329186 259780 225952 249336 271127 236951 167902 63651
16934 63651 5069 47428 45754 20839 49303 73931 146281 147660 88033 97356 20686 -58820
16922 -58820 -32728 35006 77492 33860 2517 18949 101241 69290 18215 -54036 -63594 -13642
16910 -13642 35752 672 -3659 -20525 -72183 -21705 -58990 -74382 -112593 -154986 -126756 -143362
16898 -143362 -134909 -91869 -63143 -48377 -10704 3256 52566 30049 -6572 13818 -17297 -19038
16886 -19038 -19056 -29099 -4694 -40491 -81431 -88828 -135990 -186367 -119431 -120057 -151529 -184205 -192600
16873 -192600 -180668 -164734 -143761 -135133 -173250 -206613 -156109 -56759 -12334 -16193 -53335 -50181
16861 -50181 -74584 -120819 -193963 -188825 -147035 -154788 -162380 -104387 -96255 -42546 -22614 -16698 61113
16848 61113 -18083 -57347 -41471 -26371 -36051 -58495 -98619 -152773 -182965 -166117 -204352 -208724
16836 -208724 -162699 -162604 -118941 -73275 -126278 -151275 -156957 -90993 6199 21272 30265 46768
16824 46768 39716 59249 14376 -9354 -13004 -41819 -75178 -122226 -87522 -65364 -38036 -81670
16812 -81670 -72669 -72122 -71698 -86795 -80190 -107608 -8452 36629 40255 -216 -71834 -29496 -9806
16799 -9806 -30263 -104319 -194466 -248347 -227947 -182857 -157660 -115509 -142344 -97328 -127463 -93333
16787 -93333 -52082 -85566 -79532 -82161 -86398 -76409 -22201 439 -78417 -111709 -131650 -144403
16775 -144403 -121420 -60003 8924 43159 122737 131604 22311 -16595 -63314 -56448 552 -58303
16763 -58303 -117459 -116508 -118090 -96287 -129615 -62446 -52500 -58644 -200428 -234861 -167516 -125842
16751 -125842 -55360 -39301 -65400 -17526 -6394 7901 4567 5875 47146 15077 -38992 -43894
16739 -43894 -65320 -91110 -107350 -42947 -31997 -98658 -101974 -43933 -42860 -39375 -109637 -106569
16727 -106569 -118289 -94158 -40796 -1884 -24951 23399 53863 36117 -42502 -21260 65141
16716 65141 29011 -72444 -62797 -12713 -39353 -38304 -34616 -10744 43218 10766 -41034 -65261
16704 -65261 -113756 -78148 -51844 -63003 7130 -7538 9146 -11734 -47463 -120816 -162415 -104148
16692 -104148 -40844 -111831 -139866 -120235 -25133 86033 117518 123345 43698 11311 3654 20693
16680 20693 39477 -31732 -14342 104052 135745 65847 -23382 -8018 -3952 -29325 -85771 -72282
16668 -72282 -27111 -25720 -126833 -208219 -265869 -153824 -114084 -111613 -41079 3946 -33341 -33881
16656 -33881 -40666 -64380 -62842 -36559 11129 445 -54862 -52950 -46302 -92405 -100504 -92658 -14639
16643 -14639 -25376 -28160 -24373 6955 -62505 -31606 -12636 -108721 -153346 -77190 24588 -52551
16631 -52551 -71829 -108474 -44105 -40543 -64927 -83802 -58667 -53633 -35890 -74809 -92875 -62373
16619 -62373 -91630 -74248 -53387 -92569 -125314 -95059 -48346 -42812 -20901 -22942 -54451 -42201
16607 -42201 8391 81741 -14555 -47184 -40819 -47310 -115873 -81306 -63652 -46429 -69945 -97840
16595 -97840 -112849 -164961 -201843 -161432 -118423 -85298 -6511 -15664 -45284 -68352 13172 -51182
16583 -51182 -94079 -70633 -79702 -35897 -40397 -79660 -103149 -114335 -136403 -72288 -35502 2664
16571 2664 -13383 -32433 -74645 -181774 -147103 -56305 -71141 -4186 18375 -5534 -24471 -83629
16559 -83629 -125619 -164771 -182898 -102398 -105209 -94405 -79668 -41958 -756 -12012 -13449 -63489
16547 -63489 -128415 -151793 -212342 -147237 -91979 -132518 -96286 -49923 -84201 -9253 -1815 46446
16535 46446 47889 69885 46446 41023 -80112 -158887 -124968 -111410 -160687 -173795 -85183 -12969
16523 -12969 -20493 -3388 15855 -35796 -78536 -114033 -81171 -16253 10897 -20616 15619 17034
16511 17034 -28334 -56557 -100891 -124048 -224965 -135726 -83411 -106117 -102625 -98388 -43428 46314
16499 46314 71138 39030 -40788 26719 9635 -33709 -29423 50933 44232 -59730 -146409 -115830
16487 -115830 -65823 42342 55633 26336 18157 -54052 -132232 -143431 -109390 -50836 -87412
16476 -87412 -86173 -50850 -1965 54923 115335 89249 -29284 -45102 -70149 -42529 -22418 -77549
16464 -77549 -150470 -188123 -199450 -141173 -93205 -37635 -19218 -73002 -128075 -73761 -43240 -86072
16452 -86072 -130159 -41063 -35182 -45180 -19103 -54871 -108840 -107911 -76096 -34008 -6219 56220
16440 56220 55558 76232 126937 5348 -100847 -115498 -97073 -30431 42586 19901 39695 78006
16428 78006 53098 -7300 -16108 -31941 10170 14356 -88284 -72740 -4718 62867 53546 -27627
16416 -27627 -40518 -4039 -101672 -174317 -168807 -172200 -115757 -107774 -116275 -100170 -197975 -217386
16404 -217386 -173442 -117285 -87539 -46065 -27626 -30683 -14401 -21463 -30048 -109374 -123896 -140073
16392 -140073 -96525 -70216 -71219 -148453 -158155 -54599 -11189 -107358 -110812 -88414 -78037 -44406
16380 -44406 -67266 -46698 -12177 -60901 -90592 -70235 -73878 -94242 -134689 -37665 -33852 -9901
16368 -9901 -26002 15356 18581 -13162 -40681 6465 -66179 -62698 -61636 -61612 -54536 -42890 -35406
16355 -35406 -21683 -21303 -57696 -44077 -90003 -92462 -89065 -21490 26352 -3495 -21154 27406
16343 27406 16783 12242 -1352 -17507 -13385 -45885 34416 72360 55620 32359 -15735 -128641
16331 -128641 -116473 -17126 -1726 -43640 -52170 -60306 -16437 -23816 -40863 18005 42758 16005
16319 16005 -36615 -132133 -89808 -130543 -145981 -110920 -105620 -79060 -45409 -105471 -136980 -112100
16307 -112100 -76644 -46570 -44274 -51484 -534 -18437 -95656 -79057 -26445 -50331 -44405 -27681
16295 -27681 -33620 -28032 -17103 48686 99409 174354 140225 117871 106584 52581 -42841 -149551
16283 -149551 -126272 -77978 -19675 -80556 -91623 -39447 -89762 -141096 -120903 -77433 -89702
16272 -89702 -94966 -76129 -62968 -131840 -154041 -191336 -162773 -116073 -198105 -226939 -116534 -9851
16260 -9851 13310 -76 5896 -22104 -19547 -12487 -36876 -10030 20656 13349 -91218 -101052 -52593
16247 -52593 -21604 -18001 -21911 -104161 -136564 -109697 -95311 -47895 -30563 -30942 -54928 -76352
16235 -76352 -97347 -90292 -28477 37094 50304 33377 11255 -2442 -23922 -72784 -147327 -172474
16223 -172474 -38401 15528 36016 47395 43175 36151 71749 39299 894 -64909 -114128 -88758
16211 -88758 -92168 -90523 -36938 -3345 22443 9715 21496 105737 114372 21111 -195 -10673
16199 -10673 -50925 -104820 -172079 -109532 11785 104358 76382 110019 127380 114219 14330
16188 14330 -64436 -76833 -38798 -80587 -69625 -62897 -53610 10222 15385 44248 25644 41011
16176 41011 46854 51844 1226 -46997 -114310 -87510 -98144 -78029 24501 27001 37184 47676
16164 47676 40812 11190 122938 129325 60335 337 -53740 -71857 -44018 -31391 -13394 -59037
16152 -59037 -48285 -2000 72998 24204 -42889 -65181 -27101 -28703 -22759 -24517 17404 -15676
16140 -15676 -71188 -26204 -12445 -5924 -19169 -38715 -58706 -52685 -29532 55432 97487 101248
16128 101248 104527 42356 -5527 2208 -30620 -74758 -97458 -54641 -35000 -24715 -34784 37494
16116 37494 87126 47489 28313 92672 76022 538 -61099 -48927 -126676 -104724 -76261 -60212
16104 -60212 -27625 -28933 11476 26459 -42046 -83581 -32163 -4152 -19444 -35411 -48231 22227
16092 22227 -32768 -87258 -111800 -120053 -78041 -106864 -140737 -139578 -137455 -107218 -8492 79652
16080 79652 39675 -21341 -32617 -30079 -80990 -87871 -77152 -188458 -150174 -100496 -95667 -76213
16068 -76213 -25712 -27570 56544 130678 147387 115236 36602 -84945 -83207 -46344 -128406 -168546
16056 -168546 -112070 -100627 -80482 -24612 -42166 2756 68997 70330 52821 -20095 -49871 -17264
16044 -17264 -25782 -18387 -18692 25963 659 5959 52394 43906 45610 34085 -14053 -5215 -17526
16031 -17526 -22798 11744 -56512 -138069 -210012 -193505 -146786 -104949 -79756 -82239 -135511 -148184
16019 -148184 -67702 -112528 -147751 -73764 -26804 -80297 -69572 -80321 -72170 -82727 -31080 -11958
16007 -11958 -13870 -76063 -80940 -53368 -47546 -35430 -10900 90389 16175 -11632 17381 -2116
15995 -2116 -19876 -38115 -112739 -150620 -126027 -96562 -80886 -143138 -170447 -51544 -11728 -21637
15983 -21637 -49437 -79715 -83297 -6997 37701 69355 50503 77448 82563 66713 -15047 -13237
15971 -13237 76565 41444 -9030 40785 91304 40801 -30813 -108126 -107857 -92261 -37891 47550
15959 47550 57425 6342 -22113 -87809 -117956 -42158 -26069 -29188 -40546 -36364 -58202 -11802
15947 -11802 72235 93672 65639 -23535 -82767 -109795 -54431 -35110 -62727 -69057 -89612 -73642
15935 -73642 -59939 -28721 22405 5661 -23899 -19922 8785 78113 85551 -14986 -4123 -33809
15923 -33809 -74394 35220 39951 25667 55502 3822 26078 28068 15603 57931 94137 114623
15911 114623 147770 84564 -8960 -74307 -99219 -88007 -72442 -65742 -93077 -148837 -155018 -41135
15899 -41135 14439 54757 -3441 -101597 -104467 -42110 64440 14620 26029 7856 -5692 -35829
15887 -35829 8237 51696 -73961 -102932 -128478 -121314 -71673 -30167 -34186 19549 8435 -11685
15875 -11685 -34332 -21258 9083 34101 87165 766 -22937 41547 7868 -85682 -101196 -145301
15863 -145301 -200863 -126117 -95968 -27606 21339 29779 -9465 36060 33233 18821 10480 8197
15851 8197 -49074 -117901 -185825 -152799 -142277 -126156 -125586 -114988 -114244 -113511 -109001 -65056 18713
15838 18713 76701 5217 -43919 -32280 59018 19338 -89357 -98030 -7561 26447 -16472 7682
15826 7682 -23213 -54572 -118264 -126456 -57544 -54207 -97062 -103216 -56535 -58684 -129647 -107222 -73131
15813 -73131 -67099 -69977 -99583 -34144 37524 -9702 42698 44801 -2619 89 -58160 -84266
15801 -84266 -82987 -138410 -110688 -28681 -18385 22607 23380 -18622 -13479 -34759 -81407 -90398 -68138
15788 -68138 -11280 69684 43776 -19966 -81077 -32490 -78368 -66023 -70102 -123243 -115565 -20279
15776 -20279 12164 69337 53896 -22619 -70289 -65013 25500 40317 -12875 -12719 -24659 -74566
15764 -74566 -112173 -80300 -48654 -9842 2592 25715 -914 -53846 -73227 10225 91539 66434
15752 66434 660 -33068 -32440 -45697 9425 -9042 -35979 -48333 31228 16723 -91935 -68904
15740 -68904 -43374 19690 89572 102612 135000 137693 54754 -7351 -1227 4857 5667 44400 57914
15727 57914 4308 -17325 -12483 14201 6301 -5864 -40486 -50718 7191 24768 -27433 -38846
15715 -38846 22621 50488 2220 -3914 85161 130001 22522 39699 52215 93744 127836 92378
15703 92378 49436 5914 -67612 -117903 -74661 -54472 -75320 -108148 -85510 -83033 -37349 -4392
15691 -4392 17146 -6333 36080 10188 -23615 6416 77096 70902 27889 4170 49084 -10995
15679 -10995 -77416 -21420 4553 41624 12780 4525 42634 -548 -64877 -12957 -27496 -46673
15667 -46673 -39474 -13725 -5791 -7683 48748 109409 171962 165274 157032 153253 76825 3551 -93981
15654 -93981 -138782 -101426 -41024 -23618 -22414 -45871 -14898 5080 1748 -18535 -27485 -39165
15642 -39165 -53016 -76366 -34287 42647 -7334 1932 1882 96747 69638 24823 15782 -34155 -47694
15629 -47694 30295 9651 74435 110702 85908 86003 63860 37159 -51170 -101420 -115538 -110773
15617 -110773 -47904 22725 -7965 -25748 -71360 -85278 33332 28725 -79612 -79891 -34693 -26337
15605 -26337 -86081 -84459 -9574 -3973 -76125 -84223 -26049 -4097 61219 5344 8022 83534
15593 83534 132894 110158 86761 23251 -55072 -22899 26691 68365 83964 37698 -20014 -27260
15581 -27260 -57100 25448 83169 98258 77643 40521 44730 45360 63432 74424 145368 166278
15569 166278 64172 1578 7303 7852 66487 35568 -30071 -50274 -110390 -100548 -50606 -33851
15557 -33851 38839 83442 74455 4345 25627 56907 16557 -79454 -105097 -18947 69251 77104
15545 77104 87938 24220 -3899 41059 10338 24565 26271 43578 42286 -9080 -52024 -161337
15533 -161337 -183286 -51987 -26875 -20506 36264 38163 -52252 -44905 -27751 -96107 -129379 -7557
15521 -7557 17807 29816 7663 6480 36131 37993 37363 -3895 8529 40440 -15797 11484 823
15508 823 -30489 -75519 -107936 -165436 -174669 -143499 -143759 -138919 -117486 -121517 -85183 -63308 65976
15495 65976 159318 68485 25944 87968 63423 -29596 -64832 -29067 41157 113168 92195 89038
15483 89038 66749 91208 94584 59027 30547 58974 52382 -16042 -61774 -85610 -105866 -12624
15471 -12624 69825 128414 91952 41309 65458 36115 53523 78036 68160 35836 2992 -11594
15459 -11594 -25231 7368 -9306 -27407 -7057 -42542 -80357 -109276 -73695 -12613 18617 56404
15447 56404 -15260 -32785 -7665 -29203 -16418 42125 43385 -26879 -102327 -62738 -29157 7769
15435 7769 72568 37415 14320 -12513 4600 -33870 -40110 -40319 -9845 -61849 -61122 -57093 -27876
15422 -27876 56862 57077 72019 50496 96572 114539 97935 63298 50245 53996 74706 38285
15410 38285 -19666 -46162 9945 -22623 -55149 -107504 -72901 -77270 -39886 -16139 -23989 -39767
15398 -39767 -27712 -51559 -64648 -47185 -92263 -34962 67435 101309 34307 11179 24311
15387 24311 17965 -24444 -56698 7504 38375 12088 6771 -35782 11989 61432 38333 51874
15375 51874 72730 20985 -55324 -77729 -44376 -26417 13964 87197 131232 88369 38519 8547
15363 8547 -11042 78864 73814 30273 -16026 -13619 3196 -51759 -21736 -34813 -28272 28149
15351 28149 71402 99614 55451 -5183 -31215 -47236 -30447 -5858 -977 -24509 70151 18165
15339 18165 -6268 68314 81551 53137 87549 43004 60919 46003 24926 -37370 -77065 -40734
15327 -40734 14150 23958 -29599 -76518 -77949 -93510 -50862 25808 75471 143035 167467 154157
15315 154157 135113 85987 9978 15841 48381 -300 -23191 58746 95811 119056 83444 22705
15303 22705 38046 46767 424 9949 80698 17767 -29950 -57110 745 21057 17883 41856
15291 41856 35256 43858 -30779 -84878 -109394 -96790 8455 5074 -36517 -81120 5935 91087
15279 91087 134489 93606 119859 61256 49980 67147 25446 1985 9401 34715 79354 91430
15267 91430 59649 44272 29277 83199 89127 86802 107021 88394 40104 31397 76962 27298
15255 27298 44277 133673 141739 196746 216237 185897 123979 65630 -8646 -27284 32138 41777
15243 41777 -9454 6787 71815 64449 98932 92598 49847 23511 -2225 -18555 -11266 -65485
15231 -65485 -56989 -18207 -58704 -74544 -6207 124975 55546 -81135 -19126 27471 32402 -27778
15219 -27778 -65491 -25108 -58640 -22778 -48669 -79295 -103732 -81878 -110081 -73944 -36679 -36673
15207 -36673 -39266 44468 43366 5257 -9905 85016 132285 -1618 -120431 -175947 -112148 -36641
15195 -36641 25537 78742 128996 41696 625 26469 -27243 -23422 69357 103559 87344 56646
15183 56646 51304 88004 119821 41304 -44590 -89228 -33088 -54155 -37668 28783 3737 24537
15171 24537 88217 98356 152480 91640 34641 -2402 -49721 -97468 -107884 -42331 7971 -19916
15159 -19916 -27393 -5523 -26216 7298 33997 -20500 -91811 -121694 -188499 -189533 -86795 -3447
15147 -3447 -22759 -94961 -83264 -17595 9497 -495 10145 -48711 -91956 -60885 33456 71772
15135 71772 125174 148295 119955 92876 149316 174520 62781 25910 45069 24559 22199 -11591
15123 -11591 12193 63005 57565 -23439 -31004 27268 54146 122970 141694 143377 74671 71274
15111 71274 39172 -1803 -13757 -42178 -56526 -856 43868 52039 95419 60835 20381 101210
15099 101210 123853 94237 38305 56695 82689 39326 -11756 -5953 26547 14965 12709 14309
15087 14309 8742 -7533 11137 28659 -29041 -96391 -72797 -35017 -4317 -45287 -119743 -108510
15075 -108510 -50930 -45190 -52446 26926 97338 137690 77270 -18835 1603 18746 -24163 -28599
15063 -28599 -30641 -50447 659 38645 74947 19194 -20947 -16853 -17467 -35444 -123574 -177347
15051 -177347 -182220 -93852 -10239 16130 -42283 -38177 5840 21875 -16736 13340 90205 75786
15039 75786 50162 76629 14445 -1866 -61777 16353 55479 16733 -11615 5307 -38582 -30660
15027 -30660 87144 86396 5209 -5477 -44267 -115736 -100549 -46496 -116705 -151441 -152177 -107803
15015 -107803 -112343 -128942 -90520 -62598 -94702 -17972 39527 6213 -30283 -30845 -47362 -37066
15003 -37066 -44070 -80654 -65322 -19262 -26200 16214 78057 117620 127700 145264 118031 134951
14991 134951 79106 104730 86337 109129 192478 197865 138349 81762 69228 42254 73122 83948
14979 83948 45431 7366 -104742 -145367 -74826 -13862 -3184 -63629 -87116 -73267 -63694 -33248
14967 -33248 -527 22543 44064 23267 -101179 -102509 -95241 -8821 49262 66524 49342 68206
14955 68206 36077 40579 30718 -27067 -33722 1496 31739 11388 -8697 61570 113215 71777
14943 71777 11895 -75828 -109440 -80717 -107068 -101354 -36205 -10664 -72439 -68467 -3069 19486
14931 19486 -3647 11754 -3014 36476 18975 35063 42323 82222 43954 91918 148234 140591
14919 140591 109829 43084 46563 99950 91087 40697 139801 184511 138862 108387 129894 21038
14907 21038 12440 -17179 -57996 -14211 87183 110758 84384 84463 73593 17228 -6864 91829
14895 91829 92822 42674 -15083 -54329 -58328 37553 69866 71966 87360 85243 69201 19004 2686
14882 2686 4994 -5733 -19694 -45389 -53687 -26164 35422 93538 139442 99117 12920 -97377
14870 -97377 -78031 -64836 -53637 -14585 40443 29338 -33655 34491 126606 32544 -101319
14859 -101319 -69860 2507 -15705 -3870 79903 141388 94055 5520 -3149 -21414 -9499 -16210
14847 -16210 -30327 5034 42072 96647 79169 26747 -48655 -121344 -56782 -52404 -50649 -19528
14835 -19528 31365 -25707 -13888 -4732 -3075 9654 62324 91036 60686 50386 118657 128506
14823 128506 72330 86069 81735 53677 60165 29657 66487 68344 79637 42784 45585 -20823
14811 -20823 -55739 18524 23603 -49095 -70270 -23166 -43406 -28773 -25450 2584 48151 40722
14799 40722 21902 43827 71749 81361 107522 78627 55846 67284 59178 71917 31157 15948
14787 15948 -49128 11746 52782 56673 102263 26804 -70419 -102122 1235 41340 25805 -63743
14775 -63743 -57451 -35460 -1837 28879 15422 39133 84444 68382 -22867 -88052 -59976 -71581
14763 -71581 -71337 -49259 -41515 -9650 131258 154684 140882 129029 34817 -23044 -81088 -74347
14751 -74347 -87698 -133758 -68827 -5201 54640 33480 -44103 -54157 48647 92507 30536
14740 30536 66833 92818 58035 45919 -289 -61247 -37483 57229 21579 -24385 -88634 -92865
14728 -92865 -68118 -40767 -8152 -65483 -108283 -77920 23898 78651 48240 -1439 -49036
14717 -49036 -103053 -135308 -114315 -108005 -56312 -15374 -76631 -82324 65477 70814 8026 25000
14705 25000 33548 -16984 40721 164717 139647 78565 83449 104212 20060 33076 31470 -1766
14693 -1766 -10271 -62145 -90438 -148980 -146764 -166928 -106532 -64208 -46897 -37216 -78687 -101550
14681 -101550 -18185 31799 17336 89439 123515 111338 40710 18993 47922 -41462 -30434
14670 -30434 67205 -15437 -73654 -15536 50469 90466 87486 101911 133416 78619 -11728 37542
14658 37542 40038 16719 -32024 29834 165429 209503 141450 95890 134871 137518 129510 60477
14646 60477 63296 118716 123127 60719 53405 113804 127612 97589 32957 76212 80148 51976
14634 51976 49791 79158 44626 78280 90598 98692 135628 156644 199411 217753 231063 161709
14622 161709 110134 101444 116200 112577 116986 105084 144651 130262 59213 5466 48737 71417
14610 71417 117405 106592 101167 153017 118570 71684 34130 -25232 -57827 -38527 -34460 -61730
14598 -61730 -117565 -47362 67872 2226 -29886 -3583 100690 179701 207336 132591 18368
14587 18368 5911 77190 85119 14572 -47538 -44587 -59516 7972 -17912 -14764 29872 69319
14575 69319 119424 118987 33900 -54628 -38292 35494 37374 8770 -8192 -64184 -78329 14430
14563 14430 89332 140139 96034 39114 -22496 -51223 16456 63322 105929 126173 158665 76866
14551 76866 46331 137866 76546 27673 -31713 -92936 -67311 46133 72476 37922 -15873
14540 -15873 -21365 -33390 14719 19634 9510 34077 65691 75394 116988 129475 69605 64149
14528 64149 58230 57452 54481 -9406 -12485 1438 -46014 -44472 -29086 -6980 17020 27224 79408
14515 79408 73786 126559 164794 160876 146072 84910 2621 50516 58964 41336 73947 88365
14503 88365 52578 11939 28816 33534 15657 10187 51184 63959 54826 -66084 -77302 44564
14491 44564 54879 133622 141560 24430 50452 119070 123894 152817 207220 162542 54332 22578
14479 22578 30804 75892 173189 199508 231196 170530 122050 114731 172350 177860 131921 170813
14467 170813 110449 60756 30467 22965 29406 16494 96467 60892 46630 134211 103334 63333
14455 63333 58393 61371 -23063 -39176 -36079 49217 55601 159708 130764 127531 24688 -66860
14443 -66860 -16586 61054 34646 45734 75526 74355 5871 1039 21031 54114 89286 116594
14431 116594 171069 131877 77867 20084 18524 68641 125532 208749 194222 58770 -26049
14420 -26049 -17800 30694 6537 -8127 -26621 -35888 -80157 -70798 -40147 -69963 -49610 29809
14408 29809 50159 17665 7126 -4020 -11243 44218 65976 49208 9997 -1976 17068 1256
14396 1256 33179 15002 -50896 -67302 976 82818 89377 44406 74449 68466 129844 119804
14384 119804 123814 134911 165175 115204 16556 94937 114914 174682 73917 8201 40099
14373 40099 115124 182489 232408 240220 281934 305360 219677 123713 123017 145693 173048 181107
14361 181107 112287 136730 114217 130542 170534 176817 183002 185921 207940 204005 81060 42330
14349 42330 125894 184337 181053 188338 102672 -5474 -22607 50194 50253 46938 80470 115664 79571
14336 79571 53896 44771 70651 115198 69276 22451 117214 129718 133688 143242 131862 129087
14324 129087 70940 60998 15561 47413 108553 123897 99592 80904 147541 190135 152955 112782
14312 112782 141477 157385 140842 145145 175240 182796 130811 98316 62591 9307 -25409 6012
14300 6012 -8848 -35662 -38250 -1504 -23074 -42930 9300 45689 14740 21724 37285 49315
14288 49315 109493 133588 114110 91913 99171 107405 136975 132782 139845 135705 109513 139562 147365
14275 147365 74665 5088 4108 -6472 -30255 -25032 13176 7772 -14246 30700 56628 124950
14263 124950 107611 156936 167101 206285 158975 110026 137341 119123 34207 45269 28908
14252 28908 43594 76355 115066 103871 50594 77682 161883 150409 151452 128763 49858 7004
14240 7004 87422 102880 82357 128925 164219 163659 150840 99739 98724 141516 134066 94755 170462
14227 170462 135935 160299 171573 173037 70859 -43770 -38090 -3868 13877 103684 128519
14216 128519 90414 113866 119595 120996 115848 68050 37759 88563 167738 222499 164044 103437
14204 103437 102498 124839 110246 114998 91672 141298 141254 68005 61505 131485 158323 69647 17671
14191 17671 95695 127185 102169 66170 61283 67597 119039 182028 172542 177854 131932 69692
14179 69692 37897 113037 158849 149356 148829 163673 151000 151444 147225 204618 228574 202423 155187
14166 155187 107089 44023 -20978 57228 103694 125433 94380 58639 27324 23923 38018 52728
14154 52728 136667 167586 148133 157492 174694 182984 127238 129682 87775 30743 92649 155806
14142 155806 146912 136842 98250 28651 37123 77288 111056 132980 145115 173743 258019 289899
14130 289899 225230 161550 102908 83879 112184 133631 135302 148515 158245 103464 138990 211901
14118 211901 210237 107386 31529 33475 144725 210229 246195 195077 180525 208067 278154
14107 278154 305598 293078 273938 385572 365306 370677 375154 335495 347155 378655 431328 517424
14095 517424 509656 537927 616979 673674 707343 740449 835665 922480 1001484 1103604 1246107
14084 1246107 1394490 1595866 1686994 1965805 2358584 2689967 3052217 3417956 3614322 3831423
14074 3831423 4078954 4370528 4581558 4613555 4644721 4611860 4451545 4366318 4169727 3968048
14064 3968048 3710073 3398001 3057006 2783834 2474793 2084909 1746032 1588728 1382073
14055 1382073 1226614 1195918 1138956 1040963 933548 849449 723959 641482 650453 618501 585342
14044 585342 550655 479991 446890 434825 427544 410469 442663 416607 370470 358337 311260 260801
14032 260801 249923 287666 369539 393511 429971 381573 324209 222304 200800 291101 294049
14021 294049 226788 237799 337369 362448 316164 332800 384244 448434 478835 434776 347200
14010 347200 212491 199539 173653 214993 147552 126412 107042 120818 159209 216388 259723
13999 259723 234836 196813 216523 225586 226631 209600 250288 185671 198164 248289 339600 352181
13987 352181 249003 120875 137247 185385 179414 238840 237939 209914 199877 173309 51448
13976 51448 50340 81326 115391 83139 105240 195679 253429 265523 255321 280756 360643 340821
13964 340821 347470 321502 272286 275954 231559 231655 263663 341293 366315 336098 303528 295404 295475
13951 295475 379575 440513 422026 374843 277310 231028 157839 158423 181252 267366 269575 163841
13939 163841 60672 113304 122520 152728 176122 161840 175080 142211 60240 84023 95679
13928 95679 62631 -10562 -990 74425 148352 200235 247242 239539 146766 159797 148311 157110
13916 157110 131511 168415 236313 234960 271879 254884 266129 287113 353091 300358 260469 271199
13904 271199 243333 237676 292217 268802 260590 274966 266621 284570 295464 266307 250033 329197
13892 329197 320276 209177 193970 252081 222264 148872 147127 121185 138618 88400 135431 201833
13880 201833 221599 155332 115931 147480 239970 239024 213190 253985 273418 262357 266512 245278
13868 245278 303914 233888 194073 181742 88730 101593 188808 235805 161979 141392 150276 194203
13856 194203 216965 311011 290281 283109 347259 294840 367128 444216 391459 348034 277961 237353
13844 237353 221500 239050 218446 269134 254414 234707 198582 223037 163295 108178 158611
13833 158611 217719 233243 272960 217768 186280 206559 263431 250296 290130 292241 236229 166876
13821 166876 185213 278595 278374 236628 254024 290617 296242 261170 278816 257524 254541 124180
13809 124180 132307 257330 240870 207426 218106 270166 333621 303154 218625 209343 233122 218203
13797 218203 172452 194702 193708 185018 113593 120219 230864 237711 244170 224330 264941 220863
13785 220863 189679 195620 232680 349009 264702 159329 165142 293125 292504 275967 237231 216894
13773 216894 227807 143369 89053 98170 112682 96297 114553 106816 132907 194839 190888 223398
13761 223398 296138 334053 324647 311312 274235 250420 266984 284990 299172 351050 335262 271554
13749 271554 250845 269901 322507 297261 293050 323231 395925 442588 492842 574491 564733 553793
13737 553793 525845 447114 506887 558742 571407 606448 575174 532239 522838 598213 620419 626580
13725 626580 681826 805320 882657 940115 1042171 1169848 1256005 1264897 1347566 1482793 1535137
13714 1535137 1709392 1837039 1882320 1919481 1938792 1989367 2076927 2062813 1945063 1957334 1953121
13703 1953121 1867026 1867495 1748059 1652276 1693683 1604886 1490412 1435740 1303896 1158292 1089661
13692 1089661 919729 761861 633185 577431 525861 454074 377572 363188 346503 345088 357230
13681 357230 384686 397937 419040 387578 400683 389745 380691 387362 402288 329378 251915 217500
13669 217500 282770 378231 379429 311790 286026 299035 339721 290814 255413 271450 222619 194132
13657 194132 233254 230357 223556 199308 231047 288576 309820 243772 234831 214915 190354 208343
13645 208343 262321 285828 292122 316369 342047 404904 445384 356819 285563 325214 317773 259841
13633 259841 241647 313389 382030 367152 335289 297839 273591 182105 210455 243806 269530
13622 269530 247342 303771 358552 453566 389151 334704 314527 279487 288955 297148 277834 298788
13610 298788 356276 352920 306965 290379 268707 256308 302453 274270 290679 282305 296546 363962
13598 363962 402165 402306 451966 481886 440726 481413 532003 589632 629448 618959 777278 973264
13586 973264 1035746 997287 924202 810225 725938 634811 553114 497144 459353 446532 408371
13575 408371 421871 443587 349695 366793 487596 510129 456767 397143 386079 391983 488932
13564 488932 577364 595754 577554 637562 648541 670796 667350 714022 792658 860545 980863
13553 980863 1143795 1459888 1673040 1699599 1685035 1611758 1321479 1042428 853695 750538
13543 750538 697200 666535 661877 643383 662420 717759 715510 649424 528220 540193 537618 507553
13531 507553 573837 571093 520370 516477 609385 657503 648695 656555 728911 739207 771778 692166
13519 692166 629188 675527 847248 1046990 1184732 1178891 1141655 1053533 901263 782652 705308
13508 705308 594454 518439 499635 532667 501364 391273 381708 367646 428343 446848 444396
13497 444396 442369 431837 491478 486976 384282 306740 258142 282114 318382 287582 332340 407618
13485 407618 366743 265812 189524 154530 168790 219038 348261 470370 464430 412444 348223
13474 348223 260742 266222 253926 287954 388840 408246 462494 519649 478764 447956 467659
13463 467659 406006 407469 343229 365301 340116 282222 275104 333029 331262 308245 271632 373340
13451 373340 403533 338408 277372 241040 307993 345663 351471 294610 343645 399271 379537 385313
13439 385313 412961 494789 469013 436254 425328 388619 392857 451267 491537 505119 519551 488345
13427 488345 493871 474816 433404 505917 601184 541039 434376 367133 371520 413127 443646 387984
13415 387984 386397 365785 329327 247415 214241 177295 255865 352755 371950 403010 474877 491710
13403 491710 371422 372482 449006 381297 455112 437479 423302 488356 589967 648406 674854
13392 674854 579194 585775 626463 654569 597753 521803 551413 591300 673092 694958 643152 553438
13380 553438 507604 435713 419302 458530 500469 413490 456385 537850 600063 526473 461571
13369 461571 492227 470715 531296 532395 454180 511935 523114 484698 478191 471812 468319 475589
13357 475589 563115 598543 617918 570407 512302 555108 544689 520115 466942 424990 420330 468041
13345 468041 499849 528268 591839 645357 673743 574634 554463 618927 528313 453595 522127
13334 522127 664650 660599 609469 542557 522378 503793 494157 579719 543965 496504 504609 470957
13322 470957 479930 473469 482528 445923 404021 422649 468497 554918 543867 523749 503322 510258
13310 510258 509317 473908 505240 581721 678744 716288 695838 680053 564049 592549 657888 597526
13298 597526 619249 616207 580602 563267 577470 565778 474372 474754 500506 525328 562776 552985
13286 552985 557764 561240 619608 661500 685070 711377 757087 763713 810677 776173 651846 609757
13274 609757 581495 645121 761670 797924 815859 904728 943517 938735 949994 860350 899600
13263 899600 1019786 1049833 1001991 979649 911972 853936 841934 824491 756529 727709 656764
13252 656764 706495 817065 924073 928503 866530 826695 830909 877673 909233 976790 1018959
13241 1018959 1078400 1136518 1186867 1203842 1176939 1172865 1136182 1152553 1172919 1234626 1264963
13230 1264963 1260585 1367136 1367410 1360497 1318058 1269139 1375946 1433466 1442193 1542530 1609668 1547104
13218 1547104 1401193 1392068 1379007 1458867 1441052 1403258 1399974 1443297 1467840 1472528 1524170 1585459
13206 1585459 1685098 1770551 1863351 1992342 2122273 2339324 2468067 2671083 2945973 3172347
13196 3172347 3384314 3530667 3503599 3410504 3241348 3055762 2896524 2762512 2687885 2612082
13186 2612082 2552302 2522918 2480624 2591189 2666665 2693990 2742054 2855821 2866859 2971820 3099968
13175 3099968 3216744 3381995 3558323 3745222 3880617 4141696 4401914 4789614 5234397
13166 5234397 5603476 6130888 6752213 7548981 8375601 9324258 10294811 11128236 11754287
13157 11754287 12173967 12435060 12748419 13317167 14157909 15239283 16739788 18554014 20813617
13148 20813617 23564754 27061664 31361745 36855111 43814463 53348765 66673556 84714863
13140 84714863 106225123 127140488 141428682 143373483 131627377 111276288 89799403
13133 89799403 71765651 58157869 48462050 41587776 36598399 33059971 30613188 29017084
13125 29017084 28073357 27657863 27575631 27483474 27237510 27001374 27128077 27801036 29087667
13116 29087667 31031529 33654455 36799833 40676105 45591625 51747982 59451919 69189489
13108 69189489 81708936 98514969 122074013 154978070 197314936 243325230 281375661
13101 281375661 298050674 284731166 245929714 196977700 152126874 117419852 92606482
13094 92606482 75122832 62491630 52968785 45588777 39792674 35112353 31480720 28748142
13086 28748142 26546684 24818568 23660975 23130161 23094913 23560158 24297738 25185562 26164988
13077 26164988 27367348 29043632 31367065 34644547 39033870 44702916 52228315 62622982
13069 62622982 77171631 96485302 118893968 139595102 152010475 150607227 134862629
13062 134862629 110994382 87035982 67379652 52770153 42259844 34563586 28738154
13055 28738154 24212271 20617774 17740873 15427396 13682661 12217559 11123844 10337144
13047 10337144 9515656 8829505 8195547 7668197 7117699 6585374 6082828 5615328 5206234
13038 5206234 4776002 4300893 3936894 3652809 3383708 3162866 3039463 2952681 2823767 2686289
13028 2686289 2591594 2520102 2401952 2318226 2169730 2034850 1870877 1796500 1787778 1763347 1723570
13017 1723570 1618880 1530258 1542822 1507520 1609350 1633863 1608181 1487274 1434470 1437136 1407812
13006 1407812 1472321 1518613 1584042 1627268 1648241 1688836 1757727 1856661 2027939 2215427 2360386
12995 2360386 2426616 2408137 2294078 2128137 1948955 1869094 1785216 1667451 1572669 1506884
12985 1506884 1475784 1477879 1475889 1410454 1337964 1389441 1433955 1491589 1546975 1590976 1662156 1758008
12973 1758008 1833292 1907278 1893453 1917231 1976966 2013033 2031215 2112043 2197707 2164091 2063971
12962 2063971 2037741 1991316 1967950 1940316 1867159 1723087 1655171 1675547 1680950 1655946 1598354
12951 1598354 1479544 1511209 1486503 1481791 1400166 1329395 1338208 1292243 1253322 1222724 1257906
12940 1257906 1439412 1553224 1670434 1829598 1884261 1937126 1865786 1693727 1550855 1277600
12930 1277600 1090944 955351 824291 704283 562285 469486 452837 489542 517606 491927
12920 491927 485117 562390 627439 633242 586752 523444 610255 610260 618521 646934 589272 594651 643983
12907 643983 653220 633598 533283 520194 530760 487551 507391 539913 566122 608758 695904
12896 695904 691932 703605 735628 699406 666205 685595 645866 580332 538306 597308 623091 683567
12884 683567 718126 773820 816373 802284 784447 863807 854452 822137 767365 720177 693446 698393
12872 698393 754814 736592 683544 670183 629815 643645 758055 785163 722744 679345 628067
12861 628067 672259 665280 642722 555867 484973 459971 502390 466608 514843 501813 525797 625234
12849 625234 730317 792744 825041 797892 705079 555674 611647 621044 593190 568882 576154
12838 576154 632717 646807 656078 627893 575831 517750 539694 603606 595196 599323 636181 680924
12826 680924 641220 619739 670174 713062 676055 653958 630766 724478 707948 682603 695275
12815 695275 708488 663091 630041 667432 733986 745988 693193 650616 651850 740546 802563 876710
12803 876710 872759 837495 824892 858661 852526 852237 822634 793112 847697 878290 923069 936958
12791 936958 908915 843385 810271 807171 883105 965953 934233 918396 1021347 1004701 947334
12780 947334 991006 1012396 996631 1014818 1120410 1166836 1201069 1148495 1145185 1161335 1179064
12769 1179064 1275139 1359961 1406705 1401549 1426025 1460937 1539175 1565747 1597286 1624120 1650443
12758 1650443 1722213 1752688 1833864 1880211 1954573 1984048 2070231 2113154 2138842 2114472 2112383
12747 2112383 2090576 2141887 2189737 2227437 2246030 2252106 2195968 2101212 1939662 1839806 1786714
12736 1786714 1791642 1769466 1680396 1645564 1571096 1473504 1419778 1413949 1375387 1316635 1317870 1358163
12724 1358163 1336827 1316044 1291930 1398805 1468668 1497797 1540260 1633988 1770966 1915503 1947698
12713 1947698 1826662 1785658 1786735 1784318 1805391 1846804 1931564 2013615 2012087 2025709 1979775 1986831
12701 1986831 1975514 2046027 2118697 2116616 2153999 2311448 2408507 2471855 2593643 2661846 2723024
12690 2723024 2818012 2949097 3133726 3226417 3298439 3502748 3702708 4011572 4317524 4619623
12680 4619623 4802097 4867599 4912314 4949453 4942709 4968615 5059645 5091868 5171958 5235948 5283715
12669 5283715 5455807 5739914 6003697 6199284 6396737 6688089 6987875 7220633 7521595
12660 7521595 7908243 8286990 8741812 9263197 9789396 10372158 10983423 11676091 12473163
12651 12473163 13400346 14444516 15654707 17059329 18603167 20209276 22045477 24157377
12643 24157377 26318371 28623225 31202445 34232775 37862853 42109347 46861754 52150736
12635 52150736 58155290 65124034 73314470 83155474 95550159 111752512 133311984 161639687
12627 161639687 197449445 239802395 286056470 332421015 374739666 408775048 430006994
12620 430006994 434924236 421967529 393029013 352680898 305562085 256050139 207978566
12613 207978566 165013802 129669285 102585929 82609791 68052331 57317636 49160506
12606 49160506 42735032 37421224 32817064 28862951 25424377 22400745 19818806 17682180
12598 17682180 16002140 14688342 13602292 12727864 11952144 11278361 10766832 10374485 10173543
12589 10173543 9933486 9786030 9650558 9535567 9528572 9543918 9549652 9569701 9674029 9793481
12579 9793481 10024313 10323749 10754578 11175346 11577460 12131432 12841165 13538783 14238881
12570 14238881 15038295 16043751 17136713 18388423 19775359 21279580 23110980 25251779
12562 25251779 27660750 30512457 33640319 37213595 41426271 46388137 52462288 59862364
12554 59862364 69161200 80898777 95920437 115281929 140145572 171066011 205906140
12547 205906140 239355740 263857731 272158432 261539831 236948975 206908233 178268359
12540 178268359 154568336 136716832 124097828 115718128 110793014 108906341 109486716 112334768
12532 112334768 117629724 125175295 134597688 145321938 156833664 168694659 180606985
12525 180606985 192518485 204544904 216722615 229098965 241347165 253005407 263523994
12518 263523994 271961426 277435634 279433750 277560022 272072420 263643710 253225321 241751422
12510 241751422 230093913 218688555 207770537 197482416 187415391 177503476 167636546
12503 167636546 157662772 147743889 138427865 130085628 122995022 117687615 114570351 113874826
12495 113874826 115925423 121179239 130245760 143780441 162363217 186148537 214015580
12488 214015580 242837865 266789881 278764883 273600996 251047335 217214684 180819120
12481 180819120 147750982 120344804 98538650 81298033 67572175 56555049 47693853
12474 47693853 40651191 34957462 30321033 26576780 23626391 21171122 19176582 17539957
12466 17539957 16216793 15157818 14312585 13640291 12835805 12004963 11200595 10382612 9553680
12457 9553680 8830088 8247043 7763495 7408121 7194433 7068575 7098543 7367891 7894432 8717477
12447 8717477 9452910 9823222 9687246 8714348 7553277 6662416 5873603 5176212 4701760
12438 4701760 4431620 4177408 3962399 3842481 3811182 3750928 3669042 3501351 3376517 3168403
12428 3168403 3015741 2950434 2839120 2746603 2656178 2592509 2555177 2485751 2453013 2468770 2418885
12417 2418885 2357578 2278295 2178278 2156192 2137843 2199308 2256821 2293765 2428723 2607565 2865295
12406 2865295 3239400 3500558 3795412 3963405 3947276 3773823 3302459 2737974 2322117 2033230
12396 2033230 1791341 1578714 1523728 1425296 1427314 1393944 1331412 1386862 1340365 1309270 1257800
12385 1257800 1249120 1227161 1259388 1335832 1456115 1604098 1781495 1983543 2206120 2234606
12375 2234606 2148778 1984207 1842209 1732617 1694059 1715348 1712915 1672594 1575817 1400333 1185706
12364 1185706 1058871 979447 864695 846378 801644 789486 865598 879405 890622 863241 839766
12353 839766 756663 720754 771561 817635 906103 1024810 1125931 1264839 1432485 1640705
12343 1640705 1730552 1780964 1672330 1537541 1456111 1429392 1305535 1193219 986823 812579
12333 812579 696539 578149 537773 643868 712756 653296 614849 557275 578926 614535 565651
12322 565651 520459 502451 582148 631067 670368 699472 698863 620657 566357 599707 672294 907480
12310 907480 1100755 1211029 1300188 1321015 1194890 973758 763946 628831 580616 558097
12300 558097 534571 348094 292853 271468 244244 316084 296691 244113 238774 242950 277977 274763
12288 274763 170704 131217 83234 116493 48527 2465 -6247 71005 138410 123765 90929
12277 90929 126083 105029 131153 159005 173204 158771 60972 65054 131911 190069 198397 232268
12265 232268 230075 211967 166580 152194 94232 -6837 -11079 -39826 -45306 3611 94972 138486
12253 138486 116957 77789 99550 132065 67922 53583 142868 224891 202248 198760 238255 214434
12241 214434 217176 200956 205457 282993 348220 366692 362237 323807 290744 255467 210039 281488
12229 281488 282715 215089 119625 86992 126791 109877 68825 140033 161027 130881 161091 186188
12217 186188 209972 246159 301746 286247 334510 337440 302315 343699 427411 544332 537830 532697
12205 532697 544314 516968 515350 597452 688716 767914 894576 1086582 1260805 1531481 1778849
12194 1778849 1908894 2070005 2156768 2203994 2167607 2114916 2013286 1768955 1439827 1210084
12184 1210084 1054304 940071 823854 645928 623944 598282 526611 488889 448839 332512
12174 332512 199401 105371 25653 31630 5579 -50255 -81092 -13169 -9803 -1041 -30178 -57769
12162 -57769 -87062 -40149 37637 37085 12114 8799 41599 -3943 -53155 15753 55654 17033
12150 17033 -40704 -36517 -62772 -55594 -36437 13472 78264 104059 191170 216619 136087 63393
12138 63393 97426 111738 132621 133856 -11168 -83292 -62755 -75462 -93797 54428 132956
12127 132956 41358 27981 102207 172703 157497 49410 40807 129140 63849 -19418 -13975 13466
12115 13466 -15908 -7786 -17044 2960 39726 28488 17133 47314 44287 -29459 -23052 38206
12103 38206 66434 96120 136386 208173 318347 340950 310328 254846 401779 610731 847568
12092 847568 1042921 1178963 1295159 1359063 1260132 1129840 1002414 883075 787794 744643
12082 744643 695477 642975 617428 570274 502635 429165 459597 594450 727260 799123 792431
12071 792431 841147 898802 996112 1103881 1144001 1114405 1205983 1306272 1371215 1356759 1391386
12060 1391386 1468899 1471699 1356108 1289890 1240682 1218262 1210595 1168632 1135432 1032041 1020484
12049 1020484 952263 877846 833871 761241 750282 712836 637859 547921 564774 572754 551635
12038 551635 575149 567362 655273 757315 929184 1042557 1165017 1257084 1342672 1322132 1278367
12027 1278367 1108717 950923 773077 607605 578718 508882 385135 295006 236943 140422
12017 140422 105517 157950 129753 109778 176540 183223 179076 125057 41914 34985 64775 49951
12005 49951 41880 63458 38544 29442 -5601 -44175 -57205 -47266 46421 92700 78446 69131
11993 69131 -20202 -47187 -12219 -35712 -76797 -54424 -26728 -99593 -153829 -118095 -109203 -96453
11981 -96453 -43227 41802 12432 -4030 22853 -45807 -85149 -36116 -18172 57141 45681 17747
11969 17747 -5773 -31384 -30431 72524 86946 -5168 -14333 18893 -7498 -66000 -74299 -92695
11957 -92695 -57193 -109976 -119038 -91176 -106693 -121608 -170274 -137774 -92448 -98498 -87236 -86637
11945 -86637 -62330 -25526 66109 142171 112167 7317 13535 54138 13980 -30988 -30580 9316
11933 9316 -30688 -29523 -13210 -41254 -92960 -69656 22102 -53815 -96584 -67230 -56472 -30420
11921 -30420 -23568 -57711 -89383 -119254 -43011 22865 -34985 -26388 16875 -51578 -21232 44971
11909 44971 46391 -5380 -42598 -46558 -77886 -86704 -5736 44737 19084 -17235 -47404 -46242
11897 -46242 -15949 -8763 35346 83561 17484 25020 37933 28673 -12849 32656 38771 -778
11885 -778 17948 -22396 -11388 1901 -510 2073 52281 80774 51506 12326 811 7643 62750
11872 62750 97941 48881 -51622 -69385 12669 22177 35904 79164 13073 -74271 -19011 31901
11860 31901 18140 58284 -6729 -61911 -25062 -47153 -24282 -43376 24756 80221 25754 1867
11848 1867 45684 95765 106753 123070 54160 17063 842 -34349 3068 80513 36326 -11792
11836 -11792 -17209 44300 74633 113628 82720 80954 81576 61801 49960 67474 105517 64769
11824 64769 73863 69649 9083 9742 -25478 -6029 36076 22150 -21147 -47656 -12753 58575
11812 58575 118908 71613 30131 2551 -14025 13870 15924 40079 -9994 -86853 -69474 -34683
11800 -34683 -24143 8581 15164 79632 74711 70195 68577 148076 123341 77807 101594 131288
11788 131288 150978 104228 84652 50685 42263 86273 92659 97627 83492 61888 94954 143269
11776 143269 140650 102115 97434 39243 24788 48858 38910 -9219 46898 63028 96997 115214
11764 115214 98419 49353 33319 51924 57835 47692 45317 57062 177014 194514 141656 34495
11752 34495 26417 65128 50596 32187 52070 20293 49212 148092 212425 197125 132140 155010
11740 155010 194793 179447 112056 48402 28714 62629 47636 54834 139921 266045 295539
11729 295539 261389 219410 209515 175961 198340 188771 179651 158955 168855 234083 184395 129838
11717 129838 138164 172286 146468 200141 267450 162353 42204 23579 49089 130973 132514
11706 132514 124481 136385 145578 153176 189307 175851 169045 145587 134290 95939 154113 179939
11694 179939 126493 120965 122407 109903 55515 124736 254386 266015 249029 190255 101258 60786
11682 60786 30486 71326 96173 126414 111562 139484 83679 221102 295248 222923 164870
11671 164870 97057 124437 141418 145502 229886 329298 244593 114854 140986 159983 121309
11660 121309 133896 155980 142558 159554 157196 151870 89036 103545 88552 87602 123009 154346
11648 154346 137223 147219 144308 87408 71394 106687 141606 194505 186754 97344 63737 129340
11636 129340 188368 205102 238324 204965 109341 68568 105690 127975 170734 171087 189586 230986
11624 230986 245388 199039 189278 138300 32974 40864 99907 159949 216765 206617 172783 191047
11612 191047 263193 336846 298546 216688 161083 129852 75830 30639 61006 131544 206950
11601 206950 197875 114411 73211 97768 122783 142029 61248 17214 127632 159416 140321
11590 140321 139723 106574 56269 44887 52731 19600 30238 85164 84132 35202 17339 63471
11578 63471 91476 136802 209269 206722 191130 204582 206673 155242 98518 143593 224685 295741
11566 295741 313411 311941 268984 141516 21696 36696 64094 128377 190619 146283 174470
11555 174470 151699 49945 89034 68773 109291 217148 234010 159723 141563 146804 185555
11544 185555 197589 188581 208997 226172 183139 105931 111645 127951 44470 38535 26076 -12269
11532 -12269 12745 82474 130575 129608 141384 178505 208555 202532 212001 266820 327588 393819
11520 393819 360040 349816 391997 366363 322698 317891 282332 271536 262972 234539 271326 322696
11508 322696 336860 277810 289199 233588 237582 245483 280063 299488 252995 275930 398986 476625
11496 476625 448175 373040 356261 441415 498082 563081 631819 675908 840266 986802 1037377
11485 1037377 1008107 878761 759969 692338 677063 592241 498729 532137 514852 493857 473137
11474 473137 483767 445658 487794 463871 400127 400585 416289 447048 493254 491806 471414 489891
11462 489891 525656 538184 573414 609575 697447 661068 723157 807731 933283 1165723 1329775
11451 1329775 1575068 1753382 1753848 1648310 1469233 1235414 955447 739960 587354 445140
11441 445140 421189 399226 427407 407203 368843 394170 412758 460121 466399 440664 400346 343420
11429 343420 294131 242327 328637 336913 362991 481576 482469 452782 459781 483426 439396 487911
11417 487911 602044 733419 819024 934430 982169 891236 750504 705755 652259 584128 472890
11406 472890 468639 514388 450389 370437 305697 267042 340770 365913 355720 362515 345844 290246
11394 290246 260527 234111 249353 247573 230356 143953 176009 153455 101650 64370 141175 199680
11382 199680 186678 168965 106668 119947 180730 198218 177667 233628 230352 199409 183481 187985
11370 187985 161474 169060 202360 263155 274313 291410 341565 316994 300550 318661 312354 268434
11358 268434 275652 323721 246932 275953 401743 412605 357811 337626 289026 274380 317270
11347 317270 382809 385786 339242 326472 248946 225070 188383 118053 153915 242935 208355 208473
11335 208473 289812 422682 445497 394033 329152 371083 429208 468930 463575 412048 415445 377512
11323 377512 398215 396177 485271 535403 548804 578211 555218 404108 283034 315230 314298 382342
11311 382342 436984 429610 395495 436361 457498 394549 406682 432396 446291 484472 496845 519300
11299 519300 509201 474357 428052 385820 367339 400636 465565 551784 606086 507440 449685
11288 449685 415548 462686 514162 499918 502710 446356 420169 451638 406793 362302 390999 393728
11276 393728 467185 492382 562305 543777 539164 562345 578165 567398 606820 672108 628985 520711
11264 520711 434914 546212 570166 584955 567566 537949 554387 614134 621381 621824 612397 609944
11252 609944 601938 651816 623508 555629 542865 565946 620950 626209 582706 573953 600345 671453
11240 671453 662012 747014 766176 653045 597020 599011 586842 659103 660968 640298 722848 760174
11228 760174 732989 752485 752091 727763 660416 633238 587460 552202 573786 627983 655560 663744
11216 663744 684607 713313 760066 755267 770136 837500 841090 768828 733081 776228 756434 820317
11204 820317 923076 991858 972132 1013491 1009437 1019283 1067021 1096372 1068237 1104209 1124831 1094145
11192 1094145 1150538 1221071 1238439 1278365 1361965 1543013 1638002 1716377 1769983 1658630 1597725
11181 1597725 1504304 1443168 1472117 1442153 1386922 1316164 1239111 1259800 1393987 1455090 1521727
11170 1521727 1597844 1679636 1700095 1785570 1853353 1918347 1916762 1935177 2022075 1971114 1921216
11159 1921216 1966190 2114635 2189088 2268826 2346182 2393817 2288722 2242048 2167208 2025719 1920372
11148 1920372 1834507 1797499 1791082 1827862 1814203 1860819 1913854 1980634 2085845 2162372 2122177
11137 2122177 2192672 2337556 2529916 2707410 2882848 3071958 3179547 3292775 3310750 3340261
11127 3340261 3428128 3590250 3667676 3586442 3452720 3288284 3151156 3128862 3063387 3081795
11117 3081795 3124536 3169700 3256352 3350200 3418590 3465331 3559189 3713087 3808455 3944346 4058376
11106 4058376 4188594 4434605 4677893 4950931 5249708 5502014 5788158 6026023 6259769
11097 6259769 6607714 7037931 7530330 8053229 8638683 9338497 10149211 11136030 12212691
11088 12212691 13407363 14666082 15937408 17214552 18519311 19902650 21511218 23584512
11080 23584512 26120620 29302362 33486776 38755293 45718799 55216474 68766779 87680831
11072 87680831 111403405 135644265 153495469 158004724 145422458 121502968 96527888
11065 96527888 75828192 60535948 49775560 42475942 37549168 34311802 32496615 31623031
11057 31623031 31412141 31489659 31708392 31969729 32121030 32408339 32955769 33861910 35086095
11048 35086095 36626695 38380226 40555202 43431587 47212605 52215989 58667077 67141318
11040 67141318 78490040 94075346 116653943 149499010 193448195 242651485 284218036
11033 284218036 302951486 288587659 245768967 193424314 147466729 112611530 87885463
11026 87885463 70743093 58943821 50873512 45401028 41505224 38618736 36137874 34005710
11018 34005710 32168255 30517452 29111220 28078256 27526591 27323699 27296996 27331775 27398653
11009 27398653 27786645 28821835 30489137 32769230 36073666 40752910 47167762 56057386
11001 56057386 68802284 86329081 107775906 128661389 142388129 142909621 128048768
10994 128048768 104058104 80246443 60974500 46827534 36849528 29801591 24850575
10987 24850575 21383651 18962085 17104396 15479077 14021014 12697470 11361877 9994657
10979 9994657 8752235 7624273 6576912 5777583 5187287 4641212 4178283 3848167 3552689
10970 3552689 3345743 3154532 3030739 2930054 2794321 2616168 2472886 2389955 2375704 2328007
10960 2328007 2226705 2165098 2150016 2108175 1999932 1946676 1863090 1789240 1737648 1701749 1695640
10949 1695640 1643588 1646548 1644225 1638321 1587008 1507492 1496367 1477328 1453452 1386771 1285241 1201045
10937 1201045 1168282 1268117 1301556 1300817 1329847 1295781 1302752 1279797 1214482 1157036 1126826 1263100
10925 1263100 1348654 1295581 1211285 1168858 1124524 1183926 1202434 1143929 1123566 1126572 1184516
10914 1184516 1168347 1214816 1191955 1075585 1074527 1097139 1093907 1045319 1062693 1009710 974745
10903 974745 1030115 1020569 1035269 1024007 967747 981605 1096989 1054631 964054 998152 1030448
10892 1030448 978893 970848 956254 990422 955864 1018545 1161308 1144890 1039076 1044978 1134845
10881 1134845 1129610 1162168 1222635 1240725 1210427 1163972 1163704 1152687 1189412 1192355 1114772 1062455
10869 1062455 1092487 1035522 1057632 1043654 1107030 1218840 1242134 1205593 1169570 1167241 1187340
10858 1187340 1190300 1222442 1229589 1349464 1453668 1429494 1445178 1535271 1617735 1671078 1766931
10847 1766931 1889284 1976003 1985406 1947297 1927444 2035779 2152464 2167040 2196989 2188836 2227339
10836 2227339 2252509 2279034 2374149 2482664 2577687 2586288 2596651 2659560 2696563 2660607 2696226
10825 2696226 2730616 2747213 2763565 2671795 2615091 2638804 2648500 2668846 2684366 2725080 2721178 2745749
10813 2745749 2737289 2702887 2705481 2728428 2743310 2671661 2686550 2708282 2772666 2815101 2794775 2748311
10801 2748311 2751520 2746524 2716666 2727791 2774643 2902125 3010028 2983631 2943560 2927596 2990442
10790 2990442 3080176 3194559 3296232 3368365 3451725 3450974 3480766 3525082 3546782 3566303 3622472
10779 3622472 3702863 3797781 3863885 3955510 3955938 4049628 4218174 4306207 4482160 4571698 4580503
10768 4580503 4569127 4653212 4753159 4868722 5025587 5105579 5267795 5462553 5647924 5746482
10758 5746482 5941545 6198524 6367112 6626318 7026108 7276298 7560407 7885784 8251544
10749 8251544 8605682 9029129 9608413 10152321 10750332 11423212 12119455 12764303 13568902
10740 13568902 14495851 15527820 16660765 17821875 19121501 20501613 22047323 23886569
10732 23886569 25976226 28394622 31123955 34050594 37350400 41107011 45411758 50434891
10724 50434891 56244700 63005476 70993004 80507003 91885613 105506212 121673510 140371305
10716 140371305 161353872 183194290 203260570 218484877 226035847 224543435 215114169
10709 215114169 200464953 183692397 167386983 153301262 142233220 134447861 129958328
10702 129958328 128430893 129639464 133411907 139389160 147056447 155746124 164199365 171434768
10694 171434768 176643307 179617020 180896035 181621182 183495126 187658467 194737777 204929077
10686 204929077 217495732 230975135 243336056 252145930 255435707 252335500 243502797
10679 243502797 230776568 216630996 203391604 192534426 184742947 179902036 177165767
10672 177165767 175224668 172575278 168141147 161613000 153530005 144780195 136369890 129314117
10664 129314117 124170599 121289200 120687993 122583847 127092332 134155907 143662290 155232203
10656 155232203 168003704 180641414 190993479 196721131 196080917 188500883 174728379
10649 174728379 156991708 138041000 119808125 103414145 89218398 77260992 67346253
10642 67346253 59123899 52199049 46291241 41266332 36841067 33148303 29918312 27085720
10634 27085720 24649614 22526851 20627089 19032425 17708684 16468639 15285835 14238474
10626 14238474 13296172 12424530 11626854 10833688 10144136 9572252 9110685 8726812 8397555
10617 8397555 8156352 7957638 7705597 7573903 7630772 7726681 7788455 7711842 7582495 7369758
10607 7369758 7141259 6936116 6732534 6601319 6464447 6331331 6247852 6159249 6125292 6134098
10597 6134098 6158216 6231258 6335117 6313071 6266565 6498891 6928621 7347296 7527595 7237703
10587 7237703 6526134 5785914 5283386 4980234 4689707 4485504 4447849 4456297 4426523 4446312
10577 4446312 4544973 4629468 4748674 4824669 4803463 4733708 4552596 4356896 4247219 4181598
10567 4181598 4143718 3999185 3904091 3777792 3623810 3395337 3279166 3175949 3065083 2989300
10557 2989300 2929994 2895793 2920809 2898326 2877632 2860944 2927700 2977997 3020339 3123757 3217975
10546 3217975 3369390 3432756 3357620 3345891 3321083 3308423 3254912 3185212 3074041 2994986 2905869
10535 2905869 2803582 2633848 2563830 2520650 2384291 2265347 2175380 2037792 1909152 1861144
10525 1861144 1849135 1810056 1696253 1635598 1650203 1638801 1589073 1520275 1455741 1491215 1459461
10514 1459461 1441617 1442728 1461513 1496332 1536767 1574765 1596898 1527739 1467360 1507656 1529405
10503 1529405 1546561 1511620 1436789 1367808 1323618 1198838 1174235 1165542 1068583 948955 986502
10492 986502 991426 1030043 1025242 1001234 995915 971640 947083 872037 883382 981513 1014217 1016753
10480 1016753 961014 921028 854899 731678 664857 750046 727055 723386 767775 708492 737542
10469 737542 782014 830805 862129 794006 790162 740740 683343 657591 695442 750308 852241
10458 852241 832342 801755 764256 742531 622140 608895 641848 555362 572212 543603 429094
10447 429094 419385 422585 397897 461998 473066 515156 590065 673913 674762 649983 659890 671553
10435 671553 685870 602485 606254 629992 523306 489585 457905 355302 311245 335590 321095
10424 321095 315601 315578 301965 324199 372692 375081 327097 296557 314038 334467 289772 273837
10412 273837 264904 314035 316293 392103 328875 295373 314053 236550 319889 372218 413476 348564
10400 348564 340450 391679 402615 391361 394466 451621 461585 483468 565186 622414 600972 534258
10388 534258 424993 382793 336695 340836 309906 312718 219586 137361 134148 205007 267546 296980
10376 296980 334065 299079 271612 270292 266045 257317 206826 203609 237238 238256 218289 190044
10364 190044 216738 227908 236934 273063 284154 289810 348177 316436 284250 217126 162904 154985
10352 154985 83973 115148 252575 273721 348889 359007 318891 265879 253613 255513 272653
10341 272653 252563 258287 286575 254327 212790 219979 218619 241476 262821 195124 120338 84796
10329 84796 62108 125586 174275 152239 178449 254125 199750 156334 192865 214310 184652 189178
10317 189178 258988 261317 226346 255893 257146 210405 187623 207882 240562 232408 266380 339000
10305 339000 366374 403617 362650 352889 365808 372113 429099 417979 385249 395142 469449 632800
10293 632800 830593 958918 1019311 1080267 1134471 1197940 1151541 1113110 1093282 1087774 969374
10282 969374 920695 834210 783252 823893 821037 758146 709416 738847 818445 901263 889755 889553
10270 889553 986671 1068133 1120524 1174489 1080771 1079176 1139011 1139491 1222985 1241372 1240469 1347598
10258 1347598 1457778 1417478 1316677 1310294 1281858 1169305 1088790 1151783 1068020 982929 973646
10247 973646 1008594 979838 922005 930842 886465 853651 806659 832000 787874 744457 738064 728963
10235 728963 748187 740309 798741 860693 957668 1062205 1172212 1204735 1139238 1140595 1074494
10224 1074494 956639 843885 730437 686778 668598 637210 642071 605774 433334 382556 319417
10213 319417 274937 231136 272603 285513 340028 436307 480758 407148 451817 577197 741397
10202 741397 891593 995854 1058982 1149558 1269636 1283747 1210091 1116976 917092 763774
10192 763774 620336 564154 486855 376020 209546 99976 113366 128888 88389 92662 151386
10181 151386 217196 207027 173414 97340 64669 132695 113748 113033 93931 81068 103258 144807
10169 144807 92712 71362 141707 129109 118117 211110 198233 182783 202873 186725 162576
10158 162576 130342 131969 115042 152203 135971 98082 119147 147473 186133 235412 173901 56343
10146 56343 -28939 -65979 -12702 -18303 44486 18771 -9600 38218 92189 157094 120949 28020
10134 28020 -28265 -17899 17819 69537 51101 65140 79678 138956 159026 186600 243363 217288
10122 217288 172779 145080 90562 94395 133353 90437 81410 72867 6930 -82473 -57816 21365
10110 21365 86348 126864 111213 124573 34464 73094 70406 44294 40859 1180 33343 62850
10098 62850 71466 20441 28568 81983 151324 105230 320 -82071 18323 26410 33032 92519
10086 92519 128764 111270 73134 63724 66733 -11673 -56802 -45153 -6816 13951 32113 -16859
10074 -16859 -31855 -28091 40125 75517 88272 151476 115895 109337 139868 83097 80221 150604
10062 150604 172880 197200 85318 43784 70607 80493 67140 17355 47974 76533 41078
10051 41078 42220 88152 142149 62224 6487 24066 60533 105862 145984 180461 185325 158275
10039 158275 165015 228011 237858 256630 281431 237762 84415 53354 98943 142992 111747 9541
10027 9541 19708 66155 106825 145938 139910 78715 42923 55421 21006 70455 97105 87904
10015 87904 65762 37458 84368 51384 31832 88891 74875 23933 48667 84737 56876 60724
10003 60724 55796 61278 70902 76433 43043 -21619 -17518 13801 70725 115153 118353 72162 130908
9990 130908 255848 259717 267563 269528 267092 321990 352040 330615 257423 155817 160052 216403
9978 216403 139247 70557 90546 70033 50289 85751 39213 -4211 27101 161184 253700
9967 253700 210548 212477 223967 266592 254971 91834 15158 55198 62820 53011 139527 174136
9955 174136 168894 142683 141735 120122 64840 80794 114656 133420 168608 59645 6741 31104
9943 31104 20312 44760 107858 176229 159679 193137 194735 110281 43735 72625 106822 71005
9931 71005 27716 22398 50204 97328 198140 269980 258827 175225 207317 187323 133588 159710
9919 159710 276765 278449 206756 183197 236550 210354 139927 123561 99154 115820 102400 86297
9907 86297 162110 211527 181099 212699 227089 141289 98247 100904 76510 126689 193926 194918
9895 194918 189486 217547 234011 196970 184428 153590 151185 228551 193770 165498 230058 292019
9883 292019 282040 251396 200144 187503 222027 179715 261621 316363 223561 154426 144301 122121
9871 122121 122295 155991 186260 159403 125801 147933 104120 79909 86488 90917 96475 120527 146391
9858 146391 156284 150334 162896 93161 86301 146904 192177 182153 198230 254760 351509 300872
9846 300872 250561 283645 233951 144079 105488 63599 142637 184479 92748 23120 61251 110952
9834 110952 158354 196592 166880 157988 180866 327487 339328 258209 195826 199505 180709 210121
9822 210121 239454 245557 170597 162931 119012 97695 113943 134344 189103 158699 191979 201033
9810 201033 239405 292454 326095 385928 383810 383990 438382 499318 560393 574292 496549 656966
9798 656966 1018622 1181956 1380723 1635150 1722201 1697229 1612527 1764008 1987930 2283909
9788 2283909 2496875 2518269 2266258 1903088 1729664 1580159 1498066 1472078 1527310 1364530
9778 1364530 1106472 983887 832689 746687 708115 707082 674004 702622 720560 755548 825272
9767 825272 984616 1177251 1376928 1573596 1638671 1616685 1673231 1830573 2068084 2256239
9757 2256239 2323370 2241342 2030077 1705757 1563030 1514809 1445754 1396877 1344948 1206403 1006336
9746 1006336 751248 606892 432358 328249 320118 337867 410732 486870 452328 401162 369517
9735 369517 394802 354553 319707 353788 317456 323644 335296 356335 354162 326699 243858 184556
9723 184556 167900 239259 258226 243607 254155 280129 293207 269031 254393 260013 243309 152743
9711 152743 192959 277648 328681 321047 357566 413248 374888 344951 352405 329979 322041 243351
9699 243351 290585 351368 320234 310978 337377 377412 345884 317875 259276 261232 262225 332517
9687 332517 389027 422847 449517 499843 482701 435540 396370 334738 383899 392287 308289 288900
9675 288900 377169 351437 319185 318224 311755 258823 233864 191239 324185 394692 394743 387618 329102
9662 329102 330211 328930 415978 454512 504485 539327 542875 466313 424513 399075 441377 490597
9650 490597 451954 394674 409018 421139 460002 407770 317955 286457 243815 190588 237797 275215
9638 275215 310649 393282 418421 403633 430636 430773 408616 465391 428802 342929 297119 344753
9626 344753 348818 368807 352085 316384 294989 381339 404763 422597 374721 358356 345531 307088
9614 307088 349594 369463 318435 279328 304851 293985 304610 338624 397089 397315 339924 349486
9602 349486 336254 377255 379455 366051 336879 435285 419956 371999 377426 425176 445909 420307
9590 420307 389089 351013 322710 348993 405607 394574 395929 383502 365355 280522 354973 361610
9578 361610 382606 356713 386742 476841 487923 472872 454308 423028 412611 427582 386536 404136
9566 404136 405700 435872 538772 576147 601378 562074 447615 449739 397858 414072 421167 425097
9554 425097 423680 468346 488503 481102 487551 501070 504678 476435 402837 448803 463395 408170
9542 408170 392546 428212 466909 516393 506693 524824 562389 533847 511668 447885 441472 495160
9530 495160 476238 440753 413282 476304 536342 497557 434510 484757 494756 519644 555531 591400
9518 591400 480205 460206 567591 583890 597572 568789 488615 452376 481469 568100 561664
9507 561664 526575 525236 508060 500946 503263 470235 515457 559075 613229 676754 678256 668310 661853
9494 661853 644575 607026 585677 618392 597596 618167 596961 557810 556042 557065 601778 631398
9482 631398 595921 577778 587466 568219 547899 585047 548888 490741 509565 528813 633481 604680
9470 604680 567449 574415 602244 655819 721180 730862 729731 740425 681983 648434 603119 591315
9458 591315 613600 688454 680566 671592 683226 740026 774555 813852 863517 801407 706168 602821
9446 602821 628469 603637 582954 630007 632579 592813 595759 609850 579592 581576 599278 614669
9434 614669 564550 612528 646259 705008 702012 690479 722774 670294 646496 697936 773098 782388
9422 782388 779456 711028 725606 763653 759028 748179 783739 785979 758721 732367 746315 804945
9410 804945 767018 726888 692273 688844 740102 783765 861982 770315 745339 768955 771157 827557
9398 827557 850477 826157 769220 686497 705766 765616 752858 735322 707795 724469 682343 701545
9386 701545 686879 719512 802346 796387 823361 891440 869723 819568 822735 751778 750621 757791
9374 757791 732504 725684 780816 780417 740333 694671 691708 706216 830922 874685 857516 798701
9362 798701 771043 787116 830595 880723 889822 900550 897703 905770 936920 959425 947212 985560
9350 985560 994696 950024 875933 883699 859083 850178 941089 925957 901944 887150 971375 1031977
9338 1031977 992659 1013279 995592 991395 972048 973111 945487 1029849 1002617 957459 977445 996223
9326 996223 1017314 1020967 1020631 1053872 1116679 1126042 1114669 1031032 1004038 1017864 1043056 1108782
9314 1108782 1131471 1145187 1154177 1131288 1185343 1235572 1222350 1184259 1164554 1201746 1298965 1300600
9302 1300600 1177554 1141863 1189588 1186748 1153516 1150531 1117402 1176245 1168426 1203955 1258371 1293285
9290 1293285 1338635 1419318 1446882 1468510 1452176 1431152 1492477 1502351 1440029 1377778 1417320 1404657
9278 1404657 1389389 1367469 1324341 1367336 1450004 1486176 1471839 1473448 1526483 1619625 1683877 1654243
9266 1654243 1660266 1657383 1648739 1656744 1643000 1662403 1726328 1674161 1758496 1802408 1747384 1749740
9254 1749740 1786228 1818742 1936375 2080669 2200171 2248589 2205896 2069956 1967813 1872192
9244 1872192 1806133 1748625 1678717 1742950 1763252 1729470 1712829 1686511 1755265 1787791 1874144
9233 1874144 2034299 1963679 1912517 1918410 1922245 1893630 1870368 1891397 1851889 1826438 1776982 1811229
9221 1811229 1826415 1848220 1836832 1781351 1772307 1788796 1854563 1848145 1861153 1880732 1857295 1859052
9209 1859052 1858509 1822408 1845497 1864975 1781407 1700745 1678679 1668861 1707925 1708352 1712494 1760883 1758362
9196 1758362 1753372 1692244 1668250 1682405 1732043 1723725 1700742 1692711 1776251 1870928 1885118 1909547
9184 1909547 1912477 1861996 1887198 1906207 1842121 1830001 1822970 1850879 1987550 1990599 1958518 1947165
9172 1947165 1917521 1912677 1967786 1948319 1970593 2043477 2075010 2038469 1934171 1871035 1933829
9161 1933829 1955085 1991986 2077855 2169937 2145357 2057807 2096096 2192989 2205233 2187994 2155034
9150 2155034 2157828 2207442 2218881 2224794 2227483 2228709 2230810 2280193 2296775 2303821 2328226 2257401 2261034
9137 2261034 2319144 2350048 2388583 2331800 2326354 2378121 2438549 2457058 2469704 2507615 2534530 2564939
9125 2564939 2517706 2508657 2530364 2614853 2637242 2573517 2581990 2653169 2616852 2636847 2608082 2622850
9113 2622850 2667383 2681839 2664764 2708679 2842800 2876666 2822816 2820229 2865545 2898125 2895511 2984284
9101 2984284 3010971 2968779 3004538 2972905 3004937 3040313 3058144 3104093 3133996 3089265 3105816
9090 3105816 3104979 3118066 3211459 3264690 3233403 3279537 3322643 3359932 3349743 3460014 3541179 3579504
9078 3579504 3606282 3616381 3549662 3466365 3463674 3577617 3555024 3577046 3638311 3631499 3622002 3738927
9066 3738927 3795470 3825213 3993211 4087076 4042095 4054174 4068212 4028299 3976026 3956419 4031548
9055 4031548 4046987 4014723 4013416 4004118 4109112 4218413 4228621 4235777 4301175 4317598 4313023 4376359
9043 4376359 4463122 4526373 4595247 4599020 4535751 4613918 4770654 4845337 4840473 4896306 4948366 5009217
9031 5009217 5076154 5192703 5256528 5270127 5285258 5296264 5384344 5441378 5478256 5453282 5446655
9020 5446655 5475753 5464260 5453955 5532303 5636974 5737568 5718257 5828500 5918415 5999975 6083147
9009 6083147 6074934 6078832 6130028 6243854 6352075 6425860 6516262 6503806 6537051 6600458 6664649
8998 6664649 6737535 6737903 6771438 6844964 6954447 7029782 7134525 7190869 7239800 7276069 7349918
8987 7349918 7464174 7512017 7582605 7686256 7829733 7926867 7999293 8095647 8178039 8228490 8199876
8976 8199876 8209535 8411056 8520745 8626600 8721573 8854918 8939592 9000007 9152185 9185936 9253419
8965 9253419 9432886 9570547 9602971 9699659 9815333 9985501 10052929 10114048 10213495 10376121
8955 10376121 10513131 10589828 10751970 10906406 10994004 11118726 11359294 11522406 11614449 11710280
8945 11710280 11840719 11977110 12119645 12281259 12381873 12494801 12617890 12754829 12908236
8936 12908236 13086424 13301638 13474512 13642410 13761898 13905221 14124949 14332420 14522317
8927 14522317 14718413 14826426 15004143 15187872 15421169 15609984 15807226 16011836 16226330
8918 16226330 16396945 16555108 16788586 16993297 17146803 17448285 17730949 17998595 18273776
8909 18273776 18453207 18659006 18919315 19187893 19416139 19578111 19779224 20006602 20254430
8900 20254430 20560609 20833882 21163273 21435746 21703020 21979192 22233395 22532669 22787205
8891 22787205 23031702 23343562 23666289 24059371 24404965 24740916 25150883 25399046 25660575
8882 25660575 26073926 26476535 26862489 27229576 27625765 28106589 28525193 28928624 29352426
8873 29352426 29867361 30550755 31237332 32251501 33798932 35754429 37914272 39662420 40527113
8864 40527113 39724344 37891913 36186402 34944940 34175233 33725848 33454920 33367124 33356990
8855 33356990 33433834 33436066 33480324 33552933 33661280 33678212 33786304 33963361 34070375 34123351 34209429
8844 34209429 34299007 34356026 34426411 34433571 34474473 34473106 34415762 34422052 34453430 34493946 34413414 34403819
8832 34403819 34395321 34374527 34244025 34091603 34072674 34008245 33900320 33690665 33531461 33442984
8822 33442984 33348978 33159362 32898379 32722912 32579507 32415246 32200677 31914425 31665728 31390946
8812 31390946 31175132 30929365 30691018 30472494 30241829 29946675 29656359 29378739 29140641
8803 29140641 28861191 28537048 28224925 28046886 27765249 27353777 27086860 26837266 26457586
8794 26457586 26104951 25824131 25514717 25200088 24900473 24626128 24376666 24089401 23811855
8785 23811855 23506030 23146959 22837654 22692660 22442608 22053043 21662237 21404934 21086753
8776 21086753 20861464 20685071 20436846 20176361 19885270 19553580 19222403 18948450 18705556
8767 18705556 18499025 18317677 18049499 17778835 17515972 17338268 17101216 16865759 16607512
8758 16607512 16385627 16225445 16086361 15845843 15542646 15368939 15127522 14919815 14680529
8749 14680529 14464541 14253696 14085911 13949226 13761545 13499603 13340790 13133638 12920676
8740 12920676 12813416 12622561 12424420 12285720 12160895 11942517 11803209 11700849 11489737
8731 11489737 11411439 11257030 11097550 10966504 10793003 10694629 10551790 10421437 10316520 10193970
8721 10193970 10108690 9951051 9808013 9621002 9510088 9400731 9315428 9185275 9042461 8944932
8711 8944932 8887987 8811278 8685753 8564424 8540471 8470093 8294137 8140306 8026430 7939147
8701 7939147 7871011 7802608 7672915 7621699 7468784 7345989 7291607 7201662 7110044 7020732 6934791
8690 6934791 6839400 6802353 6777160 6753900 6686505 6491832 6375722 6341042 6331568 6264550 6206996
8679 6206996 6115358 6071170 6017621 5929557 5915261 5818127 5749253 5760552 5728239 5697040 5517850
8668 5517850 5465834 5401987 5324555 5263190 5233843 5237316 5196030 5154021 5126416 5079006 5007767 4994708
8656 4994708 4898274 4787154 4741717 4685964 4685485 4704608 4682790 4720745 4634603 4551830 4539501 4521436
8644 4521436 4397022 4269027 4249999 4238907 4190356 4213637 4289026 4311808 4197211 4099223 4062849
8633 4062849 4042920 4001004 3935730 3887449 3795793 3785849 3892950 3892710 3824251 3750372 3763834 3772202
8621 3772202 3679507 3672920 3714635 3694310 3724254 3797201 3748770 3683263 3717096 3630273 3607412 3642367
8609 3642367 3678361 3815142 3903832 3952321 4038274 4266668 4597740 5158559 6010748 6862245
8599 6862245 7434994 7601032 6938078 5853290 5131285 4665273 4382915 4162156 4030983
8590 4030983 3894204 3800413 3761069 3789827 3814310 3750031 3760621 3698082 3590533 3518786 3396303
8579 3396303 3330476 3280566 3284304 3235887 3134253 3170455 3236320 3223643 3290060 3512584 3712919
8568 3712919 3810850 3845890 3823231 3784477 3696242 3619055 3716497 3854249 4171443 4665821 5442117
8557 5442117 6919926 8635599 10004367 10825205 10119082 8087654 6211378 4926065 4122465
8548 4122465 3596921 3162733 2889796 2735389 2589278 2434559 2424464 2508447 2564105 2517335
8538 2517335 2486059 2516933 2485032 2561063 2703308 2762515 2885766 2942731 2873433 2727553 2640588
8527 2640588 2514005 2350034 2285090 2230918 2155901 2168114 2144141 2124061 2143478 2157080 2232153
8516 2232153 2402188 2623777 2995897 3480307 4195254 4996498 5507989 5517385 4722083 3675077
8506 3675077 2960750 2428584 2065178 1905294 1902207 1801699 1695026 1587392 1503640 1516621
8496 1516621 1533843 1496670 1465317 1460705 1454014 1406363 1382882 1339729 1255732 1279102 1283809 1270067
8484 1270067 1217582 1220158 1256616 1204630 1196128 1221907 1259963 1196304 1208494 1191410 1247335 1195311
8472 1195311 1182795 1155140 1114427 1151472 1182592 1173819 1110833 1121452 1189059 1171139 1194251 1130061
8460 1130061 956059 977995 984024 925999 918739 1006542 1082288 1060968 1007519 936352 952145 946651
8448 946651 976050 937422 948960 947593 973393 1005319 950261 1021932 999675 882227 834477 895115
8436 895115 918046 908831 928053 970394 912010 928375 881269 854719 917147 873069 862432 861258
8424 861258 933120 1002462 992494 909361 879467 918009 941779 910226 907263 959365 939475 951142
8412 951142 979222 928553 785022 775131 786337 816802 835972 794244 779074 756585 806279 847494
8400 847494 869397 868237 820591 728823 691140 667144 661835 688548 680714 695878 750460 707824
8388 707824 648707 623994 650282 660985 747202 775310 775213 776249 838847 907322 909659 830912 803372
8375 803372 809666 808261 815606 911123 982032 1080113 1067091 1030902 948306 848389 704856 676184
8363 676184 704285 683284 657391 595125 536830 482265 422537 462089 469024 494700 599525 631936
8351 631936 593895 564429 637190 670147 615597 483851 501203 622404 711068 643930 584253
8340 584253 522626 497305 551685 564140 606940 639018 625601 612273 620994 646208 698460 780237
8328 780237 870545 993792 1057237 1127047 1302842 1431279 1325890 1069471 900083 795279
8318 795279 733590 721832 736381 732127 648102 548941 475680 500988 571669 575328 510705 433762
8306 433762 339447 366187 450690 500834 516598 531356 482081 474239 482398 474697 434209 422966
8294 422966 467295 495581 484176 510593 548563 570674 559320 590970 617841 527633 503904 506752
8282 506752 541904 634946 754937 813412 773108 807159 752129 650988 594447 526116 440405
8271 440405 395177 402846 435125 465156 480717 454369 460946 434979 434528 444522 419268 474691 479906
8258 479906 481925 388964 394847 368433 279042 288172 355101 424965 392042 465103 496594 451309
8246 451309 474787 421645 456193 470697 462411 511083 387672 351607 378755 312197 265858 318730
8234 318730 385158 321912 291431 313854 338704 381099 338492 326422 307830 312761 309311 332938
8222 332938 441148 481283 482638 323200 267071 314485 338706 313340 241914 260287 318042
8211 318042 289891 322277 250702 207897 259041 150431 186729 217159 266367 296883 216370
8200 216370 240221 273536 297251 230798 234577 246405 342110 382975 266500 223775 213268 256830
8188 256830 295811 299532 360535 429514 386623 258897 223997 244469 219896 208705 232568 197623
8176 197623 184097 122691 139427 174358 283527 312102 295147 248846 298429 299254 286855 274732
8164 274732 259124 291782 258259 252364 294378 274299 286448 285666 248781 212542 316792 408604
8152 408604 367710 307635 270515 265354 289679 322310 301752 331983 375110 386693 316839 311246
8140 311246 224153 170983 150047 102111 110068 121515 159736 252649 284597 287768 326045 326238
8128 326238 272267 227755 223746 257391 275779 240896 257239 252158 249654 227044 216865 234353
8116 234353 251441 226671 159896 143072 109844 175664 265269 307049 242126 160089 101861 123255
8104 123255 201497 190211 151402 122756 134004 79714 97651 128976 158913 272865 323795
8093 323795 327939 322300 232132 215161 237164 163910 130851 172994 163932 156819 151684 142336 167731
8080 167731 184204 217330 183125 147730 116183 134029 163726 166267 227223 220916 137475 58899
8068 58899 61964 67650 86473 91512 5063 -56995 14171 110947 136798 102822 134521 161789
8056 161789 151228 135708 167256 154317 72648 111898 160368 163390 121513 152044 132858 172555
8044 172555 235877 225615 163198 166528 172840 181399 185551 140355 165500 161847 150431 167659 207476
8031 207476 160057 116733 108484 129765 121723 188255 137334 155792 139226 106723 146299 147492
8019 147492 157706 122533 114965 110948 152093 215320 215055 217109 235229 273360 256553 249434 252094
8006 252094 224152 165137 175620 150150 182330 213833 246318 239202 251776 294888 318612 320956
7994 320956 271711 244151 222998 281127 310236 335872 304655 233228 173906 138829 109603 139426
7982 139426 145535 191785 142539 116379 97956 111629 164339 191177 108429 98765 103674 130885
7970 130885 206445 202296 125633 42594 1709 -27164 72140 178233 207615 165796 154499 176225
7958 176225 121692 152881 162406 146960 201396 265096 252838 259377 222996 198199 238080 258013
7946 258013 178027 85225 37604 81200 91650 76798 63142 28268 102330 206463 166223
7935 166223 72752 113291 130259 62803 24526 33228 113511 182112 177462 153155 132340 86794
7923 86794 67570 91955 123892 161270 134241 90233 154386 245285 328327 298908 290354 288931
7911 288931 280756 258957 138823 134777 99235 152406 201867 153965 144974 152831 146807 207382
7899 207382 249278 218154 135065 141828 191869 147333 132037 77095 67984 104273 88317 107957
7887 107957 141729 188970 128690 113760 170164 104452 65040 83771 149144 178785 82698 93554
7875 93554 133158 166363 154199 144880 129871 105663 83168 34213 885 9239 7159 67083
7863 67083 78281 71652 77194 133607 158487 203797 139681 106634 134477 186363 207008 157866
7851 157866 122540 79850 133056 124030 107368 150947 109848 24091 -55270 -10894 13227 96257
7839 96257 159387 130813 115068 82229 64813 4057 78093 114886 79932 79676 53804 6768
7827 6768 -30252 40305 92034 77512 15891 -14608 7130 1934 34520 4469 10075 24465
7815 24465 11502 -9095 -27862 36985 7536 -27696 18427 26083 -532 -21378 -89051 -151822
7803 -151822 -125108 -50286 -6170 9297 71897 115989 87538 34018 -10170 -67668 -16732 -9744
7791 -9744 32963 41115 90839 79641 68866 98485 30974 -18755 -22925 -43617 24651 131840
7779 131840 102502 81324 4181 -11378 74563 35950 -30749 -63706 -353 39636 59928 34490
7767 34490 43557 159113 140558 9836 4029 92825 141241 173555 196149 127178 6822 -9118
7755 -9118 -14897 -69358 -137842 -100015 -30030 43979 113651 88272 75694 86985 109892 138128
7743 138128 116546 114912 132726 57182 36282 18466 20506 85802 135823 72662 41382 39408
7731 39408 56820 -19258 -81110 -45025 -90812 -95858 -27722 -66142 -42998 -28556 -39851 -14026
7719 -14026 18834 77838 89926 35596 19745 -5430 -35947 -125301 -81584 -43233 -98475 -68684
7707 -68684 -36511 -71577 -76125 -22132 45065 11490 -57853 -87081 -46758 8064 113384 71581
7695 71581 77346 106690 72158 62129 12639 13886 -8810 23959 -31301 -61983 -74839 -97576
7683 -97576 -97416 -33311 39564 10651 57491 70231 41188 44753 39259 11014 56745 69017 -308
7670 -308 8750 -19965 -107599 -119694 -86386 -75109 -53740 30067 52837 101341 72215 60422
7658 60422 81987 94902 77003 33532 53476 53669 77599 132596 181334 69031 43632 93457
7646 93457 75061 10173 -33824 -66506 23030 41256 34194 -35498 -111748 -73510 -37143 -27577
7634 -27577 -81193 -128655 -111157 -34217 24065 53195 33796 -7474 -37625 -29043 -75318 -80837
7622 -80837 -99565 -78217 -109475 -89852 -32065 -28079 -33926 16960 74192 26440 -63771 -77517
7610 -77517 -53849 -36431 -37537 -92875 -96413 -44519 -54761 -112231 -81916 -83244 -61722 -57403 -36376
7597 -36376 -14930 -3067 -19517 3903 -31795 -39735 -8262 -120857 -156862 -98995 -84235 -27817
7585 -27817 -10074 -40651 -104311 -133425 -105981 -44609 -34717 -55159 -153411 -146373 -122704 -37065
7573 -37065 -2367 -27933 -56438 -82651 18139 59651 6696 22223 34561 21551 -15303 -10551
7561 -10551 -6138 -63074 10718 46603 43206 75132 60753 17682 3532 9608 -24450 -37182
7549 -37182 -28897 1872 35637 69967 59382 8014 -43561 -80100 -86611 -34283 -42819 -67005
7537 -67005 -64721 -72414 -54293 -2187 1519 -82097 -135901 -121928 -90902 2550 -14970 -50987
7525 -50987 -5094 -31469 -72735 -27762 40457 102954 78326 29660 23145 28946 86767 33242
7513 33242 -32398 -95743 -138272 -64014 -37056 -73506 -70194 -40541 -45377 -45388 -86113 -93006 -58585
7500 -58585 -20099 5781 -84796 -168705 -151977 -101429 -17117 -64179 -72494 -91719 -58329 -31595
7488 -31595 -48444 -7669 -6630 -37023 -85086 -48952 2161 14163 -30038 -14690 61107 98000
7476 98000 71707 52132 8633 -156 -52049 -98359 -176820 -125649 5366 40848 5920 -52207
7464 -52207 -67535 -1734 53341 46156 4099 51155 34086 -49160 -117639 -130371 -67256 -45460
7452 -45460 -53154 -78686 -121925 -205207 -170499 -104588 -70439 -131506 -134116 -167348 -101466 -18345
7440 -18345 -49548 -108117 -96557 -85019 -19429 -2458 71614 99282 110611 78809 10401 -76829
7428 -76829 -130222 -81405 14014 35001 10702 -13664 -85917 -169227 -166676 -125588 -94447 -48056
7416 -48056 -38613 -84858 -124472 -129824 -130827 -89062 -60704 -69818 -134209 -140919 -126307 -145016 -109395
7403 -109395 -69513 -56380 -75993 17407 32526 -72291 -130911 -117721 -56358 2036 15749
7392 15749 5918 -41567 -22771 -47982 -23978 20238 -3620 37048 -2971 -78202 -118574 -43121
7380 -43121 3375 5716 -38898 -70429 -97296 -124500 -150573 -106955 -117232 -54349 44129 59555
7368 59555 59577 123990 160738 86042 -4514 40562 12856 -32104 -21478 43467 -37678 -121412
7356 -121412 -105464 -71544 -11377 -3648 -35275 -84686 -122676 -155064 -86996 52422 44055 25720
7344 25720 -71901 -249105 -278947 -202714 -167588 -96415 -85787 -95014 -42123 -19822 -48100 -10563
7332 -10563 -70366 -144008 -182218 -120081 -103409 -183999 -160574 -63729 -26616 -68361 -5960 -6838
7320 -6838 -9916 -2879 -23041 9635 69288 48863 53323 27551 10656 13121 83485 62174 25611
7307 25611 65122 116218 141523 90678 5336 -45588 -115339 -62534 59153 92070 124157 138828
7295 138828 79899 -6668 -66269 -78150 -115746 -98084 -49144 -118794 -152605 -135731 -79216 -47926
7283 -47926 -55537 47640 71979 41262 42042 -29532 -31251 -48284 -67748 2762 -23139 -78513
7271 -78513 -92057 -70403 -63520 -69299 7571 19062 -75816 -107077 1759 22930 -3734 25006
7259 25006 69167 27630 -16966 23312 12635 21305 61560 71717 68466 129168 110331 80240
7247 80240 26548 791 24118 13354 96088 92185 60534 -21535 -79010 -110045 -57215 20494
7235 20494 28121 -18146 11368 10359 -43245 -7235 14610 5884 -39361 -80264 -104003 -120340
7223 -120340 -146446 -84230 -46370 35506 39973 29213 22083 60332 76961 97349 41847 -56727
7211 -56727 -113494 -112733 -116113 -90264 -91480 -57133 -58332 -24376 -63321 -89300 -67760 -20187 60345
7198 60345 74941 35828 57576 29972 42232 2139 -54670 -54689 -59989 -47394 -49390 -37070 -87551
7185 -87551 -78871 -67618 -50372 -13256 48535 130922 59620 -1395 47816 28843 -66163 -56745
7173 -56745 -48551 -51927 -5208 2547 -19657 -80325 -92422 -57928 -4300 -15972 867 -57641
7161 -57641 -112921 -97391 -3858 8240 18515 31756 -22805 -34966 -78817 -69370 -33635 -20988
7149 -20988 -65703 -91191 -82321 -84558 -116513 -79641 -93150 -121850 -146474 -80849 43486 51188
7137 51188 -9112 5339 10046 -12051 21613 -13665 -1555 -11403 -1520 -74013 -96431 -84129
7125 -84129 -77788 -63773 -33608 -93121 -107944 -94858 -70374 -150071 -67845 25910 7899 -56161
7113 -56161 -55479 -110079 -46167 -270 -47006 -89597 -90487 -91240 -80921 -34223 -58025 -101309 -147203
7100 -147203 -151435 -86431 17464 -40607 -151095 -120751 -57659 20748 49702 32704 28897 -96105
7088 -96105 -101056 -48751 626 -56035 -82937 -125027 -198617 -229217 -223516 -180475 -216276 -257673
7076 -257673 -244710 -155603 -96668 -67494 -113148 -146357 -128980 -126247 -78607 7614 46545 14005
7064 14005 3683 -40061 -44878 -12212 -57323 -112480 -138426 -124266 -147494 -160869 -185357 -67888
7052 -67888 8404 40438 51146 95670 66699 43135 49913 14013 18714 69820 -680 12903
7040 12903 62502 29533 -81671 -110164 -67886 10841 68290 89493 63490 2552 -83988 -129117
7028 -129117 -65652 7822 -26555 -83486 -34246 23678 4597 -46360 -115379 -63058 -31341 -17064
7016 -17064 37761 25067 -16840 -87675 -65168 -25153 11785 -39677 -62296 -95881 -21771 -25083
7004 -25083 -37327 24572 118229 125161 111192 126650 146953 154469 31969 -6743 -8565 -47097
6992 -47097 -24918 3991 -17952 -22930 -44580 -28212 -1025 -55839 -108701 -84569 -37981 -9723
6980 -9723 -42488 -78953 -65690 -111042 -70707 -38789 -26239 15935 18937 -78099 -118752 -155788
6968 -155788 -175622 -191010 -223253 -182624 -168819 -155913 -148710 -84488 -25536 46944 105622 84290
6956 84290 112222 110808 26104 1473 -20691 7498 18968 1607 35125 -986 -67006 -69214
6944 -69214 -72661 -31569 -27459 -70378 -45820 -52203 -70989 11014 -73765 -77539 -50145 -50418 -10249
6931 -10249 14017 -57770 -80696 -80714 -6042 12672 -105279 -91415 -81769 -125455 -152199 -179217
6919 -179217 -146725 -91200 -32975 -116228 -199842 -212587 -168856 -29310 -24915 -41646 -11945 -26421
6907 -26421 -56217 -9429 -4286 17617 48228 -1887 25370 374 -26087 -17683 -8507 39426
6895 39426 52671 67756 71877 14581 -25750 -62675 -61827 -4930 19308 45857 14587 13542 -39960
6882 -39960 10695 -10802 -2402 30204 11436 -53232 -65339 -87869 -35249 -60056 -117542 -160657
6870 -160657 -147074 -137066 -122951 -47349 -3051 -7544 -4514 70858 17824 6458 23574 23943
6858 23943 13553 36764 26816 88497 157689 179179 202403 137173 80088 35985 28254 43068
6846 43068 -25913 -56818 -77265 -85709 -52720 -21153 10651 57363 46539 38993 22897 38462
6834 38462 47242 41661 86724 17454 -64529 -94647 -73448 -124089 -168025 -148117 -131781 -81124
6822 -81124 -85712 -70258 -103214 -47840 48975 -1865 -89215 -68960 -52712 18546 -9751 -7750
6810 -7750 25878 21839 24202 28476 32180 41079 68172 45116 -15392 -32231 -18006 31294 -20282
6797 -20282 -47363 -43193 -136156 -123562 -105459 -70369 -80413 -73632 -138122 -166213 -172369 -69859
6785 -69859 -41780 -40720 -9479 -54023 -85734 -100392 -200124 -199414 -113576 -69483 -50459 -43297 -46803
6772 -46803 24170 -31182 -77725 -118132 -117694 -155833 -159159 -124587 -106991 -81541 -101124 -114136
6760 -114136 -111468 -169885 -165109 -127479 -72689 -58063 -179446 -177276 -54255 275 -10740 -28291
6748 -28291 -20534 -81092 -63085 -35395 1166 32234 6592 -59811 -116316 -52037 -22244 -69198
6736 -69198 -67900 -55942 11212 2334 -61267 -23103 27039 -1217 -77956 -109022 -51745 -45541
6724 -45541 -22069 5617 439 -50571 -85580 -136302 -121507 -65402 65725 150331 168459 227081
6712 227081 358834 425849 461014 368039 275735 178283 181154 150407 37351 84101 181191
6701 181191 138126 61189 -15241 -36886 -29702 -8764 -20199 -63113 -5720 15922 44580 87079
6689 87079 10353 3947 -32239 -116372 -42874 604 -46580 -157783 -160725 -150755 -154973 -106232
6677 -106232 -827 -36650 -94910 -69792 -64723 -59613 49301 194768 182965 135609 44462
6666 44462 42052 -54275 -70403 -10026 85861 45050 -16403 -76005 -132900 -128883 -125674 -117471 -115015
6653 -115015 -96772 -118151 -127670 -50716 47850 70229 -18991 -38966 -22600 -56070 -50863 -33628
6641 -33628 25663 28335 -66047 -150349 -166591 -92954 -31425 5223 -32002 -88731 -82548 -143881
6629 -143881 -145467 -151391 -111833 -94313 -69786 -9273 23207 19707 -39310 -52292 -39073 -24362
6617 -24362 -33951 -85740 -166999 -150921 -122776 -159787 -149828 -78201 7656 33395 -40468 -89421
6605 -89421 -109612 -79475 -68969 -49683 10923 42010 -3874 -70826 -116282 -130242 -89663 -84534
6593 -84534 -77477 -36839 -66989 -99495 -48372 -5064 -39662 -42962 -62048 -31893 37393 34657
6581 34657 16319 21771 4112 42353 3669 -66183 -127563 -117316 -75866 -50303 -15018 2293
6569 2293 55836 83970 32343 18298 38841 -50369 -90025 -81391 -35174 9979 -71792 -80441
6557 -80441 -22936 81933 102790 79276 106169 48396 -2500 -54215 -83501 -43637 -1071 -367
6545 -367 -88501 -165690 -112702 -88770 -70478 -24298 23980 66626 12042 -67908 -84316 -77654
6533 -77654 -9899 37507 38932 -41760 -54577 19331 22613 42 -46720 -156548 -188379 -186871
6521 -186871 -170399 -126292 -141674 -114600 -61940 -20882 -49096 -43022 -23168 22330 -24797 -98286
6509 -98286 -78277 -70118 -45004 -49549 -15865 -46521 -46580 -21117 -28590 -128368 -106495 -56576 -69843
6496 -69843 -120798 -175394 -225518 -184898 -76293 -57612 -92657 -35007 70964 47805 -7343
6485 -7343 35226 36068 5522 -5467 -44028 -14823 -35144 80 -9780 -53872 -45195 -92559 -127129
6472 -127129 -65208 -70164 -113545 -75056 -34490 14861 -70865 -98356 -141731 -191225 -97133 -49998
6460 -49998 -101428 -103984 -89412 -108700 -109894 -97700 -82210 12010 -17833 -29853 -74031 -103297
6448 -103297 -17358 56472 93422 52205 14956 55894 15781 -19484 -94470 -131861 -104399 -44574
6436 -44574 -16741 26333 24621 99736 66776 -16516 -52915 -64053 -27862 -10379 -20427 -974
6424 -974 20318 -40345 -30033 7113 71532 25170 -53888 -96469 -87938 -121159 -113120 -109101 -109664
6411 -109664 -58973 -60230 -13660 10405 -4982 -53758 -84283 -81706 -58120 -18155 -29935 -132094
6399 -132094 -148828 -148444 -119905 -87853 -64321 -125516 -151450 -67368 -30808 1844 -25746 45307
6387 45307 -9586 -24373 1167 75262 91752 115691 139506 120781 31232 -15282 -25359 20949
6375 20949 1797 52866 87763 44267 -60883 -137932 -70352 39872 70283 77422 3287 -56478
6363 -56478 -40805 -60319 -78004 -58365 -96654 -96056 -37367 -49277 -69656 14270 12265 -39375
6351 -39375 -38557 46902 79543 14588 -99485 -194551 -218907 -217664 -182053 -163666 -176696 -159343
6339 -159343 -63711 -72180 -17263 33879 43489 55736 67364 98960 51960 -28989 -72983 -20335
6327 -20335 38068 91699 62911 21378 -25588 -82149 -144605 -160784 -90392 12813 38364 28806
6315 28806 61569 73349 31539 5482 -418 32067 81679 21316 -108132 -164732 -206495 -217090
6303 -217090 -203434 -157634 -153462 -153299 -83295 -33799 16719 42761 11202 -13651 -31121 -50939
6291 -50939 -107762 -57510 -5786 -60322 -95625 -86030 -122263 -157993 -193519 -140647 -151231 -53260
6279 -53260 42017 27887 -41475 -12368 -8491 -27801 -21523 -14906 -79382 -89112 -26314 -15513 -47932
6266 -47932 -74423 -45692 -22144 -49846 -61372 -31460 -63462 -109802 -118079 -139561 -100859 -53012
6254 -53012 -69382 -125978 -140521 -153722 -132007 -86480 -129483 -117471 -84218 5665 48393 54250
6242 54250 53890 3259 -8119 34310 47870 34147 62665 110130 120813 90473 30712 -42564
6230 -42564 -108576 -104796 -93397 -133638 -221783 -209542 -70416 2605 -6213 -24080 -53114 -102172
6218 -102172 -109719 -112597 -110132 -67351 -34263 23277 75916 83188 55969 31575 -40142 -122035
6206 -122035 -223085 -218469 -145087 -114717 -106334 -84274 -60656 21864 -28854 -47232 -118693 -155014
6194 -155014 -136336 -144543 -140595 -51786 7910 10273 21590 -53816 -89939 -64960 -9446 -61283
6182 -61283 -116405 -18913 26541 -20426 -95553 -192756 -158825 -130040 -88736 -9474 -32514 -111105
6170 -111105 -75855 -9237 -16075 -43182 -64957 -114576 -94964 -66754 -57632 -109868 -83688 -101601
6158 -101601 -116173 -161161 -149152 -139192 -145399 -231015 -135814 -56398 -75588 -50684 -107297 -21963
6146 -21963 -44071 -27198 -31216 -67078 -33953 -39934 -16395 20367 57047 36993 -39667 -60564
6134 -60564 8803 -23810 -18134 2217 -24304 -79445 -99965 -26545 -18382 -50700 -20709 -3161
6122 -3161 14729 8834 -45320 -109512 -63295 4059 -59323 -89997 -119440 -165411 -58838 -5534
6110 -5534 -54423 -74514 -73433 -69709 -65005 -59070 -103924 -165958 -177561 -136688 -128533 -117768 -85549
6097 -85549 -73728 -81027 -91168 -61161 -54227 -40389 -28650 -25574 -38190 -47357 -74905 -60687 -71056
6084 -71056 -34432 47608 46335 36660 -73312 -129387 -170085 -82105 -55541 -158266 -128284 -12643
6072 -12643 -643 -42712 -18130 31579 -5373 -17047 -3436 -48358 -33520 -45044 -67248 -86471
6060 -86471 -98548 -57523 -39675 30270 93149 42758 973 4851 10332 45128 25504 3764
6048 3764 -35734 -42249 2098 42349 73773 102777 21070 -42236 -13641 -99311 -122366 -141184
6036 -141184 -133209 -139184 -187857 -163120 -46163 12248 45763 -14969 -39141 39940 -6721 -63268
6024 -63268 -128253 -79210 -89631 -66025 -58513 -52302 14652 18812 -47516 -65610 -70787 -45317 5206
6011 5206 -112346 -157106 -114923 -38485 24538 114656 119401 73030 39462 3842 -22860 -37261
5999 -37261 -127767 -91056 -33272 -1994 -14943 3627 13580 -356 -47318 -75495 -71279 -47656
5987 -47656 -46367 -27444 6019 -43634 -40728 -3711 -5951 32001 60847 37609 38226 46186 38987
5974 38987 14297 86151 112650 6095 -87845 -70056 -51341 -86583 -139779 -75372 11365 -3134
5962 -3134 -92794 -88695 -96726 -97136 -115661 -78298 -36347 -724 12842 -21470 -13966 -61645 -111485
5949 -111485 -86574 -53672 29235 77092 52554 54741 93104 58519 38905 -6543 -12180 -35460
5937 -35460 -39340 -68495 -83881 -4319 34346 43410 17165 -10431 -33996 -44104 -65841 -109321
5925 -109321 -133819 -127350 -107006 -159700 -157821 -91592 -23809 -46886 -78913 -1766 -33036 -41539
5913 -41539 -17970 -78124 -22978 65676 48853 21603 25363 6144 -42828 -46220 1560 17664
5901 17664 48509 82349 19342 38749 4520 -16386 -580 -1898 24237 46021 69316 79094
5889 79094 71216 22414 33397 83752 100015 122178 89150 50167 -7781 30010 11832 -44529
5877 -44529 21959 106197 82830 -13782 -58932 -64339 -12600 35997 73891 64749 2926 8732
5865 8732 9065 57449 33730 30455 -2173 -17084 30841 75650 61929 46536 57611 -12895 -67918
5852 -67918 -63696 -43566 646 -13149 -43165 -84198 -59507 -23696 -28630 52136 97216 93434
5840 93434 8107 -62609 -5977 -8911 23928 -5734 -5316 47019 -5181 -84729 -91191 -108838 -138756
5827 -138756 -200772 -265301 -280940 -245945 -211771 -194464 -83453 25322 89260 94188 44242
5816 44242 24299 135009 165747 57463 -50374 -77682 -13240 11455 -39540 -78287 -114818
5805 -114818 -66415 -7048 -33827 -76377 -119212 -118123 -102844 -69980 -40756 -39598 -84061 -71292
5793 -71292 -33612 -61141 -141690 -114431 -8704 12555 -56351 -84291 -88038 -137381 -139909 -123418
5781 -123418 -109635 -42020 31923 17732 -25791 -37924 -45869 -54720 55171 -18247 -57931 -32859
5769 -32859 -51750 -54997 -80825 -103824 -117394 -64217 -14857 15424 -5639 -122335 -134833 -51375
5757 -51375 45256 45249 75532 48904 3879 -68780 -77131 -42337 -63131 -132327 -136523 -124137 -40524
5744 -40524 -25394 22300 65437 -27550 -64159 -52860 -1778 27350 -71230 -90678 -34068 5597
5732 5597 40316 97051 40629 11516 -47664 -44984 12262 27719 -10796 -14623 48524 31186
5720 31186 -36677 -28442 -3385 -57406 -176912 -173116 -34683 21955 -15074 -25710 -52336 -61203
5708 -61203 -87025 -40096 28333 19411 16098 -112719 -146192 -121281 -47072 12303 -26635 -50117
5696 -50117 -27711 -9796 20064 25542 76420 78256 61073 -16328 -57233 -58954 5399 87788
5684 87788 90394 43168 23614 75973 12824 -32573 36935 43281 14366 -29041 -3970 -9340
5672 -9340 -53944 -131395 -174613 -116857 -101969 -131119 -167206 -160607 -67281 -1576 -3431 -33766
5660 -33766 -92323 -105386 -107360 -68621 -14478 -31938 -91064 -63196 -32482 -70041 -81086 -23183
5648 -23183 18901 -6932 51583 25576 -10853 30059 70444 46304 2259 55354 59788 17086
5636 17086 -1358 -13604 58695 42579 -14810 -75673 -48242 -30363 -24597 -76836 -128533 -89926
5624 -89926 -9632 23148 -8707 -20131 9728 -8140 -52358 -57437 24825 92824 75688 68803
5612 68803 34759 9390 -25086 -49142 13014 48822 36794 19190 -73690 -21963 -51809 -80824
5600 -80824 3898 4814 22757 127193 118726 125232 103027 -8099 -30852 -61899 -87804 -29838
5588 -29838 3589 26707 57161 45754 -23976 -40679 -2324 -27288 -59361 -72295 -84004 -97429
5576 -97429 -46469 -31607 -1920 9496 6813 -60328 -115035 -126249 -25720 28138 -1347 -11048
5564 -11048 -16269 22313 48661 50887 -30875 -43684 14135 38633 -4144 -15907 40298 41800
5552 41800 -17169 20444 52717 41582 -499 -100938 -133620 -146913 -148704 -114409 -107973 -105369
5540 -105369 -40600 33834 48378 24203 -30762 319 49148 -2415 -31440 21922 50596 41069
5528 41069 -14679 42373 -10835 -74759 -84085 -81106 -59926 4382 -21389 29115 118244 50064
5516 50064 -55588 -74458 11616 92880 110807 68338 -39942 -27050 -18635 72404 150743 162752
5504 162752 92184 39781 12376 112484 94015 22068 -3696 52350 42418 56382 25887 10927
5492 10927 20190 -274 14749 -8764 -79309 -56249 -79850 -82826 -52194 -38185 -56397 -24221
5480 -24221 67506 56423 -7643 8164 15217 19610 7365 14275 51839 18918 42833 59120
5468 59120 54083 35555 15784 -38844 -64037 -36282 13615 3027 27949 -42463 -13588 28526
5456 28526 -3884 -25363 -40960 -37909 41070 26280 5179 22838 71255 87288 126309 88988
5444 88988 107519 70291 -27488 -64825 -47425 23675 30277 -18069 -77610 -80375 -103251 -71838
5432 -71838 -55416 -38206 6068 53943 53122 29500 -11340 -50816 -85888 -95744 -104083 -94441 -77126
5419 -77126 -69187 -52119 -18473 96566 160456 101277 76431 70571 67468 -22113 -78944 -126098
5407 -126098 -123739 -116182 -134740 -233224 -181048 -119558 -74084 -44685 -17684 3740 40325 155430
5395 155430 198813 162327 110567 72985 95300 28242 -9095 35368 -14899 -82318 -50032 -11084
5383 -11084 11853 841 -7328 87660 147322 122368 3320 -80288 -50080 27416 23142 -87525
5371 -87525 -66245 1218 29003 24801 7700 8147 -11011 -23672 38464 97561 100005 133991 108013
5358 108013 121072 67761 44024 61989 34139 -35283 -69069 -17485 -19162 -46865 -131989 -89065
5346 -89065 -34521 -700 16482 18324 16221 -22699 -7220 -84015 -85989 -6320 89356 74439
5334 74439 36842 39728 52991 90843 43252 -125 7282 89329 126947 21391 -83131 -56909
5322 -56909 -91937 -122920 -102922 23652 85628 35502 2801 -4823 -46392 -69453 -28544 30370
5310 30370 57119 46735 50866 -7892 -28794 -52161 -78752 -135826 -93799 -42864 -71037 -29066
5298 -29066 14061 -53134 -115885 -68424 -11176 -19436 -25735 -56116 -25067 -29773 53809 22250
5286 22250 -29581 -40431 -51657 -69194 -127509 -157975 -131303 -91762 -83738 -98256 7057 -33513
5274 -33513 -120097 -81353 -49592 -5379 57910 72385 -1745 -35456 -30487 -38637 26888 36482
5262 36482 67930 91790 151175 133789 68624 43195 1788 -111061 -190528 -168558 -96430 -5597
5250 -5597 19660 -19504 -76534 -77529 -24147 -24696 -48937 -32615 -34659 -44374 -67228 -86113 -45996
5237 -45996 -19048 -36903 -110175 -164665 -148874 -80038 -116862 -85792 -11036 14960 -54253 -95421
5225 -95421 -38517 -47042 -88763 -2594 -22181 -17487 -12014 -25913 22251 14681 -30738 -133777
5213 -133777 -212849 -175647 -88875 -37812 -33219 -53798 -56746 -45046 -82930 -89654 -40257 -60403
5201 -60403 -46676 -174664 -194578 -191337 -158412 -45502 -8554 -80315 -105799 14371 -14504
5190 -14504 -20755 -67691 -69321 -55341 -113212 -69434 -51126 -71322 -80683 -26167 -45696 -83600
5178 -83600 -103077 -43784 3622 -26813 -26465 5960 -34617 -52793 -36443 5880 -28800 -89806
5166 -89806 -116039 -139148 -27201 -10051 -38672 -47692 -5183 7609 33213 -42358 -104446 -141710
5154 -141710 -110098 27229 108293 98353 98097 73641 98918 49324 -9805 -37424 13320 37619
5142 37619 -29681 13861 46329 -2264 -14690 -44301 -58387 -8892 78041 40540 40507 57833
5130 57833 -17700 -3384 -21918 -57749 -55444 -92832 -95973 -133989 -80259 -33141 18521 -28352
5118 -28352 32879 47760 23895 74358 59319 57377 36940 37025 -2462 21818 24604 7324 26943
5105 26943 31153 -2742 33384 38418 44353 57345 42330 49567 129836 126315 51381 -22123 -52833
5092 -52833 -50985 -78357 -16612 36946 98315 168532 99927 39957 50013 50926 20585 -13316
5080 -13316 -46167 -18561 -41692 -69043 -46208 58880 110997 128321 58486 37583 -14596 -85710
5068 -85710 -132966 -162928 -191096 -211762 -119254 -71428 -27827 371 -52701 -43983 -12744 -50526
5056 -50526 -64332 -57145 -89690 -171568 -184200 -144292 -92692 -93707 -25653 8548 -17172 -57562
5044 -57562 -118836 -189608 -143501 -13368 -7602 -4857 7106 39303 86192 3426 -15890 -53549
5032 -53549 -37978 11631 68185 89357 59624 67585 62622 -66171 -93259 -109516 -98479 -73202
5020 -73202 -18430 5955 -30708 -47465 -37697 16513 21289 4663 31822 27673 85716 99148
5008 99148 130787 78838 2242 28929 30585 23041 25513 37649 7921 -51800 -31516 110003
4996 110003 77888 34365 6790 32482 13349 42450 12961 -75107 -97390 -109354 -64808 -73277
4984 -73277 -54017 -4005 40669 72836 72723 64396 80952 94165 40084 31132 -2975 2214 14405
4971 14405 23526 7447 99049 54149 -16484 -3655 8471 -2637 11042 -41107 -51346 -67554
4959 -67554 -18861 -50068 -62380 -109099 -102080 -139879 -140068 -58484 -22488 -53828 -26343 1103
4947 1103 -11763 11911 9586 -12464 -5635 -21470 28359 112280 24965 -72697 -96957 -96501 -123606
4934 -123606 -985 68020 53559 32885 -7029 -8615 -57913 -79206 -84385 -82606 -42467 -8579
4922 -8579 -41234 -51247 -18275 -16043 13755 3914 -17722 1029 -45202 -105485 -80611 -56851
4910 -56851 -100056 -97927 -77361 42874 87713 -32239 -35896 16994 32368 44158 55161 86650
4898 86650 52833 64122 -28905 -106639 -67816 21067 -34735 -95280 -122961 -48249 -51475 -75571
4886 -75571 -73434 -16814 47377 89331 62078 -23662 23298 15476 -96721 -117279 -58876 -23269
4874 -23269 -61354 -65111 45011 66767 72077 21858 -40267 -91554 -107188 -21140 36641 32717
4862 32717 71498 92141 41594 -6692 -497 -10670 8994 -69358 -96379 -2085 53981 40292
4850 40292 84570 18238 -62945 -98799 -80332 -64736 -4101 147387 118308 -19320 -69989
4839 -69989 -52550 -31363 55727 75094 27983 42273 40867 82832 130427 143082 148833 135367
4827 135367 151246 217157 155159 -1095 -41740 -72701 -113444 -18398 105024 40722 -56698
4816 -56698 -45912 55180 77507 115749 148374 144269 63357 -1164 10897 80182 121543 45712
4804 45712 -31113 -31514 2625 3859 -52771 -123608 -123361 -133288 -105285 -11134 3603 18031 -18483
4791 -18483 -8661 24117 -5893 -41777 -10289 21347 50516 76708 85973 67790 65430 52650
4779 52650 -26276 -111984 -149255 -106876 -90573 -109848 -141885 -45266 37341 79409 45253 -22158
4767 -22158 -65910 -129261 -123151 -78250 -47467 -76770 -98165 -102775 -88860 -70708 -9834 -10933
4755 -10933 -38860 -105003 -80048 -61098 -28475 -8348 64183 93292 81541 -13828 -39575 -1747
4743 -1747 11299 55388 38681 -7611 -47248 -29187 -66143 -34629 -46021 -89274 -88543 -60520
4731 -60520 -6925 60682 129517 159052 169100 134619 93345 138188 158388 99036 123272 128326
4719 128326 70683 -30037 -71487 -54936 -34973 -69425 -76605 9807 -12261 -37651 -7882 21225
4707 21225 -44350 -65637 -13757 44418 11166 -45829 -8202 26051 18175 4813 4503 51058
4695 51058 50976 4518 -14490 -14552 -46241 -42551 21843 -20493 -35237 -23751 -25575 -23649 -57744 -172
4681 -172 63072 74030 2530 -49680 -12566 -12799 -524 -31702 10507 16113 -62871 -72634 -272
4668 -272 26473 76347 97989 86814 -11028 -30855 2058 15486 32882 26973 -7381 -887 -15784
4655 -15784 -83938 -91413 -57077 -84249 -93428 -97119 -92258 -109062 -61396 -44984 -14350 7254 100573
4642 100573 41529 45649 51550 87089 150478 92160 20216 -62743 -28341 -9276 -12632 2189
4630 2189 -66651 -78171 -48218 20165 1201 -64064 -28079 25621 69084 8472 -2120 -39038
4618 -39038 -78741 -67572 -22628 -26748 -14723 13302 -32471 -13472 -3061 28791 -17636 -104495
4606 -104495 -82537 17932 40602 16920 -31575 -96073 -58065 21513 -11611 -40153 -36442 -68920
4594 -68920 -101187 -44764 -3545 -14444 25332 125028 72667 -1298 -26443 2044 -1540 -90944
4582 -90944 -107139 -53199 -4659 1025 -13443 -18688 -29069 -16389 -32884 -20766 -27579 22375
4570 22375 66849 70858 117863 173091 165221 91751 -3211 19880 -31845 -82021 -40671 -18019
4558 -18019 7140 10799 22775 -29157 -17564 -2638 26267 8501 -17388 30993 90146 144409
4546 144409 79880 -19697 72758 40038 5747 -77255 -177111 -170853 -102314 -24364 27444 -30518
4534 -30518 -97750 -30327 -45872 -68560 17879 33581 -30616 12494 45521 91038 72711 45189
4522 45189 -10479 28423 -30349 -28330 26404 46452 -8801 -17360 15097 -37560 1890 43591
4510 43591 74994 29845 97783 81233 -52904 -82220 21484 20033 -24803 17028 62884 18723
4498 18723 -28244 -38979 -108012 -152397 -104178 -96152 -107480 -94138 -105534 -13393 -32487 -27955
4486 -27955 30423 -43992 -88052 -75018 -11720 11998 31966 57505 24416 -60266 -103673 -78748
4474 -78748 29568 59323 44114 46629 -8779 -120532 -164602 -129760 -141925 -81464 -85388 -44849
4462 -44849 108731 77828 -6971 16342 -31625 -133928 -87794 -34459 2253 62789 25136
4451 25136 -15910 -5218 -4947 16909 24367 -2256 23732 31595 17954 -16991 -83482 -82991 -48452
4438 -48452 -26870 32718 65518 36353 76939 105667 13626 -11638 57501 56885 49021 -51703
4426 -51703 -112369 -95975 -36621 -33427 -68281 -141609 -121455 -110902 -154604 -167176 -145781 -112252
4414 -112252 -70304 -81842 -92971 -75759 -67528 -11038 49064 84461 -3726 -63620 -43364 -466
4402 -466 -5848 -42387 -75506 -32038 -35542 29242 53337 86988 83421 85217 67898 162412 128890
4389 128890 67362 -3335 -14626 -1640 -36159 -12270 9882 -8699 -13697 -60116 -79422 13630
4377 13630 66193 79760 57848 17173 37381 -34475 -74176 -124163 -68346 37092 -2027 -12901
4365 -12901 -15646 30738 11047 55105 49872 44319 -2022 -55199 -53874 -20052 -83519 -166345 -147312
4352 -147312 -105073 -125321 -124971 -67216 -58552 -8566 38599 39432 44926 -69843 -81693 -80875 14696
4339 14696 835 -26596 -74997 -53371 1917 33554 49584 16441 -51261 -120284 -100250 -57261
4327 -57261 -33953 -63270 -89871 -121868 -97608 -105208 -43861 -75842 -123971 -117410 -131369 -138823
4315 -138823 -130280 -61894 22071 66003 102535 26079 -32279 -28167 25420 35328 81907 86489
4303 86489 58297 12361 -639 34680 -35526 -13196 -23854 -42152 -32486 17292 3770 -448
4291 -448 8163 -25200 -71924 -80349 -49159 -25826 -19206 -42579 -90603 -97031 -77114 -119934 -92398
4278 -92398 -59944 -19051 -24495 -44066 -78374 -79002 -14454 -29290 -26376 -52412 -46008 6720 47521
4265 47521 13453 38885 7770 -21497 36529 74895 -20871 -69309 -50824 -71299 -40774 1024
4253 1024 -13555 -3087 51212 46347 -9386 -109652 -90240 8826 52812 -14529 -21716 -13268
4241 -13268 -132396 -164654 -161700 -101722 -45068 -85170 -115071 -93570 -89446 -39834 104517 91374
4229 91374 46802 84797 162701 163063 115293 31335 -15413 -91873 -152283 -158961 -89062 -136028
4217 -136028 -142887 -354 65308 113778 86230 57857 50112 117696 145049 161132 82329 -33105
4205 -33105 -17007 6308 81280 102672 -28914 -38303 -50045 -31789 38884 19580 40959 64919
4193 64919 44737 44201 78384 83868 148305 129366 66782 13557 16737 40592 31980 -10179 -25991
4180 -25991 -36732 -19967 -7858 -55240 -8273 29160 9707 37879 49558 -19203 -33960 48219
4168 48219 151107 164610 26740 7993 -10644 -52012 -36923 -31274 18200 41936 45672 81868
4156 81868 99326 98980 71156 115527 80172 -48541 -87192 -76185 -57821 18687 48530 22491
4144 22491 28719 71170 60293 42666 46024 99163 72398 -3360 -53828 -25719 -44082 -88576
4132 -88576 -79621 -95171 -50925 -41850 -42650 -41163 -36003 -108777 -107139 -18287 -4165 -61641 11426
4119 11426 51344 54097 28003 -17465 18326 43536 -8496 -78931 -69233 14053 38838 91631
4107 91631 85837 40264 24579 -20458 -14656 -9041 -1561 -76100 -16989 -17987 -7029 -48441 -88733
4094 -88733 -121413 -120544 -125427 -94273 -46232 -27163 15798 22477 7865 25132 -347 -32085 -106277
4081 -106277 -61953 -25127 34201 48659 90467 47252 14331 1337 77726 76051 78079 43927
4069 43927 13591 -12388 -32843 8379 53142 29781 22198 12570 8603 -21553 -55930 -100364
4057 -100364 -98348 -80494 8033 5547 -23546 -26124 20306 -2093 -30328 -26860 8017 84226
4045 84226 21662 -59590 -31556 -47952 -6125 5003 76221 67698 38829 59835 85627 12674
4033 12674 -45189 -73243 -52783 -34682 13604 27989 -51946 -83994 -48079 24862 87704 97033
4021 97033 54636 39803 137486 80987 -844 -18677 36504 66374 29546 233 -32825 4264
4009 4264 19280 16420 92473 90245 121398 94812 -15066 -71760 -36465 -11953 -59809 -92847
3997 -92847 -64687 -44744 -59386 -6710 61844 71851 9656 -66199 -83019 -50037 5280 26199
3985 26199 14189 39683 75426 2903 -20013 -44270 -44458 9003 -25321 -37215 -33215 -34433 -52970
3972 -52970 -78519 -129807 -121697 -115816 -68439 -64271 -59537 -63274 -82414 -86486 -107828 -74089 -47804
3959 -47804 -37144 -19949 29897 70824 93117 79161 11816 17199 -1275 -56981 -48830 8824
3947 8824 66392 110615 76469 84769 115301 58950 18367 -27297 25184 143353 134205 43167
3935 43167 114577 125652 57457 49139 -2859 -91067 -40366 17294 12819 48068 107529 87495
3923 87495 116102 114791 -23715 -28313 -52311 -102936 -142187 -94857 -52263 -50142 -38260 16835
3911 16835 68117 38704 11825 47452 57922 -10822 -4565 -722 -5783 -57288 -24793 23237
3899 23237 40216 105704 64787 43616 87763 26151 31618 46101 68076 114890 150995 90054
3887 90054 -36477 -74870 10547 21513 26748 12629 55040 79163 118734 141562 41496 47702
3875 47702 96014 65422 -894 -45404 -42962 -10861 -59543 -80174 -49575 -31325 13673 118430
3863 118430 134914 94044 25437 12578 34714 70851 63392 19691 89182 -4886 -56864 68131
3851 68131 33871 -12320 -33625 23640 87032 100322 158129 89268 79572 118538 100522 38488
3839 38488 2061 -17676 17356 85139 61030 29383 81456 142894 138059 123659 61520 -78988
3827 -78988 -95598 -56754 -107601 -78618 -33501 -51878 -60461 -33542 3968 -10489 -53229 -33889
3815 -33889 -20975 85095 113470 50596 9605 -4354 3938 -1502 52000 96400 23580 -43110
3803 -43110 -4318 -5256 32114 66243 -13639 -19294 36769 133771 137081 119109 113423 124005 54098
3790 54098 15093 -54233 -38823 -67552 -18134 -831 31512 81727 60035 -62506 -99360 -46469
3778 -46469 2345 46558 40313 -4788 -11675 -45298 -108164 -158943 -119504 -10798 54522 61683
3766 61683 -32719 -72328 -109806 -119461 -51452 6187 -45148 -51033 -32329 -53954 16031 49406
3754 49406 -12755 -70680 -19182 -33339 -61112 16610 67106 23148 12147 -68497 -123515 -106996
3742 -106996 -96578 -43918 -31319 30784 79621 85627 -25729 -62252 31965 123440 94684 24382
3730 24382 -107244 -134880 -104856 -19694 18288 5939 -20090 -27517 -38346 -22272 46567 108213
3718 108213 84178 26246 -33994 -960 47343 31946 59600 135144 132887 82913 85853 106597
3706 106597 82049 44789 45280 76380 71082 4829 14981 54587 15936 38018 75392 32525
3694 32525 -53821 -64342 -36701 71878 40180 -40116 -20093 4654 -9742 45774 20366 27259
3682 27259 12909 -71259 -63243 20288 16024 1156 67584 75166 31294 -1584 -33503 -7328
3670 -7328 41581 -6230 -11486 -24830 -56418 -36033 -58873 -41508 -51141 -80243 -146698 -145191 -151579
3657 -151579 -46784 2188 -21737 -35170 -51743 -73747 -47752 -57179 -99270 1648 59415
3646 59415 20379 -9811 30606 94190 61586 -4886 -41727 -17884 -35043 -3591 61670 71643
3634 71643 -2850 -31219 -59753 -102927 -54675 -35263 -45222 -17315 -25315 -12005 -18542 -54076
3622 -54076 8430 17274 5342 -22480 -31782 -29953 2392 10882 8595 1587 -58452 4282 20511
3609 20511 -34778 -101507 -135640 -139634 -111419 -79569 -58429 -42669 -3840 49080 67305 70633
3597 70633 98714 103269 73490 128035 141179 81567 64689 80700 55260 22083 9735 20422
3585 20422 -50477 -41074 26537 57583 10824 -53120 -61170 -12331 -7993 -23924 -52211 -12593
3573 -12593 49893 2535 7625 -24720 -44190 -37483 -51613 17166 32939 55626 11910 -48889
3561 -48889 11811 24637 15919 7773 27684 43001 51754 11821 11897 -11567 -15567 -1413 12249
3548 12249 -63124 -70202 -41938 -42539 -56529 -62694 -21770 -3630 -71573 -50821 -96802 -110997 -65861
3535 -65861 -55348 -120907 -70456 -24261 -39919 -106460 -102988 -88738 -144739 -88885 54662 90606
3523 90606 116288 117225 101581 55361 -7018 30995 5493 19358 9859 -80805 -121184 -97772
3511 -97772 -110338 -148549 -137240 -73629 -52654 -34584 -19396 1436 -15742 -88189 -107520 -50184
3499 -50184 45198 57040 -5211 23693 98051 70087 19507 -21782 -7433 -10370 40135 96909
3487 96909 82949 11851 69054 69882 106801 89866 72476 84184 -22082 -65245 -59423 -5375
3475 -5375 -43358 -59023 -11154 4416 -9624 -71134 -82184 16418 71666 52956 77470 101337
3463 101337 30514 7582 50466 58659 9459 16560 45624 -7435 -67596 -2508 -13387 -35281
3451 -35281 -35911 -88195 -97871 -72703 -54728 2928 57639 29817 -7636 -14722 18374 69971 64436
3438 64436 47821 37511 32958 51011 43710 -52661 -44110 92645 102930 16095 -121348 -140829
3426 -140829 -116085 -80121 17286 2866 27628 53570 64966 40600 25127 -62390 -13993 -14905
3414 -14905 -59814 -61518 -7169 39820 -7666 -49867 -79957 -87404 -72721 -102912 -102576 -67258 -73562
3401 -73562 -83885 -65988 -48496 26133 77588 75877 27511 39488 -10188 -109177 -120840 -52293
3389 -52293 -51866 -33533 -3625 -563 -80859 -91640 -88763 -123920 -109852 -58160 10751 36181 60412
3376 60412 14263 -30232 -7778 9294 54228 97724 65624 120758 115946 71547 124589 68153
3364 68153 19157 51229 14004 -31292 -83758 -157702 -221603 -103733 -2517 -29826 -14983
3353 -14983 48466 91269 101557 127446 119493 67381 33250 -62018 -91927 -109925 -105243 -70972
3341 -70972 -66598 -86647 -35937 -70673 -37391 46015 45050 86822 34150 59914 -19473 -99594
3329 -99594 -109692 -30277 72975 71651 27415 51139 -17185 -62855 -14489 62085 71154 118432
3317 118432 87227 43444 -2045 4699 47328 72550 108421 81534 -30502 -17153 8299 37080
3305 37080 1588 25032 40683 -24611 -9503 25144 22294 70002 52176 -14913 -9606 -11947
3293 -11947 -13322 14032 55305 48532 67240 -12474 -92603 -42837 28197 -49260 -112876 -140007
3281 -140007 -106017 -81827 -89597 -56319 -26947 -28391 8574 62253 67641 107893 45190 -42185
3269 -42185 -38475 12632 -4848 -1338 18360 5467 -32453 -22303 30109 34986 50553 56389 -2375
3256 -2375 -46391 -13284 56634 42240 76964 46096 23831 -31350 6672 43087 55582 -73999
3244 -73999 -149357 -145857 -113094 -19136 -23591 33504 86164 57118 42606 7815 -33252 -16816
3232 -16816 -23095 -32711 61 2927 -10365 -60306 -50322 41649 70049 140457 178363 145850 106980
3219 106980 79928 33514 -24771 -64326 -82897 -48112 -76103 -94502 -75793 -92526 -144782 -112999
3207 -112999 40456 71628 100036 115862 85955 146349 162629 128401 38936 40728 39778 -9887
3195 -9887 92603 142724 71721 -11983 -5721 35468 41006 50457 60422 87297 49842 31213 108842
3182 108842 198474 103545 38655 60387 34432 40703 67884 105506 169326 127007 109565 -17305
3170 -17305 -28740 22022 95359 49299 -24088 59841 61241 67181 93997 138159 102046 55532
3158 55532 35910 70744 144278 128069 71414 57220 22117 -41740 -78276 -32273 -13680 14372
3146 14372 13017 12078 -18958 -81217 -57379 -34137 -73932 -21257 -19008 -50364 -7606 27693 72449
$$ [...]
##END NTUPLES=NMR SPECTRUM
##END=
