##TITLE=Analysis number 307719
Compound Code cc 42114
Book Reference 437/2
Project Code adrs
Chemist Name wendyb
##JCAMPDX= 6.0         $$ Bruker NMR JCAMP-DX V2.0
##DATA TYPE= NMR SPECTRUM
##DATA CLASS= NTUPLES
##ORIGIN= Bruker BioSpin GmbH
##OWNER= NMR
$$ XWIN-NMR		Version 3.5
$$ Wed May 11 09:04:59 2005 GMT Daylight Time (UT+1h)  MAYBRIDGE\NMR@NMR_250MHZ
##.OBSERVE FREQUENCY= 250.131544655141
##.OBSERVE NUCLEUS= ^1H
##.ACQUISITION MODE= SIMULTANEOUS (DQD)
##.ACQUISITION SCHEME= undefined
##.AVERAGES= 16
##.DIGITISER RES= 18
##SPECTROMETER/DATA SYSTEM= dpx250
##.PULSE SEQUENCE= zg30
##.SOLVENT NAME= CDCl3
##.SHIFT REFERENCE= (INTERNAL, CDCl3, 0, 16.522)
##AUDIT TRAIL= $$ (NUMBER, WHEN, WHO, WHERE, WHAT)
$$ ##TITLE= Audit trail, XWIN-NMR		Version 3.5
$$ ##JCAMPDX= 5.01
$$ ##ORIGIN= Bruker BioSpin GmbH
$$ ##OWNER= NMR
$$ C:\u/data/dgb/nmr/ADRS/2800/pdata/1/auditp.txt
$$ ##AUDIT TRAIL=  $$ (NUMBER, WHEN, WHO, WHERE, WHAT)
(   1,<2005-05-11 09:04:40.27 +100>,<MAYBRIDGE\NMR>,<NMR_250MHZ>,
      <created by zg, POWCHK disabled, PULCHK disabled
       configuration hash MD5:
       62 19 C7 07 E1 42 D1 B7 37 6C 3D D0 77 39 F9 E6
       data hash MD5: 64K
       F5 5D D8 C9 F1 EF 0D 9C 69 69 F4 90 2C 7F 11 6C>)
(   2,<2005-05-11 09:04:51.26 +100>,<MAYBRIDGE\NMR>,<NMR_250MHZ>,
      <Start of raw data processing
       ef LB = 0.3 FT_mod = 6 PKNL = 1 SI = 32K 
       data hash MD5: 32K
       CD 1A 36 62 9C 52 21 6F 55 D2 84 83 A0 84 01 76>)
(   3,<2005-05-11 09:04:53.35 +100>,<MAYBRIDGE\NMR>,<NMR_250MHZ>,
      <apk 
       data hash MD5: 32K
       21 76 AB C0 34 9D 7D 66 66 D1 47 F8 F0 64 CF E8>)
(   4,<2005-05-11 09:04:54.10 +100>,<MAYBRIDGE\NMR>,<NMR_250MHZ>,
      <abs ABSG = 5 
       data hash MD5: 32K
       E2 51 91 52 BC AD 8F 89 07 0E 0C F2 E0 F0 20 FD>)
$$ ##END=
$$ 
$$ hash MD5
$$ EA EF 73 0D 1A F4 E0 0E 70 32 7B 4A 19 5B 91 DB
##$RELAX= 
##$RELAX= 
##$RELAX= 
##$RELAX= 
##$RELAX= 
##$RELAX= 
##$RELAX= 
$$ Bruker specific parameters
$$ --------------------------
##$DU= <C:\u>
##$EXPNO= 2800
##$NAME= <ADRS>
##$PROCNO= 1
##$TYPE= <nmr>
##$USER= <dgb>
##$AMP= (0..31)
100 100 100 100 100 100 100 100 100 100 100 100 100 100 100 100 100 100 
100 100 100 100 100 100 100 100 100 100 100 100 100 100 
##$AQSEQ= 0
##$AQ_mod= 3
##$AUNM= <au_zg>
##$AUTOPOS= <3 >
##$BF1= 250.13
##$BF2= 250.13
##$BF3= 250.13
##$BF4= 250.13
##$BF5= 500.13
##$BF6= 500.13
##$BF7= 500.13
##$BF8= 500.13
##$BYTORDA= 1
##$CFDGTYP= 0
##$CFRGTYP= 5
##$CHEMSTR= <none>
##$CNST= (0..31)
1 1 145 1 1 1 1 1 1 1 1 1 1 1 1 1 1 1 1 1 1 1 1 1 1 1 1 1 1 1 1 1 
##$CPDPRG= <>
##$CPDPRG1= <>
##$CPDPRG2= <>
##$CPDPRG3= <>
##$CPDPRG4= <mlev>
##$CPDPRG5= <mlev>
##$CPDPRG6= <mlev>
##$CPDPRG7= <mlev>
##$CPDPRG8= <mlev>
##$CPDPRGB= <>
##$CPDPRGT= <>
##$D= (0..31)
0 1 0 0 0 0 0 0 0 0.06 0 0 0 0 0 0 0.0002 0 0 0 0 0 0 0 0 0 0 0 0 0 0 
0 
##$DATE= 1115798679
##$DBL= (0..7)
120 120 120 120 120 120 120 120 
##$DBP= (0..7)
150 150 150 150 150 150 150 150 
##$DBP07= 0
##$DBPNAM0= <>
##$DBPNAM1= <>
$$ [...]
##$SUBNAM7= <"">
##$SUBNAM8= <"">
##$SUBNAM9= <"">
##$SW= 20.6930455092707
##$SWIBOX= (0..15)
0 0 3 0 0 0 0 0 0 0 0 0 0 0 0 0 
##$SW_h= 5175.983436853
##$TD= 65536
##$TD0= 1
##$TE= 295.16
##$TE2= 300
##$TE3= 300
##$TEG= 300
##$TL= (0..7)
0 120 120 120 120 120 120 120 
##$TP= (0..7)
150 150 150 150 150 150 150 150 
##$TP07= 0
##$TPNAME0= <>
##$TPNAME1= <>
##$TPNAME2= <>
##$TPNAME3= <>
##$TPNAME4= <>
##$TPNAME5= <>
##$TPNAME6= <>
##$TPNAME7= <>
##$TPOAL= (0..7)
0.5 0.5 0.5 0.5 0.5 0.5 0.5 0.5 
##$TPOFFS= (0..7)
0 0 0 0 0 0 0 0 
##$TUNHIN= 0
##$TUNHOUT= 0
##$TUNXOUT= 0
##$USERA1= <user>
##$USERA2= <user>
##$USERA3= <user>
##$USERA4= <user>
##$USERA5= <user>
##$V9= 5
##$VALIST= <valist>
##$VCLIST= <CCCCCCCCCCCCCCC>
##$VD= 0
##$VDLIST= <DDDDDDDDDDDDDDD>
##$VPLIST= <PPPPPPPPPPPPPPP>
##$VTLIST= <TTTTTTTTTTTTTTT>
##$WBST= 1024
##$WBSW= 4
##$XGAIN= (0..3)
0 0 0 0 
##$XL= 0
##$YL= 0
##$YMAX_a= 278481
##$YMIN_a= -436097
##$ZGOPTNS= <>
##$ZL1= 120
##$ZL2= 120
##$ZL3= 120
##$ZL4= 120
##$ABSF1= 16.522
##$ABSF2= -4.171173
##$ABSG= 5
##$ABSL= 3
##$ALPHA= 0
##$AQORDER= 0
##$ASSFAC= 0
##$ASSFACI= 0
##$ASSFACX= 0
##$ASSWID= 0
##$AUNMP= <proc_1d>
##$AZFE= 0.1
##$AZFW= 0.1
##$BCFW= 0
##$BC_mod= 0
##$BYTORDP= 0
##$COROFFS= 0
##$CY= 12.5
##$DATMOD= 1
##$DC= 0
##$DFILT= <>
##$DTYPP= 0
##$F1P= 14.0000005364418
##$F2P= -0.99999901652339
##$FCOR= 0.5
##$FTSIZE= 32768
##$FT_mod= 6
##$GAMMA= 0
##$GB= 0
##$INTBC= 1
##$INTSCL= 1
##$ISEN= 128
##$LB= 0.3
##$LEV0= 0
##$LPBIN= 0
##$MAXI= 10000
##$MC2= 0
##$MEAN= 0
##$ME_mod= 0
##$MI= 0
##$NCOEF= 0
##$NC_proc= -5
##$NLEV= 6
##$NOISF1= 0
##$NOISF2= 0
##$NSP= 0
##$NTH_PI= 0
##$NZP= 0
##$OFFSET= 16.522
##$PC= 1
##$PHC0= -70.7776
##$PHC1= 4.222885
##$PH_mod= 1
##$PKNL= yes
##$PPARMOD= 0
##$PSCAL= 4
##$PSIGN= 0
##$REVERSE= no
##$SF= 250.13
##$SI= 32768
##$SIGF1= 0
##$SIGF2= 0
##$SINO= 400
##$SIOLD= 32768
##$SREGLST= <1H.CDCl3>
##$SSB= 0
##$STSI= 32768
##$STSR= 0
##$SW_p= 5175.98343685301
##$SYMM= 0
##$S_DEV= 0
##$TDeff= 65536
##$TDoff= 0
##$TI= <Analysis number 999999
Compound Code 99
Book Reference 9
Project Code 9>
##$TILT= no
##$TM1= 0
##$TM2= 0
##$TOPLEV= 0
##$USERP1= <user>
##$USERP2= <user>
##$USERP3= <user>
##$USERP4= <user>
##$USERP5= <user>
##$WDW= 1
##$XDIM= 32768
##$YMAX_p= 302173761
##$YMIN_p= -419283
$$ End of Bruker specific parameters
$$ ---------------------------------
##NTUPLES= NMR SPECTRUM
##VAR_NAME=  FREQUENCY,     SPECTRUM/REAL,   SPECTRUM/IMAG
##SYMBOL=    X,             R,               I
##VAR_TYPE=  INDEPENDENT,   DEPENDENT,       DEPENDENT
##VAR_FORM=  AFFN,          ASDF,            ASDF
##VAR_DIM=   32768,         32768,           32768
##UNITS=     HZ,            ARBITRARY UNITS, ARBITRARY UNITS
##FACTOR=    0.157963299565203, 1,           1
##FIRST=     4132.6476996994, 0,             0
##LAST=      -1043.33573715361, 0,           0
##MIN=       -1043.33573715361, -419283,     0
##MAX=       4132.6476996994, 302173761,     0
$$ Real data points
##PAGE= N=1
##DATA TABLE= (X++(R..R)), XYDATA
$$ [...]
$$ plain form
22672 -103711 74042 67093 95399 158231 79962 -29542 -146844 -85636 -18674 -29274 -31439
22661 -31439 29533 76098 -55724 -91310 -205459 -246733 -211941 -155313 -39111 -16042 -136004
22650 -136004 -77734 76459 109429 184449 119615 59951 -2983 67168 112278 118233 109801 153551
22638 153551 171133 151240 29228 25848 37900 4407 -25438 -77666 -127800 -80007 -17663
22627 -17663 -115205 -122739 -134146 -88360 57358 114507 157518 154639 205056 177285 19636 -180742
22615 -180742 -297038 -203694 -118951 -112921 -188766 -182244 -91026 -88759 -113671 -46170 -32898 -133827
22603 -133827 -213651 -295995 -346853 -303876 -294359 -129569 -62704 -57722 -6623 -18516 -47401 -15594
22591 -15594 10660 -61722 -34341 -49237 -19387 -71166 -71445 -11995 -12920 9511 -63327 -155649
$$ packed form
22672a03711J77753o949K8306O2832p8269j09504j17302O1208O6962j0600k165
22661c1439O0972M6565j31822l5586j14149m1274L4792N6628J16202K3069j19962
22650a36004N8270J54193L2970P5020o4834n9664o2934P0151M5110N955q432M3750
22638A53551J7582j9893j22012l380J2052l3493k9845n2228n0134M7793O2344
22627a7663r7542p534j1407M5786J45718N7149M3011k879N0417k7771j57649k00378
22615a80742j16296R3344Q4743O030p5845O522R1218K267k4912O7501J3272j00929
22603a33827p9824q2344n0858M2977R517J64790O6865M982N1099j1893k8885L1807
22591a5594K6254p2382K7381j4896K9850n1779k79N9450r25K2431p2838r2322
$$ plain form
22579 -155649 -1270 60316 79433 -4034 -78981 -24157 33676 -31774 -19940 38307 102689
22568 102689 54833 32073 4541 97566 155297 224429 181511 137140 98539 147748 221509
22557 221509 225141 112722 88223 -78911 -71718 37243 28626 37021 44349 -8245 -9406 -120797
22545 -120797 -193724 -66659 -33538 -120890 -169355 -254869 -334544 -372208 -329097 -291326 -229077
22534 -229077 -285650 -294969 -212254 -93918 -43911 -72137 -53473 -227909 -173927 -188677 -187290
22523 -187290 -174432 -85588 -4685 -36876 -8906 108433 83120 -56448 -216896 -162696 -6795
22512 -6795 28581 15684 -24613 -120187 -292008 -290618 -210333 -110775 -84848 51553 28878 11185
22500 11185 -5567 -14754 -54655 -52623 -20624 -31961 -68491 -61419 -35346 48886 40183 -6878
$$ packed form
22579a55649J54379O1586J9117q3467p4947N4824N7833o5450J1834N8247O4382
22568A02689m7856k2760k7532R3025N7731O9132m2918m4371l8601M9209P3761
22557B21509L632j12419k4499j67134P193J08961q617Q395P328n2594j161j11391
22545a20797p2927J27065L3121q7352m8465q5514p9675l7664M3111L7771O2249
22534b29077n6573r319Q2715J18336N0007k8226J8664j74436N3982j4750J387
22523a87290J2858Q8844Q0903l2191K7970J17339k5313j39568j60448N4200J55901
22512f795L5376j2897m0297r5574j71821J390Q0285R9558K5927J36401k2675j7693
22500A1185j6752r187l9901K032L1999j1337l6530P072K6073Q4232q703m7061
$$ plain form
22488 -6878 -129867 -113095 -9143 -13924 -5914 99975 239781 198620 39504 8076 9467
22477 9467 77941 167168 190148 236273 312574 264246 115298 69993 -15341 -18164 18607 139380
22465 139380 69282 100781 16761 -27672 9177 97349 102360 -58017 -75180 -8786 76592
22454 76592 65186 22148 -48182 -42449 -124304 -136694 -140648 -141124 -77893 -148623 -197919 -237563
22442 -237563 -120238 -3983 -31399 -135573 -120189 -62873 34916 59210 35584 50671 92967
22431 92967 178275 149311 23178 -30177 -47903 -81716 -95375 -65221 -97051 -142981 -70390
22420 -70390 -159134 -166965 -157115 -241477 -179925 -104026 -203309 -190892 -93406 30821 105689 82947
22408 82947 -37991 -93292 -124891 -13379 -55074 -53536 22338 -66731 -75744 -757 97755 119693
$$ packed form
22488f878j22989J6772J03952m781Q010J05889J39806m1161j59116l1428J391
22477I467O8474Q9227K2980M6125P6301m8328j48948m5305q5334k823L6771J20773
22465A39380p0098L1499q4020m4433L6849Q8172N011j60377j7163O6394Q5378
22454G6592j1406m3038p0330N733q1855j2390l954m76O3231p0730m9296l9644
22442b37563J17325J16255k7416j04174J5384N7316R7789K4294k3626J5087M2296
22431I2967Q5308k8964j26133n3355j7726l3813j3659L0154l1830m5930P2591
22420g0390q8744p831R850q4362O1552P5899r9283J2417R7486J24227P4868k2742
22408H2947j20938n5301l1599J11512m1695J538P5874q9069r013P4987R8512K1938
$$ plain form
22396 119693 175720 158002 -41245 -154294 -248589 -235848 -80593 119543 188027 70163
22386 70163 -60953 2901 142485 211910 163538 111968 56027 42426 48554 23085 69555
22375 69555 28182 -86748 -99107 -154105 -105404 -84790 -57644 27903 50922 65087 26974
22364 26974 41145 52843 122566 88579 -5014 -125694 -303291 -227196 -211777 -69580 -40924
22353 -40924 -156084 -183237 -125658 -12046 15866 -29685 3908 23745 -15054 23797 81549
22342 81549 -12 -12598 -38177 -43489 -1910 462 -71688 -63392 22490 30498 131957 185215
22330 185215 280623 173848 5076 -169577 -164269 -151991 -98606 -72212 4993 102963 101000
22319 101000 172771 142583 74238 85807 196556 273199 162270 -15719 -100963 -47711 114842
$$ packed form
22396A19693N6027j7718j99247j13049r4295J2741J55255K00136O8484j17864
22386G0163j31116O3854J39584O9425m8372n1570n5941j3601O128k5469M6470
22375F9555m1373j14930j2359n4998M8701K0614K7146Q5547K3019J4165l8113
22364B6974J4171J1698O9723l3987r3593j20680j77597P6095J5419J42197K8656
22353d0924j15160k7153N7579J13612K7912m5551L3593J9837l8799L8851N7752
22342H1549q1561j2586k5579n312M1579K372p2150Q296Q5882Q008J01459N3258
22330A85215R5408j06775j68772j74653N308J2278N3385K6394P7205R7970j963
22319A01000P1771l0188o8345J1569J10749P6643j10929j77989q5244N3252J62553
$$ plain form
22308 114842 136487 151629 115233 73551 62913 117592 -29585 -86938 -97849 -49226 50309
22297 50309 -47568 -37681 32334 -50121 -121133 -25013 100017 137364 -27057 -152062 -114382
22286 -114382 -85726 -42102 78264 32173 -66247 -100351 -31119 -2102 7629 118624 147024
22275 147024 79769 25843 -65537 -113149 -129510 -80845 -39373 -17967 29693 75561 53436
22264 53436 87087 53107 -94574 -31811 50686 170475 287077 158687 -13170 -76757 -223990
22253 -223990 -143167 -16056 -22785 -6653 122522 82707 48941 125221 216198 105134 75905
22242 75905 58495 5921 -7754 -29380 -62968 -100091 -260182 -252584 -208379 -48442 114453
22231 114453 15591 54995 187660 99871 48360 23346 96443 -13229 -117844 -130392 -83104
$$ packed form
22308A14842K1645J5142l6396m1682j0638N4679j47177n7353j0911M8623R9535
22297E0309r7877R887P0015q2455p1012R6120J25030L7347j64421j25005L7680
22286a14382K8656M3624J20366m6091r8420l4104O9232K9017R731J10995K8400
22275A47024o7255n3926r1380m7612j6361M8665M1472K1406M7660M5868k2125
22264E3436L3651l3980j47681O2763Q2497J19789J16602j28390j71857o3587j47233
22253b23990Q0823J27111o729J6132J29175l9815l3766P6280R0977j11064k9229
22242G5905j7410n2574j3675k1626l3588l7123j60091P598M4205J59937J62895
22231A14453r8862L9404J32665q7789n1511k5014P3097j09672j04615j2548M7288
$$ plain form
22220 -83104 -92967 -17585 93163 70204 27254 -127397 -90192 -46133 77888 55413 -46992
22209 -46992 -55040 -84790 -151230 -52213 80683 109171 -313 -530 -20330 -52300 -93088 -112059
22197 -112059 -40318 -43843 -44660 110873 117459 87128 45986 -36454 -44927 -111319 -142467 -18619
22185 -18619 116088 108942 174950 192870 86662 -38987 -155053 -80063 -11263 -113485 -19967
22174 -19967 22693 21977 -56553 28874 54231 31068 26610 64012 8338 -64383 -30335 -109635
22162 -109635 -165850 -133986 -142748 -179382 -226679 -206214 -127672 -143636 -109593 -96024 -113046 -58329
22150 -58329 -55659 -36070 -1866 9731 78162 8259 -42801 -52521 966 -20887 -53964 -66913
22138 -66913 23194 38488 -123217 -286210 -239508 -160725 -248425 -271775 -289644 -253330 -208742
$$ packed form
22220h3104r863P5382J10748k2959m2950j54651L7205M4059J24021k2475j02405
22209d6992q048k9750o6440R9017J32896K8488j09484k17j9800l1970m0788j8971
22197a12059P1741l525q17J55533O586l0331m1142q2440q473o6392l1148J23848
22185a8619J34707p146O6008J7920j06208j25649j16066P4990O8800j02222R3518
22174a9967M2660p16p8530Q5427K5357k3163m458L7402n5674p2721L4048p9300
22162a09635n6215L1864q762l6634m7297K0465P8542j5964L4043J3569j7022N4717
22150e8329K670J9589L4204J1597O8431o9903n1060r720N3487k1853l3077j2949
22138f6913R0107J5294j61705j62993M6702P8783q7700k3350j7869L6314M4588
$$ plain form
22127 -208742 -106893 -70845 -59208 74491 176957 41418 -20938 -77488 -89792 69599
22117 69599 94834 70525 118211 44183 136352 217255 198453 152638 23407 -56336 -95812
22106 -95812 -15173 8704 -32202 -160211 -243957 -351558 -335733 -331215 -243012 -153273 -248259
22095 -248259 -221163 -111500 -154863 -122766 -41444 49319 105954 162732 83440 -8216 7693
22084 7693 118781 100872 59861 101261 189956 155081 48193 -62811 -28680 54555 22442
22073 22442 146154 103448 -26415 -4369 78698 17761 36258 39508 76774 83207 98828 50372
22061 50372 42219 43058 -9823 -71632 -81651 -45053 -105441 -192062 -215808 -168069 -44845 -64251
22049 -64251 -4296 -9433 -925 21583 40365 42946 -34280 -97605 -17607 -6618 85616 175855
$$ packed form
22127b08742J01849L6048J1637J33699J02466j35539o2356n6550j2304J59391
22117F9599K5235k4309M7686p4028R2169Q0903j8802m5815j29231p9743l9476
22106i5812Q0639K3877m0906j28009q3746j07601J5825M518Q8203Q9739r4986
22095b48259K7096J09663m3363L2097Q1322R0763N6635N6778p9292r1656J5909
22084G693J11088j7909m1011M1400Q8695l4875j06888j11004L4131Q3235l2113
22073B2442J23712m2706j29863K2046Q3067o0937J8497L250L7266O433J5621m8456
22061E0372q153Q39n2881o1809j0019L6598o0388q6621k3746M7739J23224j9406
22049f4251N9955n137Q508K2508J8782K581p7226o3325P9998J0989R2234R0239
$$ plain form
22037 175855 137791 193372 138838 77532 49106 28084 39652 2874 -141529 -217818 -86571
22026 -86571 -80112 -117704 -169801 -142887 7560 -23952 -137638 -144457 -71260 -67152 -13216 -47781
22014 -47781 -171625 -172887 -143389 -124973 -96663 14079 99077 114149 6187 -96124 -139610
22003 -139610 -163164 -209574 -102641 28970 180700 195931 84426 95961 -44848 -166326
21993 -166326 -158994 -136660 -141291 -99976 19136 11366 11128 88825 122447 81648 -96805 -243977
21981 -243977 -242862 -150841 -70 -33951 -115729 -160168 -204016 -152682 -216195 -176062 -115346
21970 -115346 -225650 -207612 -230530 -199080 -9908 97386 31079 20487 129971 134202 178303
21959 178303 83665 36327 60816 14378 -49125 -104218 -116124 -89191 -88132 -109937 -75267 5441
$$ packed form
22037A75855l8064N5581n4534o1306k8426k1022J1568l6778j44403p6289J31247
22026h6571O459l7592n2097K6914J50447l1512j13686o819P3197M108N3936l4565
22014d7781j23844j262K9498J8416K8310J10742Q4998J5072j07962j02311m3486
22003a39610k3554m6410J06933J31611J51730J5231j11505J1535j40809j21478
21993a66326P332K2334m631M1315J19112p770k38P7697L3622m0799j78453j47172
21981b43977J115R2021J50771l3881q1778m4439m3848N1334o3513M0133O0716
21970a15346j10304J8038k2918L1450J89172J07294o6307j0592J09484M231M4101
21959A78303r4638m7338K4489m6438o3503n5093j1906K6933J059k1805L4670Q0708
$$ plain form
21947 5441 -12896 55935 134014 29360 -2472 128298 171214 102887 133635 110717 -47783
21936 -47783 -177293 -45995 121774 49805 -58300 -121234 -208938 -194101 -156874 -228774 -149519
21925 -149519 -59166 -2688 -82874 -44252 -4064 25827 -51567 -42518 -127660 -99589 -174303 -175837
21913 -175837 -144637 -267500 -199339 -92196 21151 -5253 107354 -60959 -145842 -104746
21903 -104746 -170743 -214055 -69677 -42268 -100642 -214021 -254925 -47989 24760 75943 144083
21892 144083 17795 -48127 119044 217238 132233 109696 4200 40891 45516 -67812 -34043
21881 -34043 -70609 -190463 -212729 -157738 -76037 143776 238747 283660 228840 242804 76941
21870 76941 -10619 26695 61784 13104 24774 124807 227083 120714 21660 139235 158185
$$ packed form
21947E441j8337O8831P8079j04654l1832J30770M2916o8327L0748k2918j58500
21936d7783j29510J31298J67769p1969j08105o2934q7704J4837L7227p1900P9255
21925a49519R0353N6478q0186L8622M0188K9891p7394R049q5142K8071p4714j534
21913a75837L1200j22863O8161J07143J13347k6404J12607j68313q4883M1096
21903a04746o5997m3312J44378K7409n8374j13379m0904K06936P2749N1183O8140
21892A44083j26288o5922J67171R8194q5005k2537j05496L6691M625j13328L3769
21881c4043l6566j19854k2266N4991Q1701K19813R4971M4913n4820J3964j65863
21870G6941q7560L7314L5089m8680J1670J00033J02276j06369r9054J17575J8950
$$ plain form
21859 158185 115817 -123071 -220392 -221889 -181094 -135772 -165324 -216709 -182778 -158136 -188340
21848 -188340 -36210 7286 -173332 -193933 -37890 21665 24867 -113895 -159905 -49822 -59188
21837 -59188 -229181 -230878 -176832 -56366 -93212 -79114 -6601 2533 -104194 -111235 -115044 -174911
21825 -174911 -154332 -86315 -39441 42852 89318 88890 177263 163183 11677 74593 17491 88763
21813 88763 60023 -190 18542 -80183 -148828 -223435 -206094 -59710 80207 85012 51897
21802 51897 -29835 -129220 -126004 -141059 -62122 102512 157468 49590 81700 35914 -54993
21791 -54993 -181833 -209400 -128661 -9159 23898 -28621 -94248 -94407 -75681 -61992 36868 66304
21779 66304 9520 -48938 2087 11224 -35217 18805 -5344 -43017 -113229 -107745 43556 139785
$$ packed form
21859A58185m2368k38888r7321j497M0795M5322k9552n1385L3931K4642l0204
21848a88340J52130M3496j80618k0601J56043N9555L202j38762m6010J10083r366
21837e9188j69993j697N4046J20466l6846J4098P2513R134j06727p041l809n9867
21825a74911K0579O8017M6874Q2293M6466m28Q8373j4080j51506O2916n7102P1272
21813H8763k8740o0213J8732r8725o8645p4607J7341J46384J39917M805l3115
21802E1897q1732r9385L216j5055P8937J64634N4956j07878L2110m5786r0907
21791e4993j26840k7567Q0739J19502L3057n2519o5627j59J8726J3689R8860K9436
21779F6304n6784n8458N1025R137m6441N4022k4149l7673p0212N484J51301R6229
$$ plain form
21767 139785 89095 -97503 -244248 -144521 -5169 118198 157504 120570 50299 -44699 8119
21756 8119 5879 -57436 -33524 81109 32960 -90630 84868 73364 -90093 -15354 39893
21745 39893 20676 -24048 -54103 -50706 94709 89125 129685 53634 -91702 -21323 16611 -63576
21733 -63576 -26524 -89218 -99030 18830 71478 142081 125521 202456 227480 235467 250031 150382
21721 150382 -7461 -20629 -15325 46876 49199 69781 69804 93574 -31235 -100453 -137914 -130167
21709 -130167 -197430 -197619 -146326 -75000 -10713 -18559 51829 203973 213528 250618 321726 176803
21697 176803 34056 -53461 24142 110786 17039 8357 105628 64764 83040 85595 42994 -118521
21685 -118521 -166669 -120248 -114644 -165046 -115782 -130319 -155180 -1045 144363 208055 154489
$$ packed form
21767A39785n0690j86598j46745R9727J39352J23367L9306l6934p0271r4998N2818
21756H119k240o3315K3912J14633m8149j23590J75498j1504j63457P4739N5247
21745C9893j9217m4724l0055L397J45415n584M0560p6051j45336P0379L7934q0187
21733f3576L7052o2694r812J17860N2648P0603j6560P6935K5024P987J4564r9649
21721A50382j57843j3168N304O2201K323K0582K3K3770j24809o9218l7461P747
21709a30167o7263j89N1293P1326O4287p846P0388J52144R555L7090P1108j44923
21697A76803j42747q7517P7603Q6644r3747q682R7271m0864J8276K555m2601j61515
21685a18521m8148M6421N604n0402M9264j4537k4861J54135J45408O3692n3566
$$ plain form
21674 154489 127462 46179 14321 105597 121503 23264 -110732 -117642 -124953 -77670 -33297 53709
21662 53709 -12920 -94102 -184035 -164543 -59894 -59088 -96916 26875 67273 83363 36729 -44810
21650 -44810 -90231 -46168 17565 90717 13751 -108209 -229023 -221601 -282078 -217926 -112392
21639 -112392 -163359 -182259 -178376 -40838 26719 104184 73225 97390 76995 105510 24887
21628 24887 58804 161448 143619 42219 68165 44406 -50758 -21383 2722 -56573 -160406
21617 -160406 -162234 -40506 12258 -54609 4554 65572 36900 16116 -82142 -154916 -192171
21606 -192171 -168059 -222247 -70707 -53871 -167493 -158578 -230196 -314207 -205629 -67805 22701
21595 22701 169289 143905 34115 40477 56352 6420 37676 69133 132909 132044 104157 95648
$$ packed form
21674A54489k7027q1283l1858R1276J5906r8239j33996o910p311M7283M4373Q7006
21662E3709o6629q1182q9933J9492J04649Q06l7828J23791M0398J6090m6634q1539
21650d4810m5421M4063O3733P3152p6966j21960j20814P422o0477O4152J05534
21639a12392n0967j8900L883J37538O7557P7465l0959K4165k0395K8515q0623
21628B4887L3917J02644j7829j01400K5946k3759r5164K9375K4105n9295j03833
21617a60406j828J21728N2764o6867N9163O1018k8672k0784r8258p2774l7255
21606a92171K4112n4188J51540J6836j13622Q915p1618q4011J08578J37824R0506
21595B2701J46588k5384j09790O362J5875m9932L1256L1457O3776q65k7887q509
$$ plain form
21583 95648 104361 30206 -74969 -44886 -21617 62368 22659 -21094 60212 -132215 -128388 -20449
21571 -20449 115426 71898 7353 -63153 -2525 73237 72451 -15864 -38798 -51401 -44982 -32561
21559 -32561 -87975 -80361 -69550 -63568 -17808 3265 37618 22679 -3862 -57733 25638 9134
21547 9134 49164 144662 2629 -93717 -50305 -80028 -13296 -25958 -30334 51241 57245 50075
21535 50075 62290 27586 -124852 -139007 -154228 -150618 -73366 9946 185753 300091 74220
21524 74220 -51382 -38417 -86950 -126795 -151618 -181909 -88205 -124613 9432 50397 -37178
21513 -37178 51067 103796 59005 2966 21826 58914 105940 218574 242749 102861 -49917
21502 -49917 -46735 -56195 -31530 -39775 -67789 -142742 -260206 -202378 -220667 -159345 -192794 -236368
$$ packed form
21583I5648Q713p4155j05175L0083K3269Q3985l9709m3753Q1306j92427L827J07939
21571b0449J35875m3528o4545p0506O0628P5762p86q8315k2934j2603O419J2421
21559c2561n5414P614J0811N982M5760K1073L4353j4939k6541n3871Q3371j6504
21547I134M0030R5498j42033r6346M3412k9723O6732j2662m376Q1575O004p170
21535E0075J2215l4704j52438j4155j5221L610P7252Q3312J75807J14338k25871
21524G4220j25602J2965m8533l9845k4823l0291R3704l6408J34045M0965q7575
21513c7178Q8245N2729m4791n6039J8860L7088M7026J12634K4175j39888j52778
21502d9917L182r460K4665q245k8014p4953j17464N7828j8289O1322l3449m3574
$$ plain form
21490 -236368 -207060 -164327 -130858 -142318 -93576 -44646 -123497 -123548 -5131 260059 303092 154056
21478 154056 83955 -90451 -195886 -271763 -229715 -211100 -112246 -63405 -95027 -203470 -182713
21467 -182713 -100816 -95258 -45229 3523 57462 105053 -60224 -181769 -153339 -117645 -28233
21456 -28233 27491 71311 -3483 -155556 -45367 60390 19316 -100712 -137102 -97719 -115448
21445 -115448 -6717 32113 -8189 -27021 -136824 -192550 -118907 -39874 -19469 40697 54923
21434 54923 44261 107544 73698 102383 56650 -35184 -78625 -54535 -30818 -51012 -182182
21423 -182182 -260834 -327550 -308663 -271595 -200331 -173660 -125629 -72763 76758 54736 22391
21412 22391 -78941 -167090 -136558 -223457 -196414 -131705 38783 50107 24323 -14063 6621
$$ packed form
21490b36368K9308M2733L3469j1460M8742M8930p8851n1J18417K65190M3033j49036
21478A54056p0101j74406j05435p5877M2048J8615R8854M8841l1622j08443K0757
21467a82713Q1897N558N0029M8752N3939M7591j65277j21545K8430L5694Q9412
21456b8233N5724M3820p4794j52073J10189J05757m1074j20028l6390L9383j7729
21445a15448J08731L8830m0302j8832j09803n5726P3643P9033K0405O0166J4226
21434E4923j0662O3283l3846K8685m5733r1834m3441K4090K3717k0194j31170
21423a82182p8652o6716J8887L7068P1264K6671M8031N2866J49521k2022l2345
21412B2391j01332q8149L0532q6899K7043O4709J70488J1324k5784l8386K0684
$$ plain form
21401 6621 51617 92200 168591 105486 55435 9195 22169 -60072 -96961 -95592 155532 179540
21389 179540 4484 -150466 -202473 -197184 -179236 -85597 -51891 -41135 -40334 -94810 10504
21378 10504 122271 243018 193668 205801 103151 49841 55351 18305 13787 119962 180961
21367 180961 179754 159617 74659 35588 54954 82254 -21917 -75648 -83661 -72735 -24145 12011
21355 12011 -46462 11757 8000 -67208 -88452 -35890 27791 -72914 -70361 -67100 54709 77134
21343 77134 -47947 -75351 -93310 -18057 -2880 -53262 -7004 16964 53444 46358 -97115
21332 -97115 -89598 -10329 -43434 -9448 -100561 -208802 -253059 -236521 -284988 -335076 -300672 -310284
21320 -310284 -197352 -91859 -123390 -111756 15372 -43113 -137524 -120577 -159045 -198944 -250471
$$ packed form
21401F621M4996M0583P6391o3105n0051m6240J2974q2241l6889J369K51124K4008
21389A79540j75056j54950n2007N289J7948R3639L3706J0756Q01n4476J05314
21378A0504J11767J20747m9350J2133j02650n3310N510l7046m518J06175O0999
21367A80961j207k0137q4958l9071J9366K7300j04171n3731q013J0926M8590L6156
21355A2011n8473N8219l757p5208k1244N2562O3681j00705K553L261J21809K2425
21343G7134j25081k7404j7959P5253J5177n0382M6258K3968L6480p086j43473
21332i7115P517P9269l3105L3986r1113j08241m4257J6538m8467n0088L4404r612
21320c10284J12932J05493l1531J1634J27128n8485r4411J6947l8468l9899n1527
$$ plain form
21309 -250471 -136454 -54285 36048 86492 26462 -34739 -108197 -101537 -87217 -51249 -57998 -37574
21297 -37574 13367 28426 -80337 -92401 -180587 -146386 -93412 -74492 -2666 55147 85337
21286 85337 12495 -23500 -5339 -97221 -209046 -173201 -114965 4239 66211 91233 224811
21275 224811 237364 226281 66223 -59255 -184486 -219236 -28559 -44662 -57471 -63524 -100865
21264 -100865 -238246 -255413 -121247 -19639 -112958 -104180 36154 30676 -47861 -67381 46100
21253 46100 64339 9216 -4021 34817 73521 20317 88848 126583 122248 61130 36898 150814
21241 150814 245998 123897 171036 253119 155701 79947 100998 95364 21406 -63379 -1255
21230 -1255 21859 39924 15314 49332 70539 -20456 -47657 -137104 -60371 64872 151054 192104
$$ packed form
21309b50471J14017Q2169R0333N0444o0030o1201p3458O660J4320L5968o749K0424
21297c7574N0941J5059j08763j2064q8186L4201N2974J8920P1826N7813L0190
21286H5337p2842l5995J8161r1882j11825L5845N8236J19204O1972K5022J33578
21275B24811J2553j1083j60058j25478j25231l4750J90677j6103j2809o053l7341
21264a00865j37381j7167J34166J01608r3319Q778J40334n478p8537j9520J13481
21253D6100J8239n5123j3237L8838L8704n3204O8531L7735m335o1118k4232J13916
21241A50814R5184j22101M7139Q2083r7418p5754K1051n634p3958q4785O2124
21230a255K3114J8065k4610L4018K1207r0995k7201q9447P6733J25243Q6182M1050
$$ plain form
21218 192104 231211 204602 120284 69866 -69561 -17334 43025 7783 -22869 63995 27885
21207 27885 18382 123924 143625 99064 61483 4851 78559 90932 32311 210663 290533
21196 290533 218872 104168 -50300 -138811 -151753 -89345 -52249 17424 13551 7468 3334 23806
21184 23806 -8591 -25345 11662 18150 105301 60766 98085 84161 -31740 -126429 -6009
21173 -6009 58164 43986 65178 -25074 -138535 -100302 -36863 -2514 -34889 -58510 -104364 -103049
21161 -103049 -36227 -1328 131080 213473 149787 99661 -21851 -49990 -77599 -115667 -52275
21150 -52275 13378 31232 41704 174343 164734 38411 19765 48217 81915 29148 -30941
21139 -30941 -69581 -98673 -73952 -201181 -96952 18029 36587 25729 117051 103690 87615
$$ packed form
21218A92104L9107k6609q4318n0418j39427N2227O0359l5242l0652Q6864l6110
21207B7885r503J05542J9701m4561l7581n6632P3708J2373n8621J78352P9870
21196B90533p1661j14704j54468q8511j2942O2408L7096O9673l873o083m134K0472
21184B3806l2397j6754L7007O488Q7151m4535L7319j3924j15901r4689J20420
21173f009O4173j4178K1192r0252j13461L8233O3439L4349l2375k3621m5854J315
21161a03049O6822L4899J32408Q2393o3686n0126j21512k8139k7609l8068O3392
21150e2275O5653J7854J0472J32639r609j26323j8646K8452L3698n2767o0089
21139c0941l8640k9092K4721j27229J04229J14981J8558j0858R1322j3361j6075
$$ plain form
21128 87615 70899 44009 40174 30531 63093 7552 39003 111193 93768 -55682 -136187 -89292
21116 -89292 -12658 -28625 -13993 4887 -2172 -24632 -35697 21645 16739 -21464 -53799 -76555
21104 -76555 -64098 48373 95915 132234 126383 104105 60787 74814 80185 1704 -68725 -22432
21092 -22432 -37597 -54421 5753 2289 5866 -12444 55819 66638 107985 45446 10351 35894
21080 35894 -72445 -59116 -25259 -116975 -215904 -241508 -124644 -127795 -118012 -2441 -67093
21069 -67093 -78084 76522 28467 91573 68013 23191 -10189 106575 151591 144596 108141
21058 108141 102009 70864 113478 91507 50714 -79403 2092 139116 143752 212581 231739
21047 231739 217132 139740 58655 -23854 7194 129219 35916 -62242 -86474 -161069 -134551
$$ packed form
21128H7615j6716k6890l835r643L2562n5541L1451P2190j7425j49450q0505M6895
21116h9292P6634j5967J4632J8880p059k2460j1065N7342m906l8203l2335k2756
21104g6555J2457J12471M7542L6319n851k2278m3318J4027N371p8481p0429M6293
21092b2432j5165j6824O0174l464L577j8310O8263J0819M1347o2539l5095K5543
21080C5894j08339J3329L3857r1716r8929k5604J16864l151R783J15571o4652
21069f7093j0991J54606m8055O3106k3560m4822l3380J16764M5016o995l6455
21058A08141o132l1145M2614k1971m0793j30117Q1495J37024M636O8829J9158
21047B31739j4607p7392q1085q2509L1048J22025r3303r8158k4232p4595K6518
$$ plain form
21036 -134551 -109867 -128979 -156272 -198045 -227215 -90969 -29625 31441 3610 -170068 -225969
21025 -225969 -151102 -89182 -90405 -44212 79266 55999 81526 4659 -97555 -75853 52739
21014 52739 51517 -22692 -22886 84626 117779 -27554 433 103821 63192 -48353 -80469
21003 -80469 -97209 -101539 -105032 -79517 -113020 -90227 14822 -8630 -98957 -60723 12544 2759
20991 2759 -63386 -45991 -72284 -227562 -364761 -215469 -55934 -40908 11554 21340 28067
20980 28067 87055 10821 1879 -120039 -174677 -285583 -347350 -292901 -223110 -205991 -169516
20969 -169516 -171684 -85570 7039 -71885 -68063 -31588 -134795 -84097 -58299 -35580 -158466
20958 -158466 -46944 -74873 -38327 21568 12601 7852 -13008 -152364 -305405 -277905 -276911 -290494
$$ packed form
21036a34551K4684j9112k7293m1773k9170J36246O1344O1066k7831j73678n5901
21025b25969P4867O1920j223M6193J23478k3267K5527p6867j02214K1702J28592
21014E2739j222p4209j94J07512L3153j45333K7987J03388m0629j11545l2116
21003h0469j6740m330l493K5515l3503K2793J05049k3452r0327L8234P3267r785
20991B759o6145J7395k6293j55278j37199J49292J59535J5026N2462R786O727
20980B8067N8988p6234q942j21918n4638j10906o1767N4449O9791J7119L6475
20969a69516k168Q6114R2609p8924L822L6475j03207N0698K5798K2719j22886
20958a58466J11522k7929L6546N9895q967m749k0860j39356j53041K7500R94j3583
$$ plain form
20946 -290494 -251775 -77452 -35375 -47335 -78558 -221094 -281531 -327115 -340600 -324903 -233027
20935 -233027 -154864 -95377 -18092 -46272 -4278 -31865 -120039 -77442 -33318 143296 93758
20924 93758 1883 39332 56532 79517 -15424 -63236 -40462 48041 60504 -16394 -70260 -36008
20912 -36008 -119603 -78494 -45210 -142987 -186174 -168731 -154107 -220533 -278228 -167667 -111897
20901 -111897 20204 -44200 -79013 2790 59118 49870 -83536 -6927 -48955 -58890 -95896
20890 -95896 -154401 -108596 -83827 -11739 121142 98920 24583 77542 -40507 -156692 -81372
20879 -81372 14884 46256 -30064 -4654 -12934 -77429 -57716 -64364 -82329 -82378 -69311 -5834 4721
20866 4721 -116573 -185047 -256446 -202656 -124160 -217147 -145387 -141261 -318330 -345029 -318650 -202958
$$ packed form
20946b90494L8719J74323M2077j1960l1223j42536o0437m5584j3485J5697R1876
20935b33027P8163N9487P7285k8180M1994k7587q8174M2597M4124J76614m9538
20924I3758r1875L7449J7200K2985r4941m7812K2774Q8503J2463p6898n3866L4252
20912c6008q3595M1109L3284r7777m3187J7443J4624o6426n7695J10561N5770
20901a11897J32101o4404l4813Q1803N6328r248j33406P6609m2028r935l7006
20890i5896n8505M5805K4769P2088J32881k2222p4337N2959j18049j16185P5320
20879h1372R6256L1372p6320K5410q280o4495J9713o648j7965m9J3067O3477J0555
20866D721j21294o8474p1399N3790P8496r2987P1760M126j77069k6699K6379J15692
$$ plain form
20854 -202958 -248298 -231351 -199247 -171654 -88685 67212 39601 -34485 -55413 -40180 15310
20843 15310 80792 13227 46278 -103915 -137968 -84511 7305 157954 183287 76535 38041
20832 38041 102164 98045 69238 103038 93981 187494 167109 15050 -26377 -16201 18689 -192098
20820 -192098 -199532 -139764 -95244 32669 66303 45948 38331 23228 -20431 -29857 -153430 -166950
20808 -166950 -117110 -49620 -52718 -76188 -120512 -141845 -239549 -260637 -134057 -66792 -109458
20797 -109458 -140244 -127374 -97977 -93102 -51507 -138634 -199648 -227320 -224810 -192907 -85704 18273
20785 18273 -79595 1292 162741 131510 70494 -8325 -2577 -19505 8036 88741 187408 100623
20773 100623 -49545 -16592 38243 27279 36635 203039 306679 213743 118308 180238 63390
$$ packed form
20854b02958m5340J6947L2104K7593Q2969J55897k7611p4086k0928J5233N5490
20843A5310O5482o7565L3051j50193l4053N3457R1816J50649K5333j06752l8494
20832C8041O4123m119k8807L3800r057R3513k0385j52059m1427J0176L4890k10787
20820a92098p434N9768M4520J27913L3634k0355p617j5103m3659r426j23573j3520
20808a66950M9840O7490l098k3470m4324k1333r7704k1088J26580O7265m2666
20797a09458l0786J2870K9397M875M1595q7127o1014k7672K510L1903J07203J03977
20785A8273r7868Q0887J61449l1231o1016p8819N748j6928K7541Q0705R8667q6785
20773A00623j50168L2953N4835j0964R356J66404J03640r2936r5435O1930j16848
$$ plain form
20762 63390 -23940 98215 75760 6988 -37275 -142945 -21688 104619 155400 32873 41014
20751 41014 17084 -41590 52159 33567 35231 57426 27220 -8615 -12038 7837 -25992 -49238
20739 -49238 -85565 -41816 -73235 -66133 -244619 -323176 -199031 -189539 -196918 -155151 -267724 -226001
20727 -226001 -194600 -261632 -217271 -180012 -86970 -27488 -60455 -162378 -304510 -230054 -152132
20716 -152132 -165181 -128126 -253440 -230729 -42449 97846 47868 26351 40005 43122 15746
20705 15746 29107 -63823 -116200 -133192 -42160 -17970 -40797 -92983 -63329 -58205 -118175 -225931
20693 -225931 -257542 -250646 -182760 -151949 -125453 -20423 -12584 -34641 -62211 -106506 -85745 -40949
20681 -40949 107464 83169 82711 134965 109378 43113 56210 86529 54510 70949 75883 73087
$$ packed form
20762F3390q7330J22155k2455o8772m4263j05670J21257J26307N0781j22527Q141
20751D1014k3930n8674R3749j8592J664K2195l0206l5835l423J9875l3829k3246
20739d9238l6327M3749l1419P102j78486p8557J24145R492p379M1767j12573M1723
20727b26001L1401o7032M4361L7259R3042N9482l2967j01923j42132P4456P7922
20716a52132j3049L7055j25314K2711J88280J40295m9978k1517J3654L117k7376
20705A5746J3361r2930n2377j6992R1032K4190k2827n2186K9654N124n9970j07756
20693b25931l1611O896O7886L0811K6496J05030P839k2057k7570m4295K0761M4796
20681d0949J48413k4295m58N2254k5587o6265J3097L0319l2019J6439M934k796
$$ plain form
20669 73087 10124 -60831 -59861 -12060 5370 -2027 -37559 -111376 -150466 -96069 -26935 -40469
20657 -40469 -115555 -146282 -113024 -47511 -77599 -186917 -259581 -138168 -78710 -82555 10217
20646 10217 -52470 -157212 -143399 -151534 -89712 -120111 -72183 -122473 -125802 -137741 -155959 -109958
20634 -109958 9326 -35742 -152431 -175515 -99594 -95836 -175228 -145278 -57454 -120374 -221923
20623 -221923 -70359 15357 -8579 -43044 -69422 -139560 -110898 -131034 -139846 -220617 -301963
20612 -301963 -153379 -55866 -83737 -172819 -134723 -84289 -151674 -98515 60216 130914 72400
20601 72400 -15417 -154773 -229967 -229877 -113944 -4029 -57328 -64640 60098 133745 43171 -82020
20589 -82020 -245611 -214117 -148211 -131496 -147288 -93721 -30381 -75005 34474 97208 44328
$$ packed form
20669G3087o2963p0955R70M7801J7430p397l5532p3817l9090N4397O9134j3534
20657d0469p5086l0727L3258O5513l0088j09318p2664J21413N9458l845R2772
20646A0217o2687j04742J3813q135O1822l0399M7928n0290l329j1939j8218M6001
20634a09958J19284m5068j16689k3084P5921L758p9392K9950Q7824o2920j01549
20623b21923J51564Q5716k3936l4465k6378p0138K8662k0136q812q0771q1346
20612c01963J48584R7513k7871q9082L8096N0434o7385N3159J58731P0698n8514
20601G2400q7817j39356p5194R0J15933J09915n3299p312J24738P3647r0574j25191
20589h2020j63591L1494O5906J6715j5792N3567O3340m4624J09479O2734n2880
$$ plain form
20578 44328 17100 -31129 -71134 -113964 -16104 112294 153736 177883 201597 154504 117575
20567 117575 36651 13137 111555 -20028 -289051 -296462 -241628 -145077 -100840 -88865 -12723
20556 -12723 -60613 -13848 29548 60218 31954 -39690 -102936 -8388 4493 47734 16524 18062
20544 18062 18787 6086 -8010 -33702 -19849 30441 -9702 -114163 -156377 -129892 -68646 -58058
20532 -58058 -170824 -173159 -165697 -64540 -72048 -91026 -97562 -75453 71376 106084 71912 21339
20520 21339 -32065 -37838 -54828 -84937 -164573 -183481 37474 184449 48137 -21408 15526
20509 15526 61325 15894 3506 -56952 -147383 -60789 -27803 -692 66420 -33407 -14514 58787
20497 58787 9199 1614 -6825 34144 -62716 -88094 -57019 -81302 9280 -45522 -125720 -175745
$$ packed form
20578D4328k7228m8229m0005m2830R7860J28398M1442K4147K3714m7093l6929
20567A17575q0924k3514R8418j31583k69023p411N4834R6551M4237J1975P6142
20556a2723m7890M6765M3396L0670k8264p1644o3246R4548J2881M3241l1210J538
20544A8062P25j2701j4096k5692J3853N0290m0143j04461m2214K6485O1246J0588
20532e8058j12766k335P462J01157p508j8978o536K2109J46829L4708l4172n0573
20520B1339n3404n773j6990l0109p9636j8908K20955J46975j36312o9545L6934
20509A5526M5799m5431j2388o0458r0431Q6594L2986K7111O7112r9827J8893P3301
20497E8787m9588p585q439M0969r6860k5378L1075k4283R0582n4802q0198n0025
$$ plain form
20485 -175745 -280247 -268316 -235717 -95185 -44043 -20983 -216781 -319481 -201668 -62447
20475 -62447 1629 -38304 -79705 -84530 -125101 -230952 -232984 -264762 -151360 -175739 -338690
20464 -338690 -395039 -229489 -108224 -211387 -184935 -126530 -88995 -151141 -151151 -175197 -188457
20453 -188457 -119498 -126756 -90056 -92216 -166254 -83055 -54801 -265308 -356241 -236842 -177194
20442 -177194 -128954 -101339 -18917 -70731 -11344 -1721 21963 61262 80352 -62054 -145204
20431 -145204 -18152 103765 33589 -951 13183 -28764 -96564 -195725 -237449 -163071 -135500
20420 -135500 -124697 -165319 -39823 -73674 -96765 -16580 -13542 -77258 -67656 -159767 -262155
20409 -262155 -230846 -132554 -32515 -110912 -107538 -94338 -123453 -146263 -18304 10460 146879
$$ packed form
20485a75745j04502J1931L2599J40532N1142K3060j95798j02700J17813J39221
20475f2447O4076l9933m1401m825m0571j05851k032l1778J13402k4379j62951
20464c38690n6349J65550J21265j03163K6452N8405L7535o2146j0k4046j3260
20453a88457O8959p258L6700k160p4038Q3199K8254k10507r0933J19399N9648
20442a77194M8240K7615Q2422n1814N9387R623K3684L9299J9090j42406q3150
20431a45204J27052J21917p0176l4540J4134m1947o7800r9161m1724P4378K7571
20420a35500J0803m0622J25496l3851k3091Q0185L038o3716R602r2111j02388
20409b62155L1309R8292J00039p8397L374J3200k9115k2810J27959K8764J36419
$$ plain form
20398 146879 198739 166026 94427 50227 55833 -33758 -54405 -102350 -83954 34875 2645
20387 2645 -119280 -169290 -171372 -118581 -25885 1311 51140 -39756 -52 -12888 17173 117018
20375 117018 218782 202264 203932 94978 1684 -25399 -8693 -47561 -103996 -129712 -96050
20364 -96050 -11455 24417 72133 63923 78883 151878 -49245 -141493 -194082 -251587 -238619 -125276
20352 -125276 18703 9904 -30000 -126670 -210885 -216319 -200544 -177512 15628 228672 165765
20341 165765 83850 11257 -179352 -245738 -221623 -133180 13506 80401 -1181 -176895 -282362
20330 -282362 -304723 -285064 -241594 -227769 -297998 -322613 -326166 -340078 -196981 -113578 -40952
20319 -40952 -65728 -105913 -56278 -47387 -60792 33915 97225 3709 -53933 -120808 -131332 14467
$$ packed form
20398A46879N1860l2713p1599m4200N606q9591k0647m7945J8396J18829l2230
20387B645j21925n0010k082N2791R2696K7196M9829r0896L9704j2836L0061R9845
20375A17018J01764j6518J668j08954r3294k7083J6706l8868n6435k5716L3662
20364i6050Q4595L5872M7716q210J4960P2995k01123r2248n2589n7505J2968J13343
20352a25276J43979q799l9904r6670q4215n434J5775K3032J93140K13044o2907
20341A65765q1915p2593j90609o6386K4115Q8443J46686O6895q1582j75714j05467
20330b82362k2361J9659M3470J3825p0229k4615l553j3912J43097Q3403P2626
20319d0952k4776m0185M9635Q891j3405R4707O3310r3516n7642o6875j0524J45799
$$ plain form
20307 14467 -8940 -68821 -4713 42985 34924 -67352 -159271 -178722 -37575 -104616 -144531
20296 -144531 -155656 -129010 -134686 -180313 -168035 -1930 -26946 -52957 13691 -28116 -15708
20285 -15708 -75536 -36999 23605 -44930 -190790 -36403 48886 106437 135211 20480 -23113
20274 -23113 -22823 -11930 -28504 -162700 -224253 -143518 -23488 -44473 -107857 -141750 -53816 -73197
20262 -73197 -85741 123702 264245 154991 205872 168658 102906 38966 -24604 100 -42484
20251 -42484 16856 -10337 -122071 -80174 -125215 -39200 -45393 -69596 -94029 -140768 -263415
20240 -263415 -221901 -149867 -23417 22661 -67147 -102125 -17122 63389 71326 4872 -129197
20229 -129197 -99792 37407 128393 101912 64233 170794 77521 3707 46769 -82081 -128326
$$ packed form
20307A4467k3407n9881O4108M7698q061j02276r1919j9451J41147o7041l9915
20296a44531j1125K6646n676m5627J2278J66105k5016k6011O6648m1807J2408
20285a5708n9828L8537O0604o8535j45860J54387Q5289N7551K8774j14731m3593
20274b3113K90J0893j6574j34196o1553Q0735J20030k0985o3384l3893Q7934j9381
20262g3197j2544K09443J40543j09254N0881l7214o5752o3940o3570K4704m2584
20251d2484N9340k7193j11734M1897m5041Q6015o193k4203k4433m6739j22647
20240b63415M1514P2034J26450M6078q9808l4978Q5003Q0511P937o6454j34069
20229a29197K9405J37199R0986k6481l7679J06561r3273p3814M3062j28850m6245
$$ plain form
20218 -128326 -245624 -360403 -383045 -362865 -243787 -27481 16447 -110808 -62530 -10305
20208 -10305 6551 -3892 -120176 -219928 -264682 -80450 -125797 -122852 -64475 -7010 38696
20197 38696 -22548 -112200 -117029 -42608 -6795 78124 81364 11786 59500 57452 -13685 62497
20185 62497 22796 -77287 -61133 -216943 -279537 -183829 -189816 -184905 -100474 66908 141523
20174 141523 60363 -15833 -30324 -62364 -132197 -208943 -207531 -147663 -122302 -116932 -248590 -222409
20162 -222409 -166319 -203830 -166838 -176351 -128620 -21808 -22119 39719 27806 -68139 -53424 40362
20150 40362 92519 131503 242224 149672 121560 89304 -58562 -115812 -124801 -186074 -44759
20139 -44759 103250 115927 -71279 -147888 -30227 75328 -28246 -33105 -120140 -188833 -214241
$$ packed form
20218a28326j17298j14779k2642K0180J19078K16306M3928j27255M8278N2225
20208a0305J6856j0443j16284r9752m4754J84232m5347K945N8377N7465M5706
20197C8696o1244q9652m829P4421L5813Q4919L240o9578M7714k048p1137P6182
20185F2497l9701j00083J6154j55810o2594R5708n987M911Q4431J67382P4615
20174A41523q1160p6196j4491l2040o9833p6746J412N9868K5361N370j31658K6181
20162b22409N6090l7511L6992r513M7731J06812l11O1838j1913r5945J4715R3786
20150D0362N2157L8984J10721r2552k8112l2256j47866n7250q989o1273J41315
20139d4759J48009J2677j87206p6609J17661J05555j03574m859q7035o8693k5408
$$ plain form
20128 -214241 -76958 25152 -19654 -74182 6507 -37590 -82425 -126284 -141416 -128009 -13637
20117 -13637 -51724 -141409 16828 99238 159918 215567 86358 -1672 59621 112974 62496
20106 62496 -90750 -228142 -236205 -190371 -95469 5757 57182 83379 36441 8812 -10664
20095 -10664 -33432 -29379 7055 49596 86106 121185 96502 142473 67829 23678 34548 74311
20083 74311 -49796 14857 41492 35039 71113 119629 103071 33783 -26769 -38631 -45096 -126375
20071 -126375 -165871 -191236 -104206 -32995 6461 17650 140874 -26463 -201386 -209056 -163548
20060 -163548 -59599 -10013 -10099 -138225 -238513 -170366 -75445 -45379 -63795 -44099 11470
20049 11470 21273 68362 28632 -101692 -71944 -60973 -158038 -162102 -169524 -132345 -131756 -132588 -121107
$$ packed form
20128b14241J37283J02110m4806n4528Q0689m4097m4835m3859j5132J3407J14372
20117a3637l8087q9685J58237Q2410O0680N5649j29209q8030O1293N3353n0478
20106F2496j53246j37392q063M5834R4902J01226N1425K6197m6938k7629j9476
20095a0664k2768M053L6434M2541L6510L5079k4683M5971p4644m4151J0870L9763
20083G4311j24107O4653K6635o453L6074M8516j6558o9288o0552j1862o465q1279
20071a26375l9496k5365Q7030P1211L9456J1189J23224j67337j74923p670M5508
20060a63548J03949M9586q6j28126j00288O8147R4921L0066j8416J9696N5569
20049A1470R803M7089l9730j30324K9748J0971r7065m064p422L7179N89q32J1481
$$ plain form
20036 -121107 -60437 -9855 7106 15047 61847 -30506 -95532 -72594 47114 117813 112001 34322
20024 34322 -39874 -8455 18934 80706 174079 164803 140596 146010 -8471 -108541 -68295 -23955
20012 -23955 -99445 -185135 -158851 -126566 -59503 -23743 -58351 -93723 -33155 -138891 -112097
20001 -112097 -1609 -7814 -5324 -33621 -85154 -95477 -39152 8102 -46152 -37976 -78900 -153996
19989 -153996 -166671 -86597 -50858 -22221 -30939 -117324 -244623 -279214 -165782 18150 153292
19978 153292 180524 156729 46501 -48846 -101403 -156771 -185883 -85150 -68906 -39411 -145063
19967 -145063 -246596 -155757 -55629 -105063 -124799 -92442 -94523 -40419 -85761 -110330 -70412
19956 -70412 45113 132660 73517 -64862 -56329 -62693 -190691 -247550 -142369 20623 27958
$$ packed form
20036a21107O0670N0582J6961P941M6800r2353o5026K2938J19708P0699n812p7679
20024C4322p4196L1419K7389O1772R3373r276k4207N414j54481j00070M0246M4340
20012b3955p5490q5690K6284L2285O7063L5760l4608l5372O0568j05736K6794
20001a12097J10488o205K490k8297n1533j0323N6325M7254n4254Q176m0924p5096
19989a53996j2675Q0074L5739K8637q718q6385j27299l4591J13432J83932J35142
19978A53292K7232k3795j10228r5347n2557n5368k9112J00733J6244K9495j05652
19967a45063j01533R0839J00128m9434j9736L2357k081N4104m5342k4569L9918
19956g0412J15525Q7547n9143j38379Q533o364j27998n6859J05181J62992P335
$$ plain form
19945 27958 43242 -42480 -84688 -171603 -265516 -242740 -141634 -45109 -133165 -125891 -112286 -45942
19933 -45942 131321 196665 143395 143327 91133 139838 19014 -60614 -31971 48062 121533 130043
19921 130043 5926 -8892 -11480 -34715 -55894 -105517 -237416 -192713 -179474 -224064 -80243
19910 -80243 5584 49531 59379 -66343 -134581 -114405 -77345 -151970 -142132 -58337 81523 40342
19898 40342 -1487 37056 26348 -92683 -146362 -27709 52612 105726 -12394 -58034 57225
19887 57225 64683 -16051 -41971 -31690 -56895 -152467 -90792 -82415 -178579 -218117 -214353 -81078
19875 -81078 -10432 -30493 64614 38987 72796 42151 -79196 -209022 -219126 -105256 -158212
19864 -158212 -198875 -154330 -120624 -10331 35652 23022 -40989 -135215 -196437 -274913 -315356
$$ packed form
19945B7958J5284q5722m2208q6915r3913K2776J01106R6525q8056P274J3605O6344
19933d5942J77263O5344n3270o8n2194M8705j20824p9628K8643Q0033P3471Q510
19921A30043j24117j4818k588k3235k1179m9623j31899M4703J3239m4590J43821
19910h0243Q5827M3947R848j25722o8238K0176L7060p4625R838Q3795J39860m1181
19898D0342m1829L8543j0708j19031n3679J18653Q0321N3114j18120m5640J15259
19887E7225P458q0734k5920J0281k5205r5572O1675Q377r6164l9538L764J33275
19875h1078P0646k0061R5107k5627L3809l0645j21347j29826j0104J13870n2956
19864a58212m0663M4545L3706J10293M5983j2630o4011r4226o1222p8476m0443
$$ plain form
19853 -315356 -323636 -239538 -191298 -244443 -273967 -123881 -190444 -193016 -144992 -88771 -50211 -133834
19841 -133834 -122073 -29590 53521 -58495 -150648 -197124 -236532 -153356 -187206 -169949 -127218
19830 -127218 -4769 34845 10642 -21196 46885 30265 36622 -24687 -42534 -4726 96889
19819 96889 85858 -18119 -26269 -17084 78710 20545 -93899 -114269 -94958 14078 29443
19808 29443 -1466 -7746 1106 -5140 17901 95515 29568 71273 122762 69242 481 1241 -24541
19795 -24541 -6660 37003 149568 166344 216669 108608 35414 48981 -24274 -33150 -187485
19784 -187485 -300873 -218778 -142789 -123686 -59723 -73772 -134734 -80195 64944 132604 -801
19773 -801 38330 46551 48619 -45228 -62051 -136209 -3625 42212 -39582 -66475 8476 37121
$$ packed form
19853c15356q280Q4098M8240n3145k9524J50086o6563k572M8024N6221L8560q3623
19841a33834J1761R2483Q3111j12016r2153m6476l9408Q3176l3850J7257M2731
19830a27218J22449L9614k4203l1838O8081j6620O357o1309j7847L7808J01615
19819I6889j1031j03977q150R185R5794n8165j14444k0370J9311J09036J5365
19808B9443l0909o280Q852o246K3041P7614o5947M1705N1489n3520o8761P60k5782
19795b4541J7881M3663J12565J6776N0325j08061p3194J3567p3255q876j54335
19784a87485j13388Q2095P5989J9103O3963j4049o0962N4539J45139O7660j33405
19773h01L9131Q221K068r3847j6823p4158J32584M5837q1794k6893P4951K8645
$$ plain form
19761 37121 -67892 -50460 -28992 -45172 -5211 101316 16890 -127840 -63507 -21206 33360
19750 33360 25010 -1275 59782 87381 -4110 -58053 -93287 -159775 -170612 -105963 -90309 -84070
19738 -84070 28034 170475 274657 236004 145766 70012 -18036 -9356 -27703 38829 -15919
19727 -15919 -136569 -150174 -115337 -105807 77115 114662 139254 57442 108687 87078 -48982
19716 -48982 -82079 -130527 -204286 -122569 -64885 -138617 -199722 -238140 -238135 -171219 -102609 -94811 -35327
19703 -35327 -94406 -54232 46169 94778 54637 -30760 -26855 -91490 -180016 -80685 -32242 -124426
19691 -124426 -173929 -101648 -56479 -90578 -173592 -140667 -58386 -149 89816 115323 137480
19680 137480 59285 -30948 -80793 -155019 -154311 -34782 -12207 -33666 -49470 47599 76038 -75645
$$ packed form
19761C7121j05013J7432K1468j6180L9961J06527q4426j44730O4333M2301N4566
19750C3360q350k6285O1057K7599r1491n3943l5234o6488j0837O4649J5654O239
19738h4070J12104J42441J04182l8653r0238p5754q8048Q680j8347O6532n4748
19727a5919j20650j3605L4837R530J82922L7547K4592q1812N1245k1609j36060
19716d8982l3097m8448p3759Q1717N7684p3732o1105l8418NO6916O8610P798N9484
19703c5327n9079M0174J00401M8609m0141q5397L905o4635q8526R9331M8443r2184
19691a24426m9503P2281M5169l4099q3014L2925Q2281N8237Q9965K5507K2157
19680A37480p8195r0233m9845p4226P08J19529K2575k1459j5804R7069K8439j51683
$$ plain form
19668 -75645 -131660 -62290 58825 66070 -30286 -96843 -183275 -202967 -147398 -152011 -147695 -117860
19656 -117860 -215754 -237536 -104682 -65613 -59860 -26512 -49532 -67320 -60427 -8428 -79694 -97310
19644 -97310 -160794 -225071 -165870 -134281 -123950 -118602 -71273 -133729 -187782 -136345 -169259 -14096
19632 -14096 178440 148648 52474 -67914 -189364 -114921 -59611 -81755 -38746 -31947 -13430
19621 -13430 -34127 -93333 -46085 10271 67080 62206 52255 80028 -68185 -128178 1360 39087
19609 39087 -74247 12305 77850 144258 132036 -50919 -226333 -148898 -27114 27667 157492
19598 157492 164804 180136 224972 277449 278817 208510 112610 116867 95624 3406 -69551 -103981
19586 -103981 -97400 -212540 -310257 -220464 -72046 -59174 -5532 -7239 -168813 -116035 -63368
$$ packed form
19668g5645n6015O9370J21115P245r6356o6557q6432j9692N5569m613M316K9835
19656a17860r7894k1782J32854L9069N753L3348k3020j7788O893N1999p1266j7616
19644i7310o3484o4277N9201L1589J0331N348M7329o2456n4053N1437l2914J55163
19632a4096J92536k9792r6174j20388j21450P4443N5310k2144M3009O799J8517
19621a3430k0697n9206M7248N6356N6809m874r951K7773j48213n9993J29538L7727
19609C9087j13334Q6552O5545O6408j2222j82955j75414P7435J21784N4781J29825
19598A57492P312J5332M4836N2477J368p0307r5900M257k1243r2218p2957l4430
19586a03981O581j15140r7717Q9793J48418J2872N3642j707j61574N2778N2667
$$ plain form
19575 -63368 -120914 -79877 -11140 5137 192296 131722 -111626 -31392 78052 -53178 -81320
19564 -81320 -90125 -202729 -274553 -174608 -169633 -226696 -253437 -180346 9250 -97807 -214959
19553 -214959 -64298 -96535 -106285 -128699 -71128 -114326 -134312 -57906 -103501 -132149 -52045
19542 -52045 -44905 -9295 62411 -20529 -74748 -71508 -162965 -184836 22920 165871 33975
19531 33975 -9223 73156 38064 78839 58428 -19722 -37345 -20607 -75557 -77032 -63653 -189660
19519 -189660 -185384 -48397 53405 127851 114361 99923 51597 -39773 -66892 770 22783
19508 22783 13074 59353 115127 89576 63274 38999 68550 93229 86283 67516 -36937 -151077
19496 -151077 -137950 -55819 15886 104167 202249 81245 77489 142101 145020 -69218 -58607
$$ packed form
19575f3368n7546M1037O8737J6277J87159o0574k43348Q0234J09444j31230k8142
19564h1320q805j12604p1824R9945M975n7063k6741P3091J89596j07057j17152
19553b14959J50661l2237r750k2414N7571m3198j9986P6406m5595k8648Q0104
19542e2045P140L5610P1706q2940n4219L240r1457k1871K07756J42951j31896
19531C3975m3198Q2379l5092M0775k0411p8150j7623J6738n4950j475J3379j26007
19519a89660M276J36987J01802P4446j3490j4438m8326r1370k7119O7662K2013
19508B2783r709M6279N5774k5551k6302k4275K9551K4679o946j8767j04453j14140
19496a51077J3127Q2131P1705Q8281R8082j21004l756O4612K919k14238J0611
$$ plain form
19485 -58607 -67313 -95701 -75982 -71711 -40809 -63215 -20699 -82383 -126668 -93176 -55717 -38358
19473 -38358 -39512 21277 76645 71395 27227 6511 12888 5224 17674 84526 79522 102892 119745
19460 119745 65176 -28710 -155986 -202405 -176961 -8213 33564 -84112 -270304 -193695 -107191
19449 -107191 -63201 -60195 -44243 -104064 -114221 -20275 -62972 -34676 64111 -2264 -151936
19438 -151936 -186450 -131479 -144587 -81957 11248 38603 78971 70121 164728 86219 10560 -26571
19426 -26571 827 -76713 -116362 -22864 18900 -10071 -37899 -35592 -84391 -132292 -201319 -271011
19414 -271011 -169014 -69948 -111296 -167036 -135920 -113102 -52777 35237 34710 68388 76296 78001
19402 78001 75686 -31070 35017 58868 10271 16693 19262 -75552 -109131 -45707 50681 19574
$$ packed form
19485e8607q706k8388J9719M271L0902k2406M2516o1684m4285L3492L7459J7359
19473c8358j154O0789N5368n250m4168k0716O377p664J2450O6852n004K3370J6853
19460A19745n4569r3886j27276m6419K5444J68748M1777j17676j86192P6609Q6504
19449a07191M3990L006J5952n9821j0157R3946m2697K8296R8787o6375j49672
19438a51936l4514N4971j3108O2630R3205K7355M0368q850R4607p8509p5659l7131
19426b6571K7398p7540l9649R3498M1764k8971k7828K307m8799m7901o9027o9692
19414b71011J01997R9066m1348n5740L1116K2818O0325Q8014n27L3678P908J705
19402G8001k315j06756O6087K3851m8597O422K569r4814l3579O3424R6388l1107
$$ plain form
19390 19574 32746 -76327 -125637 -179865 -141763 -136739 -61620 14347 108155 47286 -26993 -80845
19378 -80845 -75167 -87797 -134018 -230713 -255054 -226526 -200893 -56489 -131751 -143030 -59628 41768
19366 41768 50601 33015 -90531 -153220 -178279 -109652 -124400 -130999 -120406 -46968 -44482 25505
19354 25505 29320 41369 33378 665 -10470 -9829 15015 -59206 -83627 -50929 -10566 39157
19342 39157 16013 -57400 -90100 -189384 -269905 -277523 -205468 -32482 -42144 -174530 -176936 -145263
19330 -145263 -151302 -168565 -131196 -103654 -97952 -120593 -107688 -157256 -312307 -340782 -290091 -274324
19318 -274324 -185148 -170357 -258701 -311579 -260797 -136133 -95815 -62841 -86451 -121460 -157072
19307 -157072 -154530 -74826 -130126 -244025 -205958 -112794 -25925 -38312 -17380 -109578 -94992
$$ packed form
19390A9574J3172j09073m9310n4228L8102N024P5119P5967R3808o0869p4279n3852
19378h0845N678j2630m6221r6695k4341K8528K5633J44404p5262j1279Q3402J01396
19366D1768Q833j7586j23546o2689k5059O8627j4748o599J0593P3438K486O9987
19354B5505L815J2049p991l2713j1135O41K4844p4221k4421L2698M0363M9723
19342C9157k3144p3413l2700r9284q0521p618P2055J72986r662j32386k406L1673
19330a45263o039j7263L7369K7542N702k2641J2905m9568j55051k8475N0691J5767
19318b74324Q9176J4791q8344n2878N0782J24664M0318L2974k3610l5009l5612
19307a57072K542P9704n5300j13899L8067R3164Q6869j2387K0932r2198J4586
$$ plain form
19296 -94992 -30238 -2985 -47232 -152828 -168340 -43276 -48722 -118135 12783 28750 6297
19285 6297 -43121 -117004 -178413 -142368 -53464 -67140 77722 126179 163614 66131 15366 97299
19273 97299 158694 68346 79286 100400 105299 91819 -41549 -99479 -90664 -139391 -108039 5331
19261 5331 -17588 -28252 77749 167382 123205 92844 27878 34758 -3647 -19166 -17835 -148535
19249 -148535 -179009 -126597 -76288 17955 -40471 -26658 21789 8940 153116 133166 75514
19238 75514 17087 53106 -154787 -150439 -156443 -202846 -155134 -35491 -22225 -81352 -61231 -30236
19226 -30236 -84707 -108757 -142620 -42060 -39808 -9843 -15740 -55274 -94303 15140 15325 -84099
19214 -84099 -104063 -6324 44432 -71748 -120308 -37953 -35964 -34343 -72164 -109666 -109159 -55857
$$ packed form
19296i4992O4754K7253m4247j05596j5512J25064n446o9413J30918J5967k2453
19285F297m9418p3883o1409L6045Q8904j3676J44862M8457L7435r7483n0765Q1933
19273I7299O1395r0348J0940K1114M899j3480j33368n7930Q815m8727L1352J13370
19261E331k2919j0664J06001Q9633m4177l0361o4966O880l8405j5519J331j30700
19249a48535l0474N2412N0309R4243n8426J3813M8447j2849J44176j9950n7652
19238G5514n8427L6019k07893M348o004m6403M7712J19643J3266n9127K0121L0995
19226c0236n4471k4050l3863J00560K252K9965n897l9534l9029J09443J85r9424
19214h4099j9964R7739N0756j16180m8560Q2355J989J621l7821l7502N07N3302
$$ plain form
19202 -55857 -68131 -124237 -134111 -11346 -7460 -16665 -132653 -270215 -282819 -296940 -72324
19191 -72324 47906 31960 -39751 -7124 5057 68007 75859 -13031 -27377 -36514 -133182 -109704
19179 -109704 -100669 -132742 -125141 -56517 -12738 -19040 43196 114512 174213 191800 112813 190620
19167 190620 171571 167292 196131 45961 -62486 -7414 -45804 79516 29259 -188923 -122950
19156 -122950 -20733 20902 48247 -29175 -118939 -30356 36098 28253 -63778 -138174 -109023
19145 -109023 -31091 -81679 -127092 7820 152770 145854 131520 189509 103008 -6420 -21803
19134 -21803 -41672 -63848 -52411 56476 129197 84748 57984 76707 149693 118471 142400
19123 142400 41120 157722 172011 167814 202387 113106 -11844 -127583 -50681 -156916 -116273
$$ packed form
19202e5857j2274n6106r874J22765L886r205j15988j37562j2604j4121K24616
19191g2324J20230j5946p1711L2627J2181O2950P852q8890j4346r137r6668K3478
19179a09704R035l2073P601O8624M3779o302O2236P1316N9701J7587p8987P7807
19167A90620j9049m279K8839j50170j08447N5072l8390J25320n0257k18182O5973
19156a22950J02217M1635K7345p7422q9764Q8583O6454p845r2031p4396K9151
19145a09023P7932n0588m5413J34912J44950o916j4334N7989q6501j09428j5383
19134b1803j9869k2176J1437J08887P2721m4449k6764J8723P2986l1222K3929
19123A42400j01280J16602J4289m197L4573q9281j24950j15739P6902j06235M0643
$$ plain form
19112 -116273 -42571 55813 59862 22827 34802 -12518 2561 -27385 -9674 23762 -11423 49278
19100 49278 94070 106354 70173 142822 205923 189620 205312 161644 130674 84175 161227 197391
19088 197391 182835 41394 -60040 -88303 -129247 -168899 -130404 -121173 -80772 -65271 6904
19077 6904 -20432 -95075 -201383 -217774 -201594 -187864 -190615 -145249 -34065 -21331 -17838 102879
19065 102879 196106 136184 -24611 36237 52643 229 -64257 -104078 -107780 -80107 -116663
19054 -116663 -257521 -160353 -87136 -40129 -73292 -50328 -143493 -245338 -89120 -18789 -24970
19043 -24970 -68629 -100150 -199003 -103798 -132899 -177909 -140172 -121349 -165225 -165245 -69538 -107900
19031 -107900 -82353 -119712 -63748 -105579 -158870 -68010 8569 31151 55753 -46096 -60749
$$ packed form
19112a16273P3702R8384M049l7035J1975m7320J5079k9946J7711L3436l5185O0701
19100D9278M4792J2284l6181P2649O3101j6303J5692m3668l0970m6499P7052L6164
19088A97391j4556j41441j01434k8263m0944l9652L8495R231M0401J5501P2175
19077F904k7336p4643j06308j6391J6180J3730k751M5366J11184J2734L493J20717
19065A02879R3227n9922j60795O0848J6406n2414o4486l9821l702K7673l6556
19054a16663j40858R7168P3217M7007l3163K2964r3165j01845J56218P0331o181
19043b4970m3659l1521r8853R5205k9101m5010L7737J8823m3876k0R5707l8362
19031a07900K5547l7359N5964m1831n3291R0860P6579K2582K4602j01849j4653
$$ plain form
19020 -60749 -52029 -10834 -40485 -72111 98 -32594 -35627 -29642 -121154 -141565 -127926 -40225
19008 -40225 8 -3212 -44539 -166204 -44323 -88655 -118875 -39837 65017 29419 35203
18997 35203 -8824 -146872 -184288 -131537 34362 -32173 -180756 -188527 -107627 -77433 -75677
18986 -75677 -16221 68658 201404 110365 57983 92528 176867 136164 41581 -45155 -91275
18975 -91275 -93929 -111022 -156930 -111337 -12867 32491 -38001 -104851 -75312 -34717 27964 18086
18963 18086 -37814 -19486 -18718 -119282 -85888 -40920 -40609 -115661 -158727 -78018 22502 -7148
18951 -7148 -46205 4617 6843 -42544 -12029 -171938 -174656 22425 16478 -9303 -24442 -109746
18939 -109746 -151332 16404 -61676 -152838 -71471 48335 -28401 -88512 301 -29221 -35410
$$ packed form
19020f0749Q720M1195k9651l1626P2209l2692l033N985r1512k0411J3639Q7701
19008d0225M0233l220m1327j21665J21881m4332l0220P9038J04854l5598N784
18997C5203m4027j38048l7416N2751J65899o6535j48583p771Q0900L0194J756
18986g5677N9456Q4879J32746r1039n2382L4545Q4339m0703r4583q6736m6120
18975i1275k654j7093m5908M5593R8470M5358p0492o6850K9539M0595O2681r878
18963A8086n5900J8328P68j00564L3394M4968L11p5052m3066Q0709J00520k9650
18951g148l9057N0822K226m9387L0515j59909k718J97081n947k5781j5139q5304
18939a09746m1586J67736p8080r1162Q1367J19806p6736o0111Q8813k9522o189
$$ plain form
18928 -35410 53037 -27963 -63999 -23576 -2205 54450 -71119 -90401 6003 24750 -47073
18917 -47073 -52742 -135789 -235449 -176911 1072 45062 123430 149902 124665 -39118 -136457
18906 -136457 -103823 -113260 -88539 -38893 -36922 1572 -1087 78482 69834 -9981 -6504 5907
18894 5907 -19666 27088 10284 -61503 -24308 -10851 -31719 -23819 -131631 -164895 -108883 -71425
18882 -71425 -66294 -49496 -54416 -48317 -52333 -76724 -68128 -113218 -135409 -106123 20443 171756
18870 171756 271331 284870 154205 110570 43898 -110994 -103495 -67927 -2169 -25247 -65060
18859 -65060 -39232 -83911 -113458 -105377 -179627 -222883 -166990 -140974 -10210 -43310 -136923 -141005
18847 -141005 -41095 -55167 -22517 -38785 -104706 -109940 -151380 -51547 14027 48526 58842 45171
$$ packed form
18928c5410Q8447q1000l6036M0423K1371N6655j25569j9282R6404J8747p1823
18917d7073n669q3047r9660N8538J77983M3990P8368K6472k5237j63783r7339
18906a36457L2634r437K4721M9646J971L8494k659P9569q648p9815L477J2411
18894E907k5573M6754j6804p1787L7195J3457k0868P900j07812l3264N6012L7458
18882g1425N131J6798m920O099m016k4391Q596m5090k2191K9286J26566J51313
18870A71756R9575J3539j30665m3635o6672j54892P499L5568O5758k3078l9813
18859f5060K5828m4679k9547Q081p4250m3256N5893K6016J30764l3100r3613m082
18847a41005R9910j4072L2650j6268o5921n234m1440R9833O5574L4499J0316j3671
$$ plain form
18835 45171 -29493 -178200 -238967 -188679 -72365 -43382 -105041 -134069 -128121 -209384 -164653
18824 -164653 -259788 -254716 -256330 -150152 -29870 -36311 -29064 42507 27959 457 9423 -75706
18812 -75706 -81162 -58478 -23409 50816 89698 70633 -18971 -30844 -40887 -36559 74387 37050
18800 37050 64950 71712 11938 33824 51556 33780 32314 56985 61641 11076 -30484 -168447
18788 -168447 -213342 -196269 -126606 -20274 76017 54587 14491 -43005 -76630 -158424 -398722
18777 -398722 -348329 -303238 -151857 5736 138628 180764 145088 103933 325026 608043
18767 608043 836106 1126713 1186286 953834 643632 438307 238122 227933 270132 207882
18757 207882 -71057 -93241 -52269 -182080 -99484 -172267 -199175 -61536 31058 55682 -35419
$$ packed form
18835D5171p4664j48707o0767N0288J16314K8983o1659k9028N948q1263M4731
18824a64653r5135N072j614J06178J20282o441P247P1571j4548k7502Q966q5129
18812g5706n456K2684L5069P4225L8882j9065q9604j1873j0043M328J10946l7337
18800C7050K7900O762n9774K1886J7732j7776j466K4671M656n0565m1560j37963
18788a68447m4895J7073O9663J06332R6291k1430m0096n7496l3625q1794k40298
18777c98722N0393M5091J51381J57593J32892M2136l5676m1155K21093K83017
18767F08043K28063K90607N9573k32452l10202k05325k00185j0189M2199o2250
18757B07882k78939k2184M0972j29811Q2596p2783k6908J37639R2594K4624r1101
$$ plain form
18746 -35419 -105651 -107020 -63142 -99033 -145255 -89477 -101007 -165006 -67704 -63392 -131005 -164405
18734 -164405 -82980 -58994 -58732 5892 71105 31800 -15390 3776 36474 130557 80689 -92173
18722 -92173 -146539 -143383 -176935 -129162 -26574 -17955 -109128 -150153 -109282 -66134 -76261 1843
18710 1843 -94304 -184906 -19847 -44446 -200650 -132975 -199465 -148742 -31721 -82490 -195946
18699 -195946 -120882 12164 -36008 -27506 2966 26281 121876 70934 -66464 -66927 1177 -72301
18687 -72301 -63270 -75449 -46536 56216 144730 91871 74783 -16966 -13498 45089 45853 -42839
18675 -42839 -97403 -8335 -29305 -81112 -167791 -185939 -185255 -175119 -280461 -305691 -152544 -65107
18663 -65107 -127803 -178562 -98799 37834 -108279 -218554 -221850 -213726 -118776 -57296 36629
$$ packed form
18746c5419p0232j369M3878l5891m6222N5778j1530o3999R7302M312o7613l3400
18734a64405Q1425K3986K62O4624O5213l9305m7190J9166L2698R4083m9868j72862
18722i2173n4366L156l3552M7773J02588Q619r1173m1025M0871M3148j0127P8104
18710A843r6147r0602J65059k4599j56204O7675o6490N0723J17021n0769j13456
18699a95946P5064J33046m8172Q502L0472K3315R5595n0942j37398m63O8104p3478
18687g2301R031j2179K8913J02752Q8514n2859j7088r1749L468N8587P64q8692
18675d2839n4564Q9068k0970n1807q6679j8148O84J0136j05342k5230J53147Q7437
18663f5107o2696n0759P9763J36633j46113j10275l296Q124R4950O1480R3925
$$ plain form
18652 36629 120047 42430 48881 100743 135769 99576 32769 21610 71096 26382 -91698 -62144
18640 -62144 69477 154478 172148 142777 101795 166227 165889 38003 -65760 -138891 -189750
18629 -189750 -163246 -119079 -149385 -153577 -153705 -158597 -158476 -114013 -114382 -154931 -160678 -177685 -32089
18616 -32089 56255 68899 94773 70187 -59551 -129225 -64388 21899 -6336 -78475 -99764
18605 -99764 -9255 65968 -11241 -69969 -70832 -58995 -72117 -17309 -1629 -46723 -106792 -29169
18593 -29169 -45433 -154178 -155728 -166940 -187215 -73844 -30290 15197 9351 27492 -4854 -76863
18581 -76863 -30146 170908 228476 198532 165903 123938 4081 -62058 -56088 -112870 -222845
18570 -222845 -266141 -219267 -249101 -261473 -177151 -102756 -111672 -48789 57448 114775 74238
$$ packed form
18652C6629Q3418p7617O451N1862L5026l6193o6807j1159M9486m4714j18080K9554
18640f2144J31621Q5001J7670k9371m0982O4432l38j27886j03763p3131n0859
18629a89750K6504M4167l0306m192j28m892J21M4463l69m0549n747j7007J45596
18616c2089Q8344J2644K5874k4586j29738o9674O4837Q6287k8235p2139k1289
18605i9764R0509P5223p7209n8728q63J1837j3122N4808J5680m5094o0069P7623
18593b9169j6264j08745j550j1212k0275J13371M3554M5487n846J8141l2346p2009
18581g6863M6717K01054N7568k9944l2629m1965j19857o6139N970n6782j09975
18570b22845m3296M6874k9834j2372Q4322P4395q916O2883J06237N7327m0537
$$ plain form
18559 74238 27566 34662 41088 -98719 -138829 -159171 -161636 -86645 -75387 -86225 -35533 -10622
18547 -10622 -84891 -86198 -50464 30798 7564 -39147 -124178 -259274 -291279 -188859 -195013 -145677
18535 -145677 -5435 90960 66638 60163 9147 -36973 12358 -20412 -117412 -59035 -47235
18524 -47235 -21649 58250 106863 224571 214091 179422 116286 103459 37056 -30745 17901
18513 17901 34619 94111 72732 80090 12887 -28520 -94016 -2608 150131 129105 34815 -88273
18501 -88273 1127 38772 -12118 82432 127713 84734 8576 -71438 -72669 -103128 -98873 -95538
18489 -95538 -126743 -130310 -106233 -116911 -81113 4968 -8471 -140591 -259245 -139125 -88986
18478 -88986 -16010 -29648 -71356 -51640 -55710 -28615 -6032 -76734 -54697 -70806 -95842 -91629
$$ packed form
18559G4238m6672P096O426j39807m0110k0342k465P4991J1258j0838N0692K4911
18547a0622p4269j307L5734Q1262k3234m6711q5031j35096l2005J02420o154M9336
18535a45677J40242R6395k4322o475n1016m6120M9331l2770r7000N8377J1800
18524d7235K5586P9899M8613J17708j0480l4669o3136j2827o6403o7801M8646
18513A7901J6718N9492k1379P358o7203m1407o5496R1408J52739k1026r4290j23088
18501h8273Q9400L7645n0890R4550M5281m2979p6158q0014j231l0459M255L335
18489i5538l1205l567K4077j0678L5798Q6081j3439j32120j18654J20120N0139
18478h8986P2976j3638m1708J9716m070K7095K2583p0702K2037j6109k5036M213
$$ plain form
18466 -91629 -151380 -135128 -190535 -198433 -118088 -100612 -49587 -76496 -167065 -172438 -99853 -36427
18454 -36427 14193 -5893 -64200 -53707 -66911 -195681 -155518 -150639 -136079 29748 123178
18443 123178 -5409 34291 188902 241051 248544 -2644 -177793 -3629 -2131 -41216 9447
18432 9447 -3115 -106523 -53503 -11892 -95403 -206558 -187187 -59156 45361 75193 55693
18421 55693 16120 -37259 -94870 -70650 -82208 6020 131350 158716 80300 111827 20565
18410 20565 26035 83674 8943 -15430 -24889 14473 22302 37176 -23301 -16587 4985 -49177
18398 -49177 -137509 -73823 -186713 -90691 10488 -85767 -121616 -98888 -121391 -11426 47534
18387 47534 -12768 -83931 -179775 -149275 9196 -29922 -19086 43175 28422 -20869 -20022 65181
$$ packed form
18466i1629n9751J6252n5407p898Q0345J7476N1025k6909r0569n373P2585O3426
18454c6427N0620k0086n8307J0493j3204j28770M0163M879J4560J65827R3430
18443A23178j28587L9700J54611N2149P493k51188j75149J74164J498l9085N0663
18432I447j2562j03408N3020M1611q3511j11155J9371J28031J04517K9832j9500
18421E5693l9573n3379n7611K4220j1558Q8228J25330K7366p8416L1527r1262
18410B0565N470N7639p4731k4373r459L9362P829J4874o0477O714K1572n4162
18398d9177q8332O3686j12890R6022J01179r6255l5849K2728k2503J09965N8960
18387D7534o0302p1163r5844L0500J58471l9118J0836O2261j4753m9291Q47Q5203
$$ plain form
18375 65181 101499 53416 2758 58495 92264 -86326 -157976 7019 142791 139403 156569
18364 156569 101033 -5106 -43844 -46992 74314 158629 254653 227636 81932 14458 11255
18353 11255 66096 62571 171 -53817 -43229 46309 156001 112930 97494 78759 -4543 -135266
18341 -135266 -193011 -163462 -181889 -175622 -47844 127187 127337 -34290 -196326 -235594 -94490
18330 -94490 -29771 -74434 27454 2567 23757 -36086 -110591 -119226 -25321 98123 194126
18319 194126 207677 115600 3049 16558 52930 -27156 -111609 -39630 -93243 -69891 41885
18308 41885 171673 100525 150219 227326 264454 237292 294004 163592 -18671 3628 27730
18297 27730 87531 160723 181966 57600 82998 43103 118214 194849 186683 84374 -31201
$$ packed form
18375F5181L6318m8083n0658N5737L3769j78590p1650J64995J35772l388J7166
18364A56569n5536j06139l8738l148J21306Q4315R6024k7017j45704o7474l203
18353A1255N4841l525o2400n3988J0588Q9538J09692m3071j5436j8735q3302j30723
18341a35266n7745K9549j8427O267J27778J75031J50j61627j62036l9268J41104
18330i4490O4719m4663J01888k4887K1190n9843p4505q635R3905J23444R6003
18319A94126J3551r2077j12551J3509L6372q0086q4453P1979n3613K3352J11776
18308D1885J29788p1148M9694P7107L7128k7162N6712j30412j82263K2299K4102
18297B7730N9801P3192K1243j24366K5398l9895P5111P6635q166j02309j15575
$$ plain form
18286 -31201 -57139 -149755 -204022 -165277 -115995 -53240 -107418 -133228 -49963 -34260 -43108 -29798
18274 -29798 71901 139432 134138 -7574 -78339 -97429 -133777 -187499 -173506 882 34775
18263 34775 61843 -29965 56311 48984 7325 -15497 -17313 11946 9673 15569 47551 -5725
18251 -5725 36960 130174 251907 227410 233060 285051 302318 210789 131001 -16474 47087 90469
18239 90469 85127 56082 -16335 84298 90601 -45119 -26063 25065 -62145 -199079 -205430 -155766
18227 -155766 -98191 6186 -2731 -36223 105585 60491 -112673 -130789 50818 134615 188929
18216 188929 256675 200775 73110 112325 145363 -10218 -10544 82227 82853 64563 87222 64897
18204 64897 122952 84062 21605 -72667 -134426 -168583 -102942 5878 30467 92526 130768
$$ packed form
18286c1201k5938r2616n4267L8745M9282O2755n4178k5810Q3265J5703q848J3310
18274b9798J01699O7531n294j41712p0765j9090l6348n3722J3993J74388L3893
18263C4775K7068r1808Q6276p327m1659k2822j816K9259k273N896L1982n3276
18251e725M2685R3214J21733k4497N650N1991J7267r1529p9788j47475O3561M3382
18239I0469n342k9045p2417J00633O303j35720J9056N1128q7210j36934o351M9664
18227a55766N7575J04377q917l3492J41808m5094j73164j8116J81607Q3797N4314
18216A88929O7746n5900j27665L9215L3038j55581l26R2771O26j8290K2659k2325
18204F4897N8055l8890o2457r4272o1759l4157O5641J08820K4589O2059L8242
$$ plain form
18193 130768 163447 84017 2602 28195 27125 -6651 -9692 33980 63882 38064 132240 144948
18181 144948 79217 47225 122528 199070 243007 197440 148930 94490 220282 267449 147756
18170 147756 83219 145058 216889 274592 208736 99887 -43046 -159447 -150919 -32492 49509
18159 49509 178752 297360 330030 430150 522909 581999 660288 700932 579110 590336 661363
18148 661363 685448 791608 805204 882415 898007 870323 880526 850219 911743 890145 901733
18137 901733 977698 1087178 1190059 1250363 1362646 1481240 1476770 1568687 1821587 1972509
18127 1972509 2234560 2497116 2788626 3339575 3965206 4529688 5256704 6201158 7418021
18118 7418021 8962489 11027355 13908854 17790217 23122373 31034275 43179217 63697053
$$ packed form
18193A30768L2679p9430q1415K5593j070l3776l041M3672K9902k5818R4176J2708
18181A44948o5731l1992P5303P6542M3937m5567m8510n4440J25792M7167j19693
18170A47756o4537O1839P1831N7703o5856j08849j42933j16401Q528J18427Q2001
18159D9509J29243J18608L2670J00120R2759N9090P8289M0644j21822J1226P1027
18148F61363K4085J06160J3596P7211J5592k7684J0203l0307O1524k1598J1588
18137I01733P5965J09480J02881O0304J12283J18594m470R1917K52900J50922
18127A972509K62051K62556K91510N50949O25631N64482P27016R44454J216863
18118G418021J544468K064866K881499L881363N332156P911902J2144942K0517836
$$ plain form
18110 63697053 100196077 157301997 216047207 239543753 214899904 165275455 113229177
18103 113229177 73787321 48825041 33724332 24338750 18154823 13907737 10958230
18096 10958230 9142348 7763331 6507276 5652413 4850166 4105800 3580112 3315420 3026781
18087 3026781 2836994 2542433 2202447 1998052 1822404 1641267 1485453 1342098 1330179 1297941
18077 1297941 1271696 1149564 1076167 1126882 1041924 821066 732586 781476 752834 747522 686993
18066 686993 501916 353260 359212 507010 532678 466496 493699 560756 608483 560125 413179
18055 413179 363777 409831 454045 675699 697873 589801 551205 424510 204410 78769
18045 78769 -42357 -35226 24036 -11475 6981 38292 147959 100897 66538 110279 86582
$$ packed form
18110F3697053L6499024N7105920N8745210K3496546k4643849m9624449n2046278
18103A13229177l9441856k4962280j5100709r385582o183927m247086k949507
18096A0958230j815882j379017j256055q54863q02247p44366n25688k64692k88639
18087C026781j89787k94561l39986k04395j75648j81137j55814j43355j1919l2238
18077A297941k6245j22132p3397N0715q4958k20858q8480M8890k8642n312o0529
18066F86993j85077j48656N952J47798K5668o6182K7203O7057M7727m8358j46946
18055D13179m9402M6054M4214K21654K2174j08072l8596j26695k20100j25641
18045G8769j21126P131N9262l5511J8456L1311J09667m7062l4359M3741k3697
$$ plain form
18034 86582 15487 41598 45860 157711 155960 221289 220027 207423 183948 163259 113220 54625
18022 54625 133872 120362 159930 207972 205185 155733 157948 173072 64019 119696 209783 180440
18010 180440 136943 64725 9646 1613 51676 112810 66987 -132554 -41626 123262 205972
17999 205972 202454 181892 255447 172454 76969 50189 129146 105748 -11047 43922 38320 120352
17987 120352 206970 34195 62940 204077 224367 283821 233514 145711 197616 174430 250581
17976 250581 228236 85840 -40149 71160 253117 94458 -13590 145847 217020 225502
17966 225502 251528 190676 250222 172942 87467 81764 165225 200158 111153 103771 132422 122853
17954 122853 153190 257397 270489 200821 140146 164976 78833 38028 63404 21407 -29166
$$ packed form
18034H6582p1095K6111M262J11851j751O5329j262j2604k3475k0689n0039n8595
18022E4625P9247j3510L9568M8042k787m9452K215J5124j09053N5677R0087k9343
18010A80440m3497p2218n5079q033N0063O1134m5823j99541R0928J64888Q2710
17999B05972l518k0562P3555q2993r5485k6780P8957k3398j16795N4969n602Q2032
17987A20352Q6618j72775K8745J41137K0290N9454n0307q7803N1905k3186P6151
17976B50581k2345j42396j25989J11309J81957j58659j08048J59437P1173Q482
17966B25502K6026o0852N9546p7280q5475n703Q3461L4933q9005p382K8651r569
17954A22853L0337J04207J3092o9668o0675K4830q6143m0805K5376m1997n0573
$$ plain form
17943 -29166 -88607 -212975 -320085 -272008 -98746 10305 -41385 -89753 28452 9338 -35852
17932 -35852 -53309 -18128 72203 147838 148253 16195 -49882 34566 31054 -4438 -2790 29808
17920 29808 69381 192161 218144 107454 15379 -2757 -129335 -101224 -107223 -56605 18000
17909 18000 66095 88008 20471 50198 47902 1367 47159 15405 -122888 -163770 -132683 -154411
17897 -154411 -196444 -132081 -119356 -233445 -227149 -120255 -90006 -80699 -20793 -83578 -66002
17886 -66002 -4707 -2877 41571 104604 166697 150034 81367 105378 68576 -55345 -135935 79558
17874 79558 205228 97805 12811 21095 36500 175500 186701 173012 175760 139681 85280
17863 85280 129655 244809 164939 74965 -28227 -12866 11579 80190 25184 62434 72367
$$ packed form
17943b9166n9441j24368j07110M8077J73262J09051n1690m8368J18205j9114m5190
17932c5852j7457L5181R0331P5635M15j32058o6077Q4448l512l5492J648L2598
17920B9808L9573J22780K5983j10690r2075j8136j26578K8111n999N0618P4605
17909A8000M8095K1913o7537K9727k296m6535M5792l1754j38293m0882L1087k1728
17897a54411m2033O4363J2725j14089O296J06894L0249R307N9906o2785J7576
17886f6002O1295J830M4448O3033O2093j6663o8667K4011l6802j23921q0590K15493
17874G9558J25670j07423q4994Q284J5405J39000J1201j3689K748l6079n4401
17863H5280M4375J15154p9870q9974j03192J5361K4445O8611n5006L7250R933
$$ plain form
17852 72367 129742 157782 78131 91156 7006 -128531 -245354 -226018 -41544 94458 136939
17841 136939 156460 185056 256210 385219 540015 515156 490004 578511 454870 376927 444273
17830 444273 416941 345969 343262 293604 231909 240790 324300 470121 432547 290640 189105
17819 189105 316798 344501 391471 452596 447454 421224 332737 266310 270564 303582 340584 393436
17807 393436 354193 344045 327099 224715 173820 220068 344656 266402 133043 104394 70770
17796 70770 95443 14196 39600 117862 201956 222202 173018 115523 126998 103892 190021 151066
17784 151066 68265 70685 117103 254417 293868 210279 234076 296547 392731 399506 351761 430839
17772 430839 530934 612492 501605 393836 470441 594189 490235 424643 405881 376117
$$ packed form
17852G2367N7375K8040p9651J3025q4150j35537j16823J9336J84474J36002M2481
17841A36939J9521K8596P1154J29009J54796k4859k5152Q8507j23641p7943O7346
17830D44273k7332p0972k707m9658o1695Q881Q3510J45821l7574j41907j01535
17819A89105J27693K7703M6970O1125n142k6230q8487o6427M254L3018L7002N2852
17807C93436l9243j0148j6946j02384n0895M6248J24588p8254j33359k8649l3624
17796G0770K4673q1247K5404P8262Q4094K0246m9184n7495J1475k3106Q6129l8955
17784A51066q2801K420M6418J37314L9451q3589K3797O2471R6184O775m7745P9078
17772D30839J00095Q1558j10887j07769P6605J23748j03954o5592j8762k9764
$$ plain form
17762 376117 325389 342569 344784 369956 453751 494042 425452 408544 425288 379483 289554 224122
17750 224122 189802 192291 287382 369071 362152 198433 199837 186636 255845 368353 395293 469998
17738 469998 450293 367810 193712 68933 52096 32101 126348 90204 -74185 3819 82022
17727 82022 197699 281094 249255 109046 139237 160060 83548 -6536 99783 171068 172677
17716 172677 174935 161580 151627 255654 239026 178611 178573 144313 167498 168255 258612 356814 258436
17703 258436 232496 304824 402518 445673 362063 275813 327710 276579 223865 175152 78356
17692 78356 119803 156873 266472 331601 407070 413205 441658 655315 716497 538678 420063
17681 420063 329000 350357 372826 344824 240699 246679 212857 174479 157369 150269 227524 310670
$$ packed form
17762C76117n0728J7180K215K5172Q3795M0291o8590j6908J6744m5805q9929o5432
17750B24122l4320K489R5091Q1689o919j63719J404j3201O9209J12508K6940P4705
17738D69998j9705q2483j74098j24779j6837j9995R4247l6144j64389P8004P8203
17727H2022J15677Q3395l1839j40209L0191K0823p6512r0084J06319P1285J609
17716A72677K258j3355r953J04027j6628o0415l8l4260K3185P57R0357R8202r8378
17703B58436k5940P2328R7694M3155q3610q6250N1897n1131n2714m8713r6796
17692G8356M1447L7070J09599O5129P5469O135K8453K13657O1182j77819j18615
17681D20063r1063K1357K2469k8002j04125N980l3822l8378j7110p100P7255Q3146
$$ plain form
17669 310670 308485 310845 260262 229037 100779 117635 175873 257838 289093 360218 281551 280479
17657 280479 353059 366512 397989 355070 258001 299787 291119 318080 363079 436699 481659 533569
17645 533569 441563 312483 381818 447590 352737 360387 510125 437237 345952 384165 333519
17634 333519 313035 318444 277938 277296 291283 301174 358326 370298 336568 243519 194187 131813
17622 131813 68134 116342 266954 243341 196763 278683 453146 512142 515249 534802 418456
17611 418456 332870 271222 168347 125391 223809 280158 351315 536571 564880 472905 398091
17600 398091 411541 517242 575102 626652 635531 501907 423817 372962 472716 545709 734933
17589 734933 741947 880071 962473 973903 820410 588314 433134 356570 393288 367134 317005
$$ packed form
17669C10670k185K360n0583l1225j28258J6856N8238Q1965L1255P1125p8667j072
17657B80479P2580J3453L1477m2919r7069M1786q668K6961M4999P3620M4960N1910
17645E33569r2006j29080O9335O5772r4853P650J49738p2888r1285L8213n0646
17634C33519k0484N409m0506o42J3987R891N7152J1972l3730r3049m9332o2374
17622A31813o3679M8208J50612k3613m6578Q1920J74463N8996L107J9553j16346
17611D18456q5586o1648j02875m2956R8418N6349P1157J85256K8309r1975p4814
17600C98091J3450J05701N7860N1550Q879j33624p8090n0855R9754P2993J89224
17589G34933P014J38124Q2402J1430j53493k32096j55180p6564L6718k6154n0129
$$ plain form
17578 317005 367993 372446 428776 477195 556982 688786 754706 820076 787697 664877 709175
17567 709175 756197 608386 539651 393261 320111 299148 246909 341849 456752 293228 240258
17556 240258 234677 166323 76789 107533 211284 163892 -1769 -39421 115786 312629 401664
17545 401664 414688 327429 212973 205583 317244 276113 217160 91993 78019 192360 270019
17534 270019 293206 201647 143191 190266 253110 295114 197486 117597 131280 182769 133688
17523 133688 88184 41115 122862 380108 598740 714800 720305 655699 576944 606925 704649
17512 704649 574574 360655 223235 190254 191679 189618 197525 240155 183059 276683 478027
17501 478027 409497 359440 280544 141438 150600 175569 249781 370792 294810 122710 -16368
$$ packed form
17578C17005N0988M453N6330M8419P9787J31804O5920O5370l2379j22820M4298
17567G09175M7022j47811o8735j46390p3150k0963n2239R4940J14903j63524n2970
17556B40258n581o8354q9534L0744J03751m7392j65661l7652J55207J96843Q9035
17545D01664J3024q7259j14456p390J11661m1131n8953j25167j3974J14341P7659
17534B70019K3187r1559n8456M7075O2844M2004r7628p9889J3683N1489m9081
17523A33688m5504m7069Q1747K57246K18632J16060N505o4606p8755K9981R7724
17512G04649j30075k13919j37420l2981J425k061P907M2630n7096R3624K01344
17501D78027o8530n0057p8896j39106R162K4969P4212J21011p5982j72100j39078
$$ plain form
17490 -16368 -36098 50894 143127 237159 180110 157792 189118 246322 321760 266339 144534
17479 144534 189076 385479 346159 353154 351263 287132 285872 351898 308854 283636 430606 422756
17467 422756 418194 398600 381332 432169 469508 586296 599455 567615 475911 443871 363666
17456 363666 309791 213244 252866 286439 295108 316372 311730 261764 286245 302487 459934 584349
17444 584349 775094 981645 1409209 1588108 1425762 1222528 995124 835066 751019 517006
17434 517006 269296 279058 267780 222639 87547 177423 328566 336233 338390 449195 565867
17423 565867 544106 510016 476321 532758 474608 422179 319249 316079 455898 579060 585767
17412 585767 568289 472270 465062 462869 390769 363179 387337 490695 474911 486571 600848
$$ packed form
17490a6368j9730Q6992R2233R4032n7049k2318L1326N7204P5438n5421j21805
17479A44534M4542J96403l9320O995j891o4131j260O6026m3044k5218J46970p850
17467D22756m562j9594j7268N0837L7339J16788J3159l1840r1704l2040q0205
17456C63666n3875r6547L9622L3573Q669K1264m642m9966K4481J6242J57447J24415
17444E84349J90745K06551M27564J78899j62346k03234k27404j60058q4047k34013
17434E17006k47710R762j1278m5141j35092Q9876J51143P667K157J10805J16672
17423E65867k1761l4090l3695N6437n8150n2429j02930l170J39819J23162O707
17412E85767j7478r6019p208k193p2100k7590K4158J03358j5784J1660J14277
$$ plain form
17401 600848 595647 666528 716305 771023 753038 702474 661535 681883 649774 680401 919933
17390 919933 1031759 1221219 1244559 1222067 1191225 1153441 1175697 1066129 1101239 1301975 1409915
17379 1409915 1458060 1377046 1276448 1164491 1191859 1148310 981623 1042781 1073327 1188953
17369 1188953 1349795 1475135 1669341 1727466 1890935 2042035 2198145 2349098 2684549 3034516
17359 3034516 3442349 3793052 4413687 5106517 6055154 7195971 8655572 10456880 12131534
17350 12131534 13005671 12806683 11952283 10704596 9612361 9031871 8836096 9213673 10081937
17341 10081937 11263800 12711872 14876493 17703451 21534515 26879910 34795948 46882274
17333 46882274 65287233 90896466 119803283 143077148 153475815 150890701 138409162
$$ packed form
17401F00848n201P0881M9777N4718j7985n0564m0939K0348l2109L0627K39532
17390I19933J11826J89460K3340k2492l0842l7784K2256j09568L5110K00736J07940
17379A409915M8145q1014j00598j11957K7368m3549j66687O1158L0546J15626
17369A188953J60842J25340J94206N8125J63469J51100J56110J50953L35451L49967
17359C034516M07833L50703O20635O92830R48637J140817J459601J801308J674654
17350A2131534Q74137j98988q54400j247687j092235n80490j95775L77577Q68264
17341A0081937J181863J448072K164621K826958L831064N345395P916038J2086326
17333D6882274J8404959K5609233K8906817K3273865J0398667k585114j2481539
$$ plain form
17326 138409162 119271946 97562929 77037193 60101336 47717123 40014513 36138763
17319 36138763 35340490 37782941 43171625 50237796 56241093 57820321 53838202 46091437
17311 46091437 37195978 29225228 23180460 19127881 16328243 14507006 13364247 12803494
17303 12803494 12539138 12461102 12564174 12958989 13650918 14322205 15128334 16310947 18415612
17294 18415612 21710424 26665021 33967223 44049879 56247818 67299538 73110772 72029382
17286 72029382 65955662 58180887 51764712 48304094 48509000 52136224 59723757 72540250
17278 72540250 92990350 123903173 166020960 215055268 260386599 288580705 288716080
17271 288716080 259953563 213026238 162747599 119477538 87137876 64776508 49747500
$$ packed form
17326A38409162j9137216k1709017k0525736j6935857j2384213p702610l875750
17319C6138763p98273K442451N388684P066171O003297J579228l982119p746765
17311D6091437q895459p970750o044768m052579k799638j821237j142759n60753
17303A2803494k64356p8036J03072L94815O91929O71287Q06129J182613K104665
17294A8415612L294812M954597P302202J0082656J2197939J1051720N811234j081390
17286G2029382o073720p774775o416175l460618K04906L627224P587533J2816493
17278G2540250K0450100L0912823M2117787M9034308M5331331K8194106J35375
17271B88716080k8762517m6927325n0278639m3270061l2339662k2361368j5029008
$$ plain form
17264 49747500 39639077 32613410 27854885 24388558 21807012 20466440 19946586 20472820
17256 20472820 22388274 25738956 30083467 33815994 34862351 32366151 27577864 22411005
17248 22411005 17892285 14299453 11722565 9802197 8314718 7185805 6292525 5642385
17240 5642385 5017380 4509449 4125974 3862909 3607372 3451022 3207256 2955879 2736831
17231 2736831 2559341 2520944 2489736 2440353 2329656 2222648 2191054 2233274 2190664 2129526 2149036
17220 2149036 2155465 2123280 2122885 2148828 2069751 1935018 1777428 1599678 1704518 1600294 1494315
17209 1494315 1506342 1632733 1663029 1718280 1761032 1865226 2009086 2085777 2112067 2041690 2090416
17198 2090416 2136180 2064696 2092478 2071660 2027879 1965924 2058324 2307303 2545703 2799962 3232175
$$ packed form
17264D9747500j0108423p025667m758525l466327k581546j340572n19854N26234
17256B0472820J915454L350682M344511L732527J046357k496200m788287n166859
17248B2411005m518720l592832k576888j920368j487479j128913q93280o50140
17240E642385o25005n07931l83475k63065k55537j56350k43766k51377k19048
17231B736831j77490l8397l1208m9383j10697j07008l1594M2220m2610o1138J9510
17220B149036O429l2185l95K5943p9077j34733j57590j77750J04840j04224j05979
17209A494315J2027J26391L0296N5251M2752J04194J43860P6691K6290p0377M8726
17198B090416M5764p1484K7782k0818m3781o1955R2400K48979K38400K54259M32213
$$ plain form
17187 3232175 3774935 4346900 4892611 5343815 5516538 5517818 5430748 5356763 5319952 5352412
17177 5352412 5340410 5432647 5583687 5708321 5958700 6408912 6874246 7667228 8562251 9477333
17167 9477333 10388613 11304926 12412888 13854066 16232391 20024529 25542763 31568829
17159 31568829 35369423 35069062 31705706 27231470 23461584 21147327 20422102 20759957
17151 20759957 22023805 24087971 27009165 31021726 36816306 45159515 57380769 75215782
17143 75215782 102040793 142064632 195481781 251545476 291588563 302173761 282009890
17136 282009890 239257012 188469763 142638437 107396515 83252629 68009260 59106849
17129 59106849 54901142 54112076 56463147 62153602 70451491 78297998 80833697 75455148
$$ packed form
17187C232175N42760N71965N45711M51204J72723J280q7070p3985l6811L2460
17177E352412j2002R2237J51040J24634K50379M50212M65334P92982Q95023R15082
17167I477333R11280R16313J107962J441178K378325L792138N518234O026066
17159C1568829L800594l00361l363356m474236l769886k314257p25225L37855
17151B0759957J263848K064166K921194M012561N794580Q343209J2221254J7835013
17143G5215782K6825011M0023839N3417149N6063695M0043087J0585198k0163871
17136B82009890m2752878n0787249m5831326l5241922k4143886j5243369q902411
17129E9106849m205707p89066K351071N690455Q297889P846507K535699n378549
$$ plain form
17121 75455148 64326538 51447134 39874686 31186007 25047697 20941558 18188700 16229891
17113 16229891 15193046 14841425 14628714 14454995 14205354 13839785 13464315 13447833 14040512
17104 14040512 15224516 17296648 20515651 25506681 32824754 42704201 52967672 59423820
17096 59423820 59414815 54119196 46566762 40030440 36040357 34738902 36603305 41908447
17088 41908447 51667849 67305280 88581140 111686585 133105193 151576474 161511715
17081 161511715 155021023 132819532 103767354 76278970 54874756 40060007 30286297
17074 30286297 23604849 19164703 16157340 14028387 12591487 11705985 11235943 11106314
17066 11106314 11544334 13034474 15297772 18036045 20687991 21958270 21404650 19303416
$$ packed form
17121G5455148j1128610j2879404j1572448q688679o138310m106139k752858j958809
17113A6229891j036845l51621k12711j73719k49641l65569l75470j6482N92679
17104A4040512J184004K072132L219003M991030P318073R879447J0263471O456148
17096E9423820r005n295619p552434o536322l990083j301455J864403N305142
17088D1908447R759402J5637431K1275860K3105445K1418608J8471281R935241
17081A61511715o490692k2201491k9052178k7488384k1404214j4814749r773710
17074C0286297o681448m440146l007363k128953j436900q85502m70042j29629
17066A1106314M38020J490140K263298K738273K651946J270279n53620k101234
$$ plain form
17058 19303416 16299627 13373399 10905393 9031256 7682575 6579642 5796043 5064143
17050 5064143 4421499 4001640 3739120 3798284 3772749 3738196 3729364 3609734 3269591 2942248
17040 2942248 2587659 2475100 2358892 2190432 2124491 2153052 2122230 2108425 2093573 2031222
17030 2031222 1864471 1767282 1890838 1968012 1920334 1875612 1831039 1753176 1876545 2048973
17020 2048973 2157174 2065984 1929552 1998344 1992596 1952825 1957895 1900430 1859063 2000319 2354215
17009 2354215 2719791 3053542 3209837 3311517 3502545 3679228 3511441 3086274 2612091
17000 2612091 2190553 1830082 1581720 1366135 1106630 967652 912539 1040708 1021216 961288
16990 961288 1005822 944661 947489 922602 834705 790379 767952 743051 744106 700094 743115 740254
$$ packed form
17058A9303416l003789k926228k468006j874137j348681j102933p83599p31900
17050E064143o42644m19859k62520N9164k5535l4553q832j19630l40143l27343
17040B942248l54589j12559j16208j68460o5941K8561l0822j3805j4852o2351
17030B031222j66751r7189J23556P7174m7678m4722m4573p7863J23369J72428
17020B048973J08201r1190j36432O8792n748l9771N070n7465m1367J41256L53896
17009B354215L65576L33751J56295J01680J91028J76683j67787m25167m74183
17000B612091m21538l60471k48362k15585k59505j38978n5113J28169j9492n9928
16990I61288M4534o1161K828k4887q7897m4326k2427k4901J055m4012M3021k861
$$ plain form
16978 740254 713005 759249 741256 754195 794657 756217 652728 519748 353936 325004 379372
16967 379372 469084 480564 632294 607088 610123 629723 588791 455034 433473 367192 461734
16956 461734 600892 653297 631459 527850 465399 499540 455383 417010 398728 233332 201172
16945 201172 128494 37421 -54875 -86721 -105956 -130915 -91837 79309 185923 323217 315987
16934 315987 271399 282104 348562 353350 303101 334744 339845 288330 238929 148154 197259 175385
16922 175385 223451 356145 392964 333133 212864 224432 277874 305288 275431 185417 38424
16911 38424 58855 122646 169147 81372 101193 107419 55958 103016 244828 265196 281304 285162
16899 285162 151293 109163 158323 204651 111910 197555 231325 178885 287865 190575 71784
$$ packed form
16978G40254k7249M6244j7993J2939M0462l8440j03489j32980j65812k8932N4368
16967C79372Q9712J1480J51730k5206L035J9600m0932j33757k1561o6281R4542
16956D61734J39158N2405k1838j03609o2451L4141m4157l8373j8282j65396l2160
16945B01172p2678r1073r2296l1846j9235k4959L9078J71146J06614J37294p230
16934C15987m4588J0705O6458M788n0249L1643N101n1515m9401r0775M9105k1874
16922A75385M8066J32694L6819n9831j20269J1568N3442K7414k9857r0014j46993
16911C8424K0431O3791M6501q7775J9821O226n1461M7058J41812K0368J6108L858
16899B85162j33869m2130M9160M6328r2741Q5645L3770n2440J08980r7290j18791
$$ plain form
16888 71784 167417 181863 108994 98858 182330 243592 226463 129157 108603 194842 179933 85190
16876 85190 53902 82143 165508 207950 185008 9548 -9819 114428 64227 72923 208386
16865 208386 243656 124376 141871 233235 187978 178802 185584 295359 258600 177215 130636
16854 130636 21225 28660 69357 252055 350785 283485 195381 126776 107995 131983 220957
16843 220957 131943 117957 134863 186080 199197 344099 473441 473867 489346 510361 491548
16832 491548 548252 578330 561400 639210 717145 641311 655767 577354 395534 400139 412938
16821 412938 432588 517172 600820 652565 574735 464031 586224 639992 592200 618757 654990
16810 654990 665912 589629 486748 413555 343066 312418 287781 384082 447921 454278 379128
$$ packed form
16888G1784R5633J4446p2869j0136Q3472O1262j7129r7306k0554Q6239j4909r4743
16876H5190l1288K8241Q3365M2442k2942j75460j9367J24247n0201Q696J35463
16865B08386L5270j19280J7495R1364m5257r176O782J09775l6759q1385m6579
16854A30636j09411P435M0697J82698R8730o7300q8104o8605j8781K3988Q8974
16843B20957q9014j3986J6906N1217J3117J44902J29342M26J5479K1015j8813
16832D91548N6704L0078j6930P7810P7935p5834J4456p8413j81820M605J2799
16821D12938J9650Q4584Q3648N1745p7830j10704J22193N3768m7792K6557L6233
16810F54990J0922p6283j02881p3193p0489l0648k4637R6301O3839O357p5150
$$ plain form
16799 379128 293769 188627 295186 344992 263567 219228 188715 179074 140613 148617 142155 162648
16787 162648 196787 250490 259953 261711 304781 344393 321900 281613 107821 132224 300136
16776 300136 313167 178422 143135 295117 341122 303650 308461 195352 161552 222037 328761
16765 328761 436599 472144 501509 510171 520986 343399 245506 213815 202205 264287 240250
16754 240250 305519 451557 358848 276013 296776 378434 249732 232719 282612 391185 338048
16743 338048 111785 114340 1371 14242 32298 56310 120512 164495 269995 263880 140878
16732 140878 -59756 -158400 -72411 -61111 -29332 -3283 -54496 33504 11300 6665 48941
16721 48941 30463 -75107 -135594 -68316 -18550 -22915 -130290 7282 14238 -118384 -97974
$$ packed form
16799C79128q5359j05142J06559M9806q1425m4339l0513r641l8461Q004o462K0493
16787A62648L4139N3703R463J758M3070L9612k2493m0287j73792K4403J67912
16776C00136J3031j34745l5287J51982M6005l7472M811j13109l3800O0485J06724
16765C28761J07838L5545K9365Q662J0815j77587r7893l1691j1610O2082k4037
16754B40250O5269J46038r2709q2835K0763Q1658j28702j7013M9893J08573n3137
16743C38048k26263K555j12969J2871J8056K4012O4202M3983J05500o115j23002
16732A40878k00634r8644Q5989J1300L1779K6049n1213Q8000k2204m635M2276
16721D8941j8478j05570o0487O7278M9766m365j07375J37572O956j32622K0410
$$ plain form
16710 -97974 -16816 68958 -15476 -20151 51390 24939 -161844 -194191 -227831 -174856 -111736 -95004
16698 -95004 89660 111368 119956 80730 77991 170554 86877 -41585 62837 87700 72135
16687 72135 68367 148546 120762 89749 82225 6583 -11106 -27433 41875 89799 75088 154965
16675 154965 115743 45111 -67973 -131677 -231130 -228267 -146031 -27096 16285 -61217 61289
16664 61289 164031 62408 81665 112135 210080 297710 320358 298027 323165 447924 456305
16653 456305 432189 479342 520038 433907 391485 372519 368811 423765 449785 435616 435703 441614
16641 441614 439751 578075 652411 622466 665633 622119 618308 481128 326586 259611 203428
16630 203428 193698 142853 122923 229289 333868 346896 489047 435965 315958 305043 251599
$$ packed form
16710i7974Q1158Q5774q4434m675P1541k6451j86783l2347l3640N2975O3120J6732
16698i5004J84664K1708Q588l9226k739R2563q3677j28462J04422K4863j5565
16687G2135l768Q0179k7784l1013p524p5642j7689j6327O9308M7924j4711P9877
16675A54965l9222p0632j13084o3704r9453K863Q2236J18935M3381p7502J22506
16664F1289J02742j01623J9257L0470R7945Q7630K2648k2331K5138J24759Q381
16653D56305k4116M7153M0696q6131m2422j8966l708N4954K6020j4169Q7N911
16641D41614j863J38324P4336k9945M3167m3514l811j37180j54542o6975n6183
16630B03428r730n0845j9930J06366J04579J3028J42151n3082j20007j0915n3444
$$ plain form
16619 251599 227823 134674 28628 46598 177426 118725 154314 256437 196745 61270 -22033
16608 -22033 23580 217648 315294 397970 444553 335294 196349 181302 293208 428523 487783
16597 487783 519652 637297 622781 481384 462886 449678 408636 461905 452560 284805 214730
16586 214730 311830 327564 361486 343965 418559 496672 424566 438004 439242 294092 285637 330066
16574 330066 346743 316074 281704 295808 223398 212832 265548 155866 79319 52060 36070
16563 36070 -51683 -43197 -49005 52386 90225 -35630 -130489 -113420 -108918 -104177 -154316 -20811
16551 -20811 156715 272888 283927 245604 125848 42467 130771 193735 93219 -43559 -12006
16540 -12006 118654 80122 95374 50060 -17031 13501 -28715 -57381 -21585 -55094 -41872
$$ packed form
16619B51599k3776r3149j06046J7970J30828n8701L5589J02123n9692j35475q3303
16608b2033M5613J94068R7646Q2676M6583j09259j38945j5047J11906J35315N9260
16597D87783L1869J17645j4516j41397j8498j3208m1042N3269r345j67755p0075
16586B14730R7100J5734L3922j7521P4594P8113p2106J3438J238j45150q455M4429
16574C30066J6677l0669l4370J4104p2410j0566N2716j09682p6547k7259j5990
16563C6070q7753Q486n808J01391L7839j25855r4859J7069M502M741n0139J33505
16551b0811J77526J16173J1039l8323j19756q3381Q8304O2964j00516j36778L1553
16540a2006J30660l8532J5252m5314o7091L0532m2216k8666L5796l3509J3222
$$ plain form
16529 -41872 -95038 -124047 -149547 -158430 -140671 -157517 -148446 -70298 -68819 -195646 -138625 -36160
16517 -36160 -26669 -79186 -58362 -4130 -46058 35576 95928 94900 94667 -62981 -110189 10325
16505 10325 62267 23244 -14992 -40452 -12769 14438 53818 -134905 -304679 -336737 -372511
16494 -372511 -303147 -224785 -152005 -73338 -139516 -215169 -60573 -40387 -84844 -153783 -144568
16483 -144568 -52499 24856 50574 53613 63670 -7360 -148019 -94230 -29753 -27348 92417
16472 92417 59441 11652 31806 109066 135978 126056 23269 -41059 -62498 22705 -10833 -93000
16460 -93000 -52487 84960 120898 48886 165767 7514 -62858 36217 3268 38060 25928
16449 25928 -15978 -21975 81408 28937 -148596 -164839 -134434 -111966 -127691 -221222 -206828
$$ packed form
16529d1872n3166k9009k5500q883J7759j6846R071P8148J479j26827N7021J02465
16517c6160R491n2517K0824N4232m1928Q1634O0352j028k33j57648m7208J20514
16505A0325N1942l9023l8236k5460K7683K7207L9380j88723j69774l2058l5774
16494c72511O9364P8362P2780P8667o6178p5653J54596K0186m4457o8939R215
16483a44568R2069P7355K5718L039J0057p1030j40659N3789O4477K405J19765
16472I2417l2976m7789K0154P7260K6912r922j02787o4328k1439Q5203l3538q2167
16460i3000M0513J37447L5938p2012J16881j58253p0372R9075l2949L4792j2132
16449B5928m1906n997J03383n2471j77533j6243L0405K2468j5725r3531J4394
$$ plain form
16438 -206828 -165107 -159144 -83468 -61232 -27033 -114585 -126076 -111702 -154468 -192381 -62652
16427 -62652 -31683 -101444 -92461 -111229 -86971 -127298 -166186 -225065 -158456 -106314 -164963 -80265
16415 -80265 -47342 -23224 -66576 -10575 8524 -65849 -14095 -29243 -95043 23044 119992
16404 119992 77471 106236 -56395 -927 9976 4980 11472 -1217 24728 -30153 -113064 -134310
16392 -134310 -110103 22747 139759 93667 31632 -7798 29309 72094 205085 282480 317599
16381 317599 335899 409387 327447 262349 163419 -47941 -50523 -55347 -59455 -112971 -98279 -38951
16369 -38951 -62681 46840 83105 167979 120493 -27453 -2728 -30584 -35044 68043 123798
16358 123798 35720 -15801 19587 39977 115402 88561 27411 -115697 -147466 -193186 -214268
$$ packed form
16438b06828M1721N963P5676K2236L4199q7552j1491J4374m2766l7913J29729
16427f2652L0969o9761Q983j8768K4258m0327l8888n8879O6609N2142n8649Q4698
16415h0265L2923K4118m3352N6001J9099p4373N1754j5148o5800J18087R6948
16404A19992m2521K8765j62631N5468J0903m996O492j2689K5945n4881q2911k1246
16392a34310K4207J32850J17012m6092o2035l9430L7107M2785J32991P7395L5119
16381C17599J8300P3488q1940o5098r8930k11360k582m824m108n3516J4692N9328
16369c8951k3730J09521L6265Q4874m7486j47946K4725k7856m460J03087N5755
16358A23798q8078n1521L5388K0390P5425k6841o1150j43108l1769m5720k1082
$$ plain form
16347 -214268 -152822 -196704 -270542 -193949 -189710 -164782 -46240 -60675 750 120057 64594
16336 64594 -53241 -22844 81383 2993 -97786 -160333 -62041 -813 27979 82186 266
16325 266 -130763 -84954 -64612 -44117 13493 -10128 -69609 17663 106292 52032 -116285 -92952
16313 -92952 -95240 -107620 -50603 -36858 -221708 -272688 -83729 -51992 -138052 -84792 44924
16302 44924 96983 112902 177855 156080 132336 29929 19071 -64317 -14641 195549 246564
16291 246564 166028 96923 108651 37455 -26700 18036 41315 -16253 -31717 104004 116728
16280 116728 132720 158694 159162 69417 64093 20531 -14648 -126915 -96994 -115194 -233016 -198590
16268 -198590 -168494 -170865 -123769 -52301 -80132 33222 9254 76487 47832 -45375 -117236
$$ packed form
16347b14268O1446m3882p3838P6593M239K4928J18542j4435O1425J19307n5463
16336F4594j17835L0397J04227p8390j00779o2547R8292O1228K8792N4207q1920
16325B66j31029M5809K0342K0495N7610k3621n9481Q7272Q8629n4260j68317K3333
16313i2952k288j2380N7017J3745j84850n0980J88959L1737q6060N3260J29716
16302D4924N2059J5919O4953k1775k3744j02407j0858q3388M9676K10190N1015
16291B46564q0536o9105J1728p1196o4155M4736K3279n7568j5464J35721J2724
16280A16728J5992K5974M68q9745n324m3562l5179j12267K9921j8200j17822L4426
16268a98590L0096k371M7096P1468k7831J13354k3968O7233k8655r3207p1861
$$ plain form
16257 -117236 -103141 -11833 102168 -594 -24578 -55395 101279 164610 70129 6174 -86931
16246 -86931 -69606 -93558 -153278 -199897 -112929 61331 113479 6409 -64333 -147351 -93772
16235 -93772 -6037 -90297 -124941 -133412 -148104 -215210 -238153 -166000 -120568 -185006 -163172 -175686
16223 -175686 -90111 -80914 -135495 -114569 -109048 2745 4993 68863 61335 57677 30992 -35168
16211 -35168 -133020 -64493 64770 -48140 -52766 100936 41282 -138098 -236954 -222115 -134999
16200 -134999 -126446 -138086 -12821 69757 50249 8574 -36993 -92165 -57017 28046 38179
16189 38179 -13264 -41235 -46250 -6848 97517 151476 76104 -17652 -84521 -124213 -79085 -58865
16177 -58865 8313 -63439 -135527 -102480 -127487 -190210 -93234 -115703 -128552 -95657 -90862 -43075
$$ packed form
16257a17236J4095R1308J14001j02762k3984l0817J56674O3331r4481o3955r3105
16246h6931J7325k3952n9720m6619Q6968J74260N2148j07070p0742q3018N3579
16235i3772Q7735q4260l4644q471j4692o7106k2943P2153M5432o4438K1834j2514
16223a75686Q5575R197n4581K0926N521J11793K248O3870p528l658k6685o6160
16211c5168r7852O8527J29263j12910m626J53702n9654j79380r8856J4839Q7116
16200a34999Q553j1640J25265Q2578j9508m1675m5567n5172L5148Q5063J0133
16189C8179n1443k7971n015L9402J04365N3959p5372r3756o6869l9692M5128K0220
16177e8865O7178p1752p2088L3047k5007o2723R6976k2469j2849L2895M795M7787
$$ plain form
16165 -43075 84635 26726 -7028 -45765 -6673 -34987 -50805 -72047 -15950 3057 -53626
16154 -53626 30673 -4726 -9174 -34539 47514 163738 35534 -78209 -164883 -220943 -189359
16143 -189359 -130084 44319 189785 233656 177300 -177 19091 64652 12656 60317 132991
16132 132991 112791 130034 162153 83928 82937 61829 -53370 10752 92406 58713 100774 149973
16120 149973 293354 242964 108954 114597 106034 -68305 -121049 77595 20603 -15953 -75602
16109 -75602 -149073 -186718 -94225 -109505 -32864 43409 58914 26349 -172494 -193893 -145435
16098 -145435 -119544 7 48484 43236 40519 17181 50674 27897 52221 236631 314240
16087 314240 201382 106577 160469 71782 -42018 -28309 48093 18571 -26248 -147648 -247854
$$ packed form
16165d3075J27710n7909l3754l8737L9092k8314j5818k1242N6097J9007n6683
16154e3626Q4299l5399m448k5365Q2053J16224j28204j13743q6674n6060L1584
16143a89359N9275J74403J45466M3871n6356j77477J9268M5561n1996M7661P2674
16132A32991k0200J7243L2119p8225r91k1108j15199O4122Q1654l3693M2061M9199
16120A49973J43381n0390j34010N643q563j74339n2744J98644n6992l6556n9649
16109g5602p3471l7645R2493j5280P6641P6273J5505l2565j98843k1399M8458
16098a45435K5891J19551M8477n248k717k3338L3493k2777K4324J84410P7609
16087C14240j12858r4805N3892q8687j13800J3709P6402k9522m4819j21400j00206
$$ plain form
16076 -247854 -241418 -50696 90149 211671 237987 134568 -48677 -109971 -163114 -199432 -59746
16065 -59746 22625 -52287 -174258 -200818 -111317 -40320 -518 63108 153491 136151 90296
16054 90296 -7146 -26910 -34715 -17429 -120592 -144373 -191328 -91193 -37668 17130 134734
16043 134734 267628 267839 173713 98649 71511 79982 74971 34451 -95461 -65070 -51802 26704
16031 26704 65515 27955 39741 95346 30712 93432 141456 27046 -100462 -86299 -52515
16020 -52515 -86041 -89102 -134660 -173056 -137219 -217607 -175538 -32865 604 76761 137855 229580
16008 229580 152042 -34144 -46305 81941 164540 171325 155579 75655 -2082 -106395 -135632
15997 -135632 -128415 -76330 -114624 -126182 -51979 -89018 -40832 -44632 -75837 -108132 -73890 -93295
$$ packed form
16076b47854O436J90722J40845J21522K6316j03419j83245o1294n3143l6318J39686
16065e9746Q2371p4912j21971k6560Q9501P0997L9802O3626R0383j7340m5855
16054I0296r7442j9764p805J7286j03163k3781m6955J00135N3525N4798J17604
16043A34734J32894K11r4126p5064k7138Q471n011m0520j29912L0391J3268P8506
16031B6704L8811l7560J1786N5605o4634O2720M8024j14410j27508J4163L3784
16020e2515l3526l061m5558l8396L5837q0388M2069J42673L3469P6157O1094R1725
16008B29580p7538j86186j2161J28246Q2599O785j5746p9924p7737j04313k9237
15997a35632P217N2085l8294j1558P4203l7039M8186l800l1205l2295L4242j9405
$$ plain form
15985 -93295 -14471 -117631 -240596 -199253 -80876 -22195 31126 73228 73002 -1146 -95249
15974 -95249 -111021 -16037 -83955 -18809 -2681 -6545 42697 121623 106847 60909 116415 86568
15962 86568 93962 23841 -4798 54400 84235 85034 71599 16685 -34354 -14396 -108817 -204967
15950 -204967 -171803 -62283 -60866 -21392 79904 9615 -26173 -35751 22816 57650 79035
15939 79035 136606 197904 155293 117919 120560 177224 103948 9128 -74304 -26763 50810 -4361
15927 -4361 6092 -19179 -91170 -22770 -28543 -55938 -185710 -209074 -100833 -125706 -116895 -98298
15915 -98298 -64654 -26853 61745 -14100 -74136 -40438 65771 81983 73297 -38515 17189
15904 17189 95168 91236 -23114 -44465 -19300 36168 -52995 -152373 -59222 -88504 -97347 -46286
$$ packed form
15985i3295P8824j03160j22965M1343J18377N8681N3321M2102k26p4148r4103
15974i5249j5772R4984o7918O5146J6128l864M9242P8926j4776m5938N5506k9847
15962H6568P394p0121k8639N9198K9835P99j3435n4914n1039J9958r4421r6150
15950b04967L3164J09520J417L9474J01296p0289l5788r578N8567L4834K1385
15939G9035N7571O1298m2611l7374K641N6664p3276r4820q3432M7541P7573n5171
15927d361J0453k5271p1991O8400n773k7395j29772k3364J08241k4873Q811J8597
15915i8298L3644L7801Q8598p5845o0036L3698J06209J6212q686j11812N5704
15904A7189P7979l932j14350k1351K5165N5468q9163r9378R3151k9282q843N1061
$$ plain form
15892 -46286 -1415 5071 -33751 -119929 -250652 -185551 -115822 -53761 -57194 -99221 7402 14700
15880 14700 -25181 10167 -21602 -28847 51321 126653 165868 186424 143400 183191 218657 116356
15868 116356 64969 44116 89273 136610 -40279 -123302 -67103 -151078 -136258 -74080 29036
15857 29036 87147 71518 -6849 -128996 -173043 -43327 -69891 -116519 -29093 54326 3206
15846 3206 -59151 -74724 -121593 -218141 -180469 -179337 -178631 -28420 91916 109340 16497 -216137
15834 -216137 -237363 -96381 -24968 -30385 60681 173010 94719 -35991 -51118 -27948 105361
15823 105361 48948 126064 137228 40240 -36406 -44212 -201240 -248276 -11775 116169 136805
15812 136805 122637 174017 119264 -9175 8490 4881 17481 85575 74836 -37647 -111292
$$ packed form
15892d6286M4871O486l8822q6178j30723O5101O9729O2061l433m2027J06623P298
15880A4700l9881L5348l1769p245Q0168P5332L9215K0556m3024L9791L5466j02301
15868A16356n1387k0853M5157M7337j76889q3023N6199q3975J4820O2178J03116
15857B9036N8111j5629p8367j22147m4047J29716k6564m6628Q7426Q3419n1120
15846C206o2357j5573m6869r6548L7672J132P06J50211J20336J7424r2843k32634
15834b16137k1226J40982P1413n417R1066J12329p8291j30710j5127K3170J33309
15823A05361n6413P7116J1164r6988p6646p806j57028m7036K36501J27944K0636
15812A36805j4168N1380n4753j28439J7665l609J2600O8094j0739j12483p3645
$$ plain form
15801 -111292 38973 77129 131506 190362 89603 -45685 -149313 -223796 -210383 -228354 -267963
15790 -267963 -208458 -23633 -3857 -29746 33298 92316 -2288 28438 87282 102255 77222
15779 77222 -11849 -17730 -100440 -117384 -58769 -113589 -179043 -145368 -76622 -72892 6359 46539
15767 46539 24405 97055 139989 216696 163631 229913 213693 -126866 -195077 -133066 -108273
15756 -108273 -68624 -181600 -213482 -215849 -193834 -127859 -66956 11210 -21206 52144 35598
15745 35598 -2129 -24783 42399 -59784 -140670 -107979 59522 169103 106799 2917 -70324
15734 -70324 -55734 40305 89667 21923 -85992 -30027 -6592 -22149 -36444 -15760 -66485
15723 -66485 -14801 33245 32910 -93789 -6581 125940 250903 94935 54632 40208 116476
$$ packed form
15801a11292J50265L8156N4377N8856j00759j35288j03628p4483J3413j7971l9609
15790b67963N9505J84825J9776k5889O3044N9018r4604L0726N8844J4973k5033
15779G7222q9071n881q2710j6944N8615n4820o5454L3675O8746L730P9251M0180
15767D6539k2134P2650M2934P6707n3065O6282j6220l40559o8211O2011K4793
15756a08273L9649j12976l1882k367K2015O5975O0903P8166l2416P3350j6546
15745C5598l7727k2654O7182j02183q0886L2691J67501J09581o2304j03882p3241
15734g0324J4590R6039M9362o7744j07915N5965K3435j5557j4295K0684n0725
15723f6485N1684M8046l35j26699Q7208J32521J24963j55968m0303j4424P6268
$$ plain form
15712 116476 66040 21759 -19466 -27718 -107479 -66289 -71437 -87767 -96640 24671 59610 -56776
15700 -56776 -62884 44951 203432 215124 202259 176666 48788 -5943 27458 69396 -812
15689 -812 -46677 -40487 -102001 -189002 -101931 -47282 35177 45828 101207 235278 226341 66535
15677 66535 -902 126576 138588 86598 -3865 47818 110850 154116 162740 66385 -122679
15666 -122679 -149954 -146895 -204903 -280594 -201723 -46200 79435 13330 -138732 -192993 -199425
15655 -199425 -98251 -22841 -59092 -23629 -9087 -69829 -43704 72713 -33316 -151332 -212443
15644 -212443 -237026 -129797 10005 31554 76932 59103 64888 111897 203265 221553 180789
15633 180789 189831 103172 -3554 -50920 -25981 67228 111995 46650 -108733 -153823 -137479
$$ packed form
15712A16476n0436m4281m1225q252p9761M1190n148j6330q873J21311L4939j16386
15700e6776o108J07835J58481J1692j2865k5593j27878n4731L3401M1938p0208
15689h12m5865O190o1514q7001Q7071N4649Q2459J0651N5379J34071q937j59806
15677F6535o7437J27478J2012n1990r0463N1683O3032M3266Q624r6355j89064
15666a22679k7275L059n8008p5691P8871J55523J25635o6105j52062n4261o432
15655a99425J01174P5410l6251L5463J4542o0742K6125J16417j06029j18016o1111
15644b12443k4583J07229J39802K1549M5378j7829N785M7009R1368J8288m0764
15633A80789R042q6659j06726m7366K4939R3209M4767o5345j55383m5090J6344
$$ plain form
15622 -137479 14831 121861 213543 224805 70233 -33740 -81107 -24949 19728 -109840
15612 -109840 -183196 -183951 -166922 -74290 -87696 -134961 -34512 398 -19906 -61666 -60764 -40865
15600 -40865 84117 220259 178998 14190 8961 68680 10018 -9468 56162 119471 220499
15589 220499 328652 342833 335284 275514 190622 193050 104809 193458 176080 84940 155712 209367
15577 209367 178945 29722 -87683 -154998 -96671 -106676 -55934 46820 76456 172772 171518
15566 171518 153654 50302 -38842 844 -64704 -32188 -72966 6716 67647 148906 151759
15555 151759 29245 -100725 -78475 20335 198236 336745 296610 192795 63976 -14299
15545 -14299 107252 215984 246173 193419 22721 -26518 -30369 13732 56741 15211 10478
$$ packed form
15622a37479J52310J07030R1682J1262j54572j03973m7367N6158M4677j29568
15612a09840p3356p55J7029R2632j3406m7265J00449L4910k0304m1760R02J9899
15600d0865J24982J36142m1261j64808n229N9719n8662j9486O5630O3309J01028
15589B20499J08153J4181p549n9770q4892K428q8241Q8649j7378r1140P0772N3655
15577B09367l0422j49223j17405o7315N8327j0005N0742J02754K9636R6316j254
15566A71518j7864j03352q9144L9686o5548L2516m0778P9682O0931Q1259K853
15555A51759j22514j29970K2250R8810J77901J38509m0135j03815j28819p8275
15545a4299J21551J08732L0189n2754j70698m9239l851M4101M3009m1530m733
$$ plain form
15534 10478 20634 -13233 45643 162887 270898 254533 166058 189435 109822 36973 149009
15523 149009 171328 189905 204099 83368 -5837 -37995 -113951 -89941 -28048 -37704 -52619
15512 -52619 30309 129865 49967 -51139 -65035 -56734 -88575 -63269 26324 153614 187508
15501 187508 120726 25656 22774 -80768 -120115 -152030 -177407 -166797 -98275 1776 -22898
15490 -22898 -87484 -102829 -40884 154069 198498 155292 62919 104253 85567 42653 97854
15479 97854 69005 25648 33768 -26535 56945 146666 69110 65934 13425 -202 -7570 40269
15467 40269 37127 -43251 -85106 -92605 22550 143921 92778 31063 -68836 -99674 -84408 -51733
15455 -51733 -185677 -226274 -75037 -171088 -65637 11260 11457 9976 20975 95775 236179
$$ packed form
15534A0478J0156l3867N8876J17244J08011j6365q8475K3377p9613p2849J12036
15523A49009K2319J8577J4194j20731q9205l2158p5956K4010O1893r656j4915
15512e2619Q2928R9556p9898j01106j3896Q301l1841K5306Q9593J27290L3894
15501A87508o6782r5070k882j03542l9347l1915k5377J0610O8522J00051k4674
15490b2898o4586j5345O1945J94953M4429m3206r2373M1334j8686m2914N5201
15479I7854k8849m3357Q120o0303Q3480Q9721p7556l176n2509j3627p368M7839
15467D0269l142q0378m1855p499J15155J21371n1143o1715r9899l0838J5266L2675
15455e1733j33944m0597J51237r6051J05451P6897J97j481J0999P4800J40404
$$ plain form
15444 236179 262361 180706 145378 118507 15841 -56111 -83837 -140920 -67214 -54616 -110837
15433 -110837 -148253 -156058 -143537 -128218 -96578 -42210 58138 117301 148679 115194 74652
15422 74652 154056 173092 -44134 52554 137187 124113 244618 249094 248468 154384 87141 -1079
15410 -1079 38468 167804 202414 196033 69825 11226 -53610 -105603 -163869 -149248 -33568
15399 -33568 -99647 -108420 -86701 -150463 -149303 -84589 -67052 -73058 72326 138756 32610 -223846
15387 -223846 -220259 -134252 -125860 -56909 -34343 -72518 -110705 -44824 39259 33226 42516 210299
15375 210299 212937 216866 258949 132214 173679 254863 167173 29674 -109577 -158901 -53023
15364 -53023 74229 174482 26716 -51280 35377 121757 33379 7423 199714 309613 266119
$$ packed form
15444B36179K6182q1655l5328k6871j02666p1952k7726n7083P3706J2598n6221
15433a10837l7416p805J2521J5319L1640N4368J00348N9163L1378l3485m0542
15422G4652P9404J9036k17226R6688Q4633j3074J20505M476o26r4084o7243q8220
15410a079L9547J29336L4610o381j26208n8599o4836n1993n8266J4621J15680
15399c3568o6079q773K1719o3762J160O4714J7537o006J45384O6430j06146k56456
15387b23846L587Q6007Q392O8951K2566l8175l8187O5881Q4083o033R290J67783
15375B10299K638L929M2083j26735M1465Q1184q7690j37499j39251m9324J05878
15364e3023J27252J00253j47766p7996Q6657Q6380q8378k5956J92291J09899m3494
$$ plain form
15353 266119 137347 54009 -12810 42025 186827 221530 75064 41554 63000 6594 -19021
15342 -19021 163108 245315 194796 28260 -18564 -23511 36059 40302 105455 42772 -5159 102531
15330 102531 143257 99670 72088 63253 38360 128544 180720 103803 69814 -51567 -75823
15319 -75823 -69858 -131522 -90921 92025 221863 258057 231589 241482 216664 117002 -9057
15308 -9057 10954 75919 60255 -9180 92491 122114 187197 224292 145175 163600 232727 248869
15296 248869 316904 295050 277649 319962 356582 299542 205315 221439 92548 58950 76746
15285 76746 130831 116317 108169 135668 190212 216611 346385 374831 368355 195325 30342
15274 30342 -43191 -16276 -31470 -71344 26607 39535 19736 146763 196215 141563 179589
$$ packed form
15353B66119j28772q3338o6819N4835J44802L4703j46466l3510K1446n6406k5615
15342a9021J82129Q2207n0519j66536m6824m947N9570M243O5153o2683m7931J07690
15330A02531M0726m3587k7582q835k4893R0184N2176p6917l3989j21381k4256
15319g5823N965o1664M0601J82946J29838L6194k6468R893k4818r9662j26059
15308i057K0011O4965j5664o9435J01671K9623O5083L7095p9117J8425O9127J6142
15296B48869O8035k1854j7401M2313L6620n7040r4227J6124j28891l3598J7796
15285G6746N4085j4514q148K7499N4544K6399J29774K8446o476j73030j64983
15274C0342p3533K6915j5194l9874R7951J2928j9799J27027M9452n4652L8026
$$ plain form
15263 179589 61903 -131930 -109863 -108710 -882 114765 126657 184147 172454 156097 126363
15252 126363 52392 112880 23732 28520 10358 64540 82648 -505 -176125 -141302 -66553
15241 -66553 -10659 -45013 -38536 18113 39570 31082 189780 160665 116733 97523 91846 -3382
15229 -3382 10743 76704 217463 246404 238529 160596 -31060 -36961 -110779 -62418 39519 81887
15217 81887 148364 157301 173640 64932 -180264 -179801 -161208 -184408 -157881 -121828 33895 113198
15205 113198 91606 -53367 -116852 -65974 114788 165813 111926 37058 92189 107236 56337
15194 56337 52830 -53678 14542 115004 -11696 -59051 -86134 6099 -63024 -143818 -45802
15183 -45802 -48672 -146338 -117736 -69506 -95702 -259860 -231539 -292790 -315121 -216460 -53762
$$ packed form
15263A79589j17686j93833K2067J153J07828J15647J1892N7490j1693j6357k9734
15252A26363p3971O0488q9148M788j8162N4182J8108q3153j75620L4823P4749
15241f6553N5894l4354O477N6649K1457q488J58698k9115m3932j9210n677r5228
15229c382J4125O5961J40759K8941p875p7933j91656n901p3818M8361J01937M2368
15217H1887O6477Q937J6339j08708k45196M63J8593k3200K6527L6053J55723P9303
15205A13198k1592j44973o3485N0878J80762N1025n3887p4868N5131J5047n0899
15194E6337l507j06508O8220J00462j26700m7355k7083R2233o9123q0794R8016
15183d5802k870r7666K8602M8230k6196j64158K8321o1251k2331R8661J62698
$$ plain form
15172 -53762 46725 -3821 -30025 -28377 13159 -24342 -89407 -73423 -221 36618 71740 127402
15160 127402 -34291 -91939 -2787 68720 224456 335895 295493 92867 54223 17051 -97272
15149 -97272 -34204 -27619 49951 26218 65542 78197 119552 97885 43761 5055 26114 3611
15137 3611 -26706 62695 146880 -8886 -115387 -119220 -20747 37905 -33783 -94495 -102039 -59593
15125 -59593 -52830 -111230 -117478 4725 40410 8432 16031 30937 127349 55695 -71028 -198593
15113 -198593 -201691 -100948 -11014 -15163 -40377 -42892 -36265 66370 48056 -57172 -55228 96219
15101 96219 87661 198939 276246 288313 162721 50616 84538 89844 -14369 -51765 18734
15090 18734 -26318 39501 73609 162982 153159 21285 44289 80649 26286 7904 -16350 2323
$$ packed form
15172e3762J00487n0546k6204J648M1536l7501o5065J5984P3202L6839L5122N5662
15160A27402j61693n7648Q9152P1507J55736J11439m0402k02626l8644l7172j14323
15149i7272O3068O585P7570k3733L9324J2655M1355k1667n4124l8706K1059k2503
15137C611l0317Q9401Q4185j55766j06501l833R8473N8652p1688o0712p544M2446
15125e9593O763n8400o248J22203L5685l1978P599J4906R6412p1654j26723j27565
15113a98593l098J00743Q9934m149k5214k515O627J02635j8314j05228J944J51447
15101I6219q558J11278P7307J2067j25592j12105L3922N306j04213l7396P0499
15090A8734m5052O5819L4108Q9373r823j31874K3004L6360n4363j8382k4254J8673
$$ plain form
15078 2323 37847 5319 -6718 -59335 -48589 1335 -18658 84420 235691 98030 -100268
15067 -100268 -220451 -238985 -206792 -92587 -27540 -80556 -68081 -115710 -122956 -78097 -102356
15056 -102356 -93191 -185427 -236917 -64584 41264 93235 209958 273959 286635 257149 199642
15045 199642 107889 12582 -97390 -66529 -128236 -132953 -101371 -92020 35288 143758 118851
15034 118851 36244 -16783 22090 24216 144 -155889 -237178 -181428 -102272 -112399 -264897
15023 -264897 -286348 -203143 -73216 87034 150368 118334 114922 128048 76187 59712 144208
15012 144208 68722 62636 15649 -29608 13896 56454 99317 199528 220629 121667 103680
15001 103680 54705 132265 69101 29910 131245 65587 -28843 -22342 -21628 51636 92814 99852
$$ packed form
15078B323L5524l2528j2037n2617J0746M9924j9993J03078J51271j37661j98298
15067a00268j20183j8534L2193J14205O5047n3016J2475m7629p246M4859k4259
15056a02356R165r2236n1490J72333J05848N1971J16723O4001J2676k9486n7507
15045A99642r1753r5307j09972L0861o1707m717L1582R351J27308J08470k4907
15034A18851q2607n3027L8873K126k4072j56033q1289N5750P9156j0127j52498
15023b64897k1451Q3205J29927J60250O3334l2034l412J3126n1861j6475Q4496
15012A44208p5486o086m6987m5257M3504M2558M2863J00211K1101r8962j7987
15001A03680m8975P7560o3164l9191J01335o5658r4430O501P14P3264M1178P038
$$ plain form
14989 99852 170465 165912 5209 -75774 -35221 -124981 -174188 -76777 -57948 -80546 -77521 -82081
14977 -82081 -43766 -131728 -188443 -246544 -155735 -8778 63556 36845 79425 94311 90631 124683
14965 124683 114904 42939 -36496 5997 143035 96921 121113 78137 -62698 -44068 38326
14954 38326 84288 84899 39190 -207700 -94789 116593 209021 181089 130632 9808 -43352
14943 -43352 -38637 -120920 -148265 -158136 -106937 -32457 -59744 -63949 55801 196771 170684 142054
14931 142054 31920 -70665 -110522 -140404 -96546 -100564 -121986 -120617 -11316 -13955 -8697 13664
14919 13664 -64087 -87346 -181243 -10404 153866 133149 118349 131754 45074 -202549 -203716
14908 -203716 -147053 477 -267 -162505 -133636 -3303 18647 -31580 -141759 -54498 -20245
$$ packed form
14989I9852P0613m553j60703q0983M0553q9760m9207R7411J8829k2598L025m560
14977h2081L8315q7962n6715n8101R0809J46957P2334k6711M2580J4886l680L4052
14965A24683r779p1965p9435M2493J37038m6114K4192m2976j40835J8630Q2394
14954C8326M5962O11m5709k46890J12911K11382R2428k7932n0457j20824n3160
14943d3352M715q2283k7345r871N1199P4480k7287m205J19750J40970k6087k8630
14931A42054j10134j02585l9857k9882M3858m018k1422J369J09301k639N258K2361
14919A3664p7751k3259r3897J70839J64270k0717j4800J3405q6680k47623j167
14908b03716N6663J47530p44j62238K8869J30333K1950n0227j10179Q7261L4253
$$ plain form
14897 -20245 -44398 -113095 -76065 20746 -23317 -50353 1530 21086 -10200 -27696 42081 95139
14885 95139 117047 211974 239889 226187 122453 43751 258 74314 182636 186354 198869
14874 198869 -35217 -125927 74556 116720 20039 140135 172830 87616 5321 -12832 -57161
14863 -57161 -31951 -67436 -14739 -17631 85642 199469 198348 215480 104400 -33192 -2277
14852 -2277 -21809 -102612 -60757 -23455 51848 87009 101550 157132 48358 57849 67727 -3908
14840 -3908 30246 -10320 -113656 -165552 -74190 -59426 -23586 -80364 -83947 -102310 -85025 32010
14828 32010 172039 152281 59047 26243 68152 97963 97319 31835 17756 -7846 -47444 -52841
14816 -52841 -85783 -114051 -64338 60885 130988 60823 63290 111730 122955 112782 93214 152035
$$ packed form
14897b0245k4153o8697L7030R6811m4063k7036N1883J9556l1286j7496O9777N3058
14885I5139K1908R4927K7915j3702j03734p8702m3493P4056J08322L718J2515
14874A98869k34086r0710K00483M2164r6681J20096L2695q5214q2295j8153m4329
14863e7161K5210l5485N2697k892J03273J13827j121J7132j11080j37592L0915
14852b277j9532q0803M1855L7302P5303L5161J4541N5582j08774R491R878p1635
14840c908L4154m0566j03336n1896R1362J4764L5840n6778l583j8363J7285J17035
14828C2010J40029j9758r3234l2804M1909K9811o44o5484j4079k5602l9598n397
14816e2841l2942k8268M9713J25223P0103p0165K467M8440J1225j0173j9568N8821
$$ plain form
14804 152035 142712 -15050 -127360 -201889 -199161 -159753 -101936 -207380 -317494 -150312 -73719
14793 -73719 -128329 -135330 -62158 -17562 -30417 -49427 30200 99612 74461 -2866 -9751 -54350
14781 -54350 -93387 -1918 -34783 -42428 76793 42569 -136463 -194850 -82431 -79430 -27103
14770 -27103 52877 19256 59458 90771 135286 114661 -6972 -48562 -20168 -2148 -90631
14759 -90631 -34900 27328 -69496 -77933 -71808 -62757 89766 244134 246030 211081 164836 6858
14747 6858 -68426 -62015 -2328 7727 93435 82063 132308 176504 125354 62243 88900 45454
14735 45454 1724 48174 -39289 -94154 -172195 -189709 -187454 -231752 -193609 -37507 139609
14724 139609 194008 101481 209718 83917 -87700 30560 43354 -14838 -127411 -59190
$$ packed form
14804A52035r323j57762j12310p4529K728L9408N7817j05444j10114J67182P6593
14793g3719n4610p001P3172M4596j2855j9010P9627O9412k5151p7327o885m4599
14781e4350l9037R1469l2865p645J19221l4224j79032n8387J12419L001N2327
14770b7103P9980l3621M0202L1313M4515k0625j21633m1590K8394J8020q8483
14759i0631N5731O2228r6824q437O125R051J52523J54368J896l4949m6245j57978
14747F858p5284O411N9687J0055Q5708j1372N0245M4196n1150o3111K6657m3446
14735D5454m3730M6450q7463n4865p8041j7514K255m4298L8143J56102J77116
14724A39609N4399r2527J08237j25801j71617J18260J2794n8192j12573O8221
$$ plain form
14714 -59190 -35810 -106200 -33900 124117 63606 10924 9713 125310 152835 125198 153356
14703 153356 123437 -7272 -107574 -197095 -226192 -199634 -1395 33295 114499 22615 -48949
14692 -48949 -81698 -39049 48045 21884 -63581 -83549 -48506 -98002 -143950 -91678 -31146 39267
14680 39267 44434 71161 51763 -37376 -35747 -40708 -5481 64630 64570 22590 -390 -630 12386
14667 12386 -23531 -53151 -53618 -74188 -142200 -167766 -181986 -135659 -55271 -57578 111611 109858
14655 109858 -9607 -48878 -972 26446 -39205 -22919 -28199 -70357 -165954 -156315 -83943 -29156
14643 -29156 24478 30843 -19894 -1256 60914 -10297 -33778 -22012 155750 233992 109077
14632 109077 31659 88855 65080 33739 90612 153967 198782 208506 266592 177032 10542
$$ packed form
14714e9190K3380p0390P2300J58017o0511n2682j211J15597K7525k7637K8158
14703A53356k9919j30709j00302q9521k9097K6558J98239L4690Q1204r1884p1564
14692d8949l2749M2649Q7094k6161q5465j9968L5043m9496m5948N2272O0532P0413
14680C9267N167K6727j9398q9139J629m961L5227P0111o0m1980k2980k40J3016
14667A2386l5917k9620m67k0570o8012k5566j4220M6327Q0388k307J69189j753
14655A09858j19465l9271M7906K7418o5651J6286n280m2158r5597R639P2372N4787
14643b9156N3634O365n0737J8638O2170p1211k3481J1766J77762P8242j24915
14632A09077p7418N7196k3775l1341N6873O3355M4815R724N8086q9560j66490
$$ plain form
14621 10542 -49478 51021 88496 14208 29628 91275 28302 -415 28413 -27659 -63413
14610 -63413 -121325 -195643 -81556 13083 -35844 -108624 -121769 -138840 -55742 101009 58822
14599 58822 106540 68232 44898 -45545 -92594 16256 79607 -50830 -169676 788 224123
14588 224123 148850 136302 60809 13601 3985 -102270 -168833 -168306 -157156 -252534 -120254 -85466
14576 -85466 -48971 13233 118007 139337 168264 200963 180452 145276 31592 49577 29710
14565 29710 60269 -60825 -32964 -82541 -220323 -175932 -36617 96900 109449 69784 11188
14554 11188 6579 20776 -3059 6504 33031 11139 -28049 -5562 48603 -51534 -39507 21366
14542 21366 -20766 -64400 -23043 5890 -19740 -28323 -114811 -72113 45810 94363 -1002 28131
$$ packed form
14621A0542o0020J00499L7475p4288J5420O1647o2973k8717K8828n6072l5754
14610f3413n7912p4318J14087R4639m8927p2780j3145j7071Q3098J56751m2187
14599E8822M7718l8308k3334r0443m7049J08850O3351j30437j18846J70464K23335
14588B24123p5273j2548p5493m7208r616j06255o6563N27J1150r5378J32280L4788
14576h5466L6495O2204J04774K1330K8927L2699k0511l5176j13684J7985j9867
14565B9710L0559j21094K7861m9577j37782M4391J39315J33517J2549l9665n8596
14554A1188m609J4197k3835R563K6527k1892l9188K2487N4165j00137J2027O0873
14542B1366m2132m3634M1357K8933k5630q583q6488M2698J17923M8553r5365K9133
$$ plain form
14530 28131 23789 -54920 -35348 -62122 -49452 21203 147561 82531 -6639 11637 -10185 -19086
14518 -19086 54732 -35463 -49711 5403 12639 147927 180729 280196 187191 201191 121055 161954
14506 161954 104025 76154 110702 188822 215821 274320 298877 222739 20993 -8432 109881
14495 109881 29623 26093 7812 -53201 -66886 -166637 -102015 -80727 -86772 -112633 -94240 -79385
14483 -79385 -29910 -39635 -35140 9726 33313 26568 48558 -67815 -100994 -119616 -50717 -37782
14471 -37782 42106 -16761 71164 30821 -73449 -77078 -71073 -120829 -81423 -73425 -164394 -205718
14459 -205718 -155772 -131156 -12493 15572 2036 -35852 -84076 -15341 9014 -9472 -44722
14448 -44722 -49860 -64263 -15492 -101478 -147576 -68525 -99221 -66913 -24725 -68364 -24236 -5346
$$ packed form
14530B8131m342p8709J9572k6774J2670P0655J26358o5030q9170J8276k1822q901
14518a9086P3818r0195j4248N5114P236J35288L2802R9467r3005J4000q0136M0899
14506A61954n7929k7871L4548P8120K6999N8499K4557p6138k01746k9425J18313
14495A09881q0258l530j8281o1013j3685r9751O4622K1288o045k5861J8393J4855
14483g9385M9475r725M495M4866K3587o745K1990j16373l3179j8622O8899J2935
14471c7782P9888n8867Q7925m0343j04270l629O005m9756L9406P998r0969m1324
14459b05718M9946K4616J18663K8065j3536l7888m8224O8735K4355j8486l5250
14448d4722n138j4403M8771q5986m6098P9051l0696L2308M2188m3639M4128J8890
$$ plain form
14436 -5346 -94895 -105681 43483 88780 64861 107629 84969 42255 -7858 85161 194065
14425 194065 236618 80265 -93872 -151751 -143310 -195974 -196390 -101349 -111142 -132663 -98621 -107027
14413 -107027 -42741 -13588 -7846 -131907 -222270 -193790 -55785 -35194 -105618 -168040 -134404
14402 -134404 -7732 -38444 -185202 -232930 -73336 -154845 -238725 -133258 65785 38068
14392 38068 89750 230325 114275 -4203 49918 67407 116077 174821 200138 183882 135157
14381 135157 155742 36740 -71765 -112875 -116187 91593 242965 327389 295832 172755 44886
14370 44886 -21355 50639 77300 7457 -100943 -63527 -14435 55598 55160 79337 95461 16929
14358 16929 80769 68500 120456 189198 179323 180496 108576 62724 57986 -45302 -4271 103219
$$ packed form
14436e346q9549j0786J49164M5297k3919M2768k2660m2714n0113R3019J08904
14425A94065M2553j56353j74137n7879Q441n2664m16R5041r793k1521L4042q406
14413a07027O4286K9153N742j24061r0363K8480J38005K0591p0424o2422L3636
14402a34404J26672l0712j46758m7728J59594q1509q3880J05467J99043k7717
14392C8068N1682J40575j16050j18478N4121J7489M8670N8744K5317j6256m8725
14381A35157K0585j19002j08505m1110l312K07780J51372Q4424l1557j23077j27869
14370D4886o6241P1994K6661o9843j08400L7416M9092P0033m38K4177J6124p8532
14358A6929O3840j2269N1956O8742r875J173p1920m5852m738j03288M1031J07490
$$ plain form
14346 103219 76480 97467 107296 114000 -1608 17803 -30749 -113895 -149596 -108018 -39033 -79800
14334 -79800 -16026 21215 27095 -46622 -73080 -21657 -17614 20828 -85061 -91188 -97128 -87179
14322 -87179 -134021 -138467 -140563 -221114 -271436 -180797 -98937 -30055 -13581 -24062 -51853 -108670
14310 -108670 -177287 -128855 -59254 45634 61578 23790 81792 48637 -23054 -55773 -21572
14299 -21572 7810 52940 -48299 -34739 33579 -35287 -159811 -180817 -192666 -109528 -87926
14288 -87926 -149588 -94363 -74747 104178 171073 164184 127176 90925 -89 -72338 -79141 -71539
14276 -71539 -32400 -31644 -55518 -139292 -164264 -186860 -124989 -121888 -54663 -70858 -2972 119033
14264 119033 117455 -24654 -37806 -6330 25542 108393 93461 87318 -16186 -85609 -57587
$$ packed form
14346A03219k6739K0987R829O704j15608J9411m8552q3146l5701M1578O8985m0767
14334g9800O3774L7241N880p3717k6458N1423M043L8442j05889o127n940R949
14322h7179m6842m446k096q0551n0322R0639Q1860O8882J6474j0481k7791n6817
14310a08670o8617M8432O9601J04888J5944l7788N8002l3155p1691l2719L4201
14299b1572K9382M5130j01239J3560O8318o8866j24524k1006j1849Q3138K1602
14288h7926o1662N5225J9616J78925O6895o889l7008l6251r1014p2249o803P602
14276g1539L9139P56k3874q3774k4972k2596O1871L101O7225j6195O7886J22005
14264A19033j578j42109j3152L1476L1872Q2851j4932o143j03504o9423K8022
$$ plain form
14253 -57587 -13975 32988 -42161 -81513 -72813 57757 48623 -57104 -71445 -8529 -6808 6413
14241 6413 53988 99501 30950 80799 52817 -12291 -49297 -55115 -145733 -113265 -123601 -115765
14229 -115765 -18279 4885 -68411 16079 167197 173272 152827 163249 240484 205440 47932
14218 47932 -69763 -114869 19752 114770 97475 70357 107756 57449 67486 29370 -21320
14207 -21320 -10260 -17929 -118288 -135027 -103711 -9316 7672 -56252 -75130 -134157 -97622 -286
14195 -286 -131303 -201589 -269305 -182532 -167555 -86876 -30269 4164 16967 -41132 14 -25720
14183 -25720 86467 35118 48208 35373 -1865 -65469 -67395 -76960 -42457 4400 118784 126783
14171 126783 144295 165231 270140 294216 253639 178234 96057 127444 30245 -72466 -58992
$$ packed form
14253e7587M3612M6963p5149l9352Q700J30570r134j05727j4341O2916J721J3221
14241F413M7575M5513o8551M9849k7982o5108l7006n818r0618L2468j0336P836
14229a15765R7486K3164p3296Q4490J51118O075k0445J0422P7235l5044j57508
14218D7932j17695m5106J34621R5018j7295k7118L7399n0307J0037l8116n0690
14207b1320J1060p669j00359j6739L1316R4395J6988o3924j8878n9027L6535R7336
14195b86j31017p0286o7716Q6773J4977Q0679N6607L4433J2803n8099M1146k5734
14183b5720J12187n1349J3090j2835l7238o3604j926r565L4503M6857J14384P999
14171A26783J7512K0936J04909K4076m0577p5405q2177L1387r7199j02711J3474
$$ plain form
14160 -58992 -105324 -125683 -31244 34868 -57123 -200900 -170699 20057 93849 117886 181591
14149 181591 237567 213716 105665 51396 66528 47939 -35592 -44881 66592 131741 42804
14138 42804 -30583 -145939 -76147 69140 76948 16738 -38099 15110 66699 52029 -52815
14127 -52815 -122711 -108468 -97507 -101719 -121838 -162839 -118310 -99529 -3827 6313 9619 -112233
14115 -112233 -154082 -66853 4036 -36684 -101503 -181393 -231763 -226922 -58937 27352 194675
14104 194675 218965 -2367 -86144 -155108 -228691 -178729 41428 63294 15781 80267 -8751
14093 -8751 -58265 26760 -22335 -35391 -50274 2805 88428 134183 163202 82682 75014 1827
14081 1827 -78972 -14561 -66892 -146820 -191830 -201624 -168339 -33595 99621 -75726 -41496
$$ packed form
14160e8992m6332k0359R4439O6112r1991j43777L0201J90756P3792K4037O3705
14149A81591N5976k3851j08051n4269J5132j8589q3531r289J11473O5149q8937
14138D2804p3387j15356O9792J45287P808o0210n4837N3209N1589j4670j04844
14127e2815o9896J4243J0961m212k0119m1001M4529J8781R5702J0140L306j21852
14115a12233m1849Q7229P0889m0720o4819p9890n0370M841J67985Q6289J67323
14104A94675K4290k21332q3777o8964p3583M9962K20157K1866m7513O4486q9018
14093h751m9514Q5025m9095j3056j4883N3079Q5623M5755K9019q0520p668p3187
14081A827q0799O4411n2331p9928m5010r794L3285J34744J33216j75347L4230
$$ plain form
14070 -41496 -24464 54052 126132 143344 168692 124314 64100 110183 90762 -19262 -48871
14059 -48871 -24353 -90549 -65160 -45111 -72813 -154641 -198160 -159970 -154954 -27410 -33777 -37995
14047 -37995 8144 89210 71445 51203 127356 107968 80346 94642 171691 244294 259835 136235
14035 136235 -155956 -275968 -278905 -318729 -318110 -188366 -166345 -110988 -24113 -29507 -147481
14024 -147481 -251257 -166077 -103312 -59714 13960 136314 174606 99729 71218 63472 112507
14013 112507 120923 67507 36969 16370 15448 124517 103336 94612 190960 159055 115757 54598
14001 54598 26894 16656 91583 83643 111673 129810 38542 -25831 71759 79897 60091 118796
13989 118796 144447 284187 293608 135671 44584 3065 4509 39226 -1017 -76089 -23129
$$ packed form
14070d1496J7032P8516P2080J7212K5348m4378o0214M6083j9421j10024k9609
14059d8871K4518o6196K5389K0049k7702q1828m3519L8190N016J27544o367m218
14047c7995M6139Q1066j7765k0242P6153j9388k7622J4296P7049P2603J5541j23600
14035A36235k92191j20012k937l9824O19J29744K2021N5357Q6875n394j17974
14024a47481j03776Q5180O2765M3598P3674J22354L8292p4877k8511p746M9035
14013A12507Q416n3416l0538k0599r22J09069k1181q724R6348l1905m3298o1159
14001E4598k7704j0238P4927p940K8030J8137r1268o4373R7590Q138j9806N8705
13989A18796K5651J39740R421j57937r1087m1519J444L4717m0243p5072N2960
$$ plain form
13978 -23129 343 18182 91888 171910 147790 191601 248239 223277 137256 141939 -12393 -80363
13966 -80363 -46950 -13781 39246 14600 73201 211266 137759 84533 91113 141098 204820 208055
13954 208055 226077 124760 40990 35727 182017 184278 142570 169178 100255 22336 17094 74015
13942 74015 116334 137803 104769 105324 128821 218392 164190 177944 330782 354211 308533 338656
13930 338656 345770 338950 199862 33779 85892 173424 203538 266934 299392 283408 317814
13919 317814 386713 326649 103611 65198 29014 21743 174647 247994 278470 250846 240353
13908 240353 269512 432430 509020 573370 452074 428363 395599 409491 367274 351356 391513
13897 391513 343633 384518 460158 362919 268866 257393 274880 285505 227296 222753 287033 344389
$$ packed form
13978b3129K3472J7839P3706Q0022k4120M3811N6638k4962q6021M683j54332o7970
13966h0363L3413L3169N3027k4646N8601J38065p3507n3226O580M9985O3722L235
13954B08055J8022j01317q3770n263J46290K261m1708K6608o8923p7919n242N6921
13942G4015M2319K1469l3034N55K3497Q9571n4202J3754J52838K3429m5678L0123
13930C38656P114o820j39088j66083N2113Q7532L0114O3396L2458j5984L4406
13919C17814O8899o0064k23038l8413l6184p271J52904P3347L0476k7624j0493
13908B40353K9159J62918P6590O4350j21296k3711l2764J3892m2217j5918M0157
13897C91513m7880M0885P5640r7239r4053j1473J7487J0625n8209m543O4280N7356
$$ plain form
13885 344389 330579 348658 408105 372223 355974 211954 250223 348622 391538 377241 445526
13874 445526 428066 282532 185132 323628 471520 415846 274938 328387 417497 412985 391973
13863 391973 338075 356698 338632 360428 240146 104387 102020 222279 236128 12682 -11600
13852 -11600 -63669 -53085 43692 52635 79606 121023 198153 154626 17857 32201 67219 151917
13840 151917 140080 157501 220814 201761 193108 221905 42325 1870 -29117 8027 -16225
13829 -16225 41640 166646 201865 218365 93663 49042 -19479 93201 210397 253388 222806
13818 222806 97907 27545 -46535 -104936 -14654 89847 30825 55492 101838 148794 155550
13807 155550 113323 12223 -117812 -5236 104262 111024 153848 177664 149338 85122 192060
$$ packed form
13885C44389j3810J8079N9447l5882j6249j44020L8269R8399M2916j4297O8285
13874D45526j7460j45534r7400J38496J47892n5674j40908N3449Q9110m512k1012
13863C91973n3898J8623j8066K1796j20282j35759k367J20259J3849k23446k4282
13852a1600n2069J0584R6777Q943K6971M1417P7130m3527j36769J4344L5018Q4698
13840A51917j1837J7421O3313j9053q653K8797j79580m0455l0987L7144k4252
13829a6225N7865J25006L5219J6500j24702m4621o8521J12680J17196M2991l0582
13818B22806j24899p0362p4080n8401R0282J04501n9022K4667M6346M6956O756
13807A55550m2227j01100j30035J12576J09498O762M2824K3816k8326o4216J06938
$$ plain form
13796 192060 169177 140810 153871 169775 171269 159977 72373 76719 197207 161228 70800 55299
13784 55299 -59732 -134867 -105905 -72444 -65833 -103573 -99659 -127594 -23894 -4378 12915 42321
13772 42321 42496 10521 -57368 22326 -9917 31789 73750 66775 39195 44606 69495 18885
13760 18885 90066 92666 42285 46428 81242 167726 190262 103869 56080 -51110 5736 88172
13748 88172 165673 164586 134555 114089 51979 88125 195431 162909 55095 -106701 -178536
13737 -178536 -129480 -89282 -156283 -231670 -159626 -74748 -14981 -8061 -15057 -26231 -35567 -77821
13725 -77821 -162060 -182883 -114051 -7569 104850 135982 113651 56578 44214 38519 -12196
13714 -12196 45155 215326 252773 143357 -74772 -37346 69595 20768 49337 88552 161418
$$ packed form
13796A92060k2883k8367J3061J5904J494j1292q7604M346J20488l5979r0428j5501
13784E5299j15031p5135K8962L3461O611l7740L914k7935J03700J9516J7293K9406
13772D2321J75l1975o7889P9694l2243M1706M1961o975k7580N411K4889n0610
13760A8885P1181K600n0381M143L4814Q6484K2536q6393m7789j07190N6846Q2436
13748H8172P7501j087l0031k0466o2110L6146J07306l2522j07814j61796p1835
13737a78536M9056M0198o7001p5387P2044Q4878N9767O920o996j1174r336m2254
13725g7821q4239k0823O8832J06482J12419L1132k2331n7073j2364n695n0715
13714a2196N7351J70171L7447j09416k18129L7426J06941m8827K8569L9215P2866
$$ plain form
13703 161418 77314 158424 173574 140482 153414 227594 152511 106260 76589 115770 194988
13692 194988 187806 195549 235982 330041 298651 214397 124574 77561 77839 131015 162921 65394
13680 65394 80850 74435 66543 120548 96493 67175 88863 24547 36750 107402 172803 42005
13668 42005 -66657 -59675 23675 92214 131455 82455 116457 182988 198509 191510 172535 131553
13656 131553 18117 -54219 -77046 15088 53826 61675 178873 230923 172093 135590 164488
13645 164488 110844 -78507 -219484 -181383 -73920 -65172 -20852 3463 24893 63350 137042
13634 137042 82938 132476 100293 138265 148011 139847 149665 232326 301456 281517 232796 304652
13622 304652 310578 197034 213701 285647 287757 257426 162761 158325 217144 166679 223894 328673
$$ packed form
13703A61418q4104Q1110J5150l3092J2932P4180p5083m6251k9671L9181P9218
13692A94988p182P743M0433R4059l1390q4254q9823m7013K78N3176L1906r7527
13680F5394J5456o415p892N4005k4055k9318K1688o4316J2203P0652O5401j30798
13668D2005j08662O982Q3350O8539L9241m9000L4002O6531J5521o999j8975m0982
13656A31553j13436p2336k2827R2134L8738P849J17198N2050n8830l6503K8898
13645A64488n3644j89351j40977L8101J07463Q748M4320K4315K1430L8457P3692
13634A37042n4104M9538l2183L7972R746q164R818Q2661O9130j9939m8721P1856
13622C04652N926j13544J6667P1946K110l0331r4665m436N8819n0465N7215J04779
$$ plain form
13610 328673 330503 321124 369392 451996 403866 283415 372216 410024 409416 322299 345747 302267
13598 302267 318408 362490 387591 427967 350219 233995 195938 221755 298279 238279 187672
13587 187672 217582 283788 363987 444014 567744 618039 599748 456583 477568 584693 614334
13576 614334 613430 534611 353456 346193 298965 297285 435375 573000 583507 481395 314398
13565 314398 194677 282875 416414 433285 332963 429014 512994 454271 389050 318071 454905
13554 454905 478664 454678 471891 379864 263996 263587 265092 304496 254182 204585 169737 173792
13542 173792 171976 277430 337302 236070 19347 35463 157189 181549 147712 86566 107898
13531 107898 170607 261771 134299 54256 86171 121217 151350 239604 214616 193268 265852
$$ packed form
13610C28673J830r379M8268Q2604m8130j20451Q8801L7808o08q7117K3448m3480
13598C02267J6141M4082K5101M0376p7748j16224l8057K5817P6524o0000n0607
13587A87672K9910O6206Q0199Q0027J23730N0295j8291j43165K0985J07125K9641
13576F14334r04p8819j81155p263m7228j680J38090J37625J0507j02112j66997
13565C14398j19721Q8198J33539J6871j00322R6051Q3980n8723o5221p0979J36834
13554D54905K3759k3986J7213r2027j15868m09J505L9404n0314m9597l4848M055
13542A73792j816J05454N9872j01232k16723J6116J21726K4360l3837o1146K1332
13531A07898O2709R1164j27472q0043L1915L5046L0133Q8254k4988k1348P2584
$$ plain form
13520 265852 316451 337611 347328 282646 138171 184877 197243 190885 215129 196639 119861 85037
13508 85037 99588 93242 86945 38836 -66260 -100718 -47610 -76495 -7995 14914 -27974 -21206
13496 -21206 71864 74508 35455 123485 130163 106611 204081 346822 411904 484930 741872 872229
13484 872229 944879 760985 582595 449999 311697 178234 178301 167361 106155 12155 110103
13473 110103 420288 432158 288397 225542 153321 177919 198829 246469 348968 446697 186793
13462 186793 111332 101772 92231 86600 40880 16854 215325 326136 492296 684109 867000
13451 867000 1137122 1386370 1522165 1577540 1420967 1200024 1055239 880402 597605 435764
13441 435764 601791 547902 339065 220489 207827 226789 173402 219315 246438 245539 223215
$$ packed form
13520B65852N0599K1160R717o4682j44475M6706J2366o358K4244j8490p6778l4824
13508H5037J4551o346o297m8109j05096l4458N3108k8885O8500K2909m2888O768
13496b1206R3070K644l9053Q8030O678k3552R7470J42741O5082P3026K56942J30357
13484H72229P2650j83894j78390j32596j38302j33463O7j0940o1206r4000R7948
13473A10103L10185J1870j43761o2855p2221K4598K0910M7640J02499R7729k59904
13462A86793p5461r560r541n631m5720k4026J98471J10811J66160J91813J82891
13451H67000K70122K49248J35795N5375j56573k20943j44785j74837k82797j61841
13441D35764J66027n3889k08837j18576j2662J8962n3387M5913K7123q99k2324
$$ plain form
13430 223215 229931 274149 282897 211744 250456 226754 274130 339013 256017 183216 179018 146491
13418 146491 92861 121770 260765 420803 571830 675187 701663 709898 627857 551631 445691
13407 445691 334401 275257 233001 360561 291150 117435 168850 257144 155741 73168 41335
13396 41335 84750 242103 229342 141292 45297 -57126 -55419 -27646 -69127 72020 50101
13385 50101 -53412 -92654 -134097 56012 206253 229123 143956 41866 107939 166488 156964
13374 156964 205260 134743 204212 261323 155770 167960 227412 209112 121196 26387 -36051
13363 -36051 -39895 -35459 -29963 76570 55976 45665 121713 51485 154195 144516 141568 95257
13351 95257 -43621 -100983 -88882 40025 74447 155407 219380 161735 141641 171493 314063
$$ packed form
13430B23215O716M4218Q748p1153L8712k3702M7376O4883q2996p2801m198l2527
13418A46491n3630K8909J38995J60038J51027J03357K6476Q235q2041p6226j05940
13407D45691j11290n9144m2256J27560o9411j73715N1415Q8294j01403q2573l1833
13396D1335M3415J57353j2761q8050r5995j02423J707K7773m1481J41147k1919
13385E0101j03513l9242m1443J90109J50241K2870q5167j02090O6073N8549r524
13374A56964M8296p0517O9469N7111j05553J2190N9452j8300q7916r4809o2438
13363c6051l844M436N496J06533k0594j0311P6048p0228J02710r679k948m6311
13351I5257j38878n7362J2101J28907L4422Q0960O3973n7645k0094K9852J42570
$$ plain form
13340 314063 220761 42983 54095 240646 196527 125457 214503 180609 211887 209184 185264
13329 185264 164205 203112 207227 177958 191374 225507 138896 169115 214282 203518 197143 219008
13317 219008 285351 263941 228932 182845 152692 141423 164152 138275 111583 153892 183199
13306 183199 138582 56926 -4520 -60039 69994 211102 98544 21825 86296 145577 310811
13295 310811 284476 273724 212196 204344 165013 79906 167951 284797 298393 271987 270131 222265
13283 222265 226619 142458 91706 218616 295733 218878 208665 203731 86275 116975 182188
13272 182188 270165 266100 268851 272687 197573 163074 192506 272492 274850 170283 177554 306582
13260 306582 288699 268176 270615 209443 180792 137962 168684 224642 182353 196197 269928 296641
$$ packed form
13340C14063r3302j77778J1112J86551m4119p1070Q9046l3894L1278k703k3920
13329A85264k1059L8907M115k9269J3416L4133q6611L0219M5167j0764o375K1865
13317B19008O6343k1410l5009m6087l0153j1269K2729k5877k6692M2309K9307
13306A83199m4617q1656o1446n5519J30033J41108j12558p6719O4471N9281J65234
13295C10811k6335j0752o1528p852l9331q5107Q8045J16846J3596k6406j856m7866
13283B22265M354q4161n0752J26910P7117p6855j0213m934j17456L0700O5213
13272A82188Q7977m065K751L836p5114l4499K9432P9986K358j04567P271J29028
13260C06582j7883k0523K439o1172k8651m2830L0722N5958m2289J3844P3731K6713
$$ plain form
13248 296641 123637 81704 45578 28303 70518 160452 199200 282322 378485 350513 211268
13237 211268 198599 258192 195150 252854 240155 102586 39807 100078 246954 265691 256661
13226 256661 129279 188697 296624 279910 147434 97321 253272 192595 199758 213284 127733
13215 127733 98685 144017 168325 109105 113807 130791 59235 1076 18088 34345 7730 110308
13203 110308 195011 218674 287755 230432 295944 408558 368189 359604 452237 518305 417471
13192 417471 410712 411940 433775 406807 453663 412923 405398 413750 363720 369839 381683 356650
13180 356650 293874 351443 369106 314158 251766 298683 450766 482734 425137 411398 474774
13169 474774 487948 598232 678522 532584 364354 376849 391333 390843 469658 448190 457568
$$ packed form
13248B96641j73004m1933l6126j7275M2215Q9934L8748Q3122R6163k7972j39245
13237B11268j2669N9593o3042N7704j2699j37569o2779O0271J46876J8737r030
13226B56661j27382N9418J07927j6714j32476n0113J55951o0677P163J3526q5551
13215A27733k9048M5332K4308n9220M702J6984p1556n8159J7012J6257k6615J02578
13203A10308Q4703K3663O9081n7323O5512J12614m0369q585R2633O6068j00834
13192D17471o759J228K1835k6968M6856m0740p525Q352n0030O119J1844k5033
13180C56650o2776N7569J7663n4948o2392M6917J52083L1968n7597j3739O3376
13169D74774J3174J10284Q0290j45938j68230J2495J4484m90P8815k1468R378
$$ plain form
13158 457568 443489 515156 600539 551592 531482 472543 490731 582614 745986 743873 776809
13147 776809 741991 633969 557496 530961 560640 508721 557021 626068 746947 812066 824724
13136 824724 805851 855603 865615 919679 935353 909433 914714 899956 806541 788667 737803 577914
13124 577914 617791 565857 671285 814212 745167 658835 731139 888216 1058994 1153686 1204688
13113 1204688 1136342 1031638 956855 989403 1183093 1155270 1010282 1155792 1334636 1447708
13103 1447708 1540982 1622483 1621228 1537027 1516992 1523020 1356115 1166711 1118603 1136876 1269339
13092 1269339 1322868 1467988 1585119 1580038 1525810 1465601 1455760 1487440 1504344 1534980 1697944
13081 1697944 1855351 1900796 1847914 1786420 1800270 1945094 2116916 2095671 2087290 2293105 2578219
$$ packed form
13158D57568j4079P1667Q5383m8947k0110n8939J8188R1883J63372k113L2936
13147G76809l4818j08022p6473k6535K9679n1919M8300O9047J20879O5119J2658
13136H24724j8873M9752J0012N4064J5674k5920N281j4758r3415j7874n0864j59889
13124E77914L9877n1934J05428J42927o9045q6332P2304J57077J70778R4692N1002
13113A204688o8346j04704p4783L2548J93690k7823j44988J45510J78844J13072
13103A447708R3274Q1501j255q4201k0035O028j66905j89404m8108J8273J32463
13092A269339N3529J45120J17131n081n4228o0209r841L1680J6904L0636J62964
13081A697944J57407M5445n2882o1494J3850J44824J71822k1245q381K05815K85114
$$ plain form
13070 2578219 2767345 2920684 2946628 2897432 2986540 3137548 3271538 3371102 3540187 3754986
13060 3754986 4045429 4258794 4345418 4559787 4949678 5363493 5807551 6395032 7235940 8275843
13050 8275843 9394931 10837006 12721043 15041069 18072682 22002066 27156448 33925064
13042 33925064 43632946 57787135 77520393 102025077 125941214 140565711 140116396
13035 140116396 125805012 103896969 81441818 62566948 48343640 38448053 31632200
13028 31632200 26772465 23172181 20506567 18687045 17626240 17020522 16772109 16519619
13020 16519619 16165799 15975570 15997780 16285960 17059532 18249847 19943628 22119121 25030872
13011 25030872 28917463 34020070 40690281 49520720 61280568 77627395 101584964 136311468
$$ packed form
13070B578219J89126J53339K5944m9196Q9108J51008J33990R9564J69085K14799
13060C754986K90443K13365Q6624K14369L89891M13815M44058N87481Q40908J039903
13050H275843J119088J442075J884037K320026L031613L929384N154382O768616
13042C3925064R707882J4154189J9733258K4504684K3916137J4624497m49315
13035A40116396j4311384k1908043k2455151j8874870j4223308r895587o815853
13028C1632200m859735l600284k665614j819522j060805o05718k48413k52490
13020A6519619l53820j90229K2210K88180P73572J190315J693781K175493K911751
13011B5030872L886591N102607O670211Q830439J1759848J6346827K3957569L4726504
$$ plain form
13003 136311468 183175415 236134633 279706414 296354680 279639443 238108967 187320495
12996 187320495 140624800 104312155 78543689 60898025 48833980 40186890 33788996
12989 33788996 28974381 25302965 22315489 20123150 18653398 17713620 17017710 16927243 17293793
12980 17293793 17879346 18336144 18766229 19349161 20051394 21182241 23074247 25872937 29709425
12971 29709425 34820024 41760358 51694468 66354572 86933588 112494009 137188161
12964 137188161 152148084 150820300 134352076 109663913 84622894 63724266 48129512
12957 48129512 36896224 28983770 23381373 19211010 16000475 13571993 11625034 10136456
12949 10136456 8912489 7973545 7262609 6614428 6248036 6026146 5763268 5578961 5214173
$$ packed form
13003A36311468M6863947N2959218M3571781J6648266j6715237m1530476n0788472
12996A87320495m6695695l6312645k5768466j7645664j2064045q647090o397894
12989C3788996m814615l671416k987476k192339j469752r39778o95910r0467L66550
12980A7293793N85553M56798M30085N82932P02233J130847J892006K798690L836488
12971B9709425N110599O940334R934110J4660104K0579016K5560421K4694152
12964A37188161J4959923j327784j6468224k4688163k5041019k0898628j5594754
12957D8129512j1233288p912454n602397m170363l210535k428482j946959j488578
12949A0136456j223967r38944p10936o48181l66392k21890k62878j84307l64788
$$ plain form
12940 5214173 4865251 4534197 4178195 3862625 3537503 3246328 3028076 2959688 2682106 2472978
12930 2472978 2352439 2282346 2143593 2072061 2047274 2007205 1850212 1680501 1750880 1666030
12920 1666030 1509065 1524356 1501376 1395696 1295223 1298431 1404943 1456028 1311301 1234881
12910 1234881 1350269 1374524 1374863 1365556 1164258 1033016 1061889 1008810 1136753 1179760 1084621
12899 1084621 1008558 1010243 993124 909712 1011050 1120190 1048505 961231 963436 1050184 1032866
12888 1032866 978635 868177 832320 736502 682708 739577 840917 896404 921939 930554 996916
12877 996916 1026090 906531 873044 935100 1070529 1058794 929724 853162 783138 655185 670242
12866 670242 640274 739207 785003 872975 866449 833661 909562 941020 904593 857551 893059 899409
$$ packed form
12940E214173l48922l31054l56002l15570l25122k91175k18252o8388k77582k09128
12930B472978j20539p0093j38753p1532k4787m0069j56993j69711P0379q4850
12920A666030j56965J5291k2980j05680j00473L208J06512N1085j44727p6420
12910A234881J15388K4255L39r307k01298j31242K8873n3079J27943M3007r5139
12899A084621p6063J685j7119q3412J01338J09140p1685q7274K205Q6748j7318
12888A032866n4231j10458l5857r5818n3794N6869J01340N5487K5535Q615O6362
12877I96916K9174j19559l3487O2056J35429j1735j29070p6562p0024j27953J5057
12866F70242k9968R8933M5796Q7972o526l2788P5901L1458l6427m7042L5508O350
$$ plain form
12854 899409 884281 887593 888959 789979 726237 738756 816966 693522 716661 789235 788249 842334
12842 842334 906185 926625 977865 1042495 1042578 922328 813823 870073 933635 982643 992403 961650
12830 961650 914010 874810 790449 852748 985275 982768 931509 857151 747058 835706 880580
12819 880580 805425 711304 819674 849598 829771 842449 910219 828114 875805 949706 868019
12808 868019 755923 709474 573567 505500 495912 528433 531148 601303 677625 746637 749691 691942
12796 691942 708251 720206 674792 603911 578199 673598 769282 711003 584327 570488 511336
12785 511336 472329 611533 632518 608367 550283 590287 582652 620275 701964 874857 993853
12774 993853 854460 790055 871286 852927 792908 758379 845073 975858 880488 759481 675415
$$ packed form
12854H99409j5128L312J366r8980o3742J2519P8210j23444K3139P2574r86N4085
12842H42334O3851K0440N1240O4630Q3j20250j08505N6250O3562M9008R760l0753
12830I61650m7640l9200q4361O2299J32527k507n1259p4358j10093Q8648M4874
12819H80580p5155r4121J08370K9924j9827J2678O7770q2105M7691P3901q1687
12808H68019j12096m6449j35907o8067r588L2521K715P0155P6322O9012L054n7749
12796F91942J6309J1955m5414p0881k5712R5399R5684n8279j26676j3839n9152
12785E11336l9007J39204K0985k4151n8084M0004p635L7623Q1689J72893J18996
12774I93853j39393o4405Q1231j8359o0019l4529Q6694J30785r5370j21007q4066
$$ plain form
12763 675415 767719 747401 667058 635619 769952 896390 978092 929597 815537 773991 741852
12752 741852 709419 768301 778520 743931 825641 906982 910025 873283 812904 702681 708591 706006
12740 706006 706101 586126 539437 530070 619423 674106 733722 742948 695018 689479 683025 662560 529877
12727 529877 472092 586127 584593 585627 631309 640129 701243 727973 799393 780116 721115 714607
12715 714607 696741 735168 888483 894034 801615 739464 746337 860269 821133 783760 736494
12704 736494 617045 484214 540211 616090 692669 785063 821400 736488 660521 641063 709779
12693 709779 780980 854819 803476 732924 712664 658441 760691 776974 764244 733252 640515
12682 640515 629371 627228 613732 763967 896518 921931 921895 857007 970051 1005642 1029659 1067951
$$ packed form
12763F75415R2304k0318q0343l1439J34333J26438Q1702m8495j14060m1546l2139
12752G41852l2433N8882J0219l4589Q1710Q1341L043l6742o0379j10223N910k585
12740G06006R5j19975m6689r367Q9353N4683N9616R226m7930n539o454k0465j32683
12727E29877n7785J14035j534J034M5682Q820O1114K6730P1420j9277n9001o508
12715G14607j7866L8427J53315N551r2419o2151O873J13932l9136l7373m7266
12704G36494j19449j32831N5997P5879P6579R2394L6337q4912p5967j9458O8716
12693G09779P1201P3839n1343p0552k0260n4223J02250J6283j2730l0992r2737
12682F40515j1144k143j3496J50235J32551K5413l6o4888J13044L5591K4017L8292
$$ plain form
12670 1067951 1067620 1161951 1198635 1155153 1131854 1122207 1120750 1107796 1043319 1031932 1018342 1071691
12658 1071691 1184966 1201898 1091026 946594 934820 988305 927109 885572 866414 825130 836914
12647 836914 951298 968801 963340 1013172 1086507 1163862 1031453 939165 968932 1009660 1102707
12636 1102707 1277144 1316142 1230153 1138624 1033103 1144124 1206339 1150961 1129309 1191207 1268834
12625 1268834 1381434 1493406 1555817 1513506 1451213 1433277 1529951 1481110 1453877 1400432 1448008
12614 1448008 1509745 1585266 1713074 1856516 1950962 2046416 1930360 1964258 2005122 1997565 2065570
12603 2065570 2209040 2387180 2460940 2492105 2556772 2661188 2846616 2863395 3015270 3137611
12593 3137611 3195898 3269498 3378415 3524661 3607695 3736485 4064752 4351835 4624891 4982257
$$ packed form
12670A067951l31R4331L6684m3482k3299r647j457j2954o4477j1387j3590N3349
12658A071691J13275J6932j10872j44432j1774N3485o1196m1537j9158m1284J1784
12647H36914J14384J7503n461M9832P3335P7355j32409r2288K9767M0728R3047
12636A102707J74437L8998q5989r1529j05521J11021O2215n5378k1652O1898P7627
12625A268834J12600J11972O2411m2311o2293j7936R6674m8841k7233n3445M7576
12614A448008O1737P5521J27808J43442R4446R5454j16056L3898M0864p557O8005
12603B065570J43470J78140P3760L1165O4667J04416J85428J6779J51875J22341
12593C137611N8287P3600J08917J46246Q3034J28790L28267K87083K73056L57366
$$ plain form
12583 4982257 5285618 5634296 5994482 6223707 6575784 6967164 7357040 7743910 8069706
12574 8069706 8603290 9248896 10012619 10925966 12132170 13537785 15195435 16949668 18962782
12565 18962782 21361702 24255785 27799545 32379473 38241688 45949372 56348255 70268628
12557 70268628 88685269 112976461 143640312 179101669 213906707 239257620 247508683
12550 247508683 237000058 212798534 182615409 152976892 127900024 108715590 95026039
12543 95026039 85937034 80707649 78560451 79169167 82175972 87315567 94320852 103000852
12535 103000852 113008237 123746676 134724097 145824722 157200335 168753208 180488019
12528 180488019 192468400 204491076 216206188 226906866 235619135 241694499 244284561
$$ packed form
12583D982257L03361L48678L60186K29225L52077L91380L89876L86870L25796
12574H069706N33584O45606P63723R13347J206204J405615J657650J754233K013114
12565A8962782K398920K894083L543760M579928N862215P707684J0398883J3920373
12557G0268628J8416641K4291192L0663851L5461357L4805038K5350913Q251063
12550B47508683j0508625k4201524l0183125k9638517k5076868j9184434j3689551
12543I5026039r089005n229385k147198O08716L006805N139595P005285Q680000
12535A03000852J0007385J0738439J0977421J1100625J1375613J1552873J1734811
12528A80488019J1980381J2022676J1715112J0700678Q712269O075364K590062
$$ plain form
12521 244284561 243049640 238481621 230966396 221371468 210505491 199239750 188132646
12514 188132646 177474166 167310830 157452852 147904908 138384840 128917451 119597170 110574418
12506 110574418 102134166 94930389 89345671 85535459 83880208 85123660 89340691 97228722
12498 97228722 109620719 127520648 151825196 181598590 213533379 241137566 256100338
12491 256100338 252834528 231956738 199794891 164160978 131089178 103437678 81641644
12484 81641644 65129214 52869189 43567621 36509736 31068946 26916041 23708854 21075873
12476 21075873 18879177 17177399 15705916 14319345 12907435 11767607 10791226 9920892
12468 9920892 9098406 8465540 7921886 7454925 6963415 6536917 6241296 6051594 5869886
$$ packed form
12521B44284561j234921m568019p515225r594928j0865977j1265741j1107104
12514A88132646j0658480j0163336r857978r547944r520068r467389r320281r022752
12506A10574418q440252p203777n584718l810212j655251J243452M217031P888031
12498I7228722J2391997J7899929K4304548K9773394L1934789K7604187J4962772
12491B56100338l265810k0877790l2161847l5633913l3071800k7651500k1796034
12484H1641644j6512430j2260025r301568p057885n440790m152905l207187k632981
12476B1075873k196696j701778j471483j386571j411910j139828r76381q70334
12468I920892q22486o32866n43654m66961m91510m26498k95621j89702j81708
$$ plain form
12459 5869886 5701353 5420297 5228468 5062555 4719153 4541649 4659106 4612058 4420450 4285008
12449 4285008 4155716 3855673 3685363 3565174 3493641 3401000 3353807 3343608 3236372 3190895
12439 3190895 3228074 3283463 3138177 3027627 3016566 3117502 3173071 3085276 3071227 3230127
12429 3230127 3296208 3200032 3219047 3257973 3254366 3086753 2900055 2785270 2828512 2932168 2962465
12418 2962465 2886792 2777748 2698934 2662596 2671674 2475767 2339398 2377990 2488944 2501618 2515319
12407 2515319 2452092 2321217 2206821 2097060 2245226 2394710 2364236 2319126 2349536 2433360
12397 2433360 2410158 2535699 2530370 2470009 2384263 2288910 2310319 2305504 2246880 2253408 2229060 2133963
12385 2133963 1968301 1938763 1943769 2017980 1992506 1890820 1943269 1913218 1890045 1918895 1837092
$$ packed form
12459E869886j68533k81056j91829j65913l43402j77504J17457m7048j91608j35442
12449D285008j29292l00043j70310j20189p1533r2641m7193j0199j07236m5477
12439C190895L7179N5389j45286j10550j1061J00936N5569q7795j4049J58900
12429C230127O6081r6176J9015L8926l607j67613j86698j14785M3242J03656L0297
12418B962465p5673j09044p8814l6338R078j95907j36369L8592J10954J2674J3701
12407B515319o3227j30875j14396j09761J48166J49484l0474m5110L0410Q3824
12397B433360k3202J25541n329o0361q5746r5353K1409m815n8624O528k4348r5097
12385B133963j65662k9538N006P4211k5474j01686N2449l0051k3173K8850q1803
$$ plain form
12374 1837092 1839297 1831714 1758192 1730739 1690614 1762555 1715638 1708111 1729950 1677369 1598578 1502391
12362 1502391 1419838 1372882 1309607 1209439 1175828 1261450 1240686 1280165 1158978 1099708 1068671
12351 1068671 1024803 1106186 1105651 1108726 1151657 1155653 1169411 1165081 1185541 1158575 1009720 977921
12339 977921 1040612 1012223 1003761 1072894 1158284 1131421 997775 1049812 1154663 1141132 1042406
12328 1042406 929300 1054680 949078 885125 866313 881743 915521 968468 934048 942809 904296
12317 904296 1035328 1085851 965619 973943 1136444 1162988 1092125 1144070 1216593 1151082 1074499
12306 1074499 1012193 1053602 1224851 1306249 1140154 1093658 1205676 1264923 1176484 1105197 1056907
12295 1056907 959302 936376 906567 983736 1099048 1142665 1151231 1358310 1431491 1389886 1498493
$$ packed form
12374A837092K205p583p3522k7453m0125P1941m6917p527K1839n2581p8791r6187
12362A502391q2553m6956o3275j00168l3611Q5622k0764L9479j21187n9270l1037
12351A068671m3868Q1383n35L075M2931L996J3758m330K0460k6966j48855l1799
12339I77921O2691k8389q462O9133Q5390k6863j33646N2037J04851j3531r8726
12328A042406j13106J25380j05602o3953j8812J5430L3778N2947l4420Q761l8513
12317I04296J31032N0523j20232Q324J62501K6544p0863N1945P2523o5511p6583
12306A074499o2306M1409J71249Q1398j66095m6496J12018N9247q8439p1287m8290
12295A056907r7605k2926k9809P7169J15312M3617Q566K07079P3181m1605J08607
$$ plain form
12284 1498493 1519574 1465532 1399762 1364787 1358315 1286431 1375148 1475417 1558572 1745601 1914703
12273 1914703 1880382 1765727 1724535 1778175 1724541 1775218 1811005 1772184 1652090 1552010 1357610
12262 1357610 1327403 1445058 1392585 1400282 1662607 1701801 1593032 1531121 1444735 1470110 1449956
12251 1449956 1391922 1375330 1357662 1406219 1349064 1424048 1473153 1520364 1513120 1525518 1617232
12240 1617232 1750626 1754823 1706958 1702031 1692224 1723094 1754900 1681378 1724385 1589275 1559020
12229 1559020 1596672 1508377 1529230 1621848 1711393 1751134 1815549 1806379 1855349 1897530 1994506
12218 1994506 2003301 1911227 1930338 1939898 1914261 1864469 1867563 1918032 1996963 2106834 2172121 2290135
12206 2290135 2247024 2270634 2373804 2404947 2453013 2541161 2573652 2570410 2494386 2462646 2539559
$$ packed form
12284A498493K1081n4042o5770l4975o472p1884Q8717J00269Q3155J87029J69102
12273A914703l4321j14655m1192N3640n3634N0677L5787l8821j20094j00080j94400
12262A357610l0207J17655n2473P697K62325L9194j08769o1911q6386K5375k0154
12251A449956n8034j6592j7668M8557n7155P4984M9105M7211p244J2398R1714
12240A617232J33394M197m7865m927r807L0870L1806p3522M3007j35110l0255
12229A559020L7652q8295K0853R2618Q9545L9741O4415r170M8970M2181R6976
12218A994506Q795r2074J9111R560k5637m9792L094N0469P8931J09871O5287J18014
12206B290135m3111K3610J03170L1143M8066Q8148L2491l242p6024l1740P6913
$$ plain form
12195 2539559 2532520 2476591 2583614 2734168 2721318 2720642 2747272 2775678 2864192 2926002 2960441
12184 2960441 3036692 2975906 2907461 2762984 2734038 2776442 2846075 2882731 2989165 3015091 3023077
12173 3023077 3124565 3250017 3308601 3195950 3239515 3291369 3344688 3473275 3455587 3339291
12163 3339291 3346703 3388904 3295094 3310935 3385039 3588366 3705731 3552224 3586117 3718762 3693956
12152 3693956 3689717 3877575 4074507 4178557 4132416 4242604 4424247 4470354 4478229 4483088 4594211
12141 4594211 4618138 4740548 4792085 4744231 4895213 4912352 5037768 5076056 5243360 5418805
12131 5418805 5506415 5674567 5804863 5811635 5995661 6106129 6175107 6309890 6521254 6667737
12121 6667737 6822659 6900082 7010906 7187583 7431520 7626263 7719941 7893687 8008468 8185087
$$ packed form
12195B539559p039n5929J07023J50554j2850o76K6630K8406Q8514O1810L4439
12184B960441P6251o0786o8445j44477k8946M2404O9633L6656J06434K5926P986
12173C023077J01488J25452N8584j12651M3565N1854N3319J28587j7688j16296
12163C339291P412M2201r3810J5841P4104K03327J17365j53507L3893J32645k4806
12152C693956m239J87858J96932J04050m6141J10188J81643M6107P875M859J11123
12141D594211K3927J22410N1537m7854J50982J7139J25416L8288J67304J75445
12131E418805Q7610J68152J30296O772J84026J10468O8978J34783K11364J46483
12121F667737J54922P7423J10824J76677K43937J94743R3678J73746J14781J76619
$$ plain form
12111 8185087 8418009 8683739 9015878 9332623 9518434 9777363 10056008 10374737 10561316
12102 10561316 10970306 11398424 11807269 12245975 12735070 13203880 13542341 13859638 14239235
12093 14239235 14612633 15027137 15278164 15637641 16008674 16306492 16783693 17320084 17847218
12084 17847218 18365985 18811084 19295308 20016113 20876011 21509235 22338994 23200522 24042053
12075 24042053 25128835 26144580 26974154 27959910 29075221 30228936 31442972 32653371
12067 32653371 33826637 35251693 36663050 37944678 39332553 40606393 42077231 43763591
12059 43763591 45605393 47378314 49127934 50948073 52831045 54817411 56797893 58722835
$$ packed form
12111H185087K32922K65730L32139L16745J85811K58929K78645L18729J86579
12102A0561316M08990M28118M08845M38706M89095M68810L38461L17297L79597
12093A4239235L73398M14504K51027L59477L71033K97818M77201N36391N27134
12084A7847218N18767M45099M84224P20805Q59898O33224Q29759Q61528Q41531
12075B4042053J086782J015745Q29574R85756J115311J153715J214036J210399
12067C2653371J173266J425056J411357J281628J387875J273840J470838J686360
12059D3763591J841802J772921J749620J820139J882972J986366J980482J924942
$$ [...]
##END NTUPLES=NMR SPECTRUM
##END=
